lucene-dev mailing list archives

Site index · List index
Message view « Date » · « Thread »
Top « Date » · « Thread »
From Apache Jenkins Server <jenk...@builds.apache.org>
Subject [JENKINS] Lucene-Solr-SmokeRelease-4.x - Build # 48 - Still Failing
Date Wed, 06 Feb 2013 08:56:29 GMT
Build: https://builds.apache.org/job/Lucene-Solr-SmokeRelease-4.x/48/

No tests ran.

Build Log:
[...truncated 31758 lines...]
prepare-release-no-sign:
    [mkdir] Created dir: /usr/home/hudson/hudson-slave/workspace/Lucene-Solr-SmokeRelease-4.x/lucene/build/fakeRelease
     [copy] Copying 386 files to /usr/home/hudson/hudson-slave/workspace/Lucene-Solr-SmokeRelease-4.x/lucene/build/fakeRelease/lucene
     [copy] Copying 194 files to /usr/home/hudson/hudson-slave/workspace/Lucene-Solr-SmokeRelease-4.x/lucene/build/fakeRelease/solr
     [exec] JAVA6_HOME is /home/hudson/tools/java/latest1.6
     [exec] JAVA7_HOME is /home/hudson/tools/java/latest1.7
     [exec] NOTE: output encoding is US-ASCII
     [exec] 
     [exec] Load release URL "file:/usr/home/hudson/hudson-slave/workspace/Lucene-Solr-SmokeRelease-4.x/lucene/build/fakeRelease/"...
     [exec] 
     [exec] Test Lucene...
     [exec]   test basics...
     [exec]   get KEYS
     [exec]     0.1 MB
     [exec]   check changes HTML...
     [exec]   download lucene-4.2.0-src.tgz...
     [exec]     26.9 MB
     [exec]     verify md5/sha1 digests
     [exec]   download lucene-4.2.0.tgz...
     [exec]     48.1 MB
     [exec]     verify md5/sha1 digests
     [exec]   download lucene-4.2.0.zip...
     [exec]     57.7 MB
     [exec]     verify md5/sha1 digests
     [exec]   unpack lucene-4.2.0.tgz...
     [exec]     verify JAR/WAR metadata...
     [exec]     test demo with 1.6...
     [exec]       got 5434 hits for query "lucene"
     [exec]     test demo with 1.7...
     [exec]       got 5434 hits for query "lucene"
     [exec]     check Lucene's javadoc JAR
     [exec]   unpack lucene-4.2.0.zip...
     [exec]     verify JAR/WAR metadata...
     [exec]     test demo with 1.6...
     [exec]       got 5434 hits for query "lucene"
     [exec]     test demo with 1.7...
     [exec]       got 5434 hits for query "lucene"
     [exec]     check Lucene's javadoc JAR
     [exec]   unpack lucene-4.2.0-src.tgz...
     [exec]     make sure no JARs/WARs in src dist...
     [exec] Traceback (most recent call last):
     [exec]   File "/usr/home/hudson/hudson-slave/workspace/Lucene-Solr-SmokeRelease-4.x/dev-tools/scripts/smokeTestRelease.py",
line 1358, in <module>
     [exec]     main()
     [exec]   File "/usr/home/hudson/hudson-slave/workspace/Lucene-Solr-SmokeRelease-4.x/dev-tools/scripts/smokeTestRelease.py",
line 1304, in main
     [exec]     smokeTest(baseURL, version, tmpDir, isSigned)
     [exec]   File "/usr/home/hudson/hudson-slave/workspace/Lucene-Solr-SmokeRelease-4.x/dev-tools/scripts/smokeTestRelease.py",
line 1340, in smokeTest
     [exec]     unpackAndVerify('lucene', tmpDir, 'lucene-%s-src.tgz' % version, version)
     [exec]   File "/usr/home/hudson/hudson-slave/workspace/Lucene-Solr-SmokeRelease-4.x/dev-tools/scripts/smokeTestRelease.py",
line 564, in unpackAndVerify
     [exec]     verifyUnpacked(project, artifact, unpackPath, version, tmpDir)
     [exec]   File "/usr/home/hudson/hudson-slave/workspace/Lucene-Solr-SmokeRelease-4.x/dev-tools/scripts/smokeTestRelease.py",
line 646, in verifyUnpacked
     [exec]     raise RuntimeError('source release has JARs...')
     [exec] RuntimeError: source release has JARs...
     [exec]     FAILED:
     [exec]       ./tools/lib/asm-debug-all-4.1.jar

BUILD FAILED
/usr/home/hudson/hudson-slave/workspace/Lucene-Solr-SmokeRelease-4.x/build.xml:288: exec returned:
1

Total time: 17 minutes 30 seconds
Build step 'Invoke Ant' marked build as failure
Email was triggered for: Failure
Sending email for trigger: Failure



Mime
View raw message