lucene-dev mailing list archives

Site index · List index
Message view « Date » · « Thread »
Top « Date » · « Thread »
From Policeman Jenkins Server <jenk...@thetaphi.de>
Subject [JENKINS] Lucene-Solr-4.x-Linux (32bit/jdk1.7.0_10) - Build # 4226 - Failure!
Date Sun, 10 Feb 2013 23:49:20 GMT
Build: http://jenkins.thetaphi.de/job/Lucene-Solr-4.x-Linux/4226/
Java: 32bit/jdk1.7.0_10 -server -XX:+UseG1GC

1 tests failed.
FAILED:  junit.framework.TestSuite.org.apache.solr.update.SoftAutoCommitTest

Error Message:
ERROR: SolrIndexSearcher opens=12 closes=11

Stack Trace:
java.lang.AssertionError: ERROR: SolrIndexSearcher opens=12 closes=11
	at __randomizedtesting.SeedInfo.seed([568D476B27F1595A]:0)
	at org.junit.Assert.fail(Assert.java:93)
	at org.apache.solr.SolrTestCaseJ4.endTrackingSearchers(SolrTestCaseJ4.java:246)
	at org.apache.solr.SolrTestCaseJ4.afterClass(SolrTestCaseJ4.java:97)
	at sun.reflect.GeneratedMethodAccessor19.invoke(Unknown Source)
	at sun.reflect.DelegatingMethodAccessorImpl.invoke(DelegatingMethodAccessorImpl.java:43)
	at java.lang.reflect.Method.invoke(Method.java:601)
	at com.carrotsearch.randomizedtesting.RandomizedRunner.invoke(RandomizedRunner.java:1559)
	at com.carrotsearch.randomizedtesting.RandomizedRunner.access$600(RandomizedRunner.java:79)
	at com.carrotsearch.randomizedtesting.RandomizedRunner$5.evaluate(RandomizedRunner.java:700)
	at com.carrotsearch.randomizedtesting.rules.StatementAdapter.evaluate(StatementAdapter.java:36)
	at com.carrotsearch.randomizedtesting.rules.SystemPropertiesRestoreRule$1.evaluate(SystemPropertiesRestoreRule.java:53)
	at org.apache.lucene.util.AbstractBeforeAfterRule$1.evaluate(AbstractBeforeAfterRule.java:46)
	at org.apache.lucene.util.TestRuleStoreClassName$1.evaluate(TestRuleStoreClassName.java:42)
	at com.carrotsearch.randomizedtesting.rules.SystemPropertiesInvariantRule$1.evaluate(SystemPropertiesInvariantRule.java:55)
	at com.carrotsearch.randomizedtesting.rules.NoShadowingOrOverridesOnMethodsRule$1.evaluate(NoShadowingOrOverridesOnMethodsRule.java:39)
	at com.carrotsearch.randomizedtesting.rules.NoShadowingOrOverridesOnMethodsRule$1.evaluate(NoShadowingOrOverridesOnMethodsRule.java:39)
	at com.carrotsearch.randomizedtesting.rules.StatementAdapter.evaluate(StatementAdapter.java:36)
	at org.apache.lucene.util.TestRuleAssertionsRequired$1.evaluate(TestRuleAssertionsRequired.java:43)
	at org.apache.lucene.util.TestRuleMarkFailure$1.evaluate(TestRuleMarkFailure.java:48)
	at org.apache.lucene.util.TestRuleIgnoreAfterMaxFailures$1.evaluate(TestRuleIgnoreAfterMaxFailures.java:70)
	at org.apache.lucene.util.TestRuleIgnoreTestSuites$1.evaluate(TestRuleIgnoreTestSuites.java:55)
	at com.carrotsearch.randomizedtesting.rules.StatementAdapter.evaluate(StatementAdapter.java:36)
	at com.carrotsearch.randomizedtesting.ThreadLeakControl$StatementRunner.run(ThreadLeakControl.java:358)
	at java.lang.Thread.run(Thread.java:722)




Build Log:
[...truncated 8977 lines...]
[junit4:junit4] Suite: org.apache.solr.update.SoftAutoCommitTest
[junit4:junit4]   2> 1 T1501 oas.SolrTestCaseJ4.initCore ####initCore
[junit4:junit4]   2> Creating dataDir: /mnt/ssd/jenkins/workspace/Lucene-Solr-4.x-Linux/solr/build/solr-core/test/J1/./solrtest-SoftAutoCommitTest-1360539499790
[junit4:junit4]   2> 1 T1501 oasc.SolrResourceLoader.<init> new SolrResourceLoader for directory: '/mnt/ssd/jenkins/workspace/Lucene-Solr-4.x-Linux/solr/build/solr-core/test-files/solr/collection1/'
[junit4:junit4]   2> 2 T1501 oasc.SolrResourceLoader.replaceClassLoader Adding 'file:/mnt/ssd/jenkins/workspace/Lucene-Solr-4.x-Linux/solr/build/solr-core/test-files/solr/collection1/lib/README' to classloader
[junit4:junit4]   2> 2 T1501 oasc.SolrResourceLoader.replaceClassLoader Adding 'file:/mnt/ssd/jenkins/workspace/Lucene-Solr-4.x-Linux/solr/build/solr-core/test-files/solr/collection1/lib/classes/' to classloader
[junit4:junit4]   2> 30 T1501 oasc.SolrConfig.<init> Using Lucene MatchVersion: LUCENE_42
[junit4:junit4]   2> 67 T1501 oasc.SolrConfig.<init> Loaded SolrConfig: solrconfig.xml
[junit4:junit4]   2> 67 T1501 oass.IndexSchema.readSchema Reading Solr Schema
[junit4:junit4]   2> 71 T1501 oass.IndexSchema.readSchema Schema name=test
[junit4:junit4]   2> 402 T1501 oass.OpenExchangeRatesOrgProvider.init Initialized with rates=open-exchange-rates.json, refreshInterval=1440.
[junit4:junit4]   2> 408 T1501 oass.IndexSchema.readSchema default search field in schema is text
[junit4:junit4]   2> 410 T1501 oass.IndexSchema.readSchema unique key field: id
[junit4:junit4]   2> 414 T1501 oass.FileExchangeRateProvider.reload Reloading exchange rates from file currency.xml
[junit4:junit4]   2> 417 T1501 oass.FileExchangeRateProvider.reload Reloading exchange rates from file currency.xml
[junit4:junit4]   2> 419 T1501 oass.OpenExchangeRatesOrgProvider.reload Reloading exchange rates from open-exchange-rates.json
[junit4:junit4]   2> 419 T1501 oass.OpenExchangeRatesOrgProvider.reload Reloading exchange rates from open-exchange-rates.json
[junit4:junit4]   2> 420 T1501 oasc.SolrResourceLoader.locateSolrHome JNDI not configured for solr (NoInitialContextEx)
[junit4:junit4]   2> 420 T1501 oasc.SolrResourceLoader.locateSolrHome using system property solr.solr.home: /mnt/ssd/jenkins/workspace/Lucene-Solr-4.x-Linux/solr/build/solr-core/test-files/solr
[junit4:junit4]   2> 420 T1501 oasc.SolrResourceLoader.<init> new SolrResourceLoader for directory: '/mnt/ssd/jenkins/workspace/Lucene-Solr-4.x-Linux/solr/build/solr-core/test-files/solr/'
[junit4:junit4]   2> 427 T1501 oasc.CoreContainer.<init> New CoreContainer 28671002
[junit4:junit4]   2> 427 T1501 oasc.SolrCore.<init> [collection1] Opening new SolrCore at /mnt/ssd/jenkins/workspace/Lucene-Solr-4.x-Linux/solr/build/solr-core/test-files/solr/collection1/, dataDir=/mnt/ssd/jenkins/workspace/Lucene-Solr-4.x-Linux/solr/build/solr-core/test/J1/./solrtest-SoftAutoCommitTest-1360539499790/
[junit4:junit4]   2> 427 T1501 oasc.JmxMonitoredMap.<init> JMX monitoring is enabled. Adding Solr mbeans to JMX Server: com.sun.jmx.mbeanserver.JmxMBeanServer@26965c
[junit4:junit4]   2> 428 T1501 oasc.SolrCore.initDirectoryFactory org.apache.solr.core.MockDirectoryFactory
[junit4:junit4]   2> 428 T1501 oasc.CachingDirectoryFactory.get return new directory for /mnt/ssd/jenkins/workspace/Lucene-Solr-4.x-Linux/solr/build/solr-core/test/J1/./solrtest-SoftAutoCommitTest-1360539499790 forceNew:false
[junit4:junit4]   2> 429 T1501 oasc.CachingDirectoryFactory.close Releasing directory:/mnt/ssd/jenkins/workspace/Lucene-Solr-4.x-Linux/solr/build/solr-core/test/J1/./solrtest-SoftAutoCommitTest-1360539499790
[junit4:junit4]   2> 429 T1501 oasc.SolrCore.getNewIndexDir New index directory detected: old=null new=/mnt/ssd/jenkins/workspace/Lucene-Solr-4.x-Linux/solr/build/solr-core/test/J1/./solrtest-SoftAutoCommitTest-1360539499790/index/
[junit4:junit4]   2> 429 T1501 oasc.SolrCore.initIndex WARNING [collection1] Solr index directory '/mnt/ssd/jenkins/workspace/Lucene-Solr-4.x-Linux/solr/build/solr-core/test/J1/./solrtest-SoftAutoCommitTest-1360539499790/index' doesn't exist. Creating new index...
[junit4:junit4]   2> 430 T1501 oasc.CachingDirectoryFactory.get return new directory for /mnt/ssd/jenkins/workspace/Lucene-Solr-4.x-Linux/solr/build/solr-core/test/J1/./solrtest-SoftAutoCommitTest-1360539499790/index forceNew:false
[junit4:junit4]   2> 431 T1501 oasc.SolrDeletionPolicy.onCommit SolrDeletionPolicy.onCommit: commits:num=1
[junit4:junit4]   2> 		commit{dir=RateLimitedDirectoryWrapper(MockDirWrapper(org.apache.lucene.store.RAMDirectory@1420e59 lockFactory=org.apache.lucene.store.NativeFSLockFactory@d6c47)),segFN=segments_1,generation=1,filenames=[segments_1]
[junit4:junit4]   2> 431 T1501 oasc.SolrDeletionPolicy.updateCommits newest commit = 1[segments_1]
[junit4:junit4]   2> 432 T1501 oasc.CachingDirectoryFactory.close Releasing directory:/mnt/ssd/jenkins/workspace/Lucene-Solr-4.x-Linux/solr/build/solr-core/test/J1/./solrtest-SoftAutoCommitTest-1360539499790/index
[junit4:junit4]   2> 432 T1501 oasc.SolrCore.initWriters created xml: solr.XMLResponseWriter
[junit4:junit4]   2> 433 T1501 oasup.UpdateRequestProcessorChain.init inserting DistributedUpdateProcessorFactory into updateRequestProcessorChain "dedupe"
[junit4:junit4]   2> 433 T1501 oasup.UpdateRequestProcessorChain.init inserting DistributedUpdateProcessorFactory into updateRequestProcessorChain "dedupe-allfields"
[junit4:junit4]   2> 434 T1501 oasup.UpdateRequestProcessorChain.init inserting DistributedUpdateProcessorFactory into updateRequestProcessorChain "stored_sig"
[junit4:junit4]   2> 434 T1501 oasup.UpdateRequestProcessorChain.init inserting DistributedUpdateProcessorFactory into updateRequestProcessorChain "uniq-fields"
[junit4:junit4]   2> 434 T1501 oasup.UpdateRequestProcessorChain.init inserting DistributedUpdateProcessorFactory into updateRequestProcessorChain "distrib-dup-test-chain-implicit"
[junit4:junit4]   2> 435 T1501 oasc.RequestHandlers.initHandlersFromConfig adding lazy requestHandler: solr.ReplicationHandler
[junit4:junit4]   2> 435 T1501 oasc.RequestHandlers.initHandlersFromConfig created /replication: solr.ReplicationHandler
[junit4:junit4]   2> 435 T1501 oasc.RequestHandlers.initHandlersFromConfig created standard: solr.StandardRequestHandler
[junit4:junit4]   2> 436 T1501 oasc.RequestHandlers.initHandlersFromConfig created /get: solr.RealTimeGetHandler
[junit4:junit4]   2> 436 T1501 oasc.RequestHandlers.initHandlersFromConfig created dismax: solr.SearchHandler
[junit4:junit4]   2> 436 T1501 oasc.RequestHandlers.initHandlersFromConfig created mock: org.apache.solr.core.MockQuerySenderListenerReqHandler
[junit4:junit4]   2> 437 T1501 oasc.RequestHandlers.initHandlersFromConfig created /admin/: org.apache.solr.handler.admin.AdminHandlers
[junit4:junit4]   2> 437 T1501 oasc.RequestHandlers.initHandlersFromConfig created defaults: solr.StandardRequestHandler
[junit4:junit4]   2> 437 T1501 oasc.RequestHandlers.initHandlersFromConfig adding lazy requestHandler: solr.StandardRequestHandler
[junit4:junit4]   2> 438 T1501 oasc.RequestHandlers.initHandlersFromConfig created lazy: solr.StandardRequestHandler
[junit4:junit4]   2> 438 T1501 oasc.RequestHandlers.initHandlersFromConfig created /update: solr.UpdateRequestHandler
[junit4:junit4]   2> 438 T1501 oasc.RequestHandlers.initHandlersFromConfig created /terms: org.apache.solr.handler.component.SearchHandler
[junit4:junit4]   2> 439 T1501 oasc.RequestHandlers.initHandlersFromConfig created spellCheckCompRH: org.apache.solr.handler.component.SearchHandler
[junit4:junit4]   2> 439 T1501 oasc.RequestHandlers.initHandlersFromConfig created spellCheckCompRH_Direct: org.apache.solr.handler.component.SearchHandler
[junit4:junit4]   2> 440 T1501 oasc.RequestHandlers.initHandlersFromConfig created spellCheckWithWordbreak: org.apache.solr.handler.component.SearchHandler
[junit4:junit4]   2> 440 T1501 oasc.RequestHandlers.initHandlersFromConfig created spellCheckWithWordbreak_Direct: org.apache.solr.handler.component.SearchHandler
[junit4:junit4]   2> 440 T1501 oasc.RequestHandlers.initHandlersFromConfig created spellCheckCompRH1: org.apache.solr.handler.component.SearchHandler
[junit4:junit4]   2> 441 T1501 oasc.RequestHandlers.initHandlersFromConfig created mltrh: org.apache.solr.handler.component.SearchHandler
[junit4:junit4]   2> 441 T1501 oasc.RequestHandlers.initHandlersFromConfig created tvrh: org.apache.solr.handler.component.SearchHandler
[junit4:junit4]   2> 441 T1501 oasc.RequestHandlers.initHandlersFromConfig created /mlt: solr.MoreLikeThisHandler
[junit4:junit4]   2> 442 T1501 oasc.RequestHandlers.initHandlersFromConfig created /debug/dump: solr.DumpRequestHandler
[junit4:junit4]   2> 444 T1501 oashl.XMLLoader.init xsltCacheLifetimeSeconds=60
[junit4:junit4]   2> 445 T1501 oasc.SolrCore.initDeprecatedSupport WARNING solrconfig.xml uses deprecated <admin/gettableFiles>, Please update your config to use the ShowFileRequestHandler.
[junit4:junit4]   2> 447 T1501 oasc.SolrCore.initDeprecatedSupport WARNING adding ShowFileRequestHandler with hidden files: [THROW.ERROR.ON.ADD.UPDATEPROCESSOR.JS, SOLRCONFIG-HIGHLIGHT.XML, SCHEMA-REQUIRED-FIELDS.XML, SCHEMA-REPLICATION2.XML, TRIVIAL.UPDATEPROCESSOR1.JS, BAD-SCHEMA-DUP-DYNAMICFIELD.XML, SCHEMA-MINIMAL.XML, SOLRCONFIG-CACHING.XML, SCHEMA-POSTINGSHIGHLIGHT.XML, SOLRCONFIG-REPEATER.XML, REGEX-BOOST-PROCESSOR-TEST.TXT, BAD-SCHEMA-NONTEXT-ANALYZER.XML, CURRENCY.XML, SOLRCONFIG-MERGEPOLICY.XML, SOLRCONFIG-TLOG.XML, SOLRCONFIG-MASTER.XML, SOLRCONFIG-COMPONENTS-NAME.XML, BAD-SCHEMA-UNIQUEKEY-MULTIVALUED.XML, SCHEMA11.XML, SOLRCONFIG-BASIC.XML, DA_COMPOUNDDICTIONARY.TXT, MISSLEADING.EXTENSION.UPDATEPROCESSOR.JS.TXT, SCHEMA-COPYFIELD-TEST.XML, SOLRCONFIG-SLAVE.XML, ELEVATE.XML, SOLRCONFIG-PROPINJECT-INDEXDEFAULT.XML, TRIVIAL.UPDATEPROCESSOR0.JS, BAD-SOLRCONFIG-BOGUS-SCRIPTENGINE-NAME.XML, SCHEMA-CHARFILTERS.XML, SCHEMA-IB.XML, SOLRCONFIG-QUERYSENDER.XML, SCHEMA-REPLICATION1.XML, SOLRCONFIG-SNIPPET-PROCESSOR.XML, DA_UTF8.XML, CONDITIONAL.UPDATEPROCESSOR.JS, MISSING.FUNCTIONS.UPDATEPROCESSOR.JS, HYPHENATION.DTD, SOLRCONFIG-ENABLEPLUGIN.XML, SCHEMA-PHRASESUGGEST.XML, STEMDICT.TXT, HUNSPELL-TEST.AFF, SCHEMA-SNIPPET-TYPE.XML, STOPTYPES-1.TXT, STOPWORDSWRONGENCODING.TXT, SCHEMA-NUMERIC.XML, SOLRCONFIG-TRANSFORMERS.XML, SOLRCONFIG-PROPINJECT.XML, BAD-SCHEMA-NOT-INDEXED-BUT-TF.XML, SOLRCONFIG-SIMPLELOCK.XML, WDFTYPES.TXT, SCHEMA-REVERSED.XML, STOPTYPES-2.TXT, BAD-SCHEMA-CURRENCY-FT-MULTIVALUED.XML, SOLRCONFIG-SPELLCHECKCOMPONENT.XML, BAD-SCHEMA-CURRENCY-MULTIVALUED.XML, SOLRCONFIG-PHRASESUGGEST.XML, SCHEMA-DFR.XML, BAD-SCHEMA-NOT-INDEXED-BUT-POS.XML, KEEP-1.TXT, OPEN-EXCHANGE-RATES.JSON, SCHEMA-SPATIAL.XML, STOPWITHBOM.TXT, SCHEMA-BINARYFIELD.XML, SOLRCONFIG-POSTINGSHIGHLIGHT.XML, SOLRCONFIG-SPELLCHECKER.XML, SOLRCONFIG-UPDATE-PROCESSOR-CHAINS.XML, BAD-SCHEMA-OMIT-TF-BUT-NOT-POS.XML, BAD-SCHEMA-DUP-FIELDTYPE.XML, SCHEMA-XINCLUDE.XML, SOLRCONFIG-MASTER1.XML, SCHEMA-BEHAVIOR.XML, SYNONYMS.TXT, BAD-SCHEMA-CURRENCY-DYNAMIC-MULTIVALUED.XML, SCHEMA_CODEC.XML, SCHEMA.XML, SOLRCONFIG-SOLR-749.XML, SOLRCONFIG-MASTER1-KEEPONEBACKUP.XML, SCHEMA-EFF.XML, SOLRCONFIG-FUNCTIONQUERY.XML, STOP-2.TXT, SCHEMA-LMDIRICHLET.XML, SOLRCONFIG-TERMINDEX.XML, SOLRCONFIG-ELEVATE.XML, SCHEMA-FOLDING.XML, STOPWORDS.TXT, SCHEMA-STOP-KEEP.XML, FUZZYSUGGEST.TXT, BAD-SCHEMA-NOT-INDEXED-BUT-NORMS.XML, SOLRCONFIG-SOLCOREPROPERTIES.XML, STOP-1.TXT, SOLRCONFIG-MASTER2.XML, SCHEMA-SPELLCHECKER.XML, SOLRCONFIG-RESPONSE-LOG-COMPONENT.XML, SOLRCONFIG-LAZYWRITER.XML, SCHEMA-LUCENEMATCHVERSION.XML, FRENCHARTICLES.TXT, BAD-MP-SOLRCONFIG.XML, SCHEMA15.XML, SOLRCONFIG-REQHANDLER.INCL, SCHEMASURROUND.XML, SCHEMA-COLLATEFILTER.XML, SOLRCONFIG-MASTER3.XML, HUNSPELL-TEST.DIC, SOLRCONFIG-XINCLUDE.XML, BAD-SCHEMA-CODEC-GLOBAL-VS-FT-MISMATCH.XML, SOLRCONFIG-SLAVE1.XML, SOLRCONFIG-DELPOLICY1.XML, SCHEMA-SIM.XML, SCHEMA-SNIPPET-FIELD.XML, SCHEMA-COLLATE.XML, STOP-SNOWBALL.TXT, BAD-SCHEMA-SIM-GLOBAL-VS-FT-MISMATCH.XML, PROTWORDS.TXT, SCHEMA-TRIE.XML, SOLRCONFIG_CODEC.XML, SCHEMA-SYNONYM-TOKENIZER.XML, BAD-SOLRCONFIG-INVALID-SCRIPTFILE.XML, JASUGGEST.TXT, SCHEMA-TFIDF.XML, SOLRCONFIG-SCRIPT-UPDATEPROCESSOR.XML, SCHEMA-LMJELINEKMERCER.XML, PHRASESUGGEST.TXT, BAD-SOLRCONFIG-MISSING-SCRIPTFILE.XML, SOLRCONFIG-BASIC-LUCENEVERSION31.XML, BAD-SCHEMA-UNIQUEKEY-USES-DEFAULT.XML, OLD_SYNONYMS.TXT, SOLRCONFIG-DELPOLICY2.XML, XSLT, SOLRCONFIG-NATIVELOCK.XML, BAD-SCHEMA-DUP-FIELD.XML, SOLRCONFIG-NOCACHE.XML, SCHEMA-BM25.XML, ADDFIELDS.UPDATEPROCESSOR.JS, SOLRCONFIG-ALTDIRECTORY.XML, SOLRCONFIG-QUERYSENDER-NOQUERY.XML, COMPOUNDDICTIONARY.TXT, SOLRCONFIG_PERF.XML, SOLRCONFIG-INDEXCONFIG.XML, BAD-SCHEMA-ANALYZER-CLASS-AND-NESTED.XML, SCHEMA-NOT-REQUIRED-UNIQUE-KEY.XML, KEEP-2.TXT, BAD-SCHEMA-UNIQUEKEY-IS-COPYFIELD-DEST.XML, SCHEMA12.XML, MAPPING-ISOLATIN1ACCENT.TXT, BAD_SOLRCONFIG.XML, BAD-SCHEMA-EXTERNAL-FILEFIELD.XML]
[junit4:junit4]   2> 448 T1501 oasc.CachingDirectoryFactory.close Releasing directory:/mnt/ssd/jenkins/workspace/Lucene-Solr-4.x-Linux/solr/build/solr-core/test/J1/./solrtest-SoftAutoCommitTest-1360539499790
[junit4:junit4]   2> 449 T1501 oass.SolrIndexSearcher.<init> Opening Searcher@1be8314 main
[junit4:junit4]   2> 449 T1501 oasu.CommitTracker.<init> Hard AutoCommit: disabled
[junit4:junit4]   2> 449 T1501 oasu.CommitTracker.<init> Soft AutoCommit: disabled
[junit4:junit4]   2> 450 T1501 oashc.SpellCheckComponent.inform Initializing spell checkers
[junit4:junit4]   2> 475 T1501 oass.DirectSolrSpellChecker.init init: {name=direct,classname=DirectSolrSpellChecker,field=lowerfilt,minQueryLength=3}
[junit4:junit4]   2> 1159 T1502 oasc.SolrCore.registerSearcher [collection1] Registered new searcher Searcher@1be8314 main{StandardDirectoryReader(segments_1:1)}
[junit4:junit4]   2> 1163 T1501 oasc.CoreContainer.registerCore registering core: collection1
[junit4:junit4]   2> 1165 T1501 oas.SolrTestCaseJ4.initCore ####initCore end
[junit4:junit4]   2> 1168 T1501 oas.SolrTestCaseJ4.setUp ###Starting testSoftAndHardCommitMaxTimeRapidAdds
[junit4:junit4]   2> 1168 T1501 oasc.CoreContainer.reload Reloading SolrCore 'collection1' using instanceDir: /mnt/ssd/jenkins/workspace/Lucene-Solr-4.x-Linux/solr/build/solr-core/test-files/solr/collection1
[junit4:junit4]   2> 1169 T1501 oasc.SolrResourceLoader.<init> new SolrResourceLoader for directory: '/mnt/ssd/jenkins/workspace/Lucene-Solr-4.x-Linux/solr/build/solr-core/test-files/solr/collection1/'
[junit4:junit4]   2> 1169 T1501 oasc.SolrResourceLoader.replaceClassLoader Adding 'file:/mnt/ssd/jenkins/workspace/Lucene-Solr-4.x-Linux/solr/build/solr-core/test-files/solr/collection1/lib/README' to classloader
[junit4:junit4]   2> 1169 T1501 oasc.SolrResourceLoader.replaceClassLoader Adding 'file:/mnt/ssd/jenkins/workspace/Lucene-Solr-4.x-Linux/solr/build/solr-core/test-files/solr/collection1/lib/classes/' to classloader
[junit4:junit4]   2> 1199 T1501 oasc.SolrConfig.<init> Using Lucene MatchVersion: LUCENE_42
[junit4:junit4]   2> 1235 T1501 oasc.SolrConfig.<init> Loaded SolrConfig: solrconfig.xml
[junit4:junit4]   2> 1236 T1501 oass.IndexSchema.readSchema Reading Solr Schema
[junit4:junit4]   2> 1240 T1501 oass.IndexSchema.readSchema Schema name=test
[junit4:junit4]   2> 1556 T1501 oass.OpenExchangeRatesOrgProvider.init Initialized with rates=open-exchange-rates.json, refreshInterval=1440.
[junit4:junit4]   2> 1561 T1501 oass.IndexSchema.readSchema default search field in schema is text
[junit4:junit4]   2> 1564 T1501 oass.IndexSchema.readSchema unique key field: id
[junit4:junit4]   2> 1568 T1501 oass.FileExchangeRateProvider.reload Reloading exchange rates from file currency.xml
[junit4:junit4]   2> 1571 T1501 oass.FileExchangeRateProvider.reload Reloading exchange rates from file currency.xml
[junit4:junit4]   2> 1573 T1501 oass.OpenExchangeRatesOrgProvider.reload Reloading exchange rates from open-exchange-rates.json
[junit4:junit4]   2> 1574 T1501 oass.OpenExchangeRatesOrgProvider.reload Reloading exchange rates from open-exchange-rates.json
[junit4:junit4]   2> 1574 T1501 oasc.SolrCore.<init> [collection1] Opening new SolrCore at /mnt/ssd/jenkins/workspace/Lucene-Solr-4.x-Linux/solr/build/solr-core/test-files/solr/collection1/, dataDir=/mnt/ssd/jenkins/workspace/Lucene-Solr-4.x-Linux/solr/build/solr-core/test/J1/./solrtest-SoftAutoCommitTest-1360539499790/
[junit4:junit4]   2> 1575 T1501 oasc.JmxMonitoredMap.<init> JMX monitoring is enabled. Adding Solr mbeans to JMX Server: com.sun.jmx.mbeanserver.JmxMBeanServer@26965c
[junit4:junit4]   2> 1575 T1501 oasc.CachingDirectoryFactory.close Releasing directory:/mnt/ssd/jenkins/workspace/Lucene-Solr-4.x-Linux/solr/build/solr-core/test/J1/./solrtest-SoftAutoCommitTest-1360539499790
[junit4:junit4]   2> 1576 T1501 oasc.SolrCore.getNewIndexDir New index directory detected: old=null new=/mnt/ssd/jenkins/workspace/Lucene-Solr-4.x-Linux/solr/build/solr-core/test/J1/./solrtest-SoftAutoCommitTest-1360539499790/index/
[junit4:junit4]   2> 1576 T1501 oasc.SolrCore.initWriters created xml: solr.XMLResponseWriter
[junit4:junit4]   2> 1577 T1501 oasup.UpdateRequestProcessorChain.init inserting DistributedUpdateProcessorFactory into updateRequestProcessorChain "dedupe"
[junit4:junit4]   2> 1578 T1501 oasup.UpdateRequestProcessorChain.init inserting DistributedUpdateProcessorFactory into updateRequestProcessorChain "dedupe-allfields"
[junit4:junit4]   2> 1578 T1501 oasup.UpdateRequestProcessorChain.init inserting DistributedUpdateProcessorFactory into updateRequestProcessorChain "stored_sig"
[junit4:junit4]   2> 1578 T1501 oasup.UpdateRequestProcessorChain.init inserting DistributedUpdateProcessorFactory into updateRequestProcessorChain "uniq-fields"
[junit4:junit4]   2> 1579 T1501 oasup.UpdateRequestProcessorChain.init inserting DistributedUpdateProcessorFactory into updateRequestProcessorChain "distrib-dup-test-chain-implicit"
[junit4:junit4]   2> 1579 T1501 oasc.RequestHandlers.initHandlersFromConfig adding lazy requestHandler: solr.ReplicationHandler
[junit4:junit4]   2> 1580 T1501 oasc.RequestHandlers.initHandlersFromConfig created /replication: solr.ReplicationHandler
[junit4:junit4]   2> 1580 T1501 oasc.RequestHandlers.initHandlersFromConfig created standard: solr.StandardRequestHandler
[junit4:junit4]   2> 1581 T1501 oasc.RequestHandlers.initHandlersFromConfig created /get: solr.RealTimeGetHandler
[junit4:junit4]   2> 1581 T1501 oasc.RequestHandlers.initHandlersFromConfig created dismax: solr.SearchHandler
[junit4:junit4]   2> 1582 T1501 oasc.RequestHandlers.initHandlersFromConfig created mock: org.apache.solr.core.MockQuerySenderListenerReqHandler
[junit4:junit4]   2> 1582 T1501 oasc.RequestHandlers.initHandlersFromConfig created /admin/: org.apache.solr.handler.admin.AdminHandlers
[junit4:junit4]   2> 1582 T1501 oasc.RequestHandlers.initHandlersFromConfig created defaults: solr.StandardRequestHandler
[junit4:junit4]   2> 1583 T1501 oasc.RequestHandlers.initHandlersFromConfig adding lazy requestHandler: solr.StandardRequestHandler
[junit4:junit4]   2> 1583 T1501 oasc.RequestHandlers.initHandlersFromConfig created lazy: solr.StandardRequestHandler
[junit4:junit4]   2> 1583 T1501 oasc.RequestHandlers.initHandlersFromConfig created /update: solr.UpdateRequestHandler
[junit4:junit4]   2> 1584 T1501 oasc.RequestHandlers.initHandlersFromConfig created /terms: org.apache.solr.handler.component.SearchHandler
[junit4:junit4]   2> 1584 T1501 oasc.RequestHandlers.initHandlersFromConfig created spellCheckCompRH: org.apache.solr.handler.component.SearchHandler
[junit4:junit4]   2> 1585 T1501 oasc.RequestHandlers.initHandlersFromConfig created spellCheckCompRH_Direct: org.apache.solr.handler.component.SearchHandler
[junit4:junit4]   2> 1585 T1501 oasc.RequestHandlers.initHandlersFromConfig created spellCheckWithWordbreak: org.apache.solr.handler.component.SearchHandler
[junit4:junit4]   2> 1586 T1501 oasc.RequestHandlers.initHandlersFromConfig created spellCheckWithWordbreak_Direct: org.apache.solr.handler.component.SearchHandler
[junit4:junit4]   2> 1586 T1501 oasc.RequestHandlers.initHandlersFromConfig created spellCheckCompRH1: org.apache.solr.handler.component.SearchHandler
[junit4:junit4]   2> 1587 T1501 oasc.RequestHandlers.initHandlersFromConfig created mltrh: org.apache.solr.handler.component.SearchHandler
[junit4:junit4]   2> 1587 T1501 oasc.RequestHandlers.initHandlersFromConfig created tvrh: org.apache.solr.handler.component.SearchHandler
[junit4:junit4]   2> 1588 T1501 oasc.RequestHandlers.initHandlersFromConfig created /mlt: solr.MoreLikeThisHandler
[junit4:junit4]   2> 1588 T1501 oasc.RequestHandlers.initHandlersFromConfig created /debug/dump: solr.DumpRequestHandler
[junit4:junit4]   2> 1589 T1501 oashl.XMLLoader.init xsltCacheLifetimeSeconds=60
[junit4:junit4]   2> 1590 T1501 oasc.SolrCore.initDeprecatedSupport WARNING solrconfig.xml uses deprecated <admin/gettableFiles>, Please update your config to use the ShowFileRequestHandler.
[junit4:junit4]   2> 1592 T1501 oasc.SolrCore.initDeprecatedSupport WARNING adding ShowFileRequestHandler with hidden files: [THROW.ERROR.ON.ADD.UPDATEPROCESSOR.JS, SOLRCONFIG-HIGHLIGHT.XML, SCHEMA-REQUIRED-FIELDS.XML, SCHEMA-REPLICATION2.XML, TRIVIAL.UPDATEPROCESSOR1.JS, BAD-SCHEMA-DUP-DYNAMICFIELD.XML, SCHEMA-MINIMAL.XML, SOLRCONFIG-CACHING.XML, SCHEMA-POSTINGSHIGHLIGHT.XML, SOLRCONFIG-REPEATER.XML, REGEX-BOOST-PROCESSOR-TEST.TXT, BAD-SCHEMA-NONTEXT-ANALYZER.XML, CURRENCY.XML, SOLRCONFIG-MERGEPOLICY.XML, SOLRCONFIG-TLOG.XML, SOLRCONFIG-MASTER.XML, SOLRCONFIG-COMPONENTS-NAME.XML, BAD-SCHEMA-UNIQUEKEY-MULTIVALUED.XML, SCHEMA11.XML, SOLRCONFIG-BASIC.XML, DA_COMPOUNDDICTIONARY.TXT, MISSLEADING.EXTENSION.UPDATEPROCESSOR.JS.TXT, SCHEMA-COPYFIELD-TEST.XML, SOLRCONFIG-SLAVE.XML, ELEVATE.XML, SOLRCONFIG-PROPINJECT-INDEXDEFAULT.XML, TRIVIAL.UPDATEPROCESSOR0.JS, BAD-SOLRCONFIG-BOGUS-SCRIPTENGINE-NAME.XML, SCHEMA-CHARFILTERS.XML, SCHEMA-IB.XML, SOLRCONFIG-QUERYSENDER.XML, SCHEMA-REPLICATION1.XML, SOLRCONFIG-SNIPPET-PROCESSOR.XML, DA_UTF8.XML, CONDITIONAL.UPDATEPROCESSOR.JS, MISSING.FUNCTIONS.UPDATEPROCESSOR.JS, HYPHENATION.DTD, SOLRCONFIG-ENABLEPLUGIN.XML, SCHEMA-PHRASESUGGEST.XML, STEMDICT.TXT, HUNSPELL-TEST.AFF, SCHEMA-SNIPPET-TYPE.XML, STOPTYPES-1.TXT, STOPWORDSWRONGENCODING.TXT, SCHEMA-NUMERIC.XML, SOLRCONFIG-TRANSFORMERS.XML, SOLRCONFIG-PROPINJECT.XML, BAD-SCHEMA-NOT-INDEXED-BUT-TF.XML, SOLRCONFIG-SIMPLELOCK.XML, WDFTYPES.TXT, SCHEMA-REVERSED.XML, STOPTYPES-2.TXT, BAD-SCHEMA-CURRENCY-FT-MULTIVALUED.XML, SOLRCONFIG-SPELLCHECKCOMPONENT.XML, BAD-SCHEMA-CURRENCY-MULTIVALUED.XML, SOLRCONFIG-PHRASESUGGEST.XML, SCHEMA-DFR.XML, BAD-SCHEMA-NOT-INDEXED-BUT-POS.XML, KEEP-1.TXT, OPEN-EXCHANGE-RATES.JSON, SCHEMA-SPATIAL.XML, STOPWITHBOM.TXT, SCHEMA-BINARYFIELD.XML, SOLRCONFIG-POSTINGSHIGHLIGHT.XML, SOLRCONFIG-SPELLCHECKER.XML, SOLRCONFIG-UPDATE-PROCESSOR-CHAINS.XML, BAD-SCHEMA-OMIT-TF-BUT-NOT-POS.XML, BAD-SCHEMA-DUP-FIELDTYPE.XML, SCHEMA-XINCLUDE.XML, SOLRCONFIG-MASTER1.XML, SCHEMA-BEHAVIOR.XML, SYNONYMS.TXT, BAD-SCHEMA-CURRENCY-DYNAMIC-MULTIVALUED.XML, SCHEMA_CODEC.XML, SCHEMA.XML, SOLRCONFIG-SOLR-749.XML, SOLRCONFIG-MASTER1-KEEPONEBACKUP.XML, SCHEMA-EFF.XML, SOLRCONFIG-FUNCTIONQUERY.XML, STOP-2.TXT, SCHEMA-LMDIRICHLET.XML, SOLRCONFIG-TERMINDEX.XML, SOLRCONFIG-ELEVATE.XML, SCHEMA-FOLDING.XML, STOPWORDS.TXT, SCHEMA-STOP-KEEP.XML, FUZZYSUGGEST.TXT, BAD-SCHEMA-NOT-INDEXED-BUT-NORMS.XML, SOLRCONFIG-SOLCOREPROPERTIES.XML, STOP-1.TXT, SOLRCONFIG-MASTER2.XML, SCHEMA-SPELLCHECKER.XML, SOLRCONFIG-RESPONSE-LOG-COMPONENT.XML, SOLRCONFIG-LAZYWRITER.XML, SCHEMA-LUCENEMATCHVERSION.XML, FRENCHARTICLES.TXT, BAD-MP-SOLRCONFIG.XML, SCHEMA15.XML, SOLRCONFIG-REQHANDLER.INCL, SCHEMASURROUND.XML, SCHEMA-COLLATEFILTER.XML, SOLRCONFIG-MASTER3.XML, HUNSPELL-TEST.DIC, SOLRCONFIG-XINCLUDE.XML, BAD-SCHEMA-CODEC-GLOBAL-VS-FT-MISMATCH.XML, SOLRCONFIG-SLAVE1.XML, SOLRCONFIG-DELPOLICY1.XML, SCHEMA-SIM.XML, SCHEMA-SNIPPET-FIELD.XML, SCHEMA-COLLATE.XML, STOP-SNOWBALL.TXT, BAD-SCHEMA-SIM-GLOBAL-VS-FT-MISMATCH.XML, PROTWORDS.TXT, SCHEMA-TRIE.XML, SOLRCONFIG_CODEC.XML, SCHEMA-SYNONYM-TOKENIZER.XML, BAD-SOLRCONFIG-INVALID-SCRIPTFILE.XML, JASUGGEST.TXT, SCHEMA-TFIDF.XML, SOLRCONFIG-SCRIPT-UPDATEPROCESSOR.XML, SCHEMA-LMJELINEKMERCER.XML, PHRASESUGGEST.TXT, BAD-SOLRCONFIG-MISSING-SCRIPTFILE.XML, SOLRCONFIG-BASIC-LUCENEVERSION31.XML, BAD-SCHEMA-UNIQUEKEY-USES-DEFAULT.XML, OLD_SYNONYMS.TXT, SOLRCONFIG-DELPOLICY2.XML, XSLT, SOLRCONFIG-NATIVELOCK.XML, BAD-SCHEMA-DUP-FIELD.XML, SOLRCONFIG-NOCACHE.XML, SCHEMA-BM25.XML, ADDFIELDS.UPDATEPROCESSOR.JS, SOLRCONFIG-ALTDIRECTORY.XML, SOLRCONFIG-QUERYSENDER-NOQUERY.XML, COMPOUNDDICTIONARY.TXT, SOLRCONFIG_PERF.XML, SOLRCONFIG-INDEXCONFIG.XML, BAD-SCHEMA-ANALYZER-CLASS-AND-NESTED.XML, SCHEMA-NOT-REQUIRED-UNIQUE-KEY.XML, KEEP-2.TXT, BAD-SCHEMA-UNIQUEKEY-IS-COPYFIELD-DEST.XML, SCHEMA12.XML, MAPPING-ISOLATIN1ACCENT.TXT, BAD_SOLRCONFIG.XML, BAD-SCHEMA-EXTERNAL-FILEFIELD.XML]
[junit4:junit4]   2> 1593 T1501 oasc.CachingDirectoryFactory.close Releasing directory:/mnt/ssd/jenkins/workspace/Lucene-Solr-4.x-Linux/solr/build/solr-core/test/J1/./solrtest-SoftAutoCommitTest-1360539499790
[junit4:junit4]   2> 1594 T1501 oass.SolrIndexSearcher.<init> Opening Searcher@11ca8ce main
[junit4:junit4]   2> 1594 T1501 oasu.CommitTracker.<init> Hard AutoCommit: disabled
[junit4:junit4]   2> 1595 T1501 oasu.CommitTracker.<init> Soft AutoCommit: disabled
[junit4:junit4]   2> 1595 T1501 oashc.SpellCheckComponent.inform Initializing spell checkers
[junit4:junit4]   2> 1596 T1501 oass.DirectSolrSpellChecker.init init: {name=direct,classname=DirectSolrSpellChecker,field=lowerfilt,minQueryLength=3}
[junit4:junit4]   2> 1605 T1503 oasc.SolrCore.registerSearcher [collection1] Registered new searcher Searcher@11ca8ce main{StandardDirectoryReader(segments_1:1)}
[junit4:junit4]   2> 1611 T1501 oasc.CoreContainer.registerCore replacing core: collection1
[junit4:junit4]   2> 1611 T1501 oasc.SolrCore.close [collection1]  CLOSING SolrCore org.apache.solr.core.SolrCore@1e6c320
[junit4:junit4]   2> 1616 T1501 oasu.DirectUpdateHandler2.close closing DirectUpdateHandler2{commits=0,autocommits=0,soft autocommits=0,optimizes=0,rollbacks=0,expungeDeletes=0,docsPending=0,adds=0,deletesById=0,deletesByQuery=0,errors=0,cumulative_adds=0,cumulative_deletesById=0,cumulative_deletesByQuery=0,cumulative_errors=0}
[junit4:junit4]   2> 1616 T1501 oasc.SolrCore.closeSearcher [collection1] Closing main searcher on request.
[junit4:junit4]   2> 1617 T1501 oasc.CachingDirectoryFactory.close Releasing directory:/mnt/ssd/jenkins/workspace/Lucene-Solr-4.x-Linux/solr/build/solr-core/test/J1/./solrtest-SoftAutoCommitTest-1360539499790/index
[junit4:junit4]   2> ASYNC  NEW_CORE C83 name=collection1 org.apache.solr.core.SolrCore@f5ea54
[junit4:junit4]   2> 1621 T1501 C83 oasc.CachingDirectoryFactory.close Releasing directory:/mnt/ssd/jenkins/workspace/Lucene-Solr-4.x-Linux/solr/build/solr-core/test/J1/./solrtest-SoftAutoCommitTest-1360539499790
[junit4:junit4]   2> 1622 T1501 C83 oasc.SolrDeletionPolicy.onInit SolrDeletionPolicy.onInit: commits:num=1
[junit4:junit4]   2> 		commit{dir=RateLimitedDirectoryWrapper(MockDirWrapper(org.apache.lucene.store.RAMDirectory@1420e59 lockFactory=org.apache.lucene.store.NativeFSLockFactory@d6c47)),segFN=segments_1,generation=1,filenames=[segments_1]
[junit4:junit4]   2> 1623 T1501 C83 oasc.SolrDeletionPolicy.updateCommits newest commit = 1[segments_1]
[junit4:junit4]   2> 1624 T1501 C83 UPDATE [collection1] webapp=null path=null params={} {add=[5000]} 0 3
[junit4:junit4]   2> 1630 T1501 C83 UPDATE [collection1] webapp=null path=null params={} {add=[5001]} 0 0
[junit4:junit4]   2> 1636 T1501 C83 UPDATE [collection1] webapp=null path=null params={} {add=[5002]} 0 1
[junit4:junit4]   2> 1641 T1501 C83 UPDATE [collection1] webapp=null path=null params={} {add=[5003]} 0 1
[junit4:junit4]   2> 1646 T1501 C83 UPDATE [collection1] webapp=null path=null params={} {add=[5004]} 0 1
[junit4:junit4]   2> 1648 T1501 oas.SolrTestCaseJ4.tearDown ###Ending testSoftAndHardCommitMaxTimeRapidAdds
[junit4:junit4]   2> 1652 T1501 oas.SolrTestCaseJ4.setUp ###Starting testSoftAndHardCommitMaxTimeDelete
[junit4:junit4]   2> 1652 T1501 oasc.CoreContainer.reload Reloading SolrCore 'collection1' using instanceDir: /mnt/ssd/jenkins/workspace/Lucene-Solr-4.x-Linux/solr/build/solr-core/test-files/solr/collection1
[junit4:junit4]   2> 1652 T1501 oasc.SolrResourceLoader.<init> new SolrResourceLoader for directory: '/mnt/ssd/jenkins/workspace/Lucene-Solr-4.x-Linux/solr/build/solr-core/test-files/solr/collection1/'
[junit4:junit4]   2> 1653 T1501 oasc.SolrResourceLoader.replaceClassLoader Adding 'file:/mnt/ssd/jenkins/workspace/Lucene-Solr-4.x-Linux/solr/build/solr-core/test-files/solr/collection1/lib/README' to classloader
[junit4:junit4]   2> 1653 T1501 oasc.SolrResourceLoader.replaceClassLoader Adding 'file:/mnt/ssd/jenkins/workspace/Lucene-Solr-4.x-Linux/solr/build/solr-core/test-files/solr/collection1/lib/classes/' to classloader
[junit4:junit4]   2> 1680 T1501 oasc.SolrConfig.<init> Using Lucene MatchVersion: LUCENE_42
[junit4:junit4]   2> 1735 T1501 oasc.SolrConfig.<init> Loaded SolrConfig: solrconfig.xml
[junit4:junit4]   2> 1735 T1501 oass.IndexSchema.readSchema Reading Solr Schema
[junit4:junit4]   2> 1739 T1501 oass.IndexSchema.readSchema Schema name=test
[junit4:junit4]   2> 2061 T1501 oass.OpenExchangeRatesOrgProvider.init Initialized with rates=open-exchange-rates.json, refreshInterval=1440.
[junit4:junit4]   2> 2066 T1501 oass.IndexSchema.readSchema default search field in schema is text
[junit4:junit4]   2> 2068 T1501 oass.IndexSchema.readSchema unique key field: id
[junit4:junit4]   2> 2073 T1501 oass.FileExchangeRateProvider.reload Reloading exchange rates from file currency.xml
[junit4:junit4]   2> 2075 T1501 oass.FileExchangeRateProvider.reload Reloading exchange rates from file currency.xml
[junit4:junit4]   2> 2078 T1501 oass.OpenExchangeRatesOrgProvider.reload Reloading exchange rates from open-exchange-rates.json
[junit4:junit4]   2> 2079 T1501 oass.OpenExchangeRatesOrgProvider.reload Reloading exchange rates from open-exchange-rates.json
[junit4:junit4]   2> 2079 T1501 oasc.SolrCore.<init> [collection1] Opening new SolrCore at /mnt/ssd/jenkins/workspace/Lucene-Solr-4.x-Linux/solr/build/solr-core/test-files/solr/collection1/, dataDir=/mnt/ssd/jenkins/workspace/Lucene-Solr-4.x-Linux/solr/build/solr-core/test/J1/./solrtest-SoftAutoCommitTest-1360539499790/
[junit4:junit4]   2> 2080 T1501 oasc.JmxMonitoredMap.<init> JMX monitoring is enabled. Adding Solr mbeans to JMX Server: com.sun.jmx.mbeanserver.JmxMBeanServer@26965c
[junit4:junit4]   2> 2081 T1501 oasc.CachingDirectoryFactory.close Releasing directory:/mnt/ssd/jenkins/workspace/Lucene-Solr-4.x-Linux/solr/build/solr-core/test/J1/./solrtest-SoftAutoCommitTest-1360539499790
[junit4:junit4]   2> 2081 T1501 oasc.SolrCore.getNewIndexDir New index directory detected: old=null new=/mnt/ssd/jenkins/workspace/Lucene-Solr-4.x-Linux/solr/build/solr-core/test/J1/./solrtest-SoftAutoCommitTest-1360539499790/index/
[junit4:junit4]   2> 2082 T1501 oasc.SolrCore.initWriters created xml: solr.XMLResponseWriter
[junit4:junit4]   2> 2084 T1501 oasup.UpdateRequestProcessorChain.init inserting DistributedUpdateProcessorFactory into updateRequestProcessorChain "dedupe"
[junit4:junit4]   2> 2085 T1501 oasup.UpdateRequestProcessorChain.init inserting DistributedUpdateProcessorFactory into updateRequestProcessorChain "dedupe-allfields"
[junit4:junit4]   2> 2085 T1501 oasup.UpdateRequestProcessorChain.init inserting DistributedUpdateProcessorFactory into updateRequestProcessorChain "stored_sig"
[junit4:junit4]   2> 2086 T1501 oasup.UpdateRequestProcessorChain.init inserting DistributedUpdateProcessorFactory into updateRequestProcessorChain "uniq-fields"
[junit4:junit4]   2> 2087 T1501 oasup.UpdateRequestProcessorChain.init inserting DistributedUpdateProcessorFactory into updateRequestProcessorChain "distrib-dup-test-chain-implicit"
[junit4:junit4]   2> 2087 T1501 oasc.RequestHandlers.initHandlersFromConfig adding lazy requestHandler: solr.ReplicationHandler
[junit4:junit4]   2> 2088 T1501 oasc.RequestHandlers.initHandlersFromConfig created /replication: solr.ReplicationHandler
[junit4:junit4]   2> 2088 T1501 oasc.RequestHandlers.initHandlersFromConfig created standard: solr.StandardRequestHandler
[junit4:junit4]   2> 2089 T1501 oasc.RequestHandlers.initHandlersFromConfig created /get: solr.RealTimeGetHandler
[junit4:junit4]   2> 2090 T1501 oasc.RequestHandlers.initHandlersFromConfig created dismax: solr.SearchHandler
[junit4:junit4]   2> 2091 T1501 oasc.RequestHandlers.initHandlersFromConfig created mock: org.apache.solr.core.MockQuerySenderListenerReqHandler
[junit4:junit4]   2> 2091 T1501 oasc.RequestHandlers.initHandlersFromConfig created /admin/: org.apache.solr.handler.admin.AdminHandlers
[junit4:junit4]   2> 2092 T1501 oasc.RequestHandlers.initHandlersFromConfig created defaults: solr.StandardRequestHandler
[junit4:junit4]   2> 2092 T1501 oasc.RequestHandlers.initHandlersFromConfig adding lazy requestHandler: solr.StandardRequestHandler
[junit4:junit4]   2> 2093 T1501 oasc.RequestHandlers.initHandlersFromConfig created lazy: solr.StandardRequestHandler
[junit4:junit4]   2> 2093 T1501 oasc.RequestHandlers.initHandlersFromConfig created /update: solr.UpdateRequestHandler
[junit4:junit4]   2> 2094 T1501 oasc.RequestHandlers.initHandlersFromConfig created /terms: org.apache.solr.handler.component.SearchHandler
[junit4:junit4]   2> 2095 T1501 oasc.RequestHandlers.initHandlersFromConfig created spellCheckCompRH: org.apache.solr.handler.component.SearchHandler
[junit4:junit4]   2> 2095 T1501 oasc.RequestHandlers.initHandlersFromConfig created spellCheckCompRH_Direct: org.apache.solr.handler.component.SearchHandler
[junit4:junit4]   2> 2096 T1501 oasc.RequestHandlers.initHandlersFromConfig created spellCheckWithWordbreak: org.apache.solr.handler.component.SearchHandler
[junit4:junit4]   2> 2097 T1501 oasc.RequestHandlers.initHandlersFromConfig created spellCheckWithWordbreak_Direct: org.apache.solr.handler.component.SearchHandler
[junit4:junit4]   2> 2098 T1501 oasc.RequestHandlers.initHandlersFromConfig created spellCheckCompRH1: org.apache.solr.handler.component.SearchHandler
[junit4:junit4]   2> 2098 T1501 oasc.RequestHandlers.initHandlersFromConfig created mltrh: org.apache.solr.handler.component.SearchHandler
[junit4:junit4]   2> 2099 T1501 oasc.RequestHandlers.initHandlersFromConfig created tvrh: org.apache.solr.handler.component.SearchHandler
[junit4:junit4]   2> 2099 T1501 oasc.RequestHandlers.initHandlersFromConfig created /mlt: solr.MoreLikeThisHandler
[junit4:junit4]   2> 2100 T1501 oasc.RequestHandlers.initHandlersFromConfig created /debug/dump: solr.DumpRequestHandler
[junit4:junit4]   2> 2101 T1501 oashl.XMLLoader.init xsltCacheLifetimeSeconds=60
[junit4:junit4]   2> 2102 T1501 oasc.SolrCore.initDeprecatedSupport WARNING solrconfig.xml uses deprecated <admin/gettableFiles>, Please update your config to use the ShowFileRequestHandler.
[junit4:junit4]   2> 2103 T1501 oasc.SolrCore.initDeprecatedSupport WARNING adding ShowFileRequestHandler with hidden files: [THROW.ERROR.ON.ADD.UPDATEPROCESSOR.JS, SOLRCONFIG-HIGHLIGHT.XML, SCHEMA-REQUIRED-FIELDS.XML, SCHEMA-REPLICATION2.XML, TRIVIAL.UPDATEPROCESSOR1.JS, BAD-SCHEMA-DUP-DYNAMICFIELD.XML, SCHEMA-MINIMAL.XML, SOLRCONFIG-CACHING.XML, SCHEMA-POSTINGSHIGHLIGHT.XML, SOLRCONFIG-REPEATER.XML, REGEX-BOOST-PROCESSOR-TEST.TXT, BAD-SCHEMA-NONTEXT-ANALYZER.XML, CURRENCY.XML, SOLRCONFIG-MERGEPOLICY.XML, SOLRCONFIG-TLOG.XML, SOLRCONFIG-MASTER.XML, SOLRCONFIG-COMPONENTS-NAME.XML, BAD-SCHEMA-UNIQUEKEY-MULTIVALUED.XML, SCHEMA11.XML, SOLRCONFIG-BASIC.XML, DA_COMPOUNDDICTIONARY.TXT, MISSLEADING.EXTENSION.UPDATEPROCESSOR.JS.TXT, SCHEMA-COPYFIELD-TEST.XML, SOLRCONFIG-SLAVE.XML, ELEVATE.XML, SOLRCONFIG-PROPINJECT-INDEXDEFAULT.XML, TRIVIAL.UPDATEPROCESSOR0.JS, BAD-SOLRCONFIG-BOGUS-SCRIPTENGINE-NAME.XML, SCHEMA-CHARFILTERS.XML, SCHEMA-IB.XML, SOLRCONFIG-QUERYSENDER.XML, SCHEMA-REPLICATION1.XML, SOLRCONFIG-SNIPPET-PROCESSOR.XML, DA_UTF8.XML, CONDITIONAL.UPDATEPROCESSOR.JS, MISSING.FUNCTIONS.UPDATEPROCESSOR.JS, HYPHENATION.DTD, SOLRCONFIG-ENABLEPLUGIN.XML, SCHEMA-PHRASESUGGEST.XML, STEMDICT.TXT, HUNSPELL-TEST.AFF, SCHEMA-SNIPPET-TYPE.XML, STOPTYPES-1.TXT, STOPWORDSWRONGENCODING.TXT, SCHEMA-NUMERIC.XML, SOLRCONFIG-TRANSFORMERS.XML, SOLRCONFIG-PROPINJECT.XML, BAD-SCHEMA-NOT-INDEXED-BUT-TF.XML, SOLRCONFIG-SIMPLELOCK.XML, WDFTYPES.TXT, SCHEMA-REVERSED.XML, STOPTYPES-2.TXT, BAD-SCHEMA-CURRENCY-FT-MULTIVALUED.XML, SOLRCONFIG-SPELLCHECKCOMPONENT.XML, BAD-SCHEMA-CURRENCY-MULTIVALUED.XML, SOLRCONFIG-PHRASESUGGEST.XML, SCHEMA-DFR.XML, BAD-SCHEMA-NOT-INDEXED-BUT-POS.XML, KEEP-1.TXT, OPEN-EXCHANGE-RATES.JSON, SCHEMA-SPATIAL.XML, STOPWITHBOM.TXT, SCHEMA-BINARYFIELD.XML, SOLRCONFIG-POSTINGSHIGHLIGHT.XML, SOLRCONFIG-SPELLCHECKER.XML, SOLRCONFIG-UPDATE-PROCESSOR-CHAINS.XML, BAD-SCHEMA-OMIT-TF-BUT-NOT-POS.XML, BAD-SCHEMA-DUP-FIELDTYPE.XML, SCHEMA-XINCLUDE.XML, SOLRCONFIG-MASTER1.XML, SCHEMA-BEHAVIOR.XML, SYNONYMS.TXT, BAD-SCHEMA-CURRENCY-DYNAMIC-MULTIVALUED.XML, SCHEMA_CODEC.XML, SCHEMA.XML, SOLRCONFIG-SOLR-749.XML, SOLRCONFIG-MASTER1-KEEPONEBACKUP.XML, SCHEMA-EFF.XML, SOLRCONFIG-FUNCTIONQUERY.XML, STOP-2.TXT, SCHEMA-LMDIRICHLET.XML, SOLRCONFIG-TERMINDEX.XML, SOLRCONFIG-ELEVATE.XML, SCHEMA-FOLDING.XML, STOPWORDS.TXT, SCHEMA-STOP-KEEP.XML, FUZZYSUGGEST.TXT, BAD-SCHEMA-NOT-INDEXED-BUT-NORMS.XML, SOLRCONFIG-SOLCOREPROPERTIES.XML, STOP-1.TXT, SOLRCONFIG-MASTER2.XML, SCHEMA-SPELLCHECKER.XML, SOLRCONFIG-RESPONSE-LOG-COMPONENT.XML, SOLRCONFIG-LAZYWRITER.XML, SCHEMA-LUCENEMATCHVERSION.XML, FRENCHARTICLES.TXT, BAD-MP-SOLRCONFIG.XML, SCHEMA15.XML, SOLRCONFIG-REQHANDLER.INCL, SCHEMASURROUND.XML, SCHEMA-COLLATEFILTER.XML, SOLRCONFIG-MASTER3.XML, HUNSPELL-TEST.DIC, SOLRCONFIG-XINCLUDE.XML, BAD-SCHEMA-CODEC-GLOBAL-VS-FT-MISMATCH.XML, SOLRCONFIG-SLAVE1.XML, SOLRCONFIG-DELPOLICY1.XML, SCHEMA-SIM.XML, SCHEMA-SNIPPET-FIELD.XML, SCHEMA-COLLATE.XML, STOP-SNOWBALL.TXT, BAD-SCHEMA-SIM-GLOBAL-VS-FT-MISMATCH.XML, PROTWORDS.TXT, SCHEMA-TRIE.XML, SOLRCONFIG_CODEC.XML, SCHEMA-SYNONYM-TOKENIZER.XML, BAD-SOLRCONFIG-INVALID-SCRIPTFILE.XML, JASUGGEST.TXT, SCHEMA-TFIDF.XML, SOLRCONFIG-SCRIPT-UPDATEPROCESSOR.XML, SCHEMA-LMJELINEKMERCER.XML, PHRASESUGGEST.TXT, BAD-SOLRCONFIG-MISSING-SCRIPTFILE.XML, SOLRCONFIG-BASIC-LUCENEVERSION31.XML, BAD-SCHEMA-UNIQUEKEY-USES-DEFAULT.XML, OLD_SYNONYMS.TXT, SOLRCONFIG-DELPOLICY2.XML, XSLT, SOLRCONFIG-NATIVELOCK.XML, BAD-SCHEMA-DUP-FIELD.XML, SOLRCONFIG-NOCACHE.XML, SCHEMA-BM25.XML, ADDFIELDS.UPDATEPROCESSOR.JS, SOLRCONFIG-ALTDIRECTORY.XML, SOLRCONFIG-QUERYSENDER-NOQUERY.XML, COMPOUNDDICTIONARY.TXT, SOLRCONFIG_PERF.XML, SOLRCONFIG-INDEXCONFIG.XML, BAD-SCHEMA-ANALYZER-CLASS-AND-NESTED.XML, SCHEMA-NOT-REQUIRED-UNIQUE-KEY.XML, KEEP-2.TXT, BAD-SCHEMA-UNIQUEKEY-IS-COPYFIELD-DEST.XML, SCHEMA12.XML, MAPPING-ISOLATIN1ACCENT.TXT, BAD_SOLRCONFIG.XML, BAD-SCHEMA-EXTERNAL-FILEFIELD.XML]
[junit4:junit4]   2> 2105 T1501 oasc.CachingDirectoryFactory.close Releasing directory:/mnt/ssd/jenkins/workspace/Lucene-Solr-4.x-Linux/solr/build/solr-core/test/J1/./solrtest-SoftAutoCommitTest-1360539499790
[junit4:junit4]   2> 2107 T1501 oass.SolrIndexSearcher.<init> Opening Searcher@2d8041 main
[junit4:junit4]   2> 2108 T1501 oasu.CommitTracker.<init> Hard AutoCommit: disabled
[junit4:junit4]   2> 2108 T1501 oasu.CommitTracker.<init> Soft AutoCommit: disabled
[junit4:junit4]   2> 2108 T1501 oashc.SpellCheckComponent.inform Initializing spell checkers
[junit4:junit4]   2> 2109 T1501 oass.DirectSolrSpellChecker.init init: {name=direct,classname=DirectSolrSpellChecker,field=lowerfilt,minQueryLength=3}
[junit4:junit4]   2> 2117 T1506 oasc.SolrCore.registerSearcher [collection1] Registered new searcher Searcher@2d8041 main{StandardDirectoryReader(segments_1:3:nrt _0(4.2):C5)}
[junit4:junit4]   2> 2120 T1501 oasc.CoreContainer.registerCore replacing core: collection1
[junit4:junit4]   2> 2120 T1501 oasc.SolrCore.close [collection1]  CLOSING SolrCore org.apache.solr.core.SolrCore@f5ea54
[junit4:junit4]   2> 2124 T1501 oasu.DirectUpdateHandler2.close closing DirectUpdateHandler2{commits=0,autocommit maxTime=1200ms,autocommits=0,soft autocommit maxTime=500ms,soft autocommits=0,optimizes=0,rollbacks=0,expungeDeletes=0,docsPending=5,adds=5,deletesById=0,deletesByQuery=0,errors=0,cumulative_adds=5,cumulative_deletesById=0,cumulative_deletesByQuery=0,cumulative_errors=0}
[junit4:junit4]   2> 2124 T1505 oasu.DirectUpdateHandler2.commit start commit{,optimize=false,openSearcher=true,waitSearcher=true,expungeDeletes=false,softCommit=true}
[junit4:junit4]   2> 2125 T1505 oasc.CachingDirectoryFactory.close Releasing directory:/mnt/ssd/jenkins/workspace/Lucene-Solr-4.x-Linux/solr/build/solr-core/test/J1/./solrtest-SoftAutoCommitTest-1360539499790
[junit4:junit4]   2> 2125 T1501 oasc.SolrCore.closeSearcher [collection1] Closing main searcher on request.
[junit4:junit4]   2> 2126 T1505 oass.SolrIndexSearcher.<init> Opening Searcher@c17df7 main
[junit4:junit4]   2> 2126 T1505 oasc.CachingDirectoryFactory.close Releasing directory:/mnt/ssd/jenkins/workspace/Lucene-Solr-4.x-Linux/solr/build/solr-core/test/J1/./solrtest-SoftAutoCommitTest-1360539499790/index
[junit4:junit4]   2> 2127 T1505 oasc.SolrException.log SEVERE auto commit error...:org.apache.solr.common.SolrException: java.util.concurrent.RejectedExecutionException: Task java.util.concurrent.FutureTask@13513ba rejected from java.util.concurrent.ThreadPoolExecutor@1a25266[Terminated, pool size = 0, active threads = 0, queued tasks = 0, completed tasks = 2]
[junit4:junit4]   2> 		at org.apache.solr.core.SolrCore.getSearcher(SolrCore.java:1660)
[junit4:junit4]   2> 		at org.apache.solr.update.DirectUpdateHandler2.commit(DirectUpdateHandler2.java:562)
[junit4:junit4]   2> 		at org.apache.solr.update.CommitTracker.run(CommitTracker.java:216)
[junit4:junit4]   2> 		at java.util.concurrent.Executors$RunnableAdapter.call(Executors.java:471)
[junit4:junit4]   2> 		at java.util.concurrent.FutureTask$Sync.innerRun(FutureTask.java:334)
[junit4:junit4]   2> 		at java.util.concurrent.FutureTask.run(FutureTask.java:166)
[junit4:junit4]   2> 		at java.util.concurrent.ScheduledThreadPoolExecutor$ScheduledFutureTask.access$201(ScheduledThreadPoolExecutor.java:178)
[junit4:junit4]   2> 		at java.util.concurrent.ScheduledThreadPoolExecutor$ScheduledFutureTask.run(ScheduledThreadPoolExecutor.java:292)
[junit4:junit4]   2> 		at java.util.concurrent.ThreadPoolExecutor.runWorker(ThreadPoolExecutor.java:1110)
[junit4:junit4]   2> 		at java.util.concurrent.ThreadPoolExecutor$Worker.run(ThreadPoolExecutor.java:603)
[junit4:junit4]   2> 		at java.lang.Thread.run(Thread.java:722)
[junit4:junit4]   2> 	Caused by: java.util.concurrent.RejectedExecutionException: Task java.util.concurrent.FutureTask@13513ba rejected from java.util.concurrent.ThreadPoolExecutor@1a25266[Terminated, pool size = 0, active threads = 0, queued tasks = 0, completed tasks = 2]
[junit4:junit4]   2> 		at java.util.concurrent.ThreadPoolExecutor$AbortPolicy.rejectedExecution(ThreadPoolExecutor.java:2013)
[junit4:junit4]   2> 		at java.util.concurrent.ThreadPoolExecutor.reject(ThreadPoolExecutor.java:816)
[junit4:junit4]   2> 		at java.util.concurrent.ThreadPoolExecutor.execute(ThreadPoolExecutor.java:1337)
[junit4:junit4]   2> 		at java.util.concurrent.AbstractExecutorService.submit(AbstractExecutorService.java:132)
[junit4:junit4]   2> 		at java.util.concurrent.Executors$DelegatedExecutorService.submit(Executors.java:641)
[junit4:junit4]   2> 		at org.apache.solr.core.SolrCore.getSearcher(SolrCore.java:1588)
[junit4:junit4]   2> 		... 10 more
[junit4:junit4]   2> 	
[junit4:junit4]   2> ASYNC  NEW_CORE C84 name=collection1 org.apache.solr.core.SolrCore@17d4074
[junit4:junit4]   2> 2132 T1501 C84 UPDATE [collection1] webapp=null path=null params={} {add=[529]} 0 1
[junit4:junit4]   2> 2139 T1501 C84 oasu.DirectUpdateHandler2.commit start commit{,optimize=false,openSearcher=true,waitSearcher=true,expungeDeletes=false,softCommit=false}
[junit4:junit4]   2> 2142 T1501 C84 oasc.SolrDeletionPolicy.onCommit SolrDeletionPolicy.onCommit: commits:num=2
[junit4:junit4]   2> 		commit{dir=RateLimitedDirectoryWrapper(MockDirWrapper(org.apache.lucene.store.RAMDirectory@1420e59 lockFactory=org.apache.lucene.store.NativeFSLockFactory@d6c47)),segFN=segments_1,generation=1,filenames=[segments_1]
[junit4:junit4]   2> 		commit{dir=RateLimitedDirectoryWrapper(MockDirWrapper(org.apache.lucene.store.RAMDirectory@1420e59 lockFactory=org.apache.lucene.store.NativeFSLockFactory@d6c47)),segFN=segments_2,generation=2,filenames=[_1_Direct_0.pos, _1_MockSep_0.frq, _1_Lucene41_0.doc, _1_Direct_0.doc, _0_MockSep_0.pos, _0_Lucene41_0.pos, _1.fnm, _0_MockSep_0.skp, _0_SimpleText_0.pst, _0.nvd, _1_Direct_0.tim, _0_MockSep_0.doc, _0.si, _0_Lucene41_0.tim, _1_Direct_0.tip, _0_Lucene41_0.tip, _1_MockSep_0.doc, _1_MockSep_0.pyl, _1.nvm, _1_MockSep_0.skp, _0.fnm, _1_MockSep_0.pos, _1_MockSep_0.tib, _1_Lucene41_0.tim, _1.nvd, _1_Lucene41_0.tip, _0.nvm, _1_MockSep_0.tii, _0_MockSep_0.tib, _1_Lucene41_0.pos, _1.fdx, _0_Direct_0.doc, _1.fdt, _0_Lucene41_0.doc, _1.si, _0_MockSep_0.frq, segments_2, _0_Direct_0.pos, _0.fdx, _0_Direct_0.tip, _0_MockSep_0.tii, _0_MockSep_0.pyl, _0_Direct_0.tim, _0.fdt, _1_SimpleText_0.pst]
[junit4:junit4]   2> 2143 T1501 C84 oasc.SolrDeletionPolicy.updateCommits newest commit = 2[_1_Direct_0.pos, _1_MockSep_0.frq, _1_Lucene41_0.doc, _1_Direct_0.doc, _0_MockSep_0.pos, _0_Lucene41_0.pos, _1.fnm, _0_MockSep_0.skp, _0_SimpleText_0.pst, _0.nvd, _1_Direct_0.tim, _0_MockSep_0.doc, _0.si, _0_Lucene41_0.tim, _1_Direct_0.tip, _0_Lucene41_0.tip, _1_MockSep_0.doc, _1_MockSep_0.pyl, _1.nvm, _1_MockSep_0.skp, _0.fnm, _1_MockSep_0.pos, _1_MockSep_0.tib, _1_Lucene41_0.tim, _1.nvd, _1_Lucene41_0.tip, _0.nvm, _1_MockSep_0.tii, _0_MockSep_0.tib, _1_Lucene41_0.pos, _1.fdx, _0_Direct_0.doc, _1.fdt, _0_Lucene41_0.doc, _1.si, _0_MockSep_0.frq, segments_2, _0_Direct_0.pos, _0.fdx, _0_Direct_0.tip, _0_MockSep_0.tii, _0_MockSep_0.pyl, _0_Direct_0.tim, _0.fdt, _1_SimpleText_0.pst]
[junit4:junit4]   2> 2144 T1501 C84 oasc.CachingDirectoryFactory.close Releasing directory:/mnt/ssd/jenkins/workspace/Lucene-Solr-4.x-Linux/solr/build/solr-core/test/J1/./solrtest-SoftAutoCommitTest-1360539499790
[junit4:junit4]   2> 2145 T1501 C84 oass.SolrIndexSearcher.<init> Opening Searcher@73cd5a main
[junit4:junit4]   2> 2146 T1501 C84 oasu.DirectUpdateHandler2.commit end_commit_flush
[junit4:junit4]   2> 2147 T1506 oasc.SolrCore.registerSearcher [collection1] Registered new searcher Searcher@73cd5a main{StandardDirectoryReader(segments_2:5:nrt _0(4.2):C5 _1(4.2):C1)}
[junit4:junit4]   2> 2147 T1506 oasc.CachingDirectoryFactory.close Releasing directory:/mnt/ssd/jenkins/workspace/Lucene-Solr-4.x-Linux/solr/build/solr-core/test/J1/./solrtest-SoftAutoCommitTest-1360539499790/index
[junit4:junit4]   2> 2147 T1501 C84 UPDATE [collection1] webapp=null path=null params={} {commit=} 0 8
[junit4:junit4]   2> 2152 T1501 C84 UPDATE [collection1] webapp=null path=null params={} {delete=[529]} 0 0
[junit4:junit4]   2> 2652 T1508 oasu.DirectUpdateHandler2.commit start commit{,optimize=false,openSearcher=true,waitSearcher=true,expungeDeletes=false,softCommit=true}
[junit4:junit4]   2> 2653 T1508 oasc.CachingDirectoryFactory.close Releasing directory:/mnt/ssd/jenkins/workspace/Lucene-Solr-4.x-Linux/solr/build/solr-core/test/J1/./solrtest-SoftAutoCommitTest-1360539499790
[junit4:junit4]   2> 2655 T1508 oass.SolrIndexSearcher.<init> Opening Searcher@2216a4 main
[junit4:junit4]   2> 2655 T1508 oasu.DirectUpdateHandler2.commit end_commit_flush
[junit4:junit4]   2> 2656 T1506 oasc.SolrCore.registerSearcher [collection1] Registered new searcher Searcher@2216a4 main{StandardDirectoryReader(segments_2:7:nrt _0(4.2):C5)}
[junit4:junit4]   2> 2657 T1506 oasc.CachingDirectoryFactory.close Releasing directory:/mnt/ssd/jenkins/workspace/Lucene-Solr-4.x-Linux/solr/build/solr-core/test/J1/./solrtest-SoftAutoCommitTest-1360539499790/index
[junit4:junit4]   2> 2661 T1501 C84 UPDATE [collection1] webapp=null path=null params={} {add=[550]} 0 1
[junit4:junit4]   2> 3161 T1508 oasu.DirectUpdateHandler2.commit start commit{,optimize=false,openSearcher=true,waitSearcher=true,expungeDeletes=false,softCommit=true}
[junit4:junit4]   2> 3162 T1508 oasc.CachingDirectoryFactory.close Releasing directory:/mnt/ssd/jenkins/workspace/Lucene-Solr-4.x-Linux/solr/build/solr-core/test/J1/./solrtest-SoftAutoCommitTest-1360539499790
[junit4:junit4]   2> 3164 T1508 oass.SolrIndexSearcher.<init> Opening Searcher@10f64e1 main
[junit4:junit4]   2> 3165 T1508 oasu.DirectUpdateHandler2.commit end_commit_flush
[junit4:junit4]   2> 3166 T1506 oasc.SolrCore.registerSearcher [collection1] Registered new searcher Searcher@10f64e1 main{StandardDirectoryReader(segments_2:9:nrt _0(4.2):C5 _2(4.2):C1)}
[junit4:junit4]   2> 3167 T1506 oasc.CachingDirectoryFactory.close Releasing directory:/mnt/ssd/jenkins/workspace/Lucene-Solr-4.x-Linux/solr/build/solr-core/test/J1/./solrtest-SoftAutoCommitTest-1360539499790/index
[junit4:junit4]   2> 3352 T1507 oasu.DirectUpdateHandler2.commit start commit{,optimize=false,openSearcher=true,waitSearcher=true,expungeDeletes=false,softCommit=false}
[junit4:junit4]   2> 3353 T1507 oasc.SolrDeletionPolicy.onCommit SolrDeletionPolicy.onCommit: commits:num=2
[junit4:junit4]   2> 		commit{dir=RateLimitedDirectoryWrapper(MockDirWrapper(org.apache.lucene.store.RAMDirectory@1420e59 lockFactory=org.apache.lucene.store.NativeFSLockFactory@d6c47)),segFN=segments_2,generation=2,filenames=[_1_Direct_0.pos, _1_MockSep_0.frq, _1_Lucene41_0.doc, _1_Direct_0.doc, _0_MockSep_0.pos, _0_Lucene41_0.pos, _1.fnm, _0_MockSep_0.skp, _0_SimpleText_0.pst, _0.nvd, _1_Direct_0.tim, _0_MockSep_0.doc, _0.si, _0_Lucene41_0.tim, _1_Direct_0.tip, _0_Lucene41_0.tip, _1_MockSep_0.doc, _1_MockSep_0.pyl, _1.nvm, _1_MockSep_0.skp, _0.fnm, _1_MockSep_0.pos, _1_MockSep_0.tib, _1_Lucene41_0.tim, _1.nvd, _1_Lucene41_0.tip, _0.nvm, _1_MockSep_0.tii, _0_MockSep_0.tib, _1_Lucene41_0.pos, _1.fdx, _0_Direct_0.doc, _1.fdt, _0_Lucene41_0.doc, _1.si, _0_MockSep_0.frq, segments_2, _0_Direct_0.pos, _0.fdx, _0_Direct_0.tip, _0_MockSep_0.tii, _0_MockSep_0.pyl, _0_Direct_0.tim, _0.fdt, _1_SimpleText_0.pst]
[junit4:junit4]   2> 		commit{dir=RateLimitedDirectoryWrapper(MockDirWrapper(org.apache.lucene.store.RAMDirectory@1420e59 lockFactory=org.apache.lucene.store.NativeFSLockFactory@d6c47)),segFN=segments_3,generation=3,filenames=[_2.si, _2_Lucene41_0.pos, _2_Direct_0.tip, _2_Lucene41_0.tim, _2_Direct_0.tim, _2_SimpleText_0.pst, _0_MockSep_0.pos, _0_Lucene41_0.pos, _2_MockSep_0.skp, _2_Direct_0.pos, _2_Lucene41_0.tip, _2_MockSep_0.doc, _0_MockSep_0.skp, _0_SimpleText_0.pst, _0.nvd, _0_MockSep_0.doc, _0.si, _0_Lucene41_0.tim, _0_Lucene41_0.tip, _2_Direct_0.doc, _0.fnm, _2.fdt, _2_MockSep_0.frq, _2_Lucene41_0.doc, _2_MockSep_0.tii, _2_MockSep_0.tib, _0.nvm, _2.fdx, _2.fnm, _0_MockSep_0.tib, _0_Direct_0.doc, _2_MockSep_0.pyl, _2.nvm, _0_Lucene41_0.doc, _2.nvd, _0_MockSep_0.frq, _0_Direct_0.pos, _0.fdx, _0_Direct_0.tip, _0_MockSep_0.tii, _2_MockSep_0.pos, _0_MockSep_0.pyl, _0_Direct_0.tim, segments_3, _0.fdt]
[junit4:junit4]   2> 3354 T1507 oasc.SolrDeletionPolicy.updateCommits newest commit = 3[_2.si, _2_Lucene41_0.pos, _2_Direct_0.tip, _2_Lucene41_0.tim, _2_Direct_0.tim, _2_SimpleText_0.pst, _0_MockSep_0.pos, _0_Lucene41_0.pos, _2_MockSep_0.skp, _2_Direct_0.pos, _2_Lucene41_0.tip, _2_MockSep_0.doc, _0_MockSep_0.skp, _0_SimpleText_0.pst, _0.nvd, _0_MockSep_0.doc, _0.si, _0_Lucene41_0.tim, _0_Lucene41_0.tip, _2_Direct_0.doc, _0.fnm, _2.fdt, _2_MockSep_0.frq, _2_Lucene41_0.doc, _2_MockSep_0.tii, _2_MockSep_0.tib, _0.nvm, _2.fdx, _2.fnm, _0_MockSep_0.tib, _0_Direct_0.doc, _2_MockSep_0.pyl, _2.nvm, _0_Lucene41_0.doc, _2.nvd, _0_MockSep_0.frq, _0_Direct_0.pos, _0.fdx, _0_Direct_0.tip, _0_MockSep_0.tii, _2_MockSep_0.pos, _0_MockSep_0.pyl, _0_Direct_0.tim, segments_3, _0.fdt]
[junit4:junit4]   2> 3354 T1507 oasc.CachingDirectoryFactory.close Releasing directory:/mnt/ssd/jenkins/workspace/Lucene-Solr-4.x-Linux/solr/build/solr-core/test/J1/./solrtest-SoftAutoCommitTest-1360539499790
[junit4:junit4]   2> 3354 T1507 oass.SolrIndexSearcher.<init> Opening Searcher@3b28d5 main
[junit4:junit4]   2> 3354 T1507 oasu.DirectUpdateHandler2.commit end_commit_flush
[junit4:junit4]   2> 3356 T1506 oasc.SolrCore.registerSearcher [collection1] Registered new searcher Searcher@3b28d5 main{StandardDirectoryReader(segments_2:9:nrt _0(4.2):C5 _2(4.2):C1)}
[junit4:junit4]   2> 3356 T1506 oasc.CachingDirectoryFactory.close Releasing directory:/mnt/ssd/jenkins/workspace/Lucene-Solr-4.x-Linux/solr/build/solr-core/test/J1/./solrtest-SoftAutoCommitTest-1360539499790/index
[junit4:junit4]   2> 5354 T1501 oas.SolrTestCaseJ4.tearDown ###Ending testSoftAndHardCommitMaxTimeDelete
[junit4:junit4]   2> 5358 T1501 oas.SolrTestCaseJ4.setUp ###Starting testSoftAndHardCommitMaxTimeMixedAdds
[junit4:junit4]   2> 5359 T1501 oasc.CoreContainer.reload Reloading SolrCore 'collection1' using instanceDir: /mnt/ssd/jenkins/workspace/Lucene-Solr-4.x-Linux/solr/build/solr-core/test-files/solr/collection1
[junit4:junit4]   2> 5359 T1501 oasc.SolrResourceLoader.<init> new SolrResourceLoader for directory: '/mnt/ssd/jenkins/workspace/Lucene-Solr-4.x-Linux/solr/build/solr-core/test-files/solr/collection1/'
[junit4:junit4]   2> 5359 T1501 oasc.SolrResourceLoader.replaceClassLoader Adding 'file:/mnt/ssd/jenkins/workspace/Lucene-Solr-4.x-Linux/solr/build/solr-core/test-files/solr/collection1/lib/README' to classloader
[junit4:junit4]   2> 5360 T1501 oasc.SolrResourceLoader.replaceClassLoader Adding 'file:/mnt/ssd/jenkins/workspace/Lucene-Solr-4.x-Linux/solr/build/solr-core/test-files/solr/collection1/lib/classes/' to classloader
[junit4:junit4]   2> 5386 T1501 oasc.SolrConfig.<init> Using Lucene MatchVersion: LUCENE_42
[junit4:junit4]   2> 5425 T1501 oasc.SolrConfig.<init> Loaded SolrConfig: solrconfig.xml
[junit4:junit4]   2> 5426 T1501 oass.IndexSchema.readSchema Reading Solr Schema
[junit4:junit4]   2> 5430 T1501 oass.IndexSchema.readSchema Schema name=test
[junit4:junit4]   2> 5634 T3 oasu.ConcurrentLRUCache.finalize SEVERE ConcurrentLRUCache was not destroyed prior to finalize(), indicates a bug -- POSSIBLE RESOURCE LEAK!!!
[junit4:junit4]   2> 5635 T3 oasu.ConcurrentLRUCache.finalize SEVERE ConcurrentLRUCache was not destroyed prior to finalize(), indicates a bug -- POSSIBLE RESOURCE LEAK!!!
[junit4:junit4]   2> 5750 T1501 oass.OpenExchangeRatesOrgProvider.init Initialized with rates=open-exchange-rates.json, refreshInterval=1440.
[junit4:junit4]   2> 5755 T1501 oass.IndexSchema.readSchema default search field in schema is text
[junit4:junit4]   2> 5757 T1501 oass.IndexSchema.readSchema unique key field: id
[junit4:junit4]   2> 5761 T1501 oass.FileExchangeRateProvider.reload Reloading exchange rates from file currency.xml
[junit4:junit4]   2> 5764 T1501 oass.FileExchangeRateProvider.reload Reloading exchange rates from file currency.xml
[junit4:junit4]   2> 5766 T1501 oass.OpenExchangeRatesOrgProvider.reload Reloading exchange rates from open-exchange-rates.json
[junit4:junit4]   2> 5766 T1501 oass.OpenExchangeRatesOrgProvider.reload Reloading exchange rates from open-exchange-rates.json
[junit4:junit4]   2> 5767 T1501 oasc.SolrCore.<init> [collection1] Opening new SolrCore at /mnt/ssd/jenkins/workspace/Lucene-Solr-4.x-Linux/solr/build/solr-core/test-files/solr/collection1/, dataDir=/mnt/ssd/jenkins/workspace/Lucene-Solr-4.x-Linux/solr/build/solr-core/test/J1/./solrtest-SoftAutoCommitTest-1360539499790/
[junit4:junit4]   2> 5767 T1501 oasc.JmxMonitoredMap.<init> JMX monitoring is enabled. Adding Solr mbeans to JMX Server: com.sun.jmx.mbeanserver.JmxMBeanServer@26965c
[junit4:junit4]   2> 5768 T1501 oasc.CachingDirectoryFactory.close Releasing directory:/mnt/ssd/jenkins/workspace/Lucene-Solr-4.x-Linux/solr/build/solr-core/test/J1/./solrtest-SoftAutoCommitTest-1360539499790
[junit4:junit4]   2> 5768 T1501 oasc.SolrCore.getNewIndexDir New index directory detected: old=null new=/mnt/ssd/jenkins/workspace/Lucene-Solr-4.x-Linux/solr/build/solr-core/test/J1/./solrtest-SoftAutoCommitTest-1360539499790/index/
[junit4:junit4]   2> 5768 T1501 oasc.SolrCore.initWriters created xml: solr.XMLResponseWriter
[junit4:junit4]   2> 5770 T1501 oasup.UpdateRequestProcessorChain.init inserting DistributedUpdateProcessorFactory into updateRequestProcessorChain "dedupe"
[junit4:junit4]   2> 5770 T1501 oasup.UpdateRequestProcessorChain.init inserting DistributedUpdateProcessorFactory into updateRequestProcessorChain "dedupe-allfields"
[junit4:junit4]   2> 5770 T1501 oasup.UpdateRequestProcessorChain.init inserting DistributedUpdateProcessorFactory into updateRequestProcessorChain "stored_sig"
[junit4:junit4]   2> 5771 T1501 oasup.UpdateRequestProcessorChain.init inserting DistributedUpdateProcessorFactory into updateRequestProcessorChain "uniq-fields"
[junit4:junit4]   2> 5771 T1501 oasup.UpdateRequestProcessorChain.init inserting DistributedUpdateProcessorFactory into updateRequestProcessorChain "distrib-dup-test-chain-implicit"
[junit4:junit4]   2> 5771 T1501 oasc.RequestHandlers.initHandlersFromConfig adding lazy requestHandler: solr.ReplicationHandler
[junit4:junit4]   2> 5772 T1501 oasc.RequestHandlers.initHandlersFromConfig created /replication: solr.ReplicationHandler
[junit4:junit4]   2> 5772 T1501 oasc.RequestHandlers.initHandlersFromConfig created standard: solr.StandardRequestHandler
[junit4:junit4]   2> 5773 T1501 oasc.RequestHandlers.initHandlersFromConfig created /get: solr.RealTimeGetHandler
[junit4:junit4]   2> 5773 T1501 oasc.RequestHandlers.initHandlersFromConfig created dismax: solr.SearchHandler
[junit4:junit4]   2> 5774 T1501 oasc.RequestHandlers.initHandlersFromConfig created mock: org.apache.solr.core.MockQuerySenderListenerReqHandler
[junit4:junit4]   2> 5774 T1501 oasc.RequestHandlers.initHandlersFromConfig created /admin/: org.apache.solr.handler.admin.AdminHandlers
[junit4:junit4]   2> 5775 T1501 oasc.RequestHandlers.initHandlersFromConfig created defaults: solr.StandardRequestHandler
[junit4:junit4]   2> 5775 T1501 oasc.RequestHandlers.initHandlersFromConfig adding lazy requestHandler: solr.StandardRequestHandler
[junit4:junit4]   2> 5775 T1501 oasc.RequestHandlers.initHandlersFromConfig created lazy: solr.StandardRequestHandler
[junit4:junit4]   2> 5776 T1501 oasc.RequestHandlers.initHandlersFromConfig created /update: solr.UpdateRequestHandler
[junit4:junit4]   2> 5776 T1501 oasc.RequestHandlers.initHandlersFromConfig created /terms: org.apache.solr.handler.component.SearchHandler
[junit4:junit4]   2> 5777 T1501 oasc.RequestHandlers.initHandlersFromConfig created spellCheckCompRH: org.apache.solr.handler.component.SearchHandler
[junit4:junit4]   2> 5777 T1501 oasc.RequestHandlers.initHandlersFromConfig created spellCheckCompRH_Direct: org.apache.solr.handler.component.SearchHandler
[junit4:junit4]   2> 5778 T1501 oasc.RequestHandlers.initHandlersFromConfig created spellCheckWithWordbreak: org.apache.solr.handler.component.SearchHandler
[junit4:junit4]   2> 5778 T1501 oasc.RequestHandlers.initHandlersFromConfig created spellCheckWithWordbreak_Direct: org.apache.solr.handler.component.SearchHandler
[junit4:junit4]   2> 5779 T1501 oasc.RequestHandlers.initHandlersFromConfig created spellCheckCompRH1: org.apache.solr.handler.component.SearchHandler
[junit4:junit4]   2> 5779 T1501 oasc.RequestHandlers.initHandlersFromConfig created mltrh: org.apache.solr.handler.component.SearchHandler
[junit4:junit4]   2> 5779 T1501 oasc.RequestHandlers.initHandlersFromConfig created tvrh: org.apache.solr.handler.component.SearchHandler
[junit4:junit4]   2> 5780 T1501 oasc.RequestHandlers.initHandlersFromConfig created /mlt: solr.MoreLikeThisHandler
[junit4:junit4]   2> 5780 T1501 oasc.RequestHandlers.initHandlersFromConfig created /debug/dump: solr.DumpRequestHandler
[junit4:junit4]   2> 5782 T1501 oashl.XMLLoader.init xsltCacheLifetimeSeconds=60
[junit4:junit4]   2> 5783 T1501 oasc.SolrCore.initDeprecatedSupport WARNING solrconfig.xml uses deprecated <admin/gettableFiles>, Please update your config to use the ShowFileRequestHandler.
[junit4:junit4]   2> 5784 T1501 oasc.SolrCore.initDeprecatedSupport WARNING adding ShowFileRequestHandler with hidden files: [THROW.ERROR.ON.ADD.UPDATEPROCESSOR.JS, SOLRCONFIG-HIGHLIGHT.XML, SCHEMA-REQUIRED-FIELDS.XML, SCHEMA-REPLICATION2.XML, TRIVIAL.UPDATEPROCESSOR1.JS, BAD-SCHEMA-DUP-DYNAMICFIELD.XML, SCHEMA-MINIMAL.XML, SOLRCONFIG-CACHING.XML, SCHEMA-POSTINGSHIGHLIGHT.XML, SOLRCONFIG-REPEATER.XML, REGEX-BOOST-PROCESSOR-TEST.TXT, BAD-SCHEMA-NONTEXT-ANALYZER.XML, CURRENCY.XML, SOLRCONFIG-MERGEPOLICY.XML, SOLRCONFIG-TLOG.XML, SOLRCONFIG-MASTER.XML, SOLRCONFIG-COMPONENTS-NAME.XML, BAD-SCHEMA-UNIQUEKEY-MULTIVALUED.XML, SCHEMA11.XML, SOLRCONFIG-BASIC.XML, DA_COMPOUNDDICTIONARY.TXT, MISSLEADING.EXTENSION.UPDATEPROCESSOR.JS.TXT, SCHEMA-COPYFIELD-TEST.XML, SOLRCONFIG-SLAVE.XML, ELEVATE.XML, SOLRCONFIG-PROPINJECT-INDEXDEFAULT.XML, TRIVIAL.UPDATEPROCESSOR0.JS, BAD-SOLRCONFIG-BOGUS-SCRIPTENGINE-NAME.XML, SCHEMA-CHARFILTERS.XML, SCHEMA-IB.XML, SOLRCONFIG-QUERYSENDER.XML, SCHEMA-REPLICATION1.XML, SOLRCONFIG-SNIPPET-PROCESSOR.XML, DA_UTF8.XML, CONDITIONAL.UPDATEPROCESSOR.JS, MISSING.FUNCTIONS.UPDATEPROCESSOR.JS, HYPHENATION.DTD, SOLRCONFIG-ENABLEPLUGIN.XML, SCHEMA-PHRASESUGGEST.XML, STEMDICT.TXT, HUNSPELL-TEST.AFF, SCHEMA-SNIPPET-TYPE.XML, STOPTYPES-1.TXT, STOPWORDSWRONGENCODING.TXT, SCHEMA-NUMERIC.XML, SOLRCONFIG-TRANSFORMERS.XML, SOLRCONFIG-PROPINJECT.XML, BAD-SCHEMA-NOT-INDEXED-BUT-TF.XML, SOLRCONFIG-SIMPLELOCK.XML, WDFTYPES.TXT, SCHEMA-REVERSED.XML, STOPTYPES-2.TXT, BAD-SCHEMA-CURRENCY-FT-MULTIVALUED.XML, SOLRCONFIG-SPELLCHECKCOMPONENT.XML, BAD-SCHEMA-CURRENCY-MULTIVALUED.XML, SOLRCONFIG-PHRASESUGGEST.XML, SCHEMA-DFR.XML, BAD-SCHEMA-NOT-INDEXED-BUT-POS.XML, KEEP-1.TXT, OPEN-EXCHANGE-RATES.JSON, SCHEMA-SPATIAL.XML, STOPWITHBOM.TXT, SCHEMA-BINARYFIELD.XML, SOLRCONFIG-POSTINGSHIGHLIGHT.XML, SOLRCONFIG-SPELLCHECKER.XML, SOLRCONFIG-UPDATE-PROCESSOR-CHAINS.XML, BAD-SCHEMA-OMIT-TF-BUT-NOT-POS.XML, BAD-SCHEMA-DUP-FIELDTYPE.XML, SCHEMA-XINCLUDE.XML, SOLRCONFIG-MASTER1.XML, SCHEMA-BEHAVIOR.XML, SYNONYMS.TXT, BAD-SCHEMA-CURRENCY-DYNAMIC-MULTIVALUED.XML, SCHEMA_CODEC.XML, SCHEMA.XML, SOLRCONFIG-SOLR-749.XML, SOLRCONFIG-MASTER1-KEEPONEBACKUP.XML, SCHEMA-EFF.XML, SOLRCONFIG-FUNCTIONQUERY.XML, STOP-2.TXT, SCHEMA-LMDIRICHLET.XML, SOLRCONFIG-TERMINDEX.XML, SOLRCONFIG-ELEVATE.XML, SCHEMA-FOLDING.XML, STOPWORDS.TXT, SCHEMA-STOP-KEEP.XML, FUZZYSUGGEST.TXT, BAD-SCHEMA-NOT-INDEXED-BUT-NORMS.XML, SOLRCONFIG-SOLCOREPROPERTIES.XML, STOP-1.TXT, SOLRCONFIG-MASTER2.XML, SCHEMA-SPELLCHECKER.XML, SOLRCONFIG-RESPONSE-LOG-COMPONENT.XML, SOLRCONFIG-LAZYWRITER.XML, SCHEMA-LUCENEMATCHVERSION.XML, FRENCHARTICLES.TXT, BAD-MP-SOLRCONFIG.XML, SCHEMA15.XML, SOLRCONFIG-REQHANDLER.INCL, SCHEMASURROUND.XML, SCHEMA-COLLATEFILTER.XML, SOLRCONFIG-MASTER3.XML, HUNSPELL-TEST.DIC, SOLRCONFIG-XINCLUDE.XML, BAD-SCHEMA-CODEC-GLOBAL-VS-FT-MISMATCH.XML, SOLRCONFIG-SLAVE1.XML, SOLRCONFIG-DELPOLICY1.XML, SCHEMA-SIM.XML, SCHEMA-SNIPPET-FIELD.XML, SCHEMA-COLLATE.XML, STOP-SNOWBALL.TXT, BAD-SCHEMA-SIM-GLOBAL-VS-FT-MISMATCH.XML, PROTWORDS.TXT, SCHEMA-TRIE.XML, SOLRCONFIG_CODEC.XML, SCHEMA-SYNONYM-TOKENIZER.XML, BAD-SOLRCONFIG-INVALID-SCRIPTFILE.XML, JASUGGEST.TXT, SCHEMA-TFIDF.XML, SOLRCONFIG-SCRIPT-UPDATEPROCESSOR.XML, SCHEMA-LMJELINEKMERCER.XML, PHRASESUGGEST.TXT, BAD-SOLRCONFIG-MISSING-SCRIPTFILE.XML, SOLRCONFIG-BASIC-LUCENEVERSION31.XML, BAD-SCHEMA-UNIQUEKEY-USES-DEFAULT.XML, OLD_SYNONYMS.TXT, SOLRCONFIG-DELPOLICY2.XML, XSLT, SOLRCONFIG-NATIVELOCK.XML, BAD-SCHEMA-DUP-FIELD.XML, SOLRCONFIG-NOCACHE.XML, SCHEMA-BM25.XML, ADDFIELDS.UPDATEPROCESSOR.JS, SOLRCONFIG-ALTDIRECTORY.XML, SOLRCONFIG-QUERYSENDER-NOQUERY.XML, COMPOUNDDICTIONARY.TXT, SOLRCONFIG_PERF.XML, SOLRCONFIG-INDEXCONFIG.XML, BAD-SCHEMA-ANALYZER-CLASS-AND-NESTED.XML, SCHEMA-NOT-REQUIRED-UNIQUE-KEY.XML, KEEP-2.TXT, BAD-SCHEMA-UNIQUEKEY-IS-COPYFIELD-DEST.XML, SCHEMA12.XML, MAPPING-ISOLATIN1ACCENT.TXT, BAD_SOLRCONFIG.XML, BAD-SCHEMA-EXTERNAL-FILEFIELD.XML]
[junit4:junit4]   2> 5786 T1501 oasc.CachingDirectoryFactory.close Releasing directory:/mnt/ssd/jenkins/workspace/Lucene-Solr-4.x-Linux/solr/build/solr-core/test/J1/./solrtest-SoftAutoCommitTest-1360539499790
[junit4:junit4]   2> 5786 T1501 oass.SolrIndexSearcher.<init> Opening Searcher@1811528 main
[junit4:junit4]   2> 5786 T1501 oasu.CommitTracker.<init> Hard AutoCommit: disabled
[junit4:junit4]   2> 5787 T1501 oasu.CommitTracker.<init> Soft AutoCommit: disabled
[junit4:junit4]   2> 5787 T1501 oashc.SpellCheckComponent.inform Initializing spell checkers
[junit4:junit4]   2> 5788 T1501 oass.DirectSolrSpellChecker.init init: {name=direct,classname=DirectSolrSpellChecker,field=lowerfilt,minQueryLength=3}
[junit4:junit4]   2> 5795 T1509 oasc.SolrCore.registerSearcher [collection1] Registered new searcher Searcher@1811528 main{StandardDirectoryReader(segments_3:9:nrt _0(4.2):C5 _2(4.2):C1)}
[junit4:junit4]   2> 5798 T1501 oasc.CoreContainer.registerCore replacing core: collection1
[junit4:junit4]   2> 5799 T1501 oasc.SolrCore.close [collection1]  CLOSING SolrCore org.apache.solr.core.SolrCore@17d4074
[junit4:junit4]   2> 5802 T1501 oasu.DirectUpdateHandler2.close closing DirectUpdateHandler2{commits=4,autocommit maxTime=1200ms,autocommits=1,soft autocommit maxTime=500ms,soft autocommits=2,optimizes=0,rollbacks=0,expungeDeletes=0,docsPending=0,adds=0,deletesById=0,deletesByQuery=0,errors=0,cumulative_adds=2,cumulative_deletesById=1,cumulative_deletesByQuery=0,cumulative_errors=0}
[junit4:junit4]   2> 5803 T1501 oasc.SolrCore.closeSearcher [collection1] Closing main searcher on request.
[junit4:junit4]   2> 5803 T1501 oasc.CachingDirectoryFactory.close Releasing directory:/mnt/ssd/jenkins/workspace/Lucene-Solr-4.x-Linux/solr/build/solr-core/test/J1/./solrtest-SoftAutoCommitTest-1360539499790/index
[junit4:junit4]   2> ASYNC  NEW_CORE C85 name=collection1 org.apache.solr.core.SolrCore@13d8164
[junit4:junit4]   2> 5808 T1501 C85 UPDATE [collection1] webapp=null path=null params={} {add=[529]} 0 1
[junit4:junit4]   2> 6308 T1511 oasu.DirectUpdateHandler2.commit start commit{,optimize=false,openSearcher=true,waitSearcher=true,expungeDeletes=false,softCommit=true}
[junit4:junit4]   2> 6308 T1511 oasc.CachingDirectoryFactory.close Releasing directory:/mnt/ssd/jenkins/workspace/Lucene-Solr-4.x-Linux/solr/build/solr-core/test/J1/./solrtest-SoftAutoCommitTest-1360539499790
[junit4:junit4]   2> 6311 T1511 oass.SolrIndexSearcher.<init> Opening Searcher@1be8ea1 main
[junit4:junit4]   2> 6311 T1511 oasu.DirectUpdateHandler2.commit end_commit_flush
[junit4:junit4]   2> 6312 T1509 oasc.SolrCore.registerSearcher [collection1] Registered new searcher Searcher@1be8ea1 main{StandardDirectoryReader(segments_3:11:nrt _0(4.2):C5 _2(4.2):C1 _3(4.2):C1)}
[junit4:junit4]   2> 6312 T1509 oasc.CachingDirectoryFactory.close Releasing directory:/mnt/ssd/jenkins/workspace/Lucene-Solr-4.x-Linux/solr/build/solr-core/test/J1/./solrtest-SoftAutoCommitTest-1360539499790/index
[junit4:junit4]   2> 6315 T1501 C85 UPDATE [collection1] webapp=null path=null params={} {add=[530]} 0 1
[junit4:junit4]   2> 6815 T1511 oasu.DirectUpdateHandler2.commit start commit{,optimize=false,openSearcher=true,waitSearcher=true,expungeDeletes=false,softCommit=true}
[junit4:junit4]   2> 6815 T1511 oasc.CachingDirectoryFactory.close Releasing directory:/mnt/ssd/jenkins/workspace/Lucene-Solr-4.x-Linux/solr/build/solr-core/test/J1/./solrtest-SoftAutoCommitTest-1360539499790
[junit4:junit4]   2> 6818 T1511 oass.SolrIndexSearcher.<init> Opening Searcher@35b075 main
[junit4:junit4]   2> 6818 T1511 oasu.DirectUpdateHandler2.commit end_commit_flush
[junit4:junit4]   2> 6819 T1509 oasc.SolrCore.registerSearcher [collection1] Registered new searcher Searcher@35b075 main{StandardDirectoryReader(segments_3:13:nrt _0(4.2):C5 _2(4.2):C1 _3(4.2):C1 _4(4.2):C1)}
[junit4:junit4]   2> 6819 T1509 oasc.CachingDirectoryFactory.close Releasing directory:/mnt/ssd/jenkins/workspace/Lucene-Solr-4.x-Linux/solr/build/solr-core/test/J1/./solrtest-SoftAutoCommitTest-1360539499790/index
[junit4:junit4]   2> 7008 T1510 oasu.DirectUpdateHandler2.commit start commit{,optimize=false,openSearcher=true,waitSearcher=true,expungeDeletes=false,softCommit=false}
[junit4:junit4]   2> 7008 T1510 oasc.SolrDeletionPolicy.onCommit SolrDeletionPolicy.onCommit: commits:num=2
[junit4:junit4]   2> 		commit{dir=RateLimitedDirectoryWrapper(MockDirWrapper(org.apache.lucene.store.RAMDirectory@1420e59 lockFactory=org.apache.lucene.store.NativeFSLockFactory@d6c47)),segFN=segments_3,generation=3,filenames=[_2.si, _2_Lucene41_0.pos, _2_Direct_0.tip, _2_Lucene41_0.tim, _2_Direct_0.tim, _2_SimpleText_0.pst, _0_MockSep_0.pos, _0_Lucene41_0.pos, _2_MockSep_0.skp, _2_Direct_0.pos, _2_Lucene41_0.tip, _2_MockSep_0.doc, _0_MockSep_0.skp, _0_SimpleText_0.pst, _0.nvd, _0_MockSep_0.doc, _0.si, _0_Lucene41_0.tim, _0_Lucene41_0.tip, _2_Direct_0.doc, _0.fnm, _2.fdt, _2_MockSep_0.frq, _2_Lucene41_0.doc, _2_MockSep_0.tii, _2_MockSep_0.tib, _0.nvm, _2.fdx, _2.fnm, _0_MockSep_0.tib, _0_Direct_0.doc, _2_MockSep_0.pyl, _2.nvm, _0_Lucene41_0.doc, _2.nvd, _0_MockSep_0.frq, _0_Direct_0.pos, _0.fdx, _0_Direct_0.tip, _0_MockSep_0.tii, _2_MockSep_0.pos, _0_MockSep_0.pyl, _0_Direct_0.tim, segments_3, _0.fdt]
[junit4:junit4]   2> 		commit{dir=RateLimitedDirectoryWrapper(MockDirWrapper(org.apache.lucene.store.RAMDirectory@1420e59 lockFactory=org.apache.lucene.store.NativeFSLockFactory@d6c47)),segFN=segments_4,generation=4,filenames=[_2_Direct_0.tip, _2_Lucene41_0.pos, _3_MockSep_0.doc, _2_Direct_0.tim, _2_Lucene41_0.tim, _2_SimpleText_0.pst, _4_Lucene41_0.doc, _0_MockSep_0.pos, _4_MockSep_0.tib, _0_Lucene41_0.pos, _4_MockSep_0.skp, _4.fnm, _3.fdt, _3_MockSep_0.frq, _2_Lucene41_0.tip, _2_MockSep_0.doc, _4.fdx, _3.nvd, _3_Lucene41_0.pos, _0_MockSep_0.skp, _3_SimpleText_0.pst, _3_MockSep_0.tib, _0_SimpleText_0.pst, _4_MockSep_0.doc, _4_Lucene41_0.pos, _4_Direct_0.pos, _3.nvm, _0_Lucene41_0.tim, _0_Lucene41_0.tip, _2_Direct_0.doc, _3_Direct_0.tip, _0.fnm, _4_MockSep_0.pos, _4_Direct_0.tim, _2.fdt, _2_MockSep_0.tii, _2_Lucene41_0.doc, _3_MockSep_0.tii, _2_MockSep_0.tib, _4_Lucene41_0.tip, _2.fdx, _4_Lucene41_0.tim, _0_Direct_0.doc, _2.nvm, _3_Lucene41_0.doc, _4_MockSep_0.pyl, _3_MockSep_0.pos, _0_Lucene41_0.doc, _2.nvd, _4_Direct_0.tip, _3.si, _2_MockSep_0.pos, _4_MockSep_0.tii, _3_Direct_0.tim, _2.si, _3_Direct_0.doc, _2_MockSep_0.skp, _2_Direct_0.pos, _3.fnm, _3_MockSep_0.pyl, _3_Lucene41_0.tip, _0.nvd, _3_Lucene41_0.tim, _0.si, _0_MockSep_0.doc, _2_MockSep_0.frq, _4.si, _4.fdt, _4_Direct_0.doc, _0.nvm, _2.fnm, _3.fdx, _0_MockSep_0.tib, _4_SimpleText_0.pst, _4.nvd, _2_MockSep_0.pyl, _4_MockSep_0.frq, _0_Direct_0.pos, _0_MockSep_0.frq, _0_Direct_0.tip, _0.fdx, _3_Direct_0.pos, _3_MockSep_0.skp, _0_MockSep_0.tii, _0_MockSep_0.pyl, _4.nvm, _0_Direct_0.tim, _0.fdt, segments_4]
[junit4:junit4]   2> 7009 T1510 oasc.SolrDeletionPolicy.updateCommits newest commit = 4[_2_Direct_0.tip, _2_Lucene41_0.pos, _3_MockSep_0.doc, _2_Direct_0.tim, _2_Lucene41_0.tim, _2_SimpleText_0.pst, _4_Lucene41_0.doc, _0_MockSep_0.pos, _4_MockSep_0.tib, _0_Lucene41_0.pos, _4_MockSep_0.skp, _4.fnm, _3.fdt, _3_MockSep_0.frq, _2_Lucene41_0.tip, _2_MockSep_0.doc, _4.fdx, _3.nvd, _3_Lucene41_0.pos, _0_MockSep_0.skp, _3_SimpleText_0.pst, _3_MockSep_0.tib, _0_SimpleText_0.pst, _4_MockSep_0.doc, _4_Lucene41_0.pos, _4_Direct_0.pos, _3.nvm, _0_Lucene41_0.tim, _0_Lucene41_0.tip, _2_Direct_0.doc, _3_Direct_0.tip, _0.fnm, _4_MockSep_0.pos, _4_Direct_0.tim, _2.fdt, _2_MockSep_0.tii, _2_Lucene41_0.doc, _3_MockSep_0.tii, _2_MockSep_0.tib, _4_Lucene41_0.tip, _2.fdx, _4_Lucene41_0.tim, _0_Direct_0.doc, _2.nvm, _3_Lucene41_0.doc, _4_MockSep_0.pyl, _3_MockSep_0.pos, _0_Lucene41_0.doc, _2.nvd, _4_Direct_0.tip, _3.si, _2_MockSep_0.pos, _4_MockSep_0.tii, _3_Direct_0.tim, _2.si, _3_Direct_0.doc, _2_MockSep_0.skp, _2_Direct_0.pos, _3.fnm, _3_MockSep_0.pyl, _3_Lucene41_0.tip, _0.nvd, _3_Lucene41_0.tim, _0.si, _0_MockSep_0.doc, _2_MockSep_0.frq, _4.si, _4.fdt, _4_Direct_0.doc, _0.nvm, _2.fnm, _3.fdx, _0_MockSep_0.tib, _4_SimpleText_0.pst, _4.nvd, _2_MockSep_0.pyl, _4_MockSep_0.frq, _0_Direct_0.pos, _0_MockSep_0.frq, _0_Direct_0.tip, _0.fdx, _3_Direct_0.pos, _3_MockSep_0.skp, _0_MockSep_0.tii, _0_MockSep_0.pyl, _4.nvm, _0_Direct_0.tim, _0.fdt, segments_4]
[junit4:junit4]   2> 7010 T1510 oasc.CachingDirectoryFactory.close Releasing directory:/mnt/ssd/jenkins/workspace/Lucene-Solr-4.x-Linux/solr/build/solr-core/test/J1/./solrtest-SoftAutoCommitTest-1360539499790
[junit4:junit4]   2> 7010 T1510 oass.SolrIndexSearcher.<init> Opening Searcher@1279b7d main
[junit4:junit4]   2> 7010 T1510 oasu.DirectUpdateHandler2.commit end_commit_flush
[junit4:junit4]   2> 7011 T1509 oasc.SolrCore.registerSearcher [collection1] Registered new searcher Searcher@1279b7d main{StandardDirectoryReader(segments_3:13:nrt _0(4.2):C5 _2(4.2):C1 _3(4.2):C1 _4(4.2):C1)}
[junit4:junit4]   2> 7011 T1509 oasc.CachingDirectoryFactory.close Releasing directory:/mnt/ssd/jenkins/workspace/Lucene-Solr-4.x-Linux/solr/build/solr-core/test/J1/./solrtest-SoftAutoCommitTest-1360539499790/index
[junit4:junit4]   2> 10210 T1501 oas.SolrTestCaseJ4.tearDown ###Ending testSoftAndHardCommitMaxTimeMixedAdds
[junit4:junit4]   2> 10211 T1501 oas.SolrTestCaseJ4.deleteCore ###deleteCore
[junit4:junit4]   2> 10211 T1501 oasc.CoreContainer.shutdown Shutting down CoreContainer instance=28671002
[junit4:junit4]   2> 10212 T1501 oasc.SolrCore.close [collection1]  CLOSING SolrCore org.apache.solr.core.SolrCore@13d8164
[junit4:junit4]   2> 10218 T1501 oasu.DirectUpdateHandler2.close closing DirectUpdateHandler2{commits=3,autocommit maxTime=1200ms,autocommits=1,soft autocommit maxTime=500ms,soft autocommits=2,optimizes=0,rollbacks=0,expungeDeletes=0,docsPending=0,adds=0,deletesById=0,deletesByQuery=0,errors=0,cumulative_adds=2,cumulative_deletesById=0,cumulative_deletesByQuery=0,cumulative_errors=0}
[junit4:junit4]   2> 10219 T1501 oasc.SolrCore.decrefSolrCoreState Closing SolrCoreState
[junit4:junit4]   2> 10219 T1501 oasu.DefaultSolrCoreState.closeIndexWriter SolrCoreState ref count has reached 0 - closing IndexWriter
[junit4:junit4]   2> 10219 T1501 oasu.DefaultSolrCoreState.closeIndexWriter closing IndexWriter with IndexWriterCloser
[junit4:junit4]   2> 10220 T1501 C85 oasc.CachingDirectoryFactory.close Releasing directory:/mnt/ssd/jenkins/workspace/Lucene-Solr-4.x-Linux/solr/build/solr-core/test/J1/./solrtest-SoftAutoCommitTest-1360539499790/index
[junit4:junit4]   2> 10220 T1501 oasc.SolrCore.closeSearcher [collection1] Closing main searcher on request.
[junit4:junit4]   2> 10220 T1501 oasc.CachingDirectoryFactory.close Releasing directory:/mnt/ssd/jenkins/workspace/Lucene-Solr-4.x-Linux/solr/build/solr-core/test/J1/./solrtest-SoftAutoCommitTest-1360539499790/index
[junit4:junit4]   2> 130440 T1501 oasc.CachingDirectoryFactory.close SEVERE Timeout waiting for all directory ref counts to be released
[junit4:junit4]   2> 130441 T1501 oasc.SolrException.log SEVERE Error closing directory:java.lang.AssertionError: 1
[junit4:junit4]   2> 		at org.apache.solr.core.CachingDirectoryFactory.close(CachingDirectoryFactory.java:139)
[junit4:junit4]   2> 		at org.apache.solr.core.SolrCore.close(SolrCore.java:1011)
[junit4:junit4]   2> 		at org.apache.solr.core.CoreContainer.shutdown(CoreContainer.java:754)
[junit4:junit4]   2> 		at org.apache.solr.util.TestHarness.close(TestHarness.java:449)
[junit4:junit4]   2> 		at org.apache.solr.SolrTestCaseJ4.deleteCore(SolrTestCaseJ4.java:418)
[junit4:junit4]   2> 		at org.apache.solr.SolrTestCaseJ4.afterClass(SolrTestCaseJ4.java:95)
[junit4:junit4]   2> 		at sun.reflect.GeneratedMethodAccessor19.invoke(Unknown Source)
[junit4:junit4]   2> 		at sun.reflect.DelegatingMethodAccessorImpl.invoke(DelegatingMethodAccessorImpl.java:43)
[junit4:junit4]   2> 		at java.lang.reflect.Method.invoke(Method.java:601)
[junit4:junit4]   2> 		at com.carrotsearch.randomizedtesting.RandomizedRunner.invoke(RandomizedRunner.java:1559)
[junit4:junit4]   2> 		at com.carrotsearch.randomizedtesting.RandomizedRunner.access$600(RandomizedRunner.java:79)
[junit4:junit4]   2> 		at com.carrotsearch.randomizedtesting.RandomizedRunner$5.evaluate(RandomizedRunner.java:700)
[junit4:junit4]   2> 		at com.carrotsearch.randomizedtesting.rules.StatementAdapter.evaluate(StatementAdapter.java:36)
[junit4:junit4]   2> 		at com.carrotsearch.randomizedtesting.rules.SystemPropertiesRestoreRule$1.evaluate(SystemPropertiesRestoreRule.java:53)
[junit4:junit4]   2> 		at org.apache.lucene.util.AbstractBeforeAfterRule$1.evaluate(AbstractBeforeAfterRule.java:46)
[junit4:junit4]   2> 		at org.apache.lucene.util.TestRuleStoreClassName$1.evaluate(TestRuleStoreClassName.java:42)
[junit4:junit4]   2> 		at com.carrotsearch.randomizedtesting.rules.SystemPropertiesInvariantRule$1.evaluate(SystemPropertiesInvariantRule.java:55)
[junit4:junit4]   2> 		at com.carrotsearch.randomizedtesting.rules.NoShadowingOrOverridesOnMethodsRule$1.evaluate(NoShadowingOrOverridesOnMethodsRule.java:39)
[junit4:junit4]   2> 		at com.carrotsearch.randomizedtesting.rules.NoShadowingOrOverridesOnMethodsRule$1.evaluate(NoShadowingOrOverridesOnMethodsRule.java:39)
[junit4:junit4]   2> 		at com.carrotsearch.randomizedtesting.rules.StatementAdapter.evaluate(StatementAdapter.java:36)
[junit4:junit4]   2> 		at org.apache.lucene.util.TestRuleAssertionsRequired$1.evaluate(TestRuleAssertionsRequired.java:43)
[junit4:junit4]   2> 		at org.apache.lucene.util.TestRuleMarkFailure$1.evaluate(TestRuleMarkFailure.java:48)
[junit4:junit4]   2> 		at org.apache.lucene.util.TestRuleIgnoreAfterMaxFailures$1.evaluate(TestRuleIgnoreAfterMaxFailures.java:70)
[junit4:junit4]   2> 		at org.apache.lucene.util.TestRuleIgnoreTestSuites$1.evaluate(TestRuleIgnoreTestSuites.java:55)
[junit4:junit4]   2> 		at com.carrotsearch.randomizedtesting.rules.StatementAdapter.evaluate(StatementAdapter.java:36)
[junit4:junit4]   2> 		at com.carrotsearch.randomizedtesting.ThreadLeakControl$StatementRunner.run(ThreadLeakControl.java:358)
[junit4:junit4]   2> 		at java.lang.Thread.run(Thread.java:722)
[junit4:junit4]   2> 	
[junit4:junit4]   2> 130441 T1501 oasc.CachingDirectoryFactory.close Closing directory when closing factory:/mnt/ssd/jenkins/workspace/Lucene-Solr-4.x-Linux/solr/build/solr-core/test/J1/./solrtest-SoftAutoCommitTest-1360539499790
[junit4:junit4]   2> 130442 T1501 oasc.CachingDirectoryFactory.closeDirectory Closing directory:/mnt/ssd/jenkins/workspace/Lucene-Solr-4.x-Linux/solr/build/solr-core/test/J1/./solrtest-SoftAutoCommitTest-1360539499790
[junit4:junit4]   2> 251456 T1501 oas.SolrTestCaseJ4.endTrackingSearchers SEVERE ERROR: SolrIndexSearcher opens=12 closes=11
[junit4:junit4]   2> NOTE: test params are: codec=Lucene42: {timestamp=PostingsFormat(name=SimpleText), range_facet_l=PostingsFormat(name=SimpleText), id=PostingsFormat(name=Direct), range_facet_sl=PostingsFormat(name=Direct), text=PostingsFormat(name=MockSep), range_facet_si=PostingsFormat(name=SimpleText), subject=PostingsFormat(name=SimpleText), multiDefault=PostingsFormat(name=SimpleText), intDefault=Lucene41(blocksize=128)}, docValues:{}, sim=RandomSimilarityProvider(queryNorm=false,coord=crazy): {}, locale=en_CA, timezone=Asia/Saigon
[junit4:junit4]   2> NOTE: Linux 3.2.0-37-generic i386/Oracle Corporation 1.7.0_10 (32-bit)/cpus=8,threads=1,free=162462080,total=315621376
[junit4:junit4]   2> NOTE: All tests run in this JVM: [ShowFileRequestHandlerTest, ReturnFieldsTest, TestPhraseSuggestions, DisMaxRequestHandlerTest, DebugComponentTest, ConvertedLegacyTest, TestCSVResponseWriter, SuggesterTSTTest, TestDocumentBuilder, TestJmxIntegration, EchoParamsTest, TestWriterPerf, FileUtilsTest, TestPropInject, XsltUpdateRequestHandlerTest, TestRemoteStreaming, TestDFRSimilarityFactory, PolyFieldTest, BasicDistributedZk2Test, StatelessScriptUpdateProcessorFactoryTest, TestDistributedSearch, PeerSyncTest, ZkNodePropsTest, TestSolrJ, XmlUpdateRequestHandlerTest, DirectUpdateHandlerTest, DistributedQueryElevationComponentTest, UpdateParamsTest, TestPluginEnable, TestSolrDeletionPolicy1, LukeRequestHandlerTest, RecoveryZkTest, HardAutoCommitTest, DocumentAnalysisRequestHandlerTest, TestCharFilters, TestUpdate, BadIndexSchemaTest, TestLazyCores, TestZkChroot, TestQuerySenderListener, IndexSchemaRuntimeFieldTest, OpenExchangeRatesOrgProviderTest, ShardRoutingTest, TestStressLucene, QueryParsingTest, DirectSolrSpellCheckerTest, SchemaVersionSpecificBehaviorTest, TestDistributedGrouping, TestSolrCoreProperties, OutputWriterTest, PrimitiveFieldTypeTest, PathHierarchyTokenizerFactoryTest, TestComponentsName, TestLRUCache, RequiredFieldsTest, PrimUtilsTest, PingRequestHandlerTest, TestQueryUtils, DOMUtilTest, SoftAutoCommitTest]
[junit4:junit4]   2> NOTE: reproduce with: ant test  -Dtestcase=SoftAutoCommitTest -Dtests.seed=568D476B27F1595A -Dtests.multiplier=3 -Dtests.slow=true -Dtests.locale=en_CA -Dtests.timezone=Asia/Saigon -Dtests.file.encoding=US-ASCII
[junit4:junit4] ERROR   0.00s J1 | SoftAutoCommitTest (suite) <<<
[junit4:junit4]    > Throwable #1: java.lang.AssertionError: ERROR: SolrIndexSearcher opens=12 closes=11
[junit4:junit4]    > 	at __randomizedtesting.SeedInfo.seed([568D476B27F1595A]:0)
[junit4:junit4]    > 	at org.junit.Assert.fail(Assert.java:93)
[junit4:junit4]    > 	at org.apache.solr.SolrTestCaseJ4.endTrackingSearchers(SolrTestCaseJ4.java:246)
[junit4:junit4]    > 	at org.apache.solr.SolrTestCaseJ4.afterClass(SolrTestCaseJ4.java:97)
[junit4:junit4]    > 	at sun.reflect.GeneratedMethodAccessor19.invoke(Unknown Source)
[junit4:junit4]    > 	at sun.reflect.DelegatingMethodAccessorImpl.invoke(DelegatingMethodAccessorImpl.java:43)
[junit4:junit4]    > 	at java.lang.reflect.Method.invoke(Method.java:601)
[junit4:junit4]    > 	at com.carrotsearch.randomizedtesting.RandomizedRunner.invoke(RandomizedRunner.java:1559)
[junit4:junit4]    > 	at com.carrotsearch.randomizedtesting.RandomizedRunner.access$600(RandomizedRunner.java:79)
[junit4:junit4]    > 	at com.carrotsearch.randomizedtesting.RandomizedRunner$5.evaluate(RandomizedRunner.java:700)
[junit4:junit4]    > 	at com.carrotsearch.randomizedtesting.rules.StatementAdapter.evaluate(StatementAdapter.java:36)
[junit4:junit4]    > 	at com.carrotsearch.randomizedtesting.rules.SystemPropertiesRestoreRule$1.evaluate(SystemPropertiesRestoreRule.java:53)
[junit4:junit4]    > 	at org.apache.lucene.util.AbstractBeforeAfterRule$1.evaluate(AbstractBeforeAfterRule.java:46)
[junit4:junit4]    > 	at org.apache.lucene.util.TestRuleStoreClassName$1.evaluate(TestRuleStoreClassName.java:42)
[junit4:junit4]    > 	at com.carrotsearch.randomizedtesting.rules.SystemPropertiesInvariantRule$1.evaluate(SystemPropertiesInvariantRule.java:55)
[junit4:junit4]    > 	at com.carrotsearch.randomizedtesting.rules.NoShadowingOrOverridesOnMethodsRule$1.evaluate(NoShadowingOrOverridesOnMethodsRule.java:39)
[junit4:junit4]    > 	at com.carrotsearch.randomizedtesting.rules.NoShadowingOrOverridesOnMethodsRule$1.evaluate(NoShadowingOrOverridesOnMethodsRule.java:39)
[junit4:junit4]    > 	at com.carrotsearch.randomizedtesting.rules.StatementAdapter.evaluate(StatementAdapter.java:36)
[junit4:junit4]    > 	at org.apache.lucene.util.TestRuleAssertionsRequired$1.evaluate(TestRuleAssertionsRequired.java:43)
[junit4:junit4]    > 	at org.apache.lucene.util.TestRuleMarkFailure$1.evaluate(TestRuleMarkFailure.java:48)
[junit4:junit4]    > 	at org.apache.lucene.util.TestRuleIgnoreAfterMaxFailures$1.evaluate(TestRuleIgnoreAfterMaxFailures.java:70)
[junit4:junit4]    > 	at org.apache.lucene.util.TestRuleIgnoreTestSuites$1.evaluate(TestRuleIgnoreTestSuites.java:55)
[junit4:junit4]    > 	at com.carrotsearch.randomizedtesting.rules.StatementAdapter.evaluate(StatementAdapter.java:36)
[junit4:junit4]    > 	at com.carrotsearch.randomizedtesting.ThreadLeakControl$StatementRunner.run(ThreadLeakControl.java:358)
[junit4:junit4]    > 	at java.lang.Thread.run(Thread.java:722)
[junit4:junit4] Completed on J1 in 251.52s, 3 tests, 1 failure <<< FAILURES!

[...truncated 393 lines...]
BUILD FAILED
/mnt/ssd/jenkins/workspace/Lucene-Solr-4.x-Linux/build.xml:381: The following error occurred while executing this line:
/mnt/ssd/jenkins/workspace/Lucene-Solr-4.x-Linux/build.xml:361: The following error occurred while executing this line:
/mnt/ssd/jenkins/workspace/Lucene-Solr-4.x-Linux/build.xml:39: The following error occurred while executing this line:
/mnt/ssd/jenkins/workspace/Lucene-Solr-4.x-Linux/solr/build.xml:183: The following error occurred while executing this line:
/mnt/ssd/jenkins/workspace/Lucene-Solr-4.x-Linux/solr/common-build.xml:447: The following error occurred while executing this line:
/mnt/ssd/jenkins/workspace/Lucene-Solr-4.x-Linux/lucene/common-build.xml:1202: The following error occurred while executing this line:
/mnt/ssd/jenkins/workspace/Lucene-Solr-4.x-Linux/lucene/common-build.xml:865: There were test failures: 251 suites, 1043 tests, 1 suite-level error, 8 ignored (3 assumptions)

Total time: 37 minutes 1 second
Build step 'Invoke Ant' marked build as failure
Archiving artifacts
Recording test results
Description set: Java: 32bit/jdk1.7.0_10 -server -XX:+UseG1GC
Email was triggered for: Failure
Sending email for trigger: Failure



Mime
View raw message