lucene-dev mailing list archives

Site index · List index
Message view « Date » · « Thread »
Top « Date » · « Thread »
From Apache Jenkins Server <jenk...@builds.apache.org>
Subject [JENKINS] Lucene-Solr-Tests-trunk-Java6 - Build # 15911 - Still Failing
Date Mon, 11 Feb 2013 14:32:42 GMT
Build: https://builds.apache.org/job/Lucene-Solr-Tests-trunk-Java6/15911/

1 tests failed.
FAILED:  org.apache.solr.cloud.SyncSliceTest.testDistribSearch

Error Message:
Test Setup Failure: shard1 should have just been set up to be inconsistent - but it's still consistent. Leader:http://127.0.0.1:37341/collection1skip list:[org.apache.solr.cloud.AbstractFullDistribZkTestBase$CloudJettyRunner@e821fee8, org.apache.solr.cloud.AbstractFullDistribZkTestBase$CloudJettyRunner@2e15e4e4]

Stack Trace:
java.lang.AssertionError: Test Setup Failure: shard1 should have just been set up to be inconsistent - but it's still consistent. Leader:http://127.0.0.1:37341/collection1skip list:[org.apache.solr.cloud.AbstractFullDistribZkTestBase$CloudJettyRunner@e821fee8, org.apache.solr.cloud.AbstractFullDistribZkTestBase$CloudJettyRunner@2e15e4e4]
	at __randomizedtesting.SeedInfo.seed([C2856B9425F4DD49:4363E58C52ABBD75]:0)
	at org.junit.Assert.fail(Assert.java:93)
	at org.junit.Assert.assertTrue(Assert.java:43)
	at org.junit.Assert.assertNotNull(Assert.java:526)
	at org.apache.solr.cloud.SyncSliceTest.doTest(SyncSliceTest.java:216)
	at org.apache.solr.BaseDistributedSearchTestCase.testDistribSearch(BaseDistributedSearchTestCase.java:794)
	at sun.reflect.NativeMethodAccessorImpl.invoke0(Native Method)
	at sun.reflect.NativeMethodAccessorImpl.invoke(NativeMethodAccessorImpl.java:57)
	at sun.reflect.DelegatingMethodAccessorImpl.invoke(DelegatingMethodAccessorImpl.java:43)
	at java.lang.reflect.Method.invoke(Method.java:616)
	at com.carrotsearch.randomizedtesting.RandomizedRunner.invoke(RandomizedRunner.java:1559)
	at com.carrotsearch.randomizedtesting.RandomizedRunner.access$600(RandomizedRunner.java:79)
	at com.carrotsearch.randomizedtesting.RandomizedRunner$6.evaluate(RandomizedRunner.java:737)
	at com.carrotsearch.randomizedtesting.RandomizedRunner$7.evaluate(RandomizedRunner.java:773)
	at com.carrotsearch.randomizedtesting.RandomizedRunner$8.evaluate(RandomizedRunner.java:787)
	at com.carrotsearch.randomizedtesting.rules.SystemPropertiesRestoreRule$1.evaluate(SystemPropertiesRestoreRule.java:53)
	at org.apache.lucene.util.TestRuleSetupTeardownChained$1.evaluate(TestRuleSetupTeardownChained.java:50)
	at org.apache.lucene.util.TestRuleFieldCacheSanity$1.evaluate(TestRuleFieldCacheSanity.java:51)
	at org.apache.lucene.util.AbstractBeforeAfterRule$1.evaluate(AbstractBeforeAfterRule.java:46)
	at com.carrotsearch.randomizedtesting.rules.SystemPropertiesInvariantRule$1.evaluate(SystemPropertiesInvariantRule.java:55)
	at org.apache.lucene.util.TestRuleThreadAndTestName$1.evaluate(TestRuleThreadAndTestName.java:49)
	at org.apache.lucene.util.TestRuleIgnoreAfterMaxFailures$1.evaluate(TestRuleIgnoreAfterMaxFailures.java:70)
	at org.apache.lucene.util.TestRuleMarkFailure$1.evaluate(TestRuleMarkFailure.java:48)
	at com.carrotsearch.randomizedtesting.rules.StatementAdapter.evaluate(StatementAdapter.java:36)
	at com.carrotsearch.randomizedtesting.ThreadLeakControl$StatementRunner.run(ThreadLeakControl.java:358)
	at com.carrotsearch.randomizedtesting.ThreadLeakControl.forkTimeoutingTask(ThreadLeakControl.java:782)
	at com.carrotsearch.randomizedtesting.ThreadLeakControl$3.evaluate(ThreadLeakControl.java:442)
	at com.carrotsearch.randomizedtesting.RandomizedRunner.runSingleTest(RandomizedRunner.java:746)
	at com.carrotsearch.randomizedtesting.RandomizedRunner$3.evaluate(RandomizedRunner.java:648)
	at com.carrotsearch.randomizedtesting.RandomizedRunner$4.evaluate(RandomizedRunner.java:682)
	at com.carrotsearch.randomizedtesting.RandomizedRunner$5.evaluate(RandomizedRunner.java:693)
	at com.carrotsearch.randomizedtesting.rules.StatementAdapter.evaluate(StatementAdapter.java:36)
	at com.carrotsearch.randomizedtesting.rules.SystemPropertiesRestoreRule$1.evaluate(SystemPropertiesRestoreRule.java:53)
	at org.apache.lucene.util.AbstractBeforeAfterRule$1.evaluate(AbstractBeforeAfterRule.java:46)
	at org.apache.lucene.util.TestRuleStoreClassName$1.evaluate(TestRuleStoreClassName.java:42)
	at com.carrotsearch.randomizedtesting.rules.SystemPropertiesInvariantRule$1.evaluate(SystemPropertiesInvariantRule.java:55)
	at com.carrotsearch.randomizedtesting.rules.NoShadowingOrOverridesOnMethodsRule$1.evaluate(NoShadowingOrOverridesOnMethodsRule.java:39)
	at com.carrotsearch.randomizedtesting.rules.NoShadowingOrOverridesOnMethodsRule$1.evaluate(NoShadowingOrOverridesOnMethodsRule.java:39)
	at com.carrotsearch.randomizedtesting.rules.StatementAdapter.evaluate(StatementAdapter.java:36)
	at org.apache.lucene.util.TestRuleAssertionsRequired$1.evaluate(TestRuleAssertionsRequired.java:43)
	at org.apache.lucene.util.TestRuleMarkFailure$1.evaluate(TestRuleMarkFailure.java:48)
	at org.apache.lucene.util.TestRuleIgnoreAfterMaxFailures$1.evaluate(TestRuleIgnoreAfterMaxFailures.java:70)
	at org.apache.lucene.util.TestRuleIgnoreTestSuites$1.evaluate(TestRuleIgnoreTestSuites.java:55)
	at com.carrotsearch.randomizedtesting.rules.StatementAdapter.evaluate(StatementAdapter.java:36)
	at com.carrotsearch.randomizedtesting.ThreadLeakControl$StatementRunner.run(ThreadLeakControl.java:358)
	at java.lang.Thread.run(Thread.java:679)




Build Log:
[...truncated 8372 lines...]
[junit4:junit4] Suite: org.apache.solr.cloud.SyncSliceTest
[junit4:junit4]   2> 0 T629 oas.BaseDistributedSearchTestCase.initHostContext Setting hostContext system property: /
[junit4:junit4]   2> 4 T629 oas.SolrTestCaseJ4.setUp ###Starting testDistribSearch
[junit4:junit4]   2> Creating dataDir: /usr/home/hudson/hudson-slave/workspace/Lucene-Solr-Tests-trunk-Java6/solr/build/solr-core/test/J0/./solrtest-SyncSliceTest-1360591858916
[junit4:junit4]   2> 4 T629 oasc.ZkTestServer.run STARTING ZK TEST SERVER
[junit4:junit4]   2> 5 T630 oasc.ZkTestServer$ZKServerMain.runFromConfig Starting server
[junit4:junit4]   2> 8 T630 oazs.ZooKeeperServer.setTickTime tickTime set to 1000
[junit4:junit4]   2> 8 T630 oazs.ZooKeeperServer.setMinSessionTimeout minSessionTimeout set to -1
[junit4:junit4]   2> 8 T630 oazs.ZooKeeperServer.setMaxSessionTimeout maxSessionTimeout set to -1
[junit4:junit4]   2> 9 T630 oazs.NIOServerCnxnFactory.configure binding to port 0.0.0.0/0.0.0.0:0
[junit4:junit4]   2> 10 T630 oazsp.FileTxnSnapLog.save Snapshotting: 0x0 to /usr/home/hudson/hudson-slave/workspace/Lucene-Solr-Tests-trunk-Java6/solr/build/solr-core/test/J0/./org.apache.solr.cloud.SyncSliceTest-1360591858916/zookeeper/server1/data/version-2/snapshot.0
[junit4:junit4]   2> 106 T629 oasc.ZkTestServer.run start zk server on port:37331
[junit4:junit4]   2> 106 T629 oaz.ZooKeeper.<init> Initiating client connection, connectString=127.0.0.1:37331 sessionTimeout=10000 watcher=org.apache.solr.common.cloud.ConnectionManager@78a7f540
[junit4:junit4]   2> 108 T629 oascc.ConnectionManager.waitForConnected Waiting for client to connect to ZooKeeper
[junit4:junit4]   2> 108 T635 oaz.ClientCnxn$SendThread.logStartConnect Opening socket connection to server localhost/127.0.0.1:37331. Will not attempt to authenticate using SASL (access denied (javax.security.auth.AuthPermission getLoginConfiguration))
[junit4:junit4]   2> 109 T635 oaz.ClientCnxn$SendThread.primeConnection Socket connection established to localhost/127.0.0.1:37331, initiating session
[junit4:junit4]   2> 109 T631 oazs.NIOServerCnxnFactory.run Accepted socket connection from /140.211.11.196:37332
[junit4:junit4]   2> 110 T631 oazs.ZooKeeperServer.processConnectRequest Client attempting to establish new session at /140.211.11.196:37332
[junit4:junit4]   2> 110 T633 oazsp.FileTxnLog.append Creating new log file: log.1
[junit4:junit4]   2> 112 T633 oazs.ZooKeeperServer.finishSessionInit Established session 0x13cc9982ceb0000 with negotiated timeout 10000 for client /140.211.11.196:37332
[junit4:junit4]   2> 112 T635 oaz.ClientCnxn$SendThread.onConnected Session establishment complete on server localhost/127.0.0.1:37331, sessionid = 0x13cc9982ceb0000, negotiated timeout = 10000
[junit4:junit4]   2> 113 T636 oascc.ConnectionManager.process Watcher org.apache.solr.common.cloud.ConnectionManager@78a7f540 name:ZooKeeperConnection Watcher:127.0.0.1:37331 got event WatchedEvent state:SyncConnected type:None path:null path:null type:None
[junit4:junit4]   2> 113 T629 oascc.ConnectionManager.waitForConnected Client is connected to ZooKeeper
[junit4:junit4]   2> 113 T629 oascc.SolrZkClient.makePath makePath: /solr
[junit4:junit4]   2> 117 T634 oazs.PrepRequestProcessor.pRequest2Txn Processed session termination for sessionid: 0x13cc9982ceb0000
[junit4:junit4]   2> 123 T636 oaz.ClientCnxn$EventThread.run EventThread shut down
[junit4:junit4]   2> 123 T629 oaz.ZooKeeper.close Session: 0x13cc9982ceb0000 closed
[junit4:junit4]   2> 124 T631 oazs.NIOServerCnxn.closeSock Closed socket connection for client /140.211.11.196:37332 which had sessionid 0x13cc9982ceb0000
[junit4:junit4]   2> 124 T629 oaz.ZooKeeper.<init> Initiating client connection, connectString=127.0.0.1:37331/solr sessionTimeout=10000 watcher=org.apache.solr.common.cloud.ConnectionManager@358c4b30
[junit4:junit4]   2> 125 T629 oascc.ConnectionManager.waitForConnected Waiting for client to connect to ZooKeeper
[junit4:junit4]   2> 125 T637 oaz.ClientCnxn$SendThread.logStartConnect Opening socket connection to server localhost/127.0.0.1:37331. Will not attempt to authenticate using SASL (access denied (javax.security.auth.AuthPermission getLoginConfiguration))
[junit4:junit4]   2> 126 T637 oaz.ClientCnxn$SendThread.primeConnection Socket connection established to localhost/127.0.0.1:37331, initiating session
[junit4:junit4]   2> 126 T631 oazs.NIOServerCnxnFactory.run Accepted socket connection from /140.211.11.196:37333
[junit4:junit4]   2> 126 T631 oazs.ZooKeeperServer.processConnectRequest Client attempting to establish new session at /140.211.11.196:37333
[junit4:junit4]   2> 128 T633 oazs.ZooKeeperServer.finishSessionInit Established session 0x13cc9982ceb0001 with negotiated timeout 10000 for client /140.211.11.196:37333
[junit4:junit4]   2> 128 T637 oaz.ClientCnxn$SendThread.onConnected Session establishment complete on server localhost/127.0.0.1:37331, sessionid = 0x13cc9982ceb0001, negotiated timeout = 10000
[junit4:junit4]   2> 128 T638 oascc.ConnectionManager.process Watcher org.apache.solr.common.cloud.ConnectionManager@358c4b30 name:ZooKeeperConnection Watcher:127.0.0.1:37331/solr got event WatchedEvent state:SyncConnected type:None path:null path:null type:None
[junit4:junit4]   2> 128 T629 oascc.ConnectionManager.waitForConnected Client is connected to ZooKeeper
[junit4:junit4]   2> 129 T629 oascc.SolrZkClient.makePath makePath: /collections/collection1
[junit4:junit4]   2> 139 T629 oascc.SolrZkClient.makePath makePath: /collections/collection1/shards
[junit4:junit4]   2> 142 T629 oascc.SolrZkClient.makePath makePath: /collections/control_collection
[junit4:junit4]   2> 145 T629 oascc.SolrZkClient.makePath makePath: /collections/control_collection/shards
[junit4:junit4]   2> 153 T629 oasc.AbstractZkTestCase.putConfig put /usr/home/hudson/hudson-slave/workspace/Lucene-Solr-Tests-trunk-Java6/solr/build/solr-core/test-files/solr/collection1/conf/solrconfig.xml to /configs/conf1/solrconfig.xml
[junit4:junit4]   2> 154 T629 oascc.SolrZkClient.makePath makePath: /configs/conf1/solrconfig.xml
[junit4:junit4]   2> 167 T629 oasc.AbstractZkTestCase.putConfig put /usr/home/hudson/hudson-slave/workspace/Lucene-Solr-Tests-trunk-Java6/solr/build/solr-core/test-files/solr/collection1/conf/schema.xml to /configs/conf1/schema.xml
[junit4:junit4]   2> 168 T629 oascc.SolrZkClient.makePath makePath: /configs/conf1/schema.xml
[junit4:junit4]   2> 272 T629 oasc.AbstractZkTestCase.putConfig put /usr/home/hudson/hudson-slave/workspace/Lucene-Solr-Tests-trunk-Java6/solr/build/solr-core/test-files/solr/collection1/conf/stopwords.txt to /configs/conf1/stopwords.txt
[junit4:junit4]   2> 273 T629 oascc.SolrZkClient.makePath makePath: /configs/conf1/stopwords.txt
[junit4:junit4]   2> 276 T629 oasc.AbstractZkTestCase.putConfig put /usr/home/hudson/hudson-slave/workspace/Lucene-Solr-Tests-trunk-Java6/solr/build/solr-core/test-files/solr/collection1/conf/protwords.txt to /configs/conf1/protwords.txt
[junit4:junit4]   2> 277 T629 oascc.SolrZkClient.makePath makePath: /configs/conf1/protwords.txt
[junit4:junit4]   2> 287 T629 oasc.AbstractZkTestCase.putConfig put /usr/home/hudson/hudson-slave/workspace/Lucene-Solr-Tests-trunk-Java6/solr/build/solr-core/test-files/solr/collection1/conf/currency.xml to /configs/conf1/currency.xml
[junit4:junit4]   2> 287 T629 oascc.SolrZkClient.makePath makePath: /configs/conf1/currency.xml
[junit4:junit4]   2> 291 T629 oasc.AbstractZkTestCase.putConfig put /usr/home/hudson/hudson-slave/workspace/Lucene-Solr-Tests-trunk-Java6/solr/build/solr-core/test-files/solr/collection1/conf/open-exchange-rates.json to /configs/conf1/open-exchange-rates.json
[junit4:junit4]   2> 291 T629 oascc.SolrZkClient.makePath makePath: /configs/conf1/open-exchange-rates.json
[junit4:junit4]   2> 296 T629 oasc.AbstractZkTestCase.putConfig put /usr/home/hudson/hudson-slave/workspace/Lucene-Solr-Tests-trunk-Java6/solr/build/solr-core/test-files/solr/collection1/conf/mapping-ISOLatin1Accent.txt to /configs/conf1/mapping-ISOLatin1Accent.txt
[junit4:junit4]   2> 297 T629 oascc.SolrZkClient.makePath makePath: /configs/conf1/mapping-ISOLatin1Accent.txt
[junit4:junit4]   2> 300 T629 oasc.AbstractZkTestCase.putConfig put /usr/home/hudson/hudson-slave/workspace/Lucene-Solr-Tests-trunk-Java6/solr/build/solr-core/test-files/solr/collection1/conf/old_synonyms.txt to /configs/conf1/old_synonyms.txt
[junit4:junit4]   2> 301 T629 oascc.SolrZkClient.makePath makePath: /configs/conf1/old_synonyms.txt
[junit4:junit4]   2> 304 T629 oasc.AbstractZkTestCase.putConfig put /usr/home/hudson/hudson-slave/workspace/Lucene-Solr-Tests-trunk-Java6/solr/build/solr-core/test-files/solr/collection1/conf/synonyms.txt to /configs/conf1/synonyms.txt
[junit4:junit4]   2> 305 T629 oascc.SolrZkClient.makePath makePath: /configs/conf1/synonyms.txt
[junit4:junit4]   2> 308 T634 oazs.PrepRequestProcessor.pRequest2Txn Processed session termination for sessionid: 0x13cc9982ceb0001
[junit4:junit4]   2> 314 T638 oaz.ClientCnxn$EventThread.run EventThread shut down
[junit4:junit4]   2> 314 T629 oaz.ZooKeeper.close Session: 0x13cc9982ceb0001 closed
[junit4:junit4]   2> 314 T631 oazs.NIOServerCnxn.closeSock Closed socket connection for client /140.211.11.196:37333 which had sessionid 0x13cc9982ceb0001
[junit4:junit4]   2> 476 T629 oejs.Server.doStart jetty-8.1.8.v20121106
[junit4:junit4]   2> 482 T629 oejs.AbstractConnector.doStart Started SocketConnector@127.0.0.1:37334
[junit4:junit4]   2> 482 T629 oass.SolrDispatchFilter.init SolrDispatchFilter.init()
[junit4:junit4]   2> 483 T629 oasc.SolrResourceLoader.locateSolrHome JNDI not configured for solr (NoInitialContextEx)
[junit4:junit4]   2> 483 T629 oasc.SolrResourceLoader.locateSolrHome using system property solr.solr.home: /usr/home/hudson/hudson-slave/workspace/Lucene-Solr-Tests-trunk-Java6/solr/build/solr-core/test/J0/./org.apache.solr.cloud.SyncSliceTest-controljetty-1360591859227
[junit4:junit4]   2> 484 T629 oasc.CoreContainer$Initializer.initialize looking for solr.xml: /usr/home/hudson/hudson-slave/workspace/Lucene-Solr-Tests-trunk-Java6/solr/build/solr-core/test/J0/./org.apache.solr.cloud.SyncSliceTest-controljetty-1360591859227/solr.xml
[junit4:junit4]   2> 484 T629 oasc.CoreContainer.<init> New CoreContainer 1549129113
[junit4:junit4]   2> 485 T629 oasc.CoreContainer.load Loading CoreContainer using Solr Home: '/usr/home/hudson/hudson-slave/workspace/Lucene-Solr-Tests-trunk-Java6/solr/build/solr-core/test/J0/./org.apache.solr.cloud.SyncSliceTest-controljetty-1360591859227/'
[junit4:junit4]   2> 485 T629 oasc.SolrResourceLoader.<init> new SolrResourceLoader for directory: '/usr/home/hudson/hudson-slave/workspace/Lucene-Solr-Tests-trunk-Java6/solr/build/solr-core/test/J0/./org.apache.solr.cloud.SyncSliceTest-controljetty-1360591859227/'
[junit4:junit4]   2> 531 T629 oashc.HttpShardHandlerFactory.getParameter Setting socketTimeout to: 60000
[junit4:junit4]   2> 531 T629 oashc.HttpShardHandlerFactory.getParameter Setting urlScheme to: http://
[junit4:junit4]   2> 532 T629 oashc.HttpShardHandlerFactory.getParameter Setting connTimeout to: 15000
[junit4:junit4]   2> 532 T629 oashc.HttpShardHandlerFactory.getParameter Setting maxConnectionsPerHost to: 20
[junit4:junit4]   2> 532 T629 oashc.HttpShardHandlerFactory.getParameter Setting corePoolSize to: 0
[junit4:junit4]   2> 533 T629 oashc.HttpShardHandlerFactory.getParameter Setting maximumPoolSize to: 2147483647
[junit4:junit4]   2> 533 T629 oashc.HttpShardHandlerFactory.getParameter Setting maxThreadIdleTime to: 5
[junit4:junit4]   2> 534 T629 oashc.HttpShardHandlerFactory.getParameter Setting sizeOfQueue to: -1
[junit4:junit4]   2> 534 T629 oashc.HttpShardHandlerFactory.getParameter Setting fairnessPolicy to: false
[junit4:junit4]   2> 534 T629 oascsi.HttpClientUtil.createClient Creating new http client, config:maxConnectionsPerHost=20&maxConnections=10000&socketTimeout=60000&connTimeout=15000&retry=false
[junit4:junit4]   2> 556 T629 oasc.CoreContainer.load Registering Log Listener
[junit4:junit4]   2> 573 T629 oasc.CoreContainer.initZooKeeper Zookeeper client=127.0.0.1:37331/solr
[junit4:junit4]   2> 574 T629 oasc.ZkController.checkChrootPath zkHost includes chroot
[junit4:junit4]   2> 574 T629 oaz.ZooKeeper.<init> Initiating client connection, connectString=127.0.0.1:37331 sessionTimeout=60000 watcher=org.apache.solr.common.cloud.ConnectionManager@93e03c2
[junit4:junit4]   2> 575 T629 oascc.ConnectionManager.waitForConnected Waiting for client to connect to ZooKeeper
[junit4:junit4]   2> 576 T648 oaz.ClientCnxn$SendThread.logStartConnect Opening socket connection to server localhost/127.0.0.1:37331. Will not attempt to authenticate using SASL (access denied (javax.security.auth.AuthPermission getLoginConfiguration))
[junit4:junit4]   2> 576 T648 oaz.ClientCnxn$SendThread.primeConnection Socket connection established to localhost/127.0.0.1:37331, initiating session
[junit4:junit4]   2> 577 T631 oazs.NIOServerCnxnFactory.run Accepted socket connection from /140.211.11.196:37335
[junit4:junit4]   2> 577 T631 oazs.ZooKeeperServer.processConnectRequest Client attempting to establish new session at /140.211.11.196:37335
[junit4:junit4]   2> 579 T633 oazs.ZooKeeperServer.finishSessionInit Established session 0x13cc9982ceb0002 with negotiated timeout 20000 for client /140.211.11.196:37335
[junit4:junit4]   2> 579 T648 oaz.ClientCnxn$SendThread.onConnected Session establishment complete on server localhost/127.0.0.1:37331, sessionid = 0x13cc9982ceb0002, negotiated timeout = 20000
[junit4:junit4]   2> 579 T649 oascc.ConnectionManager.process Watcher org.apache.solr.common.cloud.ConnectionManager@93e03c2 name:ZooKeeperConnection Watcher:127.0.0.1:37331 got event WatchedEvent state:SyncConnected type:None path:null path:null type:None
[junit4:junit4]   2> 579 T629 oascc.ConnectionManager.waitForConnected Client is connected to ZooKeeper
[junit4:junit4]   2> 581 T634 oazs.PrepRequestProcessor.pRequest2Txn Processed session termination for sessionid: 0x13cc9982ceb0002
[junit4:junit4]   2> 582 T649 oaz.ClientCnxn$EventThread.run EventThread shut down
[junit4:junit4]   2> 582 T631 oazs.NIOServerCnxn.closeSock Closed socket connection for client /140.211.11.196:37335 which had sessionid 0x13cc9982ceb0002
[junit4:junit4]   2> 582 T629 oaz.ZooKeeper.close Session: 0x13cc9982ceb0002 closed
[junit4:junit4]   2> 583 T629 oascsi.HttpClientUtil.createClient Creating new http client, config:maxConnections=500&maxConnectionsPerHost=16&socketTimeout=60000&connTimeout=15000
[junit4:junit4]   2> 595 T629 oaz.ZooKeeper.<init> Initiating client connection, connectString=127.0.0.1:37331/solr sessionTimeout=30000 watcher=org.apache.solr.common.cloud.ConnectionManager@753da9c8
[junit4:junit4]   2> 595 T629 oascc.ConnectionManager.waitForConnected Waiting for client to connect to ZooKeeper
[junit4:junit4]   2> 596 T650 oaz.ClientCnxn$SendThread.logStartConnect Opening socket connection to server localhost/127.0.0.1:37331. Will not attempt to authenticate using SASL (access denied (javax.security.auth.AuthPermission getLoginConfiguration))
[junit4:junit4]   2> 596 T650 oaz.ClientCnxn$SendThread.primeConnection Socket connection established to localhost/127.0.0.1:37331, initiating session
[junit4:junit4]   2> 596 T631 oazs.NIOServerCnxnFactory.run Accepted socket connection from /140.211.11.196:37336
[junit4:junit4]   2> 597 T631 oazs.ZooKeeperServer.processConnectRequest Client attempting to establish new session at /140.211.11.196:37336
[junit4:junit4]   2> 598 T633 oazs.ZooKeeperServer.finishSessionInit Established session 0x13cc9982ceb0003 with negotiated timeout 20000 for client /140.211.11.196:37336
[junit4:junit4]   2> 598 T650 oaz.ClientCnxn$SendThread.onConnected Session establishment complete on server localhost/127.0.0.1:37331, sessionid = 0x13cc9982ceb0003, negotiated timeout = 20000
[junit4:junit4]   2> 598 T651 oascc.ConnectionManager.process Watcher org.apache.solr.common.cloud.ConnectionManager@753da9c8 name:ZooKeeperConnection Watcher:127.0.0.1:37331/solr got event WatchedEvent state:SyncConnected type:None path:null path:null type:None
[junit4:junit4]   2> 598 T629 oascc.ConnectionManager.waitForConnected Client is connected to ZooKeeper
[junit4:junit4]   2> 601 T634 oazs.PrepRequestProcessor.pRequest Got user-level KeeperException when processing sessionid:0x13cc9982ceb0003 type:create cxid:0x2 zxid:0x1a txntype:-1 reqpath:n/a Error Path:/solr/overseer Error:KeeperErrorCode = NodeExists for /solr/overseer
[junit4:junit4]   2> 610 T629 oascc.SolrZkClient.makePath makePath: /live_nodes
[junit4:junit4]   2> 612 T629 oasc.ZkController.createEphemeralLiveNode Register node as live in ZooKeeper:/live_nodes/127.0.0.1:37334_
[junit4:junit4]   2> 613 T634 oazs.PrepRequestProcessor.pRequest Got user-level KeeperException when processing sessionid:0x13cc9982ceb0003 type:delete cxid:0x8 zxid:0x1c txntype:-1 reqpath:n/a Error Path:/solr/live_nodes/127.0.0.1:37334_ Error:KeeperErrorCode = NoNode for /solr/live_nodes/127.0.0.1:37334_
[junit4:junit4]   2> 614 T629 oascc.SolrZkClient.makePath makePath: /live_nodes/127.0.0.1:37334_
[junit4:junit4]   2> 623 T629 oascc.SolrZkClient.makePath makePath: /overseer_elect/election
[junit4:junit4]   2> 636 T634 oazs.PrepRequestProcessor.pRequest Got user-level KeeperException when processing sessionid:0x13cc9982ceb0003 type:delete cxid:0x16 zxid:0x21 txntype:-1 reqpath:n/a Error Path:/solr/overseer_elect/leader Error:KeeperErrorCode = NoNode for /solr/overseer_elect/leader
[junit4:junit4]   2> 637 T629 oascc.SolrZkClient.makePath makePath: /overseer_elect/leader
[junit4:junit4]   2> 641 T629 oasc.Overseer.start Overseer (id=89167748066377731-127.0.0.1:37334_-n_0000000000) starting
[junit4:junit4]   2> 641 T634 oazs.PrepRequestProcessor.pRequest Got user-level KeeperException when processing sessionid:0x13cc9982ceb0003 type:create cxid:0x1b zxid:0x23 txntype:-1 reqpath:n/a Error Path:/solr/overseer Error:KeeperErrorCode = NodeExists for /solr/overseer
[junit4:junit4]   2> 649 T634 oazs.PrepRequestProcessor.pRequest Got user-level KeeperException when processing sessionid:0x13cc9982ceb0003 type:create cxid:0x1c zxid:0x24 txntype:-1 reqpath:n/a Error Path:/solr/overseer Error:KeeperErrorCode = NodeExists for /solr/overseer
[junit4:junit4]   2> 650 T634 oazs.PrepRequestProcessor.pRequest Got user-level KeeperException when processing sessionid:0x13cc9982ceb0003 type:create cxid:0x1d zxid:0x25 txntype:-1 reqpath:n/a Error Path:/solr/overseer Error:KeeperErrorCode = NodeExists for /solr/overseer
[junit4:junit4]   2> 652 T634 oazs.PrepRequestProcessor.pRequest Got user-level KeeperException when processing sessionid:0x13cc9982ceb0003 type:create cxid:0x1e zxid:0x26 txntype:-1 reqpath:n/a Error Path:/solr/overseer Error:KeeperErrorCode = NodeExists for /solr/overseer
[junit4:junit4]   2> 661 T653 oasc.OverseerCollectionProcessor.run Process current queue of collection creations
[junit4:junit4]   2> 662 T629 oascc.SolrZkClient.makePath makePath: /clusterstate.json
[junit4:junit4]   2> 665 T629 oascc.ZkStateReader.createClusterStateWatchersAndUpdate Updating cluster state from ZooKeeper... 
[junit4:junit4]   2> 667 T652 oasc.Overseer$ClusterStateUpdater.run Starting to work on the main queue
[junit4:junit4]   2> 672 T654 oasc.CoreContainer.create Creating SolrCore 'collection1' using instanceDir: /usr/home/hudson/hudson-slave/workspace/Lucene-Solr-Tests-trunk-Java6/solr/build/solr-core/test/J0/./org.apache.solr.cloud.SyncSliceTest-controljetty-1360591859227/collection1
[junit4:junit4]   2> 672 T654 oasc.ZkController.createCollectionZkNode Check for collection zkNode:control_collection
[junit4:junit4]   2> 673 T654 oasc.ZkController.createCollectionZkNode Collection zkNode exists
[junit4:junit4]   2> 673 T654 oasc.ZkController.readConfigName Load collection config from:/collections/control_collection
[junit4:junit4]   2> 674 T654 oasc.SolrResourceLoader.<init> new SolrResourceLoader for directory: '/usr/home/hudson/hudson-slave/workspace/Lucene-Solr-Tests-trunk-Java6/solr/build/solr-core/test/J0/./org.apache.solr.cloud.SyncSliceTest-controljetty-1360591859227/collection1/'
[junit4:junit4]   2> 675 T654 oasc.SolrResourceLoader.replaceClassLoader Adding 'file:/usr/home/hudson/hudson-slave/workspace/Lucene-Solr-Tests-trunk-Java6/solr/build/solr-core/test/J0/org.apache.solr.cloud.SyncSliceTest-controljetty-1360591859227/collection1/lib/README' to classloader
[junit4:junit4]   2> 676 T654 oasc.SolrResourceLoader.replaceClassLoader Adding 'file:/usr/home/hudson/hudson-slave/workspace/Lucene-Solr-Tests-trunk-Java6/solr/build/solr-core/test/J0/org.apache.solr.cloud.SyncSliceTest-controljetty-1360591859227/collection1/lib/classes/' to classloader
[junit4:junit4]   2> 729 T654 oasc.SolrConfig.<init> Using Lucene MatchVersion: LUCENE_50
[junit4:junit4]   2> 799 T654 oasc.SolrConfig.<init> Loaded SolrConfig: solrconfig.xml
[junit4:junit4]   2> 900 T654 oass.IndexSchema.readSchema Reading Solr Schema
[junit4:junit4]   2> 907 T654 oass.IndexSchema.readSchema Schema name=test
[junit4:junit4]   2> 1513 T654 oass.OpenExchangeRatesOrgProvider.init Initialized with rates=open-exchange-rates.json, refreshInterval=1440.
[junit4:junit4]   2> 1521 T654 oass.IndexSchema.readSchema default search field in schema is text
[junit4:junit4]   2> 1523 T654 oass.IndexSchema.readSchema unique key field: id
[junit4:junit4]   2> 1536 T654 oass.FileExchangeRateProvider.reload Reloading exchange rates from file currency.xml
[junit4:junit4]   2> 1540 T654 oass.FileExchangeRateProvider.reload Reloading exchange rates from file currency.xml
[junit4:junit4]   2> 1543 T654 oass.OpenExchangeRatesOrgProvider.reload Reloading exchange rates from open-exchange-rates.json
[junit4:junit4]   2> 1544 T654 oass.OpenExchangeRatesOrgProvider.reload Reloading exchange rates from open-exchange-rates.json
[junit4:junit4]   2> 1545 T654 oasc.SolrCore.<init> [collection1] Opening new SolrCore at /usr/home/hudson/hudson-slave/workspace/Lucene-Solr-Tests-trunk-Java6/solr/build/solr-core/test/J0/./org.apache.solr.cloud.SyncSliceTest-controljetty-1360591859227/collection1/, dataDir=./org.apache.solr.cloud.SyncSliceTest-1360591858916/control/data/
[junit4:junit4]   2> 1545 T654 oasc.JmxMonitoredMap.<init> JMX monitoring is enabled. Adding Solr mbeans to JMX Server: com.sun.jmx.mbeanserver.JmxMBeanServer@18330bf
[junit4:junit4]   2> 1546 T654 oasc.SolrCore.initDirectoryFactory solr.NRTCachingDirectoryFactory
[junit4:junit4]   2> 1547 T654 oasc.CachingDirectoryFactory.get return new directory for /usr/home/hudson/hudson-slave/workspace/Lucene-Solr-Tests-trunk-Java6/solr/build/solr-core/test/J0/./org.apache.solr.cloud.SyncSliceTest-1360591858916/control/data forceNew:false
[junit4:junit4]   2> 1547 T654 oasc.CachingDirectoryFactory.close Releasing directory:/usr/home/hudson/hudson-slave/workspace/Lucene-Solr-Tests-trunk-Java6/solr/build/solr-core/test/J0/./org.apache.solr.cloud.SyncSliceTest-1360591858916/control/data
[junit4:junit4]   2> 1547 T654 oasc.SolrCore.getNewIndexDir New index directory detected: old=null new=./org.apache.solr.cloud.SyncSliceTest-1360591858916/control/data/index/
[junit4:junit4]   2> 1548 T654 oasc.SolrCore.initIndex WARNING [collection1] Solr index directory './org.apache.solr.cloud.SyncSliceTest-1360591858916/control/data/index' doesn't exist. Creating new index...
[junit4:junit4]   2> 1548 T654 oasc.CachingDirectoryFactory.get return new directory for /usr/home/hudson/hudson-slave/workspace/Lucene-Solr-Tests-trunk-Java6/solr/build/solr-core/test/J0/./org.apache.solr.cloud.SyncSliceTest-1360591858916/control/data/index forceNew:false
[junit4:junit4]   2> 1553 T654 oasc.SolrDeletionPolicy.onCommit SolrDeletionPolicy.onCommit: commits:num=1
[junit4:junit4]   2> 		commit{dir=RateLimitedDirectoryWrapper(NRTCachingDirectory(org.apache.lucene.store.NIOFSDirectory@/usr/home/hudson/hudson-slave/workspace/Lucene-Solr-Tests-trunk-Java6/solr/build/solr-core/test/J0/org.apache.solr.cloud.SyncSliceTest-1360591858916/control/data/index lockFactory=org.apache.lucene.store.NativeFSLockFactory@6fcc074b; maxCacheMB=48.0 maxMergeSizeMB=4.0)),segFN=segments_1,generation=1,filenames=[segments_1]
[junit4:junit4]   2> 1553 T654 oasc.SolrDeletionPolicy.updateCommits newest commit = 1[segments_1]
[junit4:junit4]   2> 1554 T654 oasc.CachingDirectoryFactory.close Releasing directory:/usr/home/hudson/hudson-slave/workspace/Lucene-Solr-Tests-trunk-Java6/solr/build/solr-core/test/J0/./org.apache.solr.cloud.SyncSliceTest-1360591858916/control/data/index
[junit4:junit4]   2> 1554 T654 oasc.SolrCore.initWriters created xml: solr.XMLResponseWriter
[junit4:junit4]   2> 1556 T654 oasup.UpdateRequestProcessorChain.init inserting DistributedUpdateProcessorFactory into updateRequestProcessorChain "dedupe"
[junit4:junit4]   2> 1556 T654 oasup.UpdateRequestProcessorChain.init inserting DistributedUpdateProcessorFactory into updateRequestProcessorChain "dedupe-allfields"
[junit4:junit4]   2> 1556 T654 oasup.UpdateRequestProcessorChain.init inserting DistributedUpdateProcessorFactory into updateRequestProcessorChain "stored_sig"
[junit4:junit4]   2> 1556 T654 oasup.UpdateRequestProcessorChain.init inserting DistributedUpdateProcessorFactory into updateRequestProcessorChain "uniq-fields"
[junit4:junit4]   2> 1557 T654 oasup.UpdateRequestProcessorChain.init inserting DistributedUpdateProcessorFactory into updateRequestProcessorChain "distrib-dup-test-chain-implicit"
[junit4:junit4]   2> 1557 T654 oasc.RequestHandlers.initHandlersFromConfig adding lazy requestHandler: solr.ReplicationHandler
[junit4:junit4]   2> 1557 T654 oasc.RequestHandlers.initHandlersFromConfig created /replication: solr.ReplicationHandler
[junit4:junit4]   2> 1557 T654 oasc.RequestHandlers.initHandlersFromConfig created standard: solr.StandardRequestHandler
[junit4:junit4]   2> 1558 T654 oasc.RequestHandlers.initHandlersFromConfig created /get: solr.RealTimeGetHandler
[junit4:junit4]   2> 1558 T654 oasc.RequestHandlers.initHandlersFromConfig created dismax: solr.SearchHandler
[junit4:junit4]   2> 1558 T654 oasc.RequestHandlers.initHandlersFromConfig created mock: org.apache.solr.core.MockQuerySenderListenerReqHandler
[junit4:junit4]   2> 1558 T654 oasc.RequestHandlers.initHandlersFromConfig created /admin/: org.apache.solr.handler.admin.AdminHandlers
[junit4:junit4]   2> 1559 T654 oasc.RequestHandlers.initHandlersFromConfig created defaults: solr.StandardRequestHandler
[junit4:junit4]   2> 1559 T654 oasc.RequestHandlers.initHandlersFromConfig adding lazy requestHandler: solr.StandardRequestHandler
[junit4:junit4]   2> 1559 T654 oasc.RequestHandlers.initHandlersFromConfig created lazy: solr.StandardRequestHandler
[junit4:junit4]   2> 1559 T654 oasc.RequestHandlers.initHandlersFromConfig created /update: solr.UpdateRequestHandler
[junit4:junit4]   2> 1560 T654 oasc.RequestHandlers.initHandlersFromConfig created /terms: org.apache.solr.handler.component.SearchHandler
[junit4:junit4]   2> 1560 T654 oasc.RequestHandlers.initHandlersFromConfig created spellCheckCompRH: org.apache.solr.handler.component.SearchHandler
[junit4:junit4]   2> 1560 T654 oasc.RequestHandlers.initHandlersFromConfig created spellCheckCompRH_Direct: org.apache.solr.handler.component.SearchHandler
[junit4:junit4]   2> 1560 T654 oasc.RequestHandlers.initHandlersFromConfig created spellCheckWithWordbreak: org.apache.solr.handler.component.SearchHandler
[junit4:junit4]   2> 1561 T654 oasc.RequestHandlers.initHandlersFromConfig created spellCheckWithWordbreak_Direct: org.apache.solr.handler.component.SearchHandler
[junit4:junit4]   2> 1561 T654 oasc.RequestHandlers.initHandlersFromConfig created spellCheckCompRH1: org.apache.solr.handler.component.SearchHandler
[junit4:junit4]   2> 1561 T654 oasc.RequestHandlers.initHandlersFromConfig created mltrh: org.apache.solr.handler.component.SearchHandler
[junit4:junit4]   2> 1562 T654 oasc.RequestHandlers.initHandlersFromConfig created tvrh: org.apache.solr.handler.component.SearchHandler
[junit4:junit4]   2> 1562 T654 oasc.RequestHandlers.initHandlersFromConfig created /mlt: solr.MoreLikeThisHandler
[junit4:junit4]   2> 1562 T654 oasc.RequestHandlers.initHandlersFromConfig created /debug/dump: solr.DumpRequestHandler
[junit4:junit4]   2> 1567 T654 oashl.XMLLoader.init xsltCacheLifetimeSeconds=60
[junit4:junit4]   2> 1570 T654 oasc.SolrCore.initDeprecatedSupport WARNING solrconfig.xml uses deprecated <admin/gettableFiles>, Please update your config to use the ShowFileRequestHandler.
[junit4:junit4]   2> 1571 T654 oasc.SolrCore.initDeprecatedSupport WARNING adding ShowFileRequestHandler with hidden files: [SCHEMA.XML, OLD_SYNONYMS.TXT, STOPWORDS.TXT, PROTWORDS.TXT, OPEN-EXCHANGE-RATES.JSON, SYNONYMS.TXT, CURRENCY.XML, MAPPING-ISOLATIN1ACCENT.TXT]
[junit4:junit4]   2> 1572 T654 oasc.CachingDirectoryFactory.close Releasing directory:/usr/home/hudson/hudson-slave/workspace/Lucene-Solr-Tests-trunk-Java6/solr/build/solr-core/test/J0/./org.apache.solr.cloud.SyncSliceTest-1360591858916/control/data
[junit4:junit4]   2> 1573 T654 oass.SolrIndexSearcher.<init> Opening Searcher@a4d79d5 main
[junit4:junit4]   2> 1574 T654 oasu.CommitTracker.<init> Hard AutoCommit: disabled
[junit4:junit4]   2> 1574 T654 oasu.CommitTracker.<init> Soft AutoCommit: disabled
[junit4:junit4]   2> 1575 T654 oashc.SpellCheckComponent.inform Initializing spell checkers
[junit4:junit4]   2> 1591 T654 oass.DirectSolrSpellChecker.init init: {name=direct,classname=DirectSolrSpellChecker,field=lowerfilt,minQueryLength=3}
[junit4:junit4]   2> 1638 T655 oasc.SolrCore.registerSearcher [collection1] Registered new searcher Searcher@a4d79d5 main{StandardDirectoryReader(segments_1:1)}
[junit4:junit4]   2> 1641 T654 oasc.ZkController.publish publishing core=collection1 state=down
[junit4:junit4]   2> 1641 T654 oasc.ZkController.publish numShards not found on descriptor - reading it from system property
[junit4:junit4]   2> 1642 T634 oazs.PrepRequestProcessor.pRequest Got user-level KeeperException when processing sessionid:0x13cc9982ceb0003 type:create cxid:0x51 zxid:0x29 txntype:-1 reqpath:n/a Error Path:/solr/overseer/queue Error:KeeperErrorCode = NoNode for /solr/overseer/queue
[junit4:junit4]   2> 2172 T652 oascc.ZkStateReader.updateClusterState Updating cloud state from ZooKeeper... 
[junit4:junit4]   2> 2172 T652 oasc.Overseer$ClusterStateUpdater.updateState Update state numShards=1 message={
[junit4:junit4]   2> 	  "operation":"state",
[junit4:junit4]   2> 	  "numShards":"1",
[junit4:junit4]   2> 	  "shard":null,
[junit4:junit4]   2> 	  "roles":null,
[junit4:junit4]   2> 	  "state":"down",
[junit4:junit4]   2> 	  "core":"collection1",
[junit4:junit4]   2> 	  "collection":"control_collection",
[junit4:junit4]   2> 	  "node_name":"127.0.0.1:37334_",
[junit4:junit4]   2> 	  "base_url":"http://127.0.0.1:37334"}
[junit4:junit4]   2> 2172 T652 oasc.Overseer$ClusterStateUpdater.createCollection Create collection control_collection with numShards 1
[junit4:junit4]   2> 2173 T652 oasc.Overseer$ClusterStateUpdater.updateState Assigning new node to shard shard=shard1
[junit4:junit4]   2> 2173 T634 oazs.PrepRequestProcessor.pRequest Got user-level KeeperException when processing sessionid:0x13cc9982ceb0003 type:create cxid:0x59 zxid:0x2c txntype:-1 reqpath:n/a Error Path:/solr/overseer/queue-work Error:KeeperErrorCode = NoNode for /solr/overseer/queue-work
[junit4:junit4]   2> 2196 T651 oascc.ZkStateReader$2.process A cluster state change: WatchedEvent state:SyncConnected type:NodeDataChanged path:/clusterstate.json, has occurred - updating... (live nodes size: 1)
[junit4:junit4]   2> 2651 T654 oasc.CoreContainer.registerCore registering core: collection1
[junit4:junit4]   2> 2651 T654 oasc.ZkController.register Register replica - core:collection1 address:http://127.0.0.1:37334 collection:control_collection shard:shard1
[junit4:junit4]   2> 2652 T654 oascc.SolrZkClient.makePath makePath: /collections/control_collection/leader_elect/shard1/election
[junit4:junit4]   2> 2696 T634 oazs.PrepRequestProcessor.pRequest Got user-level KeeperException when processing sessionid:0x13cc9982ceb0003 type:delete cxid:0x73 zxid:0x36 txntype:-1 reqpath:n/a Error Path:/solr/collections/control_collection/leaders Error:KeeperErrorCode = NoNode for /solr/collections/control_collection/leaders
[junit4:junit4]   2> 2697 T654 oasc.ShardLeaderElectionContext.runLeaderProcess Running the leader process.
[junit4:junit4]   2> 2698 T634 oazs.PrepRequestProcessor.pRequest Got user-level KeeperException when processing sessionid:0x13cc9982ceb0003 type:create cxid:0x74 zxid:0x37 txntype:-1 reqpath:n/a Error Path:/solr/overseer Error:KeeperErrorCode = NodeExists for /solr/overseer
[junit4:junit4]   2> 2708 T654 oasc.ShardLeaderElectionContext.waitForReplicasToComeUp Enough replicas found to continue.
[junit4:junit4]   2> 2708 T654 oasc.ShardLeaderElectionContext.runLeaderProcess I may be the new leader - try and sync
[junit4:junit4]   2> 2709 T654 oasc.SyncStrategy.sync Sync replicas to http://127.0.0.1:37334/collection1/
[junit4:junit4]   2> 2709 T654 oasc.SyncStrategy.syncReplicas Sync Success - now sync replicas to me
[junit4:junit4]   2> 2709 T654 oasc.SyncStrategy.syncToMe http://127.0.0.1:37334/collection1/ has no replicas
[junit4:junit4]   2> 2709 T654 oasc.ShardLeaderElectionContext.runLeaderProcess I am the new leader: http://127.0.0.1:37334/collection1/
[junit4:junit4]   2> 2709 T654 oascc.SolrZkClient.makePath makePath: /collections/control_collection/leaders/shard1
[junit4:junit4]   2> 2714 T634 oazs.PrepRequestProcessor.pRequest Got user-level KeeperException when processing sessionid:0x13cc9982ceb0003 type:create cxid:0x7e zxid:0x3b txntype:-1 reqpath:n/a Error Path:/solr/overseer Error:KeeperErrorCode = NodeExists for /solr/overseer
[junit4:junit4]   2> 3701 T652 oascc.ZkStateReader.updateClusterState Updating cloud state from ZooKeeper... 
[junit4:junit4]   2> 3734 T651 oascc.ZkStateReader$2.process A cluster state change: WatchedEvent state:SyncConnected type:NodeDataChanged path:/clusterstate.json, has occurred - updating... (live nodes size: 1)
[junit4:junit4]   2> 3796 T654 oasc.ZkController.register We are http://127.0.0.1:37334/collection1/ and leader is http://127.0.0.1:37334/collection1/
[junit4:junit4]   2> 3796 T654 oasc.ZkController.register No LogReplay needed for core=collection1 baseURL=http://127.0.0.1:37334
[junit4:junit4]   2> 3796 T654 oasc.ZkController.checkRecovery I am the leader, no recovery necessary
[junit4:junit4]   2> 3796 T654 oasc.ZkController.publish publishing core=collection1 state=active
[junit4:junit4]   2> 3796 T654 oasc.ZkController.publish numShards not found on descriptor - reading it from system property
[junit4:junit4]   2> 3798 T654 oascc.ZkStateReader.updateClusterState Updating cloud state from ZooKeeper... 
[junit4:junit4]   2> 3799 T629 oass.SolrDispatchFilter.init user.dir=/usr/home/hudson/hudson-slave/workspace/Lucene-Solr-Tests-trunk-Java6/solr/build/solr-core/test/J0
[junit4:junit4]   2> 3800 T629 oass.SolrDispatchFilter.init SolrDispatchFilter.init() done
[junit4:junit4]   2> 3800 T629 oascsi.HttpClientUtil.createClient Creating new http client, config:maxConnections=128&maxConnectionsPerHost=32&followRedirects=false
[junit4:junit4]   2> 3814 T629 oascsi.HttpClientUtil.createClient Creating new http client, config:
[junit4:junit4]   2> 3823 T629 oaz.ZooKeeper.<init> Initiating client connection, connectString=127.0.0.1:37331/solr sessionTimeout=10000 watcher=org.apache.solr.common.cloud.ConnectionManager@758fd559
[junit4:junit4]   2> 3824 T629 oascc.ConnectionManager.waitForConnected Waiting for client to connect to ZooKeeper
[junit4:junit4]   2> 3825 T656 oaz.ClientCnxn$SendThread.logStartConnect Opening socket connection to server localhost/127.0.0.1:37331. Will not attempt to authenticate using SASL (access denied (javax.security.auth.AuthPermission getLoginConfiguration))
[junit4:junit4]   2> 3825 T656 oaz.ClientCnxn$SendThread.primeConnection Socket connection established to localhost/127.0.0.1:37331, initiating session
[junit4:junit4]   2> 3825 T631 oazs.NIOServerCnxnFactory.run Accepted socket connection from /140.211.11.196:37337
[junit4:junit4]   2> 3826 T631 oazs.ZooKeeperServer.processConnectRequest Client attempting to establish new session at /140.211.11.196:37337
[junit4:junit4]   2> 3828 T633 oazs.ZooKeeperServer.finishSessionInit Established session 0x13cc9982ceb0004 with negotiated timeout 10000 for client /140.211.11.196:37337
[junit4:junit4]   2> 3828 T656 oaz.ClientCnxn$SendThread.onConnected Session establishment complete on server localhost/127.0.0.1:37331, sessionid = 0x13cc9982ceb0004, negotiated timeout = 10000
[junit4:junit4]   2> 3828 T657 oascc.ConnectionManager.process Watcher org.apache.solr.common.cloud.ConnectionManager@758fd559 name:ZooKeeperConnection Watcher:127.0.0.1:37331/solr got event WatchedEvent state:SyncConnected type:None path:null path:null type:None
[junit4:junit4]   2> 3828 T629 oascc.ConnectionManager.waitForConnected Client is connected to ZooKeeper
[junit4:junit4]   2> 3830 T629 oascc.ZkStateReader.createClusterStateWatchersAndUpdate Updating cluster state from ZooKeeper... 
[junit4:junit4]   2> 3832 T629 oasc.ChaosMonkey.monkeyLog monkey: init - expire sessions:true cause connection loss:true
[junit4:junit4]   2> 3995 T629 oejs.Server.doStart jetty-8.1.8.v20121106
[junit4:junit4]   2> 3997 T629 oejs.AbstractConnector.doStart Started SocketConnector@127.0.0.1:37338
[junit4:junit4]   2> 3998 T629 oass.SolrDispatchFilter.init SolrDispatchFilter.init()
[junit4:junit4]   2> 3998 T629 oasc.SolrResourceLoader.locateSolrHome JNDI not configured for solr (NoInitialContextEx)
[junit4:junit4]   2> 3999 T629 oasc.SolrResourceLoader.locateSolrHome using system property solr.solr.home: /usr/home/hudson/hudson-slave/workspace/Lucene-Solr-Tests-trunk-Java6/solr/build/solr-core/test/J0/./org.apache.solr.cloud.SyncSliceTest-jetty1-1360591862744
[junit4:junit4]   2> 3999 T629 oasc.CoreContainer$Initializer.initialize looking for solr.xml: /usr/home/hudson/hudson-slave/workspace/Lucene-Solr-Tests-trunk-Java6/solr/build/solr-core/test/J0/./org.apache.solr.cloud.SyncSliceTest-jetty1-1360591862744/solr.xml
[junit4:junit4]   2> 4000 T629 oasc.CoreContainer.<init> New CoreContainer 1362045401
[junit4:junit4]   2> 4000 T629 oasc.CoreContainer.load Loading CoreContainer using Solr Home: '/usr/home/hudson/hudson-slave/workspace/Lucene-Solr-Tests-trunk-Java6/solr/build/solr-core/test/J0/./org.apache.solr.cloud.SyncSliceTest-jetty1-1360591862744/'
[junit4:junit4]   2> 4001 T629 oasc.SolrResourceLoader.<init> new SolrResourceLoader for directory: '/usr/home/hudson/hudson-slave/workspace/Lucene-Solr-Tests-trunk-Java6/solr/build/solr-core/test/J0/./org.apache.solr.cloud.SyncSliceTest-jetty1-1360591862744/'
[junit4:junit4]   2> 4046 T629 oashc.HttpShardHandlerFactory.getParameter Setting socketTimeout to: 60000
[junit4:junit4]   2> 4047 T629 oashc.HttpShardHandlerFactory.getParameter Setting urlScheme to: http://
[junit4:junit4]   2> 4047 T629 oashc.HttpShardHandlerFactory.getParameter Setting connTimeout to: 15000
[junit4:junit4]   2> 4048 T629 oashc.HttpShardHandlerFactory.getParameter Setting maxConnectionsPerHost to: 20
[junit4:junit4]   2> 4048 T629 oashc.HttpShardHandlerFactory.getParameter Setting corePoolSize to: 0
[junit4:junit4]   2> 4048 T629 oashc.HttpShardHandlerFactory.getParameter Setting maximumPoolSize to: 2147483647
[junit4:junit4]   2> 4049 T629 oashc.HttpShardHandlerFactory.getParameter Setting maxThreadIdleTime to: 5
[junit4:junit4]   2> 4049 T629 oashc.HttpShardHandlerFactory.getParameter Setting sizeOfQueue to: -1
[junit4:junit4]   2> 4050 T629 oashc.HttpShardHandlerFactory.getParameter Setting fairnessPolicy to: false
[junit4:junit4]   2> 4050 T629 oascsi.HttpClientUtil.createClient Creating new http client, config:maxConnectionsPerHost=20&maxConnections=10000&socketTimeout=60000&connTimeout=15000&retry=false
[junit4:junit4]   2> 4069 T629 oasc.CoreContainer.load Registering Log Listener
[junit4:junit4]   2> 4090 T629 oasc.CoreContainer.initZooKeeper Zookeeper client=127.0.0.1:37331/solr
[junit4:junit4]   2> 4091 T629 oasc.ZkController.checkChrootPath zkHost includes chroot
[junit4:junit4]   2> 4091 T629 oaz.ZooKeeper.<init> Initiating client connection, connectString=127.0.0.1:37331 sessionTimeout=60000 watcher=org.apache.solr.common.cloud.ConnectionManager@641cbaeb
[junit4:junit4]   2> 4092 T629 oascc.ConnectionManager.waitForConnected Waiting for client to connect to ZooKeeper
[junit4:junit4]   2> 4093 T667 oaz.ClientCnxn$SendThread.logStartConnect Opening socket connection to server localhost/127.0.0.1:37331. Will not attempt to authenticate using SASL (access denied (javax.security.auth.AuthPermission getLoginConfiguration))
[junit4:junit4]   2> 4093 T667 oaz.ClientCnxn$SendThread.primeConnection Socket connection established to localhost/127.0.0.1:37331, initiating session
[junit4:junit4]   2> 4094 T631 oazs.NIOServerCnxnFactory.run Accepted socket connection from /140.211.11.196:37339
[junit4:junit4]   2> 4094 T631 oazs.ZooKeeperServer.processConnectRequest Client attempting to establish new session at /140.211.11.196:37339
[junit4:junit4]   2> 4096 T633 oazs.ZooKeeperServer.finishSessionInit Established session 0x13cc9982ceb0005 with negotiated timeout 20000 for client /140.211.11.196:37339
[junit4:junit4]   2> 4096 T667 oaz.ClientCnxn$SendThread.onConnected Session establishment complete on server localhost/127.0.0.1:37331, sessionid = 0x13cc9982ceb0005, negotiated timeout = 20000
[junit4:junit4]   2> 4096 T668 oascc.ConnectionManager.process Watcher org.apache.solr.common.cloud.ConnectionManager@641cbaeb name:ZooKeeperConnection Watcher:127.0.0.1:37331 got event WatchedEvent state:SyncConnected type:None path:null path:null type:None
[junit4:junit4]   2> 4097 T629 oascc.ConnectionManager.waitForConnected Client is connected to ZooKeeper
[junit4:junit4]   2> 4098 T634 oazs.PrepRequestProcessor.pRequest2Txn Processed session termination for sessionid: 0x13cc9982ceb0005
[junit4:junit4]   2> 4107 T631 oazs.NIOServerCnxn.closeSock Closed socket connection for client /140.211.11.196:37339 which had sessionid 0x13cc9982ceb0005
[junit4:junit4]   2> 4110 T668 oaz.ClientCnxn$EventThread.run EventThread shut down
[junit4:junit4]   2> 4110 T629 oaz.ZooKeeper.close Session: 0x13cc9982ceb0005 closed
[junit4:junit4]   2> 4111 T629 oascsi.HttpClientUtil.createClient Creating new http client, config:maxConnections=500&maxConnectionsPerHost=16&socketTimeout=60000&connTimeout=15000
[junit4:junit4]   2> 4121 T629 oaz.ZooKeeper.<init> Initiating client connection, connectString=127.0.0.1:37331/solr sessionTimeout=30000 watcher=org.apache.solr.common.cloud.ConnectionManager@4d2d1f6d
[junit4:junit4]   2> 4122 T629 oascc.ConnectionManager.waitForConnected Waiting for client to connect to ZooKeeper
[junit4:junit4]   2> 4122 T669 oaz.ClientCnxn$SendThread.logStartConnect Opening socket connection to server localhost/127.0.0.1:37331. Will not attempt to authenticate using SASL (access denied (javax.security.auth.AuthPermission getLoginConfiguration))
[junit4:junit4]   2> 4122 T669 oaz.ClientCnxn$SendThread.primeConnection Socket connection established to localhost/127.0.0.1:37331, initiating session
[junit4:junit4]   2> 4122 T631 oazs.NIOServerCnxnFactory.run Accepted socket connection from /140.211.11.196:37340
[junit4:junit4]   2> 4123 T631 oazs.ZooKeeperServer.processConnectRequest Client attempting to establish new session at /140.211.11.196:37340
[junit4:junit4]   2> 4124 T633 oazs.ZooKeeperServer.finishSessionInit Established session 0x13cc9982ceb0006 with negotiated timeout 20000 for client /140.211.11.196:37340
[junit4:junit4]   2> 4124 T669 oaz.ClientCnxn$SendThread.onConnected Session establishment complete on server localhost/127.0.0.1:37331, sessionid = 0x13cc9982ceb0006, negotiated timeout = 20000
[junit4:junit4]   2> 4124 T670 oascc.ConnectionManager.process Watcher org.apache.solr.common.cloud.ConnectionManager@4d2d1f6d name:ZooKeeperConnection Watcher:127.0.0.1:37331/solr got event WatchedEvent state:SyncConnected type:None path:null path:null type:None
[junit4:junit4]   2> 4125 T629 oascc.ConnectionManager.waitForConnected Client is connected to ZooKeeper
[junit4:junit4]   2> 4126 T634 oazs.PrepRequestProcessor.pRequest Got user-level KeeperException when processing sessionid:0x13cc9982ceb0006 type:create cxid:0x1 zxid:0x49 txntype:-1 reqpath:n/a Error Path:/solr/overseer Error:KeeperErrorCode = NodeExists for /solr/overseer
[junit4:junit4]   2> 4127 T634 oazs.PrepRequestProcessor.pRequest Got user-level KeeperException when processing sessionid:0x13cc9982ceb0006 type:create cxid:0x2 zxid:0x4a txntype:-1 reqpath:n/a Error Path:/solr/overseer Error:KeeperErrorCode = NodeExists for /solr/overseer
[junit4:junit4]   2> 4136 T629 oascc.ZkStateReader.createClusterStateWatchersAndUpdate Updating cluster state from ZooKeeper... 
[junit4:junit4]   2> 4138 T629 oasc.ZkController.createEphemeralLiveNode Register node as live in ZooKeeper:/live_nodes/127.0.0.1:37338_
[junit4:junit4]   2> 4139 T634 oazs.PrepRequestProcessor.pRequest Got user-level KeeperException when processing sessionid:0x13cc9982ceb0006 type:delete cxid:0x9 zxid:0x4b txntype:-1 reqpath:n/a Error Path:/solr/live_nodes/127.0.0.1:37338_ Error:KeeperErrorCode = NoNode for /solr/live_nodes/127.0.0.1:37338_
[junit4:junit4]   2> 4140 T629 oascc.SolrZkClient.makePath makePath: /live_nodes/127.0.0.1:37338_
[junit4:junit4]   2> 4143 T651 oascc.ZkStateReader$2.process A cluster state change: WatchedEvent state:SyncConnected type:NodeChildrenChanged path:/live_nodes, has occurred - updating... (live nodes size: 1)
[junit4:junit4]   2> 4144 T670 oascc.ZkStateReader$3.process Updating live nodes... (2)
[junit4:junit4]   2> 4144 T657 oascc.ZkStateReader$3.process Updating live nodes... (2)
[junit4:junit4]   2> 4145 T651 oascc.ZkStateReader$3.process Updating live nodes... (2)
[junit4:junit4]   2> 4156 T671 oasc.CoreContainer.create Creating SolrCore 'collection1' using instanceDir: /usr/home/hudson/hudson-slave/workspace/Lucene-Solr-Tests-trunk-Java6/solr/build/solr-core/test/J0/./org.apache.solr.cloud.SyncSliceTest-jetty1-1360591862744/collection1
[junit4:junit4]   2> 4156 T671 oasc.ZkController.createCollectionZkNode Check for collection zkNode:collection1
[junit4:junit4]   2> 4157 T671 oasc.ZkController.createCollectionZkNode Collection zkNode exists
[junit4:junit4]   2> 4157 T671 oasc.ZkController.readConfigName Load collection config from:/collections/collection1
[junit4:junit4]   2> 4159 T671 oasc.SolrResourceLoader.<init> new SolrResourceLoader for directory: '/usr/home/hudson/hudson-slave/workspace/Lucene-Solr-Tests-trunk-Java6/solr/build/solr-core/test/J0/./org.apache.solr.cloud.SyncSliceTest-jetty1-1360591862744/collection1/'
[junit4:junit4]   2> 4160 T671 oasc.SolrResourceLoader.replaceClassLoader Adding 'file:/usr/home/hudson/hudson-slave/workspace/Lucene-Solr-Tests-trunk-Java6/solr/build/solr-core/test/J0/org.apache.solr.cloud.SyncSliceTest-jetty1-1360591862744/collection1/lib/README' to classloader
[junit4:junit4]   2> 4160 T671 oasc.SolrResourceLoader.replaceClassLoader Adding 'file:/usr/home/hudson/hudson-slave/workspace/Lucene-Solr-Tests-trunk-Java6/solr/build/solr-core/test/J0/org.apache.solr.cloud.SyncSliceTest-jetty1-1360591862744/collection1/lib/classes/' to classloader
[junit4:junit4]   2> 4214 T671 oasc.SolrConfig.<init> Using Lucene MatchVersion: LUCENE_50
[junit4:junit4]   2> 4284 T671 oasc.SolrConfig.<init> Loaded SolrConfig: solrconfig.xml
[junit4:junit4]   2> 4385 T671 oass.IndexSchema.readSchema Reading Solr Schema
[junit4:junit4]   2> 4392 T671 oass.IndexSchema.readSchema Schema name=test
[junit4:junit4]   2> 4995 T671 oass.OpenExchangeRatesOrgProvider.init Initialized with rates=open-exchange-rates.json, refreshInterval=1440.
[junit4:junit4]   2> 5007 T671 oass.IndexSchema.readSchema default search field in schema is text
[junit4:junit4]   2> 5010 T671 oass.IndexSchema.readSchema unique key field: id
[junit4:junit4]   2> 5023 T671 oass.FileExchangeRateProvider.reload Reloading exchange rates from file currency.xml
[junit4:junit4]   2> 5027 T671 oass.FileExchangeRateProvider.reload Reloading exchange rates from file currency.xml
[junit4:junit4]   2> 5030 T671 oass.OpenExchangeRatesOrgProvider.reload Reloading exchange rates from open-exchange-rates.json
[junit4:junit4]   2> 5031 T671 oass.OpenExchangeRatesOrgProvider.reload Reloading exchange rates from open-exchange-rates.json
[junit4:junit4]   2> 5032 T671 oasc.SolrCore.<init> [collection1] Opening new SolrCore at /usr/home/hudson/hudson-slave/workspace/Lucene-Solr-Tests-trunk-Java6/solr/build/solr-core/test/J0/./org.apache.solr.cloud.SyncSliceTest-jetty1-1360591862744/collection1/, dataDir=./org.apache.solr.cloud.SyncSliceTest-1360591858916/jetty1/
[junit4:junit4]   2> 5033 T671 oasc.JmxMonitoredMap.<init> JMX monitoring is enabled. Adding Solr mbeans to JMX Server: com.sun.jmx.mbeanserver.JmxMBeanServer@18330bf
[junit4:junit4]   2> 5033 T671 oasc.SolrCore.initDirectoryFactory solr.NRTCachingDirectoryFactory
[junit4:junit4]   2> 5034 T671 oasc.CachingDirectoryFactory.get return new directory for /usr/home/hudson/hudson-slave/workspace/Lucene-Solr-Tests-trunk-Java6/solr/build/solr-core/test/J0/./org.apache.solr.cloud.SyncSliceTest-1360591858916/jetty1 forceNew:false
[junit4:junit4]   2> 5034 T671 oasc.CachingDirectoryFactory.close Releasing directory:/usr/home/hudson/hudson-slave/workspace/Lucene-Solr-Tests-trunk-Java6/solr/build/solr-core/test/J0/./org.apache.solr.cloud.SyncSliceTest-1360591858916/jetty1
[junit4:junit4]   2> 5034 T671 oasc.SolrCore.getNewIndexDir New index directory detected: old=null new=./org.apache.solr.cloud.SyncSliceTest-1360591858916/jetty1/index/
[junit4:junit4]   2> 5035 T671 oasc.SolrCore.initIndex WARNING [collection1] Solr index directory './org.apache.solr.cloud.SyncSliceTest-1360591858916/jetty1/index' doesn't exist. Creating new index...
[junit4:junit4]   2> 5035 T671 oasc.CachingDirectoryFactory.get return new directory for /usr/home/hudson/hudson-slave/workspace/Lucene-Solr-Tests-trunk-Java6/solr/build/solr-core/test/J0/./org.apache.solr.cloud.SyncSliceTest-1360591858916/jetty1/index forceNew:false
[junit4:junit4]   2> 5043 T671 oasc.SolrDeletionPolicy.onCommit SolrDeletionPolicy.onCommit: commits:num=1
[junit4:junit4]   2> 		commit{dir=RateLimitedDirectoryWrapper(NRTCachingDirectory(org.apache.lucene.store.NIOFSDirectory@/usr/home/hudson/hudson-slave/workspace/Lucene-Solr-Tests-trunk-Java6/solr/build/solr-core/test/J0/org.apache.solr.cloud.SyncSliceTest-1360591858916/jetty1/index lockFactory=org.apache.lucene.store.NativeFSLockFactory@6e3b11bd; maxCacheMB=48.0 maxMergeSizeMB=4.0)),segFN=segments_1,generation=1,filenames=[segments_1]
[junit4:junit4]   2> 5043 T671 oasc.SolrDeletionPolicy.updateCommits newest commit = 1[segments_1]
[junit4:junit4]   2> 5044 T671 oasc.CachingDirectoryFactory.close Releasing directory:/usr/home/hudson/hudson-slave/workspace/Lucene-Solr-Tests-trunk-Java6/solr/build/solr-core/test/J0/./org.apache.solr.cloud.SyncSliceTest-1360591858916/jetty1/index
[junit4:junit4]   2> 5044 T671 oasc.SolrCore.initWriters created xml: solr.XMLResponseWriter
[junit4:junit4]   2> 5045 T671 oasup.UpdateRequestProcessorChain.init inserting DistributedUpdateProcessorFactory into updateRequestProcessorChain "dedupe"
[junit4:junit4]   2> 5045 T671 oasup.UpdateRequestProcessorChain.init inserting DistributedUpdateProcessorFactory into updateRequestProcessorChain "dedupe-allfields"
[junit4:junit4]   2> 5046 T671 oasup.UpdateRequestProcessorChain.init inserting DistributedUpdateProcessorFactory into updateRequestProcessorChain "stored_sig"
[junit4:junit4]   2> 5046 T671 oasup.UpdateRequestProcessorChain.init inserting DistributedUpdateProcessorFactory into updateRequestProcessorChain "uniq-fields"
[junit4:junit4]   2> 5046 T671 oasup.UpdateRequestProcessorChain.init inserting DistributedUpdateProcessorFactory into updateRequestProcessorChain "distrib-dup-test-chain-implicit"
[junit4:junit4]   2> 5046 T671 oasc.RequestHandlers.initHandlersFromConfig adding lazy requestHandler: solr.ReplicationHandler
[junit4:junit4]   2> 5047 T671 oasc.RequestHandlers.initHandlersFromConfig created /replication: solr.ReplicationHandler
[junit4:junit4]   2> 5047 T671 oasc.RequestHandlers.initHandlersFromConfig created standard: solr.StandardRequestHandler
[junit4:junit4]   2> 5047 T671 oasc.RequestHandlers.initHandlersFromConfig created /get: solr.RealTimeGetHandler
[junit4:junit4]   2> 5048 T671 oasc.RequestHandlers.initHandlersFromConfig created dismax: solr.SearchHandler
[junit4:junit4]   2> 5048 T671 oasc.RequestHandlers.initHandlersFromConfig created mock: org.apache.solr.core.MockQuerySenderListenerReqHandler
[junit4:junit4]   2> 5048 T671 oasc.RequestHandlers.initHandlersFromConfig created /admin/: org.apache.solr.handler.admin.AdminHandlers
[junit4:junit4]   2> 5049 T671 oasc.RequestHandlers.initHandlersFromConfig created defaults: solr.StandardRequestHandler
[junit4:junit4]   2> 5049 T671 oasc.RequestHandlers.initHandlersFromConfig adding lazy requestHandler: solr.StandardRequestHandler
[junit4:junit4]   2> 5049 T671 oasc.RequestHandlers.initHandlersFromConfig created lazy: solr.StandardRequestHandler
[junit4:junit4]   2> 5049 T671 oasc.RequestHandlers.initHandlersFromConfig created /update: solr.UpdateRequestHandler
[junit4:junit4]   2> 5050 T671 oasc.RequestHandlers.initHandlersFromConfig created /terms: org.apache.solr.handler.component.SearchHandler
[junit4:junit4]   2> 5050 T671 oasc.RequestHandlers.initHandlersFromConfig created spellCheckCompRH: org.apache.solr.handler.component.SearchHandler
[junit4:junit4]   2> 5051 T671 oasc.RequestHandlers.initHandlersFromConfig created spellCheckCompRH_Direct: org.apache.solr.handler.component.SearchHandler
[junit4:junit4]   2> 5051 T671 oasc.RequestHandlers.initHandlersFromConfig created spellCheckWithWordbreak: org.apache.solr.handler.component.SearchHandler
[junit4:junit4]   2> 5051 T671 oasc.RequestHandlers.initHandlersFromConfig created spellCheckWithWordbreak_Direct: org.apache.solr.handler.component.SearchHandler
[junit4:junit4]   2> 5052 T671 oasc.RequestHandlers.initHandlersFromConfig created spellCheckCompRH1: org.apache.solr.handler.component.SearchHandler
[junit4:junit4]   2> 5052 T671 oasc.RequestHandlers.initHandlersFromConfig created mltrh: org.apache.solr.handler.component.SearchHandler
[junit4:junit4]   2> 5052 T671 oasc.RequestHandlers.initHandlersFromConfig created tvrh: org.apache.solr.handler.component.SearchHandler
[junit4:junit4]   2> 5053 T671 oasc.RequestHandlers.initHandlersFromConfig created /mlt: solr.MoreLikeThisHandler
[junit4:junit4]   2> 5053 T671 oasc.RequestHandlers.initHandlersFromConfig created /debug/dump: solr.DumpRequestHandler
[junit4:junit4]   2> 5058 T671 oashl.XMLLoader.init xsltCacheLifetimeSeconds=60
[junit4:junit4]   2> 5061 T671 oasc.SolrCore.initDeprecatedSupport WARNING solrconfig.xml uses deprecated <admin/gettableFiles>, Please update your config to use the ShowFileRequestHandler.
[junit4:junit4]   2> 5062 T671 oasc.SolrCore.initDeprecatedSupport WARNING adding ShowFileRequestHandler with hidden files: [SCHEMA.XML, OLD_SYNONYMS.TXT, STOPWORDS.TXT, PROTWORDS.TXT, OPEN-EXCHANGE-RATES.JSON, SYNONYMS.TXT, CURRENCY.XML, MAPPING-ISOLATIN1ACCENT.TXT]
[junit4:junit4]   2> 5063 T671 oasc.CachingDirectoryFactory.close Releasing directory:/usr/home/hudson/hudson-slave/workspace/Lucene-Solr-Tests-trunk-Java6/solr/build/solr-core/test/J0/./org.apache.solr.cloud.SyncSliceTest-1360591858916/jetty1
[junit4:junit4]   2> 5065 T671 oass.SolrIndexSearcher.<init> Opening Searcher@5e0dc0 main
[junit4:junit4]   2> 5065 T671 oasu.CommitTracker.<init> Hard AutoCommit: disabled
[junit4:junit4]   2> 5065 T671 oasu.CommitTracker.<init> Soft AutoCommit: disabled
[junit4:junit4]   2> 5066 T671 oashc.SpellCheckComponent.inform Initializing spell checkers
[junit4:junit4]   2> 5071 T671 oass.DirectSolrSpellChecker.init init: {name=direct,classname=DirectSolrSpellChecker,field=lowerfilt,minQueryLength=3}
[junit4:junit4]   2> 5118 T672 oasc.SolrCore.registerSearcher [collection1] Registered new searcher Searcher@5e0dc0 main{StandardDirectoryReader(segments_1:1)}
[junit4:junit4]   2> 5121 T671 oasc.ZkController.publish publishing core=collection1 state=down
[junit4:junit4]   2> 5121 T671 oasc.ZkController.publish numShards not found on descriptor - reading it from system property
[junit4:junit4]   2> 5248 T652 oascc.ZkStateReader.updateClusterState Updating cloud state from ZooKeeper... 
[junit4:junit4]   2> 5248 T652 oasc.Overseer$ClusterStateUpdater.updateState Update state numShards=1 message={
[junit4:junit4]   2> 	  "operation":"state",
[junit4:junit4]   2> 	  "numShards":"1",
[junit4:junit4]   2> 	  "shard":"shard1",
[junit4:junit4]   2> 	  "roles":null,
[junit4:junit4]   2> 	  "state":"active",
[junit4:junit4]   2> 	  "core":"collection1",
[junit4:junit4]   2> 	  "collection":"control_collection",
[junit4:junit4]   2> 	  "node_name":"127.0.0.1:37334_",
[junit4:junit4]   2> 	  "base_url":"http://127.0.0.1:37334"}
[junit4:junit4]   2> 5253 T652 oasc.Overseer$ClusterStateUpdater.updateState Update state numShards=1 message={
[junit4:junit4]   2> 	  "operation":"state",
[junit4:junit4]   2> 	  "numShards":"1",
[junit4:junit4]   2> 	  "shard":null,
[junit4:junit4]   2> 	  "roles":null,
[junit4:junit4]   2> 	  "state":"down",
[junit4:junit4]   2> 	  "core":"collection1",
[junit4:junit4]   2> 	  "collection":"collection1",
[junit4:junit4]   2> 	  "node_name":"127.0.0.1:37338_",
[junit4:junit4]   2> 	  "base_url":"http://127.0.0.1:37338"}
[junit4:junit4]   2> 5253 T652 oasc.Overseer$ClusterStateUpdater.createCollection Create collection collection1 with numShards 1
[junit4:junit4]   2> 5253 T652 oasc.Overseer$ClusterStateUpdater.updateState Assigning new node to shard shard=shard1
[junit4:junit4]   2> 5264 T670 oascc.ZkStateReader$2.process A cluster state change: WatchedEvent state:SyncConnected type:NodeDataChanged path:/clusterstate.json, has occurred - updating... (live nodes size: 2)
[junit4:junit4]   2> 5264 T657 oascc.ZkStateReader$2.process A cluster state change: WatchedEvent state:SyncConnected type:NodeDataChanged path:/clusterstate.json, has occurred - updating... (live nodes size: 2)
[junit4:junit4]   2> 5264 T651 oascc.ZkStateReader$2.process A cluster state change: WatchedEvent state:SyncConnected type:NodeDataChanged path:/clusterstate.json, has occurred - updating... (live nodes size: 2)
[junit4:junit4]   2> 6123 T671 oasc.CoreContainer.registerCore registering core: collection1
[junit4:junit4]   2> 6123 T671 oasc.ZkController.register Register replica - core:collection1 address:http://127.0.0.1:37338 collection:collection1 shard:shard1
[junit4:junit4]   2> 6125 T671 oascc.SolrZkClient.makePath makePath: /collections/collection1/leader_elect/shard1/election
[junit4:junit4]   2> 6133 T634 oazs.PrepRequestProcessor.pRequest Got user-level KeeperException when processing sessionid:0x13cc9982ceb0006 type:delete cxid:0x45 zxid:0x5a txntype:-1 reqpath:n/a Error Path:/solr/collections/collection1/leaders Error:KeeperErrorCode = NoNode for /solr/collections/collection1/leaders
[junit4:junit4]   2> 6134 T671 oasc.ShardLeaderElectionContext.runLeaderProcess Running the leader process.
[junit4:junit4]   2> 6135 T634 oazs.PrepRequestProcessor.pRequest Got user-level KeeperException when processing sessionid:0x13cc9982ceb0006 type:create cxid:0x46 zxid:0x5b txntype:-1 reqpath:n/a Error Path:/solr/overseer Error:KeeperErrorCode = NodeExists for /solr/overseer
[junit4:junit4]   2> 6145 T671 oasc.ShardLeaderElectionContext.waitForReplicasToComeUp Enough replicas found to continue.
[junit4:junit4]   2> 6146 T671 oasc.ShardLeaderElectionContext.runLeaderProcess I may be the new leader - try and sync
[junit4:junit4]   2> 6146 T671 oasc.SyncStrategy.sync Sync replicas to http://127.0.0.1:37338/collection1/
[junit4:junit4]   2> 6146 T671 oasc.SyncStrategy.syncReplicas Sync Success - now sync replicas to me
[junit4:junit4]   2> 6146 T671 oasc.SyncStrategy.syncToMe http://127.0.0.1:37338/collection1/ has no replicas
[junit4:junit4]   2> 6147 T671 oasc.ShardLeaderElectionContext.runLeaderProcess I am the new leader: http://127.0.0.1:37338/collection1/
[junit4:junit4]   2> 6147 T671 oascc.SolrZkClient.makePath makePath: /collections/collection1/leaders/shard1
[junit4:junit4]   2> 6153 T634 oazs.PrepRequestProcessor.pRequest Got user-level KeeperException when processing sessionid:0x13cc9982ceb0006 type:create cxid:0x50 zxid:0x5f txntype:-1 reqpath:n/a Error Path:/solr/overseer Error:KeeperErrorCode = NodeExists for /solr/overseer
[junit4:junit4]   2> 6780 T652 oascc.ZkStateReader.updateClusterState Updating cloud state from ZooKeeper... 
[junit4:junit4]   2> 6798 T651 oascc.ZkStateReader$2.process A cluster state change: WatchedEvent state:SyncConnected type:NodeDataChanged path:/clusterstate.json, has occurred - updating... (live nodes size: 2)
[junit4:junit4]   2> 6798 T670 oascc.ZkStateReader$2.process A cluster state change: WatchedEvent state:SyncConnected type:NodeDataChanged path:/clusterstate.json, has occurred - updating... (live nodes size: 2)
[junit4:junit4]   2> 6798 T657 oascc.ZkStateReader$2.process A cluster state change: WatchedEvent state:SyncConnected type:NodeDataChanged path:/clusterstate.json, has occurred - updating... (live nodes size: 2)
[junit4:junit4]   2> 6827 T671 oasc.ZkController.register We are http://127.0.0.1:37338/collection1/ and leader is http://127.0.0.1:37338/collection1/
[junit4:junit4]   2> 6827 T671 oasc.ZkController.register No LogReplay needed for core=collection1 baseURL=http://127.0.0.1:37338
[junit4:junit4]   2> 6827 T671 oasc.ZkController.checkRecovery I am the leader, no recovery necessary
[junit4:junit4]   2> 6827 T671 oasc.ZkController.publish publishing core=collection1 state=active
[junit4:junit4]   2> 6827 T671 oasc.ZkController.publish numShards not found on descriptor - reading it from system property
[junit4:junit4]   2> 6829 T671 oascc.ZkStateReader.updateClusterState Updating cloud state from ZooKeeper... 
[junit4:junit4]   2> 6830 T629 oass.SolrDispatchFilter.init user.dir=/usr/home/hudson/hudson-slave/workspace/Lucene-Solr-Tests-trunk-Java6/solr/build/solr-core/test/J0
[junit4:junit4]   2> 6831 T629 oass.SolrDispatchFilter.init SolrDispatchFilter.init() done
[junit4:junit4]   2> 6832 T629 oascsi.HttpClientUtil.createClient Creating new http client, config:maxConnections=128&maxConnectionsPerHost=32&followRedirects=false
[junit4:junit4]   2> 7030 T629 oejs.Server.doStart jetty-8.1.8.v20121106
[junit4:junit4]   2> 7033 T629 oejs.AbstractConnector.doStart Started SocketConnector@127.0.0.1:37341
[junit4:junit4]   2> 7034 T629 oass.SolrDispatchFilter.init SolrDispatchFilter.init()
[junit4:junit4]   2> 7034 T629 oasc.SolrResourceLoader.locateSolrHome JNDI not configured for solr (NoInitialContextEx)
[junit4:junit4]   2> 7035 T629 oasc.SolrResourceLoader.locateSolrHome using system property solr.solr.home: /usr/home/hudson/hudson-slave/workspace/Lucene-Solr-Tests-trunk-Java6/solr/build/solr-core/test/J0/./org.apache.solr.cloud.SyncSliceTest-jetty2-1360591865759
[junit4:junit4]   2> 7035 T629 oasc.CoreContainer$Initializer.initialize looking for solr.xml: /usr/home/hudson/hudson-slave/workspace/Lucene-Solr-Tests-trunk-Java6/solr/build/solr-core/test/J0/./org.apache.solr.cloud.SyncSliceTest-jetty2-1360591865759/solr.xml
[junit4:junit4]   2> 7035 T629 oasc.CoreContainer.<init> New CoreContainer 857181635
[junit4:junit4]   2> 7036 T629 oasc.CoreContainer.load Loading CoreContainer using Solr Home: '/usr/home/hudson/hudson-slave/workspace/Lucene-Solr-Tests-trunk-Java6/solr/build/solr-core/test/J0/./org.apache.solr.cloud.SyncSliceTest-jetty2-1360591865759/'
[junit4:junit4]   2> 7037 T629 oasc.SolrResourceLoader.<init> new SolrResourceLoader for directory: '/usr/home/hudson/hudson-slave/workspace/Lucene-Solr-Tests-trunk-Java6/solr/build/solr-core/test/J0/./org.apache.solr.cloud.SyncSliceTest-jetty2-1360591865759/'
[junit4:junit4]   2> 7089 T629 oashc.HttpShardHandlerFactory.getParameter Setting socketTimeout to: 60000
[junit4:junit4]   2> 7090 T629 oashc.HttpShardHandlerFactory.getParameter Setting urlScheme to: http://
[junit4:junit4]   2> 7090 T629 oashc.HttpShardHandlerFactory.getParameter Setting connTimeout to: 15000
[junit4:junit4]   2> 7090 T629 oashc.HttpShardHandlerFactory.getParameter Setting maxConnectionsPerHost to: 20
[junit4:junit4]   2> 7091 T629 oashc.HttpShardHandlerFactory.getParameter Setting corePoolSize to: 0
[junit4:junit4]   2> 7091 T629 oashc.HttpShardHandlerFactory.getParameter Setting maximumPoolSize to: 2147483647
[junit4:junit4]   2> 7092 T629 oashc.HttpShardHandlerFactory.getParameter Setting maxThreadIdleTime to: 5
[junit4:junit4]   2> 7092 T629 oashc.HttpShardHandlerFactory.getParameter Setting sizeOfQueue to: -1
[junit4:junit4]   2> 7092 T629 oashc.HttpShardHandlerFactory.getParameter Setting fairnessPolicy to: false
[junit4:junit4]   2> 7093 T629 oascsi.HttpClientUtil.createClient Creating new http client, config:maxConnectionsPerHost=20&maxConnections=10000&socketTimeout=60000&connTimeout=15000&retry=false
[junit4:junit4]   2> 7116 T629 oasc.CoreContainer.load Registering Log Listener
[junit4:junit4]   2> 7136 T629 oasc.CoreContainer.initZooKeeper Zookeeper client=127.0.0.1:37331/solr
[junit4:junit4]   2> 7136 T629 oasc.ZkController.checkChrootPath zkHost includes chroot
[junit4:junit4]   2> 7137 T629 oaz.ZooKeeper.<init> Initiating client connection, connectString=127.0.0.1:37331 sessionTimeout=60000 watcher=org.apache.solr.common.cloud.ConnectionManager@27051733
[junit4:junit4]   2> 7138 T629 oascc.ConnectionManager.waitForConnected Waiting for client to connect to ZooKeeper
[junit4:junit4]   2> 7138 T682 oaz.ClientCnxn$SendThread.logStartConnect Opening socket connection to server localhost/127.0.0.1:37331. Will not attempt to authenticate using SASL (access denied (javax.security.auth.AuthPermission getLoginConfiguration))
[junit4:junit4]   2> 7139 T682 oaz.ClientCnxn$SendThread.primeConnection Socket connection established to localhost/127.0.0.1:37331, initiating session
[junit4:junit4]   2> 7140 T631 oazs.NIOServerCnxnFactory.run Accepted socket connection from /140.211.11.196:37342
[junit4:junit4]   2> 7140 T631 oazs.ZooKeeperServer.processConnectRequest Client attempting to establish new session at /140.211.11.196:37342
[junit4:junit4]   2> 7142 T633 oazs.ZooKeeperServer.finishSessionInit Established session 0x13cc9982ceb0007 with negotiated timeout 20000 for client /140.211.11.196:37342
[junit4:junit4]   2> 7142 T682 oaz.ClientCnxn$SendThread.onConnected Session establishment complete on server localhost/127.0.0.1:37331, sessionid = 0x13cc9982ceb0007, negotiated timeout = 20000
[junit4:junit4]   2> 7142 T683 oascc.ConnectionManager.process Watcher org.apache.solr.common.cloud.ConnectionManager@27051733 name:ZooKeeperConnection Watcher:127.0.0.1:37331 got event WatchedEvent state:SyncConnected type:None path:null path:null type:None
[junit4:junit4]   2> 7143 T629 oascc.ConnectionManager.waitForConnected Client is connected to ZooKeeper
[junit4:junit4]   2> 7144 T634 oazs.PrepRequestProcessor.pRequest2Txn Processed session termination for sessionid: 0x13cc9982ceb0007
[junit4:junit4]   2> 7164 T683 oaz.ClientCnxn$EventThread.run EventThread shut down
[junit4:junit4]   2> 7164 T631 oazs.NIOServerCnxn.closeSock Closed socket connection for client /140.211.11.196:37342 which had sessionid 0x13cc9982ceb0007
[junit4:junit4]   2> 7164 T629 oaz.ZooKeeper.close Session: 0x13cc9982ceb0007 closed
[junit4:junit4]   2> 7165 T629 oascsi.HttpClientUtil.createClient Creating new http client, config:maxConnections=500&maxConnectionsPerHost=16&socketTimeout=60000&connTimeout=15000
[junit4:junit4]   2> 7177 T629 oaz.ZooKeeper.<init> Initiating client connection, connectString=127.0.0.1:37331/solr sessionTimeout=30000 watcher=org.apache.solr.common.cloud.ConnectionManager@1d192738
[junit4:junit4]   2> 7178 T629 oascc.ConnectionManager.waitForConnected Waiting for client to connect to ZooKeeper
[junit4:junit4]   2> 7178 T684 oaz.ClientCnxn$SendThread.logStartConnect Opening socket connection to server localhost/127.0.0.1:37331. Will not attempt to authenticate using SASL (access denied (javax.security.auth.AuthPermission getLoginConfiguration))
[junit4:junit4]   2> 7179 T684 oaz.ClientCnxn$SendThread.primeConnection Socket connection established to localhost/127.0.0.1:37331, initiating session
[junit4:junit4]   2> 7179 T631 oazs.NIOServerCnxnFactory.run Accepted socket connection from /140.211.11.196:37343
[junit4:junit4]   2> 7179 T631 oazs.ZooKeeperServer.processConnectRequest Client attempting to establish new session at /140.211.11.196:37343
[junit4:junit4]   2> 7180 T633 oazs.ZooKeeperServer.finishSessionInit Established session 0x13cc9982ceb0008 with negotiated timeout 20000 for client /140.211.11.196:37343
[junit4:junit4]   2> 7180 T684 oaz.ClientCnxn$SendThread.onConnected Session establishment complete on server localhost/127.0.0.1:37331, sessionid = 0x13cc9982ceb0008, negotiated timeout = 20000
[junit4:junit4]   2> 7181 T685 oascc.ConnectionManager.process Watcher org.apache.solr.common.cloud.ConnectionManager@1d192738 name:ZooKeeperConnection Watcher:127.0.0.1:37331/solr got event WatchedEvent state:SyncConnected type:None path:null path:null type:None
[junit4:junit4]   2> 7181 T629 oascc.ConnectionManager.waitForConnected Client is connected to ZooKeeper
[junit4:junit4]   2> 7182 T634 oazs.PrepRequestProcessor.pRequest Got user-level KeeperException when processing sessionid:0x13cc9982ceb0008 type:create cxid:0x1 zxid:0x6c txntype:-1 reqpath:n/a Error Path:/solr/overseer Error:KeeperErrorCode = NodeExists for /solr/overseer
[junit4:junit4]   2> 7184 T634 oazs.PrepRequestProcessor.pRequest Got user-level KeeperException when processing sessionid:0x13cc9982ceb0008 type:create cxid:0x2 zxid:0x6d txntype:-1 reqpath:n/a Error Path:/solr/overseer Error:KeeperErrorCode = NodeExists for /solr/overseer
[junit4:junit4]   2> 7186 T629 oascc.ZkStateReader.createClusterStateWatchersAndUpdate Updating cluster state from ZooKeeper... 
[junit4:junit4]   2> 7188 T629 oasc.ZkController.createEphemeralLiveNode Register node as live in ZooKeeper:/live_nodes/127.0.0.1:37341_
[junit4:junit4]   2> 7189 T634 oazs.PrepRequestProcessor.pRequest Got user-level KeeperException when processing sessionid:0x13cc9982ceb0008 type:delete cxid:0x9 zxid:0x6e txntype:-1 reqpath:n/a Error Path:/solr/live_nodes/127.0.0.1:37341_ Error:KeeperErrorCode = NoNode for /solr/live_nodes/127.0.0.1:37341_
[junit4:junit4]   2> 7190 T629 oascc.SolrZkClient.makePath makePath: /live_nodes/127.0.0.1:37341_
[junit4:junit4]   2> 7192 T651 oascc.ZkStateReader$2.process A cluster state change: WatchedEvent state:SyncConnected type:NodeChildrenChanged path:/live_nodes, has occurred - updating... (live nodes size: 2)
[junit4:junit4]   2> 7193 T657 oascc.ZkStateReader$3.process Updating live nodes... (3)
[junit4:junit4]   2> 7193 T670 oascc.ZkStateReader$3.process Updating live nodes... (3)
[junit4:junit4]   2> 7193 T657 oascc.ZkStateReader$2.process A cluster state change: WatchedEvent state:SyncConnected type:NodeChildrenChanged path:/live_nodes, has occurred - updating... (live nodes size: 3)
[junit4:junit4]   2> 7193 T670 oascc.ZkStateReader$2.process A cluster state change: WatchedEvent state:SyncConnected type:NodeChildrenChanged path:/live_nodes, has occurred - updating... (live nodes size: 3)
[junit4:junit4]   2> 7193 T685 oascc.ZkStateReader$3.process Updating live nodes... (3)
[junit4:junit4]   2> 7200 T651 oascc.ZkStateReader$3.process Updating live nodes... (3)
[junit4:junit4]   2> 7210 T686 oasc.CoreContainer.create Creating SolrCore 'collection1' using instanceDir: /usr/home/hudson/hudson-slave/workspace/Lucene-Solr-Tests-trunk-Java6/solr/build/solr-core/test/J0/./org.apache.solr.cloud.SyncSliceTest-jetty2-1360591865759/collection1
[junit4:junit4]   2> 7210 T686 oasc.ZkController.createCollectionZkNode Check for collection zkNode:collection1
[junit4:junit4]   2> 7211 T686 oasc.ZkController.createCollectionZkNode Collection zkNode exists
[junit4:junit4]   2> 7211 T686 oasc.ZkController.readConfigName Load collection config from:/collections/collection1
[junit4:junit4]   2> 7213 T686 oasc.SolrResourceLoader.<init> new SolrResourceLoader for directory: '/usr/home/hudson/hudson-slave/workspace/Lucene-Solr-Tests-trunk-Java6/solr/build/solr-core/test/J0/./org.apache.solr.cloud.SyncSliceTest-jetty2-1360591865759/collection1/'
[junit4:junit4]   2> 7214 T686 oasc.SolrResourceLoader.replaceClassLoader Adding 'file:/usr/home/hudson/hudson-slave/workspace/Lucene-Solr-Tests-trunk-Java6/solr/build/solr-core/test/J0/org.apache.solr.cloud.SyncSliceTest-jetty2-1360591865759/collection1/lib/classes/' to classloader
[junit4:junit4]   2> 7214 T686 oasc.SolrResourceLoader.replaceClassLoader Adding 'file:/usr/home/hudson/hudson-slave/workspace/Lucene-Solr-Tests-trunk-Java6/solr/build/solr-core/test/J0/org.apache.solr.cloud.SyncSliceTest-jetty2-1360591865759/collection1/lib/README' to classloader
[junit4:junit4]   2> 7266 T686 oasc.SolrConfig.<init> Using Lucene MatchVersion: LUCENE_50
[junit4:junit4]   2> 7335 T686 oasc.SolrConfig.<init> Loaded SolrConfig: solrconfig.xml
[junit4:junit4]   2> 7436 T686 oass.IndexSchema.readSchema Reading Solr Schema
[junit4:junit4]   2> 7443 T686 oass.IndexSchema.readSchema Schema name=test
[junit4:junit4]   2> 8056 T686 oass.OpenExchangeRatesOrgProvider.init Initialized with rates=open-exchange-rates.json, refreshInterval=1440.
[junit4:junit4]   2> 8064 T686 oass.IndexSchema.readSchema default search field in schema is text
[junit4:junit4]   2> 8067 T686 oass.IndexSchema.readSchema unique key field: id
[junit4:junit4]   2> 8080 T686 oass.FileExchangeRateProvider.reload Reloading exchange rates from file currency.xml
[junit4:junit4]   2> 8084 T686 oass.FileExchangeRateProvider.reload Reloading exchange rates from file currency.xml
[junit4:junit4]   2> 8087 T686 oass.OpenExchangeRatesOrgProvider.reload Reloading exchange rates from open-exchange-rates.json
[junit4:junit4]   2> 8089 T686 oass.OpenExchangeRatesOrgProvider.reload Reloading exchange rates from open-exchange-rates.json
[junit4:junit4]   2> 8090 T686 oasc.SolrCore.<init> [collection1] Opening new SolrCore at /usr/home/hudson/hudson-slave/workspace/Lucene-Solr-Tests-trunk-Java6/solr/build/solr-core/test/J0/./org.apache.solr.cloud.SyncSliceTest-jetty2-1360591865759/collection1/, dataDir=./org.apache.solr.cloud.SyncSliceTest-1360591858916/jetty2/
[junit4:junit4]   2> 8090 T686 oasc.JmxMonitoredMap.<init> JMX monitoring is enabled. Adding Solr mbeans to JMX Server: com.sun.jmx.mbeanserver.JmxMBeanServer@18330bf
[junit4:junit4]   2> 8090 T686 oasc.SolrCore.initDirectoryFactory solr.NRTCachingDirectoryFactory
[junit4:junit4]   2> 8091 T686 oasc.CachingDirectoryFactory.get return new directory for /usr/home/hudson/hudson-slave/workspace/Lucene-Solr-Tests-trunk-Java6/solr/build/solr-core/test/J0/./org.apache.solr.cloud.SyncSliceTest-1360591858916/jetty2 forceNew:false
[junit4:junit4]   2> 8091 T686 oasc.CachingDirectoryFactory.close Releasing directory:/usr/home/hudson/hudson-slave/workspace/Lucene-Solr-Tests-trunk-Java6/solr/build/solr-core/test/J0/./org.apache.solr.cloud.SyncSliceTest-1360591858916/jetty2
[junit4:junit4]   2> 8091 T686 oasc.SolrCore.getNewIndexDir New index directory detected: old=null new=./org.apache.solr.cloud.SyncSliceTest-1360591858916/jetty2/index/
[junit4:junit4]   2> 8092 T686 oasc.SolrCore.initIndex WARNING [collection1] Solr index directory './org.apache.solr.cloud.SyncSliceTest-1360591858916/jetty2/index' doesn't exist. Creating new index...
[junit4:junit4]   2> 8093 T686 oasc.CachingDirectoryFactory.get return new directory for /usr/home/hudson/hudson-slave/workspace/Lucene-Solr-Tests-trunk-Java6/solr/build/solr-core/test/J0/./org.apache.solr.cloud.SyncSliceTest-1360591858916/jetty2/index forceNew:false
[junit4:junit4]   2> 8117 T686 oasc.SolrDeletionPolicy.onCommit SolrDeletionPolicy.onCommit: commits:num=1
[junit4:junit4]   2> 		commit{dir=RateLimitedDirectoryWrapper(NRTCachingDirectory(org.apache.lucene.store.NIOFSDirectory@/usr/home/hudson/hudson-slave/workspace/Lucene-Solr-Tests-trunk-Java6/solr/build/solr-core/test/J0/org.apache.solr.cloud.SyncSliceTest-1360591858916/jetty2/index lockFactory=org.apache.lucene.store.NativeFSLockFactory@12430cdb; maxCacheMB=48.0 maxMergeSizeMB=4.0)),segFN=segments_1,generation=1,filenames=[segments_1]
[junit4:junit4]   2> 8117 T686 oasc.SolrDeletionPolicy.updateCommits newest commit = 1[segments_1]
[junit4:junit4]   2> 8118 T686 oasc.CachingDirectoryFactory.close Releasing directory:/usr/home/hudson/hudson-slave/workspace/Lucene-Solr-Tests-trunk-Java6/solr/build/solr-core/test/J0/./org.apache.solr.cloud.SyncSliceTest-1360591858916/jetty2/index
[junit4:junit4]   2> 8119 T686 oasc.SolrCore.initWriters created xml: solr.XMLResponseWriter
[junit4:junit4]   2> 8120 T686 oasup.UpdateRequestProcessorChain.init inserting DistributedUpdateProcessorFactory into updateRequestProcessorChain "dedupe"
[junit4:junit4]   2> 8120 T686 oasup.UpdateRequestProcessorChain.init inserting DistributedUpdateProcessorFactory into updateRequestProcessorChain "dedupe-allfields"
[junit4:junit4]   2> 8120 T686 oasup.UpdateRequestProcessorChain.init inserting DistributedUpdateProcessorFactory into updateRequestProcessorChain "stored_sig"
[junit4:junit4]   2> 8121 T686 oasup.UpdateRequestProcessorChain.init inserting DistributedUpdateProcessorFactory into updateRequestProcessorChain "uniq-fields"
[junit4:junit4]   2> 8121 T686 oasup.UpdateRequestProcessorChain.init inserting DistributedUpdateProcessorFactory into updateRequestProcessorChain "distrib-dup-test-chain-implicit"
[junit4:junit4]   2> 8121 T686 oasc.RequestHandlers.initHandlersFromConfig adding lazy requestHandler: solr.ReplicationHandler
[junit4:junit4]   2> 8121 T686 oasc.RequestHandlers.initHandlersFromConfig created /replication: solr.ReplicationHandler
[junit4:junit4]   2> 8122 T686 oasc.RequestHandlers.initHandlersFromConfig created standard: solr.StandardRequestHandler
[junit4:junit4]   2> 8122 T686 oasc.RequestHandlers.initHandlersFromConfig created /get: solr.RealTimeGetHandler
[junit4:junit4]   2> 8123 T686 oasc.RequestHandlers.initHandlersFromConfig created dismax: solr.SearchHandler
[junit4:junit4]   2> 8123 T686 oasc.RequestHandlers.initHandlersFromConfig created mock: org.apache.solr.core.MockQuerySenderListenerReqHandler
[junit4:junit4]   2> 8123 T686 oasc.RequestHandlers.initHandlersFromConfig created /admin/: org.apache.solr.handler.admin.AdminHandlers
[junit4:junit4]   2> 8124 T686 oasc.RequestHandlers.initHandlersFromConfig created defaults: solr.StandardRequestHandler
[junit4:junit4]   2> 8124 T686 oasc.RequestHandlers.initHandlersFromConfig adding lazy requestHandler: solr.StandardRequestHandler
[junit4:junit4]   2> 8124 T686 oasc.RequestHandlers.initHandlersFromConfig created lazy: solr.StandardRequestHandler
[junit4:junit4]   2> 8124 T686 oasc.RequestHandlers.initHandlersFromConfig created /update: solr.UpdateRequestHandler
[junit4:junit4]   2> 8125 T686 oasc.RequestHandlers.initHandlersFromConfig created /terms: org.apache.solr.handler.component.SearchHandler
[junit4:junit4]   2> 8125 T686 oasc.RequestHandlers.initHandlersFromConfig created spellCheckCompRH: org.apache.solr.handler.component.SearchHandler
[junit4:junit4]   2> 8125 T686 oasc.RequestHandlers.initHandlersFromConfig created spellCheckCompRH_Direct: org.apache.solr.handler.component.SearchHandler
[junit4:junit4]   2> 8126 T686 oasc.RequestHandlers.initHandlersFromConfig created spellCheckWithWordbreak: org.apache.solr.handler.component.SearchHandler
[junit4:junit4]   2> 8126 T686 oasc.RequestHandlers.initHandlersFromConfig created spellCheckWithWordbreak_Direct: org.apache.solr.handler.component.SearchHandler
[junit4:junit4]   2> 8126 T686 oasc.RequestHandlers.initHandlersFromConfig created spellCheckCompRH1: org.apache.solr.handler.component.SearchHandler
[junit4:junit4]   2> 8127 T686 oasc.RequestHandlers.initHandlersFromConfig created mltrh: org.apache.solr.handler.component.SearchHandler
[junit4:junit4]   2> 8127 T686 oasc.RequestHandlers.initHandlersFromConfig created tvrh: org.apache.solr.handler.component.SearchHandler
[junit4:junit4]   2> 8128 T686 oasc.RequestHandlers.initHandlersFromConfig created /mlt: solr.MoreLikeThisHandler
[junit4:junit4]   2> 8128 T686 oasc.RequestHandlers.initHandlersFromConfig created /debug/dump: solr.DumpRequestHandler
[junit4:junit4]   2> 8135 T686 oashl.XMLLoader.init xsltCacheLifetimeSeconds=60
[junit4:junit4]   2> 8139 T686 oasc.SolrCore.initDeprecatedSupport WARNING solrconfig.xml uses deprecated <admin/gettableFiles>, Please update your config to use the ShowFileRequestHandler.
[junit4:junit4]   2> 8140 T686 oasc.SolrCore.initDeprecatedSupport WARNING adding ShowFileRequestHandler with hidden files: [SCHEMA.XML, OLD_SYNONYMS.TXT, STOPWORDS.TXT, PROTWORDS.TXT, OPEN-EXCHANGE-RATES.JSON, SYNONYMS.TXT, CURRENCY.XML, MAPPING-ISOLATIN1ACCENT.TXT]
[junit4:junit4]   2> 8145 T686 oasc.CachingDirectoryFactory.close Releasing directory:/usr/home/hudson/hudson-slave/workspace/Lucene-Solr-Tests-trunk-Java6/solr/build/solr-core/test/J0/./org.apache.solr.cloud.SyncSliceTest-1360591858916/jetty2
[junit4:junit4]   2> 8146 T686 oass.SolrIndexSearcher.<init> Opening Searcher@31e4c806 main
[junit4:junit4]   2> 8147 T686 oasu.CommitTracker.<init> Hard AutoCommit: disabled
[junit4:junit4]   2> 8147 T686 oasu.CommitTracker.<init> Soft AutoCommit: disabled
[junit4:junit4]   2> 8148 T686 oashc.SpellCheckComponent.inform Initializing spell checkers
[junit4:junit4]   2> 8156 T686 oass.DirectSolrSpellChecker.init init: {name=direct,classname=DirectSolrSpellChecker,field=lowerfilt,minQueryLength=3}
[junit4:junit4]   2> 8211 T687 oasc.SolrCore.registerSearcher [collection1] Registered new searcher Searcher@31e4c806 main{StandardDirectoryReader(segments_1:1)}
[junit4:junit4]   2> 8214 T686 oasc.ZkController.publish publishing core=collection1 state=down
[junit4:junit4]   2> 8215 T686 oasc.ZkController.publish numShards not found on descriptor - reading it from system property
[junit4:junit4]   2> 8304 T652 oascc.ZkStateReader.updateClusterState Updating cloud state from ZooKeeper... 
[junit4:junit4]   2> 8305 T652 oasc.Overseer$ClusterStateUpdater.updateState Update state numShards=1 message={
[junit4:junit4]   2> 	  "operation":"state",
[junit4:junit4]   2> 	  "numShards":"1",
[junit4:junit4]   2> 	  "shard":"shard1",
[junit4:junit4]   2> 	  "roles":null,
[junit4:junit4]   2> 	  "state":"active",
[junit4:junit4]   2> 	  "core":"collection1",
[junit4:junit4]   2> 	  "collection":"collection1",
[junit4:junit4]   2> 	  "node_name":"127.0.0.1:37338_",
[junit4:junit4]   2> 	  "base_url":"http://127.0.0.1:37338"}
[junit4:junit4]   2> 8310 T652 oasc.Overseer$ClusterStateUpdater.updateState Update state numShards=1 message={
[junit4:junit4]   2> 	  "operation":"state",
[junit4:junit4]   2> 	  "numShards":"1",
[junit4:junit4]   2> 	  "shard":null,
[junit4:junit4]   2> 	  "roles":null,
[junit4:junit4]   2> 	  "state":"down",
[junit4:junit4]   2> 	  "core":"collection1",
[junit4:junit4]   2> 	  "collection":"collection1",
[junit4:junit4]   2> 	  "node_name":"127.0.0.1:37341_",
[junit4:junit4]   2> 	  "base_url":"http://127.0.0.1:37341"}
[junit4:junit4]   2> 8310 T652 oasc.Overseer$ClusterStateUpdater.updateState Collection already exists with numShards=1
[junit4:junit4]   2> 8310 T652 oasc.Overseer$ClusterStateUpdater.updateState Assigning new node to shard shard=shard1
[junit4:junit4]   2> 8325 T651 oascc.ZkStateReader$2.process A cluster state change: WatchedEvent state:SyncConnected type:NodeDataChanged path:/clusterstate.json, has occurred - updating... (live nodes size: 3)
[junit4:junit4]   2> 8325 T685 oascc.ZkStateReader$2.process A cluster state change: WatchedEvent state:SyncConnected type:NodeDataChanged path:/clusterstate.json, has occurred - updating... (live nodes size: 3)
[junit4:junit4]   2> 8325 T657 oascc.ZkStateReader$2.process A cluster state change: WatchedEvent state:SyncConnected type:NodeDataChanged path:/clusterstate.json, has occurred - updating... (live nodes size: 3)
[junit4:junit4]   2> 8325 T670 oascc.ZkStateReader$2.process A cluster state change: WatchedEvent state:SyncConnected type:NodeDataChanged path:/clusterstate.json, has occurred - updating... (live nodes size: 3)
[junit4:junit4]   2> 9217 T686 oasc.CoreContainer.registerCore registering core: collection1
[junit4:junit4]   2> 9217 T686 oasc.ZkController.register Register replica - core:collection1 address:http://127.0.0.1:37341 collection:collection1 shard:shard1
[junit4:junit4]   2> 9221 T686 oasc.ZkController.register We are http://127.0.0.1:37341/collection1/ and leader is http://127.0.0.1:37338/collection1/
[junit4:junit4]   2> 9221 T686 oasc.ZkController.register No LogReplay needed for core=collection1 baseURL=http://127.0.0.1:37341
[junit4:junit4]   2> 9222 T686 oasc.ZkController.checkRecovery Core needs to recover:collection1
[junit4:junit4]   2> 9222 T686 oasu.DefaultSolrCoreState.doRecovery Running recovery - first canceling any ongoing recovery
[junit4:junit4]   2> ASYNC  NEW_CORE C35 name=collection1 org.apache.solr.core.SolrCore@738ff53f url=http://127.0.0.1:37341/collection1 node=127.0.0.1:37341_ C35_STATE=coll:collection1 core:collection1 props:{shard=null, roles=null, state=down, core=collection1, collection=collection1, node_name=127.0.0.1:37341_, base_url=http://127.0.0.1:37341}
[junit4:junit4]   2> 9223 T688 C35 P37341 oasc.RecoveryStrategy.run Starting recovery process.  core=collection1 recoveringAfterStartup=true
[junit4:junit4]   2> 9223 T686 oascc.ZkStateReader.updateClusterState Updating cloud state from ZooKeeper... 
[junit4:junit4]   2> 9223 T688 C35 P37341 oasc.RecoveryStrategy.doRecovery ###### startupVersions=[]
[junit4:junit4]   2> 9224 T688 C35 P37341 oasc.ZkController.publish publishing core=collection1 state=recovering
[junit4:junit4]   2> 9224 T688 C35 P37341 oasc.ZkController.publish numShards not found on descriptor - reading it from system property
[junit4:junit4]   2> 9224 T629 oass.SolrDispatchFilter.init user.dir=/usr/home/hudson/hudson-slave/workspace/Lucene-Solr-Tests-trunk-Java6/solr/build/solr-core/test/J0
[junit4:junit4]   2> 9224 T629 oass.SolrDispatchFilter.init SolrDispatchFilter.init() done
[junit4:junit4]   2> 9225 T629 oascsi.HttpClientUtil.createClient Creating new http client, config:maxConnections=128&maxConnectionsPerHost=32&followRedirects=false
[junit4:junit4]   2> 9225 T688 C35 P37341 oascsi.HttpClientUtil.createClient Creating new http client, config:maxConnections=128&maxConnectionsPerHost=32&followRedirects=false
[junit4:junit4]   2> 9367 T629 oejs.Server.doStart jetty-8.1.8.v20121106
[junit4:junit4]   2> 9369 T629 oejs.AbstractConnector.doStart Started SocketConnector@127.0.0.1:37345
[junit4:junit4]   2> 9369 T629 oass.SolrDispatchFilter.init SolrDispatchFilter.init()
[junit4:junit4]   2> 9370 T629 oasc.SolrResourceLoader.locateSolrHome JNDI not configured for solr (NoInitialContextEx)
[junit4:junit4]   2> 9370 T629 oasc.SolrResourceLoader.locateSolrHome using system property solr.solr.home: /usr/home/hudson/hudson-slave/workspace/Lucene-Solr-Tests-trunk-Java6/solr/build/solr-core/test/J0/./org.apache.solr.cloud.SyncSliceTest-jetty3-1360591868152
[junit4:junit4]   2> 9370 T629 oasc.CoreContainer$Initializer.initialize looking for solr.xml: /usr/home/hudson/hudson-slave/workspace/Lucene-Solr-Tests-trunk-Java6/solr/build/solr-core/test/J0/./org.apache.solr.cloud.SyncSliceTest-jetty3-1360591868152/solr.xml
[junit4:junit4]   2> 9371 T629 oasc.CoreContainer.<init> New CoreContainer 1493880550
[junit4:junit4]   2> 9371 T629 oasc.CoreContainer.load Loading CoreContainer using Solr Home: '/usr/home/hudson/hudson-slave/workspace/Lucene-Solr-Tests-trunk-Java6/solr/build/solr-core/test/J0/./org.apache.solr.cloud.SyncSliceTest-jetty3-1360591868152/'
[junit4:junit4]   2> 9372 T629 oasc.SolrResourceLoader.<init> new SolrResourceLoader for directory: '/usr/home/hudson/hudson-slave/workspace/Lucene-Solr-Tests-trunk-Java6/solr/build/solr-core/test/J0/./org.apache.solr.cloud.SyncSliceTest-jetty3-1360591868152/'
[junit4:junit4]   2> 9406 T629 oashc.HttpShardHandlerFactory.getParameter Setting socketTimeout to: 60000
[junit4:junit4]   2> 9406 T629 oashc.HttpShardHandlerFactory.getParameter Setting urlScheme to: http://
[junit4:junit4]   2> 9406 T629 oashc.HttpShardHandlerFactory.getParameter Setting connTimeout to: 15000
[junit4:junit4]   2> 9407 T629 oashc.HttpShardHandlerFactory.getParameter Setting maxConnectionsPerHost to: 20
[junit4:junit4]   2> 9407 T629 oashc.HttpShardHandlerFactory.getParameter Setting corePoolSize to: 0
[junit4:junit4]   2> 9407 T629 oashc.HttpShardHandlerFactory.getParameter Setting maximumPoolSize to: 2147483647
[junit4:junit4]   2> 9408 T629 oashc.HttpShardHandlerFactory.getParameter Setting maxThreadIdleTime to: 5
[junit4:junit4]   2> 9408 T629 oashc.HttpShardHandlerFactory.getParameter Setting sizeOfQueue to: -1
[junit4:junit4]   2> 9408 T629 oashc.HttpShardHandlerFactory.getParameter Setting fairnessPolicy to: false
[junit4:junit4]   2> 9409 T629 oascsi.HttpClientUtil.createClient Creating new http client, config:maxConnectionsPerHost=20&maxConnections=10000&socketTimeout=60000&connTimeout=15000&retry=false
[junit4:junit4]   2> 9423 T629 oasc.CoreContainer.load Registering Log Listener
[junit4:junit4]   2> 9440 T629 oasc.CoreContainer.initZooKeeper Zookeeper client=127.0.0.1:37331/solr
[junit4:junit4]   2> 9440 T629 oasc.ZkController.checkChrootPath zkHost includes chroot
[junit4:junit4]   2> 9441 T629 oaz.ZooKeeper.<init> Initiating client connection, connectString=127.0.0.1:37331 sessionTimeout=60000 watcher=org.apache.solr.common.cloud.ConnectionManager@26074375
[junit4:junit4]   2> 9442 T629 oascc.ConnectionManager.waitForConnected Waiting for client to connect to ZooKeeper
[junit4:junit4]   2> 9443 T698 oaz.ClientCnxn$SendThread.logStartConnect Opening socket connection to server localhost/127.0.0.1:37331. Will not attempt to authenticate using SASL (access denied (javax.security.auth.AuthPermission getLoginConfiguration))
[junit4:junit4]   2> 9444 T698 oaz.ClientCnxn$SendThread.primeConnection Socket connection established to localhost/127.0.0.1:37331, initiating session
[junit4:junit4]   2> 9444 T631 oazs.NIOServerCnxnFactory.run Accepted socket connection from /140.211.11.196:37346
[junit4:junit4]   2> 9444 T631 oazs.ZooKeeperServer.processConnectRequest Client attempting to establish new session at /140.211.11.196:37346
[junit4:junit4]   2> 9446 T633 oazs.ZooKeeperServer.finishSessionInit Established session 0x13cc9982ceb0009 with negotiated timeout 20000 for client /140.211.11.196:37346
[junit4:junit4]   2> 9446 T698 oaz.ClientCnxn$SendThread.onConnected Session establishment complete on server localhost/127.0.0.1:37331, sessionid = 0x13cc9982ceb0009, negotiated timeout = 20000
[junit4:junit4]   2> 9446 T699 oascc.ConnectionManager.process Watcher org.apache.solr.common.cloud.ConnectionManager@26074375 name:ZooKeeperConnection Watcher:127.0.0.1:37331 got event WatchedEvent state:SyncConnected type:None path:null path:null type:None
[junit4:junit4]   2> 9446 T629 oascc.ConnectionManager.waitForConnected Client is connected to ZooKeeper
[junit4:junit4]   2> 9449 T634 oazs.PrepRequestProcessor.pRequest2Txn Processed session termination for sessionid: 0x13cc9982ceb0009
[junit4:junit4]   2> 9451 T699 oaz.ClientCnxn$EventThread.run EventThread shut down
[junit4:junit4]   2> 9451 T631 oazs.NIOServerCnxn.closeSock Closed socket connection for client /140.211.11.196:37346 which had sessionid 0x13cc9982ceb0009
[junit4:junit4]   2> 9451 T629 oaz.ZooKeeper.close Session: 0x13cc9982ceb0009 closed
[junit4:junit4]   2> 9451 T629 oascsi.HttpClientUtil.createClient Creating new http client, config:maxConnections=500&maxConnectionsPerHost=16&socketTimeout=60000&connTimeout=15000
[junit4:junit4]   2> 9458 T629 oaz.ZooKeeper.<init> Initiating client connection, connectString=127.0.0.1:37331/solr sessionTimeout=30000 watcher=org.apache.solr.common.cloud.ConnectionManager@3ea57997
[junit4:junit4]   2> 9459 T629 oascc.ConnectionManager.waitForConnected Waiting for client to connect to ZooKeeper
[junit4:junit4]   2> 9460 T700 oaz.ClientCnxn$SendThread.logStartConnect Opening socket connection to server localhost/127.0.0.1:37331. Will not attempt to authenticate using SASL (access denied (javax.security.auth.AuthPermission getLoginConfiguration))
[junit4:junit4]   2> 9460 T700 oaz.ClientCnxn$SendThread.primeConnection Socket connection established to localhost/127.0.0.1:37331, initiating session
[junit4:junit4]   2> 9460 T631 oazs.NIOServerCnxnFactory.run Accepted socket connection from /140.211.11.196:37347
[junit4:junit4]   2> 9461 T631 oazs.ZooKeeperServer.processConnectRequest Client attempting to establish new session at /140.211.11.196:37347
[junit4:junit4]   2> 9462 T633 oazs.ZooKeeperServer.finishSessionInit Established session 0x13cc9982ceb000a with negotiated timeout 20000 for client /140.211.11.196:37347
[junit4:junit4]   2> 9462 T700 oaz.ClientCnxn$SendThread.onConnected Session establishment complete on server localhost/127.0.0.1:37331, sessionid = 0x13cc9982ceb000a, negotiated timeout = 20000
[junit4:junit4]   2> 9462 T701 oascc.ConnectionManager.process Watcher org.apache.solr.common.cloud.ConnectionManager@3ea57997 name:ZooKeeperConnection Watcher:127.0.0.1:37331/solr got event WatchedEvent state:SyncConnected type:None path:null path:null type:None
[junit4:junit4]   2> 9462 T629 oascc.ConnectionManager.waitForConnected Client is connected to ZooKeeper
[junit4:junit4]   2> 9463 T634 oazs.PrepRequestProcessor.pRequest Got user-level KeeperException when processing sessionid:0x13cc9982ceb000a type:create cxid:0x1 zxid:0x7e txntype:-1 reqpath:n/a Error Path:/solr/overseer Error:KeeperErrorCode = NodeExists for /solr/overseer
[junit4:junit4]   2> 9465 T634 oazs.PrepRequestProcessor.pRequest Got user-level KeeperException when processing sessionid:0x13cc9982ceb000a type:create cxid:0x2 zxid:0x7f txntype:-1 reqpath:n/a Error Path:/solr/overseer Error:KeeperErrorCode = NodeExists for /solr/overseer
[junit4:junit4]   2> 9474 T629 oascc.ZkStateReader.createClusterStateWatchersAndUpdate Updating cluster state from ZooKeeper... 
[junit4:junit4]   2> 9476 T629 oasc.ZkController.createEphemeralLiveNode Register node as live in ZooKeeper:/live_nodes/127.0.0.1:37345_
[junit4:junit4]   2> 9476 T634 oazs.PrepRequestProcessor.pRequest Got user-level KeeperException when processing sessionid:0x13cc9982ceb000a type:delete cxid:0x9 zxid:0x80 txntype:-1 reqpath:n/a Error Path:/solr/live_nodes/127.0.0.1:37345_ Error:KeeperErrorCode = NoNode for /solr/live_nodes/127.0.0.1:37345_
[junit4:junit4]   2> 9478 T629 oascc.SolrZkClient.makePath makePath: /live_nodes/127.0.0.1:37345_
[junit4:junit4]   2> 9480 T685 oascc.ZkStateReader$2.process A cluster state change: WatchedEvent state:SyncConnected type:NodeChildrenChanged path:/live_nodes, has occurred - updating... (live nodes size: 3)
[junit4:junit4]   2> 9481 T651 oascc.ZkStateReader$2.process A cluster state change: WatchedEvent state:SyncConnected type:NodeChildrenChanged path:/live_nodes, has occurred - updating... (live nodes size: 3)
[junit4:junit4]   2> 9481 T657 oascc.ZkStateReader$3.process Updating live nodes... (4)
[junit4:junit4]   2> 9481 T670 oascc.ZkStateReader$3.process Updating live nodes... (4)
[junit4:junit4]   2> 9481 T657 oascc.ZkStateReader$2.process A cluster state change: WatchedEvent state:SyncConnected type:NodeChildrenChanged path:/live_nodes, has occurred - updating... (live nodes size: 4)
[junit4:junit4]   2> 9481 T701 oascc.ZkStateReader$3.process Updating live nodes... (4)
[junit4:junit4]   2> 9481 T670 oascc.ZkStateReader$2.process A cluster state change: WatchedEvent state:SyncConnected type:NodeChildrenChanged path:/live_nodes, has occurred - updating... (live nodes size: 4)
[junit4:junit4]   2> 9482 T685 oascc.ZkStateReader$3.process Updating live nodes... (4)
[junit4:junit4]   2> 9482 T651 oascc.ZkStateReader$3.process Updating live nodes... (4)
[junit4:junit4]   2> 9490 T702 oasc.CoreContainer.create Creating SolrCore 'collection1' using instanceDir: /usr/home/hudson/hudson-slave/workspace/Lucene-Solr-Tests-trunk-Java6/solr/build/solr-core/test/J0/./org.apache.solr.cloud.SyncSliceTest-jetty3-1360591868152/collection1
[junit4:junit4]   2> 9490 T702 oasc.ZkController.createCollectionZkNode Check for collection zkNode:collection1
[junit4:junit4]   2> 9491 T702 oasc.ZkController.createCollectionZkNode Collection zkNode exists
[junit4:junit4]   2> 9491 T702 oasc.ZkController.readConfigName Load collection config from:/collections/collection1
[junit4:junit4]   2> 9492 T702 oasc.SolrResourceLoader.<init> new SolrResourceLoader for directory: '/usr/home/hudson/hudson-slave/workspace/Lucene-Solr-Tests-trunk-Java6/solr/build/solr-core/test/J0/./org.apache.solr.cloud.SyncSliceTest-jetty3-1360591868152/collection1/'
[junit4:junit4]   2> 9493 T702 oasc.SolrResourceLoader.replaceClassLoader Adding 'file:/usr/home/hudson/hudson-slave/workspace/Lucene-Solr-Tests-trunk-Java6/solr/build/solr-core/test/J0/org.apache.solr.cloud.SyncSliceTest-jetty3-1360591868152/collection1/lib/README' to classloader
[junit4:junit4]   2> 9494 T702 oasc.SolrResourceLoader.replaceClassLoader Adding 'file:/usr/home/hudson/hudson-slave/workspace/Lucene-Solr-Tests-trunk-Java6/solr/build/solr-core/test/J0/org.apache.solr.cloud.SyncSliceTest-jetty3-1360591868152/collection1/lib/classes/' to classloader
[junit4:junit4]   2> 9544 T702 oasc.SolrConfig.<init> Using Lucene MatchVersion: LUCENE_50
[junit4:junit4]   2> 9611 T702 oasc.SolrConfig.<init> Loaded SolrConfig: solrconfig.xml
[junit4:junit4]   2> 9712 T702 oass.IndexSchema.readSchema Reading Solr Schema
[junit4:junit4]   2> 9719 T702 oass.IndexSchema.readSchema Schema name=test
[junit4:junit4]   2> 9841 T652 oascc.ZkStateReader.updateClusterState Updating cloud state from ZooKeeper... 
[junit4:junit4]   2> 9841 T652 oasc.Overseer$ClusterStateUpdater.updateState Update state numShards=1 message={
[junit4:junit4]   2> 	  "operation":"state",
[junit4:junit4]   2> 	  "numShards":"1",
[junit4:junit4]   2> 	  "shard":"shard1",
[junit4:junit4]   2> 	  "roles":null,
[junit4:junit4]   2> 	  "state":"recovering",
[junit4:junit4]   2> 	  "core":"collection1",
[junit4:junit4]   2> 	  "collection":"collection1",
[junit4:junit4]   2> 	  "node_name":"127.0.0.1:37341_",
[junit4:junit4]   2> 	  "base_url":"http://127.0.0.1:37341"}
[junit4:junit4]   2> 9857 T651 oascc.ZkStateReader$2.process A cluster state change: WatchedEvent state:SyncConnected type:NodeDataChanged path:/clusterstate.json, has occurred - updating... (live nodes size: 4)
[junit4:junit4]   2> 9857 T701 oascc.ZkStateReader$2.process A cluster state change: WatchedEvent state:SyncConnected type:NodeDataChanged path:/clusterstate.json, has occurred - updating... (live nodes size: 4)
[junit4:junit4]   2> 9857 T670 oascc.ZkStateReader$2.process A cluster state change: WatchedEvent state:SyncConnected type:NodeDataChanged path:/clusterstate.json, has occurred - updating... (live nodes size: 4)
[junit4:junit4]   2> 9857 T685 oascc.ZkStateReader$2.process A cluster state change: WatchedEvent state:SyncConnected type:NodeDataChanged path:/clusterstate.json, has occurred - updating... (live nodes size: 4)
[junit4:junit4]   2> 9857 T657 oascc.ZkStateReader$2.process A cluster state change: WatchedEvent state:SyncConnected type:NodeDataChanged path:/clusterstate.json, has occurred - updating... (live nodes size: 4)
[junit4:junit4]   2> 10323 T702 oass.OpenExchangeRatesOrgProvider.init Initialized with rates=open-exchange-rates.json, refreshInterval=1440.
[junit4:junit4]   2> 10336 T702 oass.IndexSchema.readSchema default search field in schema is text
[junit4:junit4]   2> 10341 T702 oass.IndexSchema.readSchema unique key field: id
[junit4:junit4]   2> 10358 T702 oass.FileExchangeRateProvider.reload Reloading exchange rates from file currency.xml
[junit4:junit4]   2> 10363 T702 oass.FileExchangeRateProvider.reload Reloading exchange rates from file currency.xml
[junit4:junit4]   2> 10367 T702 oass.OpenExchangeRatesOrgProvider.reload Reloading exchange rates from open-exchange-rates.json
[junit4:junit4]   2> 10369 T702 oass.OpenExchangeRatesOrgProvider.reload Reloading exchange rates from open-exchange-rates.json
[junit4:junit4]   2> 10370 T702 oasc.SolrCore.<init> [collection1] Opening new SolrCore at /usr/home/hudson/hudson-slave/workspace/Lucene-Solr-Tests-trunk-Java6/solr/build/solr-core/test/J0/./org.apache.solr.cloud.SyncSliceTest-jetty3-1360591868152/collection1/, dataDir=./org.apache.solr.cloud.SyncSliceTest-1360591858916/jetty3/
[junit4:junit4]   2> 10371 T702 oasc.JmxMonitoredMap.<init> JMX monitoring is enabled. Adding Solr mbeans to JMX Server: com.sun.jmx.mbeanserver.JmxMBeanServer@18330bf
[junit4:junit4]   2> 10371 T702 oasc.SolrCore.initDirectoryFactory solr.NRTCachingDirectoryFactory
[junit4:junit4]   2> 10372 T702 oasc.CachingDirectoryFactory.get return new directory for /usr/home/hudson/hudson-slave/workspace/Lucene-Solr-Tests-trunk-Java6/solr/build/solr-core/test/J0/./org.apache.solr.cloud.SyncSliceTest-1360591858916/jetty3 forceNew:false
[junit4:junit4]   2> 10373 T702 oasc.CachingDirectoryFactory.close Releasing directory:/usr/home/hudson/hudson-slave/workspace/Lucene-Solr-Tests-trunk-Java6/solr/build/solr-core/test/J0/./org.apache.solr.cloud.SyncSliceTest-1360591858916/jetty3
[junit4:junit4]   2> 10373 T702 oasc.SolrCore.getNewIndexDir New index directory detected: old=null new=./org.apache.solr.cloud.SyncSliceTest-1360591858916/jetty3/index/
[junit4:junit4]   2> 10373 T702 oasc.SolrCore.initIndex WARNING [collection1] Solr index directory './org.apache.solr.cloud.SyncSliceTest-1360591858916/jetty3/index' doesn't exist. Creating new index...
[junit4:junit4]   2> 10375 T702 oasc.CachingDirectoryFactory.get return new directory for /usr/home/hudson/hudson-slave/workspace/Lucene-Solr-Tests-trunk-Java6/solr/build/solr-core/test/J0/./org.apache.solr.cloud.SyncSliceTest-1360591858916/jetty3/index forceNew:false
[junit4:junit4]   2> 10389 T702 oasc.SolrDeletionPolicy.onCommit SolrDeletionPolicy.onCommit: commits:num=1
[junit4:junit4]   2> 		commit{dir=RateLimitedDirectoryWrapper(NRTCachingDirectory(org.apache.lucene.store.NIOFSDirectory@/usr/home/hudson/hudson-slave/workspace/Lucene-Solr-Tests-trunk-Java6/solr/build/solr-core/test/J0/org.apache.solr.cloud.SyncSliceTest-1360591858916/jetty3/index lockFactory=org.apache.lucene.store.NativeFSLockFactory@62a54986; maxCacheMB=48.0 maxMergeSizeMB=4.0)),segFN=segments_1,generation=1,filenames=[segments_1]
[junit4:junit4]   2> 10390 T702 oasc.SolrDeletionPolicy.updateCommits newest commit = 1[segments_1]
[junit4:junit4]   2> 10391 T702 oasc.CachingDirectoryFactory.close Releasing directory:/usr/home/hudson/hudson-slave/workspace/Lucene-Solr-Tests-trunk-Java6/solr/build/solr-core/test/J0/./org.apache.solr.cloud.SyncSliceTest-1360591858916/jetty3/index
[junit4:junit4]   2> 10391 T702 oasc.SolrCore.initWriters created xml: solr.XMLResponseWriter
[junit4:junit4]   2> 10393 T702 oasup.UpdateRequestProcessorChain.init inserting DistributedUpdateProcessorFactory into updateRequestProcessorChain "dedupe"
[junit4:junit4]   2> 10393 T702 oasup.UpdateRequestProcessorChain.init inserting DistributedUpdateProcessorFactory into updateRequestProcessorChain "dedupe-allfields"
[junit4:junit4]   2> 10394 T702 oasup.UpdateRequestProcessorChain.init inserting DistributedUpdateProcessorFactory into updateRequestProcessorChain "stored_sig"
[junit4:junit4]   2> 10394 T702 oasup.UpdateRequestProcessorChain.init inserting DistributedUpdateProcessorFactory into updateRequestProcessorChain "uniq-fields"
[junit4:junit4]   2> 10395 T702 oasup.UpdateRequestProcessorChain.init inserting DistributedUpdateProcessorFactory into updateRequestProcessorChain "distrib-dup-test-chain-implicit"
[junit4:junit4]   2> 10395 T702 oasc.RequestHandlers.initHandlersFromConfig adding lazy requestHandler: solr.ReplicationHandler
[junit4:junit4]   2> 10395 T702 oasc.RequestHandlers.initHandlersFromConfig created /replication: solr.ReplicationHandler
[junit4:junit4]   2> 10396 T702 oasc.RequestHandlers.initHandlersFromConfig created standard: solr.StandardRequestHandler
[junit4:junit4]   2> 10396 T702 oasc.RequestHandlers.initHandlersFromConfig created /get: solr.RealTimeGetHandler
[junit4:junit4]   2> 10397 T702 oasc.RequestHandlers.initHandlersFromConfig created dismax: solr.SearchHandler
[junit4:junit4]   2> 10398 T702 oasc.RequestHandlers.initHandlersFromConfig created mock: org.apache.solr.core.MockQuerySenderListenerReqHandler
[junit4:junit4]   2> 10398 T702 oasc.RequestHandlers.initHandlersFromConfig created /admin/: org.apache.solr.handler.admin.AdminHandlers
[junit4:junit4]   2> 10398 T702 oasc.RequestHandlers.initHandlersFromConfig created defaults: solr.StandardRequestHandler
[junit4:junit4]   2> 10399 T702 oasc.RequestHandlers.initHandlersFromConfig adding lazy requestHandler: solr.StandardRequestHandler
[junit4:junit4]   2> 10399 T702 oasc.RequestHandlers.initHandlersFromConfig created lazy: solr.StandardRequestHandler
[junit4:junit4]   2> 10400 T702 oasc.RequestHandlers.initHandlersFromConfig created /update: solr.UpdateRequestHandler
[junit4:junit4]   2> 10400 T702 oasc.RequestHandlers.initHandlersFromConfig created /terms: org.apache.solr.handler.component.SearchHandler
[junit4:junit4]   2> 10401 T702 oasc.RequestHandlers.initHandlersFromConfig created spellCheckCompRH: org.apache.solr.handler.component.SearchHandler
[junit4:junit4]   2> 10401 T702 oasc.RequestHandlers.initHandlersFromConfig created spellCheckCompRH_Direct: org.apache.solr.handler.component.SearchHandler
[junit4:junit4]   2> 10402 T702 oasc.RequestHandlers.initHandlersFromConfig created spellCheckWithWordbreak: org.apache.solr.handler.component.SearchHandler
[junit4:junit4]   2> 10402 T702 oasc.RequestHandlers.initHandlersFromConfig created spellCheckWithWordbreak_Direct: org.apache.solr.handler.component.SearchHandler
[junit4:junit4]   2> 10403 T702 oasc.RequestHandlers.initHandlersFromConfig created spellCheckCompRH1: org.apache.solr.handler.component.SearchHandler
[junit4:junit4]   2> 10403 T702 oasc.RequestHandlers.initHandlersFromConfig created mltrh: org.apache.solr.handler.component.SearchHandler
[junit4:junit4]   2> 10404 T702 oasc.RequestHandlers.initHandlersFromConfig created tvrh: org.apache.solr.handler.component.SearchHandler
[junit4:junit4]   2> 10404 T702 oasc.RequestHandlers.initHandlersFromConfig created /mlt: solr.MoreLikeThisHandler
[junit4:junit4]   2> 10405 T702 oasc.RequestHandlers.initHandlersFromConfig created /debug/dump: solr.DumpRequestHandler
[junit4:junit4]   2> 10412 T702 oashl.XMLLoader.init xsltCacheLifetimeSeconds=60
[junit4:junit4]   2> 10417 T702 oasc.SolrCore.initDeprecatedSupport WARNING solrconfig.xml uses deprecated <admin/gettableFiles>, Please update your config to use the ShowFileRequestHandler.
[junit4:junit4]   2> 10418 T702 oasc.SolrCore.initDeprecatedSupport WARNING adding ShowFileRequestHandler with hidden files: [SCHEMA.XML, OLD_SYNONYMS.TXT, STOPWORDS.TXT, PROTWORDS.TXT, OPEN-EXCHANGE-RATES.JSON, SYNONYMS.TXT, CURRENCY.XML, MAPPING-ISOLATIN1ACCENT.TXT]
[junit4:junit4]   2> 10421 T702 oasc.CachingDirectoryFactory.close Releasing directory:/usr/home/hudson/hudson-slave/workspace/Lucene-Solr-Tests-trunk-Java6/solr/build/solr-core/test/J0/./org.apache.solr.cloud.SyncSliceTest-1360591858916/jetty3
[junit4:junit4]   2> 10423 T702 oass.SolrIndexSearcher.<init> Opening Searcher@3cfff0e9 main
[junit4:junit4]   2> 10424 T702 oasu.CommitTracker.<init> Hard AutoCommit: disabled
[junit4:junit4]   2> 10424 T702 oasu.CommitTracker.<init> Soft AutoCommit: disabled
[junit4:junit4]   2> 10425 T702 oashc.SpellCheckComponent.inform Initializing spell checkers
[junit4:junit4]   2> 10432 T702 oass.DirectSolrSpellChecker.init init: {name=direct,classname=DirectSolrSpellChecker,field=lowerfilt,minQueryLength=3}
[junit4:junit4]   2> 10492 T703 oasc.SolrCore.registerSearcher [collection1] Registered new searcher Searcher@3cfff0e9 main{StandardDirectoryReader(segments_1:1)}
[junit4:junit4]   2> 10497 T702 oasc.ZkController.publish publishing core=collection1 state=down
[junit4:junit4]   2> 10497 T702 oasc.ZkController.publish numShards not found on descriptor - reading it from system property
[junit4:junit4]   2> 11363 T652 oascc.ZkStateReader.updateClusterState Updating cloud state from ZooKeeper... 
[junit4:junit4]   2> 11364 T652 oasc.Overseer$ClusterStateUpdater.updateState Update state numShards=1 message={
[junit4:junit4]   2> 	  "operation":"state",
[junit4:junit4]   2> 	  "numShards":"1",
[junit4:junit4]   2> 	  "shard":null,
[junit4:junit4]   2> 	  "roles":null,
[junit4:junit4]   2> 	  "state":"down",
[junit4:junit4]   2> 	  "core":"collection1",
[junit4:junit4]   2> 	  "collection":"collection1",
[junit4:junit4]   2> 	  "node_name":"127.0.0.1:37345_",
[junit4:junit4]   2> 	  "base_url":"http://127.0.0.1:37345"}
[junit4:junit4]   2> 11364 T652 oasc.Overseer$ClusterStateUpdater.updateState Collection already exists with numShards=1
[junit4:junit4]   2> 11364 T652 oasc.Overseer$ClusterStateUpdater.updateState Assigning new node to shard shard=shard1
[junit4:junit4]   2> 11384 T701 oascc.ZkStateReader$2.process A cluster state change: WatchedEvent state:SyncConnected type:NodeDataChanged path:/clusterstate.json, has occurred - updating... (live nodes size: 4)
[junit4:junit4]   2> 11384 T685 oascc.ZkStateReader$2.process A cluster state change: WatchedEvent state:SyncConnected type:NodeDataChanged path:/clusterstate.json, has occurred - updating... (live nodes size: 4)
[junit4:junit4]   2> 11384 T651 oascc.ZkStateReader$2.process A cluster state change: WatchedEvent state:SyncConnected type:NodeDataChanged path:/clusterstate.json, has occurred - updating... (live nodes size: 4)
[junit4:junit4]   2> 11384 T670 oascc.ZkStateReader$2.process A cluster state change: WatchedEvent state:SyncConnected type:NodeDataChanged path:/clusterstate.json, has occurred - updating... (live nodes size: 4)
[junit4:junit4]   2> 11384 T657 oascc.ZkStateReader$2.process A cluster state change: WatchedEvent state:SyncConnected type:NodeDataChanged path:/clusterstate.json, has occurred - updating... (live nodes size: 4)
[junit4:junit4]   2> 11500 T702 oasc.CoreContainer.registerCore registering core: collection1
[junit4:junit4]   2> 11500 T702 oasc.ZkController.register Register replica - core:collection1 address:http://127.0.0.1:37345 collection:collection1 shard:shard1
[junit4:junit4]   2> 11504 T702 oasc.ZkController.register We are http://127.0.0.1:37345/collection1/ and leader is http://127.0.0.1:37338/collection1/
[junit4:junit4]   2> 11504 T702 oasc.ZkController.register No LogReplay needed for core=collection1 baseURL=http://127.0.0.1:37345
[junit4:junit4]   2> 11504 T702 oasc.ZkController.checkRecovery Core needs to recover:collection1
[junit4:junit4]   2> 11504 T702 oasu.DefaultSolrCoreState.doRecovery Running recovery - first canceling any ongoing recovery
[junit4:junit4]   2> ASYNC  NEW_CORE C36 name=collection1 org.apache.solr.core.SolrCore@6432d3c0 url=http://127.0.0.1:37345/collection1 node=127.0.0.1:37345_ C36_STATE=coll:collection1 core:collection1 props:{shard=null, roles=null, state=down, core=collection1, collection=collection1, node_name=127.0.0.1:37345_, base_url=http://127.0.0.1:37345}
[junit4:junit4]   2> 11505 T704 C36 P37345 oasc.RecoveryStrategy.run Starting recovery process.  core=collection1 recoveringAfterStartup=true
[junit4:junit4]   2> 11506 T704 C36 P37345 oasc.RecoveryStrategy.doRecovery ###### startupVersions=[]
[junit4:junit4]   2> 11506 T702 oascc.ZkStateReader.updateClusterState Updating cloud state from ZooKeeper... 
[junit4:junit4]   2> 11506 T704 C36 P37345 oasc.ZkController.publish publishing core=collection1 state=recovering
[junit4:junit4]   2> 11506 T704 C36 P37345 oasc.ZkController.publish numShards not found on descriptor - reading it from system property
[junit4:junit4]   2> 11506 T629 oass.SolrDispatchFilter.init user.dir=/usr/home/hudson/hudson-slave/workspace/Lucene-Solr-Tests-trunk-Java6/solr/build/solr-core/test/J0
[junit4:junit4]   2> 11507 T629 oass.SolrDispatchFilter.init SolrDispatchFilter.init() done
[junit4:junit4]   2> 11508 T629 oascsi.HttpClientUtil.createClient Creating new http client, config:maxConnections=128&maxConnectionsPerHost=32&followRedirects=false
[junit4:junit4]   2> 11515 T704 C36 P37345 oascsi.HttpClientUtil.createClient Creating new http client, config:maxConnections=128&maxConnectionsPerHost=32&followRedirects=false
[junit4:junit4]   2> 11704 T629 oejs.Server.doStart jetty-8.1.8.v20121106
[junit4:junit4]   2> 11707 T629 oejs.AbstractConnector.doStart Started SocketConnector@127.0.0.1:37349
[junit4:junit4]   2> 11707 T629 oass.SolrDispatchFilter.init SolrDispatchFilter.init()
[junit4:junit4]   2> 11708 T629 oasc.SolrResourceLoader.locateSolrHome JNDI not configured for solr (NoInitialContextEx)
[junit4:junit4]   2> 11708 T629 oasc.SolrResourceLoader.locateSolrHome using system property solr.solr.home: /usr/home/hudson/hudson-slave/workspace/Lucene-Solr-Tests-trunk-Java6/solr/build/solr-core/test/J0/./org.apache.solr.cloud.SyncSliceTest-jetty4-1360591870435
[junit4:junit4]   2> 11709 T629 oasc.CoreContainer$Initializer.initialize looking for solr.xml: /usr/home/hudson/hudson-slave/workspace/Lucene-Solr-Tests-trunk-Java6/solr/build/solr-core/test/J0/./org.apache.solr.cloud.SyncSliceTest-jetty4-1360591870435/solr.xml
[junit4:junit4]   2> 11709 T629 oasc.CoreContainer.<init> New CoreContainer 943921171
[junit4:junit4]   2> 11710 T629 oasc.CoreContainer.load Loading CoreContainer using Solr Home: '/usr/home/hudson/hudson-slave/workspace/Lucene-Solr-Tests-trunk-Java6/solr/build/solr-core/test/J0/./org.apache.solr.cloud.SyncSliceTest-jetty4-1360591870435/'
[junit4:junit4]   2> 11710 T629 oasc.SolrResourceLoader.<init> new SolrResourceLoader for directory: '/usr/home/hudson/hudson-slave/workspace/Lucene-Solr-Tests-trunk-Java6/solr/build/solr-core/test/J0/./org.apache.solr.cloud.SyncSliceTest-jetty4-1360591870435/'
[junit4:junit4]   2> 11769 T629 oashc.HttpShardHandlerFactory.getParameter Setting socketTimeout to: 60000
[junit4:junit4]   2> 11769 T629 oashc.HttpShardHandlerFactory.getParameter Setting urlScheme to: http://
[junit4:junit4]   2> 11770 T629 oashc.HttpShardHandlerFactory.getParameter Setting connTimeout to: 15000
[junit4:junit4]   2> 11770 T629 oashc.HttpShardHandlerFactory.getParameter Setting maxConnectionsPerHost to: 20
[junit4:junit4]   2> 11771 T629 oashc.HttpShardHandlerFactory.getParameter Setting corePoolSize to: 0
[junit4:junit4]   2> 11771 T629 oashc.HttpShardHandlerFactory.getParameter Setting maximumPoolSize to: 2147483647
[junit4:junit4]   2> 11772 T629 oashc.HttpShardHandlerFactory.getParameter Setting maxThreadIdleTime to: 5
[junit4:junit4]   2> 11772 T629 oashc.HttpShardHandlerFactory.getParameter Setting sizeOfQueue to: -1
[junit4:junit4]   2> 11772 T629 oashc.HttpShardHandlerFactory.getParameter Setting fairnessPolicy to: false
[junit4:junit4]   2> 11773 T629 oascsi.HttpClientUtil.createClient Creating new http client, config:maxConnectionsPerHost=20&maxConnections=10000&socketTimeout=60000&connTimeout=15000&retry=false
[junit4:junit4]   2> 11793 T629 oasc.CoreContainer.load Registering Log Listener
[junit4:junit4]   2> 11818 T629 oasc.CoreContainer.initZooKeeper Zookeeper client=127.0.0.1:37331/solr
[junit4:junit4]   2> 11818 T629 oasc.ZkController.checkChrootPath zkHost includes chroot
[junit4:junit4]   2> 11819 T629 oaz.ZooKeeper.<init> Initiating client connection, connectString=127.0.0.1:37331 sessionTimeout=60000 watcher=org.apache.solr.common.cloud.ConnectionManager@16d876df
[junit4:junit4]   2> 11820 T629 oascc.ConnectionManager.waitForConnected Waiting for client to connect to ZooKeeper
[junit4:junit4]   2> 11820 T714 oaz.ClientCnxn$SendThread.logStartConnect Opening socket connection to server localhost/127.0.0.1:37331. Will not attempt to authenticate using SASL (access denied (javax.security.auth.AuthPermission getLoginConfiguration))
[junit4:junit4]   2> 11821 T714 oaz.ClientCnxn$SendThread.primeConnection Socket connection established to localhost/127.0.0.1:37331, initiating session
[junit4:junit4]   2> 11821 T631 oazs.NIOServerCnxnFactory.run Accepted socket connection from /140.211.11.196:37350
[junit4:junit4]   2> 11822 T631 oazs.ZooKeeperServer.processConnectRequest Client attempting to establish new session at /140.211.11.196:37350
[junit4:junit4]   2> 11824 T633 oazs.ZooKeeperServer.finishSessionInit Established session 0x13cc9982ceb000b with negotiated timeout 20000 for client /140.211.11.196:37350
[junit4:junit4]   2> 11824 T714 oaz.ClientCnxn$SendThread.onConnected Session establishment complete on server localhost/127.0.0.1:37331, sessionid = 0x13cc9982ceb000b, negotiated timeout = 20000
[junit4:junit4]   2> 11824 T715 oascc.ConnectionManager.process Watcher org.apache.solr.common.cloud.ConnectionManager@16d876df name:ZooKeeperConnection Watcher:127.0.0.1:37331 got event WatchedEvent state:SyncConnected type:None path:null path:null type:None
[junit4:junit4]   2> 11824 T629 oascc.ConnectionManager.waitForConnected Client is connected to ZooKeeper
[junit4:junit4]   2> 11826 T634 oazs.PrepRequestProcessor.pRequest2Txn Processed session termination for sessionid: 0x13cc9982ceb000b
[junit4:junit4]   2> 11839 T715 oaz.ClientCnxn$EventThread.run EventThread shut down
[junit4:junit4]   2> 11839 T631 oazs.NIOServerCnxn.closeSock Closed socket connection for client /140.211.11.196:37350 which had sessionid 0x13cc9982ceb000b
[junit4:junit4]   2> 11839 T629 oaz.ZooKeeper.close Session: 0x13cc9982ceb000b closed
[junit4:junit4]   2> 11840 T629 oascsi.HttpClientUtil.createClient Creating new http client, config:maxConnections=500&maxConnectionsPerHost=16&socketTimeout=60000&connTimeout=15000
[junit4:junit4]   2> 11850 T629 oaz.ZooKeeper.<init> Initiating client connection, connectString=127.0.0.1:37331/solr sessionTimeout=30000 watcher=org.apache.solr.common.cloud.ConnectionManager@6f9d85cd
[junit4:junit4]   2> 11851 T629 oascc.ConnectionManager.waitForConnected Waiting for client to connect to ZooKeeper
[junit4:junit4]   2> 11851 T716 oaz.ClientCnxn$SendThread.logStartConnect Opening socket connection to server localhost/127.0.0.1:37331. Will not attempt to authenticate using SASL (access denied (javax.security.auth.AuthPermission getLoginConfiguration))
[junit4:junit4]   2> 11852 T716 oaz.ClientCnxn$SendThread.primeConnection Socket connection established to localhost/127.0.0.1:37331, initiating session
[junit4:junit4]   2> 11852 T631 oazs.NIOServerCnxnFactory.run Accepted socket connection from /140.211.11.196:37351
[junit4:junit4]   2> 11852 T631 oazs.ZooKeeperServer.processConnectRequest Client attempting to establish new session at /140.211.11.196:37351
[junit4:junit4]   2> 11853 T633 oazs.ZooKeeperServer.finishSessionInit Established session 0x13cc9982ceb000c with negotiated timeout 20000 for client /140.211.11.196:37351
[junit4:junit4]   2> 11853 T716 oaz.ClientCnxn$SendThread.onConnected Session establishment complete on server localhost/127.0.0.1:37331, sessionid = 0x13cc9982ceb000c, negotiated timeout = 20000
[junit4:junit4]   2> 11854 T717 oascc.ConnectionManager.process Watcher org.apache.solr.common.cloud.ConnectionManager@6f9d85cd name:ZooKeeperConnection Watcher:127.0.0.1:37331/solr got event WatchedEvent state:SyncConnected type:None path:null path:null type:None
[junit4:junit4]   2> 11854 T629 oascc.ConnectionManager.waitForConnected Client is connected to ZooKeeper
[junit4:junit4]   2> 11855 T634 oazs.PrepRequestProcessor.pRequest Got user-level KeeperException when processing sessionid:0x13cc9982ceb000c type:create cxid:0x1 zxid:0x91 txntype:-1 reqpath:n/a Error Path:/solr/overseer Error:KeeperErrorCode = NodeExists for /solr/overseer
[junit4:junit4]   2> 11856 T634 oazs.PrepRequestProcessor.pRequest Got user-level KeeperException when processing sessionid:0x13cc9982ceb000c type:create cxid:0x2 zxid:0x92 txntype:-1 reqpath:n/a Error Path:/solr/overseer Error:KeeperErrorCode = NodeExists for /solr/overseer
[junit4:junit4]   2> 11864 T629 oascc.ZkStateReader.createClusterStateWatchersAndUpdate Updating cluster state from ZooKeeper... 
[junit4:junit4]   2> 11866 T629 oasc.ZkController.createEphemeralLiveNode Register node as live in ZooKeeper:/live_nodes/127.0.0.1:37349_
[junit4:junit4]   2> 11867 T634 oazs.PrepRequestProcessor.pRequest Got user-level KeeperException when processing sessionid:0x13cc9982ceb000c type:delete cxid:0x9 zxid:0x93 txntype:-1 reqpath:n/a Error Path:/solr/live_nodes/127.0.0.1:37349_ Error:KeeperErrorCode = NoNode for /solr/live_nodes/127.0.0.1:37349_
[junit4:junit4]   2> 11868 T629 oascc.SolrZkClient.makePath makePath: /live_nodes/127.0.0.1:37349_
[junit4:junit4]   2> 11875 T651 oascc.ZkStateReader$2.process A cluster state change: WatchedEvent state:SyncConnected type:NodeChildrenChanged path:/live_nodes, has occurred - updating... (live nodes size: 4)
[junit4:junit4]   2> 11875 T685 oascc.ZkStateReader$2.process A cluster state change: WatchedEvent state:SyncConnected type:NodeChildrenChanged path:/live_nodes, has occurred - updating... (live nodes size: 4)
[junit4:junit4]   2> 11876 T717 oascc.ZkStateReader$3.process Updating live nodes... (5)
[junit4:junit4]   2> 11876 T657 oascc.ZkStateReader$3.process Updating live nodes... (5)
[junit4:junit4]   2> 11876 T670 oascc.ZkStateReader$3.process Updating live nodes... (5)
[junit4:junit4]   2> 11876 T701 oascc.ZkStateReader$3.process Updating live nodes... (5)
[junit4:junit4]   2> 11876 T657 oascc.ZkStateReader$2.process A cluster state change: WatchedEvent state:SyncConnected type:NodeChildrenChanged path:/live_nodes, has occurred - updating... (live nodes size: 5)
[junit4:junit4]   2> 11876 T701 oascc.ZkStateReader$2.process A cluster state change: WatchedEvent state:SyncConnected type:NodeChildrenChanged path:/live_nodes, has occurred - updating... (live nodes size: 5)
[junit4:junit4]   2> 11877 T670 oascc.ZkStateReader$2.process A cluster state change: WatchedEvent state:SyncConnected type:NodeChildrenChanged path:/live_nodes, has occurred - updating... (live nodes size: 5)
[junit4:junit4]   2> 11877 T651 oascc.ZkStateReader$3.process Updating live nodes... (5)
[junit4:junit4]   2> 11879 T685 oascc.ZkStateReader$3.process Updating live nodes... (5)
[junit4:junit4]   2> 11887 T718 oasc.CoreContainer.create Creating SolrCore 'collection1' using instanceDir: /usr/home/hudson/hudson-slave/workspace/Lucene-Solr-Tests-trunk-Java6/solr/build/solr-core/test/J0/./org.apache.solr.cloud.SyncSliceTest-jetty4-1360591870435/collection1
[junit4:junit4]   2> 11887 T718 oasc.ZkController.createCollectionZkNode Check for collection zkNode:collection1
[junit4:junit4]   2> 11888 T718 oasc.ZkController.createCollectionZkNode Collection zkNode exists
[junit4:junit4]   2> 11889 T718 oasc.ZkController.readConfigName Load collection config from:/collections/collection1
[junit4:junit4]   2> 11891 T718 oasc.SolrResourceLoader.<init> new SolrResourceLoader for directory: '/usr/home/hudson/hudson-slave/workspace/Lucene-Solr-Tests-trunk-Java6/solr/build/solr-core/test/J0/./org.apache.solr.cloud.SyncSliceTest-jetty4-1360591870435/collection1/'
[junit4:junit4]   2> 11892 T718 oasc.SolrResourceLoader.replaceClassLoader Adding 'file:/usr/home/hudson/hudson-slave/workspace/Lucene-Solr-Tests-trunk-Java6/solr/build/solr-core/test/J0/org.apache.solr.cloud.SyncSliceTest-jetty4-1360591870435/collection1/lib/README' to classloader
[junit4:junit4]   2> 11893 T718 oasc.SolrResourceLoader.replaceClassLoader Adding 'file:/usr/home/hudson/hudson-slave/workspace/Lucene-Solr-Tests-trunk-Java6/solr/build/solr-core/test/J0/org.apache.solr.cloud.SyncSliceTest-jetty4-1360591870435/collection1/lib/classes/' to classloader
[junit4:junit4]   2> 11953 T718 oasc.SolrConfig.<init> Using Lucene MatchVersion: LUCENE_50
[junit4:junit4]   2> 12032 T718 oasc.SolrConfig.<init> Loaded SolrConfig: solrconfig.xml
[junit4:junit4]   2> 12133 T718 oass.IndexSchema.readSchema Reading Solr Schema
[junit4:junit4]   2> 12140 T718 oass.IndexSchema.readSchema Schema name=test
[junit4:junit4]   2>  C35_STATE=coll:collection1 core:collection1 props:{shard=shard1, roles=null, state=recovering, core=collection1, collection=collection1, node_name=127.0.0.1:37341_, base_url=http://127.0.0.1:37341}
[junit4:junit4]   2> 12244 T688 C35 P37341 oasc.RecoveryStrategy.doRecovery Attempting to PeerSync from http://127.0.0.1:37338/collection1/ core=collection1 - recoveringAfterStartup=true
[junit4:junit4]   2> 12244 T688 C35 P37341 oasu.PeerSync.sync PeerSync: core=collection1 url=http://127.0.0.1:37341 START replicas=[http://127.0.0.1:37338/collection1/] nUpdates=100
[junit4:junit4]   2> 12245 T688 C35 P37341 oasu.PeerSync.sync WARNING no frame of reference to tell of we've missed updates
[junit4:junit4]   2> 12245 T688 C35 P37341 oasc.RecoveryStrategy.doRecovery PeerSync Recovery was not successful - trying replication. core=collection1
[junit4:junit4]   2> 12246 T688 C35 P37341 oasc.RecoveryStrategy.doRecovery Starting Replication Recovery. core=collection1
[junit4:junit4]   2> 12246 T688 C35 P37341 oasc.RecoveryStrategy.doRecovery Begin buffering updates. core=collection1
[junit4:junit4]   2> 12246 T688 C35 P37341 oasu.UpdateLog.bufferUpdates Starting to buffer updates. FSUpdateLog{state=ACTIVE, tlog=null}
[junit4:junit4]   2> 12246 T688 C35 P37341 oasc.RecoveryStrategy.replicate Attempting to replicate from http://127.0.0.1:37338/collection1/. core=collection1
[junit4:junit4]   2> 12246 T688 C35 P37341 oascsi.HttpClientUtil.createClient Creating new http client, config:maxConnections=128&maxConnectionsPerHost=32&followRedirects=false
[junit4:junit4]   2> ASYNC  NEW_CORE C37 name=collection1 org.apache.solr.core.SolrCore@21f0dbb9 url=http://127.0.0.1:37338/collection1 node=127.0.0.1:37338_ C37_STATE=coll:collection1 core:collection1 props:{shard=shard1, roles=null, state=active, core=collection1, collection=collection1, node_name=127.0.0.1:37338_, base_url=http://127.0.0.1:37338, leader=true}
[junit4:junit4]   2> 12254 T662 C37 P37338 REQ /get {getVersions=100&distrib=false&wt=javabin&qt=/get&version=2} status=0 QTime=0 
[junit4:junit4]   2> 12258 T663 C37 P37338 oasu.DirectUpdateHandler2.commit start commit{,optimize=false,openSearcher=false,waitSearcher=true,expungeDeletes=false,softCommit=false}
[junit4:junit4]   2> 12260 T663 C37 P37338 oasc.CachingDirectoryFactory.close Releasing directory:/usr/home/hudson/hudson-slave/workspace/Lucene-Solr-Tests-trunk-Java6/solr/build/solr-core/test/J0/./org.apache.solr.cloud.SyncSliceTest-1360591858916/jetty1
[junit4:junit4]   2> 12266 T663 C37 P37338 oasc.SolrDeletionPolicy.onInit SolrDeletionPolicy.onInit: commits:num=1
[junit4:junit4]   2> 		commit{dir=RateLimitedDirectoryWrapper(NRTCachingDirectory(org.apache.lucene.store.NIOFSDirectory@/usr/home/hudson/hudson-slave/workspace/Lucene-Solr-Tests-trunk-Java6/solr/build/solr-core/test/J0/org.apache.solr.cloud.SyncSliceTest-1360591858916/jetty1/index lockFactory=org.apache.lucene.store.NativeFSLockFactory@6e3b11bd; maxCacheMB=48.0 maxMergeSizeMB=4.0)),segFN=segments_1,generation=1,filenames=[segments_1]
[junit4:junit4]   2> 12267 T663 C37 P37338 oasc.SolrDeletionPolicy.updateCommits newest commit = 1[segments_1]
[junit4:junit4]   2> 12282 T663 C37 P37338 oasc.SolrDeletionPolicy.onCommit SolrDeletionPolicy.onCommit: commits:num=2
[junit4:junit4]   2> 		commit{dir=RateLimitedDirectoryWrapper(NRTCachingDirectory(org.apache.lucene.store.NIOFSDirectory@/usr/home/hudson/hudson-slave/workspace/Lucene-Solr-Tests-trunk-Java6/solr/build/solr-core/test/J0/org.apache.solr.cloud.SyncSliceTest-1360591858916/jetty1/index lockFactory=org.apache.lucene.store.NativeFSLockFactory@6e3b11bd; maxCacheMB=48.0 maxMergeSizeMB=4.0)),segFN=segments_1,generation=1,filenames=[segments_1]
[junit4:junit4]   2> 		commit{dir=RateLimitedDirectoryWrapper(NRTCachingDirectory(org.apache.lucene.store.NIOFSDirectory@/usr/home/hudson/hudson-slave/workspace/Lucene-Solr-Tests-trunk-Java6/solr/build/solr-core/test/J0/org.apache.solr.cloud.SyncSliceTest-1360591858916/jetty1/index lockFactory=org.apache.lucene.store.NativeFSLockFactory@6e3b11bd; maxCacheMB=48.0 maxMergeSizeMB=4.0)),segFN=segments_2,generation=2,filenames=[segments_2]
[junit4:junit4]   2> 12283 T663 C37 P37338 oasc.SolrDeletionPolicy.updateCommits newest commit = 2[segments_2]
[junit4:junit4]   2> 12284 T663 C37 P37338 oasc.CachingDirectoryFactory.close Releasing directory:/usr/home/hudson/hudson-slave/workspace/Lucene-Solr-Tests-trunk-Java6/solr/build/solr-core/test/J0/./org.apache.solr.cloud.SyncSliceTest-1360591858916/jetty1
[junit4:junit4]   2> 12285 T663 C37 P37338 oass.SolrIndexSearcher.<init> Opening Searcher@a8c9e70 realtime
[junit4:junit4]   2> 12285 T663 C37 P37338 oasu.DirectUpdateHandler2.commit end_commit_flush
[junit4:junit4]   2> 12286 T663 C37 P37338 /update {waitSearcher=true&openSearcher=false&commit=true&wt=javabin&commit_end_point=true&version=2&softCommit=false} {commit=} 0 28
[junit4:junit4]   2> 12287 T688 C35 P37341 oash.ReplicationHandler.inform Commits will be reserved for  10000
[junit4:junit4]   2> 12287 T688 C35 P37341 oash.SnapPuller.<init>  No value set for 'pollInterval'. Timer Task not started.
[junit4:junit4]   2> 12290 T664 C37 P37338 oash.ReplicationHandler.inform Commits will be reserved for  10000
[junit4:junit4]   2> 12290 T664 C37 P37338 REQ /replication {command=indexversion&qt=/replication&wt=javabin&version=2} status=0 QTime=1 
[junit4:junit4]   2> 12291 T688 C35 P37341 oash.SnapPuller.fetchLatestIndex Master's generation: 2
[junit4:junit4]   2> 12291 T688 C35 P37341 oash.SnapPuller.fetchLatestIndex Slave's generation: 1
[junit4:junit4]   2> 12292 T688 C35 P37341 oash.SnapPuller.fetchLatestIndex Starting replication process
[junit4:junit4]   2> 12295 T664 C37 P37338 oasc.CachingDirectoryFactory.close Releasing directory:/usr/home/hudson/hudson-slave/workspace/Lucene-Solr-Tests-trunk-Java6/solr/build/solr-core/test/J0/./org.apache.solr.cloud.SyncSliceTest-1360591858916/jetty1
[junit4:junit4]   2> 12295 T664 C37 P37338 oasc.CachingDirectoryFactory.close Releasing directory:/usr/home/hudson/hudson-slave/workspace/Lucene-Solr-Tests-trunk-Java6/solr/build/solr-core/test/J0/./org.apache.solr.cloud.SyncSliceTest-1360591858916/jetty1/index
[junit4:junit4]   2> 12296 T664 C37 P37338 REQ /replication {command=filelist&qt=/replication&wt=javabin&generation=2&version=2} status=0 QTime=2 
[junit4:junit4]   2> 12297 T688 C35 P37341 oash.SnapPuller.fetchLatestIndex Number of files in latest index in master: 1
[junit4:junit4]   2> 12298 T688 C35 P37341 oasc.CachingDirectoryFactory.get return new directory for /usr/home/hudson/hudson-slave/workspace/Lucene-Solr-Tests-trunk-Java6/solr/build/solr-core/test/J0/./org.apache.solr.cloud.SyncSliceTest-1360591858916/jetty2/index.20130212011111209 forceNew:false
[junit4:junit4]   2> 12298 T688 C35 P37341 oasc.CachingDirectoryFactory.close Releasing directory:/usr/home/hudson/hudson-slave/workspace/Lucene-Solr-Tests-trunk-Java6/solr/build/solr-core/test/J0/./org.apache.solr.cloud.SyncSliceTest-1360591858916/jetty2
[junit4:junit4]   2> 12299 T688 C35 P37341 oash.SnapPuller.fetchLatestIndex Starting download to RateLimitedDirectoryWrapper(NRTCachingDirectory(org.apache.lucene.store.NIOFSDirectory@/usr/home/hudson/hudson-slave/workspace/Lucene-Solr-Tests-trunk-Java6/solr/build/solr-core/test/J0/org.apache.solr.cloud.SyncSliceTest-1360591858916/jetty2/index.20130212011111209 lockFactory=org.apache.lucene.store.NativeFSLockFactory@533c43e5; maxCacheMB=48.0 maxMergeSizeMB=4.0)) fullCopy=true
[junit4:junit4]   2> 12302 T664 C37 P37338 REQ /replication {file=segments_2&command=filecontent&checksum=true&wt=filestream&qt=/replication&generation=2} status=0 QTime=0 
[junit4:junit4]   2> 12304 T688 C35 P37341 oasc.CachingDirectoryFactory.close Releasing directory:/usr/home/hudson/hudson-slave/workspace/Lucene-Solr-Tests-trunk-Java6/solr/build/solr-core/test/J0/./org.apache.solr.cloud.SyncSliceTest-1360591858916/jetty2/index
[junit4:junit4]   2> 12304 T688 C35 P37341 oash.SnapPuller.fetchLatestIndex Total time taken for download : 0 secs
[junit4:junit4]   2> 12305 T688 C35 P37341 oash.SnapPuller.modifyIndexProps New index installed. Updating index properties... index=index.20130212011111209
[junit4:junit4]   2> 12306 T688 C35 P37341 oasc.CachingDirectoryFactory.close Releasing directory:/usr/home/hudson/hudson-slave/workspace/Lucene-Solr-Tests-trunk-Java6/solr/build/solr-core/test/J0/./org.apache.solr.cloud.SyncSliceTest-1360591858916/jetty2
[junit4:junit4]   2> 12307 T688 C35 P37341 oasc.CachingDirectoryFactory.close Releasing directory:/usr/home/hudson/hudson-slave/workspace/Lucene-Solr-Tests-trunk-Java6/solr/build/solr-core/test/J0/./org.apache.solr.cloud.SyncSliceTest-1360591858916/jetty2
[junit4:junit4]   2> 12307 T688 C35 P37341 oasc.SolrCore.getNewIndexDir New index directory detected: old=./org.apache.solr.cloud.SyncSliceTest-1360591858916/jetty2/index/ new=./org.apache.solr.cloud.SyncSliceTest-1360591858916/jetty2/index.20130212011111209
[junit4:junit4]   2> 12311 T688 C35 P37341 oasc.SolrDeletionPolicy.onInit SolrDeletionPolicy.onInit: commits:num=1
[junit4:junit4]   2> 		commit{dir=RateLimitedDirectoryWrapper(NRTCachingDirectory(org.apache.lucene.store.NIOFSDirectory@/usr/home/hudson/hudson-slave/workspace/Lucene-Solr-Tests-trunk-Java6/solr/build/solr-core/test/J0/org.apache.solr.cloud.SyncSliceTest-1360591858916/jetty2/index.20130212011111209 lockFactory=org.apache.lucene.store.NativeFSLockFactory@533c43e5; maxCacheMB=48.0 maxMergeSizeMB=4.0)),segFN=segments_2,generation=2,filenames=[segments_2]
[junit4:junit4]   2> 12312 T688 C35 P37341 oasc.SolrDeletionPolicy.updateCommits newest commit = 2[segments_2]
[junit4:junit4]   2> 12313 T688 C35 P37341 oasc.CachingDirectoryFactory.close Releasing directory:/usr/home/hudson/hudson-slave/workspace/Lucene-Solr-Tests-trunk-Java6/solr/build/solr-core/test/J0/./org.apache.solr.cloud.SyncSliceTest-1360591858916/jetty2
[junit4:junit4]   2> 12313 T688 C35 P37341 oasu.DefaultSolrCoreState.newIndexWriter Creating new IndexWriter...
[junit4:junit4]   2> 12314 T688 C35 P37341 oasu.DefaultSolrCoreState.newIndexWriter Waiting until IndexWriter is unused... core=collection1
[junit4:junit4]   2> 12314 T688 C35 P37341 oasu.DefaultSolrCoreState.newIndexWriter Rollback old IndexWriter... core=collection1
[junit4:junit4]   2> 12315 T688 C35 P37341 oasc.CachingDirectoryFactory.close Releasing directory:/usr/home/hudson/hudson-slave/workspace/Lucene-Solr-Tests-trunk-Java6/solr/build/solr-core/test/J0/./org.apache.solr.cloud.SyncSliceTest-1360591858916/jetty2/index.20130212011111209
[junit4:junit4]   2> 12315 T688 C35 P37341 oasc.CachingDirectoryFactory.close Releasing directory:/usr/home/hudson/hudson-slave/workspace/Lucene-Solr-Tests-trunk-Java6/solr/build/solr-core/test/J0/./org.apache.solr.cloud.SyncSliceTest-1360591858916/jetty2
[junit4:junit4]   2> 12319 T688 C35 P37341 oasc.SolrDeletionPolicy.onInit SolrDeletionPolicy.onInit: commits:num=1
[junit4:junit4]   2> 		commit{dir=RateLimitedDirectoryWrapper(NRTCachingDirectory(org.apache.lucene.store.NIOFSDirectory@/usr/home/hudson/hudson-slave/workspace/Lucene-Solr-Tests-trunk-Java6/solr/build/solr-core/test/J0/org.apache.solr.cloud.SyncSliceTest-1360591858916/jetty2/index.20130212011111209 lockFactory=org.apache.lucene.store.NativeFSLockFactory@533c43e5; maxCacheMB=48.0 maxMergeSizeMB=4.0)),segFN=segments_2,generation=2,filenames=[segments_2]
[junit4:junit4]   2> 12320 T688 C35 P37341 oasc.SolrDeletionPolicy.updateCommits newest commit = 2[segments_2]
[junit4:junit4]   2> 12320 T688 C35 P37341 oasu.DefaultSolrCoreState.newIndexWriter New IndexWriter is ready to be used.
[junit4:junit4]   2> 12320 T688 C35 P37341 oasc.CachingDirectoryFactory.close Releasing directory:/usr/home/hudson/hudson-slave/workspace/Lucene-Solr-Tests-trunk-Java6/solr/build/solr-core/test/J0/./org.apache.solr.cloud.SyncSliceTest-1360591858916/jetty2
[junit4:junit4]   2> 12321 T688 C35 P37341 oass.SolrIndexSearcher.<init> Opening Searcher@e7db0da main
[junit4:junit4]   2> 12322 T687 oasc.SolrCore.registerSearcher [collection1] Registered new searcher Searcher@e7db0da main{StandardDirectoryReader(segments_2:1:nrt)}
[junit4:junit4]   2> 12323 T687 oasc.CachingDirectoryFactory.close Releasing directory:/usr/home/hudson/hudson-slave/workspace/Lucene-Solr-Tests-trunk-Java6/solr/build/solr-core/test/J0/./org.apache.solr.cloud.SyncSliceTest-1360591858916/jetty2/index
[junit4:junit4]   2> 12323 T688 C35 P37341 oasu.DirectUpdateHandler2.commit start commit{,optimize=false,openSearcher=false,waitSearcher=false,expungeDeletes=false,softCommit=false}
[junit4:junit4]   2> 12327 T688 C35 P37341 oasc.SolrDeletionPolicy.onCommit SolrDeletionPolicy.onCommit: commits:num=2
[junit4:junit4]   2> 		commit{dir=RateLimitedDirectoryWrapper(NRTCachingDirectory(org.apache.lucene.store.NIOFSDirectory@/usr/home/hudson/hudson-slave/workspace/Lucene-Solr-Tests-trunk-Java6/solr/build/solr-core/test/J0/org.apache.solr.cloud.SyncSliceTest-1360591858916/jetty2/index.20130212011111209 lockFactory=org.apache.lucene.store.NativeFSLockFactory@533c43e5; maxCacheMB=48.0 maxMergeSizeMB=4.0)),segFN=segments_2,generation=2,filenames=[segments_2]
[junit4:junit4]   2> 		commit{dir=RateLimitedDirectoryWrapper(NRTCachingDirectory(org.apache.lucene.store.NIOFSDirectory@/usr/home/hudson/hudson-slave/workspace/Lucene-Solr-Tests-trunk-Java6/solr/build/solr-core/test/J0/org.apache.solr.cloud.SyncSliceTest-1360591858916/jetty2/index.20130212011111209 lockFactory=org.apache.lucene.store.NativeFSLockFactory@533c43e5; maxCacheMB=48.0 maxMergeSizeMB=4.0)),segFN=segments_3,generation=3,filenames=[segments_3]
[junit4:junit4]   2> 12327 T688 C35 P37341 oasc.SolrDeletionPolicy.updateCommits newest commit = 3[segments_3]
[junit4:junit4]   2> 12328 T688 C35 P37341 oasc.CachingDirectoryFactory.close Releasing directory:/usr/home/hudson/hudson-slave/workspace/Lucene-Solr-Tests-trunk-Java6/solr/build/solr-core/test/J0/./org.apache.solr.cloud.SyncSliceTest-1360591858916/jetty2
[junit4:junit4]   2> 12329 T688 C35 P37341 oasu.DirectUpdateHandler2.commit end_commit_flush
[junit4:junit4]   2> 12329 T688 C35 P37341 oasc.CachingDirectoryFactory.close Releasing directory:/usr/home/hudson/hudson-slave/workspace/Lucene-Solr-Tests-trunk-Java6/solr/build/solr-core/test/J0/./org.apache.solr.cloud.SyncSliceTest-1360591858916/jetty2/index.20130212011111209
[junit4:junit4]   2> 12329 T688 C35 P37341 oasc.CachingDirectoryFactory.close Releasing directory:/usr/home/hudson/hudson-slave/workspace/Lucene-Solr-Tests-trunk-Java6/solr/build/solr-core/test/J0/./org.apache.solr.cloud.SyncSliceTest-1360591858916/jetty2/index
[junit4:junit4]   2> 12329 T688 C35 P37341 oasc.RecoveryStrategy.replay No replay needed. core=collection1
[junit4:junit4]   2> 12329 T688 C35 P37341 oasc.RecoveryStrategy.doRecovery Replication Recovery was successful - registering as Active. core=collection1
[junit4:junit4]   2> 12329 T688 C35 P37341 oasc.ZkController.publish publishing core=collection1 state=active
[junit4:junit4]   2> 12329 T688 C35 P37341 oasc.ZkController.publish numShards not found on descriptor - reading it from system property
[junit4:junit4]   2> 12337 T688 C35 P37341 oasc.RecoveryStrategy.doRecovery Finished recovery process. core=collection1
[junit4:junit4]   2> 12811 T718 oass.OpenExchangeRatesOrgProvider.init Initialized with rates=open-exchange-rates.json, refreshInterval=1440.
[junit4:junit4]   2> 12824 T718 oass.IndexSchema.readSchema default search field in schema is text
[junit4:junit4]   2> 12829 T718 oass.IndexSchema.readSchema unique key field: id
[junit4:junit4]   2> 12845 T718 oass.FileExchangeRateProvider.reload Reloading exchange rates from file currency.xml
[junit4:junit4]   2> 12857 T718 oass.FileExchangeRateProvider.reload Reloading exchange rates from file currency.xml
[junit4:junit4]   2> 12862 T718 oass.OpenExchangeRatesOrgProvider.reload Reloading exchange rates from open-exchange-rates.json
[junit4:junit4]   2> 12863 T718 oass.OpenExchangeRatesOrgProvider.reload Reloading exchange rates from open-exchange-rates.json
[junit4:junit4]   2> 12864 T718 oasc.SolrCore.<init> [collection1] Opening new SolrCore at /usr/home/hudson/hudson-slave/workspace/Lucene-Solr-Tests-trunk-Java6/solr/build/solr-core/test/J0/./org.apache.solr.cloud.SyncSliceTest-jetty4-1360591870435/collection1/, dataDir=./org.apache.solr.cloud.SyncSliceTest-1360591858916/jetty4/
[junit4:junit4]   2> 12865 T718 oasc.JmxMonitoredMap.<init> JMX monitoring is enabled. Adding Solr mbeans to JMX Server: com.sun.jmx.mbeanserver.JmxMBeanServer@18330bf
[junit4:junit4]   2> 12865 T718 oasc.SolrCore.initDirectoryFactory solr.NRTCachingDirectoryFactory
[junit4:junit4]   2> 12866 T718 oasc.CachingDirectoryFactory.get return new directory for /usr/home/hudson/hudson-slave/workspace/Lucene-Solr-Tests-trunk-Java6/solr/build/solr-core/test/J0/./org.apache.solr.cloud.SyncSliceTest-1360591858916/jetty4 forceNew:false
[junit4:junit4]   2> 12867 T718 oasc.CachingDirectoryFactory.close Releasing directory:/usr/home/hudson/hudson-slave/workspace/Lucene-Solr-Tests-trunk-Java6/solr/build/solr-core/test/J0/./org.apache.solr.cloud.SyncSliceTest-1360591858916/jetty4
[junit4:junit4]   2> 12867 T718 oasc.SolrCore.getNewIndexDir New index directory detected: old=null new=./org.apache.solr.cloud.SyncSliceTest-1360591858916/jetty4/index/
[junit4:junit4]   2> 12868 T718 oasc.SolrCore.initIndex WARNING [collection1] Solr index directory './org.apache.solr.cloud.SyncSliceTest-1360591858916/jetty4/index' doesn't exist. Creating new index...
[junit4:junit4]   2> 12869 T718 oasc.CachingDirectoryFactory.get return new directory for /usr/home/hudson/hudson-slave/workspace/Lucene-Solr-Tests-trunk-Java6/solr/build/solr-core/test/J0/./org.apache.solr.cloud.SyncSliceTest-1360591858916/jetty4/index forceNew:false
[junit4:junit4]   2> 12890 T652 oascc.ZkStateReader.updateClusterState Updating cloud state from ZooKeeper... 
[junit4:junit4]   2> 12891 T652 oasc.Overseer$ClusterStateUpdater.updateState Update state numShards=1 message={
[junit4:junit4]   2> 	  "operation":"state",
[junit4:junit4]   2> 	  "numShards":"1",
[junit4:junit4]   2> 	  "shard":"shard1",
[junit4:junit4]   2> 	  "roles":null,
[junit4:junit4]   2> 	  "state":"recovering",
[junit4:junit4]   2> 	  "core":"collection1",
[junit4:junit4]   2> 	  "collection":"collection1",
[junit4:junit4]   2> 	  "node_name":"127.0.0.1:37345_",
[junit4:junit4]   2> 	  "base_url":"http://127.0.0.1:37345"}
[junit4:junit4]   2> 12907 T718 oasc.SolrDeletionPolicy.onCommit SolrDeletionPolicy.onCommit: commits:num=1
[junit4:junit4]   2> 		commit{dir=RateLimitedDirectoryWrapper(NRTCachingDirectory(org.apache.lucene.store.NIOFSDirectory@/usr/home/hudson/hudson-slave/workspace/Lucene-Solr-Tests-trunk-Java6/solr/build/solr-core/test/J0/org.apache.solr.cloud.SyncSliceTest-1360591858916/jetty4/index lockFactory=org.apache.lucene.store.NativeFSLockFactory@24534011; maxCacheMB=48.0 maxMergeSizeMB=4.0)),segFN=segments_1,generation=1,filenames=[segments_1]
[junit4:junit4]   2> 12908 T718 oasc.SolrDeletionPolicy.updateCommits newest commit = 1[segments_1]
[junit4:junit4]   2> 12909 T718 oasc.CachingDirectoryFactory.close Releasing directory:/usr/home/hudson/hudson-slave/workspace/Lucene-Solr-Tests-trunk-Java6/solr/build/solr-core/test/J0/./org.apache.solr.cloud.SyncSliceTest-1360591858916/jetty4/index
[junit4:junit4]   2> 12909 T718 oasc.SolrCore.initWriters created xml: solr.XMLResponseWriter
[junit4:junit4]   2> 12909 T652 oasc.Overseer$ClusterStateUpdater.updateState Update state numShards=1 message={
[junit4:junit4]   2> 	  "operation":"state",
[junit4:junit4]   2> 	  "numShards":"1",
[junit4:junit4]   2> 	  "shard":"shard1",
[junit4:junit4]   2> 	  "roles":null,
[junit4:junit4]   2> 	  "state":"active",
[junit4:junit4]   2> 	  "core":"collection1",
[junit4:junit4]   2> 	  "collection":"collection1",
[junit4:junit4]   2> 	  "node_name":"127.0.0.1:37341_",
[junit4:junit4]   2> 	  "base_url":"http://127.0.0.1:37341"}
[junit4:junit4]   2> 12911 T718 oasup.UpdateRequestProcessorChain.init inserting DistributedUpdateProcessorFactory into updateRequestProcessorChain "dedupe"
[junit4:junit4]   2> 12911 T718 oasup.UpdateRequestProcessorChain.init inserting DistributedUpdateProcessorFactory into updateRequestProcessorChain "dedupe-allfields"
[junit4:junit4]   2> 12912 T718 oasup.UpdateRequestProcessorChain.init inserting DistributedUpdateProcessorFactory into updateRequestProcessorChain "stored_sig"
[junit4:junit4]   2> 12912 T718 oasup.UpdateRequestProcessorChain.init inserting DistributedUpdateProcessorFactory into updateRequestProcessorChain "uniq-fields"
[junit4:junit4]   2> 12913 T718 oasup.UpdateRequestProcessorChain.init inserting DistributedUpdateProcessorFactory into updateRequestProcessorChain "distrib-dup-test-chain-implicit"
[junit4:junit4]   2> 12913 T718 oasc.RequestHandlers.initHandlersFromConfig adding lazy requestHandler: solr.ReplicationHandler
[junit4:junit4]   2> 12913 T718 oasc.RequestHandlers.initHandlersFromConfig created /replication: solr.ReplicationHandler
[junit4:junit4]   2> 12914 T718 oasc.RequestHandlers.initHandlersFromConfig created standard: solr.StandardRequestHandler
[junit4:junit4]   2> 12914 T718 oasc.RequestHandlers.initHandlersFromConfig created /get: solr.RealTimeGetHandler
[junit4:junit4]   2> 12915 T718 oasc.RequestHandlers.initHandlersFromConfig created dismax: solr.SearchHandler
[junit4:junit4]   2> 12916 T718 oasc.RequestHandlers.initHandlersFromConfig created mock: org.apache.solr.core.MockQuerySenderListenerReqHandler
[junit4:junit4]   2> 12916 T718 oasc.RequestHandlers.initHandlersFromConfig created /admin/: org.apache.solr.handler.admin.AdminHandlers
[junit4:junit4]   2> 12916 T718 oasc.RequestHandlers.initHandlersFromConfig created defaults: solr.StandardRequestHandler
[junit4:junit4]   2> 12917 T718 oasc.RequestHandlers.initHandlersFromConfig adding lazy requestHandler: solr.StandardRequestHandler
[junit4:junit4]   2> 12917 T718 oasc.RequestHandlers.initHandlersFromConfig created lazy: solr.StandardRequestHandler
[junit4:junit4]   2> 12918 T718 oasc.RequestHandlers.initHandlersFromConfig created /update: solr.UpdateRequestHandler
[junit4:junit4]   2> 12918 T718 oasc.RequestHandlers.initHandlersFromConfig created /terms: org.apache.solr.handler.component.SearchHandler
[junit4:junit4]   2> 12919 T718 oasc.RequestHandlers.initHandlersFromConfig created spellCheckCompRH: org.apache.solr.handler.component.SearchHandler
[junit4:junit4]   2> 12919 T718 oasc.RequestHandlers.initHandlersFromConfig created spellCheckCompRH_Direct: org.apache.solr.handler.component.SearchHandler
[junit4:junit4]   2> 12920 T718 oasc.RequestHandlers.initHandlersFromConfig created spellCheckWithWordbreak: org.apache.solr.handler.component.SearchHandler
[junit4:junit4]   2> 12920 T718 oasc.RequestHandlers.initHandlersFromConfig created spellCheckWithWordbreak_Direct: org.apache.solr.handler.component.SearchHandler
[junit4:junit4]   2> 12921 T718 oasc.RequestHandlers.initHandlersFromConfig created spellCheckCompRH1: org.apache.solr.handler.component.SearchHandler
[junit4:junit4]   2> 12921 T718 oasc.RequestHandlers.initHandlersFromConfig created mltrh: org.apache.solr.handler.component.SearchHandler
[junit4:junit4]   2> 12922 T718 oasc.RequestHandlers.initHandlersFromConfig created tvrh: org.apache.solr.handler.component.SearchHandler
[junit4:junit4]   2> 12922 T717 oascc.ZkStateReader$2.process A cluster state change: WatchedEvent state:SyncConnected type:NodeDataChanged path:/clusterstate.json, has occurred - updating... (live nodes size: 5)
[junit4:junit4]   2> 12922 T651 oascc.ZkStateReader$2.process A cluster state change: WatchedEvent state:SyncConnected type:NodeDataChanged path:/clusterstate.json, has occurred - updating... (live nodes size: 5)
[junit4:junit4]   2> 12922 T701 oascc.ZkStateReader$2.process A cluster state change: WatchedEvent state:SyncConnected type:NodeDataChanged path:/clusterstate.json, has occurred - updating... (live nodes size: 5)
[junit4:junit4]   2> 12922 T670 oascc.ZkStateReader$2.process A cluster state change: WatchedEvent state:SyncConnected type:NodeDataChanged path:/clusterstate.json, has occurred - updating... (live nodes size: 5)
[junit4:junit4]   2> 12922 T685 oascc.ZkStateReader$2.process A cluster state change: WatchedEvent state:SyncConnected type:NodeDataChanged path:/clusterstate.json, has occurred - updating... (live nodes size: 5)
[junit4:junit4]   2> 12922 T718 oasc.RequestHandlers.initHandlersFromConfig created /mlt: solr.MoreLikeThisHandler
[junit4:junit4]   2> 12922 T657 oascc.ZkStateReader$2.process A cluster state change: WatchedEvent state:SyncConnected type:NodeDataChanged path:/clusterstate.json, has occurred - updating... (live nodes size: 5)
[junit4:junit4]   2> 12924 T718 oasc.RequestHandlers.initHandlersFromConfig created /debug/dump: solr.DumpRequestHandler
[junit4:junit4]   2> 12932 T718 oashl.XMLLoader.init xsltCacheLifetimeSeconds=60
[junit4:junit4]   2> 12938 T718 oasc.SolrCore.initDeprecatedSupport WARNING solrconfig.xml uses deprecated <admin/gettableFiles>, Please update your config to use the ShowFileRequestHandler.
[junit4:junit4]   2> 12939 T718 oasc.SolrCore.initDeprecatedSupport WARNING adding ShowFileRequestHandler with hidden files: [SCHEMA.XML, OLD_SYNONYMS.TXT, STOPWORDS.TXT, PROTWORDS.TXT, OPEN-EXCHANGE-RATES.JSON, SYNONYMS.TXT, CURRENCY.XML, MAPPING-ISOLATIN1ACCENT.TXT]
[junit4:junit4]   2> 12942 T718 oasc.CachingDirectoryFactory.close Releasing directory:/usr/home/hudson/hudson-slave/workspace/Lucene-Solr-Tests-trunk-Java6/solr/build/solr-core/test/J0/./org.apache.solr.cloud.SyncSliceTest-1360591858916/jetty4
[junit4:junit4]   2> 12943 T718 oass.SolrIndexSearcher.<init> Opening Searcher@4f1d0f91 main
[junit4:junit4]   2> 12945 T718 oasu.CommitTracker.<init> Hard AutoCommit: disabled
[junit4:junit4]   2> 12945 T718 oasu.CommitTracker.<init> Soft AutoCommit: disabled
[junit4:junit4]   2> 12945 T718 oashc.SpellCheckComponent.inform Initializing spell checkers
[junit4:junit4]   2> 12953 T718 oass.DirectSolrSpellChecker.init init: {name=direct,classname=DirectSolrSpellChecker,field=lowerfilt,minQueryLength=3}
[junit4:junit4]   2> 13013 T721 oasc.SolrCore.registerSearcher [collection1] Registered new searcher Searcher@4f1d0f91 main{StandardDirectoryReader(segments_1:1)}
[junit4:junit4]   2> 13018 T718 oasc.ZkController.publish publishing core=collection1 state=down
[junit4:junit4]   2> 13018 T718 oasc.ZkController.publish numShards not found on descriptor - reading it from system property
[junit4:junit4]   2> 14440 T652 oascc.ZkStateReader.updateClusterState Updating cloud state from ZooKeeper... 
[junit4:junit4]   2> 14441 T652 oasc.Overseer$ClusterStateUpdater.updateState Update state numShards=1 message={
[junit4:junit4]   2> 	  "operation":"state",
[junit4:junit4]   2> 	  "numShards":"1",
[junit4:junit4]   2> 	  "shard":null,
[junit4:junit4]   2> 	  "roles":null,
[junit4:junit4]   2> 	  "state":"down",
[junit4:junit4]   2> 	  "core":"collection1",
[junit4:junit4]   2> 	  "collection":"collection1",
[junit4:junit4]   2> 	  "node_name":"127.0.0.1:37349_",
[junit4:junit4]   2> 	  "base_url":"http://127.0.0.1:37349"}
[junit4:junit4]   2> 14441 T652 oasc.Overseer$ClusterStateUpdater.updateState Collection already exists with numShards=1
[junit4:junit4]   2> 14441 T652 oasc.Overseer$ClusterStateUpdater.updateState Assigning new node to shard shard=shard1
[junit4:junit4]   2> 14486 T717 oascc.ZkStateReader$2.process A cluster state change: WatchedEvent state:SyncConnected type:NodeDataChanged path:/clusterstate.json, has occurred - updating... (live nodes size: 5)
[junit4:junit4]   2> 14486 T657 oascc.ZkStateReader$2.process A cluster state change: WatchedEvent state:SyncConnected type:NodeDataChanged path:/clusterstate.json, has occurred - updating... (live nodes size: 5)
[junit4:junit4]   2> 14487 T651 oascc.ZkStateReader$2.process A cluster state change: WatchedEvent state:SyncConnected type:NodeDataChanged path:/clusterstate.json, has occurred - updating... (live nodes size: 5)
[junit4:junit4]   2> 14487 T701 oascc.ZkStateReader$2.process A cluster state change: WatchedEvent state:SyncConnected type:NodeDataChanged path:/clusterstate.json, has occurred - updating... (live nodes size: 5)
[junit4:junit4]   2> 14486 T685 oascc.ZkStateReader$2.process A cluster state change: WatchedEvent state:SyncConnected type:NodeDataChanged path:/clusterstate.json, has occurred - updating... (live nodes size: 5)
[junit4:junit4]   2> 14486 T670 oascc.ZkStateReader$2.process A cluster state change: WatchedEvent state:SyncConnected type:NodeDataChanged path:/clusterstate.json, has occurred - updating... (live nodes size: 5)
[junit4:junit4]   2> 15022 T718 oasc.CoreContainer.registerCore registering core: collection1
[junit4:junit4]   2> 15022 T718 oasc.ZkController.register Register replica - core:collection1 address:http://127.0.0.1:37349 collection:collection1 shard:shard1
[junit4:junit4]   2> 15026 T718 oasc.ZkController.register We are http://127.0.0.1:37349/collection1/ and leader is http://127.0.0.1:37338/collection1/
[junit4:junit4]   2> 15026 T718 oasc.ZkController.register No LogReplay needed for core=collection1 baseURL=http://127.0.0.1:37349
[junit4:junit4]   2> 15026 T718 oasc.ZkController.checkRecovery Core needs to recover:collection1
[junit4:junit4]   2> 15027 T718 oasu.DefaultSolrCoreState.doRecovery Running recovery - first canceling any ongoing recovery
[junit4:junit4]   2> ASYNC  NEW_CORE C38 name=collection1 org.apache.solr.core.SolrCore@64dd4991 url=http://127.0.0.1:37349/collection1 node=127.0.0.1:37349_ C38_STATE=coll:collection1 core:collection1 props:{shard=null, roles=null, state=down, core=collection1, collection=collection1, node_name=127.0.0.1:37349_, base_url=http://127.0.0.1:37349}
[junit4:junit4]   2> 15028 T722 C38 P37349 oasc.RecoveryStrategy.run Starting recovery process.  core=collection1 recoveringAfterStartup=true
[junit4:junit4]   2> 15028 T722 C38 P37349 oasc.RecoveryStrategy.doRecovery ###### startupVersions=[]
[junit4:junit4]   2> 15028 T718 oascc.ZkStateReader.updateClusterState Updating cloud state from ZooKeeper... 
[junit4:junit4]   2> 15028 T722 C38 P37349 oasc.ZkController.publish publishing core=collection1 state=recovering
[junit4:junit4]   2> 15029 T722 C38 P37349 oasc.ZkController.publish numShards not found on descriptor - reading it from system property
[junit4:junit4]   2> 15029 T629 oass.SolrDispatchFilter.init user.dir=/usr/home/hudson/hudson-slave/workspace/Lucene-Solr-Tests-trunk-Java6/solr/build/solr-core/test/J0
[junit4:junit4]   2> 15030 T629 oass.SolrDispatchFilter.init SolrDispatchFilter.init() done
[junit4:junit4]   2> 15030 T722 C38 P37349 oascsi.HttpClientUtil.createClient Creating new http client, config:maxConnections=128&maxConnectionsPerHost=32&followRedirects=false
[junit4:junit4]   2> 15030 T629 oascsi.HttpClientUtil.createClient Creating new http client, config:maxConnections=128&maxConnectionsPerHost=32&followRedirects=false
[junit4:junit4]   2> 15049 T629 oascc.ZkStateReader.updateClusterState Updating cloud state from ZooKeeper... 
[junit4:junit4]   2> 15051 T629 oasc.AbstractFullDistribZkTestBase.waitForThingsToLevelOut Wait for recoveries to finish - wait 15 for each attempt
[junit4:junit4]   2> 15051 T629 oasc.AbstractDistribZkTestBase.waitForRecoveriesToFinish Wait for recoveries to finish - collection: collection1 failOnTimeout:true timeout (sec):15
[junit4:junit4]   2> 15052 T629 oascc.ZkStateReader.updateClusterState Updating cloud state from ZooKeeper... 
[junit4:junit4]   2>  C36_STATE=coll:collection1 core:collection1 props:{shard=shard1, roles=null, state=recovering, core=collection1, collection=collection1, node_name=127.0.0.1:37345_, base_url=http://127.0.0.1:37345}
[junit4:junit4]   2> 15529 T704 C36 P37345 oasc.RecoveryStrategy.doRecovery Attempting to PeerSync from http://127.0.0.1:37338/collection1/ core=collection1 - recoveringAfterStartup=true
[junit4:junit4]   2> 15529 T704 C36 P37345 oasu.PeerSync.sync PeerSync: core=collection1 url=http://127.0.0.1:37345 START replicas=[http://127.0.0.1:37338/collection1/] nUpdates=100
[junit4:junit4]   2> 15529 T704 C36 P37345 oasu.PeerSync.sync WARNING no frame of reference to tell of we've missed updates
[junit4:junit4]   2> 15529 T704 C36 P37345 oasc.RecoveryStrategy.doRecovery PeerSync Recovery was not successful - trying replication. core=collection1
[junit4:junit4]   2> 15530 T704 C36 P37345 oasc.RecoveryStrategy.doRecovery Starting Replication Recovery. core=collection1
[junit4:junit4]   2> 15530 T704 C36 P37345 oasc.RecoveryStrategy.doRecovery Begin buffering updates. core=collection1
[junit4:junit4]   2> 15530 T704 C36 P37345 oasu.UpdateLog.bufferUpdates Starting to buffer updates. FSUpdateLog{state=ACTIVE, tlog=null}
[junit4:junit4]   2> 15530 T704 C36 P37345 oasc.RecoveryStrategy.replicate Attempting to replicate from http://127.0.0.1:37338/collection1/. core=collection1
[junit4:junit4]   2> 15530 T704 C36 P37345 oascsi.HttpClientUtil.createClient Creating new http client, config:maxConnections=128&maxConnectionsPerHost=32&followRedirects=false
[junit4:junit4]   2> 15532 T662 C37 P37338 REQ /get {getVersions=100&distrib=false&wt=javabin&qt=/get&version=2} status=0 QTime=0 
[junit4:junit4]   2> 15538 T666 C37 P37338 oasu.DirectUpdateHandler2.commit start commit{,optimize=false,openSearcher=false,waitSearcher=true,expungeDeletes=false,softCommit=false}
[junit4:junit4]   2> 15555 T666 C37 P37338 oasc.SolrDeletionPolicy.onCommit SolrDeletionPolicy.onCommit: commits:num=2
[junit4:junit4]   2> 		commit{dir=RateLimitedDirectoryWrapper(NRTCachingDirectory(org.apache.lucene.store.NIOFSDirectory@/usr/home/hudson/hudson-slave/workspace/Lucene-Solr-Tests-trunk-Java6/solr/build/solr-core/test/J0/org.apache.solr.cloud.SyncSliceTest-1360591858916/jetty1/index lockFactory=org.apache.lucene.store.NativeFSLockFactory@6e3b11bd; maxCacheMB=48.0 maxMergeSizeMB=4.0)),segFN=segments_2,generation=2,filenames=[segments_2]
[junit4:junit4]   2> 		commit{dir=RateLimitedDirectoryWrapper(NRTCachingDirectory(org.apache.lucene.store.NIOFSDirectory@/usr/home/hudson/hudson-slave/workspace/Lucene-Solr-Tests-trunk-Java6/solr/build/solr-core/test/J0/org.apache.solr.cloud.SyncSliceTest-1360591858916/jetty1/index lockFactory=org.apache.lucene.store.NativeFSLockFactory@6e3b11bd; maxCacheMB=48.0 maxMergeSizeMB=4.0)),segFN=segments_3,generation=3,filenames=[segments_3]
[junit4:junit4]   2> 15556 T666 C37 P37338 oasc.SolrDeletionPolicy.updateCommits newest commit = 3[segments_3]
[junit4:junit4]   2> 15556 T666 C37 P37338 oasc.CachingDirectoryFactory.close Releasing directory:/usr/home/hudson/hudson-slave/workspace/Lucene-Solr-Tests-trunk-Java6/solr/build/solr-core/test/J0/./org.apache.solr.cloud.SyncSliceTest-1360591858916/jetty1
[junit4:junit4]   2> 15557 T666 C37 P37338 oasu.DirectUpdateHandler2.commit end_commit_flush
[junit4:junit4]   2> 15557 T666 C37 P37338 /update {waitSearcher=true&openSearcher=false&commit=true&wt=javabin&commit_end_point=true&version=2&softCommit=false} {commit=} 0 19
[junit4:junit4]   2> 15558 T704 C36 P37345 oash.ReplicationHandler.inform Commits will be reserved for  10000
[junit4:junit4]   2> 15561 T704 C36 P37345 oash.SnapPuller.<init>  No value set for 'pollInterval'. Timer Task not started.
[junit4:junit4]   2> 15564 T664 C37 P37338 REQ /replication {command=indexversion&qt=/replication&wt=javabin&version=2} status=0 QTime=0 
[junit4:junit4]   2> 15565 T704 C36 P37345 oash.SnapPuller.fetchLatestIndex Master's generation: 3
[junit4:junit4]   2> 15565 T704 C36 P37345 oash.SnapPuller.fetchLatestIndex Slave's generation: 1
[junit4:junit4]   2> 15565 T704 C36 P37345 oash.SnapPuller.fetchLatestIndex Starting replication process
[junit4:junit4]   2> 15567 T664 C37 P37338 oasc.CachingDirectoryFactory.close Releasing directory:/usr/home/hudson/hudson-slave/workspace/Lucene-Solr-Tests-trunk-Java6/solr/build/solr-core/test/J0/./org.apache.solr.cloud.SyncSliceTest-1360591858916/jetty1
[junit4:junit4]   2> 15568 T664 C37 P37338 oasc.CachingDirectoryFactory.close Releasing directory:/usr/home/hudson/hudson-slave/workspace/Lucene-Solr-Tests-trunk-Java6/solr/build/solr-core/test/J0/./org.apache.solr.cloud.SyncSliceTest-1360591858916/jetty1/index
[junit4:junit4]   2> 15568 T664 C37 P37338 REQ /replication {command=filelist&qt=/replication&wt=javabin&generation=3&version=2} status=0 QTime=1 
[junit4:junit4]   2> 15568 T704 C36 P37345 oash.SnapPuller.fetchLatestIndex Number of files in latest index in master: 1
[junit4:junit4]   2> 15569 T704 C36 P37345 oasc.CachingDirectoryFactory.get return new directory for /usr/home/hudson/hudson-slave/workspace/Lucene-Solr-Tests-trunk-Java6/solr/build/solr-core/test/J0/./org.apache.solr.cloud.SyncSliceTest-1360591858916/jetty3/index.20130212011114481 forceNew:false
[junit4:junit4]   2> 15570 T704 C36 P37345 oasc.CachingDirectoryFactory.close Releasing directory:/usr/home/hudson/hudson-slave/workspace/Lucene-Solr-Tests-trunk-Java6/solr/build/solr-core/test/J0/./org.apache.solr.cloud.SyncSliceTest-1360591858916/jetty3
[junit4:junit4]   2> 15570 T704 C36 P37345 oash.SnapPuller.fetchLatestIndex Starting download to RateLimitedDirectoryWrapper(NRTCachingDirectory(org.apache.lucene.store.NIOFSDirectory@/usr/home/hudson/hudson-slave/workspace/Lucene-Solr-Tests-trunk-Java6/solr/build/solr-core/test/J0/org.apache.solr.cloud.SyncSliceTest-1360591858916/jetty3/index.20130212011114481 lockFactory=org.apache.lucene.store.NativeFSLockFactory@25da9954; maxCacheMB=48.0 maxMergeSizeMB=4.0)) fullCopy=true
[junit4:junit4]   2> 15574 T664 C37 P37338 REQ /replication {file=segments_3&command=filecontent&checksum=true&wt=filestream&qt=/replication&generation=3} status=0 QTime=0 
[junit4:junit4]   2> 15576 T704 C36 P37345 oasc.CachingDirectoryFactory.close Releasing directory:/usr/home/hudson/hudson-slave/workspace/Lucene-Solr-Tests-trunk-Java6/solr/build/solr-core/test/J0/./org.apache.solr.cloud.SyncSliceTest-1360591858916/jetty3/index
[junit4:junit4]   2> 15576 T704 C36 P37345 oash.SnapPuller.fetchLatestIndex Total time taken for download : 0 secs
[junit4:junit4]   2> 15583 T704 C36 P37345 oash.SnapPuller.modifyIndexProps New index installed. Updating index properties... index=index.20130212011114481
[junit4:junit4]   2> 15584 T704 C36 P37345 oasc.CachingDirectoryFactory.close Releasing directory:/usr/home/hudson/hudson-slave/workspace/Lucene-Solr-Tests-trunk-Java6/solr/build/solr-core/test/J0/./org.apache.solr.cloud.SyncSliceTest-1360591858916/jetty3
[junit4:junit4]   2> 15585 T704 C36 P37345 oasc.CachingDirectoryFactory.close Releasing directory:/usr/home/hudson/hudson-slave/workspace/Lucene-Solr-Tests-trunk-Java6/solr/build/solr-core/test/J0/./org.apache.solr.cloud.SyncSliceTest-1360591858916/jetty3
[junit4:junit4]   2> 15585 T704 C36 P37345 oasc.SolrCore.getNewIndexDir New index directory detected: old=./org.apache.solr.cloud.SyncSliceTest-1360591858916/jetty3/index/ new=./org.apache.solr.cloud.SyncSliceTest-1360591858916/jetty3/index.20130212011114481
[junit4:junit4]   2> 15589 T704 C36 P37345 oasc.SolrDeletionPolicy.onInit SolrDeletionPolicy.onInit: commits:num=1
[junit4:junit4]   2> 		commit{dir=RateLimitedDirectoryWrapper(NRTCachingDirectory(org.apache.lucene.store.NIOFSDirectory@/usr/home/hudson/hudson-slave/workspace/Lucene-Solr-Tests-trunk-Java6/solr/build/solr-core/test/J0/org.apache.solr.cloud.SyncSliceTest-1360591858916/jetty3/index.20130212011114481 lockFactory=org.apache.lucene.store.NativeFSLockFactory@25da9954; maxCacheMB=48.0 maxMergeSizeMB=4.0)),segFN=segments_3,generation=3,filenames=[segments_3]
[junit4:junit4]   2> 15590 T704 C36 P37345 oasc.SolrDeletionPolicy.updateCommits newest commit = 3[segments_3]
[junit4:junit4]   2> 15591 T704 C36 P37345 oasc.CachingDirectoryFactory.close Releasing directory:/usr/home/hudson/hudson-slave/workspace/Lucene-Solr-Tests-trunk-Java6/solr/build/solr-core/test/J0/./org.apache.solr.cloud.SyncSliceTest-1360591858916/jetty3
[junit4:junit4]   2> 15591 T704 C36 P37345 oasu.DefaultSolrCoreState.newIndexWriter Creating new IndexWriter...
[junit4:junit4]   2> 15591 T704 C36 P37345 oasu.DefaultSolrCoreState.newIndexWriter Waiting until IndexWriter is unused... core=collection1
[junit4:junit4]   2> 15592 T704 C36 P37345 oasu.DefaultSolrCoreState.newIndexWriter Rollback old IndexWriter... core=collection1
[junit4:junit4]   2> 15592 T704 C36 P37345 oasc.CachingDirectoryFactory.close Releasing directory:/usr/home/hudson/hudson-slave/workspace/Lucene-Solr-Tests-trunk-Java6/solr/build/solr-core/test/J0/./org.apache.solr.cloud.SyncSliceTest-1360591858916/jetty3/index.20130212011114481
[junit4:junit4]   2> 15593 T704 C36 P37345 oasc.CachingDirectoryFactory.close Releasing directory:/usr/home/hudson/hudson-slave/workspace/Lucene-Solr-Tests-trunk-Java6/solr/build/solr-core/test/J0/./org.apache.solr.cloud.SyncSliceTest-1360591858916/jetty3
[junit4:junit4]   2> 15598 T704 C36 P37345 oasc.SolrDeletionPolicy.onInit SolrDeletionPolicy.onInit: commits:num=1
[junit4:junit4]   2> 		commit{dir=RateLimitedDirectoryWrapper(NRTCachingDirectory(org.apache.lucene.store.NIOFSDirectory@/usr/home/hudson/hudson-slave/workspace/Lucene-Solr-Tests-trunk-Java6/solr/build/solr-core/test/J0/org.apache.solr.cloud.SyncSliceTest-1360591858916/jetty3/index.20130212011114481 lockFactory=org.apache.lucene.store.NativeFSLockFactory@25da9954; maxCacheMB=48.0 maxMergeSizeMB=4.0)),segFN=segments_3,generation=3,filenames=[segments_3]
[junit4:junit4]   2> 15598 T704 C36 P37345 oasc.SolrDeletionPolicy.updateCommits newest commit = 3[segments_3]
[junit4:junit4]   2> 15599 T704 C36 P37345 oasu.DefaultSolrCoreState.newIndexWriter New IndexWriter is ready to be used.
[junit4:junit4]   2> 15599 T704 C36 P37345 oasc.CachingDirectoryFactory.close Releasing directory:/usr/home/hudson/hudson-slave/workspace/Lucene-Solr-Tests-trunk-Java6/solr/build/solr-core/test/J0/./org.apache.solr.cloud.SyncSliceTest-1360591858916/jetty3
[junit4:junit4]   2> 15600 T704 C36 P37345 oass.SolrIndexSearcher.<init> Opening Searcher@39dbbe10 main
[junit4:junit4]   2> 15602 T703 oasc.SolrCore.registerSearcher [collection1] Registered new searcher Searcher@39dbbe10 main{StandardDirectoryReader(segments_3:1:nrt)}
[junit4:junit4]   2> 15602 T703 oasc.CachingDirectoryFactory.close Releasing directory:/usr/home/hudson/hudson-slave/workspace/Lucene-Solr-Tests-trunk-Java6/solr/build/solr-core/test/J0/./org.apache.solr.cloud.SyncSliceTest-1360591858916/jetty3/index
[junit4:junit4]   2> 15603 T704 C36 P37345 oasu.DirectUpdateHandler2.commit start commit{,optimize=false,openSearcher=false,waitSearcher=false,expungeDeletes=false,softCommit=false}
[junit4:junit4]   2> 15606 T704 C36 P37345 oasc.SolrDeletionPolicy.onCommit SolrDeletionPolicy.onCommit: commits:num=2
[junit4:junit4]   2> 		commit{dir=RateLimitedDirectoryWrapper(NRTCachingDirectory(org.apache.lucene.store.NIOFSDirectory@/usr/home/hudson/hudson-slave/workspace/Lucene-Solr-Tests-trunk-Java6/solr/build/solr-core/test/J0/org.apache.solr.cloud.SyncSliceTest-1360591858916/jetty3/index.20130212011114481 lockFactory=org.apache.lucene.store.NativeFSLockFactory@25da9954; maxCacheMB=48.0 maxMergeSizeMB=4.0)),segFN=segments_3,generation=3,filenames=[segments_3]
[junit4:junit4]   2> 		commit{dir=RateLimitedDirectoryWrapper(NRTCachingDirectory(org.apache.lucene.store.NIOFSDirectory@/usr/home/hudson/hudson-slave/workspace/Lucene-Solr-Tests-trunk-Java6/solr/build/solr-core/test/J0/org.apache.solr.cloud.SyncSliceTest-1360591858916/jetty3/index.20130212011114481 lockFactory=org.apache.lucene.store.NativeFSLockFactory@25da9954; maxCacheMB=48.0 maxMergeSizeMB=4.0)),segFN=segments_4,generation=4,filenames=[segments_4]
[junit4:junit4]   2> 15607 T704 C36 P37345 oasc.SolrDeletionPolicy.updateCommits newest commit = 4[segments_4]
[junit4:junit4]   2> 15608 T704 C36 P37345 oasc.CachingDirectoryFactory.close Releasing directory:/usr/home/hudson/hudson-slave/workspace/Lucene-Solr-Tests-trunk-Java6/solr/build/solr-core/test/J0/./org.apache.solr.cloud.SyncSliceTest-1360591858916/jetty3
[junit4:junit4]   2> 15608 T704 C36 P37345 oasu.DirectUpdateHandler2.commit end_commit_flush
[junit4:junit4]   2> 15608 T704 C36 P37345 oasc.CachingDirectoryFactory.close Releasing directory:/usr/home/hudson/hudson-slave/workspace/Lucene-Solr-Tests-trunk-Java6/solr/build/solr-core/test/J0/./org.apache.solr.cloud.SyncSliceTest-1360591858916/jetty3/index.20130212011114481
[junit4:junit4]   2> 15608 T704 C36 P37345 oasc.CachingDirectoryFactory.close Releasing directory:/usr/home/hudson/hudson-slave/workspace/Lucene-Solr-Tests-trunk-Java6/solr/build/solr-core/test/J0/./org.apache.solr.cloud.SyncSliceTest-1360591858916/jetty3/index
[junit4:junit4]   2> 15609 T704 C36 P37345 oasc.RecoveryStrategy.replay No replay needed. core=collection1
[junit4:junit4]   2> 15609 T704 C36 P37345 oasc.RecoveryStrategy.doRecovery Replication Recovery was successful - registering as Active. core=collection1
[junit4:junit4]   2> 15609 T704 C36 P37345 oasc.ZkController.publish publishing core=collection1 state=active
[junit4:junit4]   2> 15609 T704 C36 P37345 oasc.ZkController.publish numShards not found on descriptor - reading it from system property
[junit4:junit4]   2> 15614 T704 C36 P37345 oasc.RecoveryStrategy.doRecovery Finished recovery process. core=collection1
[junit4:junit4]   2> 15992 T652 oascc.ZkStateReader.updateClusterState Updating cloud state from ZooKeeper... 
[junit4:junit4]   2> 15993 T652 oasc.Overseer$ClusterStateUpdater.updateState Update state numShards=1 message={
[junit4:junit4]   2> 	  "operation":"state",
[junit4:junit4]   2> 	  "numShards":"1",
[junit4:junit4]   2> 	  "shard":"shard1",
[junit4:junit4]   2> 	  "roles":null,
[junit4:junit4]   2> 	  "state":"recovering",
[junit4:junit4]   2> 	  "core":"collection1",
[junit4:junit4]   2> 	  "collection":"collection1",
[junit4:junit4]   2> 	  "node_name":"127.0.0.1:37349_",
[junit4:junit4]   2> 	  "base_url":"http://127.0.0.1:37349"}
[junit4:junit4]   2> 16009 T652 oasc.Overseer$ClusterStateUpdater.updateState Update state numShards=1 message={
[junit4:junit4]   2> 	  "operation":"state",
[junit4:junit4]   2> 	  "numShards":"1",
[junit4:junit4]   2> 	  "shard":"shard1",
[junit4:junit4]   2> 	  "roles":null,
[junit4:junit4]   2> 	  "state":"active",
[junit4:junit4]   2> 	  "core":"collection1",
[junit4:junit4]   2> 	  "collection":"collection1",
[junit4:junit4]   2> 	  "node_name":"127.0.0.1:37345_",
[junit4:junit4]   2> 	  "base_url":"http://127.0.0.1:37345"}
[junit4:junit4]   2> 16021 T657 oascc.ZkStateReader$2.process A cluster state change: WatchedEvent state:SyncConnected type:NodeDataChanged path:/clusterstate.json, has occurred - updating... (live nodes size: 5)
[junit4:junit4]   2> 16021 T685 oascc.ZkStateReader$2.process A cluster state change: WatchedEvent state:SyncConnected type:NodeDataChanged path:/clusterstate.json, has occurred - updating... (live nodes size: 5)
[junit4:junit4]   2> 16021 T701 oascc.ZkStateReader$2.process A cluster state change: WatchedEvent state:SyncConnected type:NodeDataChanged path:/clusterstate.json, has occurred - updating... (live nodes size: 5)
[junit4:junit4]   2> 16021 T651 oascc.ZkStateReader$2.process A cluster state change: WatchedEvent state:SyncConnected type:NodeDataChanged path:/clusterstate.json, has occurred - updating... (live nodes size: 5)
[junit4:junit4]   2> 16021 T670 oascc.ZkStateReader$2.process A cluster state change: WatchedEvent state:SyncConnected type:NodeDataChanged path:/clusterstate.json, has occurred - updating... (live nodes size: 5)
[junit4:junit4]   2> 16021 T717 oascc.ZkStateReader$2.process A cluster state change: WatchedEvent state:SyncConnected type:NodeDataChanged path:/clusterstate.json, has occurred - updating... (live nodes size: 5)
[junit4:junit4]   2> 16054 T629 oascc.ZkStateReader.updateClusterState Updating cloud state from ZooKeeper... 
[junit4:junit4]   2> 17056 T629 oascc.ZkStateReader.updateClusterState Updating cloud state from ZooKeeper... 
[junit4:junit4]   2>  C38_STATE=coll:collection1 core:collection1 props:{shard=shard1, roles=null, state=recovering, core=collection1, collection=collection1, node_name=127.0.0.1:37349_, base_url=http://127.0.0.1:37349}
[junit4:junit4]   2> 18052 T722 C38 P37349 oasc.RecoveryStrategy.doRecovery Attempting to PeerSync from http://127.0.0.1:37338/collection1/ core=collection1 - recoveringAfterStartup=true
[junit4:junit4]   2> 18052 T722 C38 P37349 oasu.PeerSync.sync PeerSync: core=collection1 url=http://127.0.0.1:37349 START replicas=[http://127.0.0.1:37338/collection1/] nUpdates=100
[junit4:junit4]   2> 18052 T722 C38 P37349 oasu.PeerSync.sync WARNING no frame of reference to tell of we've missed updates
[junit4:junit4]   2> 18053 T722 C38 P37349 oasc.RecoveryStrategy.doRecovery PeerSync Recovery was not successful - trying replication. core=collection1
[junit4:junit4]   2> 18053 T722 C38 P37349 oasc.RecoveryStrategy.doRecovery Starting Replication Recovery. core=collection1
[junit4:junit4]   2> 18053 T722 C38 P37349 oasc.RecoveryStrategy.doRecovery Begin buffering updates. core=collection1
[junit4:junit4]   2> 18053 T722 C38 P37349 oasu.UpdateLog.bufferUpdates Starting to buffer updates. FSUpdateLog{state=ACTIVE, tlog=null}
[junit4:junit4]   2> 18053 T722 C38 P37349 oasc.RecoveryStrategy.replicate Attempting to replicate from http://127.0.0.1:37338/collection1/. core=collection1
[junit4:junit4]   2> 18053 T722 C38 P37349 oascsi.HttpClientUtil.createClient Creating new http client, config:maxConnections=128&maxConnectionsPerHost=32&followRedirects=false
[junit4:junit4]   2> 18055 T662 C37 P37338 REQ /get {getVersions=100&distrib=false&wt=javabin&qt=/get&version=2} status=0 QTime=0 
[junit4:junit4]   2> 18059 T629 oascc.ZkStateReader.updateClusterState Updating cloud state from ZooKeeper... 
[junit4:junit4]   2> 18069 T660 C37 P37338 oasu.DirectUpdateHandler2.commit start commit{,optimize=false,openSearcher=false,waitSearcher=true,expungeDeletes=false,softCommit=false}
[junit4:junit4]   2> 18073 T660 C37 P37338 oasc.SolrDeletionPolicy.onCommit SolrDeletionPolicy.onCommit: commits:num=3
[junit4:junit4]   2> 		commit{dir=RateLimitedDirectoryWrapper(NRTCachingDirectory(org.apache.lucene.store.NIOFSDirectory@/usr/home/hudson/hudson-slave/workspace/Lucene-Solr-Tests-trunk-Java6/solr/build/solr-core/test/J0/org.apache.solr.cloud.SyncSliceTest-1360591858916/jetty1/index lockFactory=org.apache.lucene.store.NativeFSLockFactory@6e3b11bd; maxCacheMB=48.0 maxMergeSizeMB=4.0)),segFN=segments_2,generation=2,filenames=[segments_2]
[junit4:junit4]   2> 		commit{dir=RateLimitedDirectoryWrapper(NRTCachingDirectory(org.apache.lucene.store.NIOFSDirectory@/usr/home/hudson/hudson-slave/workspace/Lucene-Solr-Tests-trunk-Java6/solr/build/solr-core/test/J0/org.apache.solr.cloud.SyncSliceTest-1360591858916/jetty1/index lockFactory=org.apache.lucene.store.NativeFSLockFactory@6e3b11bd; maxCacheMB=48.0 maxMergeSizeMB=4.0)),segFN=segments_3,generation=3,filenames=[segments_3]
[junit4:junit4]   2> 		commit{dir=RateLimitedDirectoryWrapper(NRTCachingDirectory(org.apache.lucene.store.NIOFSDirectory@/usr/home/hudson/hudson-slave/workspace/Lucene-Solr-Tests-trunk-Java6/solr/build/solr-core/test/J0/org.apache.solr.cloud.SyncSliceTest-1360591858916/jetty1/index lockFactory=org.apache.lucene.store.NativeFSLockFactory@6e3b11bd; maxCacheMB=48.0 maxMergeSizeMB=4.0)),segFN=segments_4,generation=4,filenames=[segments_4]
[junit4:junit4]   2> 18073 T660 C37 P37338 oasc.SolrDeletionPolicy.updateCommits newest commit = 4[segments_4]
[junit4:junit4]   2> 18074 T660 C37 P37338 oasc.CachingDirectoryFactory.close Releasing directory:/usr/home/hudson/hudson-slave/workspace/Lucene-Solr-Tests-trunk-Java6/solr/build/solr-core/test/J0/./org.apache.solr.cloud.SyncSliceTest-1360591858916/jetty1
[junit4:junit4]   2> 18074 T660 C37 P37338 oasu.DirectUpdateHandler2.commit end_commit_flush
[junit4:junit4]   2> 18075 T660 C37 P37338 /update {waitSearcher=true&openSearcher=false&commit=true&wt=javabin&commit_end_point=true&version=2&softCommit=false} {commit=} 0 6
[junit4:junit4]   2> 18076 T722 C38 P37349 oash.ReplicationHandler.inform Commits will be reserved for  10000
[junit4:junit4]   2> 18076 T722 C38 P37349 oash.SnapPuller.<init>  No value set for 'pollInterval'. Timer Task not started.
[junit4:junit4]   2> 18078 T664 C37 P37338 REQ /replication {command=indexversion&qt=/replication&wt=javabin&version=2} status=0 QTime=0 
[junit4:junit4]   2> 18079 T722 C38 P37349 oash.SnapPuller.fetchLatestIndex Master's generation: 4
[junit4:junit4]   2> 18079 T722 C38 P37349 oash.SnapPuller.fetchLatestIndex Slave's generation: 1
[junit4:junit4]   2> 18079 T722 C38 P37349 oash.SnapPuller.fetchLatestIndex Starting replication process
[junit4:junit4]   2> 18082 T664 C37 P37338 oasc.CachingDirectoryFactory.close Releasing directory:/usr/home/hudson/hudson-slave/workspace/Lucene-Solr-Tests-trunk-Java6/solr/build/solr-core/test/J0/./org.apache.solr.cloud.SyncSliceTest-1360591858916/jetty1
[junit4:junit4]   2> 18083 T664 C37 P37338 oasc.CachingDirectoryFactory.close Releasing directory:/usr/home/hudson/hudson-slave/workspace/Lucene-Solr-Tests-trunk-Java6/solr/build/solr-core/test/J0/./org.apache.solr.cloud.SyncSliceTest-1360591858916/jetty1/index
[junit4:junit4]   2> 18083 T664 C37 P37338 REQ /replication {command=filelist&qt=/replication&wt=javabin&generation=4&version=2} status=0 QTime=1 
[junit4:junit4]   2> 18084 T722 C38 P37349 oash.SnapPuller.fetchLatestIndex Number of files in latest index in master: 1
[junit4:junit4]   2> 18086 T722 C38 P37349 oasc.CachingDirectoryFactory.get return new directory for /usr/home/hudson/hudson-slave/workspace/Lucene-Solr-Tests-trunk-Java6/solr/build/solr-core/test/J0/./org.apache.solr.cloud.SyncSliceTest-1360591858916/jetty4/index.20130212011116996 forceNew:false
[junit4:junit4]   2> 18086 T722 C38 P37349 oasc.CachingDirectoryFactory.close Releasing directory:/usr/home/hudson/hudson-slave/workspace/Lucene-Solr-Tests-trunk-Java6/solr/build/solr-core/test/J0/./org.apache.solr.cloud.SyncSliceTest-1360591858916/jetty4
[junit4:junit4]   2> 18087 T722 C38 P37349 oash.SnapPuller.fetchLatestIndex Starting download to RateLimitedDirectoryWrapper(NRTCachingDirectory(org.apache.lucene.store.NIOFSDirectory@/usr/home/hudson/hudson-slave/workspace/Lucene-Solr-Tests-trunk-Java6/solr/build/solr-core/test/J0/org.apache.solr.cloud.SyncSliceTest-1360591858916/jetty4/index.20130212011116996 lockFactory=org.apache.lucene.store.NativeFSLockFactory@558cdd; maxCacheMB=48.0 maxMergeSizeMB=4.0)) fullCopy=true
[junit4:junit4]   2> 18090 T664 C37 P37338 REQ /replication {file=segments_4&command=filecontent&checksum=true&wt=filestream&qt=/replication&generation=4} status=0 QTime=0 
[junit4:junit4]   2> 18092 T722 C38 P37349 oasc.CachingDirectoryFactory.close Releasing directory:/usr/home/hudson/hudson-slave/workspace/Lucene-Solr-Tests-trunk-Java6/solr/build/solr-core/test/J0/./org.apache.solr.cloud.SyncSliceTest-1360591858916/jetty4/index
[junit4:junit4]   2> 18092 T722 C38 P37349 oash.SnapPuller.fetchLatestIndex Total time taken for download : 0 secs
[junit4:junit4]   2> 18092 T722 C38 P37349 oash.SnapPuller.modifyIndexProps New index installed. Updating index properties... index=index.20130212011116996
[junit4:junit4]   2> 18093 T722 C38 P37349 oasc.CachingDirectoryFactory.close Releasing directory:/usr/home/hudson/hudson-slave/workspace/Lucene-Solr-Tests-trunk-Java6/solr/build/solr-core/test/J0/./org.apache.solr.cloud.SyncSliceTest-1360591858916/jetty4
[junit4:junit4]   2> 18094 T722 C38 P37349 oasc.CachingDirectoryFactory.close Releasing directory:/usr/home/hudson/hudson-slave/workspace/Lucene-Solr-Tests-trunk-Java6/solr/build/solr-core/test/J0/./org.apache.solr.cloud.SyncSliceTest-1360591858916/jetty4
[junit4:junit4]   2> 18094 T722 C38 P37349 oasc.SolrCore.getNewIndexDir New index directory detected: old=./org.apache.solr.cloud.SyncSliceTest-1360591858916/jetty4/index/ new=./org.apache.solr.cloud.SyncSliceTest-1360591858916/jetty4/index.20130212011116996
[junit4:junit4]   2> 18097 T722 C38 P37349 oasc.SolrDeletionPolicy.onInit SolrDeletionPolicy.onInit: commits:num=1
[junit4:junit4]   2> 		commit{dir=RateLimitedDirectoryWrapper(NRTCachingDirectory(org.apache.lucene.store.NIOFSDirectory@/usr/home/hudson/hudson-slave/workspace/Lucene-Solr-Tests-trunk-Java6/solr/build/solr-core/test/J0/org.apache.solr.cloud.SyncSliceTest-1360591858916/jetty4/index.20130212011116996 lockFactory=org.apache.lucene.store.NativeFSLockFactory@558cdd; maxCacheMB=48.0 maxMergeSizeMB=4.0)),segFN=segments_4,generation=4,filenames=[segments_4]
[junit4:junit4]   2> 18098 T722 C38 P37349 oasc.SolrDeletionPolicy.updateCommits newest commit = 4[segments_4]
[junit4:junit4]   2> 18099 T722 C38 P37349 oasc.CachingDirectoryFactory.close Releasing directory:/usr/home/hudson/hudson-slave/workspace/Lucene-Solr-Tests-trunk-Java6/solr/build/solr-core/test/J0/./org.apache.solr.cloud.SyncSliceTest-1360591858916/jetty4
[junit4:junit4]   2> 18099 T722 C38 P37349 oasu.DefaultSolrCoreState.newIndexWriter Creating new IndexWriter...
[junit4:junit4]   2> 18100 T722 C38 P37349 oasu.DefaultSolrCoreState.newIndexWriter Waiting until IndexWriter is unused... core=collection1
[junit4:junit4]   2> 18100 T722 C38 P37349 oasu.DefaultSolrCoreState.newIndexWriter Rollback old IndexWriter... core=collection1
[junit4:junit4]   2> 18100 T722 C38 P37349 oasc.CachingDirectoryFactory.close Releasing directory:/usr/home/hudson/hudson-slave/workspace/Lucene-Solr-Tests-trunk-Java6/solr/build/solr-core/test/J0/./org.apache.solr.cloud.SyncSliceTest-1360591858916/jetty4/index.20130212011116996
[junit4:junit4]   2> 18101 T722 C38 P37349 oasc.CachingDirectoryFactory.close Releasing directory:/usr/home/hudson/hudson-slave/workspace/Lucene-Solr-Tests-trunk-Java6/solr/build/solr-core/test/J0/./org.apache.solr.cloud.SyncSliceTest-1360591858916/jetty4
[junit4:junit4]   2> 18104 T722 C38 P37349 oasc.SolrDeletionPolicy.onInit SolrDeletionPolicy.onInit: commits:num=1
[junit4:junit4]   2> 		commit{dir=RateLimitedDirectoryWrapper(NRTCachingDirectory(org.apache.lucene.store.NIOFSDirectory@/usr/home/hudson/hudson-slave/workspace/Lucene-Solr-Tests-trunk-Java6/solr/build/solr-core/test/J0/org.apache.solr.cloud.SyncSliceTest-1360591858916/jetty4/index.20130212011116996 lockFactory=org.apache.lucene.store.NativeFSLockFactory@558cdd; maxCacheMB=48.0 maxMergeSizeMB=4.0)),segFN=segments_4,generation=4,filenames=[segments_4]
[junit4:junit4]   2> 18104 T722 C38 P37349 oasc.SolrDeletionPolicy.updateCommits newest commit = 4[segments_4]
[junit4:junit4]   2> 18105 T722 C38 P37349 oasu.DefaultSolrCoreState.newIndexWriter New IndexWriter is ready to be used.
[junit4:junit4]   2> 18105 T722 C38 P37349 oasc.CachingDirectoryFactory.close Releasing directory:/usr/home/hudson/hudson-slave/workspace/Lucene-Solr-Tests-trunk-Java6/solr/build/solr-core/test/J0/./org.apache.solr.cloud.SyncSliceTest-1360591858916/jetty4
[junit4:junit4]   2> 18105 T722 C38 P37349 oass.SolrIndexSearcher.<init> Opening Searcher@7d9e1749 main
[junit4:junit4]   2> 18107 T721 oasc.SolrCore.registerSearcher [collection1] Registered new searcher Searcher@7d9e1749 main{StandardDirectoryReader(segments_4:1:nrt)}
[junit4:junit4]   2> 18108 T721 oasc.CachingDirectoryFactory.close Releasing directory:/usr/home/hudson/hudson-slave/workspace/Lucene-Solr-Tests-trunk-Java6/solr/build/solr-core/test/J0/./org.apache.solr.cloud.SyncSliceTest-1360591858916/jetty4/index
[junit4:junit4]   2> 18108 T722 C38 P37349 oasu.DirectUpdateHandler2.commit start commit{,optimize=false,openSearcher=false,waitSearcher=false,expungeDeletes=false,softCommit=false}
[junit4:junit4]   2> 18111 T722 C38 P37349 oasc.SolrDeletionPolicy.onCommit SolrDeletionPolicy.onCommit: commits:num=2
[junit4:junit4]   2> 		commit{dir=RateLimitedDirectoryWrapper(NRTCachingDirectory(org.apache.lucene.store.NIOFSDirectory@/usr

[...truncated too long message...]

-slave/workspace/Lucene-Solr-Tests-trunk-Java6/solr/build/solr-core/test/J0/./org.apache.solr.cloud.SyncSliceTest-1360591858916/jetty4/index
[junit4:junit4]   2> 895895 T629 oasc.CachingDirectoryFactory.closeDirectory Closing directory:/usr/home/hudson/hudson-slave/workspace/Lucene-Solr-Tests-trunk-Java6/solr/build/solr-core/test/J0/./org.apache.solr.cloud.SyncSliceTest-1360591858916/jetty4/index
[junit4:junit4]   2> 908181 T717 oaz.ClientCnxn$EventThread.run EventThread shut down
[junit4:junit4]   2> 908181 T629 oaz.ZooKeeper.close Session: 0x13cc9982ceb000c closed
[junit4:junit4]   2> 908183 T629 oejsh.ContextHandler.doStop stopped o.e.j.s.ServletContextHandler{/,null}
[junit4:junit4]   2> 908462 T629 oas.SolrTestCaseJ4.tearDown ###Ending testDistribSearch
[junit4:junit4]   1> client port:0.0.0.0/0.0.0.0:0
[junit4:junit4]   2> NOTE: reproduce with: ant test  -Dtestcase=SyncSliceTest -Dtests.method=testDistribSearch -Dtests.seed=C2856B9425F4DD49 -Dtests.multiplier=3 -Dtests.slow=true -Dtests.locale=ar_LB -Dtests.timezone=SST -Dtests.file.encoding=UTF-8
[junit4:junit4] FAILURE  908s J0 | SyncSliceTest.testDistribSearch <<<
[junit4:junit4]    > Throwable #1: java.lang.AssertionError: Test Setup Failure: shard1 should have just been set up to be inconsistent - but it's still consistent. Leader:http://127.0.0.1:37341/collection1skip list:[org.apache.solr.cloud.AbstractFullDistribZkTestBase$CloudJettyRunner@e821fee8, org.apache.solr.cloud.AbstractFullDistribZkTestBase$CloudJettyRunner@2e15e4e4]
[junit4:junit4]    > 	at __randomizedtesting.SeedInfo.seed([C2856B9425F4DD49:4363E58C52ABBD75]:0)
[junit4:junit4]    > 	at org.junit.Assert.fail(Assert.java:93)
[junit4:junit4]    > 	at org.junit.Assert.assertTrue(Assert.java:43)
[junit4:junit4]    > 	at org.junit.Assert.assertNotNull(Assert.java:526)
[junit4:junit4]    > 	at org.apache.solr.cloud.SyncSliceTest.doTest(SyncSliceTest.java:216)
[junit4:junit4]    > 	at org.apache.solr.BaseDistributedSearchTestCase.testDistribSearch(BaseDistributedSearchTestCase.java:794)
[junit4:junit4]    > 	at sun.reflect.NativeMethodAccessorImpl.invoke0(Native Method)
[junit4:junit4]    > 	at sun.reflect.NativeMethodAccessorImpl.invoke(NativeMethodAccessorImpl.java:57)
[junit4:junit4]    > 	at sun.reflect.DelegatingMethodAccessorImpl.invoke(DelegatingMethodAccessorImpl.java:43)
[junit4:junit4]    > 	at java.lang.reflect.Method.invoke(Method.java:616)
[junit4:junit4]    > 	at com.carrotsearch.randomizedtesting.RandomizedRunner.invoke(RandomizedRunner.java:1559)
[junit4:junit4]    > 	at com.carrotsearch.randomizedtesting.RandomizedRunner.access$600(RandomizedRunner.java:79)
[junit4:junit4]    > 	at com.carrotsearch.randomizedtesting.RandomizedRunner$6.evaluate(RandomizedRunner.java:737)
[junit4:junit4]    > 	at com.carrotsearch.randomizedtesting.RandomizedRunner$7.evaluate(RandomizedRunner.java:773)
[junit4:junit4]    > 	at com.carrotsearch.randomizedtesting.RandomizedRunner$8.evaluate(RandomizedRunner.java:787)
[junit4:junit4]    > 	at com.carrotsearch.randomizedtesting.rules.SystemPropertiesRestoreRule$1.evaluate(SystemPropertiesRestoreRule.java:53)
[junit4:junit4]    > 	at org.apache.lucene.util.TestRuleSetupTeardownChained$1.evaluate(TestRuleSetupTeardownChained.java:50)
[junit4:junit4]    > 	at org.apache.lucene.util.TestRuleFieldCacheSanity$1.evaluate(TestRuleFieldCacheSanity.java:51)
[junit4:junit4]    > 	at org.apache.lucene.util.AbstractBeforeAfterRule$1.evaluate(AbstractBeforeAfterRule.java:46)
[junit4:junit4]    > 	at com.carrotsearch.randomizedtesting.rules.SystemPropertiesInvariantRule$1.evaluate(SystemPropertiesInvariantRule.java:55)
[junit4:junit4]    > 	at org.apache.lucene.util.TestRuleThreadAndTestName$1.evaluate(TestRuleThreadAndTestName.java:49)
[junit4:junit4]    > 	at org.apache.lucene.util.TestRuleIgnoreAfterMaxFailures$1.evaluate(TestRuleIgnoreAfterMaxFailures.java:70)
[junit4:junit4]    > 	at org.apache.lucene.util.TestRuleMarkFailure$1.evaluate(TestRuleMarkFailure.java:48)
[junit4:junit4]    > 	at com.carrotsearch.randomizedtesting.rules.StatementAdapter.evaluate(StatementAdapter.java:36)
[junit4:junit4]    > 	at com.carrotsearch.randomizedtesting.ThreadLeakControl$StatementRunner.run(ThreadLeakControl.java:358)
[junit4:junit4]    > 	at com.carrotsearch.randomizedtesting.ThreadLeakControl.forkTimeoutingTask(ThreadLeakControl.java:782)
[junit4:junit4]    > 	at com.carrotsearch.randomizedtesting.ThreadLeakControl$3.evaluate(ThreadLeakControl.java:442)
[junit4:junit4]    > 	at com.carrotsearch.randomizedtesting.RandomizedRunner.runSingleTest(RandomizedRunner.java:746)
[junit4:junit4]    > 	at com.carrotsearch.randomizedtesting.RandomizedRunner$3.evaluate(RandomizedRunner.java:648)
[junit4:junit4]    > 	at com.carrotsearch.randomizedtesting.RandomizedRunner$4.evaluate(RandomizedRunner.java:682)
[junit4:junit4]    > 	at com.carrotsearch.randomizedtesting.RandomizedRunner$5.evaluate(RandomizedRunner.java:693)
[junit4:junit4]    > 	at com.carrotsearch.randomizedtesting.rules.StatementAdapter.evaluate(StatementAdapter.java:36)
[junit4:junit4]    > 	at com.carrotsearch.randomizedtesting.rules.SystemPropertiesRestoreRule$1.evaluate(SystemPropertiesRestoreRule.java:53)
[junit4:junit4]    > 	at org.apache.lucene.util.AbstractBeforeAfterRule$1.evaluate(AbstractBeforeAfterRule.java:46)
[junit4:junit4]    > 	at org.apache.lucene.util.TestRuleStoreClassName$1.evaluate(TestRuleStoreClassName.java:42)
[junit4:junit4]    > 	at com.carrotsearch.randomizedtesting.rules.SystemPropertiesInvariantRule$1.evaluate(SystemPropertiesInvariantRule.java:55)
[junit4:junit4]    > 	at com.carrotsearch.randomizedtesting.rules.NoShadowingOrOverridesOnMethodsRule$1.evaluate(NoShadowingOrOverridesOnMethodsRule.java:39)
[junit4:junit4]    > 	at com.carrotsearch.randomizedtesting.rules.NoShadowingOrOverridesOnMethodsRule$1.evaluate(NoShadowingOrOverridesOnMethodsRule.java:39)
[junit4:junit4]    > 	at com.carrotsearch.randomizedtesting.rules.StatementAdapter.evaluate(StatementAdapter.java:36)
[junit4:junit4]    > 	at org.apache.lucene.util.TestRuleAssertionsRequired$1.evaluate(TestRuleAssertionsRequired.java:43)
[junit4:junit4]    > 	at org.apache.lucene.util.TestRuleMarkFailure$1.evaluate(TestRuleMarkFailure.java:48)
[junit4:junit4]    > 	at org.apache.lucene.util.TestRuleIgnoreAfterMaxFailures$1.evaluate(TestRuleIgnoreAfterMaxFailures.java:70)
[junit4:junit4]    > 	at org.apache.lucene.util.TestRuleIgnoreTestSuites$1.evaluate(TestRuleIgnoreTestSuites.java:55)
[junit4:junit4]    > 	at com.carrotsearch.randomizedtesting.rules.StatementAdapter.evaluate(StatementAdapter.java:36)
[junit4:junit4]    > 	at com.carrotsearch.randomizedtesting.ThreadLeakControl$StatementRunner.run(ThreadLeakControl.java:358)
[junit4:junit4]    > 	at java.lang.Thread.run(Thread.java:679)
[junit4:junit4]   2> 908482 T629 oas.SolrTestCaseJ4.deleteCore ###deleteCore
[junit4:junit4]   2> NOTE: test params are: codec=Lucene42: {range_facet_l=Pulsing41(freqCutoff=3 minBlockSize=28 maxBlockSize=61), text=PostingsFormat(name=MockRandom), _version_=PostingsFormat(name=SimpleText), rnd_b=PostingsFormat(name=Memory doPackFST= false), intDefault=PostingsFormat(name=SimpleText), id=PostingsFormat(name=Memory doPackFST= false), timestamp=Pulsing41(freqCutoff=3 minBlockSize=28 maxBlockSize=61), a_t=Pulsing41(freqCutoff=3 minBlockSize=28 maxBlockSize=61), range_facet_sl=PostingsFormat(name=Memory doPackFST= false), range_facet_si=Pulsing41(freqCutoff=3 minBlockSize=28 maxBlockSize=61), other_tl1=PostingsFormat(name=SimpleText), multiDefault=Pulsing41(freqCutoff=3 minBlockSize=28 maxBlockSize=61), a_si=PostingsFormat(name=SimpleText)}, docValues:{}, sim=DefaultSimilarity, locale=ar_LB, timezone=SST
[junit4:junit4]   2> NOTE: FreeBSD 9.0-RELEASE amd64/Sun Microsystems Inc. 1.6.0_32 (64-bit)/cpus=16,threads=2,free=175867528,total=422772736
[junit4:junit4]   2> NOTE: All tests run in this JVM: [PreAnalyzedFieldTest, ResourceLoaderTest, ZkControllerTest, TestCollationField, SuggesterFSTTest, FastVectorHighlighterTest, SpatialFilterTest, TestAtomicUpdateErrorCases, SimplePostToolTest, TestSearchPerf, SimpleFacetsTest, DirectSolrConnectionTest, CoreContainerCoreInitFailuresTest, ShardRoutingTest, BinaryUpdateRequestHandlerTest, HighlighterConfigTest, TestIndexSearcher, TestLFUCache, TestPartialUpdateDeduplication, ChaosMonkeyNothingIsSafeTest, TestPHPSerializedResponseWriter, NotRequiredUniqueKeyTest, TestJoin, DirectUpdateHandlerOptimizeTest, TestDefaultSimilarityFactory, DistributedSpellCheckComponentTest, TestQueryTypes, DateFieldTest, TestFaceting, BadComponentTest, CurrencyFieldTest, SyncSliceTest]
[junit4:junit4] Completed on J0 in 908.50s, 1 test, 1 failure <<< FAILURES!

[...truncated 436 lines...]
BUILD FAILED
/usr/home/hudson/hudson-slave/workspace/Lucene-Solr-Tests-trunk-Java6/build.xml:381: The following error occurred while executing this line:
/usr/home/hudson/hudson-slave/workspace/Lucene-Solr-Tests-trunk-Java6/build.xml:361: The following error occurred while executing this line:
/usr/home/hudson/hudson-slave/workspace/Lucene-Solr-Tests-trunk-Java6/build.xml:39: The following error occurred while executing this line:
/usr/home/hudson/hudson-slave/workspace/Lucene-Solr-Tests-trunk-Java6/solr/build.xml:183: The following error occurred while executing this line:
/usr/home/hudson/hudson-slave/workspace/Lucene-Solr-Tests-trunk-Java6/solr/common-build.xml:447: The following error occurred while executing this line:
/usr/home/hudson/hudson-slave/workspace/Lucene-Solr-Tests-trunk-Java6/lucene/common-build.xml:1202: The following error occurred while executing this line:
/usr/home/hudson/hudson-slave/workspace/Lucene-Solr-Tests-trunk-Java6/lucene/common-build.xml:865: There were test failures: 250 suites, 1040 tests, 1 failure, 22 ignored (4 assumptions)

Total time: 47 minutes 33 seconds
Build step 'Invoke Ant' marked build as failure
Archiving artifacts
Recording test results
Email was triggered for: Failure
Sending email for trigger: Failure



Mime
View raw message