lucene-dev mailing list archives

Site index · List index
Message view « Date » · « Thread »
Top « Date » · « Thread »
From Policeman Jenkins Server <jenk...@thetaphi.de>
Subject [JENKINS] Lucene-Solr-trunk-Linux (32bit/ibm-j9-jdk7) - Build # 4428 - Failure!
Date Fri, 22 Feb 2013 13:51:18 GMT
Build: http://jenkins.thetaphi.de/job/Lucene-Solr-trunk-Linux/4428/
Java: 32bit/ibm-j9-jdk7 

4 tests failed.
FAILED:  junit.framework.TestSuite.org.apache.lucene.search.TestMultiTermConstantScore

Error Message:


Stack Trace:
java.lang.AssertionError
	at __randomizedtesting.SeedInfo.seed([A254AA3A66AFD5DC]:0)
	at org.apache.lucene.store.DataOutput.writeVLong(DataOutput.java:217)
	at org.apache.lucene.util.fst.FST.pack(FST.java:1674)
	at org.apache.lucene.util.fst.Builder.finish(Builder.java:477)
	at org.apache.lucene.codecs.memory.MemoryPostingsFormat$TermsWriter.finish(MemoryPostingsFormat.java:274)
	at org.apache.lucene.index.FreqProxTermsWriterPerField.flush(FreqProxTermsWriterPerField.java:548)
	at org.apache.lucene.index.FreqProxTermsWriter.flush(FreqProxTermsWriter.java:85)
	at org.apache.lucene.index.TermsHash.flush(TermsHash.java:116)
	at org.apache.lucene.index.DocInverter.flush(DocInverter.java:53)
	at org.apache.lucene.index.DocFieldProcessor.flush(DocFieldProcessor.java:81)
	at org.apache.lucene.index.DocumentsWriterPerThread.flush(DocumentsWriterPerThread.java:494)
	at org.apache.lucene.index.DocumentsWriter.doFlush(DocumentsWriter.java:422)
	at org.apache.lucene.index.DocumentsWriter.postUpdate(DocumentsWriter.java:316)
	at org.apache.lucene.index.DocumentsWriter.updateDocument(DocumentsWriter.java:389)
	at org.apache.lucene.index.IndexWriter.updateDocument(IndexWriter.java:1471)
	at org.apache.lucene.index.IndexWriter.addDocument(IndexWriter.java:1146)
	at org.apache.lucene.index.RandomIndexWriter.addDocument(RandomIndexWriter.java:152)
	at org.apache.lucene.index.RandomIndexWriter.addDocument(RandomIndexWriter.java:114)
	at org.apache.lucene.search.BaseTestRangeFilter.build(BaseTestRangeFilter.java:153)
	at org.apache.lucene.search.BaseTestRangeFilter.beforeClassBaseTestRangeFilter(BaseTestRangeFilter.java:97)
	at sun.reflect.NativeMethodAccessorImpl.invoke0(Native Method)
	at sun.reflect.NativeMethodAccessorImpl.invoke(NativeMethodAccessorImpl.java:88)
	at sun.reflect.DelegatingMethodAccessorImpl.invoke(DelegatingMethodAccessorImpl.java:55)
	at java.lang.reflect.Method.invoke(Method.java:613)
	at com.carrotsearch.randomizedtesting.RandomizedRunner.invoke(RandomizedRunner.java:1559)
	at com.carrotsearch.randomizedtesting.RandomizedRunner.access$600(RandomizedRunner.java:79)
	at com.carrotsearch.randomizedtesting.RandomizedRunner$4.evaluate(RandomizedRunner.java:677)
	at com.carrotsearch.randomizedtesting.RandomizedRunner$5.evaluate(RandomizedRunner.java:693)
	at org.apache.lucene.util.AbstractBeforeAfterRule$1.evaluate(AbstractBeforeAfterRule.java:46)
	at org.apache.lucene.util.TestRuleStoreClassName$1.evaluate(TestRuleStoreClassName.java:42)
	at com.carrotsearch.randomizedtesting.rules.SystemPropertiesInvariantRule$1.evaluate(SystemPropertiesInvariantRule.java:55)
	at com.carrotsearch.randomizedtesting.rules.NoShadowingOrOverridesOnMethodsRule$1.evaluate(NoShadowingOrOverridesOnMethodsRule.java:39)
	at com.carrotsearch.randomizedtesting.rules.NoShadowingOrOverridesOnMethodsRule$1.evaluate(NoShadowingOrOverridesOnMethodsRule.java:39)
	at com.carrotsearch.randomizedtesting.rules.StatementAdapter.evaluate(StatementAdapter.java:36)
	at org.apache.lucene.util.TestRuleAssertionsRequired$1.evaluate(TestRuleAssertionsRequired.java:43)
	at org.apache.lucene.util.TestRuleMarkFailure$1.evaluate(TestRuleMarkFailure.java:48)
	at org.apache.lucene.util.TestRuleIgnoreAfterMaxFailures$1.evaluate(TestRuleIgnoreAfterMaxFailures.java:70)
	at org.apache.lucene.util.TestRuleIgnoreTestSuites$1.evaluate(TestRuleIgnoreTestSuites.java:55)
	at com.carrotsearch.randomizedtesting.rules.StatementAdapter.evaluate(StatementAdapter.java:36)
	at com.carrotsearch.randomizedtesting.ThreadLeakControl$StatementRunner.run(ThreadLeakControl.java:358)
	at java.lang.Thread.run(Thread.java:780)


FAILED:  junit.framework.TestSuite.org.apache.lucene.search.TestMultiTermConstantScore

Error Message:


Stack Trace:
java.lang.NullPointerException
	at __randomizedtesting.SeedInfo.seed([A254AA3A66AFD5DC]:0)
	at org.apache.lucene.search.TestMultiTermConstantScore.afterClass(TestMultiTermConstantScore.java:81)
	at sun.reflect.NativeMethodAccessorImpl.invoke0(Native Method)
	at sun.reflect.NativeMethodAccessorImpl.invoke(NativeMethodAccessorImpl.java:88)
	at sun.reflect.DelegatingMethodAccessorImpl.invoke(DelegatingMethodAccessorImpl.java:55)
	at java.lang.reflect.Method.invoke(Method.java:613)
	at com.carrotsearch.randomizedtesting.RandomizedRunner.invoke(RandomizedRunner.java:1559)
	at com.carrotsearch.randomizedtesting.RandomizedRunner.access$600(RandomizedRunner.java:79)
	at com.carrotsearch.randomizedtesting.RandomizedRunner$5.evaluate(RandomizedRunner.java:700)
	at org.apache.lucene.util.AbstractBeforeAfterRule$1.evaluate(AbstractBeforeAfterRule.java:46)
	at org.apache.lucene.util.TestRuleStoreClassName$1.evaluate(TestRuleStoreClassName.java:42)
	at com.carrotsearch.randomizedtesting.rules.SystemPropertiesInvariantRule$1.evaluate(SystemPropertiesInvariantRule.java:55)
	at com.carrotsearch.randomizedtesting.rules.NoShadowingOrOverridesOnMethodsRule$1.evaluate(NoShadowingOrOverridesOnMethodsRule.java:39)
	at com.carrotsearch.randomizedtesting.rules.NoShadowingOrOverridesOnMethodsRule$1.evaluate(NoShadowingOrOverridesOnMethodsRule.java:39)
	at com.carrotsearch.randomizedtesting.rules.StatementAdapter.evaluate(StatementAdapter.java:36)
	at org.apache.lucene.util.TestRuleAssertionsRequired$1.evaluate(TestRuleAssertionsRequired.java:43)
	at org.apache.lucene.util.TestRuleMarkFailure$1.evaluate(TestRuleMarkFailure.java:48)
	at org.apache.lucene.util.TestRuleIgnoreAfterMaxFailures$1.evaluate(TestRuleIgnoreAfterMaxFailures.java:70)
	at org.apache.lucene.util.TestRuleIgnoreTestSuites$1.evaluate(TestRuleIgnoreTestSuites.java:55)
	at com.carrotsearch.randomizedtesting.rules.StatementAdapter.evaluate(StatementAdapter.java:36)
	at com.carrotsearch.randomizedtesting.ThreadLeakControl$StatementRunner.run(ThreadLeakControl.java:358)
	at java.lang.Thread.run(Thread.java:780)


FAILED:  junit.framework.TestSuite.org.apache.lucene.search.TestMultiTermConstantScore

Error Message:


Stack Trace:
java.lang.NullPointerException
	at __randomizedtesting.SeedInfo.seed([A254AA3A66AFD5DC]:0)
	at org.apache.lucene.search.BaseTestRangeFilter.afterClassBaseTestRangeFilter(BaseTestRangeFilter.java:103)
	at sun.reflect.NativeMethodAccessorImpl.invoke0(Native Method)
	at sun.reflect.NativeMethodAccessorImpl.invoke(NativeMethodAccessorImpl.java:88)
	at sun.reflect.DelegatingMethodAccessorImpl.invoke(DelegatingMethodAccessorImpl.java:55)
	at java.lang.reflect.Method.invoke(Method.java:613)
	at com.carrotsearch.randomizedtesting.RandomizedRunner.invoke(RandomizedRunner.java:1559)
	at com.carrotsearch.randomizedtesting.RandomizedRunner.access$600(RandomizedRunner.java:79)
	at com.carrotsearch.randomizedtesting.RandomizedRunner$5.evaluate(RandomizedRunner.java:700)
	at org.apache.lucene.util.AbstractBeforeAfterRule$1.evaluate(AbstractBeforeAfterRule.java:46)
	at org.apache.lucene.util.TestRuleStoreClassName$1.evaluate(TestRuleStoreClassName.java:42)
	at com.carrotsearch.randomizedtesting.rules.SystemPropertiesInvariantRule$1.evaluate(SystemPropertiesInvariantRule.java:55)
	at com.carrotsearch.randomizedtesting.rules.NoShadowingOrOverridesOnMethodsRule$1.evaluate(NoShadowingOrOverridesOnMethodsRule.java:39)
	at com.carrotsearch.randomizedtesting.rules.NoShadowingOrOverridesOnMethodsRule$1.evaluate(NoShadowingOrOverridesOnMethodsRule.java:39)
	at com.carrotsearch.randomizedtesting.rules.StatementAdapter.evaluate(StatementAdapter.java:36)
	at org.apache.lucene.util.TestRuleAssertionsRequired$1.evaluate(TestRuleAssertionsRequired.java:43)
	at org.apache.lucene.util.TestRuleMarkFailure$1.evaluate(TestRuleMarkFailure.java:48)
	at org.apache.lucene.util.TestRuleIgnoreAfterMaxFailures$1.evaluate(TestRuleIgnoreAfterMaxFailures.java:70)
	at org.apache.lucene.util.TestRuleIgnoreTestSuites$1.evaluate(TestRuleIgnoreTestSuites.java:55)
	at com.carrotsearch.randomizedtesting.rules.StatementAdapter.evaluate(StatementAdapter.java:36)
	at com.carrotsearch.randomizedtesting.ThreadLeakControl$StatementRunner.run(ThreadLeakControl.java:358)
	at java.lang.Thread.run(Thread.java:780)


REGRESSION:  org.apache.lucene.index.TestRollingUpdates.testRollingUpdates

Error Message:


Stack Trace:
java.lang.AssertionError
	at __randomizedtesting.SeedInfo.seed([A254AA3A66AFD5DC:2CAFAB43D5317017]:0)
	at org.apache.lucene.store.DataOutput.writeVLong(DataOutput.java:217)
	at org.apache.lucene.util.fst.FST.pack(FST.java:1674)
	at org.apache.lucene.util.fst.Builder.finish(Builder.java:477)
	at org.apache.lucene.codecs.memory.MemoryPostingsFormat$TermsWriter.finish(MemoryPostingsFormat.java:274)
	at org.apache.lucene.index.FreqProxTermsWriterPerField.flush(FreqProxTermsWriterPerField.java:548)
	at org.apache.lucene.index.FreqProxTermsWriter.flush(FreqProxTermsWriter.java:85)
	at org.apache.lucene.index.TermsHash.flush(TermsHash.java:116)
	at org.apache.lucene.index.DocInverter.flush(DocInverter.java:53)
	at org.apache.lucene.index.DocFieldProcessor.flush(DocFieldProcessor.java:81)
	at org.apache.lucene.index.DocumentsWriterPerThread.flush(DocumentsWriterPerThread.java:494)
	at org.apache.lucene.index.DocumentsWriter.doFlush(DocumentsWriter.java:422)
	at org.apache.lucene.index.DocumentsWriter.flushAllThreads(DocumentsWriter.java:559)
	at org.apache.lucene.index.IndexWriter.getReader(IndexWriter.java:355)
	at org.apache.lucene.index.TestRollingUpdates.testRollingUpdates(TestRollingUpdates.java:113)
	at sun.reflect.NativeMethodAccessorImpl.invoke0(Native Method)
	at sun.reflect.NativeMethodAccessorImpl.invoke(NativeMethodAccessorImpl.java:88)
	at sun.reflect.DelegatingMethodAccessorImpl.invoke(DelegatingMethodAccessorImpl.java:55)
	at java.lang.reflect.Method.invoke(Method.java:613)
	at com.carrotsearch.randomizedtesting.RandomizedRunner.invoke(RandomizedRunner.java:1559)
	at com.carrotsearch.randomizedtesting.RandomizedRunner.access$600(RandomizedRunner.java:79)
	at com.carrotsearch.randomizedtesting.RandomizedRunner$6.evaluate(RandomizedRunner.java:737)
	at com.carrotsearch.randomizedtesting.RandomizedRunner$7.evaluate(RandomizedRunner.java:773)
	at com.carrotsearch.randomizedtesting.RandomizedRunner$8.evaluate(RandomizedRunner.java:787)
	at org.apache.lucene.util.TestRuleSetupTeardownChained$1.evaluate(TestRuleSetupTeardownChained.java:50)
	at org.apache.lucene.util.TestRuleFieldCacheSanity$1.evaluate(TestRuleFieldCacheSanity.java:51)
	at org.apache.lucene.util.AbstractBeforeAfterRule$1.evaluate(AbstractBeforeAfterRule.java:46)
	at com.carrotsearch.randomizedtesting.rules.SystemPropertiesInvariantRule$1.evaluate(SystemPropertiesInvariantRule.java:55)
	at org.apache.lucene.util.TestRuleThreadAndTestName$1.evaluate(TestRuleThreadAndTestName.java:49)
	at org.apache.lucene.util.TestRuleIgnoreAfterMaxFailures$1.evaluate(TestRuleIgnoreAfterMaxFailures.java:70)
	at org.apache.lucene.util.TestRuleMarkFailure$1.evaluate(TestRuleMarkFailure.java:48)
	at com.carrotsearch.randomizedtesting.rules.StatementAdapter.evaluate(StatementAdapter.java:36)
	at com.carrotsearch.randomizedtesting.ThreadLeakControl$StatementRunner.run(ThreadLeakControl.java:358)
	at com.carrotsearch.randomizedtesting.ThreadLeakControl.forkTimeoutingTask(ThreadLeakControl.java:782)
	at com.carrotsearch.randomizedtesting.ThreadLeakControl$3.evaluate(ThreadLeakControl.java:442)
	at com.carrotsearch.randomizedtesting.RandomizedRunner.runSingleTest(RandomizedRunner.java:746)
	at com.carrotsearch.randomizedtesting.RandomizedRunner$3.evaluate(RandomizedRunner.java:648)
	at com.carrotsearch.randomizedtesting.RandomizedRunner$4.evaluate(RandomizedRunner.java:682)
	at com.carrotsearch.randomizedtesting.RandomizedRunner$5.evaluate(RandomizedRunner.java:693)
	at org.apache.lucene.util.AbstractBeforeAfterRule$1.evaluate(AbstractBeforeAfterRule.java:46)
	at org.apache.lucene.util.TestRuleStoreClassName$1.evaluate(TestRuleStoreClassName.java:42)
	at com.carrotsearch.randomizedtesting.rules.SystemPropertiesInvariantRule$1.evaluate(SystemPropertiesInvariantRule.java:55)
	at com.carrotsearch.randomizedtesting.rules.NoShadowingOrOverridesOnMethodsRule$1.evaluate(NoShadowingOrOverridesOnMethodsRule.java:39)
	at com.carrotsearch.randomizedtesting.rules.NoShadowingOrOverridesOnMethodsRule$1.evaluate(NoShadowingOrOverridesOnMethodsRule.java:39)
	at com.carrotsearch.randomizedtesting.rules.StatementAdapter.evaluate(StatementAdapter.java:36)
	at org.apache.lucene.util.TestRuleAssertionsRequired$1.evaluate(TestRuleAssertionsRequired.java:43)
	at org.apache.lucene.util.TestRuleMarkFailure$1.evaluate(TestRuleMarkFailure.java:48)
	at org.apache.lucene.util.TestRuleIgnoreAfterMaxFailures$1.evaluate(TestRuleIgnoreAfterMaxFailures.java:70)
	at org.apache.lucene.util.TestRuleIgnoreTestSuites$1.evaluate(TestRuleIgnoreTestSuites.java:55)
	at com.carrotsearch.randomizedtesting.rules.StatementAdapter.evaluate(StatementAdapter.java:36)
	at com.carrotsearch.randomizedtesting.ThreadLeakControl$StatementRunner.run(ThreadLeakControl.java:358)
	at java.lang.Thread.run(Thread.java:780)




Build Log:
[...truncated 833 lines...]
[junit4:junit4] Suite: org.apache.lucene.search.TestMultiTermConstantScore
[junit4:junit4]   2> NOTE: test params are: codec=Lucene42: {body=PostingsFormat(name=Direct),
id=PostingsFormat(name=Memory doPackFST= true)}, docValues:{}, sim=DefaultSimilarity, locale=sr__#Latn,
timezone=America/Louisville
[junit4:junit4]   2> NOTE: Linux 3.2.0-38-generic x86/IBM Corporation 1.7.0 (32-bit)/cpus=8,threads=1,free=8969224,total=177602560
[junit4:junit4]   2> NOTE: All tests run in this JVM: [TestPerFieldDocValuesFormat, TestNumericUtils,
TestWindowsMMap, TestRegexpQuery, TestBagOfPostings, TestLock, TestTermVectorsReader, TestUTF32ToUTF8,
TestIndexFileDeleter, TestTimeLimitingCollector, TestSloppyPhraseQuery2, TestMockAnalyzer,
TestShardSearching, TestWildcardRandom, TestSimilarityBase, TestCustomSearcherSort, TestRecyclingByteBlockAllocator,
TestFilterAtomicReader, TestFieldCacheRangeFilter, TestSimpleExplanations, TestBackwardsCompatibility,
TestThreadedForceMerge, TestBlockPostingsFormat3, TestLazyProxSkipping, TestMultiDocValues,
TestDirectoryReaderReopen, TestNGramPhraseQuery, TestPagedBytes, TestSetOnce, TestIndexWriterCommit,
TestConcurrentMergeScheduler, ThrowInUncaught, TestWeakIdentityMap, TestElevationComparator,
TestIndexWriterOnJRECrash, TestSpanExplanationsOfNonMatches, TestPhraseQuery, TestScorerPerf,
TestMockDirectoryWrapper, TestForUtil, TestCheckIndex, TestDocBoost, Test2BPostingsBytes,
TestSimpleAttributeImpl, TestSegmentReader, TestFixedBitSet, TestSimpleExplanationsOfNonMatches,
TestIndexWriterReader, TestFuzzyQuery, TestByteSlices, TestFastCompressionMode, TestIndexWriterNRTIsCurrent,
Nested, Nested, Nested, TestByteArrayDataInput, TestSearchAfter, TestRegexpRandom, TestPositiveScoresOnlyCollector,
Nested1, TestFlushByRamOrCountsPolicy, TestIndexWriter, TestLucene42DocValuesFormat, TestLucene40DocValuesFormat,
TestMultiMMap, TestDoubleBarrelLRUCache, TestSegmentMerger, TestMultiLevelSkipList, TestVirtualMethod,
TestDateFilter, TestDocValuesWithThreads, TestGraphTokenizers, InBeforeClass, InAfterClass,
InTestMethod, NonStringProperties, TestTopDocsCollector, TestSimpleSearchEquivalence, TestParallelAtomicReader,
TestTotalHitCountCollector, TestDeletionPolicy, TestPayloadExplanations, TestMultiValuedNumericRangeQuery,
TestSearcherManager, TestMultiTermConstantScore]
[junit4:junit4]   2> NOTE: reproduce with: ant test  -Dtestcase=TestMultiTermConstantScore
-Dtests.seed=A254AA3A66AFD5DC -Dtests.multiplier=3 -Dtests.slow=true -Dtests.locale=sr__#Latn
-Dtests.timezone=America/Louisville -Dtests.file.encoding=US-ASCII
[junit4:junit4] ERROR   0.00s J0 | TestMultiTermConstantScore (suite) <<<
[junit4:junit4]    > Throwable #1: java.lang.AssertionError
[junit4:junit4]    > 	at __randomizedtesting.SeedInfo.seed([A254AA3A66AFD5DC]:0)
[junit4:junit4]    > 	at org.apache.lucene.store.DataOutput.writeVLong(DataOutput.java:217)
[junit4:junit4]    > 	at org.apache.lucene.util.fst.FST.pack(FST.java:1674)
[junit4:junit4]    > 	at org.apache.lucene.util.fst.Builder.finish(Builder.java:477)
[junit4:junit4]    > 	at org.apache.lucene.codecs.memory.MemoryPostingsFormat$TermsWriter.finish(MemoryPostingsFormat.java:274)
[junit4:junit4]    > 	at org.apache.lucene.index.FreqProxTermsWriterPerField.flush(FreqProxTermsWriterPerField.java:548)
[junit4:junit4]    > 	at org.apache.lucene.index.FreqProxTermsWriter.flush(FreqProxTermsWriter.java:85)
[junit4:junit4]    > 	at org.apache.lucene.index.TermsHash.flush(TermsHash.java:116)
[junit4:junit4]    > 	at org.apache.lucene.index.DocInverter.flush(DocInverter.java:53)
[junit4:junit4]    > 	at org.apache.lucene.index.DocFieldProcessor.flush(DocFieldProcessor.java:81)
[junit4:junit4]    > 	at org.apache.lucene.index.DocumentsWriterPerThread.flush(DocumentsWriterPerThread.java:494)
[junit4:junit4]    > 	at org.apache.lucene.index.DocumentsWriter.doFlush(DocumentsWriter.java:422)
[junit4:junit4]    > 	at org.apache.lucene.index.DocumentsWriter.postUpdate(DocumentsWriter.java:316)
[junit4:junit4]    > 	at org.apache.lucene.index.DocumentsWriter.updateDocument(DocumentsWriter.java:389)
[junit4:junit4]    > 	at org.apache.lucene.index.IndexWriter.updateDocument(IndexWriter.java:1471)
[junit4:junit4]    > 	at org.apache.lucene.index.IndexWriter.addDocument(IndexWriter.java:1146)
[junit4:junit4]    > 	at org.apache.lucene.index.RandomIndexWriter.addDocument(RandomIndexWriter.java:152)
[junit4:junit4]    > 	at org.apache.lucene.index.RandomIndexWriter.addDocument(RandomIndexWriter.java:114)
[junit4:junit4]    > 	at org.apache.lucene.search.BaseTestRangeFilter.build(BaseTestRangeFilter.java:153)
[junit4:junit4]    > 	at org.apache.lucene.search.BaseTestRangeFilter.beforeClassBaseTestRangeFilter(BaseTestRangeFilter.java:97)
[junit4:junit4]    > 	at sun.reflect.NativeMethodAccessorImpl.invoke0(Native Method)
[junit4:junit4]    > 	at sun.reflect.NativeMethodAccessorImpl.invoke(NativeMethodAccessorImpl.java:88)
[junit4:junit4]    > 	at sun.reflect.DelegatingMethodAccessorImpl.invoke(DelegatingMethodAccessorImpl.java:55)
[junit4:junit4]    > 	at java.lang.reflect.Method.invoke(Method.java:613)
[junit4:junit4]    > 	at com.carrotsearch.randomizedtesting.RandomizedRunner.invoke(RandomizedRunner.java:1559)
[junit4:junit4]    > 	at com.carrotsearch.randomizedtesting.RandomizedRunner.access$600(RandomizedRunner.java:79)
[junit4:junit4]    > 	at com.carrotsearch.randomizedtesting.RandomizedRunner$4.evaluate(RandomizedRunner.java:677)
[junit4:junit4]    > 	at com.carrotsearch.randomizedtesting.RandomizedRunner$5.evaluate(RandomizedRunner.java:693)
[junit4:junit4]    > 	at org.apache.lucene.util.AbstractBeforeAfterRule$1.evaluate(AbstractBeforeAfterRule.java:46)
[junit4:junit4]    > 	at org.apache.lucene.util.TestRuleStoreClassName$1.evaluate(TestRuleStoreClassName.java:42)
[junit4:junit4]    > 	at com.carrotsearch.randomizedtesting.rules.SystemPropertiesInvariantRule$1.evaluate(SystemPropertiesInvariantRule.java:55)
[junit4:junit4]    > 	at com.carrotsearch.randomizedtesting.rules.NoShadowingOrOverridesOnMethodsRule$1.evaluate(NoShadowingOrOverridesOnMethodsRule.java:39)
[junit4:junit4]    > 	at com.carrotsearch.randomizedtesting.rules.NoShadowingOrOverridesOnMethodsRule$1.evaluate(NoShadowingOrOverridesOnMethodsRule.java:39)
[junit4:junit4]    > 	at com.carrotsearch.randomizedtesting.rules.StatementAdapter.evaluate(StatementAdapter.java:36)
[junit4:junit4]    > 	at org.apache.lucene.util.TestRuleAssertionsRequired$1.evaluate(TestRuleAssertionsRequired.java:43)
[junit4:junit4]    > 	at org.apache.lucene.util.TestRuleMarkFailure$1.evaluate(TestRuleMarkFailure.java:48)
[junit4:junit4]    > 	at org.apache.lucene.util.TestRuleIgnoreAfterMaxFailures$1.evaluate(TestRuleIgnoreAfterMaxFailures.java:70)
[junit4:junit4]    > 	at org.apache.lucene.util.TestRuleIgnoreTestSuites$1.evaluate(TestRuleIgnoreTestSuites.java:55)
[junit4:junit4]    > 	at com.carrotsearch.randomizedtesting.rules.StatementAdapter.evaluate(StatementAdapter.java:36)
[junit4:junit4]    > 	at com.carrotsearch.randomizedtesting.ThreadLeakControl$StatementRunner.run(ThreadLeakControl.java:358)
[junit4:junit4]    > 	at java.lang.Thread.run(Thread.java:780)
[junit4:junit4]    > Throwable #2: java.lang.NullPointerException
[junit4:junit4]    > 	at __randomizedtesting.SeedInfo.seed([A254AA3A66AFD5DC]:0)
[junit4:junit4]    > 	at org.apache.lucene.search.TestMultiTermConstantScore.afterClass(TestMultiTermConstantScore.java:81)
[junit4:junit4]    > 	at sun.reflect.NativeMethodAccessorImpl.invoke0(Native Method)
[junit4:junit4]    > 	at sun.reflect.NativeMethodAccessorImpl.invoke(NativeMethodAccessorImpl.java:88)
[junit4:junit4]    > 	at sun.reflect.DelegatingMethodAccessorImpl.invoke(DelegatingMethodAccessorImpl.java:55)
[junit4:junit4]    > 	at java.lang.reflect.Method.invoke(Method.java:613)
[junit4:junit4]    > 	at com.carrotsearch.randomizedtesting.RandomizedRunner.invoke(RandomizedRunner.java:1559)
[junit4:junit4]    > 	at com.carrotsearch.randomizedtesting.RandomizedRunner.access$600(RandomizedRunner.java:79)
[junit4:junit4]    > 	at com.carrotsearch.randomizedtesting.RandomizedRunner$5.evaluate(RandomizedRunner.java:700)
[junit4:junit4]    > 	at org.apache.lucene.util.AbstractBeforeAfterRule$1.evaluate(AbstractBeforeAfterRule.java:46)
[junit4:junit4]    > 	at org.apache.lucene.util.TestRuleStoreClassName$1.evaluate(TestRuleStoreClassName.java:42)
[junit4:junit4]    > 	at com.carrotsearch.randomizedtesting.rules.SystemPropertiesInvariantRule$1.evaluate(SystemPropertiesInvariantRule.java:55)
[junit4:junit4]    > 	at com.carrotsearch.randomizedtesting.rules.NoShadowingOrOverridesOnMethodsRule$1.evaluate(NoShadowingOrOverridesOnMethodsRule.java:39)
[junit4:junit4]    > 	at com.carrotsearch.randomizedtesting.rules.NoShadowingOrOverridesOnMethodsRule$1.evaluate(NoShadowingOrOverridesOnMethodsRule.java:39)
[junit4:junit4]    > 	at com.carrotsearch.randomizedtesting.rules.StatementAdapter.evaluate(StatementAdapter.java:36)
[junit4:junit4]    > 	at org.apache.lucene.util.TestRuleAssertionsRequired$1.evaluate(TestRuleAssertionsRequired.java:43)
[junit4:junit4]    > 	at org.apache.lucene.util.TestRuleMarkFailure$1.evaluate(TestRuleMarkFailure.java:48)
[junit4:junit4]    > 	at org.apache.lucene.util.TestRuleIgnoreAfterMaxFailures$1.evaluate(TestRuleIgnoreAfterMaxFailures.java:70)
[junit4:junit4]    > 	at org.apache.lucene.util.TestRuleIgnoreTestSuites$1.evaluate(TestRuleIgnoreTestSuites.java:55)
[junit4:junit4]    > 	at com.carrotsearch.randomizedtesting.rules.StatementAdapter.evaluate(StatementAdapter.java:36)
[junit4:junit4]    > 	at com.carrotsearch.randomizedtesting.ThreadLeakControl$StatementRunner.run(ThreadLeakControl.java:358)
[junit4:junit4]    > 	at java.lang.Thread.run(Thread.java:780)
[junit4:junit4]    > Throwable #3: java.lang.NullPointerException
[junit4:junit4]    > 	at __randomizedtesting.SeedInfo.seed([A254AA3A66AFD5DC]:0)
[junit4:junit4]    > 	at org.apache.lucene.search.BaseTestRangeFilter.afterClassBaseTestRangeFilter(BaseTestRangeFilter.java:103)
[junit4:junit4]    > 	at sun.reflect.NativeMethodAccessorImpl.invoke0(Native Method)
[junit4:junit4]    > 	at sun.reflect.NativeMethodAccessorImpl.invoke(NativeMethodAccessorImpl.java:88)
[junit4:junit4]    > 	at sun.reflect.DelegatingMethodAccessorImpl.invoke(DelegatingMethodAccessorImpl.java:55)
[junit4:junit4]    > 	at java.lang.reflect.Method.invoke(Method.java:613)
[junit4:junit4]    > 	at com.carrotsearch.randomizedtesting.RandomizedRunner.invoke(RandomizedRunner.java:1559)
[junit4:junit4]    > 	at com.carrotsearch.randomizedtesting.RandomizedRunner.access$600(RandomizedRunner.java:79)
[junit4:junit4]    > 	at com.carrotsearch.randomizedtesting.RandomizedRunner$5.evaluate(RandomizedRunner.java:700)
[junit4:junit4]    > 	at org.apache.lucene.util.AbstractBeforeAfterRule$1.evaluate(AbstractBeforeAfterRule.java:46)
[junit4:junit4]    > 	at org.apache.lucene.util.TestRuleStoreClassName$1.evaluate(TestRuleStoreClassName.java:42)
[junit4:junit4]    > 	at com.carrotsearch.randomizedtesting.rules.SystemPropertiesInvariantRule$1.evaluate(SystemPropertiesInvariantRule.java:55)
[junit4:junit4]    > 	at com.carrotsearch.randomizedtesting.rules.NoShadowingOrOverridesOnMethodsRule$1.evaluate(NoShadowingOrOverridesOnMethodsRule.java:39)
[junit4:junit4]    > 	at com.carrotsearch.randomizedtesting.rules.NoShadowingOrOverridesOnMethodsRule$1.evaluate(NoShadowingOrOverridesOnMethodsRule.java:39)
[junit4:junit4]    > 	at com.carrotsearch.randomizedtesting.rules.StatementAdapter.evaluate(StatementAdapter.java:36)
[junit4:junit4]    > 	at org.apache.lucene.util.TestRuleAssertionsRequired$1.evaluate(TestRuleAssertionsRequired.java:43)
[junit4:junit4]    > 	at org.apache.lucene.util.TestRuleMarkFailure$1.evaluate(TestRuleMarkFailure.java:48)
[junit4:junit4]    > 	at org.apache.lucene.util.TestRuleIgnoreAfterMaxFailures$1.evaluate(TestRuleIgnoreAfterMaxFailures.java:70)
[junit4:junit4]    > 	at org.apache.lucene.util.TestRuleIgnoreTestSuites$1.evaluate(TestRuleIgnoreTestSuites.java:55)
[junit4:junit4]    > 	at com.carrotsearch.randomizedtesting.rules.StatementAdapter.evaluate(StatementAdapter.java:36)
[junit4:junit4]    > 	at com.carrotsearch.randomizedtesting.ThreadLeakControl$StatementRunner.run(ThreadLeakControl.java:358)
[junit4:junit4]    > 	at java.lang.Thread.run(Thread.java:780)
[junit4:junit4] Completed on J0 in 0.15s, 0 tests, 1 failure, 2 errors <<< FAILURES!

[...truncated 111 lines...]
[junit4:junit4] Suite: org.apache.lucene.index.TestRollingUpdates
[junit4:junit4]   2> NOTE: reproduce with: ant test  -Dtestcase=TestRollingUpdates -Dtests.method=testRollingUpdates
-Dtests.seed=A254AA3A66AFD5DC -Dtests.multiplier=3 -Dtests.slow=true -Dtests.locale=ca_ES_PREEURO
-Dtests.timezone=America/Louisville -Dtests.file.encoding=US-ASCII
[junit4:junit4] FAILURE 0.18s J0 | TestRollingUpdates.testRollingUpdates <<<
[junit4:junit4]    > Throwable #1: java.lang.AssertionError
[junit4:junit4]    > 	at __randomizedtesting.SeedInfo.seed([A254AA3A66AFD5DC:2CAFAB43D5317017]:0)
[junit4:junit4]    > 	at org.apache.lucene.store.DataOutput.writeVLong(DataOutput.java:217)
[junit4:junit4]    > 	at org.apache.lucene.util.fst.FST.pack(FST.java:1674)
[junit4:junit4]    > 	at org.apache.lucene.util.fst.Builder.finish(Builder.java:477)
[junit4:junit4]    > 	at org.apache.lucene.codecs.memory.MemoryPostingsFormat$TermsWriter.finish(MemoryPostingsFormat.java:274)
[junit4:junit4]    > 	at org.apache.lucene.index.FreqProxTermsWriterPerField.flush(FreqProxTermsWriterPerField.java:548)
[junit4:junit4]    > 	at org.apache.lucene.index.FreqProxTermsWriter.flush(FreqProxTermsWriter.java:85)
[junit4:junit4]    > 	at org.apache.lucene.index.TermsHash.flush(TermsHash.java:116)
[junit4:junit4]    > 	at org.apache.lucene.index.DocInverter.flush(DocInverter.java:53)
[junit4:junit4]    > 	at org.apache.lucene.index.DocFieldProcessor.flush(DocFieldProcessor.java:81)
[junit4:junit4]    > 	at org.apache.lucene.index.DocumentsWriterPerThread.flush(DocumentsWriterPerThread.java:494)
[junit4:junit4]    > 	at org.apache.lucene.index.DocumentsWriter.doFlush(DocumentsWriter.java:422)
[junit4:junit4]    > 	at org.apache.lucene.index.DocumentsWriter.flushAllThreads(DocumentsWriter.java:559)
[junit4:junit4]    > 	at org.apache.lucene.index.IndexWriter.getReader(IndexWriter.java:355)
[junit4:junit4]    > 	at org.apache.lucene.index.TestRollingUpdates.testRollingUpdates(TestRollingUpdates.java:113)
[junit4:junit4]    > 	at sun.reflect.NativeMethodAccessorImpl.invoke0(Native Method)
[junit4:junit4]    > 	at sun.reflect.NativeMethodAccessorImpl.invoke(NativeMethodAccessorImpl.java:88)
[junit4:junit4]    > 	at sun.reflect.DelegatingMethodAccessorImpl.invoke(DelegatingMethodAccessorImpl.java:55)
[junit4:junit4]    > 	at java.lang.reflect.Method.invoke(Method.java:613)
[junit4:junit4]    > 	at com.carrotsearch.randomizedtesting.RandomizedRunner.invoke(RandomizedRunner.java:1559)
[junit4:junit4]    > 	at com.carrotsearch.randomizedtesting.RandomizedRunner.access$600(RandomizedRunner.java:79)
[junit4:junit4]    > 	at com.carrotsearch.randomizedtesting.RandomizedRunner$6.evaluate(RandomizedRunner.java:737)
[junit4:junit4]    > 	at com.carrotsearch.randomizedtesting.RandomizedRunner$7.evaluate(RandomizedRunner.java:773)
[junit4:junit4]    > 	at com.carrotsearch.randomizedtesting.RandomizedRunner$8.evaluate(RandomizedRunner.java:787)
[junit4:junit4]    > 	at org.apache.lucene.util.TestRuleSetupTeardownChained$1.evaluate(TestRuleSetupTeardownChained.java:50)
[junit4:junit4]    > 	at org.apache.lucene.util.TestRuleFieldCacheSanity$1.evaluate(TestRuleFieldCacheSanity.java:51)
[junit4:junit4]    > 	at org.apache.lucene.util.AbstractBeforeAfterRule$1.evaluate(AbstractBeforeAfterRule.java:46)
[junit4:junit4]    > 	at com.carrotsearch.randomizedtesting.rules.SystemPropertiesInvariantRule$1.evaluate(SystemPropertiesInvariantRule.java:55)
[junit4:junit4]    > 	at org.apache.lucene.util.TestRuleThreadAndTestName$1.evaluate(TestRuleThreadAndTestName.java:49)
[junit4:junit4]    > 	at org.apache.lucene.util.TestRuleIgnoreAfterMaxFailures$1.evaluate(TestRuleIgnoreAfterMaxFailures.java:70)
[junit4:junit4]    > 	at org.apache.lucene.util.TestRuleMarkFailure$1.evaluate(TestRuleMarkFailure.java:48)
[junit4:junit4]    > 	at com.carrotsearch.randomizedtesting.rules.StatementAdapter.evaluate(StatementAdapter.java:36)
[junit4:junit4]    > 	at com.carrotsearch.randomizedtesting.ThreadLeakControl$StatementRunner.run(ThreadLeakControl.java:358)
[junit4:junit4]    > 	at com.carrotsearch.randomizedtesting.ThreadLeakControl.forkTimeoutingTask(ThreadLeakControl.java:782)
[junit4:junit4]    > 	at com.carrotsearch.randomizedtesting.ThreadLeakControl$3.evaluate(ThreadLeakControl.java:442)
[junit4:junit4]    > 	at com.carrotsearch.randomizedtesting.RandomizedRunner.runSingleTest(RandomizedRunner.java:746)
[junit4:junit4]    > 	at com.carrotsearch.randomizedtesting.RandomizedRunner$3.evaluate(RandomizedRunner.java:648)
[junit4:junit4]    > 	at com.carrotsearch.randomizedtesting.RandomizedRunner$4.evaluate(RandomizedRunner.java:682)
[junit4:junit4]    > 	at com.carrotsearch.randomizedtesting.RandomizedRunner$5.evaluate(RandomizedRunner.java:693)
[junit4:junit4]    > 	at org.apache.lucene.util.AbstractBeforeAfterRule$1.evaluate(AbstractBeforeAfterRule.java:46)
[junit4:junit4]    > 	at org.apache.lucene.util.TestRuleStoreClassName$1.evaluate(TestRuleStoreClassName.java:42)
[junit4:junit4]    > 	at com.carrotsearch.randomizedtesting.rules.SystemPropertiesInvariantRule$1.evaluate(SystemPropertiesInvariantRule.java:55)
[junit4:junit4]    > 	at com.carrotsearch.randomizedtesting.rules.NoShadowingOrOverridesOnMethodsRule$1.evaluate(NoShadowingOrOverridesOnMethodsRule.java:39)
[junit4:junit4]    > 	at com.carrotsearch.randomizedtesting.rules.NoShadowingOrOverridesOnMethodsRule$1.evaluate(NoShadowingOrOverridesOnMethodsRule.java:39)
[junit4:junit4]    > 	at com.carrotsearch.randomizedtesting.rules.StatementAdapter.evaluate(StatementAdapter.java:36)
[junit4:junit4]    > 	at org.apache.lucene.util.TestRuleAssertionsRequired$1.evaluate(TestRuleAssertionsRequired.java:43)
[junit4:junit4]    > 	at org.apache.lucene.util.TestRuleMarkFailure$1.evaluate(TestRuleMarkFailure.java:48)
[junit4:junit4]    > 	at org.apache.lucene.util.TestRuleIgnoreAfterMaxFailures$1.evaluate(TestRuleIgnoreAfterMaxFailures.java:70)
[junit4:junit4]    > 	at org.apache.lucene.util.TestRuleIgnoreTestSuites$1.evaluate(TestRuleIgnoreTestSuites.java:55)
[junit4:junit4]    > 	at com.carrotsearch.randomizedtesting.rules.StatementAdapter.evaluate(StatementAdapter.java:36)
[junit4:junit4]    > 	at com.carrotsearch.randomizedtesting.ThreadLeakControl$StatementRunner.run(ThreadLeakControl.java:358)
[junit4:junit4]    > 	at java.lang.Thread.run(Thread.java:780)
[junit4:junit4]   2> NOTE: test params are: codec=Asserting, sim=RandomSimilarityProvider(queryNorm=false,coord=yes):
{titleTokenized=DFR GL1, body=DFR GZ(0.3)}, locale=ca_ES_PREEURO, timezone=America/Louisville
[junit4:junit4]   2> NOTE: Linux 3.2.0-38-generic x86/IBM Corporation 1.7.0 (32-bit)/cpus=8,threads=1,free=75555256,total=291504128
[junit4:junit4]   2> NOTE: All tests run in this JVM: [TestPerFieldDocValuesFormat, TestNumericUtils,
TestWindowsMMap, TestRegexpQuery, TestBagOfPostings, TestLock, TestTermVectorsReader, TestUTF32ToUTF8,
TestIndexFileDeleter, TestTimeLimitingCollector, TestSloppyPhraseQuery2, TestMockAnalyzer,
TestShardSearching, TestWildcardRandom, TestSimilarityBase, TestCustomSearcherSort, TestRecyclingByteBlockAllocator,
TestFilterAtomicReader, TestFieldCacheRangeFilter, TestSimpleExplanations, TestBackwardsCompatibility,
TestThreadedForceMerge, TestBlockPostingsFormat3, TestLazyProxSkipping, TestMultiDocValues,
TestDirectoryReaderReopen, TestNGramPhraseQuery, TestPagedBytes, TestSetOnce, TestIndexWriterCommit,
TestConcurrentMergeScheduler, ThrowInUncaught, TestWeakIdentityMap, TestElevationComparator,
TestIndexWriterOnJRECrash, TestSpanExplanationsOfNonMatches, TestPhraseQuery, TestScorerPerf,
TestMockDirectoryWrapper, TestForUtil, TestCheckIndex, TestDocBoost, Test2BPostingsBytes,
TestSimpleAttributeImpl, TestSegmentReader, TestFixedBitSet, TestSimpleExplanationsOfNonMatches,
TestIndexWriterReader, TestFuzzyQuery, TestByteSlices, TestFastCompressionMode, TestIndexWriterNRTIsCurrent,
Nested, Nested, Nested, TestByteArrayDataInput, TestSearchAfter, TestRegexpRandom, TestPositiveScoresOnlyCollector,
Nested1, TestFlushByRamOrCountsPolicy, TestIndexWriter, TestLucene42DocValuesFormat, TestLucene40DocValuesFormat,
TestMultiMMap, TestDoubleBarrelLRUCache, TestSegmentMerger, TestMultiLevelSkipList, TestVirtualMethod,
TestDateFilter, TestDocValuesWithThreads, TestGraphTokenizers, InBeforeClass, InAfterClass,
InTestMethod, NonStringProperties, TestTopDocsCollector, TestSimpleSearchEquivalence, TestParallelAtomicReader,
TestTotalHitCountCollector, TestDeletionPolicy, TestPayloadExplanations, TestMultiValuedNumericRangeQuery,
TestSearcherManager, TestMultiTermConstantScore, Nested1, TestPhrasePrefixQuery, TestBasics,
TestAtomicUpdate, TestOpenBitSet, TestPersistentSnapshotDeletionPolicy, TestSort, TestArrayUtil,
TestSearchWithThreads, TestBufferedIndexInput, TestLongPostings, TestDirectoryReader, TestDeterminizeLexicon,
TestDocumentsWriterStallControl, TestConsistentFieldNumbers, TestComplexExplanations, TestCrashCausesCorruptIndex,
TestCharTermAttributeImpl, TestRollingUpdates]
[junit4:junit4] Completed on J0 in 1.52s, 2 tests, 1 failure <<< FAILURES!

[...truncated 445 lines...]
BUILD FAILED
/mnt/ssd/jenkins/workspace/Lucene-Solr-trunk-Linux/build.xml:381: The following error occurred
while executing this line:
/mnt/ssd/jenkins/workspace/Lucene-Solr-trunk-Linux/build.xml:374: The following error occurred
while executing this line:
/mnt/ssd/jenkins/workspace/Lucene-Solr-trunk-Linux/build.xml:39: The following error occurred
while executing this line:
/mnt/ssd/jenkins/workspace/Lucene-Solr-trunk-Linux/lucene/build.xml:50: The following error
occurred while executing this line:
/mnt/ssd/jenkins/workspace/Lucene-Solr-trunk-Linux/lucene/common-build.xml:1202: The following
error occurred while executing this line:
/mnt/ssd/jenkins/workspace/Lucene-Solr-trunk-Linux/lucene/common-build.xml:865: There were
test failures: 342 suites, 2131 tests, 3 suite-level errors, 1 failure, 56 ignored (44 assumptions)

Total time: 14 minutes 6 seconds
Build step 'Invoke Ant' marked build as failure
Archiving artifacts
Recording test results
Description set: Java: 32bit/ibm-j9-jdk7 
Email was triggered for: Failure
Sending email for trigger: Failure



Mime
View raw message