lucene-dev mailing list archives

Site index · List index
Message view « Date » · « Thread »
Top « Date » · « Thread »
From Policeman Jenkins Server <jenk...@thetaphi.de>
Subject [JENKINS] Lucene-Solr-trunk-Linux (32bit/jdk1.8.0-ea-b65) - Build # 4124 - Failure!
Date Sun, 03 Feb 2013 06:48:26 GMT
Build: http://jenkins.thetaphi.de/job/Lucene-Solr-trunk-Linux/4124/
Java: 32bit/jdk1.8.0-ea-b65 -server -XX:+UseConcMarkSweepGC

1 tests failed.
REGRESSION:  org.apache.solr.update.SoftAutoCommitTest.testSoftAndHardCommitMaxTimeDelete

Error Message:
searcher529 wasn't soon enough after soft529: 1359873395981 !< 1359873395878 + 100 (fudge)

Stack Trace:
java.lang.AssertionError: searcher529 wasn't soon enough after soft529: 1359873395981 !< 1359873395878 + 100 (fudge)
	at __randomizedtesting.SeedInfo.seed([3274EBF10CFFF667:F538536C17573BD7]:0)
	at org.junit.Assert.fail(Assert.java:93)
	at org.junit.Assert.assertTrue(Assert.java:43)
	at org.apache.solr.update.SoftAutoCommitTest.testSoftAndHardCommitMaxTimeDelete(SoftAutoCommitTest.java:265)
	at sun.reflect.NativeMethodAccessorImpl.invoke0(Native Method)
	at sun.reflect.NativeMethodAccessorImpl.invoke(NativeMethodAccessorImpl.java:57)
	at sun.reflect.DelegatingMethodAccessorImpl.invoke(DelegatingMethodAccessorImpl.java:43)
	at java.lang.reflect.Method.invoke(Method.java:474)
	at com.carrotsearch.randomizedtesting.RandomizedRunner.invoke(RandomizedRunner.java:1559)
	at com.carrotsearch.randomizedtesting.RandomizedRunner.access$600(RandomizedRunner.java:79)
	at com.carrotsearch.randomizedtesting.RandomizedRunner$6.evaluate(RandomizedRunner.java:737)
	at com.carrotsearch.randomizedtesting.RandomizedRunner$7.evaluate(RandomizedRunner.java:773)
	at com.carrotsearch.randomizedtesting.RandomizedRunner$8.evaluate(RandomizedRunner.java:787)
	at com.carrotsearch.randomizedtesting.rules.SystemPropertiesRestoreRule$1.evaluate(SystemPropertiesRestoreRule.java:53)
	at org.apache.lucene.util.TestRuleSetupTeardownChained$1.evaluate(TestRuleSetupTeardownChained.java:50)
	at org.apache.lucene.util.TestRuleFieldCacheSanity$1.evaluate(TestRuleFieldCacheSanity.java:51)
	at org.apache.lucene.util.AbstractBeforeAfterRule$1.evaluate(AbstractBeforeAfterRule.java:46)
	at com.carrotsearch.randomizedtesting.rules.SystemPropertiesInvariantRule$1.evaluate(SystemPropertiesInvariantRule.java:55)
	at org.apache.lucene.util.TestRuleThreadAndTestName$1.evaluate(TestRuleThreadAndTestName.java:49)
	at org.apache.lucene.util.TestRuleIgnoreAfterMaxFailures$1.evaluate(TestRuleIgnoreAfterMaxFailures.java:70)
	at org.apache.lucene.util.TestRuleMarkFailure$1.evaluate(TestRuleMarkFailure.java:48)
	at com.carrotsearch.randomizedtesting.rules.StatementAdapter.evaluate(StatementAdapter.java:36)
	at com.carrotsearch.randomizedtesting.ThreadLeakControl$StatementRunner.run(ThreadLeakControl.java:358)
	at com.carrotsearch.randomizedtesting.ThreadLeakControl.forkTimeoutingTask(ThreadLeakControl.java:782)
	at com.carrotsearch.randomizedtesting.ThreadLeakControl$3.evaluate(ThreadLeakControl.java:442)
	at com.carrotsearch.randomizedtesting.RandomizedRunner.runSingleTest(RandomizedRunner.java:746)
	at com.carrotsearch.randomizedtesting.RandomizedRunner$3.evaluate(RandomizedRunner.java:648)
	at com.carrotsearch.randomizedtesting.RandomizedRunner$4.evaluate(RandomizedRunner.java:682)
	at com.carrotsearch.randomizedtesting.RandomizedRunner$5.evaluate(RandomizedRunner.java:693)
	at com.carrotsearch.randomizedtesting.rules.StatementAdapter.evaluate(StatementAdapter.java:36)
	at com.carrotsearch.randomizedtesting.rules.SystemPropertiesRestoreRule$1.evaluate(SystemPropertiesRestoreRule.java:53)
	at org.apache.lucene.util.AbstractBeforeAfterRule$1.evaluate(AbstractBeforeAfterRule.java:46)
	at org.apache.lucene.util.TestRuleStoreClassName$1.evaluate(TestRuleStoreClassName.java:42)
	at com.carrotsearch.randomizedtesting.rules.SystemPropertiesInvariantRule$1.evaluate(SystemPropertiesInvariantRule.java:55)
	at com.carrotsearch.randomizedtesting.rules.NoShadowingOrOverridesOnMethodsRule$1.evaluate(NoShadowingOrOverridesOnMethodsRule.java:39)
	at com.carrotsearch.randomizedtesting.rules.NoShadowingOrOverridesOnMethodsRule$1.evaluate(NoShadowingOrOverridesOnMethodsRule.java:39)
	at com.carrotsearch.randomizedtesting.rules.StatementAdapter.evaluate(StatementAdapter.java:36)
	at org.apache.lucene.util.TestRuleAssertionsRequired$1.evaluate(TestRuleAssertionsRequired.java:43)
	at org.apache.lucene.util.TestRuleMarkFailure$1.evaluate(TestRuleMarkFailure.java:48)
	at org.apache.lucene.util.TestRuleIgnoreAfterMaxFailures$1.evaluate(TestRuleIgnoreAfterMaxFailures.java:70)
	at org.apache.lucene.util.TestRuleIgnoreTestSuites$1.evaluate(TestRuleIgnoreTestSuites.java:55)
	at com.carrotsearch.randomizedtesting.rules.StatementAdapter.evaluate(StatementAdapter.java:36)
	at com.carrotsearch.randomizedtesting.ThreadLeakControl$StatementRunner.run(ThreadLeakControl.java:358)
	at java.lang.Thread.run(Thread.java:722)




Build Log:
[...truncated 8820 lines...]
[junit4:junit4] Suite: org.apache.solr.update.SoftAutoCommitTest
[junit4:junit4]   2> 1 T511 oas.SolrTestCaseJ4.initCore ####initCore
[junit4:junit4]   2> Creating dataDir: /mnt/ssd/jenkins/workspace/Lucene-Solr-trunk-Linux/solr/build/solr-core/test/J1/./solrtest-SoftAutoCommitTest-1359873394006
[junit4:junit4]   2> 1 T511 oasc.SolrResourceLoader.<init> new SolrResourceLoader for directory: '/mnt/ssd/jenkins/workspace/Lucene-Solr-trunk-Linux/solr/build/solr-core/test-files/solr/collection1/'
[junit4:junit4]   2> 2 T511 oasc.SolrResourceLoader.replaceClassLoader Adding 'file:/mnt/ssd/jenkins/workspace/Lucene-Solr-trunk-Linux/solr/build/solr-core/test-files/solr/collection1/lib/README' to classloader
[junit4:junit4]   2> 3 T511 oasc.SolrResourceLoader.replaceClassLoader Adding 'file:/mnt/ssd/jenkins/workspace/Lucene-Solr-trunk-Linux/solr/build/solr-core/test-files/solr/collection1/lib/classes/' to classloader
[junit4:junit4]   2> 31 T511 oasc.SolrConfig.<init> Using Lucene MatchVersion: LUCENE_50
[junit4:junit4]   2> 101 T511 oasc.SolrConfig.<init> Loaded SolrConfig: solrconfig.xml
[junit4:junit4]   2> 102 T511 oass.IndexSchema.readSchema Reading Solr Schema
[junit4:junit4]   2> 105 T511 oass.IndexSchema.readSchema Schema name=test
[junit4:junit4]   2> 539 T511 oass.OpenExchangeRatesOrgProvider.init Initialized with rates=open-exchange-rates.json, refreshInterval=1440.
[junit4:junit4]   2> 544 T511 oass.IndexSchema.readSchema default search field in schema is text
[junit4:junit4]   2> 546 T511 oass.IndexSchema.readSchema unique key field: id
[junit4:junit4]   2> 550 T511 oass.FileExchangeRateProvider.reload Reloading exchange rates from file currency.xml
[junit4:junit4]   2> 552 T511 oass.FileExchangeRateProvider.reload Reloading exchange rates from file currency.xml
[junit4:junit4]   2> 554 T511 oass.OpenExchangeRatesOrgProvider.reload Reloading exchange rates from open-exchange-rates.json
[junit4:junit4]   2> 555 T511 oass.OpenExchangeRatesOrgProvider.reload Reloading exchange rates from open-exchange-rates.json
[junit4:junit4]   2> 555 T511 oasc.SolrResourceLoader.locateSolrHome JNDI not configured for solr (NoInitialContextEx)
[junit4:junit4]   2> 556 T511 oasc.SolrResourceLoader.locateSolrHome using system property solr.solr.home: /mnt/ssd/jenkins/workspace/Lucene-Solr-trunk-Linux/solr/build/solr-core/test-files/solr
[junit4:junit4]   2> 556 T511 oasc.SolrResourceLoader.<init> new SolrResourceLoader for directory: '/mnt/ssd/jenkins/workspace/Lucene-Solr-trunk-Linux/solr/build/solr-core/test-files/solr/'
[junit4:junit4]   2> 561 T511 oasc.CoreContainer.<init> New CoreContainer 24320607
[junit4:junit4]   2> 561 T511 oasc.SolrCore.<init> [collection1] Opening new SolrCore at /mnt/ssd/jenkins/workspace/Lucene-Solr-trunk-Linux/solr/build/solr-core/test-files/solr/collection1/, dataDir=/mnt/ssd/jenkins/workspace/Lucene-Solr-trunk-Linux/solr/build/solr-core/test/J1/./solrtest-SoftAutoCommitTest-1359873394006/
[junit4:junit4]   2> 561 T511 oasc.JmxMonitoredMap.<init> JMX monitoring is enabled. Adding Solr mbeans to JMX Server: com.sun.jmx.mbeanserver.JmxMBeanServer@20ac02
[junit4:junit4]   2> 562 T511 oasc.SolrCore.initDirectoryFactory org.apache.solr.core.MockDirectoryFactory
[junit4:junit4]   2> 562 T511 oasc.CachingDirectoryFactory.get return new directory for /mnt/ssd/jenkins/workspace/Lucene-Solr-trunk-Linux/solr/build/solr-core/test/J1/./solrtest-SoftAutoCommitTest-1359873394006 forceNew:false
[junit4:junit4]   2> 562 T511 oasc.CachingDirectoryFactory.close Releasing directory:/mnt/ssd/jenkins/workspace/Lucene-Solr-trunk-Linux/solr/build/solr-core/test/J1/./solrtest-SoftAutoCommitTest-1359873394006
[junit4:junit4]   2> 563 T511 oasc.SolrCore.getNewIndexDir New index directory detected: old=null new=/mnt/ssd/jenkins/workspace/Lucene-Solr-trunk-Linux/solr/build/solr-core/test/J1/./solrtest-SoftAutoCommitTest-1359873394006/index/
[junit4:junit4]   2> 563 T511 oasc.SolrCore.initIndex WARNING [collection1] Solr index directory '/mnt/ssd/jenkins/workspace/Lucene-Solr-trunk-Linux/solr/build/solr-core/test/J1/./solrtest-SoftAutoCommitTest-1359873394006/index' doesn't exist. Creating new index...
[junit4:junit4]   2> 563 T511 oasc.CachingDirectoryFactory.get return new directory for /mnt/ssd/jenkins/workspace/Lucene-Solr-trunk-Linux/solr/build/solr-core/test/J1/./solrtest-SoftAutoCommitTest-1359873394006/index forceNew:false
[junit4:junit4]   2> 564 T511 oasc.SolrDeletionPolicy.onCommit SolrDeletionPolicy.onCommit: commits:num=1
[junit4:junit4]   2> 		commit{dir=RateLimitedDirectoryWrapper(MockDirWrapper(org.apache.lucene.store.RAMDirectory@fc9ec0 lockFactory=org.apache.lucene.store.NativeFSLockFactory@125a0f8)),segFN=segments_1,generation=1,filenames=[segments_1]
[junit4:junit4]   2> 565 T511 oasc.SolrDeletionPolicy.updateCommits newest commit = 1[segments_1]
[junit4:junit4]   2> 565 T511 oasc.CachingDirectoryFactory.close Releasing directory:/mnt/ssd/jenkins/workspace/Lucene-Solr-trunk-Linux/solr/build/solr-core/test/J1/./solrtest-SoftAutoCommitTest-1359873394006/index
[junit4:junit4]   2> 565 T511 oasc.SolrCore.initWriters created xml: solr.XMLResponseWriter
[junit4:junit4]   2> 567 T511 oasup.UpdateRequestProcessorChain.init inserting DistributedUpdateProcessorFactory into updateRequestProcessorChain "dedupe"
[junit4:junit4]   2> 567 T511 oasup.UpdateRequestProcessorChain.init inserting DistributedUpdateProcessorFactory into updateRequestProcessorChain "dedupe-allfields"
[junit4:junit4]   2> 568 T511 oasup.UpdateRequestProcessorChain.init inserting DistributedUpdateProcessorFactory into updateRequestProcessorChain "stored_sig"
[junit4:junit4]   2> 568 T511 oasup.UpdateRequestProcessorChain.init inserting DistributedUpdateProcessorFactory into updateRequestProcessorChain "uniq-fields"
[junit4:junit4]   2> 568 T511 oasup.UpdateRequestProcessorChain.init inserting DistributedUpdateProcessorFactory into updateRequestProcessorChain "distrib-dup-test-chain-implicit"
[junit4:junit4]   2> 569 T511 oasc.RequestHandlers.initHandlersFromConfig adding lazy requestHandler: solr.ReplicationHandler
[junit4:junit4]   2> 569 T511 oasc.RequestHandlers.initHandlersFromConfig created /replication: solr.ReplicationHandler
[junit4:junit4]   2> 569 T511 oasc.RequestHandlers.initHandlersFromConfig created standard: solr.StandardRequestHandler
[junit4:junit4]   2> 570 T511 oasc.RequestHandlers.initHandlersFromConfig created /get: solr.RealTimeGetHandler
[junit4:junit4]   2> 570 T511 oasc.RequestHandlers.initHandlersFromConfig created dismax: solr.SearchHandler
[junit4:junit4]   2> 570 T511 oasc.RequestHandlers.initHandlersFromConfig created mock: org.apache.solr.core.MockQuerySenderListenerReqHandler
[junit4:junit4]   2> 570 T511 oasc.RequestHandlers.initHandlersFromConfig created /admin/: org.apache.solr.handler.admin.AdminHandlers
[junit4:junit4]   2> 571 T511 oasc.RequestHandlers.initHandlersFromConfig created defaults: solr.StandardRequestHandler
[junit4:junit4]   2> 571 T511 oasc.RequestHandlers.initHandlersFromConfig adding lazy requestHandler: solr.StandardRequestHandler
[junit4:junit4]   2> 571 T511 oasc.RequestHandlers.initHandlersFromConfig created lazy: solr.StandardRequestHandler
[junit4:junit4]   2> 572 T511 oasc.RequestHandlers.initHandlersFromConfig created /update: solr.UpdateRequestHandler
[junit4:junit4]   2> 572 T511 oasc.RequestHandlers.initHandlersFromConfig created /terms: org.apache.solr.handler.component.SearchHandler
[junit4:junit4]   2> 572 T511 oasc.RequestHandlers.initHandlersFromConfig created spellCheckCompRH: org.apache.solr.handler.component.SearchHandler
[junit4:junit4]   2> 572 T511 oasc.RequestHandlers.initHandlersFromConfig created spellCheckCompRH_Direct: org.apache.solr.handler.component.SearchHandler
[junit4:junit4]   2> 573 T511 oasc.RequestHandlers.initHandlersFromConfig created spellCheckWithWordbreak: org.apache.solr.handler.component.SearchHandler
[junit4:junit4]   2> 573 T511 oasc.RequestHandlers.initHandlersFromConfig created spellCheckWithWordbreak_Direct: org.apache.solr.handler.component.SearchHandler
[junit4:junit4]   2> 573 T511 oasc.RequestHandlers.initHandlersFromConfig created spellCheckCompRH1: org.apache.solr.handler.component.SearchHandler
[junit4:junit4]   2> 574 T511 oasc.RequestHandlers.initHandlersFromConfig created mltrh: org.apache.solr.handler.component.SearchHandler
[junit4:junit4]   2> 574 T511 oasc.RequestHandlers.initHandlersFromConfig created tvrh: org.apache.solr.handler.component.SearchHandler
[junit4:junit4]   2> 574 T511 oasc.RequestHandlers.initHandlersFromConfig created /mlt: solr.MoreLikeThisHandler
[junit4:junit4]   2> 575 T511 oasc.RequestHandlers.initHandlersFromConfig created /debug/dump: solr.DumpRequestHandler
[junit4:junit4]   2> 577 T511 oashl.XMLLoader.init xsltCacheLifetimeSeconds=60
[junit4:junit4]   2> 579 T511 oasc.SolrCore.initDeprecatedSupport WARNING solrconfig.xml uses deprecated <admin/gettableFiles>, Please update your config to use the ShowFileRequestHandler.
[junit4:junit4]   2> 580 T511 oasc.SolrCore.initDeprecatedSupport WARNING adding ShowFileRequestHandler with hidden files: [STEMDICT.TXT, SCHEMA-MINIMAL.XML, SOLRCONFIG-POSTINGSHIGHLIGHT.XML, SCHEMA-COLLATE.XML, SCHEMA-BINARYFIELD.XML, SOLRCONFIG-MASTER3.XML, BAD-SCHEMA-EXTERNAL-FILEFIELD.XML, MAPPING-ISOLATIN1ACCENT.TXT, SCHEMA-EFF.XML, STOPWORDSWRONGENCODING.TXT, SCHEMA-NUMERIC.XML, BAD-SCHEMA-NONTEXT-ANALYZER.XML, SOLRCONFIG-SLAVE1.XML, STOPTYPES-1.TXT, SOLRCONFIG-COMPONENTS-NAME.XML, SCHEMA-STOP-KEEP.XML, MISSING.FUNCTIONS.UPDATEPROCESSOR.JS, BAD-SCHEMA-SIM-GLOBAL-VS-FT-MISMATCH.XML, ADDFIELDS.UPDATEPROCESSOR.JS, SCHEMA-IB.XML, STOPWITHBOM.TXT, SCHEMA.XML, SOLRCONFIG_PERF.XML, SOLRCONFIG-MASTER1-KEEPONEBACKUP.XML, SCHEMA-BM25.XML, SOLRCONFIG-TERMINDEX.XML, SOLRCONFIG-SOLR-749.XML, SCHEMA-LMDIRICHLET.XML, SCHEMASURROUND.XML, FRENCHARTICLES.TXT, SCHEMA-SYNONYM-TOKENIZER.XML, HYPHENATION.DTD, STOPWORDS.TXT, SCHEMA-LMJELINEKMERCER.XML, BAD-SCHEMA-UNIQUEKEY-IS-COPYFIELD-DEST.XML, SCHEMA-POSTINGSHIGHLIGHT.XML, SCHEMA11.XML, BAD-SCHEMA-CURRENCY-MULTIVALUED.XML, STOP-1.TXT, SCHEMA12.XML, SCHEMA-TRIE.XML, SOLRCONFIG-MASTER2.XML, BAD-SCHEMA-ANALYZER-CLASS-AND-NESTED.XML, SOLRCONFIG-SNIPPET-PROCESSOR.XML, SOLRCONFIG-HIGHLIGHT.XML, SOLRCONFIG-NATIVELOCK.XML, PROTWORDS.TXT, SOLRCONFIG-PROPINJECT-INDEXDEFAULT.XML, COMPOUNDDICTIONARY.TXT, SOLRCONFIG-INDEXCONFIG.XML, SCHEMA-PHRASESUGGEST.XML, HUNSPELL-TEST.DIC, TRIVIAL.UPDATEPROCESSOR0.JS, SOLRCONFIG-CACHING.XML, SOLRCONFIG-UPDATE-PROCESSOR-CHAINS.XML, STOP-2.TXT, BAD-SCHEMA-UNIQUEKEY-USES-DEFAULT.XML, SCHEMA-LUCENEMATCHVERSION.XML, SOLRCONFIG-SLAVE.XML, ELEVATE.XML, SOLRCONFIG-SPELLCHECKCOMPONENT.XML, JASUGGEST.TXT, SOLRCONFIG-XINCLUDE.XML, SOLRCONFIG-DELPOLICY2.XML, SCHEMA-DFR.XML, BAD-SCHEMA-DUP-DYNAMICFIELD.XML, DA_COMPOUNDDICTIONARY.TXT, CONDITIONAL.UPDATEPROCESSOR.JS, SOLRCONFIG-DELPOLICY1.XML, SCHEMA-CHARFILTERS.XML, SOLRCONFIG_CODEC.XML, BAD-SCHEMA-NOT-INDEXED-BUT-POS.XML, SOLRCONFIG-RESPONSE-LOG-COMPONENT.XML, SCHEMA-NOT-REQUIRED-UNIQUE-KEY.XML, BAD-SCHEMA-CURRENCY-FT-MULTIVALUED.XML, SCHEMA-SNIPPET-FIELD.XML, SCHEMA-REPLICATION1.XML, BAD-SCHEMA-DUP-FIELD.XML, SCHEMA-BEHAVIOR.XML, SOLRCONFIG-SOLCOREPROPERTIES.XML, DA_UTF8.XML, SCHEMA-FOLDING.XML, SCHEMA-SIM.XML, PHRASESUGGEST.TXT, STOPTYPES-2.TXT, THROW.ERROR.ON.ADD.UPDATEPROCESSOR.JS, SCHEMA-SPATIAL.XML, BAD-SCHEMA-DUP-FIELDTYPE.XML, BAD-SCHEMA-NOT-INDEXED-BUT-NORMS.XML, SOLRCONFIG-ELEVATE.XML, SCHEMA-REQUIRED-FIELDS.XML, SOLRCONFIG-QUERYSENDER.XML, SOLRCONFIG-REPEATER.XML, SOLRCONFIG-REQHANDLER.INCL, SYNONYMS.TXT, XSLT, SOLRCONFIG-QUERYSENDER-NOQUERY.XML, TRIVIAL.UPDATEPROCESSOR1.JS, SOLRCONFIG-SPELLCHECKER.XML, OLD_SYNONYMS.TXT, HUNSPELL-TEST.AFF, BAD-SOLRCONFIG-BOGUS-SCRIPTENGINE-NAME.XML, SOLRCONFIG-MERGEPOLICY.XML, FUZZYSUGGEST.TXT, SOLRCONFIG-MASTER.XML, BAD-SOLRCONFIG-MISSING-SCRIPTFILE.XML, SOLRCONFIG-BASIC.XML, OPEN-EXCHANGE-RATES.JSON, SCHEMA-COPYFIELD-TEST.XML, BAD-SCHEMA-CURRENCY-DYNAMIC-MULTIVALUED.XML, SOLRCONFIG-MASTER1.XML, SCHEMA_CODEC.XML, REGEX-BOOST-PROCESSOR-TEST.TXT, SOLRCONFIG-ENABLEPLUGIN.XML, KEEP-2.TXT, KEEP-1.TXT, SCHEMA-TFIDF.XML, SCHEMA15.XML, SOLRCONFIG-PHRASESUGGEST.XML, SOLRCONFIG-TLOG.XML, SOLRCONFIG-LAZYWRITER.XML, SOLRCONFIG-ALTDIRECTORY.XML, BAD-SCHEMA-OMIT-TF-BUT-NOT-POS.XML, SCHEMA-REPLICATION2.XML, SCHEMA-REVERSED.XML, SCHEMA-SNIPPET-TYPE.XML, SOLRCONFIG-TRANSFORMERS.XML, SOLRCONFIG-NOCACHE.XML, SCHEMA-SPELLCHECKER.XML, BAD-SCHEMA-UNIQUEKEY-MULTIVALUED.XML, BAD-SOLRCONFIG-INVALID-SCRIPTFILE.XML, MISSLEADING.EXTENSION.UPDATEPROCESSOR.JS.TXT, BAD-SCHEMA-NOT-INDEXED-BUT-TF.XML, SCHEMA-XINCLUDE.XML, SOLRCONFIG-SIMPLELOCK.XML, BAD_SOLRCONFIG.XML, BAD-SCHEMA-CODEC-GLOBAL-VS-FT-MISMATCH.XML, STOP-SNOWBALL.TXT, SOLRCONFIG-SCRIPT-UPDATEPROCESSOR.XML, WDFTYPES.TXT, BAD-MP-SOLRCONFIG.XML, SOLRCONFIG-FUNCTIONQUERY.XML, SOLRCONFIG-PROPINJECT.XML, CURRENCY.XML]
[junit4:junit4]   2> 582 T511 oasc.CachingDirectoryFactory.close Releasing directory:/mnt/ssd/jenkins/workspace/Lucene-Solr-trunk-Linux/solr/build/solr-core/test/J1/./solrtest-SoftAutoCommitTest-1359873394006
[junit4:junit4]   2> 582 T511 oass.SolrIndexSearcher.<init> Opening Searcher@2b44dd main
[junit4:junit4]   2> 582 T511 oasu.CommitTracker.<init> Hard AutoCommit: disabled
[junit4:junit4]   2> 583 T511 oasu.CommitTracker.<init> Soft AutoCommit: disabled
[junit4:junit4]   2> 583 T511 oashc.SpellCheckComponent.inform Initializing spell checkers
[junit4:junit4]   2> 594 T511 oass.DirectSolrSpellChecker.init init: {name=direct,classname=DirectSolrSpellChecker,field=lowerfilt,minQueryLength=3}
[junit4:junit4]   2> 663 T512 oasc.SolrCore.registerSearcher [collection1] Registered new searcher Searcher@2b44dd main{StandardDirectoryReader(segments_1:1)}
[junit4:junit4]   2> 667 T511 oasc.CoreContainer.registerCore registering core: collection1
[junit4:junit4]   2> 670 T511 oas.SolrTestCaseJ4.initCore ####initCore end
[junit4:junit4]   2> 692 T511 oas.SolrTestCaseJ4.setUp ###Starting testSoftAndHardCommitMaxTimeDelete
[junit4:junit4]   2> 693 T511 oasc.CoreContainer.reload Reloading SolrCore 'collection1' using instanceDir: /mnt/ssd/jenkins/workspace/Lucene-Solr-trunk-Linux/solr/build/solr-core/test-files/solr/collection1
[junit4:junit4]   2> 693 T511 oasc.SolrResourceLoader.<init> new SolrResourceLoader for directory: '/mnt/ssd/jenkins/workspace/Lucene-Solr-trunk-Linux/solr/build/solr-core/test-files/solr/collection1/'
[junit4:junit4]   2> 694 T511 oasc.SolrResourceLoader.replaceClassLoader Adding 'file:/mnt/ssd/jenkins/workspace/Lucene-Solr-trunk-Linux/solr/build/solr-core/test-files/solr/collection1/lib/README' to classloader
[junit4:junit4]   2> 694 T511 oasc.SolrResourceLoader.replaceClassLoader Adding 'file:/mnt/ssd/jenkins/workspace/Lucene-Solr-trunk-Linux/solr/build/solr-core/test-files/solr/collection1/lib/classes/' to classloader
[junit4:junit4]   2> 722 T511 oasc.SolrConfig.<init> Using Lucene MatchVersion: LUCENE_50
[junit4:junit4]   2> 762 T511 oasc.SolrConfig.<init> Loaded SolrConfig: solrconfig.xml
[junit4:junit4]   2> 762 T511 oass.IndexSchema.readSchema Reading Solr Schema
[junit4:junit4]   2> 774 T511 oass.IndexSchema.readSchema Schema name=test
[junit4:junit4]   2> 1233 T511 oass.OpenExchangeRatesOrgProvider.init Initialized with rates=open-exchange-rates.json, refreshInterval=1440.
[junit4:junit4]   2> 1241 T511 oass.IndexSchema.readSchema default search field in schema is text
[junit4:junit4]   2> 1244 T511 oass.IndexSchema.readSchema unique key field: id
[junit4:junit4]   2> 1250 T511 oass.FileExchangeRateProvider.reload Reloading exchange rates from file currency.xml
[junit4:junit4]   2> 1254 T511 oass.FileExchangeRateProvider.reload Reloading exchange rates from file currency.xml
[junit4:junit4]   2> 1257 T511 oass.OpenExchangeRatesOrgProvider.reload Reloading exchange rates from open-exchange-rates.json
[junit4:junit4]   2> 1258 T511 oass.OpenExchangeRatesOrgProvider.reload Reloading exchange rates from open-exchange-rates.json
[junit4:junit4]   2> 1259 T511 oasc.SolrCore.<init> [collection1] Opening new SolrCore at /mnt/ssd/jenkins/workspace/Lucene-Solr-trunk-Linux/solr/build/solr-core/test-files/solr/collection1/, dataDir=/mnt/ssd/jenkins/workspace/Lucene-Solr-trunk-Linux/solr/build/solr-core/test/J1/./solrtest-SoftAutoCommitTest-1359873394006/
[junit4:junit4]   2> 1259 T511 oasc.JmxMonitoredMap.<init> JMX monitoring is enabled. Adding Solr mbeans to JMX Server: com.sun.jmx.mbeanserver.JmxMBeanServer@20ac02
[junit4:junit4]   2> 1260 T511 oasc.CachingDirectoryFactory.close Releasing directory:/mnt/ssd/jenkins/workspace/Lucene-Solr-trunk-Linux/solr/build/solr-core/test/J1/./solrtest-SoftAutoCommitTest-1359873394006
[junit4:junit4]   2> 1260 T511 oasc.SolrCore.getNewIndexDir New index directory detected: old=null new=/mnt/ssd/jenkins/workspace/Lucene-Solr-trunk-Linux/solr/build/solr-core/test/J1/./solrtest-SoftAutoCommitTest-1359873394006/index/
[junit4:junit4]   2> 1260 T511 oasc.SolrCore.initWriters created xml: solr.XMLResponseWriter
[junit4:junit4]   2> 1262 T511 oasup.UpdateRequestProcessorChain.init inserting DistributedUpdateProcessorFactory into updateRequestProcessorChain "dedupe"
[junit4:junit4]   2> 1263 T511 oasup.UpdateRequestProcessorChain.init inserting DistributedUpdateProcessorFactory into updateRequestProcessorChain "dedupe-allfields"
[junit4:junit4]   2> 1263 T511 oasup.UpdateRequestProcessorChain.init inserting DistributedUpdateProcessorFactory into updateRequestProcessorChain "stored_sig"
[junit4:junit4]   2> 1264 T511 oasup.UpdateRequestProcessorChain.init inserting DistributedUpdateProcessorFactory into updateRequestProcessorChain "uniq-fields"
[junit4:junit4]   2> 1264 T511 oasup.UpdateRequestProcessorChain.init inserting DistributedUpdateProcessorFactory into updateRequestProcessorChain "distrib-dup-test-chain-implicit"
[junit4:junit4]   2> 1265 T511 oasc.RequestHandlers.initHandlersFromConfig adding lazy requestHandler: solr.ReplicationHandler
[junit4:junit4]   2> 1265 T511 oasc.RequestHandlers.initHandlersFromConfig created /replication: solr.ReplicationHandler
[junit4:junit4]   2> 1266 T511 oasc.RequestHandlers.initHandlersFromConfig created standard: solr.StandardRequestHandler
[junit4:junit4]   2> 1266 T511 oasc.RequestHandlers.initHandlersFromConfig created /get: solr.RealTimeGetHandler
[junit4:junit4]   2> 1267 T511 oasc.RequestHandlers.initHandlersFromConfig created dismax: solr.SearchHandler
[junit4:junit4]   2> 1267 T511 oasc.RequestHandlers.initHandlersFromConfig created mock: org.apache.solr.core.MockQuerySenderListenerReqHandler
[junit4:junit4]   2> 1268 T511 oasc.RequestHandlers.initHandlersFromConfig created /admin/: org.apache.solr.handler.admin.AdminHandlers
[junit4:junit4]   2> 1268 T511 oasc.RequestHandlers.initHandlersFromConfig created defaults: solr.StandardRequestHandler
[junit4:junit4]   2> 1269 T511 oasc.RequestHandlers.initHandlersFromConfig adding lazy requestHandler: solr.StandardRequestHandler
[junit4:junit4]   2> 1269 T511 oasc.RequestHandlers.initHandlersFromConfig created lazy: solr.StandardRequestHandler
[junit4:junit4]   2> 1270 T511 oasc.RequestHandlers.initHandlersFromConfig created /update: solr.UpdateRequestHandler
[junit4:junit4]   2> 1270 T511 oasc.RequestHandlers.initHandlersFromConfig created /terms: org.apache.solr.handler.component.SearchHandler
[junit4:junit4]   2> 1271 T511 oasc.RequestHandlers.initHandlersFromConfig created spellCheckCompRH: org.apache.solr.handler.component.SearchHandler
[junit4:junit4]   2> 1272 T511 oasc.RequestHandlers.initHandlersFromConfig created spellCheckCompRH_Direct: org.apache.solr.handler.component.SearchHandler
[junit4:junit4]   2> 1272 T511 oasc.RequestHandlers.initHandlersFromConfig created spellCheckWithWordbreak: org.apache.solr.handler.component.SearchHandler
[junit4:junit4]   2> 1273 T511 oasc.RequestHandlers.initHandlersFromConfig created spellCheckWithWordbreak_Direct: org.apache.solr.handler.component.SearchHandler
[junit4:junit4]   2> 1273 T511 oasc.RequestHandlers.initHandlersFromConfig created spellCheckCompRH1: org.apache.solr.handler.component.SearchHandler
[junit4:junit4]   2> 1275 T511 oasc.RequestHandlers.initHandlersFromConfig created mltrh: org.apache.solr.handler.component.SearchHandler
[junit4:junit4]   2> 1275 T511 oasc.RequestHandlers.initHandlersFromConfig created tvrh: org.apache.solr.handler.component.SearchHandler
[junit4:junit4]   2> 1276 T511 oasc.RequestHandlers.initHandlersFromConfig created /mlt: solr.MoreLikeThisHandler
[junit4:junit4]   2> 1276 T511 oasc.RequestHandlers.initHandlersFromConfig created /debug/dump: solr.DumpRequestHandler
[junit4:junit4]   2> 1278 T511 oashl.XMLLoader.init xsltCacheLifetimeSeconds=60
[junit4:junit4]   2> 1280 T511 oasc.SolrCore.initDeprecatedSupport WARNING solrconfig.xml uses deprecated <admin/gettableFiles>, Please update your config to use the ShowFileRequestHandler.
[junit4:junit4]   2> 1282 T511 oasc.SolrCore.initDeprecatedSupport WARNING adding ShowFileRequestHandler with hidden files: [STEMDICT.TXT, SCHEMA-MINIMAL.XML, SOLRCONFIG-POSTINGSHIGHLIGHT.XML, SCHEMA-COLLATE.XML, SCHEMA-BINARYFIELD.XML, SOLRCONFIG-MASTER3.XML, BAD-SCHEMA-EXTERNAL-FILEFIELD.XML, MAPPING-ISOLATIN1ACCENT.TXT, SCHEMA-EFF.XML, STOPWORDSWRONGENCODING.TXT, SCHEMA-NUMERIC.XML, BAD-SCHEMA-NONTEXT-ANALYZER.XML, SOLRCONFIG-SLAVE1.XML, STOPTYPES-1.TXT, SOLRCONFIG-COMPONENTS-NAME.XML, SCHEMA-STOP-KEEP.XML, MISSING.FUNCTIONS.UPDATEPROCESSOR.JS, BAD-SCHEMA-SIM-GLOBAL-VS-FT-MISMATCH.XML, ADDFIELDS.UPDATEPROCESSOR.JS, SCHEMA-IB.XML, STOPWITHBOM.TXT, SCHEMA.XML, SOLRCONFIG_PERF.XML, SOLRCONFIG-MASTER1-KEEPONEBACKUP.XML, SCHEMA-BM25.XML, SOLRCONFIG-TERMINDEX.XML, SOLRCONFIG-SOLR-749.XML, SCHEMA-LMDIRICHLET.XML, SCHEMASURROUND.XML, FRENCHARTICLES.TXT, SCHEMA-SYNONYM-TOKENIZER.XML, HYPHENATION.DTD, STOPWORDS.TXT, SCHEMA-LMJELINEKMERCER.XML, BAD-SCHEMA-UNIQUEKEY-IS-COPYFIELD-DEST.XML, SCHEMA-POSTINGSHIGHLIGHT.XML, SCHEMA11.XML, BAD-SCHEMA-CURRENCY-MULTIVALUED.XML, STOP-1.TXT, SCHEMA12.XML, SCHEMA-TRIE.XML, SOLRCONFIG-MASTER2.XML, BAD-SCHEMA-ANALYZER-CLASS-AND-NESTED.XML, SOLRCONFIG-SNIPPET-PROCESSOR.XML, SOLRCONFIG-HIGHLIGHT.XML, SOLRCONFIG-NATIVELOCK.XML, PROTWORDS.TXT, SOLRCONFIG-PROPINJECT-INDEXDEFAULT.XML, COMPOUNDDICTIONARY.TXT, SOLRCONFIG-INDEXCONFIG.XML, SCHEMA-PHRASESUGGEST.XML, HUNSPELL-TEST.DIC, TRIVIAL.UPDATEPROCESSOR0.JS, SOLRCONFIG-CACHING.XML, SOLRCONFIG-UPDATE-PROCESSOR-CHAINS.XML, STOP-2.TXT, BAD-SCHEMA-UNIQUEKEY-USES-DEFAULT.XML, SCHEMA-LUCENEMATCHVERSION.XML, SOLRCONFIG-SLAVE.XML, ELEVATE.XML, SOLRCONFIG-SPELLCHECKCOMPONENT.XML, JASUGGEST.TXT, SOLRCONFIG-XINCLUDE.XML, SOLRCONFIG-DELPOLICY2.XML, SCHEMA-DFR.XML, BAD-SCHEMA-DUP-DYNAMICFIELD.XML, DA_COMPOUNDDICTIONARY.TXT, CONDITIONAL.UPDATEPROCESSOR.JS, SOLRCONFIG-DELPOLICY1.XML, SCHEMA-CHARFILTERS.XML, SOLRCONFIG_CODEC.XML, BAD-SCHEMA-NOT-INDEXED-BUT-POS.XML, SOLRCONFIG-RESPONSE-LOG-COMPONENT.XML, SCHEMA-NOT-REQUIRED-UNIQUE-KEY.XML, BAD-SCHEMA-CURRENCY-FT-MULTIVALUED.XML, SCHEMA-SNIPPET-FIELD.XML, SCHEMA-REPLICATION1.XML, BAD-SCHEMA-DUP-FIELD.XML, SCHEMA-BEHAVIOR.XML, SOLRCONFIG-SOLCOREPROPERTIES.XML, DA_UTF8.XML, SCHEMA-FOLDING.XML, SCHEMA-SIM.XML, PHRASESUGGEST.TXT, STOPTYPES-2.TXT, THROW.ERROR.ON.ADD.UPDATEPROCESSOR.JS, SCHEMA-SPATIAL.XML, BAD-SCHEMA-DUP-FIELDTYPE.XML, BAD-SCHEMA-NOT-INDEXED-BUT-NORMS.XML, SOLRCONFIG-ELEVATE.XML, SCHEMA-REQUIRED-FIELDS.XML, SOLRCONFIG-QUERYSENDER.XML, SOLRCONFIG-REPEATER.XML, SOLRCONFIG-REQHANDLER.INCL, SYNONYMS.TXT, XSLT, SOLRCONFIG-QUERYSENDER-NOQUERY.XML, TRIVIAL.UPDATEPROCESSOR1.JS, SOLRCONFIG-SPELLCHECKER.XML, OLD_SYNONYMS.TXT, HUNSPELL-TEST.AFF, BAD-SOLRCONFIG-BOGUS-SCRIPTENGINE-NAME.XML, SOLRCONFIG-MERGEPOLICY.XML, FUZZYSUGGEST.TXT, SOLRCONFIG-MASTER.XML, BAD-SOLRCONFIG-MISSING-SCRIPTFILE.XML, SOLRCONFIG-BASIC.XML, OPEN-EXCHANGE-RATES.JSON, SCHEMA-COPYFIELD-TEST.XML, BAD-SCHEMA-CURRENCY-DYNAMIC-MULTIVALUED.XML, SOLRCONFIG-MASTER1.XML, SCHEMA_CODEC.XML, REGEX-BOOST-PROCESSOR-TEST.TXT, SOLRCONFIG-ENABLEPLUGIN.XML, KEEP-2.TXT, KEEP-1.TXT, SCHEMA-TFIDF.XML, SCHEMA15.XML, SOLRCONFIG-PHRASESUGGEST.XML, SOLRCONFIG-TLOG.XML, SOLRCONFIG-LAZYWRITER.XML, SOLRCONFIG-ALTDIRECTORY.XML, BAD-SCHEMA-OMIT-TF-BUT-NOT-POS.XML, SCHEMA-REPLICATION2.XML, SCHEMA-REVERSED.XML, SCHEMA-SNIPPET-TYPE.XML, SOLRCONFIG-TRANSFORMERS.XML, SOLRCONFIG-NOCACHE.XML, SCHEMA-SPELLCHECKER.XML, BAD-SCHEMA-UNIQUEKEY-MULTIVALUED.XML, BAD-SOLRCONFIG-INVALID-SCRIPTFILE.XML, MISSLEADING.EXTENSION.UPDATEPROCESSOR.JS.TXT, BAD-SCHEMA-NOT-INDEXED-BUT-TF.XML, SCHEMA-XINCLUDE.XML, SOLRCONFIG-SIMPLELOCK.XML, BAD_SOLRCONFIG.XML, BAD-SCHEMA-CODEC-GLOBAL-VS-FT-MISMATCH.XML, STOP-SNOWBALL.TXT, SOLRCONFIG-SCRIPT-UPDATEPROCESSOR.XML, WDFTYPES.TXT, BAD-MP-SOLRCONFIG.XML, SOLRCONFIG-FUNCTIONQUERY.XML, SOLRCONFIG-PROPINJECT.XML, CURRENCY.XML]
[junit4:junit4]   2> 1284 T511 oasc.CachingDirectoryFactory.close Releasing directory:/mnt/ssd/jenkins/workspace/Lucene-Solr-trunk-Linux/solr/build/solr-core/test/J1/./solrtest-SoftAutoCommitTest-1359873394006
[junit4:junit4]   2> 1285 T511 oass.SolrIndexSearcher.<init> Opening Searcher@12e39ee main
[junit4:junit4]   2> 1285 T511 oasu.CommitTracker.<init> Hard AutoCommit: disabled
[junit4:junit4]   2> 1286 T511 oasu.CommitTracker.<init> Soft AutoCommit: disabled
[junit4:junit4]   2> 1286 T511 oashc.SpellCheckComponent.inform Initializing spell checkers
[junit4:junit4]   2> 1288 T511 oass.DirectSolrSpellChecker.init init: {name=direct,classname=DirectSolrSpellChecker,field=lowerfilt,minQueryLength=3}
[junit4:junit4]   2> 1298 T513 oasc.SolrCore.registerSearcher [collection1] Registered new searcher Searcher@12e39ee main{StandardDirectoryReader(segments_1:1)}
[junit4:junit4]   2> 1302 T511 oasc.CoreContainer.registerCore replacing core: collection1
[junit4:junit4]   2> 1303 T511 oasc.SolrCore.close [collection1]  CLOSING SolrCore org.apache.solr.core.SolrCore@1c86213
[junit4:junit4]   2> 1308 T511 oasu.DirectUpdateHandler2.close closing DirectUpdateHandler2{commits=0,autocommits=0,soft autocommits=0,optimizes=0,rollbacks=0,expungeDeletes=0,docsPending=0,adds=0,deletesById=0,deletesByQuery=0,errors=0,cumulative_adds=0,cumulative_deletesById=0,cumulative_deletesByQuery=0,cumulative_errors=0}
[junit4:junit4]   2> 1308 T511 oasc.SolrCore.closeSearcher [collection1] Closing main searcher on request.
[junit4:junit4]   2> 1309 T511 oasc.CachingDirectoryFactory.close Releasing directory:/mnt/ssd/jenkins/workspace/Lucene-Solr-trunk-Linux/solr/build/solr-core/test/J1/./solrtest-SoftAutoCommitTest-1359873394006/index
[junit4:junit4]   2> ASYNC  NEW_CORE C23 name=collection1 org.apache.solr.core.SolrCore@188c77
[junit4:junit4]   2> 1322 T511 C23 oasc.CachingDirectoryFactory.close Releasing directory:/mnt/ssd/jenkins/workspace/Lucene-Solr-trunk-Linux/solr/build/solr-core/test/J1/./solrtest-SoftAutoCommitTest-1359873394006
[junit4:junit4]   2> 1324 T511 C23 oasc.SolrDeletionPolicy.onInit SolrDeletionPolicy.onInit: commits:num=1
[junit4:junit4]   2> 		commit{dir=RateLimitedDirectoryWrapper(MockDirWrapper(org.apache.lucene.store.RAMDirectory@fc9ec0 lockFactory=org.apache.lucene.store.NativeFSLockFactory@125a0f8)),segFN=segments_1,generation=1,filenames=[segments_1]
[junit4:junit4]   2> 1324 T511 C23 oasc.SolrDeletionPolicy.updateCommits newest commit = 1[segments_1]
[junit4:junit4]   2> 1342 T511 C23 UPDATE [collection1] webapp=null path=null params={} {add=[529]} 0 20
[junit4:junit4]   2> 1352 T511 C23 oasu.DirectUpdateHandler2.commit start commit{,optimize=false,openSearcher=true,waitSearcher=true,expungeDeletes=false,softCommit=false}
[junit4:junit4]   2> 1358 T511 C23 oasc.SolrDeletionPolicy.onCommit SolrDeletionPolicy.onCommit: commits:num=2
[junit4:junit4]   2> 		commit{dir=RateLimitedDirectoryWrapper(MockDirWrapper(org.apache.lucene.store.RAMDirectory@fc9ec0 lockFactory=org.apache.lucene.store.NativeFSLockFactory@125a0f8)),segFN=segments_1,generation=1,filenames=[segments_1]
[junit4:junit4]   2> 		commit{dir=RateLimitedDirectoryWrapper(MockDirWrapper(org.apache.lucene.store.RAMDirectory@fc9ec0 lockFactory=org.apache.lucene.store.NativeFSLockFactory@125a0f8)),segFN=segments_2,generation=2,filenames=[_0.si, _0.fdt, _0_Pulsing41_0.pos, _0_nrm.cfs, _0_nrm.cfe, _0_MockFixedIntBlock_0.pos, _0_MockFixedIntBlock_0.skp, _0_NestedPulsing_0.pos, _0_Lucene41_0.tip, _0_MockFixedIntBlock_0.frq, _0_Pulsing41_0.tim, _0_Lucene41_0.doc, _0.fdx, segments_2, _0_NestedPulsing_0.doc, _0_MockFixedIntBlock_0.tii, _0_MockFixedIntBlock_0.tib, _0_NestedPulsing_0.tim, _0_Lucene41_0.tim, _0.fnm, _0_Lucene41_0.pos, _0_MockFixedIntBlock_0.pyl, _0_Pulsing41_0.tip, _0_MockFixedIntBlock_0.doc, _0_Pulsing41_0.doc, _0_NestedPulsing_0.tip]
[junit4:junit4]   2> 1358 T511 C23 oasc.SolrDeletionPolicy.updateCommits newest commit = 2[_0.si, _0.fdt, _0_Pulsing41_0.pos, _0_nrm.cfs, _0_nrm.cfe, _0_MockFixedIntBlock_0.pos, _0_MockFixedIntBlock_0.skp, _0_NestedPulsing_0.pos, _0_Lucene41_0.tip, _0_MockFixedIntBlock_0.frq, _0_Pulsing41_0.tim, _0_Lucene41_0.doc, _0.fdx, segments_2, _0_NestedPulsing_0.doc, _0_MockFixedIntBlock_0.tii, _0_MockFixedIntBlock_0.tib, _0_NestedPulsing_0.tim, _0_Lucene41_0.tim, _0.fnm, _0_Lucene41_0.pos, _0_MockFixedIntBlock_0.pyl, _0_Pulsing41_0.tip, _0_MockFixedIntBlock_0.doc, _0_Pulsing41_0.doc, _0_NestedPulsing_0.tip]
[junit4:junit4]   2> 1359 T511 C23 oasc.CachingDirectoryFactory.close Releasing directory:/mnt/ssd/jenkins/workspace/Lucene-Solr-trunk-Linux/solr/build/solr-core/test/J1/./solrtest-SoftAutoCommitTest-1359873394006
[junit4:junit4]   2> 1361 T511 C23 oass.SolrIndexSearcher.<init> Opening Searcher@173f71 main
[junit4:junit4]   2> 1363 T511 C23 oasu.DirectUpdateHandler2.commit end_commit_flush
[junit4:junit4]   2> 1364 T513 oasc.SolrCore.registerSearcher [collection1] Registered new searcher Searcher@173f71 main{StandardDirectoryReader(segments_2:3 _0(5.0):C1)}
[junit4:junit4]   2> 1365 T513 oasc.CachingDirectoryFactory.close Releasing directory:/mnt/ssd/jenkins/workspace/Lucene-Solr-trunk-Linux/solr/build/solr-core/test/J1/./solrtest-SoftAutoCommitTest-1359873394006/index
[junit4:junit4]   2> 1365 T511 C23 UPDATE [collection1] webapp=null path=null params={} {commit=} 0 14
[junit4:junit4]   2> 1372 T511 C23 UPDATE [collection1] webapp=null path=null params={} {delete=[529]} 0 0
[junit4:junit4]   2> 1873 T515 oasu.DirectUpdateHandler2.commit start commit{,optimize=false,openSearcher=true,waitSearcher=true,expungeDeletes=false,softCommit=true}
[junit4:junit4]   2> 1873 T515 oasc.CachingDirectoryFactory.close Releasing directory:/mnt/ssd/jenkins/workspace/Lucene-Solr-trunk-Linux/solr/build/solr-core/test/J1/./solrtest-SoftAutoCommitTest-1359873394006
[junit4:junit4]   2> 1975 T515 oass.SolrIndexSearcher.<init> Opening Searcher@30d1f3 main
[junit4:junit4]   2> 1976 T515 oasu.DirectUpdateHandler2.commit end_commit_flush
[junit4:junit4]   2> 1977 T513 oasc.SolrCore.registerSearcher [collection1] Registered new searcher Searcher@30d1f3 main{StandardDirectoryReader(segments_2:5:nrt)}
[junit4:junit4]   2> 1977 T513 oasc.CachingDirectoryFactory.close Releasing directory:/mnt/ssd/jenkins/workspace/Lucene-Solr-trunk-Linux/solr/build/solr-core/test/J1/./solrtest-SoftAutoCommitTest-1359873394006/index
[junit4:junit4]   2> 1980 T511 C23 UPDATE [collection1] webapp=null path=null params={} {add=[550]} 0 1
[junit4:junit4]   2> 2480 T515 oasu.DirectUpdateHandler2.commit start commit{,optimize=false,openSearcher=true,waitSearcher=true,expungeDeletes=false,softCommit=true}
[junit4:junit4]   2> 2481 T515 oasc.CachingDirectoryFactory.close Releasing directory:/mnt/ssd/jenkins/workspace/Lucene-Solr-trunk-Linux/solr/build/solr-core/test/J1/./solrtest-SoftAutoCommitTest-1359873394006
[junit4:junit4]   2> 2484 T515 oass.SolrIndexSearcher.<init> Opening Searcher@11c67b2 main
[junit4:junit4]   2> 2484 T515 oasu.DirectUpdateHandler2.commit end_commit_flush
[junit4:junit4]   2> 2485 T513 oasc.SolrCore.registerSearcher [collection1] Registered new searcher Searcher@11c67b2 main{StandardDirectoryReader(segments_2:7:nrt _1(5.0):C1)}
[junit4:junit4]   2> 2485 T513 oasc.CachingDirectoryFactory.close Releasing directory:/mnt/ssd/jenkins/workspace/Lucene-Solr-trunk-Linux/solr/build/solr-core/test/J1/./solrtest-SoftAutoCommitTest-1359873394006/index
[junit4:junit4]   2> 2573 T514 oasu.DirectUpdateHandler2.commit start commit{,optimize=false,openSearcher=true,waitSearcher=true,expungeDeletes=false,softCommit=false}
[junit4:junit4]   2> 2573 T514 oasc.SolrDeletionPolicy.onCommit SolrDeletionPolicy.onCommit: commits:num=2
[junit4:junit4]   2> 		commit{dir=RateLimitedDirectoryWrapper(MockDirWrapper(org.apache.lucene.store.RAMDirectory@fc9ec0 lockFactory=org.apache.lucene.store.NativeFSLockFactory@125a0f8)),segFN=segments_2,generation=2,filenames=[_0.si, _0.fdt, _0_Pulsing41_0.pos, _0_nrm.cfs, _0_nrm.cfe, _0_MockFixedIntBlock_0.pos, _0_MockFixedIntBlock_0.skp, _0_NestedPulsing_0.pos, _0_Lucene41_0.tip, _0_MockFixedIntBlock_0.frq, _0_Pulsing41_0.tim, _0_Lucene41_0.doc, _0.fdx, segments_2, _0_NestedPulsing_0.doc, _0_MockFixedIntBlock_0.tii, _0_MockFixedIntBlock_0.tib, _0_NestedPulsing_0.tim, _0_Lucene41_0.tim, _0.fnm, _0_Lucene41_0.pos, _0_MockFixedIntBlock_0.pyl, _0_Pulsing41_0.tip, _0_MockFixedIntBlock_0.doc, _0_Pulsing41_0.doc, _0_NestedPulsing_0.tip]
[junit4:junit4]   2> 		commit{dir=RateLimitedDirectoryWrapper(MockDirWrapper(org.apache.lucene.store.RAMDirectory@fc9ec0 lockFactory=org.apache.lucene.store.NativeFSLockFactory@125a0f8)),segFN=segments_3,generation=3,filenames=[_1_Lucene41_0.tim, segments_3, _1_nrm.cfe, _1_Lucene41_0.pos, _1_MockFixedIntBlock_0.pyl, _1_NestedPulsing_0.doc, _1.fdt, _1_Pulsing41_0.tim, _1.si, _1_Pulsing41_0.doc, _1_Pulsing41_0.pos, _1_MockFixedIntBlock_0.skp, _1_MockFixedIntBlock_0.tii, _1_NestedPulsing_0.tip, _1_Lucene41_0.doc, _1_Pulsing41_0.tip, _1_MockFixedIntBlock_0.frq, _1_NestedPulsing_0.pos, _1_NestedPulsing_0.tim, _1_Lucene41_0.tip, _1_MockFixedIntBlock_0.doc, _1.fnm, _1_MockFixedIntBlock_0.pos, _1_nrm.cfs, _1.fdx, _1_MockFixedIntBlock_0.tib]
[junit4:junit4]   2> 2574 T514 oasc.SolrDeletionPolicy.updateCommits newest commit = 3[_1_Lucene41_0.tim, segments_3, _1_nrm.cfe, _1_Lucene41_0.pos, _1_MockFixedIntBlock_0.pyl, _1_NestedPulsing_0.doc, _1.fdt, _1_Pulsing41_0.tim, _1.si, _1_Pulsing41_0.doc, _1_Pulsing41_0.pos, _1_MockFixedIntBlock_0.skp, _1_MockFixedIntBlock_0.tii, _1_NestedPulsing_0.tip, _1_Lucene41_0.doc, _1_Pulsing41_0.tip, _1_MockFixedIntBlock_0.frq, _1_NestedPulsing_0.pos, _1_NestedPulsing_0.tim, _1_Lucene41_0.tip, _1_MockFixedIntBlock_0.doc, _1.fnm, _1_MockFixedIntBlock_0.pos, _1_nrm.cfs, _1.fdx, _1_MockFixedIntBlock_0.tib]
[junit4:junit4]   2> 2574 T514 oasc.CachingDirectoryFactory.close Releasing directory:/mnt/ssd/jenkins/workspace/Lucene-Solr-trunk-Linux/solr/build/solr-core/test/J1/./solrtest-SoftAutoCommitTest-1359873394006
[junit4:junit4]   2> 2574 T514 oass.SolrIndexSearcher.<init> Opening Searcher@75dd6d main
[junit4:junit4]   2> 2574 T511 oas.SolrTestCaseJ4.tearDown ###Ending testSoftAndHardCommitMaxTimeDelete
[junit4:junit4]   2> 2574 T514 oasu.DirectUpdateHandler2.commit end_commit_flush
[junit4:junit4]   2> 2575 T513 oasc.SolrCore.registerSearcher [collection1] Registered new searcher Searcher@75dd6d main{StandardDirectoryReader(segments_2:7:nrt _1(5.0):C1)}
[junit4:junit4]   2> 2575 T513 oasc.CachingDirectoryFactory.close Releasing directory:/mnt/ssd/jenkins/workspace/Lucene-Solr-trunk-Linux/solr/build/solr-core/test/J1/./solrtest-SoftAutoCommitTest-1359873394006/index
[junit4:junit4]   2> NOTE: reproduce with: ant test  -Dtestcase=SoftAutoCommitTest -Dtests.method=testSoftAndHardCommitMaxTimeDelete -Dtests.seed=3274EBF10CFFF667 -Dtests.multiplier=3 -Dtests.slow=true -Dtests.locale=de_CH -Dtests.timezone=America/Argentina/Ushuaia -Dtests.file.encoding=UTF-8
[junit4:junit4] FAILURE 1.94s J1 | SoftAutoCommitTest.testSoftAndHardCommitMaxTimeDelete <<<
[junit4:junit4]    > Throwable #1: java.lang.AssertionError: searcher529 wasn't soon enough after soft529: 1359873395981 !< 1359873395878 + 100 (fudge)
[junit4:junit4]    > 	at __randomizedtesting.SeedInfo.seed([3274EBF10CFFF667:F538536C17573BD7]:0)
[junit4:junit4]    > 	at org.junit.Assert.fail(Assert.java:93)
[junit4:junit4]    > 	at org.junit.Assert.assertTrue(Assert.java:43)
[junit4:junit4]    > 	at org.apache.solr.update.SoftAutoCommitTest.testSoftAndHardCommitMaxTimeDelete(SoftAutoCommitTest.java:265)
[junit4:junit4]    > 	at sun.reflect.NativeMethodAccessorImpl.invoke0(Native Method)
[junit4:junit4]    > 	at sun.reflect.NativeMethodAccessorImpl.invoke(NativeMethodAccessorImpl.java:57)
[junit4:junit4]    > 	at sun.reflect.DelegatingMethodAccessorImpl.invoke(DelegatingMethodAccessorImpl.java:43)
[junit4:junit4]    > 	at java.lang.reflect.Method.invoke(Method.java:474)
[junit4:junit4]    > 	at com.carrotsearch.randomizedtesting.RandomizedRunner.invoke(RandomizedRunner.java:1559)
[junit4:junit4]    > 	at com.carrotsearch.randomizedtesting.RandomizedRunner.access$600(RandomizedRunner.java:79)
[junit4:junit4]    > 	at com.carrotsearch.randomizedtesting.RandomizedRunner$6.evaluate(RandomizedRunner.java:737)
[junit4:junit4]    > 	at com.carrotsearch.randomizedtesting.RandomizedRunner$7.evaluate(RandomizedRunner.java:773)
[junit4:junit4]    > 	at com.carrotsearch.randomizedtesting.RandomizedRunner$8.evaluate(RandomizedRunner.java:787)
[junit4:junit4]    > 	at com.carrotsearch.randomizedtesting.rules.SystemPropertiesRestoreRule$1.evaluate(SystemPropertiesRestoreRule.java:53)
[junit4:junit4]    > 	at org.apache.lucene.util.TestRuleSetupTeardownChained$1.evaluate(TestRuleSetupTeardownChained.java:50)
[junit4:junit4]    > 	at org.apache.lucene.util.TestRuleFieldCacheSanity$1.evaluate(TestRuleFieldCacheSanity.java:51)
[junit4:junit4]    > 	at org.apache.lucene.util.AbstractBeforeAfterRule$1.evaluate(AbstractBeforeAfterRule.java:46)
[junit4:junit4]    > 	at com.carrotsearch.randomizedtesting.rules.SystemPropertiesInvariantRule$1.evaluate(SystemPropertiesInvariantRule.java:55)
[junit4:junit4]    > 	at org.apache.lucene.util.TestRuleThreadAndTestName$1.evaluate(TestRuleThreadAndTestName.java:49)
[junit4:junit4]    > 	at org.apache.lucene.util.TestRuleIgnoreAfterMaxFailures$1.evaluate(TestRuleIgnoreAfterMaxFailures.java:70)
[junit4:junit4]    > 	at org.apache.lucene.util.TestRuleMarkFailure$1.evaluate(TestRuleMarkFailure.java:48)
[junit4:junit4]    > 	at com.carrotsearch.randomizedtesting.rules.StatementAdapter.evaluate(StatementAdapter.java:36)
[junit4:junit4]    > 	at com.carrotsearch.randomizedtesting.ThreadLeakControl$StatementRunner.run(ThreadLeakControl.java:358)
[junit4:junit4]    > 	at com.carrotsearch.randomizedtesting.ThreadLeakControl.forkTimeoutingTask(ThreadLeakControl.java:782)
[junit4:junit4]    > 	at com.carrotsearch.randomizedtesting.ThreadLeakControl$3.evaluate(ThreadLeakControl.java:442)
[junit4:junit4]    > 	at com.carrotsearch.randomizedtesting.RandomizedRunner.runSingleTest(RandomizedRunner.java:746)
[junit4:junit4]    > 	at com.carrotsearch.randomizedtesting.RandomizedRunner$3.evaluate(RandomizedRunner.java:648)
[junit4:junit4]    > 	at com.carrotsearch.randomizedtesting.RandomizedRunner$4.evaluate(RandomizedRunner.java:682)
[junit4:junit4]    > 	at com.carrotsearch.randomizedtesting.RandomizedRunner$5.evaluate(RandomizedRunner.java:693)
[junit4:junit4]    > 	at com.carrotsearch.randomizedtesting.rules.StatementAdapter.evaluate(StatementAdapter.java:36)
[junit4:junit4]    > 	at com.carrotsearch.randomizedtesting.rules.SystemPropertiesRestoreRule$1.evaluate(SystemPropertiesRestoreRule.java:53)
[junit4:junit4]    > 	at org.apache.lucene.util.AbstractBeforeAfterRule$1.evaluate(AbstractBeforeAfterRule.java:46)
[junit4:junit4]    > 	at org.apache.lucene.util.TestRuleStoreClassName$1.evaluate(TestRuleStoreClassName.java:42)
[junit4:junit4]    > 	at com.carrotsearch.randomizedtesting.rules.SystemPropertiesInvariantRule$1.evaluate(SystemPropertiesInvariantRule.java:55)
[junit4:junit4]    > 	at com.carrotsearch.randomizedtesting.rules.NoShadowingOrOverridesOnMethodsRule$1.evaluate(NoShadowingOrOverridesOnMethodsRule.java:39)
[junit4:junit4]    > 	at com.carrotsearch.randomizedtesting.rules.NoShadowingOrOverridesOnMethodsRule$1.evaluate(NoShadowingOrOverridesOnMethodsRule.java:39)
[junit4:junit4]    > 	at com.carrotsearch.randomizedtesting.rules.StatementAdapter.evaluate(StatementAdapter.java:36)
[junit4:junit4]    > 	at org.apache.lucene.util.TestRuleAssertionsRequired$1.evaluate(TestRuleAssertionsRequired.java:43)
[junit4:junit4]    > 	at org.apache.lucene.util.TestRuleMarkFailure$1.evaluate(TestRuleMarkFailure.java:48)
[junit4:junit4]    > 	at org.apache.lucene.util.TestRuleIgnoreAfterMaxFailures$1.evaluate(TestRuleIgnoreAfterMaxFailures.java:70)
[junit4:junit4]    > 	at org.apache.lucene.util.TestRuleIgnoreTestSuites$1.evaluate(TestRuleIgnoreTestSuites.java:55)
[junit4:junit4]    > 	at com.carrotsearch.randomizedtesting.rules.StatementAdapter.evaluate(StatementAdapter.java:36)
[junit4:junit4]    > 	at com.carrotsearch.randomizedtesting.ThreadLeakControl$StatementRunner.run(ThreadLeakControl.java:358)
[junit4:junit4]    > 	at java.lang.Thread.run(Thread.java:722)
[junit4:junit4]   2> 2617 T511 oas.SolrTestCaseJ4.setUp ###Starting testSoftAndHardCommitMaxTimeRapidAdds
[junit4:junit4]   2> 2618 T511 oasc.CoreContainer.reload Reloading SolrCore 'collection1' using instanceDir: /mnt/ssd/jenkins/workspace/Lucene-Solr-trunk-Linux/solr/build/solr-core/test-files/solr/collection1
[junit4:junit4]   2> 2618 T511 oasc.SolrResourceLoader.<init> new SolrResourceLoader for directory: '/mnt/ssd/jenkins/workspace/Lucene-Solr-trunk-Linux/solr/build/solr-core/test-files/solr/collection1/'
[junit4:junit4]   2> 2618 T511 oasc.SolrResourceLoader.replaceClassLoader Adding 'file:/mnt/ssd/jenkins/workspace/Lucene-Solr-trunk-Linux/solr/build/solr-core/test-files/solr/collection1/lib/README' to classloader
[junit4:junit4]   2> 2624 T511 oasc.SolrResourceLoader.replaceClassLoader Adding 'file:/mnt/ssd/jenkins/workspace/Lucene-Solr-trunk-Linux/solr/build/solr-core/test-files/solr/collection1/lib/classes/' to classloader
[junit4:junit4]   2> 2655 T511 oasc.SolrConfig.<init> Using Lucene MatchVersion: LUCENE_50
[junit4:junit4]   2> 2707 T511 oasc.SolrConfig.<init> Loaded SolrConfig: solrconfig.xml
[junit4:junit4]   2> 2708 T511 oass.IndexSchema.readSchema Reading Solr Schema
[junit4:junit4]   2> 2721 T511 oass.IndexSchema.readSchema Schema name=test
[junit4:junit4]   2> 3119 T511 oass.OpenExchangeRatesOrgProvider.init Initialized with rates=open-exchange-rates.json, refreshInterval=1440.
[junit4:junit4]   2> 3125 T511 oass.IndexSchema.readSchema default search field in schema is text
[junit4:junit4]   2> 3127 T511 oass.IndexSchema.readSchema unique key field: id
[junit4:junit4]   2> 3133 T511 oass.FileExchangeRateProvider.reload Reloading exchange rates from file currency.xml
[junit4:junit4]   2> 3136 T511 oass.FileExchangeRateProvider.reload Reloading exchange rates from file currency.xml
[junit4:junit4]   2> 3142 T511 oass.OpenExchangeRatesOrgProvider.reload Reloading exchange rates from open-exchange-rates.json
[junit4:junit4]   2> 3144 T511 oass.OpenExchangeRatesOrgProvider.reload Reloading exchange rates from open-exchange-rates.json
[junit4:junit4]   2> 3145 T511 oasc.SolrCore.<init> [collection1] Opening new SolrCore at /mnt/ssd/jenkins/workspace/Lucene-Solr-trunk-Linux/solr/build/solr-core/test-files/solr/collection1/, dataDir=/mnt/ssd/jenkins/workspace/Lucene-Solr-trunk-Linux/solr/build/solr-core/test/J1/./solrtest-SoftAutoCommitTest-1359873394006/
[junit4:junit4]   2> 3146 T511 oasc.JmxMonitoredMap.<init> JMX monitoring is enabled. Adding Solr mbeans to JMX Server: com.sun.jmx.mbeanserver.JmxMBeanServer@20ac02
[junit4:junit4]   2> 3146 T511 oasc.CachingDirectoryFactory.close Releasing directory:/mnt/ssd/jenkins/workspace/Lucene-Solr-trunk-Linux/solr/build/solr-core/test/J1/./solrtest-SoftAutoCommitTest-1359873394006
[junit4:junit4]   2> 3147 T511 oasc.SolrCore.getNewIndexDir New index directory detected: old=null new=/mnt/ssd/jenkins/workspace/Lucene-Solr-trunk-Linux/solr/build/solr-core/test/J1/./solrtest-SoftAutoCommitTest-1359873394006/index/
[junit4:junit4]   2> 3147 T511 oasc.SolrCore.initWriters created xml: solr.XMLResponseWriter
[junit4:junit4]   2> 3149 T511 oasup.UpdateRequestProcessorChain.init inserting DistributedUpdateProcessorFactory into updateRequestProcessorChain "dedupe"
[junit4:junit4]   2> 3149 T511 oasup.UpdateRequestProcessorChain.init inserting DistributedUpdateProcessorFactory into updateRequestProcessorChain "dedupe-allfields"
[junit4:junit4]   2> 3150 T511 oasup.UpdateRequestProcessorChain.init inserting DistributedUpdateProcessorFactory into updateRequestProcessorChain "stored_sig"
[junit4:junit4]   2> 3150 T511 oasup.UpdateRequestProcessorChain.init inserting DistributedUpdateProcessorFactory into updateRequestProcessorChain "uniq-fields"
[junit4:junit4]   2> 3151 T511 oasup.UpdateRequestProcessorChain.init inserting DistributedUpdateProcessorFactory into updateRequestProcessorChain "distrib-dup-test-chain-implicit"
[junit4:junit4]   2> 3151 T511 oasc.RequestHandlers.initHandlersFromConfig adding lazy requestHandler: solr.ReplicationHandler
[junit4:junit4]   2> 3152 T511 oasc.RequestHandlers.initHandlersFromConfig created /replication: solr.ReplicationHandler
[junit4:junit4]   2> 3152 T511 oasc.RequestHandlers.initHandlersFromConfig created standard: solr.StandardRequestHandler
[junit4:junit4]   2> 3152 T511 oasc.RequestHandlers.initHandlersFromConfig created /get: solr.RealTimeGetHandler
[junit4:junit4]   2> 3153 T511 oasc.RequestHandlers.initHandlersFromConfig created dismax: solr.SearchHandler
[junit4:junit4]   2> 3153 T511 oasc.RequestHandlers.initHandlersFromConfig created mock: org.apache.solr.core.MockQuerySenderListenerReqHandler
[junit4:junit4]   2> 3154 T511 oasc.RequestHandlers.initHandlersFromConfig created /admin/: org.apache.solr.handler.admin.AdminHandlers
[junit4:junit4]   2> 3154 T511 oasc.RequestHandlers.initHandlersFromConfig created defaults: solr.StandardRequestHandler
[junit4:junit4]   2> 3154 T511 oasc.RequestHandlers.initHandlersFromConfig adding lazy requestHandler: solr.StandardRequestHandler
[junit4:junit4]   2> 3154 T511 oasc.RequestHandlers.initHandlersFromConfig created lazy: solr.StandardRequestHandler
[junit4:junit4]   2> 3155 T511 oasc.RequestHandlers.initHandlersFromConfig created /update: solr.UpdateRequestHandler
[junit4:junit4]   2> 3155 T511 oasc.RequestHandlers.initHandlersFromConfig created /terms: org.apache.solr.handler.component.SearchHandler
[junit4:junit4]   2> 3156 T511 oasc.RequestHandlers.initHandlersFromConfig created spellCheckCompRH: org.apache.solr.handler.component.SearchHandler
[junit4:junit4]   2> 3156 T511 oasc.RequestHandlers.initHandlersFromConfig created spellCheckCompRH_Direct: org.apache.solr.handler.component.SearchHandler
[junit4:junit4]   2> 3156 T511 oasc.RequestHandlers.initHandlersFromConfig created spellCheckWithWordbreak: org.apache.solr.handler.component.SearchHandler
[junit4:junit4]   2> 3157 T511 oasc.RequestHandlers.initHandlersFromConfig created spellCheckWithWordbreak_Direct: org.apache.solr.handler.component.SearchHandler
[junit4:junit4]   2> 3157 T511 oasc.RequestHandlers.initHandlersFromConfig created spellCheckCompRH1: org.apache.solr.handler.component.SearchHandler
[junit4:junit4]   2> 3157 T511 oasc.RequestHandlers.initHandlersFromConfig created mltrh: org.apache.solr.handler.component.SearchHandler
[junit4:junit4]   2> 3158 T511 oasc.RequestHandlers.initHandlersFromConfig created tvrh: org.apache.solr.handler.component.SearchHandler
[junit4:junit4]   2> 3158 T511 oasc.RequestHandlers.initHandlersFromConfig created /mlt: solr.MoreLikeThisHandler
[junit4:junit4]   2> 3158 T511 oasc.RequestHandlers.initHandlersFromConfig created /debug/dump: solr.DumpRequestHandler
[junit4:junit4]   2> 3161 T511 oashl.XMLLoader.init xsltCacheLifetimeSeconds=60
[junit4:junit4]   2> 3162 T511 oasc.SolrCore.initDeprecatedSupport WARNING solrconfig.xml uses deprecated <admin/gettableFiles>, Please update your config to use the ShowFileRequestHandler.
[junit4:junit4]   2> 3163 T511 oasc.SolrCore.initDeprecatedSupport WARNING adding ShowFileRequestHandler with hidden files: [STEMDICT.TXT, SCHEMA-MINIMAL.XML, SOLRCONFIG-POSTINGSHIGHLIGHT.XML, SCHEMA-COLLATE.XML, SCHEMA-BINARYFIELD.XML, SOLRCONFIG-MASTER3.XML, BAD-SCHEMA-EXTERNAL-FILEFIELD.XML, MAPPING-ISOLATIN1ACCENT.TXT, SCHEMA-EFF.XML, STOPWORDSWRONGENCODING.TXT, SCHEMA-NUMERIC.XML, BAD-SCHEMA-NONTEXT-ANALYZER.XML, SOLRCONFIG-SLAVE1.XML, STOPTYPES-1.TXT, SOLRCONFIG-COMPONENTS-NAME.XML, SCHEMA-STOP-KEEP.XML, MISSING.FUNCTIONS.UPDATEPROCESSOR.JS, BAD-SCHEMA-SIM-GLOBAL-VS-FT-MISMATCH.XML, ADDFIELDS.UPDATEPROCESSOR.JS, SCHEMA-IB.XML, STOPWITHBOM.TXT, SCHEMA.XML, SOLRCONFIG_PERF.XML, SOLRCONFIG-MASTER1-KEEPONEBACKUP.XML, SCHEMA-BM25.XML, SOLRCONFIG-TERMINDEX.XML, SOLRCONFIG-SOLR-749.XML, SCHEMA-LMDIRICHLET.XML, SCHEMASURROUND.XML, FRENCHARTICLES.TXT, SCHEMA-SYNONYM-TOKENIZER.XML, HYPHENATION.DTD, STOPWORDS.TXT, SCHEMA-LMJELINEKMERCER.XML, BAD-SCHEMA-UNIQUEKEY-IS-COPYFIELD-DEST.XML, SCHEMA-POSTINGSHIGHLIGHT.XML, SCHEMA11.XML, BAD-SCHEMA-CURRENCY-MULTIVALUED.XML, STOP-1.TXT, SCHEMA12.XML, SCHEMA-TRIE.XML, SOLRCONFIG-MASTER2.XML, BAD-SCHEMA-ANALYZER-CLASS-AND-NESTED.XML, SOLRCONFIG-SNIPPET-PROCESSOR.XML, SOLRCONFIG-HIGHLIGHT.XML, SOLRCONFIG-NATIVELOCK.XML, PROTWORDS.TXT, SOLRCONFIG-PROPINJECT-INDEXDEFAULT.XML, COMPOUNDDICTIONARY.TXT, SOLRCONFIG-INDEXCONFIG.XML, SCHEMA-PHRASESUGGEST.XML, HUNSPELL-TEST.DIC, TRIVIAL.UPDATEPROCESSOR0.JS, SOLRCONFIG-CACHING.XML, SOLRCONFIG-UPDATE-PROCESSOR-CHAINS.XML, STOP-2.TXT, BAD-SCHEMA-UNIQUEKEY-USES-DEFAULT.XML, SCHEMA-LUCENEMATCHVERSION.XML, SOLRCONFIG-SLAVE.XML, ELEVATE.XML, SOLRCONFIG-SPELLCHECKCOMPONENT.XML, JASUGGEST.TXT, SOLRCONFIG-XINCLUDE.XML, SOLRCONFIG-DELPOLICY2.XML, SCHEMA-DFR.XML, BAD-SCHEMA-DUP-DYNAMICFIELD.XML, DA_COMPOUNDDICTIONARY.TXT, CONDITIONAL.UPDATEPROCESSOR.JS, SOLRCONFIG-DELPOLICY1.XML, SCHEMA-CHARFILTERS.XML, SOLRCONFIG_CODEC.XML, BAD-SCHEMA-NOT-INDEXED-BUT-POS.XML, SOLRCONFIG-RESPONSE-LOG-COMPONENT.XML, SCHEMA-NOT-REQUIRED-UNIQUE-KEY.XML, BAD-SCHEMA-CURRENCY-FT-MULTIVALUED.XML, SCHEMA-SNIPPET-FIELD.XML, SCHEMA-REPLICATION1.XML, BAD-SCHEMA-DUP-FIELD.XML, SCHEMA-BEHAVIOR.XML, SOLRCONFIG-SOLCOREPROPERTIES.XML, DA_UTF8.XML, SCHEMA-FOLDING.XML, SCHEMA-SIM.XML, PHRASESUGGEST.TXT, STOPTYPES-2.TXT, THROW.ERROR.ON.ADD.UPDATEPROCESSOR.JS, SCHEMA-SPATIAL.XML, BAD-SCHEMA-DUP-FIELDTYPE.XML, BAD-SCHEMA-NOT-INDEXED-BUT-NORMS.XML, SOLRCONFIG-ELEVATE.XML, SCHEMA-REQUIRED-FIELDS.XML, SOLRCONFIG-QUERYSENDER.XML, SOLRCONFIG-REPEATER.XML, SOLRCONFIG-REQHANDLER.INCL, SYNONYMS.TXT, XSLT, SOLRCONFIG-QUERYSENDER-NOQUERY.XML, TRIVIAL.UPDATEPROCESSOR1.JS, SOLRCONFIG-SPELLCHECKER.XML, OLD_SYNONYMS.TXT, HUNSPELL-TEST.AFF, BAD-SOLRCONFIG-BOGUS-SCRIPTENGINE-NAME.XML, SOLRCONFIG-MERGEPOLICY.XML, FUZZYSUGGEST.TXT, SOLRCONFIG-MASTER.XML, BAD-SOLRCONFIG-MISSING-SCRIPTFILE.XML, SOLRCONFIG-BASIC.XML, OPEN-EXCHANGE-RATES.JSON, SCHEMA-COPYFIELD-TEST.XML, BAD-SCHEMA-CURRENCY-DYNAMIC-MULTIVALUED.XML, SOLRCONFIG-MASTER1.XML, SCHEMA_CODEC.XML, REGEX-BOOST-PROCESSOR-TEST.TXT, SOLRCONFIG-ENABLEPLUGIN.XML, KEEP-2.TXT, KEEP-1.TXT, SCHEMA-TFIDF.XML, SCHEMA15.XML, SOLRCONFIG-PHRASESUGGEST.XML, SOLRCONFIG-TLOG.XML, SOLRCONFIG-LAZYWRITER.XML, SOLRCONFIG-ALTDIRECTORY.XML, BAD-SCHEMA-OMIT-TF-BUT-NOT-POS.XML, SCHEMA-REPLICATION2.XML, SCHEMA-REVERSED.XML, SCHEMA-SNIPPET-TYPE.XML, SOLRCONFIG-TRANSFORMERS.XML, SOLRCONFIG-NOCACHE.XML, SCHEMA-SPELLCHECKER.XML, BAD-SCHEMA-UNIQUEKEY-MULTIVALUED.XML, BAD-SOLRCONFIG-INVALID-SCRIPTFILE.XML, MISSLEADING.EXTENSION.UPDATEPROCESSOR.JS.TXT, BAD-SCHEMA-NOT-INDEXED-BUT-TF.XML, SCHEMA-XINCLUDE.XML, SOLRCONFIG-SIMPLELOCK.XML, BAD_SOLRCONFIG.XML, BAD-SCHEMA-CODEC-GLOBAL-VS-FT-MISMATCH.XML, STOP-SNOWBALL.TXT, SOLRCONFIG-SCRIPT-UPDATEPROCESSOR.XML, WDFTYPES.TXT, BAD-MP-SOLRCONFIG.XML, SOLRCONFIG-FUNCTIONQUERY.XML, SOLRCONFIG-PROPINJECT.XML, CURRENCY.XML]
[junit4:junit4]   2> 3165 T511 oasc.CachingDirectoryFactory.close Releasing directory:/mnt/ssd/jenkins/workspace/Lucene-Solr-trunk-Linux/solr/build/solr-core/test/J1/./solrtest-SoftAutoCommitTest-1359873394006
[junit4:junit4]   2> 3165 T511 oass.SolrIndexSearcher.<init> Opening Searcher@1ae80bd main
[junit4:junit4]   2> 3166 T511 oasu.CommitTracker.<init> Hard AutoCommit: disabled
[junit4:junit4]   2> 3166 T511 oasu.CommitTracker.<init> Soft AutoCommit: disabled
[junit4:junit4]   2> 3167 T511 oashc.SpellCheckComponent.inform Initializing spell checkers
[junit4:junit4]   2> 3167 T511 oass.DirectSolrSpellChecker.init init: {name=direct,classname=DirectSolrSpellChecker,field=lowerfilt,minQueryLength=3}
[junit4:junit4]   2> 3174 T516 oasc.SolrCore.registerSearcher [collection1] Registered new searcher Searcher@1ae80bd main{StandardDirectoryReader(segments_3:7:nrt _1(5.0):C1)}
[junit4:junit4]   2> 3180 T511 oasc.CoreContainer.registerCore replacing core: collection1
[junit4:junit4]   2> 3180 T511 oasc.SolrCore.close [collection1]  CLOSING SolrCore org.apache.solr.core.SolrCore@188c77
[junit4:junit4]   2> 3185 T511 oasu.DirectUpdateHandler2.close closing DirectUpdateHandler2{commits=4,autocommit maxTime=1200ms,autocommits=1,soft autocommit maxTime=500ms,soft autocommits=2,optimizes=0,rollbacks=0,expungeDeletes=0,docsPending=0,adds=0,deletesById=0,deletesByQuery=0,errors=0,cumulative_adds=2,cumulative_deletesById=1,cumulative_deletesByQuery=0,cumulative_errors=0}
[junit4:junit4]   2> 3186 T511 oasc.SolrCore.closeSearcher [collection1] Closing main searcher on request.
[junit4:junit4]   2> 3186 T511 oasc.CachingDirectoryFactory.close Releasing directory:/mnt/ssd/jenkins/workspace/Lucene-Solr-trunk-Linux/solr/build/solr-core/test/J1/./solrtest-SoftAutoCommitTest-1359873394006/index
[junit4:junit4]   2> ASYNC  NEW_CORE C24 name=collection1 org.apache.solr.core.SolrCore@4d9ac0
[junit4:junit4]   2> 3200 T511 C24 UPDATE [collection1] webapp=null path=null params={} {add=[5000]} 0 4
[junit4:junit4]   2> 3204 T511 C24 UPDATE [collection1] webapp=null path=null params={} {add=[5001]} 0 0
[junit4:junit4]   2> 3211 T511 C24 UPDATE [collection1] webapp=null path=null params={} {add=[5002]} 0 1
[junit4:junit4]   2> 3215 T511 C24 UPDATE [collection1] webapp=null path=null params={} {add=[5003]} 0 0
[junit4:junit4]   2> 3220 T511 C24 UPDATE [collection1] webapp=null path=null params={} {add=[5004]} 0 0
[junit4:junit4]   2> 3221 T511 oas.SolrTestCaseJ4.tearDown ###Ending testSoftAndHardCommitMaxTimeRapidAdds
[junit4:junit4]   2> 3225 T511 oas.SolrTestCaseJ4.setUp ###Starting testSoftAndHardCommitMaxTimeMixedAdds
[junit4:junit4]   2> 3226 T511 oasc.CoreContainer.reload Reloading SolrCore 'collection1' using instanceDir: /mnt/ssd/jenkins/workspace/Lucene-Solr-trunk-Linux/solr/build/solr-core/test-files/solr/collection1
[junit4:junit4]   2> 3226 T511 oasc.SolrResourceLoader.<init> new SolrResourceLoader for directory: '/mnt/ssd/jenkins/workspace/Lucene-Solr-trunk-Linux/solr/build/solr-core/test-files/solr/collection1/'
[junit4:junit4]   2> 3226 T511 oasc.SolrResourceLoader.replaceClassLoader Adding 'file:/mnt/ssd/jenkins/workspace/Lucene-Solr-trunk-Linux/solr/build/solr-core/test-files/solr/collection1/lib/README' to classloader
[junit4:junit4]   2> 3227 T511 oasc.SolrResourceLoader.replaceClassLoader Adding 'file:/mnt/ssd/jenkins/workspace/Lucene-Solr-trunk-Linux/solr/build/solr-core/test-files/solr/collection1/lib/classes/' to classloader
[junit4:junit4]   2> 3256 T511 oasc.SolrConfig.<init> Using Lucene MatchVersion: LUCENE_50
[junit4:junit4]   2> 3300 T511 oasc.SolrConfig.<init> Loaded SolrConfig: solrconfig.xml
[junit4:junit4]   2> 3301 T511 oass.IndexSchema.readSchema Reading Solr Schema
[junit4:junit4]   2> 3304 T511 oass.IndexSchema.readSchema Schema name=test
[junit4:junit4]   2> 3700 T518 oasu.DirectUpdateHandler2.commit start commit{,optimize=false,openSearcher=true,waitSearcher=true,expungeDeletes=false,softCommit=true}
[junit4:junit4]   2> 3700 T518 oasc.CachingDirectoryFactory.close Releasing directory:/mnt/ssd/jenkins/workspace/Lucene-Solr-trunk-Linux/solr/build/solr-core/test/J1/./solrtest-SoftAutoCommitTest-1359873394006
[junit4:junit4]   2> 3705 T518 oass.SolrIndexSearcher.<init> Opening Searcher@1ec7f18 main
[junit4:junit4]   2> 3706 T516 oasc.SolrCore.registerSearcher [collection1] Registered new searcher Searcher@1ec7f18 main{StandardDirectoryReader(segments_3:9:nrt _1(5.0):C1 _2(5.0):C5)}
[junit4:junit4]   2> 3706 T518 oasu.DirectUpdateHandler2.commit end_commit_flush
[junit4:junit4]   2> 3706 T516 oasc.CachingDirectoryFactory.close Releasing directory:/mnt/ssd/jenkins/workspace/Lucene-Solr-trunk-Linux/solr/build/solr-core/test/J1/./solrtest-SoftAutoCommitTest-1359873394006/index
[junit4:junit4]   2> 3720 T511 oass.OpenExchangeRatesOrgProvider.init Initialized with rates=open-exchange-rates.json, refreshInterval=1440.
[junit4:junit4]   2> 3728 T511 oass.IndexSchema.readSchema default search field in schema is text
[junit4:junit4]   2> 3745 T511 oass.IndexSchema.readSchema unique key field: id
[junit4:junit4]   2> 3749 T511 oass.FileExchangeRateProvider.reload Reloading exchange rates from file currency.xml
[junit4:junit4]   2> 3752 T511 oass.FileExchangeRateProvider.reload Reloading exchange rates from file currency.xml
[junit4:junit4]   2> 3754 T511 oass.OpenExchangeRatesOrgProvider.reload Reloading exchange rates from open-exchange-rates.json
[junit4:junit4]   2> 3755 T511 oass.OpenExchangeRatesOrgProvider.reload Reloading exchange rates from open-exchange-rates.json
[junit4:junit4]   2> 3755 T511 oasc.SolrCore.<init> [collection1] Opening new SolrCore at /mnt/ssd/jenkins/workspace/Lucene-Solr-trunk-Linux/solr/build/solr-core/test-files/solr/collection1/, dataDir=/mnt/ssd/jenkins/workspace/Lucene-Solr-trunk-Linux/solr/build/solr-core/test/J1/./solrtest-SoftAutoCommitTest-1359873394006/
[junit4:junit4]   2> 3756 T511 oasc.JmxMonitoredMap.<init> JMX monitoring is enabled. Adding Solr mbeans to JMX Server: com.sun.jmx.mbeanserver.JmxMBeanServer@20ac02
[junit4:junit4]   2> 3756 T511 oasc.CachingDirectoryFactory.close Releasing directory:/mnt/ssd/jenkins/workspace/Lucene-Solr-trunk-Linux/solr/build/solr-core/test/J1/./solrtest-SoftAutoCommitTest-1359873394006
[junit4:junit4]   2> 3756 T511 oasc.SolrCore.getNewIndexDir New index directory detected: old=null new=/mnt/ssd/jenkins/workspace/Lucene-Solr-trunk-Linux/solr/build/solr-core/test/J1/./solrtest-SoftAutoCommitTest-1359873394006/index/
[junit4:junit4]   2> 3757 T511 oasc.SolrCore.initWriters created xml: solr.XMLResponseWriter
[junit4:junit4]   2> 3758 T511 oasup.UpdateRequestProcessorChain.init inserting DistributedUpdateProcessorFactory into updateRequestProcessorChain "dedupe"
[junit4:junit4]   2> 3758 T511 oasup.UpdateRequestProcessorChain.init inserting DistributedUpdateProcessorFactory into updateRequestProcessorChain "dedupe-allfields"
[junit4:junit4]   2> 3759 T511 oasup.UpdateRequestProcessorChain.init inserting DistributedUpdateProcessorFactory into updateRequestProcessorChain "stored_sig"
[junit4:junit4]   2> 3759 T511 oasup.UpdateRequestProcessorChain.init inserting DistributedUpdateProcessorFactory into updateRequestProcessorChain "uniq-fields"
[junit4:junit4]   2> 3760 T511 oasup.UpdateRequestProcessorChain.init inserting DistributedUpdateProcessorFactory into updateRequestProcessorChain "distrib-dup-test-chain-implicit"
[junit4:junit4]   2> 3760 T511 oasc.RequestHandlers.initHandlersFromConfig adding lazy requestHandler: solr.ReplicationHandler
[junit4:junit4]   2> 3760 T511 oasc.RequestHandlers.initHandlersFromConfig created /replication: solr.ReplicationHandler
[junit4:junit4]   2> 3761 T511 oasc.RequestHandlers.initHandlersFromConfig created standard: solr.StandardRequestHandler
[junit4:junit4]   2> 3761 T511 oasc.RequestHandlers.initHandlersFromConfig created /get: solr.RealTimeGetHandler
[junit4:junit4]   2> 3762 T511 oasc.RequestHandlers.initHandlersFromConfig created dismax: solr.SearchHandler
[junit4:junit4]   2> 3762 T511 oasc.RequestHandlers.initHandlersFromConfig created mock: org.apache.solr.core.MockQuerySenderListenerReqHandler
[junit4:junit4]   2> 3763 T511 oasc.RequestHandlers.initHandlersFromConfig created /admin/: org.apache.solr.handler.admin.AdminHandlers
[junit4:junit4]   2> 3763 T511 oasc.RequestHandlers.initHandlersFromConfig created defaults: solr.StandardRequestHandler
[junit4:junit4]   2> 3764 T511 oasc.RequestHandlers.initHandlersFromConfig adding lazy requestHandler: solr.StandardRequestHandler
[junit4:junit4]   2> 3764 T511 oasc.RequestHandlers.initHandlersFromConfig created lazy: solr.StandardRequestHandler
[junit4:junit4]   2> 3765 T511 oasc.RequestHandlers.initHandlersFromConfig created /update: solr.UpdateRequestHandler
[junit4:junit4]   2> 3765 T511 oasc.RequestHandlers.initHandlersFromConfig created /terms: org.apache.solr.handler.component.SearchHandler
[junit4:junit4]   2> 3766 T511 oasc.RequestHandlers.initHandlersFromConfig created spellCheckCompRH: org.apache.solr.handler.component.SearchHandler
[junit4:junit4]   2> 3766 T511 oasc.RequestHandlers.initHandlersFromConfig created spellCheckCompRH_Direct: org.apache.solr.handler.component.SearchHandler
[junit4:junit4]   2> 3767 T511 oasc.RequestHandlers.initHandlersFromConfig created spellCheckWithWordbreak: org.apache.solr.handler.component.SearchHandler
[junit4:junit4]   2> 3767 T511 oasc.RequestHandlers.initHandlersFromConfig created spellCheckWithWordbreak_Direct: org.apache.solr.handler.component.SearchHandler
[junit4:junit4]   2> 3768 T511 oasc.RequestHandlers.initHandlersFromConfig created spellCheckCompRH1: org.apache.solr.handler.component.SearchHandler
[junit4:junit4]   2> 3768 T511 oasc.RequestHandlers.initHandlersFromConfig created mltrh: org.apache.solr.handler.component.SearchHandler
[junit4:junit4]   2> 3769 T511 oasc.RequestHandlers.initHandlersFromConfig created tvrh: org.apache.solr.handler.component.SearchHandler
[junit4:junit4]   2> 3769 T511 oasc.RequestHandlers.initHandlersFromConfig created /mlt: solr.MoreLikeThisHandler
[junit4:junit4]   2> 3769 T511 oasc.RequestHandlers.initHandlersFromConfig created /debug/dump: solr.DumpRequestHandler
[junit4:junit4]   2> 3770 T511 oashl.XMLLoader.init xsltCacheLifetimeSeconds=60
[junit4:junit4]   2> 3772 T511 oasc.SolrCore.initDeprecatedSupport WARNING solrconfig.xml uses deprecated <admin/gettableFiles>, Please update your config to use the ShowFileRequestHandler.
[junit4:junit4]   2> 3773 T511 oasc.SolrCore.initDeprecatedSupport WARNING adding ShowFileRequestHandler with hidden files: [STEMDICT.TXT, SCHEMA-MINIMAL.XML, SOLRCONFIG-POSTINGSHIGHLIGHT.XML, SCHEMA-COLLATE.XML, SCHEMA-BINARYFIELD.XML, SOLRCONFIG-MASTER3.XML, BAD-SCHEMA-EXTERNAL-FILEFIELD.XML, MAPPING-ISOLATIN1ACCENT.TXT, SCHEMA-EFF.XML, STOPWORDSWRONGENCODING.TXT, SCHEMA-NUMERIC.XML, BAD-SCHEMA-NONTEXT-ANALYZER.XML, SOLRCONFIG-SLAVE1.XML, STOPTYPES-1.TXT, SOLRCONFIG-COMPONENTS-NAME.XML, SCHEMA-STOP-KEEP.XML, MISSING.FUNCTIONS.UPDATEPROCESSOR.JS, BAD-SCHEMA-SIM-GLOBAL-VS-FT-MISMATCH.XML, ADDFIELDS.UPDATEPROCESSOR.JS, SCHEMA-IB.XML, STOPWITHBOM.TXT, SCHEMA.XML, SOLRCONFIG_PERF.XML, SOLRCONFIG-MASTER1-KEEPONEBACKUP.XML, SCHEMA-BM25.XML, SOLRCONFIG-TERMINDEX.XML, SOLRCONFIG-SOLR-749.XML, SCHEMA-LMDIRICHLET.XML, SCHEMASURROUND.XML, FRENCHARTICLES.TXT, SCHEMA-SYNONYM-TOKENIZER.XML, HYPHENATION.DTD, STOPWORDS.TXT, SCHEMA-LMJELINEKMERCER.XML, BAD-SCHEMA-UNIQUEKEY-IS-COPYFIELD-DEST.XML, SCHEMA-POSTINGSHIGHLIGHT.XML, SCHEMA11.XML, BAD-SCHEMA-CURRENCY-MULTIVALUED.XML, STOP-1.TXT, SCHEMA12.XML, SCHEMA-TRIE.XML, SOLRCONFIG-MASTER2.XML, BAD-SCHEMA-ANALYZER-CLASS-AND-NESTED.XML, SOLRCONFIG-SNIPPET-PROCESSOR.XML, SOLRCONFIG-HIGHLIGHT.XML, SOLRCONFIG-NATIVELOCK.XML, PROTWORDS.TXT, SOLRCONFIG-PROPINJECT-INDEXDEFAULT.XML, COMPOUNDDICTIONARY.TXT, SOLRCONFIG-INDEXCONFIG.XML, SCHEMA-PHRASESUGGEST.XML, HUNSPELL-TEST.DIC, TRIVIAL.UPDATEPROCESSOR0.JS, SOLRCONFIG-CACHING.XML, SOLRCONFIG-UPDATE-PROCESSOR-CHAINS.XML, STOP-2.TXT, BAD-SCHEMA-UNIQUEKEY-USES-DEFAULT.XML, SCHEMA-LUCENEMATCHVERSION.XML, SOLRCONFIG-SLAVE.XML, ELEVATE.XML, SOLRCONFIG-SPELLCHECKCOMPONENT.XML, JASUGGEST.TXT, SOLRCONFIG-XINCLUDE.XML, SOLRCONFIG-DELPOLICY2.XML, SCHEMA-DFR.XML, BAD-SCHEMA-DUP-DYNAMICFIELD.XML, DA_COMPOUNDDICTIONARY.TXT, CONDITIONAL.UPDATEPROCESSOR.JS, SOLRCONFIG-DELPOLICY1.XML, SCHEMA-CHARFILTERS.XML, SOLRCONFIG_CODEC.XML, BAD-SCHEMA-NOT-INDEXED-BUT-POS.XML, SOLRCONFIG-RESPONSE-LOG-COMPONENT.XML, SCHEMA-NOT-REQUIRED-UNIQUE-KEY.XML, BAD-SCHEMA-CURRENCY-FT-MULTIVALUED.XML, SCHEMA-SNIPPET-FIELD.XML, SCHEMA-REPLICATION1.XML, BAD-SCHEMA-DUP-FIELD.XML, SCHEMA-BEHAVIOR.XML, SOLRCONFIG-SOLCOREPROPERTIES.XML, DA_UTF8.XML, SCHEMA-FOLDING.XML, SCHEMA-SIM.XML, PHRASESUGGEST.TXT, STOPTYPES-2.TXT, THROW.ERROR.ON.ADD.UPDATEPROCESSOR.JS, SCHEMA-SPATIAL.XML, BAD-SCHEMA-DUP-FIELDTYPE.XML, BAD-SCHEMA-NOT-INDEXED-BUT-NORMS.XML, SOLRCONFIG-ELEVATE.XML, SCHEMA-REQUIRED-FIELDS.XML, SOLRCONFIG-QUERYSENDER.XML, SOLRCONFIG-REPEATER.XML, SOLRCONFIG-REQHANDLER.INCL, SYNONYMS.TXT, XSLT, SOLRCONFIG-QUERYSENDER-NOQUERY.XML, TRIVIAL.UPDATEPROCESSOR1.JS, SOLRCONFIG-SPELLCHECKER.XML, OLD_SYNONYMS.TXT, HUNSPELL-TEST.AFF, BAD-SOLRCONFIG-BOGUS-SCRIPTENGINE-NAME.XML, SOLRCONFIG-MERGEPOLICY.XML, FUZZYSUGGEST.TXT, SOLRCONFIG-MASTER.XML, BAD-SOLRCONFIG-MISSING-SCRIPTFILE.XML, SOLRCONFIG-BASIC.XML, OPEN-EXCHANGE-RATES.JSON, SCHEMA-COPYFIELD-TEST.XML, BAD-SCHEMA-CURRENCY-DYNAMIC-MULTIVALUED.XML, SOLRCONFIG-MASTER1.XML, SCHEMA_CODEC.XML, REGEX-BOOST-PROCESSOR-TEST.TXT, SOLRCONFIG-ENABLEPLUGIN.XML, KEEP-2.TXT, KEEP-1.TXT, SCHEMA-TFIDF.XML, SCHEMA15.XML, SOLRCONFIG-PHRASESUGGEST.XML, SOLRCONFIG-TLOG.XML, SOLRCONFIG-LAZYWRITER.XML, SOLRCONFIG-ALTDIRECTORY.XML, BAD-SCHEMA-OMIT-TF-BUT-NOT-POS.XML, SCHEMA-REPLICATION2.XML, SCHEMA-REVERSED.XML, SCHEMA-SNIPPET-TYPE.XML, SOLRCONFIG-TRANSFORMERS.XML, SOLRCONFIG-NOCACHE.XML, SCHEMA-SPELLCHECKER.XML, BAD-SCHEMA-UNIQUEKEY-MULTIVALUED.XML, BAD-SOLRCONFIG-INVALID-SCRIPTFILE.XML, MISSLEADING.EXTENSION.UPDATEPROCESSOR.JS.TXT, BAD-SCHEMA-NOT-INDEXED-BUT-TF.XML, SCHEMA-XINCLUDE.XML, SOLRCONFIG-SIMPLELOCK.XML, BAD_SOLRCONFIG.XML, BAD-SCHEMA-CODEC-GLOBAL-VS-FT-MISMATCH.XML, STOP-SNOWBALL.TXT, SOLRCONFIG-SCRIPT-UPDATEPROCESSOR.XML, WDFTYPES.TXT, BAD-MP-SOLRCONFIG.XML, SOLRCONFIG-FUNCTIONQUERY.XML, SOLRCONFIG-PROPINJECT.XML, CURRENCY.XML]
[junit4:junit4]   2> 3774 T511 oasc.CachingDirectoryFactory.close Releasing directory:/mnt/ssd/jenkins/workspace/Lucene-Solr-trunk-Linux/solr/build/solr-core/test/J1/./solrtest-SoftAutoCommitTest-1359873394006
[junit4:junit4]   2> 3775 T511 oass.SolrIndexSearcher.<init> Opening Searcher@1ddf58a main
[junit4:junit4]   2> 3775 T511 oasu.CommitTracker.<init> Hard AutoCommit: disabled
[junit4:junit4]   2> 3776 T511 oasu.CommitTracker.<init> Soft AutoCommit: disabled
[junit4:junit4]   2> 3776 T511 oashc.SpellCheckComponent.inform Initializing spell checkers
[junit4:junit4]   2> 3777 T511 oass.DirectSolrSpellChecker.init init: {name=direct,classname=DirectSolrSpellChecker,field=lowerfilt,minQueryLength=3}
[junit4:junit4]   2> 3783 T519 oasc.SolrCore.registerSearcher [collection1] Registered new searcher Searcher@1ddf58a main{StandardDirectoryReader(segments_3:9:nrt _1(5.0):C1 _2(5.0):C5)}
[junit4:junit4]   2> 3796 T511 oasc.CoreContainer.registerCore replacing core: collection1
[junit4:junit4]   2> 3796 T511 oasc.SolrCore.close [collection1]  CLOSING SolrCore org.apache.solr.core.SolrCore@4d9ac0
[junit4:junit4]   2> 3802 T511 oasu.DirectUpdateHandler2.close closing DirectUpdateHandler2{commits=1,autocommit maxTime=1200ms,autocommits=0,soft autocommit maxTime=500ms,soft autocommits=1,optimizes=0,rollbacks=0,expungeDeletes=0,docsPending=5,adds=0,deletesById=0,deletesByQuery=0,errors=0,cumulative_adds=5,cumulative_deletesById=0,cumulative_deletesByQuery=0,cumulative_errors=0}
[junit4:junit4]   2> 3803 T511 oasc.SolrCore.closeSearcher [collection1] Closing main searcher on request.
[junit4:junit4]   2> 3803 T511 oasc.CachingDirectoryFactory.close Releasing directory:/mnt/ssd/jenkins/workspace/Lucene-Solr-trunk-Linux/solr/build/solr-core/test/J1/./solrtest-SoftAutoCommitTest-1359873394006/index
[junit4:junit4]   2> ASYNC  NEW_CORE C25 name=collection1 org.apache.solr.core.SolrCore@967f33
[junit4:junit4]   2> 3814 T511 C25 UPDATE [collection1] webapp=null path=null params={} {add=[529]} 0 6
[junit4:junit4]   2> 4314 T521 oasu.DirectUpdateHandler2.commit start commit{,optimize=false,openSearcher=true,waitSearcher=true,expungeDeletes=false,softCommit=true}
[junit4:junit4]   2> 4315 T521 oasc.CachingDirectoryFactory.close Releasing directory:/mnt/ssd/jenkins/workspace/Lucene-Solr-trunk-Linux/solr/build/solr-core/test/J1/./solrtest-SoftAutoCommitTest-1359873394006
[junit4:junit4]   2> 4317 T521 oass.SolrIndexSearcher.<init> Opening Searcher@10b9d6b main
[junit4:junit4]   2> 4317 T521 oasu.DirectUpdateHandler2.commit end_commit_flush
[junit4:junit4]   2> 4318 T519 oasc.SolrCore.registerSearcher [collection1] Registered new searcher Searcher@10b9d6b main{StandardDirectoryReader(segments_3:11:nrt _1(5.0):C1 _2(5.0):C5 _3(5.0):C1)}
[junit4:junit4]   2> 4329 T519 oasc.CachingDirectoryFactory.close Releasing directory:/mnt/ssd/jenkins/workspace/Lucene-Solr-trunk-Linux/solr/build/solr-core/test/J1/./solrtest-SoftAutoCommitTest-1359873394006/index
[junit4:junit4]   2> 4331 T511 C25 UPDATE [collection1] webapp=null path=null params={} {add=[530]} 0 1
[junit4:junit4]   2> 4831 T521 oasu.DirectUpdateHandler2.commit start commit{,optimize=false,openSearcher=true,waitSearcher=true,expungeDeletes=false,softCommit=true}
[junit4:junit4]   2> 4831 T521 oasc.CachingDirectoryFactory.close Releasing directory:/mnt/ssd/jenkins/workspace/Lucene-Solr-trunk-Linux/solr/build/solr-core/test/J1/./solrtest-SoftAutoCommitTest-1359873394006
[junit4:junit4]   2> 4834 T521 oass.SolrIndexSearcher.<init> Opening Searcher@d43338 main
[junit4:junit4]   2> 4834 T521 oasu.DirectUpdateHandler2.commit end_commit_flush
[junit4:junit4]   2> 4835 T519 oasc.SolrCore.registerSearcher [collection1] Registered new searcher Searcher@d43338 main{StandardDirectoryReader(segments_3:13:nrt _1(5.0):C1 _2(5.0):C5 _3(5.0):C1 _4(5.0):C1)}
[junit4:junit4]   2> 4836 T519 oasc.CachingDirectoryFactory.close Releasing directory:/mnt/ssd/jenkins/workspace/Lucene-Solr-trunk-Linux/solr/build/solr-core/test/J1/./solrtest-SoftAutoCommitTest-1359873394006/index
[junit4:junit4]   2> 5010 T520 oasu.DirectUpdateHandler2.commit start commit{,optimize=false,openSearcher=true,waitSearcher=true,expungeDeletes=false,softCommit=false}
[junit4:junit4]   2> 5011 T520 oasc.SolrDeletionPolicy.onCommit SolrDeletionPolicy.onCommit: commits:num=2
[junit4:junit4]   2> 		commit{dir=RateLimitedDirectoryWrapper(MockDirWrapper(org.apache.lucene.store.RAMDirectory@fc9ec0 lockFactory=org.apache.lucene.store.NativeFSLockFactory@125a0f8)),segFN=segments_3,generation=3,filenames=[_1_Lucene41_0.tim, segments_3, _1_nrm.cfe, _1_Lucene41_0.pos, _1_MockFixedIntBlock_0.pyl, _1_NestedPulsing_0.doc, _1.fdt, _1_Pulsing41_0.tim, _1.si, _1_Pulsing41_0.doc, _1_Pulsing41_0.pos, _1_MockFixedIntBlock_0.skp, _1_MockFixedIntBlock_0.tii, _1_NestedPulsing_0.tip, _1_Lucene41_0.doc, _1_Pulsing41_0.tip, _1_MockFixedIntBlock_0.frq, _1_NestedPulsing_0.pos, _1_NestedPulsing_0.tim, _1_Lucene41_0.tip, _1_MockFixedIntBlock_0.doc, _1.fnm, _1_MockFixedIntBlock_0.pos, _1_nrm.cfs, _1.fdx, _1_MockFixedIntBlock_0.tib]
[junit4:junit4]   2> 		commit{dir=RateLimitedDirectoryWrapper(MockDirWrapper(org.apache.lucene.store.RAMDirectory@fc9ec0 lockFactory=org.apache.lucene.store.NativeFSLockFactory@125a0f8)),segFN=segments_4,generation=4,filenames=[_3_NestedPulsing_0.tim, _3.si, _2_MockFixedIntBlock_0.doc, _4_MockFixedIntBlock_0.skp, _2_Pulsing41_0.tim, _2_MockFixedIntBlock_0.pos, _3_NestedPulsing_0.tip, _3_Lucene41_0.pos, _1_Pulsing41_0.tip, _3_Pulsing41_0.tip, _2_Lucene41_0.tim, _2_MockFixedIntBlock_0.tii, _4_Lucene41_0.tim, _1_NestedPulsing_0.pos, _2_Pulsing41_0.pos, _4_NestedPulsing_0.tim, _4_Lucene41_0.doc, _4_Pulsing41_0.pos, _1_MockFixedIntBlock_0.doc, _4.fnm, _4.fdt, _3.fdx, _3_MockFixedIntBlock_0.skp, _4_Pulsing41_0.tip, _3_MockFixedIntBlock_0.pos, _1_nrm.cfe, _2_Lucene41_0.tip, _1_Pulsing41_0.tim, _3_nrm.cfs, _4_Pulsing41_0.tim, _1.si, _2_nrm.cfs, _3_MockFixedIntBlock_0.doc, _1_NestedPulsing_0.tim, _2_NestedPulsing_0.tim, _3_NestedPulsing_0.doc, _3_Lucene41_0.tip, _2_MockFixedIntBlock_0.frq, _1.fnm, _3_NestedPulsing_0.pos, _4_MockFixedIntBlock_0.tib, _1_nrm.cfs, _4_MockFixedIntBlock_0.doc, _3_Pulsing41_0.doc, _1_MockFixedIntBlock_0.tib, _3_MockFixedIntBlock_0.tib, _1_Lucene41_0.pos, _4_Lucene41_0.tip, _2_Lucene41_0.doc, _2.si, _1_NestedPulsing_0.doc, _1.fdt, _1_Pulsing41_0.doc, _3_Pulsing41_0.tim, _4_Lucene41_0.pos, _4_Pulsing41_0.doc, _1_MockFixedIntBlock_0.skp, _1_MockFixedIntBlock_0.tii, _4_NestedPulsing_0.pos, _4.fdx, _1_NestedPulsing_0.tip, _3_MockFixedIntBlock_0.tii, _1_MockFixedIntBlock_0.frq, _4_MockFixedIntBlock_0.tii, _3_nrm.cfe, _1_Lucene41_0.tip, _3_Pulsing41_0.pos, _2_Pulsing41_0.doc, _2.fdx, _4_nrm.cfe, _2_NestedPulsing_0.pos, _2.fdt, _2_nrm.cfe, _3_MockFixedIntBlock_0.frq, _4.si, _1_MockFixedIntBlock_0.pos, _1_Lucene41_0.tim, _3.fdt, _4_MockFixedIntBlock_0.frq, _1_MockFixedIntBlock_0.pyl, segments_4, _2_MockFixedIntBlock_0.pyl, _3.fnm, _2.fnm, _4_MockFixedIntBlock_0.pyl, _1_Pulsing41_0.pos, _4_NestedPulsing_0.tip, _4_NestedPulsing_0.doc, _2_MockFixedIntBlock_0.skp, _1_Lucene41_0.doc, _3_Lucene41_0.doc, _4_MockFixedIntBlock_0.pos, _2_NestedPulsing_0.tip, _3_MockFixedIntBlock_0.pyl, _3_Lucene41_0.tim, _2_MockFixedIntBlock_0.tib, _2_Pulsing41_0.tip, _4_nrm.cfs, _2_NestedPulsing_0.doc, _1.fdx, _2_Lucene41_0.pos]
[junit4:junit4]   2> 5011 T520 oasc.SolrDeletionPolicy.updateCommits newest commit = 4[_3_NestedPulsing_0.tim, _3.si, _2_MockFixedIntBlock_0.doc, _4_MockFixedIntBlock_0.skp, _2_Pulsing41_0.tim, _2_MockFixedIntBlock_0.pos, _3_NestedPulsing_0.tip, _3_Lucene41_0.pos, _1_Pulsing41_0.tip, _3_Pulsing41_0.tip, _2_Lucene41_0.tim, _2_MockFixedIntBlock_0.tii, _4_Lucene41_0.tim, _1_NestedPulsing_0.pos, _2_Pulsing41_0.pos, _4_NestedPulsing_0.tim, _4_Lucene41_0.doc, _4_Pulsing41_0.pos, _1_MockFixedIntBlock_0.doc, _4.fnm, _4.fdt, _3.fdx, _3_MockFixedIntBlock_0.skp, _4_Pulsing41_0.tip, _3_MockFixedIntBlock_0.pos, _1_nrm.cfe, _2_Lucene41_0.tip, _1_Pulsing41_0.tim, _3_nrm.cfs, _4_Pulsing41_0.tim, _1.si, _2_nrm.cfs, _3_MockFixedIntBlock_0.doc, _1_NestedPulsing_0.tim, _2_NestedPulsing_0.tim, _3_NestedPulsing_0.doc, _3_Lucene41_0.tip, _2_MockFixedIntBlock_0.frq, _1.fnm, _3_NestedPulsing_0.pos, _4_MockFixedIntBlock_0.tib, _1_nrm.cfs, _4_MockFixedIntBlock_0.doc, _3_Pulsing41_0.doc, _1_MockFixedIntBlock_0.tib, _3_MockFixedIntBlock_0.tib, _1_Lucene41_0.pos, _4_Lucene41_0.tip, _2_Lucene41_0.doc, _2.si, _1_NestedPulsing_0.doc, _1.fdt, _1_Pulsing41_0.doc, _3_Pulsing41_0.tim, _4_Lucene41_0.pos, _4_Pulsing41_0.doc, _1_MockFixedIntBlock_0.skp, _1_MockFixedIntBlock_0.tii, _4_NestedPulsing_0.pos, _4.fdx, _1_NestedPulsing_0.tip, _3_MockFixedIntBlock_0.tii, _1_MockFixedIntBlock_0.frq, _4_MockFixedIntBlock_0.tii, _3_nrm.cfe, _1_Lucene41_0.tip, _3_Pulsing41_0.pos, _2_Pulsing41_0.doc, _2.fdx, _4_nrm.cfe, _2_NestedPulsing_0.pos, _2.fdt, _2_nrm.cfe, _3_MockFixedIntBlock_0.frq, _4.si, _1_MockFixedIntBlock_0.pos, _1_Lucene41_0.tim, _3.fdt, _4_MockFixedIntBlock_0.frq, _1_MockFixedIntBlock_0.pyl, segments_4, _2_MockFixedIntBlock_0.pyl, _3.fnm, _2.fnm, _4_MockFixedIntBlock_0.pyl, _1_Pulsing41_0.pos, _4_NestedPulsing_0.tip, _4_NestedPulsing_0.doc, _2_MockFixedIntBlock_0.skp, _1_Lucene41_0.doc, _3_Lucene41_0.doc, _4_MockFixedIntBlock_0.pos, _2_NestedPulsing_0.tip, _3_MockFixedIntBlock_0.pyl, _3_Lucene41_0.tim, _2_MockFixedIntBlock_0.tib, _2_Pulsing41_0.tip, _4_nrm.cfs, _2_NestedPulsing_0.doc, _1.fdx, _2_Lucene41_0.pos]
[junit4:junit4]   2> 5012 T520 oasc.CachingDirectoryFactory.close Releasing directory:/mnt/ssd/jenkins/workspace/Lucene-Solr-trunk-Linux/solr/build/solr-core/test/J1/./solrtest-SoftAutoCommitTest-1359873394006
[junit4:junit4]   2> 5012 T520 oass.SolrIndexSearcher.<init> Opening Searcher@1091791 main
[junit4:junit4]   2> 5012 T520 oasu.DirectUpdateHandler2.commit end_commit_flush
[junit4:junit4]   2> 5014 T519 oasc.SolrCore.registerSearcher [collection1] Registered new searcher Searcher@1091791 main{StandardDirectoryReader(segments_3:13:nrt _1(5.0):C1 _2(5.0):C5 _3(5.0):C1 _4(5.0):C1)}
[junit4:junit4]   2> 5015 T519 oasc.CachingDirectoryFactory.close Releasing directory:/mnt/ssd/jenkins/workspace/Lucene-Solr-trunk-Linux/solr/build/solr-core/test/J1/./solrtest-SoftAutoCommitTest-1359873394006/index
[junit4:junit4]   2> 8213 T511 oas.SolrTestCaseJ4.tearDown ###Ending testSoftAndHardCommitMaxTimeMixedAdds
[junit4:junit4]   2> 8215 T511 oas.SolrTestCaseJ4.deleteCore ###deleteCore
[junit4:junit4]   2> 8215 T511 oasc.CoreContainer.shutdown Shutting down CoreContainer instance=24320607
[junit4:junit4]   2> 8215 T511 oasc.SolrCore.close [collection1]  CLOSING SolrCore org.apache.solr.core.SolrCore@967f33
[junit4:junit4]   2> 8221 T511 oasu.DirectUpdateHandler2.close closing DirectUpdateHandler2{commits=3,autocommit maxTime=1200ms,autocommits=1,soft autocommit maxTime=500ms,soft autocommits=2,optimizes=0,rollbacks=0,expungeDeletes=0,docsPending=0,adds=0,deletesById=0,deletesByQuery=0,errors=0,cumulative_adds=2,cumulative_deletesById=0,cumulative_deletesByQuery=0,cumulative_errors=0}
[junit4:junit4]   2> 8222 T511 oasc.SolrCore.decrefSolrCoreState Closing SolrCoreState
[junit4:junit4]   2> 8222 T511 oasu.DefaultSolrCoreState.closeIndexWriter SolrCoreState ref count has reached 0 - closing IndexWriter
[junit4:junit4]   2> 8222 T511 oasu.DefaultSolrCoreState.closeIndexWriter closing IndexWriter with IndexWriterCloser
[junit4:junit4]   2> 8223 T511 C25 oasc.CachingDirectoryFactory.close Releasing directory:/mnt/ssd/jenkins/workspace/Lucene-Solr-trunk-Linux/solr/build/solr-core/test/J1/./solrtest-SoftAutoCommitTest-1359873394006/index
[junit4:junit4]   2> 8223 T511 oasc.SolrCore.closeSearcher [collection1] Closing main searcher on request.
[junit4:junit4]   2> 8224 T511 oasc.CachingDirectoryFactory.close Releasing directory:/mnt/ssd/jenkins/workspace/Lucene-Solr-trunk-Linux/solr/build/solr-core/test/J1/./solrtest-SoftAutoCommitTest-1359873394006/index
[junit4:junit4]   2> 8224 T511 oasc.CachingDirectoryFactory.close Closing directory when closing factory:/mnt/ssd/jenkins/workspace/Lucene-Solr-trunk-Linux/solr/build/solr-core/test/J1/./solrtest-SoftAutoCommitTest-1359873394006/index
[junit4:junit4]   2> 8224 T511 oasc.CachingDirectoryFactory.closeDirectory Closing directory:/mnt/ssd/jenkins/workspace/Lucene-Solr-trunk-Linux/solr/build/solr-core/test/J1/./solrtest-SoftAutoCommitTest-1359873394006/index
[junit4:junit4]   2> 8225 T511 oasc.CachingDirectoryFactory.close Closing directory when closing factory:/mnt/ssd/jenkins/workspace/Lucene-Solr-trunk-Linux/solr/build/solr-core/test/J1/./solrtest-SoftAutoCommitTest-1359873394006
[junit4:junit4]   2> 8225 T511 oasc.CachingDirectoryFactory.closeDirectory Closing directory:/mnt/ssd/jenkins/workspace/Lucene-Solr-trunk-Linux/solr/build/solr-core/test/J1/./solrtest-SoftAutoCommitTest-1359873394006
[junit4:junit4]   2> NOTE: test params are: codec=Lucene42: {range_facet_sl=Lucene41(blocksize=128), range_facet_l=PostingsFormat(name=NestedPulsing), intDefault=Pulsing41(freqCutoff=20 minBlockSize=93 maxBlockSize=228), range_facet_si=PostingsFormat(name=NestedPulsing), timestamp=PostingsFormat(name=NestedPulsing), subject=PostingsFormat(name=NestedPulsing), text=MockFixedIntBlock(blockSize=1587), multiDefault=PostingsFormat(name=NestedPulsing), id=Lucene41(blocksize=128)}, sim=DefaultSimilarity, locale=de_CH, timezone=America/Argentina/Ushuaia
[junit4:junit4]   2> NOTE: Linux 3.2.0-37-generic i386/Oracle Corporation 1.8.0-ea (32-bit)/cpus=8,threads=1,free=29231808,total=74555392
[junit4:junit4]   2> NOTE: All tests run in this JVM: [TestDocSet, StatelessScriptUpdateProcessorFactoryTest, BadIndexSchemaTest, TestSolrDeletionPolicy2, BasicZkTest, TestQuerySenderListener, RecoveryZkTest, TestSolrXMLSerializer, TestDistributedSearch, TestMultiCoreConfBootstrap, XmlUpdateRequestHandlerTest, SpellingQueryConverterTest, TestLRUCache, TestPropInject, DistributedQueryElevationComponentTest, SoftAutoCommitTest]
[junit4:junit4] Completed on J1 in 8.26s, 3 tests, 1 failure <<< FAILURES!

[...truncated 646 lines...]
BUILD FAILED
/mnt/ssd/jenkins/workspace/Lucene-Solr-trunk-Linux/build.xml:346: The following error occurred while executing this line:
/mnt/ssd/jenkins/workspace/Lucene-Solr-trunk-Linux/build.xml:39: The following error occurred while executing this line:
/mnt/ssd/jenkins/workspace/Lucene-Solr-trunk-Linux/solr/build.xml:178: The following error occurred while executing this line:
/mnt/ssd/jenkins/workspace/Lucene-Solr-trunk-Linux/solr/common-build.xml:428: The following error occurred while executing this line:
/mnt/ssd/jenkins/workspace/Lucene-Solr-trunk-Linux/lucene/common-build.xml:1176: The following error occurred while executing this line:
/mnt/ssd/jenkins/workspace/Lucene-Solr-trunk-Linux/lucene/common-build.xml:841: There were test failures: 249 suites, 1038 tests, 1 failure, 9 ignored (4 assumptions)

Total time: 34 minutes 6 seconds
Build step 'Invoke Ant' marked build as failure
Archiving artifacts
Recording test results
Description set: Java: 32bit/jdk1.8.0-ea-b65 -server -XX:+UseConcMarkSweepGC
Email was triggered for: Failure
Sending email for trigger: Failure



Mime
View raw message