lucene-dev mailing list archives

Site index · List index
Message view « Date » · « Thread »
Top « Date » · « Thread »
From Apache Jenkins Server <jenk...@builds.apache.org>
Subject [JENKINS] Lucene-Solr-Tests-trunk-java7 - Build # 3706 - Still Failing
Date Mon, 04 Feb 2013 09:50:18 GMT
Build: https://builds.apache.org/job/Lucene-Solr-Tests-trunk-java7/3706/

2 tests failed.
FAILED:  org.apache.solr.cloud.BasicDistributedZkTest.testDistribSearch

Error Message:
Test abandoned because suite timeout was reached.

Stack Trace:
java.lang.Exception: Test abandoned because suite timeout was reached.
	at __randomizedtesting.SeedInfo.seed([D57BB880CB873303]:0)


FAILED:  junit.framework.TestSuite.org.apache.solr.cloud.BasicDistributedZkTest

Error Message:
Suite timeout exceeded (>= 7200000 msec).

Stack Trace:
java.lang.Exception: Suite timeout exceeded (>= 7200000 msec).
	at __randomizedtesting.SeedInfo.seed([D57BB880CB873303]:0)




Build Log:
[...truncated 9395 lines...]
[junit4:junit4] Suite: org.apache.solr.cloud.BasicDistributedZkTest
[junit4:junit4]   2> 1 T392 oas.BaseDistributedSearchTestCase.initHostContext Setting hostContext system property: /
[junit4:junit4]   2> 7 T392 oas.SolrTestCaseJ4.setUp ###Starting testDistribSearch
[junit4:junit4]   2> Creating dataDir: /usr/home/hudson/hudson-slave/workspace/Lucene-Solr-Tests-trunk-java7/solr/build/solr-core/test/J0/./solrtest-BasicDistributedZkTest-1359964174397
[junit4:junit4]   2> 18 T392 oasc.ZkTestServer.run STARTING ZK TEST SERVER
[junit4:junit4]   2> 26 T393 oasc.ZkTestServer$ZKServerMain.runFromConfig Starting server
[junit4:junit4]   2> 116 T393 oaz.Environment.logEnv Server environment:zookeeper.version=3.4.5-1392090, built on 09/30/2012 17:52 GMT
[junit4:junit4]   2> 116 T393 oaz.Environment.logEnv Server environment:host.name=lucene.zones.apache.org
[junit4:junit4]   2> 116 T393 oaz.Environment.logEnv Server environment:java.version=1.7.0_09
[junit4:junit4]   2> 116 T393 oaz.Environment.logEnv Server environment:java.vendor=Oracle Corporation
[junit4:junit4]   2> 116 T393 oaz.Environment.logEnv Server environment:java.home=/usr/local/openjdk7/jre
[junit4:junit4]   2> 116 T393 oaz.Environment.logEnv Server environment:java.class.path=/usr/home/hudson/hudson-slave/workspace/Lucene-Solr-Tests-trunk-java7/solr/build/solr-core/classes/test:/usr/home/hudson/hudson-slave/workspace/Lucene-Solr-Tests-trunk-java7/solr/build/solr-test-framework/classes/java:/usr/home/hudson/hudson-slave/workspace/Lucene-Solr-Tests-trunk-java7/solr/build/solr-core/test-files:/usr/home/hudson/hudson-slave/workspace/Lucene-Solr-Tests-trunk-java7/lucene/build/test-framework/classes/java:/usr/home/hudson/hudson-slave/workspace/Lucene-Solr-Tests-trunk-java7/lucene/build/codecs/classes/java:/usr/home/hudson/hudson-slave/workspace/Lucene-Solr-Tests-trunk-java7/solr/build/solr-solrj/classes/java:/usr/home/hudson/hudson-slave/workspace/Lucene-Solr-Tests-trunk-java7/solr/build/solr-core/classes/java:/usr/home/hudson/hudson-slave/workspace/Lucene-Solr-Tests-trunk-java7/lucene/build/analysis/common/lucene-analyzers-common-5.0-SNAPSHOT.jar:/usr/home/hudson/hudson-slave/workspace/Lucene-Solr-Tests-trunk-java7/lucene/build/analysis/kuromoji/lucene-analyzers-kuromoji-5.0-SNAPSHOT.jar:/usr/home/hudson/hudson-slave/workspace/Lucene-Solr-Tests-trunk-java7/lucene/build/analysis/phonetic/lucene-analyzers-phonetic-5.0-SNAPSHOT.jar:/usr/home/hudson/hudson-slave/workspace/Lucene-Solr-Tests-trunk-java7/lucene/build/highlighter/lucene-highlighter-5.0-SNAPSHOT.jar:/usr/home/hudson/hudson-slave/workspace/Lucene-Solr-Tests-trunk-java7/lucene/build/memory/lucene-memory-5.0-SNAPSHOT.jar:/usr/home/hudson/hudson-slave/workspace/Lucene-Solr-Tests-trunk-java7/lucene/build/misc/lucene-misc-5.0-SNAPSHOT.jar:/usr/home/hudson/hudson-slave/workspace/Lucene-Solr-Tests-trunk-java7/lucene/build/spatial/lucene-spatial-5.0-SNAPSHOT.jar:/usr/home/hudson/hudson-slave/workspace/Lucene-Solr-Tests-trunk-java7/lucene/build/suggest/lucene-suggest-5.0-SNAPSHOT.jar:/usr/home/hudson/hudson-slave/workspace/Lucene-Solr-Tests-trunk-java7/lucene/build/grouping/lucene-grouping-5.0-SNAPSHOT.jar:/usr/home/hudson/hudson-slave/workspace/Lucene-Solr-Tests-trunk-java7/lucene/build/queries/lucene-queries-5.0-SNAPSHOT.jar:/usr/home/hudson/hudson-slave/workspace/Lucene-Solr-Tests-trunk-java7/lucene/build/queryparser/lucene-queryparser-5.0-SNAPSHOT.jar:/usr/home/hudson/hudson-slave/workspace/Lucene-Solr-Tests-trunk-java7/solr/core/lib/cglib-nodep-2.2.jar:/usr/home/hudson/hudson-slave/workspace/Lucene-Solr-Tests-trunk-java7/solr/core/lib/commons-cli-1.2.jar:/usr/home/hudson/hudson-slave/workspace/Lucene-Solr-Tests-trunk-java7/solr/core/lib/commons-codec-1.7.jar:/usr/home/hudson/hudson-slave/workspace/Lucene-Solr-Tests-trunk-java7/solr/core/lib/commons-fileupload-1.2.1.jar:/usr/home/hudson/hudson-slave/workspace/Lucene-Solr-Tests-trunk-java7/solr/core/lib/commons-lang-2.6.jar:/usr/home/hudson/hudson-slave/workspace/Lucene-Solr-Tests-trunk-java7/solr/core/lib/easymock-3.0.jar:/usr/home/hudson/hudson-slave/workspace/Lucene-Solr-Tests-trunk-java7/solr/core/lib/guava-13.0.1.jar:/usr/home/hudson/hudson-slave/workspace/Lucene-Solr-Tests-trunk-java7/solr/core/lib/javax.servlet-api-3.0.1.jar:/usr/home/hudson/hudson-slave/workspace/Lucene-Solr-Tests-trunk-java7/solr/core/lib/objenesis-1.2.jar:/usr/home/hudson/hudson-slave/workspace/Lucene-Solr-Tests-trunk-java7/solr/core/lib/spatial4j-0.3.jar:/usr/home/hudson/hudson-slave/workspace/Lucene-Solr-Tests-trunk-java7/solr/solrj/lib/commons-io-2.1.jar:/usr/home/hudson/hudson-slave/workspace/Lucene-Solr-Tests-trunk-java7/solr/solrj/lib/httpclient-4.1.3.jar:/usr/home/hudson/hudson-slave/workspace/Lucene-Solr-Tests-trunk-java7/solr/solrj/lib/httpcore-4.1.4.jar:/usr/home/hudson/hudson-slave/workspace/Lucene-Solr-Tests-trunk-java7/solr/solrj/lib/httpmime-4.1.3.jar:/usr/home/hudson/hudson-slave/workspace/Lucene-Solr-Tests-trunk-java7/solr/solrj/lib/jcl-over-slf4j-1.6.4.jar:/usr/home/hudson/hudson-slave/workspace/Lucene-Solr-Tests-trunk-java7/solr/solrj/lib/slf4j-api-1.6.4.jar:/usr/home/hudson/hudson-slave/workspace/Lucene-Solr-Tests-trunk-java7/solr/solrj/lib/slf4j-jdk14-1.6.4.jar:/usr/home/hudson/hudson-slave/workspace/Lucene-Solr-Tests-trunk-java7/solr/solrj/lib/wstx-asl-3.2.7.jar:/usr/home/hudson/hudson-slave/workspace/Lucene-Solr-Tests-trunk-java7/solr/solrj/lib/zookeeper-3.4.5.jar:/usr/home/hudson/hudson-slave/workspace/Lucene-Solr-Tests-trunk-java7/solr/example/lib/jetty-continuation-8.1.8.v20121106.jar:/usr/home/hudson/hudson-slave/workspace/Lucene-Solr-Tests-trunk-java7/solr/example/lib/jetty-deploy-8.1.8.v20121106.jar:/usr/home/hudson/hudson-slave/workspace/Lucene-Solr-Tests-trunk-java7/solr/example/lib/jetty-http-8.1.8.v20121106.jar:/usr/home/hudson/hudson-slave/workspace/Lucene-Solr-Tests-trunk-java7/solr/example/lib/jetty-io-8.1.8.v20121106.jar:/usr/home/hudson/hudson-slave/workspace/Lucene-Solr-Tests-trunk-java7/solr/example/lib/jetty-jmx-8.1.8.v20121106.jar:/usr/home/hudson/hudson-slave/workspace/Lucene-Solr-Tests-trunk-java7/solr/example/lib/jetty-security-8.1.8.v20121106.jar:/usr/home/hudson/hudson-slave/workspace/Lucene-Solr-Tests-trunk-java7/solr/example/lib/jetty-server-8.1.8.v20121106.jar:/usr/home/hudson/hudson-slave/workspace/Lucene-Solr-Tests-trunk-java7/solr/example/lib/jetty-servlet-8.1.8.v20121106.jar:/usr/home/hudson/hudson-slave/workspace/Lucene-Solr-Tests-trunk-java7/solr/example/lib/jetty-util-8.1.8.v20121106.jar:/usr/home/hudson/hudson-slave/workspace/Lucene-Solr-Tests-trunk-java7/solr/example/lib/jetty-webapp-8.1.8.v20121106.jar:/usr/home/hudson/hudson-slave/workspace/Lucene-Solr-Tests-trunk-java7/solr/example/lib/jetty-xml-8.1.8.v20121106.jar:/usr/home/hudson/hudson-slave/workspace/Lucene-Solr-Tests-trunk-java7/solr/example/lib/servlet-api-3.0.jar:/usr/home/hudson/hudson-slave/workspace/Lucene-Solr-Tests-trunk-java7/solr/example/example-DIH/solr/db/lib/derby-10.9.1.0.jar:/usr/home/hudson/hudson-slave/workspace/Lucene-Solr-Tests-trunk-java7/solr/example/example-DIH/solr/db/lib/hsqldb-1.8.0.10.jar:/usr/home/hudson/hudson-slave/workspace/Lucene-Solr-Tests-trunk-java7/lucene/build/core/classes/java:/usr/home/hudson/hudson-slave/workspace/Lucene-Solr-Tests-trunk-java7/lucene/test-framework/lib/junit-4.10.jar:/usr/home/hudson/hudson-slave/workspace/Lucene-Solr-Tests-trunk-java7/lucene/test-framework/lib/randomizedtesting-runner-2.0.8.jar:/home/hudson/hudson-slave/tools/hudson.tasks.Ant_AntInstallation/ant-1.8.2/lib/ant-launcher.jar:/home/hudson/.ant/lib/ivy-2.2.0.jar:/home/hudson/hudson-slave/tools/hudson.tasks.Ant_AntInstallation/ant-1.8.2/lib/ant-commons-logging.jar:/home/hudson/hudson-slave/tools/hudson.tasks.Ant_AntInstallation/ant-1.8.2/lib/ant-apache-regexp.jar:/home/hudson/hudson-slave/tools/hudson.tasks.Ant_AntInstallation/ant-1.8.2/lib/ant-apache-oro.jar:/home/hudson/hudson-slave/tools/hudson.tasks.Ant_AntInstallation/ant-1.8.2/lib/ant-swing.jar:/home/hudson/hudson-slave/tools/hudson.tasks.Ant_AntInstallation/ant-1.8.2/lib/ant-jdepend.jar:/home/hudson/hudson-slave/tools/hudson.tasks.Ant_AntInstallation/ant-1.8.2/lib/ant-apache-xalan2.jar:/home/hudson/hudson-slave/tools/hudson.tasks.Ant_AntInstallation/ant-1.8.2/lib/ant-apache-bsf.jar:/home/hudson/hudson-slave/tools/hudson.tasks.Ant_AntInstallation/ant-1.8.2/lib/ant-junit4.jar:/home/hudson/hudson-slave/tools/hudson.tasks.Ant_AntInstallation/ant-1.8.2/lib/ant-commons-net.jar:/home/hudson/hudson-slave/tools/hudson.tasks.Ant_AntInstallation/ant-1.8.2/lib/ant-antlr.jar:/home/hudson/hudson-slave/tools/hudson.tasks.Ant_AntInstallation/ant-1.8.2/lib/ant-junit.jar:/home/hudson/hudson-slave/tools/hudson.tasks.Ant_AntInstallation/ant-1.8.2/lib/ant-jmf.jar:/home/hudson/hudson-slave/tools/hudson.tasks.Ant_AntInstallation/ant-1.8.2/lib/ant-netrexx.jar:/home/hudson/hudson-slave/tools/hudson.tasks.Ant_AntInstallation/ant-1.8.2/lib/ant-apache-log4j.jar:/home/hudson/hudson-slave/tools/hudson.tasks.Ant_AntInstallation/ant-1.8.2/lib/ant-apache-resolver.jar:/home/hudson/hudson-slave/tools/hudson.tasks.Ant_AntInstallation/ant-1.8.2/lib/ant.jar:/home/hudson/hudson-slave/tools/hudson.tasks.Ant_AntInstallation/ant-1.8.2/lib/ant-jsch.jar:/home/hudson/hudson-slave/tools/hudson.tasks.Ant_AntInstallation/ant-1.8.2/lib/ant-testutil.jar:/home/hudson/hudson-slave/tools/hudson.tasks.Ant_AntInstallation/ant-1.8.2/lib/ant-apache-bcel.jar:/home/hudson/hudson-slave/tools/hudson.tasks.Ant_AntInstallation/ant-1.8.2/lib/ant-jai.jar:/home/hudson/hudson-slave/tools/hudson.tasks.Ant_AntInstallation/ant-1.8.2/lib/ant-javamail.jar:/usr/local/openjdk7/lib/tools.jar:/home/hudson/.ivy2/cache/com.carrotsearch.randomizedtesting/junit4-ant/jars/junit4-ant-2.0.8.jar
[junit4:junit4]   2> 118 T393 oaz.Environment.logEnv Server environment:java.library.path=/usr/local/openjdk7/jre/lib/amd64/server:/usr/local/openjdk7/jre/lib/amd64:/usr/local/openjdk7/jre/../lib/amd64:/usr/local/openjdk6/jre/lib/amd64/server:/usr/local/openjdk6/jre/lib/amd64:/usr/local/openjdk6/jre/../lib/amd64:/usr/java/packages/lib/amd64:/lib:/usr/lib:/usr/local/lib
[junit4:junit4]   2> 118 T393 oaz.Environment.logEnv Server environment:java.io.tmpdir=.
[junit4:junit4]   2> 118 T393 oaz.Environment.logEnv Server environment:java.compiler=<NA>
[junit4:junit4]   2> 118 T393 oaz.Environment.logEnv Server environment:os.name=FreeBSD
[junit4:junit4]   2> 119 T393 oaz.Environment.logEnv Server environment:os.arch=amd64
[junit4:junit4]   2> 119 T393 oaz.Environment.logEnv Server environment:os.version=9.0-RELEASE
[junit4:junit4]   2> 119 T393 oaz.Environment.logEnv Server environment:user.name=hudson
[junit4:junit4]   2> 119 T393 oaz.Environment.logEnv Server environment:user.home=/home/hudson
[junit4:junit4]   2> 119 T393 oaz.Environment.logEnv Server environment:user.dir=/usr/home/hudson/hudson-slave/workspace/Lucene-Solr-Tests-trunk-java7/solr/build/solr-core/test/J0
[junit4:junit4]   2> 170 T393 oazs.ZooKeeperServer.setTickTime tickTime set to 1000
[junit4:junit4]   2> 170 T393 oazs.ZooKeeperServer.setMinSessionTimeout minSessionTimeout set to -1
[junit4:junit4]   2> 170 T393 oazs.ZooKeeperServer.setMaxSessionTimeout maxSessionTimeout set to -1
[junit4:junit4]   2> 178 T393 oazs.NIOServerCnxnFactory.configure binding to port 0.0.0.0/0.0.0.0:0
[junit4:junit4]   2> 227 T392 oasc.ZkTestServer.run start zk server on port:57486
[junit4:junit4]   2> 287 T393 oazsp.FileTxnSnapLog.save Snapshotting: 0x0 to /usr/home/hudson/hudson-slave/workspace/Lucene-Solr-Tests-trunk-java7/solr/build/solr-core/test/J0/./org.apache.solr.cloud.BasicDistributedZkTest-1359964174397/zookeeper/server1/data/version-2/snapshot.0
[junit4:junit4]   2> 354 T392 oaz.Environment.logEnv Client environment:zookeeper.version=3.4.5-1392090, built on 09/30/2012 17:52 GMT
[junit4:junit4]   2> 355 T392 oaz.Environment.logEnv Client environment:host.name=lucene.zones.apache.org
[junit4:junit4]   2> 355 T392 oaz.Environment.logEnv Client environment:java.version=1.7.0_09
[junit4:junit4]   2> 355 T392 oaz.Environment.logEnv Client environment:java.vendor=Oracle Corporation
[junit4:junit4]   2> 356 T392 oaz.Environment.logEnv Client environment:java.home=/usr/local/openjdk7/jre
[junit4:junit4]   2> 356 T392 oaz.Environment.logEnv Client environment:java.class.path=/usr/home/hudson/hudson-slave/workspace/Lucene-Solr-Tests-trunk-java7/solr/build/solr-core/classes/test:/usr/home/hudson/hudson-slave/workspace/Lucene-Solr-Tests-trunk-java7/solr/build/solr-test-framework/classes/java:/usr/home/hudson/hudson-slave/workspace/Lucene-Solr-Tests-trunk-java7/solr/build/solr-core/test-files:/usr/home/hudson/hudson-slave/workspace/Lucene-Solr-Tests-trunk-java7/lucene/build/test-framework/classes/java:/usr/home/hudson/hudson-slave/workspace/Lucene-Solr-Tests-trunk-java7/lucene/build/codecs/classes/java:/usr/home/hudson/hudson-slave/workspace/Lucene-Solr-Tests-trunk-java7/solr/build/solr-solrj/classes/java:/usr/home/hudson/hudson-slave/workspace/Lucene-Solr-Tests-trunk-java7/solr/build/solr-core/classes/java:/usr/home/hudson/hudson-slave/workspace/Lucene-Solr-Tests-trunk-java7/lucene/build/analysis/common/lucene-analyzers-common-5.0-SNAPSHOT.jar:/usr/home/hudson/hudson-slave/workspace/Lucene-Solr-Tests-trunk-java7/lucene/build/analysis/kuromoji/lucene-analyzers-kuromoji-5.0-SNAPSHOT.jar:/usr/home/hudson/hudson-slave/workspace/Lucene-Solr-Tests-trunk-java7/lucene/build/analysis/phonetic/lucene-analyzers-phonetic-5.0-SNAPSHOT.jar:/usr/home/hudson/hudson-slave/workspace/Lucene-Solr-Tests-trunk-java7/lucene/build/highlighter/lucene-highlighter-5.0-SNAPSHOT.jar:/usr/home/hudson/hudson-slave/workspace/Lucene-Solr-Tests-trunk-java7/lucene/build/memory/lucene-memory-5.0-SNAPSHOT.jar:/usr/home/hudson/hudson-slave/workspace/Lucene-Solr-Tests-trunk-java7/lucene/build/misc/lucene-misc-5.0-SNAPSHOT.jar:/usr/home/hudson/hudson-slave/workspace/Lucene-Solr-Tests-trunk-java7/lucene/build/spatial/lucene-spatial-5.0-SNAPSHOT.jar:/usr/home/hudson/hudson-slave/workspace/Lucene-Solr-Tests-trunk-java7/lucene/build/suggest/lucene-suggest-5.0-SNAPSHOT.jar:/usr/home/hudson/hudson-slave/workspace/Lucene-Solr-Tests-trunk-java7/lucene/build/grouping/lucene-grouping-5.0-SNAPSHOT.jar:/usr/home/hudson/hudson-slave/workspace/Lucene-Solr-Tests-trunk-java7/lucene/build/queries/lucene-queries-5.0-SNAPSHOT.jar:/usr/home/hudson/hudson-slave/workspace/Lucene-Solr-Tests-trunk-java7/lucene/build/queryparser/lucene-queryparser-5.0-SNAPSHOT.jar:/usr/home/hudson/hudson-slave/workspace/Lucene-Solr-Tests-trunk-java7/solr/core/lib/cglib-nodep-2.2.jar:/usr/home/hudson/hudson-slave/workspace/Lucene-Solr-Tests-trunk-java7/solr/core/lib/commons-cli-1.2.jar:/usr/home/hudson/hudson-slave/workspace/Lucene-Solr-Tests-trunk-java7/solr/core/lib/commons-codec-1.7.jar:/usr/home/hudson/hudson-slave/workspace/Lucene-Solr-Tests-trunk-java7/solr/core/lib/commons-fileupload-1.2.1.jar:/usr/home/hudson/hudson-slave/workspace/Lucene-Solr-Tests-trunk-java7/solr/core/lib/commons-lang-2.6.jar:/usr/home/hudson/hudson-slave/workspace/Lucene-Solr-Tests-trunk-java7/solr/core/lib/easymock-3.0.jar:/usr/home/hudson/hudson-slave/workspace/Lucene-Solr-Tests-trunk-java7/solr/core/lib/guava-13.0.1.jar:/usr/home/hudson/hudson-slave/workspace/Lucene-Solr-Tests-trunk-java7/solr/core/lib/javax.servlet-api-3.0.1.jar:/usr/home/hudson/hudson-slave/workspace/Lucene-Solr-Tests-trunk-java7/solr/core/lib/objenesis-1.2.jar:/usr/home/hudson/hudson-slave/workspace/Lucene-Solr-Tests-trunk-java7/solr/core/lib/spatial4j-0.3.jar:/usr/home/hudson/hudson-slave/workspace/Lucene-Solr-Tests-trunk-java7/solr/solrj/lib/commons-io-2.1.jar:/usr/home/hudson/hudson-slave/workspace/Lucene-Solr-Tests-trunk-java7/solr/solrj/lib/httpclient-4.1.3.jar:/usr/home/hudson/hudson-slave/workspace/Lucene-Solr-Tests-trunk-java7/solr/solrj/lib/httpcore-4.1.4.jar:/usr/home/hudson/hudson-slave/workspace/Lucene-Solr-Tests-trunk-java7/solr/solrj/lib/httpmime-4.1.3.jar:/usr/home/hudson/hudson-slave/workspace/Lucene-Solr-Tests-trunk-java7/solr/solrj/lib/jcl-over-slf4j-1.6.4.jar:/usr/home/hudson/hudson-slave/workspace/Lucene-Solr-Tests-trunk-java7/solr/solrj/lib/slf4j-api-1.6.4.jar:/usr/home/hudson/hudson-slave/workspace/Lucene-Solr-Tests-trunk-java7/solr/solrj/lib/slf4j-jdk14-1.6.4.jar:/usr/home/hudson/hudson-slave/workspace/Lucene-Solr-Tests-trunk-java7/solr/solrj/lib/wstx-asl-3.2.7.jar:/usr/home/hudson/hudson-slave/workspace/Lucene-Solr-Tests-trunk-java7/solr/solrj/lib/zookeeper-3.4.5.jar:/usr/home/hudson/hudson-slave/workspace/Lucene-Solr-Tests-trunk-java7/solr/example/lib/jetty-continuation-8.1.8.v20121106.jar:/usr/home/hudson/hudson-slave/workspace/Lucene-Solr-Tests-trunk-java7/solr/example/lib/jetty-deploy-8.1.8.v20121106.jar:/usr/home/hudson/hudson-slave/workspace/Lucene-Solr-Tests-trunk-java7/solr/example/lib/jetty-http-8.1.8.v20121106.jar:/usr/home/hudson/hudson-slave/workspace/Lucene-Solr-Tests-trunk-java7/solr/example/lib/jetty-io-8.1.8.v20121106.jar:/usr/home/hudson/hudson-slave/workspace/Lucene-Solr-Tests-trunk-java7/solr/example/lib/jetty-jmx-8.1.8.v20121106.jar:/usr/home/hudson/hudson-slave/workspace/Lucene-Solr-Tests-trunk-java7/solr/example/lib/jetty-security-8.1.8.v20121106.jar:/usr/home/hudson/hudson-slave/workspace/Lucene-Solr-Tests-trunk-java7/solr/example/lib/jetty-server-8.1.8.v20121106.jar:/usr/home/hudson/hudson-slave/workspace/Lucene-Solr-Tests-trunk-java7/solr/example/lib/jetty-servlet-8.1.8.v20121106.jar:/usr/home/hudson/hudson-slave/workspace/Lucene-Solr-Tests-trunk-java7/solr/example/lib/jetty-util-8.1.8.v20121106.jar:/usr/home/hudson/hudson-slave/workspace/Lucene-Solr-Tests-trunk-java7/solr/example/lib/jetty-webapp-8.1.8.v20121106.jar:/usr/home/hudson/hudson-slave/workspace/Lucene-Solr-Tests-trunk-java7/solr/example/lib/jetty-xml-8.1.8.v20121106.jar:/usr/home/hudson/hudson-slave/workspace/Lucene-Solr-Tests-trunk-java7/solr/example/lib/servlet-api-3.0.jar:/usr/home/hudson/hudson-slave/workspace/Lucene-Solr-Tests-trunk-java7/solr/example/example-DIH/solr/db/lib/derby-10.9.1.0.jar:/usr/home/hudson/hudson-slave/workspace/Lucene-Solr-Tests-trunk-java7/solr/example/example-DIH/solr/db/lib/hsqldb-1.8.0.10.jar:/usr/home/hudson/hudson-slave/workspace/Lucene-Solr-Tests-trunk-java7/lucene/build/core/classes/java:/usr/home/hudson/hudson-slave/workspace/Lucene-Solr-Tests-trunk-java7/lucene/test-framework/lib/junit-4.10.jar:/usr/home/hudson/hudson-slave/workspace/Lucene-Solr-Tests-trunk-java7/lucene/test-framework/lib/randomizedtesting-runner-2.0.8.jar:/home/hudson/hudson-slave/tools/hudson.tasks.Ant_AntInstallation/ant-1.8.2/lib/ant-launcher.jar:/home/hudson/.ant/lib/ivy-2.2.0.jar:/home/hudson/hudson-slave/tools/hudson.tasks.Ant_AntInstallation/ant-1.8.2/lib/ant-commons-logging.jar:/home/hudson/hudson-slave/tools/hudson.tasks.Ant_AntInstallation/ant-1.8.2/lib/ant-apache-regexp.jar:/home/hudson/hudson-slave/tools/hudson.tasks.Ant_AntInstallation/ant-1.8.2/lib/ant-apache-oro.jar:/home/hudson/hudson-slave/tools/hudson.tasks.Ant_AntInstallation/ant-1.8.2/lib/ant-swing.jar:/home/hudson/hudson-slave/tools/hudson.tasks.Ant_AntInstallation/ant-1.8.2/lib/ant-jdepend.jar:/home/hudson/hudson-slave/tools/hudson.tasks.Ant_AntInstallation/ant-1.8.2/lib/ant-apache-xalan2.jar:/home/hudson/hudson-slave/tools/hudson.tasks.Ant_AntInstallation/ant-1.8.2/lib/ant-apache-bsf.jar:/home/hudson/hudson-slave/tools/hudson.tasks.Ant_AntInstallation/ant-1.8.2/lib/ant-junit4.jar:/home/hudson/hudson-slave/tools/hudson.tasks.Ant_AntInstallation/ant-1.8.2/lib/ant-commons-net.jar:/home/hudson/hudson-slave/tools/hudson.tasks.Ant_AntInstallation/ant-1.8.2/lib/ant-antlr.jar:/home/hudson/hudson-slave/tools/hudson.tasks.Ant_AntInstallation/ant-1.8.2/lib/ant-junit.jar:/home/hudson/hudson-slave/tools/hudson.tasks.Ant_AntInstallation/ant-1.8.2/lib/ant-jmf.jar:/home/hudson/hudson-slave/tools/hudson.tasks.Ant_AntInstallation/ant-1.8.2/lib/ant-netrexx.jar:/home/hudson/hudson-slave/tools/hudson.tasks.Ant_AntInstallation/ant-1.8.2/lib/ant-apache-log4j.jar:/home/hudson/hudson-slave/tools/hudson.tasks.Ant_AntInstallation/ant-1.8.2/lib/ant-apache-resolver.jar:/home/hudson/hudson-slave/tools/hudson.tasks.Ant_AntInstallation/ant-1.8.2/lib/ant.jar:/home/hudson/hudson-slave/tools/hudson.tasks.Ant_AntInstallation/ant-1.8.2/lib/ant-jsch.jar:/home/hudson/hudson-slave/tools/hudson.tasks.Ant_AntInstallation/ant-1.8.2/lib/ant-testutil.jar:/home/hudson/hudson-slave/tools/hudson.tasks.Ant_AntInstallation/ant-1.8.2/lib/ant-apache-bcel.jar:/home/hudson/hudson-slave/tools/hudson.tasks.Ant_AntInstallation/ant-1.8.2/lib/ant-jai.jar:/home/hudson/hudson-slave/tools/hudson.tasks.Ant_AntInstallation/ant-1.8.2/lib/ant-javamail.jar:/usr/local/openjdk7/lib/tools.jar:/home/hudson/.ivy2/cache/com.carrotsearch.randomizedtesting/junit4-ant/jars/junit4-ant-2.0.8.jar
[junit4:junit4]   2> 358 T392 oaz.Environment.logEnv Client environment:java.library.path=/usr/local/openjdk7/jre/lib/amd64/server:/usr/local/openjdk7/jre/lib/amd64:/usr/local/openjdk7/jre/../lib/amd64:/usr/local/openjdk6/jre/lib/amd64/server:/usr/local/openjdk6/jre/lib/amd64:/usr/local/openjdk6/jre/../lib/amd64:/usr/java/packages/lib/amd64:/lib:/usr/lib:/usr/local/lib
[junit4:junit4]   2> 359 T392 oaz.Environment.logEnv Client environment:java.io.tmpdir=.
[junit4:junit4]   2> 359 T392 oaz.Environment.logEnv Client environment:java.compiler=<NA>
[junit4:junit4]   2> 359 T392 oaz.Environment.logEnv Client environment:os.name=FreeBSD
[junit4:junit4]   2> 360 T392 oaz.Environment.logEnv Client environment:os.arch=amd64
[junit4:junit4]   2> 360 T392 oaz.Environment.logEnv Client environment:os.version=9.0-RELEASE
[junit4:junit4]   2> 361 T392 oaz.Environment.logEnv Client environment:user.name=hudson
[junit4:junit4]   2> 361 T392 oaz.Environment.logEnv Client environment:user.home=/home/hudson
[junit4:junit4]   2> 361 T392 oaz.Environment.logEnv Client environment:user.dir=/usr/home/hudson/hudson-slave/workspace/Lucene-Solr-Tests-trunk-java7/solr/build/solr-core/test/J0
[junit4:junit4]   2> 368 T392 oaz.ZooKeeper.<init> Initiating client connection, connectString=127.0.0.1:57486 sessionTimeout=10000 watcher=org.apache.solr.common.cloud.ConnectionManager@236a9eb8
[junit4:junit4]   2> 477 T392 oascc.ConnectionManager.waitForConnected Waiting for client to connect to ZooKeeper
[junit4:junit4]   2> 490 T398 oaz.ClientCnxn$SendThread.logStartConnect Opening socket connection to server localhost/127.0.0.1:57486. Will not attempt to authenticate using SASL (access denied ("javax.security.auth.AuthPermission" "getLoginConfiguration"))
[junit4:junit4]   2> 493 T398 oaz.ClientCnxn$SendThread.primeConnection Socket connection established to localhost/127.0.0.1:57486, initiating session
[junit4:junit4]   2> 493 T394 oazs.NIOServerCnxnFactory.run Accepted socket connection from /140.211.11.196:57487
[junit4:junit4]   2> 527 T394 oazs.ZooKeeperServer.processConnectRequest Client attempting to establish new session at /140.211.11.196:57487
[junit4:junit4]   2> 545 T396 oazsp.FileTxnLog.append Creating new log file: log.1
[junit4:junit4]   2> 587 T396 oazs.ZooKeeperServer.finishSessionInit Established session 0x13ca42e798a0000 with negotiated timeout 10000 for client /140.211.11.196:57487
[junit4:junit4]   2> 588 T398 oaz.ClientCnxn$SendThread.onConnected Session establishment complete on server localhost/127.0.0.1:57486, sessionid = 0x13ca42e798a0000, negotiated timeout = 10000
[junit4:junit4]   2> 596 T399 oascc.ConnectionManager.process Watcher org.apache.solr.common.cloud.ConnectionManager@236a9eb8 name:ZooKeeperConnection Watcher:127.0.0.1:57486 got event WatchedEvent state:SyncConnected type:None path:null path:null type:None
[junit4:junit4]   2> 596 T392 oascc.ConnectionManager.waitForConnected Client is connected to ZooKeeper
[junit4:junit4]   2> 602 T392 oascc.SolrZkClient.makePath makePath: /solr
[junit4:junit4]   2> 688 T397 oazs.PrepRequestProcessor.pRequest2Txn Processed session termination for sessionid: 0x13ca42e798a0000
[junit4:junit4]   2> 690 T399 oaz.ClientCnxn$EventThread.run EventThread shut down
[junit4:junit4]   2> 690 T392 oaz.ZooKeeper.close Session: 0x13ca42e798a0000 closed
[junit4:junit4]   2> 690 T392 oaz.ZooKeeper.<init> Initiating client connection, connectString=127.0.0.1:57486/solr sessionTimeout=10000 watcher=org.apache.solr.common.cloud.ConnectionManager@79399317
[junit4:junit4]   2> 691 T394 oazs.NIOServerCnxn.closeSock Closed socket connection for client /140.211.11.196:57487 which had sessionid 0x13ca42e798a0000
[junit4:junit4]   2> 691 T392 oascc.ConnectionManager.waitForConnected Waiting for client to connect to ZooKeeper
[junit4:junit4]   2> 692 T400 oaz.ClientCnxn$SendThread.logStartConnect Opening socket connection to server localhost/127.0.0.1:57486. Will not attempt to authenticate using SASL (access denied ("javax.security.auth.AuthPermission" "getLoginConfiguration"))
[junit4:junit4]   2> 693 T400 oaz.ClientCnxn$SendThread.primeConnection Socket connection established to localhost/127.0.0.1:57486, initiating session
[junit4:junit4]   2> 693 T394 oazs.NIOServerCnxnFactory.run Accepted socket connection from /140.211.11.196:57488
[junit4:junit4]   2> 693 T394 oazs.ZooKeeperServer.processConnectRequest Client attempting to establish new session at /140.211.11.196:57488
[junit4:junit4]   2> 695 T396 oazs.ZooKeeperServer.finishSessionInit Established session 0x13ca42e798a0001 with negotiated timeout 10000 for client /140.211.11.196:57488
[junit4:junit4]   2> 695 T400 oaz.ClientCnxn$SendThread.onConnected Session establishment complete on server localhost/127.0.0.1:57486, sessionid = 0x13ca42e798a0001, negotiated timeout = 10000
[junit4:junit4]   2> 695 T401 oascc.ConnectionManager.process Watcher org.apache.solr.common.cloud.ConnectionManager@79399317 name:ZooKeeperConnection Watcher:127.0.0.1:57486/solr got event WatchedEvent state:SyncConnected type:None path:null path:null type:None
[junit4:junit4]   2> 696 T392 oascc.ConnectionManager.waitForConnected Client is connected to ZooKeeper
[junit4:junit4]   2> 703 T392 oascc.SolrZkClient.makePath makePath: /collections/collection1
[junit4:junit4]   2> 710 T392 oascc.SolrZkClient.makePath makePath: /collections/collection1/shards
[junit4:junit4]   2> 715 T392 oascc.SolrZkClient.makePath makePath: /collections/control_collection
[junit4:junit4]   2> 719 T392 oascc.SolrZkClient.makePath makePath: /collections/control_collection/shards
[junit4:junit4]   2> 725 T392 oasc.AbstractZkTestCase.putConfig put /usr/home/hudson/hudson-slave/workspace/Lucene-Solr-Tests-trunk-java7/solr/build/solr-core/test-files/solr/collection1/conf/solrconfig.xml to /configs/conf1/solrconfig.xml
[junit4:junit4]   2> 728 T392 oascc.SolrZkClient.makePath makePath: /configs/conf1/solrconfig.xml
[junit4:junit4]   2> 740 T392 oasc.AbstractZkTestCase.putConfig put /usr/home/hudson/hudson-slave/workspace/Lucene-Solr-Tests-trunk-java7/solr/build/solr-core/test-files/solr/collection1/conf/schema.xml to /configs/conf1/schema.xml
[junit4:junit4]   2> 743 T392 oascc.SolrZkClient.makePath makePath: /configs/conf1/schema.xml
[junit4:junit4]   2> 850 T392 oasc.AbstractZkTestCase.putConfig put /usr/home/hudson/hudson-slave/workspace/Lucene-Solr-Tests-trunk-java7/solr/build/solr-core/test-files/solr/collection1/conf/stopwords.txt to /configs/conf1/stopwords.txt
[junit4:junit4]   2> 851 T392 oascc.SolrZkClient.makePath makePath: /configs/conf1/stopwords.txt
[junit4:junit4]   2> 856 T392 oasc.AbstractZkTestCase.putConfig put /usr/home/hudson/hudson-slave/workspace/Lucene-Solr-Tests-trunk-java7/solr/build/solr-core/test-files/solr/collection1/conf/protwords.txt to /configs/conf1/protwords.txt
[junit4:junit4]   2> 857 T392 oascc.SolrZkClient.makePath makePath: /configs/conf1/protwords.txt
[junit4:junit4]   2> 862 T392 oasc.AbstractZkTestCase.putConfig put /usr/home/hudson/hudson-slave/workspace/Lucene-Solr-Tests-trunk-java7/solr/build/solr-core/test-files/solr/collection1/conf/currency.xml to /configs/conf1/currency.xml
[junit4:junit4]   2> 863 T392 oascc.SolrZkClient.makePath makePath: /configs/conf1/currency.xml
[junit4:junit4]   2> 868 T392 oasc.AbstractZkTestCase.putConfig put /usr/home/hudson/hudson-slave/workspace/Lucene-Solr-Tests-trunk-java7/solr/build/solr-core/test-files/solr/collection1/conf/open-exchange-rates.json to /configs/conf1/open-exchange-rates.json
[junit4:junit4]   2> 869 T392 oascc.SolrZkClient.makePath makePath: /configs/conf1/open-exchange-rates.json
[junit4:junit4]   2> 874 T392 oasc.AbstractZkTestCase.putConfig put /usr/home/hudson/hudson-slave/workspace/Lucene-Solr-Tests-trunk-java7/solr/build/solr-core/test-files/solr/collection1/conf/mapping-ISOLatin1Accent.txt to /configs/conf1/mapping-ISOLatin1Accent.txt
[junit4:junit4]   2> 875 T392 oascc.SolrZkClient.makePath makePath: /configs/conf1/mapping-ISOLatin1Accent.txt
[junit4:junit4]   2> 880 T392 oasc.AbstractZkTestCase.putConfig put /usr/home/hudson/hudson-slave/workspace/Lucene-Solr-Tests-trunk-java7/solr/build/solr-core/test-files/solr/collection1/conf/old_synonyms.txt to /configs/conf1/old_synonyms.txt
[junit4:junit4]   2> 881 T392 oascc.SolrZkClient.makePath makePath: /configs/conf1/old_synonyms.txt
[junit4:junit4]   2> 886 T392 oasc.AbstractZkTestCase.putConfig put /usr/home/hudson/hudson-slave/workspace/Lucene-Solr-Tests-trunk-java7/solr/build/solr-core/test-files/solr/collection1/conf/synonyms.txt to /configs/conf1/synonyms.txt
[junit4:junit4]   2> 887 T392 oascc.SolrZkClient.makePath makePath: /configs/conf1/synonyms.txt
[junit4:junit4]   2> 892 T397 oazs.PrepRequestProcessor.pRequest2Txn Processed session termination for sessionid: 0x13ca42e798a0001
[junit4:junit4]   2> 893 T401 oaz.ClientCnxn$EventThread.run EventThread shut down
[junit4:junit4]   2> 893 T392 oaz.ZooKeeper.close Session: 0x13ca42e798a0001 closed
[junit4:junit4]   2> 893 T394 oazs.NIOServerCnxn.closeSock Closed socket connection for client /140.211.11.196:57488 which had sessionid 0x13ca42e798a0001
[junit4:junit4]   2> 1085 T392 oejs.Server.doStart jetty-8.1.8.v20121106
[junit4:junit4]   2> 1097 T392 oejs.AbstractConnector.doStart Started SocketConnector@127.0.0.1:57489
[junit4:junit4]   2> 1098 T392 oass.SolrDispatchFilter.init SolrDispatchFilter.init()
[junit4:junit4]   2> 1098 T392 oasc.SolrResourceLoader.locateSolrHome JNDI not configured for solr (NoInitialContextEx)
[junit4:junit4]   2> 1099 T392 oasc.SolrResourceLoader.locateSolrHome using system property solr.solr.home: /usr/home/hudson/hudson-slave/workspace/Lucene-Solr-Tests-trunk-java7/solr/build/solr-core/test/J0/./org.apache.solr.cloud.BasicDistributedZkTest-controljetty-1359964175283
[junit4:junit4]   2> 1100 T392 oasc.CoreContainer$Initializer.initialize looking for solr.xml: /usr/home/hudson/hudson-slave/workspace/Lucene-Solr-Tests-trunk-java7/solr/build/solr-core/test/J0/./org.apache.solr.cloud.BasicDistributedZkTest-controljetty-1359964175283/solr.xml
[junit4:junit4]   2> 1101 T392 oasc.CoreContainer.<init> New CoreContainer 281542132
[junit4:junit4]   2> 1102 T392 oasc.CoreContainer.load Loading CoreContainer using Solr Home: '/usr/home/hudson/hudson-slave/workspace/Lucene-Solr-Tests-trunk-java7/solr/build/solr-core/test/J0/./org.apache.solr.cloud.BasicDistributedZkTest-controljetty-1359964175283/'
[junit4:junit4]   2> 1102 T392 oasc.SolrResourceLoader.<init> new SolrResourceLoader for directory: '/usr/home/hudson/hudson-slave/workspace/Lucene-Solr-Tests-trunk-java7/solr/build/solr-core/test/J0/./org.apache.solr.cloud.BasicDistributedZkTest-controljetty-1359964175283/'
[junit4:junit4]   2> 1165 T392 oashc.HttpShardHandlerFactory.getParameter Setting socketTimeout to: 60000
[junit4:junit4]   2> 1166 T392 oashc.HttpShardHandlerFactory.getParameter Setting urlScheme to: http://
[junit4:junit4]   2> 1166 T392 oashc.HttpShardHandlerFactory.getParameter Setting connTimeout to: 15000
[junit4:junit4]   2> 1167 T392 oashc.HttpShardHandlerFactory.getParameter Setting maxConnectionsPerHost to: 20
[junit4:junit4]   2> 1167 T392 oashc.HttpShardHandlerFactory.getParameter Setting corePoolSize to: 0
[junit4:junit4]   2> 1167 T392 oashc.HttpShardHandlerFactory.getParameter Setting maximumPoolSize to: 2147483647
[junit4:junit4]   2> 1168 T392 oashc.HttpShardHandlerFactory.getParameter Setting maxThreadIdleTime to: 5
[junit4:junit4]   2> 1168 T392 oashc.HttpShardHandlerFactory.getParameter Setting sizeOfQueue to: -1
[junit4:junit4]   2> 1169 T392 oashc.HttpShardHandlerFactory.getParameter Setting fairnessPolicy to: false
[junit4:junit4]   2> 1169 T392 oascsi.HttpClientUtil.createClient Creating new http client, config:maxConnectionsPerHost=20&maxConnections=10000&socketTimeout=60000&connTimeout=15000&retry=false
[junit4:junit4]   2> 1195 T392 oasc.CoreContainer.load Registering Log Listener
[junit4:junit4]   2> 1219 T392 oasc.CoreContainer.initZooKeeper Zookeeper client=127.0.0.1:57486/solr
[junit4:junit4]   2> 1250 T392 oasc.ZkController.checkChrootPath zkHost includes chroot
[junit4:junit4]   2> 1250 T392 oaz.ZooKeeper.<init> Initiating client connection, connectString=127.0.0.1:57486 sessionTimeout=60000 watcher=org.apache.solr.common.cloud.ConnectionManager@6f255853
[junit4:junit4]   2> 1251 T392 oascc.ConnectionManager.waitForConnected Waiting for client to connect to ZooKeeper
[junit4:junit4]   2> 1252 T411 oaz.ClientCnxn$SendThread.logStartConnect Opening socket connection to server localhost/127.0.0.1:57486. Will not attempt to authenticate using SASL (access denied ("javax.security.auth.AuthPermission" "getLoginConfiguration"))
[junit4:junit4]   2> 1253 T411 oaz.ClientCnxn$SendThread.primeConnection Socket connection established to localhost/127.0.0.1:57486, initiating session
[junit4:junit4]   2> 1253 T394 oazs.NIOServerCnxnFactory.run Accepted socket connection from /140.211.11.196:57490
[junit4:junit4]   2> 1254 T394 oazs.ZooKeeperServer.processConnectRequest Client attempting to establish new session at /140.211.11.196:57490
[junit4:junit4]   2> 1255 T396 oazs.ZooKeeperServer.finishSessionInit Established session 0x13ca42e798a0002 with negotiated timeout 20000 for client /140.211.11.196:57490
[junit4:junit4]   2> 1255 T411 oaz.ClientCnxn$SendThread.onConnected Session establishment complete on server localhost/127.0.0.1:57486, sessionid = 0x13ca42e798a0002, negotiated timeout = 20000
[junit4:junit4]   2> 1256 T412 oascc.ConnectionManager.process Watcher org.apache.solr.common.cloud.ConnectionManager@6f255853 name:ZooKeeperConnection Watcher:127.0.0.1:57486 got event WatchedEvent state:SyncConnected type:None path:null path:null type:None
[junit4:junit4]   2> 1256 T392 oascc.ConnectionManager.waitForConnected Client is connected to ZooKeeper
[junit4:junit4]   2> 1258 T397 oazs.PrepRequestProcessor.pRequest2Txn Processed session termination for sessionid: 0x13ca42e798a0002
[junit4:junit4]   2> 1259 T412 oaz.ClientCnxn$EventThread.run EventThread shut down
[junit4:junit4]   2> 1259 T392 oaz.ZooKeeper.close Session: 0x13ca42e798a0002 closed
[junit4:junit4]   2> 1260 T394 oazs.NIOServerCnxn.doIO WARNING caught end of stream exception EndOfStreamException: Unable to read additional data from client sessionid 0x13ca42e798a0002, likely client has closed socket
[junit4:junit4]   2> 	at org.apache.zookeeper.server.NIOServerCnxn.doIO(NIOServerCnxn.java:220)
[junit4:junit4]   2> 	at org.apache.zookeeper.server.NIOServerCnxnFactory.run(NIOServerCnxnFactory.java:208)
[junit4:junit4]   2> 	at java.lang.Thread.run(Thread.java:722)
[junit4:junit4]   2> 
[junit4:junit4]   2> 1261 T394 oazs.NIOServerCnxn.closeSock Closed socket connection for client /140.211.11.196:57490 which had sessionid 0x13ca42e798a0002
[junit4:junit4]   2> 1265 T392 oascsi.HttpClientUtil.createClient Creating new http client, config:maxConnections=500&maxConnectionsPerHost=16&socketTimeout=60000&connTimeout=15000
[junit4:junit4]   2> 1288 T392 oaz.ZooKeeper.<init> Initiating client connection, connectString=127.0.0.1:57486/solr sessionTimeout=30000 watcher=org.apache.solr.common.cloud.ConnectionManager@36e1d274
[junit4:junit4]   2> 1289 T392 oascc.ConnectionManager.waitForConnected Waiting for client to connect to ZooKeeper
[junit4:junit4]   2> 1290 T413 oaz.ClientCnxn$SendThread.logStartConnect Opening socket connection to server localhost/127.0.0.1:57486. Will not attempt to authenticate using SASL (access denied ("javax.security.auth.AuthPermission" "getLoginConfiguration"))
[junit4:junit4]   2> 1291 T413 oaz.ClientCnxn$SendThread.primeConnection Socket connection established to localhost/127.0.0.1:57486, initiating session
[junit4:junit4]   2> 1291 T394 oazs.NIOServerCnxnFactory.run Accepted socket connection from /140.211.11.196:57491
[junit4:junit4]   2> 1291 T394 oazs.ZooKeeperServer.processConnectRequest Client attempting to establish new session at /140.211.11.196:57491
[junit4:junit4]   2> 1319 T396 oazs.ZooKeeperServer.finishSessionInit Established session 0x13ca42e798a0003 with negotiated timeout 20000 for client /140.211.11.196:57491
[junit4:junit4]   2> 1319 T413 oaz.ClientCnxn$SendThread.onConnected Session establishment complete on server localhost/127.0.0.1:57486, sessionid = 0x13ca42e798a0003, negotiated timeout = 20000
[junit4:junit4]   2> 1320 T414 oascc.ConnectionManager.process Watcher org.apache.solr.common.cloud.ConnectionManager@36e1d274 name:ZooKeeperConnection Watcher:127.0.0.1:57486/solr got event WatchedEvent state:SyncConnected type:None path:null path:null type:None
[junit4:junit4]   2> 1320 T392 oascc.ConnectionManager.waitForConnected Client is connected to ZooKeeper
[junit4:junit4]   2> 1357 T397 oazs.PrepRequestProcessor.pRequest Got user-level KeeperException when processing sessionid:0x13ca42e798a0003 type:create cxid:0x2 zxid:0x1a txntype:-1 reqpath:n/a Error Path:/solr/overseer Error:KeeperErrorCode = NodeExists for /solr/overseer
[junit4:junit4]   2> 1368 T392 oascc.SolrZkClient.makePath makePath: /live_nodes
[junit4:junit4]   2> 1372 T392 oasc.ZkController.createEphemeralLiveNode Register node as live in ZooKeeper:/live_nodes/127.0.0.1:57489_
[junit4:junit4]   2> 1378 T397 oazs.PrepRequestProcessor.pRequest Got user-level KeeperException when processing sessionid:0x13ca42e798a0003 type:delete cxid:0x7 zxid:0x1c txntype:-1 reqpath:n/a Error Path:/solr/live_nodes/127.0.0.1:57489_ Error:KeeperErrorCode = NoNode for /solr/live_nodes/127.0.0.1:57489_
[junit4:junit4]   2> 1426 T392 oascc.SolrZkClient.makePath makePath: /live_nodes/127.0.0.1:57489_
[junit4:junit4]   2> 1432 T392 oascc.SolrZkClient.makePath makePath: /overseer_elect/election
[junit4:junit4]   2> 1507 T397 oazs.PrepRequestProcessor.pRequest Got user-level KeeperException when processing sessionid:0x13ca42e798a0003 type:delete cxid:0x15 zxid:0x21 txntype:-1 reqpath:n/a Error Path:/solr/overseer_elect/leader Error:KeeperErrorCode = NoNode for /solr/overseer_elect/leader
[junit4:junit4]   2> 1509 T392 oascc.SolrZkClient.makePath makePath: /overseer_elect/leader
[junit4:junit4]   2> 1544 T392 oasc.Overseer.start Overseer (id=89126612155105283-127.0.0.1:57489_-n_0000000000) starting
[junit4:junit4]   2> 1545 T397 oazs.PrepRequestProcessor.pRequest Got user-level KeeperException when processing sessionid:0x13ca42e798a0003 type:create cxid:0x1a zxid:0x23 txntype:-1 reqpath:n/a Error Path:/solr/overseer Error:KeeperErrorCode = NodeExists for /solr/overseer
[junit4:junit4]   2> 1568 T397 oazs.PrepRequestProcessor.pRequest Got user-level KeeperException when processing sessionid:0x13ca42e798a0003 type:create cxid:0x1b zxid:0x24 txntype:-1 reqpath:n/a Error Path:/solr/overseer Error:KeeperErrorCode = NodeExists for /solr/overseer
[junit4:junit4]   2> 1570 T397 oazs.PrepRequestProcessor.pRequest Got user-level KeeperException when processing sessionid:0x13ca42e798a0003 type:create cxid:0x1c zxid:0x25 txntype:-1 reqpath:n/a Error Path:/solr/overseer Error:KeeperErrorCode = NodeExists for /solr/overseer
[junit4:junit4]   2> 1580 T397 oazs.PrepRequestProcessor.pRequest Got user-level KeeperException when processing sessionid:0x13ca42e798a0003 type:create cxid:0x1d zxid:0x26 txntype:-1 reqpath:n/a Error Path:/solr/overseer Error:KeeperErrorCode = NodeExists for /solr/overseer
[junit4:junit4]   2> 1588 T416 oasc.OverseerCollectionProcessor.run Process current queue of collection creations
[junit4:junit4]   2> 1589 T392 oascc.SolrZkClient.makePath makePath: /clusterstate.json
[junit4:junit4]   2> 1593 T392 oascc.ZkStateReader.createClusterStateWatchersAndUpdate Updating cluster state from ZooKeeper... 
[junit4:junit4]   2> 1615 T415 oasc.Overseer$ClusterStateUpdater.run Starting to work on the main queue
[junit4:junit4]   2> 1626 T417 oasc.CoreContainer.create Creating SolrCore 'collection1' using instanceDir: /usr/home/hudson/hudson-slave/workspace/Lucene-Solr-Tests-trunk-java7/solr/build/solr-core/test/J0/./org.apache.solr.cloud.BasicDistributedZkTest-controljetty-1359964175283/collection1
[junit4:junit4]   2> 1626 T417 oasc.ZkController.createCollectionZkNode Check for collection zkNode:control_collection
[junit4:junit4]   2> 1627 T417 oasc.ZkController.createCollectionZkNode Collection zkNode exists
[junit4:junit4]   2> 1628 T417 oasc.ZkController.readConfigName Load collection config from:/collections/control_collection
[junit4:junit4]   2> 1630 T417 oasc.SolrResourceLoader.<init> new SolrResourceLoader for directory: '/usr/home/hudson/hudson-slave/workspace/Lucene-Solr-Tests-trunk-java7/solr/build/solr-core/test/J0/./org.apache.solr.cloud.BasicDistributedZkTest-controljetty-1359964175283/collection1/'
[junit4:junit4]   2> 1632 T417 oasc.SolrResourceLoader.replaceClassLoader Adding 'file:/usr/home/hudson/hudson-slave/workspace/Lucene-Solr-Tests-trunk-java7/solr/build/solr-core/test/J0/org.apache.solr.cloud.BasicDistributedZkTest-controljetty-1359964175283/collection1/lib/classes/' to classloader
[junit4:junit4]   2> 1632 T417 oasc.SolrResourceLoader.replaceClassLoader Adding 'file:/usr/home/hudson/hudson-slave/workspace/Lucene-Solr-Tests-trunk-java7/solr/build/solr-core/test/J0/org.apache.solr.cloud.BasicDistributedZkTest-controljetty-1359964175283/collection1/lib/README' to classloader
[junit4:junit4]   2> 1719 T417 oasc.SolrConfig.<init> Using Lucene MatchVersion: LUCENE_50
[junit4:junit4]   2> 1804 T417 oasc.SolrConfig.<init> Loaded SolrConfig: solrconfig.xml
[junit4:junit4]   2> 1906 T417 oass.IndexSchema.readSchema Reading Solr Schema
[junit4:junit4]   2> 1913 T417 oass.IndexSchema.readSchema Schema name=test
[junit4:junit4]   2> 2666 T417 oass.OpenExchangeRatesOrgProvider.init Initialized with rates=open-exchange-rates.json, refreshInterval=1440.
[junit4:junit4]   2> 2679 T417 oass.IndexSchema.readSchema default search field in schema is text
[junit4:junit4]   2> 2683 T417 oass.IndexSchema.readSchema unique key field: id
[junit4:junit4]   2> 2706 T417 oass.FileExchangeRateProvider.reload Reloading exchange rates from file currency.xml
[junit4:junit4]   2> 2712 T417 oass.FileExchangeRateProvider.reload Reloading exchange rates from file currency.xml
[junit4:junit4]   2> 2718 T417 oass.OpenExchangeRatesOrgProvider.reload Reloading exchange rates from open-exchange-rates.json
[junit4:junit4]   2> 2720 T417 oass.OpenExchangeRatesOrgProvider.reload Reloading exchange rates from open-exchange-rates.json
[junit4:junit4]   2> 2722 T417 oasc.SolrCore.<init> [collection1] Opening new SolrCore at /usr/home/hudson/hudson-slave/workspace/Lucene-Solr-Tests-trunk-java7/solr/build/solr-core/test/J0/./org.apache.solr.cloud.BasicDistributedZkTest-controljetty-1359964175283/collection1/, dataDir=./org.apache.solr.cloud.BasicDistributedZkTest-1359964174397/control/data/
[junit4:junit4]   2> 2722 T417 oasc.JmxMonitoredMap.<init> JMX monitoring is enabled. Adding Solr mbeans to JMX Server: com.sun.jmx.mbeanserver.JmxMBeanServer@5c1a7261
[junit4:junit4]   2> 2723 T417 oasc.SolrCore.initDirectoryFactory solr.StandardDirectoryFactory
[junit4:junit4]   2> 2763 T417 oasc.CachingDirectoryFactory.get return new directory for /usr/home/hudson/hudson-slave/workspace/Lucene-Solr-Tests-trunk-java7/solr/build/solr-core/test/J0/./org.apache.solr.cloud.BasicDistributedZkTest-1359964174397/control/data forceNew:false
[junit4:junit4]   2> 2763 T417 oasc.CachingDirectoryFactory.close Releasing directory:/usr/home/hudson/hudson-slave/workspace/Lucene-Solr-Tests-trunk-java7/solr/build/solr-core/test/J0/./org.apache.solr.cloud.BasicDistributedZkTest-1359964174397/control/data
[junit4:junit4]   2> 2764 T417 oasc.SolrCore.getNewIndexDir New index directory detected: old=null new=./org.apache.solr.cloud.BasicDistributedZkTest-1359964174397/control/data/index/
[junit4:junit4]   2> 2765 T417 oasc.SolrCore.initIndex WARNING [collection1] Solr index directory './org.apache.solr.cloud.BasicDistributedZkTest-1359964174397/control/data/index' doesn't exist. Creating new index...
[junit4:junit4]   2> 2766 T417 oasc.CachingDirectoryFactory.get return new directory for /usr/home/hudson/hudson-slave/workspace/Lucene-Solr-Tests-trunk-java7/solr/build/solr-core/test/J0/./org.apache.solr.cloud.BasicDistributedZkTest-1359964174397/control/data/index forceNew:false
[junit4:junit4]   2> 2788 T417 oasc.SolrDeletionPolicy.onCommit SolrDeletionPolicy.onCommit: commits:num=1
[junit4:junit4]   2> 		commit{dir=RateLimitedDirectoryWrapper(org.apache.lucene.store.NIOFSDirectory@/usr/home/hudson/hudson-slave/workspace/Lucene-Solr-Tests-trunk-java7/solr/build/solr-core/test/J0/org.apache.solr.cloud.BasicDistributedZkTest-1359964174397/control/data/index lockFactory=org.apache.lucene.store.NativeFSLockFactory@46615a78),segFN=segments_1,generation=1,filenames=[segments_1]
[junit4:junit4]   2> 2789 T417 oasc.SolrDeletionPolicy.updateCommits newest commit = 1[segments_1]
[junit4:junit4]   2> 2790 T417 oasc.CachingDirectoryFactory.close Releasing directory:/usr/home/hudson/hudson-slave/workspace/Lucene-Solr-Tests-trunk-java7/solr/build/solr-core/test/J0/./org.apache.solr.cloud.BasicDistributedZkTest-1359964174397/control/data/index
[junit4:junit4]   2> 2790 T417 oasc.SolrCore.initWriters created xml: solr.XMLResponseWriter
[junit4:junit4]   2> 2792 T417 oasup.UpdateRequestProcessorChain.init inserting DistributedUpdateProcessorFactory into updateRequestProcessorChain "dedupe"
[junit4:junit4]   2> 2792 T417 oasup.UpdateRequestProcessorChain.init inserting DistributedUpdateProcessorFactory into updateRequestProcessorChain "dedupe-allfields"
[junit4:junit4]   2> 2792 T417 oasup.UpdateRequestProcessorChain.init inserting DistributedUpdateProcessorFactory into updateRequestProcessorChain "stored_sig"
[junit4:junit4]   2> 2793 T417 oasup.UpdateRequestProcessorChain.init inserting DistributedUpdateProcessorFactory into updateRequestProcessorChain "uniq-fields"
[junit4:junit4]   2> 2793 T417 oasup.UpdateRequestProcessorChain.init inserting DistributedUpdateProcessorFactory into updateRequestProcessorChain "distrib-dup-test-chain-implicit"
[junit4:junit4]   2> 2794 T417 oasc.RequestHandlers.initHandlersFromConfig adding lazy requestHandler: solr.ReplicationHandler
[junit4:junit4]   2> 2794 T417 oasc.RequestHandlers.initHandlersFromConfig created /replication: solr.ReplicationHandler
[junit4:junit4]   2> 2794 T417 oasc.RequestHandlers.initHandlersFromConfig created standard: solr.StandardRequestHandler
[junit4:junit4]   2> 2795 T417 oasc.RequestHandlers.initHandlersFromConfig created /get: solr.RealTimeGetHandler
[junit4:junit4]   2> 2795 T417 oasc.RequestHandlers.initHandlersFromConfig created dismax: solr.SearchHandler
[junit4:junit4]   2> 2796 T417 oasc.RequestHandlers.initHandlersFromConfig created mock: org.apache.solr.core.MockQuerySenderListenerReqHandler
[junit4:junit4]   2> 2796 T417 oasc.RequestHandlers.initHandlersFromConfig created /admin/: org.apache.solr.handler.admin.AdminHandlers
[junit4:junit4]   2> 2797 T417 oasc.RequestHandlers.initHandlersFromConfig created defaults: solr.StandardRequestHandler
[junit4:junit4]   2> 2797 T417 oasc.RequestHandlers.initHandlersFromConfig adding lazy requestHandler: solr.StandardRequestHandler
[junit4:junit4]   2> 2797 T417 oasc.RequestHandlers.initHandlersFromConfig created lazy: solr.StandardRequestHandler
[junit4:junit4]   2> 2798 T417 oasc.RequestHandlers.initHandlersFromConfig created /update: solr.UpdateRequestHandler
[junit4:junit4]   2> 2798 T417 oasc.RequestHandlers.initHandlersFromConfig created /terms: org.apache.solr.handler.component.SearchHandler
[junit4:junit4]   2> 2799 T417 oasc.RequestHandlers.initHandlersFromConfig created spellCheckCompRH: org.apache.solr.handler.component.SearchHandler
[junit4:junit4]   2> 2799 T417 oasc.RequestHandlers.initHandlersFromConfig created spellCheckCompRH_Direct: org.apache.solr.handler.component.SearchHandler
[junit4:junit4]   2> 2799 T417 oasc.RequestHandlers.initHandlersFromConfig created spellCheckWithWordbreak: org.apache.solr.handler.component.SearchHandler
[junit4:junit4]   2> 2800 T417 oasc.RequestHandlers.initHandlersFromConfig created spellCheckWithWordbreak_Direct: org.apache.solr.handler.component.SearchHandler
[junit4:junit4]   2> 2800 T417 oasc.RequestHandlers.initHandlersFromConfig created spellCheckCompRH1: org.apache.solr.handler.component.SearchHandler
[junit4:junit4]   2> 2801 T417 oasc.RequestHandlers.initHandlersFromConfig created mltrh: org.apache.solr.handler.component.SearchHandler
[junit4:junit4]   2> 2801 T417 oasc.RequestHandlers.initHandlersFromConfig created tvrh: org.apache.solr.handler.component.SearchHandler
[junit4:junit4]   2> 2802 T417 oasc.RequestHandlers.initHandlersFromConfig created /mlt: solr.MoreLikeThisHandler
[junit4:junit4]   2> 2802 T417 oasc.RequestHandlers.initHandlersFromConfig created /debug/dump: solr.DumpRequestHandler
[junit4:junit4]   2> 2818 T417 oashl.XMLLoader.init xsltCacheLifetimeSeconds=60
[junit4:junit4]   2> 2823 T417 oasc.SolrCore.initDeprecatedSupport WARNING solrconfig.xml uses deprecated <admin/gettableFiles>, Please update your config to use the ShowFileRequestHandler.
[junit4:junit4]   2> 2825 T417 oasc.SolrCore.initDeprecatedSupport WARNING adding ShowFileRequestHandler with hidden files: [SCHEMA.XML, OLD_SYNONYMS.TXT, STOPWORDS.TXT, PROTWORDS.TXT, OPEN-EXCHANGE-RATES.JSON, SYNONYMS.TXT, CURRENCY.XML, MAPPING-ISOLATIN1ACCENT.TXT]
[junit4:junit4]   2> 2828 T417 oasc.CachingDirectoryFactory.close Releasing directory:/usr/home/hudson/hudson-slave/workspace/Lucene-Solr-Tests-trunk-java7/solr/build/solr-core/test/J0/./org.apache.solr.cloud.BasicDistributedZkTest-1359964174397/control/data
[junit4:junit4]   2> 2830 T417 oass.SolrIndexSearcher.<init> Opening Searcher@46183eec main
[junit4:junit4]   2> 2831 T417 oasu.CommitTracker.<init> Hard AutoCommit: disabled
[junit4:junit4]   2> 2831 T417 oasu.CommitTracker.<init> Soft AutoCommit: disabled
[junit4:junit4]   2> 2832 T417 oashc.SpellCheckComponent.inform Initializing spell checkers
[junit4:junit4]   2> 2840 T417 oass.DirectSolrSpellChecker.init init: {name=direct,classname=DirectSolrSpellChecker,field=lowerfilt,minQueryLength=3}
[junit4:junit4]   2> 2899 T418 oasc.SolrCore.registerSearcher [collection1] Registered new searcher Searcher@46183eec main{StandardDirectoryReader(segments_1:1)}
[junit4:junit4]   2> 2904 T417 oasc.ZkController.publish publishing core=collection1 state=down
[junit4:junit4]   2> 2904 T417 oasc.ZkController.publish numShards not found on descriptor - reading it from system property
[junit4:junit4]   2> 2905 T397 oazs.PrepRequestProcessor.pRequest Got user-level KeeperException when processing sessionid:0x13ca42e798a0003 type:create cxid:0x50 zxid:0x29 txntype:-1 reqpath:n/a Error Path:/solr/overseer/queue Error:KeeperErrorCode = NoNode for /solr/overseer/queue
[junit4:junit4]   2> 3126 T415 oascc.ZkStateReader.updateClusterState Updating cloud state from ZooKeeper... 
[junit4:junit4]   2> 3128 T415 oasc.Overseer$ClusterStateUpdater.updateState Update state numShards=1 message={
[junit4:junit4]   2> 	  "operation":"state",
[junit4:junit4]   2> 	  "numShards":"1",
[junit4:junit4]   2> 	  "shard":null,
[junit4:junit4]   2> 	  "roles":null,
[junit4:junit4]   2> 	  "state":"down",
[junit4:junit4]   2> 	  "core":"collection1",
[junit4:junit4]   2> 	  "collection":"control_collection",
[junit4:junit4]   2> 	  "node_name":"127.0.0.1:57489_",
[junit4:junit4]   2> 	  "base_url":"http://127.0.0.1:57489"}
[junit4:junit4]   2> 3128 T415 oasc.Overseer$ClusterStateUpdater.createCollection Create collection control_collection with numShards 1
[junit4:junit4]   2> 3158 T415 oasc.Overseer$ClusterStateUpdater.updateState Assigning new node to shard shard=shard1
[junit4:junit4]   2> 3160 T397 oazs.PrepRequestProcessor.pRequest Got user-level KeeperException when processing sessionid:0x13ca42e798a0003 type:create cxid:0x58 zxid:0x2c txntype:-1 reqpath:n/a Error Path:/solr/overseer/queue-work Error:KeeperErrorCode = NoNode for /solr/overseer/queue-work
[junit4:junit4]   2> 3204 T414 oascc.ZkStateReader$2.process A cluster state change: WatchedEvent state:SyncConnected type:NodeDataChanged path:/clusterstate.json, has occurred - updating... (live nodes size: 1)
[junit4:junit4]   2> 3918 T417 oasc.CoreContainer.registerCore registering core: collection1
[junit4:junit4]   2> 3918 T417 oasc.ZkController.register Register replica - core:collection1 address:http://127.0.0.1:57489 collection:control_collection shard:shard1
[junit4:junit4]   2> 3928 T417 oascsi.HttpClientUtil.createClient Creating new http client, config:maxConnections=10000&maxConnectionsPerHost=20&connTimeout=30000&socketTimeout=30000&retry=false
[junit4:junit4]   2> 3949 T417 oascc.SolrZkClient.makePath makePath: /collections/control_collection/leader_elect/shard1/election
[junit4:junit4]   2> 4002 T397 oazs.PrepRequestProcessor.pRequest Got user-level KeeperException when processing sessionid:0x13ca42e798a0003 type:delete cxid:0x72 zxid:0x36 txntype:-1 reqpath:n/a Error Path:/solr/collections/control_collection/leaders Error:KeeperErrorCode = NoNode for /solr/collections/control_collection/leaders
[junit4:junit4]   2> 4003 T417 oasc.ShardLeaderElectionContext.runLeaderProcess Running the leader process.
[junit4:junit4]   2> 4004 T397 oazs.PrepRequestProcessor.pRequest Got user-level KeeperException when processing sessionid:0x13ca42e798a0003 type:create cxid:0x73 zxid:0x37 txntype:-1 reqpath:n/a Error Path:/solr/overseer Error:KeeperErrorCode = NodeExists for /solr/overseer
[junit4:junit4]   2> 4015 T417 oasc.ShardLeaderElectionContext.waitForReplicasToComeUp Enough replicas found to continue.
[junit4:junit4]   2> 4015 T417 oasc.ShardLeaderElectionContext.runLeaderProcess I may be the new leader - try and sync
[junit4:junit4]   2> 4016 T417 oasc.SyncStrategy.sync Sync replicas to http://127.0.0.1:57489/collection1/
[junit4:junit4]   2> 4016 T417 oasc.SyncStrategy.syncReplicas Sync Success - now sync replicas to me
[junit4:junit4]   2> 4017 T417 oasc.SyncStrategy.syncToMe http://127.0.0.1:57489/collection1/ has no replicas
[junit4:junit4]   2> 4017 T417 oasc.ShardLeaderElectionContext.runLeaderProcess I am the new leader: http://127.0.0.1:57489/collection1/
[junit4:junit4]   2> 4017 T417 oascc.SolrZkClient.makePath makePath: /collections/control_collection/leaders/shard1
[junit4:junit4]   2> 4030 T397 oazs.PrepRequestProcessor.pRequest Got user-level KeeperException when processing sessionid:0x13ca42e798a0003 type:create cxid:0x7d zxid:0x3b txntype:-1 reqpath:n/a Error Path:/solr/overseer Error:KeeperErrorCode = NodeExists for /solr/overseer
[junit4:junit4]   2> 4715 T415 oascc.ZkStateReader.updateClusterState Updating cloud state from ZooKeeper... 
[junit4:junit4]   2> 4772 T414 oascc.ZkStateReader$2.process A cluster state change: WatchedEvent state:SyncConnected type:NodeDataChanged path:/clusterstate.json, has occurred - updating... (live nodes size: 1)
[junit4:junit4]   2> 4809 T417 oasc.ZkController.register We are http://127.0.0.1:57489/collection1/ and leader is http://127.0.0.1:57489/collection1/
[junit4:junit4]   2> 4809 T417 oasc.ZkController.register No LogReplay needed for core=collection1 baseURL=http://127.0.0.1:57489
[junit4:junit4]   2> 4810 T417 oasc.ZkController.checkRecovery I am the leader, no recovery necessary
[junit4:junit4]   2> 4810 T417 oasc.ZkController.publish publishing core=collection1 state=active
[junit4:junit4]   2> 4810 T417 oasc.ZkController.publish numShards not found on descriptor - reading it from system property
[junit4:junit4]   2> 4814 T417 oascc.ZkStateReader.updateClusterState Updating cloud state from ZooKeeper... 
[junit4:junit4]   2> 4816 T392 oass.SolrDispatchFilter.init user.dir=/usr/home/hudson/hudson-slave/workspace/Lucene-Solr-Tests-trunk-java7/solr/build/solr-core/test/J0
[junit4:junit4]   2> 4816 T392 oass.SolrDispatchFilter.init SolrDispatchFilter.init() done
[junit4:junit4]   2> 4817 T392 oascsi.HttpClientUtil.createClient Creating new http client, config:maxConnections=128&maxConnectionsPerHost=32&followRedirects=false
[junit4:junit4]   2> 4830 T392 oascsi.HttpClientUtil.createClient Creating new http client, config:
[junit4:junit4]   2> 4848 T392 oaz.ZooKeeper.<init> Initiating client connection, connectString=127.0.0.1:57486/solr sessionTimeout=10000 watcher=org.apache.solr.common.cloud.ConnectionManager@418e4ed7
[junit4:junit4]   2> 4850 T392 oascc.ConnectionManager.waitForConnected Waiting for client to connect to ZooKeeper
[junit4:junit4]   2> 4850 T419 oaz.ClientCnxn$SendThread.logStartConnect Opening socket connection to server localhost/127.0.0.1:57486. Will not attempt to authenticate using SASL (access denied ("javax.security.auth.AuthPermission" "getLoginConfiguration"))
[junit4:junit4]   2> 4851 T419 oaz.ClientCnxn$SendThread.primeConnection Socket connection established to localhost/127.0.0.1:57486, initiating session
[junit4:junit4]   2> 4852 T394 oazs.NIOServerCnxnFactory.run Accepted socket connection from /140.211.11.196:57492
[junit4:junit4]   2> 4852 T394 oazs.ZooKeeperServer.processConnectRequest Client attempting to establish new session at /140.211.11.196:57492
[junit4:junit4]   2> 4854 T396 oazs.ZooKeeperServer.finishSessionInit Established session 0x13ca42e798a0004 with negotiated timeout 10000 for client /140.211.11.196:57492
[junit4:junit4]   2> 4854 T419 oaz.ClientCnxn$SendThread.onConnected Session establishment complete on server localhost/127.0.0.1:57486, sessionid = 0x13ca42e798a0004, negotiated timeout = 10000
[junit4:junit4]   2> 4855 T420 oascc.ConnectionManager.process Watcher org.apache.solr.common.cloud.ConnectionManager@418e4ed7 name:ZooKeeperConnection Watcher:127.0.0.1:57486/solr got event WatchedEvent state:SyncConnected type:None path:null path:null type:None
[junit4:junit4]   2> 4855 T392 oascc.ConnectionManager.waitForConnected Client is connected to ZooKeeper
[junit4:junit4]   2> 4857 T392 oascc.ZkStateReader.createClusterStateWatchersAndUpdate Updating cluster state from ZooKeeper... 
[junit4:junit4]   2> 4863 T392 oasc.ChaosMonkey.monkeyLog monkey: init - expire sessions:true cause connection loss:true
[junit4:junit4]   2> 5076 T392 oejs.Server.doStart jetty-8.1.8.v20121106
[junit4:junit4]   2> 5079 T392 oejs.AbstractConnector.doStart Started SocketConnector@127.0.0.1:57493
[junit4:junit4]   2> 5079 T392 oass.SolrDispatchFilter.init SolrDispatchFilter.init()
[junit4:junit4]   2> 5080 T392 oasc.SolrResourceLoader.locateSolrHome JNDI not configured for solr (NoInitialContextEx)
[junit4:junit4]   2> 5081 T392 oasc.SolrResourceLoader.locateSolrHome using system property solr.solr.home: /usr/home/hudson/hudson-slave/workspace/Lucene-Solr-Tests-trunk-java7/solr/build/solr-core/test/J0/./org.apache.solr.cloud.BasicDistributedZkTest-jetty1-1359964179253
[junit4:junit4]   2> 5081 T392 oasc.CoreContainer$Initializer.initialize looking for solr.xml: /usr/home/hudson/hudson-slave/workspace/Lucene-Solr-Tests-trunk-java7/solr/build/solr-core/test/J0/./org.apache.solr.cloud.BasicDistributedZkTest-jetty1-1359964179253/solr.xml
[junit4:junit4]   2> 5082 T392 oasc.CoreContainer.<init> New CoreContainer 2016950128
[junit4:junit4]   2> 5082 T392 oasc.CoreContainer.load Loading CoreContainer using Solr Home: '/usr/home/hudson/hudson-slave/workspace/Lucene-Solr-Tests-trunk-java7/solr/build/solr-core/test/J0/./org.apache.solr.cloud.BasicDistributedZkTest-jetty1-1359964179253/'
[junit4:junit4]   2> 5083 T392 oasc.SolrResourceLoader.<init> new SolrResourceLoader for directory: '/usr/home/hudson/hudson-slave/workspace/Lucene-Solr-Tests-trunk-java7/solr/build/solr-core/test/J0/./org.apache.solr.cloud.BasicDistributedZkTest-jetty1-1359964179253/'
[junit4:junit4]   2> 5165 T392 oashc.HttpShardHandlerFactory.getParameter Setting socketTimeout to: 60000
[junit4:junit4]   2> 5166 T392 oashc.HttpShardHandlerFactory.getParameter Setting urlScheme to: http://
[junit4:junit4]   2> 5166 T392 oashc.HttpShardHandlerFactory.getParameter Setting connTimeout to: 15000
[junit4:junit4]   2> 5167 T392 oashc.HttpShardHandlerFactory.getParameter Setting maxConnectionsPerHost to: 20
[junit4:junit4]   2> 5167 T392 oashc.HttpShardHandlerFactory.getParameter Setting corePoolSize to: 0
[junit4:junit4]   2> 5168 T392 oashc.HttpShardHandlerFactory.getParameter Setting maximumPoolSize to: 2147483647
[junit4:junit4]   2> 5168 T392 oashc.HttpShardHandlerFactory.getParameter Setting maxThreadIdleTime to: 5
[junit4:junit4]   2> 5169 T392 oashc.HttpShardHandlerFactory.getParameter Setting sizeOfQueue to: -1
[junit4:junit4]   2> 5169 T392 oashc.HttpShardHandlerFactory.getParameter Setting fairnessPolicy to: false
[junit4:junit4]   2> 5170 T392 oascsi.HttpClientUtil.createClient Creating new http client, config:maxConnectionsPerHost=20&maxConnections=10000&socketTimeout=60000&connTimeout=15000&retry=false
[junit4:junit4]   2> 5198 T392 oasc.CoreContainer.load Registering Log Listener
[junit4:junit4]   2> 5223 T392 oasc.CoreContainer.initZooKeeper Zookeeper client=127.0.0.1:57486/solr
[junit4:junit4]   2> 5223 T392 oasc.ZkController.checkChrootPath zkHost includes chroot
[junit4:junit4]   2> 5224 T392 oaz.ZooKeeper.<init> Initiating client connection, connectString=127.0.0.1:57486 sessionTimeout=60000 watcher=org.apache.solr.common.cloud.ConnectionManager@54fc0a39
[junit4:junit4]   2> 5225 T392 oascc.ConnectionManager.waitForConnected Waiting for client to connect to ZooKeeper
[junit4:junit4]   2> 5226 T430 oaz.ClientCnxn$SendThread.logStartConnect Opening socket connection to server localhost/127.0.0.1:57486. Will not attempt to authenticate using SASL (access denied ("javax.security.auth.AuthPermission" "getLoginConfiguration"))
[junit4:junit4]   2> 5227 T430 oaz.ClientCnxn$SendThread.primeConnection Socket connection established to localhost/127.0.0.1:57486, initiating session
[junit4:junit4]   2> 5227 T394 oazs.NIOServerCnxnFactory.run Accepted socket connection from /140.211.11.196:57494
[junit4:junit4]   2> 5227 T394 oazs.ZooKeeperServer.processConnectRequest Client attempting to establish new session at /140.211.11.196:57494
[junit4:junit4]   2> 5230 T396 oazs.ZooKeeperServer.finishSessionInit Established session 0x13ca42e798a0005 with negotiated timeout 20000 for client /140.211.11.196:57494
[junit4:junit4]   2> 5230 T430 oaz.ClientCnxn$SendThread.onConnected Session establishment complete on server localhost/127.0.0.1:57486, sessionid = 0x13ca42e798a0005, negotiated timeout = 20000
[junit4:junit4]   2> 5231 T431 oascc.ConnectionManager.process Watcher org.apache.solr.common.cloud.ConnectionManager@54fc0a39 name:ZooKeeperConnection Watcher:127.0.0.1:57486 got event WatchedEvent state:SyncConnected type:None path:null path:null type:None
[junit4:junit4]   2> 5231 T392 oascc.ConnectionManager.waitForConnected Client is connected to ZooKeeper
[junit4:junit4]   2> 5233 T397 oazs.PrepRequestProcessor.pRequest2Txn Processed session termination for sessionid: 0x13ca42e798a0005
[junit4:junit4]   2> 5234 T431 oaz.ClientCnxn$EventThread.run EventThread shut down
[junit4:junit4]   2> 5234 T394 oazs.NIOServerCnxn.closeSock Closed socket connection for client /140.211.11.196:57494 which had sessionid 0x13ca42e798a0005
[junit4:junit4]   2> 5234 T392 oaz.ZooKeeper.close Session: 0x13ca42e798a0005 closed
[junit4:junit4]   2> 5235 T392 oascsi.HttpClientUtil.createClient Creating new http client, config:maxConnections=500&maxConnectionsPerHost=16&socketTimeout=60000&connTimeout=15000
[junit4:junit4]   2> 5249 T392 oaz.ZooKeeper.<init> Initiating client connection, connectString=127.0.0.1:57486/solr sessionTimeout=30000 watcher=org.apache.solr.common.cloud.ConnectionManager@5a3bf049
[junit4:junit4]   2> 5251 T392 oascc.ConnectionManager.waitForConnected Waiting for client to connect to ZooKeeper
[junit4:junit4]   2> 5252 T432 oaz.ClientCnxn$SendThread.logStartConnect Opening socket connection to server localhost/127.0.0.1:57486. Will not attempt to authenticate using SASL (access denied ("javax.security.auth.AuthPermission" "getLoginConfiguration"))
[junit4:junit4]   2> 5253 T432 oaz.ClientCnxn$SendThread.primeConnection Socket connection established to localhost/127.0.0.1:57486, initiating session
[junit4:junit4]   2> 5253 T394 oazs.NIOServerCnxnFactory.run Accepted socket connection from /140.211.11.196:57495
[junit4:junit4]   2> 5254 T394 oazs.ZooKeeperServer.processConnectRequest Client attempting to establish new session at /140.211.11.196:57495
[junit4:junit4]   2> 5255 T396 oazs.ZooKeeperServer.finishSessionInit Established session 0x13ca42e798a0006 with negotiated timeout 20000 for client /140.211.11.196:57495
[junit4:junit4]   2> 5256 T432 oaz.ClientCnxn$SendThread.onConnected Session establishment complete on server localhost/127.0.0.1:57486, sessionid = 0x13ca42e798a0006, negotiated timeout = 20000
[junit4:junit4]   2> 5256 T433 oascc.ConnectionManager.process Watcher org.apache.solr.common.cloud.ConnectionManager@5a3bf049 name:ZooKeeperConnection Watcher:127.0.0.1:57486/solr got event WatchedEvent state:SyncConnected type:None path:null path:null type:None
[junit4:junit4]   2> 5256 T392 oascc.ConnectionManager.waitForConnected Client is connected to ZooKeeper
[junit4:junit4]   2> 5258 T397 oazs.PrepRequestProcessor.pRequest Got user-level KeeperException when processing sessionid:0x13ca42e798a0006 type:create cxid:0x1 zxid:0x49 txntype:-1 reqpath:n/a Error Path:/solr/overseer Error:KeeperErrorCode = NodeExists for /solr/overseer
[junit4:junit4]   2> 5260 T397 oazs.PrepRequestProcessor.pRequest Got user-level KeeperException when processing sessionid:0x13ca42e798a0006 type:create cxid:0x2 zxid:0x4a txntype:-1 reqpath:n/a Error Path:/solr/overseer Error:KeeperErrorCode = NodeExists for /solr/overseer
[junit4:junit4]   2> 5262 T392 oasc.ZkController.createEphemeralLiveNode Register node as live in ZooKeeper:/live_nodes/127.0.0.1:57493_
[junit4:junit4]   2> 5263 T397 oazs.PrepRequestProcessor.pRequest Got user-level KeeperException when processing sessionid:0x13ca42e798a0006 type:delete cxid:0x4 zxid:0x4b txntype:-1 reqpath:n/a Error Path:/solr/live_nodes/127.0.0.1:57493_ Error:KeeperErrorCode = NoNode for /solr/live_nodes/127.0.0.1:57493_
[junit4:junit4]   2> 5270 T392 oascc.SolrZkClient.makePath makePath: /live_nodes/127.0.0.1:57493_
[junit4:junit4]   2> 5298 T414 oascc.ZkStateReader$3.process Updating live nodes... (2)
[junit4:junit4]   2> 5298 T420 oascc.ZkStateReader$3.process Updating live nodes... (2)
[junit4:junit4]   2> 5299 T414 oascc.ZkStateReader$2.process A cluster state change: WatchedEvent state:SyncConnected type:NodeChildrenChanged path:/live_nodes, has occurred - updating... (live nodes size: 2)
[junit4:junit4]   2> 5314 T392 oascc.ZkStateReader.createClusterStateWatchersAndUpdate Updating cluster state from ZooKeeper... 
[junit4:junit4]   2> 5330 T434 oasc.CoreContainer.create Creating SolrCore 'collection1' using instanceDir: /usr/home/hudson/hudson-slave/workspace/Lucene-Solr-Tests-trunk-java7/solr/build/solr-core/test/J0/./org.apache.solr.cloud.BasicDistributedZkTest-jetty1-1359964179253/collection1
[junit4:junit4]   2> 5331 T434 oasc.ZkController.createCollectionZkNode Check for collection zkNode:collection1
[junit4:junit4]   2> 5332 T434 oasc.ZkController.createCollectionZkNode Collection zkNode exists
[junit4:junit4]   2> 5333 T434 oasc.ZkController.readConfigName Load collection config from:/collections/collection1
[junit4:junit4]   2> 5336 T434 oasc.SolrResourceLoader.<init> new SolrResourceLoader for directory: '/usr/home/hudson/hudson-slave/workspace/Lucene-Solr-Tests-trunk-java7/solr/build/solr-core/test/J0/./org.apache.solr.cloud.BasicDistributedZkTest-jetty1-1359964179253/collection1/'
[junit4:junit4]   2> 5338 T434 oasc.SolrResourceLoader.replaceClassLoader Adding 'file:/usr/home/hudson/hudson-slave/workspace/Lucene-Solr-Tests-trunk-java7/solr/build/solr-core/test/J0/org.apache.solr.cloud.BasicDistributedZkTest-jetty1-1359964179253/collection1/lib/classes/' to classloader
[junit4:junit4]   2> 5339 T434 oasc.SolrResourceLoader.replaceClassLoader Adding 'file:/usr/home/hudson/hudson-slave/workspace/Lucene-Solr-Tests-trunk-java7/solr/build/solr-core/test/J0/org.apache.solr.cloud.BasicDistributedZkTest-jetty1-1359964179253/collection1/lib/README' to classloader
[junit4:junit4]   2> 5432 T434 oasc.SolrConfig.<init> Using Lucene MatchVersion: LUCENE_50
[junit4:junit4]   2> 5521 T434 oasc.SolrConfig.<init> Loaded SolrConfig: solrconfig.xml
[junit4:junit4]   2> 5623 T434 oass.IndexSchema.readSchema Reading Solr Schema
[junit4:junit4]   2> 5630 T434 oass.IndexSchema.readSchema Schema name=test
[junit4:junit4]   2> 6294 T415 oascc.ZkStateReader.updateClusterState Updating cloud state from ZooKeeper... 
[junit4:junit4]   2> 6295 T415 oasc.Overseer$ClusterStateUpdater.updateState Update state numShards=1 message={
[junit4:junit4]   2> 	  "operation":"state",
[junit4:junit4]   2> 	  "numShards":"1",
[junit4:junit4]   2> 	  "shard":"shard1",
[junit4:junit4]   2> 	  "roles":null,
[junit4:junit4]   2> 	  "state":"active",
[junit4:junit4]   2> 	  "core":"collection1",
[junit4:junit4]   2> 	  "collection":"control_collection",
[junit4:junit4]   2> 	  "node_name":"127.0.0.1:57489_",
[junit4:junit4]   2> 	  "base_url":"http://127.0.0.1:57489"}
[junit4:junit4]   2> 6360 T434 oass.OpenExchangeRatesOrgProvider.init Initialized with rates=open-exchange-rates.json, refreshInterval=1440.
[junit4:junit4]   2> 6363 T414 oascc.ZkStateReader$2.process A cluster state change: WatchedEvent state:SyncConnected type:NodeDataChanged path:/clusterstate.json, has occurred - updating... (live nodes size: 2)
[junit4:junit4]   2> 6363 T420 oascc.ZkStateReader$2.process A cluster state change: WatchedEvent state:SyncConnected type:NodeDataChanged path:/clusterstate.json, has occurred - updating... (live nodes size: 2)
[junit4:junit4]   2> 6363 T433 oascc.ZkStateReader$2.process A cluster state change: WatchedEvent state:SyncConnected type:NodeDataChanged path:/clusterstate.json, has occurred - updating... (live nodes size: 2)
[junit4:junit4]   2> 6376 T434 oass.IndexSchema.readSchema default search field in schema is text
[junit4:junit4]   2> 6380 T434 oass.IndexSchema.readSchema unique key field: id
[junit4:junit4]   2> 6425 T434 oass.FileExchangeRateProvider.reload Reloading exchange rates from file currency.xml
[junit4:junit4]   2> 6432 T434 oass.FileExchangeRateProvider.reload Reloading exchange rates from file currency.xml
[junit4:junit4]   2> 6437 T434 oass.OpenExchangeRatesOrgProvider.reload Reloading exchange rates from open-exchange-rates.json
[junit4:junit4]   2> 6440 T434 oass.OpenExchangeRatesOrgProvider.reload Reloading exchange rates from open-exchange-rates.json
[junit4:junit4]   2> 6442 T434 oasc.SolrCore.<init> [collection1] Opening new SolrCore at /usr/home/hudson/hudson-slave/workspace/Lucene-Solr-Tests-trunk-java7/solr/build/solr-core/test/J0/./org.apache.solr.cloud.BasicDistributedZkTest-jetty1-1359964179253/collection1/, dataDir=./org.apache.solr.cloud.BasicDistributedZkTest-1359964174397/jetty1/
[junit4:junit4]   2> 6443 T434 oasc.JmxMonitoredMap.<init> JMX monitoring is enabled. Adding Solr mbeans to JMX Server: com.sun.jmx.mbeanserver.JmxMBeanServer@5c1a7261
[junit4:junit4]   2> 6443 T434 oasc.SolrCore.initDirectoryFactory solr.StandardDirectoryFactory
[junit4:junit4]   2> 6444 T434 oasc.CachingDirectoryFactory.get return new directory for /usr/home/hudson/hudson-slave/workspace/Lucene-Solr-Tests-trunk-java7/solr/build/solr-core/test/J0/./org.apache.solr.cloud.BasicDistributedZkTest-1359964174397/jetty1 forceNew:false
[junit4:junit4]   2> 6445 T434 oasc.CachingDirectoryFactory.close Releasing directory:/usr/home/hudson/hudson-slave/workspace/Lucene-Solr-Tests-trunk-java7/solr/build/solr-core/test/J0/./org.apache.solr.cloud.BasicDistributedZkTest-1359964174397/jetty1
[junit4:junit4]   2> 6445 T434 oasc.SolrCore.getNewIndexDir New index directory detected: old=null new=./org.apache.solr.cloud.BasicDistributedZkTest-1359964174397/jetty1/index/
[junit4:junit4]   2> 6446 T434 oasc.SolrCore.initIndex WARNING [collection1] Solr index directory './org.apache.solr.cloud.BasicDistributedZkTest-1359964174397/jetty1/index' doesn't exist. Creating new index...
[junit4:junit4]   2> 6446 T434 oasc.CachingDirectoryFactory.get return new directory for /usr/home/hudson/hudson-slave/workspace/Lucene-Solr-Tests-trunk-java7/solr/build/solr-core/test/J0/./org.apache.solr.cloud.BasicDistributedZkTest-1359964174397/jetty1/index forceNew:false
[junit4:junit4]   2> 6472 T434 oasc.SolrDeletionPolicy.onCommit SolrDeletionPolicy.onCommit: commits:num=1
[junit4:junit4]   2> 		commit{dir=RateLimitedDirectoryWrapper(org.apache.lucene.store.NIOFSDirectory@/usr/home/hudson/hudson-slave/workspace/Lucene-Solr-Tests-trunk-java7/solr/build/solr-core/test/J0/org.apache.solr.cloud.BasicDistributedZkTest-1359964174397/jetty1/index lockFactory=org.apache.lucene.store.NativeFSLockFactory@6b20f25),segFN=segments_1,generation=1,filenames=[segments_1]
[junit4:junit4]   2> 6472 T434 oasc.SolrDeletionPolicy.updateCommits newest commit = 1[segments_1]
[junit4:junit4]   2> 6473 T434 oasc.CachingDirectoryFactory.close Releasing directory:/usr/home/hudson/hudson-slave/workspace/Lucene-Solr-Tests-trunk-java7/solr/build/solr-core/test/J0/./org.apache.solr.cloud.BasicDistributedZkTest-1359964174397/jetty1/index
[junit4:junit4]   2> 6473 T434 oasc.SolrCore.initWriters created xml: solr.XMLResponseWriter
[junit4:junit4]   2> 6476 T434 oasup.UpdateRequestProcessorChain.init inserting DistributedUpdateProcessorFactory into updateRequestProcessorChain "dedupe"
[junit4:junit4]   2> 6476 T434 oasup.UpdateRequestProcessorChain.init inserting DistributedUpdateProcessorFactory into updateRequestProcessorChain "dedupe-allfields"
[junit4:junit4]   2> 6476 T434 oasup.UpdateRequestProcessorChain.init inserting DistributedUpdateProcessorFactory into updateRequestProcessorChain "stored_sig"
[junit4:junit4]   2> 6477 T434 oasup.UpdateRequestProcessorChain.init inserting DistributedUpdateProcessorFactory into updateRequestProcessorChain "uniq-fields"
[junit4:junit4]   2> 6477 T434 oasup.UpdateRequestProcessorChain.init inserting DistributedUpdateProcessorFactory into updateRequestProcessorChain "distrib-dup-test-chain-implicit"
[junit4:junit4]   2> 6477 T434 oasc.RequestHandlers.initHandlersFromConfig adding lazy requestHandler: solr.ReplicationHandler
[junit4:junit4]   2> 6478 T434 oasc.RequestHandlers.initHandlersFromConfig created /replication: solr.ReplicationHandler
[junit4:junit4]   2> 6478 T434 oasc.RequestHandlers.initHandlersFromConfig created standard: solr.StandardRequestHandler
[junit4:junit4]   2> 6479 T434 oasc.RequestHandlers.initHandlersFromConfig created /get: solr.RealTimeGetHandler
[junit4:junit4]   2> 6480 T434 oasc.RequestHandlers.initHandlersFromConfig created dismax: solr.SearchHandler
[junit4:junit4]   2> 6480 T434 oasc.RequestHandlers.initHandlersFromConfig created mock: org.apache.solr.core.MockQuerySenderListenerReqHandler
[junit4:junit4]   2> 6481 T434 oasc.RequestHandlers.initHandlersFromConfig created /admin/: org.apache.solr.handler.admin.AdminHandlers
[junit4:junit4]   2> 6481 T434 oasc.RequestHandlers.initHandlersFromConfig created defaults: solr.StandardRequestHandler
[junit4:junit4]   2> 6481 T434 oasc.RequestHandlers.initHandlersFromConfig adding lazy requestHandler: solr.StandardRequestHandler
[junit4:junit4]   2> 6482 T434 oasc.RequestHandlers.initHandlersFromConfig created lazy: solr.StandardRequestHandler
[junit4:junit4]   2> 6482 T434 oasc.RequestHandlers.initHandlersFromConfig created /update: solr.UpdateRequestHandler
[junit4:junit4]   2> 6483 T434 oasc.RequestHandlers.initHandlersFromConfig created /terms: org.apache.solr.handler.component.SearchHandler
[junit4:junit4]   2> 6484 T434 oasc.RequestHandlers.initHandlersFromConfig created spellCheckCompRH: org.apache.solr.handler.component.SearchHandler
[junit4:junit4]   2> 6484 T434 oasc.RequestHandlers.initHandlersFromConfig created spellCheckCompRH_Direct: org.apache.solr.handler.component.SearchHandler
[junit4:junit4]   2> 6485 T434 oasc.RequestHandlers.initHandlersFromConfig created spellCheckWithWordbreak: org.apache.solr.handler.component.SearchHandler
[junit4:junit4]   2> 6485 T434 oasc.RequestHandlers.initHandlersFromConfig created spellCheckWithWordbreak_Direct: org.apache.solr.handler.component.SearchHandler
[junit4:junit4]   2> 6486 T434 oasc.RequestHandlers.initHandlersFromConfig created spellCheckCompRH1: org.apache.solr.handler.component.SearchHandler
[junit4:junit4]   2> 6486 T434 oasc.RequestHandlers.initHandlersFromConfig created mltrh: org.apache.solr.handler.component.SearchHandler
[junit4:junit4]   2> 6487 T434 oasc.RequestHandlers.initHandlersFromConfig created tvrh: org.apache.solr.handler.component.SearchHandler
[junit4:junit4]   2> 6487 T434 oasc.RequestHandlers.initHandlersFromConfig created /mlt: solr.MoreLikeThisHandler
[junit4:junit4]   2> 6488 T434 oasc.RequestHandlers.initHandlersFromConfig created /debug/dump: solr.DumpRequestHandler
[junit4:junit4]   2> 6505 T434 oashl.XMLLoader.init xsltCacheLifetimeSeconds=60
[junit4:junit4]   2> 6512 T434 oasc.SolrCore.initDeprecatedSupport WARNING solrconfig.xml uses deprecated <admin/gettableFiles>, Please update your config to use the ShowFileRequestHandler.
[junit4:junit4]   2> 6515 T434 oasc.SolrCore.initDeprecatedSupport WARNING adding ShowFileRequestHandler with hidden files: [SCHEMA.XML, OLD_SYNONYMS.TXT, STOPWORDS.TXT, PROTWORDS.TXT, OPEN-EXCHANGE-RATES.JSON, SYNONYMS.TXT, CURRENCY.XML, MAPPING-ISOLATIN1ACCENT.TXT]
[junit4:junit4]   2> 6518 T434 oasc.CachingDirectoryFactory.close Releasing directory:/usr/home/hudson/hudson-slave/workspace/Lucene-Solr-Tests-trunk-java7/solr/build/solr-core/test/J0/./org.apache.solr.cloud.BasicDistributedZkTest-1359964174397/jetty1
[junit4:junit4]   2> 6520 T434 oass.SolrIndexSearcher.<init> Opening Searcher@45249b94 main
[junit4:junit4]   2> 6521 T434 oasu.CommitTracker.<init> Hard AutoCommit: disabled
[junit4:junit4]   2> 6521 T434 oasu.CommitTracker.<init> Soft AutoCommit: disabled
[junit4:junit4]   2> 6522 T434 oashc.SpellCheckComponent.inform Initializing spell checkers
[junit4:junit4]   2> 6581 T434 oass.DirectSolrSpellChecker.init init: {name=direct,classname=DirectSolrSpellChecker,field=lowerfilt,minQueryLength=3}
[junit4:junit4]   2> 6733 T435 oasc.SolrCore.registerSearcher [collection1] Registered new searcher Searcher@45249b94 main{StandardDirectoryReader(segments_1:1)}
[junit4:junit4]   2> 6738 T434 oasc.ZkController.publish publishing core=collection1 state=down
[junit4:junit4]   2> 6739 T434 oasc.ZkController.publish numShards not found on descriptor - reading it from system property
[junit4:junit4]   2> 7909 T415 oascc.ZkStateReader.updateClusterState Updating cloud state from ZooKeeper... 
[junit4:junit4]   2> 7910 T415 oasc.Overseer$ClusterStateUpdater.updateState Update state numShards=2 message={
[junit4:junit4]   2> 	  "operation":"state",
[junit4:junit4]   2> 	  "numShards":"2",
[junit4:junit4]   2> 	  "shard":null,
[junit4:junit4]   2> 	  "roles":null,
[junit4:junit4]   2> 	  "state":"down",
[junit4:junit4]   2> 	  "core":"collection1",
[junit4:junit4]   2> 	  "collection":"collection1",
[junit4:junit4]   2> 	  "node_name":"127.0.0.1:57493_",
[junit4:junit4]   2> 	  "base_url":"http://127.0.0.1:57493"}
[junit4:junit4]   2> 7911 T415 oasc.Overseer$ClusterStateUpdater.createCollection Create collection collection1 with numShards 2
[junit4:junit4]   2> 7911 T415 oasc.Overseer$ClusterStateUpdater.updateState Assigning new node to shard shard=shard1
[junit4:junit4]   2> 7965 T420 oascc.ZkStateReader$2.process A cluster state change: WatchedEvent state:SyncConnected type:NodeDataChanged path:/clusterstate.json, has occurred - updating... (live nodes size: 2)
[junit4:junit4]   2> 7965 T414 oascc.ZkStateReader$2.process A cluster state change: WatchedEvent state:SyncConnected type:NodeDataChanged path:/clusterstate.json, has occurred - updating... (live nodes size: 2)
[junit4:junit4]   2> 7965 T433 oascc.ZkStateReader$2.process A cluster state change: WatchedEvent state:SyncConnected type:NodeDataChanged path:/clusterstate.json, has occurred - updating... (live nodes size: 2)
[junit4:junit4]   2> 8743 T434 oasc.CoreContainer.registerCore registering core: collection1
[junit4:junit4]   2> 8743 T434 oasc.ZkController.register Register replica - core:collection1 address:http://127.0.0.1:57493 collection:collection1 shard:shard1
[junit4:junit4]   2> 8745 T434 oascc.SolrZkClient.makePath makePath: /collections/collection1/leader_elect/shard1/election
[junit4:junit4]   2> 8768 T397 oazs.PrepRequestProcessor.pRequest Got user-level KeeperException when processing sessionid:0x13ca42e798a0006 type:delete cxid:0x45 zxid:0x5b txntype:-1 reqpath:n/a Error Path:/solr/collections/collection1/leaders Error:KeeperErrorCode = NoNode for /solr/collections/collection1/leaders
[junit4:junit4]   2> 8769 T434 oasc.ShardLeaderElectionContext.runLeaderProcess Running the leader process.
[junit4:junit4]   2> 8770 T397 oazs.PrepRequestProcessor.pRequest Got user-level KeeperException when processing sessionid:0x13ca42e798a0006 type:create cxid:0x46 zxid:0x5c txntype:-1 reqpath:n/a Error Path:/solr/overseer Error:KeeperErrorCode = NodeExists for /solr/overseer
[junit4:junit4]   2> 8779 T434 oasc.ShardLeaderElectionContext.waitForReplicasToComeUp Enough replicas found to continue.
[junit4:junit4]   2> 8779 T434 oasc.ShardLeaderElectionContext.runLeaderProcess I may be the new leader - try and sync
[junit4:junit4]   2> 8780 T434 oasc.SyncStrategy.sync Sync replicas to http://127.0.0.1:57493/collection1/
[junit4:junit4]   2> 8780 T434 oasc.SyncStrategy.syncReplicas Sync Success - now sync replicas to me
[junit4:junit4]   2> 8780 T434 oasc.SyncStrategy.syncToMe http://127.0.0.1:57493/collection1/ has no replicas
[junit4:junit4]   2> 8780 T434 oasc.ShardLeaderElectionContext.runLeaderProcess I am the new leader: http://127.0.0.1:57493/collection1/
[junit4:junit4]   2> 8781 T434 oascc.SolrZkClient.makePath makePath: /collections/collection1/leaders/shard1
[junit4:junit4]   2> 8788 T397 oazs.PrepRequestProcessor.pRequest Got user-level KeeperException when processing sessionid:0x13ca42e798a0006 type:create cxid:0x50 zxid:0x60 txntype:-1 reqpath:n/a Error Path:/solr/overseer Error:KeeperErrorCode = NodeExists for /solr/overseer
[junit4:junit4]   2> 9477 T415 oascc.ZkStateReader.updateClusterState Updating cloud state from ZooKeeper... 
[junit4:junit4]   2> 9499 T414 oascc.ZkStateReader$2.process A cluster state change: WatchedEvent state:SyncConnected type:NodeDataChanged path:/clusterstate.json, has occurred - updating... (live nodes size: 2)
[junit4:junit4]   2> 9499 T420 oascc.ZkStateReader$2.process A cluster state change: WatchedEvent state:SyncConnected type:NodeDataChanged path:/clusterstate.json, has occurred - updating... (live nodes size: 2)
[junit4:junit4]   2> 9499 T433 oascc.ZkStateReader$2.process A cluster state change: WatchedEvent state:SyncConnected type:NodeDataChanged path:/clusterstate.json, has occurred - updating... (live nodes size: 2)
[junit4:junit4]   2> 9505 T434 oasc.ZkController.register We are http://127.0.0.1:57493/collection1/ and leader is http://127.0.0.1:57493/collection1/
[junit4:junit4]   2> 9505 T434 oasc.ZkController.register No LogReplay needed for core=collection1 baseURL=http://127.0.0.1:57493
[junit4:junit4]   2> 9505 T434 oasc.ZkController.checkRecovery I am the leader, no recovery necessary
[junit4:junit4]   2> 9506 T434 oasc.ZkController.publish publishing core=collection1 state=active
[junit4:junit4]   2> 9506 T434 oasc.ZkController.publish numShards not found on descriptor - reading it from system property
[junit4:junit4]   2> 9515 T434 oascc.ZkStateReader.updateClusterState Updating cloud state from ZooKeeper... 
[junit4:junit4]   2> 9517 T392 oass.SolrDispatchFilter.init user.dir=/usr/home/hudson/hudson-slave/workspace/Lucene-Solr-Tests-trunk-java7/solr/build/solr-core/test/J0
[junit4:junit4]   2> 9518 T392 oass.SolrDispatchFilter.init SolrDispatchFilter.init() done
[junit4:junit4]   2> 9519 T392 oascsi.HttpClientUtil.createClient Creating new http client, config:maxConnections=128&maxConnectionsPerHost=32&followRedirects=false
[junit4:junit4]   2> 9764 T392 oejs.Server.doStart jetty-8.1.8.v20121106
[junit4:junit4]   2> 9767 T392 oejs.AbstractConnector.doStart Started SocketConnector@127.0.0.1:57496
[junit4:junit4]   2> 9768 T392 oass.SolrDispatchFilter.init SolrDispatchFilter.init()
[junit4:junit4]   2> 9769 T392 oasc.SolrResourceLoader.locateSolrHome JNDI not configured for solr (NoInitialContextEx)
[junit4:junit4]   2> 9770 T392 oasc.SolrResourceLoader.locateSolrHome using system property solr.solr.home: /usr/home/hudson/hudson-slave/workspace/Lucene-Solr-Tests-trunk-java7/solr/build/solr-core/test/J0/./org.apache.solr.cloud.BasicDistributedZkTest-jetty2-1359964183926
[junit4:junit4]   2> 9770 T392 oasc.CoreContainer$Initializer.initialize looking for solr.xml: /usr/home/hudson/hudson-slave/workspace/Lucene-Solr-Tests-trunk-java7/solr/build/solr-core/test/J0/./org.apache.solr.cloud.BasicDistributedZkTest-jetty2-1359964183926/solr.xml
[junit4:junit4]   2> 9770 T392 oasc.CoreContainer.<init> New CoreContainer 1572554169
[junit4:junit4]   2> 9771 T392 oasc.CoreContainer.load Loading CoreContainer using Solr Home: '/usr/home/hudson/hudson-slave/workspace/Lucene-Solr-Tests-trunk-java7/solr/build/solr-core/test/J0/./org.apache.solr.cloud.BasicDistributedZkTest-jetty2-1359964183926/'
[junit4:junit4]   2> 9772 T392 oasc.SolrResourceLoader.<init> new SolrResourceLoader for directory: '/usr/home/hudson/hudson-slave/workspace/Lucene-Solr-Tests-trunk-java7/solr/build/solr-core/test/J0/./org.apache.solr.cloud.BasicDistributedZkTest-jetty2-1359964183926/'
[junit4:junit4]   2> 9844 T392 oashc.HttpShardHandlerFactory.getParameter Setting socketTimeout to: 60000
[junit4:junit4]   2> 9845 T392 oashc.HttpShardHandlerFactory.getParameter Setting urlScheme to: http://
[junit4:junit4]   2> 9846 T392 oashc.HttpShardHandlerFactory.getParameter Setting connTimeout to: 15000
[junit4:junit4]   2> 9846 T392 oashc.HttpShardHandlerFactory.getParameter Setting maxConnectionsPerHost to: 20
[junit4:junit4]   2> 9847 T392 oashc.HttpShardHandlerFactory.getParameter Setting corePoolSize to: 0
[junit4:junit4]   2> 9847 T392 oashc.HttpShardHandlerFactory.getParameter Setting maximumPoolSize to: 2147483647
[junit4:junit4]   2> 9847 T392 oashc.HttpShardHandlerFactory.getParameter Setting maxThreadIdleTime to: 5
[junit4:junit4]   2> 9848 T392 oashc.HttpShardHandlerFactory.getParameter Setting sizeOfQueue to: -1
[junit4:junit4]   2> 9848 T392 oashc.HttpShardHandlerFactory.getParameter Setting fairnessPolicy to: false
[junit4:junit4]   2> 9849 T392 oascsi.HttpClientUtil.createClient Creating new http client, config:maxConnectionsPerHost=20&maxConnections=10000&socketTimeout=60000&connTimeout=15000&retry=false
[junit4:junit4]   2> 9878 T392 oasc.CoreContainer.load Registering Log Listener
[junit4:junit4]   2> 9904 T392 oasc.CoreContainer.initZooKeeper Zookeeper client=127.0.0.1:57486/solr
[junit4:junit4]   2> 9905 T392 oasc.ZkController.checkChrootPath zkHost includes chroot
[junit4:junit4]   2> 9906 T392 oaz.ZooKeeper.<init> Initiating client connection, connectString=127.0.0.1:57486 sessionTimeout=60000 watcher=org.apache.solr.common.cloud.ConnectionManager@68f8529f
[junit4:junit4]   2> 9907 T392 oascc.ConnectionManager.waitForConnected Waiting for client to connect to ZooKeeper
[junit4:junit4]   2> 9907 T445 oaz.ClientCnxn$SendThread.logStartConnect Opening socket connection to server localhost/127.0.0.1:57486. Will not attempt to authenticate using SASL (access denied ("javax.security.auth.AuthPermission" "getLoginConfiguration"))
[junit4:junit4]   2> 9908 T445 oaz.ClientCnxn$SendThread.primeConnection Socket connection established to localhost/127.0.0.1:57486, initiating session
[junit4:junit4]   2> 9909 T394 oazs.NIOServerCnxnFactory.run Accepted socket connection from /140.211.11.196:57497
[junit4:junit4]   2> 9909 T394 oazs.ZooKeeperServer.processConnectRequest Client attempting to establish new session at /140.211.11.196:57497
[junit4:junit4]   2> 9912 T396 oazs.ZooKeeperServer.finishSessionInit Established session 0x13ca42e798a0007 with negotiated timeout 20000 for client /140.211.11.196:57497
[junit4:junit4]   2> 9912 T445 oaz.ClientCnxn$SendThread.onConnected Session establishment complete on server localhost/127.0.0.1:57486, sessionid = 0x13ca42e798a0007, negotiated timeout = 20000
[junit4:junit4]   2> 9912 T446 oascc.ConnectionManager.process Watcher org.apache.solr.common.cloud.ConnectionManager@68f8529f name:ZooKeeperConnection Watcher:127.0.0.1:57486 got event WatchedEvent state:SyncConnected type:None path:null path:null type:None
[junit4:junit4]   2> 9913 T392 oascc.ConnectionManager.waitForConnected Client is connected to ZooKeeper
[junit4:junit4]   2> 9915 T397 oazs.PrepRequestProcessor.pRequest2Txn Processed session termination for sessionid: 0x13ca42e798a0007
[junit4:junit4]   2> 9917 T446 oaz.ClientCnxn$EventThread.run EventThread shut down
[junit4:junit4]   2> 9917 T394 oazs.NIOServerCnxn.closeSock Closed socket connection for client /140.211.11.196:57497 which had sessionid 0x13ca42e798a0007
[junit4:junit4]   2> 9917 T392 oaz.ZooKeeper.close Session: 0x13ca42e798a0007 closed
[junit4:junit4]   2> 9918 T392 oascsi.HttpClientUtil.createClient Creating new http client, config:maxConnections=500&maxConnectionsPerHost=16&socketTimeout=60000&connTimeout=15000
[junit4:junit4]   2> 9932 T392 oaz.ZooKeeper.<init> Initiating client connection, connectString=127.0.0.1:57486/solr sessionTimeout=30000 watcher=org.apache.solr.common.cloud.ConnectionManager@749bfdca
[junit4:junit4]   2> 9933 T392 oascc.ConnectionManager.waitForConnected Waiting for client to connect to ZooKeeper
[junit4:junit4]   2> 9934 T447 oaz.ClientCnxn$SendThread.logStartConnect Opening socket connection to server localhost/127.0.0.1:57486. Will not attempt to authenticate using SASL (access denied ("javax.security.auth.AuthPermission" "getLoginConfiguration"))
[junit4:junit4]   2> 9935 T447 oaz.ClientCnxn$SendThread.primeConnection Socket connection established to localhost/127.0.0.1:57486, initiating session
[junit4:junit4]   2> 9935 T394 oazs.NIOServerCnxnFactory.run Accepted socket connection from /140.211.11.196:57498
[junit4:junit4]   2> 9935 T394 oazs.ZooKeeperServer.processConnectRequest Client attempting to establish new session at /140.211.11.196:57498
[junit4:junit4]   2> 9937 T396 oazs.ZooKeeperServer.finishSessionInit Established session 0x13ca42e798a0008 with negotiated timeout 20000 for client /140.211.11.196:57498
[junit4:junit4]   2> 9937 T447 oaz.ClientCnxn$SendThread.onConnected Session establishment complete on server localhost/127.0.0.1:57486, sessionid = 0x13ca42e798a0008, negotiated timeout = 20000
[junit4:junit4]   2> 9938 T448 oascc.ConnectionManager.process Watcher org.apache.solr.common.cloud.ConnectionManager@749bfdca name:ZooKeeperConnection Watcher:127.0.0.1:57486/solr got event WatchedEvent state:SyncConnected type:None path:null path:null type:None
[junit4:junit4]   2> 9938 T392 oascc.ConnectionManager.waitForConnected Client is connected to ZooKeeper
[junit4:junit4]   2> 9939 T397 oazs.PrepRequestProcessor.pRequest Got user-level KeeperException when processing sessionid:0x13ca42e798a0008 type:create cxid:0x1 zxid:0x6d txntype:-1 reqpath:n/a Error Path:/solr/overseer Error:KeeperErrorCode = NodeExists for /solr/overseer
[junit4:junit4]   2> 9941 T397 oazs.PrepRequestProcessor.pRequest Got user-level KeeperException when processing sessionid:0x13ca42e798a0008 type:create cxid:0x2 zxid:0x6e txntype:-1 reqpath:n/a Error Path:/solr/overseer Error:KeeperErrorCode = NodeExists for /solr/overseer
[junit4:junit4]   2> 9944 T392 oasc.ZkController.createEphemeralLiveNode Register node as live in ZooKeeper:/live_nodes/127.0.0.1:57496_
[junit4:junit4]   2> 9945 T397 oazs.PrepRequestProcessor.pRequest Got user-level KeeperException when processing sessionid:0x13ca42e798a0008 type:delete cxid:0x4 zxid:0x6f txntype:-1 reqpath:n/a Error Path:/solr/live_nodes/127.0.0.1:57496_ Error:KeeperErrorCode = NoNode for /solr/live_nodes/127.0.0.1:57496_
[junit4:junit4]   2> 9951 T392 oascc.SolrZkClient.makePath makePath: /live_nodes/127.0.0.1:57496_
[junit4:junit4]   2> 9955 T420 oascc.ZkStateReader$2.process A cluster state change: WatchedEvent state:SyncConnected type:NodeChildrenChanged path:/live_nodes, has occurred - updating... (live nodes size: 2)
[junit4:junit4]   2> 9956 T433 oascc.ZkStateReader$2.process A cluster state change: WatchedEvent state:SyncConnected type:NodeChildrenChanged path:/live_nodes, has occurred - updating... (live nodes size: 2)
[junit4:junit4]   2> 9956 T414 oascc.ZkStateReader$3.process Updating live nodes... (3)
[junit4:junit4]   2> 9957 T414 oascc.ZkStateReader$2.process A cluster state change: WatchedEvent state:SyncConnected type:NodeChildrenChanged path:/live_nodes, has occurred - updating... (live nodes size: 3)
[junit4:junit4]   2> 9959 T420 oascc.ZkStateReader$3.process Updating live nodes... (3)
[junit4:junit4]   2> 9960 T433 oascc.ZkStateReader$3.process Updating live nodes... (3)
[junit4:junit4]   2> 9965 T392 oascc.ZkStateReader.createClusterStateWatchersAndUpdate Updating cluster state from ZooKeeper... 
[junit4:junit4]   2> 9975 T449 oasc.CoreContainer.create Creating SolrCore 'collection1' using instanceDir: /usr/home/hudson/hudson-slave/workspace/Lucene-Solr-Tests-trunk-java7/solr/build/solr-core/test/J0/./org.apache.solr.cloud.BasicDistributedZkTest-jetty2-1359964183926/collection1
[junit4:junit4]   2> 9975 T449 oasc.ZkController.createCollectionZkNode Check for collection zkNode:collection1
[junit4:junit4]   2> 9977 T449 oasc.ZkController.createCollectionZkNode Collection zkNode exists
[junit4:junit4]   2> 9977 T449 oasc.ZkController.readConfigName Load collection config from:/collections/collection1
[junit4:junit4]   2> 9979 T449 oasc.SolrResourceLoader.<init> new SolrResourceLoader for directory: '/usr/home/hudson/hudson-slave/workspace/Lucene-Solr-Tests-trunk-java7/solr/build/solr-core/test/J0/./org.apache.solr.cloud.BasicDistributedZkTest-jetty2-1359964183926/collection1/'
[junit4:junit4]   2> 9981 T449 oasc.SolrResourceLoader.replaceClassLoader Adding 'file:/usr/home/hudson/hudson-slave/workspace/Lucene-Solr-Tests-trunk-java7/solr/build/solr-core/test/J0/org.apache.solr.cloud.BasicDistributedZkTest-jetty2-1359964183926/collection1/lib/classes/' to classloader
[junit4:junit4]   2> 9981 T449 oasc.SolrResourceLoader.replaceClassLoader Adding 'file:/usr/home/hudson/hudson-slave/workspace/Lucene-Solr-Tests-trunk-java7/solr/build/solr-core/test/J0/org.apache.solr.cloud.BasicDistributedZkTest-jetty2-1359964183926/collection1/lib/README' to classloader
[junit4:junit4]   2> 10045 T449 oasc.SolrConfig.<init> Using Lucene MatchVersion: LUCENE_50
[junit4:junit4]   2> 10121 T449 oasc.SolrConfig.<init> Loaded SolrConfig: solrconfig.xml
[junit4:junit4]   2> 10222 T449 oass.IndexSchema.readSchema Reading Solr Schema
[junit4:junit4]   2> 10232 T449 oass.IndexSchema.readSchema Schema name=test
[junit4:junit4]   2> 10982 T449 oass.OpenExchangeRatesOrgProvider.init Initialized with rates=open-exchange-rates.json, refreshInterval=1440.
[junit4:junit4]   2> 10997 T449 oass.IndexSchema.readSchema default search field in schema is text
[junit4:junit4]   2> 11003 T449 oass.IndexSchema.readSchema unique key field: id
[junit4:junit4]   2> 11019 T415 oascc.ZkStateReader.updateClusterState Updating cloud state from ZooKeeper... 
[junit4:junit4]   2> 11022 T415 oasc.Overseer$ClusterStateUpdater.updateState Update state numShards=2 message={
[junit4:junit4]   2> 	  "operation":"state",
[junit4:junit4]   2> 	  "numShards":"2",
[junit4:junit4]   2> 	  "shard":"shard1",
[junit4:junit4]   2> 	  "roles":null,
[junit4:junit4]   2> 	  "state":"active",
[junit4:junit4]   2> 	  "core":"collection1",
[junit4:junit4]   2> 	  "collection":"collection1",
[junit4:junit4]   2> 	  "node_name":"127.0.0.1:57493_",
[junit4:junit4]   2> 	  "base_url":"http://127.0.0.1:57493"}
[junit4:junit4]   2> 11041 T420 oascc.ZkStateReader$2.process A cluster state change: WatchedEvent state:SyncConnected type:NodeDataChanged path:/clusterstate.json, has occurred - updating... (live nodes size: 3)
[junit4:junit4]   2> 11041 T433 oascc.ZkStateReader$2.process A cluster state change: WatchedEvent state:SyncConnected type:NodeDataChanged path:/clusterstate.json, has occurred - updating... (live nodes size: 3)
[junit4:junit4]   2> 11041 T448 oascc.ZkStateReader$2.process A cluster state change: WatchedEvent state:SyncConnected type:NodeDataChanged path:/clusterstate.json, has occurred - updating... (live nodes size: 3)
[junit4:junit4]   2> 11041 T414 oascc.ZkStateReader$2.process A cluster state change: WatchedEvent state:SyncConnected type:NodeDataChanged path:/clusterstate.json, has occurred - updating... (live nodes size: 3)
[junit4:junit4]   2> 11048 T449 oass.FileExchangeRateProvider.reload Reloading exchange rates from file currency.xml
[junit4:junit4]   2> 11055 T449 oass.FileExchangeRateProvider.reload Reloading exchange rates from file currency.xml
[junit4:junit4]   2> 11062 T449 oass.OpenExchangeRatesOrgProvider.reload Reloading exchange rates from open-exchange-rates.json
[junit4:junit4]   2> 11064 T449 oass.OpenExchangeRatesOrgProvider.reload Reloading exchange rates from open-exchange-rates.json
[junit4:junit4]   2> 11067 T449 oasc.SolrCore.<init> [collection1] Opening new SolrCore at /usr/home/hudson/hudson-slave/workspace/Lucene-Solr-Tests-trunk-java7/solr/build/solr-core/test/J0/./org.apache.solr.cloud.BasicDistributedZkTest-jetty2-1359964183926/collection1/, dataDir=./org.apache.solr.cloud.BasicDistributedZkTest-1359964174397/jetty2/
[junit4:junit4]   2> 11067 T449 oasc.JmxMonitoredMap.<init> JMX monitoring is enabled. Adding Solr mbeans to JMX Server: com.sun.jmx.mbeanserver.JmxMBeanServer@5c1a7261
[junit4:junit4]   2> 11068 T449 oasc.SolrCore.initDirectoryFactory solr.StandardDirectoryFactory
[junit4:junit4]   2> 11069 T449 oasc.CachingDirectoryFactory.get return new directory for /usr/home/hudson/hudson-slave/workspace/Lucene-Solr-Tests-trunk-java7/solr/build/solr-core/test/J0/./org.apache.solr.cloud.BasicDistributedZkTest-1359964174397/jetty2 forceNew:false
[junit4:junit4]   2> 11070 T449 oasc.CachingDirectoryFactory.close Releasing directory:/usr/home/hudson/hudson-slave/workspace/Lucene-Solr-Tests-trunk-java7/solr/build/solr-core/test/J0/./org.apache.solr.cloud.BasicDistributedZkTest-1359964174397/jetty2
[junit4:junit4]   2> 11070 T449 oasc.SolrCore.getNewIndexDir New index directory detected: old=null new=./org.apache.solr.cloud.BasicDistributedZkTest-1359964174397/jetty2/index/
[junit4:junit4]   2> 11070 T449 oasc.SolrCore.initIndex WARNING [collection1] Solr index directory './org.apache.solr.cloud.BasicDistributedZkTest-1359964174397/jetty2/index' doesn't exist. Creating new index...
[junit4:junit4]   2> 11071 T449 oasc.CachingDirectoryFactory.get return new directory for /usr/home/hudson/hudson-slave/workspace/Lucene-Solr-Tests-trunk-java7/solr/build/solr-core/test/J0/./org.apache.solr.cloud.BasicDistributedZkTest-1359964174397/jetty2/index forceNew:false
[junit4:junit4]   2> 11077 T449 oasc.SolrDeletionPolicy.onCommit SolrDeletionPolicy.onCommit: commits:num=1
[junit4:junit4]   2> 		commit{dir=RateLimitedDirectoryWrapper(org.apache.lucene.store.NIOFSDirectory@/usr/home/hudson/hudson-slave/workspace/Lucene-Solr-Tests-trunk-java7/solr/build/solr-core/test/J0/org.apache.solr.cloud.BasicDistributedZkTest-1359964174397/jetty2/index lockFactory=org.apache.lucene.store.NativeFSLockFactory@64eb9eaf),segFN=segments_1,generation=1,filenames=[segments_1]
[junit4:junit4]   2> 11078 T449 oasc.SolrDeletionPolicy.updateCommits newest commit = 1[segments_1]
[junit4:junit4]   2> 11079 T449 oasc.CachingDirectoryFactory.close Releasing directory:/usr/home/hudson/hudson-slave/workspace/Lucene-Solr-Tests-trunk-java7/solr/build/solr-core/test/J0/./org.apache.solr.cloud.BasicDistributedZkTest-1359964174397/jetty2/index
[junit4:junit4]   2> 11079 T449 oasc.SolrCore.initWriters created xml: solr.XMLResponseWriter
[junit4:junit4]   2> 11082 T449 oasup.UpdateRequestProcessorChain.init inserting DistributedUpdateProcessorFactory into updateRequestProcessorChain "dedupe"
[junit4:junit4]   2> 11082 T449 oasup.UpdateRequestProcessorChain.init inserting DistributedUpdateProcessorFactory into updateRequestProcessorChain "dedupe-allfields"
[junit4:junit4]   2> 11082 T449 oasup.UpdateRequestProcessorChain.init inserting DistributedUpdateProcessorFactory into updateRequestProcessorChain "stored_sig"
[junit4:junit4]   2> 11083 T449 oasup.UpdateRequestProcessorChain.init inserting DistributedUpdateProcessorFactory into updateRequestProcessorChain "uniq-fields"
[junit4:junit4]   2> 11084 T449 oasup.UpdateRequestProcessorChain.init inserting DistributedUpdateProcessorFactory into updateRequestProcessorChain "distrib-dup-test-chain-implicit"
[junit4:junit4]   2> 11084 T449 oasc.RequestHandlers.initHandlersFromConfig adding lazy requestHandler: solr.ReplicationHandler
[junit4:junit4]   2> 11084 T449 oasc.RequestHandlers.initHandlersFromConfig created /replication: solr.ReplicationHandler
[junit4:junit4]   2> 11085 T449 oasc.RequestHandlers.initHandlersFromConfig created standard: solr.StandardRequestHandler
[junit4:junit4]   2> 11086 T449 oasc.RequestHandlers.initHandlersFromConfig created /get: solr.RealTimeGetHandler
[junit4:junit4]   2> 11087 T449 oasc.RequestHandlers.initHandlersFromConfig created dismax: solr.SearchHandler
[junit4:junit4]   2> 11087 T449 oasc.RequestHandlers.initHandlersFromConfig created mock: org.apache.solr.core.MockQuerySenderListenerReqHandler
[junit4:junit4]   2> 11088 T449 oasc.RequestHandlers.initHandlersFromConfig created /admin/: org.apache.solr.handler.admin.AdminHandlers
[junit4:junit4]   2> 11089 T449 oasc.RequestHandlers.initHandlersFromConfig created defaults: solr.StandardRequestHandler
[junit4:junit4]   2> 11089 T449 oasc.RequestHandlers.initHandlersFromConfig adding lazy requestHandler: solr.StandardRequestHandler
[junit4:junit4]   2> 11090 T449 oasc.RequestHandlers.initHandlersFromConfig created lazy: solr.StandardRequestHandler
[junit4:junit4]   2> 11090 T449 oasc.RequestHandlers.initHandlersFromConfig created /update: solr.UpdateRequestHandler
[junit4:junit4]   2> 11091 T449 oasc.RequestHandlers.initHandlersFromConfig created /terms: org.apache.solr.handler.component.SearchHandler
[junit4:junit4]   2> 11092 T449 oasc.RequestHandlers.initHandlersFromConfig created spellCheckCompRH: org.apache.solr.handler.component.SearchHandler
[junit4:junit4]   2> 11092 T449 oasc.RequestHandlers.initHandlersFromConfig created spellCheckCompRH_Direct: org.apache.solr.handler.component.SearchHandler
[junit4:junit4]   2> 11093 T449 oasc.RequestHandlers.initHandlersFromConfig created spellCheckWithWordbreak: org.apache.solr.handler.component.SearchHandler
[junit4:junit4]   2> 11094 T449 oasc.RequestHandlers.initHandlersFromConfig created spellCheckWithWordbreak_Direct: org.apache.solr.handler.component.SearchHandler
[junit4:junit4]   2> 11094 T449 oasc.RequestHandlers.initHandlersFromConfig created spellCheckCompRH1: org.apache.solr.handler.component.SearchHandler
[junit4:junit4]   2> 11095 T449 oasc.RequestHandlers.initHandlersFromConfig created mltrh: org.apache.solr.handler.component.SearchHandler
[junit4:junit4]   2> 11096 T449 oasc.RequestHandlers.initHandlersFromConfig created tvrh: org.apache.solr.handler.component.SearchHandler
[junit4:junit4]   2> 11096 T449 oasc.RequestHandlers.initHandlersFromConfig created /mlt: solr.MoreLikeThisHandler
[junit4:junit4]   2> 11097 T449 oasc.RequestHandlers.initHandlersFromConfig created /debug/dump: solr.DumpRequestHandler
[junit4:junit4]   2> 11111 T449 oashl.XMLLoader.init xsltCacheLifetimeSeconds=60
[junit4:junit4]   2> 11118 T449 oasc.SolrCore.initDeprecatedSupport WARNING solrconfig.xml uses deprecated <admin/gettableFiles>, Please update your config to use the ShowFileRequestHandler.
[junit4:junit4]   2> 11120 T449 oasc.SolrCore.initDeprecatedSupport WARNING adding ShowFileRequestHandler with hidden files: [SCHEMA.XML, OLD_SYNONYMS.TXT, STOPWORDS.TXT, PROTWORDS.TXT, OPEN-EXCHANGE-RATES.JSON, SYNONYMS.TXT, CURRENCY.XML, MAPPING-ISOLATIN1ACCENT.TXT]
[junit4:junit4]   2> 11124 T449 oasc.CachingDirectoryFactory.close Releasing directory:/usr/home/hudson/hudson-slave/workspace/Lucene-Solr-Tests-trunk-java7/solr/build/solr-core/test/J0/./org.apache.solr.cloud.BasicDistributedZkTest-1359964174397/jetty2
[junit4:junit4]   2> 11126 T449 oass.SolrIndexSearcher.<init> Opening Searcher@14647a74 main
[junit4:junit4]   2> 11127 T449 oasu.CommitTracker.<init> Hard AutoCommit: disabled
[junit4:junit4]   2> 11127 T449 oasu.CommitTracker.<init> Soft AutoCommit: disabled
[junit4:junit4]   2> 11128 T449 oashc.SpellCheckComponent.inform Initializing spell checkers
[junit4:junit4]   2> 11139 T449 oass.DirectSolrSpellChecker.init init: {name=direct,classname=DirectSolrSpellChecker,field=lowerfilt,minQueryLength=3}
[junit4:junit4]   2> 11202 T450 oasc.SolrCore.registerSearcher [collection1] Registered new searcher Searcher@14647a74 main{StandardDirectoryReader(segments_1:1)}
[junit4:junit4]   2> 11210 T449 oasc.ZkController.publish publishing core=collection1 state=down
[junit4:junit4]   2> 11210 T449 oasc.ZkController.publish numShards not found on descriptor - reading it from system property
[junit4:junit4]   2> 12552 T415 oascc.ZkStateReader.updateClusterState Updating cloud state from ZooKeeper... 
[junit4:junit4]   2> 12553 T415 oasc.Overseer$ClusterStateUpdater.updateState Update state numShards=2 message={
[junit4:junit4]   2> 	  "operation":"state",
[junit4:junit4]   2> 	  "numShards":"2",
[junit4:junit4]   2> 	  "shard":null,
[junit4:junit4]   2> 	  "roles":null,
[junit4:junit4]   2> 	  "state":"down",
[junit4:junit4]   2> 	  "core":"collection1",
[junit4:junit4]   2> 	  "collection":"collection1",
[junit4:junit4]   2> 	  "node_name":"127.0.0.1:57496_",
[junit4:junit4]   2> 	  "base_url":"http://127.0.0.1:57496"}
[junit4:junit4]   2> 12554 T415 oasc.Overseer$ClusterStateUpdater.updateState Collection already exists with numShards=2
[junit4:junit4]   2> 12554 T415 oasc.Overseer$ClusterStateUpdater.updateState Assigning new node to shard shard=shard2
[junit4:junit4]   2> 12565 T420 oascc.ZkStateReader$2.process A cluster state change: WatchedEvent state:SyncConnected type:NodeDataChanged path:/clusterstate.json, has occurred - updating... (live nodes size: 3)
[junit4:junit4]   2> 12565 T414 oascc.ZkStateReader$2.process A cluster state change: WatchedEvent state:SyncConnected type:NodeDataChanged path:/clusterstate.json, has occurred - updating... (live nodes size: 3)
[junit4:junit4]   2> 12565 T448 oascc.ZkStateReader$2.process A cluster state change: WatchedEvent state:SyncConnected type:NodeDataChanged path:/clusterstate.json, has occurred - updating... (live nodes size: 3)
[junit4:junit4]   2> 12565 T433 oascc.ZkStateReader$2.process A cluster state change: WatchedEvent state:SyncConnected type:NodeDataChanged path:/clusterstate.json, has occurred - updating... (live nodes size: 3)
[junit4:junit4]   2> 13214 T449 oasc.CoreContainer.registerCore registering core: collection1
[junit4:junit4]   2> 13214 T449 oasc.ZkController.register Register replica - core:collection1 address:http://127.0.0.1:57496 collection:collection1 shard:shard2
[junit4:junit4]   2> 13216 T449 oascc.SolrZkClient.makePath makePath: /collections/collection1/leader_elect/shard2/election
[junit4:junit4]   2> 13238 T397 oazs.PrepRequestProcessor.pRequest Got user-level KeeperException when processing sessionid:0x13ca42e798a0008 type:delete cxid:0x44 zxid:0x7e txntype:-1 reqpath:n/a Error Path:/solr/collections/collection1/leaders/shard2 Error:KeeperErrorCode = NoNode for /solr/collections/collection1/leaders/shard2
[junit4:junit4]   2> 13240 T449 oasc.ShardLeaderElectionContext.runLeaderProcess Running the leader process.
[junit4:junit4]   2> 13241 T397 oazs.PrepRequestProcessor.pRequest Got user-level KeeperException when processing sessionid:0x13ca42e798a0008 type:create cxid:0x45 zxid:0x7f txntype:-1 reqpath:n/a Error Path:/solr/overseer Error:KeeperErrorCode = NodeExists for /solr/overseer
[junit4:junit4]   2> 13246 T449 oasc.ShardLeaderElectionContext.waitForReplicasToComeUp Enough replicas found to continue.
[junit4:junit4]   2> 13246 T449 oasc.ShardLeaderElectionContext.runLeaderProcess I may be the new leader - try and sync
[junit4:junit4]   2> 13247 T449 oasc.SyncStrategy.sync Sync replicas to http://127.0.0.1:57496/collection1/
[junit4:junit4]   2> 13247 T449 oasc.SyncStrategy.syncReplicas Sync Success - now sync replicas to me
[junit4:junit4]   2> 13247 T449 oasc.SyncStrategy.syncToMe http://127.0.0.1:57496/collection1/ has no replicas
[junit4:junit4]   2> 13248 T449 oasc.ShardLeaderElectionContext.runLeaderProcess I am the new leader: http://127.0.0.1:57496/collection1/
[junit4:junit4]   2> 13248 T449 oascc.SolrZkClient.makePath makePath: /collections/collection1/leaders/shard2
[junit4:junit4]   2> 13254 T397 oazs.PrepRequestProcessor.pRequest Got user-level KeeperException when processing sessionid:0x13ca42e798a0008 type:create cxid:0x4e zxid:0x82 txntype:-1 reqpath:n/a Error Path:/solr/overseer Error:KeeperErrorCode = NodeExists for /solr/overseer
[junit4:junit4]   2> 14081 T415 oascc.ZkStateReader.updateClusterState Updating cloud state from ZooKeeper... 
[junit4:junit4]   2> 14111 T420 oascc.ZkStateReader$2.process A cluster state change: WatchedEvent state:SyncConnected type:NodeDataChanged path:/clusterstate.json, has occurred - updating... (live nodes size: 3)
[junit4:junit4]   2> 14113 T414 oascc.ZkStateReader$2.process A cluster state change: WatchedEvent state:SyncConnected type:NodeDataChanged path:/clusterstate.json, has occurred - updating... (live nodes size: 3)
[junit4:junit4]   2> 14114 T433 oascc.ZkStateReader$2.process A cluster state change: WatchedEvent state:SyncConnected type:NodeDataChanged path:/clusterstate.json, has occurred - updating... (live nodes size: 3)
[junit4:junit4]   2> 14114 T448 oascc.ZkStateReader$2.process A cluster state change: WatchedEvent state:SyncConnected type:NodeDataChanged path:/clusterstate.json, has occurred - updating... (live nodes size: 3)
[junit4:junit4]   2> 14131 T449 oasc.ZkController.register We are http://127.0.0.1:57496/collection1/ and leader is http://127.0.0.1:57496/collection1/
[junit4:junit4]   2> 14131 T449 oasc.ZkController.register No LogReplay needed for core=collection1 baseURL=http://127.0.0.1:57496
[junit4:junit4]   2> 14131 T449 oasc.ZkController.checkRecovery I am the leader, no recovery necessary
[junit4:junit4]   2> 14132 T449 oasc.ZkController.publish publishing core=collection1 state=active
[junit4:junit4]   2> 14132 T449 oasc.ZkController.publish numShards not found on descriptor - reading it from system property
[junit4:junit4]   2> 14135 T449 oascc.ZkStateReader.updateClusterState Updating cloud state from ZooKeeper... 
[junit4:junit4]   2> 14137 T392 oass.SolrDispatchFilter.init user.dir=/usr/home/hudson/hudson-slave/workspace/Lucene-Solr-Tests-trunk-java7/solr/build/solr-core/test/J0
[junit4:junit4]   2> 14137 T392 oass.SolrDispatchFilter.init SolrDispatchFilter.init() done
[junit4:junit4]   2> 14138 T392 oascsi.HttpClientUtil.createClient Creating new http client, config:maxConnections=128&maxConnectionsPerHost=32&followRedirects=false
[junit4:junit4]   2> 14358 T392 oejs.Server.doStart jetty-8.1.8.v20121106
[junit4:junit4]   2> 14362 T392 oejs.AbstractConnector.doStart Started SocketConnector@127.0.0.1:57499
[junit4:junit4]   2> 14363 T392 oass.SolrDispatchFilter.init SolrDispatchFilter.init()
[junit4:junit4]   2> 14363 T392 oasc.SolrResourceLoader.locateSolrHome JNDI not configured for solr (NoInitialContextEx)
[junit4:junit4]   2> 14364 T392 oasc.SolrResourceLoader.locateSolrHome using system property solr.solr.home: /usr/home/hudson/hudson-slave/workspace/Lucene-Solr-Tests-trunk-java7/solr/build/solr-core/test/J0/./org.apache.solr.cloud.BasicDistributedZkTest-jetty3-1359964188544
[junit4:junit4]   2> 14364 T392 oasc.CoreContainer$Initializer.initialize looking for solr.xml: /usr/home/hudson/hudson-slave/workspace/Lucene-Solr-Tests-trunk-java7/solr/build/solr-core/test/J0/./org.apache.solr.cloud.BasicDistributedZkTest-jetty3-1359964188544/solr.xml
[junit4:junit4]   2> 14364 T392 oasc.CoreContainer.<init> New CoreContainer 1347951050
[junit4:junit4]   2> 14365 T392 oasc.CoreContainer.load Loading CoreContainer using Solr Home: '/usr/home/hudson/hudson-slave/workspace/Lucene-Solr-Tests-trunk-java7/solr/build/solr-core/test/J0/./org.apache.solr.cloud.BasicDistributedZkTest-jetty3-1359964188544/'
[junit4:junit4]   2> 14366 T392 oasc.SolrResourceLoader.<init> new SolrResourceLoader for directory: '/usr/home/hudson/hudson-slave/workspace/Lucene-Solr-Tests-trunk-java7/solr/build/solr-core/test/J0/./org.apache.solr.cloud.BasicDistributedZkTest-jetty3-1359964188544/'
[junit4:junit4]   2> 14436 T392 oashc.HttpShardHandlerFactory.getParameter Setting socketTimeout to: 60000
[junit4:junit4]   2> 14436 T392 oashc.HttpShardHandlerFactory.getParameter Setting urlScheme to: http://
[junit4:junit4]   2> 14437 T392 oashc.HttpShardHandlerFactory.getParameter Setting connTimeout to: 15000
[junit4:junit4]   2> 14437 T392 oashc.HttpShardHandlerFactory.getParameter Setting maxConnectionsPerHost to: 20
[junit4:junit4]   2> 14438 T392 oashc.HttpShardHandlerFactory.getParameter Setting corePoolSize to: 0
[junit4:junit4]   2> 14438 T392 oashc.HttpShardHandlerFactory.getParameter Setting maximumPoolSize to: 2147483647
[junit4:junit4]   2> 14439 T392 oashc.HttpShardHandlerFactory.getParameter Setting maxThreadIdleTime to: 5
[junit4:junit4]   2> 14439 T392 oashc.HttpShardHandlerFactory.getParameter Setting sizeOfQueue to: -1
[junit4:junit4]   2> 14440 T392 oashc.HttpShardHandlerFactory.getParameter Setting fairnessPolicy to: false
[junit4:junit4]   2> 14440 T392 oascsi.HttpClientUtil.createClient Creating new http client, config:maxConnectionsPerHost=20&maxConnections=10000&socketTimeout=60000&connTimeout=15000&retry=false
[junit4:junit4]   2> 14463 T392 oasc.CoreContainer.load Registering Log Listener
[junit4:junit4]   2> 14487 T392 oasc.CoreContainer.initZooKeeper Zookeeper client=127.0.0.1:57486/solr
[junit4:junit4]   2> 14487 T392 oasc.ZkController.checkChrootPath zkHost includes chroot
[junit4:junit4]   2> 14488 T392 oaz.ZooKeeper.<init> Initiating client connection, connectString=127.0.0.1:57486 sessionTimeout=60000 watcher=org.apache.solr.common.cloud.ConnectionManager@17dc56b4
[junit4:junit4]   2> 14489 T392 oascc.ConnectionManager.waitForConnected Waiting for client to connect to ZooKeeper
[junit4:junit4]   2> 14490 T460 oaz.ClientCnxn$SendThread.logStartConnect Opening socket connection to server localhost/127.0.0.1:57486. Will not attempt to authenticate using SASL (access denied ("javax.security.auth.AuthPermission" "getLoginConfiguration"))
[junit4:junit4]   2> 14491 T460 oaz.ClientCnxn$SendThread.primeConnection Socket connection established to localhost/127.0.0.1:57486, initiating session
[junit4:junit4]   2> 14491 T394 oazs.NIOServerCnxnFactory.run Accepted socket connection from /140.211.11.196:57500
[junit4:junit4]   2> 14491 T394 oazs.ZooKeeperServer.processConnectRequest Client attempting to establish new session at /140.211.11.196:57500
[junit4:junit4]   2> 14494 T396 oazs.ZooKeeperServer.finishSessionInit Established session 0x13ca42e798a0009 with negotiated timeout 20000 for client /140.211.11.196:57500
[junit4:junit4]   2> 14494 T460 oaz.ClientCnxn$SendThread.onConnected Session establishment complete on server localhost/127.0.0.1:57486, sessionid = 0x13ca42e798a0009, negotiated timeout = 20000
[junit4:junit4]   2> 14494 T461 oascc.ConnectionManager.process Watcher org.apache.solr.common.cloud.ConnectionManager@17dc56b4 name:ZooKeeperConnection Watcher:127.0.0.1:57486 got event WatchedEvent state:SyncConnected type:None path:null path:null type:None
[junit4:junit4]   2> 14494 T392 oascc.ConnectionManager.waitForConnected Client is connected to ZooKeeper
[junit4:junit4]   2> 14497 T397 oazs.PrepRequestProcessor.pRequest2Txn Processed session termination for sessionid: 0x13ca42e798a0009
[junit4:junit4]   2> 14510 T461 oaz.ClientCnxn$EventThread.run EventThread shut down
[junit4:junit4]   2> 14510 T394 oazs.NIOServerCnxn.closeSock Closed socket connection for client /140.211.11.196:57500 which had sessionid 0x13ca42e798a0009
[junit4:junit4]   2> 14510 T392 oaz.ZooKeeper.close Session: 0x13ca42e798a0009 closed
[junit4:junit4]   2> 14511 T392 oascsi.HttpClientUtil.createClient Creating new http client, config:maxConnections=500&maxConnectionsPerHost=16&socketTimeout=60000&connTimeout=15000
[junit4:junit4]   2> 14525 T392 oaz.ZooKeeper.<init> Initiating client connection, connectString=127.0.0.1:57486/solr sessionTimeout=30000 watcher=org.apache.solr.common.cloud.ConnectionManager@7373b483
[junit4:junit4]   2> 14526 T392 oascc.ConnectionManager.waitForConnected Waiting for client to connect to ZooKeeper
[junit4:junit4]   2> 14527 T462 oaz.ClientCnxn$SendThread.logStartConnect Opening socket connection to server localhost/127.0.0.1:57486. Will not attempt to authenticate using SASL (access denied ("javax.security.auth.AuthPermission" "getLoginConfiguration"))
[junit4:junit4]   2> 14527 T462 oaz.ClientCnxn$SendThread.primeConnection Socket connection established to localhost/127.0.0.1:57486, initiating session
[junit4:junit4]   2> 14528 T394 oazs.NIOServerCnxnFactory.run Accepted socket connection from /140.211.11.196:57501
[junit4:junit4]   2> 14528 T394 oazs.ZooKeeperServer.processConnectRequest Client attempting to establish new session at /140.211.11.196:57501
[junit4:junit4]   2> 14530 T396 oazs.ZooKeeperServer.finishSessionInit Established session 0x13ca42e798a000a with negotiated timeout 20000 for client /140.211.11.196:57501
[junit4:junit4]   2> 14530 T462 oaz.ClientCnxn$SendThread.onConnected Session establishment complete on server localhost/127.0.0.1:57486, sessionid = 0x13ca42e798a000a, negotiated timeout = 20000
[junit4:junit4]   2> 14530 T463 oascc.ConnectionManager.process Watcher org.apache.solr.common.cloud.ConnectionManager@7373b483 name:ZooKeeperConnection Watcher:127.0.0.1:57486/solr got event WatchedEvent state:SyncConnected type:None path:null path:null type:None
[junit4:junit4]   2> 14530 T392 oascc.ConnectionManager.waitForConnected Client is connected to ZooKeeper
[junit4:junit4]   2> 14532 T397 oazs.PrepRequestProcessor.pRequest Got user-level KeeperException when processing sessionid:0x13ca42e798a000a type:create cxid:0x1 zxid:0x8f txntype:-1 reqpath:n/a Error Path:/solr/overseer Error:KeeperErrorCode = NodeExists for /solr/overseer
[junit4:junit4]   2> 14535 T397 oazs.PrepRequestProcessor.pRequest Got user-level KeeperException when processing sessionid:0x13ca42e798a000a type:create cxid:0x2 zxid:0x90 txntype:-1 reqpath:n/a Error Path:/solr/overseer Error:KeeperErrorCode = NodeExists for /solr/overseer
[junit4:junit4]   2> 14538 T392 oasc.ZkController.createEphemeralLiveNode Register node as live in ZooKeeper:/live_nodes/127.0.0.1:57499_
[junit4:junit4]   2> 14539 T397 oazs.PrepRequestProcessor.pRequest Got user-level KeeperException when processing sessionid:0x13ca42e798a000a type:delete cxid:0x4 zxid:0x91 txntype:-1 reqpath:n/a Error Path:/solr/live_nodes/127.0.0.1:57499_ Error:KeeperErrorCode = NoNode for /solr/live_nodes/127.0.0.1:57499_
[junit4:junit4]   2> 14540 T392 oascc.SolrZkClient.makePath makePath: /live_nodes/127.0.0.1:57499_
[junit4:junit4]   2> 14544 T420 oascc.ZkStateReader$2.process A cluster state change: WatchedEvent state:SyncConnected type:NodeChildrenChanged path:/live_nodes, has occurred - updating... (live nodes size: 3)
[junit4:junit4]   2> 14544 T433 oascc.ZkStateReader$2.process A cluster state change: WatchedEvent state:SyncConnected type:NodeChildrenChanged path:/live_nodes, has occurred - updating... (live nodes size: 3)
[junit4:junit4]   2> 14545 T448 oascc.ZkStateReader$3.process Updating live nodes... (4)
[junit4:junit4]   2> 14546 T448 oascc.ZkStateReader$2.process A cluster state change: WatchedEvent state:SyncConnected type:NodeChildrenChanged path:/live_nodes, has occurred - updating... (live nodes size: 4)
[junit4:junit4]   2> 14546 T414 oascc.ZkStateReader$3.process Updating live nodes... (4)
[junit4:junit4]   2> 14546 T414 oascc.ZkStateReader$2.process A cluster state change: WatchedEvent state:SyncConnected type:NodeChildrenChanged path:/live_nodes, has occurred - updating... (live nodes size: 4)
[junit4:junit4]   2> 14548 T420 oascc.ZkStateReader$3.process Updating live nodes... (4)
[junit4:junit4]   2> 14549 T433 oascc.ZkStateReader$3.process Updating live nodes... (4)
[junit4:junit4]   2> 14553 T392 oascc.ZkStateReader.createClusterStateWatchersAndUpdate Updating cluster state from ZooKeeper... 
[junit4:junit4]   2> 14562 T464 oasc.CoreContainer.create Creating SolrCore 'collection1' using instanceDir: /usr/home/hudson/hudson-slave/workspace/Lucene-Solr-Tests-trunk-java7/solr/build/solr-core/test/J0/./org.apache.solr.cloud.BasicDistributedZkTest-jetty3-1359964188544/collection1
[junit4:junit4]   2> 14563 T464 oasc.ZkController.createCollectionZkNode Check for collection zkNode:collection1
[junit4:junit4]   2> 14564 T464 oasc.ZkController.createCollectionZkNode Collection zkNode exists
[junit4:junit4]   2> 14564 T464 oasc.ZkController.readConfigName Load collection config from:/collections/collection1
[junit4:junit4]   2> 14568 T464 oasc.SolrResourceLoader.<init> new SolrResourceLoader for directory: '/usr/home/hudson/hudson-slave/workspace/Lucene-Solr-Tests-trunk-java7/solr/build/solr-core/test/J0/./org.apache.solr.cloud.BasicDistributedZkTest-jetty3-1359964188544/collection1/'
[junit4:junit4]   2> 14569 T464 oasc.SolrResourceLoader.replaceClassLoader Adding 'file:/usr/home/hudson/hudson-slave/workspace/Lucene-Solr-Tests-trunk-java7/solr/build/solr-core/test/J0/org.apache.solr.cloud.BasicDistributedZkTest-jetty3-1359964188544/collection1/lib/README' to classloader
[junit4:junit4]   2> 14570 T464 oasc.SolrResourceLoader.replaceClassLoader Adding 'file:/usr/home/hudson/hudson-slave/workspace/Lucene-Solr-Tests-trunk-java7/solr/build/solr-core/test/J0/org.apache.solr.cloud.BasicDistributedZkTest-jetty3-1359964188544/collection1/lib/classes/' to classloader
[junit4:junit4]   2> 14627 T464 oasc.SolrConfig.<init> Using Lucene MatchVersion: LUCENE_50
[junit4:junit4]   2> 14721 T464 oasc.SolrConfig.<init> Loaded SolrConfig: solrconfig.xml
[junit4:junit4]   2> 14823 T464 oass.IndexSchema.readSchema Reading Solr Schema
[junit4:junit4]   2> 14830 T464 oass.IndexSchema.readSchema Schema name=test
[junit4:junit4]   2> 15440 T464 oass.OpenExchangeRatesOrgProvider.init Initialized with rates=open-exchange-rates.json, refreshInterval=1440.
[junit4:junit4]   2> 15449 T464 oass.IndexSchema.readSchema default search field in schema is text
[junit4:junit4]   2> 15452 T464 oass.IndexSchema.readSchema unique key field: id
[junit4:junit4]   2> 15490 T464 oass.FileExchangeRateProvider.reload Reloading exchange rates from file currency.xml
[junit4:junit4]   2> 15499 T464 oass.FileExchangeRateProvider.reload Reloading exchange rates from file currency.xml
[junit4:junit4]   2> 15507 T464 oass.OpenExchangeRatesOrgProvider.reload Reloading exchange rates from open-exchange-rates.json
[junit4:junit4]   2> 15510 T464 oass.OpenExchangeRatesOrgProvider.reload Reloading exchange rates from open-exchange-rates.json
[junit4:junit4]   2> 15513 T464 oasc.SolrCore.<init> [collection1] Opening new SolrCore at /usr/home/hudson/hudson-slave/workspace/Lucene-Solr-Tests-trunk-java7/solr/build/solr-core/test/J0/./org.apache.solr.cloud.BasicDistributedZkTest-jetty3-1359964188544/collection1/, dataDir=./org.apache.solr.cloud.BasicDistributedZkTest-1359964174397/jetty3/
[junit4:junit4]   2> 15513 T464 oasc.JmxMonitoredMap.<init> JMX monitoring is enabled. Adding Solr mbeans to JMX Server: com.sun.jmx.mbeanserver.JmxMBeanServer@5c1a7261
[junit4:junit4]   2> 15514 T464 oasc.SolrCore.initDirectoryFactory solr.StandardDirectoryFactory
[junit4:junit4]   2> 15515 T464 oasc.CachingDirectoryFactory.get return new directory for /usr/home/hudson/hudson-slave/workspace/Lucene-Solr-Tests-trunk-java7/solr/build/solr-core/test/J0/./org.apache.solr.cloud.BasicDistributedZkTest-1359964174397/jetty3 forceNew:false
[junit4:junit4]   2> 15516 T464 oasc.CachingDirectoryFactory.close Releasing directory:/usr/home/hudson/hudson-slave/workspace/Lucene-Solr-Tests-trunk-java7/solr/build/solr-core/test/J0/./org.apache.solr.cloud.BasicDistributedZkTest-1359964174397/jetty3
[junit4:junit4]   2> 15516 T464 oasc.SolrCore.getNewIndexDir New index directory detected: old=null new=./org.apache.solr.cloud.BasicDistributedZkTest-1359964174397/jetty3/index/
[junit4:junit4]   2> 15517 T464 oasc.SolrCore.initIndex WARNING [collection1] Solr index directory './org.apache.solr.cloud.BasicDistributedZkTest-1359964174397/jetty3/index' doesn't exist. Creating new index...
[junit4:junit4]   2> 15518 T464 oasc.CachingDirectoryFactory.get return new directory for /usr/home/hudson/hudson-slave/workspace/Lucene-Solr-Tests-trunk-java7/solr/build/solr-core/test/J0/./org.apache.solr.cloud.BasicDistributedZkTest-1359964174397/jetty3/index forceNew:false
[junit4:junit4]   2> 15550 T464 oasc.SolrDeletionPolicy.onCommit SolrDeletionPolicy.onCommit: commits:num=1
[junit4:junit4]   2> 		commit{dir=RateLimitedDirectoryWrapper(org.apache.lucene.store.NIOFSDirectory@/usr/home/hudson/hudson-slave/workspace/Lucene-Solr-Tests-trunk-java7/solr/build/solr-core/test/J0/org.apache.solr.cloud.BasicDistributedZkTest-1359964174397/jetty3/index lockFactory=org.apache.lucene.store.NativeFSLockFactory@6ff29305),segFN=segments_1,generation=1,filenames=[segments_1]
[junit4:junit4]   2> 15551 T464 oasc.SolrDeletionPolicy.updateCommits newest commit = 1[segments_1]
[junit4:junit4]   2> 15552 T464 oasc.CachingDirectoryFactory.close Releasing directory:/usr/home/hudson/hudson-slave/workspace/Lucene-Solr-Tests-trunk-java7/solr/build/solr-core/test/J0/./org.apache.solr.cloud.BasicDistributedZkTest-1359964174397/jetty3/index
[junit4:junit4]   2> 15552 T464 oasc.SolrCore.initWriters created xml: solr.XMLResponseWriter
[junit4:junit4]   2> 15555 T464 oasup.UpdateRequestProcessorChain.init inserting DistributedUpdateProcessorFactory into updateRequestProcessorChain "dedupe"
[junit4:junit4]   2> 15555 T464 oasup.UpdateRequestProcessorChain.init inserting DistributedUpdateProcessorFactory into updateRequestProcessorChain "dedupe-allfields"
[junit4:junit4]   2> 15555 T464 oasup.UpdateRequestProcessorChain.init inserting DistributedUpdateProcessorFactory into updateRequestProcessorChain "stored_sig"
[junit4:junit4]   2> 15556 T464 oasup.UpdateRequestProcessorChain.init inserting DistributedUpdateProcessorFactory into updateRequestProcessorChain "uniq-fields"
[junit4:junit4]   2> 15557 T464 oasup.UpdateRequestProcessorChain.init inserting DistributedUpdateProcessorFactory into updateRequestProcessorChain "distrib-dup-test-chain-implicit"
[junit4:junit4]   2> 15557 T464 oasc.RequestHandlers.initHandlersFromConfig adding lazy requestHandler: solr.ReplicationHandler
[junit4:junit4]   2> 15557 T464 oasc.RequestHandlers.initHandlersFromConfig created /replication: solr.ReplicationHandler
[junit4:junit4]   2> 15558 T464 oasc.RequestHandlers.initHandlersFromConfig created standard: solr.StandardRequestHandler
[junit4:junit4]   2> 15559 T464 oasc.RequestHandlers.initHandlersFromConfig created /get: solr.RealTimeGetHandler
[junit4:junit4]   2> 15560 T464 oasc.RequestHandlers.initHandlersFromConfig created dismax: solr.SearchHandler
[junit4:junit4]   2> 15560 T464 oasc.RequestHandlers.initHandlersFromConfig created mock: org.apache.solr.core.MockQuerySenderListenerReqHandler
[junit4:junit4]   2> 15561 T464 oasc.RequestHandlers.initHandlersFromConfig created /admin/: org.apache.solr.handler.admin.AdminHandlers
[junit4:junit4]   2> 15562 T464 oasc.RequestHandlers.initHandlersFromConfig created defaults: solr.StandardRequestHandler
[junit4:junit4]   2> 15562 T464 oasc.RequestHandlers.initHandlersFromConfig adding lazy requestHandler: solr.StandardRequestHandler
[junit4:junit4]   2> 15563 T464 oasc.RequestHandlers.initHandlersFromConfig created lazy: solr.StandardRequestHandler
[junit4:junit4]   2> 15563 T464 oasc.RequestHandlers.initHandlersFromConfig created /update: solr.UpdateRequestHandler
[junit4:junit4]   2> 15564 T464 oasc.RequestHandlers.initHandlersFromConfig created /terms: org.apache.solr.handler.component.SearchHandler
[junit4:junit4]   2> 15565 T464 oasc.RequestHandlers.initHandlersFromConfig created spellCheckCompRH: org.apache.solr.handler.component.SearchHandler
[junit4:junit4]   2> 15565 T464 oasc.RequestHandlers.initHandlersFromConfig created spellCheckCompRH_Direct: org.apache.solr.handler.component.SearchHandler
[junit4:junit4]   2> 15566 T464 oasc.RequestHandlers.initHandlersFromConfig created spellCheckWithWordbreak: org.apache.solr.handler.component.SearchHandler
[junit4:junit4]   2> 15566 T464 oasc.RequestHandlers.initHandlersFromConfig created spellCheckWithWordbreak_Direct: org.apache.solr.handler.component.SearchHandler
[junit4:junit4]   2> 15567 T464 oasc.RequestHandlers.initHandlersFromConfig created spellCheckCompRH1: org.apache.solr.handler.component.SearchHandler
[junit4:junit4]   2> 15568 T464 oasc.RequestHandlers.initHandlersFromConfig created mltrh: org.apache.solr.handler.component.SearchHandler
[junit4:junit4]   2> 15569 T464 oasc.RequestHandlers.initHandlersFromConfig created tvrh: org.apache.solr.handler.component.SearchHandler
[junit4:junit4]   2> 15569 T464 oasc.RequestHandlers.initHandlersFromConfig created /mlt: solr.MoreLikeThisHandler
[junit4:junit4]   2> 15570 T464 oasc.RequestHandlers.initHandlersFromConfig created /debug/dump: solr.DumpRequestHandler
[junit4:junit4]   2> 15586 T464 oashl.XMLLoader.init xsltCacheLifetimeSeconds=60
[junit4:junit4]   2> 15594 T464 oasc.SolrCore.initDeprecatedSupport WARNING solrconfig.xml uses deprecated <admin/gettableFiles>, Please update your config to use the ShowFileRequestHandler.
[junit4:junit4]   2> 15596 T464 oasc.SolrCore.initDeprecatedSupport WARNING adding ShowFileRequestHandler with hidden files: [SCHEMA.XML, OLD_SYNONYMS.TXT, STOPWORDS.TXT, PROTWORDS.TXT, OPEN-EXCHANGE-RATES.JSON, SYNONYMS.TXT, CURRENCY.XML, MAPPING-ISOLATIN1ACCENT.TXT]
[junit4:junit4]   2> 15599 T464 oasc.CachingDirectoryFactory.close Releasing directory:/usr/home/hudson/hudson-slave/workspace/Lucene-Solr-Tests-trunk-java7/solr/build/solr-core/test/J0/./org.apache.solr.cloud.BasicDistributedZkTest-1359964174397/jetty3
[junit4:junit4]   2> 15601 T464 oass.SolrIndexSearcher.<init> Opening Searcher@6a9d8d3f main
[junit4:junit4]   2> 15603 T464 oasu.CommitTracker.<init> Hard AutoCommit: disabled
[junit4:junit4]   2> 15603 T464 oasu.CommitTracker.<init> Soft AutoCommit: disabled
[junit4:junit4]   2> 15604 T464 oashc.SpellCheckComponent.inform Initializing spell checkers
[junit4:junit4]   2> 15614 T464 oass.DirectSolrSpellChecker.init init: {name=direct,classname=DirectSolrSpellChecker,field=lowerfilt,minQueryLength=3}
[junit4:junit4]   2> 15625 T415 oascc.ZkStateReader.updateClusterState Updating cloud state from ZooKeeper... 
[junit4:junit4]   2> 15626 T415 oasc.Overseer$ClusterStateUpdater.updateState Update state numShards=2 message={
[junit4:junit4]   2> 	  "operation":"state",
[junit4:junit4]   2> 	  "numShards":"2",
[junit4:junit4]   2> 	  "shard":"shard2",
[junit4:junit4]   2> 	  "roles":null,
[junit4:junit4]   2> 	  "state":"active",
[junit4:junit4]   2> 	  "core":"collection1",
[junit4:junit4]   2> 	  "collection":"collection1",
[junit4:junit4]   2> 	  "node_name":"127.0.0.1:57496_",
[junit4:junit4]   2> 	  "base_url":"http://127.0.0.1:57496"}
[junit4:junit4]   2> 15646 T414 oascc.ZkStateReader$2.process A cluster state change: WatchedEvent state:SyncConnected type:NodeDataChanged path:/clusterstate.json, has occurred - updating... (live nodes size: 4)
[junit4:junit4]   2> 15647 T448 oascc.ZkStateReader$2.process A cluster state change: WatchedEvent state:SyncConnected type:NodeDataChanged path:/clusterstate.json, has occurred - updating... (live nodes size: 4)
[junit4:junit4]   2> 15647 T433 oascc.ZkStateReader$2.process A cluster state change: WatchedEvent state:SyncConnected type:NodeDataChanged path:/clusterstate.json, has occurred - updating... (live nodes size: 4)
[junit4:junit4]   2> 15646 T463 oascc.ZkStateReader$2.process A cluster state change: WatchedEvent state:SyncConnected type:NodeDataChanged path:/clusterstate.json, has occurred - updating... (live nodes size: 4)
[junit4:junit4]   2> 15646 T420 oascc.ZkStateReader$2.process A cluster state change: WatchedEvent state:SyncConnected type:NodeDataChanged path:/clusterstate.json, has occurred - updating... (live nodes size: 4)
[junit4:junit4]   2> 15682 T465 oasc.SolrCore.registerSearcher [collection1] Registered new searcher Searcher@6a9d8d3f main{StandardDirectoryReader(segments_1:1)}
[junit4:junit4]   2> 15689 T464 oasc.ZkController.publish publishing core=collection1 state=down
[junit4:junit4]   2> 15689 T464 oasc.ZkController.publish numShards not found on descriptor - reading it from system property
[junit4:junit4]   2> 17172 T415 oascc.ZkStateReader.updateClusterState Updating cloud state from ZooKeeper... 
[junit4:junit4]   2> 17173 T415 oasc.Overseer$ClusterStateUpdater.updateState Update state numShards=2 message={
[junit4:junit4]   2> 	  "operation":"state",
[junit4:junit4]   2> 	  "numShards":"2",
[junit4:junit4]   2> 	  "shard":null,
[junit4:junit4]   2> 	  "roles":null,
[junit4:junit4]   2> 	  "state":"down",
[junit4:junit4]   2> 	  "core":"collection1",
[junit4:junit4]   2> 	  "collection":"collection1",
[junit4:junit4]   2> 	  "node_name":"127.0.0.1:57499_",
[junit4:junit4]   2> 	  "base_url":"http://127.0.0.1:57499"}
[junit4:junit4]   2> 17173 T415 oasc.Overseer$ClusterStateUpdater.updateState Collection already exists with numShards=2
[junit4:junit4]   2> 17173 T415 oasc.Overseer$ClusterStateUpdater.updateState Assigning new node to shard shard=shard1
[junit4:junit4]   2> 17192 T448 oascc.ZkStateReader$2.process A cluster state change: WatchedEvent state:SyncConnected type:NodeDataChanged path:/clusterstate.json, has occurred - updating... (live nodes size: 4)
[junit4:junit4]   2> 17192 T433 oascc.ZkStateReader$2.process A cluster state change: WatchedEvent state:SyncConnected type:NodeDataChanged path:/clusterstate.json, has occurred - updating... (live nodes size: 4)
[junit4:junit4]   2> 17192 T414 oascc.ZkStateReader$2.process A cluster state change: WatchedEvent state:SyncConnected type:NodeDataChanged path:/clusterstate.json, has occurred - updating... (live nodes size: 4)
[junit4:junit4]   2> 17193 T463 oascc.ZkStateReader$2.process A cluster state change: WatchedEvent state:SyncConnected type:NodeDataChanged path:/clusterstate.json, has occurred - updating... (live nodes size: 4)
[junit4:junit4]   2> 17192 T420 oascc.ZkStateReader$2.process A cluster state change: WatchedEvent state:SyncConnected type:NodeDataChanged path:/clusterstate.json, has occurred - updating... (live nodes size: 4)
[junit4:junit4]   2> 17694 T464 oasc.CoreContainer.registerCore registering core: collection1
[junit4:junit4]   2> 17694 T464 oasc.ZkController.register Register replica - core:collection1 address:http://127.0.0.1:57499 collection:collection1 shard:shard1
[junit4:junit4]   2> 17707 T464 oasc.ZkController.register We are http://127.0.0.1:57499/collection1/ and leader is http://127.0.0.1:57493/collection1/
[junit4:junit4]   2> 17707 T464 oasc.ZkController.register No LogReplay needed for core=collection1 baseURL=http://127.0.0.1:57499
[junit4:junit4]   2> 17707 T464 oasc.ZkController.checkRecovery Core needs to recover:collection1
[junit4:junit4]   2> 17708 T464 oasu.DefaultSolrCoreState.doRecovery Running recovery - first canceling any ongoing recovery
[junit4:junit4]   2> ASYNC  NEW_CORE C66 name=collection1 org.apache.solr.core.SolrCore@329bfb6c url=http://127.0.0.1:57499/collection1 node=127.0.0.1:57499_ C66_STATE=coll:collection1 core:collection1 props:{shard=null, roles=null, state=down, core=collection1, collection=collection1, node_name=127.0.0.1:57499_, base_url=http://127.0.0.1:57499}
[junit4:junit4]   2> 17715 T466 C66 P57499 oasc.RecoveryStrategy.run Starting recovery process.  core=collection1 recoveringAfterStartup=true
[junit4:junit4]   2> 17716 T466 C66 P57499 oasc.RecoveryStrategy.doRecovery ###### startupVersions=[]
[junit4:junit4]   2> 17716 T464 oascc.ZkStateReader.updateClusterState Updating cloud state from ZooKeeper... 
[junit4:junit4]   2> 17716 T466 C66 P57499 oasc.ZkController.publish publishing core=collection1 state=recovering
[junit4:junit4]   2> 17716 T466 C66 P57499 oasc.ZkController.publish numShards not found on descriptor - reading it from system property
[junit4:junit4]   2> 17718 T392 oass.SolrDispatchFilter.init user.dir=/usr/home/hudson/hudson-slave/workspace/Lucene-Solr-Tests-trunk-java7/solr/build/solr-core/test/J0
[junit4:junit4]   2> 17718 T392 oass.SolrDispatchFilter.init SolrDispatchFilter.init() done
[junit4:junit4]   2> 17719 T466 C66 P57499 oascsi.HttpClientUtil.createClient Creating new http client, config:maxConnections=128&maxConnectionsPerHost=32&followRedirects=false
[junit4:junit4]   2> 17719 T392 oascsi.HttpClientUtil.createClient Creating new http client, config:maxConnections=128&maxConnectionsPerHost=32&followRedirects=false
[junit4:junit4]   2> 17939 T392 oejs.Server.doStart jetty-8.1.8.v20121106
[junit4:junit4]   2> 17942 T392 oejs.AbstractConnector.doStart Started SocketConnector@127.0.0.1:57503
[junit4:junit4]   2> 17943 T392 oass.SolrDispatchFilter.init SolrDispatchFilter.init()
[junit4:junit4]   2> 17944 T392 oasc.SolrResourceLoader.locateSolrHome JNDI not configured for solr (NoInitialContextEx)
[junit4:junit4]   2> 17945 T392 oasc.SolrResourceLoader.locateSolrHome using system property solr.solr.home: /usr/home/hudson/hudson-slave/workspace/Lucene-Solr-Tests-trunk-java7/solr/build/solr-core/test/J0/./org.apache.solr.cloud.BasicDistributedZkTest-jetty4-1359964192127
[junit4:junit4]   2> 17945 T392 oasc.CoreContainer$Initializer.initialize looking for solr.xml: /usr/home/hudson/hudson-slave/workspace/Lucene-Solr-Tests-trunk-java7/solr/build/solr-core/test/J0/./org.apache.solr.cloud.BasicDistributedZkTest-jetty4-1359964192127/solr.xml
[junit4:junit4]   2> 17946 T392 oasc.CoreContainer.<init> New CoreContainer 365908951
[junit4:junit4]   2> 17947 T392 oasc.CoreContainer.load Loading CoreContainer using Solr Home: '/usr/home/hudson/hudson-slave/workspace/Lucene-Solr-Tests-trunk-java7/solr/build/solr-core/test/J0/./org.apache.solr.cloud.BasicDistributedZkTest-jetty4-1359964192127/'
[junit4:junit4]   2> 17948 T392 oasc.SolrResourceLoader.<init> new SolrResourceLoader for directory: '/usr/home/hudson/hudson-slave/workspace/Lucene-Solr-Tests-trunk-java7/solr/build/solr-core/test/J0/./org.apache.solr.cloud.BasicDistributedZkTest-jetty4-1359964192127/'
[junit4:junit4]   2> 18012 T392 oashc.HttpShardHandlerFactory.getParameter Setting socketTimeout to: 60000
[junit4:junit4]   2> 18012 T392 oashc.HttpShardHandlerFactory.getParameter Setting urlScheme to: http://
[junit4:junit4]   2> 18013 T392 oashc.HttpShardHandlerFactory.getParameter Setting connTimeout to: 15000
[junit4:junit4]   2> 18013 T392 oashc.HttpShardHandlerFactory.getParameter Setting maxConnectionsPerHost to: 20
[junit4:junit4]   2> 18014 T392 oashc.HttpShardHandlerFactory.getParameter Setting corePoolSize to: 0
[junit4:junit4]   2> 18014 T392 oashc.HttpShardHandlerFactory.getParameter Setting maximumPoolSize to: 2147483647
[junit4:junit4]   2> 18015 T392 oashc.HttpShardHandlerFactory.getParameter Setting maxThreadIdleTime to: 5
[junit4:junit4]   2> 18015 T392 oashc.HttpShardHandlerFactory.getParameter Setting sizeOfQueue to: -1
[junit4:junit4]   2> 18016 T392 oashc.HttpShardHandlerFactory.getParameter Setting fairnessPolicy to: false
[junit4:junit4]   2> 18016 T392 oascsi.HttpClientUtil.createClient Creating new http client, config:maxConnectionsPerHost=20&maxConnections=10000&socketTimeout=60000&connTimeout=15000&retry=false
[junit4:junit4]   2> 18041 T392 oasc.CoreContainer.load Registering Log Listener
[junit4:junit4]   2> 18079 T392 oasc.CoreContainer.initZooKeeper Zookeeper client=127.0.0.1:57486/solr
[junit4:junit4]   2> 18080 T392 oasc.ZkController.checkChrootPath zkHost includes chroot
[junit4:junit4]   2> 18081 T392 oaz.ZooKeeper.<init> Initiating client connection, connectString=127.0.0.1:57486 sessionTimeout=60000 watcher=org.apache.solr.common.cloud.ConnectionManager@27835573
[junit4:junit4]   2> 18082 T392 oascc.ConnectionManager.waitForConnected Waiting for client to connect to ZooKeeper
[junit4:junit4]   2> 18082 T476 oaz.ClientCnxn$SendThread.logStartConnect Opening socket connection to server localhost/127.0.0.1:57486. Will not attempt to authenticate using SASL (access denied ("javax.security.auth.AuthPermission" "getLoginConfiguration"))
[junit4:junit4]   2> 18083 T476 oaz.ClientCnxn$SendThread.primeConnection Socket connection established to localhost/127.0.0.1:57486, initiating session
[junit4:junit4]   2> 18084 T394 oazs.NIOServerCnxnFactory.run Accepted socket connection from /140.211.11.196:57504
[junit4:junit4]   2> 18084 T394 oazs.ZooKeeperServer.processConnectRequest Client attempting to establish new session at /140.211.11.196:57504
[junit4:junit4]   2> 18091 T396 oazs.ZooKeeperServer.finishSessionInit Established session 0x13ca42e798a000b with negotiated timeout 20000 for client /140.211.11.196:57504
[junit4:junit4]   2> 18091 T476 oaz.ClientCnxn$SendThread.onConnected Session establishment complete on server localhost/127.0.0.1:57486, sessionid = 0x13ca42e798a000b, negotiated timeout = 20000
[junit4:junit4]   2> 18092 T477 oascc.ConnectionManager.process Watcher org.apache.solr.common.cloud.ConnectionManager@27835573 name:ZooKeeperConnection Watcher:127.0.0.1:57486 got event WatchedEvent state:SyncConnected type:None path:null path:null type:None
[junit4:junit4]   2> 18092 T392 oascc.ConnectionManager.waitForConnected Client is connected to ZooKeeper
[junit4:junit4]   2> 18094 T397 oazs.PrepRequestProcessor.pRequest2Txn Processed session termination for sessionid: 0x13ca42e798a000b
[junit4:junit4]   2> 18095 T394 oazs.NIOServerCnxn.closeSock Closed socket connection for client /140.211.11.196:57504 which had sessionid 0x13ca42e798a000b
[junit4:junit4]   2> 18096 T477 oaz.ClientCnxn$EventThread.run EventThread shut down
[junit4:junit4]   2> 18096 T392 oaz.ZooKeeper.close Session: 0x13ca42e798a000b closed
[junit4:junit4]   2> 18096 T392 oascsi.HttpClientUtil.createClient Creating new http client, config:maxConnections=500&maxConnectionsPerHost=16&socketTimeout=60000&connTimeout=15000
[junit4:junit4]   2> 18112 T392 oaz.ZooKeeper.<init> Initiating client connection, connectString=127.0.0.1:57486/solr sessionTimeout=30000 watcher=org.apache.solr.common.cloud.ConnectionManager@15ec85e2
[junit4:junit4]   2> 18113 T392 oascc.ConnectionManager.waitForConnected Waiting for client to connect to ZooKeeper
[junit4:junit4]   2> 18114 T478 oaz.ClientCnxn$SendThread.logStartConnect Opening socket connection to server localhost/127.0.0.1:57486. Will not attempt to authenticate using SASL (access denied ("javax.security.auth.AuthPermission" "getLoginConfiguration"))
[junit4:junit4]   2> 18114 T478 oaz.ClientCnxn$SendThread.primeConnection Socket connection established to localhost/127.0.0.1:57486, initiating session
[junit4:junit4]   2> 18115 T394 oazs.NIOServerCnxnFactory.run Accepted socket connection from /140.211.11.196:57505
[junit4:junit4]   2> 18115 T394 oazs.ZooKeeperServer.processConnectRequest Client attempting to establish new session at /140.211.11.196:57505
[junit4:junit4]   2> 18117 T396 oazs.ZooKeeperServer.finishSessionInit Established session 0x13ca42e798a000c with negotiated timeout 20000 for client /140.211.11.196:57505
[junit4:junit4]   2> 18117 T478 oaz.ClientCnxn$SendThread.onConnected Session establishment complete on server localhost/127.0.0.1:57486, sessionid = 0x13ca42e798a000c, negotiated timeout = 20000
[junit4:junit4]   2> 18117 T479 oascc.ConnectionManager.process Watcher org.apache.solr.common.cloud.ConnectionManager@15ec85e2 name:ZooKeeperConnection Watcher:127.0.0.1:57486/solr got event WatchedEvent state:SyncConnected type:None path:null path:null type:None
[junit4:junit4]   2> 18117 T392 oascc.ConnectionManager.waitForConnected Client is connected to ZooKeeper
[junit4:junit4]   2> 18119 T397 oazs.PrepRequestProcessor.pRequest Got user-level KeeperException when processing sessionid:0x13ca42e798a000c type:create cxid:0x1 zxid:0xa2 txntype:-1 reqpath:n/a Error Path:/solr/overseer Error:KeeperErrorCode = NodeExists for /solr/overseer
[junit4:junit4]   2> 18123 T397 oazs.PrepRequestProcessor.pRequest Got user-level KeeperException when processing sessionid:0x13ca42e798a000c type:create cxid:0x2 zxid:0xa3 txntype:-1 reqpath:n/a Error Path:/solr/overseer Error:KeeperErrorCode = NodeExists for /solr/overseer
[junit4:junit4]   2> 18125 T392 oasc.ZkController.createEphemeralLiveNode Register node as live in ZooKeeper:/live_nodes/127.0.0.1:57503_
[junit4:junit4]   2> 18126 T397 oazs.PrepRequestProcessor.pRequest Got user-level KeeperException when processing sessionid:0x13ca42e798a000c type:delete cxid:0x4 zxid:0xa4 txntype:-1 reqpath:n/a Error Path:/solr/live_nodes/127.0.0.1:57503_ Error:KeeperErrorCode = NoNode for /solr/live_nodes/127.0.0.1:57503_
[junit4:junit4]   2> 18128 T392 oascc.SolrZkClient.makePath makePath: /live_nodes/127.0.0.1:57503_
[junit4:junit4]   2> 18136 T420 oascc.ZkStateReader$2.process A cluster state change: WatchedEvent state:SyncConnected type:NodeChildrenChanged path:/live_nodes, has occurred - updating... (live nodes size: 4)
[junit4:junit4]   2> 18136 T463 oascc.ZkStateReader$2.process A cluster state change: WatchedEvent state:SyncConnected type:NodeChildrenChanged path:/live_nodes, has occurred - updating... (live nodes size: 4)
[junit4:junit4]   2> 18136 T433 oascc.ZkStateReader$2.process A cluster state change: WatchedEvent state:SyncConnected type:NodeChildrenChanged path:/live_nodes, has occurred - updating... (live nodes size: 4)
[junit4:junit4]   2> 18137 T448 oascc.ZkStateReader$3.process Updating live nodes... (5)
[junit4:junit4]   2> 18138 T414 oascc.ZkStateReader$3.process Updating live nodes... (5)
[junit4:junit4]   2> 18138 T448 oascc.ZkStateReader$2.process A cluster state change: WatchedEvent state:SyncConnected type:NodeChildrenChanged path:/live_nodes, has occurred - updating... (live nodes size: 5)
[junit4:junit4]   2> 18138 T414 oascc.ZkStateReader$2.process A cluster state change: WatchedEvent state:SyncConnected type:NodeChildrenChanged path:/live_nodes, has occurred - updating... (live nodes size: 5)
[junit4:junit4]   2> 18140 T463 oascc.ZkStateReader$3.process Updating live nodes... (5)
[junit4:junit4]   2> 18141 T433 oascc.ZkStateReader$3.process Updating live nodes... (5)
[junit4:junit4]   2> 18141 T420 oascc.ZkStateReader$3.process Updating live nodes... (5)
[junit4:junit4]   2> 18146 T392 oascc.ZkStateReader.createClusterStateWatchersAndUpdate Updating cluster state from ZooKeeper... 
[junit4:junit4]   2> 18157 T480 oasc.CoreContainer.create Creating SolrCore 'collection1' using instanceDir: /usr/home/hudson/hudson-slave/workspace/Lucene-Solr-Tests-trunk-java7/solr/build/solr-core/test/J0/./org.apache.solr.cloud.BasicDistributedZkTest-jetty4-1359964192127/collection1
[junit4:junit4]   2> 18158 T480 oasc.ZkController.createCollectionZkNode Check for collection zkNode:collection1
[junit4:junit4]   2> 18159 T480 oasc.ZkController.createCollectionZkNode Collection zkNode exists
[junit4:junit4]   2> 18160 T480 oasc.ZkController.readConfigName Load collection config from:/collections/collection1
[junit4:junit4]   2> 18162 T480 oasc.SolrResourceLoader.<init> new SolrResourceLoader for directory: '/usr/home/hudson/hudson-slave/workspace/Lucene-Solr-Tests-trunk-java7/solr/build/solr-core/test/J0/./org.apache.solr.cloud.BasicDistributedZkTest-jetty4-1359964192127/collection1/'
[junit4:junit4]   2> 18164 T480 oasc.SolrResourceLoader.replaceClassLoader Adding 'file:/usr/home/hudson/hudson-slave/workspace/Lucene-Solr-Tests-trunk-java7/solr/build/solr-core/test/J0/org.apache.solr.cloud.BasicDistributedZkTest-jetty4-1359964192127/collection1/lib/classes/' to classloader
[junit4:junit4]   2> 18165 T480 oasc.SolrResourceLoader.replaceClassLoader Adding 'file:/usr/home/hudson/hudson-slave/workspace/Lucene-Solr-Tests-trunk-java7/solr/build/solr-core/test/J0/org.apache.solr.cloud.BasicDistributedZkTest-jetty4-1359964192127/collection1/lib/README' to classloader
[junit4:junit4]   2> 18229 T480 oasc.SolrConfig.<init> Using Lucene MatchVersion: LUCENE_50
[junit4:junit4]   2> 18313 T480 oasc.SolrConfig.<init> Loaded SolrConfig: solrconfig.xml
[junit4:junit4]   2> 18414 T480 oass.IndexSchema.readSchema Reading Solr Schema
[junit4:junit4]   2> 18422 T480 oass.IndexSchema.readSchema Schema name=test
[junit4:junit4]   2> 18702 T415 oascc.ZkStateReader.updateClusterState Updating cloud state from ZooKeeper... 
[junit4:junit4]   2> 18706 T415 oasc.Overseer$ClusterStateUpdater.updateState Update state numShards=2 message={
[junit4:junit4]   2> 	  "operation":"state",
[junit4:junit4]   2> 	  "numShards":"2",
[junit4:junit4]   2> 	  "shard":"shard1",
[junit4:junit4]   2> 	  "roles":null,
[junit4:junit4]   2> 	  "state":"recovering",
[junit4:junit4]   2> 	  "core":"collection1",
[junit4:junit4]   2> 	  "collection":"collection1",
[junit4:junit4]   2> 	  "node_name":"127.0.0.1:57499_",
[junit4:junit4]   2> 	  "base_url":"http://127.0.0.1:57499"}
[junit4:junit4]   2> 18745 T420 oascc.ZkStateReader$2.process A cluster state change: WatchedEvent state:SyncConnected type:NodeDataChanged path:/clusterstate.json, has occurred - updating... (live nodes size: 5)
[junit4:junit4]   2> 18745 T479 oascc.ZkStateReader$2.process A cluster state change: WatchedEvent state:SyncConnected type:NodeDataChanged path:/clusterstate.json, has occurred - updating... (live nodes size: 5)
[junit4:junit4]   2> 18745 T433 oascc.ZkStateReader$2.process A cluster state change: WatchedEvent state:SyncConnected type:NodeDataChanged path:/clusterstate.json, has occurred - updating... (live nodes size: 5)
[junit4:junit4]   2> 18745 T463 oascc.ZkStateReader$2.process A cluster state change: WatchedEvent state:SyncConnected type:NodeDataChanged path:/clusterstate.json, has occurred - updating... (live nodes size: 5)
[junit4:junit4]   2> 18745 T448 oascc.ZkStateReader$2.process A cluster state change: WatchedEvent state:SyncConnected type:NodeDataChanged path:/clusterstate.json, has occurred - updating... (live nodes size: 5)
[junit4:junit4]   2> 18745 T414 oascc.ZkStateReader$2.process A cluster state change: WatchedEvent state:SyncConnected type:NodeDataChanged path:/clusterstate.json, has occurred - updating... (live nodes size: 5)
[junit4:junit4]   2> 19200 T480 oass.OpenExchangeRatesOrgProvider.init Initialized with rates=open-exchange-rates.json, refreshInterval=1440.
[junit4:junit4]   2> 19213 T480 oass.IndexSchema.readSchema default search field in schema is text
[junit4:junit4]   2> 19217 T480 oass.IndexSchema.readSchema unique key field: id
[junit4:junit4]   2> 19242 T480 oass.FileExchangeRateProvider.reload Reloading exchange rates from file currency.xml
[junit4:junit4]   2> 19248 T480 oass.FileExchangeRateProvider.reload Reloading exchange rates from file currency.xml
[junit4:junit4]   2> 19253 T480 oass.OpenExchangeRatesOrgProvider.reload Reloading exchange rates from open-exchange-rates.json
[junit4:junit4]   2> 19255 T480 oass.OpenExchangeRatesOrgProvider.reload Reloading exchange rates from open-exchange-rates.json
[junit4:junit4]   2> 19257 T480 oasc.SolrCore.<init> [collection1] Opening new SolrCore at /usr/home/hudson/hudson-slave/workspace/Lucene-Solr-Tests-trunk-java7/solr/build/solr-core/test/J0/./org.apache.solr.cloud.BasicDistributedZkTest-jetty4-1359964192127/collection1/, dataDir=./org.apache.solr.cloud.BasicDistributedZkTest-1359964174397/jetty4/
[junit4:junit4]   2> 19257 T480 oasc.JmxMonitoredMap.<init> JMX monitoring is enabled. Adding Solr mbeans to JMX Server: com.sun.jmx.mbeanserver.JmxMBeanServer@5c1a7261
[junit4:junit4]   2> 19258 T480 oasc.SolrCore.initDirectoryFactory solr.StandardDirectoryFactory
[junit4:junit4]   2> 19259 T480 oasc.CachingDirectoryFactory.get return new directory for /usr/home/hudson/hudson-slave/workspace/Lucene-Solr-Tests-trunk-java7/solr/build/solr-core/test/J0/./org.apache.solr.cloud.BasicDistributedZkTest-1359964174397/jetty4 forceNew:false
[junit4:junit4]   2> 19259 T480 oasc.CachingDirectoryFactory.close Releasing directory:/usr/home/hudson/hudson-slave/workspace/Lucene-Solr-Tests-trunk-java7/solr/build/solr-core/test/J0/./org.apache.solr.cloud.BasicDistributedZkTest-1359964174397/jetty4
[junit4:junit4]   2> 19259 T480 oasc.SolrCore.getNewIndexDir New index directory detected: old=null new=./org.apache.solr.cloud.BasicDistributedZkTest-1359964174397/jetty4/index/
[junit4:junit4]   2> 19260 T480 oasc.SolrCore.initIndex WARNING [collection1] Solr index directory './org.apache.solr.cloud.BasicDistributedZkTest-1359964174397/jetty4/index' doesn't exist. Creating new index...
[junit4:junit4]   2> 19261 T480 oasc.CachingDirectoryFactory.get return new directory for /usr/home/hudson/hudson-slave/workspace/Lucene-Solr-Tests-trunk-java7/solr/build/solr-core/test/J0/./org.apache.solr.cloud.BasicDistributedZkTest-1359964174397/jetty4/index forceNew:false
[junit4:junit4]   2> 19273 T480 oasc.SolrDeletionPolicy.onCommit SolrDeletionPolicy.onCommit: commits:num=1
[junit4:junit4]   2> 		commit{dir=RateLimitedDirectoryWrapper(org.apache.lucene.store.NIOFSDirectory@/usr/home/hudson/hudson-slave/workspace/Lucene-Solr-Tests-trunk-java7/solr/build/solr-core/test/J0/org.apache.solr.cloud.BasicDistributedZkTest-1359964174397/jetty4/index lockFactory=org.apache.lucene.store.NativeFSLockFactory@791e2d7d),segFN=segments_1,generation=1,filenames=[segments_1]
[junit4:junit4]   2> 19274 T480 oasc.SolrDeletionPolicy.updateCommits newest commit = 1[segments_1]
[junit4:junit4]   2> 19274 T480 oasc.CachingDirectoryFactory.close Releasing directory:/usr/home/hudson/hudson-slave/workspace/Lucene-Solr-Tests-trunk-java7/solr/build/solr-core/test/J0/./org.apache.solr.cloud.BasicDistributedZkTest-1359964174397/jetty4/index
[junit4:junit4]   2> 19275 T480 oasc.SolrCore.initWriters created xml: solr.XMLResponseWriter
[junit4:junit4]   2> 19276 T480 oasup.UpdateRequestProcessorChain.init inserting DistributedUpdateProcessorFactory into updateRequestProcessorChain "dedupe"
[junit4:junit4]   2> 19276 T480 oasup.UpdateRequestProcessorChain.init inserting DistributedUpdateProcessorFactory into updateRequestProcessorChain "dedupe-allfields"
[junit4:junit4]   2> 19277 T480 oasup.UpdateRequestProcessorChain.init inserting DistributedUpdateProcessorFactory into updateRequestProcessorChain "stored_sig"
[junit4:junit4]   2> 19277 T480 oasup.UpdateRequestProcessorChain.init inserting DistributedUpdateProcessorFactory into updateRequestProcessorChain "uniq-fields"
[junit4:junit4]   2> 19277 T480 oasup.UpdateRequestProcessorChain.init inserting DistributedUpdateProcessorFactory into updateRequestProcessorChain "distrib-dup-test-chain-implicit"
[junit4:junit4]   2> 19278 T480 oasc.RequestHandlers.initHandlersFromConfig adding lazy requestHandler: solr.ReplicationHandler
[junit4:junit4]   2> 19278 T480 oasc.RequestHandlers.initHandlersFromConfig created /replication: solr.ReplicationHandler
[junit4:junit4]   2> 19279 T480 oasc.RequestHandlers.initHandlersFromConfig created standard: solr.StandardRequestHandler
[junit4:junit4]   2> 19279 T480 oasc.RequestHandlers.initHandlersFromConfig created /get: solr.RealTimeGetHandler
[junit4:junit4]   2> 19279 T480 oasc.RequestHandlers.initHandlersFromConfig created dismax: solr.SearchHandler
[junit4:junit4]   2> 19280 T480 oasc.RequestHandlers.initHandlersFromConfig created mock: org.apache.solr.core.MockQuerySenderListenerReqHandler
[junit4:junit4]   2> 19280 T480 oasc.RequestHandlers.initHandlersFromConfig created /admin/: org.apache.solr.handler.admin.AdminHandlers
[junit4:junit4]   2> 19281 T480 oasc.RequestHandlers.initHandlersFromConfig created defaults: solr.StandardRequestHandler
[junit4:junit4]   2> 19281 T480 oasc.RequestHandlers.initHandlersFromConfig adding lazy requestHandler: solr.StandardRequestHandler
[junit4:junit4]   2> 19281 T480 oasc.RequestHandlers.initHandlersFromConfig created lazy: solr.StandardRequestHandler
[junit4:junit4]   2> 19281 T480 oasc.RequestHandlers.initHandlersFromConfig created /update: solr.UpdateRequestHandler
[junit4:junit4]   2> 19282 T480 oasc.RequestHandlers.initHandlersFromConfig created /terms: org.apache.solr.handler.component.SearchHandler
[junit4:junit4]   2> 19282 T480 oasc.RequestHandlers.initHandlersFromConfig created spellCheckCompRH: org.apache.solr.handler.component.SearchHandler
[junit4:junit4]   2> 19283 T480 oasc.RequestHandlers.initHandlersFromConfig created spellCheckCompRH_Direct: org.apache.solr.handler.component.SearchHandler
[junit4:junit4]   2> 19283 T480 oasc.RequestHandlers.initHandlersFromConfig created spellCheckWithWordbreak: org.apache.solr.handler.component.SearchHandler
[junit4:junit4]   2> 19283 T480 oasc.RequestHandlers.initHandlersFromConfig created spellCheckWithWordbreak_Direct: org.apache.solr.handler.component.SearchHandler
[junit4:junit4]   2> 19284 T480 oasc.RequestHandlers.initHandlersFromConfig created spellCheckCompRH1: org.apache.solr.handler.component.SearchHandler
[junit4:junit4]   2> 19284 T480 oasc.RequestHandlers.initHandlersFromConfig created mltrh: org.apache.solr.handler.component.SearchHandler
[junit4:junit4]   2> 19285 T480 oasc.RequestHandlers.initHandlersFromConfig created tvrh: org.apache.solr.handler.component.SearchHandler
[junit4:junit4]   2> 19285 T480 oasc.RequestHandlers.initHandlersFromConfig created /mlt: solr.MoreLikeThisHandler
[junit4:junit4]   2> 19285 T480 oasc.RequestHandlers.initHandlersFromConfig created /debug/dump: solr.DumpRequestHandler
[junit4:junit4]   2> 19296 T480 oashl.XMLLoader.init xsltCacheLifetimeSeconds=60
[junit4:junit4]   2> 19300 T480 oasc.SolrCore.initDeprecatedSupport WARNING solrconfig.xml uses deprecated <admin/gettableFiles>, Please update your config to use the ShowFileRequestHandler.
[junit4:junit4]   2> 19302 T480 oasc.SolrCore.initDeprecatedSupport WARNING adding ShowFileRequestHandler with hidden files: [SCHEMA.XML, OLD_SYNONYMS.TXT, STOPWORDS.TXT, PROTWORDS.TXT, OPEN-EXCHANGE-RATES.JSON, SYNONYMS.TXT, CURRENCY.XML, MAPPING-ISOLATIN1ACCENT.TXT]
[junit4:junit4]   2> 19305 T480 oasc.CachingDirectoryFactory.close Releasing directory:/usr/home/hudson/hudson-slave/workspace/Lucene-Solr-Tests-trunk-java7/solr/build/solr-core/test/J0/./org.apache.solr.cloud.BasicDistributedZkTest-1359964174397/jetty4
[junit4:junit4]   2> 19306 T480 oass.SolrIndexSearcher.<init> Opening Searcher@3fdd7b0f main
[junit4:junit4]   2> 19308 T480 oasu.CommitTracker.<init> Hard AutoCommit: disabled
[junit4:junit4]   2> 19308 T480 oasu.CommitTracker.<init> Soft AutoCommit: disabled
[junit4:junit4]   2> 19308 T480 oashc.SpellCheckComponent.inform Initializing spell checkers
[junit4:junit4]   2> 19316 T480 oass.DirectSolrSpellChecker.init init: {name=direct,classname=DirectSolrSpellChecker,field=lowerfilt,minQueryLength=3}
[junit4:junit4]   2> 19362 T481 oasc.SolrCore.registerSearcher [collection1] Registered new searcher Searcher@3fdd7b0f main{StandardDirectoryReader(segments_1:1)}
[junit4:junit4]   2> 19366 T480 oasc.ZkController.publish publishing core=collection1 state=down
[junit4:junit4]   2> 19366 T480 oasc.ZkController.publish numShards not found on descriptor - reading it from system property
[junit4:junit4]   2> 20255 T415 oascc.ZkStateReader.updateClusterState Updating cloud state from ZooKeeper... 
[junit4:junit4]   2> 20257 T415 oasc.Overseer$ClusterStateUpdater.updateState Update state numShards=2 message={
[junit4:junit4]   2> 	  "operation":"state",
[junit4:junit4]   2> 	  "numShards":"2",
[junit4:junit4]   2> 	  "shard":null,
[junit4:junit4]   2> 	  "roles":null,
[junit4:junit4]   2> 	  "state":"down",
[junit4:junit4]   2> 	  "core":"collection1",
[junit4:junit4]   2> 	  "collection":"collection1",
[junit4:junit4]   2> 	  "node_name":"127.0.0.1:57503_",
[junit4:junit4]   2> 	  "base_url":"http://127.0.0.1:57503"}
[junit4:junit4]   2> 20257 T415 oasc.Overseer$ClusterStateUpdater.updateState Collection already exists with numShards=2
[junit4:junit4]   2> 20257 T415 oasc.Overseer$ClusterStateUpdater.updateState Assigning new node to shard shard=shard2
[junit4:junit4]   2> 20296 T479 oascc.ZkStateReader$2.process A cluster state change: WatchedEvent state:SyncConnected type:NodeDataChanged path:/clusterstate.json, has occurred - updating... (live nodes size: 5)
[junit4:junit4]   2> 20296 T463 oascc.ZkStateReader$2.process A cluster state change: WatchedEvent state:SyncConnected type:NodeDataChanged path:/clusterstate.json, has occurred - updating... (live nodes size: 5)
[junit4:junit4]   2> 20296 T433 oascc.ZkStateReader$2.process A cluster state change: WatchedEvent state:SyncConnected type:NodeDataChanged path:/clusterstate.json, has occurred - updating... (live nodes size: 5)
[junit4:junit4]   2> 20296 T448 oascc.ZkStateReader$2.process A cluster state change: WatchedEvent state:SyncConnected type:NodeDataChanged path:/clusterstate.json, has occurred - updating... (live nodes size: 5)
[junit4:junit4]   2> 20296 T420 oascc.ZkStateReader$2.process A cluster state change: WatchedEvent state:SyncConnected type:NodeDataChanged path:/clusterstate.json, has occurred - updating... (live nodes size: 5)
[junit4:junit4]   2> 20296 T414 oascc.ZkStateReader$2.process A cluster state change: WatchedEvent state:SyncConnected type:NodeDataChanged path:/clusterstate.json, has occurred - updating... (live nodes size: 5)
[junit4:junit4]   2> 20370 T480 oasc.CoreContainer.registerCore registering core: collection1
[junit4:junit4]   2> 20370 T480 oasc.ZkController.register Register replica - core:collection1 address:http://127.0.0.1:57503 collection:collection1 shard:shard2
[junit4:junit4]   2> 20376 T480 oasc.ZkController.register We are http://127.0.0.1:57503/collection1/ and leader is http://127.0.0.1:57496/collection1/
[junit4:junit4]   2> 20376 T480 oasc.ZkController.register No LogReplay needed for core=collection1 baseURL=http://127.0.0.1:57503
[junit4:junit4]   2> 20377 T480 oasc.ZkController.checkRecovery Core needs to recover:collection1
[junit4:junit4]   2> 20377 T480 oasu.DefaultSolrCoreState.doRecovery Running recovery - first canceling any ongoing recovery
[junit4:junit4]   2> ASYNC  NEW_CORE C67 name=collection1 org.apache.solr.core.SolrCore@1e455cba url=http://127.0.0.1:57503/collection1 node=127.0.0.1:57503_ C67_STATE=coll:collection1 core:collection1 props:{shard=null, roles=null, state=down, core=collection1, collection=collection1, node_name=127.0.0.1:57503_, base_url=http://127.0.0.1:57503}
[junit4:junit4]   2> 20377 T482 C67 P57503 oasc.RecoveryStrategy.run Starting recovery process.  core=collection1 recoveringAfterStartup=true
[junit4:junit4]   2> 20378 T482 C67 P57503 oasc.RecoveryStrategy.doRecovery ###### startupVersions=[]
[junit4:junit4]   2> 20378 T482 C67 P57503 oasc.ZkController.publish publishing core=collection1 state=recovering
[junit4:junit4]   2> 20378 T482 C67 P57503 oasc.ZkController.publish numShards not found on descriptor - reading it from system property
[junit4:junit4]   2> 20378 T480 oascc.ZkStateReader.updateClusterState Updating cloud state from ZooKeeper... 
[junit4:junit4]   2> 20381 T482 C67 P57503 oascsi.HttpClientUtil.createClient Creating new http client, config:maxConnections=128&maxConnectionsPerHost=32&followRedirects=false
[junit4:junit4]   2> 20382 T392 oass.SolrDispatchFilter.init user.dir=/usr/home/hudson/hudson-slave/workspace/Lucene-Solr-Tests-trunk-java7/solr/build/solr-core/test/J0
[junit4:junit4]   2> 20382 T392 oass.SolrDispatchFilter.init SolrDispatchFilter.init() done
[junit4:junit4]   2> 20383 T392 oascsi.HttpClientUtil.createClient Creating new http client, config:maxConnections=128&maxConnectionsPerHost=32&followRedirects=false
[junit4:junit4]   2> 20410 T392 oascc.ZkStateReader.updateClusterState Updating cloud state from ZooKeeper... 
[junit4:junit4]   2> 20413 T392 oasc.AbstractDistribZkTestBase.waitForRecoveriesToFinish Wait for recoveries to finish - collection: collection1 failOnTimeout:true timeout (sec):230
[junit4:junit4]   2> 20415 T392 oascc.ZkStateReader.updateClusterState Updating cloud state from ZooKeeper... 
[junit4:junit4]   2>  C66_STATE=coll:collection1 core:collection1 props:{shard=shard1, roles=null, state=recovering, core=collection1, collection=collection1, node_name=127.0.0.1:57499_, base_url=http://127.0.0.1:57499}
[junit4:junit4]   2> 20768 T466 C66 P57499 oasc.RecoveryStrategy.doRecovery Attempting to PeerSync from http://127.0.0.1:57493/collection1/ core=collection1 - recoveringAfterStartup=true
[junit4:junit4]   2> 20778 T466 C66 P57499 oascsi.HttpClientUtil.createClient Creating new http client, config:maxConnectionsPerHost=20&maxConnections=10000&connTimeout=30000&socketTimeout=30000&retry=false
[junit4:junit4]   2> 20797 T466 C66 P57499 oasu.PeerSync.sync PeerSync: core=collection1 url=http://127.0.0.1:57499 START replicas=[http://127.0.0.1:57493/collection1/] nUpdates=100
[junit4:junit4]   2> 20798 T466 C66 P57499 oasu.PeerSync.sync WARNING no frame of reference to tell of we've missed updates
[junit4:junit4]   2> 20798 T466 C66 P57499 oasc.RecoveryStrategy.doRecovery PeerSync Recovery was not successful - trying replication. core=collection1
[junit4:junit4]   2> 20799 T466 C66 P57499 oasc.RecoveryStrategy.doRecovery Starting Replication Recovery. core=collection1
[junit4:junit4]   2> 20799 T466 C66 P57499 oasc.RecoveryStrategy.doRecovery Begin buffering updates. core=collection1
[junit4:junit4]   2> 20799 T466 C66 P57499 oasu.UpdateLog.bufferUpdates Starting to buffer updates. FSUpdateLog{state=ACTIVE, tlog=null}
[junit4:junit4]   2> 20800 T466 C66 P57499 oasc.RecoveryStrategy.replicate Attempting to replicate from http://127.0.0.1:57493/collection1/. core=collection1
[junit4:junit4]   2> 20800 T466 C66 P57499 oascsi.HttpClientUtil.createClient Creating new http client, config:maxConnections=128&maxConnectionsPerHost=32&followRedirects=false
[junit4:junit4]   2> ASYNC  NEW_CORE C68 name=collection1 org.apache.solr.core.SolrCore@b3fb8af url=http://127.0.0.1:57493/collection1 node=127.0.0.1:57493_ C68_STATE=coll:collection1 core:collection1 props:{shard=shard1, roles=null, state=active, core=collection1, collection=collection1, node_name=127.0.0.1:57493_, base_url=http://127.0.0.1:57493, leader=true}
[junit4:junit4]   2> 20816 T424 C68 P57493 REQ /get {getVersions=100&distrib=false&wt=javabin&qt=/get&version=2} status=0 QTime=0 
[junit4:junit4]   2> 20838 T425 C68 P57493 oasu.DirectUpdateHandler2.commit start commit{,optimize=false,openSearcher=false,waitSearcher=true,expungeDeletes=false,softCommit=false}
[junit4:junit4]   2> 20840 T425 C68 P57493 oasc.CachingDirectoryFactory.close Releasing directory:/usr/home/hudson/hudson-slave/workspace/Lucene-Solr-Tests-trunk-java7/solr/build/solr-core/test/J0/./org.apache.solr.cloud.BasicDistributedZkTest-1359964174397/jetty1
[junit4:junit4]   2> 20844 T425 C68 P57493 oasc.SolrDeletionPolicy.onInit SolrDeletionPolicy.onInit: commits:num=1
[junit4:junit4]   2> 		commit{dir=RateLimitedDirectoryWrapper(org.apache.lucene.store.NIOFSDirectory@/usr/home/hudson/hudson-slave/workspace/Lucene-Solr-Tests-trunk-java7/solr/build/solr-core/test/J0/org.apache.solr.cloud.BasicDistributedZkTest-1359964174397/jetty1/index lockFactory=org.apache.lucene.store.NativeFSLockFactory@6b20f25),segFN=segments_1,generation=1,filenames=[segments_1]
[junit4:junit4]   2> 20845 T425 C68 P57493 oasc.SolrDeletionPolicy.updateCommits newest commit = 1[segments_1]
[junit4:junit4]   2> 20852 T425 C68 P57493 oasc.SolrDeletionPolicy.onCommit SolrDeletionPolicy.onCommit: commits:num=2
[junit4:junit4]   2> 		commit{dir=RateLimitedDirectoryWrapper(org.apache.lucene.store.NIOFSDirectory@/usr/home/hudson/hudson-slave/workspace/Lucene-Solr-Tests-trunk-java7/solr/build/solr-core/test/J0/org.apache.solr.cloud.BasicDistributedZkTest-1359964174397/jetty1/index lockFactory=org.apache.lucene.store.NativeFSLockFactory@6b20f25),segFN=segments_1,generation=1,filenames=[segments_1]
[junit4:junit4]   2> 		commit{dir=RateLimitedDirectoryWrapper(org.apache.lucene.store.NIOFSDirectory@/usr/home/hudson/hudson-slave/workspace/Lucene-Solr-Tests-trunk-java7/solr/build/solr-core/test/J0/org.apache.solr.cloud.BasicDistributedZkTest-1359964174397/jetty1/index lockFactory=org.apache.lucene.store.NativeFSLockFactory@6b20f25),segFN=segments_2,generation=2,filenames=[segments_2]
[junit4:junit4]   2> 20853 T425 C68 P57493 oasc.SolrDeletionPolicy.updateCommits newest commit = 2[segments_2]
[junit4:junit4]   2> 20855 T425 C68 P57493 oasc.CachingDirectoryFactory.close Releasing directory:/usr/home/hudson/hudson-slave/workspace/Lucene-Solr-Tests-trunk-java7/solr/build/solr-core/test/J0/./org.apache.solr.cloud.BasicDistributedZkTest-1359964174397/jetty1
[junit4:junit4]   2> 20855 T425 C68 P57493 oass.SolrIndexSearcher.<init> Opening Searcher@4d2457b1 realtime
[junit4:junit4]   2> 20856 T425 C68 P57493 oasu.DirectUpdateHandler2.commit end_commit_flush
[junit4:junit4]   2> 20857 T425 C68 P57493 /update {waitSearcher=true&openSearcher=false&commit=true&wt=javabin&commit_end_point=true&version=2&softCommit=false} {commit=} 0 37
[junit4:junit4]   2> 20859 T466 C66 P57499 oash.ReplicationHandler.inform Commits will be reserved for  10000
[junit4:junit4]   2> 20859 T466 C66 P57499 oascsi.HttpClientUtil.createClient Creating new http client, config:connTimeout=5000&socketTimeout=20000&allowCompression=false&maxConnections=10000&maxConnectionsPerHost=10000
[junit4:junit4]   2> 20892 T466 C66 P57499 oash.SnapPuller.<init>  No value set for 'pollInterval'. Timer Task not started.
[junit4:junit4]   2> 20897 T426 C68 P57493 oash.ReplicationHandler.inform Commits will be reserved for  10000
[junit4:junit4]   2> 20898 T426 C68 P57493 REQ /replication {command=indexversion&qt=/replication&wt=javabin&version=2} status=0 QTime=2 
[junit4:junit4]   2> 20899 T466 C66 P57499 oash.SnapPuller.fetchLatestIndex Master's generation: 2
[junit4:junit4]   2> 20899 T466 C66 P57499 oash.SnapPuller.fetchLatestIndex Slave's generation: 1
[junit4:junit4]   2> 20900 T466 C66 P57499 oash.SnapPuller.fetchLatestIndex Starting replication process
[junit4:junit4]   2> 20903 T426 C68 P57493 oasc.CachingDirectoryFactory.close Releasing directory:/usr/home/hudson/hudson-slave/workspace/Lucene-Solr-Tests-trunk-java7/solr/build/solr-core/test/J0/./org.apache.solr.cloud.BasicDistributedZkTest-1359964174397/jetty1
[junit4:junit4]   2> 20904 T426 C68 P57493 oasc.CachingDirectoryFactory.close Releasing directory:/usr/home/hudson/hudson-slave/workspace/Lucene-Solr-Tests-trunk-java7/solr/build/solr-core/test/J0/./org.apache.solr.cloud.BasicDistributedZkTest-1359964174397/jetty1/index
[junit4:junit4]   2> 20904 T426 C68 P57493 REQ /replication {command=filelist&qt=/replication&wt=javabin&generation=2&version=2} status=0 QTime=2 
[junit4:junit4]   2> 20905 T466 C66 P57499 oash.SnapPuller.fetchLatestIndex Number of files in latest index in master: 1
[junit4:junit4]   2> 20907 T466 C66 P57499 oasc.CachingDirectoryFactory.get return new directory for /usr/home/hudson/hudson-slave/workspace/Lucene-Solr-Tests-trunk-java7/solr/build/solr-core/test/J0/./org.apache.solr.cloud.BasicDistributedZkTest-1359964174397/jetty3/index.20130204074955295 forceNew:false
[junit4:junit4]   2> 20907 T466 C66 P57499 oasc.CachingDirectoryFactory.close Releasing directory:/usr/home/hudson/hudson-slave/workspace/Lucene-Solr-Tests-trunk-java7/solr/build/solr-core/test/J0/./org.apache.solr.cloud.BasicDistributedZkTest-1359964174397/jetty3
[junit4:junit4]   2> 20908 T466 C66 P57499 oash.SnapPuller.fetchLatestIndex Starting download to RateLimitedDirectoryWrapper(org.apache.lucene.store.NIOFSDirectory@/usr/home/hudson/hudson-slave/workspace/Lucene-Solr-Tests-trunk-java7/solr/build/solr-core/test/J0/org.apache.solr.cloud.BasicDistributedZkTest-1359964174397/jetty3/index.20130204074955295 lockFactory=org.apache.lucene.store.NativeFSLockFactory@e872d2f) fullCopy=true
[junit4:junit4]   2> 20925 T426 C68 P57493 REQ /replication {file=segments_2&command=filecontent&checksum=true&wt=filestream&qt=/replication&generation=2} status=0 QTime=7 
[junit4:junit4]   2> 20947 T466 C66 P57499 oasc.CachingDirectoryFactory.close Releasing directory:/usr/home/hudson/hudson-slave/workspace/Lucene-Solr-Tests-trunk-java7/solr/build/solr-core/test/J0/./org.apache.solr.cloud.BasicDistributedZkTest-1359964174397/jetty3/index
[junit4:junit4]   2> 20947 T466 C66 P57499 oash.SnapPuller.fetchLatestIndex Total time taken for download : 0 secs
[junit4:junit4]   2> 20948 T466 C66 P57499 oash.SnapPuller.modifyIndexProps New index installed. Updating index properties... index=index.20130204074955295
[junit4:junit4]   2> 20950 T466 C66 P57499 oasc.CachingDirectoryFactory.close Releasing directory:/usr/home/hudson/hudson-slave/workspace/Lucene-Solr-Tests-trunk-java7/solr/build/solr-core/test/J0/./org.apache.solr.cloud.BasicDistributedZkTest-1359964174397/jetty3
[junit4:junit4]   2> 20951 T466 C66 P57499 oasc.CachingDirectoryFactory.close Releasing directory:/usr/home/hudson/hudson-slave/workspace/Lucene-Solr-Tests-trunk-java7/solr/build/solr-core/test/J0/./org.apache.solr.cloud.BasicDistributedZkTest-1359964174397/jetty3
[junit4:junit4]   2> 20951 T466 C66 P57499 oasc.SolrCore.getNewIndexDir New index directory detected: old=./org.apache.solr.cloud.BasicDistributedZkTest-1359964174397/jetty3/index/ new=./org.apache.solr.cloud.BasicDistributedZkTest-1359964174397/jetty3/index.20130204074955295
[junit4:junit4]   2> 20955 T466 C66 P57499 oasc.SolrDeletionPolicy.onInit SolrDeletionPolicy.onInit: commits:num=1
[junit4:junit4]   2> 		commit{dir=RateLimitedDirectoryWrapper(org.apache.lucene.store.NIOFSDirectory@/usr/home/hudson/hudson-slave/workspace/Lucene-Solr-Tests-trunk-java7/solr/build/solr-core/test/J0/org.apache.solr.cloud.BasicDistributedZkTest-1359964174397/jetty3/index.20130204074955295 lockFactory=org.apache.lucene.store.NativeFSLockFactory@e872d2f),segFN=segments_2,generation=2,filenames=[segments_2]
[junit4:junit4]   2> 20956 T466 C66 P57499 oasc.SolrDeletionPolicy.updateCommits newest commit = 2[segments_2]
[junit4:junit4]   2> 20958 T466 C66 P57499 oasc.CachingDirectoryFactory.close Releasing directory:/usr/home/hudson/hudson-slave/workspace/Lucene-Solr-Tests-trunk-java7/solr/build/solr-core/test/J0/./org.apache.solr.cloud.BasicDistributedZkTest-1359964174397/jetty3
[junit4:junit4]   2> 20962 T466 C66 P57499 oasu.DefaultSolrCoreState.newIndexWriter Creating new IndexWriter...
[junit4:junit4]   2> 20963 T466 C66 P57499 oasu.DefaultSolrCoreState.newIndexWriter Waiting until IndexWriter is unused... core=collection1
[junit4:junit4]   2> 20963 T466 C66 P57499 oasu.DefaultSolrCoreState.newIndexWriter Rollback old IndexWriter... core=collection1
[junit4:junit4]   2> 20964 T466 C66 P57499 oasc.CachingDirectoryFactory.close Releasing directory:/usr/home/hudson/hudson-slave/workspace/Lucene-Solr-Tests-trunk-java7/solr/build/solr-core/test/J0/./org.apache.solr.cloud.BasicDistributedZkTest-1359964174397/jetty3/index.20130204074955295
[junit4:junit4]   2> 20965 T466 C66 P57499 oasc.CachingDirectoryFactory.close Releasing directory:/usr/home/hudson/hudson-slave/workspace/Lucene-Solr-Tests-trunk-java7/solr/build/solr-core/test/J0/./org.apache.solr.cloud.BasicDistributedZkTest-1359964174397/jetty3
[junit4:junit4]   2> 20969 T466 C66 P57499 oasc.SolrDeletionPolicy.onInit SolrDeletionPolicy.onInit: commits:num=1
[junit4:junit4]   2> 		commit{dir=RateLimitedDirectoryWrapper(org.apache.lucene.store.NIOFSDirectory@/usr/home/hudson/hudson-slave/workspace/Lucene-Solr-Tests-trunk-java7/solr/build/solr-core/test/J0/org.apache.solr.cloud.BasicDistributedZkTest-1359964174397/jetty3/index.20130204074955295 lockFactory=org.apache.lucene.store.NativeFSLockFactory@e872d2f),segFN=segments_2,generation=2,filenames=[segments_2]
[junit4:junit4]   2> 20969 T466 C66 P57499 oasc.SolrDeletionPolicy.updateCommits newest commit = 2[segments_2]
[junit4:junit4]   2> 20969 T466 C66 P57499 oasu.DefaultSolrCoreState.newIndexWriter New IndexWriter is ready to be used.
[junit4:junit4]   2> 20970 T466 C66 P57499 oasc.CachingDirectoryFactory.close Releasing directory:/usr/home/hudson/hudson-slave/workspace/Lucene-Solr-Tests-trunk-java7/solr/build/solr-core/test/J0/./org.apache.solr.cloud.BasicDistributedZkTest-1359964174397/jetty3
[junit4:junit4]   2> 20970 T466 C66 P57499 oass.SolrIndexSearcher.<init> Opening Searcher@7f1654e7 main
[junit4:junit4]   2> 20972 T465 oasc.SolrCore.registerSearcher [collection1] Registered new searcher Searcher@7f1654e7 main{StandardDirectoryReader(segments_2:1:nrt)}
[junit4:junit4]   2> 20973 T465 oasc.CachingDirectoryFactory.close Releasing directory:/usr/home/hudson/hudson-slave/workspace/Lucene-Solr-Tests-trunk-java7/solr/build/solr-core/test/J0/./org.apache.solr.cloud.BasicDistributedZkTest-1359964174397/jetty3/index
[junit4:junit4]   2> 20973 T466 C66 P57499 oasu.DirectUpdateHandler2.commit start commit{,optimize=false,openSearcher=false,waitSearcher=false,expungeDeletes=false,softCommit=false}
[junit4:junit4]   2> 20976 T466 C66 P57499 oasc.SolrDeletionPolicy.onCommit SolrDeletionPolicy.onCommit: commits:num=2
[junit4:junit4]   2> 		commit{dir=RateLimitedDirectoryWrapper(org.apache.lucene.store.NIOFSDirectory@/usr/home/hudson/hudson-slave/workspace/Lucene-Solr-Tests-trunk-java7/solr/build/solr-core/test/J0/org.apache.solr.cloud.BasicDistributedZkTest-1359964174397/jetty3/index.20130204074955295 lockFactory=org.apache.lucene.store.NativeFSLockFactory@e872d2f),segFN=segments_2,generation=2,filenames=[segments_2]
[junit4:junit4]   2> 		commit{dir=RateLimitedDirectoryWrapper(org.apache.lucene.store.NIOFSDirectory@/usr/home/hudson/hudson-slave/workspace/Lucene-Solr-Tests-trunk-java7/solr/build/solr-core/test/J0/org.apache.solr.cloud.BasicDistributedZkTest-1359964174397/jetty3/index.20130204074955295 lockFactory=org.apache.lucene.store.NativeFSLockFactory@e872d2f),segFN=segments_3,generation=3,filenames=[segments_3]
[junit4:junit4]   2> 20977 T466 C66 P57499 oasc.SolrDeletionPolicy.updateCommits newest commit = 3[segments_3]
[junit4:junit4]   2> 20978 T466 C66 P57499 oasc.CachingDirectoryFactory.close Releasing directory:/usr/home/hudson/hudson-slave/workspace/Lucene-Solr-Tests-trunk-java7/solr/build/solr-core/test/J0/./org.apache.solr.cloud.BasicDistributedZkTest-1359964174397/jetty3
[junit4:junit4]   2> 20978 T466 C66 P57499 oasu.DirectUpdateHandler2.commit end_commit_flush
[junit4:junit4]   2> 20979 T466 C66 P57499 oasc.CachingDirectoryFactory.close Releasing directory:/usr/home/hudson/hudson-slave/workspace/Lucene-Solr-Tests-trunk-java7/solr/build/solr-core/test/J0/./org.apache.solr.cloud.BasicDistributedZkTest-1359964174397/jetty3/index.20130204074955295
[junit4:junit4]   2> 20979 T466 C66 P57499 oasc.CachingDirectoryFactory.close Releasing directory:/usr/home/hudson/hudson-slave/workspace/Lucene-Solr-Tests-trunk-java7/solr/build/solr-core/test/J0/./org.apache.solr.cloud.BasicDistributedZkTest-1359964174397/jetty3/index
[junit4:junit4]   2> 20979 T466 C66 P57499 oasc.RecoveryStrategy.replay No replay needed. core=collection1
[junit4:junit4]   2> 20979 T466 C66 P57499 oasc.RecoveryStrategy.doRecovery Replication Recovery was successful - registering as Active. core=collection1
[junit4:junit4]   2> 20980 T466 C66 P57499 oasc.ZkController.publish publishing core=collection1 state=active
[junit4:junit4]   2> 20980 T466 C66 P57499 oasc.ZkController.publish numShards not found on descriptor - reading it from system property
[junit4:junit4]   2> 20982 T466 C66 P57499 oasc.RecoveryStrategy.doRecovery Finished recovery process. core=collection1
[junit4:junit4]   2> 21418 T392 oascc.ZkStateReader.updateClusterState Updating cloud state from ZooKeeper... 
[junit4:junit4]   2> 21809 T415 oascc.ZkStateReader.updateClusterState Updating cloud state from ZooKeeper... 
[junit4:junit4]   2> 21811 T415 oasc.Overseer$ClusterStateUpdater.updateState Update state numShards=2 message={
[junit4:junit4]   2> 	  "operation":"state",
[junit4:junit4]   2> 	  "numShards":"2",
[junit4:junit4]   2> 	  "shard":"shard2",
[junit4:junit4]   2> 	  "roles":null,
[junit4:junit4]   2> 	  "state":"recovering",
[junit4:junit4]   2> 	  "core":"collection1",
[junit4:junit4]   2> 	  "collection":"collection1",
[junit4:junit4]   2> 	  "node_name":"127.0.0.1:57503_",
[junit4:junit4]   2> 	  "base_url":"http://127.0.0.1:57503"}
[junit4:junit4]   2> 21824 T415 oasc.Overseer$ClusterStateUpdater.updateState Update state numShards=2 message={
[junit4:junit4]   2> 	  "operation":"state",
[junit4:junit4]   2> 	  "numShards":"2",
[junit4:junit4]   2> 	  "shard":"shard1",
[junit4:junit4]   2> 	  "roles":null,
[junit4:junit4]   2> 	  "state":"active",
[junit4:junit4]   2> 	  "core":"collection1",
[junit4:junit4]   2> 	  "collection":"collection1",
[junit4:junit4]   2> 	  "node_name":"127.0.0.1:57499_",
[junit4:junit4]   2> 	  "base_url":"http://127.0.0.1:57499"}
[junit4:junit4]   2> 21837 T479 oascc.ZkStateReader$2.process A cluster state change: WatchedEvent state:SyncConnected type:NodeDataChanged path:/clusterstate.json, has occurred - updating... (live nodes size: 5)
[junit4:junit4]   2> 21837 T420 oascc.ZkStateReader$2.process A cluster state change: WatchedEvent state:SyncConnected type:NodeDataChanged path:/clusterstate.json, has occurred - updating... (live nodes size: 5)
[junit4:junit4]   2> 21837 T433 oascc.ZkStateReader$2.process A cluster state change: WatchedEvent state:SyncConnected type:NodeDataChanged path:/clusterstate.json, has occurred - updating... (live nodes size: 5)
[junit4:junit4]   2> 21837 T448 oascc.ZkStateReader$2.process A cluster state change: WatchedEvent state:SyncConnected type:NodeDataChanged path:/clusterstate.json, has occurred - updating... (live nodes size: 5)
[junit4:junit4]   2> 21837 T463 oascc.ZkStateReader$2.process A cluster state change: WatchedEvent state:SyncConnected type:NodeDataChanged path:/clusterstate.json, has occurred - updating... (live nodes size: 5)
[junit4:junit4]   2> 21837 T414 oascc.ZkStateReader$2.process A cluster state change: WatchedEvent state:SyncConnected type:NodeDataChanged path:/clusterstate.json, has occurred - updating... (live nodes size: 5)
[junit4:junit4]   2> 22421 T392 oascc.ZkStateReader.updateClusterState Updating cloud state from ZooKeeper... 
[junit4:junit4]   2> 23425 T392 oascc.ZkStateReader.updateClusterState Updating cloud state from ZooKeeper... 
[junit4:junit4]   2>  C67_STATE=coll:collection1 core:collection1 props:{shard=shard2, roles=null, state=recovering, core=collection1, collection=collection1, node_name=127.0.0.1:57503_, base_url=http://127.0.0.1:57503}
[junit4:junit4]   2> 24414 T482 C67 P57503 oasc.RecoveryStrategy.doRecovery Attempting to PeerSync from http://127.0.0.1:57496/collection1/ core=collection1 - recoveringAfterStartup=true
[junit4:junit4]   2> 24414 T482 C67 P57503 oasu.PeerSync.sync PeerSync: core=collection1 url=http://127.0.0.1:57503 START replicas=[http://127.0.0.1:57496/collection1/] nUpdates=100
[junit4:junit4]   2> 24415 T482 C67 P57503 oasu.PeerSync.sync WARNING no frame of reference to tell of we've missed updates
[junit4:junit4]   2> 24415 T482 C67 P57503 oasc.RecoveryStrategy.doRecovery PeerSync Recovery was not successful - trying replication. core=collection1
[junit4:junit4]   2> 24415 T482 C67 P57503 oasc.RecoveryStrategy.doRecovery Starting Replication Recovery. core=collection1
[junit4:junit4]   2> 24415 T482 C67 P57503 oasc.RecoveryStrategy.doRecovery Begin buffering updates. core=collection1
[junit4:junit4]   2> 24416 T482 C67 P57503 oasu.UpdateLog.bufferUpdates Starting to buffer updates. FSUpdateLog{state=ACTIVE, tlog=null}
[junit4:junit4]   2> 24416 T482 C67 P57503 oasc.RecoveryStrategy.replicate Attempting to replicate from http://127.0.0.1:57496/collection1/. core=collection1
[junit4:junit4]   2> 24417 T482 C67 P57503 oascsi.HttpClientUtil.createClient Creating new http client, config:maxConnections=128&maxConnectionsPerHost=32&followRedirects=false
[junit4:junit4]   2> 24428 T392 oascc.ZkStateReader.updateClusterState Updating cloud state from ZooKeeper... 
[junit4:junit4]   2> ASYNC  NEW_CORE C69 name=collection1 org.apache.solr.core.SolrCore@4f903ce5 url=http://127.0.0.1:57496/collection1 node=127.0.0.1:57496_ C69_STATE=coll:collection1 core:collection1 props:{shard=shard2, roles=null, state=active, core=collection1, collection=collection1, node_name=127.0.0.1:57496_, base_url=http://127.0.0.1:57496, leader=true}
[junit4:junit4]   2> 24433 T439 C69 P57496 REQ /get {getVersions=100&distrib=false&wt=javabin&qt=/get&version=2} status=0 QTime=1 
[junit4:junit4]   2> 24439 T440 C69 P57496 oasu.DirectUpdateHandler2.commit start commit{,optimize=false,openSearcher=false,waitSearcher=true,expungeDeletes=false,softCommit=false}
[junit4:junit4]   2> 24440 T440 C69 P57496 oasc.CachingDirectoryFactory.close Releasing directory:/usr/home/hudson/hudson-slave/workspace/Lucene-Solr-Tests-trunk-java7/solr/build/solr-core/test/J0/./org.apache.solr.cloud.BasicDistributedZkTest-1359964174397/jetty2
[junit4:junit4]   2> 24444 T440 C69 P57496 oasc.SolrDeletionPolicy.onInit SolrDeletionPolicy.onInit: commits:num=1
[junit4:junit4]   2> 		commit{dir=RateLimitedDirectoryWrapper(org.apache.lucene.store.NIOFSDirectory@/usr/home/hudson/hudson-slave/workspace/Lucene-Solr-Tests-trunk-java7/solr/build/solr-core/test/J0/org.apache.solr.cloud.BasicDistributedZkTest-1359964174397/jetty2/index lockFactory=org.apache.lucene.store.NativeFSLockFactory@64eb9eaf),segFN=segments_1,generation=1,filenames=[segments_1]
[junit4:junit4]   2> 24445 T440 C69 P57496 oasc.SolrDeletionPolicy.updateCommits newest commit = 1[segments_1]
[junit4:junit4]   2> 24449 T440 C69 P57496 oasc.SolrDeletionPolicy.onCommit SolrDeletionPolicy.onCommit: commits:num=2
[junit4:junit4]   2> 		commit{dir=RateLimitedDirectoryWrapper(org.apache.lucene.store.NIOFSDirectory@/usr/home/hudson/hudson-slave/workspace/Lucene-Solr-Tests-trunk-java7/solr/build/solr-core/test/J0/org.apache.solr.cloud.BasicDistributedZkTest-1359964174397/jetty2/index lockFactory=org.apache.lucene.store.NativeFSLockFactory@64eb9eaf),segFN=segments_1,generation=1,filenames=[segments_1]
[junit4:junit4]   2> 		commit{dir=RateLimitedDirectoryWrapper(org.apache.lucene.store.NIOFSDirectory@/usr/home/hudson/hudson-slave/workspace/Lucene-Solr-Tests-trunk-java7/solr/build/solr-core/test/J0/org.apache.solr.cloud.BasicDistributedZkTest-1359964174397/jetty2/index lockFactory=org.apache.lucene.store.NativeFSLockFactory@64eb9eaf),segFN=segments_2,generation=2,filenames=[segments_2]
[junit4:junit4]   2> 24449 T440 C69 P57496 oasc.SolrDeletionPolicy.updateCommits newest commit = 2[segments_2]
[junit4:junit4]   2> 24450 T440 C69 P57496 oasc.CachingDirectoryFactory.close Releasing directory:/usr/home/hudson/hudson-slave/workspace/Lucene-Solr-Tests-trunk-java7/solr/build/solr-core/test/J0/./org.apache.solr.cloud.BasicDistributedZkTest-1359964174397/jetty2
[junit4:junit4]   2> 24451 T440 C69 P57496 oass.SolrIndexSearcher.<init> Opening Searcher@1f14c6d0 realtime
[junit4:junit4]   2> 24451 T440 C69 P57496 oasu.DirectUpdateHandler2.commit end_commit_flush
[junit4:junit4]   2> 24452 T440 C69 P57496 /update {waitSearcher=true&openSearcher=false&commit=true&wt=javabin&commit_end_point=true&version=2&softCommit=false} {commit=} 0 13
[junit4:junit4]   2> 24453 T482 C67 P57503 oash.ReplicationHandler.inform Commits will be reserved for  10000
[junit4:junit4]   2> 24454 T482 C67 P57503 oash.SnapPuller.<init>  No value set f

[...truncated too long message...]

ad.run(Thread.java:722)
[junit4:junit4]   2> 	  17) Thread[id=421, name=HashSessionScavenger-10, state=TIMED_WAITING, group=TGRP-BasicDistributedZkTest]
[junit4:junit4]   2> 	        at java.lang.Object.wait(Native Method)
[junit4:junit4]   2> 	        at java.util.TimerThread.mainLoop(Timer.java:552)
[junit4:junit4]   2> 	        at java.util.TimerThread.run(Timer.java:505)
[junit4:junit4]   2> 	  18) Thread[id=496, name=TEST-BasicDistributedZkTest.testDistribSearch-seed#[D57BB880CB873303]-SendThread(localhost:57486), state=RUNNABLE, group=TGRP-BasicDistributedZkTest]
[junit4:junit4]   2> 	        at sun.nio.ch.SelectorImpl.lockAndDoSelect(SelectorImpl.java:82)
[junit4:junit4]   2> 	        at sun.nio.ch.SelectorImpl.select(SelectorImpl.java:98)
[junit4:junit4]   2> 	        at org.apache.zookeeper.ClientCnxnSocketNIO.doTransport(ClientCnxnSocketNIO.java:338)
[junit4:junit4]   2> 	        at org.apache.zookeeper.ClientCnxn$SendThread.run(ClientCnxn.java:1068)
[junit4:junit4]   2> 	  19) Thread[id=478, name=TEST-BasicDistributedZkTest.testDistribSearch-seed#[D57BB880CB873303]-SendThread(localhost:57486), state=RUNNABLE, group=TGRP-BasicDistributedZkTest]
[junit4:junit4]   2> 	        at sun.nio.ch.SelectorImpl.lockAndDoSelect(SelectorImpl.java:82)
[junit4:junit4]   2> 	        at sun.nio.ch.SelectorImpl.select(SelectorImpl.java:98)
[junit4:junit4]   2> 	        at org.apache.zookeeper.ClientCnxnSocketNIO.doTransport(ClientCnxnSocketNIO.java:338)
[junit4:junit4]   2> 	        at org.apache.zookeeper.ClientCnxn$SendThread.run(ClientCnxn.java:1068)
[junit4:junit4]   2> 	  20) Thread[id=422, name=qtp934902858-422 Acceptor0 SocketConnector@127.0.0.1:57493, state=RUNNABLE, group=TGRP-BasicDistributedZkTest]
[junit4:junit4]   2> 	        at java.net.PlainSocketImpl.socketAccept(Native Method)
[junit4:junit4]   2> 	        at java.net.AbstractPlainSocketImpl.accept(AbstractPlainSocketImpl.java:398)
[junit4:junit4]   2> 	        at java.net.ServerSocket.implAccept(ServerSocket.java:522)
[junit4:junit4]   2> 	        at java.net.ServerSocket.accept(ServerSocket.java:490)
[junit4:junit4]   2> 	        at org.eclipse.jetty.server.bio.SocketConnector.accept(SocketConnector.java:117)
[junit4:junit4]   2> 	        at org.eclipse.jetty.server.AbstractConnector$Acceptor.run(AbstractConnector.java:938)
[junit4:junit4]   2> 	        at org.eclipse.jetty.util.thread.QueuedThreadPool.runJob(QueuedThreadPool.java:608)
[junit4:junit4]   2> 	        at org.eclipse.jetty.util.thread.QueuedThreadPool$3.run(QueuedThreadPool.java:543)
[junit4:junit4]   2> 	        at java.lang.Thread.run(Thread.java:722)
[junit4:junit4]   2> 	  21) Thread[id=447, name=TEST-BasicDistributedZkTest.testDistribSearch-seed#[D57BB880CB873303]-SendThread(localhost:57486), state=RUNNABLE, group=TGRP-BasicDistributedZkTest]
[junit4:junit4]   2> 	        at java.nio.channels.spi.AbstractSelector.begin(AbstractSelector.java:216)
[junit4:junit4]   2> 	        at sun.nio.ch.KQueueSelectorImpl.doSelect(KQueueSelectorImpl.java:102)
[junit4:junit4]   2> 	        at sun.nio.ch.SelectorImpl.lockAndDoSelect(SelectorImpl.java:87)
[junit4:junit4]   2> 	        at sun.nio.ch.SelectorImpl.select(SelectorImpl.java:98)
[junit4:junit4]   2> 	        at org.apache.zookeeper.ClientCnxnSocketNIO.doTransport(ClientCnxnSocketNIO.java:338)
[junit4:junit4]   2> 	        at org.apache.zookeeper.ClientCnxn$SendThread.run(ClientCnxn.java:1068)
[junit4:junit4]   2> 	  22) Thread[id=538, name=searcherExecutor-441-thread-1, state=WAITING, group=TGRP-BasicDistributedZkTest]
[junit4:junit4]   2> 	        at sun.misc.Unsafe.park(Native Method)
[junit4:junit4]   2> 	        at java.util.concurrent.locks.LockSupport.park(LockSupport.java:186)
[junit4:junit4]   2> 	        at java.util.concurrent.locks.AbstractQueuedSynchronizer$ConditionObject.await(AbstractQueuedSynchronizer.java:2043)
[junit4:junit4]   2> 	        at java.util.concurrent.LinkedBlockingQueue.take(LinkedBlockingQueue.java:442)
[junit4:junit4]   2> 	        at java.util.concurrent.ThreadPoolExecutor.getTask(ThreadPoolExecutor.java:1043)
[junit4:junit4]   2> 	        at java.util.concurrent.ThreadPoolExecutor.runWorker(ThreadPoolExecutor.java:1103)
[junit4:junit4]   2> 	        at java.util.concurrent.ThreadPoolExecutor$Worker.run(ThreadPoolExecutor.java:603)
[junit4:junit4]   2> 	        at java.lang.Thread.run(Thread.java:722)
[junit4:junit4]   2> 	  23) Thread[id=462, name=TEST-BasicDistributedZkTest.testDistribSearch-seed#[D57BB880CB873303]-SendThread(localhost:57486), state=RUNNABLE, group=TGRP-BasicDistributedZkTest]
[junit4:junit4]   2> 	        at sun.nio.ch.KQueueArrayWrapper.kevent0(Native Method)
[junit4:junit4]   2> 	        at sun.nio.ch.KQueueArrayWrapper.poll(KQueueArrayWrapper.java:159)
[junit4:junit4]   2> 	        at sun.nio.ch.KQueueSelectorImpl.doSelect(KQueueSelectorImpl.java:103)
[junit4:junit4]   2> 	        at sun.nio.ch.SelectorImpl.lockAndDoSelect(SelectorImpl.java:87)
[junit4:junit4]   2> 	        at sun.nio.ch.SelectorImpl.select(SelectorImpl.java:98)
[junit4:junit4]   2> 	        at org.apache.zookeeper.ClientCnxnSocketNIO.doTransport(ClientCnxnSocketNIO.java:338)
[junit4:junit4]   2> 	        at org.apache.zookeeper.ClientCnxn$SendThread.run(ClientCnxn.java:1068)
[junit4:junit4]   2> 	  24) Thread[id=541, name=searcherExecutor-449-thread-1, state=WAITING, group=TGRP-BasicDistributedZkTest]
[junit4:junit4]   2> 	        at sun.misc.Unsafe.park(Native Method)
[junit4:junit4]   2> 	        at java.util.concurrent.locks.LockSupport.park(LockSupport.java:186)
[junit4:junit4]   2> 	        at java.util.concurrent.locks.AbstractQueuedSynchronizer$ConditionObject.await(AbstractQueuedSynchronizer.java:2043)
[junit4:junit4]   2> 	        at java.util.concurrent.LinkedBlockingQueue.take(LinkedBlockingQueue.java:442)
[junit4:junit4]   2> 	        at java.util.concurrent.ThreadPoolExecutor.getTask(ThreadPoolExecutor.java:1043)
[junit4:junit4]   2> 	        at java.util.concurrent.ThreadPoolExecutor.runWorker(ThreadPoolExecutor.java:1103)
[junit4:junit4]   2> 	        at java.util.concurrent.ThreadPoolExecutor$Worker.run(ThreadPoolExecutor.java:603)
[junit4:junit4]   2> 	        at java.lang.Thread.run(Thread.java:722)
[junit4:junit4]   2> NOTE: test params are: codec=Lucene42: {n_f1=PostingsFormat(name=Direct), foo_b=Lucene41(blocksize=128), foo_d=PostingsFormat(name=MockSep), foo_f=Lucene41(blocksize=128), n_tl1=PostingsFormat(name=Direct), n_d1=MockFixedIntBlock(blockSize=1134), rnd_b=PostingsFormat(name=MockSep), intDefault=PostingsFormat(name=Direct), n_td1=PostingsFormat(name=Direct), timestamp=MockFixedIntBlock(blockSize=1134), id=PostingsFormat(name=MockSep), range_facet_sl=PostingsFormat(name=MockSep), range_facet_si=MockFixedIntBlock(blockSize=1134), oddField_s=PostingsFormat(name=MockSep), foo_i=PostingsFormat(name=Direct), multiDefault=MockFixedIntBlock(blockSize=1134), n_tf1=MockFixedIntBlock(blockSize=1134), n_dt1=PostingsFormat(name=Direct), n_ti1=PostingsFormat(name=MockSep), range_facet_l=MockFixedIntBlock(blockSize=1134), text=Lucene41(blocksize=128), _version_=PostingsFormat(name=Direct), val_i=PostingsFormat(name=MockSep), SubjectTerms_mfacet=PostingsFormat(name=Direct), a_t=MockFixedIntBlock(blockSize=1134), n_tdt1=PostingsFormat(name=Direct), other_tl1=PostingsFormat(name=Direct), n_l1=MockFixedIntBlock(blockSize=1134), a_si=PostingsFormat(name=Direct)}, sim=DefaultSimilarity, locale=ar_SA, timezone=Atlantic/Faeroe
[junit4:junit4]   2> NOTE: FreeBSD 9.0-RELEASE amd64/Oracle Corporation 1.7.0_09 (64-bit)/cpus=16,threads=26,free=99856064,total=260046848
[junit4:junit4]   2> NOTE: All tests run in this JVM: [CSVRequestHandlerTest, TestBinaryResponseWriter, TestIndexingPerformance, TestFastOutputStream, TestSearchPerf, ResourceLoaderTest, JSONWriterTest, FileBasedSpellCheckerTest, TestBadConfig, TestExtendedDismaxParser, SuggesterFSTTest, DateMathParserTest, TestReload, SolrCoreCheckLockOnStartupTest, DefaultValueUpdateProcessorTest, TestCoreContainer, JsonLoaderTest, NumericFieldsTest, NotRequiredUniqueKeyTest, ExternalFileFieldSortTest, TestRandomFaceting, DistributedTermsComponentTest, SuggesterWFSTTest, TestSolrQueryParser, BinaryUpdateRequestHandlerTest, BasicDistributedZkTest]
[junit4:junit4]   2> NOTE: reproduce with: ant test  -Dtestcase=BasicDistributedZkTest -Dtests.seed=D57BB880CB873303 -Dtests.multiplier=3 -Dtests.slow=true -Dtests.locale=ar_SA -Dtests.timezone=Atlantic/Faeroe -Dtests.file.encoding=ISO-8859-1
[junit4:junit4] ERROR   0.00s J0 | BasicDistributedZkTest (suite) <<<
[junit4:junit4]    > Throwable #1: java.lang.Exception: Suite timeout exceeded (>= 7200000 msec).
[junit4:junit4]    > 	at __randomizedtesting.SeedInfo.seed([D57BB880CB873303]:0)
[junit4:junit4] Completed on J0 in 7223.50s, 1 test, 2 errors <<< FAILURES!

[...truncated 116 lines...]
BUILD FAILED
/usr/home/hudson/hudson-slave/workspace/Lucene-Solr-Tests-trunk-java7/build.xml:346: The following error occurred while executing this line:
/usr/home/hudson/hudson-slave/workspace/Lucene-Solr-Tests-trunk-java7/build.xml:39: The following error occurred while executing this line:
/usr/home/hudson/hudson-slave/workspace/Lucene-Solr-Tests-trunk-java7/solr/build.xml:178: The following error occurred while executing this line:
/usr/home/hudson/hudson-slave/workspace/Lucene-Solr-Tests-trunk-java7/solr/common-build.xml:428: The following error occurred while executing this line:
/usr/home/hudson/hudson-slave/workspace/Lucene-Solr-Tests-trunk-java7/lucene/common-build.xml:1176: The following error occurred while executing this line:
/usr/home/hudson/hudson-slave/workspace/Lucene-Solr-Tests-trunk-java7/lucene/common-build.xml:841: There were test failures: 249 suites, 1038 tests, 1 suite-level error, 1 error, 146 ignored (4 assumptions)

Total time: 146 minutes 17 seconds
Build step 'Invoke Ant' marked build as failure
Archiving artifacts
Recording test results
Email was triggered for: Failure
Sending email for trigger: Failure



Mime
View raw message