lucene-dev mailing list archives

Site index · List index
Message view « Date » · « Thread »
Top « Date » · « Thread »
From Policeman Jenkins Server <jenk...@thetaphi.de>
Subject [JENKINS] Lucene-Solr-4.x-MacOSX (64bit/jdk1.7.0) - Build # 210 - Still Failing!
Date Thu, 14 Feb 2013 03:52:47 GMT
Build: http://jenkins.thetaphi.de/job/Lucene-Solr-4.x-MacOSX/210/
Java: 64bit/jdk1.7.0 -XX:+UseConcMarkSweepGC

1 tests failed.
REGRESSION:  org.apache.solr.cloud.BasicDistributedZkTest.testDistribSearch

Error Message:
IOException occured when talking to server at: http://127.0.0.1:52224/jszv/b

Stack Trace:
org.apache.solr.client.solrj.SolrServerException: IOException occured when talking to server at: http://127.0.0.1:52224/jszv/b
	at __randomizedtesting.SeedInfo.seed([5A81000E2E96E716:DB678E1659C9872A]:0)
	at org.apache.solr.client.solrj.impl.HttpSolrServer.request(HttpSolrServer.java:416)
	at org.apache.solr.client.solrj.impl.HttpSolrServer.request(HttpSolrServer.java:181)
	at org.apache.solr.cloud.BasicDistributedZkTest.testCoreUnloadAndLeaders(BasicDistributedZkTest.java:572)
	at org.apache.solr.cloud.BasicDistributedZkTest.doTest(BasicDistributedZkTest.java:337)
	at org.apache.solr.BaseDistributedSearchTestCase.testDistribSearch(BaseDistributedSearchTestCase.java:794)
	at sun.reflect.NativeMethodAccessorImpl.invoke0(Native Method)
	at sun.reflect.NativeMethodAccessorImpl.invoke(NativeMethodAccessorImpl.java:57)
	at sun.reflect.DelegatingMethodAccessorImpl.invoke(DelegatingMethodAccessorImpl.java:43)
	at java.lang.reflect.Method.invoke(Method.java:601)
	at com.carrotsearch.randomizedtesting.RandomizedRunner.invoke(RandomizedRunner.java:1559)
	at com.carrotsearch.randomizedtesting.RandomizedRunner.access$600(RandomizedRunner.java:79)
	at com.carrotsearch.randomizedtesting.RandomizedRunner$6.evaluate(RandomizedRunner.java:737)
	at com.carrotsearch.randomizedtesting.RandomizedRunner$7.evaluate(RandomizedRunner.java:773)
	at com.carrotsearch.randomizedtesting.RandomizedRunner$8.evaluate(RandomizedRunner.java:787)
	at com.carrotsearch.randomizedtesting.rules.SystemPropertiesRestoreRule$1.evaluate(SystemPropertiesRestoreRule.java:53)
	at org.apache.lucene.util.TestRuleSetupTeardownChained$1.evaluate(TestRuleSetupTeardownChained.java:50)
	at org.apache.lucene.util.TestRuleFieldCacheSanity$1.evaluate(TestRuleFieldCacheSanity.java:51)
	at org.apache.lucene.util.AbstractBeforeAfterRule$1.evaluate(AbstractBeforeAfterRule.java:46)
	at com.carrotsearch.randomizedtesting.rules.SystemPropertiesInvariantRule$1.evaluate(SystemPropertiesInvariantRule.java:55)
	at org.apache.lucene.util.TestRuleThreadAndTestName$1.evaluate(TestRuleThreadAndTestName.java:49)
	at org.apache.lucene.util.TestRuleIgnoreAfterMaxFailures$1.evaluate(TestRuleIgnoreAfterMaxFailures.java:70)
	at org.apache.lucene.util.TestRuleMarkFailure$1.evaluate(TestRuleMarkFailure.java:48)
	at com.carrotsearch.randomizedtesting.rules.StatementAdapter.evaluate(StatementAdapter.java:36)
	at com.carrotsearch.randomizedtesting.ThreadLeakControl$StatementRunner.run(ThreadLeakControl.java:358)
	at com.carrotsearch.randomizedtesting.ThreadLeakControl.forkTimeoutingTask(ThreadLeakControl.java:782)
	at com.carrotsearch.randomizedtesting.ThreadLeakControl$3.evaluate(ThreadLeakControl.java:442)
	at com.carrotsearch.randomizedtesting.RandomizedRunner.runSingleTest(RandomizedRunner.java:746)
	at com.carrotsearch.randomizedtesting.RandomizedRunner$3.evaluate(RandomizedRunner.java:648)
	at com.carrotsearch.randomizedtesting.RandomizedRunner$4.evaluate(RandomizedRunner.java:682)
	at com.carrotsearch.randomizedtesting.RandomizedRunner$5.evaluate(RandomizedRunner.java:693)
	at com.carrotsearch.randomizedtesting.rules.StatementAdapter.evaluate(StatementAdapter.java:36)
	at com.carrotsearch.randomizedtesting.rules.SystemPropertiesRestoreRule$1.evaluate(SystemPropertiesRestoreRule.java:53)
	at org.apache.lucene.util.AbstractBeforeAfterRule$1.evaluate(AbstractBeforeAfterRule.java:46)
	at org.apache.lucene.util.TestRuleStoreClassName$1.evaluate(TestRuleStoreClassName.java:42)
	at com.carrotsearch.randomizedtesting.rules.SystemPropertiesInvariantRule$1.evaluate(SystemPropertiesInvariantRule.java:55)
	at com.carrotsearch.randomizedtesting.rules.NoShadowingOrOverridesOnMethodsRule$1.evaluate(NoShadowingOrOverridesOnMethodsRule.java:39)
	at com.carrotsearch.randomizedtesting.rules.NoShadowingOrOverridesOnMethodsRule$1.evaluate(NoShadowingOrOverridesOnMethodsRule.java:39)
	at com.carrotsearch.randomizedtesting.rules.StatementAdapter.evaluate(StatementAdapter.java:36)
	at org.apache.lucene.util.TestRuleAssertionsRequired$1.evaluate(TestRuleAssertionsRequired.java:43)
	at org.apache.lucene.util.TestRuleMarkFailure$1.evaluate(TestRuleMarkFailure.java:48)
	at org.apache.lucene.util.TestRuleIgnoreAfterMaxFailures$1.evaluate(TestRuleIgnoreAfterMaxFailures.java:70)
	at org.apache.lucene.util.TestRuleIgnoreTestSuites$1.evaluate(TestRuleIgnoreTestSuites.java:55)
	at com.carrotsearch.randomizedtesting.rules.StatementAdapter.evaluate(StatementAdapter.java:36)
	at com.carrotsearch.randomizedtesting.ThreadLeakControl$StatementRunner.run(ThreadLeakControl.java:358)
	at java.lang.Thread.run(Thread.java:722)
Caused by: java.net.SocketException: Invalid argument
	at java.net.SocketInputStream.socketRead0(Native Method)
	at java.net.SocketInputStream.read(SocketInputStream.java:150)
	at java.net.SocketInputStream.read(SocketInputStream.java:121)
	at org.apache.http.impl.io.AbstractSessionInputBuffer.fillBuffer(AbstractSessionInputBuffer.java:166)
	at org.apache.http.impl.io.SocketInputBuffer.fillBuffer(SocketInputBuffer.java:90)
	at org.apache.http.impl.io.AbstractSessionInputBuffer.readLine(AbstractSessionInputBuffer.java:281)
	at org.apache.http.impl.conn.DefaultHttpResponseParser.parseHead(DefaultHttpResponseParser.java:92)
	at org.apache.http.impl.conn.DefaultHttpResponseParser.parseHead(DefaultHttpResponseParser.java:62)
	at org.apache.http.impl.io.AbstractMessageParser.parse(AbstractMessageParser.java:254)
	at org.apache.http.impl.AbstractHttpClientConnection.receiveResponseHeader(AbstractHttpClientConnection.java:289)
	at org.apache.http.impl.conn.DefaultClientConnection.receiveResponseHeader(DefaultClientConnection.java:252)
	at org.apache.http.impl.conn.ManagedClientConnectionImpl.receiveResponseHeader(ManagedClientConnectionImpl.java:191)
	at org.apache.http.protocol.HttpRequestExecutor.doReceiveResponse(HttpRequestExecutor.java:300)
	at org.apache.http.protocol.HttpRequestExecutor.execute(HttpRequestExecutor.java:127)
	at org.apache.http.impl.client.DefaultRequestDirector.tryExecute(DefaultRequestDirector.java:717)
	at org.apache.http.impl.client.DefaultRequestDirector.execute(DefaultRequestDirector.java:522)
	at org.apache.http.impl.client.AbstractHttpClient.execute(AbstractHttpClient.java:906)
	at org.apache.http.impl.client.AbstractHttpClient.execute(AbstractHttpClient.java:805)
	at org.apache.http.impl.client.AbstractHttpClient.execute(AbstractHttpClient.java:784)
	at org.apache.solr.client.solrj.impl.HttpSolrServer.request(HttpSolrServer.java:353)
	... 44 more




Build Log:
[...truncated 8978 lines...]
[junit4:junit4] Suite: org.apache.solr.cloud.BasicDistributedZkTest
[junit4:junit4]   2> 0 T2894 oas.BaseDistributedSearchTestCase.initHostContext Setting hostContext system property: /jszv/b
[junit4:junit4]   2> 9 T2894 oas.SolrTestCaseJ4.setUp ###Starting testDistribSearch
[junit4:junit4]   2> Creating dataDir: /Users/jenkins/jenkins-slave/workspace/Lucene-Solr-4.x-MacOSX/solr/build/solr-core/test/J0/./solrtest-BasicDistributedZkTest-1360812146870
[junit4:junit4]   2> 10 T2894 oasc.ZkTestServer.run STARTING ZK TEST SERVER
[junit4:junit4]   2> 11 T2895 oasc.ZkTestServer$ZKServerMain.runFromConfig Starting server
[junit4:junit4]   2> 14 T2895 oazs.ZooKeeperServer.setTickTime tickTime set to 1000
[junit4:junit4]   2> 15 T2895 oazs.ZooKeeperServer.setMinSessionTimeout minSessionTimeout set to -1
[junit4:junit4]   2> 15 T2895 oazs.ZooKeeperServer.setMaxSessionTimeout maxSessionTimeout set to -1
[junit4:junit4]   2> 16 T2895 oazs.NIOServerCnxnFactory.configure binding to port 0.0.0.0/0.0.0.0:0
[junit4:junit4]   2> 18 T2895 oazsp.FileTxnSnapLog.save Snapshotting: 0x0 to /Users/jenkins/jenkins-slave/workspace/Lucene-Solr-4.x-MacOSX/solr/build/solr-core/test/J0/./org.apache.solr.cloud.BasicDistributedZkTest-1360812146869/zookeeper/server1/data/version-2/snapshot.0
[junit4:junit4]   2> 116 T2894 oasc.ZkTestServer.run start zk server on port:52214
[junit4:junit4]   2> 117 T2894 oaz.ZooKeeper.<init> Initiating client connection, connectString=127.0.0.1:52214 sessionTimeout=10000 watcher=org.apache.solr.common.cloud.ConnectionManager@51051d66
[junit4:junit4]   2> 118 T2894 oascc.ConnectionManager.waitForConnected Waiting for client to connect to ZooKeeper
[junit4:junit4]   2> 119 T2900 oaz.ClientCnxn$SendThread.logStartConnect Opening socket connection to server localhost/127.0.0.1:52214. Will not attempt to authenticate using SASL (access denied ("javax.security.auth.AuthPermission" "getLoginConfiguration"))
[junit4:junit4]   2> 120 T2900 oaz.ClientCnxn$SendThread.primeConnection Socket connection established to localhost/127.0.0.1:52214, initiating session
[junit4:junit4]   2> 120 T2896 oazs.NIOServerCnxnFactory.run Accepted socket connection from /127.0.0.1:52215
[junit4:junit4]   2> 121 T2896 oazs.ZooKeeperServer.processConnectRequest Client attempting to establish new session at /127.0.0.1:52215
[junit4:junit4]   2> 122 T2898 oazsp.FileTxnLog.append Creating new log file: log.1
[junit4:junit4]   2> 127 T2898 oazs.ZooKeeperServer.finishSessionInit Established session 0x13cd6b980c00000 with negotiated timeout 10000 for client /127.0.0.1:52215
[junit4:junit4]   2> 127 T2900 oaz.ClientCnxn$SendThread.onConnected Session establishment complete on server localhost/127.0.0.1:52214, sessionid = 0x13cd6b980c00000, negotiated timeout = 10000
[junit4:junit4]   2> 128 T2901 oascc.ConnectionManager.process Watcher org.apache.solr.common.cloud.ConnectionManager@51051d66 name:ZooKeeperConnection Watcher:127.0.0.1:52214 got event WatchedEvent state:SyncConnected type:None path:null path:null type:None
[junit4:junit4]   2> 128 T2894 oascc.ConnectionManager.waitForConnected Client is connected to ZooKeeper
[junit4:junit4]   2> 129 T2894 oascc.SolrZkClient.makePath makePath: /solr
[junit4:junit4]   2> 136 T2899 oazs.PrepRequestProcessor.pRequest2Txn Processed session termination for sessionid: 0x13cd6b980c00000
[junit4:junit4]   2> 137 T2901 oaz.ClientCnxn$EventThread.run EventThread shut down
[junit4:junit4]   2> 137 T2894 oaz.ZooKeeper.close Session: 0x13cd6b980c00000 closed
[junit4:junit4]   2> 139 T2896 oazs.NIOServerCnxn.closeSock Closed socket connection for client /127.0.0.1:52215 which had sessionid 0x13cd6b980c00000
[junit4:junit4]   2> 139 T2894 oaz.ZooKeeper.<init> Initiating client connection, connectString=127.0.0.1:52214/solr sessionTimeout=10000 watcher=org.apache.solr.common.cloud.ConnectionManager@23d1bd18
[junit4:junit4]   2> 141 T2894 oascc.ConnectionManager.waitForConnected Waiting for client to connect to ZooKeeper
[junit4:junit4]   2> 142 T2902 oaz.ClientCnxn$SendThread.logStartConnect Opening socket connection to server localhost/127.0.0.1:52214. Will not attempt to authenticate using SASL (access denied ("javax.security.auth.AuthPermission" "getLoginConfiguration"))
[junit4:junit4]   2> 143 T2902 oaz.ClientCnxn$SendThread.primeConnection Socket connection established to localhost/127.0.0.1:52214, initiating session
[junit4:junit4]   2> 144 T2896 oazs.NIOServerCnxnFactory.run Accepted socket connection from /127.0.0.1:52216
[junit4:junit4]   2> 145 T2896 oazs.ZooKeeperServer.processConnectRequest Client attempting to establish new session at /127.0.0.1:52216
[junit4:junit4]   2> 147 T2898 oazs.ZooKeeperServer.finishSessionInit Established session 0x13cd6b980c00001 with negotiated timeout 10000 for client /127.0.0.1:52216
[junit4:junit4]   2> 147 T2902 oaz.ClientCnxn$SendThread.onConnected Session establishment complete on server localhost/127.0.0.1:52214, sessionid = 0x13cd6b980c00001, negotiated timeout = 10000
[junit4:junit4]   2> 148 T2903 oascc.ConnectionManager.process Watcher org.apache.solr.common.cloud.ConnectionManager@23d1bd18 name:ZooKeeperConnection Watcher:127.0.0.1:52214/solr got event WatchedEvent state:SyncConnected type:None path:null path:null type:None
[junit4:junit4]   2> 149 T2894 oascc.ConnectionManager.waitForConnected Client is connected to ZooKeeper
[junit4:junit4]   2> 150 T2894 oascc.SolrZkClient.makePath makePath: /collections/collection1
[junit4:junit4]   2> 161 T2894 oascc.SolrZkClient.makePath makePath: /collections/collection1/shards
[junit4:junit4]   2> 167 T2894 oascc.SolrZkClient.makePath makePath: /collections/control_collection
[junit4:junit4]   2> 171 T2894 oascc.SolrZkClient.makePath makePath: /collections/control_collection/shards
[junit4:junit4]   2> 177 T2894 oasc.AbstractZkTestCase.putConfig put /Users/jenkins/jenkins-slave/workspace/Lucene-Solr-4.x-MacOSX/solr/build/solr-core/test-files/solr/collection1/conf/solrconfig.xml to /configs/conf1/solrconfig.xml
[junit4:junit4]   2> 179 T2894 oascc.SolrZkClient.makePath makePath: /configs/conf1/solrconfig.xml
[junit4:junit4]   2> 188 T2894 oasc.AbstractZkTestCase.putConfig put /Users/jenkins/jenkins-slave/workspace/Lucene-Solr-4.x-MacOSX/solr/build/solr-core/test-files/solr/collection1/conf/schema.xml to /configs/conf1/schema.xml
[junit4:junit4]   2> 189 T2894 oascc.SolrZkClient.makePath makePath: /configs/conf1/schema.xml
[junit4:junit4]   2> 196 T2894 oasc.AbstractZkTestCase.putConfig put /Users/jenkins/jenkins-slave/workspace/Lucene-Solr-4.x-MacOSX/solr/build/solr-core/test-files/solr/collection1/conf/stopwords.txt to /configs/conf1/stopwords.txt
[junit4:junit4]   2> 197 T2894 oascc.SolrZkClient.makePath makePath: /configs/conf1/stopwords.txt
[junit4:junit4]   2> 203 T2894 oasc.AbstractZkTestCase.putConfig put /Users/jenkins/jenkins-slave/workspace/Lucene-Solr-4.x-MacOSX/solr/build/solr-core/test-files/solr/collection1/conf/protwords.txt to /configs/conf1/protwords.txt
[junit4:junit4]   2> 204 T2894 oascc.SolrZkClient.makePath makePath: /configs/conf1/protwords.txt
[junit4:junit4]   2> 211 T2894 oasc.AbstractZkTestCase.putConfig put /Users/jenkins/jenkins-slave/workspace/Lucene-Solr-4.x-MacOSX/solr/build/solr-core/test-files/solr/collection1/conf/currency.xml to /configs/conf1/currency.xml
[junit4:junit4]   2> 213 T2894 oascc.SolrZkClient.makePath makePath: /configs/conf1/currency.xml
[junit4:junit4]   2> 219 T2894 oasc.AbstractZkTestCase.putConfig put /Users/jenkins/jenkins-slave/workspace/Lucene-Solr-4.x-MacOSX/solr/build/solr-core/test-files/solr/collection1/conf/open-exchange-rates.json to /configs/conf1/open-exchange-rates.json
[junit4:junit4]   2> 220 T2894 oascc.SolrZkClient.makePath makePath: /configs/conf1/open-exchange-rates.json
[junit4:junit4]   2> 227 T2894 oasc.AbstractZkTestCase.putConfig put /Users/jenkins/jenkins-slave/workspace/Lucene-Solr-4.x-MacOSX/solr/build/solr-core/test-files/solr/collection1/conf/mapping-ISOLatin1Accent.txt to /configs/conf1/mapping-ISOLatin1Accent.txt
[junit4:junit4]   2> 229 T2894 oascc.SolrZkClient.makePath makePath: /configs/conf1/mapping-ISOLatin1Accent.txt
[junit4:junit4]   2> 235 T2894 oasc.AbstractZkTestCase.putConfig put /Users/jenkins/jenkins-slave/workspace/Lucene-Solr-4.x-MacOSX/solr/build/solr-core/test-files/solr/collection1/conf/old_synonyms.txt to /configs/conf1/old_synonyms.txt
[junit4:junit4]   2> 237 T2894 oascc.SolrZkClient.makePath makePath: /configs/conf1/old_synonyms.txt
[junit4:junit4]   2> 247 T2894 oasc.AbstractZkTestCase.putConfig put /Users/jenkins/jenkins-slave/workspace/Lucene-Solr-4.x-MacOSX/solr/build/solr-core/test-files/solr/collection1/conf/synonyms.txt to /configs/conf1/synonyms.txt
[junit4:junit4]   2> 248 T2894 oascc.SolrZkClient.makePath makePath: /configs/conf1/synonyms.txt
[junit4:junit4]   2> 255 T2899 oazs.PrepRequestProcessor.pRequest2Txn Processed session termination for sessionid: 0x13cd6b980c00001
[junit4:junit4]   2> 256 T2903 oaz.ClientCnxn$EventThread.run EventThread shut down
[junit4:junit4]   2> 256 T2894 oaz.ZooKeeper.close Session: 0x13cd6b980c00001 closed
[junit4:junit4]   2> 258 T2896 oazs.NIOServerCnxn.closeSock Closed socket connection for client /127.0.0.1:52216 which had sessionid 0x13cd6b980c00001
[junit4:junit4]   2> 482 T2894 oejs.Server.doStart jetty-8.1.8.v20121106
[junit4:junit4]   2> 500 T2894 oejs.AbstractConnector.doStart Started SelectChannelConnector@127.0.0.1:52217
[junit4:junit4]   2> 500 T2894 oass.SolrDispatchFilter.init SolrDispatchFilter.init()
[junit4:junit4]   2> 501 T2894 oasc.SolrResourceLoader.locateSolrHome JNDI not configured for solr (NoInitialContextEx)
[junit4:junit4]   2> 501 T2894 oasc.SolrResourceLoader.locateSolrHome using system property solr.solr.home: /Users/jenkins/jenkins-slave/workspace/Lucene-Solr-4.x-MacOSX/solr/build/solr-core/test/J0/./org.apache.solr.cloud.BasicDistributedZkTest-controljetty-1360812147118
[junit4:junit4]   2> 501 T2894 oasc.CoreContainer$Initializer.initialize looking for solr.xml: /Users/jenkins/jenkins-slave/workspace/Lucene-Solr-4.x-MacOSX/solr/build/solr-core/test/J0/./org.apache.solr.cloud.BasicDistributedZkTest-controljetty-1360812147118/solr.xml
[junit4:junit4]   2> 502 T2894 oasc.CoreContainer.<init> New CoreContainer 531477530
[junit4:junit4]   2> 502 T2894 oasc.CoreContainer.load Loading CoreContainer using Solr Home: '/Users/jenkins/jenkins-slave/workspace/Lucene-Solr-4.x-MacOSX/solr/build/solr-core/test/J0/./org.apache.solr.cloud.BasicDistributedZkTest-controljetty-1360812147118/'
[junit4:junit4]   2> 503 T2894 oasc.SolrResourceLoader.<init> new SolrResourceLoader for directory: '/Users/jenkins/jenkins-slave/workspace/Lucene-Solr-4.x-MacOSX/solr/build/solr-core/test/J0/./org.apache.solr.cloud.BasicDistributedZkTest-controljetty-1360812147118/'
[junit4:junit4]   2> 549 T2894 oashc.HttpShardHandlerFactory.getParameter Setting socketTimeout to: 60000
[junit4:junit4]   2> 550 T2894 oashc.HttpShardHandlerFactory.getParameter Setting urlScheme to: http://
[junit4:junit4]   2> 551 T2894 oashc.HttpShardHandlerFactory.getParameter Setting connTimeout to: 15000
[junit4:junit4]   2> 551 T2894 oashc.HttpShardHandlerFactory.getParameter Setting maxConnectionsPerHost to: 20
[junit4:junit4]   2> 552 T2894 oashc.HttpShardHandlerFactory.getParameter Setting corePoolSize to: 0
[junit4:junit4]   2> 553 T2894 oashc.HttpShardHandlerFactory.getParameter Setting maximumPoolSize to: 2147483647
[junit4:junit4]   2> 553 T2894 oashc.HttpShardHandlerFactory.getParameter Setting maxThreadIdleTime to: 5
[junit4:junit4]   2> 554 T2894 oashc.HttpShardHandlerFactory.getParameter Setting sizeOfQueue to: -1
[junit4:junit4]   2> 555 T2894 oashc.HttpShardHandlerFactory.getParameter Setting fairnessPolicy to: false
[junit4:junit4]   2> 555 T2894 oascsi.HttpClientUtil.createClient Creating new http client, config:maxConnectionsPerHost=20&maxConnections=10000&socketTimeout=60000&connTimeout=15000&retry=false
[junit4:junit4]   2> 572 T2894 oasc.CoreContainer.load Registering Log Listener
[junit4:junit4]   2> 593 T2894 oasc.CoreContainer.initZooKeeper Zookeeper client=127.0.0.1:52214/solr
[junit4:junit4]   2> 594 T2894 oasc.ZkController.checkChrootPath zkHost includes chroot
[junit4:junit4]   2> 595 T2894 oaz.ZooKeeper.<init> Initiating client connection, connectString=127.0.0.1:52214 sessionTimeout=60000 watcher=org.apache.solr.common.cloud.ConnectionManager@3662093
[junit4:junit4]   2> 597 T2913 oaz.ClientCnxn$SendThread.logStartConnect Opening socket connection to server localhost/127.0.0.1:52214. Will not attempt to authenticate using SASL (access denied ("javax.security.auth.AuthPermission" "getLoginConfiguration"))
[junit4:junit4]   2> 598 T2894 oascc.ConnectionManager.waitForConnected Waiting for client to connect to ZooKeeper
[junit4:junit4]   2> 600 T2913 oaz.ClientCnxn$SendThread.primeConnection Socket connection established to localhost/127.0.0.1:52214, initiating session
[junit4:junit4]   2> 602 T2896 oazs.NIOServerCnxnFactory.run Accepted socket connection from /127.0.0.1:52218
[junit4:junit4]   2> 603 T2896 oazs.ZooKeeperServer.processConnectRequest Client attempting to establish new session at /127.0.0.1:52218
[junit4:junit4]   2> 606 T2898 oazs.ZooKeeperServer.finishSessionInit Established session 0x13cd6b980c00002 with negotiated timeout 20000 for client /127.0.0.1:52218
[junit4:junit4]   2> 607 T2913 oaz.ClientCnxn$SendThread.onConnected Session establishment complete on server localhost/127.0.0.1:52214, sessionid = 0x13cd6b980c00002, negotiated timeout = 20000
[junit4:junit4]   2> 608 T2914 oascc.ConnectionManager.process Watcher org.apache.solr.common.cloud.ConnectionManager@3662093 name:ZooKeeperConnection Watcher:127.0.0.1:52214 got event WatchedEvent state:SyncConnected type:None path:null path:null type:None
[junit4:junit4]   2> 608 T2894 oascc.ConnectionManager.waitForConnected Client is connected to ZooKeeper
[junit4:junit4]   2> 614 T2899 oazs.PrepRequestProcessor.pRequest2Txn Processed session termination for sessionid: 0x13cd6b980c00002
[junit4:junit4]   2> 615 T2896 oazs.NIOServerCnxn.closeSock Closed socket connection for client /127.0.0.1:52218 which had sessionid 0x13cd6b980c00002
[junit4:junit4]   2> 616 T2914 oaz.ClientCnxn$EventThread.run EventThread shut down
[junit4:junit4]   2> 618 T2894 oaz.ZooKeeper.close Session: 0x13cd6b980c00002 closed
[junit4:junit4]   2> 619 T2894 oascsi.HttpClientUtil.createClient Creating new http client, config:maxConnections=500&maxConnectionsPerHost=16&socketTimeout=60000&connTimeout=15000
[junit4:junit4]   2> 629 T2894 oaz.ZooKeeper.<init> Initiating client connection, connectString=127.0.0.1:52214/solr sessionTimeout=30000 watcher=org.apache.solr.common.cloud.ConnectionManager@41060780
[junit4:junit4]   2> 632 T2894 oascc.ConnectionManager.waitForConnected Waiting for client to connect to ZooKeeper
[junit4:junit4]   2> 634 T2915 oaz.ClientCnxn$SendThread.logStartConnect Opening socket connection to server localhost/127.0.0.1:52214. Will not attempt to authenticate using SASL (access denied ("javax.security.auth.AuthPermission" "getLoginConfiguration"))
[junit4:junit4]   2> 635 T2896 oazs.NIOServerCnxnFactory.run Accepted socket connection from /127.0.0.1:52219
[junit4:junit4]   2> 636 T2915 oaz.ClientCnxn$SendThread.primeConnection Socket connection established to localhost/127.0.0.1:52214, initiating session
[junit4:junit4]   2> 636 T2896 oazs.ZooKeeperServer.processConnectRequest Client attempting to establish new session at /127.0.0.1:52219
[junit4:junit4]   2> 638 T2898 oazs.ZooKeeperServer.finishSessionInit Established session 0x13cd6b980c00003 with negotiated timeout 20000 for client /127.0.0.1:52219
[junit4:junit4]   2> 639 T2915 oaz.ClientCnxn$SendThread.onConnected Session establishment complete on server localhost/127.0.0.1:52214, sessionid = 0x13cd6b980c00003, negotiated timeout = 20000
[junit4:junit4]   2> 639 T2916 oascc.ConnectionManager.process Watcher org.apache.solr.common.cloud.ConnectionManager@41060780 name:ZooKeeperConnection Watcher:127.0.0.1:52214/solr got event WatchedEvent state:SyncConnected type:None path:null path:null type:None
[junit4:junit4]   2> 640 T2894 oascc.ConnectionManager.waitForConnected Client is connected to ZooKeeper
[junit4:junit4]   2> 648 T2899 oazs.PrepRequestProcessor.pRequest Got user-level KeeperException when processing sessionid:0x13cd6b980c00003 type:create cxid:0x2 zxid:0x1a txntype:-1 reqpath:n/a Error Path:/solr/overseer Error:KeeperErrorCode = NodeExists for /solr/overseer
[junit4:junit4]   2> 652 T2894 oascc.SolrZkClient.makePath makePath: /live_nodes
[junit4:junit4]   2> 659 T2894 oasc.ZkController.createEphemeralLiveNode Register node as live in ZooKeeper:/live_nodes/127.0.0.1:52217_jszv%2Fb
[junit4:junit4]   2> 661 T2899 oazs.PrepRequestProcessor.pRequest Got user-level KeeperException when processing sessionid:0x13cd6b980c00003 type:delete cxid:0x8 zxid:0x1c txntype:-1 reqpath:n/a Error Path:/solr/live_nodes/127.0.0.1:52217_jszv%2Fb Error:KeeperErrorCode = NoNode for /solr/live_nodes/127.0.0.1:52217_jszv%2Fb
[junit4:junit4]   2> 662 T2894 oascc.SolrZkClient.makePath makePath: /live_nodes/127.0.0.1:52217_jszv%2Fb
[junit4:junit4]   2> 677 T2894 oascc.SolrZkClient.makePath makePath: /overseer_elect/election
[junit4:junit4]   2> 708 T2899 oazs.PrepRequestProcessor.pRequest Got user-level KeeperException when processing sessionid:0x13cd6b980c00003 type:delete cxid:0x16 zxid:0x21 txntype:-1 reqpath:n/a Error Path:/solr/overseer_elect/leader Error:KeeperErrorCode = NoNode for /solr/overseer_elect/leader
[junit4:junit4]   2> 711 T2894 oascc.SolrZkClient.makePath makePath: /overseer_elect/leader
[junit4:junit4]   2> 717 T2894 oasc.Overseer.start Overseer (id=89182184857927683-127.0.0.1:52217_jszv%2Fb-n_0000000000) starting
[junit4:junit4]   2> 719 T2899 oazs.PrepRequestProcessor.pRequest Got user-level KeeperException when processing sessionid:0x13cd6b980c00003 type:create cxid:0x1b zxid:0x23 txntype:-1 reqpath:n/a Error Path:/solr/overseer Error:KeeperErrorCode = NodeExists for /solr/overseer
[junit4:junit4]   2> 721 T2899 oazs.PrepRequestProcessor.pRequest Got user-level KeeperException when processing sessionid:0x13cd6b980c00003 type:create cxid:0x1c zxid:0x24 txntype:-1 reqpath:n/a Error Path:/solr/overseer Error:KeeperErrorCode = NodeExists for /solr/overseer
[junit4:junit4]   2> 723 T2899 oazs.PrepRequestProcessor.pRequest Got user-level KeeperException when processing sessionid:0x13cd6b980c00003 type:create cxid:0x1d zxid:0x25 txntype:-1 reqpath:n/a Error Path:/solr/overseer Error:KeeperErrorCode = NodeExists for /solr/overseer
[junit4:junit4]   2> 726 T2899 oazs.PrepRequestProcessor.pRequest Got user-level KeeperException when processing sessionid:0x13cd6b980c00003 type:create cxid:0x1e zxid:0x26 txntype:-1 reqpath:n/a Error Path:/solr/overseer Error:KeeperErrorCode = NodeExists for /solr/overseer
[junit4:junit4]   2> 728 T2918 oasc.OverseerCollectionProcessor.run Process current queue of collection creations
[junit4:junit4]   2> 733 T2894 oascc.SolrZkClient.makePath makePath: /clusterstate.json
[junit4:junit4]   2> 742 T2894 oascc.ZkStateReader.createClusterStateWatchersAndUpdate Updating cluster state from ZooKeeper... 
[junit4:junit4]   2> 754 T2919 oasc.CoreContainer.create Creating SolrCore 'collection1' using instanceDir: /Users/jenkins/jenkins-slave/workspace/Lucene-Solr-4.x-MacOSX/solr/build/solr-core/test/J0/./org.apache.solr.cloud.BasicDistributedZkTest-controljetty-1360812147118/collection1
[junit4:junit4]   2> 755 T2919 oasc.ZkController.createCollectionZkNode Check for collection zkNode:control_collection
[junit4:junit4]   2> 755 T2917 oasc.Overseer$ClusterStateUpdater.run Starting to work on the main queue
[junit4:junit4]   2> 757 T2919 oasc.ZkController.createCollectionZkNode Collection zkNode exists
[junit4:junit4]   2> 758 T2919 oasc.ZkController.readConfigName Load collection config from:/collections/control_collection
[junit4:junit4]   2> 762 T2919 oasc.SolrResourceLoader.<init> new SolrResourceLoader for directory: '/Users/jenkins/jenkins-slave/workspace/Lucene-Solr-4.x-MacOSX/solr/build/solr-core/test/J0/./org.apache.solr.cloud.BasicDistributedZkTest-controljetty-1360812147118/collection1/'
[junit4:junit4]   2> 764 T2919 oasc.SolrResourceLoader.replaceClassLoader Adding 'file:/Users/jenkins/jenkins-slave/workspace/Lucene-Solr-4.x-MacOSX/solr/build/solr-core/test/J0/org.apache.solr.cloud.BasicDistributedZkTest-controljetty-1360812147118/collection1/lib/classes/' to classloader
[junit4:junit4]   2> 765 T2919 oasc.SolrResourceLoader.replaceClassLoader Adding 'file:/Users/jenkins/jenkins-slave/workspace/Lucene-Solr-4.x-MacOSX/solr/build/solr-core/test/J0/org.apache.solr.cloud.BasicDistributedZkTest-controljetty-1360812147118/collection1/lib/README' to classloader
[junit4:junit4]   2> 834 T2919 oasc.SolrConfig.<init> Using Lucene MatchVersion: LUCENE_42
[junit4:junit4]   2> 920 T2919 oasc.SolrConfig.<init> Loaded SolrConfig: solrconfig.xml
[junit4:junit4]   2> 922 T2919 oass.IndexSchema.readSchema Reading Solr Schema
[junit4:junit4]   2> 934 T2919 oass.IndexSchema.readSchema Schema name=test
[junit4:junit4]   2> 1550 T2919 oass.OpenExchangeRatesOrgProvider.init Initialized with rates=open-exchange-rates.json, refreshInterval=1440.
[junit4:junit4]   2> 1559 T2919 oass.IndexSchema.readSchema default search field in schema is text
[junit4:junit4]   2> 1563 T2919 oass.IndexSchema.readSchema unique key field: id
[junit4:junit4]   2> 1590 T2919 oass.FileExchangeRateProvider.reload Reloading exchange rates from file currency.xml
[junit4:junit4]   2> 1598 T2919 oass.FileExchangeRateProvider.reload Reloading exchange rates from file currency.xml
[junit4:junit4]   2> 1605 T2919 oass.OpenExchangeRatesOrgProvider.reload Reloading exchange rates from open-exchange-rates.json
[junit4:junit4]   2> 1607 T2919 oass.OpenExchangeRatesOrgProvider.reload Reloading exchange rates from open-exchange-rates.json
[junit4:junit4]   2> 1609 T2919 oasc.SolrCore.<init> [collection1] Opening new SolrCore at /Users/jenkins/jenkins-slave/workspace/Lucene-Solr-4.x-MacOSX/solr/build/solr-core/test/J0/./org.apache.solr.cloud.BasicDistributedZkTest-controljetty-1360812147118/collection1/, dataDir=./org.apache.solr.cloud.BasicDistributedZkTest-1360812146869/control/data/
[junit4:junit4]   2> 1610 T2919 oasc.JmxMonitoredMap.<init> JMX monitoring is enabled. Adding Solr mbeans to JMX Server: com.sun.jmx.mbeanserver.JmxMBeanServer@262adc9a
[junit4:junit4]   2> 1611 T2919 oasc.SolrCore.initDirectoryFactory solr.NRTCachingDirectoryFactory
[junit4:junit4]   2> 1612 T2919 oasc.CachingDirectoryFactory.get return new directory for /Users/jenkins/jenkins-slave/workspace/Lucene-Solr-4.x-MacOSX/solr/build/solr-core/test/J0/./org.apache.solr.cloud.BasicDistributedZkTest-1360812146869/control/data forceNew:false
[junit4:junit4]   2> 1613 T2919 oasc.CachingDirectoryFactory.close Releasing directory:/Users/jenkins/jenkins-slave/workspace/Lucene-Solr-4.x-MacOSX/solr/build/solr-core/test/J0/./org.apache.solr.cloud.BasicDistributedZkTest-1360812146869/control/data
[junit4:junit4]   2> 1614 T2919 oasc.SolrCore.getNewIndexDir New index directory detected: old=null new=./org.apache.solr.cloud.BasicDistributedZkTest-1360812146869/control/data/index/
[junit4:junit4]   2> 1614 T2919 oasc.SolrCore.initIndex WARNING [collection1] Solr index directory './org.apache.solr.cloud.BasicDistributedZkTest-1360812146869/control/data/index' doesn't exist. Creating new index...
[junit4:junit4]   2> 1615 T2919 oasc.CachingDirectoryFactory.get return new directory for /Users/jenkins/jenkins-slave/workspace/Lucene-Solr-4.x-MacOSX/solr/build/solr-core/test/J0/./org.apache.solr.cloud.BasicDistributedZkTest-1360812146869/control/data/index forceNew:false
[junit4:junit4]   2> 1621 T2919 oasc.SolrDeletionPolicy.onCommit SolrDeletionPolicy.onCommit: commits:num=1
[junit4:junit4]   2> 		commit{dir=RateLimitedDirectoryWrapper(NRTCachingDirectory(org.apache.lucene.store.NIOFSDirectory@/Users/jenkins/jenkins-slave/workspace/Lucene-Solr-4.x-MacOSX/solr/build/solr-core/test/J0/org.apache.solr.cloud.BasicDistributedZkTest-1360812146869/control/data/index lockFactory=org.apache.lucene.store.NativeFSLockFactory@31ffde0c; maxCacheMB=48.0 maxMergeSizeMB=4.0)),segFN=segments_1,generation=1,filenames=[segments_1]
[junit4:junit4]   2> 1621 T2919 oasc.SolrDeletionPolicy.updateCommits newest commit = 1[segments_1]
[junit4:junit4]   2> 1622 T2919 oasc.CachingDirectoryFactory.close Releasing directory:/Users/jenkins/jenkins-slave/workspace/Lucene-Solr-4.x-MacOSX/solr/build/solr-core/test/J0/./org.apache.solr.cloud.BasicDistributedZkTest-1360812146869/control/data/index
[junit4:junit4]   2> 1622 T2919 oasc.SolrCore.initWriters created xml: solr.XMLResponseWriter
[junit4:junit4]   2> 1625 T2919 oasup.UpdateRequestProcessorChain.init inserting DistributedUpdateProcessorFactory into updateRequestProcessorChain "dedupe"
[junit4:junit4]   2> 1625 T2919 oasup.UpdateRequestProcessorChain.init inserting DistributedUpdateProcessorFactory into updateRequestProcessorChain "dedupe-allfields"
[junit4:junit4]   2> 1626 T2919 oasup.UpdateRequestProcessorChain.init inserting DistributedUpdateProcessorFactory into updateRequestProcessorChain "stored_sig"
[junit4:junit4]   2> 1626 T2919 oasup.UpdateRequestProcessorChain.init inserting DistributedUpdateProcessorFactory into updateRequestProcessorChain "uniq-fields"
[junit4:junit4]   2> 1627 T2919 oasup.UpdateRequestProcessorChain.init inserting DistributedUpdateProcessorFactory into updateRequestProcessorChain "distrib-dup-test-chain-implicit"
[junit4:junit4]   2> 1628 T2919 oasc.RequestHandlers.initHandlersFromConfig adding lazy requestHandler: solr.ReplicationHandler
[junit4:junit4]   2> 1628 T2919 oasc.RequestHandlers.initHandlersFromConfig created /replication: solr.ReplicationHandler
[junit4:junit4]   2> 1629 T2919 oasc.RequestHandlers.initHandlersFromConfig created standard: solr.StandardRequestHandler
[junit4:junit4]   2> 1630 T2919 oasc.RequestHandlers.initHandlersFromConfig created /get: solr.RealTimeGetHandler
[junit4:junit4]   2> 1630 T2919 oasc.RequestHandlers.initHandlersFromConfig created dismax: solr.SearchHandler
[junit4:junit4]   2> 1631 T2919 oasc.RequestHandlers.initHandlersFromConfig created mock: org.apache.solr.core.MockQuerySenderListenerReqHandler
[junit4:junit4]   2> 1631 T2919 oasc.RequestHandlers.initHandlersFromConfig created /admin/: org.apache.solr.handler.admin.AdminHandlers
[junit4:junit4]   2> 1632 T2919 oasc.RequestHandlers.initHandlersFromConfig created defaults: solr.StandardRequestHandler
[junit4:junit4]   2> 1632 T2919 oasc.RequestHandlers.initHandlersFromConfig adding lazy requestHandler: solr.StandardRequestHandler
[junit4:junit4]   2> 1633 T2919 oasc.RequestHandlers.initHandlersFromConfig created lazy: solr.StandardRequestHandler
[junit4:junit4]   2> 1633 T2919 oasc.RequestHandlers.initHandlersFromConfig created /update: solr.UpdateRequestHandler
[junit4:junit4]   2> 1634 T2919 oasc.RequestHandlers.initHandlersFromConfig created /terms: org.apache.solr.handler.component.SearchHandler
[junit4:junit4]   2> 1635 T2919 oasc.RequestHandlers.initHandlersFromConfig created spellCheckCompRH: org.apache.solr.handler.component.SearchHandler
[junit4:junit4]   2> 1636 T2919 oasc.RequestHandlers.initHandlersFromConfig created spellCheckCompRH_Direct: org.apache.solr.handler.component.SearchHandler
[junit4:junit4]   2> 1636 T2919 oasc.RequestHandlers.initHandlersFromConfig created spellCheckWithWordbreak: org.apache.solr.handler.component.SearchHandler
[junit4:junit4]   2> 1637 T2919 oasc.RequestHandlers.initHandlersFromConfig created spellCheckWithWordbreak_Direct: org.apache.solr.handler.component.SearchHandler
[junit4:junit4]   2> 1638 T2919 oasc.RequestHandlers.initHandlersFromConfig created spellCheckCompRH1: org.apache.solr.handler.component.SearchHandler
[junit4:junit4]   2> 1638 T2919 oasc.RequestHandlers.initHandlersFromConfig created mltrh: org.apache.solr.handler.component.SearchHandler
[junit4:junit4]   2> 1639 T2919 oasc.RequestHandlers.initHandlersFromConfig created tvrh: org.apache.solr.handler.component.SearchHandler
[junit4:junit4]   2> 1640 T2919 oasc.RequestHandlers.initHandlersFromConfig created /mlt: solr.MoreLikeThisHandler
[junit4:junit4]   2> 1640 T2919 oasc.RequestHandlers.initHandlersFromConfig created /debug/dump: solr.DumpRequestHandler
[junit4:junit4]   2> 1647 T2919 oashl.XMLLoader.init xsltCacheLifetimeSeconds=60
[junit4:junit4]   2> 1650 T2919 oasc.SolrCore.initDeprecatedSupport WARNING solrconfig.xml uses deprecated <admin/gettableFiles>, Please update your config to use the ShowFileRequestHandler.
[junit4:junit4]   2> 1652 T2919 oasc.SolrCore.initDeprecatedSupport WARNING adding ShowFileRequestHandler with hidden files: [SCHEMA.XML, OLD_SYNONYMS.TXT, STOPWORDS.TXT, PROTWORDS.TXT, OPEN-EXCHANGE-RATES.JSON, SYNONYMS.TXT, CURRENCY.XML, MAPPING-ISOLATIN1ACCENT.TXT]
[junit4:junit4]   2> 1654 T2919 oasc.CachingDirectoryFactory.close Releasing directory:/Users/jenkins/jenkins-slave/workspace/Lucene-Solr-4.x-MacOSX/solr/build/solr-core/test/J0/./org.apache.solr.cloud.BasicDistributedZkTest-1360812146869/control/data
[junit4:junit4]   2> 1656 T2919 oass.SolrIndexSearcher.<init> Opening Searcher@3caafe72 main
[junit4:junit4]   2> 1657 T2919 oasu.CommitTracker.<init> Hard AutoCommit: disabled
[junit4:junit4]   2> 1657 T2919 oasu.CommitTracker.<init> Soft AutoCommit: disabled
[junit4:junit4]   2> 1657 T2919 oashc.SpellCheckComponent.inform Initializing spell checkers
[junit4:junit4]   2> 1664 T2919 oass.DirectSolrSpellChecker.init init: {name=direct,classname=DirectSolrSpellChecker,field=lowerfilt,minQueryLength=3}
[junit4:junit4]   2> 1695 T2920 oasc.SolrCore.registerSearcher [collection1] Registered new searcher Searcher@3caafe72 main{StandardDirectoryReader(segments_1:1)}
[junit4:junit4]   2> 1700 T2919 oasc.ZkController.publish publishing core=collection1 state=down
[junit4:junit4]   2> 1700 T2919 oasc.ZkController.publish numShards not found on descriptor - reading it from system property
[junit4:junit4]   2> 1701 T2899 oazs.PrepRequestProcessor.pRequest Got user-level KeeperException when processing sessionid:0x13cd6b980c00003 type:create cxid:0x51 zxid:0x29 txntype:-1 reqpath:n/a Error Path:/solr/overseer/queue Error:KeeperErrorCode = NoNode for /solr/overseer/queue
[junit4:junit4]   2> 2266 T2917 oascc.ZkStateReader.updateClusterState Updating cloud state from ZooKeeper... 
[junit4:junit4]   2> 2267 T2917 oasc.Overseer$ClusterStateUpdater.updateState Update state numShards=1 message={
[junit4:junit4]   2> 	  "operation":"state",
[junit4:junit4]   2> 	  "numShards":"1",
[junit4:junit4]   2> 	  "shard":null,
[junit4:junit4]   2> 	  "roles":null,
[junit4:junit4]   2> 	  "state":"down",
[junit4:junit4]   2> 	  "core":"collection1",
[junit4:junit4]   2> 	  "collection":"control_collection",
[junit4:junit4]   2> 	  "node_name":"127.0.0.1:52217_jszv%2Fb",
[junit4:junit4]   2> 	  "base_url":"http://127.0.0.1:52217/jszv/b"}
[junit4:junit4]   2> 2267 T2917 oasc.Overseer$ClusterStateUpdater.createCollection Create collection control_collection with numShards 1
[junit4:junit4]   2> 2267 T2917 oasc.Overseer$ClusterStateUpdater.updateState Assigning new node to shard shard=shard1
[junit4:junit4]   2> 2268 T2899 oazs.PrepRequestProcessor.pRequest Got user-level KeeperException when processing sessionid:0x13cd6b980c00003 type:create cxid:0x59 zxid:0x2c txntype:-1 reqpath:n/a Error Path:/solr/overseer/queue-work Error:KeeperErrorCode = NoNode for /solr/overseer/queue-work
[junit4:junit4]   2> 2276 T2916 oascc.ZkStateReader$2.process A cluster state change: WatchedEvent state:SyncConnected type:NodeDataChanged path:/clusterstate.json, has occurred - updating... (live nodes size: 1)
[junit4:junit4]   2> 2706 T2919 oasc.CoreContainer.registerCore registering core: collection1
[junit4:junit4]   2> 2706 T2919 oasc.ZkController.register Register replica - core:collection1 address:http://127.0.0.1:52217/jszv/b collection:control_collection shard:shard1
[junit4:junit4]   2> 2709 T2919 oascc.SolrZkClient.makePath makePath: /collections/control_collection/leader_elect/shard1/election
[junit4:junit4]   2> 2730 T2899 oazs.PrepRequestProcessor.pRequest Got user-level KeeperException when processing sessionid:0x13cd6b980c00003 type:delete cxid:0x73 zxid:0x36 txntype:-1 reqpath:n/a Error Path:/solr/collections/control_collection/leaders Error:KeeperErrorCode = NoNode for /solr/collections/control_collection/leaders
[junit4:junit4]   2> 2732 T2919 oasc.ShardLeaderElectionContext.runLeaderProcess Running the leader process.
[junit4:junit4]   2> 2733 T2899 oazs.PrepRequestProcessor.pRequest Got user-level KeeperException when processing sessionid:0x13cd6b980c00003 type:create cxid:0x74 zxid:0x37 txntype:-1 reqpath:n/a Error Path:/solr/overseer Error:KeeperErrorCode = NodeExists for /solr/overseer
[junit4:junit4]   2> 2741 T2919 oasc.ShardLeaderElectionContext.waitForReplicasToComeUp Enough replicas found to continue.
[junit4:junit4]   2> 2742 T2919 oasc.ShardLeaderElectionContext.runLeaderProcess I may be the new leader - try and sync
[junit4:junit4]   2> 2743 T2919 oasc.SyncStrategy.sync Sync replicas to http://127.0.0.1:52217/jszv/b/collection1/
[junit4:junit4]   2> 2744 T2919 oasc.SyncStrategy.syncReplicas Sync Success - now sync replicas to me
[junit4:junit4]   2> 2744 T2919 oasc.SyncStrategy.syncToMe http://127.0.0.1:52217/jszv/b/collection1/ has no replicas
[junit4:junit4]   2> 2745 T2919 oasc.ShardLeaderElectionContext.runLeaderProcess I am the new leader: http://127.0.0.1:52217/jszv/b/collection1/
[junit4:junit4]   2> 2746 T2919 oascc.SolrZkClient.makePath makePath: /collections/control_collection/leaders/shard1
[junit4:junit4]   2> 2762 T2899 oazs.PrepRequestProcessor.pRequest Got user-level KeeperException when processing sessionid:0x13cd6b980c00003 type:create cxid:0x7e zxid:0x3b txntype:-1 reqpath:n/a Error Path:/solr/overseer Error:KeeperErrorCode = NodeExists for /solr/overseer
[junit4:junit4]   2> 3785 T2917 oascc.ZkStateReader.updateClusterState Updating cloud state from ZooKeeper... 
[junit4:junit4]   2> 3800 T2916 oascc.ZkStateReader$2.process A cluster state change: WatchedEvent state:SyncConnected type:NodeDataChanged path:/clusterstate.json, has occurred - updating... (live nodes size: 1)
[junit4:junit4]   2> 3858 T2919 oasc.ZkController.register We are http://127.0.0.1:52217/jszv/b/collection1/ and leader is http://127.0.0.1:52217/jszv/b/collection1/
[junit4:junit4]   2> 3859 T2919 oasc.ZkController.register No LogReplay needed for core=collection1 baseURL=http://127.0.0.1:52217/jszv/b
[junit4:junit4]   2> 3859 T2919 oasc.ZkController.checkRecovery I am the leader, no recovery necessary
[junit4:junit4]   2> 3859 T2919 oasc.ZkController.publish publishing core=collection1 state=active
[junit4:junit4]   2> 3859 T2919 oasc.ZkController.publish numShards not found on descriptor - reading it from system property
[junit4:junit4]   2> 3863 T2919 oascc.ZkStateReader.updateClusterState Updating cloud state from ZooKeeper... 
[junit4:junit4]   2> 3865 T2894 oass.SolrDispatchFilter.init user.dir=/Users/jenkins/jenkins-slave/workspace/Lucene-Solr-4.x-MacOSX/solr/build/solr-core/test/J0
[junit4:junit4]   2> 3865 T2894 oass.SolrDispatchFilter.init SolrDispatchFilter.init() done
[junit4:junit4]   2> 3866 T2894 oascsi.HttpClientUtil.createClient Creating new http client, config:maxConnections=128&maxConnectionsPerHost=32&followRedirects=false
[junit4:junit4]   2> 3881 T2894 oascsi.HttpClientUtil.createClient Creating new http client, config:
[junit4:junit4]   2> 3883 T2894 oaz.ZooKeeper.<init> Initiating client connection, connectString=127.0.0.1:52214/solr sessionTimeout=10000 watcher=org.apache.solr.common.cloud.ConnectionManager@114b9eb8
[junit4:junit4]   2> 3884 T2894 oascc.ConnectionManager.waitForConnected Waiting for client to connect to ZooKeeper
[junit4:junit4]   2> 3885 T2921 oaz.ClientCnxn$SendThread.logStartConnect Opening socket connection to server localhost/127.0.0.1:52214. Will not attempt to authenticate using SASL (access denied ("javax.security.auth.AuthPermission" "getLoginConfiguration"))
[junit4:junit4]   2> 3886 T2921 oaz.ClientCnxn$SendThread.primeConnection Socket connection established to localhost/127.0.0.1:52214, initiating session
[junit4:junit4]   2> 3886 T2896 oazs.NIOServerCnxnFactory.run Accepted socket connection from /127.0.0.1:52220
[junit4:junit4]   2> 3887 T2896 oazs.ZooKeeperServer.processConnectRequest Client attempting to establish new session at /127.0.0.1:52220
[junit4:junit4]   2> 3889 T2898 oazs.ZooKeeperServer.finishSessionInit Established session 0x13cd6b980c00004 with negotiated timeout 10000 for client /127.0.0.1:52220
[junit4:junit4]   2> 3889 T2921 oaz.ClientCnxn$SendThread.onConnected Session establishment complete on server localhost/127.0.0.1:52214, sessionid = 0x13cd6b980c00004, negotiated timeout = 10000
[junit4:junit4]   2> 3889 T2922 oascc.ConnectionManager.process Watcher org.apache.solr.common.cloud.ConnectionManager@114b9eb8 name:ZooKeeperConnection Watcher:127.0.0.1:52214/solr got event WatchedEvent state:SyncConnected type:None path:null path:null type:None
[junit4:junit4]   2> 3890 T2894 oascc.ConnectionManager.waitForConnected Client is connected to ZooKeeper
[junit4:junit4]   2> 3893 T2894 oascc.ZkStateReader.createClusterStateWatchersAndUpdate Updating cluster state from ZooKeeper... 
[junit4:junit4]   2> 3896 T2894 oasc.ChaosMonkey.monkeyLog monkey: init - expire sessions:true cause connection loss:true
[junit4:junit4]   2> 4090 T2894 oejs.Server.doStart jetty-8.1.8.v20121106
[junit4:junit4]   2> 4092 T2894 oejs.AbstractConnector.doStart Started SelectChannelConnector@127.0.0.1:52221
[junit4:junit4]   2> 4094 T2894 oass.SolrDispatchFilter.init SolrDispatchFilter.init()
[junit4:junit4]   2> 4094 T2894 oasc.SolrResourceLoader.locateSolrHome JNDI not configured for solr (NoInitialContextEx)
[junit4:junit4]   2> 4094 T2894 oasc.SolrResourceLoader.locateSolrHome using system property solr.solr.home: /Users/jenkins/jenkins-slave/workspace/Lucene-Solr-4.x-MacOSX/solr/build/solr-core/test/J0/./org.apache.solr.cloud.BasicDistributedZkTest-jetty1-1360812150757
[junit4:junit4]   2> 4095 T2894 oasc.CoreContainer$Initializer.initialize looking for solr.xml: /Users/jenkins/jenkins-slave/workspace/Lucene-Solr-4.x-MacOSX/solr/build/solr-core/test/J0/./org.apache.solr.cloud.BasicDistributedZkTest-jetty1-1360812150757/solr.xml
[junit4:junit4]   2> 4096 T2894 oasc.CoreContainer.<init> New CoreContainer 229195887
[junit4:junit4]   2> 4096 T2894 oasc.CoreContainer.load Loading CoreContainer using Solr Home: '/Users/jenkins/jenkins-slave/workspace/Lucene-Solr-4.x-MacOSX/solr/build/solr-core/test/J0/./org.apache.solr.cloud.BasicDistributedZkTest-jetty1-1360812150757/'
[junit4:junit4]   2> 4096 T2894 oasc.SolrResourceLoader.<init> new SolrResourceLoader for directory: '/Users/jenkins/jenkins-slave/workspace/Lucene-Solr-4.x-MacOSX/solr/build/solr-core/test/J0/./org.apache.solr.cloud.BasicDistributedZkTest-jetty1-1360812150757/'
[junit4:junit4]   2> 4144 T2894 oashc.HttpShardHandlerFactory.getParameter Setting socketTimeout to: 60000
[junit4:junit4]   2> 4145 T2894 oashc.HttpShardHandlerFactory.getParameter Setting urlScheme to: http://
[junit4:junit4]   2> 4146 T2894 oashc.HttpShardHandlerFactory.getParameter Setting connTimeout to: 15000
[junit4:junit4]   2> 4146 T2894 oashc.HttpShardHandlerFactory.getParameter Setting maxConnectionsPerHost to: 20
[junit4:junit4]   2> 4147 T2894 oashc.HttpShardHandlerFactory.getParameter Setting corePoolSize to: 0
[junit4:junit4]   2> 4147 T2894 oashc.HttpShardHandlerFactory.getParameter Setting maximumPoolSize to: 2147483647
[junit4:junit4]   2> 4148 T2894 oashc.HttpShardHandlerFactory.getParameter Setting maxThreadIdleTime to: 5
[junit4:junit4]   2> 4148 T2894 oashc.HttpShardHandlerFactory.getParameter Setting sizeOfQueue to: -1
[junit4:junit4]   2> 4149 T2894 oashc.HttpShardHandlerFactory.getParameter Setting fairnessPolicy to: false
[junit4:junit4]   2> 4150 T2894 oascsi.HttpClientUtil.createClient Creating new http client, config:maxConnectionsPerHost=20&maxConnections=10000&socketTimeout=60000&connTimeout=15000&retry=false
[junit4:junit4]   2> 4163 T2894 oasc.CoreContainer.load Registering Log Listener
[junit4:junit4]   2> 4183 T2894 oasc.CoreContainer.initZooKeeper Zookeeper client=127.0.0.1:52214/solr
[junit4:junit4]   2> 4184 T2894 oasc.ZkController.checkChrootPath zkHost includes chroot
[junit4:junit4]   2> 4184 T2894 oaz.ZooKeeper.<init> Initiating client connection, connectString=127.0.0.1:52214 sessionTimeout=60000 watcher=org.apache.solr.common.cloud.ConnectionManager@75648f09
[junit4:junit4]   2> 4186 T2894 oascc.ConnectionManager.waitForConnected Waiting for client to connect to ZooKeeper
[junit4:junit4]   2> 4186 T2932 oaz.ClientCnxn$SendThread.logStartConnect Opening socket connection to server localhost/127.0.0.1:52214. Will not attempt to authenticate using SASL (access denied ("javax.security.auth.AuthPermission" "getLoginConfiguration"))
[junit4:junit4]   2> 4188 T2932 oaz.ClientCnxn$SendThread.primeConnection Socket connection established to localhost/127.0.0.1:52214, initiating session
[junit4:junit4]   2> 4188 T2896 oazs.NIOServerCnxnFactory.run Accepted socket connection from /127.0.0.1:52222
[junit4:junit4]   2> 4189 T2896 oazs.ZooKeeperServer.processConnectRequest Client attempting to establish new session at /127.0.0.1:52222
[junit4:junit4]   2> 4190 T2898 oazs.ZooKeeperServer.finishSessionInit Established session 0x13cd6b980c00005 with negotiated timeout 20000 for client /127.0.0.1:52222
[junit4:junit4]   2> 4190 T2932 oaz.ClientCnxn$SendThread.onConnected Session establishment complete on server localhost/127.0.0.1:52214, sessionid = 0x13cd6b980c00005, negotiated timeout = 20000
[junit4:junit4]   2> 4191 T2933 oascc.ConnectionManager.process Watcher org.apache.solr.common.cloud.ConnectionManager@75648f09 name:ZooKeeperConnection Watcher:127.0.0.1:52214 got event WatchedEvent state:SyncConnected type:None path:null path:null type:None
[junit4:junit4]   2> 4191 T2894 oascc.ConnectionManager.waitForConnected Client is connected to ZooKeeper
[junit4:junit4]   2> 4194 T2899 oazs.PrepRequestProcessor.pRequest2Txn Processed session termination for sessionid: 0x13cd6b980c00005
[junit4:junit4]   2> 4195 T2896 oazs.NIOServerCnxn.closeSock Closed socket connection for client /127.0.0.1:52222 which had sessionid 0x13cd6b980c00005
[junit4:junit4]   2> 4196 T2933 oaz.ClientCnxn$EventThread.run EventThread shut down
[junit4:junit4]   2> 4195 T2894 oaz.ZooKeeper.close Session: 0x13cd6b980c00005 closed
[junit4:junit4]   2> 4197 T2894 oascsi.HttpClientUtil.createClient Creating new http client, config:maxConnections=500&maxConnectionsPerHost=16&socketTimeout=60000&connTimeout=15000
[junit4:junit4]   2> 4203 T2894 oaz.ZooKeeper.<init> Initiating client connection, connectString=127.0.0.1:52214/solr sessionTimeout=30000 watcher=org.apache.solr.common.cloud.ConnectionManager@4d02731d
[junit4:junit4]   2> 4205 T2894 oascc.ConnectionManager.waitForConnected Waiting for client to connect to ZooKeeper
[junit4:junit4]   2> 4206 T2934 oaz.ClientCnxn$SendThread.logStartConnect Opening socket connection to server localhost/127.0.0.1:52214. Will not attempt to authenticate using SASL (access denied ("javax.security.auth.AuthPermission" "getLoginConfiguration"))
[junit4:junit4]   2> 4207 T2934 oaz.ClientCnxn$SendThread.primeConnection Socket connection established to localhost/127.0.0.1:52214, initiating session
[junit4:junit4]   2> 4207 T2896 oazs.NIOServerCnxnFactory.run Accepted socket connection from /127.0.0.1:52223
[junit4:junit4]   2> 4207 T2896 oazs.ZooKeeperServer.processConnectRequest Client attempting to establish new session at /127.0.0.1:52223
[junit4:junit4]   2> 4209 T2898 oazs.ZooKeeperServer.finishSessionInit Established session 0x13cd6b980c00006 with negotiated timeout 20000 for client /127.0.0.1:52223
[junit4:junit4]   2> 4209 T2934 oaz.ClientCnxn$SendThread.onConnected Session establishment complete on server localhost/127.0.0.1:52214, sessionid = 0x13cd6b980c00006, negotiated timeout = 20000
[junit4:junit4]   2> 4210 T2935 oascc.ConnectionManager.process Watcher org.apache.solr.common.cloud.ConnectionManager@4d02731d name:ZooKeeperConnection Watcher:127.0.0.1:52214/solr got event WatchedEvent state:SyncConnected type:None path:null path:null type:None
[junit4:junit4]   2> 4210 T2894 oascc.ConnectionManager.waitForConnected Client is connected to ZooKeeper
[junit4:junit4]   2> 4212 T2899 oazs.PrepRequestProcessor.pRequest Got user-level KeeperException when processing sessionid:0x13cd6b980c00006 type:create cxid:0x1 zxid:0x49 txntype:-1 reqpath:n/a Error Path:/solr/overseer Error:KeeperErrorCode = NodeExists for /solr/overseer
[junit4:junit4]   2> 4214 T2899 oazs.PrepRequestProcessor.pRequest Got user-level KeeperException when processing sessionid:0x13cd6b980c00006 type:create cxid:0x2 zxid:0x4a txntype:-1 reqpath:n/a Error Path:/solr/overseer Error:KeeperErrorCode = NodeExists for /solr/overseer
[junit4:junit4]   2> 4217 T2894 oascc.ZkStateReader.createClusterStateWatchersAndUpdate Updating cluster state from ZooKeeper... 
[junit4:junit4]   2> 4223 T2894 oasc.ZkController.createEphemeralLiveNode Register node as live in ZooKeeper:/live_nodes/127.0.0.1:52221_jszv%2Fb
[junit4:junit4]   2> 4224 T2899 oazs.PrepRequestProcessor.pRequest Got user-level KeeperException when processing sessionid:0x13cd6b980c00006 type:delete cxid:0x9 zxid:0x4b txntype:-1 reqpath:n/a Error Path:/solr/live_nodes/127.0.0.1:52221_jszv%2Fb Error:KeeperErrorCode = NoNode for /solr/live_nodes/127.0.0.1:52221_jszv%2Fb
[junit4:junit4]   2> 4225 T2894 oascc.SolrZkClient.makePath makePath: /live_nodes/127.0.0.1:52221_jszv%2Fb
[junit4:junit4]   2> 4230 T2916 oascc.ZkStateReader$2.process A cluster state change: WatchedEvent state:SyncConnected type:NodeChildrenChanged path:/live_nodes, has occurred - updating... (live nodes size: 1)
[junit4:junit4]   2> 4231 T2922 oascc.ZkStateReader$3.process Updating live nodes... (2)
[junit4:junit4]   2> 4232 T2935 oascc.ZkStateReader$3.process Updating live nodes... (2)
[junit4:junit4]   2> 4234 T2916 oascc.ZkStateReader$3.process Updating live nodes... (2)
[junit4:junit4]   2> 4242 T2936 oasc.CoreContainer.create Creating SolrCore 'collection1' using instanceDir: /Users/jenkins/jenkins-slave/workspace/Lucene-Solr-4.x-MacOSX/solr/build/solr-core/test/J0/./org.apache.solr.cloud.BasicDistributedZkTest-jetty1-1360812150757/collection1
[junit4:junit4]   2> 4242 T2936 oasc.ZkController.createCollectionZkNode Check for collection zkNode:collection1
[junit4:junit4]   2> 4244 T2936 oasc.ZkController.createCollectionZkNode Collection zkNode exists
[junit4:junit4]   2> 4244 T2936 oasc.ZkController.readConfigName Load collection config from:/collections/collection1
[junit4:junit4]   2> 4246 T2936 oasc.SolrResourceLoader.<init> new SolrResourceLoader for directory: '/Users/jenkins/jenkins-slave/workspace/Lucene-Solr-4.x-MacOSX/solr/build/solr-core/test/J0/./org.apache.solr.cloud.BasicDistributedZkTest-jetty1-1360812150757/collection1/'
[junit4:junit4]   2> 4247 T2936 oasc.SolrResourceLoader.replaceClassLoader Adding 'file:/Users/jenkins/jenkins-slave/workspace/Lucene-Solr-4.x-MacOSX/solr/build/solr-core/test/J0/org.apache.solr.cloud.BasicDistributedZkTest-jetty1-1360812150757/collection1/lib/classes/' to classloader
[junit4:junit4]   2> 4248 T2936 oasc.SolrResourceLoader.replaceClassLoader Adding 'file:/Users/jenkins/jenkins-slave/workspace/Lucene-Solr-4.x-MacOSX/solr/build/solr-core/test/J0/org.apache.solr.cloud.BasicDistributedZkTest-jetty1-1360812150757/collection1/lib/README' to classloader
[junit4:junit4]   2> 4302 T2936 oasc.SolrConfig.<init> Using Lucene MatchVersion: LUCENE_42
[junit4:junit4]   2> 4394 T2936 oasc.SolrConfig.<init> Loaded SolrConfig: solrconfig.xml
[junit4:junit4]   2> 4397 T2936 oass.IndexSchema.readSchema Reading Solr Schema
[junit4:junit4]   2> 4404 T2936 oass.IndexSchema.readSchema Schema name=test
[junit4:junit4]   2> 5105 T2936 oass.OpenExchangeRatesOrgProvider.init Initialized with rates=open-exchange-rates.json, refreshInterval=1440.
[junit4:junit4]   2> 5113 T2936 oass.IndexSchema.readSchema default search field in schema is text
[junit4:junit4]   2> 5117 T2936 oass.IndexSchema.readSchema unique key field: id
[junit4:junit4]   2> 5142 T2936 oass.FileExchangeRateProvider.reload Reloading exchange rates from file currency.xml
[junit4:junit4]   2> 5148 T2936 oass.FileExchangeRateProvider.reload Reloading exchange rates from file currency.xml
[junit4:junit4]   2> 5154 T2936 oass.OpenExchangeRatesOrgProvider.reload Reloading exchange rates from open-exchange-rates.json
[junit4:junit4]   2> 5156 T2936 oass.OpenExchangeRatesOrgProvider.reload Reloading exchange rates from open-exchange-rates.json
[junit4:junit4]   2> 5159 T2936 oasc.SolrCore.<init> [collection1] Opening new SolrCore at /Users/jenkins/jenkins-slave/workspace/Lucene-Solr-4.x-MacOSX/solr/build/solr-core/test/J0/./org.apache.solr.cloud.BasicDistributedZkTest-jetty1-1360812150757/collection1/, dataDir=./org.apache.solr.cloud.BasicDistributedZkTest-1360812146869/jetty1/
[junit4:junit4]   2> 5159 T2936 oasc.JmxMonitoredMap.<init> JMX monitoring is enabled. Adding Solr mbeans to JMX Server: com.sun.jmx.mbeanserver.JmxMBeanServer@262adc9a
[junit4:junit4]   2> 5160 T2936 oasc.SolrCore.initDirectoryFactory solr.NRTCachingDirectoryFactory
[junit4:junit4]   2> 5160 T2936 oasc.CachingDirectoryFactory.get return new directory for /Users/jenkins/jenkins-slave/workspace/Lucene-Solr-4.x-MacOSX/solr/build/solr-core/test/J0/./org.apache.solr.cloud.BasicDistributedZkTest-1360812146869/jetty1 forceNew:false
[junit4:junit4]   2> 5161 T2936 oasc.CachingDirectoryFactory.close Releasing directory:/Users/jenkins/jenkins-slave/workspace/Lucene-Solr-4.x-MacOSX/solr/build/solr-core/test/J0/./org.apache.solr.cloud.BasicDistributedZkTest-1360812146869/jetty1
[junit4:junit4]   2> 5161 T2936 oasc.SolrCore.getNewIndexDir New index directory detected: old=null new=./org.apache.solr.cloud.BasicDistributedZkTest-1360812146869/jetty1/index/
[junit4:junit4]   2> 5162 T2936 oasc.SolrCore.initIndex WARNING [collection1] Solr index directory './org.apache.solr.cloud.BasicDistributedZkTest-1360812146869/jetty1/index' doesn't exist. Creating new index...
[junit4:junit4]   2> 5163 T2936 oasc.CachingDirectoryFactory.get return new directory for /Users/jenkins/jenkins-slave/workspace/Lucene-Solr-4.x-MacOSX/solr/build/solr-core/test/J0/./org.apache.solr.cloud.BasicDistributedZkTest-1360812146869/jetty1/index forceNew:false
[junit4:junit4]   2> 5166 T2936 oasc.SolrDeletionPolicy.onCommit SolrDeletionPolicy.onCommit: commits:num=1
[junit4:junit4]   2> 		commit{dir=RateLimitedDirectoryWrapper(NRTCachingDirectory(org.apache.lucene.store.NIOFSDirectory@/Users/jenkins/jenkins-slave/workspace/Lucene-Solr-4.x-MacOSX/solr/build/solr-core/test/J0/org.apache.solr.cloud.BasicDistributedZkTest-1360812146869/jetty1/index lockFactory=org.apache.lucene.store.NativeFSLockFactory@6ec5f7c1; maxCacheMB=48.0 maxMergeSizeMB=4.0)),segFN=segments_1,generation=1,filenames=[segments_1]
[junit4:junit4]   2> 5167 T2936 oasc.SolrDeletionPolicy.updateCommits newest commit = 1[segments_1]
[junit4:junit4]   2> 5167 T2936 oasc.CachingDirectoryFactory.close Releasing directory:/Users/jenkins/jenkins-slave/workspace/Lucene-Solr-4.x-MacOSX/solr/build/solr-core/test/J0/./org.apache.solr.cloud.BasicDistributedZkTest-1360812146869/jetty1/index
[junit4:junit4]   2> 5168 T2936 oasc.SolrCore.initWriters created xml: solr.XMLResponseWriter
[junit4:junit4]   2> 5170 T2936 oasup.UpdateRequestProcessorChain.init inserting DistributedUpdateProcessorFactory into updateRequestProcessorChain "dedupe"
[junit4:junit4]   2> 5170 T2936 oasup.UpdateRequestProcessorChain.init inserting DistributedUpdateProcessorFactory into updateRequestProcessorChain "dedupe-allfields"
[junit4:junit4]   2> 5171 T2936 oasup.UpdateRequestProcessorChain.init inserting DistributedUpdateProcessorFactory into updateRequestProcessorChain "stored_sig"
[junit4:junit4]   2> 5171 T2936 oasup.UpdateRequestProcessorChain.init inserting DistributedUpdateProcessorFactory into updateRequestProcessorChain "uniq-fields"
[junit4:junit4]   2> 5172 T2936 oasup.UpdateRequestProcessorChain.init inserting DistributedUpdateProcessorFactory into updateRequestProcessorChain "distrib-dup-test-chain-implicit"
[junit4:junit4]   2> 5172 T2936 oasc.RequestHandlers.initHandlersFromConfig adding lazy requestHandler: solr.ReplicationHandler
[junit4:junit4]   2> 5172 T2936 oasc.RequestHandlers.initHandlersFromConfig created /replication: solr.ReplicationHandler
[junit4:junit4]   2> 5173 T2936 oasc.RequestHandlers.initHandlersFromConfig created standard: solr.StandardRequestHandler
[junit4:junit4]   2> 5174 T2936 oasc.RequestHandlers.initHandlersFromConfig created /get: solr.RealTimeGetHandler
[junit4:junit4]   2> 5174 T2936 oasc.RequestHandlers.initHandlersFromConfig created dismax: solr.SearchHandler
[junit4:junit4]   2> 5175 T2936 oasc.RequestHandlers.initHandlersFromConfig created mock: org.apache.solr.core.MockQuerySenderListenerReqHandler
[junit4:junit4]   2> 5175 T2936 oasc.RequestHandlers.initHandlersFromConfig created /admin/: org.apache.solr.handler.admin.AdminHandlers
[junit4:junit4]   2> 5176 T2936 oasc.RequestHandlers.initHandlersFromConfig created defaults: solr.StandardRequestHandler
[junit4:junit4]   2> 5176 T2936 oasc.RequestHandlers.initHandlersFromConfig adding lazy requestHandler: solr.StandardRequestHandler
[junit4:junit4]   2> 5176 T2936 oasc.RequestHandlers.initHandlersFromConfig created lazy: solr.StandardRequestHandler
[junit4:junit4]   2> 5177 T2936 oasc.RequestHandlers.initHandlersFromConfig created /update: solr.UpdateRequestHandler
[junit4:junit4]   2> 5178 T2936 oasc.RequestHandlers.initHandlersFromConfig created /terms: org.apache.solr.handler.component.SearchHandler
[junit4:junit4]   2> 5179 T2936 oasc.RequestHandlers.initHandlersFromConfig created spellCheckCompRH: org.apache.solr.handler.component.SearchHandler
[junit4:junit4]   2> 5179 T2936 oasc.RequestHandlers.initHandlersFromConfig created spellCheckCompRH_Direct: org.apache.solr.handler.component.SearchHandler
[junit4:junit4]   2> 5179 T2936 oasc.RequestHandlers.initHandlersFromConfig created spellCheckWithWordbreak: org.apache.solr.handler.component.SearchHandler
[junit4:junit4]   2> 5180 T2936 oasc.RequestHandlers.initHandlersFromConfig created spellCheckWithWordbreak_Direct: org.apache.solr.handler.component.SearchHandler
[junit4:junit4]   2> 5180 T2936 oasc.RequestHandlers.initHandlersFromConfig created spellCheckCompRH1: org.apache.solr.handler.component.SearchHandler
[junit4:junit4]   2> 5181 T2936 oasc.RequestHandlers.initHandlersFromConfig created mltrh: org.apache.solr.handler.component.SearchHandler
[junit4:junit4]   2> 5181 T2936 oasc.RequestHandlers.initHandlersFromConfig created tvrh: org.apache.solr.handler.component.SearchHandler
[junit4:junit4]   2> 5182 T2936 oasc.RequestHandlers.initHandlersFromConfig created /mlt: solr.MoreLikeThisHandler
[junit4:junit4]   2> 5182 T2936 oasc.RequestHandlers.initHandlersFromConfig created /debug/dump: solr.DumpRequestHandler
[junit4:junit4]   2> 5188 T2936 oashl.XMLLoader.init xsltCacheLifetimeSeconds=60
[junit4:junit4]   2> 5191 T2936 oasc.SolrCore.initDeprecatedSupport WARNING solrconfig.xml uses deprecated <admin/gettableFiles>, Please update your config to use the ShowFileRequestHandler.
[junit4:junit4]   2> 5192 T2936 oasc.SolrCore.initDeprecatedSupport WARNING adding ShowFileRequestHandler with hidden files: [SCHEMA.XML, OLD_SYNONYMS.TXT, STOPWORDS.TXT, PROTWORDS.TXT, OPEN-EXCHANGE-RATES.JSON, SYNONYMS.TXT, CURRENCY.XML, MAPPING-ISOLATIN1ACCENT.TXT]
[junit4:junit4]   2> 5195 T2936 oasc.CachingDirectoryFactory.close Releasing directory:/Users/jenkins/jenkins-slave/workspace/Lucene-Solr-4.x-MacOSX/solr/build/solr-core/test/J0/./org.apache.solr.cloud.BasicDistributedZkTest-1360812146869/jetty1
[junit4:junit4]   2> 5197 T2936 oass.SolrIndexSearcher.<init> Opening Searcher@b4bbea5 main
[junit4:junit4]   2> 5198 T2936 oasu.CommitTracker.<init> Hard AutoCommit: disabled
[junit4:junit4]   2> 5198 T2936 oasu.CommitTracker.<init> Soft AutoCommit: disabled
[junit4:junit4]   2> 5199 T2936 oashc.SpellCheckComponent.inform Initializing spell checkers
[junit4:junit4]   2> 5206 T2936 oass.DirectSolrSpellChecker.init init: {name=direct,classname=DirectSolrSpellChecker,field=lowerfilt,minQueryLength=3}
[junit4:junit4]   2> 5243 T2937 oasc.SolrCore.registerSearcher [collection1] Registered new searcher Searcher@b4bbea5 main{StandardDirectoryReader(segments_1:1)}
[junit4:junit4]   2> 5252 T2936 oasc.ZkController.publish publishing core=collection1 state=down
[junit4:junit4]   2> 5252 T2936 oasc.ZkController.publish numShards not found on descriptor - reading it from system property
[junit4:junit4]   2> 5313 T2917 oascc.ZkStateReader.updateClusterState Updating cloud state from ZooKeeper... 
[junit4:junit4]   2> 5315 T2917 oasc.Overseer$ClusterStateUpdater.updateState Update state numShards=1 message={
[junit4:junit4]   2> 	  "operation":"state",
[junit4:junit4]   2> 	  "numShards":"1",
[junit4:junit4]   2> 	  "shard":"shard1",
[junit4:junit4]   2> 	  "roles":null,
[junit4:junit4]   2> 	  "state":"active",
[junit4:junit4]   2> 	  "core":"collection1",
[junit4:junit4]   2> 	  "collection":"control_collection",
[junit4:junit4]   2> 	  "node_name":"127.0.0.1:52217_jszv%2Fb",
[junit4:junit4]   2> 	  "base_url":"http://127.0.0.1:52217/jszv/b"}
[junit4:junit4]   2> 5322 T2917 oasc.Overseer$ClusterStateUpdater.updateState Update state numShards=2 message={
[junit4:junit4]   2> 	  "operation":"state",
[junit4:junit4]   2> 	  "numShards":"2",
[junit4:junit4]   2> 	  "shard":null,
[junit4:junit4]   2> 	  "roles":null,
[junit4:junit4]   2> 	  "state":"down",
[junit4:junit4]   2> 	  "core":"collection1",
[junit4:junit4]   2> 	  "collection":"collection1",
[junit4:junit4]   2> 	  "node_name":"127.0.0.1:52221_jszv%2Fb",
[junit4:junit4]   2> 	  "base_url":"http://127.0.0.1:52221/jszv/b"}
[junit4:junit4]   2> 5323 T2917 oasc.Overseer$ClusterStateUpdater.createCollection Create collection collection1 with numShards 2
[junit4:junit4]   2> 5323 T2917 oasc.Overseer$ClusterStateUpdater.updateState Assigning new node to shard shard=shard1
[junit4:junit4]   2> 5331 T2922 oascc.ZkStateReader$2.process A cluster state change: WatchedEvent state:SyncConnected type:NodeDataChanged path:/clusterstate.json, has occurred - updating... (live nodes size: 2)
[junit4:junit4]   2> 5331 T2935 oascc.ZkStateReader$2.process A cluster state change: WatchedEvent state:SyncConnected type:NodeDataChanged path:/clusterstate.json, has occurred - updating... (live nodes size: 2)
[junit4:junit4]   2> 5332 T2916 oascc.ZkStateReader$2.process A cluster state change: WatchedEvent state:SyncConnected type:NodeDataChanged path:/clusterstate.json, has occurred - updating... (live nodes size: 2)
[junit4:junit4]   2> 6256 T2936 oasc.CoreContainer.registerCore registering core: collection1
[junit4:junit4]   2> 6257 T2936 oasc.ZkController.register Register replica - core:collection1 address:http://127.0.0.1:52221/jszv/b collection:collection1 shard:shard1
[junit4:junit4]   2> 6260 T2936 oascc.SolrZkClient.makePath makePath: /collections/collection1/leader_elect/shard1/election
[junit4:junit4]   2> 6280 T2899 oazs.PrepRequestProcessor.pRequest Got user-level KeeperException when processing sessionid:0x13cd6b980c00006 type:delete cxid:0x45 zxid:0x5a txntype:-1 reqpath:n/a Error Path:/solr/collections/collection1/leaders Error:KeeperErrorCode = NoNode for /solr/collections/collection1/leaders
[junit4:junit4]   2> 6281 T2936 oasc.ShardLeaderElectionContext.runLeaderProcess Running the leader process.
[junit4:junit4]   2> 6282 T2899 oazs.PrepRequestProcessor.pRequest Got user-level KeeperException when processing sessionid:0x13cd6b980c00006 type:create cxid:0x46 zxid:0x5b txntype:-1 reqpath:n/a Error Path:/solr/overseer Error:KeeperErrorCode = NodeExists for /solr/overseer
[junit4:junit4]   2> 6285 T2936 oasc.ShardLeaderElectionContext.waitForReplicasToComeUp Enough replicas found to continue.
[junit4:junit4]   2> 6286 T2936 oasc.ShardLeaderElectionContext.runLeaderProcess I may be the new leader - try and sync
[junit4:junit4]   2> 6286 T2936 oasc.SyncStrategy.sync Sync replicas to http://127.0.0.1:52221/jszv/b/collection1/
[junit4:junit4]   2> 6286 T2936 oasc.SyncStrategy.syncReplicas Sync Success - now sync replicas to me
[junit4:junit4]   2> 6286 T2936 oasc.SyncStrategy.syncToMe http://127.0.0.1:52221/jszv/b/collection1/ has no replicas
[junit4:junit4]   2> 6287 T2936 oasc.ShardLeaderElectionContext.runLeaderProcess I am the new leader: http://127.0.0.1:52221/jszv/b/collection1/
[junit4:junit4]   2> 6287 T2936 oascc.SolrZkClient.makePath makePath: /collections/collection1/leaders/shard1
[junit4:junit4]   2> 6295 T2899 oazs.PrepRequestProcessor.pRequest Got user-level KeeperException when processing sessionid:0x13cd6b980c00006 type:create cxid:0x50 zxid:0x5f txntype:-1 reqpath:n/a Error Path:/solr/overseer Error:KeeperErrorCode = NodeExists for /solr/overseer
[junit4:junit4]   2> 6847 T2917 oascc.ZkStateReader.updateClusterState Updating cloud state from ZooKeeper... 
[junit4:junit4]   2> 6864 T2916 oascc.ZkStateReader$2.process A cluster state change: WatchedEvent state:SyncConnected type:NodeDataChanged path:/clusterstate.json, has occurred - updating... (live nodes size: 2)
[junit4:junit4]   2> 6864 T2922 oascc.ZkStateReader$2.process A cluster state change: WatchedEvent state:SyncConnected type:NodeDataChanged path:/clusterstate.json, has occurred - updating... (live nodes size: 2)
[junit4:junit4]   2> 6864 T2935 oascc.ZkStateReader$2.process A cluster state change: WatchedEvent state:SyncConnected type:NodeDataChanged path:/clusterstate.json, has occurred - updating... (live nodes size: 2)
[junit4:junit4]   2> 6912 T2936 oasc.ZkController.register We are http://127.0.0.1:52221/jszv/b/collection1/ and leader is http://127.0.0.1:52221/jszv/b/collection1/
[junit4:junit4]   2> 6913 T2936 oasc.ZkController.register No LogReplay needed for core=collection1 baseURL=http://127.0.0.1:52221/jszv/b
[junit4:junit4]   2> 6913 T2936 oasc.ZkController.checkRecovery I am the leader, no recovery necessary
[junit4:junit4]   2> 6914 T2936 oasc.ZkController.publish publishing core=collection1 state=active
[junit4:junit4]   2> 6914 T2936 oasc.ZkController.publish numShards not found on descriptor - reading it from system property
[junit4:junit4]   2> 6917 T2936 oascc.ZkStateReader.updateClusterState Updating cloud state from ZooKeeper... 
[junit4:junit4]   2> 6919 T2894 oass.SolrDispatchFilter.init user.dir=/Users/jenkins/jenkins-slave/workspace/Lucene-Solr-4.x-MacOSX/solr/build/solr-core/test/J0
[junit4:junit4]   2> 6920 T2894 oass.SolrDispatchFilter.init SolrDispatchFilter.init() done
[junit4:junit4]   2> 6920 T2894 oascsi.HttpClientUtil.createClient Creating new http client, config:maxConnections=128&maxConnectionsPerHost=32&followRedirects=false
[junit4:junit4]   2> 7098 T2894 oejs.Server.doStart jetty-8.1.8.v20121106
[junit4:junit4]   2> 7102 T2894 oejs.AbstractConnector.doStart Started SelectChannelConnector@127.0.0.1:52224
[junit4:junit4]   2> 7103 T2894 oass.SolrDispatchFilter.init SolrDispatchFilter.init()
[junit4:junit4]   2> 7104 T2894 oasc.SolrResourceLoader.locateSolrHome JNDI not configured for solr (NoInitialContextEx)
[junit4:junit4]   2> 7104 T2894 oasc.SolrResourceLoader.locateSolrHome using system property solr.solr.home: /Users/jenkins/jenkins-slave/workspace/Lucene-Solr-4.x-MacOSX/solr/build/solr-core/test/J0/./org.apache.solr.cloud.BasicDistributedZkTest-jetty2-1360812153787
[junit4:junit4]   2> 7105 T2894 oasc.CoreContainer$Initializer.initialize looking for solr.xml: /Users/jenkins/jenkins-slave/workspace/Lucene-Solr-4.x-MacOSX/solr/build/solr-core/test/J0/./org.apache.solr.cloud.BasicDistributedZkTest-jetty2-1360812153787/solr.xml
[junit4:junit4]   2> 7106 T2894 oasc.CoreContainer.<init> New CoreContainer 1939662068
[junit4:junit4]   2> 7106 T2894 oasc.CoreContainer.load Loading CoreContainer using Solr Home: '/Users/jenkins/jenkins-slave/workspace/Lucene-Solr-4.x-MacOSX/solr/build/solr-core/test/J0/./org.apache.solr.cloud.BasicDistributedZkTest-jetty2-1360812153787/'
[junit4:junit4]   2> 7107 T2894 oasc.SolrResourceLoader.<init> new SolrResourceLoader for directory: '/Users/jenkins/jenkins-slave/workspace/Lucene-Solr-4.x-MacOSX/solr/build/solr-core/test/J0/./org.apache.solr.cloud.BasicDistributedZkTest-jetty2-1360812153787/'
[junit4:junit4]   2> 7146 T2894 oashc.HttpShardHandlerFactory.getParameter Setting socketTimeout to: 60000
[junit4:junit4]   2> 7146 T2894 oashc.HttpShardHandlerFactory.getParameter Setting urlScheme to: http://
[junit4:junit4]   2> 7147 T2894 oashc.HttpShardHandlerFactory.getParameter Setting connTimeout to: 15000
[junit4:junit4]   2> 7147 T2894 oashc.HttpShardHandlerFactory.getParameter Setting maxConnectionsPerHost to: 20
[junit4:junit4]   2> 7148 T2894 oashc.HttpShardHandlerFactory.getParameter Setting corePoolSize to: 0
[junit4:junit4]   2> 7149 T2894 oashc.HttpShardHandlerFactory.getParameter Setting maximumPoolSize to: 2147483647
[junit4:junit4]   2> 7149 T2894 oashc.HttpShardHandlerFactory.getParameter Setting maxThreadIdleTime to: 5
[junit4:junit4]   2> 7150 T2894 oashc.HttpShardHandlerFactory.getParameter Setting sizeOfQueue to: -1
[junit4:junit4]   2> 7150 T2894 oashc.HttpShardHandlerFactory.getParameter Setting fairnessPolicy to: false
[junit4:junit4]   2> 7151 T2894 oascsi.HttpClientUtil.createClient Creating new http client, config:maxConnectionsPerHost=20&maxConnections=10000&socketTimeout=60000&connTimeout=15000&retry=false
[junit4:junit4]   2> 7164 T2894 oasc.CoreContainer.load Registering Log Listener
[junit4:junit4]   2> 7192 T2894 oasc.CoreContainer.initZooKeeper Zookeeper client=127.0.0.1:52214/solr
[junit4:junit4]   2> 7193 T2894 oasc.ZkController.checkChrootPath zkHost includes chroot
[junit4:junit4]   2> 7194 T2894 oaz.ZooKeeper.<init> Initiating client connection, connectString=127.0.0.1:52214 sessionTimeout=60000 watcher=org.apache.solr.common.cloud.ConnectionManager@5fdb67a
[junit4:junit4]   2> 7195 T2894 oascc.ConnectionManager.waitForConnected Waiting for client to connect to ZooKeeper
[junit4:junit4]   2> 7196 T2947 oaz.ClientCnxn$SendThread.logStartConnect Opening socket connection to server localhost/127.0.0.1:52214. Will not attempt to authenticate using SASL (access denied ("javax.security.auth.AuthPermission" "getLoginConfiguration"))
[junit4:junit4]   2> 7197 T2947 oaz.ClientCnxn$SendThread.primeConnection Socket connection established to localhost/127.0.0.1:52214, initiating session
[junit4:junit4]   2> 7197 T2896 oazs.NIOServerCnxnFactory.run Accepted socket connection from /127.0.0.1:52225
[junit4:junit4]   2> 7198 T2896 oazs.ZooKeeperServer.processConnectRequest Client attempting to establish new session at /127.0.0.1:52225
[junit4:junit4]   2> 7199 T2898 oazs.ZooKeeperServer.finishSessionInit Established session 0x13cd6b980c00007 with negotiated timeout 20000 for client /127.0.0.1:52225
[junit4:junit4]   2> 7199 T2947 oaz.ClientCnxn$SendThread.onConnected Session establishment complete on server localhost/127.0.0.1:52214, sessionid = 0x13cd6b980c00007, negotiated timeout = 20000
[junit4:junit4]   2> 7200 T2948 oascc.ConnectionManager.process Watcher org.apache.solr.common.cloud.ConnectionManager@5fdb67a name:ZooKeeperConnection Watcher:127.0.0.1:52214 got event WatchedEvent state:SyncConnected type:None path:null path:null type:None
[junit4:junit4]   2> 7200 T2894 oascc.ConnectionManager.waitForConnected Client is connected to ZooKeeper
[junit4:junit4]   2> 7203 T2899 oazs.PrepRequestProcessor.pRequest2Txn Processed session termination for sessionid: 0x13cd6b980c00007
[junit4:junit4]   2> 7204 T2896 oazs.NIOServerCnxn.closeSock Closed socket connection for client /127.0.0.1:52225 which had sessionid 0x13cd6b980c00007
[junit4:junit4]   2> 7204 T2894 oaz.ZooKeeper.close Session: 0x13cd6b980c00007 closed
[junit4:junit4]   2> 7204 T2948 oaz.ClientCnxn$EventThread.run EventThread shut down
[junit4:junit4]   2> 7205 T2894 oascsi.HttpClientUtil.createClient Creating new http client, config:maxConnections=500&maxConnectionsPerHost=16&socketTimeout=60000&connTimeout=15000
[junit4:junit4]   2> 7212 T2894 oaz.ZooKeeper.<init> Initiating client connection, connectString=127.0.0.1:52214/solr sessionTimeout=30000 watcher=org.apache.solr.common.cloud.ConnectionManager@38c27bc4
[junit4:junit4]   2> 7214 T2894 oascc.ConnectionManager.waitForConnected Waiting for client to connect to ZooKeeper
[junit4:junit4]   2> 7214 T2949 oaz.ClientCnxn$SendThread.logStartConnect Opening socket connection to server localhost/127.0.0.1:52214. Will not attempt to authenticate using SASL (access denied ("javax.security.auth.AuthPermission" "getLoginConfiguration"))
[junit4:junit4]   2> 7215 T2949 oaz.ClientCnxn$SendThread.primeConnection Socket connection established to localhost/127.0.0.1:52214, initiating session
[junit4:junit4]   2> 7215 T2896 oazs.NIOServerCnxnFactory.run Accepted socket connection from /127.0.0.1:52226
[junit4:junit4]   2> 7216 T2896 oazs.ZooKeeperServer.processConnectRequest Client attempting to establish new session at /127.0.0.1:52226
[junit4:junit4]   2> 7218 T2898 oazs.ZooKeeperServer.finishSessionInit Established session 0x13cd6b980c00008 with negotiated timeout 20000 for client /127.0.0.1:52226
[junit4:junit4]   2> 7218 T2949 oaz.ClientCnxn$SendThread.onConnected Session establishment complete on server localhost/127.0.0.1:52214, sessionid = 0x13cd6b980c00008, negotiated timeout = 20000
[junit4:junit4]   2> 7218 T2950 oascc.ConnectionManager.process Watcher org.apache.solr.common.cloud.ConnectionManager@38c27bc4 name:ZooKeeperConnection Watcher:127.0.0.1:52214/solr got event WatchedEvent state:SyncConnected type:None path:null path:null type:None
[junit4:junit4]   2> 7219 T2894 oascc.ConnectionManager.waitForConnected Client is connected to ZooKeeper
[junit4:junit4]   2> 7221 T2899 oazs.PrepRequestProcessor.pRequest Got user-level KeeperException when processing sessionid:0x13cd6b980c00008 type:create cxid:0x1 zxid:0x6c txntype:-1 reqpath:n/a Error Path:/solr/overseer Error:KeeperErrorCode = NodeExists for /solr/overseer
[junit4:junit4]   2> 7222 T2899 oazs.PrepRequestProcessor.pRequest Got user-level KeeperException when processing sessionid:0x13cd6b980c00008 type:create cxid:0x2 zxid:0x6d txntype:-1 reqpath:n/a Error Path:/solr/overseer Error:KeeperErrorCode = NodeExists for /solr/overseer
[junit4:junit4]   2> 7225 T2894 oascc.ZkStateReader.createClusterStateWatchersAndUpdate Updating cluster state from ZooKeeper... 
[junit4:junit4]   2> 7229 T2894 oasc.ZkController.createEphemeralLiveNode Register node as live in ZooKeeper:/live_nodes/127.0.0.1:52224_jszv%2Fb
[junit4:junit4]   2> 7230 T2899 oazs.PrepRequestProcessor.pRequest Got user-level KeeperException when processing sessionid:0x13cd6b980c00008 type:delete cxid:0x9 zxid:0x6e txntype:-1 reqpath:n/a Error Path:/solr/live_nodes/127.0.0.1:52224_jszv%2Fb Error:KeeperErrorCode = NoNode for /solr/live_nodes/127.0.0.1:52224_jszv%2Fb
[junit4:junit4]   2> 7231 T2894 oascc.SolrZkClient.makePath makePath: /live_nodes/127.0.0.1:52224_jszv%2Fb
[junit4:junit4]   2> 7236 T2916 oascc.ZkStateReader$2.process A cluster state change: WatchedEvent state:SyncConnected type:NodeChildrenChanged path:/live_nodes, has occurred - updating... (live nodes size: 2)
[junit4:junit4]   2> 7237 T2922 oascc.ZkStateReader$3.process Updating live nodes... (3)
[junit4:junit4]   2> 7237 T2950 oascc.ZkStateReader$3.process Updating live nodes... (3)
[junit4:junit4]   2> 7238 T2935 oascc.ZkStateReader$3.process Updating live nodes... (3)
[junit4:junit4]   2> 7238 T2935 oascc.ZkStateReader$2.process A cluster state change: WatchedEvent state:SyncConnected type:NodeChildrenChanged path:/live_nodes, has occurred - updating... (live nodes size: 3)
[junit4:junit4]   2> 7237 T2922 oascc.ZkStateReader$2.process A cluster state change: WatchedEvent state:SyncConnected type:NodeChildrenChanged path:/live_nodes, has occurred - updating... (live nodes size: 3)
[junit4:junit4]   2> 7240 T2916 oascc.ZkStateReader$3.process Updating live nodes... (3)
[junit4:junit4]   2> 7249 T2951 oasc.CoreContainer.create Creating SolrCore 'collection1' using instanceDir: /Users/jenkins/jenkins-slave/workspace/Lucene-Solr-4.x-MacOSX/solr/build/solr-core/test/J0/./org.apache.solr.cloud.BasicDistributedZkTest-jetty2-1360812153787/collection1
[junit4:junit4]   2> 7249 T2951 oasc.ZkController.createCollectionZkNode Check for collection zkNode:collection1
[junit4:junit4]   2> 7250 T2951 oasc.ZkController.createCollectionZkNode Collection zkNode exists
[junit4:junit4]   2> 7251 T2951 oasc.ZkController.readConfigName Load collection config from:/collections/collection1
[junit4:junit4]   2> 7253 T2951 oasc.SolrResourceLoader.<init> new SolrResourceLoader for directory: '/Users/jenkins/jenkins-slave/workspace/Lucene-Solr-4.x-MacOSX/solr/build/solr-core/test/J0/./org.apache.solr.cloud.BasicDistributedZkTest-jetty2-1360812153787/collection1/'
[junit4:junit4]   2> 7254 T2951 oasc.SolrResourceLoader.replaceClassLoader Adding 'file:/Users/jenkins/jenkins-slave/workspace/Lucene-Solr-4.x-MacOSX/solr/build/solr-core/test/J0/org.apache.solr.cloud.BasicDistributedZkTest-jetty2-1360812153787/collection1/lib/classes/' to classloader
[junit4:junit4]   2> 7254 T2951 oasc.SolrResourceLoader.replaceClassLoader Adding 'file:/Users/jenkins/jenkins-slave/workspace/Lucene-Solr-4.x-MacOSX/solr/build/solr-core/test/J0/org.apache.solr.cloud.BasicDistributedZkTest-jetty2-1360812153787/collection1/lib/README' to classloader
[junit4:junit4]   2> 7308 T2951 oasc.SolrConfig.<init> Using Lucene MatchVersion: LUCENE_42
[junit4:junit4]   2> 7389 T2951 oasc.SolrConfig.<init> Loaded SolrConfig: solrconfig.xml
[junit4:junit4]   2> 7390 T2951 oass.IndexSchema.readSchema Reading Solr Schema
[junit4:junit4]   2> 7397 T2951 oass.IndexSchema.readSchema Schema name=test
[junit4:junit4]   2> 8105 T2951 oass.OpenExchangeRatesOrgProvider.init Initialized with rates=open-exchange-rates.json, refreshInterval=1440.
[junit4:junit4]   2> 8114 T2951 oass.IndexSchema.readSchema default search field in schema is text
[junit4:junit4]   2> 8118 T2951 oass.IndexSchema.readSchema unique key field: id
[junit4:junit4]   2> 8140 T2951 oass.FileExchangeRateProvider.reload Reloading exchange rates from file currency.xml
[junit4:junit4]   2> 8146 T2951 oass.FileExchangeRateProvider.reload Reloading exchange rates from file currency.xml
[junit4:junit4]   2> 8154 T2951 oass.OpenExchangeRatesOrgProvider.reload Reloading exchange rates from open-exchange-rates.json
[junit4:junit4]   2> 8156 T2951 oass.OpenExchangeRatesOrgProvider.reload Reloading exchange rates from open-exchange-rates.json
[junit4:junit4]   2> 8158 T2951 oasc.SolrCore.<init> [collection1] Opening new SolrCore at /Users/jenkins/jenkins-slave/workspace/Lucene-Solr-4.x-MacOSX/solr/build/solr-core/test/J0/./org.apache.solr.cloud.BasicDistributedZkTest-jetty2-1360812153787/collection1/, dataDir=./org.apache.solr.cloud.BasicDistributedZkTest-1360812146869/jetty2/
[junit4:junit4]   2> 8159 T2951 oasc.JmxMonitoredMap.<init> JMX monitoring is enabled. Adding Solr mbeans to JMX Server: com.sun.jmx.mbeanserver.JmxMBeanServer@262adc9a
[junit4:junit4]   2> 8159 T2951 oasc.SolrCore.initDirectoryFactory solr.NRTCachingDirectoryFactory
[junit4:junit4]   2> 8160 T2951 oasc.CachingDirectoryFactory.get return new directory for /Users/jenkins/jenkins-slave/workspace/Lucene-Solr-4.x-MacOSX/solr/build/solr-core/test/J0/./org.apache.solr.cloud.BasicDistributedZkTest-1360812146869/jetty2 forceNew:false
[junit4:junit4]   2> 8161 T2951 oasc.CachingDirectoryFactory.close Releasing directory:/Users/jenkins/jenkins-slave/workspace/Lucene-Solr-4.x-MacOSX/solr/build/solr-core/test/J0/./org.apache.solr.cloud.BasicDistributedZkTest-1360812146869/jetty2
[junit4:junit4]   2> 8161 T2951 oasc.SolrCore.getNewIndexDir New index directory detected: old=null new=./org.apache.solr.cloud.BasicDistributedZkTest-1360812146869/jetty2/index/
[junit4:junit4]   2> 8162 T2951 oasc.SolrCore.initIndex WARNING [collection1] Solr index directory './org.apache.solr.cloud.BasicDistributedZkTest-1360812146869/jetty2/index' doesn't exist. Creating new index...
[junit4:junit4]   2> 8163 T2951 oasc.CachingDirectoryFactory.get return new directory for /Users/jenkins/jenkins-slave/workspace/Lucene-Solr-4.x-MacOSX/solr/build/solr-core/test/J0/./org.apache.solr.cloud.BasicDistributedZkTest-1360812146869/jetty2/index forceNew:false
[junit4:junit4]   2> 8167 T2951 oasc.SolrDeletionPolicy.onCommit SolrDeletionPolicy.onCommit: commits:num=1
[junit4:junit4]   2> 		commit{dir=RateLimitedDirectoryWrapper(NRTCachingDirectory(org.apache.lucene.store.NIOFSDirectory@/Users/jenkins/jenkins-slave/workspace/Lucene-Solr-4.x-MacOSX/solr/build/solr-core/test/J0/org.apache.solr.cloud.BasicDistributedZkTest-1360812146869/jetty2/index lockFactory=org.apache.lucene.store.NativeFSLockFactory@2fbf971e; maxCacheMB=48.0 maxMergeSizeMB=4.0)),segFN=segments_1,generation=1,filenames=[segments_1]
[junit4:junit4]   2> 8168 T2951 oasc.SolrDeletionPolicy.updateCommits newest commit = 1[segments_1]
[junit4:junit4]   2> 8169 T2951 oasc.CachingDirectoryFactory.close Releasing directory:/Users/jenkins/jenkins-slave/workspace/Lucene-Solr-4.x-MacOSX/solr/build/solr-core/test/J0/./org.apache.solr.cloud.BasicDistributedZkTest-1360812146869/jetty2/index
[junit4:junit4]   2> 8169 T2951 oasc.SolrCore.initWriters created xml: solr.XMLResponseWriter
[junit4:junit4]   2> 8172 T2951 oasup.UpdateRequestProcessorChain.init inserting DistributedUpdateProcessorFactory into updateRequestProcessorChain "dedupe"
[junit4:junit4]   2> 8172 T2951 oasup.UpdateRequestProcessorChain.init inserting DistributedUpdateProcessorFactory into updateRequestProcessorChain "dedupe-allfields"
[junit4:junit4]   2> 8173 T2951 oasup.UpdateRequestProcessorChain.init inserting DistributedUpdateProcessorFactory into updateRequestProcessorChain "stored_sig"
[junit4:junit4]   2> 8173 T2951 oasup.UpdateRequestProcessorChain.init inserting DistributedUpdateProcessorFactory into updateRequestProcessorChain "uniq-fields"
[junit4:junit4]   2> 8174 T2951 oasup.UpdateRequestProcessorChain.init inserting DistributedUpdateProcessorFactory into updateRequestProcessorChain "distrib-dup-test-chain-implicit"
[junit4:junit4]   2> 8174 T2951 oasc.RequestHandlers.initHandlersFromConfig adding lazy requestHandler: solr.ReplicationHandler
[junit4:junit4]   2> 8175 T2951 oasc.RequestHandlers.initHandlersFromConfig created /replication: solr.ReplicationHandler
[junit4:junit4]   2> 8176 T2951 oasc.RequestHandlers.initHandlersFromConfig created standard: solr.StandardRequestHandler
[junit4:junit4]   2> 8176 T2951 oasc.RequestHandlers.initHandlersFromConfig created /get: solr.RealTimeGetHandler
[junit4:junit4]   2> 8177 T2951 oasc.RequestHandlers.initHandlersFromConfig created dismax: solr.SearchHandler
[junit4:junit4]   2> 8178 T2951 oasc.RequestHandlers.initHandlersFromConfig created mock: org.apache.solr.core.MockQuerySenderListenerReqHandler
[junit4:junit4]   2> 8179 T2951 oasc.RequestHandlers.initHandlersFromConfig created /admin/: org.apache.solr.handler.admin.AdminHandlers
[junit4:junit4]   2> 8179 T2951 oasc.RequestHandlers.initHandlersFromConfig created defaults: solr.StandardRequestHandler
[junit4:junit4]   2> 8180 T2951 oasc.RequestHandlers.initHandlersFromConfig adding lazy requestHandler: solr.StandardRequestHandler
[junit4:junit4]   2> 8180 T2951 oasc.RequestHandlers.initHandlersFromConfig created lazy: solr.StandardRequestHandler
[junit4:junit4]   2> 8181 T2951 oasc.RequestHandlers.initHandlersFromConfig created /update: solr.UpdateRequestHandler
[junit4:junit4]   2> 8181 T2951 oasc.RequestHandlers.initHandlersFromConfig created /terms: org.apache.solr.handler.component.SearchHandler
[junit4:junit4]   2> 8182 T2951 oasc.RequestHandlers.initHandlersFromConfig created spellCheckCompRH: org.apache.solr.handler.component.SearchHandler
[junit4:junit4]   2> 8183 T2951 oasc.RequestHandlers.initHandlersFromConfig created spellCheckCompRH_Direct: org.apache.solr.handler.component.SearchHandler
[junit4:junit4]   2> 8184 T2951 oasc.RequestHandlers.initHandlersFromConfig created spellCheckWithWordbreak: org.apache.solr.handler.component.SearchHandler
[junit4:junit4]   2> 8185 T2951 oasc.RequestHandlers.initHandlersFromConfig created spellCheckWithWordbreak_Direct: org.apache.solr.handler.component.SearchHandler
[junit4:junit4]   2> 8185 T2951 oasc.RequestHandlers.initHandlersFromConfig created spellCheckCompRH1: org.apache.solr.handler.component.SearchHandler
[junit4:junit4]   2> 8186 T2951 oasc.RequestHandlers.initHandlersFromConfig created mltrh: org.apache.solr.handler.component.SearchHandler
[junit4:junit4]   2> 8187 T2951 oasc.RequestHandlers.initHandlersFromConfig created tvrh: org.apache.solr.handler.component.SearchHandler
[junit4:junit4]   2> 8187 T2951 oasc.RequestHandlers.initHandlersFromConfig created /mlt: solr.MoreLikeThisHandler
[junit4:junit4]   2> 8188 T2951 oasc.RequestHandlers.initHandlersFromConfig created /debug/dump: solr.DumpRequestHandler
[junit4:junit4]   2> 8194 T2951 oashl.XMLLoader.init xsltCacheLifetimeSeconds=60
[junit4:junit4]   2> 8198 T2951 oasc.SolrCore.initDeprecatedSupport WARNING solrconfig.xml uses deprecated <admin/gettableFiles>, Please update your config to use the ShowFileRequestHandler.
[junit4:junit4]   2> 8199 T2951 oasc.SolrCore.initDeprecatedSupport WARNING adding ShowFileRequestHandler with hidden files: [SCHEMA.XML, OLD_SYNONYMS.TXT, STOPWORDS.TXT, PROTWORDS.TXT, OPEN-EXCHANGE-RATES.JSON, SYNONYMS.TXT, CURRENCY.XML, MAPPING-ISOLATIN1ACCENT.TXT]
[junit4:junit4]   2> 8202 T2951 oasc.CachingDirectoryFactory.close Releasing directory:/Users/jenkins/jenkins-slave/workspace/Lucene-Solr-4.x-MacOSX/solr/build/solr-core/test/J0/./org.apache.solr.cloud.BasicDistributedZkTest-1360812146869/jetty2
[junit4:junit4]   2> 8203 T2951 oass.SolrIndexSearcher.<init> Opening Searcher@18b46bac main
[junit4:junit4]   2> 8204 T2951 oasu.CommitTracker.<init> Hard AutoCommit: disabled
[junit4:junit4]   2> 8204 T2951 oasu.CommitTracker.<init> Soft AutoCommit: disabled
[junit4:junit4]   2> 8205 T2951 oashc.SpellCheckComponent.inform Initializing spell checkers
[junit4:junit4]   2> 8211 T2951 oass.DirectSolrSpellChecker.init init: {name=direct,classname=DirectSolrSpellChecker,field=lowerfilt,minQueryLength=3}
[junit4:junit4]   2> 8243 T2952 oasc.SolrCore.registerSearcher [collection1] Registered new searcher Searcher@18b46bac main{StandardDirectoryReader(segments_1:1)}
[junit4:junit4]   2> 8251 T2951 oasc.ZkController.publish publishing core=collection1 state=down
[junit4:junit4]   2> 8251 T2951 oasc.ZkController.publish numShards not found on descriptor - reading it from system property
[junit4:junit4]   2> 8376 T2917 oascc.ZkStateReader.updateClusterState Updating cloud state from ZooKeeper... 
[junit4:junit4]   2> 8378 T2917 oasc.Overseer$ClusterStateUpdater.updateState Update state numShards=2 message={
[junit4:junit4]   2> 	  "operation":"state",
[junit4:junit4]   2> 	  "numShards":"2",
[junit4:junit4]   2> 	  "shard":"shard1",
[junit4:junit4]   2> 	  "roles":null,
[junit4:junit4]   2> 	  "state":"active",
[junit4:junit4]   2> 	  "core":"collection1",
[junit4:junit4]   2> 	  "collection":"collection1",
[junit4:junit4]   2> 	  "node_name":"127.0.0.1:52221_jszv%2Fb",
[junit4:junit4]   2> 	  "base_url":"http://127.0.0.1:52221/jszv/b"}
[junit4:junit4]   2> 8384 T2917 oasc.Overseer$ClusterStateUpdater.updateState Update state numShards=2 message={
[junit4:junit4]   2> 	  "operation":"state",
[junit4:junit4]   2> 	  "numShards":"2",
[junit4:junit4]   2> 	  "shard":null,
[junit4:junit4]   2> 	  "roles":null,
[junit4:junit4]   2> 	  "state":"down",
[junit4:junit4]   2> 	  "core":"collection1",
[junit4:junit4]   2> 	  "collection":"collection1",
[junit4:junit4]   2> 	  "node_name":"127.0.0.1:52224_jszv%2Fb",
[junit4:junit4]   2> 	  "base_url":"http://127.0.0.1:52224/jszv/b"}
[junit4:junit4]   2> 8384 T2917 oasc.Overseer$ClusterStateUpdater.updateState Collection already exists with numShards=2
[junit4:junit4]   2> 8384 T2917 oasc.Overseer$ClusterStateUpdater.updateState Assigning new node to shard shard=shard2
[junit4:junit4]   2> 8391 T2950 oascc.ZkStateReader$2.process A cluster state change: WatchedEvent state:SyncConnected type:NodeDataChanged path:/clusterstate.json, has occurred - updating... (live nodes size: 3)
[junit4:junit4]   2> 8391 T2922 oascc.ZkStateReader$2.process A cluster state change: WatchedEvent state:SyncConnected type:NodeDataChanged path:/clusterstate.json, has occurred - updating... (live nodes size: 3)
[junit4:junit4]   2> 8392 T2916 oascc.ZkStateReader$2.process A cluster state change: WatchedEvent state:SyncConnected type:NodeDataChanged path:/clusterstate.json, has occurred - updating... (live nodes size: 3)
[junit4:junit4]   2> 8393 T2935 oascc.ZkStateReader$2.process A cluster state change: WatchedEvent state:SyncConnected type:NodeDataChanged path:/clusterstate.json, has occurred - updating... (live nodes size: 3)
[junit4:junit4]   2> 9254 T2951 oasc.CoreContainer.registerCore registering core: collection1
[junit4:junit4]   2> 9254 T2951 oasc.ZkController.register Register replica - core:collection1 address:http://127.0.0.1:52224/jszv/b collection:collection1 shard:shard2
[junit4:junit4]   2> 9256 T2951 oascc.SolrZkClient.makePath makePath: /collections/collection1/leader_elect/shard2/election
[junit4:junit4]   2> 9267 T2899 oazs.PrepRequestProcessor.pRequest Got user-level KeeperException when processing sessionid:0x13cd6b980c00008 type:delete cxid:0x44 zxid:0x7c txntype:-1 reqpath:n/a Error Path:/solr/collections/collection1/leaders/shard2 Error:KeeperErrorCode = NoNode for /solr/collections/collection1/leaders/shard2
[junit4:junit4]   2> 9268 T2951 oasc.ShardLeaderElectionContext.runLeaderProcess Running the leader process.
[junit4:junit4]   2> 9269 T2899 oazs.PrepRequestProcessor.pRequest Got user-level KeeperException when processing sessionid:0x13cd6b980c00008 type:create cxid:0x45 zxid:0x7d txntype:-1 reqpath:n/a Error Path:/solr/overseer Error:KeeperErrorCode = NodeExists for /solr/overseer
[junit4:junit4]   2> 9272 T2951 oasc.ShardLeaderElectionContext.waitForReplicasToComeUp Enough replicas found to continue.
[junit4:junit4]   2> 9273 T2951 oasc.ShardLeaderElectionContext.runLeaderProcess I may be the new leader - try and sync
[junit4:junit4]   2> 9273 T2951 oasc.SyncStrategy.sync Sync replicas to http://127.0.0.1:52224/jszv/b/collection1/
[junit4:junit4]   2> 9273 T2951 oasc.SyncStrategy.syncReplicas Sync Success - now sync replicas to me
[junit4:junit4]   2> 9273 T2951 oasc.SyncStrategy.syncToMe http://127.0.0.1:52224/jszv/b/collection1/ has no replicas
[junit4:junit4]   2> 9274 T2951 oasc.ShardLeaderElectionContext.runLeaderProcess I am the new leader: http://127.0.0.1:52224/jszv/b/collection1/
[junit4:junit4]   2> 9274 T2951 oascc.SolrZkClient.makePath makePath: /collections/collection1/leaders/shard2
[junit4:junit4]   2> 9280 T2899 oazs.PrepRequestProcessor.pRequest Got user-level KeeperException when processing sessionid:0x13cd6b980c00008 type:create cxid:0x4e zxid:0x80 txntype:-1 reqpath:n/a Error Path:/solr/overseer Error:KeeperErrorCode = NodeExists for /solr/overseer
[junit4:junit4]   2> 9906 T2917 oascc.ZkStateReader.updateClusterState Updating cloud state from ZooKeeper... 
[junit4:junit4]   2> 9923 T2950 oascc.ZkStateReader$2.process A cluster state change: WatchedEvent state:SyncConnected type:NodeDataChanged path:/clusterstate.json, has occurred - updating... (live nodes size: 3)
[junit4:junit4]   2> 9923 T2916 oascc.ZkStateReader$2.process A cluster state change: WatchedEvent state:SyncConnected type:NodeDataChanged path:/clusterstate.json, has occurred - updating... (live nodes size: 3)
[junit4:junit4]   2> 9923 T2935 oascc.ZkStateReader$2.process A cluster state change: WatchedEvent state:SyncConnected type:NodeDataChanged path:/clusterstate.json, has occurred - updating... (live nodes size: 3)
[junit4:junit4]   2> 9923 T2922 oascc.ZkStateReader$2.process A cluster state change: WatchedEvent state:SyncConnected type:NodeDataChanged path:/clusterstate.json, has occurred - updating... (live nodes size: 3)
[junit4:junit4]   2> 9948 T2951 oasc.ZkController.register We are http://127.0.0.1:52224/jszv/b/collection1/ and leader is http://127.0.0.1:52224/jszv/b/collection1/
[junit4:junit4]   2> 9949 T2951 oasc.ZkController.register No LogReplay needed for core=collection1 baseURL=http://127.0.0.1:52224/jszv/b
[junit4:junit4]   2> 9949 T2951 oasc.ZkController.checkRecovery I am the leader, no recovery necessary
[junit4:junit4]   2> 9949 T2951 oasc.ZkController.publish publishing core=collection1 state=active
[junit4:junit4]   2> 9950 T2951 oasc.ZkController.publish numShards not found on descriptor - reading it from system property
[junit4:junit4]   2> 9953 T2951 oascc.ZkStateReader.updateClusterState Updating cloud state from ZooKeeper... 
[junit4:junit4]   2> 9955 T2894 oass.SolrDispatchFilter.init user.dir=/Users/jenkins/jenkins-slave/workspace/Lucene-Solr-4.x-MacOSX/solr/build/solr-core/test/J0
[junit4:junit4]   2> 9956 T2894 oass.SolrDispatchFilter.init SolrDispatchFilter.init() done
[junit4:junit4]   2> 9956 T2894 oascsi.HttpClientUtil.createClient Creating new http client, config:maxConnections=128&maxConnectionsPerHost=32&followRedirects=false
[junit4:junit4]   2> 10162 T2894 oejs.Server.doStart jetty-8.1.8.v20121106
[junit4:junit4]   2> 10166 T2894 oejs.AbstractConnector.doStart Started SelectChannelConnector@127.0.0.1:52227
[junit4:junit4]   2> 10168 T2894 oass.SolrDispatchFilter.init SolrDispatchFilter.init()
[junit4:junit4]   2> 10168 T2894 oasc.SolrResourceLoader.locateSolrHome JNDI not configured for solr (NoInitialContextEx)
[junit4:junit4]   2> 10169 T2894 oasc.SolrResourceLoader.locateSolrHome using system property solr.solr.home: /Users/jenkins/jenkins-slave/workspace/Lucene-Solr-4.x-MacOSX/solr/build/solr-core/test/J0/./org.apache.solr.cloud.BasicDistributedZkTest-jetty3-1360812156825
[junit4:junit4]   2> 10169 T2894 oasc.CoreContainer$Initializer.initialize looking for solr.xml: /Users/jenkins/jenkins-slave/workspace/Lucene-Solr-4.x-MacOSX/solr/build/solr-core/test/J0/./org.apache.solr.cloud.BasicDistributedZkTest-jetty3-1360812156825/solr.xml
[junit4:junit4]   2> 10170 T2894 oasc.CoreContainer.<init> New CoreContainer 273145857
[junit4:junit4]   2> 10171 T2894 oasc.CoreContainer.load Loading CoreContainer using Solr Home: '/Users/jenkins/jenkins-slave/workspace/Lucene-Solr-4.x-MacOSX/solr/build/solr-core/test/J0/./org.apache.solr.cloud.BasicDistributedZkTest-jetty3-1360812156825/'
[junit4:junit4]   2> 10171 T2894 oasc.SolrResourceLoader.<init> new SolrResourceLoader for directory: '/Users/jenkins/jenkins-slave/workspace/Lucene-Solr-4.x-MacOSX/solr/build/solr-core/test/J0/./org.apache.solr.cloud.BasicDistributedZkTest-jetty3-1360812156825/'
[junit4:junit4]   2> 10214 T2894 oashc.HttpShardHandlerFactory.getParameter Setting socketTimeout to: 60000
[junit4:junit4]   2> 10215 T2894 oashc.HttpShardHandlerFactory.getParameter Setting urlScheme to: http://
[junit4:junit4]   2> 10216 T2894 oashc.HttpShardHandlerFactory.getParameter Setting connTimeout to: 15000
[junit4:junit4]   2> 10216 T2894 oashc.HttpShardHandlerFactory.getParameter Setting maxConnectionsPerHost to: 20
[junit4:junit4]   2> 10217 T2894 oashc.HttpShardHandlerFactory.getParameter Setting corePoolSize to: 0
[junit4:junit4]   2> 10218 T2894 oashc.HttpShardHandlerFactory.getParameter Setting maximumPoolSize to: 2147483647
[junit4:junit4]   2> 10218 T2894 oashc.HttpShardHandlerFactory.getParameter Setting maxThreadIdleTime to: 5
[junit4:junit4]   2> 10219 T2894 oashc.HttpShardHandlerFactory.getParameter Setting sizeOfQueue to: -1
[junit4:junit4]   2> 10219 T2894 oashc.HttpShardHandlerFactory.getParameter Setting fairnessPolicy to: false
[junit4:junit4]   2> 10220 T2894 oascsi.HttpClientUtil.createClient Creating new http client, config:maxConnectionsPerHost=20&maxConnections=10000&socketTimeout=60000&connTimeout=15000&retry=false
[junit4:junit4]   2> 10234 T2894 oasc.CoreContainer.load Registering Log Listener
[junit4:junit4]   2> 10266 T2894 oasc.CoreContainer.initZooKeeper Zookeeper client=127.0.0.1:52214/solr
[junit4:junit4]   2> 10267 T2894 oasc.ZkController.checkChrootPath zkHost includes chroot
[junit4:junit4]   2> 10268 T2894 oaz.ZooKeeper.<init> Initiating client connection, connectString=127.0.0.1:52214 sessionTimeout=60000 watcher=org.apache.solr.common.cloud.ConnectionManager@419ecae4
[junit4:junit4]   2> 10269 T2894 oascc.ConnectionManager.waitForConnected Waiting for client to connect to ZooKeeper
[junit4:junit4]   2> 10269 T2962 oaz.ClientCnxn$SendThread.logStartConnect Opening socket connection to server localhost/127.0.0.1:52214. Will not attempt to authenticate using SASL (access denied ("javax.security.auth.AuthPermission" "getLoginConfiguration"))
[junit4:junit4]   2> 10271 T2962 oaz.ClientCnxn$SendThread.primeConnection Socket connection established to localhost/127.0.0.1:52214, initiating session
[junit4:junit4]   2> 10271 T2896 oazs.NIOServerCnxnFactory.run Accepted socket connection from /127.0.0.1:52228
[junit4:junit4]   2> 10272 T2896 oazs.ZooKeeperServer.processConnectRequest Client attempting to establish new session at /127.0.0.1:52228
[junit4:junit4]   2> 10273 T2898 oazs.ZooKeeperServer.finishSessionInit Established session 0x13cd6b980c00009 with negotiated timeout 20000 for client /127.0.0.1:52228
[junit4:junit4]   2> 10273 T2962 oaz.ClientCnxn$SendThread.onConnected Session establishment complete on server localhost/127.0.0.1:52214, sessionid = 0x13cd6b980c00009, negotiated timeout = 20000
[junit4:junit4]   2> 10274 T2963 oascc.ConnectionManager.process Watcher org.apache.solr.common.cloud.ConnectionManager@419ecae4 name:ZooKeeperConnection Watcher:127.0.0.1:52214 got event WatchedEvent state:SyncConnected type:None path:null path:null type:None
[junit4:junit4]   2> 10274 T2894 oascc.ConnectionManager.waitForConnected Client is connected to ZooKeeper
[junit4:junit4]   2> 10277 T2899 oazs.PrepRequestProcessor.pRequest2Txn Processed session termination for sessionid: 0x13cd6b980c00009
[junit4:junit4]   2> 10279 T2896 oazs.NIOServerCnxn.closeSock Closed socket connection for client /127.0.0.1:52228 which had sessionid 0x13cd6b980c00009
[junit4:junit4]   2> 10279 T2963 oaz.ClientCnxn$EventThread.run EventThread shut down
[junit4:junit4]   2> 10279 T2894 oaz.ZooKeeper.close Session: 0x13cd6b980c00009 closed
[junit4:junit4]   2> 10281 T2894 oascsi.HttpClientUtil.createClient Creating new http client, config:maxConnections=500&maxConnectionsPerHost=16&socketTimeout=60000&connTimeout=15000
[junit4:junit4]   2> 10287 T2894 oaz.ZooKeeper.<init> Initiating client connection, connectString=127.0.0.1:52214/solr sessionTimeout=30000 watcher=org.apache.solr.common.cloud.ConnectionManager@7034ee53
[junit4:junit4]   2> 10288 T2894 oascc.ConnectionManager.waitForConnected Waiting for client to connect to ZooKeeper
[junit4:junit4]   2> 10289 T2964 oaz.ClientCnxn$SendThread.logStartConnect Opening socket connection to server localhost/127.0.0.1:52214. Will not attempt to authenticate using SASL (access denied ("javax.security.auth.AuthPermission" "getLoginConfiguration"))
[junit4:junit4]   2> 10290 T2964 oaz.ClientCnxn$SendThread.primeConnection Socket connection established to localhost/127.0.0.1:52214, initiating session
[junit4:junit4]   2> 10290 T2896 oazs.NIOServerCnxnFactory.run Accepted socket connection from /127.0.0.1:52229
[junit4:junit4]   2> 10291 T2896 oazs.ZooKeeperServer.processConnectRequest Client attempting to establish new session at /127.0.0.1:52229
[junit4:junit4]   2> 10293 T2898 oazs.ZooKeeperServer.finishSessionInit Established session 0x13cd6b980c0000a with negotiated timeout 20000 for client /127.0.0.1:52229
[junit4:junit4]   2> 10293 T2964 oaz.ClientCnxn$SendThread.onConnected Session establishment complete on server localhost/127.0.0.1:52214, sessionid = 0x13cd6b980c0000a, negotiated timeout = 20000
[junit4:junit4]   2> 10293 T2965 oascc.ConnectionManager.process Watcher org.apache.solr.common.cloud.ConnectionManager@7034ee53 name:ZooKeeperConnection Watcher:127.0.0.1:52214/solr got event WatchedEvent state:SyncConnected type:None path:null path:null type:None
[junit4:junit4]   2> 10294 T2894 oascc.ConnectionManager.waitForConnected Client is connected to ZooKeeper
[junit4:junit4]   2> 10296 T2899 oazs.PrepRequestProcessor.pRequest Got user-level KeeperException when processing sessionid:0x13cd6b980c0000a type:create cxid:0x1 zxid:0x8d txntype:-1 reqpath:n/a Error Path:/solr/overseer Error:KeeperErrorCode = NodeExists for /solr/overseer
[junit4:junit4]   2> 10298 T2899 oazs.PrepRequestProcessor.pRequest Got user-level KeeperException when processing sessionid:0x13cd6b980c0000a type:create cxid:0x2 zxid:0x8e txntype:-1 reqpath:n/a Error Path:/solr/overseer Error:KeeperErrorCode = NodeExists for /solr/overseer
[junit4:junit4]   2> 10300 T2894 oascc.ZkStateReader.createClusterStateWatchersAndUpdate Updating cluster state from ZooKeeper... 
[junit4:junit4]   2> 10305 T2894 oasc.ZkController.createEphemeralLiveNode Register node as live in ZooKeeper:/live_nodes/127.0.0.1:52227_jszv%2Fb
[junit4:junit4]   2> 10306 T2899 oazs.PrepRequestProcessor.pRequest Got user-level KeeperException when processing sessionid:0x13cd6b980c0000a type:delete cxid:0x9 zxid:0x8f txntype:-1 reqpath:n/a Error Path:/solr/live_nodes/127.0.0.1:52227_jszv%2Fb Error:KeeperErrorCode = NoNode for /solr/live_nodes/127.0.0.1:52227_jszv%2Fb
[junit4:junit4]   2> 10308 T2894 oascc.SolrZkClient.makePath makePath: /live_nodes/127.0.0.1:52227_jszv%2Fb
[junit4:junit4]   2> 10314 T2916 oascc.ZkStateReader$2.process A cluster state change: WatchedEvent state:SyncConnected type:NodeChildrenChanged path:/live_nodes, has occurred - updating... (live nodes size: 3)
[junit4:junit4]   2> 10315 T2965 oascc.ZkStateReader$3.process Updating live nodes... (4)
[junit4:junit4]   2> 10315 T2950 oascc.ZkStateReader$3.process Updating live nodes... (4)
[junit4:junit4]   2> 10315 T2950 oascc.ZkStateReader$2.process A cluster state change: WatchedEvent state:SyncConnected type:NodeChildrenChanged path:/live_nodes, has occurred - updating... (live nodes size: 4)
[junit4:junit4]   2> 10315 T2922 oascc.ZkStateReader$3.process Updating live nodes... (4)
[junit4:junit4]   2> 10316 T2922 oascc.ZkStateReader$2.process A cluster state change: WatchedEvent state:SyncConnected type:NodeChildrenChanged path:/live_nodes, has occurred - updating... (live nodes size: 4)
[junit4:junit4]   2> 10316 T2935 oascc.ZkStateReader$3.process Updating live nodes... (4)
[junit4:junit4]   2> 10316 T2935 oascc.ZkStateReader$2.process A cluster state change: WatchedEvent state:SyncConnected type:NodeChildrenChanged path:/live_nodes, has occurred - updating... (live nodes size: 4)
[junit4:junit4]   2> 10320 T2916 oascc.ZkStateReader$3.process Updating live nodes... (4)
[junit4:junit4]   2> 10334 T2966 oasc.CoreContainer.create Creating SolrCore 'collection1' using instanceDir: /Users/jenkins/jenkins-slave/workspace/Lucene-Solr-4.x-MacOSX/solr/build/solr-core/test/J0/./org.apache.solr.cloud.BasicDistributedZkTest-jetty3-1360812156825/collection1
[junit4:junit4]   2> 10334 T2966 oasc.ZkController.createCollectionZkNode Check for collection zkNode:collection1
[junit4:junit4]   2> 10337 T2966 oasc.ZkController.createCollectionZkNode Collection zkNode exists
[junit4:junit4]   2> 10337 T2966 oasc.ZkController.readConfigName Load collection config from:/collections/collection1
[junit4:junit4]   2> 10340 T2966 oasc.SolrResourceLoader.<init> new SolrResourceLoader for directory: '/Users/jenkins/jenkins-slave/workspace/Lucene-Solr-4.x-MacOSX/solr/build/solr-core/test/J0/./org.apache.solr.cloud.BasicDistributedZkTest-jetty3-1360812156825/collection1/'
[junit4:junit4]   2> 10341 T2966 oasc.SolrResourceLoader.replaceClassLoader Adding 'file:/Users/jenkins/jenkins-slave/workspace/Lucene-Solr-4.x-MacOSX/solr/build/solr-core/test/J0/org.apache.solr.cloud.BasicDistributedZkTest-jetty3-1360812156825/collection1/lib/classes/' to classloader
[junit4:junit4]   2> 10341 T2966 oasc.SolrResourceLoader.replaceClassLoader Adding 'file:/Users/jenkins/jenkins-slave/workspace/Lucene-Solr-4.x-MacOSX/solr/build/solr-core/test/J0/org.apache.solr.cloud.BasicDistributedZkTest-jetty3-1360812156825/collection1/lib/README' to classloader
[junit4:junit4]   2> 10406 T2966 oasc.SolrConfig.<init> Using Lucene MatchVersion: LUCENE_42
[junit4:junit4]   2> 10496 T2966 oasc.SolrConfig.<init> Loaded SolrConfig: solrconfig.xml
[junit4:junit4]   2> 10497 T2966 oass.IndexSchema.readSchema Reading Solr Schema
[junit4:junit4]   2> 10504 T2966 oass.IndexSchema.readSchema Schema name=test
[junit4:junit4]   2> 11150 T2966 oass.OpenExchangeRatesOrgProvider.init Initialized with rates=open-exchange-rates.json, refreshInterval=1440.
[junit4:junit4]   2> 11157 T2966 oass.IndexSchema.readSchema default search field in schema is text
[junit4:junit4]   2> 11160 T2966 oass.IndexSchema.readSchema unique key field: id
[junit4:junit4]   2> 11183 T2966 oass.FileExchangeRateProvider.reload Reloading exchange rates from file currency.xml
[junit4:junit4]   2> 11188 T2966 oass.FileExchangeRateProvider.reload Reloading exchange rates from file currency.xml
[junit4:junit4]   2> 11193 T2966 oass.OpenExchangeRatesOrgProvider.reload Reloading exchange rates from open-exchange-rates.json
[junit4:junit4]   2> 11196 T2966 oass.OpenExchangeRatesOrgProvider.reload Reloading exchange rates from open-exchange-rates.json
[junit4:junit4]   2> 11198 T2966 oasc.SolrCore.<init> [collection1] Opening new SolrCore at /Users/jenkins/jenkins-slave/workspace/Lucene-Solr-4.x-MacOSX/solr/build/solr-core/test/J0/./org.apache.solr.cloud.BasicDistributedZkTest-jetty3-1360812156825/collection1/, dataDir=./org.apache.solr.cloud.BasicDistributedZkTest-1360812146869/jetty3/
[junit4:junit4]   2> 11198 T2966 oasc.JmxMonitoredMap.<init> JMX monitoring is enabled. Adding Solr mbeans to JMX Server: com.sun.jmx.mbeanserver.JmxMBeanServer@262adc9a
[junit4:junit4]   2> 11199 T2966 oasc.SolrCore.initDirectoryFactory solr.NRTCachingDirectoryFactory
[junit4:junit4]   2> 11199 T2966 oasc.CachingDirectoryFactory.get return new directory for /Users/jenkins/jenkins-slave/workspace/Lucene-Solr-4.x-MacOSX/solr/build/solr-core/test/J0/./org.apache.solr.cloud.BasicDistributedZkTest-1360812146869/jetty3 forceNew:false
[junit4:junit4]   2> 11200 T2966 oasc.CachingDirectoryFactory.close Releasing directory:/Users/jenkins/jenkins-slave/workspace/Lucene-Solr-4.x-MacOSX/solr/build/solr-core/test/J0/./org.apache.solr.cloud.BasicDistributedZkTest-1360812146869/jetty3
[junit4:junit4]   2> 11200 T2966 oasc.SolrCore.getNewIndexDir New index directory detected: old=null new=./org.apache.solr.cloud.BasicDistributedZkTest-1360812146869/jetty3/index/
[junit4:junit4]   2> 11201 T2966 oasc.SolrCore.initIndex WARNING [collection1] Solr index directory './org.apache.solr.cloud.BasicDistributedZkTest-1360812146869/jetty3/index' doesn't exist. Creating new index...
[junit4:junit4]   2> 11202 T2966 oasc.CachingDirectoryFactory.get return new directory for /Users/jenkins/jenkins-slave/workspace/Lucene-Solr-4.x-MacOSX/solr/build/solr-core/test/J0/./org.apache.solr.cloud.BasicDistributedZkTest-1360812146869/jetty3/index forceNew:false
[junit4:junit4]   2> 11206 T2966 oasc.SolrDeletionPolicy.onCommit SolrDeletionPolicy.onCommit: commits:num=1
[junit4:junit4]   2> 		commit{dir=RateLimitedDirectoryWrapper(NRTCachingDirectory(org.apache.lucene.store.NIOFSDirectory@/Users/jenkins/jenkins-slave/workspace/Lucene-Solr-4.x-MacOSX/solr/build/solr-core/test/J0/org.apache.solr.cloud.BasicDistributedZkTest-1360812146869/jetty3/index lockFactory=org.apache.lucene.store.NativeFSLockFactory@951e3ce; maxCacheMB=48.0 maxMergeSizeMB=4.0)),segFN=segments_1,generation=1,filenames=[segments_1]
[junit4:junit4]   2> 11207 T2966 oasc.SolrDeletionPolicy.updateCommits newest commit = 1[segments_1]
[junit4:junit4]   2> 11207 T2966 oasc.CachingDirectoryFactory.close Releasing directory:/Users/jenkins/jenkins-slave/workspace/Lucene-Solr-4.x-MacOSX/solr/build/solr-core/test/J0/./org.apache.solr.cloud.BasicDistributedZkTest-1360812146869/jetty3/index
[junit4:junit4]   2> 11208 T2966 oasc.SolrCore.initWriters created xml: solr.XMLResponseWriter
[junit4:junit4]   2> 11211 T2966 oasup.UpdateRequestProcessorChain.init inserting DistributedUpdateProcessorFactory into updateRequestProcessorChain "dedupe"
[junit4:junit4]   2> 11211 T2966 oasup.UpdateRequestProcessorChain.init inserting DistributedUpdateProcessorFactory into updateRequestProcessorChain "dedupe-allfields"
[junit4:junit4]   2> 11212 T2966 oasup.UpdateRequestProcessorChain.init inserting DistributedUpdateProcessorFactory into updateRequestProcessorChain "stored_sig"
[junit4:junit4]   2> 11212 T2966 oasup.UpdateRequestProcessorChain.init inserting DistributedUpdateProcessorFactory into updateRequestProcessorChain "uniq-fields"
[junit4:junit4]   2> 11213 T2966 oasup.UpdateRequestProcessorChain.init inserting DistributedUpdateProcessorFactory into updateRequestProcessorChain "distrib-dup-test-chain-implicit"
[junit4:junit4]   2> 11214 T2966 oasc.RequestHandlers.initHandlersFromConfig adding lazy requestHandler: solr.ReplicationHandler
[junit4:junit4]   2> 11215 T2966 oasc.RequestHandlers.initHandlersFromConfig created /replication: solr.ReplicationHandler
[junit4:junit4]   2> 11215 T2966 oasc.RequestHandlers.initHandlersFromConfig created standard: solr.StandardRequestHandler
[junit4:junit4]   2> 11216 T2966 oasc.RequestHandlers.initHandlersFromConfig created /get: solr.RealTimeGetHandler
[junit4:junit4]   2> 11217 T2966 oasc.RequestHandlers.initHandlersFromConfig created dismax: solr.SearchHandler
[junit4:junit4]   2> 11217 T2966 oasc.RequestHandlers.initHandlersFromConfig created mock: org.apache.solr.core.MockQuerySenderListenerReqHandler
[junit4:junit4]   2> 11218 T2966 oasc.RequestHandlers.initHandlersFromConfig created /admin/: org.apache.solr.handler.admin.AdminHandlers
[junit4:junit4]   2> 11218 T2966 oasc.RequestHandlers.initHandlersFromConfig created defaults: solr.StandardRequestHandler
[junit4:junit4]   2> 11219 T2966 oasc.RequestHandlers.initHandlersFromConfig adding lazy requestHandler: solr.StandardRequestHandler
[junit4:junit4]   2> 11219 T2966 oasc.RequestHandlers.initHandlersFromConfig created lazy: solr.StandardRequestHandler
[junit4:junit4]   2> 11220 T2966 oasc.RequestHandlers.initHandlersFromConfig created /update: solr.UpdateRequestHandler
[junit4:junit4]   2> 11221 T2966 oasc.RequestHandlers.initHandlersFromConfig created /terms: org.apache.solr.handler.component.SearchHandler
[junit4:junit4]   2> 11222 T2966 oasc.RequestHandlers.initHandlersFromConfig created spellCheckCompRH: org.apache.solr.handler.component.SearchHandler
[junit4:junit4]   2> 11223 T2966 oasc.RequestHandlers.initHandlersFromConfig created spellCheckCompRH_Direct: org.apache.solr.handler.component.SearchHandler
[junit4:junit4]   2> 11223 T2966 oasc.RequestHandlers.initHandlersFromConfig created spellCheckWithWordbreak: org.apache.solr.handler.component.SearchHandler
[junit4:junit4]   2> 11224 T2966 oasc.RequestHandlers.initHandlersFromConfig created spellCheckWithWordbreak_Direct: org.apache.solr.handler.component.SearchHandler
[junit4:junit4]   2> 11225 T2966 oasc.RequestHandlers.initHandlersFromConfig created spellCheckCompRH1: org.apache.solr.handler.component.SearchHandler
[junit4:junit4]   2> 11226 T2966 oasc.RequestHandlers.initHandlersFromConfig created mltrh: org.apache.solr.handler.component.SearchHandler
[junit4:junit4]   2> 11227 T2966 oasc.RequestHandlers.initHandlersFromConfig created tvrh: org.apache.solr.handler.component.SearchHandler
[junit4:junit4]   2> 11228 T2966 oasc.RequestHandlers.initHandlersFromConfig created /mlt: solr.MoreLikeThisHandler
[junit4:junit4]   2> 11229 T2966 oasc.RequestHandlers.initHandlersFromConfig created /debug/dump: solr.DumpRequestHandler
[junit4:junit4]   2> 11236 T2966 oashl.XMLLoader.init xsltCacheLifetimeSeconds=60
[junit4:junit4]   2> 11240 T2966 oasc.SolrCore.initDeprecatedSupport WARNING solrconfig.xml uses deprecated <admin/gettableFiles>, Please update your config to use the ShowFileRequestHandler.
[junit4:junit4]   2> 11242 T2966 oasc.SolrCore.initDeprecatedSupport WARNING adding ShowFileRequestHandler with hidden files: [SCHEMA.XML, OLD_SYNONYMS.TXT, STOPWORDS.TXT, PROTWORDS.TXT, OPEN-EXCHANGE-RATES.JSON, SYNONYMS.TXT, CURRENCY.XML, MAPPING-ISOLATIN1ACCENT.TXT]
[junit4:junit4]   2> 11245 T2966 oasc.CachingDirectoryFactory.close Releasing directory:/Users/jenkins/jenkins-slave/workspace/Lucene-Solr-4.x-MacOSX/solr/build/solr-core/test/J0/./org.apache.solr.cloud.BasicDistributedZkTest-1360812146869/jetty3
[junit4:junit4]   2> 11247 T2966 oass.SolrIndexSearcher.<init> Opening Searcher@51667022 main
[junit4:junit4]   2> 11248 T2966 oasu.CommitTracker.<init> Hard AutoCommit: disabled
[junit4:junit4]   2> 11248 T2966 oasu.CommitTracker.<init> Soft AutoCommit: disabled
[junit4:junit4]   2> 11249 T2966 oashc.SpellCheckComponent.inform Initializing spell checkers
[junit4:junit4]   2> 11256 T2966 oass.DirectSolrSpellChecker.init init: {name=direct,classname=DirectSolrSpellChecker,field=lowerfilt,minQueryLength=3}
[junit4:junit4]   2> 11289 T2967 oasc.SolrCore.registerSearcher [collection1] Registered new searcher Searcher@51667022 main{StandardDirectoryReader(segments_1:1)}
[junit4:junit4]   2> 11297 T2966 oasc.ZkController.publish publishing core=collection1 state=down
[junit4:junit4]   2> 11297 T2966 oasc.ZkController.publish numShards not found on descriptor - reading it from system property
[junit4:junit4]   2> 11443 T2917 oascc.ZkStateReader.updateClusterState Updating cloud state from ZooKeeper... 
[junit4:junit4]   2> 11445 T2917 oasc.Overseer$ClusterStateUpdater.updateState Update state numShards=2 message={
[junit4:junit4]   2> 	  "operation":"state",
[junit4:junit4]   2> 	  "numShards":"2",
[junit4:junit4]   2> 	  "shard":"shard2",
[junit4:junit4]   2> 	  "roles":null,
[junit4:junit4]   2> 	  "state":"active",
[junit4:junit4]   2> 	  "core":"collection1",
[junit4:junit4]   2> 	  "collection":"collection1",
[junit4:junit4]   2> 	  "node_name":"127.0.0.1:52224_jszv%2Fb",
[junit4:junit4]   2> 	  "base_url":"http://127.0.0.1:52224/jszv/b"}
[junit4:junit4]   2> 11452 T2917 oasc.Overseer$ClusterStateUpdater.updateState Update state numShards=2 message={
[junit4:junit4]   2> 	  "operation":"state",
[junit4:junit4]   2> 	  "numShards":"2",
[junit4:junit4]   2> 	  "shard":null,
[junit4:junit4]   2> 	  "roles":null,
[junit4:junit4]   2> 	  "state":"down",
[junit4:junit4]   2> 	  "core":"collection1",
[junit4:junit4]   2> 	  "collection":"collection1",
[junit4:junit4]   2> 	  "node_name":"127.0.0.1:52227_jszv%2Fb",
[junit4:junit4]   2> 	  "base_url":"http://127.0.0.1:52227/jszv/b"}
[junit4:junit4]   2> 11452 T2917 oasc.Overseer$ClusterStateUpdater.updateState Collection already exists with numShards=2
[junit4:junit4]   2> 11453 T2917 oasc.Overseer$ClusterStateUpdater.updateState Assigning new node to shard shard=shard1
[junit4:junit4]   2> 11461 T2922 oascc.ZkStateReader$2.process A cluster state change: WatchedEvent state:SyncConnected type:NodeDataChanged path:/clusterstate.json, has occurred - updating... (live nodes size: 4)
[junit4:junit4]   2> 11461 T2965 oascc.ZkStateReader$2.process A cluster state change: WatchedEvent state:SyncConnected type:NodeDataChanged path:/clusterstate.json, has occurred - updating... (live nodes size: 4)
[junit4:junit4]   2> 11461 T2950 oascc.ZkStateReader$2.process A cluster state change: WatchedEvent state:SyncConnected type:NodeDataChanged path:/clusterstate.json, has occurred - updating... (live nodes size: 4)
[junit4:junit4]   2> 11461 T2916 oascc.ZkStateReader$2.process A cluster state change: WatchedEvent state:SyncConnected type:NodeDataChanged path:/clusterstate.json, has occurred - updating... (live nodes size: 4)
[junit4:junit4]   2> 11462 T2935 oascc.ZkStateReader$2.process A cluster state change: WatchedEvent state:SyncConnected type:NodeDataChanged path:/clusterstate.json, has occurred - updating... (live nodes size: 4)
[junit4:junit4]   2> 12299 T2966 oasc.CoreContainer.registerCore registering core: collection1
[junit4:junit4]   2> 12300 T2966 oasc.ZkController.register Register replica - core:collection1 address:http://127.0.0.1:52227/jszv/b collection:collection1 shard:shard1
[junit4:junit4]   2> 12306 T2966 oasc.ZkController.register We are http://127.0.0.1:52227/jszv/b/collection1/ and leader is http://127.0.0.1:52221/jszv/b/collection1/
[junit4:junit4]   2> 12307 T2966 oasc.ZkController.register No LogReplay needed for core=collection1 baseURL=http://127.0.0.1:52227/jszv/b
[junit4:junit4]   2> 12307 T2966 oasc.ZkController.checkRecovery Core needs to recover:collection1
[junit4:junit4]   2> 12308 T2966 oasu.DefaultSolrCoreState.doRecovery Running recovery - first canceling any ongoing recovery
[junit4:junit4]   2> ASYNC  NEW_CORE C172 name=collection1 org.apache.solr.core.SolrCore@200812ee url=http://127.0.0.1:52227/jszv/b/collection1 node=127.0.0.1:52227_jszv%2Fb C172_STATE=coll:collection1 core:collection1 props:{shard=null, roles=null, state=down, core=collection1, collection=collection1, node_name=127.0.0.1:52227_jszv%2Fb, base_url=http://127.0.0.1:52227/jszv/b}
[junit4:junit4]   2> 12309 T2968 C172 P52227 oasc.RecoveryStrategy.run Starting recovery process.  core=collection1 recoveringAfterStartup=true
[junit4:junit4]   2> 12310 T2968 C172 P52227 oasc.RecoveryStrategy.doRecovery ###### startupVersions=[]
[junit4:junit4]   2> 12310 T2968 C172 P52227 oasc.ZkController.publish publishing core=collection1 state=recovering
[junit4:junit4]   2> 12310 T2966 oascc.ZkStateReader.updateClusterState Updating cloud state from ZooKeeper... 
[junit4:junit4]   2> 12310 T2968 C172 P52227 oasc.ZkController.publish numShards not found on descriptor - reading it from system property
[junit4:junit4]   2> 12313 T2968 C172 P52227 oascsi.HttpClientUtil.createClient Creating new http client, config:maxConnections=128&maxConnectionsPerHost=32&followRedirects=false
[junit4:junit4]   2> 12313 T2894 oass.SolrDispatchFilter.init user.dir=/Users/jenkins/jenkins-slave/workspace/Lucene-Solr-4.x-MacOSX/solr/build/solr-core/test/J0
[junit4:junit4]   2> 12314 T2894 oass.SolrDispatchFilter.init SolrDispatchFilter.init() done
[junit4:junit4]   2> 12314 T2894 oascsi.HttpClientUtil.createClient Creating new http client, config:maxConnections=128&maxConnectionsPerHost=32&followRedirects=false
[junit4:junit4]   2> 12511 T2894 oejs.Server.doStart jetty-8.1.8.v20121106
[junit4:junit4]   2> 12516 T2894 oejs.AbstractConnector.doStart Started SelectChannelConnector@127.0.0.1:52231
[junit4:junit4]   2> 12517 T2894 oass.SolrDispatchFilter.init SolrDispatchFilter.init()
[junit4:junit4]   2> 12518 T2894 oasc.SolrResourceLoader.locateSolrHome JNDI not configured for solr (NoInitialContextEx)
[junit4:junit4]   2> 12519 T2894 oasc.SolrResourceLoader.locateSolrHome using system property solr.solr.home: /Users/jenkins/jenkins-slave/workspace/Lucene-Solr-4.x-MacOSX/solr/build/solr-core/test/J0/./org.apache.solr.cloud.BasicDistributedZkTest-jetty4-1360812159183
[junit4:junit4]   2> 12520 T2894 oasc.CoreContainer$Initializer.initialize looking for solr.xml: /Users/jenkins/jenkins-slave/workspace/Lucene-Solr-4.x-MacOSX/solr/build/solr-core/test/J0/./org.apache.solr.cloud.BasicDistributedZkTest-jetty4-1360812159183/solr.xml
[junit4:junit4]   2> 12521 T2894 oasc.CoreContainer.<init> New CoreContainer 106224361
[junit4:junit4]   2> 12523 T2894 oasc.CoreContainer.load Loading CoreContainer using Solr Home: '/Users/jenkins/jenkins-slave/workspace/Lucene-Solr-4.x-MacOSX/solr/build/solr-core/test/J0/./org.apache.solr.cloud.BasicDistributedZkTest-jetty4-1360812159183/'
[junit4:junit4]   2> 12523 T2894 oasc.SolrResourceLoader.<init> new SolrResourceLoader for directory: '/Users/jenkins/jenkins-slave/workspace/Lucene-Solr-4.x-MacOSX/solr/build/solr-core/test/J0/./org.apache.solr.cloud.BasicDistributedZkTest-jetty4-1360812159183/'
[junit4:junit4]   2> 12573 T2894 oashc.HttpShardHandlerFactory.getParameter Setting socketTimeout to: 60000
[junit4:junit4]   2> 12573 T2894 oashc.HttpShardHandlerFactory.getParameter Setting urlScheme to: http://
[junit4:junit4]   2> 12574 T2894 oashc.HttpShardHandlerFactory.getParameter Setting connTimeout to: 15000
[junit4:junit4]   2> 12575 T2894 oashc.HttpShardHandlerFactory.getParameter Setting maxConnectionsPerHost to: 20
[junit4:junit4]   2> 12575 T2894 oashc.HttpShardHandlerFactory.getParameter Setting corePoolSize to: 0
[junit4:junit4]   2> 12575 T2894 oashc.HttpShardHandlerFactory.getParameter Setting maximumPoolSize to: 2147483647
[junit4:junit4]   2> 12576 T2894 oashc.HttpShardHandlerFactory.getParameter Setting maxThreadIdleTime to: 5
[junit4:junit4]   2> 12576 T2894 oashc.HttpShardHandlerFactory.getParameter Setting sizeOfQueue to: -1
[junit4:junit4]   2> 12577 T2894 oashc.HttpShardHandlerFactory.getParameter Setting fairnessPolicy to: false
[junit4:junit4]   2> 12577 T2894 oascsi.HttpClientUtil.createClient Creating new http client, config:maxConnectionsPerHost=20&maxConnections=10000&socketTimeout=60000&connTimeout=15000&retry=false
[junit4:junit4]   2> 12590 T2894 oasc.CoreContainer.load Registering Log Listener
[junit4:junit4]   2> 12609 T2894 oasc.CoreContainer.initZooKeeper Zookeeper client=127.0.0.1:52214/solr
[junit4:junit4]   2> 12610 T2894 oasc.ZkController.checkChrootPath zkHost includes chroot
[junit4:junit4]   2> 12610 T2894 oaz.ZooKeeper.<init> Initiating client connection, connectString=127.0.0.1:52214 sessionTimeout=60000 watcher=org.apache.solr.common.cloud.ConnectionManager@74a02cbf
[junit4:junit4]   2> 12612 T2894 oascc.ConnectionManager.waitForConnected Waiting for client to connect to ZooKeeper
[junit4:junit4]   2> 12612 T2978 oaz.ClientCnxn$SendThread.logStartConnect Opening socket connection to server localhost/127.0.0.1:52214. Will not attempt to authenticate using SASL (access denied ("javax.security.auth.AuthPermission" "getLoginConfiguration"))
[junit4:junit4]   2> 12614 T2978 oaz.ClientCnxn$SendThread.primeConnection Socket connection established to localhost/127.0.0.1:52214, initiating session
[junit4:junit4]   2> 12614 T2896 oazs.NIOServerCnxnFactory.run Accepted socket connection from /127.0.0.1:52232
[junit4:junit4]   2> 12615 T2896 oazs.ZooKeeperServer.processConnectRequest Client attempting to establish new session at /127.0.0.1:52232
[junit4:junit4]   2> 12617 T2898 oazs.ZooKeeperServer.finishSessionInit Established session 0x13cd6b980c0000b with negotiated timeout 20000 for client /127.0.0.1:52232
[junit4:junit4]   2> 12617 T2978 oaz.ClientCnxn$SendThread.onConnected Session establishment complete on server localhost/127.0.0.1:52214, sessionid = 0x13cd6b980c0000b, negotiated timeout = 20000
[junit4:junit4]   2> 12618 T2979 oascc.ConnectionManager.process Watcher org.apache.solr.common.cloud.ConnectionManager@74a02cbf name:ZooKeeperConnection Watcher:127.0.0.1:52214 got event WatchedEvent state:SyncConnected type:None path:null path:null type:None
[junit4:junit4]   2> 12618 T2894 oascc.ConnectionManager.waitForConnected Client is connected to ZooKeeper
[junit4:junit4]   2> 12621 T2899 oazs.PrepRequestProcessor.pRequest2Txn Processed session termination for sessionid: 0x13cd6b980c0000b
[junit4:junit4]   2> 12623 T2896 oazs.NIOServerCnxn.closeSock Closed socket connection for client /127.0.0.1:52232 which had sessionid 0x13cd6b980c0000b
[junit4:junit4]   2> 12623 T2979 oaz.ClientCnxn$EventThread.run EventThread shut down
[junit4:junit4]   2> 12623 T2894 oaz.ZooKeeper.close Session: 0x13cd6b980c0000b closed
[junit4:junit4]   2> 12625 T2894 oascsi.HttpClientUtil.createClient Creating new http client, config:maxConnections=500&maxConnectionsPerHost=16&socketTimeout=60000&connTimeout=15000
[junit4:junit4]   2> 12630 T2894 oaz.ZooKeeper.<init> Initiating client connection, connectString=127.0.0.1:52214/solr sessionTimeout=30000 watcher=org.apache.solr.common.cloud.ConnectionManager@5c4b1681
[junit4:junit4]   2> 12631 T2894 oascc.ConnectionManager.waitForConnected Waiting for client to connect to ZooKeeper
[junit4:junit4]   2> 12632 T2980 oaz.ClientCnxn$SendThread.logStartConnect Opening socket connection to server localhost/127.0.0.1:52214. Will not attempt to authenticate using SASL (access denied ("javax.security.auth.AuthPermission" "getLoginConfiguration"))
[junit4:junit4]   2> 12633 T2980 oaz.ClientCnxn$SendThread.primeConnection Socket connection established to localhost/127.0.0.1:52214, initiating session
[junit4:junit4]   2> 12634 T2896 oazs.NIOServerCnxnFactory.run Accepted socket connection from /127.0.0.1:52233
[junit4:junit4]   2> 12634 T2896 oazs.ZooKeeperServer.processConnectRequest Client attempting to establish new session at /127.0.0.1:52233
[junit4:junit4]   2> 12636 T2898 oazs.ZooKeeperServer.finishSessionInit Established session 0x13cd6b980c0000c with negotiated timeout 20000 for client /127.0.0.1:52233
[junit4:junit4]   2> 12636 T2980 oaz.ClientCnxn$SendThread.onConnected Session establishment complete on server localhost/127.0.0.1:52214, sessionid = 0x13cd6b980c0000c, negotiated timeout = 20000
[junit4:junit4]   2> 12636 T2981 oascc.ConnectionManager.process Watcher org.apache.solr.common.cloud.ConnectionManager@5c4b1681 name:ZooKeeperConnection Watcher:127.0.0.1:52214/solr got event WatchedEvent state:SyncConnected type:None path:null path:null type:None
[junit4:junit4]   2> 12637 T2894 oascc.ConnectionManager.waitForConnected Client is connected to ZooKeeper
[junit4:junit4]   2> 12640 T2899 oazs.PrepRequestProcessor.pRequest Got user-level KeeperException when processing sessionid:0x13cd6b980c0000c type:create cxid:0x1 zxid:0x9f txntype:-1 reqpath:n/a Error Path:/solr/overseer Error:KeeperErrorCode = NodeExists for /solr/overseer
[junit4:junit4]   2> 12641 T2899 oazs.PrepRequestProcessor.pRequest Got user-level KeeperException when processing sessionid:0x13cd6b980c0000c type:create cxid:0x2 zxid:0xa0 txntype:-1 reqpath:n/a Error Path:/solr/overseer Error:KeeperErrorCode = NodeExists for /solr/overseer
[junit4:junit4]   2> 12645 T2894 oascc.ZkStateReader.createClusterStateWatchersAndUpdate Updating cluster state from ZooKeeper... 
[junit4:junit4]   2> 12650 T2894 oasc.ZkController.createEphemeralLiveNode Register node as live in ZooKeeper:/live_nodes/127.0.0.1:52231_jszv%2Fb
[junit4:junit4]   2> 12651 T2899 oazs.PrepRequestProcessor.pRequest Got user-level KeeperException when processing sessionid:0x13cd6b980c0000c type:delete cxid:0x9 zxid:0xa1 txntype:-1 reqpath:n/a Error Path:/solr/live_nodes/127.0.0.1:52231_jszv%2Fb Error:KeeperErrorCode = NoNode for /solr/live_nodes/127.0.0.1:52231_jszv%2Fb
[junit4:junit4]   2> 12652 T2894 oascc.SolrZkClient.makePath makePath: /live_nodes/127.0.0.1:52231_jszv%2Fb
[junit4:junit4]   2> 12658 T2916 oascc.ZkStateReader$2.process A cluster state change: WatchedEvent state:SyncConnected type:NodeChildrenChanged path:/live_nodes, has occurred - updating... (live nodes size: 4)
[junit4:junit4]   2> 12660 T2965 oascc.ZkStateReader$3.process Updating live nodes... (5)
[junit4:junit4]   2> 12661 T2965 oascc.ZkStateReader$2.process A cluster state change: WatchedEvent state:SyncConnected type:NodeChildrenChanged path:/live_nodes, has occurred - updating... (live nodes size: 5)
[junit4:junit4]   2> 12661 T2922 oascc.ZkStateReader$3.process Updating live nodes... (5)
[junit4:junit4]   2> 12661 T2922 oascc.ZkStateReader$2.process A cluster state change: WatchedEvent state:SyncConnected type:NodeChildrenChanged path:/live_nodes, has occurred - updating... (live nodes size: 5)
[junit4:junit4]   2> 12661 T2950 oascc.ZkStateReader$3.process Updating live nodes... (5)
[junit4:junit4]   2> 12662 T2950 oascc.ZkStateReader$2.process A cluster state change: WatchedEvent state:SyncConnected type:NodeChildrenChanged path:/live_nodes, has occurred - updating... (live nodes size: 5)
[junit4:junit4]   2> 12662 T2935 oascc.ZkStateReader$3.process Updating live nodes... (5)
[junit4:junit4]   2> 12662 T2981 oascc.ZkStateReader$3.process Updating live nodes... (5)
[junit4:junit4]   2> 12662 T2935 oascc.ZkStateReader$2.process A cluster state change: WatchedEvent state:SyncConnected type:NodeChildrenChanged path:/live_nodes, has occurred - updating... (live nodes size: 5)
[junit4:junit4]   2> 12665 T2916 oascc.ZkStateReader$3.process Updating live nodes... (5)
[junit4:junit4]   2> 12678 T2982 oasc.CoreContainer.create Creating SolrCore 'collection1' using instanceDir: /Users/jenkins/jenkins-slave/workspace/Lucene-Solr-4.x-MacOSX/solr/build/solr-core/test/J0/./org.apache.solr.cloud.BasicDistributedZkTest-jetty4-1360812159183/collection1
[junit4:junit4]   2> 12678 T2982 oasc.ZkController.createCollectionZkNode Check for collection zkNode:collection1
[junit4:junit4]   2> 12679 T2982 oasc.ZkController.createCollectionZkNode Collection zkNode exists
[junit4:junit4]   2> 12679 T2982 oasc.ZkController.readConfigName Load collection config from:/collections/collection1
[junit4:junit4]   2> 12682 T2982 oasc.SolrResourceLoader.<init> new SolrResourceLoader for directory: '/Users/jenkins/jenkins-slave/workspace/Lucene-Solr-4.x-MacOSX/solr/build/solr-core/test/J0/./org.apache.solr.cloud.BasicDistributedZkTest-jetty4-1360812159183/collection1/'
[junit4:junit4]   2> 12683 T2982 oasc.SolrResourceLoader.replaceClassLoader Adding 'file:/Users/jenkins/jenkins-slave/workspace/Lucene-Solr-4.x-MacOSX/solr/build/solr-core/test/J0/org.apache.solr.cloud.BasicDistributedZkTest-jetty4-1360812159183/collection1/lib/classes/' to classloader
[junit4:junit4]   2> 12683 T2982 oasc.SolrResourceLoader.replaceClassLoader Adding 'file:/Users/jenkins/jenkins-slave/workspace/Lucene-Solr-4.x-MacOSX/solr/build/solr-core/test/J0/org.apache.solr.cloud.BasicDistributedZkTest-jetty4-1360812159183/collection1/lib/README' to classloader
[junit4:junit4]   2> 12763 T2982 oasc.SolrConfig.<init> Using Lucene MatchVersion: LUCENE_42
[junit4:junit4]   2> 12868 T2982 oasc.SolrConfig.<init> Loaded SolrConfig: solrconfig.xml
[junit4:junit4]   2> 12870 T2982 oass.IndexSchema.readSchema Reading Solr Schema
[junit4:junit4]   2> 12880 T2982 oass.IndexSchema.readSchema Schema name=test
[junit4:junit4]   2> 12977 T2917 oascc.ZkStateReader.updateClusterState Updating cloud state from ZooKeeper... 
[junit4:junit4]   2> 12978 T2917 oasc.Overseer$ClusterStateUpdater.updateState Update state numShards=2 message={
[junit4:junit4]   2> 	  "operation":"state",
[junit4:junit4]   2> 	  "numShards":"2",
[junit4:junit4]   2> 	  "shard":"shard1",
[junit4:junit4]   2> 	  "roles":null,
[junit4:junit4]   2> 	  "state":"recovering",
[junit4:junit4]   2> 	  "core":"collection1",
[junit4:junit4]   2> 	  "collection":"collection1",
[junit4:junit4]   2> 	  "node_name":"127.0.0.1:52227_jszv%2Fb",
[junit4:junit4]   2> 	  "base_url":"http://127.0.0.1:52227/jszv/b"}
[junit4:junit4]   2> 12986 T2965 oascc.ZkStateReader$2.process A cluster state change: WatchedEvent state:SyncConnected type:NodeDataChanged path:/clusterstate.json, has occurred - updating... (live nodes size: 5)
[junit4:junit4]   2> 12987 T2950 oascc.ZkStateReader$2.process A cluster state change: WatchedEvent state:SyncConnected type:NodeDataChanged path:/clusterstate.json, has occurred - updating... (live nodes size: 5)
[junit4:junit4]   2> 12987 T2935 oascc.ZkStateReader$2.process A cluster state change: WatchedEvent state:SyncConnected type:NodeDataChanged path:/clusterstate.json, has occurred - updating... (live nodes size: 5)
[junit4:junit4]   2> 12988 T2922 oascc.ZkStateReader$2.process A cluster state change: WatchedEvent state:SyncConnected type:NodeDataChanged path:/clusterstate.json, has occurred - updating... (live nodes size: 5)
[junit4:junit4]   2> 12989 T2916 oascc.ZkStateReader$2.process A cluster state change: WatchedEvent state:SyncConnected type:NodeDataChanged path:/clusterstate.json, has occurred - updating... (live nodes size: 5)
[junit4:junit4]   2> 12993 T2981 oascc.ZkStateReader$2.process A cluster state change: WatchedEvent state:SyncConnected type:NodeDataChanged path:/clusterstate.json, has occurred - updating... (live nodes size: 5)
[junit4:junit4]   2> 13545 T2982 oass.OpenExchangeRatesOrgProvider.init Initialized with rates=open-exchange-rates.json, refreshInterval=1440.
[junit4:junit4]   2> 13554 T2982 oass.IndexSchema.readSchema default search field in schema is text
[junit4:junit4]   2> 13557 T2982 oass.IndexSchema.readSchema unique key field: id
[junit4:junit4]   2> 13582 T2982 oass.FileExchangeRateProvider.reload Reloading exchange rates from file currency.xml
[junit4:junit4]   2> 13602 T2982 oass.FileExchangeRateProvider.reload Reloading exchange rates from file currency.xml
[junit4:junit4]   2> 13608 T2982 oass.OpenExchangeRatesOrgProvider.reload Reloading exchange rates from open-exchange-rates.json
[junit4:junit4]   2> 13611 T2982 oass.OpenExchangeRatesOrgProvider.reload Reloading exchange rates from open-exchange-rates.json
[junit4:junit4]   2> 13613 T2982 oasc.SolrCore.<init> [collection1] Opening new SolrCore at /Users/jenkins/jenkins-slave/workspace/Lucene-Solr-4.x-MacOSX/solr/build/solr-core/test/J0/./org.apache.solr.cloud.BasicDistributedZkTest-jetty4-1360812159183/collection1/, dataDir=./org.apache.solr.cloud.BasicDistributedZkTest-1360812146869/jetty4/
[junit4:junit4]   2> 13613 T2982 oasc.JmxMonitoredMap.<init> JMX monitoring is enabled. Adding Solr mbeans to JMX Server: com.sun.jmx.mbeanserver.JmxMBeanServer@262adc9a
[junit4:junit4]   2> 13614 T2982 oasc.SolrCore.initDirectoryFactory solr.NRTCachingDirectoryFactory
[junit4:junit4]   2> 13615 T2982 oasc.CachingDirectoryFactory.get return new directory for /Users/jenkins/jenkins-slave/workspace/Lucene-Solr-4.x-MacOSX/solr/build/solr-core/test/J0/./org.apache.solr.cloud.BasicDistributedZkTest-1360812146869/jetty4 forceNew:false
[junit4:junit4]   2> 13615 T2982 oasc.CachingDirectoryFactory.close Releasing directory:/Users/jenkins/jenkins-slave/workspace/Lucene-Solr-4.x-MacOSX/solr/build/solr-core/test/J0/./org.apache.solr.cloud.BasicDistributedZkTest-1360812146869/jetty4
[junit4:junit4]   2> 13615 T2982 oasc.SolrCore.getNewIndexDir New index directory detected: old=null new=./org.apache.solr.cloud.BasicDistributedZkTest-1360812146869/jetty4/index/
[junit4:junit4]   2> 13616 T2982 oasc.SolrCore.initIndex WARNING [collection1] Solr index directory './org.apache.solr.cloud.BasicDistributedZkTest-1360812146869/jetty4/index' doesn't exist. Creating new index...
[junit4:junit4]   2> 13617 T2982 oasc.CachingDirectoryFactory.get return new directory for /Users/jenkins/jenkins-slave/workspace/Lucene-Solr-4.x-MacOSX/solr/build/solr-core/test/J0/./org.apache.solr.cloud.BasicDistributedZkTest-1360812146869/jetty4/index forceNew:false
[junit4:junit4]   2> 13622 T2982 oasc.SolrDeletionPolicy.onCommit SolrDeletionPolicy.onCommit: commits:num=1
[junit4:junit4]   2> 		commit{dir=RateLimitedDirectoryWrapper(NRTCachingDirectory(org.apache.lucene.store.NIOFSDirectory@/Users/jenkins/jenkins-slave/workspace/Lucene-Solr-4.x-MacOSX/solr/build/solr-core/test/J0/org.apache.solr.cloud.BasicDistributedZkTest-1360812146869/jetty4/index lockFactory=org.apache.lucene.store.NativeFSLockFactory@3639ae9b; maxCacheMB=48.0 maxMergeSizeMB=4.0)),segFN=segments_1,generation=1,filenames=[segments_1]
[junit4:junit4]   2> 13622 T2982 oasc.SolrDeletionPolicy.updateCommits newest commit = 1[segments_1]
[junit4:junit4]   2> 13623 T2982 oasc.CachingDirectoryFactory.close Releasing directory:/Users/jenkins/jenkins-slave/workspace/Lucene-Solr-4.x-MacOSX/solr/build/solr-core/test/J0/./org.apache.solr.cloud.BasicDistributedZkTest-1360812146869/jetty4/index
[junit4:junit4]   2> 13624 T2982 oasc.SolrCore.initWriters created xml: solr.XMLResponseWriter
[junit4:junit4]   2> 13627 T2982 oasup.UpdateRequestProcessorChain.init inserting DistributedUpdateProcessorFactory into updateRequestProcessorChain "dedupe"
[junit4:junit4]   2> 13628 T2982 oasup.UpdateRequestProcessorChain.init inserting DistributedUpdateProcessorFactory into updateRequestProcessorChain "dedupe-allfields"
[junit4:junit4]   2> 13629 T2982 oasup.UpdateRequestProcessorChain.init inserting DistributedUpdateProcessorFactory into updateRequestProcessorChain "stored_sig"
[junit4:junit4]   2> 13630 T2982 oasup.UpdateRequestProcessorChain.init inserting DistributedUpdateProcessorFactory into updateRequestProcessorChain "uniq-fields"
[junit4:junit4]   2> 13631 T2982 oasup.UpdateRequestProcessorChain.init inserting DistributedUpdateProcessorFactory into updateRequestProcessorChain "distrib-dup-test-chain-implicit"
[junit4:junit4]   2> 13631 T2982 oasc.RequestHandlers.initHandlersFromConfig adding lazy requestHandler: solr.ReplicationHandler
[junit4:junit4]   2> 13632 T2982 oasc.RequestHandlers.initHandlersFromConfig created /replication: solr.ReplicationHandler
[junit4:junit4]   2> 13633 T2982 oasc.RequestHandlers.initHandlersFromConfig created standard: solr.StandardRequestHandler
[junit4:junit4]   2> 13633 T2982 oasc.RequestHandlers.initHandlersFromConfig created /get: solr.RealTimeGetHandler
[junit4:junit4]   2> 13634 T2982 oasc.RequestHandlers.initHandlersFromConfig created dismax: solr.SearchHandler
[junit4:junit4]   2> 13635 T2982 oasc.RequestHandlers.initHandlersFromConfig created mock: org.apache.solr.core.MockQuerySenderListenerReqHandler
[junit4:junit4]   2> 13635 T2982 oasc.RequestHandlers.initHandlersFromConfig created /admin/: org.apache.solr.handler.admin.AdminHandlers
[junit4:junit4]   2> 13636 T2982 oasc.RequestHandlers.initHandlersFromConfig created defaults: solr.StandardRequestHandler
[junit4:junit4]   2> 13636 T2982 oasc.RequestHandlers.initHandlersFromConfig adding lazy requestHandler: solr.StandardRequestHandler
[junit4:junit4]   2> 13637 T2982 oasc.RequestHandlers.initHandlersFromConfig created lazy: solr.StandardRequestHandler
[junit4:junit4]   2> 13638 T2982 oasc.RequestHandlers.initHandlersFromConfig created /update: solr.UpdateRequestHandler
[junit4:junit4]   2> 13638 T2982 oasc.RequestHandlers.initHandlersFromConfig created /terms: org.apache.solr.handler.component.SearchHandler
[junit4:junit4]   2> 13639 T2982 oasc.RequestHandlers.initHandlersFromConfig created spellCheckCompRH: org.apache.solr.handler.component.SearchHandler
[junit4:junit4]   2> 13640 T2982 oasc.RequestHandlers.initHandlersFromConfig created spellCheckCompRH_Direct: org.apache.solr.handler.component.SearchHandler
[junit4:junit4]   2> 13641 T2982 oasc.RequestHandlers.initHandlersFromConfig created spellCheckWithWordbreak: org.apache.solr.handler.component.SearchHandler
[junit4:junit4]   2> 13641 T2982 oasc.RequestHandlers.initHandlersFromConfig created spellCheckWithWordbreak_Direct: org.apache.solr.handler.component.SearchHandler
[junit4:junit4]   2> 13642 T2982 oasc.RequestHandlers.initHandlersFromConfig created spellCheckCompRH1: org.apache.solr.handler.component.SearchHandler
[junit4:junit4]   2> 13643 T2982 oasc.RequestHandlers.initHandlersFromConfig created mltrh: org.apache.solr.handler.component.SearchHandler
[junit4:junit4]   2> 13643 T2982 oasc.RequestHandlers.initHandlersFromConfig created tvrh: org.apache.solr.handler.component.SearchHandler
[junit4:junit4]   2> 13644 T2982 oasc.RequestHandlers.initHandlersFromConfig created /mlt: solr.MoreLikeThisHandler
[junit4:junit4]   2> 13645 T2982 oasc.RequestHandlers.initHandlersFromConfig created /debug/dump: solr.DumpRequestHandler
[junit4:junit4]   2> 13652 T2982 oashl.XMLLoader.init xsltCacheLifetimeSeconds=60
[junit4:junit4]   2> 13656 T2982 oasc.SolrCore.initDeprecatedSupport WARNING solrconfig.xml uses deprecated <admin/gettableFiles>, Please update your config to use the ShowFileRequestHandler.
[junit4:junit4]   2> 13658 T2982 oasc.SolrCore.initDeprecatedSupport WARNING adding ShowFileRequestHandler with hidden files: [SCHEMA.XML, OLD_SYNONYMS.TXT, STOPWORDS.TXT, PROTWORDS.TXT, OPEN-EXCHANGE-RATES.JSON, SYNONYMS.TXT, CURRENCY.XML, MAPPING-ISOLATIN1ACCENT.TXT]
[junit4:junit4]   2> 13661 T2982 oasc.CachingDirectoryFactory.close Releasing directory:/Users/jenkins/jenkins-slave/workspace/Lucene-Solr-4.x-MacOSX/solr/build/solr-core/test/J0/./org.apache.solr.cloud.BasicDistributedZkTest-1360812146869/jetty4
[junit4:junit4]   2> 13662 T2982 oass.SolrIndexSearcher.<init> Opening Searcher@465bb664 main
[junit4:junit4]   2> 13663 T2982 oasu.CommitTracker.<init> Hard AutoCommit: disabled
[junit4:junit4]   2> 13664 T2982 oasu.CommitTracker.<init> Soft AutoCommit: disabled
[junit4:junit4]   2> 13664 T2982 oashc.SpellCheckComponent.inform Initializing spell checkers
[junit4:junit4]   2> 13670 T2982 oass.DirectSolrSpellChecker.init init: {name=direct,classname=DirectSolrSpellChecker,field=lowerfilt,minQueryLength=3}
[junit4:junit4]   2> 13706 T2983 oasc.SolrCore.registerSearcher [collection1] Registered new searcher Searcher@465bb664 main{StandardDirectoryReader(segments_1:1)}
[junit4:junit4]   2> 13715 T2982 oasc.ZkController.publish publishing core=collection1 state=down
[junit4:junit4]   2> 13716 T2982 oasc.ZkController.publish numShards not found on descriptor - reading it from system property
[junit4:junit4]   2> 14507 T2917 oascc.ZkStateReader.updateClusterState Updating cloud state from ZooKeeper... 
[junit4:junit4]   2> 14508 T2917 oasc.Overseer$ClusterStateUpdater.updateState Update state numShards=2 message={
[junit4:junit4]   2> 	  "operation":"state",
[junit4:junit4]   2> 	  "numShards":"2",
[junit4:junit4]   2> 	  "shard":null,
[junit4:junit4]   2> 	  "roles":null,
[junit4:junit4]   2> 	  "state":"down",
[junit4:junit4]   2> 	  "core":"collection1",
[junit4:junit4]   2> 	  "collection":"collection1",
[junit4:junit4]   2> 	  "node_name":"127.0.0.1:52231_jszv%2Fb",
[junit4:junit4]   2> 	  "base_url":"http://127.0.0.1:52231/jszv/b"}
[junit4:junit4]   2> 14509 T2917 oasc.Overseer$ClusterStateUpdater.updateState Collection already exists with numShards=2
[junit4:junit4]   2> 14509 T2917 oasc.Overseer$ClusterStateUpdater.updateState Assigning new node to shard shard=shard2
[junit4:junit4]   2> 14518 T2965 oascc.ZkStateReader$2.process A cluster state change: WatchedEvent state:SyncConnected type:NodeDataChanged path:/clusterstate.json, has occurred - updating... (live nodes size: 5)
[junit4:junit4]   2> 14518 T2981 oascc.ZkStateReader$2.process A cluster state change: WatchedEvent state:SyncConnected type:NodeDataChanged path:/clusterstate.json, has occurred - updating... (live nodes size: 5)
[junit4:junit4]   2> 14518 T2950 oascc.ZkStateReader$2.process A cluster state change: WatchedEvent state:SyncConnected type:NodeDataChanged path:/clusterstate.json, has occurred - updating... (live nodes size: 5)
[junit4:junit4]   2> 14519 T2935 oascc.ZkStateReader$2.process A cluster state change: WatchedEvent state:SyncConnected type:NodeDataChanged path:/clusterstate.json, has occurred - updating... (live nodes size: 5)
[junit4:junit4]   2> 14518 T2922 oascc.ZkStateReader$2.process A cluster state change: WatchedEvent state:SyncConnected type:NodeDataChanged path:/clusterstate.json, has occurred - updating... (live nodes size: 5)
[junit4:junit4]   2> 14518 T2916 oascc.ZkStateReader$2.process A cluster state change: WatchedEvent state:SyncConnected type:NodeDataChanged path:/clusterstate.json, has occurred - updating... (live nodes size: 5)
[junit4:junit4]   2> 14719 T2982 oasc.CoreContainer.registerCore registering core: collection1
[junit4:junit4]   2> 14720 T2982 oasc.ZkController.register Register replica - core:collection1 address:http://127.0.0.1:52231/jszv/b collection:collection1 shard:shard2
[junit4:junit4]   2> 14727 T2982 oasc.ZkController.register We are http://127.0.0.1:52231/jszv/b/collection1/ and leader is http://127.0.0.1:52224/jszv/b/collection1/
[junit4:junit4]   2> 14727 T2982 oasc.ZkController.register No LogReplay needed for core=collection1 baseURL=http://127.0.0.1:52231/jszv/b
[junit4:junit4]   2> 14727 T2982 oasc.ZkController.checkRecovery Core needs to recover:collection1
[junit4:junit4]   2> 14728 T2982 oasu.DefaultSolrCoreState.doRecovery Running recovery - first canceling any ongoing recovery
[junit4:junit4]   2> ASYNC  NEW_CORE C173 name=collection1 org.apache.solr.core.SolrCore@6162e961 url=http://127.0.0.1:52231/jszv/b/collection1 node=127.0.0.1:52231_jszv%2Fb C173_STATE=coll:collection1 core:collection1 props:{shard=null, roles=null, state=down, core=collection1, collection=collection1, node_name=127.0.0.1:52231_jszv%2Fb, base_url=http://127.0.0.1:52231/jszv/b}
[junit4:junit4]   2> 14729 T2984 C173 P52231 oasc.RecoveryStrategy.run Starting recovery process.  core=collection1 recoveringAfterStartup=true
[junit4:junit4]   2> 14731 T2984 C173 P52231 oasc.RecoveryStrategy.doRecovery ###### startupVersions=[]
[junit4:junit4]   2> 14731 T2982 oascc.ZkStateReader.updateClusterState Updating cloud state from ZooKeeper... 
[junit4:junit4]   2> 14731 T2984 C173 P52231 oasc.ZkController.publish publishing core=collection1 state=recovering
[junit4:junit4]   2> 14732 T2984 C173 P52231 oasc.ZkController.publish numShards not found on descriptor - reading it from system property
[junit4:junit4]   2> 14734 T2894 oass.SolrDispatchFilter.init user.dir=/Users/jenkins/jenkins-slave/workspace/Lucene-Solr-4.x-MacOSX/solr/build/solr-core/test/J0
[junit4:junit4]   2> 14734 T2984 C173 P52231 oascsi.HttpClientUtil.createClient Creating new http client, config:maxConnections=128&maxConnectionsPerHost=32&followRedirects=false
[junit4:junit4]   2> 14735 T2894 oass.SolrDispatchFilter.init SolrDispatchFilter.init() done
[junit4:junit4]   2> 14736 T2894 oascsi.HttpClientUtil.createClient Creating new http client, config:maxConnections=128&maxConnectionsPerHost=32&followRedirects=false
[junit4:junit4]   2> 14749 T2894 oascc.ZkStateReader.updateClusterState Updating cloud state from ZooKeeper... 
[junit4:junit4]   2> 14751 T2894 oasc.AbstractDistribZkTestBase.waitForRecoveriesToFinish Wait for recoveries to finish - collection: collection1 failOnTimeout:true timeout (sec):230
[junit4:junit4]   2> 14753 T2894 oascc.ZkStateReader.updateClusterState Updating cloud state from ZooKeeper... 
[junit4:junit4]   2>  C172_STATE=coll:collection1 core:collection1 props:{shard=shard1, roles=null, state=recovering, core=collection1, collection=collection1, node_name=127.0.0.1:52227_jszv%2Fb, base_url=http://127.0.0.1:52227/jszv/b}
[junit4:junit4]   2> 15351 T2968 C172 P52227 oasc.RecoveryStrategy.doRecovery Attempting to PeerSync from http://127.0.0.1:52221/jszv/b/collection1/ core=collection1 - recoveringAfterStartup=true
[junit4:junit4]   2> 15352 T2968 C172 P52227 oasu.PeerSync.sync PeerSync: core=collection1 url=http://127.0.0.1:52227/jszv/b START replicas=[http://127.0.0.1:52221/jszv/b/collection1/] nUpdates=100
[junit4:junit4]   2> 15352 T2968 C172 P52227 oasu.PeerSync.sync WARNING no frame of reference to tell of we've missed updates
[junit4:junit4]   2> 15353 T2968 C172 P52227 oasc.RecoveryStrategy.doRecovery PeerSync Recovery was not successful - trying replication. core=collection1
[junit4:junit4]   2> 15353 T2968 C172 P52227 oasc.RecoveryStrategy.doRecovery Starting Replication Recovery. core=collection1
[junit4:junit4]   2> 15354 T2968 C172 P52227 oasc.RecoveryStrategy.doRecovery Begin buffering updates. core=collection1
[junit4:junit4]   2> 15354 T2968 C172 P52227 oasu.UpdateLog.bufferUpdates Starting to buffer updates. FSUpdateLog{state=ACTIVE, tlog=null}
[junit4:junit4]   2> 15354 T2968 C172 P52227 oasc.RecoveryStrategy.replicate Attempting to replicate from http://127.0.0.1:52221/jszv/b/collection1/. core=collection1
[junit4:junit4]   2> 15355 T2968 C172 P52227 oascsi.HttpClientUtil.createClient Creating new http client, config:maxConnections=128&maxConnectionsPerHost=32&followRedirects=false
[junit4:junit4]   2> ASYNC  NEW_CORE C174 name=collection1 org.apache.solr.core.SolrCore@4b4d2745 url=http://127.0.0.1:52221/jszv/b/collection1 node=127.0.0.1:52221_jszv%2Fb C174_STATE=coll:collection1 core:collection1 props:{shard=shard1, roles=null, state=active, core=collection1, collection=collection1, node_name=127.0.0.1:52221_jszv%2Fb, base_url=http://127.0.0.1:52221/jszv/b, leader=true}
[junit4:junit4]   2> 15362 T2928 C174 P52221 REQ /get {getVersions=100&distrib=false&wt=javabin&qt=/get&version=2} status=0 QTime=0 
[junit4:junit4]   2> 15367 T2926 C174 P52221 oasu.DirectUpdateHandler2.commit start commit{,optimize=false,openSearcher=false,waitSearcher=true,expungeDeletes=false,softCommit=false}
[junit4:junit4]   2> 15369 T2926 C174 P52221 oasc.CachingDirectoryFactory.close Releasing directory:/Users/jenkins/jenkins-slave/workspace/Lucene-Solr-4.x-MacOSX/solr/build/solr-core/test/J0/./org.apache.solr.cloud.BasicDistributedZkTest-1360812146869/jetty1
[junit4:junit4]   2> 15375 T2926 C174 P52221 oasc.SolrDeletionPolicy.onInit SolrDeletionPolicy.onInit: commits:num=1
[junit4:junit4]   2> 		commit{dir=RateLimitedDirectoryWrapper(NRTCachingDirectory(org.apache.lucene.store.NIOFSDirectory@/Users/jenkins/jenkins-slave/workspace/Lucene-Solr-4.x-MacOSX/solr/build/solr-core/test/J0/org.apache.solr.cloud.BasicDistributedZkTest-1360812146869/jetty1/index lockFactory=org.apache.lucene.store.NativeFSLockFactory@6ec5f7c1; maxCacheMB=48.0 maxMergeSizeMB=4.0)),segFN=segments_1,generation=1,filenames=[segments_1]
[junit4:junit4]   2> 15376 T2926 C174 P52221 oasc.SolrDeletionPolicy.updateCommits newest commit = 1[segments_1]
[junit4:junit4]   2> 15382 T2926 C174 P52221 oasc.SolrDeletionPolicy.onCommit SolrDeletionPolicy.onCommit: commits:num=2
[junit4:junit4]   2> 		commit{dir=RateLimitedDirectoryWrapper(NRTCachingDirectory(org.apache.lucene.store.NIOFSDirectory@/Users/jenkins/jenkins-slave/workspace/Lucene-Solr-4.x-MacOSX/solr/build/solr-core/test/J0/org.apache.solr.cloud.BasicDistributedZkTest-1360812146869/jetty1/index lockFactory=org.apache.lucene.store.NativeFSLockFactory@6ec5f7c1; maxCacheMB=48.0 maxMergeSizeMB=4.0)),segFN=segments_1,generation=1,filenames=[segments_1]
[junit4:junit4]   2> 		commit{dir=RateLimitedDirectoryWrapper(NRTCachingDirectory(org.apache.lucene.store.NIOFSDirectory@/Users/jenkins/jenkins-slave/workspace/Lucene-Solr-4.x-MacOSX/solr/build/solr-core/test/J0/org.apache.solr.cloud.BasicDistributedZkTest-1360812146869/jetty1/index lockFactory=org.apache.lucene.store.NativeFSLockFactory@6ec5f7c1; maxCacheMB=48.0 maxMergeSizeMB=4.0)),segFN=segments_2,generation=2,filenames=[segments_2]
[junit4:junit4]   2> 15383 T2926 C174 P52221 oasc.SolrDeletionPolicy.updateCommits newest commit = 2[segments_2]
[junit4:junit4]   2> 15384 T2926 C174 P52221 oasc.CachingDirectoryFactory.close Releasing directory:/Users/jenkins/jenkins-slave/workspace/Lucene-Solr-4.x-MacOSX/solr/build/solr-core/test/J0/./org.apache.solr.cloud.BasicDistributedZkTest-1360812146869/jetty1
[junit4:junit4]   2> 15384 T2926 C174 P52221 oass.SolrIndexSearcher.<init> Opening Searcher@336c17fe realtime
[junit4:junit4]   2> 15385 T2926 C174 P52221 oasu.DirectUpdateHandler2.commit end_commit_flush
[junit4:junit4]   2> 15385 T2926 C174 P52221 /update {waitSearcher=true&openSearcher=false&commit=true&wt=javabin&commit_end_point=true&version=2&softCommit=false} {commit=} 0 19
[junit4:junit4]   2> 15386 T2968 C172 P52227 oash.ReplicationHandler.inform Commits will be reserved for  10000
[junit4:junit4]   2> 15386 T2968 C172 P52227 oash.SnapPuller.<init>  No value set for 'pollInterval'. Timer Task not started.
[junit4:junit4]   2> 15389 T2929 C174 P52221 oash.ReplicationHandler.inform Commits will be reserved for  10000
[junit4:junit4]   2> 15390 T2929 C174 P52221 REQ /replication {command=indexversion&qt=/replication&wt=javabin&version=2} status=0 QTime=2 
[junit4:junit4]   2> 15391 T2968 C172 P52227 oash.SnapPuller.fetchLatestIndex Master's generation: 2
[junit4:junit4]   2> 15391 T2968 C172 P52227 oash.SnapPuller.fetchLatestIndex Slave's generation: 1
[junit4:junit4]   2> 15391 T2968 C172 P52227 oash.SnapPuller.fetchLatestIndex Starting replication process
[junit4:junit4]   2> 15394 T2930 C174 P52221 oasc.CachingDirectoryFactory.close Releasing directory:/Users/jenkins/jenkins-slave/workspace/Lucene-Solr-4.x-MacOSX/solr/build/solr-core/test/J0/./org.apache.solr.cloud.BasicDistributedZkTest-1360812146869/jetty1
[junit4:junit4]   2> 15395 T2930 C174 P52221 oasc.CachingDirectoryFactory.close Releasing directory:/Users/jenkins/jenkins-slave/workspace/Lucene-Solr-4.x-MacOSX/solr/build/solr-core/test/J0/./org.apache.solr.cloud.BasicDistributedZkTest-1360812146869/jetty1/index
[junit4:junit4]   2> 15396 T2930 C174 P52221 REQ /replication {command=filelist&qt=/replication&wt=javabin&generation=2&version=2} status=0 QTime=3 
[junit4:junit4]   2> 15396 T2968 C172 P52227 oash.SnapPuller.fetchLatestIndex Number of files in latest index in master: 1
[junit4:junit4]   2> 15398 T2968 C172 P52227 oasc.CachingDirectoryFactory.get return new directory for /Users/jenkins/jenkins-slave/workspace/Lucene-Solr-4.x-MacOSX/solr/build/solr-core/test/J0/./org.apache.solr.cloud.BasicDistributedZkTest-1360812146869/jetty3/index.20130214042242257 forceNew:false
[junit4:junit4]   2> 15398 T2968 C172 P52227 oasc.CachingDirectoryFactory.close Releasing directory:/Users/jenkins/jenkins-slave/workspace/Lucene-Solr-4.x-MacOSX/solr/build/solr-core/test/J0/./org.apache.solr.cloud.BasicDistributedZkTest-1360812146869/jetty3
[junit4:junit4]   2> 15399 T2968 C172 P52227 oash.SnapPuller.fetchLatestIndex Starting download to RateLimitedDirectoryWrapper(NRTCachingDirectory(org.apache.lucene.store.NIOFSDirectory@/Users/jenkins/jenkins-slave/workspace/Lucene-Solr-4.x-MacOSX/solr/build/solr-core/test/J0/org.apache.solr.cloud.BasicDistributedZkTest-1360812146869/jetty3/index.20130214042242257 lockFactory=org.apache.lucene.store.NativeFSLockFactory@77f983e0; maxCacheMB=48.0 maxMergeSizeMB=4.0)) fullCopy=true
[junit4:junit4]   2> 15402 T2928 C174 P52221 REQ /replication {file=segments_2&command=filecontent&checksum=true&wt=filestream&qt=/replication&generation=2} status=0 QTime=0 
[junit4:junit4]   2> 15404 T2968 C172 P52227 oasc.CachingDirectoryFactory.close Releasing directory:/Users/jenkins/jenkins-slave/workspace/Lucene-Solr-4.x-MacOSX/solr/build/solr-core/test/J0/./org.apache.solr.cloud.BasicDistributedZkTest-1360812146869/jetty3/index
[junit4:junit4]   2> 15405 T2968 C172 P52227 oash.SnapPuller.fetchLatestIndex Total time taken for download : 0 secs
[junit4:junit4]   2> 15405 T2968 C172 P52227 oash.SnapPuller.modifyIndexProps New index installed. Updating index properties... index=index.20130214042242257
[junit4:junit4]   2> 15406 T2968 C172 P52227 oasc.CachingDirectoryFactory.close Releasing directory:/Users/jenkins/jenkins-slave/workspace/Lucene-Solr-4.x-MacOSX/solr/build/solr-core/test/J0/./org.apache.solr.cloud.BasicDistributedZkTest-1360812146869/jetty3
[junit4:junit4]   2> 15407 T2968 C172 P52227 oasc.CachingDirectoryFactory.close Releasing directory:/Users/jenkins/jenkins-slave/workspace/Lucene-Solr-4.x-MacOSX/solr/build/solr-core/test/J0/./org.apache.solr.cloud.BasicDistributedZkTest-1360812146869/jetty3
[junit4:junit4]   2> 15407 T2968 C172 P52227 oasc.SolrCore.getNewIndexDir New index directory detected: old=./org.apache.solr.cloud.BasicDistributedZkTest-1360812146869/jetty3/index/ new=./org.apache.solr.cloud.BasicDistributedZkTest-1360812146869/jetty3/index.20130214042242257
[junit4:junit4]   2> 15411 T2968 C172 P52227 oasc.SolrDeletionPolicy.onInit SolrDeletionPolicy.onInit: commits:num=1
[junit4:junit4]   2> 		commit{dir=RateLimitedDirectoryWrapper(NRTCachingDirectory(org.apache.lucene.store.NIOFSDirectory@/Users/jenkins/jenkins-slave/workspace/Lucene-Solr-4.x-MacOSX/solr/build/solr-core/test/J0/org.apache.solr.cloud.BasicDistributedZkTest-1360812146869/jetty3/index.20130214042242257 lockFactory=org.apache.lucene.store.NativeFSLockFactory@77f983e0; maxCacheMB=48.0 maxMergeSizeMB=4.0)),segFN=segments_2,generation=2,filenames=[segments_2]
[junit4:junit4]   2> 15412 T2968 C172 P52227 oasc.SolrDeletionPolicy.updateCommits newest commit = 2[segments_2]
[junit4:junit4]   2> 15414 T2968 C172 P52227 oasc.CachingDirectoryFactory.close Releasing directory:/Users/jenkins/jenkins-slave/workspace/Lucene-Solr-4.x-MacOSX/solr/build/solr-core/test/J0/./org.apache.solr.cloud.BasicDistributedZkTest-1360812146869/jetty3
[junit4:junit4]   2> 15414 T2968 C172 P52227 oasu.DefaultSolrCoreState.newIndexWriter Creating new IndexWriter...
[junit4:junit4]   2> 15414 T2968 C172 P52227 oasu.DefaultSolrCoreState.newIndexWriter Waiting until IndexWriter is unused... core=collection1
[junit4:junit4]   2> 15415 T2968 C172 P52227 oasu.DefaultSolrCoreState.newIndexWriter Rollback old IndexWriter... core=collection1
[junit4:junit4]   2> 15415 T2968 C172 P52227 oasc.CachingDirectoryFactory.close Releasing directory:/Users/jenkins/jenkins-slave/workspace/Lucene-Solr-4.x-MacOSX/solr/build/solr-core/test/J0/./org.apache.solr.cloud.BasicDistributedZkTest-1360812146869/jetty3/index.20130214042242257
[junit4:junit4]   2> 15416 T2968 C172 P52227 oasc.CachingDirectoryFactory.close Releasing directory:/Users/jenkins/jenkins-slave/workspace/Lucene-Solr-4.x-MacOSX/solr/build/solr-core/test/J0/./org.apache.solr.cloud.BasicDistributedZkTest-1360812146869/jetty3
[junit4:junit4]   2> 15419 T2968 C172 P52227 oasc.SolrDeletionPolicy.onInit SolrDeletionPolicy.onInit: commits:num=1
[junit4:junit4]   2> 		commit{dir=RateLimitedDirectoryWrapper(NRTCachingDirectory(org.apache.lucene.store.NIOFSDirectory@/Users/jenkins/jenkins-slave/workspace/Lucene-Solr-4.x-MacOSX/solr/build/solr-core/test/J0/org.apache.solr.cloud.BasicDistributedZkTest-1360812146869/jetty3/index.20130214042242257 lockFactory=org.apache.lucene.store.NativeFSLockFactory@77f983e0; maxCacheMB=48.0 maxMergeSizeMB=4.0)),segFN=segments_2,generation=2,filenames=[segments_2]
[junit4:junit4]   2> 15419 T2968 C172 P52227 oasc.SolrDeletionPolicy.updateCommits newest commit = 2[segments_2]
[junit4:junit4]   2> 15419 T2968 C172 P52227 oasu.DefaultSolrCoreState.newIndexWriter New IndexWriter is ready to be used.
[junit4:junit4]   2> 15420 T2968 C172 P52227 oasc.CachingDirectoryFactory.close Releasing directory:/Users/jenkins/jenkins-slave/workspace/Lucene-Solr-4.x-MacOSX/solr/build/solr-core/test/J0/./org.apache.solr.cloud.BasicDistributedZkTest-1360812146869/jetty3
[junit4:junit4]   2> 15420 T2968 C172 P52227 oass.SolrIndexSearcher.<init> Opening Searcher@47c53f54 main
[junit4:junit4]   2> 15422 T2967 oasc.SolrCore.registerSearcher [collection1] Registered new searcher Searcher@47c53f54 main{StandardDirectoryReader(segments_2:1:nrt)}
[junit4:junit4]   2> 15423 T2967 oasc.CachingDirectoryFactory.close Releasing directory:/Users/jenkins/jenkins-slave/workspace/Lucene-Solr-4.x-MacOSX/solr/build/solr-core/test/J0/./org.apache.solr.cloud.BasicDistributedZkTest-1360812146869/jetty3/index
[junit4:junit4]   2> 15423 T2968 C172 P52227 oasu.DirectUpdateHandler2.commit start commit{,optimize=false,openSearcher=false,waitSearcher=false,expungeDeletes=false,softCommit=false}
[junit4:junit4]   2> 15426 T2968 C172 P52227 oasc.SolrDeletionPolicy.onCommit SolrDeletionPolicy.onCommit: commits:num=2
[junit4:junit4]   2> 		commit{dir=RateLimitedDirectoryWrapper(NRTCachingDirectory(org.apache.lucene.store.NIOFSDirectory@/Users/jenkins/jenkins-slave/workspace/Lucene-Solr-4.x-MacOSX/solr/build/solr-core/test/J0/org.apache.solr.cloud.BasicDistributedZkTest-1360812146869/jetty3/index.20130214042242257 lockFactory=org.apache.lucene.store.NativeFSLockFactory@77f983e0; maxCacheMB=48.0 maxMergeSizeMB=4.0)),segFN=segments_2,generation=2,filenames=[segments_2]
[junit4:junit4]   2> 		commit{dir=RateLimitedDirectoryWrapper(NRTCachingDirectory(org.apache.lucene.store.NIOFSDirectory@/Users/jenkins/jenkins-slave/workspace/Lucene-Solr-4.x-MacOSX/solr/build/solr-core/test/J0/org.apache.solr.cloud.BasicDistributedZkTest-1360812146869/jetty3/index.20130214042242257 lockFactory=org.apache.lucene.store.NativeFSLockFactory@77f983e0; maxCacheMB=48.0 maxMergeSizeMB=4.0)),segFN=segments_3,generation=3,filenames=[segments_3]
[junit4:junit4]   2> 15427 T2968 C172 P52227 oasc.SolrDeletionPolicy.updateCommits newest commit = 3[segments_3]
[junit4:junit4]   2> 15428 T2968 C172 P52227 oasc.CachingDirectoryFactory.close Releasing directory:/Users/jenkins/jenkins-slave/workspace/Lucene-Solr-4.x-MacOSX/solr/build/solr-core/test/J0/./org.apache.solr.cloud.BasicDistributedZkTest-1360812146869/jetty3
[junit4:junit4]   2> 15428 T2968 C172 P52227 oasu.DirectUpdateHandler2.commit end_commit_flush
[junit4:junit4]   2> 15428 T2968 C172 P52227 oasc.CachingDirectoryFactory.close Releasing directory:/Users/jenkins/jenkins-slave/workspace/Lucene-Solr-4.x-MacOSX/solr/build/solr-core/test/J0/./org.apache.solr.cloud.BasicDistributedZkTest-1360812146869/jetty3/index.20130214042242257
[junit4:junit4]   2> 15428 T2968 C172 P52227 oasc.CachingDirectoryFactory.close Releasing directory:/Users/jenkins/jenkins-slave/workspace/Lucene-Solr-4.x-MacOSX/solr/build/solr-core/test/J0/./org.apache.solr.cloud.BasicDistributedZkTest-1360812146869/jetty3/index
[junit4:junit4]   2> 15429 T2968 C172 P52227 oasc.RecoveryStrategy.replay No replay needed. core=collection1
[junit4:junit4]   2> 15429 T2968 C172 P52227 oasc.RecoveryStrategy.doRecovery Replication Recovery was successful - registering as Active. core=collection1
[junit4:junit4]   2> 15429 T2968 C172 P52227 oasc.ZkController.publish publishing core=collection1 state=active
[junit4:junit4]   2> 15429 T2968 C172 P52227 oasc.ZkController.publish numShards not found on descriptor - reading it from system property
[junit4:junit4]   2> 15431 T2968 C172 P52227 oasc.RecoveryStrategy.doRecovery Finished recovery process. core=collection1
[junit4:junit4]   2> 15756 T2894 oascc.ZkStateReader.updateClusterState Updating cloud state from ZooKeeper... 
[junit4:junit4]   2> 16033 T2917 oascc.ZkStateReader.updateClusterState Updating cloud state from ZooKeeper... 
[junit4:junit4]   2> 16034 T2917 oasc.Overseer$ClusterStateUpdater.updateState Update state numShards=2 message={
[junit4:junit4]   2> 	  "operation":"state",
[junit4:junit4]   2> 	  "numShards":"2",
[junit4:junit4]   2> 	  "shard":"shard2",
[junit4:junit4]   2> 	  "roles":null,
[junit4:junit4]   2> 	  "state":"recovering",
[junit4:junit4]   2> 	  "core":"collection1",
[junit4:junit4]   2> 	  "collection":"collection1",
[junit4:junit4]   2> 	  "node_name":"127.0.0.1:52231_jszv%2Fb",
[junit4:junit4]   2> 	  "base_url":"http://127.0.0.1:52231/jszv/b"}
[junit4:junit4]   2> 16040 T2917 oasc.Overseer$ClusterStateUpdater.updateState Update state numShards=2 message={
[junit4:junit4]   2> 	  "operation":"state",
[junit4:junit4]   2> 	  "numShards":"2",
[junit4:junit4]   2> 	  "shard":"shard1",
[junit4:junit4]   2> 	  "roles":null,
[junit4:junit4]   2> 	  "state":"active",
[junit4:junit4]   2> 	  "core":"collection1",
[junit4:junit4]   2> 	  "collection":"collection1",
[junit4:junit4]   2> 	  "node_name":"127.0.0.1:52227_jszv%2Fb",
[junit4:junit4]   2> 	  "base_url":"http://127.0.0.1:52227/jszv/b"}
[junit4:junit4]   2> 16046 T2922 oascc.ZkStateReader$2.process A cluster state change: WatchedEvent state:SyncConnected type:NodeDataChanged path:/clusterstate.json, has occurred - updating... (live nodes size: 5)
[junit4:junit4]   2> 16047 T2965 oascc.ZkStateReader$2.process A cluster state change: WatchedEvent state:SyncConnected type:NodeDataChanged path:/clusterstate.json, has occurred - updating... (live nodes size: 5)
[junit4:junit4]   2> 16047 T2935 oascc.ZkStateReader$2.process A cluster state change: WatchedEvent state:SyncConnected type:NodeDataChanged path:/clusterstate.json, has occurred - updating... (live nodes size: 5)
[junit4:junit4]   2> 16047 T2950 oascc.ZkStateReader$2.process A cluster state change: WatchedEvent state:SyncConnected type:NodeDataChanged path:/clusterstate.json, has occurred - updating... (live nodes size: 5)
[junit4:junit4]   2> 16047 T2981 oascc.ZkStateReader$2.process A cluster state change: WatchedEvent state:SyncConnected type:NodeDataChanged path:/clusterstate.json, has occurred - updating... (live nodes size: 5)
[junit4:junit4]   2> 16047 T2916 oascc.ZkStateReader$2.process A cluster state change: WatchedEvent state:SyncConnected type:NodeDataChanged path:/clusterstate.json, has occurred - updating... (live nodes size: 5)
[junit4:junit4]   2> 16760 T2894 oascc.ZkStateReader.updateClusterState Updating cloud state from ZooKeeper... 
[junit4:junit4]   2> 17764 T2894 oascc.ZkStateReader.updateClusterState Updating cloud state from ZooKeeper... 
[junit4:junit4]   2>  C173_STATE=coll:collection1 core:collection1 props:{shard=shard2, roles=null, state=recovering, core=collection1, collection=collection1, node_name=127.0.0.1:52231_jszv%2Fb, base_url=http://127.0.0.1:52231/jszv/b}
[junit4:junit4]   2> 18757 T2984 C173 P52231 oasc.RecoveryStrategy.doRecovery Attempting to PeerSync from http://127.0.0.1:52224/jszv/b/collection1/ core=collection1 - recoveringAfterStartup=true
[junit4:junit4]   2> 18757 T2984 C173 P52231 oasu.PeerSync.sync PeerSync: core=collection1 url=http://127.0.0.1:52231/jszv/b START replicas=[http://127.0.0.1:52224/jszv/b/collection1/] nUpdates=100
[junit4:junit4]   2> 18758 T2984 C173 P52231 oasu.PeerSync.sync WARNING no frame of reference to tell of we've missed updates
[junit4:junit4]   2> 18758 T2984 C173 P52231 oasc.RecoveryStrategy.doRecovery PeerSync Recovery was not successful - trying replication. core=collection1
[junit4:junit4]   2> 18759 T2984 C173 P52231 oasc.RecoveryStrategy.doRecovery Starting Replication Recovery. core=collection1
[junit4:junit4]   2> 18759 T2984 C173 P52231 oasc.RecoveryStrategy.doRecovery Begin buffering updates. core=collection1
[junit4:junit4]   2> 18759 T2984 C173 P52231 oasu.UpdateLog.bufferUpdates Starting to buffer updates. FSUpdateLog{state=ACTIVE, tlog=null}
[junit4:junit4]   2> 18760 T2984 C173 P52231 oasc.RecoveryStrategy.replicate Attempting to replicate from http://127.0.0.1:52224/jszv/b/collection1/. core=collection1
[junit4:junit4]   2> 18760 T2984 C173 P52231 oascsi.HttpClientUtil.createClient Creating new http client, config:maxConnections=128&maxConnectionsPerHost=32&followRedirects=false
[junit4:junit4]   2> ASYNC  NEW_CORE C175 name=collection1 org.apache.solr.core.SolrCore@75a4a89 url=http://127.0.0.1:52224/jszv/b/collection1 node=127.0.0.1:52224_jszv%2Fb C175_STATE=coll:collection1 core:collection1 props:{shard=shard2, roles=null, state=active, core=collection1, collection=collection1, node_name=127.0.0.1:52224_jszv%2Fb, base_url=http://127.0.0.1:52224/jszv/b, leader=true}
[junit4:junit4]   2> 18766 T2945 C175 P52224 REQ /get {getVersions=100&distrib=false&wt=javabin&qt=/get&version=2} status=0 QTime=1 
[junit4:junit4]   2> 18768 T2894 oascc.ZkStateReader.updateClusterState Updating cloud state from ZooKeeper... 
[junit4:junit4]   2> 18769 T2946 C175 P52224 oasu.DirectUpdateHandler2.commit start commit{,optimize=false,openSearcher=false,waitSearcher=true,expungeDeletes=false,softCommit=false}
[junit4:junit4]   2> 18770 T2946 C175 P52224 oasc.CachingDirectoryFactory.close Releasing directory:/Users/jenkins/jenkins-slave/workspace/Lucene-Solr-4.x-MacOSX/solr/build/solr-core/test/J0/./org.apache.solr.cloud.BasicDistributedZkTest-1360812146869/jetty2
[junit4:junit4]   2> 18773 T2946 C175 P52224 oasc.SolrDeletionPolicy.onInit SolrDeletionPolicy.onInit: commits:num=1
[junit4:junit4]   2> 		commit{dir=RateLimitedDirectoryWrapper(NRTCachingDirectory(org.apache.lucene.store.NIOFSDirectory@/Users/jenkins/jenkins-slave/workspace/Lucene-Solr-4.x-MacOSX/solr/build/solr-core/test/J0/org.apache.solr.cloud.BasicDistributedZkTest-1360812146869/jetty2/index lockFactory=org.apache.lucene.store.NativeFSLockFactory@2fbf971e; maxCacheMB=48.0 maxMergeSizeMB=4.0)),segFN=segments_1,generation=1,filenames=[segments_1]
[junit4:junit4]   2> 18774 T2946 C175 P52224 oasc.SolrDeletionPolicy.updateCommits newest commit = 1[segments_1]
[junit4:junit4]   2> 18777 T2946 C175 P52224 oasc.SolrDeletionPolicy.onCommit SolrDeletionPolicy.onCommit: commits:num=2
[junit4:junit4]   2> 		commit{dir=RateLimitedDirectoryWrapper(NRTCachingDirectory(org.apache.lucene.store.NIOFSDirectory@/Users/jenkins/jenkins-slave/workspace/Lucene-Solr-4.x-MacOSX/solr/build/solr-core/test/J0/org.apache.solr.cloud.BasicDistributedZkTest-1360812146869/jetty2/index lockFactory=org.apache.lucene.store.NativeFSLockFactory@2fbf971e; maxCacheMB=48.0 maxMergeSizeMB=4.0)),segFN=segments_1,generation=1,filenames=[segments_1]
[junit4:junit4]   2> 		commit{dir=RateLimitedDirectoryWrapper(NRTCachingDirectory(org.apache.lucene.store.NIOFSDirectory@/Users/jenkins/jenkins-slave/workspace/Lucene-Solr-4.x-MacOSX/solr/build/solr-core/test/J0/org.apache.solr.cloud.BasicDistributedZkTest-1360812146869/jetty2/index lockFactory=org.apache.lucene.store.NativeFSLockFactory@2fbf971e; maxCacheMB=48.0 maxMergeSizeMB=4.0)),segFN=segments_2,generation=2,filenames=[segments_2]
[junit4:junit4]   2> 18777 T2946 C175 P52224 oasc.SolrDeletionPolicy.updateCommits newest commit = 2[segments_2]
[junit4:junit4]   2> 18778 T2946 C175 P52224 oasc.CachingDirectoryFactory.close Releasing directory:/Users/jenkins/jenkins-slave/workspace/Lucene-Solr-4.x-MacOSX/solr/build/solr-core/test/J0/./org.apache.solr.cloud.BasicDistributedZkTest-1360812146869/jetty2
[junit4:junit4]   2> 18778 T2946 C175 P52224 oass.SolrIndexSearcher.<init> Opening Searcher@3f1b2d11 realtime
[junit4:junit4]   2> 18779 T2946 C175 P52224 oasu.DirectUpdateHandler2.commit end_commit_flush
[junit4:junit4]   2> 18779 T2946 C175 P52224 /update {waitSearcher=true&openSearcher=false&commit=true&wt=javabin&commit_end_point=true&version=2&softCommit=false} {commit=} 0 10
[junit4:junit4]   2> 18780 T2984 C173 P52231 oash.ReplicationHandler.inform Commits will be reserved for  10000
[junit4:junit4]   2> 18780 T2984 C173 P52231 oash.SnapPuller.<init>  No value set for 'pollInterval'. Timer Task not started.
[junit4:junit4]   2> 18783 T2943 C175 P52224 oash.ReplicationHandler.inform Commits will be reserved for  10000
[junit4:junit4]   2> 18784 T2943 C175 P52224 REQ /replication {command=indexversion&qt=/replication&wt=javabin&version=2} status=0 QTime=2 
[junit4:junit4]   2> 18784 T2984 C173 P52231 oash.SnapPuller.fetchLatestIndex Master's generation: 2
[junit4:junit4]   2> 18784 T2984 C173 P52231 oash.SnapPuller.fetchLatestIndex Slave's generation: 1
[junit4:junit4]   2> 18785 T2984 C173 P52231 oash.SnapPuller.fetchLatestIndex Starting replication process
[junit4:junit4]   2> 18788 T2944 C175 P52224 oasc.CachingDirectoryFactory.close Releasing directory:/Users/jenkins/jenkins-slave/workspace/Lucene-Solr-4.x-MacOSX/solr/build/solr-core/test/J0/./org.apache.solr.cloud.BasicDistributedZkTest-1360812146869/jetty2
[junit4:junit4]   2> 18789 T2944 C175 P52224 oasc.CachingDirectoryFactory.close Releasing directory:/Users/jenkins/jenkins-slave/workspace/Lucene-Solr-4.x-MacOSX/solr/build/solr-core/test/J0/./org.apache.solr.cloud.BasicDistributedZkTest-1360812146869/jetty2/index
[junit4:junit4]   2> 18790 T2944 C175 P52224 REQ /replication {command=filelist&qt=/replication&wt=javabin&generation=2&version=2} status=0 QTime=2 
[junit4:junit4]   2> 18790 T2984 C173 P52231 oash.SnapPuller.fetchLatestIndex Number of files in latest index in master: 1
[junit4:junit4]   2> 18791 T2984 C173 P52231 oasc.CachingDirectoryFactory.get return new directory for /Users/jenkins/jenkins-slave/workspace/Lucene-Solr-4.x-MacOSX/solr/build/solr-core/test/J0/./org.apache.solr.cloud.BasicDistributedZkTest-1360812146869/jetty4/index.20130214042245651 forceNew:false
[junit4:junit4]   2> 18792 T2984 C173 P52231 oasc.CachingDirectoryFactory.close Releasing directory:/Users/jenkins/jenkins-slave/workspace/Lucene-Solr-4.x-MacOSX/solr/build/solr-core/test/J0/./org.apache.solr.cloud.BasicDistributedZkTest-1360812146869/jetty4
[junit4:junit4]   2> 18792 T2984 C173 P52231 oash.SnapPuller.fetchLatestIndex Starting download to RateLimitedDirectoryWrapper(NRTCachingDirectory(org.apache.lucene.store.NIOFSDirectory@/Users/jenkins/jenkins-slave/workspace/Lucene-Solr-4.x-MacOSX/solr/build/solr-core/test/J0/org.apache.solr.cloud.BasicDistributedZkTest-1360812146869/jetty4/index.20130214042245651 lockFactory=org.apache.lucene.store.NativeFSLockFactory@538e653f; maxCacheMB=48.0 maxMergeSizeMB=4.0)) fullCopy=true
[junit4:junit4]   2> 18798 T2945 C175 P52224 REQ /replication {file=segments_2&command=filecontent&checksum=true&wt=filestream&qt=/replication&generation=2} status=0 QTime=0 
[junit4:junit4]   2> 18800 T2984 C173 P52231 oasc.CachingDirectoryFactory.close Releasing directory:/Users/jenkins/jenkins-slave/workspace/Lucene-Solr-4.x-MacOSX/solr/build/solr-core/test/J0/./org.apache.solr.cloud.BasicDistributedZkTest-1360812146869/jetty4/index
[junit4:junit4]   2> 18800 T2984 C173 P52231 oash.SnapPuller.fetchLatestIndex Total time taken for download : 0 secs
[junit4:junit4]   2> 18801 T2984 C173 P52231 oash.SnapPuller.modifyIndexProps New index installed. Updating index properties... index=index.20130214042245651
[junit4:junit4]   2> 18802 T2984 C173 P52231 oasc.CachingDirectoryFactory.close Releasing directory:/Users/jenkins/jenkins-slave/workspace/Lucene-Solr-4.x-MacOSX/solr/build/solr-core/test/J0/./org.apache.solr.cloud.BasicDistributedZkTest-1360812146869/jetty4
[junit4:junit4]   2> 18802 T2984 C173 P52231 oasc.CachingDirectoryFactory.close Releasing directory:/Users/jenkins/jenkins-slave/workspace/Lucene-Solr-4.x-MacOSX/solr/build/solr-core/test/J0/./org.apache.solr.cloud.BasicDistributedZkTest-1360812146869/jetty4
[junit4:junit4]   2> 18803 T2984 C173 P52231 oasc.SolrCore.getNewIndexDir New index directory detected: old=./org.apache.solr.cloud.BasicDistributedZkTest-1360812146869/jetty4/index/ new=./org.apache.solr.cloud.BasicDistributedZkTest-1360812146869/jetty4/index.20130214042245651
[junit4:junit4]   2> 18805 T2984 C173 P52231 oasc.SolrDeletionPolicy.onInit SolrDeletionPolicy.onInit: commits:num=1
[junit4:junit4]   2> 		commit{dir=RateLimitedDirectoryWrapper(NRTCachingDirectory(org.apache.lucene.store.NIOFSDirectory@/Users/jenkins/jenkins-slave/workspace/Lucene-Solr-4.x-MacOSX/solr/build/solr-core/test/J0/org.apache.solr.cloud.BasicDistributedZkTest-1360812146869/jetty4/index.20130214042245651 lockFactory=org.apache.lucene.store.NativeFSLockFactory@538e653f; maxCacheMB=48.0 maxMergeSizeMB=4.0)),segFN=segments_2,generation=2,filenames=[segments_2]
[junit4:junit4]   2> 18806 T2984 C173 P52231 oasc.SolrDeletionPolicy.updateCommits newest commit = 2[segments_2]
[junit4:junit4]   2> 18807 T2984 C173 P52231 oasc.CachingDirectoryFactory.close Releasing directory:/Users/jenkins/jenkins-slave/workspace/Lucene-Solr-4.x-MacOSX/solr/build/solr-core/test/J0/./org.apache.solr.cloud.BasicDistributedZkTest-1360812146869/jetty4
[junit4:junit4]   2> 18807 T2984 C173 P52231 oasu.DefaultSolrCoreState.newIndexWriter Creating new IndexWriter...
[junit4:junit4]   2> 18807 T2984 C173 P52231 oasu.DefaultSolrCoreState.newIndexWriter Waiting until IndexWriter is unused... core=collection1
[junit4:junit4]   2> 18808 T2984 C173 P52231 oasu.DefaultSolrCoreState.newIndexWriter Rollback old IndexWriter... core=collection1
[junit4:junit4]   2> 18808 T2984 C173 P52231 oasc.CachingDirectoryFactory.close Releasing directory:/Users/jenkins/jenkins-slave/workspace/Lucene-Solr-4.x-MacOSX/solr/build/solr-core/test/J0/./org.apache.solr.cloud.BasicDistributedZkTest-1360812146869/jetty4/index.20130214042245651
[junit4:junit4]   2> 18809 T2984 C173 P52231 oasc.CachingDirectoryFactory.close Releasing directory:/Users/jenkins/jenkins-slave/workspace/Lucene-Solr-4.x-MacOSX/solr/build/solr-core/test/J0/./org.apache.solr.cloud.BasicDistributedZkTest-1360812146869/jetty4
[junit4:junit4]   2> 18812 T2984 C173 P52231 oasc.SolrDeletionPolicy.onInit SolrDeletionPolicy.onInit: commits:num=1
[junit4:junit4]   2> 		commit{dir=RateLimitedDirectoryWrapper(NRTCachingDirectory(org.apache.lucene.store.NIOFSDirectory@/Users/jenkins/jenkins-slave/workspace/Lucene-Solr-4.x-MacOSX/solr/build/solr-core/test/J0/org.apache.solr.cloud.BasicDistributedZkTest-1360812146869/jetty4/index.20130214042245651 lockFactory=org.apache.lucene.store.NativeFSLockFactory@538e653f; maxCacheMB=48.0 maxMergeSizeMB=4.0)),segFN=segments_2,generation=2,filenames=[segments_2]
[junit4:junit4]   2> 18812 T2984 C173 P52231 oasc.SolrDeletionPolicy.updateCommits newest commit = 2[segments_2]
[junit4:junit4]   2> 18812 T2984 C173 P52231 oasu.DefaultSolrCoreState.newIndexWriter New IndexWriter is ready to be used.
[junit4:junit4]   2> 18813 T2984 C173 P52231 oasc.CachingDirectoryFactory.close Releasing directory:/Users/jenkins/jenkins-slave/workspace/Lucene-Solr-4.x-MacOSX/solr/build/solr-core/test/J0/./org.apache.solr.cloud.BasicDistributedZkTest-1360812146869/jetty4
[junit4:junit4]   2> 18813 T2984 C173 P52231 oass.SolrIndexSearcher.<init> Opening Searcher@2428d15 main
[junit4:junit4]   2> 18815 T2983 oasc.SolrCore.registerSearcher [collection1] Registered new searcher Searcher@2428d15 main{StandardDirectoryReader(segments_2:1:nrt)}
[junit4:junit4]   2> 18816 T2983 oasc.CachingDirectoryFactory.close Releasing directory:/Users/jenkins/jenkins-slave/workspace/Lucene-Solr-4.x-MacOSX/solr/build/solr-core/test/J0/./org.apache.solr.cloud.BasicDistributedZkTest-1360812146869/jetty4/index
[junit4:junit4]   2> 18816 T2984 C173 P52231 oasu.DirectUpdateHandler2.commit start commit{,optimize=false,openSearcher=false,waitSearcher=false,expungeDeletes=false,softCommit=false}
[junit4:junit4]   2> 18819 T2984 C173 P52231 oasc.SolrDeletionPolicy.onCommit SolrDeletionPolicy.onCommit: commits:num=2
[junit4:junit4]   2> 		commit{dir=RateLimitedDirectoryWrapper(NRTCachingDirectory(org.apache.lucene.store.NIOFSDirectory@/Users/jenkins/jenkins-slave/workspace/Lucene-Solr-4.x-MacOSX/solr/build/solr-core/test/J0/org.apache.solr.cloud.BasicDistributedZkTest-1360812146869/jetty4/index.20130214042245651 lockFactory=org.apache.lucene.store.NativeFSLockFactory@538e653f; maxCacheMB=48.0 maxMergeSizeMB=4.0)),segFN=segments_2,generation=2,filenames=[segments_2]
[junit4:junit4]   2> 		commit{dir=RateLimitedDirectoryWrapper(NRTCachingDirectory(org.apache.lucene.store.NIOFSDirectory@/Users/jenkins/jenkins-slave/workspace/Lucene-Solr-4.x-MacOSX/solr/build/solr-core/test/J0/org.apache.solr.cloud.BasicDistributedZkTest-1360812146869/jetty4/index.20130214042245651 lockFactory=org.apache.lucene.store.NativeFSLockFactory@538e653f; maxCacheMB=48.0 maxMergeSizeMB=4.0)),segFN=segments_3,generation=3,filenames=[segments_3]
[junit4:junit4]   2> 18819 T2984 C173 P52231 oasc.SolrDeletionPolicy.updateCommits newest commit = 3[segments_3]
[junit4:junit4]   2> 18820 T2984 C173 P52231 oasc.CachingDirectoryFactory.close Releasing directory:/Users/jenkins/jenkins-slave/workspace/Lucene-Solr-4.x-MacOSX/solr/build/solr-core/test/J0/./org.apache.solr.cloud.BasicDistributedZkTest-1360812146869/jetty4
[junit4:junit4]   2> 18820 T2984 C173 P52231 oasu.DirectUpdateHandler2.commit end_commit_flush
[junit4:junit4]   2> 18821 T2984 C173 P52231 oasc.CachingDirectoryFactory.close Releasing directory:/Users/jenkins/jenkins-slave/workspace/Lucene-Solr-4.x-MacOSX/solr/build/solr-core/test/J0/./org.apache.solr.cloud.BasicDistributedZkTest-1360812146869/jetty4/index.20130214042245651
[junit4:junit4]   2> 18821 T2984 C173 P52231 oasc.CachingDirectoryFactory.close Releasing directory:/Users/jenkins/jenkins-slave/workspace/Lucene-Solr-4.x-MacOSX/solr/build/solr-core/test/J0/./org.apache.solr.cloud.BasicDistributedZkTest-1360812146869/jetty4/index
[junit4:junit4]   2> 18821 T2984 C173 P52231 oasc.RecoveryStrategy.replay No replay needed. core=collection1
[junit4:junit4]   2> 18822 T2984 C173 P52231 oasc.RecoveryStrategy.doRecovery Replication Recovery was successful - registering as Active. core=collection1
[junit4:junit4]   2> 18822 T2984 C173 P52231 oasc.ZkController.publish publishing core=collection1 state=active
[junit4:junit4]   2> 18822 T2984 C173 P52231 oasc.ZkController.publish numShards not found on descriptor - reading it from system property
[junit4:junit4]   2> 18824 T2984 C173 P52231 oasc.RecoveryStrategy.doRecovery Finished recovery process. core=collection1
[junit4:junit4]   2> 19070 T2917 oascc.ZkStateReader.updateClusterState Updating cloud state from ZooKeeper... 
[junit4:junit4]   2> 19071 T2917 oasc.Overseer$ClusterStateUpdater.updateState Update state numShards=2 message={
[junit4:junit4]   2> 	  "operation":"state",
[junit4:junit4]   2> 	  "numShards":"2",
[junit4:junit4]   2> 	  "shard":"shard2",
[junit4:junit4]   2> 	  "roles":null,
[junit4:junit4]   2> 	  "state":"active",
[junit4:junit4]   2> 	  "core":"collection1",
[junit4:junit4]   2> 	  "collection":"collection1",
[junit4:junit4]   2> 	  "node_name":"127.0.0.1:52231_jszv%2Fb",
[junit4:junit4]   2> 	  "base_url":"http://127.0.0.1:52231/jszv/b"}
[junit4:junit4]   2> 19079 T2981 oascc.ZkStateReader$2.process A cluster state change: WatchedEvent state:SyncConnected type:NodeDataChanged path:/clusterstate.json, has occurred - updating... (live nodes size: 5)
[junit4:junit4]   2> 19079 T2922 oascc.ZkStateReader$2.process A cluster state change: WatchedEvent state:SyncConnected type:NodeDataChanged path:/clusterstate.json, has occurred - updating... (live nodes size: 5)
[junit4:junit4]   2> 19079 T2950 oascc.ZkStateReader$2.process A cluster state change: WatchedEvent state:SyncConnected type:NodeDataChanged path:/clusterstate.json, has occurred - updating... (live nodes size: 5)
[junit4:junit4]   2> 19079 T2916 oascc.ZkStateReader$2.process A cluster state change: WatchedEvent state:SyncConnected type:NodeDataChanged path:/clusterstate.json, has occurred - updating... (live nodes size: 5)
[junit4:junit4]   2> 19079 T2935 oascc.ZkStateReader$2.process A cluster state change: WatchedEvent state:SyncConnected type:NodeDataChanged path:/clusterstate.json, has occurred - updating... (live nodes size: 5)
[junit4:junit4]   2> 19079 T2965 oascc.ZkStateReader$2.process A cluster state change: WatchedEvent state:SyncConnected type:NodeDataChanged path:/clusterstate.json, has occurred - updating... (live nodes size: 5)
[junit4:junit4]   2> 19772 T2894 oascc.ZkStateReader.updateClusterState Updating cloud state from ZooKeeper... 
[junit4:junit4]   2> 19774 T2894 oasc.AbstractDistribZkTestBase.waitForRecoveriesToFinish Recoveries finished - collection: collection1
[junit4:junit4]   2> ASYNC  NEW_CORE C176 name=collection1 org.apache.solr.core.SolrCore@101fa401 url=http://127.0.0.1:52217/jszv/b/collection1 node=127.0.0.1:52217_jszv%2Fb C176_STATE=coll:control_collection core:collection1 props:{shard=shard1, roles=null, state=active, core=collection1, collection=control_collection, node_name=127.0.0.1:52217_jszv%2Fb, base_url=http://127.0.0.1:52217/jszv/b, leader=true}
[junit4:junit4]   2> 19785 T2911 C176 P52217 oasc.CachingDirectoryFactory.close Releasing directory:/Users/jenkins/jenkins-slave/workspace/Lucene-Solr-4.x-MacOSX/solr/build/solr-core/test/J0/./org.apache.solr.cloud.BasicDistributedZkTest-1360812146869/control/data
[junit4:junit4]   2> 19787 T2911 C176 P52217 oasc.SolrDeletionPolicy.onInit SolrDeletionPolicy.onInit: commits:num=1
[junit4:junit4]   2> 		commit{dir=RateLimitedDirectoryWrapper(NRTCachingDirectory(org.apache.lucene.store.NIOFSDirectory@/Users/jenkins/jenkins-slave/workspace/Lucene-Solr-4.x-MacOSX/solr/build/solr-core/test/J0/org.apache.solr.cloud.BasicDistributedZkTest-1360812146869/control/data/index lockFactory=org.apache.lucene.store.NativeFSLockFactory@31ffde0c; maxCacheMB=48.0 maxMergeSizeMB=4.0)),segFN=segments_1,generation=1,filenames=[segments_1]
[junit4:junit4]   2> 19788 T2911 C176 P52217 oasc.SolrDeletionPolicy.updateCommits newest commit = 1[segments_1]
[junit4:junit4]   2> 19790 T2911 C176 P52217 oasc.CachingDirectoryFactory.close Releasing directory:/Users/jenkins/jenkins-slave/workspace/Lucene-Solr-4.x-MacOSX/solr/build/solr-core/test/J0/./org.apache.solr.cloud.BasicDistributedZkTest-1360812146869/control/data
[junit4:junit4]   2> 19790 T2911 C176 P52217 oass.SolrIndexSearcher.<init> Opening Searcher@49c9c976 realtime
[junit4:junit4]   2> 19791 T2911 C176 P52217 /update {wt=javabin&version=2} {deleteByQuery=*:* (-1426914978450898944)} 0 8
[junit4:junit4]   2> 19800 T2942 C175 P52224 oasc.CachingDirectoryFactory.close Releasing directory:/Users/jenkins/jenkins-slave/workspace/Lucene-Solr-4.x-MacOSX/solr/build/solr-core/test/J0/./org.apache.solr.cloud.BasicDistributedZkTest-1360812146869/jetty2
[junit4:junit4]   2> 19807 T2930 C174 P52221 oasc.CachingDirectoryFactory.close Releasing directory:/Users/jenkins/jenkins-slave/workspace/Lucene-Solr-4.x-MacOSX/solr/build/solr-core/test/J0/./org.apache.solr.cloud.BasicDistributedZkTest-1360812146869/jetty1
[junit4:junit4]   2>  C173_STATE=coll:collection1 core:collection1 props:{shard=shard2, roles=null, state=active, core=collection1, collection=collection1, node_name=127.0.0.1:52231_jszv%2Fb, base_url=http://127.0.0.1:52231/jszv/b}
[junit4:junit4]   2> 19827 T2977 C173 P52231 oasc.CachingDirectoryFactory.close Releasing directory:/Users/jenkins/jenkins-slave/workspace/Lucene-Solr-4.x-MacOSX/solr/build/solr-core/test/J0/./org.apache.solr.cloud.BasicDistributedZkTest-1360812146869/jetty4
[junit4:junit4]   2> 19828 T2977 C173 P52231 /update {update.distrib=FROMLEADER&_version_=-1426914978466627584&update.from=http://127.0.0.1:52224/jszv/b/collection1/&wt=javabin&version=2} {deleteByQuery=*:* (-1426914978466627584)} 0 4
[junit4:junit4]   2>  C172_STATE=coll:collection1 core:collection1 props:{shard=shard1, roles=null, state=active, core=collection1, collection=collection1, node_name=127.0.0.1:52227_jszv%2Fb, base_url=http://127.0.0.1:52227/jszv/b}
[junit4:junit4]   2> 19831 T2956 C172 P52227 oasc.CachingDirectoryFactory.close Releasing directory:/Users/jenkins/jenkins-slave/workspace/Lucene-Solr-4.x-MacOSX/solr/build/solr-core/test/J0/./org.apache.solr.cloud.BasicDistributedZkTest-1360812146869/jetty3
[junit4:junit4]   2> 19833 T2956 C172 P52227 /update {update.distrib=FROMLEADER&_version_=-1426914978472919040&update.from=http://127.0.0.1:52221/jszv/b/collection1/&wt=javabin&version=2} {deleteByQuery=*:* (-1426914978472919040)} 0 4
[junit4:junit4]   2> 19834 T2930 C174 P52221 /update {update.distrib=TOLEADER&wt=javabin&version=2} {deleteByQuery=*:* (-1426914978472919040)} 0 29
[junit4:junit4]   2> 19835 T2942 C175 P52224 /update {wt=javabin&version=2} {deleteByQuery=*:* (-1426914978466627584)} 0 37
[junit4:junit4]   2> 19841 T2912 C176 P52217

[...truncated too long message...]

stemPropertiesInvariantRule$1.evaluate(SystemPropertiesInvariantRule.java:55)
[junit4:junit4]    > 	at com.carrotsearch.randomizedtesting.rules.NoShadowingOrOverridesOnMethodsRule$1.evaluate(NoShadowingOrOverridesOnMethodsRule.java:39)
[junit4:junit4]    > 	at com.carrotsearch.randomizedtesting.rules.NoShadowingOrOverridesOnMethodsRule$1.evaluate(NoShadowingOrOverridesOnMethodsRule.java:39)
[junit4:junit4]    > 	at com.carrotsearch.randomizedtesting.rules.StatementAdapter.evaluate(StatementAdapter.java:36)
[junit4:junit4]    > 	at org.apache.lucene.util.TestRuleAssertionsRequired$1.evaluate(TestRuleAssertionsRequired.java:43)
[junit4:junit4]    > 	at org.apache.lucene.util.TestRuleMarkFailure$1.evaluate(TestRuleMarkFailure.java:48)
[junit4:junit4]    > 	at org.apache.lucene.util.TestRuleIgnoreAfterMaxFailures$1.evaluate(TestRuleIgnoreAfterMaxFailures.java:70)
[junit4:junit4]    > 	at org.apache.lucene.util.TestRuleIgnoreTestSuites$1.evaluate(TestRuleIgnoreTestSuites.java:55)
[junit4:junit4]    > 	at com.carrotsearch.randomizedtesting.rules.StatementAdapter.evaluate(StatementAdapter.java:36)
[junit4:junit4]    > 	at com.carrotsearch.randomizedtesting.ThreadLeakControl$StatementRunner.run(ThreadLeakControl.java:358)
[junit4:junit4]    > 	at java.lang.Thread.run(Thread.java:722)
[junit4:junit4]    > Caused by: java.net.SocketException: Invalid argument
[junit4:junit4]    > 	at java.net.SocketInputStream.socketRead0(Native Method)
[junit4:junit4]    > 	at java.net.SocketInputStream.read(SocketInputStream.java:150)
[junit4:junit4]    > 	at java.net.SocketInputStream.read(SocketInputStream.java:121)
[junit4:junit4]    > 	at org.apache.http.impl.io.AbstractSessionInputBuffer.fillBuffer(AbstractSessionInputBuffer.java:166)
[junit4:junit4]    > 	at org.apache.http.impl.io.SocketInputBuffer.fillBuffer(SocketInputBuffer.java:90)
[junit4:junit4]    > 	at org.apache.http.impl.io.AbstractSessionInputBuffer.readLine(AbstractSessionInputBuffer.java:281)
[junit4:junit4]    > 	at org.apache.http.impl.conn.DefaultHttpResponseParser.parseHead(DefaultHttpResponseParser.java:92)
[junit4:junit4]    > 	at org.apache.http.impl.conn.DefaultHttpResponseParser.parseHead(DefaultHttpResponseParser.java:62)
[junit4:junit4]    > 	at org.apache.http.impl.io.AbstractMessageParser.parse(AbstractMessageParser.java:254)
[junit4:junit4]    > 	at org.apache.http.impl.AbstractHttpClientConnection.receiveResponseHeader(AbstractHttpClientConnection.java:289)
[junit4:junit4]    > 	at org.apache.http.impl.conn.DefaultClientConnection.receiveResponseHeader(DefaultClientConnection.java:252)
[junit4:junit4]    > 	at org.apache.http.impl.conn.ManagedClientConnectionImpl.receiveResponseHeader(ManagedClientConnectionImpl.java:191)
[junit4:junit4]    > 	at org.apache.http.protocol.HttpRequestExecutor.doReceiveResponse(HttpRequestExecutor.java:300)
[junit4:junit4]    > 	at org.apache.http.protocol.HttpRequestExecutor.execute(HttpRequestExecutor.java:127)
[junit4:junit4]    > 	at org.apache.http.impl.client.DefaultRequestDirector.tryExecute(DefaultRequestDirector.java:717)
[junit4:junit4]    > 	at org.apache.http.impl.client.DefaultRequestDirector.execute(DefaultRequestDirector.java:522)
[junit4:junit4]    > 	at org.apache.http.impl.client.AbstractHttpClient.execute(AbstractHttpClient.java:906)
[junit4:junit4]    > 	at org.apache.http.impl.client.AbstractHttpClient.execute(AbstractHttpClient.java:805)
[junit4:junit4]    > 	at org.apache.http.impl.client.AbstractHttpClient.execute(AbstractHttpClient.java:784)
[junit4:junit4]    > 	at org.apache.solr.client.solrj.impl.HttpSolrServer.request(HttpSolrServer.java:353)
[junit4:junit4]    > 	... 44 more
[junit4:junit4]   2> 897226 T2894 oas.SolrTestCaseJ4.deleteCore ###deleteCore
[junit4:junit4]   2> NOTE: test params are: codec=Lucene42: {n_f1=PostingsFormat(name=NestedPulsing), foo_b=PostingsFormat(name=Memory doPackFST= true), cat=PostingsFormat(name=Memory doPackFST= false), foo_d=Lucene41(blocksize=128), foo_f=PostingsFormat(name=Memory doPackFST= true), n_tl1=PostingsFormat(name=NestedPulsing), n_d1=PostingsFormat(name=Memory doPackFST= false), rnd_b=Lucene41(blocksize=128), intDefault=PostingsFormat(name=NestedPulsing), n_td1=PostingsFormat(name=NestedPulsing), timestamp=PostingsFormat(name=Memory doPackFST= false), id=Lucene41(blocksize=128), range_facet_sl=Lucene41(blocksize=128), range_facet_si=PostingsFormat(name=Memory doPackFST= false), oddField_s=Lucene41(blocksize=128), sequence_i=Lucene41(blocksize=128), name=Lucene41(blocksize=128), foo_i=PostingsFormat(name=NestedPulsing), regex_dup_B_s=PostingsFormat(name=Memory doPackFST= false), multiDefault=PostingsFormat(name=Memory doPackFST= false), n_tf1=PostingsFormat(name=Memory doPackFST= false), n_dt1=PostingsFormat(name=NestedPulsing), genre_s=Lucene41(blocksize=128), author_t=PostingsFormat(name=NestedPulsing), n_ti1=Lucene41(blocksize=128), range_facet_l=PostingsFormat(name=Memory doPackFST= false), text=PostingsFormat(name=Memory doPackFST= true), _version_=PostingsFormat(name=NestedPulsing), val_i=Lucene41(blocksize=128), SubjectTerms_mfacet=PostingsFormat(name=NestedPulsing), series_t=PostingsFormat(name=NestedPulsing), a_t=PostingsFormat(name=Memory doPackFST= false), n_tdt1=PostingsFormat(name=NestedPulsing), regex_dup_A_s=PostingsFormat(name=Memory doPackFST= true), price=PostingsFormat(name=Memory doPackFST= true), other_tl1=PostingsFormat(name=NestedPulsing), n_l1=PostingsFormat(name=Memory doPackFST= false), a_si=PostingsFormat(name=NestedPulsing), inStock=PostingsFormat(name=Memory doPackFST= true)}, docValues:{}, sim=DefaultSimilarity, locale=ar_KW, timezone=Europe/Madrid
[junit4:junit4]   2> NOTE: Mac OS X 10.8.2 x86_64/Oracle Corporation 1.7.0_10 (64-bit)/cpus=2,threads=1,free=77965160,total=202682368
[junit4:junit4]   2> NOTE: All tests run in this JVM: [TestLuceneMatchVersion, TestSearchPerf, RequestHandlersTest, TestRemoteStreaming, TermVectorComponentTest, DirectUpdateHandlerTest, IndexSchemaRuntimeFieldTest, TestFiltering, IndexBasedSpellCheckerTest, TestSystemIdResolver, TestReplicationHandler, TestFaceting, TestUpdate, TestFoldingMultitermQuery, TestLMJelinekMercerSimilarityFactory, SolrRequestParserTest, TestCollationKeyRangeQueries, QueryElevationComponentTest, BadIndexSchemaTest, RegexBoostProcessorTest, TestIndexSearcher, TestSolrJ, TestQueryTypes, DOMUtilTest, FileBasedSpellCheckerTest, TermVectorComponentDistributedTest, WordBreakSolrSpellCheckerTest, TestCharFilters, FastVectorHighlighterTest, TestSolrXMLSerializer, TestDocumentBuilder, DateFieldTest, DisMaxRequestHandlerTest, ZkCLITest, TestXIncludeConfig, TestReload, TestReversedWildcardFilterFactory, StatsComponentTest, TestPseudoReturnFields, FieldMutatingUpdateProcessorTest, UpdateRequestProcessorFactoryTest, AlternateDirectoryTest, TestPhraseSuggestions, LoggingHandlerTest, TestWordDelimiterFilterFactory, BinaryUpdateRequestHandlerTest, TestSort, TestBM25SimilarityFactory, HighlighterConfigTest, UUIDFieldTest, ShardRoutingCustomTest, URLClassifyProcessorTest, TestRandomFaceting, TestLFUCache, NoCacheHeaderTest, TestDistributedSearch, TestStressReorder, TestValueSourceCache, DistanceFunctionTest, TestJmxMonitoredMap, SchemaVersionSpecificBehaviorTest, TestIndexingPerformance, SearchHandlerTest, TestPartialUpdateDeduplication, MinimalSchemaTest, CopyFieldTest, DirectSolrConnectionTest, NotRequiredUniqueKeyTest, UniqFieldsUpdateProcessorFactoryTest, DocumentAnalysisRequestHandlerTest, NumericFieldsTest, TestExtendedDismaxParser, TestFastOutputStream, QueryEqualityTest, MBeansHandlerTest, TestHashPartitioner, RAMDirectoryFactoryTest, CacheHeaderTest, MoreLikeThisHandlerTest, FieldAnalysisRequestHandlerTest, TestPropInjectDefaults, FullSolrCloudDistribCmdsTest, SynonymTokenizerTest, SortByFunctionTest, HighlighterTest, ShardRoutingTest, TestWriterPerf, TestCodecSupport, OutputWriterTest, XmlUpdateRequestHandlerTest, SimpleFacetsTest, TestArbitraryIndexDir, TestDefaultSimilarityFactory, LegacyHTMLStripCharFilterTest, SystemInfoHandlerTest, TestCSVLoader, TestFunctionQuery, TestSolr4Spatial, TestLMDirichletSimilarityFactory, TestNumberUtils, ZkControllerTest, PolyFieldTest, BasicDistributedZk2Test, TestComponentsName, ScriptEngineTest, TestCSVResponseWriter, IndexReaderFactoryTest, TestStressLucene, ChaosMonkeySafeLeaderTest, CoreAdminHandlerTest, TestQuerySenderListener, CircularListTest, TestCoreContainer, ReturnFieldsTest, DistributedSpellCheckComponentTest, TestMergePolicyConfig, EchoParamsTest, LeaderElectionTest, TestLRUCache, DocumentBuilderTest, SolrIndexConfigTest, TestPHPSerializedResponseWriter, BasicDistributedZkTest]
[junit4:junit4] Completed in 897.62s, 1 test, 1 error <<< FAILURES!

[...truncated 386 lines...]
BUILD FAILED
/Users/jenkins/jenkins-slave/workspace/Lucene-Solr-4.x-MacOSX/build.xml:381: The following error occurred while executing this line:
/Users/jenkins/jenkins-slave/workspace/Lucene-Solr-4.x-MacOSX/build.xml:361: The following error occurred while executing this line:
/Users/jenkins/jenkins-slave/workspace/Lucene-Solr-4.x-MacOSX/build.xml:39: The following error occurred while executing this line:
/Users/jenkins/jenkins-slave/workspace/Lucene-Solr-4.x-MacOSX/solr/build.xml:183: The following error occurred while executing this line:
/Users/jenkins/jenkins-slave/workspace/Lucene-Solr-4.x-MacOSX/solr/common-build.xml:447: The following error occurred while executing this line:
/Users/jenkins/jenkins-slave/workspace/Lucene-Solr-4.x-MacOSX/lucene/common-build.xml:1202: The following error occurred while executing this line:
/Users/jenkins/jenkins-slave/workspace/Lucene-Solr-4.x-MacOSX/lucene/common-build.xml:865: There were test failures: 251 suites, 1043 tests, 1 error, 13 ignored (2 assumptions)

Total time: 77 minutes 58 seconds
Build step 'Invoke Ant' marked build as failure
Archiving artifacts
Recording test results
Description set: Java: 64bit/jdk1.7.0 -XX:+UseConcMarkSweepGC
Email was triggered for: Failure
Sending email for trigger: Failure



Mime
View raw message