lucene-dev mailing list archives

Site index · List index
Message view « Date » · « Thread »
Top « Date » · « Thread »
From Apache Jenkins Server <jenk...@builds.apache.org>
Subject [JENKINS] Lucene-Solr-Tests-trunk-java7 - Build # 3728 - Still Failing
Date Tue, 12 Feb 2013 12:21:05 GMT
Build: https://builds.apache.org/job/Lucene-Solr-Tests-trunk-java7/3728/

1 tests failed.
REGRESSION:  org.apache.solr.cloud.BasicDistributedZkTest.testDistribSearch

Error Message:
No registered leader was found, collection:unloadcollection slice:shard1

Stack Trace:
org.apache.solr.common.SolrException: No registered leader was found, collection:unloadcollection slice:shard1
	at __randomizedtesting.SeedInfo.seed([703551648690CA12:F1D3DF7CF1CFAA2E]:0)
	at org.apache.solr.common.cloud.ZkStateReader.getLeaderRetry(ZkStateReader.java:429)
	at org.apache.solr.common.cloud.ZkStateReader.getLeaderUrl(ZkStateReader.java:403)
	at org.apache.solr.cloud.BasicDistributedZkTest.testCoreUnloadAndLeaders(BasicDistributedZkTest.java:525)
	at org.apache.solr.cloud.BasicDistributedZkTest.doTest(BasicDistributedZkTest.java:337)
	at org.apache.solr.BaseDistributedSearchTestCase.testDistribSearch(BaseDistributedSearchTestCase.java:794)
	at sun.reflect.NativeMethodAccessorImpl.invoke0(Native Method)
	at sun.reflect.NativeMethodAccessorImpl.invoke(NativeMethodAccessorImpl.java:57)
	at sun.reflect.DelegatingMethodAccessorImpl.invoke(DelegatingMethodAccessorImpl.java:43)
	at java.lang.reflect.Method.invoke(Method.java:601)
	at com.carrotsearch.randomizedtesting.RandomizedRunner.invoke(RandomizedRunner.java:1559)
	at com.carrotsearch.randomizedtesting.RandomizedRunner.access$600(RandomizedRunner.java:79)
	at com.carrotsearch.randomizedtesting.RandomizedRunner$6.evaluate(RandomizedRunner.java:737)
	at com.carrotsearch.randomizedtesting.RandomizedRunner$7.evaluate(RandomizedRunner.java:773)
	at com.carrotsearch.randomizedtesting.RandomizedRunner$8.evaluate(RandomizedRunner.java:787)
	at com.carrotsearch.randomizedtesting.rules.SystemPropertiesRestoreRule$1.evaluate(SystemPropertiesRestoreRule.java:53)
	at org.apache.lucene.util.TestRuleSetupTeardownChained$1.evaluate(TestRuleSetupTeardownChained.java:50)
	at org.apache.lucene.util.TestRuleFieldCacheSanity$1.evaluate(TestRuleFieldCacheSanity.java:51)
	at org.apache.lucene.util.AbstractBeforeAfterRule$1.evaluate(AbstractBeforeAfterRule.java:46)
	at com.carrotsearch.randomizedtesting.rules.SystemPropertiesInvariantRule$1.evaluate(SystemPropertiesInvariantRule.java:55)
	at org.apache.lucene.util.TestRuleThreadAndTestName$1.evaluate(TestRuleThreadAndTestName.java:49)
	at org.apache.lucene.util.TestRuleIgnoreAfterMaxFailures$1.evaluate(TestRuleIgnoreAfterMaxFailures.java:70)
	at org.apache.lucene.util.TestRuleMarkFailure$1.evaluate(TestRuleMarkFailure.java:48)
	at com.carrotsearch.randomizedtesting.rules.StatementAdapter.evaluate(StatementAdapter.java:36)
	at com.carrotsearch.randomizedtesting.ThreadLeakControl$StatementRunner.run(ThreadLeakControl.java:358)
	at com.carrotsearch.randomizedtesting.ThreadLeakControl.forkTimeoutingTask(ThreadLeakControl.java:782)
	at com.carrotsearch.randomizedtesting.ThreadLeakControl$3.evaluate(ThreadLeakControl.java:442)
	at com.carrotsearch.randomizedtesting.RandomizedRunner.runSingleTest(RandomizedRunner.java:746)
	at com.carrotsearch.randomizedtesting.RandomizedRunner$3.evaluate(RandomizedRunner.java:648)
	at com.carrotsearch.randomizedtesting.RandomizedRunner$4.evaluate(RandomizedRunner.java:682)
	at com.carrotsearch.randomizedtesting.RandomizedRunner$5.evaluate(RandomizedRunner.java:693)
	at com.carrotsearch.randomizedtesting.rules.StatementAdapter.evaluate(StatementAdapter.java:36)
	at com.carrotsearch.randomizedtesting.rules.SystemPropertiesRestoreRule$1.evaluate(SystemPropertiesRestoreRule.java:53)
	at org.apache.lucene.util.AbstractBeforeAfterRule$1.evaluate(AbstractBeforeAfterRule.java:46)
	at org.apache.lucene.util.TestRuleStoreClassName$1.evaluate(TestRuleStoreClassName.java:42)
	at com.carrotsearch.randomizedtesting.rules.SystemPropertiesInvariantRule$1.evaluate(SystemPropertiesInvariantRule.java:55)
	at com.carrotsearch.randomizedtesting.rules.NoShadowingOrOverridesOnMethodsRule$1.evaluate(NoShadowingOrOverridesOnMethodsRule.java:39)
	at com.carrotsearch.randomizedtesting.rules.NoShadowingOrOverridesOnMethodsRule$1.evaluate(NoShadowingOrOverridesOnMethodsRule.java:39)
	at com.carrotsearch.randomizedtesting.rules.StatementAdapter.evaluate(StatementAdapter.java:36)
	at org.apache.lucene.util.TestRuleAssertionsRequired$1.evaluate(TestRuleAssertionsRequired.java:43)
	at org.apache.lucene.util.TestRuleMarkFailure$1.evaluate(TestRuleMarkFailure.java:48)
	at org.apache.lucene.util.TestRuleIgnoreAfterMaxFailures$1.evaluate(TestRuleIgnoreAfterMaxFailures.java:70)
	at org.apache.lucene.util.TestRuleIgnoreTestSuites$1.evaluate(TestRuleIgnoreTestSuites.java:55)
	at com.carrotsearch.randomizedtesting.rules.StatementAdapter.evaluate(StatementAdapter.java:36)
	at com.carrotsearch.randomizedtesting.ThreadLeakControl$StatementRunner.run(ThreadLeakControl.java:358)
	at java.lang.Thread.run(Thread.java:722)




Build Log:
[...truncated 9469 lines...]
[junit4:junit4] Suite: org.apache.solr.cloud.BasicDistributedZkTest
[junit4:junit4]   2> 0 T1842 oas.BaseDistributedSearchTestCase.initHostContext Setting hostContext system property: /hu_/j
[junit4:junit4]   2> 4 T1842 oas.SolrTestCaseJ4.setUp ###Starting testDistribSearch
[junit4:junit4]   2> Creating dataDir: /usr/home/hudson/hudson-slave/workspace/Lucene-Solr-Tests-trunk-java7/solr/build/solr-core/test/J1/./solrtest-BasicDistributedZkTest-1360668229211
[junit4:junit4]   2> 5 T1842 oasc.ZkTestServer.run STARTING ZK TEST SERVER
[junit4:junit4]   2> 6 T1843 oasc.ZkTestServer$ZKServerMain.runFromConfig Starting server
[junit4:junit4]   2> 10 T1843 oazs.ZooKeeperServer.setTickTime tickTime set to 1000
[junit4:junit4]   2> 10 T1843 oazs.ZooKeeperServer.setMinSessionTimeout minSessionTimeout set to -1
[junit4:junit4]   2> 10 T1843 oazs.ZooKeeperServer.setMaxSessionTimeout maxSessionTimeout set to -1
[junit4:junit4]   2> 10 T1843 oazs.NIOServerCnxnFactory.configure binding to port 0.0.0.0/0.0.0.0:0
[junit4:junit4]   2> 11 T1843 oazsp.FileTxnSnapLog.save Snapshotting: 0x0 to /usr/home/hudson/hudson-slave/workspace/Lucene-Solr-Tests-trunk-java7/solr/build/solr-core/test/J1/./org.apache.solr.cloud.BasicDistributedZkTest-1360668229211/zookeeper/server1/data/version-2/snapshot.0
[junit4:junit4]   2> 107 T1842 oasc.ZkTestServer.run start zk server on port:60965
[junit4:junit4]   2> 107 T1842 oaz.ZooKeeper.<init> Initiating client connection, connectString=127.0.0.1:60965 sessionTimeout=10000 watcher=org.apache.solr.common.cloud.ConnectionManager@3f2b49ca
[junit4:junit4]   2> 108 T1842 oascc.ConnectionManager.waitForConnected Waiting for client to connect to ZooKeeper
[junit4:junit4]   2> 109 T1848 oaz.ClientCnxn$SendThread.logStartConnect Opening socket connection to server localhost/127.0.0.1:60965. Will not attempt to authenticate using SASL (access denied ("javax.security.auth.AuthPermission" "getLoginConfiguration"))
[junit4:junit4]   2> 109 T1848 oaz.ClientCnxn$SendThread.primeConnection Socket connection established to localhost/127.0.0.1:60965, initiating session
[junit4:junit4]   2> 110 T1844 oazs.NIOServerCnxnFactory.run Accepted socket connection from /140.211.11.196:60966
[junit4:junit4]   2> 110 T1844 oazs.ZooKeeperServer.processConnectRequest Client attempting to establish new session at /140.211.11.196:60966
[junit4:junit4]   2> 110 T1846 oazsp.FileTxnLog.append Creating new log file: log.1
[junit4:junit4]   2> 113 T1846 oazs.ZooKeeperServer.finishSessionInit Established session 0x13cce257e620000 with negotiated timeout 10000 for client /140.211.11.196:60966
[junit4:junit4]   2> 113 T1848 oaz.ClientCnxn$SendThread.onConnected Session establishment complete on server localhost/127.0.0.1:60965, sessionid = 0x13cce257e620000, negotiated timeout = 10000
[junit4:junit4]   2> 113 T1849 oascc.ConnectionManager.process Watcher org.apache.solr.common.cloud.ConnectionManager@3f2b49ca name:ZooKeeperConnection Watcher:127.0.0.1:60965 got event WatchedEvent state:SyncConnected type:None path:null path:null type:None
[junit4:junit4]   2> 114 T1842 oascc.ConnectionManager.waitForConnected Client is connected to ZooKeeper
[junit4:junit4]   2> 114 T1842 oascc.SolrZkClient.makePath makePath: /solr
[junit4:junit4]   2> 128 T1847 oazs.PrepRequestProcessor.pRequest2Txn Processed session termination for sessionid: 0x13cce257e620000
[junit4:junit4]   2> 131 T1849 oaz.ClientCnxn$EventThread.run EventThread shut down
[junit4:junit4]   2> 131 T1844 oazs.NIOServerCnxn.closeSock Closed socket connection for client /140.211.11.196:60966 which had sessionid 0x13cce257e620000
[junit4:junit4]   2> 130 T1842 oaz.ZooKeeper.close Session: 0x13cce257e620000 closed
[junit4:junit4]   2> 131 T1842 oaz.ZooKeeper.<init> Initiating client connection, connectString=127.0.0.1:60965/solr sessionTimeout=10000 watcher=org.apache.solr.common.cloud.ConnectionManager@542ad756
[junit4:junit4]   2> 132 T1842 oascc.ConnectionManager.waitForConnected Waiting for client to connect to ZooKeeper
[junit4:junit4]   2> 133 T1850 oaz.ClientCnxn$SendThread.logStartConnect Opening socket connection to server localhost/127.0.0.1:60965. Will not attempt to authenticate using SASL (access denied ("javax.security.auth.AuthPermission" "getLoginConfiguration"))
[junit4:junit4]   2> 133 T1850 oaz.ClientCnxn$SendThread.primeConnection Socket connection established to localhost/127.0.0.1:60965, initiating session
[junit4:junit4]   2> 133 T1844 oazs.NIOServerCnxnFactory.run Accepted socket connection from /140.211.11.196:60967
[junit4:junit4]   2> 134 T1844 oazs.ZooKeeperServer.processConnectRequest Client attempting to establish new session at /140.211.11.196:60967
[junit4:junit4]   2> 136 T1846 oazs.ZooKeeperServer.finishSessionInit Established session 0x13cce257e620001 with negotiated timeout 10000 for client /140.211.11.196:60967
[junit4:junit4]   2> 136 T1850 oaz.ClientCnxn$SendThread.onConnected Session establishment complete on server localhost/127.0.0.1:60965, sessionid = 0x13cce257e620001, negotiated timeout = 10000
[junit4:junit4]   2> 136 T1851 oascc.ConnectionManager.process Watcher org.apache.solr.common.cloud.ConnectionManager@542ad756 name:ZooKeeperConnection Watcher:127.0.0.1:60965/solr got event WatchedEvent state:SyncConnected type:None path:null path:null type:None
[junit4:junit4]   2> 136 T1842 oascc.ConnectionManager.waitForConnected Client is connected to ZooKeeper
[junit4:junit4]   2> 137 T1842 oascc.SolrZkClient.makePath makePath: /collections/collection1
[junit4:junit4]   2> 142 T1842 oascc.SolrZkClient.makePath makePath: /collections/collection1/shards
[junit4:junit4]   2> 146 T1842 oascc.SolrZkClient.makePath makePath: /collections/control_collection
[junit4:junit4]   2> 154 T1842 oascc.SolrZkClient.makePath makePath: /collections/control_collection/shards
[junit4:junit4]   2> 158 T1842 oasc.AbstractZkTestCase.putConfig put /usr/home/hudson/hudson-slave/workspace/Lucene-Solr-Tests-trunk-java7/solr/build/solr-core/test-files/solr/collection1/conf/solrconfig.xml to /configs/conf1/solrconfig.xml
[junit4:junit4]   2> 159 T1842 oascc.SolrZkClient.makePath makePath: /configs/conf1/solrconfig.xml
[junit4:junit4]   2> 170 T1842 oasc.AbstractZkTestCase.putConfig put /usr/home/hudson/hudson-slave/workspace/Lucene-Solr-Tests-trunk-java7/solr/build/solr-core/test-files/solr/collection1/conf/schema.xml to /configs/conf1/schema.xml
[junit4:junit4]   2> 171 T1842 oascc.SolrZkClient.makePath makePath: /configs/conf1/schema.xml
[junit4:junit4]   2> 276 T1842 oasc.AbstractZkTestCase.putConfig put /usr/home/hudson/hudson-slave/workspace/Lucene-Solr-Tests-trunk-java7/solr/build/solr-core/test-files/solr/collection1/conf/stopwords.txt to /configs/conf1/stopwords.txt
[junit4:junit4]   2> 277 T1842 oascc.SolrZkClient.makePath makePath: /configs/conf1/stopwords.txt
[junit4:junit4]   2> 280 T1842 oasc.AbstractZkTestCase.putConfig put /usr/home/hudson/hudson-slave/workspace/Lucene-Solr-Tests-trunk-java7/solr/build/solr-core/test-files/solr/collection1/conf/protwords.txt to /configs/conf1/protwords.txt
[junit4:junit4]   2> 281 T1842 oascc.SolrZkClient.makePath makePath: /configs/conf1/protwords.txt
[junit4:junit4]   2> 290 T1842 oasc.AbstractZkTestCase.putConfig put /usr/home/hudson/hudson-slave/workspace/Lucene-Solr-Tests-trunk-java7/solr/build/solr-core/test-files/solr/collection1/conf/currency.xml to /configs/conf1/currency.xml
[junit4:junit4]   2> 291 T1842 oascc.SolrZkClient.makePath makePath: /configs/conf1/currency.xml
[junit4:junit4]   2> 295 T1842 oasc.AbstractZkTestCase.putConfig put /usr/home/hudson/hudson-slave/workspace/Lucene-Solr-Tests-trunk-java7/solr/build/solr-core/test-files/solr/collection1/conf/open-exchange-rates.json to /configs/conf1/open-exchange-rates.json
[junit4:junit4]   2> 296 T1842 oascc.SolrZkClient.makePath makePath: /configs/conf1/open-exchange-rates.json
[junit4:junit4]   2> 299 T1842 oasc.AbstractZkTestCase.putConfig put /usr/home/hudson/hudson-slave/workspace/Lucene-Solr-Tests-trunk-java7/solr/build/solr-core/test-files/solr/collection1/conf/mapping-ISOLatin1Accent.txt to /configs/conf1/mapping-ISOLatin1Accent.txt
[junit4:junit4]   2> 300 T1842 oascc.SolrZkClient.makePath makePath: /configs/conf1/mapping-ISOLatin1Accent.txt
[junit4:junit4]   2> 303 T1842 oasc.AbstractZkTestCase.putConfig put /usr/home/hudson/hudson-slave/workspace/Lucene-Solr-Tests-trunk-java7/solr/build/solr-core/test-files/solr/collection1/conf/old_synonyms.txt to /configs/conf1/old_synonyms.txt
[junit4:junit4]   2> 304 T1842 oascc.SolrZkClient.makePath makePath: /configs/conf1/old_synonyms.txt
[junit4:junit4]   2> 308 T1842 oasc.AbstractZkTestCase.putConfig put /usr/home/hudson/hudson-slave/workspace/Lucene-Solr-Tests-trunk-java7/solr/build/solr-core/test-files/solr/collection1/conf/synonyms.txt to /configs/conf1/synonyms.txt
[junit4:junit4]   2> 309 T1842 oascc.SolrZkClient.makePath makePath: /configs/conf1/synonyms.txt
[junit4:junit4]   2> 312 T1847 oazs.PrepRequestProcessor.pRequest2Txn Processed session termination for sessionid: 0x13cce257e620001
[junit4:junit4]   2> 313 T1851 oaz.ClientCnxn$EventThread.run EventThread shut down
[junit4:junit4]   2> 313 T1844 oazs.NIOServerCnxn.closeSock Closed socket connection for client /140.211.11.196:60967 which had sessionid 0x13cce257e620001
[junit4:junit4]   2> 313 T1842 oaz.ZooKeeper.close Session: 0x13cce257e620001 closed
[junit4:junit4]   2> 511 T1842 oejs.Server.doStart jetty-8.1.8.v20121106
[junit4:junit4]   2> 517 T1842 oejs.AbstractConnector.doStart Started SocketConnector@127.0.0.1:60968
[junit4:junit4]   2> 518 T1842 oass.SolrDispatchFilter.init SolrDispatchFilter.init()
[junit4:junit4]   2> 518 T1842 oasc.SolrResourceLoader.locateSolrHome JNDI not configured for solr (NoInitialContextEx)
[junit4:junit4]   2> 519 T1842 oasc.SolrResourceLoader.locateSolrHome using system property solr.solr.home: /usr/home/hudson/hudson-slave/workspace/Lucene-Solr-Tests-trunk-java7/solr/build/solr-core/test/J1/./org.apache.solr.cloud.BasicDistributedZkTest-controljetty-1360668229519
[junit4:junit4]   2> 519 T1842 oasc.CoreContainer$Initializer.initialize looking for solr.xml: /usr/home/hudson/hudson-slave/workspace/Lucene-Solr-Tests-trunk-java7/solr/build/solr-core/test/J1/./org.apache.solr.cloud.BasicDistributedZkTest-controljetty-1360668229519/solr.xml
[junit4:junit4]   2> 520 T1842 oasc.CoreContainer.<init> New CoreContainer 1764594575
[junit4:junit4]   2> 520 T1842 oasc.CoreContainer.load Loading CoreContainer using Solr Home: '/usr/home/hudson/hudson-slave/workspace/Lucene-Solr-Tests-trunk-java7/solr/build/solr-core/test/J1/./org.apache.solr.cloud.BasicDistributedZkTest-controljetty-1360668229519/'
[junit4:junit4]   2> 521 T1842 oasc.SolrResourceLoader.<init> new SolrResourceLoader for directory: '/usr/home/hudson/hudson-slave/workspace/Lucene-Solr-Tests-trunk-java7/solr/build/solr-core/test/J1/./org.apache.solr.cloud.BasicDistributedZkTest-controljetty-1360668229519/'
[junit4:junit4]   2> 588 T1842 oashc.HttpShardHandlerFactory.getParameter Setting socketTimeout to: 60000
[junit4:junit4]   2> 588 T1842 oashc.HttpShardHandlerFactory.getParameter Setting urlScheme to: http://
[junit4:junit4]   2> 589 T1842 oashc.HttpShardHandlerFactory.getParameter Setting connTimeout to: 15000
[junit4:junit4]   2> 589 T1842 oashc.HttpShardHandlerFactory.getParameter Setting maxConnectionsPerHost to: 20
[junit4:junit4]   2> 590 T1842 oashc.HttpShardHandlerFactory.getParameter Setting corePoolSize to: 0
[junit4:junit4]   2> 590 T1842 oashc.HttpShardHandlerFactory.getParameter Setting maximumPoolSize to: 2147483647
[junit4:junit4]   2> 591 T1842 oashc.HttpShardHandlerFactory.getParameter Setting maxThreadIdleTime to: 5
[junit4:junit4]   2> 591 T1842 oashc.HttpShardHandlerFactory.getParameter Setting sizeOfQueue to: -1
[junit4:junit4]   2> 592 T1842 oashc.HttpShardHandlerFactory.getParameter Setting fairnessPolicy to: false
[junit4:junit4]   2> 592 T1842 oascsi.HttpClientUtil.createClient Creating new http client, config:maxConnectionsPerHost=20&maxConnections=10000&socketTimeout=60000&connTimeout=15000&retry=false
[junit4:junit4]   2> 614 T1842 oasc.CoreContainer.load Registering Log Listener
[junit4:junit4]   2> 635 T1842 oasc.CoreContainer.initZooKeeper Zookeeper client=127.0.0.1:60965/solr
[junit4:junit4]   2> 636 T1842 oasc.ZkController.checkChrootPath zkHost includes chroot
[junit4:junit4]   2> 636 T1842 oaz.ZooKeeper.<init> Initiating client connection, connectString=127.0.0.1:60965 sessionTimeout=60000 watcher=org.apache.solr.common.cloud.ConnectionManager@501162b0
[junit4:junit4]   2> 637 T1842 oascc.ConnectionManager.waitForConnected Waiting for client to connect to ZooKeeper
[junit4:junit4]   2> 638 T1861 oaz.ClientCnxn$SendThread.logStartConnect Opening socket connection to server localhost/127.0.0.1:60965. Will not attempt to authenticate using SASL (access denied ("javax.security.auth.AuthPermission" "getLoginConfiguration"))
[junit4:junit4]   2> 638 T1861 oaz.ClientCnxn$SendThread.primeConnection Socket connection established to localhost/127.0.0.1:60965, initiating session
[junit4:junit4]   2> 639 T1844 oazs.NIOServerCnxnFactory.run Accepted socket connection from /140.211.11.196:60969
[junit4:junit4]   2> 639 T1844 oazs.ZooKeeperServer.processConnectRequest Client attempting to establish new session at /140.211.11.196:60969
[junit4:junit4]   2> 644 T1846 oazs.ZooKeeperServer.finishSessionInit Established session 0x13cce257e620002 with negotiated timeout 20000 for client /140.211.11.196:60969
[junit4:junit4]   2> 644 T1861 oaz.ClientCnxn$SendThread.onConnected Session establishment complete on server localhost/127.0.0.1:60965, sessionid = 0x13cce257e620002, negotiated timeout = 20000
[junit4:junit4]   2> 644 T1862 oascc.ConnectionManager.process Watcher org.apache.solr.common.cloud.ConnectionManager@501162b0 name:ZooKeeperConnection Watcher:127.0.0.1:60965 got event WatchedEvent state:SyncConnected type:None path:null path:null type:None
[junit4:junit4]   2> 645 T1842 oascc.ConnectionManager.waitForConnected Client is connected to ZooKeeper
[junit4:junit4]   2> 646 T1847 oazs.PrepRequestProcessor.pRequest2Txn Processed session termination for sessionid: 0x13cce257e620002
[junit4:junit4]   2> 654 T1862 oaz.ClientCnxn$EventThread.run EventThread shut down
[junit4:junit4]   2> 654 T1844 oazs.NIOServerCnxn.closeSock Closed socket connection for client /140.211.11.196:60969 which had sessionid 0x13cce257e620002
[junit4:junit4]   2> 654 T1842 oaz.ZooKeeper.close Session: 0x13cce257e620002 closed
[junit4:junit4]   2> 655 T1842 oascsi.HttpClientUtil.createClient Creating new http client, config:maxConnections=500&maxConnectionsPerHost=16&socketTimeout=60000&connTimeout=15000
[junit4:junit4]   2> 667 T1842 oaz.ZooKeeper.<init> Initiating client connection, connectString=127.0.0.1:60965/solr sessionTimeout=30000 watcher=org.apache.solr.common.cloud.ConnectionManager@2e5c31a7
[junit4:junit4]   2> 669 T1842 oascc.ConnectionManager.waitForConnected Waiting for client to connect to ZooKeeper
[junit4:junit4]   2> 669 T1863 oaz.ClientCnxn$SendThread.logStartConnect Opening socket connection to server localhost/127.0.0.1:60965. Will not attempt to authenticate using SASL (access denied ("javax.security.auth.AuthPermission" "getLoginConfiguration"))
[junit4:junit4]   2> 670 T1863 oaz.ClientCnxn$SendThread.primeConnection Socket connection established to localhost/127.0.0.1:60965, initiating session
[junit4:junit4]   2> 670 T1844 oazs.NIOServerCnxnFactory.run Accepted socket connection from /140.211.11.196:60970
[junit4:junit4]   2> 671 T1844 oazs.ZooKeeperServer.processConnectRequest Client attempting to establish new session at /140.211.11.196:60970
[junit4:junit4]   2> 672 T1846 oazs.ZooKeeperServer.finishSessionInit Established session 0x13cce257e620003 with negotiated timeout 20000 for client /140.211.11.196:60970
[junit4:junit4]   2> 672 T1863 oaz.ClientCnxn$SendThread.onConnected Session establishment complete on server localhost/127.0.0.1:60965, sessionid = 0x13cce257e620003, negotiated timeout = 20000
[junit4:junit4]   2> 673 T1864 oascc.ConnectionManager.process Watcher org.apache.solr.common.cloud.ConnectionManager@2e5c31a7 name:ZooKeeperConnection Watcher:127.0.0.1:60965/solr got event WatchedEvent state:SyncConnected type:None path:null path:null type:None
[junit4:junit4]   2> 673 T1842 oascc.ConnectionManager.waitForConnected Client is connected to ZooKeeper
[junit4:junit4]   2> 677 T1847 oazs.PrepRequestProcessor.pRequest Got user-level KeeperException when processing sessionid:0x13cce257e620003 type:create cxid:0x2 zxid:0x1a txntype:-1 reqpath:n/a Error Path:/solr/overseer Error:KeeperErrorCode = NodeExists for /solr/overseer
[junit4:junit4]   2> 684 T1842 oascc.SolrZkClient.makePath makePath: /live_nodes
[junit4:junit4]   2> 687 T1842 oasc.ZkController.createEphemeralLiveNode Register node as live in ZooKeeper:/live_nodes/127.0.0.1:60968_hu_%2Fj
[junit4:junit4]   2> 688 T1847 oazs.PrepRequestProcessor.pRequest Got user-level KeeperException when processing sessionid:0x13cce257e620003 type:delete cxid:0x8 zxid:0x1c txntype:-1 reqpath:n/a Error Path:/solr/live_nodes/127.0.0.1:60968_hu_%2Fj Error:KeeperErrorCode = NoNode for /solr/live_nodes/127.0.0.1:60968_hu_%2Fj
[junit4:junit4]   2> 689 T1842 oascc.SolrZkClient.makePath makePath: /live_nodes/127.0.0.1:60968_hu_%2Fj
[junit4:junit4]   2> 694 T1842 oascc.SolrZkClient.makePath makePath: /overseer_elect/election
[junit4:junit4]   2> 706 T1847 oazs.PrepRequestProcessor.pRequest Got user-level KeeperException when processing sessionid:0x13cce257e620003 type:delete cxid:0x16 zxid:0x21 txntype:-1 reqpath:n/a Error Path:/solr/overseer_elect/leader Error:KeeperErrorCode = NoNode for /solr/overseer_elect/leader
[junit4:junit4]   2> 714 T1842 oascc.SolrZkClient.makePath makePath: /overseer_elect/leader
[junit4:junit4]   2> 718 T1842 oasc.Overseer.start Overseer (id=89172753070030851-127.0.0.1:60968_hu_%2Fj-n_0000000000) starting
[junit4:junit4]   2> 719 T1847 oazs.PrepRequestProcessor.pRequest Got user-level KeeperException when processing sessionid:0x13cce257e620003 type:create cxid:0x1b zxid:0x23 txntype:-1 reqpath:n/a Error Path:/solr/overseer Error:KeeperErrorCode = NodeExists for /solr/overseer
[junit4:junit4]   2> 721 T1847 oazs.PrepRequestProcessor.pRequest Got user-level KeeperException when processing sessionid:0x13cce257e620003 type:create cxid:0x1c zxid:0x24 txntype:-1 reqpath:n/a Error Path:/solr/overseer Error:KeeperErrorCode = NodeExists for /solr/overseer
[junit4:junit4]   2> 728 T1847 oazs.PrepRequestProcessor.pRequest Got user-level KeeperException when processing sessionid:0x13cce257e620003 type:create cxid:0x1d zxid:0x25 txntype:-1 reqpath:n/a Error Path:/solr/overseer Error:KeeperErrorCode = NodeExists for /solr/overseer
[junit4:junit4]   2> 729 T1847 oazs.PrepRequestProcessor.pRequest Got user-level KeeperException when processing sessionid:0x13cce257e620003 type:create cxid:0x1e zxid:0x26 txntype:-1 reqpath:n/a Error Path:/solr/overseer Error:KeeperErrorCode = NodeExists for /solr/overseer
[junit4:junit4]   2> 731 T1866 oasc.OverseerCollectionProcessor.run Process current queue of collection creations
[junit4:junit4]   2> 732 T1842 oascc.SolrZkClient.makePath makePath: /clusterstate.json
[junit4:junit4]   2> 745 T1842 oascc.ZkStateReader.createClusterStateWatchersAndUpdate Updating cluster state from ZooKeeper... 
[junit4:junit4]   2> 747 T1865 oasc.Overseer$ClusterStateUpdater.run Starting to work on the main queue
[junit4:junit4]   2> 754 T1867 oasc.CoreContainer.create Creating SolrCore 'collection1' using instanceDir: /usr/home/hudson/hudson-slave/workspace/Lucene-Solr-Tests-trunk-java7/solr/build/solr-core/test/J1/./org.apache.solr.cloud.BasicDistributedZkTest-controljetty-1360668229519/collection1
[junit4:junit4]   2> 754 T1867 oasc.ZkController.createCollectionZkNode Check for collection zkNode:control_collection
[junit4:junit4]   2> 755 T1867 oasc.ZkController.createCollectionZkNode Collection zkNode exists
[junit4:junit4]   2> 755 T1867 oasc.ZkController.readConfigName Load collection config from:/collections/control_collection
[junit4:junit4]   2> 757 T1867 oasc.SolrResourceLoader.<init> new SolrResourceLoader for directory: '/usr/home/hudson/hudson-slave/workspace/Lucene-Solr-Tests-trunk-java7/solr/build/solr-core/test/J1/./org.apache.solr.cloud.BasicDistributedZkTest-controljetty-1360668229519/collection1/'
[junit4:junit4]   2> 758 T1867 oasc.SolrResourceLoader.replaceClassLoader Adding 'file:/usr/home/hudson/hudson-slave/workspace/Lucene-Solr-Tests-trunk-java7/solr/build/solr-core/test/J1/org.apache.solr.cloud.BasicDistributedZkTest-controljetty-1360668229519/collection1/lib/README' to classloader
[junit4:junit4]   2> 758 T1867 oasc.SolrResourceLoader.replaceClassLoader Adding 'file:/usr/home/hudson/hudson-slave/workspace/Lucene-Solr-Tests-trunk-java7/solr/build/solr-core/test/J1/org.apache.solr.cloud.BasicDistributedZkTest-controljetty-1360668229519/collection1/lib/classes/' to classloader
[junit4:junit4]   2> 822 T1867 oasc.SolrConfig.<init> Using Lucene MatchVersion: LUCENE_50
[junit4:junit4]   2> 907 T1867 oasc.SolrConfig.<init> Loaded SolrConfig: solrconfig.xml
[junit4:junit4]   2> 1008 T1867 oass.IndexSchema.readSchema Reading Solr Schema
[junit4:junit4]   2> 1015 T1867 oass.IndexSchema.readSchema Schema name=test
[junit4:junit4]   2> 1703 T1867 oass.OpenExchangeRatesOrgProvider.init Initialized with rates=open-exchange-rates.json, refreshInterval=1440.
[junit4:junit4]   2> 1716 T1867 oass.IndexSchema.readSchema default search field in schema is text
[junit4:junit4]   2> 1720 T1867 oass.IndexSchema.readSchema unique key field: id
[junit4:junit4]   2> 1736 T1867 oass.FileExchangeRateProvider.reload Reloading exchange rates from file currency.xml
[junit4:junit4]   2> 1741 T1867 oass.FileExchangeRateProvider.reload Reloading exchange rates from file currency.xml
[junit4:junit4]   2> 1746 T1867 oass.OpenExchangeRatesOrgProvider.reload Reloading exchange rates from open-exchange-rates.json
[junit4:junit4]   2> 1748 T1867 oass.OpenExchangeRatesOrgProvider.reload Reloading exchange rates from open-exchange-rates.json
[junit4:junit4]   2> 1749 T1867 oasc.SolrCore.<init> [collection1] Opening new SolrCore at /usr/home/hudson/hudson-slave/workspace/Lucene-Solr-Tests-trunk-java7/solr/build/solr-core/test/J1/./org.apache.solr.cloud.BasicDistributedZkTest-controljetty-1360668229519/collection1/, dataDir=./org.apache.solr.cloud.BasicDistributedZkTest-1360668229211/control/data/
[junit4:junit4]   2> 1749 T1867 oasc.JmxMonitoredMap.<init> JMX monitoring is enabled. Adding Solr mbeans to JMX Server: com.sun.jmx.mbeanserver.JmxMBeanServer@26058825
[junit4:junit4]   2> 1750 T1867 oasc.SolrCore.initDirectoryFactory solr.NRTCachingDirectoryFactory
[junit4:junit4]   2> 1751 T1867 oasc.CachingDirectoryFactory.get return new directory for /usr/home/hudson/hudson-slave/workspace/Lucene-Solr-Tests-trunk-java7/solr/build/solr-core/test/J1/./org.apache.solr.cloud.BasicDistributedZkTest-1360668229211/control/data forceNew:false
[junit4:junit4]   2> 1752 T1867 oasc.CachingDirectoryFactory.close Releasing directory:/usr/home/hudson/hudson-slave/workspace/Lucene-Solr-Tests-trunk-java7/solr/build/solr-core/test/J1/./org.apache.solr.cloud.BasicDistributedZkTest-1360668229211/control/data
[junit4:junit4]   2> 1752 T1867 oasc.SolrCore.getNewIndexDir New index directory detected: old=null new=./org.apache.solr.cloud.BasicDistributedZkTest-1360668229211/control/data/index/
[junit4:junit4]   2> 1753 T1867 oasc.SolrCore.initIndex WARNING [collection1] Solr index directory './org.apache.solr.cloud.BasicDistributedZkTest-1360668229211/control/data/index' doesn't exist. Creating new index...
[junit4:junit4]   2> 1754 T1867 oasc.CachingDirectoryFactory.get return new directory for /usr/home/hudson/hudson-slave/workspace/Lucene-Solr-Tests-trunk-java7/solr/build/solr-core/test/J1/./org.apache.solr.cloud.BasicDistributedZkTest-1360668229211/control/data/index forceNew:false
[junit4:junit4]   2> 1779 T1867 oasc.SolrDeletionPolicy.onCommit SolrDeletionPolicy.onCommit: commits:num=1
[junit4:junit4]   2> 		commit{dir=RateLimitedDirectoryWrapper(NRTCachingDirectory(org.apache.lucene.store.NIOFSDirectory@/usr/home/hudson/hudson-slave/workspace/Lucene-Solr-Tests-trunk-java7/solr/build/solr-core/test/J1/org.apache.solr.cloud.BasicDistributedZkTest-1360668229211/control/data/index lockFactory=org.apache.lucene.store.NativeFSLockFactory@7cbd3163; maxCacheMB=48.0 maxMergeSizeMB=4.0)),segFN=segments_1,generation=1,filenames=[segments_1]
[junit4:junit4]   2> 1779 T1867 oasc.SolrDeletionPolicy.updateCommits newest commit = 1[segments_1]
[junit4:junit4]   2> 1781 T1867 oasc.CachingDirectoryFactory.close Releasing directory:/usr/home/hudson/hudson-slave/workspace/Lucene-Solr-Tests-trunk-java7/solr/build/solr-core/test/J1/./org.apache.solr.cloud.BasicDistributedZkTest-1360668229211/control/data/index
[junit4:junit4]   2> 1782 T1867 oasc.SolrCore.initWriters created xml: solr.XMLResponseWriter
[junit4:junit4]   2> 1785 T1867 oasup.UpdateRequestProcessorChain.init inserting DistributedUpdateProcessorFactory into updateRequestProcessorChain "dedupe"
[junit4:junit4]   2> 1785 T1867 oasup.UpdateRequestProcessorChain.init inserting DistributedUpdateProcessorFactory into updateRequestProcessorChain "dedupe-allfields"
[junit4:junit4]   2> 1786 T1867 oasup.UpdateRequestProcessorChain.init inserting DistributedUpdateProcessorFactory into updateRequestProcessorChain "stored_sig"
[junit4:junit4]   2> 1786 T1867 oasup.UpdateRequestProcessorChain.init inserting DistributedUpdateProcessorFactory into updateRequestProcessorChain "uniq-fields"
[junit4:junit4]   2> 1787 T1867 oasup.UpdateRequestProcessorChain.init inserting DistributedUpdateProcessorFactory into updateRequestProcessorChain "distrib-dup-test-chain-implicit"
[junit4:junit4]   2> 1787 T1867 oasc.RequestHandlers.initHandlersFromConfig adding lazy requestHandler: solr.ReplicationHandler
[junit4:junit4]   2> 1788 T1867 oasc.RequestHandlers.initHandlersFromConfig created /replication: solr.ReplicationHandler
[junit4:junit4]   2> 1789 T1867 oasc.RequestHandlers.initHandlersFromConfig created standard: solr.StandardRequestHandler
[junit4:junit4]   2> 1789 T1867 oasc.RequestHandlers.initHandlersFromConfig created /get: solr.RealTimeGetHandler
[junit4:junit4]   2> 1790 T1867 oasc.RequestHandlers.initHandlersFromConfig created dismax: solr.SearchHandler
[junit4:junit4]   2> 1791 T1867 oasc.RequestHandlers.initHandlersFromConfig created mock: org.apache.solr.core.MockQuerySenderListenerReqHandler
[junit4:junit4]   2> 1791 T1867 oasc.RequestHandlers.initHandlersFromConfig created /admin/: org.apache.solr.handler.admin.AdminHandlers
[junit4:junit4]   2> 1792 T1867 oasc.RequestHandlers.initHandlersFromConfig created defaults: solr.StandardRequestHandler
[junit4:junit4]   2> 1792 T1867 oasc.RequestHandlers.initHandlersFromConfig adding lazy requestHandler: solr.StandardRequestHandler
[junit4:junit4]   2> 1793 T1867 oasc.RequestHandlers.initHandlersFromConfig created lazy: solr.StandardRequestHandler
[junit4:junit4]   2> 1794 T1867 oasc.RequestHandlers.initHandlersFromConfig created /update: solr.UpdateRequestHandler
[junit4:junit4]   2> 1794 T1867 oasc.RequestHandlers.initHandlersFromConfig created /terms: org.apache.solr.handler.component.SearchHandler
[junit4:junit4]   2> 1795 T1867 oasc.RequestHandlers.initHandlersFromConfig created spellCheckCompRH: org.apache.solr.handler.component.SearchHandler
[junit4:junit4]   2> 1796 T1867 oasc.RequestHandlers.initHandlersFromConfig created spellCheckCompRH_Direct: org.apache.solr.handler.component.SearchHandler
[junit4:junit4]   2> 1796 T1867 oasc.RequestHandlers.initHandlersFromConfig created spellCheckWithWordbreak: org.apache.solr.handler.component.SearchHandler
[junit4:junit4]   2> 1797 T1867 oasc.RequestHandlers.initHandlersFromConfig created spellCheckWithWordbreak_Direct: org.apache.solr.handler.component.SearchHandler
[junit4:junit4]   2> 1798 T1867 oasc.RequestHandlers.initHandlersFromConfig created spellCheckCompRH1: org.apache.solr.handler.component.SearchHandler
[junit4:junit4]   2> 1799 T1867 oasc.RequestHandlers.initHandlersFromConfig created mltrh: org.apache.solr.handler.component.SearchHandler
[junit4:junit4]   2> 1799 T1867 oasc.RequestHandlers.initHandlersFromConfig created tvrh: org.apache.solr.handler.component.SearchHandler
[junit4:junit4]   2> 1800 T1867 oasc.RequestHandlers.initHandlersFromConfig created /mlt: solr.MoreLikeThisHandler
[junit4:junit4]   2> 1801 T1867 oasc.RequestHandlers.initHandlersFromConfig created /debug/dump: solr.DumpRequestHandler
[junit4:junit4]   2> 1825 T1867 oashl.XMLLoader.init xsltCacheLifetimeSeconds=60
[junit4:junit4]   2> 1832 T1867 oasc.SolrCore.initDeprecatedSupport WARNING solrconfig.xml uses deprecated <admin/gettableFiles>, Please update your config to use the ShowFileRequestHandler.
[junit4:junit4]   2> 1834 T1867 oasc.SolrCore.initDeprecatedSupport WARNING adding ShowFileRequestHandler with hidden files: [SCHEMA.XML, OLD_SYNONYMS.TXT, STOPWORDS.TXT, PROTWORDS.TXT, OPEN-EXCHANGE-RATES.JSON, SYNONYMS.TXT, CURRENCY.XML, MAPPING-ISOLATIN1ACCENT.TXT]
[junit4:junit4]   2> 1838 T1867 oasc.CachingDirectoryFactory.close Releasing directory:/usr/home/hudson/hudson-slave/workspace/Lucene-Solr-Tests-trunk-java7/solr/build/solr-core/test/J1/./org.apache.solr.cloud.BasicDistributedZkTest-1360668229211/control/data
[junit4:junit4]   2> 1841 T1867 oass.SolrIndexSearcher.<init> Opening Searcher@469e42ec main
[junit4:junit4]   2> 1842 T1867 oasu.CommitTracker.<init> Hard AutoCommit: disabled
[junit4:junit4]   2> 1843 T1867 oasu.CommitTracker.<init> Soft AutoCommit: disabled
[junit4:junit4]   2> 1843 T1867 oashc.SpellCheckComponent.inform Initializing spell checkers
[junit4:junit4]   2> 1856 T1867 oass.DirectSolrSpellChecker.init init: {name=direct,classname=DirectSolrSpellChecker,field=lowerfilt,minQueryLength=3}
[junit4:junit4]   2> 2416 T1868 oasc.SolrCore.registerSearcher [collection1] Registered new searcher Searcher@469e42ec main{StandardDirectoryReader(segments_1:1)}
[junit4:junit4]   2> 2425 T1867 oasc.ZkController.publish publishing core=collection1 state=down
[junit4:junit4]   2> 2425 T1867 oasc.ZkController.publish numShards not found on descriptor - reading it from system property
[junit4:junit4]   2> 2426 T1847 oazs.PrepRequestProcessor.pRequest Got user-level KeeperException when processing sessionid:0x13cce257e620003 type:create cxid:0x54 zxid:0x29 txntype:-1 reqpath:n/a Error Path:/solr/overseer/queue Error:KeeperErrorCode = NoNode for /solr/overseer/queue
[junit4:junit4]   2> 3755 T1865 oascc.ZkStateReader.updateClusterState Updating cloud state from ZooKeeper... 
[junit4:junit4]   2> 3756 T1865 oasc.Overseer$ClusterStateUpdater.updateState Update state numShards=1 message={
[junit4:junit4]   2> 	  "operation":"state",
[junit4:junit4]   2> 	  "numShards":"1",
[junit4:junit4]   2> 	  "shard":null,
[junit4:junit4]   2> 	  "roles":null,
[junit4:junit4]   2> 	  "state":"down",
[junit4:junit4]   2> 	  "core":"collection1",
[junit4:junit4]   2> 	  "collection":"control_collection",
[junit4:junit4]   2> 	  "node_name":"127.0.0.1:60968_hu_%2Fj",
[junit4:junit4]   2> 	  "base_url":"http://127.0.0.1:60968/hu_/j"}
[junit4:junit4]   2> 3756 T1865 oasc.Overseer$ClusterStateUpdater.createCollection Create collection control_collection with numShards 1
[junit4:junit4]   2> 3756 T1865 oasc.Overseer$ClusterStateUpdater.updateState Assigning new node to shard shard=shard1
[junit4:junit4]   2> 3757 T1847 oazs.PrepRequestProcessor.pRequest Got user-level KeeperException when processing sessionid:0x13cce257e620003 type:create cxid:0x5c zxid:0x2c txntype:-1 reqpath:n/a Error Path:/solr/overseer/queue-work Error:KeeperErrorCode = NoNode for /solr/overseer/queue-work
[junit4:junit4]   2> 3792 T1864 oascc.ZkStateReader$2.process A cluster state change: WatchedEvent state:SyncConnected type:NodeDataChanged path:/clusterstate.json, has occurred - updating... (live nodes size: 1)
[junit4:junit4]   2> 4440 T1867 oasc.CoreContainer.registerCore registering core: collection1
[junit4:junit4]   2> 4440 T1867 oasc.ZkController.register Register replica - core:collection1 address:http://127.0.0.1:60968/hu_/j collection:control_collection shard:shard1
[junit4:junit4]   2> 4441 T1867 oascc.SolrZkClient.makePath makePath: /collections/control_collection/leader_elect/shard1/election
[junit4:junit4]   2> 4489 T1847 oazs.PrepRequestProcessor.pRequest Got user-level KeeperException when processing sessionid:0x13cce257e620003 type:delete cxid:0x76 zxid:0x36 txntype:-1 reqpath:n/a Error Path:/solr/collections/control_collection/leaders Error:KeeperErrorCode = NoNode for /solr/collections/control_collection/leaders
[junit4:junit4]   2> 4491 T1867 oasc.ShardLeaderElectionContext.runLeaderProcess Running the leader process.
[junit4:junit4]   2> 4492 T1847 oazs.PrepRequestProcessor.pRequest Got user-level KeeperException when processing sessionid:0x13cce257e620003 type:create cxid:0x77 zxid:0x37 txntype:-1 reqpath:n/a Error Path:/solr/overseer Error:KeeperErrorCode = NodeExists for /solr/overseer
[junit4:junit4]   2> 4507 T1867 oasc.ShardLeaderElectionContext.waitForReplicasToComeUp Enough replicas found to continue.
[junit4:junit4]   2> 4507 T1867 oasc.ShardLeaderElectionContext.runLeaderProcess I may be the new leader - try and sync
[junit4:junit4]   2> 4507 T1867 oasc.SyncStrategy.sync Sync replicas to http://127.0.0.1:60968/hu_/j/collection1/
[junit4:junit4]   2> 4508 T1867 oasc.SyncStrategy.syncReplicas Sync Success - now sync replicas to me
[junit4:junit4]   2> 4508 T1867 oasc.SyncStrategy.syncToMe http://127.0.0.1:60968/hu_/j/collection1/ has no replicas
[junit4:junit4]   2> 4508 T1867 oasc.ShardLeaderElectionContext.runLeaderProcess I am the new leader: http://127.0.0.1:60968/hu_/j/collection1/
[junit4:junit4]   2> 4508 T1867 oascc.SolrZkClient.makePath makePath: /collections/control_collection/leaders/shard1
[junit4:junit4]   2> 4515 T1847 oazs.PrepRequestProcessor.pRequest Got user-level KeeperException when processing sessionid:0x13cce257e620003 type:create cxid:0x81 zxid:0x3b txntype:-1 reqpath:n/a Error Path:/solr/overseer Error:KeeperErrorCode = NodeExists for /solr/overseer
[junit4:junit4]   2> 5298 T1865 oascc.ZkStateReader.updateClusterState Updating cloud state from ZooKeeper... 
[junit4:junit4]   2> 5322 T1864 oascc.ZkStateReader$2.process A cluster state change: WatchedEvent state:SyncConnected type:NodeDataChanged path:/clusterstate.json, has occurred - updating... (live nodes size: 1)
[junit4:junit4]   2> 5385 T1867 oasc.ZkController.register We are http://127.0.0.1:60968/hu_/j/collection1/ and leader is http://127.0.0.1:60968/hu_/j/collection1/
[junit4:junit4]   2> 5385 T1867 oasc.ZkController.register No LogReplay needed for core=collection1 baseURL=http://127.0.0.1:60968/hu_/j
[junit4:junit4]   2> 5385 T1867 oasc.ZkController.checkRecovery I am the leader, no recovery necessary
[junit4:junit4]   2> 5386 T1867 oasc.ZkController.publish publishing core=collection1 state=active
[junit4:junit4]   2> 5386 T1867 oasc.ZkController.publish numShards not found on descriptor - reading it from system property
[junit4:junit4]   2> 5390 T1867 oascc.ZkStateReader.updateClusterState Updating cloud state from ZooKeeper... 
[junit4:junit4]   2> 5391 T1842 oass.SolrDispatchFilter.init user.dir=/usr/home/hudson/hudson-slave/workspace/Lucene-Solr-Tests-trunk-java7/solr/build/solr-core/test/J1
[junit4:junit4]   2> 5392 T1842 oass.SolrDispatchFilter.init SolrDispatchFilter.init() done
[junit4:junit4]   2> 5393 T1842 oascsi.HttpClientUtil.createClient Creating new http client, config:maxConnections=128&maxConnectionsPerHost=32&followRedirects=false
[junit4:junit4]   2> 5418 T1842 oascsi.HttpClientUtil.createClient Creating new http client, config:
[junit4:junit4]   2> 5437 T1842 oaz.ZooKeeper.<init> Initiating client connection, connectString=127.0.0.1:60965/solr sessionTimeout=10000 watcher=org.apache.solr.common.cloud.ConnectionManager@78a97e2a
[junit4:junit4]   2> 5439 T1842 oascc.ConnectionManager.waitForConnected Waiting for client to connect to ZooKeeper
[junit4:junit4]   2> 5439 T1869 oaz.ClientCnxn$SendThread.logStartConnect Opening socket connection to server localhost/127.0.0.1:60965. Will not attempt to authenticate using SASL (access denied ("javax.security.auth.AuthPermission" "getLoginConfiguration"))
[junit4:junit4]   2> 5440 T1869 oaz.ClientCnxn$SendThread.primeConnection Socket connection established to localhost/127.0.0.1:60965, initiating session
[junit4:junit4]   2> 5440 T1844 oazs.NIOServerCnxnFactory.run Accepted socket connection from /140.211.11.196:60971
[junit4:junit4]   2> 5441 T1844 oazs.ZooKeeperServer.processConnectRequest Client attempting to establish new session at /140.211.11.196:60971
[junit4:junit4]   2> 5443 T1846 oazs.ZooKeeperServer.finishSessionInit Established session 0x13cce257e620004 with negotiated timeout 10000 for client /140.211.11.196:60971
[junit4:junit4]   2> 5443 T1869 oaz.ClientCnxn$SendThread.onConnected Session establishment complete on server localhost/127.0.0.1:60965, sessionid = 0x13cce257e620004, negotiated timeout = 10000
[junit4:junit4]   2> 5443 T1870 oascc.ConnectionManager.process Watcher org.apache.solr.common.cloud.ConnectionManager@78a97e2a name:ZooKeeperConnection Watcher:127.0.0.1:60965/solr got event WatchedEvent state:SyncConnected type:None path:null path:null type:None
[junit4:junit4]   2> 5444 T1842 oascc.ConnectionManager.waitForConnected Client is connected to ZooKeeper
[junit4:junit4]   2> 5445 T1842 oascc.ZkStateReader.createClusterStateWatchersAndUpdate Updating cluster state from ZooKeeper... 
[junit4:junit4]   2> 5447 T1842 oasc.ChaosMonkey.monkeyLog monkey: init - expire sessions:true cause connection loss:true
[junit4:junit4]   2> 5637 T1842 oejs.Server.doStart jetty-8.1.8.v20121106
[junit4:junit4]   2> 5641 T1842 oejs.AbstractConnector.doStart Started SocketConnector@127.0.0.1:60972
[junit4:junit4]   2> 5642 T1842 oass.SolrDispatchFilter.init SolrDispatchFilter.init()
[junit4:junit4]   2> 5643 T1842 oasc.SolrResourceLoader.locateSolrHome JNDI not configured for solr (NoInitialContextEx)
[junit4:junit4]   2> 5643 T1842 oasc.SolrResourceLoader.locateSolrHome using system property solr.solr.home: /usr/home/hudson/hudson-slave/workspace/Lucene-Solr-Tests-trunk-java7/solr/build/solr-core/test/J1/./org.apache.solr.cloud.BasicDistributedZkTest-jetty1-1360668234654
[junit4:junit4]   2> 5643 T1842 oasc.CoreContainer$Initializer.initialize looking for solr.xml: /usr/home/hudson/hudson-slave/workspace/Lucene-Solr-Tests-trunk-java7/solr/build/solr-core/test/J1/./org.apache.solr.cloud.BasicDistributedZkTest-jetty1-1360668234654/solr.xml
[junit4:junit4]   2> 5644 T1842 oasc.CoreContainer.<init> New CoreContainer 1188406593
[junit4:junit4]   2> 5645 T1842 oasc.CoreContainer.load Loading CoreContainer using Solr Home: '/usr/home/hudson/hudson-slave/workspace/Lucene-Solr-Tests-trunk-java7/solr/build/solr-core/test/J1/./org.apache.solr.cloud.BasicDistributedZkTest-jetty1-1360668234654/'
[junit4:junit4]   2> 5645 T1842 oasc.SolrResourceLoader.<init> new SolrResourceLoader for directory: '/usr/home/hudson/hudson-slave/workspace/Lucene-Solr-Tests-trunk-java7/solr/build/solr-core/test/J1/./org.apache.solr.cloud.BasicDistributedZkTest-jetty1-1360668234654/'
[junit4:junit4]   2> 5719 T1842 oashc.HttpShardHandlerFactory.getParameter Setting socketTimeout to: 60000
[junit4:junit4]   2> 5720 T1842 oashc.HttpShardHandlerFactory.getParameter Setting urlScheme to: http://
[junit4:junit4]   2> 5720 T1842 oashc.HttpShardHandlerFactory.getParameter Setting connTimeout to: 15000
[junit4:junit4]   2> 5721 T1842 oashc.HttpShardHandlerFactory.getParameter Setting maxConnectionsPerHost to: 20
[junit4:junit4]   2> 5721 T1842 oashc.HttpShardHandlerFactory.getParameter Setting corePoolSize to: 0
[junit4:junit4]   2> 5722 T1842 oashc.HttpShardHandlerFactory.getParameter Setting maximumPoolSize to: 2147483647
[junit4:junit4]   2> 5722 T1842 oashc.HttpShardHandlerFactory.getParameter Setting maxThreadIdleTime to: 5
[junit4:junit4]   2> 5723 T1842 oashc.HttpShardHandlerFactory.getParameter Setting sizeOfQueue to: -1
[junit4:junit4]   2> 5723 T1842 oashc.HttpShardHandlerFactory.getParameter Setting fairnessPolicy to: false
[junit4:junit4]   2> 5724 T1842 oascsi.HttpClientUtil.createClient Creating new http client, config:maxConnectionsPerHost=20&maxConnections=10000&socketTimeout=60000&connTimeout=15000&retry=false
[junit4:junit4]   2> 5746 T1842 oasc.CoreContainer.load Registering Log Listener
[junit4:junit4]   2> 5768 T1842 oasc.CoreContainer.initZooKeeper Zookeeper client=127.0.0.1:60965/solr
[junit4:junit4]   2> 5769 T1842 oasc.ZkController.checkChrootPath zkHost includes chroot
[junit4:junit4]   2> 5769 T1842 oaz.ZooKeeper.<init> Initiating client connection, connectString=127.0.0.1:60965 sessionTimeout=60000 watcher=org.apache.solr.common.cloud.ConnectionManager@1fad12f0
[junit4:junit4]   2> 5770 T1842 oascc.ConnectionManager.waitForConnected Waiting for client to connect to ZooKeeper
[junit4:junit4]   2> 5771 T1880 oaz.ClientCnxn$SendThread.logStartConnect Opening socket connection to server localhost/127.0.0.1:60965. Will not attempt to authenticate using SASL (access denied ("javax.security.auth.AuthPermission" "getLoginConfiguration"))
[junit4:junit4]   2> 5771 T1880 oaz.ClientCnxn$SendThread.primeConnection Socket connection established to localhost/127.0.0.1:60965, initiating session
[junit4:junit4]   2> 5771 T1844 oazs.NIOServerCnxnFactory.run Accepted socket connection from /140.211.11.196:60973
[junit4:junit4]   2> 5772 T1844 oazs.ZooKeeperServer.processConnectRequest Client attempting to establish new session at /140.211.11.196:60973
[junit4:junit4]   2> 5774 T1880 oaz.ClientCnxn$SendThread.onConnected Session establishment complete on server localhost/127.0.0.1:60965, sessionid = 0x13cce257e620005, negotiated timeout = 20000
[junit4:junit4]   2> 5774 T1846 oazs.ZooKeeperServer.finishSessionInit Established session 0x13cce257e620005 with negotiated timeout 20000 for client /140.211.11.196:60973
[junit4:junit4]   2> 5774 T1881 oascc.ConnectionManager.process Watcher org.apache.solr.common.cloud.ConnectionManager@1fad12f0 name:ZooKeeperConnection Watcher:127.0.0.1:60965 got event WatchedEvent state:SyncConnected type:None path:null path:null type:None
[junit4:junit4]   2> 5774 T1842 oascc.ConnectionManager.waitForConnected Client is connected to ZooKeeper
[junit4:junit4]   2> 5776 T1847 oazs.PrepRequestProcessor.pRequest2Txn Processed session termination for sessionid: 0x13cce257e620005
[junit4:junit4]   2> 5777 T1881 oaz.ClientCnxn$EventThread.run EventThread shut down
[junit4:junit4]   2> 5777 T1844 oazs.NIOServerCnxn.closeSock Closed socket connection for client /140.211.11.196:60973 which had sessionid 0x13cce257e620005
[junit4:junit4]   2> 5777 T1842 oaz.ZooKeeper.close Session: 0x13cce257e620005 closed
[junit4:junit4]   2> 5778 T1842 oascsi.HttpClientUtil.createClient Creating new http client, config:maxConnections=500&maxConnectionsPerHost=16&socketTimeout=60000&connTimeout=15000
[junit4:junit4]   2> 5789 T1842 oaz.ZooKeeper.<init> Initiating client connection, connectString=127.0.0.1:60965/solr sessionTimeout=30000 watcher=org.apache.solr.common.cloud.ConnectionManager@ab5f09c
[junit4:junit4]   2> 5791 T1842 oascc.ConnectionManager.waitForConnected Waiting for client to connect to ZooKeeper
[junit4:junit4]   2> 5791 T1882 oaz.ClientCnxn$SendThread.logStartConnect Opening socket connection to server localhost/127.0.0.1:60965. Will not attempt to authenticate using SASL (access denied ("javax.security.auth.AuthPermission" "getLoginConfiguration"))
[junit4:junit4]   2> 5791 T1882 oaz.ClientCnxn$SendThread.primeConnection Socket connection established to localhost/127.0.0.1:60965, initiating session
[junit4:junit4]   2> 5792 T1844 oazs.NIOServerCnxnFactory.run Accepted socket connection from /140.211.11.196:60974
[junit4:junit4]   2> 5792 T1844 oazs.ZooKeeperServer.processConnectRequest Client attempting to establish new session at /140.211.11.196:60974
[junit4:junit4]   2> 5794 T1846 oazs.ZooKeeperServer.finishSessionInit Established session 0x13cce257e620006 with negotiated timeout 20000 for client /140.211.11.196:60974
[junit4:junit4]   2> 5794 T1882 oaz.ClientCnxn$SendThread.onConnected Session establishment complete on server localhost/127.0.0.1:60965, sessionid = 0x13cce257e620006, negotiated timeout = 20000
[junit4:junit4]   2> 5794 T1883 oascc.ConnectionManager.process Watcher org.apache.solr.common.cloud.ConnectionManager@ab5f09c name:ZooKeeperConnection Watcher:127.0.0.1:60965/solr got event WatchedEvent state:SyncConnected type:None path:null path:null type:None
[junit4:junit4]   2> 5794 T1842 oascc.ConnectionManager.waitForConnected Client is connected to ZooKeeper
[junit4:junit4]   2> 5795 T1847 oazs.PrepRequestProcessor.pRequest Got user-level KeeperException when processing sessionid:0x13cce257e620006 type:create cxid:0x1 zxid:0x49 txntype:-1 reqpath:n/a Error Path:/solr/overseer Error:KeeperErrorCode = NodeExists for /solr/overseer
[junit4:junit4]   2> 5797 T1847 oazs.PrepRequestProcessor.pRequest Got user-level KeeperException when processing sessionid:0x13cce257e620006 type:create cxid:0x2 zxid:0x4a txntype:-1 reqpath:n/a Error Path:/solr/overseer Error:KeeperErrorCode = NodeExists for /solr/overseer
[junit4:junit4]   2> 5805 T1842 oascc.ZkStateReader.createClusterStateWatchersAndUpdate Updating cluster state from ZooKeeper... 
[junit4:junit4]   2> 5808 T1842 oasc.ZkController.createEphemeralLiveNode Register node as live in ZooKeeper:/live_nodes/127.0.0.1:60972_hu_%2Fj
[junit4:junit4]   2> 5809 T1847 oazs.PrepRequestProcessor.pRequest Got user-level KeeperException when processing sessionid:0x13cce257e620006 type:delete cxid:0x9 zxid:0x4b txntype:-1 reqpath:n/a Error Path:/solr/live_nodes/127.0.0.1:60972_hu_%2Fj Error:KeeperErrorCode = NoNode for /solr/live_nodes/127.0.0.1:60972_hu_%2Fj
[junit4:junit4]   2> 5810 T1842 oascc.SolrZkClient.makePath makePath: /live_nodes/127.0.0.1:60972_hu_%2Fj
[junit4:junit4]   2> 5814 T1864 oascc.ZkStateReader$2.process A cluster state change: WatchedEvent state:SyncConnected type:NodeChildrenChanged path:/live_nodes, has occurred - updating... (live nodes size: 1)
[junit4:junit4]   2> 5814 T1870 oascc.ZkStateReader$3.process Updating live nodes... (2)
[junit4:junit4]   2> 5814 T1883 oascc.ZkStateReader$3.process Updating live nodes... (2)
[junit4:junit4]   2> 5816 T1864 oascc.ZkStateReader$3.process Updating live nodes... (2)
[junit4:junit4]   2> 5823 T1884 oasc.CoreContainer.create Creating SolrCore 'collection1' using instanceDir: /usr/home/hudson/hudson-slave/workspace/Lucene-Solr-Tests-trunk-java7/solr/build/solr-core/test/J1/./org.apache.solr.cloud.BasicDistributedZkTest-jetty1-1360668234654/collection1
[junit4:junit4]   2> 5824 T1884 oasc.ZkController.createCollectionZkNode Check for collection zkNode:collection1
[junit4:junit4]   2> 5824 T1884 oasc.ZkController.createCollectionZkNode Collection zkNode exists
[junit4:junit4]   2> 5824 T1884 oasc.ZkController.readConfigName Load collection config from:/collections/collection1
[junit4:junit4]   2> 5826 T1884 oasc.SolrResourceLoader.<init> new SolrResourceLoader for directory: '/usr/home/hudson/hudson-slave/workspace/Lucene-Solr-Tests-trunk-java7/solr/build/solr-core/test/J1/./org.apache.solr.cloud.BasicDistributedZkTest-jetty1-1360668234654/collection1/'
[junit4:junit4]   2> 5827 T1884 oasc.SolrResourceLoader.replaceClassLoader Adding 'file:/usr/home/hudson/hudson-slave/workspace/Lucene-Solr-Tests-trunk-java7/solr/build/solr-core/test/J1/org.apache.solr.cloud.BasicDistributedZkTest-jetty1-1360668234654/collection1/lib/classes/' to classloader
[junit4:junit4]   2> 5828 T1884 oasc.SolrResourceLoader.replaceClassLoader Adding 'file:/usr/home/hudson/hudson-slave/workspace/Lucene-Solr-Tests-trunk-java7/solr/build/solr-core/test/J1/org.apache.solr.cloud.BasicDistributedZkTest-jetty1-1360668234654/collection1/lib/README' to classloader
[junit4:junit4]   2> 5886 T1884 oasc.SolrConfig.<init> Using Lucene MatchVersion: LUCENE_50
[junit4:junit4]   2> 5962 T1884 oasc.SolrConfig.<init> Loaded SolrConfig: solrconfig.xml
[junit4:junit4]   2> 6063 T1884 oass.IndexSchema.readSchema Reading Solr Schema
[junit4:junit4]   2> 6071 T1884 oass.IndexSchema.readSchema Schema name=test
[junit4:junit4]   2> 6824 T1884 oass.OpenExchangeRatesOrgProvider.init Initialized with rates=open-exchange-rates.json, refreshInterval=1440.
[junit4:junit4]   2> 6837 T1865 oascc.ZkStateReader.updateClusterState Updating cloud state from ZooKeeper... 
[junit4:junit4]   2> 6837 T1884 oass.IndexSchema.readSchema default search field in schema is text
[junit4:junit4]   2> 6838 T1865 oasc.Overseer$ClusterStateUpdater.updateState Update state numShards=1 message={
[junit4:junit4]   2> 	  "operation":"state",
[junit4:junit4]   2> 	  "numShards":"1",
[junit4:junit4]   2> 	  "shard":"shard1",
[junit4:junit4]   2> 	  "roles":null,
[junit4:junit4]   2> 	  "state":"active",
[junit4:junit4]   2> 	  "core":"collection1",
[junit4:junit4]   2> 	  "collection":"control_collection",
[junit4:junit4]   2> 	  "node_name":"127.0.0.1:60968_hu_%2Fj",
[junit4:junit4]   2> 	  "base_url":"http://127.0.0.1:60968/hu_/j"}
[junit4:junit4]   2> 6841 T1884 oass.IndexSchema.readSchema unique key field: id
[junit4:junit4]   2> 6857 T1870 oascc.ZkStateReader$2.process A cluster state change: WatchedEvent state:SyncConnected type:NodeDataChanged path:/clusterstate.json, has occurred - updating... (live nodes size: 2)
[junit4:junit4]   2> 6857 T1883 oascc.ZkStateReader$2.process A cluster state change: WatchedEvent state:SyncConnected type:NodeDataChanged path:/clusterstate.json, has occurred - updating... (live nodes size: 2)
[junit4:junit4]   2> 6857 T1864 oascc.ZkStateReader$2.process A cluster state change: WatchedEvent state:SyncConnected type:NodeDataChanged path:/clusterstate.json, has occurred - updating... (live nodes size: 2)
[junit4:junit4]   2> 6873 T1884 oass.FileExchangeRateProvider.reload Reloading exchange rates from file currency.xml
[junit4:junit4]   2> 6879 T1884 oass.FileExchangeRateProvider.reload Reloading exchange rates from file currency.xml
[junit4:junit4]   2> 6884 T1884 oass.OpenExchangeRatesOrgProvider.reload Reloading exchange rates from open-exchange-rates.json
[junit4:junit4]   2> 6885 T1884 oass.OpenExchangeRatesOrgProvider.reload Reloading exchange rates from open-exchange-rates.json
[junit4:junit4]   2> 6887 T1884 oasc.SolrCore.<init> [collection1] Opening new SolrCore at /usr/home/hudson/hudson-slave/workspace/Lucene-Solr-Tests-trunk-java7/solr/build/solr-core/test/J1/./org.apache.solr.cloud.BasicDistributedZkTest-jetty1-1360668234654/collection1/, dataDir=./org.apache.solr.cloud.BasicDistributedZkTest-1360668229211/jetty1/
[junit4:junit4]   2> 6887 T1884 oasc.JmxMonitoredMap.<init> JMX monitoring is enabled. Adding Solr mbeans to JMX Server: com.sun.jmx.mbeanserver.JmxMBeanServer@26058825
[junit4:junit4]   2> 6888 T1884 oasc.SolrCore.initDirectoryFactory solr.NRTCachingDirectoryFactory
[junit4:junit4]   2> 6889 T1884 oasc.CachingDirectoryFactory.get return new directory for /usr/home/hudson/hudson-slave/workspace/Lucene-Solr-Tests-trunk-java7/solr/build/solr-core/test/J1/./org.apache.solr.cloud.BasicDistributedZkTest-1360668229211/jetty1 forceNew:false
[junit4:junit4]   2> 6889 T1884 oasc.CachingDirectoryFactory.close Releasing directory:/usr/home/hudson/hudson-slave/workspace/Lucene-Solr-Tests-trunk-java7/solr/build/solr-core/test/J1/./org.apache.solr.cloud.BasicDistributedZkTest-1360668229211/jetty1
[junit4:junit4]   2> 6890 T1884 oasc.SolrCore.getNewIndexDir New index directory detected: old=null new=./org.apache.solr.cloud.BasicDistributedZkTest-1360668229211/jetty1/index/
[junit4:junit4]   2> 6890 T1884 oasc.SolrCore.initIndex WARNING [collection1] Solr index directory './org.apache.solr.cloud.BasicDistributedZkTest-1360668229211/jetty1/index' doesn't exist. Creating new index...
[junit4:junit4]   2> 6891 T1884 oasc.CachingDirectoryFactory.get return new directory for /usr/home/hudson/hudson-slave/workspace/Lucene-Solr-Tests-trunk-java7/solr/build/solr-core/test/J1/./org.apache.solr.cloud.BasicDistributedZkTest-1360668229211/jetty1/index forceNew:false
[junit4:junit4]   2> 6900 T1884 oasc.SolrDeletionPolicy.onCommit SolrDeletionPolicy.onCommit: commits:num=1
[junit4:junit4]   2> 		commit{dir=RateLimitedDirectoryWrapper(NRTCachingDirectory(org.apache.lucene.store.NIOFSDirectory@/usr/home/hudson/hudson-slave/workspace/Lucene-Solr-Tests-trunk-java7/solr/build/solr-core/test/J1/org.apache.solr.cloud.BasicDistributedZkTest-1360668229211/jetty1/index lockFactory=org.apache.lucene.store.NativeFSLockFactory@6c0dbbd8; maxCacheMB=48.0 maxMergeSizeMB=4.0)),segFN=segments_1,generation=1,filenames=[segments_1]
[junit4:junit4]   2> 6900 T1884 oasc.SolrDeletionPolicy.updateCommits newest commit = 1[segments_1]
[junit4:junit4]   2> 6901 T1884 oasc.CachingDirectoryFactory.close Releasing directory:/usr/home/hudson/hudson-slave/workspace/Lucene-Solr-Tests-trunk-java7/solr/build/solr-core/test/J1/./org.apache.solr.cloud.BasicDistributedZkTest-1360668229211/jetty1/index
[junit4:junit4]   2> 6902 T1884 oasc.SolrCore.initWriters created xml: solr.XMLResponseWriter
[junit4:junit4]   2> 6904 T1884 oasup.UpdateRequestProcessorChain.init inserting DistributedUpdateProcessorFactory into updateRequestProcessorChain "dedupe"
[junit4:junit4]   2> 6905 T1884 oasup.UpdateRequestProcessorChain.init inserting DistributedUpdateProcessorFactory into updateRequestProcessorChain "dedupe-allfields"
[junit4:junit4]   2> 6905 T1884 oasup.UpdateRequestProcessorChain.init inserting DistributedUpdateProcessorFactory into updateRequestProcessorChain "stored_sig"
[junit4:junit4]   2> 6905 T1884 oasup.UpdateRequestProcessorChain.init inserting DistributedUpdateProcessorFactory into updateRequestProcessorChain "uniq-fields"
[junit4:junit4]   2> 6906 T1884 oasup.UpdateRequestProcessorChain.init inserting DistributedUpdateProcessorFactory into updateRequestProcessorChain "distrib-dup-test-chain-implicit"
[junit4:junit4]   2> 6906 T1884 oasc.RequestHandlers.initHandlersFromConfig adding lazy requestHandler: solr.ReplicationHandler
[junit4:junit4]   2> 6907 T1884 oasc.RequestHandlers.initHandlersFromConfig created /replication: solr.ReplicationHandler
[junit4:junit4]   2> 6908 T1884 oasc.RequestHandlers.initHandlersFromConfig created standard: solr.StandardRequestHandler
[junit4:junit4]   2> 6908 T1884 oasc.RequestHandlers.initHandlersFromConfig created /get: solr.RealTimeGetHandler
[junit4:junit4]   2> 6909 T1884 oasc.RequestHandlers.initHandlersFromConfig created dismax: solr.SearchHandler
[junit4:junit4]   2> 6910 T1884 oasc.RequestHandlers.initHandlersFromConfig created mock: org.apache.solr.core.MockQuerySenderListenerReqHandler
[junit4:junit4]   2> 6910 T1884 oasc.RequestHandlers.initHandlersFromConfig created /admin/: org.apache.solr.handler.admin.AdminHandlers
[junit4:junit4]   2> 6911 T1884 oasc.RequestHandlers.initHandlersFromConfig created defaults: solr.StandardRequestHandler
[junit4:junit4]   2> 6911 T1884 oasc.RequestHandlers.initHandlersFromConfig adding lazy requestHandler: solr.StandardRequestHandler
[junit4:junit4]   2> 6911 T1884 oasc.RequestHandlers.initHandlersFromConfig created lazy: solr.StandardRequestHandler
[junit4:junit4]   2> 6912 T1884 oasc.RequestHandlers.initHandlersFromConfig created /update: solr.UpdateRequestHandler
[junit4:junit4]   2> 6913 T1884 oasc.RequestHandlers.initHandlersFromConfig created /terms: org.apache.solr.handler.component.SearchHandler
[junit4:junit4]   2> 6913 T1884 oasc.RequestHandlers.initHandlersFromConfig created spellCheckCompRH: org.apache.solr.handler.component.SearchHandler
[junit4:junit4]   2> 6914 T1884 oasc.RequestHandlers.initHandlersFromConfig created spellCheckCompRH_Direct: org.apache.solr.handler.component.SearchHandler
[junit4:junit4]   2> 6914 T1884 oasc.RequestHandlers.initHandlersFromConfig created spellCheckWithWordbreak: org.apache.solr.handler.component.SearchHandler
[junit4:junit4]   2> 6915 T1884 oasc.RequestHandlers.initHandlersFromConfig created spellCheckWithWordbreak_Direct: org.apache.solr.handler.component.SearchHandler
[junit4:junit4]   2> 6916 T1884 oasc.RequestHandlers.initHandlersFromConfig created spellCheckCompRH1: org.apache.solr.handler.component.SearchHandler
[junit4:junit4]   2> 6916 T1884 oasc.RequestHandlers.initHandlersFromConfig created mltrh: org.apache.solr.handler.component.SearchHandler
[junit4:junit4]   2> 6917 T1884 oasc.RequestHandlers.initHandlersFromConfig created tvrh: org.apache.solr.handler.component.SearchHandler
[junit4:junit4]   2> 6917 T1884 oasc.RequestHandlers.initHandlersFromConfig created /mlt: solr.MoreLikeThisHandler
[junit4:junit4]   2> 6918 T1884 oasc.RequestHandlers.initHandlersFromConfig created /debug/dump: solr.DumpRequestHandler
[junit4:junit4]   2> 6932 T1884 oashl.XMLLoader.init xsltCacheLifetimeSeconds=60
[junit4:junit4]   2> 6937 T1884 oasc.SolrCore.initDeprecatedSupport WARNING solrconfig.xml uses deprecated <admin/gettableFiles>, Please update your config to use the ShowFileRequestHandler.
[junit4:junit4]   2> 6939 T1884 oasc.SolrCore.initDeprecatedSupport WARNING adding ShowFileRequestHandler with hidden files: [SCHEMA.XML, OLD_SYNONYMS.TXT, STOPWORDS.TXT, PROTWORDS.TXT, OPEN-EXCHANGE-RATES.JSON, SYNONYMS.TXT, CURRENCY.XML, MAPPING-ISOLATIN1ACCENT.TXT]
[junit4:junit4]   2> 6942 T1884 oasc.CachingDirectoryFactory.close Releasing directory:/usr/home/hudson/hudson-slave/workspace/Lucene-Solr-Tests-trunk-java7/solr/build/solr-core/test/J1/./org.apache.solr.cloud.BasicDistributedZkTest-1360668229211/jetty1
[junit4:junit4]   2> 6944 T1884 oass.SolrIndexSearcher.<init> Opening Searcher@748d43cf main
[junit4:junit4]   2> 6945 T1884 oasu.CommitTracker.<init> Hard AutoCommit: disabled
[junit4:junit4]   2> 6945 T1884 oasu.CommitTracker.<init> Soft AutoCommit: disabled
[junit4:junit4]   2> 6946 T1884 oashc.SpellCheckComponent.inform Initializing spell checkers
[junit4:junit4]   2> 6955 T1884 oass.DirectSolrSpellChecker.init init: {name=direct,classname=DirectSolrSpellChecker,field=lowerfilt,minQueryLength=3}
[junit4:junit4]   2> 6999 T1885 oasc.SolrCore.registerSearcher [collection1] Registered new searcher Searcher@748d43cf main{StandardDirectoryReader(segments_1:1)}
[junit4:junit4]   2> 7006 T1884 oasc.ZkController.publish publishing core=collection1 state=down
[junit4:junit4]   2> 7006 T1884 oasc.ZkController.publish numShards not found on descriptor - reading it from system property
[junit4:junit4]   2> 8363 T1865 oascc.ZkStateReader.updateClusterState Updating cloud state from ZooKeeper... 
[junit4:junit4]   2> 8364 T1865 oasc.Overseer$ClusterStateUpdater.updateState Update state numShards=2 message={
[junit4:junit4]   2> 	  "operation":"state",
[junit4:junit4]   2> 	  "numShards":"2",
[junit4:junit4]   2> 	  "shard":null,
[junit4:junit4]   2> 	  "roles":null,
[junit4:junit4]   2> 	  "state":"down",
[junit4:junit4]   2> 	  "core":"collection1",
[junit4:junit4]   2> 	  "collection":"collection1",
[junit4:junit4]   2> 	  "node_name":"127.0.0.1:60972_hu_%2Fj",
[junit4:junit4]   2> 	  "base_url":"http://127.0.0.1:60972/hu_/j"}
[junit4:junit4]   2> 8364 T1865 oasc.Overseer$ClusterStateUpdater.createCollection Create collection collection1 with numShards 2
[junit4:junit4]   2> 8364 T1865 oasc.Overseer$ClusterStateUpdater.updateState Assigning new node to shard shard=shard1
[junit4:junit4]   2> 8382 T1883 oascc.ZkStateReader$2.process A cluster state change: WatchedEvent state:SyncConnected type:NodeDataChanged path:/clusterstate.json, has occurred - updating... (live nodes size: 2)
[junit4:junit4]   2> 8382 T1870 oascc.ZkStateReader$2.process A cluster state change: WatchedEvent state:SyncConnected type:NodeDataChanged path:/clusterstate.json, has occurred - updating... (live nodes size: 2)
[junit4:junit4]   2> 8382 T1864 oascc.ZkStateReader$2.process A cluster state change: WatchedEvent state:SyncConnected type:NodeDataChanged path:/clusterstate.json, has occurred - updating... (live nodes size: 2)
[junit4:junit4]   2> 9010 T1884 oasc.CoreContainer.registerCore registering core: collection1
[junit4:junit4]   2> 9010 T1884 oasc.ZkController.register Register replica - core:collection1 address:http://127.0.0.1:60972/hu_/j collection:collection1 shard:shard1
[junit4:junit4]   2> 9011 T1884 oascc.SolrZkClient.makePath makePath: /collections/collection1/leader_elect/shard1/election
[junit4:junit4]   2> 9031 T1847 oazs.PrepRequestProcessor.pRequest Got user-level KeeperException when processing sessionid:0x13cce257e620006 type:delete cxid:0x47 zxid:0x5b txntype:-1 reqpath:n/a Error Path:/solr/collections/collection1/leaders Error:KeeperErrorCode = NoNode for /solr/collections/collection1/leaders
[junit4:junit4]   2> 9036 T1884 oasc.ShardLeaderElectionContext.runLeaderProcess Running the leader process.
[junit4:junit4]   2> 9037 T1847 oazs.PrepRequestProcessor.pRequest Got user-level KeeperException when processing sessionid:0x13cce257e620006 type:create cxid:0x48 zxid:0x5c txntype:-1 reqpath:n/a Error Path:/solr/overseer Error:KeeperErrorCode = NodeExists for /solr/overseer
[junit4:junit4]   2> 9045 T1884 oasc.ShardLeaderElectionContext.waitForReplicasToComeUp Enough replicas found to continue.
[junit4:junit4]   2> 9046 T1884 oasc.ShardLeaderElectionContext.runLeaderProcess I may be the new leader - try and sync
[junit4:junit4]   2> 9046 T1884 oasc.SyncStrategy.sync Sync replicas to http://127.0.0.1:60972/hu_/j/collection1/
[junit4:junit4]   2> 9046 T1884 oasc.SyncStrategy.syncReplicas Sync Success - now sync replicas to me
[junit4:junit4]   2> 9046 T1884 oasc.SyncStrategy.syncToMe http://127.0.0.1:60972/hu_/j/collection1/ has no replicas
[junit4:junit4]   2> 9047 T1884 oasc.ShardLeaderElectionContext.runLeaderProcess I am the new leader: http://127.0.0.1:60972/hu_/j/collection1/
[junit4:junit4]   2> 9047 T1884 oascc.SolrZkClient.makePath makePath: /collections/collection1/leaders/shard1
[junit4:junit4]   2> 9053 T1847 oazs.PrepRequestProcessor.pRequest Got user-level KeeperException when processing sessionid:0x13cce257e620006 type:create cxid:0x52 zxid:0x60 txntype:-1 reqpath:n/a Error Path:/solr/overseer Error:KeeperErrorCode = NodeExists for /solr/overseer
[junit4:junit4]   2> 9920 T1865 oascc.ZkStateReader.updateClusterState Updating cloud state from ZooKeeper... 
[junit4:junit4]   2> 9977 T1870 oascc.ZkStateReader$2.process A cluster state change: WatchedEvent state:SyncConnected type:NodeDataChanged path:/clusterstate.json, has occurred - updating... (live nodes size: 2)
[junit4:junit4]   2> 9977 T1864 oascc.ZkStateReader$2.process A cluster state change: WatchedEvent state:SyncConnected type:NodeDataChanged path:/clusterstate.json, has occurred - updating... (live nodes size: 2)
[junit4:junit4]   2> 9977 T1883 oascc.ZkStateReader$2.process A cluster state change: WatchedEvent state:SyncConnected type:NodeDataChanged path:/clusterstate.json, has occurred - updating... (live nodes size: 2)
[junit4:junit4]   2> 10031 T1884 oasc.ZkController.register We are http://127.0.0.1:60972/hu_/j/collection1/ and leader is http://127.0.0.1:60972/hu_/j/collection1/
[junit4:junit4]   2> 10031 T1884 oasc.ZkController.register No LogReplay needed for core=collection1 baseURL=http://127.0.0.1:60972/hu_/j
[junit4:junit4]   2> 10031 T1884 oasc.ZkController.checkRecovery I am the leader, no recovery necessary
[junit4:junit4]   2> 10032 T1884 oasc.ZkController.publish publishing core=collection1 state=active
[junit4:junit4]   2> 10032 T1884 oasc.ZkController.publish numShards not found on descriptor - reading it from system property
[junit4:junit4]   2> 10035 T1884 oascc.ZkStateReader.updateClusterState Updating cloud state from ZooKeeper... 
[junit4:junit4]   2> 10036 T1842 oass.SolrDispatchFilter.init user.dir=/usr/home/hudson/hudson-slave/workspace/Lucene-Solr-Tests-trunk-java7/solr/build/solr-core/test/J1
[junit4:junit4]   2> 10037 T1842 oass.SolrDispatchFilter.init SolrDispatchFilter.init() done
[junit4:junit4]   2> 10037 T1842 oascsi.HttpClientUtil.createClient Creating new http client, config:maxConnections=128&maxConnectionsPerHost=32&followRedirects=false
[junit4:junit4]   2> 10238 T1842 oejs.Server.doStart jetty-8.1.8.v20121106
[junit4:junit4]   2> 10241 T1842 oejs.AbstractConnector.doStart Started SocketConnector@127.0.0.1:60975
[junit4:junit4]   2> 10242 T1842 oass.SolrDispatchFilter.init SolrDispatchFilter.init()
[junit4:junit4]   2> 10243 T1842 oasc.SolrResourceLoader.locateSolrHome JNDI not configured for solr (NoInitialContextEx)
[junit4:junit4]   2> 10243 T1842 oasc.SolrResourceLoader.locateSolrHome using system property solr.solr.home: /usr/home/hudson/hudson-slave/workspace/Lucene-Solr-Tests-trunk-java7/solr/build/solr-core/test/J1/./org.apache.solr.cloud.BasicDistributedZkTest-jetty2-1360668239259
[junit4:junit4]   2> 10244 T1842 oasc.CoreContainer$Initializer.initialize looking for solr.xml: /usr/home/hudson/hudson-slave/workspace/Lucene-Solr-Tests-trunk-java7/solr/build/solr-core/test/J1/./org.apache.solr.cloud.BasicDistributedZkTest-jetty2-1360668239259/solr.xml
[junit4:junit4]   2> 10244 T1842 oasc.CoreContainer.<init> New CoreContainer 13723955
[junit4:junit4]   2> 10245 T1842 oasc.CoreContainer.load Loading CoreContainer using Solr Home: '/usr/home/hudson/hudson-slave/workspace/Lucene-Solr-Tests-trunk-java7/solr/build/solr-core/test/J1/./org.apache.solr.cloud.BasicDistributedZkTest-jetty2-1360668239259/'
[junit4:junit4]   2> 10245 T1842 oasc.SolrResourceLoader.<init> new SolrResourceLoader for directory: '/usr/home/hudson/hudson-slave/workspace/Lucene-Solr-Tests-trunk-java7/solr/build/solr-core/test/J1/./org.apache.solr.cloud.BasicDistributedZkTest-jetty2-1360668239259/'
[junit4:junit4]   2> 10315 T1842 oashc.HttpShardHandlerFactory.getParameter Setting socketTimeout to: 60000
[junit4:junit4]   2> 10316 T1842 oashc.HttpShardHandlerFactory.getParameter Setting urlScheme to: http://
[junit4:junit4]   2> 10316 T1842 oashc.HttpShardHandlerFactory.getParameter Setting connTimeout to: 15000
[junit4:junit4]   2> 10317 T1842 oashc.HttpShardHandlerFactory.getParameter Setting maxConnectionsPerHost to: 20
[junit4:junit4]   2> 10317 T1842 oashc.HttpShardHandlerFactory.getParameter Setting corePoolSize to: 0
[junit4:junit4]   2> 10318 T1842 oashc.HttpShardHandlerFactory.getParameter Setting maximumPoolSize to: 2147483647
[junit4:junit4]   2> 10318 T1842 oashc.HttpShardHandlerFactory.getParameter Setting maxThreadIdleTime to: 5
[junit4:junit4]   2> 10319 T1842 oashc.HttpShardHandlerFactory.getParameter Setting sizeOfQueue to: -1
[junit4:junit4]   2> 10319 T1842 oashc.HttpShardHandlerFactory.getParameter Setting fairnessPolicy to: false
[junit4:junit4]   2> 10320 T1842 oascsi.HttpClientUtil.createClient Creating new http client, config:maxConnectionsPerHost=20&maxConnections=10000&socketTimeout=60000&connTimeout=15000&retry=false
[junit4:junit4]   2> 10344 T1842 oasc.CoreContainer.load Registering Log Listener
[junit4:junit4]   2> 10368 T1842 oasc.CoreContainer.initZooKeeper Zookeeper client=127.0.0.1:60965/solr
[junit4:junit4]   2> 10369 T1842 oasc.ZkController.checkChrootPath zkHost includes chroot
[junit4:junit4]   2> 10370 T1842 oaz.ZooKeeper.<init> Initiating client connection, connectString=127.0.0.1:60965 sessionTimeout=60000 watcher=org.apache.solr.common.cloud.ConnectionManager@47d38c14
[junit4:junit4]   2> 10371 T1842 oascc.ConnectionManager.waitForConnected Waiting for client to connect to ZooKeeper
[junit4:junit4]   2> 10371 T1895 oaz.ClientCnxn$SendThread.logStartConnect Opening socket connection to server localhost/127.0.0.1:60965. Will not attempt to authenticate using SASL (access denied ("javax.security.auth.AuthPermission" "getLoginConfiguration"))
[junit4:junit4]   2> 10372 T1895 oaz.ClientCnxn$SendThread.primeConnection Socket connection established to localhost/127.0.0.1:60965, initiating session
[junit4:junit4]   2> 10372 T1844 oazs.NIOServerCnxnFactory.run Accepted socket connection from /140.211.11.196:60976
[junit4:junit4]   2> 10372 T1844 oazs.ZooKeeperServer.processConnectRequest Client attempting to establish new session at /140.211.11.196:60976
[junit4:junit4]   2> 10374 T1846 oazs.ZooKeeperServer.finishSessionInit Established session 0x13cce257e620007 with negotiated timeout 20000 for client /140.211.11.196:60976
[junit4:junit4]   2> 10374 T1895 oaz.ClientCnxn$SendThread.onConnected Session establishment complete on server localhost/127.0.0.1:60965, sessionid = 0x13cce257e620007, negotiated timeout = 20000
[junit4:junit4]   2> 10375 T1896 oascc.ConnectionManager.process Watcher org.apache.solr.common.cloud.ConnectionManager@47d38c14 name:ZooKeeperConnection Watcher:127.0.0.1:60965 got event WatchedEvent state:SyncConnected type:None path:null path:null type:None
[junit4:junit4]   2> 10375 T1842 oascc.ConnectionManager.waitForConnected Client is connected to ZooKeeper
[junit4:junit4]   2> 10376 T1847 oazs.PrepRequestProcessor.pRequest2Txn Processed session termination for sessionid: 0x13cce257e620007
[junit4:junit4]   2> 10377 T1896 oaz.ClientCnxn$EventThread.run EventThread shut down
[junit4:junit4]   2> 10377 T1844 oazs.NIOServerCnxn.closeSock Closed socket connection for client /140.211.11.196:60976 which had sessionid 0x13cce257e620007
[junit4:junit4]   2> 10377 T1842 oaz.ZooKeeper.close Session: 0x13cce257e620007 closed
[junit4:junit4]   2> 10378 T1842 oascsi.HttpClientUtil.createClient Creating new http client, config:maxConnections=500&maxConnectionsPerHost=16&socketTimeout=60000&connTimeout=15000
[junit4:junit4]   2> 10390 T1842 oaz.ZooKeeper.<init> Initiating client connection, connectString=127.0.0.1:60965/solr sessionTimeout=30000 watcher=org.apache.solr.common.cloud.ConnectionManager@34c427b4
[junit4:junit4]   2> 10391 T1842 oascc.ConnectionManager.waitForConnected Waiting for client to connect to ZooKeeper
[junit4:junit4]   2> 10392 T1897 oaz.ClientCnxn$SendThread.logStartConnect Opening socket connection to server localhost/127.0.0.1:60965. Will not attempt to authenticate using SASL (access denied ("javax.security.auth.AuthPermission" "getLoginConfiguration"))
[junit4:junit4]   2> 10392 T1897 oaz.ClientCnxn$SendThread.primeConnection Socket connection established to localhost/127.0.0.1:60965, initiating session
[junit4:junit4]   2> 10392 T1844 oazs.NIOServerCnxnFactory.run Accepted socket connection from /140.211.11.196:60977
[junit4:junit4]   2> 10393 T1844 oazs.ZooKeeperServer.processConnectRequest Client attempting to establish new session at /140.211.11.196:60977
[junit4:junit4]   2> 10395 T1846 oazs.ZooKeeperServer.finishSessionInit Established session 0x13cce257e620008 with negotiated timeout 20000 for client /140.211.11.196:60977
[junit4:junit4]   2> 10395 T1897 oaz.ClientCnxn$SendThread.onConnected Session establishment complete on server localhost/127.0.0.1:60965, sessionid = 0x13cce257e620008, negotiated timeout = 20000
[junit4:junit4]   2> 10395 T1898 oascc.ConnectionManager.process Watcher org.apache.solr.common.cloud.ConnectionManager@34c427b4 name:ZooKeeperConnection Watcher:127.0.0.1:60965/solr got event WatchedEvent state:SyncConnected type:None path:null path:null type:None
[junit4:junit4]   2> 10395 T1842 oascc.ConnectionManager.waitForConnected Client is connected to ZooKeeper
[junit4:junit4]   2> 10396 T1847 oazs.PrepRequestProcessor.pRequest Got user-level KeeperException when processing sessionid:0x13cce257e620008 type:create cxid:0x1 zxid:0x6d txntype:-1 reqpath:n/a Error Path:/solr/overseer Error:KeeperErrorCode = NodeExists for /solr/overseer
[junit4:junit4]   2> 10398 T1847 oazs.PrepRequestProcessor.pRequest Got user-level KeeperException when processing sessionid:0x13cce257e620008 type:create cxid:0x2 zxid:0x6e txntype:-1 reqpath:n/a Error Path:/solr/overseer Error:KeeperErrorCode = NodeExists for /solr/overseer
[junit4:junit4]   2> 10406 T1842 oascc.ZkStateReader.createClusterStateWatchersAndUpdate Updating cluster state from ZooKeeper... 
[junit4:junit4]   2> 10409 T1842 oasc.ZkController.createEphemeralLiveNode Register node as live in ZooKeeper:/live_nodes/127.0.0.1:60975_hu_%2Fj
[junit4:junit4]   2> 10409 T1847 oazs.PrepRequestProcessor.pRequest Got user-level KeeperException when processing sessionid:0x13cce257e620008 type:delete cxid:0x9 zxid:0x6f txntype:-1 reqpath:n/a Error Path:/solr/live_nodes/127.0.0.1:60975_hu_%2Fj Error:KeeperErrorCode = NoNode for /solr/live_nodes/127.0.0.1:60975_hu_%2Fj
[junit4:junit4]   2> 10411 T1842 oascc.SolrZkClient.makePath makePath: /live_nodes/127.0.0.1:60975_hu_%2Fj
[junit4:junit4]   2> 10414 T1864 oascc.ZkStateReader$2.process A cluster state change: WatchedEvent state:SyncConnected type:NodeChildrenChanged path:/live_nodes, has occurred - updating... (live nodes size: 2)
[junit4:junit4]   2> 10414 T1883 oascc.ZkStateReader$2.process A cluster state change: WatchedEvent state:SyncConnected type:NodeChildrenChanged path:/live_nodes, has occurred - updating... (live nodes size: 2)
[junit4:junit4]   2> 10414 T1870 oascc.ZkStateReader$3.process Updating live nodes... (3)
[junit4:junit4]   2> 10414 T1898 oascc.ZkStateReader$3.process Updating live nodes... (3)
[junit4:junit4]   2> 10415 T1870 oascc.ZkStateReader$2.process A cluster state change: WatchedEvent state:SyncConnected type:NodeChildrenChanged path:/live_nodes, has occurred - updating... (live nodes size: 3)
[junit4:junit4]   2> 10416 T1864 oascc.ZkStateReader$3.process Updating live nodes... (3)
[junit4:junit4]   2> 10416 T1883 oascc.ZkStateReader$3.process Updating live nodes... (3)
[junit4:junit4]   2> 10424 T1899 oasc.CoreContainer.create Creating SolrCore 'collection1' using instanceDir: /usr/home/hudson/hudson-slave/workspace/Lucene-Solr-Tests-trunk-java7/solr/build/solr-core/test/J1/./org.apache.solr.cloud.BasicDistributedZkTest-jetty2-1360668239259/collection1
[junit4:junit4]   2> 10424 T1899 oasc.ZkController.createCollectionZkNode Check for collection zkNode:collection1
[junit4:junit4]   2> 10425 T1899 oasc.ZkController.createCollectionZkNode Collection zkNode exists
[junit4:junit4]   2> 10425 T1899 oasc.ZkController.readConfigName Load collection config from:/collections/collection1
[junit4:junit4]   2> 10427 T1899 oasc.SolrResourceLoader.<init> new SolrResourceLoader for directory: '/usr/home/hudson/hudson-slave/workspace/Lucene-Solr-Tests-trunk-java7/solr/build/solr-core/test/J1/./org.apache.solr.cloud.BasicDistributedZkTest-jetty2-1360668239259/collection1/'
[junit4:junit4]   2> 10428 T1899 oasc.SolrResourceLoader.replaceClassLoader Adding 'file:/usr/home/hudson/hudson-slave/workspace/Lucene-Solr-Tests-trunk-java7/solr/build/solr-core/test/J1/org.apache.solr.cloud.BasicDistributedZkTest-jetty2-1360668239259/collection1/lib/README' to classloader
[junit4:junit4]   2> 10429 T1899 oasc.SolrResourceLoader.replaceClassLoader Adding 'file:/usr/home/hudson/hudson-slave/workspace/Lucene-Solr-Tests-trunk-java7/solr/build/solr-core/test/J1/org.apache.solr.cloud.BasicDistributedZkTest-jetty2-1360668239259/collection1/lib/classes/' to classloader
[junit4:junit4]   2> 10488 T1899 oasc.SolrConfig.<init> Using Lucene MatchVersion: LUCENE_50
[junit4:junit4]   2> 10563 T1899 oasc.SolrConfig.<init> Loaded SolrConfig: solrconfig.xml
[junit4:junit4]   2> 10664 T1899 oass.IndexSchema.readSchema Reading Solr Schema
[junit4:junit4]   2> 10671 T1899 oass.IndexSchema.readSchema Schema name=test
[junit4:junit4]   2> 11322 T1899 oass.OpenExchangeRatesOrgProvider.init Initialized with rates=open-exchange-rates.json, refreshInterval=1440.
[junit4:junit4]   2> 11336 T1899 oass.IndexSchema.readSchema default search field in schema is text
[junit4:junit4]   2> 11340 T1899 oass.IndexSchema.readSchema unique key field: id
[junit4:junit4]   2> 11359 T1899 oass.FileExchangeRateProvider.reload Reloading exchange rates from file currency.xml
[junit4:junit4]   2> 11365 T1899 oass.FileExchangeRateProvider.reload Reloading exchange rates from file currency.xml
[junit4:junit4]   2> 11371 T1899 oass.OpenExchangeRatesOrgProvider.reload Reloading exchange rates from open-exchange-rates.json
[junit4:junit4]   2> 11372 T1899 oass.OpenExchangeRatesOrgProvider.reload Reloading exchange rates from open-exchange-rates.json
[junit4:junit4]   2> 11374 T1899 oasc.SolrCore.<init> [collection1] Opening new SolrCore at /usr/home/hudson/hudson-slave/workspace/Lucene-Solr-Tests-trunk-java7/solr/build/solr-core/test/J1/./org.apache.solr.cloud.BasicDistributedZkTest-jetty2-1360668239259/collection1/, dataDir=./org.apache.solr.cloud.BasicDistributedZkTest-1360668229211/jetty2/
[junit4:junit4]   2> 11374 T1899 oasc.JmxMonitoredMap.<init> JMX monitoring is enabled. Adding Solr mbeans to JMX Server: com.sun.jmx.mbeanserver.JmxMBeanServer@26058825
[junit4:junit4]   2> 11375 T1899 oasc.SolrCore.initDirectoryFactory solr.NRTCachingDirectoryFactory
[junit4:junit4]   2> 11377 T1899 oasc.CachingDirectoryFactory.get return new directory for /usr/home/hudson/hudson-slave/workspace/Lucene-Solr-Tests-trunk-java7/solr/build/solr-core/test/J1/./org.apache.solr.cloud.BasicDistributedZkTest-1360668229211/jetty2 forceNew:false
[junit4:junit4]   2> 11377 T1899 oasc.CachingDirectoryFactory.close Releasing directory:/usr/home/hudson/hudson-slave/workspace/Lucene-Solr-Tests-trunk-java7/solr/build/solr-core/test/J1/./org.apache.solr.cloud.BasicDistributedZkTest-1360668229211/jetty2
[junit4:junit4]   2> 11378 T1899 oasc.SolrCore.getNewIndexDir New index directory detected: old=null new=./org.apache.solr.cloud.BasicDistributedZkTest-1360668229211/jetty2/index/
[junit4:junit4]   2> 11379 T1899 oasc.SolrCore.initIndex WARNING [collection1] Solr index directory './org.apache.solr.cloud.BasicDistributedZkTest-1360668229211/jetty2/index' doesn't exist. Creating new index...
[junit4:junit4]   2> 11380 T1899 oasc.CachingDirectoryFactory.get return new directory for /usr/home/hudson/hudson-slave/workspace/Lucene-Solr-Tests-trunk-java7/solr/build/solr-core/test/J1/./org.apache.solr.cloud.BasicDistributedZkTest-1360668229211/jetty2/index forceNew:false
[junit4:junit4]   2> 11388 T1899 oasc.SolrDeletionPolicy.onCommit SolrDeletionPolicy.onCommit: commits:num=1
[junit4:junit4]   2> 		commit{dir=RateLimitedDirectoryWrapper(NRTCachingDirectory(org.apache.lucene.store.NIOFSDirectory@/usr/home/hudson/hudson-slave/workspace/Lucene-Solr-Tests-trunk-java7/solr/build/solr-core/test/J1/org.apache.solr.cloud.BasicDistributedZkTest-1360668229211/jetty2/index lockFactory=org.apache.lucene.store.NativeFSLockFactory@12ed2889; maxCacheMB=48.0 maxMergeSizeMB=4.0)),segFN=segments_1,generation=1,filenames=[segments_1]
[junit4:junit4]   2> 11389 T1899 oasc.SolrDeletionPolicy.updateCommits newest commit = 1[segments_1]
[junit4:junit4]   2> 11390 T1899 oasc.CachingDirectoryFactory.close Releasing directory:/usr/home/hudson/hudson-slave/workspace/Lucene-Solr-Tests-trunk-java7/solr/build/solr-core/test/J1/./org.apache.solr.cloud.BasicDistributedZkTest-1360668229211/jetty2/index
[junit4:junit4]   2> 11390 T1899 oasc.SolrCore.initWriters created xml: solr.XMLResponseWriter
[junit4:junit4]   2> 11393 T1899 oasup.UpdateRequestProcessorChain.init inserting DistributedUpdateProcessorFactory into updateRequestProcessorChain "dedupe"
[junit4:junit4]   2> 11393 T1899 oasup.UpdateRequestProcessorChain.init inserting DistributedUpdateProcessorFactory into updateRequestProcessorChain "dedupe-allfields"
[junit4:junit4]   2> 11394 T1899 oasup.UpdateRequestProcessorChain.init inserting DistributedUpdateProcessorFactory into updateRequestProcessorChain "stored_sig"
[junit4:junit4]   2> 11394 T1899 oasup.UpdateRequestProcessorChain.init inserting DistributedUpdateProcessorFactory into updateRequestProcessorChain "uniq-fields"
[junit4:junit4]   2> 11395 T1899 oasup.UpdateRequestProcessorChain.init inserting DistributedUpdateProcessorFactory into updateRequestProcessorChain "distrib-dup-test-chain-implicit"
[junit4:junit4]   2> 11395 T1899 oasc.RequestHandlers.initHandlersFromConfig adding lazy requestHandler: solr.ReplicationHandler
[junit4:junit4]   2> 11396 T1899 oasc.RequestHandlers.initHandlersFromConfig created /replication: solr.ReplicationHandler
[junit4:junit4]   2> 11396 T1899 oasc.RequestHandlers.initHandlersFromConfig created standard: solr.StandardRequestHandler
[junit4:junit4]   2> 11397 T1899 oasc.RequestHandlers.initHandlersFromConfig created /get: solr.RealTimeGetHandler
[junit4:junit4]   2> 11398 T1899 oasc.RequestHandlers.initHandlersFromConfig created dismax: solr.SearchHandler
[junit4:junit4]   2> 11398 T1899 oasc.RequestHandlers.initHandlersFromConfig created mock: org.apache.solr.core.MockQuerySenderListenerReqHandler
[junit4:junit4]   2> 11399 T1899 oasc.RequestHandlers.initHandlersFromConfig created /admin/: org.apache.solr.handler.admin.AdminHandlers
[junit4:junit4]   2> 11399 T1899 oasc.RequestHandlers.initHandlersFromConfig created defaults: solr.StandardRequestHandler
[junit4:junit4]   2> 11399 T1899 oasc.RequestHandlers.initHandlersFromConfig adding lazy requestHandler: solr.StandardRequestHandler
[junit4:junit4]   2> 11400 T1899 oasc.RequestHandlers.initHandlersFromConfig created lazy: solr.StandardRequestHandler
[junit4:junit4]   2> 11401 T1899 oasc.RequestHandlers.initHandlersFromConfig created /update: solr.UpdateRequestHandler
[junit4:junit4]   2> 11401 T1899 oasc.RequestHandlers.initHandlersFromConfig created /terms: org.apache.solr.handler.component.SearchHandler
[junit4:junit4]   2> 11402 T1899 oasc.RequestHandlers.initHandlersFromConfig created spellCheckCompRH: org.apache.solr.handler.component.SearchHandler
[junit4:junit4]   2> 11402 T1899 oasc.RequestHandlers.initHandlersFromConfig created spellCheckCompRH_Direct: org.apache.solr.handler.component.SearchHandler
[junit4:junit4]   2> 11403 T1899 oasc.RequestHandlers.initHandlersFromConfig created spellCheckWithWordbreak: org.apache.solr.handler.component.SearchHandler
[junit4:junit4]   2> 11404 T1899 oasc.RequestHandlers.initHandlersFromConfig created spellCheckWithWordbreak_Direct: org.apache.solr.handler.component.SearchHandler
[junit4:junit4]   2> 11404 T1899 oasc.RequestHandlers.initHandlersFromConfig created spellCheckCompRH1: org.apache.solr.handler.component.SearchHandler
[junit4:junit4]   2> 11405 T1899 oasc.RequestHandlers.initHandlersFromConfig created mltrh: org.apache.solr.handler.component.SearchHandler
[junit4:junit4]   2> 11405 T1899 oasc.RequestHandlers.initHandlersFromConfig created tvrh: org.apache.solr.handler.component.SearchHandler
[junit4:junit4]   2> 11406 T1899 oasc.RequestHandlers.initHandlersFromConfig created /mlt: solr.MoreLikeThisHandler
[junit4:junit4]   2> 11407 T1899 oasc.RequestHandlers.initHandlersFromConfig created /debug/dump: solr.DumpRequestHandler
[junit4:junit4]   2> 11423 T1899 oashl.XMLLoader.init xsltCacheLifetimeSeconds=60
[junit4:junit4]   2> 11429 T1899 oasc.SolrCore.initDeprecatedSupport WARNING solrconfig.xml uses deprecated <admin/gettableFiles>, Please update your config to use the ShowFileRequestHandler.
[junit4:junit4]   2> 11431 T1899 oasc.SolrCore.initDeprecatedSupport WARNING adding ShowFileRequestHandler with hidden files: [SCHEMA.XML, OLD_SYNONYMS.TXT, STOPWORDS.TXT, PROTWORDS.TXT, OPEN-EXCHANGE-RATES.JSON, SYNONYMS.TXT, CURRENCY.XML, MAPPING-ISOLATIN1ACCENT.TXT]
[junit4:junit4]   2> 11434 T1899 oasc.CachingDirectoryFactory.close Releasing directory:/usr/home/hudson/hudson-slave/workspace/Lucene-Solr-Tests-trunk-java7/solr/build/solr-core/test/J1/./org.apache.solr.cloud.BasicDistributedZkTest-1360668229211/jetty2
[junit4:junit4]   2> 11436 T1899 oass.SolrIndexSearcher.<init> Opening Searcher@b78fe2 main
[junit4:junit4]   2> 11437 T1899 oasu.CommitTracker.<init> Hard AutoCommit: disabled
[junit4:junit4]   2> 11438 T1899 oasu.CommitTracker.<init> Soft AutoCommit: disabled
[junit4:junit4]   2> 11438 T1899 oashc.SpellCheckComponent.inform Initializing spell checkers
[junit4:junit4]   2> 11448 T1899 oass.DirectSolrSpellChecker.init init: {name=direct,classname=DirectSolrSpellChecker,field=lowerfilt,minQueryLength=3}
[junit4:junit4]   2> 11486 T1865 oascc.ZkStateReader.updateClusterState Updating cloud state from ZooKeeper... 
[junit4:junit4]   2> 11488 T1865 oasc.Overseer$ClusterStateUpdater.updateState Update state numShards=2 message={
[junit4:junit4]   2> 	  "operation":"state",
[junit4:junit4]   2> 	  "numShards":"2",
[junit4:junit4]   2> 	  "shard":"shard1",
[junit4:junit4]   2> 	  "roles":null,
[junit4:junit4]   2> 	  "state":"active",
[junit4:junit4]   2> 	  "core":"collection1",
[junit4:junit4]   2> 	  "collection":"collection1",
[junit4:junit4]   2> 	  "node_name":"127.0.0.1:60972_hu_%2Fj",
[junit4:junit4]   2> 	  "base_url":"http://127.0.0.1:60972/hu_/j"}
[junit4:junit4]   2> 11513 T1898 oascc.ZkStateReader$2.process A cluster state change: WatchedEvent state:SyncConnected type:NodeDataChanged path:/clusterstate.json, has occurred - updating... (live nodes size: 3)
[junit4:junit4]   2> 11513 T1870 oascc.ZkStateReader$2.process A cluster state change: WatchedEvent state:SyncConnected type:NodeDataChanged path:/clusterstate.json, has occurred - updating... (live nodes size: 3)
[junit4:junit4]   2> 11513 T1864 oascc.ZkStateReader$2.process A cluster state change: WatchedEvent state:SyncConnected type:NodeDataChanged path:/clusterstate.json, has occurred - updating... (live nodes size: 3)
[junit4:junit4]   2> 11513 T1883 oascc.ZkStateReader$2.process A cluster state change: WatchedEvent state:SyncConnected type:NodeDataChanged path:/clusterstate.json, has occurred - updating... (live nodes size: 3)
[junit4:junit4]   2> 11517 T1900 oasc.SolrCore.registerSearcher [collection1] Registered new searcher Searcher@b78fe2 main{StandardDirectoryReader(segments_1:1)}
[junit4:junit4]   2> 11523 T1899 oasc.ZkController.publish publishing core=collection1 state=down
[junit4:junit4]   2> 11523 T1899 oasc.ZkController.publish numShards not found on descriptor - reading it from system property
[junit4:junit4]   2> 13021 T1865 oascc.ZkStateReader.updateClusterState Updating cloud state from ZooKeeper... 
[junit4:junit4]   2> 13022 T1865 oasc.Overseer$ClusterStateUpdater.updateState Update state numShards=2 message={
[junit4:junit4]   2> 	  "operation":"state",
[junit4:junit4]   2> 	  "numShards":"2",
[junit4:junit4]   2> 	  "shard":null,
[junit4:junit4]   2> 	  "roles":null,
[junit4:junit4]   2> 	  "state":"down",
[junit4:junit4]   2> 	  "core":"collection1",
[junit4:junit4]   2> 	  "collection":"collection1",
[junit4:junit4]   2> 	  "node_name":"127.0.0.1:60975_hu_%2Fj",
[junit4:junit4]   2> 	  "base_url":"http://127.0.0.1:60975/hu_/j"}
[junit4:junit4]   2> 13022 T1865 oasc.Overseer$ClusterStateUpdater.updateState Collection already exists with numShards=2
[junit4:junit4]   2> 13022 T1865 oasc.Overseer$ClusterStateUpdater.updateState Assigning new node to shard shard=shard2
[junit4:junit4]   2> 13085 T1870 oascc.ZkStateReader$2.process A cluster state change: WatchedEvent state:SyncConnected type:NodeDataChanged path:/clusterstate.json, has occurred - updating... (live nodes size: 3)
[junit4:junit4]   2> 13085 T1883 oascc.ZkStateReader$2.process A cluster state change: WatchedEvent state:SyncConnected type:NodeDataChanged path:/clusterstate.json, has occurred - updating... (live nodes size: 3)
[junit4:junit4]   2> 13085 T1898 oascc.ZkStateReader$2.process A cluster state change: WatchedEvent state:SyncConnected type:NodeDataChanged path:/clusterstate.json, has occurred - updating... (live nodes size: 3)
[junit4:junit4]   2> 13086 T1864 oascc.ZkStateReader$2.process A cluster state change: WatchedEvent state:SyncConnected type:NodeDataChanged path:/clusterstate.json, has occurred - updating... (live nodes size: 3)
[junit4:junit4]   2> 13527 T1899 oasc.CoreContainer.registerCore registering core: collection1
[junit4:junit4]   2> 13527 T1899 oasc.ZkController.register Register replica - core:collection1 address:http://127.0.0.1:60975/hu_/j collection:collection1 shard:shard2
[junit4:junit4]   2> 13528 T1899 oascc.SolrZkClient.makePath makePath: /collections/collection1/leader_elect/shard2/election
[junit4:junit4]   2> 13554 T1847 oazs.PrepRequestProcessor.pRequest Got user-level KeeperException when processing sessionid:0x13cce257e620008 type:delete cxid:0x46 zxid:0x7e txntype:-1 reqpath:n/a Error Path:/solr/collections/collection1/leaders/shard2 Error:KeeperErrorCode = NoNode for /solr/collections/collection1/leaders/shard2
[junit4:junit4]   2> 13556 T1899 oasc.ShardLeaderElectionContext.runLeaderProcess Running the leader process.
[junit4:junit4]   2> 13556 T1847 oazs.PrepRequestProcessor.pRequest Got user-level KeeperException when processing sessionid:0x13cce257e620008 type:create cxid:0x47 zxid:0x7f txntype:-1 reqpath:n/a Error Path:/solr/overseer Error:KeeperErrorCode = NodeExists for /solr/overseer
[junit4:junit4]   2> 13567 T1899 oasc.ShardLeaderElectionContext.waitForReplicasToComeUp Enough replicas found to continue.
[junit4:junit4]   2> 13567 T1899 oasc.ShardLeaderElectionContext.runLeaderProcess I may be the new leader - try and sync
[junit4:junit4]   2> 13568 T1899 oasc.SyncStrategy.sync Sync replicas to http://127.0.0.1:60975/hu_/j/collection1/
[junit4:junit4]   2> 13568 T1899 oasc.SyncStrategy.syncReplicas Sync Success - now sync replicas to me
[junit4:junit4]   2> 13568 T1899 oasc.SyncStrategy.syncToMe http://127.0.0.1:60975/hu_/j/collection1/ has no replicas
[junit4:junit4]   2> 13568 T1899 oasc.ShardLeaderElectionContext.runLeaderProcess I am the new leader: http://127.0.0.1:60975/hu_/j/collection1/
[junit4:junit4]   2> 13569 T1899 oascc.SolrZkClient.makePath makePath: /collections/collection1/leaders/shard2
[junit4:junit4]   2> 13573 T1847 oazs.PrepRequestProcessor.pRequest Got user-level KeeperException when processing sessionid:0x13cce257e620008 type:create cxid:0x50 zxid:0x82 txntype:-1 reqpath:n/a Error Path:/solr/overseer Error:KeeperErrorCode = NodeExists for /solr/overseer
[junit4:junit4]   2> 14593 T1865 oascc.ZkStateReader.updateClusterState Updating cloud state from ZooKeeper... 
[junit4:junit4]   2> 14642 T1864 oascc.ZkStateReader$2.process A cluster state change: WatchedEvent state:SyncConnected type:NodeDataChanged path:/clusterstate.json, has occurred - updating... (live nodes size: 3)
[junit4:junit4]   2> 14642 T1898 oascc.ZkStateReader$2.process A cluster state change: WatchedEvent state:SyncConnected type:NodeDataChanged path:/clusterstate.json, has occurred - updating... (live nodes size: 3)
[junit4:junit4]   2> 14642 T1883 oascc.ZkStateReader$2.process A cluster state change: WatchedEvent state:SyncConnected type:NodeDataChanged path:/clusterstate.json, has occurred - updating... (live nodes size: 3)
[junit4:junit4]   2> 14642 T1870 oascc.ZkStateReader$2.process A cluster state change: WatchedEvent state:SyncConnected type:NodeDataChanged path:/clusterstate.json, has occurred - updating... (live nodes size: 3)
[junit4:junit4]   2> 14698 T1899 oasc.ZkController.register We are http://127.0.0.1:60975/hu_/j/collection1/ and leader is http://127.0.0.1:60975/hu_/j/collection1/
[junit4:junit4]   2> 14698 T1899 oasc.ZkController.register No LogReplay needed for core=collection1 baseURL=http://127.0.0.1:60975/hu_/j
[junit4:junit4]   2> 14698 T1899 oasc.ZkController.checkRecovery I am the leader, no recovery necessary
[junit4:junit4]   2> 14699 T1899 oasc.ZkController.publish publishing core=collection1 state=active
[junit4:junit4]   2> 14699 T1899 oasc.ZkController.publish numShards not found on descriptor - reading it from system property
[junit4:junit4]   2> 14702 T1899 oascc.ZkStateReader.updateClusterState Updating cloud state from ZooKeeper... 
[junit4:junit4]   2> 14703 T1842 oass.SolrDispatchFilter.init user.dir=/usr/home/hudson/hudson-slave/workspace/Lucene-Solr-Tests-trunk-java7/solr/build/solr-core/test/J1
[junit4:junit4]   2> 14704 T1842 oass.SolrDispatchFilter.init SolrDispatchFilter.init() done
[junit4:junit4]   2> 14705 T1842 oascsi.HttpClientUtil.createClient Creating new http client, config:maxConnections=128&maxConnectionsPerHost=32&followRedirects=false
[junit4:junit4]   2> 14909 T1842 oejs.Server.doStart jetty-8.1.8.v20121106
[junit4:junit4]   2> 14913 T1842 oejs.AbstractConnector.doStart Started SocketConnector@127.0.0.1:60978
[junit4:junit4]   2> 14913 T1842 oass.SolrDispatchFilter.init SolrDispatchFilter.init()
[junit4:junit4]   2> 14914 T1842 oasc.SolrResourceLoader.locateSolrHome JNDI not configured for solr (NoInitialContextEx)
[junit4:junit4]   2> 14914 T1842 oasc.SolrResourceLoader.locateSolrHome using system property solr.solr.home: /usr/home/hudson/hudson-slave/workspace/Lucene-Solr-Tests-trunk-java7/solr/build/solr-core/test/J1/./org.apache.solr.cloud.BasicDistributedZkTest-jetty3-1360668243927
[junit4:junit4]   2> 14915 T1842 oasc.CoreContainer$Initializer.initialize looking for solr.xml: /usr/home/hudson/hudson-slave/workspace/Lucene-Solr-Tests-trunk-java7/solr/build/solr-core/test/J1/./org.apache.solr.cloud.BasicDistributedZkTest-jetty3-1360668243927/solr.xml
[junit4:junit4]   2> 14915 T1842 oasc.CoreContainer.<init> New CoreContainer 3018306
[junit4:junit4]   2> 14916 T1842 oasc.CoreContainer.load Loading CoreContainer using Solr Home: '/usr/home/hudson/hudson-slave/workspace/Lucene-Solr-Tests-trunk-java7/solr/build/solr-core/test/J1/./org.apache.solr.cloud.BasicDistributedZkTest-jetty3-1360668243927/'
[junit4:junit4]   2> 14917 T1842 oasc.SolrResourceLoader.<init> new SolrResourceLoader for directory: '/usr/home/hudson/hudson-slave/workspace/Lucene-Solr-Tests-trunk-java7/solr/build/solr-core/test/J1/./org.apache.solr.cloud.BasicDistributedZkTest-jetty3-1360668243927/'
[junit4:junit4]   2> 14987 T1842 oashc.HttpShardHandlerFactory.getParameter Setting socketTimeout to: 60000
[junit4:junit4]   2> 14988 T1842 oashc.HttpShardHandlerFactory.getParameter Setting urlScheme to: http://
[junit4:junit4]   2> 14989 T1842 oashc.HttpShardHandlerFactory.getParameter Setting connTimeout to: 15000
[junit4:junit4]   2> 14989 T1842 oashc.HttpShardHandlerFactory.getParameter Setting maxConnectionsPerHost to: 20
[junit4:junit4]   2> 14990 T1842 oashc.HttpShardHandlerFactory.getParameter Setting corePoolSize to: 0
[junit4:junit4]   2> 14990 T1842 oashc.HttpShardHandlerFactory.getParameter Setting maximumPoolSize to: 2147483647
[junit4:junit4]   2> 14991 T1842 oashc.HttpShardHandlerFactory.getParameter Setting maxThreadIdleTime to: 5
[junit4:junit4]   2> 14991 T1842 oashc.HttpShardHandlerFactory.getParameter Setting sizeOfQueue to: -1
[junit4:junit4]   2> 14992 T1842 oashc.HttpShardHandlerFactory.getParameter Setting fairnessPolicy to: false
[junit4:junit4]   2> 14992 T1842 oascsi.HttpClientUtil.createClient Creating new http client, config:maxConnectionsPerHost=20&maxConnections=10000&socketTimeout=60000&connTimeout=15000&retry=false
[junit4:junit4]   2> 15014 T1842 oasc.CoreContainer.load Registering Log Listener
[junit4:junit4]   2> 15034 T1842 oasc.CoreContainer.initZooKeeper Zookeeper client=127.0.0.1:60965/solr
[junit4:junit4]   2> 15035 T1842 oasc.ZkController.checkChrootPath zkHost includes chroot
[junit4:junit4]   2> 15035 T1842 oaz.ZooKeeper.<init> Initiating client connection, connectString=127.0.0.1:60965 sessionTimeout=60000 watcher=org.apache.solr.common.cloud.ConnectionManager@3da60f25
[junit4:junit4]   2> 15037 T1842 oascc.ConnectionManager.waitForConnected Waiting for client to connect to ZooKeeper
[junit4:junit4]   2> 15037 T1910 oaz.ClientCnxn$SendThread.logStartConnect Opening socket connection to server localhost/127.0.0.1:60965. Will not attempt to authenticate using SASL (access denied ("javax.security.auth.AuthPermission" "getLoginConfiguration"))
[junit4:junit4]   2> 15038 T1910 oaz.ClientCnxn$SendThread.primeConnection Socket connection established to localhost/127.0.0.1:60965, initiating session
[junit4:junit4]   2> 15038 T1844 oazs.NIOServerCnxnFactory.run Accepted socket connection from /140.211.11.196:60979
[junit4:junit4]   2> 15038 T1844 oazs.ZooKeeperServer.processConnectRequest Client attempting to establish new session at /140.211.11.196:60979
[junit4:junit4]   2> 15040 T1846 oazs.ZooKeeperServer.finishSessionInit Established session 0x13cce257e620009 with negotiated timeout 20000 for client /140.211.11.196:60979
[junit4:junit4]   2> 15040 T1910 oaz.ClientCnxn$SendThread.onConnected Session establishment complete on server localhost/127.0.0.1:60965, sessionid = 0x13cce257e620009, negotiated timeout = 20000
[junit4:junit4]   2> 15041 T1911 oascc.ConnectionManager.process Watcher org.apache.solr.common.cloud.ConnectionManager@3da60f25 name:ZooKeeperConnection Watcher:127.0.0.1:60965 got event WatchedEvent state:SyncConnected type:None path:null path:null type:None
[junit4:junit4]   2> 15041 T1842 oascc.ConnectionManager.waitForConnected Client is connected to ZooKeeper
[junit4:junit4]   2> 15042 T1847 oazs.PrepRequestProcessor.pRequest2Txn Processed session termination for sessionid: 0x13cce257e620009
[junit4:junit4]   2> 15055 T1911 oaz.ClientCnxn$EventThread.run EventThread shut down
[junit4:junit4]   2> 15055 T1844 oazs.NIOServerCnxn.closeSock Closed socket connection for client /140.211.11.196:60979 which had sessionid 0x13cce257e620009
[junit4:junit4]   2> 15055 T1842 oaz.ZooKeeper.close Session: 0x13cce257e620009 closed
[junit4:junit4]   2> 15055 T1842 oascsi.HttpClientUtil.createClient Creating new http client, config:maxConnections=500&maxConnectionsPerHost=16&socketTimeout=60000&connTimeout=15000
[junit4:junit4]   2> 15068 T1842 oaz.ZooKeeper.<init> Initiating client connection, connectString=127.0.0.1:60965/solr sessionTimeout=30000 watcher=org.apache.solr.common.cloud.ConnectionManager@4382830b
[junit4:junit4]   2> 15069 T1842 oascc.ConnectionManager.waitForConnected Waiting for client to connect to ZooKeeper
[junit4:junit4]   2> 15069 T1912 oaz.ClientCnxn$SendThread.logStartConnect Opening socket connection to server localhost/127.0.0.1:60965. Will not attempt to authenticate using SASL (access denied ("javax.security.auth.AuthPermission" "getLoginConfiguration"))
[junit4:junit4]   2> 15070 T1912 oaz.ClientCnxn$SendThread.primeConnection Socket connection established to localhost/127.0.0.1:60965, initiating session
[junit4:junit4]   2> 15070 T1844 oazs.NIOServerCnxnFactory.run Accepted socket connection from /140.211.11.196:60980
[junit4:junit4]   2> 15071 T1844 oazs.ZooKeeperServer.processConnectRequest Client attempting to establish new session at /140.211.11.196:60980
[junit4:junit4]   2> 15072 T1846 oazs.ZooKeeperServer.finishSessionInit Established session 0x13cce257e62000a with negotiated timeout 20000 for client /140.211.11.196:60980
[junit4:junit4]   2> 15072 T1912 oaz.ClientCnxn$SendThread.onConnected Session establishment complete on server localhost/127.0.0.1:60965, sessionid = 0x13cce257e62000a, negotiated timeout = 20000
[junit4:junit4]   2> 15073 T1913 oascc.ConnectionManager.process Watcher org.apache.solr.common.cloud.ConnectionManager@4382830b name:ZooKeeperConnection Watcher:127.0.0.1:60965/solr got event WatchedEvent state:SyncConnected type:None path:null path:null type:None
[junit4:junit4]   2> 15073 T1842 oascc.ConnectionManager.waitForConnected Client is connected to ZooKeeper
[junit4:junit4]   2> 15074 T1847 oazs.PrepRequestProcessor.pRequest Got user-level KeeperException when processing sessionid:0x13cce257e62000a type:create cxid:0x1 zxid:0x8f txntype:-1 reqpath:n/a Error Path:/solr/overseer Error:KeeperErrorCode = NodeExists for /solr/overseer
[junit4:junit4]   2> 15078 T1847 oazs.PrepRequestProcessor.pRequest Got user-level KeeperException when processing sessionid:0x13cce257e62000a type:create cxid:0x2 zxid:0x90 txntype:-1 reqpath:n/a Error Path:/solr/overseer Error:KeeperErrorCode = NodeExists for /solr/overseer
[junit4:junit4]   2> 15080 T1842 oascc.ZkStateReader.createClusterStateWatchersAndUpdate Updating cluster state from ZooKeeper... 
[junit4:junit4]   2> 15083 T1842 oasc.ZkController.createEphemeralLiveNode Register node as live in ZooKeeper:/live_nodes/127.0.0.1:60978_hu_%2Fj
[junit4:junit4]   2> 15084 T1847 oazs.PrepRequestProcessor.pRequest Got user-level KeeperException when processing sessionid:0x13cce257e62000a type:delete cxid:0x9 zxid:0x91 txntype:-1 reqpath:n/a Error Path:/solr/live_nodes/127.0.0.1:60978_hu_%2Fj Error:KeeperErrorCode = NoNode for /solr/live_nodes/127.0.0.1:60978_hu_%2Fj
[junit4:junit4]   2> 15086 T1842 oascc.SolrZkClient.makePath makePath: /live_nodes/127.0.0.1:60978_hu_%2Fj
[junit4:junit4]   2> 15089 T1883 oascc.ZkStateReader$2.process A cluster state change: WatchedEvent state:SyncConnected type:NodeChildrenChanged path:/live_nodes, has occurred - updating... (live nodes size: 3)
[junit4:junit4]   2> 15089 T1864 oascc.ZkStateReader$2.process A cluster state change: WatchedEvent state:SyncConnected type:NodeChildrenChanged path:/live_nodes, has occurred - updating... (live nodes size: 3)
[junit4:junit4]   2> 15090 T1870 oascc.ZkStateReader$3.process Updating live nodes... (4)
[junit4:junit4]   2> 15090 T1913 oascc.ZkStateReader$3.process Updating live nodes... (4)
[junit4:junit4]   2> 15091 T1870 oascc.ZkStateReader$2.process A cluster state change: WatchedEvent state:SyncConnected type:NodeChildrenChanged path:/live_nodes, has occurred - updating... (live nodes size: 4)
[junit4:junit4]   2> 15091 T1898 oascc.ZkStateReader$3.process Updating live nodes... (4)
[junit4:junit4]   2> 15091 T1898 oascc.ZkStateReader$2.process A cluster state change: WatchedEvent state:SyncConnected type:NodeChildrenChanged path:/live_nodes, has occurred - updating... (live nodes size: 4)
[junit4:junit4]   2> 15093 T1883 oascc.ZkStateReader$3.process Updating live nodes... (4)
[junit4:junit4]   2> 15093 T1864 oascc.ZkStateReader$3.process Updating live nodes... (4)
[junit4:junit4]   2> 15099 T1914 oasc.CoreContainer.create Creating SolrCore 'collection1' using instanceDir: /usr/home/hudson/hudson-slave/workspace/Lucene-Solr-Tests-trunk-java7/solr/build/solr-core/test/J1/./org.apache.solr.cloud.BasicDistributedZkTest-jetty3-1360668243927/collection1
[junit4:junit4]   2> 15100 T1914 oasc.ZkController.createCollectionZkNode Check for collection zkNode:collection1
[junit4:junit4]   2> 15100 T1914 oasc.ZkController.createCollectionZkNode Collection zkNode exists
[junit4:junit4]   2> 15101 T1914 oasc.ZkController.readConfigName Load collection config from:/collections/collection1
[junit4:junit4]   2> 15102 T1914 oasc.SolrResourceLoader.<init> new SolrResourceLoader for directory: '/usr/home/hudson/hudson-slave/workspace/Lucene-Solr-Tests-trunk-java7/solr/build/solr-core/test/J1/./org.apache.solr.cloud.BasicDistributedZkTest-jetty3-1360668243927/collection1/'
[junit4:junit4]   2> 15104 T1914 oasc.SolrResourceLoader.replaceClassLoader Adding 'file:/usr/home/hudson/hudson-slave/workspace/Lucene-Solr-Tests-trunk-java7/solr/build/solr-core/test/J1/org.apache.solr.cloud.BasicDistributedZkTest-jetty3-1360668243927/collection1/lib/classes/' to classloader
[junit4:junit4]   2> 15105 T1914 oasc.SolrResourceLoader.replaceClassLoader Adding 'file:/usr/home/hudson/hudson-slave/workspace/Lucene-Solr-Tests-trunk-java7/solr/build/solr-core/test/J1/org.apache.solr.cloud.BasicDistributedZkTest-jetty3-1360668243927/collection1/lib/README' to classloader
[junit4:junit4]   2> 15165 T1914 oasc.SolrConfig.<init> Using Lucene MatchVersion: LUCENE_50
[junit4:junit4]   2> 15249 T1914 oasc.SolrConfig.<init> Loaded SolrConfig: solrconfig.xml
[junit4:junit4]   2> 15350 T1914 oass.IndexSchema.readSchema Reading Solr Schema
[junit4:junit4]   2> 15357 T1914 oass.IndexSchema.readSchema Schema name=test
[junit4:junit4]   2> 16019 T1914 oass.OpenExchangeRatesOrgProvider.init Initialized with rates=open-exchange-rates.json, refreshInterval=1440.
[junit4:junit4]   2> 16032 T1914 oass.IndexSchema.readSchema default search field in schema is text
[junit4:junit4]   2> 16036 T1914 oass.IndexSchema.readSchema unique key field: id
[junit4:junit4]   2> 16052 T1914 oass.FileExchangeRateProvider.reload Reloading exchange rates from file currency.xml
[junit4:junit4]   2> 16058 T1914 oass.FileExchangeRateProvider.reload Reloading exchange rates from file currency.xml
[junit4:junit4]   2> 16063 T1914 oass.OpenExchangeRatesOrgProvider.reload Reloading exchange rates from open-exchange-rates.json
[junit4:junit4]   2> 16064 T1914 oass.OpenExchangeRatesOrgProvider.reload Reloading exchange rates from open-exchange-rates.json
[junit4:junit4]   2> 16066 T1914 oasc.SolrCore.<init> [collection1] Opening new SolrCore at /usr/home/hudson/hudson-slave/workspace/Lucene-Solr-Tests-trunk-java7/solr/build/solr-core/test/J1/./org.apache.solr.cloud.BasicDistributedZkTest-jetty3-1360668243927/collection1/, dataDir=./org.apache.solr.cloud.BasicDistributedZkTest-1360668229211/jetty3/
[junit4:junit4]   2> 16066 T1914 oasc.JmxMonitoredMap.<init> JMX monitoring is enabled. Adding Solr mbeans to JMX Server: com.sun.jmx.mbeanserver.JmxMBeanServer@26058825
[junit4:junit4]   2> 16067 T1914 oasc.SolrCore.initDirectoryFactory solr.NRTCachingDirectoryFactory
[junit4:junit4]   2> 16068 T1914 oasc.CachingDirectoryFactory.get return new directory for /usr/home/hudson/hudson-slave/workspace/Lucene-Solr-Tests-trunk-java7/solr/build/solr-core/test/J1/./org.apache.solr.cloud.BasicDistributedZkTest-1360668229211/jetty3 forceNew:false
[junit4:junit4]   2> 16069 T1914 oasc.CachingDirectoryFactory.close Releasing directory:/usr/home/hudson/hudson-slave/workspace/Lucene-Solr-Tests-trunk-java7/solr/build/solr-core/test/J1/./org.apache.solr.cloud.BasicDistributedZkTest-1360668229211/jetty3
[junit4:junit4]   2> 16069 T1914 oasc.SolrCore.getNewIndexDir New index directory detected: old=null new=./org.apache.solr.cloud.BasicDistributedZkTest-1360668229211/jetty3/index/
[junit4:junit4]   2> 16070 T1914 oasc.SolrCore.initIndex WARNING [collection1] Solr index directory './org.apache.solr.cloud.BasicDistributedZkTest-1360668229211/jetty3/index' doesn't exist. Creating new index...
[junit4:junit4]   2> 16071 T1914 oasc.CachingDirectoryFactory.get return new directory for /usr/home/hudson/hudson-slave/workspace/Lucene-Solr-Tests-trunk-java7/solr/build/solr-core/test/J1/./org.apache.solr.cloud.BasicDistributedZkTest-1360668229211/jetty3/index forceNew:false
[junit4:junit4]   2> 16078 T1914 oasc.SolrDeletionPolicy.onCommit SolrDeletionPolicy.onCommit: commits:num=1
[junit4:junit4]   2> 		commit{dir=RateLimitedDirectoryWrapper(NRTCachingDirectory(org.apache.lucene.store.NIOFSDirectory@/usr/home/hudson/hudson-slave/workspace/Lucene-Solr-Tests-trunk-java7/solr/build/solr-core/test/J1/org.apache.solr.cloud.BasicDistributedZkTest-1360668229211/jetty3/index lockFactory=org.apache.lucene.store.NativeFSLockFactory@2978f04; maxCacheMB=48.0 maxMergeSizeMB=4.0)),segFN=segments_1,generation=1,filenames=[segments_1]
[junit4:junit4]   2> 16078 T1914 oasc.SolrDeletionPolicy.updateCommits newest commit = 1[segments_1]
[junit4:junit4]   2> 16080 T1914 oasc.CachingDirectoryFactory.close Releasing directory:/usr/home/hudson/hudson-slave/workspace/Lucene-Solr-Tests-trunk-java7/solr/build/solr-core/test/J1/./org.apache.solr.cloud.BasicDistributedZkTest-1360668229211/jetty3/index
[junit4:junit4]   2> 16080 T1914 oasc.SolrCore.initWriters created xml: solr.XMLResponseWriter
[junit4:junit4]   2> 16082 T1914 oasup.UpdateRequestProcessorChain.init inserting DistributedUpdateProcessorFactory into updateRequestProcessorChain "dedupe"
[junit4:junit4]   2> 16083 T1914 oasup.UpdateRequestProcessorChain.init inserting DistributedUpdateProcessorFactory into updateRequestProcessorChain "dedupe-allfields"
[junit4:junit4]   2> 16083 T1914 oasup.UpdateRequestProcessorChain.init inserting DistributedUpdateProcessorFactory into updateRequestProcessorChain "stored_sig"
[junit4:junit4]   2> 16084 T1914 oasup.UpdateRequestProcessorChain.init inserting DistributedUpdateProcessorFactory into updateRequestProcessorChain "uniq-fields"
[junit4:junit4]   2> 16084 T1914 oasup.UpdateRequestProcessorChain.init inserting DistributedUpdateProcessorFactory into updateRequestProcessorChain "distrib-dup-test-chain-implicit"
[junit4:junit4]   2> 16084 T1914 oasc.RequestHandlers.initHandlersFromConfig adding lazy requestHandler: solr.ReplicationHandler
[junit4:junit4]   2> 16085 T1914 oasc.RequestHandlers.initHandlersFromConfig created /replication: solr.ReplicationHandler
[junit4:junit4]   2> 16086 T1914 oasc.RequestHandlers.initHandlersFromConfig created standard: solr.StandardRequestHandler
[junit4:junit4]   2> 16086 T1914 oasc.RequestHandlers.initHandlersFromConfig created /get: solr.RealTimeGetHandler
[junit4:junit4]   2> 16087 T1914 oasc.RequestHandlers.initHandlersFromConfig created dismax: solr.SearchHandler
[junit4:junit4]   2> 16087 T1914 oasc.RequestHandlers.initHandlersFromConfig created mock: org.apache.solr.core.MockQuerySenderListenerReqHandler
[junit4:junit4]   2> 16088 T1914 oasc.RequestHandlers.initHandlersFromConfig created /admin/: org.apache.solr.handler.admin.AdminHandlers
[junit4:junit4]   2> 16089 T1914 oasc.RequestHandlers.initHandlersFromConfig created defaults: solr.StandardRequestHandler
[junit4:junit4]   2> 16089 T1914 oasc.RequestHandlers.initHandlersFromConfig adding lazy requestHandler: solr.StandardRequestHandler
[junit4:junit4]   2> 16089 T1914 oasc.RequestHandlers.initHandlersFromConfig created lazy: solr.StandardRequestHandler
[junit4:junit4]   2> 16090 T1914 oasc.RequestHandlers.initHandlersFromConfig created /update: solr.UpdateRequestHandler
[junit4:junit4]   2> 16090 T1914 oasc.RequestHandlers.initHandlersFromConfig created /terms: org.apache.solr.handler.component.SearchHandler
[junit4:junit4]   2> 16091 T1914 oasc.RequestHandlers.initHandlersFromConfig created spellCheckCompRH: org.apache.solr.handler.component.SearchHandler
[junit4:junit4]   2> 16092 T1914 oasc.RequestHandlers.initHandlersFromConfig created spellCheckCompRH_Direct: org.apache.solr.handler.component.SearchHandler
[junit4:junit4]   2> 16092 T1914 oasc.RequestHandlers.initHandlersFromConfig created spellCheckWithWordbreak: org.apache.solr.handler.component.SearchHandler
[junit4:junit4]   2> 16093 T1914 oasc.RequestHandlers.initHandlersFromConfig created spellCheckWithWordbreak_Direct: org.apache.solr.handler.component.SearchHandler
[junit4:junit4]   2> 16093 T1914 oasc.RequestHandlers.initHandlersFromConfig created spellCheckCompRH1: org.apache.solr.handler.component.SearchHandler
[junit4:junit4]   2> 16094 T1914 oasc.RequestHandlers.initHandlersFromConfig created mltrh: org.apache.solr.handler.component.SearchHandler
[junit4:junit4]   2> 16095 T1914 oasc.RequestHandlers.initHandlersFromConfig created tvrh: org.apache.solr.handler.component.SearchHandler
[junit4:junit4]   2> 16095 T1914 oasc.RequestHandlers.initHandlersFromConfig created /mlt: solr.MoreLikeThisHandler
[junit4:junit4]   2> 16096 T1914 oasc.RequestHandlers.initHandlersFromConfig created /debug/dump: solr.DumpRequestHandler
[junit4:junit4]   2> 16109 T1914 oashl.XMLLoader.init xsltCacheLifetimeSeconds=60
[junit4:junit4]   2> 16114 T1914 oasc.SolrCore.initDeprecatedSupport WARNING solrconfig.xml uses deprecated <admin/gettableFiles>, Please update your config to use the ShowFileRequestHandler.
[junit4:junit4]   2> 16115 T1914 oasc.SolrCore.initDeprecatedSupport WARNING adding ShowFileRequestHandler with hidden files: [SCHEMA.XML, OLD_SYNONYMS.TXT, STOPWORDS.TXT, PROTWORDS.TXT, OPEN-EXCHANGE-RATES.JSON, SYNONYMS.TXT, CURRENCY.XML, MAPPING-ISOLATIN1ACCENT.TXT]
[junit4:junit4]   2> 16118 T1914 oasc.CachingDirectoryFactory.close Releasing directory:/usr/home/hudson/hudson-slave/workspace/Lucene-Solr-Tests-trunk-java7/solr/build/solr-core/test/J1/./org.apache.solr.cloud.BasicDistributedZkTest-1360668229211/jetty3
[junit4:junit4]   2> 16120 T1914 oass.SolrIndexSearcher.<init> Opening Searcher@2ebad0d7 main
[junit4:junit4]   2> 16121 T1914 oasu.CommitTracker.<init> Hard AutoCommit: disabled
[junit4:junit4]   2> 16121 T1914 oasu.CommitTracker.<init> Soft AutoCommit: disabled
[junit4:junit4]   2> 16122 T1914 oashc.SpellCheckComponent.inform Initializing spell checkers
[junit4:junit4]   2> 16130 T1914 oass.DirectSolrSpellChecker.init init: {name=direct,classname=DirectSolrSpellChecker,field=lowerfilt,minQueryLength=3}
[junit4:junit4]   2> 16157 T1865 oascc.ZkStateReader.updateClusterState Updating cloud state from ZooKeeper... 
[junit4:junit4]   2> 16158 T1865 oasc.Overseer$ClusterStateUpdater.updateState Update state numShards=2 message={
[junit4:junit4]   2> 	  "operation":"state",
[junit4:junit4]   2> 	  "numShards":"2",
[junit4:junit4]   2> 	  "shard":"shard2",
[junit4:junit4]   2> 	  "roles":null,
[junit4:junit4]   2> 	  "state":"active",
[junit4:junit4]   2> 	  "core":"collection1",
[junit4:junit4]   2> 	  "collection":"collection1",
[junit4:junit4]   2> 	  "node_name":"127.0.0.1:60975_hu_%2Fj",
[junit4:junit4]   2> 	  "base_url":"http://127.0.0.1:60975/hu_/j"}
[junit4:junit4]   2> 16176 T1864 oascc.ZkStateReader$2.process A cluster state change: WatchedEvent state:SyncConnected type:NodeDataChanged path:/clusterstate.json, has occurred - updating... (live nodes size: 4)
[junit4:junit4]   2> 16176 T1898 oascc.ZkStateReader$2.process A cluster state change: WatchedEvent state:SyncConnected type:NodeDataChanged path:/clusterstate.json, has occurred - updating... (live nodes size: 4)
[junit4:junit4]   2> 16176 T1870 oascc.ZkStateReader$2.process A cluster state change: WatchedEvent state:SyncConnected type:NodeDataChanged path:/clusterstate.json, has occurred - updating... (live nodes size: 4)
[junit4:junit4]   2> 16176 T1913 oascc.ZkStateReader$2.process A cluster state change: WatchedEvent state:SyncConnected type:NodeDataChanged path:/clusterstate.json, has occurred - updating... (live nodes size: 4)
[junit4:junit4]   2> 16176 T1883 oascc.ZkStateReader$2.process A cluster state change: WatchedEvent state:SyncConnected type:NodeDataChanged path:/clusterstate.json, has occurred - updating... (live nodes size: 4)
[junit4:junit4]   2> 16201 T1915 oasc.SolrCore.registerSearcher [collection1] Registered new searcher Searcher@2ebad0d7 main{StandardDirectoryReader(segments_1:1)}
[junit4:junit4]   2> 16208 T1914 oasc.ZkController.publish publishing core=collection1 state=down
[junit4:junit4]   2> 16208 T1914 oasc.ZkController.publish numShards not found on descriptor - reading it from system property
[junit4:junit4]   2> 17690 T1865 oascc.ZkStateReader.updateClusterState Updating cloud state from ZooKeeper... 
[junit4:junit4]   2> 17691 T1865 oasc.Overseer$ClusterStateUpdater.updateState Update state numShards=2 message={
[junit4:junit4]   2> 	  "operation":"state",
[junit4:junit4]   2> 	  "numShards":"2",
[junit4:junit4]   2> 	  "shard":null,
[junit4:junit4]   2> 	  "roles":null,
[junit4:junit4]   2> 	  "state":"down",
[junit4:junit4]   2> 	  "core":"collection1",
[junit4:junit4]   2> 	  "collection":"collection1",
[junit4:junit4]   2> 	  "node_name":"127.0.0.1:60978_hu_%2Fj",
[junit4:junit4]   2> 	  "base_url":"http://127.0.0.1:60978/hu_/j"}
[junit4:junit4]   2> 17691 T1865 oasc.Overseer$ClusterStateUpdater.updateState Collection already exists with numShards=2
[junit4:junit4]   2> 17692 T1865 oasc.Overseer$ClusterStateUpdater.updateState Assigning new node to shard shard=shard1
[junit4:junit4]   2> 17718 T1864 oascc.ZkStateReader$2.process A cluster state change: WatchedEvent state:SyncConnected type:NodeDataChanged path:/clusterstate.json, has occurred - updating... (live nodes size: 4)
[junit4:junit4]   2> 17718 T1870 oascc.ZkStateReader$2.process A cluster state change: WatchedEvent state:SyncConnected type:NodeDataChanged path:/clusterstate.json, has occurred - updating... (live nodes size: 4)
[junit4:junit4]   2> 17718 T1913 oascc.ZkStateReader$2.process A cluster state change: WatchedEvent state:SyncConnected type:NodeDataChanged path:/clusterstate.json, has occurred - updating... (live nodes size: 4)
[junit4:junit4]   2> 17718 T1883 oascc.ZkStateReader$2.process A cluster state change: WatchedEvent state:SyncConnected type:NodeDataChanged path:/clusterstate.json, has occurred - updating... (live nodes size: 4)
[junit4:junit4]   2> 17718 T1898 oascc.ZkStateReader$2.process A cluster state change: WatchedEvent state:SyncConnected type:NodeDataChanged path:/clusterstate.json, has occurred - updating... (live nodes size: 4)
[junit4:junit4]   2> 18212 T1914 oasc.CoreContainer.registerCore registering core: collection1
[junit4:junit4]   2> 18212 T1914 oasc.ZkController.register Register replica - core:collection1 address:http://127.0.0.1:60978/hu_/j collection:collection1 shard:shard1
[junit4:junit4]   2> 18217 T1914 oasc.ZkController.register We are http://127.0.0.1:60978/hu_/j/collection1/ and leader is http://127.0.0.1:60972/hu_/j/collection1/
[junit4:junit4]   2> 18217 T1914 oasc.ZkController.register No LogReplay needed for core=collection1 baseURL=http://127.0.0.1:60978/hu_/j
[junit4:junit4]   2> 18217 T1914 oasc.ZkController.checkRecovery Core needs to recover:collection1
[junit4:junit4]   2> 18218 T1914 oasu.DefaultSolrCoreState.doRecovery Running recovery - first canceling any ongoing recovery
[junit4:junit4]   2> ASYNC  NEW_CORE C143 name=collection1 org.apache.solr.core.SolrCore@7c064cc url=http://127.0.0.1:60978/hu_/j/collection1 node=127.0.0.1:60978_hu_%2Fj C143_STATE=coll:collection1 core:collection1 props:{shard=null, roles=null, state=down, core=collection1, collection=collection1, node_name=127.0.0.1:60978_hu_%2Fj, base_url=http://127.0.0.1:60978/hu_/j}
[junit4:junit4]   2> 18219 T1916 C143 P60978 oasc.RecoveryStrategy.run Starting recovery process.  core=collection1 recoveringAfterStartup=true
[junit4:junit4]   2> 18219 T1916 C143 P60978 oasc.RecoveryStrategy.doRecovery ###### startupVersions=[]
[junit4:junit4]   2> 18220 T1914 oascc.ZkStateReader.updateClusterState Updating cloud state from ZooKeeper... 
[junit4:junit4]   2> 18220 T1916 C143 P60978 oasc.ZkController.publish publishing core=collection1 state=recovering
[junit4:junit4]   2> 18220 T1916 C143 P60978 oasc.ZkController.publish numShards not found on descriptor - reading it from system property
[junit4:junit4]   2> 18221 T1842 oass.SolrDispatchFilter.init user.dir=/usr/home/hudson/hudson-slave/workspace/Lucene-Solr-Tests-trunk-java7/solr/build/solr-core/test/J1
[junit4:junit4]   2> 18221 T1842 oass.SolrDispatchFilter.init SolrDispatchFilter.init() done
[junit4:junit4]   2> 18222 T1916 C143 P60978 oascsi.HttpClientUtil.createClient Creating new http client, config:maxConnections=128&maxConnectionsPerHost=32&followRedirects=false
[junit4:junit4]   2> 18222 T1842 oascsi.HttpClientUtil.createClient Creating new http client, config:maxConnections=128&maxConnectionsPerHost=32&followRedirects=false
[junit4:junit4]   2> 18424 T1842 oejs.Server.doStart jetty-8.1.8.v20121106
[junit4:junit4]   2> 18427 T1842 oejs.AbstractConnector.doStart Started SocketConnector@127.0.0.1:60982
[junit4:junit4]   2> 18428 T1842 oass.SolrDispatchFilter.init SolrDispatchFilter.init()
[junit4:junit4]   2> 18429 T1842 oasc.SolrResourceLoader.locateSolrHome JNDI not configured for solr (NoInitialContextEx)
[junit4:junit4]   2> 18429 T1842 oasc.SolrResourceLoader.locateSolrHome using system property solr.solr.home: /usr/home/hudson/hudson-slave/workspace/Lucene-Solr-Tests-trunk-java7/solr/build/solr-core/test/J1/./org.apache.solr.cloud.BasicDistributedZkTest-jetty4-1360668247447
[junit4:junit4]   2> 18430 T1842 oasc.CoreContainer$Initializer.initialize looking for solr.xml: /usr/home/hudson/hudson-slave/workspace/Lucene-Solr-Tests-trunk-java7/solr/build/solr-core/test/J1/./org.apache.solr.cloud.BasicDistributedZkTest-jetty4-1360668247447/solr.xml
[junit4:junit4]   2> 18430 T1842 oasc.CoreContainer.<init> New CoreContainer 1786184522
[junit4:junit4]   2> 18431 T1842 oasc.CoreContainer.load Loading CoreContainer using Solr Home: '/usr/home/hudson/hudson-slave/workspace/Lucene-Solr-Tests-trunk-java7/solr/build/solr-core/test/J1/./org.apache.solr.cloud.BasicDistributedZkTest-jetty4-1360668247447/'
[junit4:junit4]   2> 18431 T1842 oasc.SolrResourceLoader.<init> new SolrResourceLoader for directory: '/usr/home/hudson/hudson-slave/workspace/Lucene-Solr-Tests-trunk-java7/solr/build/solr-core/test/J1/./org.apache.solr.cloud.BasicDistributedZkTest-jetty4-1360668247447/'
[junit4:junit4]   2> 18498 T1842 oashc.HttpShardHandlerFactory.getParameter Setting socketTimeout to: 60000
[junit4:junit4]   2> 18499 T1842 oashc.HttpShardHandlerFactory.getParameter Setting urlScheme to: http://
[junit4:junit4]   2> 18499 T1842 oashc.HttpShardHandlerFactory.getParameter Setting connTimeout to: 15000
[junit4:junit4]   2> 18500 T1842 oashc.HttpShardHandlerFactory.getParameter Setting maxConnectionsPerHost to: 20
[junit4:junit4]   2> 18501 T1842 oashc.HttpShardHandlerFactory.getParameter Setting corePoolSize to: 0
[junit4:junit4]   2> 18501 T1842 oashc.HttpShardHandlerFactory.getParameter Setting maximumPoolSize to: 2147483647
[junit4:junit4]   2> 18502 T1842 oashc.HttpShardHandlerFactory.getParameter Setting maxThreadIdleTime to: 5
[junit4:junit4]   2> 18502 T1842 oashc.HttpShardHandlerFactory.getParameter Setting sizeOfQueue to: -1
[junit4:junit4]   2> 18503 T1842 oashc.HttpShardHandlerFactory.getParameter Setting fairnessPolicy to: false
[junit4:junit4]   2> 18503 T1842 oascsi.HttpClientUtil.createClient Creating new http client, config:maxConnectionsPerHost=20&maxConnections=10000&socketTimeout=60000&connTimeout=15000&retry=false
[junit4:junit4]   2> 18527 T1842 oasc.CoreContainer.load Registering Log Listener
[junit4:junit4]   2> 18551 T1842 oasc.CoreContainer.initZooKeeper Zookeeper client=127.0.0.1:60965/solr
[junit4:junit4]   2> 18552 T1842 oasc.ZkController.checkChrootPath zkHost includes chroot
[junit4:junit4]   2> 18552 T1842 oaz.ZooKeeper.<init> Initiating client connection, connectString=127.0.0.1:60965 sessionTimeout=60000 watcher=org.apache.solr.common.cloud.ConnectionManager@766d257
[junit4:junit4]   2> 18553 T1842 oascc.ConnectionManager.waitForConnected Waiting for client to connect to ZooKeeper
[junit4:junit4]   2> 18554 T1926 oaz.ClientCnxn$SendThread.logStartConnect Opening socket connection to server localhost/127.0.0.1:60965. Will not attempt to authenticate using SASL (access denied ("javax.security.auth.AuthPermission" "getLoginConfiguration"))
[junit4:junit4]   2> 18554 T1926 oaz.ClientCnxn$SendThread.primeConnection Socket connection established to localhost/127.0.0.1:60965, initiating session
[junit4:junit4]   2> 18555 T1844 oazs.NIOServerCnxnFactory.run Accepted socket connection from /140.211.11.196:60983
[junit4:junit4]   2> 18555 T1844 oazs.ZooKeeperServer.processConnectRequest Client attempting to establish new session at /140.211.11.196:60983
[junit4:junit4]   2> 18561 T1846 oazs.ZooKeeperServer.finishSessionInit Established session 0x13cce257e62000b with negotiated timeout 20000 for client /140.211.11.196:60983
[junit4:junit4]   2> 18561 T1926 oaz.ClientCnxn$SendThread.onConnected Session establishment complete on server localhost/127.0.0.1:60965, sessionid = 0x13cce257e62000b, negotiated timeout = 20000
[junit4:junit4]   2> 18562 T1927 oascc.ConnectionManager.process Watcher org.apache.solr.common.cloud.ConnectionManager@766d257 name:ZooKeeperConnection Watcher:127.0.0.1:60965 got event WatchedEvent state:SyncConnected type:None path:null path:null type:None
[junit4:junit4]   2> 18562 T1842 oascc.ConnectionManager.waitForConnected Client is connected to ZooKeeper
[junit4:junit4]   2> 18563 T1847 oazs.PrepRequestProcessor.pRequest2Txn Processed session termination for sessionid: 0x13cce257e62000b
[junit4:junit4]   2> 18565 T1927 oaz.ClientCnxn$EventThread.run EventThread shut down
[junit4:junit4]   2> 18565 T1844 oazs.NIOServerCnxn.closeSock Closed socket connection for client /140.211.11.196:60983 which had sessionid 0x13cce257e62000b
[junit4:junit4]   2> 18565 T1842 oaz.ZooKeeper.close Session: 0x13cce257e62000b closed
[junit4:junit4]   2> 18565 T1842 oascsi.HttpClientUtil.createClient Creating new http client, config:maxConnections=500&maxConnectionsPerHost=16&socketTimeout=60000&connTimeout=15000
[junit4:junit4]   2> 18579 T1842 oaz.ZooKeeper.<init> Initiating client connection, connectString=127.0.0.1:60965/solr sessionTimeout=30000 watcher=org.apache.solr.common.cloud.ConnectionManager@cddb3b5
[junit4:junit4]   2> 18580 T1842 oascc.ConnectionManager.waitForConnected Waiting for client to connect to ZooKeeper
[junit4:junit4]   2> 18581 T1928 oaz.ClientCnxn$SendThread.logStartConnect Opening socket connection to server localhost/127.0.0.1:60965. Will not attempt to authenticate using SASL (access denied ("javax.security.auth.AuthPermission" "getLoginConfiguration"))
[junit4:junit4]   2> 18581 T1928 oaz.ClientCnxn$SendThread.primeConnection Socket connection established to localhost/127.0.0.1:60965, initiating session
[junit4:junit4]   2> 18582 T1844 oazs.NIOServerCnxnFactory.run Accepted socket connection from /140.211.11.196:60984
[junit4:junit4]   2> 18582 T1844 oazs.ZooKeeperServer.processConnectRequest Client attempting to establish new session at /140.211.11.196:60984
[junit4:junit4]   2> 18584 T1846 oazs.ZooKeeperServer.finishSessionInit Established session 0x13cce257e62000c with negotiated timeout 20000 for client /140.211.11.196:60984
[junit4:junit4]   2> 18584 T1928 oaz.ClientCnxn$SendThread.onConnected Session establishment complete on server localhost/127.0.0.1:60965, sessionid = 0x13cce257e62000c, negotiated timeout = 20000
[junit4:junit4]   2> 18584 T1929 oascc.ConnectionManager.process Watcher org.apache.solr.common.cloud.ConnectionManager@cddb3b5 name:ZooKeeperConnection Watcher:127.0.0.1:60965/solr got event WatchedEvent state:SyncConnected type:None path:null path:null type:None
[junit4:junit4]   2> 18584 T1842 oascc.ConnectionManager.waitForConnected Client is connected to ZooKeeper
[junit4:junit4]   2> 18585 T1847 oazs.PrepRequestProcessor.pRequest Got user-level KeeperException when processing sessionid:0x13cce257e62000c type:create cxid:0x1 zxid:0xa2 txntype:-1 reqpath:n/a Error Path:/solr/overseer Error:KeeperErrorCode = NodeExists for /solr/overseer
[junit4:junit4]   2> 18587 T1847 oazs.PrepRequestProcessor.pRequest Got user-level KeeperException when processing sessionid:0x13cce257e62000c type:create cxid:0x2 zxid:0xa3 txntype:-1 reqpath:n/a Error Path:/solr/overseer Error:KeeperErrorCode = NodeExists for /solr/overseer
[junit4:junit4]   2> 18596 T1842 oascc.ZkStateReader.createClusterStateWatchersAndUpdate Updating cluster state from ZooKeeper... 
[junit4:junit4]   2> 18599 T1842 oasc.ZkController.createEphemeralLiveNode Register node as live in ZooKeeper:/live_nodes/127.0.0.1:60982_hu_%2Fj
[junit4:junit4]   2> 18600 T1847 oazs.PrepRequestProcessor.pRequest Got user-level KeeperException when processing sessionid:0x13cce257e62000c type:delete cxid:0x9 zxid:0xa4 txntype:-1 reqpath:n/a Error Path:/solr/live_nodes/127.0.0.1:60982_hu_%2Fj Error:KeeperErrorCode = NoNode for /solr/live_nodes/127.0.0.1:60982_hu_%2Fj
[junit4:junit4]   2> 18602 T1842 oascc.SolrZkClient.makePath makePath: /live_nodes/127.0.0.1:60982_hu_%2Fj
[junit4:junit4]   2> 18605 T1864 oascc.ZkStateReader$2.process A cluster state change: WatchedEvent state:SyncConnected type:NodeChildrenChanged path:/live_nodes, has occurred - updating... (live nodes size: 4)
[junit4:junit4]   2> 18605 T1883 oascc.ZkStateReader$2.process A cluster state change: WatchedEvent state:SyncConnected type:NodeChildrenChanged path:/live_nodes, has occurred - updating... (live nodes size: 4)
[junit4:junit4]   2> 18606 T1913 oascc.ZkStateReader$3.process Updating live nodes... (5)
[junit4:junit4]   2> 18606 T1898 oascc.ZkStateReader$3.process Updating live nodes... (5)
[junit4:junit4]   2> 18606 T1913 oascc.ZkStateReader$2.process A cluster state change: WatchedEvent state:SyncConnected type:NodeChildrenChanged path:/live_nodes, has occurred - updating... (live nodes size: 5)
[junit4:junit4]   2> 18606 T1898 oascc.ZkStateReader$2.process A cluster state change: WatchedEvent state:SyncConnected type:NodeChildrenChanged path:/live_nodes, has occurred - updating... (live nodes size: 5)
[junit4:junit4]   2> 18606 T1929 oascc.ZkStateReader$3.process Updating live nodes... (5)
[junit4:junit4]   2> 18606 T1870 oascc.ZkStateReader$3.process Updating live nodes... (5)
[junit4:junit4]   2> 18607 T1870 oascc.ZkStateReader$2.process A cluster state change: WatchedEvent state:SyncConnected type:NodeChildrenChanged path:/live_nodes, has occurred - updating... (live nodes size: 5)
[junit4:junit4]   2> 18608 T1883 oascc.ZkStateReader$3.process Updating live nodes... (5)
[junit4:junit4]   2> 18610 T1864 oascc.ZkStateReader$3.process Updating live nodes... (5)
[junit4:junit4]   2> 18620 T1930 oasc.CoreContainer.create Creating SolrCore 'collection1' using instanceDir: /usr/home/hudson/hudson-slave/workspace/Lucene-Solr-Tests-trunk-java7/solr/build/solr-core/test/J1/./org.apache.solr.cloud.BasicDistributedZkTest-jetty4-1360668247447/collection1
[junit4:junit4]   2> 18621 T1930 oasc.ZkController.createCollectionZkNode Check for collection zkNode:collection1
[junit4:junit4]   2> 18622 T1930 oasc.ZkController.createCollectionZkNode Collection zkNode exists
[junit4:junit4]   2> 18622 T1930 oasc.ZkController.readConfigName Load collection config from:/collections/collection1
[junit4:junit4]   2> 18623 T1930 oasc.SolrResourceLoader.<init> new SolrResourceLoader for directory: '/usr/home/hudson/hudson-slave/workspace/Lucene-Solr-Tests-trunk-java7/solr/build/solr-core/test/J1/./org.apache.solr.cloud.BasicDistributedZkTest-jetty4-1360668247447/collection1/'
[junit4:junit4]   2> 18625 T1930 oasc.SolrResourceLoader.replaceClassLoader Adding 'file:/usr/home/hudson/hudson-slave/workspace/Lucene-Solr-Tests-trunk-java7/solr/build/solr-core/test/J1/org.apache.solr.cloud.BasicDistributedZkTest-jetty4-1360668247447/collection1/lib/classes/' to classloader
[junit4:junit4]   2> 18626 T1930 oasc.SolrResourceLoader.replaceClassLoader Adding 'file:/usr/home/hudson/hudson-slave/workspace/Lucene-Solr-Tests-trunk-java7/solr/build/solr-core/test/J1/org.apache.solr.cloud.BasicDistributedZkTest-jetty4-1360668247447/collection1/lib/README' to classloader
[junit4:junit4]   2> 18690 T1930 oasc.SolrConfig.<init> Using Lucene MatchVersion: LUCENE_50
[junit4:junit4]   2> 18779 T1930 oasc.SolrConfig.<init> Loaded SolrConfig: solrconfig.xml
[junit4:junit4]   2> 18880 T1930 oass.IndexSchema.readSchema Reading Solr Schema
[junit4:junit4]   2> 18887 T1930 oass.IndexSchema.readSchema Schema name=test
[junit4:junit4]   2> 19225 T1865 oascc.ZkStateReader.updateClusterState Updating cloud state from ZooKeeper... 
[junit4:junit4]   2> 19226 T1865 oasc.Overseer$ClusterStateUpdater.updateState Update state numShards=2 message={
[junit4:junit4]   2> 	  "operation":"state",
[junit4:junit4]   2> 	  "numShards":"2",
[junit4:junit4]   2> 	  "shard":"shard1",
[junit4:junit4]   2> 	  "roles":null,
[junit4:junit4]   2> 	  "state":"recovering",
[junit4:junit4]   2> 	  "core":"collection1",
[junit4:junit4]   2> 	  "collection":"collection1",
[junit4:junit4]   2> 	  "node_name":"127.0.0.1:60978_hu_%2Fj",
[junit4:junit4]   2> 	  "base_url":"http://127.0.0.1:60978/hu_/j"}
[junit4:junit4]   2> 19244 T1883 oascc.ZkStateReader$2.process A cluster state change: WatchedEvent state:SyncConnected type:NodeDataChanged path:/clusterstate.json, has occurred - updating... (live nodes size: 5)
[junit4:junit4]   2> 19244 T1864 oascc.ZkStateReader$2.process A cluster state change: WatchedEvent state:SyncConnected type:NodeDataChanged path:/clusterstate.json, has occurred - updating... (live nodes size: 5)
[junit4:junit4]   2> 19244 T1929 oascc.ZkStateReader$2.process A cluster state change: WatchedEvent state:SyncConnected type:NodeDataChanged path:/clusterstate.json, has occurred - updating... (live nodes size: 5)
[junit4:junit4]   2> 19244 T1913 oascc.ZkStateReader$2.process A cluster state change: WatchedEvent state:SyncConnected type:NodeDataChanged path:/clusterstate.json, has occurred - updating... (live nodes size: 5)
[junit4:junit4]   2> 19244 T1898 oascc.ZkStateReader$2.process A cluster state change: WatchedEvent state:SyncConnected type:NodeDataChanged path:/clusterstate.json, has occurred - updating... (live nodes size: 5)
[junit4:junit4]   2> 19244 T1870 oascc.ZkStateReader$2.process A cluster state change: WatchedEvent state:SyncConnected type:NodeDataChanged path:/clusterstate.json, has occurred - updating... (live nodes size: 5)
[junit4:junit4]   2> 19524 T1930 oass.OpenExchangeRatesOrgProvider.init Initialized with rates=open-exchange-rates.json, refreshInterval=1440.
[junit4:junit4]   2> 19532 T1930 oass.IndexSchema.readSchema default search field in schema is text
[junit4:junit4]   2> 19535 T1930 oass.IndexSchema.readSchema unique key field: id
[junit4:junit4]   2> 19548 T1930 oass.FileExchangeRateProvider.reload Reloading exchange rates from file currency.xml
[junit4:junit4]   2> 19552 T1930 oass.FileExchangeRateProvider.reload Reloading exchange rates from file currency.xml
[junit4:junit4]   2> 19556 T1930 oass.OpenExchangeRatesOrgProvider.reload Reloading exchange rates from open-exchange-rates.json
[junit4:junit4]   2> 19557 T1930 oass.OpenExchangeRatesOrgProvider.reload Reloading exchange rates from open-exchange-rates.json
[junit4:junit4]   2> 19558 T1930 oasc.SolrCore.<init> [collection1] Opening new SolrCore at /usr/home/hudson/hudson-slave/workspace/Lucene-Solr-Tests-trunk-java7/solr/build/solr-core/test/J1/./org.apache.solr.cloud.BasicDistributedZkTest-jetty4-1360668247447/collection1/, dataDir=./org.apache.solr.cloud.BasicDistributedZkTest-1360668229211/jetty4/
[junit4:junit4]   2> 19558 T1930 oasc.JmxMonitoredMap.<init> JMX monitoring is enabled. Adding Solr mbeans to JMX Server: com.sun.jmx.mbeanserver.JmxMBeanServer@26058825
[junit4:junit4]   2> 19559 T1930 oasc.SolrCore.initDirectoryFactory solr.NRTCachingDirectoryFactory
[junit4:junit4]   2> 19559 T1930 oasc.CachingDirectoryFactory.get return new directory for /usr/home/hudson/hudson-slave/workspace/Lucene-Solr-Tests-trunk-java7/solr/build/solr-core/test/J1/./org.apache.solr.cloud.BasicDistributedZkTest-1360668229211/jetty4 forceNew:false
[junit4:junit4]   2> 19560 T1930 oasc.CachingDirectoryFactory.close Releasing directory:/usr/home/hudson/hudson-slave/workspace/Lucene-Solr-Tests-trunk-java7/solr/build/solr-core/test/J1/./org.apache.solr.cloud.BasicDistributedZkTest-1360668229211/jetty4
[junit4:junit4]   2> 19560 T1930 oasc.SolrCore.getNewIndexDir New index directory detected: old=null new=./org.apache.solr.cloud.BasicDistributedZkTest-1360668229211/jetty4/index/
[junit4:junit4]   2> 19560 T1930 oasc.SolrCore.initIndex WARNING [collection1] Solr index directory './org.apache.solr.cloud.BasicDistributedZkTest-1360668229211/jetty4/index' doesn't exist. Creating new index...
[junit4:junit4]   2> 19561 T1930 oasc.CachingDirectoryFactory.get return new directory for /usr/home/hudson/hudson-slave/workspace/Lucene-Solr-Tests-trunk-java7/solr/build/solr-core/test/J1/./org.apache.solr.cloud.BasicDistributedZkTest-1360668229211/jetty4/index forceNew:false
[junit4:junit4]   2> 19566 T1930 oasc.SolrDeletionPolicy.onCommit SolrDeletionPolicy.onCommit: commits:num=1
[junit4:junit4]   2> 		commit{dir=RateLimitedDirectoryWrapper(NRTCachingDirectory(org.apache.lucene.store.NIOFSDirectory@/usr/home/hudson/hudson-slave/workspace/Lucene-Solr-Tests-trunk-java7/solr/build/solr-core/test/J1/org.apache.solr.cloud.BasicDistributedZkTest-1360668229211/jetty4/index lockFactory=org.apache.lucene.store.NativeFSLockFactory@5a6a7c9; maxCacheMB=48.0 maxMergeSizeMB=4.0)),segFN=segments_1,generation=1,filenames=[segments_1]
[junit4:junit4]   2> 19566 T1930 oasc.SolrDeletionPolicy.updateCommits newest commit = 1[segments_1]
[junit4:junit4]   2> 19566 T1930 oasc.CachingDirectoryFactory.close Releasing directory:/usr/home/hudson/hudson-slave/workspace/Lucene-Solr-Tests-trunk-java7/solr/build/solr-core/test/J1/./org.apache.solr.cloud.BasicDistributedZkTest-1360668229211/jetty4/index
[junit4:junit4]   2> 19567 T1930 oasc.SolrCore.initWriters created xml: solr.XMLResponseWriter
[junit4:junit4]   2> 19569 T1930 oasup.UpdateRequestProcessorChain.init inserting DistributedUpdateProcessorFactory into updateRequestProcessorChain "dedupe"
[junit4:junit4]   2> 19569 T1930 oasup.UpdateRequestProcessorChain.init inserting DistributedUpdateProcessorFactory into updateRequestProcessorChain "dedupe-allfields"
[junit4:junit4]   2> 19569 T1930 oasup.UpdateRequestProcessorChain.init inserting DistributedUpdateProcessorFactory into updateRequestProcessorChain "stored_sig"
[junit4:junit4]   2> 19569 T1930 oasup.UpdateRequestProcessorChain.init inserting DistributedUpdateProcessorFactory into updateRequestProcessorChain "uniq-fields"
[junit4:junit4]   2> 19570 T1930 oasup.UpdateRequestProcessorChain.init inserting DistributedUpdateProcessorFactory into updateRequestProcessorChain "distrib-dup-test-chain-implicit"
[junit4:junit4]   2> 19570 T1930 oasc.RequestHandlers.initHandlersFromConfig adding lazy requestHandler: solr.ReplicationHandler
[junit4:junit4]   2> 19570 T1930 oasc.RequestHandlers.initHandlersFromConfig created /replication: solr.ReplicationHandler
[junit4:junit4]   2> 19571 T1930 oasc.RequestHandlers.initHandlersFromConfig created standard: solr.StandardRequestHandler
[junit4:junit4]   2> 19571 T1930 oasc.RequestHandlers.initHandlersFromConfig created /get: solr.RealTimeGetHandler
[junit4:junit4]   2> 19572 T1930 oasc.RequestHandlers.initHandlersFromConfig created dismax: solr.SearchHandler
[junit4:junit4]   2> 19572 T1930 oasc.RequestHandlers.initHandlersFromConfig created mock: org.apache.solr.core.MockQuerySenderListenerReqHandler
[junit4:junit4]   2> 19572 T1930 oasc.RequestHandlers.initHandlersFromConfig created /admin/: org.apache.solr.handler.admin.AdminHandlers
[junit4:junit4]   2> 19573 T1930 oasc.RequestHandlers.initHandlersFromConfig created defaults: solr.StandardRequestHandler
[junit4:junit4]   2> 19573 T1930 oasc.RequestHandlers.initHandlersFromConfig adding lazy requestHandler: solr.StandardRequestHandler
[junit4:junit4]   2> 19573 T1930 oasc.RequestHandlers.initHandlersFromConfig created lazy: solr.StandardRequestHandler
[junit4:junit4]   2> 19574 T1930 oasc.RequestHandlers.initHandlersFromConfig created /update: solr.UpdateRequestHandler
[junit4:junit4]   2> 19574 T1930 oasc.RequestHandlers.initHandlersFromConfig created /terms: org.apache.solr.handler.component.SearchHandler
[junit4:junit4]   2> 19574 T1930 oasc.RequestHandlers.initHandlersFromConfig created spellCheckCompRH: org.apache.solr.handler.component.SearchHandler
[junit4:junit4]   2> 19575 T1930 oasc.RequestHandlers.initHandlersFromConfig created spellCheckCompRH_Direct: org.apache.solr.handler.component.SearchHandler
[junit4:junit4]   2> 19575 T1930 oasc.RequestHandlers.initHandlersFromConfig created spellCheckWithWordbreak: org.apache.solr.handler.component.SearchHandler
[junit4:junit4]   2> 19576 T1930 oasc.RequestHandlers.initHandlersFromConfig created spellCheckWithWordbreak_Direct: org.apache.solr.handler.component.SearchHandler
[junit4:junit4]   2> 19576 T1930 oasc.RequestHandlers.initHandlersFromConfig created spellCheckCompRH1: org.apache.solr.handler.component.SearchHandler
[junit4:junit4]   2> 19576 T1930 oasc.RequestHandlers.initHandlersFromConfig created mltrh: org.apache.solr.handler.component.SearchHandler
[junit4:junit4]   2> 19577 T1930 oasc.RequestHandlers.initHandlersFromConfig created tvrh: org.apache.solr.handler.component.SearchHandler
[junit4:junit4]   2> 19577 T1930 oasc.RequestHandlers.initHandlersFromConfig created /mlt: solr.MoreLikeThisHandler
[junit4:junit4]   2> 19578 T1930 oasc.RequestHandlers.initHandlersFromConfig created /debug/dump: solr.DumpRequestHandler
[junit4:junit4]   2> 19586 T1930 oashl.XMLLoader.init xsltCacheLifetimeSeconds=60
[junit4:junit4]   2> 19589 T1930 oasc.SolrCore.initDeprecatedSupport WARNING solrconfig.xml uses deprecated <admin/gettableFiles>, Please update your config to use the ShowFileRequestHandler.
[junit4:junit4]   2> 19591 T1930 oasc.SolrCore.initDeprecatedSupport WARNING adding ShowFileRequestHandler with hidden files: [SCHEMA.XML, OLD_SYNONYMS.TXT, STOPWORDS.TXT, PROTWORDS.TXT, OPEN-EXCHANGE-RATES.JSON, SYNONYMS.TXT, CURRENCY.XML, MAPPING-ISOLATIN1ACCENT.TXT]
[junit4:junit4]   2> 19592 T1930 oasc.CachingDirectoryFactory.close Releasing directory:/usr/home/hudson/hudson-slave/workspace/Lucene-Solr-Tests-trunk-java7/solr/build/solr-core/test/J1/./org.apache.solr.cloud.BasicDistributedZkTest-1360668229211/jetty4
[junit4:junit4]   2> 19594 T1930 oass.SolrIndexSearcher.<init> Opening Searcher@186674a3 main
[junit4:junit4]   2> 19594 T1930 oasu.CommitTracker.<init> Hard AutoCommit: disabled
[junit4:junit4]   2> 19595 T1930 oasu.CommitTracker.<init> Soft AutoCommit: disabled
[junit4:junit4]   2> 19595 T1930 oashc.SpellCheckComponent.inform Initializing spell checkers
[junit4:junit4]   2> 19600 T1930 oass.DirectSolrSpellChecker.init init: {name=direct,classname=DirectSolrSpellChecker,field=lowerfilt,minQueryLength=3}
[junit4:junit4]   2> 19659 T1931 oasc.SolrCore.registerSearcher [collection1] Registered new searcher Searcher@186674a3 main{StandardDirectoryReader(segments_1:1)}
[junit4:junit4]   2> 19666 T1930 oasc.ZkController.publish publishing core=collection1 state=down
[junit4:junit4]   2> 19666 T1930 oasc.ZkController.publish numShards not found on descriptor - reading it from system property
[junit4:junit4]   2> 20753 T1865 oascc.ZkStateReader.updateClusterState Updating cloud state from ZooKeeper... 
[junit4:junit4]   2> 20754 T1865 oasc.Overseer$ClusterStateUpdater.updateState Update state numShards=2 message={
[junit4:junit4]   2> 	  "operation":"state",
[junit4:junit4]   2> 	  "numShards":"2",
[junit4:junit4]   2> 	  "shard":null,
[junit4:junit4]   2> 	  "roles":null,
[junit4:junit4]   2> 	  "state":"down",
[junit4:junit4]   2> 	  "core":"collection1",
[junit4:junit4]   2> 	  "collection":"collection1",
[junit4:junit4]   2> 	  "node_name":"127.0.0.1:60982_hu_%2Fj",
[junit4:junit4]   2> 	  "base_url":"http://127.0.0.1:60982/hu_/j"}
[junit4:junit4]   2> 20754 T1865 oasc.Overseer$ClusterStateUpdater.updateState Collection already exists with numShards=2
[junit4:junit4]   2> 20754 T1865 oasc.Overseer$ClusterStateUpdater.updateState Assigning new node to shard shard=shard2
[junit4:junit4]   2> 20775 T1864 oascc.ZkStateReader$2.process A cluster state change: WatchedEvent state:SyncConnected type:NodeDataChanged path:/clusterstate.json, has occurred - updating... (live nodes size: 5)
[junit4:junit4]   2> 20776 T1898 oascc.ZkStateReader$2.process A cluster state change: WatchedEvent state:SyncConnected type:NodeDataChanged path:/clusterstate.json, has occurred - updating... (live nodes size: 5)
[junit4:junit4]   2> 20776 T1929 oascc.ZkStateReader$2.process A cluster state change: WatchedEvent state:SyncConnected type:NodeDataChanged path:/clusterstate.json, has occurred - updating... (live nodes size: 5)
[junit4:junit4]   2> 20776 T1870 oascc.ZkStateReader$2.process A cluster state change: WatchedEvent state:SyncConnected type:NodeDataChanged path:/clusterstate.json, has occurred - updating... (live nodes size: 5)
[junit4:junit4]   2> 20776 T1913 oascc.ZkStateReader$2.process A cluster state change: WatchedEvent state:SyncConnected type:NodeDataChanged path:/clusterstate.json, has occurred - updating... (live nodes size: 5)
[junit4:junit4]   2> 20776 T1883 oascc.ZkStateReader$2.process A cluster state change: WatchedEvent state:SyncConnected type:NodeDataChanged path:/clusterstate.json, has occurred - updating... (live nodes size: 5)
[junit4:junit4]   2> 21670 T1930 oasc.CoreContainer.registerCore registering core: collection1
[junit4:junit4]   2> 21670 T1930 oasc.ZkController.register Register replica - core:collection1 address:http://127.0.0.1:60982/hu_/j collection:collection1 shard:shard2
[junit4:junit4]   2> 21675 T1930 oasc.ZkController.register We are http://127.0.0.1:60982/hu_/j/collection1/ and leader is http://127.0.0.1:60975/hu_/j/collection1/
[junit4:junit4]   2> 21675 T1930 oasc.ZkController.register No LogReplay needed for core=collection1 baseURL=http://127.0.0.1:60982/hu_/j
[junit4:junit4]   2> 21676 T1930 oasc.ZkController.checkRecovery Core needs to recover:collection1
[junit4:junit4]   2> 21676 T1930 oasu.DefaultSolrCoreState.doRecovery Running recovery - first canceling any ongoing recovery
[junit4:junit4]   2> ASYNC  NEW_CORE C144 name=collection1 org.apache.solr.core.SolrCore@1eb109df url=http://127.0.0.1:60982/hu_/j/collection1 node=127.0.0.1:60982_hu_%2Fj C144_STATE=coll:collection1 core:collection1 props:{shard=null, roles=null, state=down, core=collection1, collection=collection1, node_name=127.0.0.1:60982_hu_%2Fj, base_url=http://127.0.0.1:60982/hu_/j}
[junit4:junit4]   2> 21677 T1932 C144 P60982 oasc.RecoveryStrategy.run Starting recovery process.  core=collection1 recoveringAfterStartup=true
[junit4:junit4]   2> 21677 T1930 oascc.ZkStateReader.updateClusterState Updating cloud state from ZooKeeper... 
[junit4:junit4]   2> 21678 T1932 C144 P60982 oasc.RecoveryStrategy.doRecovery ###### startupVersions=[]
[junit4:junit4]   2> 21678 T1932 C144 P60982 oasc.ZkController.publish publishing core=collection1 state=recovering
[junit4:junit4]   2> 21678 T1932 C144 P60982 oasc.ZkController.publish numShards not found on descriptor - reading it from system property
[junit4:junit4]   2> 21679 T1842 oass.SolrDispatchFilter.init user.dir=/usr/home/hudson/hudson-slave/workspace/Lucene-Solr-Tests-trunk-java7/solr/build/solr-core/test/J1
[junit4:junit4]   2> 21679 T1842 oass.SolrDispatchFilter.init SolrDispatchFilter.init() done
[junit4:junit4]   2> 21680 T1842 oascsi.HttpClientUtil.createClient Creating new http client, config:maxConnections=128&maxConnectionsPerHost=32&followRedirects=false
[junit4:junit4]   2> 21682 T1932 C144 P60982 oascsi.HttpClientUtil.createClient Creating new http client, config:maxConnections=128&maxConnectionsPerHost=32&followRedirects=false
[junit4:junit4]   2> 21706 T1842 oascc.ZkStateReader.updateClusterState Updating cloud state from ZooKeeper... 
[junit4:junit4]   2> 21708 T1842 oasc.AbstractDistribZkTestBase.waitForRecoveriesToFinish Wait for recoveries to finish - collection: collection1 failOnTimeout:true timeout (sec):230
[junit4:junit4]   2> 21709 T1842 oascc.ZkStateReader.updateClusterState Updating cloud state from ZooKeeper... 
[junit4:junit4]   2>  C143_STATE=coll:collection1 core:collection1 props:{shard=shard1, roles=null, state=recovering, core=collection1, collection=collection1, node_name=127.0.0.1:60978_hu_%2Fj, base_url=http://127.0.0.1:60978/hu_/j}
[junit4:junit4]   2> 22246 T1916 C143 P60978 oasc.RecoveryStrategy.doRecovery Attempting to PeerSync from http://127.0.0.1:60972/hu_/j/collection1/ core=collection1 - recoveringAfterStartup=true
[junit4:junit4]   2> 22246 T1916 C143 P60978 oasu.PeerSync.sync PeerSync: core=collection1 url=http://127.0.0.1:60978/hu_/j START replicas=[http://127.0.0.1:60972/hu_/j/collection1/] nUpdates=100
[junit4:junit4]   2> 22247 T1916 C143 P60978 oasu.PeerSync.sync WARNING no frame of reference to tell of we've missed updates
[junit4:junit4]   2> 22247 T1916 C143 P60978 oasc.RecoveryStrategy.doRecovery PeerSync Recovery was not successful - trying replication. core=collection1
[junit4:junit4]   2> 22247 T1916 C143 P60978 oasc.RecoveryStrategy.doRecovery Starting Replication Recovery. core=collection1
[junit4:junit4]   2> 22247 T1916 C143 P60978 oasc.RecoveryStrategy.doRecovery Begin buffering updates. core=collection1
[junit4:junit4]   2> 22248 T1916 C143 P60978 oasu.UpdateLog.bufferUpdates Starting to buffer updates. FSUpdateLog{state=ACTIVE, tlog=null}
[junit4:junit4]   2> 22248 T1916 C143 P60978 oasc.RecoveryStrategy.replicate Attempting to replicate from http://127.0.0.1:60972/hu_/j/collection1/. core=collection1
[junit4:junit4]   2> 22248 T1916 C143 P60978 oascsi.HttpClientUtil.createClient Creating new http client, config:maxConnections=128&maxConnectionsPerHost=32&followRedirects=false
[junit4:junit4]   2> ASYNC  NEW_CORE C145 name=collection1 org.apache.solr.core.SolrCore@5a1e20d6 url=http://127.0.0.1:60972/hu_/j/collection1 node=127.0.0.1:60972_hu_%2Fj C145_STATE=coll:collection1 core:collection1 props:{shard=shard1, roles=null, state=active, core=collection1, collection=collection1, node_name=127.0.0.1:60972_hu_%2Fj, base_url=http://127.0.0.1:60972/hu_/j, leader=true}
[junit4:junit4]   2> 22259 T1874 C145 P60972 REQ /get {getVersions=100&distrib=false&wt=javabin&qt=/get&version=2} status=0 QTime=1 
[junit4:junit4]   2> 22264 T1875 C145 P60972 oasu.DirectUpdateHandler2.commit start commit{,optimize=false,openSearcher=false,waitSearcher=true,expungeDeletes=false,softCommit=false}
[junit4:junit4]   2> 22265 T1875 C145 P60972 oasc.CachingDirectoryFactory.close Releasing directory:/usr/home/hudson/hudson-slave/workspace/Lucene-Solr-Tests-trunk-java7/solr/build/solr-core/test/J1/./org.apache.solr.cloud.BasicDistributedZkTest-1360668229211/jetty1
[junit4:junit4]   2> 22272 T1875 C145 P60972 oasc.SolrDeletionPolicy.onInit SolrDeletionPolicy.onInit: commits:num=1
[junit4:junit4]   2> 		commit{dir=RateLimitedDirectoryWrapper(NRTCachingDirectory(org.apache.lucene.store.NIOFSDirectory@/usr/home/hudson/hudson-slave/workspace/Lucene-Solr-Tests-trunk-java7/solr/build/solr-core/test/J1/org.apache.solr.cloud.BasicDistributedZkTest-1360668229211/jetty1/index lockFactory=org.apache.lucene.store.NativeFSLockFactory@6c0dbbd8; maxCacheMB=48.0 maxMergeSizeMB=4.0)),segFN=segments_1,generation=1,filenames=[segments_1]
[junit4:junit4]   2> 22273 T1875 C145 P60972 oasc.SolrDeletionPolicy.updateCommits newest commit = 1[segments_1]
[junit4:junit4]   2> 22280 T1875 C145 P60972 oasc.SolrDeletionPolicy.onCommit SolrDeletionPolicy.onCommit: commits:num=2
[junit4:junit4]   2> 		commit{dir=RateLimitedDirectoryWrapper(NRTCachingDirectory(org.apache.lucene.store.NIOFSDirectory@/usr/home/hudson/hudson-slave/workspace/Lucene-Solr-Tests-trunk-java7/solr/build/solr-core/test/J1/org.apache.solr.cloud.BasicDistributedZkTest-1360668229211/jetty1/index lockFactory=org.apache.lucene.store.NativeFSLockFactory@6c0dbbd8; maxCacheMB=48.0 maxMergeSizeMB=4.0)),segFN=segments_1,generation=1,filenames=[segments_1]
[junit4:junit4]   2> 		commit{dir=RateLimitedDirectoryWrapper(NRTCachingDirectory(org.apache.lucene.store.NIOFSDirectory@/usr/home/hudson/hudson-slave/workspace/Lucene-Solr-Tests-trunk-java7/solr/build/solr-core/test/J1/org.apache.solr.cloud.BasicDistributedZkTest-1360668229211/jetty1/index lockFactory=org.apache.lucene.store.NativeFSLockFactory@6c0dbbd8; maxCacheMB=48.0 maxMergeSizeMB=4.0)),segFN=segments_2,generation=2,filenames=[segments_2]
[junit4:junit4]   2> 22281 T1875 C145 P60972 oasc.SolrDeletionPolicy.updateCommits newest commit = 2[segments_2]
[junit4:junit4]   2> 22282 T1865 oascc.ZkStateReader.updateClusterState Updating cloud state from ZooKeeper... 
[junit4:junit4]   2> 22282 T1875 C145 P60972 oasc.CachingDirectoryFactory.close Releasing directory:/usr/home/hudson/hudson-slave/workspace/Lucene-Solr-Tests-trunk-java7/solr/build/solr-core/test/J1/./org.apache.solr.cloud.BasicDistributedZkTest-1360668229211/jetty1
[junit4:junit4]   2> 22283 T1865 oasc.Overseer$ClusterStateUpdater.updateState Update state numShards=2 message={
[junit4:junit4]   2> 	  "operation":"state",
[junit4:junit4]   2> 	  "numShards":"2",
[junit4:junit4]   2> 	  "shard":"shard2",
[junit4:junit4]   2> 	  "roles":null,
[junit4:junit4]   2> 	  "state":"recovering",
[junit4:junit4]   2> 	  "core":"collection1",
[junit4:junit4]   2> 	  "collection":"collection1",
[junit4:junit4]   2> 	  "node_name":"127.0.0.1:60982_hu_%2Fj",
[junit4:junit4]   2> 	  "base_url":"http://127.0.0.1:60982/hu_/j"}
[junit4:junit4]   2> 22283 T1875 C145 P60972 oass.SolrIndexSearcher.<init> Opening Searcher@339790f9 realtime
[junit4:junit4]   2> 22284 T1875 C145 P60972 oasu.DirectUpdateHandler2.commit end_commit_flush
[junit4:junit4]   2> 22284 T1875 C145 P60972 /update {waitSearcher=true&openSearcher=false&commit=true&wt=javabin&commit_end_point=true&version=2&softCommit=false} {commit=} 0 21
[junit4:junit4]   2> 22286 T1916 C143 P60978 oash.ReplicationHandler.inform Commits will be reserved for  10000
[junit4:junit4]   2> 22286 T1916 C143 P60978 oash.SnapPuller.<init>  No value set for 'pollInterval'. Timer Task not started.
[junit4:junit4]   2> 22289 T1876 C145 P60972 oash.ReplicationHandler.inform Commits will be reserved for  10000
[junit4:junit4]   2> 22289 T1876 C145 P60972 REQ /replication {command=indexversion&qt=/replication&wt=javabin&version=2} status=0 QTime=2 
[junit4:junit4]   2> 22290 T1916 C143 P60978 oash.SnapPuller.fetchLatestIndex Master's generation: 2
[junit4:junit4]   2> 22291 T1916 C143 P60978 oash.SnapPuller.fetchLatestIndex Slave's generation: 1
[junit4:junit4]   2> 22291 T1916 C143 P60978 oash.SnapPuller.fetchLatestIndex Starting replication process
[junit4:junit4]   2> 22293 T1876 C145 P60972 oasc.CachingDirectoryFactory.close Releasing directory:/usr/home/hudson/hudson-slave/workspace/Lucene-Solr-Tests-trunk-java7/solr/build/solr-core/test/J1/./org.apache.solr.cloud.BasicDistributedZkTest-1360668229211/jetty1
[junit4:junit4]   2> 22295 T1876 C145 P60972 oasc.CachingDirectoryFactory.close Releasing directory:/usr/home/hudson/hudson-slave/workspace/Lucene-Solr-Tests-trunk-java7/solr/build/solr-core/test/J1/./org.apache.solr.cloud.BasicDistributedZkTest-1360668229211/jetty1/index
[junit4:junit4]   2> 22295 T1876 C145 P60972 REQ /replication {command=filelist&qt=/replication&wt=javabin&generation=2&version=2} status=0 QTime=2 
[junit4:junit4]   2> 22296 T1916 C143 P60978 oash.SnapPuller.fetchLatestIndex Number of files in latest index in master: 1
[junit4:junit4]   2> 22297 T1864 oascc.ZkStateReader$2.process A cluster state change: WatchedEvent state:SyncConnected type:NodeDataChanged path:/clusterstate.json, has occurred - updating... (live nodes size: 5)
[junit4:junit4]   2> 22297 T1870 oascc.ZkStateReader$2.process A cluster state change: WatchedEvent state:SyncConnected type:NodeDataChanged path:/clusterstate.json, has occurred - updating... (live nodes size: 5)
[junit4:junit4]   2> 22297 T1929 oascc.ZkStateReader$2.process A cluster state change: WatchedEvent state:SyncConnected type:NodeDataChanged path:/clusterstate.json, has occurred - updating... (live nodes size: 5)
[junit4:junit4]   2> 22297 T1913 oascc.ZkStateReader$2.process A cluster state change: WatchedEvent state:SyncConnected type:NodeDataChanged path:/clusterstate.json, has occurred - updating... (live nodes size: 5)
[junit4:junit4]   2> 22297 T1883 oascc.ZkStateReader$2.process A cluster state change: WatchedEvent state:SyncConnected type:NodeDataChanged path:/clusterstate.json, has occurred - updating... (live nodes size: 5)
[junit4:junit4]   2> 22297 T1898 oascc.ZkStateReader$2.process A cluster state change: WatchedEvent state:SyncConnected type:NodeDataChanged path:/clusterstate.json, has occurred - updating... (live nodes size: 5)
[junit4:junit4]   2> 22298 T1916 C143 P60978 oasc.CachingDirectoryFactory.get return new directory for /usr/home/hudson/hudson-slave/workspace/Lucene-Solr-Tests-trunk-java7/solr/build/solr-core/test/J1/./org.apache.solr.cloud.BasicDistributedZkTest-1360668229211/jetty3/index.20130212232411502 forceNew:false
[junit4:junit4]   2> 22300 T1916 C143 P60978 oasc.CachingDirectoryFactory.close Releasing directory:/usr/home/hudson/hudson-slave/workspace/Lucene-Solr-Tests-trunk-java7/solr/build/solr-core/test/J1/./org.apache.solr.cloud.BasicDistributedZkTest-1360668229211/jetty3
[junit4:junit4]   2> 22301 T1916 C143 P60978 oash.SnapPuller.fetchLatestIndex Starting download to RateLimitedDirectoryWrapper(NRTCachingDirectory(org.apache.lucene.store.NIOFSDirectory@/usr/home/hudson/hudson-slave/workspace/Lucene-Solr-Tests-trunk-java7/solr/build/solr-core/test/J1/org.apache.solr.cloud.BasicDistributedZkTest-1360668229211/jetty3/index.20130212232411502 lockFactory=org.apache.lucene.store.NativeFSLockFactory@5405d518; maxCacheMB=48.0 maxMergeSizeMB=4.0)) fullCopy=true
[junit4:junit4]   2> 22305 T1876 C145 P60972 REQ /replication {file=segments_2&command=filecontent&checksum=true&wt=filestream&qt=/replication&generation=2} status=0 QTime=0 
[junit4:junit4]   2> 22307 T1916 C143 P60978 oasc.CachingDirectoryFactory.close Releasing directory:/usr/home/hudson/hudson-slave/workspace/Lucene-Solr-Tests-trunk-java7/solr/build/solr-core/test/J1/./org.apache.solr.cloud.BasicDistributedZkTest-1360668229211/jetty3/index
[junit4:junit4]   2> 22307 T1916 C143 P60978 oash.SnapPuller.fetchLatestIndex Total time taken for download : 0 secs
[junit4:junit4]   2> 22308 T1916 C143 P60978 oash.SnapPuller.modifyIndexProps New index installed. Updating index properties... index=index.20130212232411502
[junit4:junit4]   2> 22310 T1916 C143 P60978 oasc.CachingDirectoryFactory.close Releasing directory:/usr/home/hudson/hudson-slave/workspace/Lucene-Solr-Tests-trunk-java7/solr/build/solr-core/test/J1/./org.apache.solr.cloud.BasicDistributedZkTest-1360668229211/jetty3
[junit4:junit4]   2> 22310 T1916 C143 P60978 oasc.CachingDirectoryFactory.close Releasing directory:/usr/home/hudson/hudson-slave/workspace/Lucene-Solr-Tests-trunk-java7/solr/build/solr-core/test/J1/./org.apache.solr.cloud.BasicDistributedZkTest-1360668229211/jetty3
[junit4:junit4]   2> 22310 T1916 C143 P60978 oasc.SolrCore.getNewIndexDir New index directory detected: old=./org.apache.solr.cloud.BasicDistributedZkTest-1360668229211/jetty3/index/ new=./org.apache.solr.cloud.BasicDistributedZkTest-1360668229211/jetty3/index.20130212232411502
[junit4:junit4]   2> 22315 T1916 C143 P60978 oasc.SolrDeletionPolicy.onInit SolrDeletionPolicy.onInit: commits:num=1
[junit4:junit4]   2> 		commit{dir=RateLimitedDirectoryWrapper(NRTCachingDirectory(org.apache.lucene.store.NIOFSDirectory@/usr/home/hudson/hudson-slave/workspace/Lucene-Solr-Tests-trunk-java7/solr/build/solr-core/test/J1/org.apache.solr.cloud.BasicDistributedZkTest-1360668229211/jetty3/index.20130212232411502 lockFactory=org.apache.lucene.store.NativeFSLockFactory@5405d518; maxCacheMB=48.0 maxMergeSizeMB=4.0)),segFN=segments_2,generation=2,filenames=[segments_2]
[junit4:junit4]   2> 22316 T1916 C143 P60978 oasc.SolrDeletionPolicy.updateCommits newest commit = 2[segments_2]
[junit4:junit4]   2> 22318 T1916 C143 P60978 oasc.CachingDirectoryFactory.close Releasing directory:/usr/home/hudson/hudson-slave/workspace/Lucene-Solr-Tests-trunk-java7/solr/build/solr-core/test/J1/./org.apache.solr.cloud.BasicDistributedZkTest-1360668229211/jetty3
[junit4:junit4]   2> 22318 T1916 C143 P60978 oasu.DefaultSolrCoreState.newIndexWriter Creating new IndexWriter...
[junit4:junit4]   2> 22318 T1916 C143 P60978 oasu.DefaultSolrCoreState.newIndexWriter Waiting until IndexWriter is unused... core=collection1
[junit4:junit4]   2> 22319 T1916 C143 P60978 oasu.DefaultSolrCoreState.newIndexWriter Rollback old IndexWriter... core=collection1
[junit4:junit4]   2> 22320 T1916 C143 P60978 oasc.CachingDirectoryFactory.close Releasing directory:/usr/home/hudson/hudson-slave/workspace/Lucene-Solr-Tests-trunk-java7/solr/build/solr-core/test/J1/./org.apache.solr.cloud.BasicDistributedZkTest-1360668229211/jetty3/index.20130212232411502
[junit4:junit4]   2> 22321 T1916 C143 P60978 oasc.CachingDirectoryFactory.close Releasing directory:/usr/home/hudson/hudson-slave/workspace/Lucene-Solr-Tests-trunk-java7/solr/build/solr-core/test/J1/./org.apache.solr.cloud.BasicDistributedZkTest-1360668229211/jetty3
[junit4:junit4]   2> 22325 T1916 C143 P60978 oasc.SolrDeletionPolicy.onInit SolrDeletionPolicy.onInit: commits:num=1
[junit4:junit4]   2> 		commit{dir=RateLimitedDirectoryWrapper(NRTCachingDirectory(org.apache.lucene.store.NIOFSDirectory@/usr/home/hudson/hudson-slave/workspace/Lucene-Solr-Tests-trunk-java7/solr/build/solr-core/test/J1/org.apache.solr.cloud.BasicDistributedZkTest-1360668229211/jetty3/index.20130212232411502 lockFactory=org.apache.lucene.store.NativeFSLockFactory@5405d518; maxCacheMB=48.0 maxMergeSizeMB=4.0)),segFN=segments_2,generation=2,filenames=[segments_2]
[junit4:junit4]   2> 22325 T1916 C143 P60978 oasc.SolrDeletionPolicy.updateCommits newest commit = 2[segments_2]
[junit4:junit4]   2> 22325 T1916 C143 P60978 oasu.DefaultSolrCoreState.newIndexWriter New IndexWriter is ready to be used.
[junit4:junit4]   2> 22326 T1916 C143 P60978 oasc.CachingDirectoryFactory.close Releasing directory:/usr/home/hudson/hudson-slave/workspace/Lucene-Solr-Tests-trunk-java7/solr/build/solr-core/test/J1/./org.apache.solr.cloud.BasicDistributedZkTest-1360668229211/jetty3
[junit4:junit4]   2> 22326 T1916 C143 P60978 oass.SolrIndexSearcher.<init> Opening Searcher@2ca61a16 main
[junit4:junit4]   2> 22328 T1915 oasc.SolrCore.registerSearcher [collection1] Registered new searcher Searcher@2ca61a16 main{StandardDirectoryReader(segments_2:1:nrt)}
[junit4:junit4]   2> 22329 T1915 oasc.CachingDirectoryFactory.close Releasing directory:/usr/home/hudson/hudson-slave/workspace/Lucene-Solr-Tests-trunk-java7/solr/build/solr-core/test/J1/./org.apache.solr.cloud.BasicDistributedZkTest-1360668229211/jetty3/index
[junit4:junit4]   2> 22329 T1916 C143 P60978 oasu.DirectUpdateHandler2.commit start commit{,optimize=false,openSearcher=false,waitSearcher=false,expungeDeletes=false,softCommit=false}
[junit4:junit4]   2> 22334 T1916 C143 P60978 oasc.SolrDeletionPolicy.onCommit SolrDeletionPolicy.onCommit: commits:num=2
[junit4:junit4]   2> 		commit{dir=RateLimitedDirectoryWrapper(NRTCachingDirectory(org.apache.lucene.store.NIOFSDirectory@/usr/home/hudson/hudson-slave/workspace/Lucene-Solr-Tests-trunk-java7/solr/build/solr-core/test/J1/org.apache.solr.cloud.BasicDistributedZkTest-1360668229211/jetty3/index.20130212232411502 lockFactory=org.apache.lucene.store.NativeFSLockFactory@5405d518; maxCacheMB=48.0 maxMergeSizeMB=4.0)),segFN=segments_2,generation=2,filenames=[segments_2]
[junit4:junit4]   2> 		commit{dir=RateLimitedDirectoryWrapper(NRTCachingDirectory(org.apache.lucene.store.NIOFSDirectory@/usr/home/hudson/hudson-slave/workspace/Lucene-Solr-Tests-trunk-java7/solr/build/solr-core/test/J1/org.apache.solr.cloud.BasicDistributedZkTest-1360668229211/jetty3/index.20130212232411502 lockFactory=org.apache.lucene.store.NativeFSLockFactory@5405d518; maxCacheMB=48.0 maxMergeSizeMB=4.0)),segFN=segments_3,generation=3,filenames=[segments_3]
[junit4:junit4]   2> 22334 T1916 C143 P60978 oasc.SolrDeletionPolicy.updateCommits newest commit = 3[segments_3]
[junit4:junit4]   2> 22335 T1916 C143 P60978 oasc.CachingDirectoryFactory.close Releasing directory:/usr/home/hudson/hudson-slave/workspace/Lucene-Solr-Tests-trunk-java7/solr/build/solr-core/test/J1/./org.apache.solr.cloud.BasicDistributedZkTest-1360668229211/jetty3
[junit4:junit4]   2> 22335 T1916 C143 P60978 oasu.DirectUpdateHandler2.commit end_commit_flush
[junit4:junit4]   2> 22336 T1916 C143 P60978 oasc.CachingDirectoryFactory.close Releasing directory:/usr/home/hudson/hudson-slave/workspace/Lucene-Solr-Tests-trunk-java7/solr/build/solr-core/test/J1/./org.apache.solr.cloud.BasicDistributedZkTest-1360668229211/jetty3/index.20130212232411502
[junit4:junit4]   2> 22336 T1916 C143 P60978 oasc.CachingDirectoryFactory.close Releasing directory:/usr/home/hudson/hudson-slave/workspace/Lucene-Solr-Tests-trunk-java7/solr/build/solr-core/test/J1/./org.apache.solr.cloud.BasicDistributedZkTest-1360668229211/jetty3/index
[junit4:junit4]   2> 22336 T1916 C143 P60978 oasc.RecoveryStrategy.replay No replay needed. core=collection1
[junit4:junit4]   2> 22336 T1916 C143 P60978 oasc.RecoveryStrategy.doRecovery Replication Recovery was successful - registering as Active. core=collection1
[junit4:junit4]   2> 22336 T1916 C143 P60978 oasc.ZkController.publish publishing core=collection1 state=active
[junit4:junit4]   2> 22337 T1916 C143 P60978 oasc.ZkController.publish numShards not found on descriptor - reading it from system property
[junit4:junit4]   2> 22344 T1916 C143 P60978 oasc.RecoveryStrategy.doRecovery Finished recovery process. core=collection1
[junit4:junit4]   2> 22713 T1842 oascc.ZkStateReader.updateClusterState Updating cloud state from ZooKeeper... 
[junit4:junit4]   2> 23715 T1842 oascc.ZkStateReader.updateClusterState Updating cloud state from ZooKeeper... 
[junit4:junit4]   2> 23809 T1865 oascc.ZkStateReader.updateClusterState Updating cloud state from ZooKeeper... 
[junit4:junit4]   2> 23810 T1865 oasc.Overseer$ClusterStateUpdater.updateState Update state numShards=2 message={
[junit4:junit4]   2> 	  "operation":"state",
[junit4:junit4]   2> 	  "numShards":"2",
[junit4:junit4]   2> 	  "shard":"shard1",
[junit4:junit4]   2> 	  "roles":null,
[junit4:junit4]   2> 	  "state":"active",
[junit4:junit4]   2> 	  "core":"collection1",
[junit4:junit4]   2> 	  "collection":"collection1",
[junit4:junit4]   2> 	  "node_name":"127.0.0.1:60978_hu_%2Fj",
[junit4:junit4]   2> 	  "base_url":"http://127.0.0.1:60978/hu_/j"}
[junit4:junit4]   2> 23858 T1913 oascc.ZkStateReader$2.process A cluster state change: WatchedEvent state:SyncConnected type:NodeDataChanged path:/clusterstate.json, has occurred - updating... (live nodes size: 5)
[junit4:junit4]   2> 23858 T1883 oascc.ZkStateReader$2.process A cluster state change: WatchedEvent state:SyncConnected type:NodeDataChanged path:/clusterstate.json, has occurred - updating... (live nodes size: 5)
[junit4:junit4]   2> 23858 T1898 oascc.ZkStateReader$2.process A cluster state change: WatchedEvent state:SyncConnected type:NodeDataChanged path:/clusterstate.json, has occurred - updating... (live nodes size: 5)
[junit4:junit4]   2> 23858 T1929 oascc.ZkStateReader$2.process A cluster state change: WatchedEvent state:SyncConnected type:NodeDataChanged path:/clusterstate.json, has occurred - updating... (live nodes size: 5)
[junit4:junit4]   2> 23858 T1870 oascc.ZkStateReader$2.process A cluster state change: WatchedEvent state:SyncConnected type:NodeDataChanged path:/clusterstate.json, has occurred - updating... (live nodes size: 5)
[junit4:junit4]   2> 23858 T1864 oascc.ZkStateReader$2.process A cluster state change: WatchedEvent state:SyncConnected type:NodeDataChanged path:/clusterstate.json, has occurred - updating... (live nodes size: 5)
[junit4:junit4]   2>  C144_STATE=coll:collection1 core:collection1 props:{shard=shard2, roles=null, state=recovering, core=collection1, collection=collection1, node_name=127.0.0.1:60982_hu_%2Fj, base_url=http://127.0.0.1:60982/hu_/j}
[junit4:junit4]   2> 24708 T1932 C144 P60982 oasc.RecoveryStrategy.doRecovery Attempting to PeerSync from http://127.0.0.1:60975/hu_/j/collection1/ core=collection1 - recoveringAfterStartup=true
[junit4:junit4]   2> 24708 T1932 C144 P60982 oasu.PeerSync.sync PeerSync: core=collection1 url=http://127.0.0.1:60982/hu_/j START replicas=[http://127.0.0.1:60975/hu_/j/collection1/] nUpdates=100
[junit4:junit4]   2> 24709 T1932 C144 P60982 oasu.PeerSync.sync WARNING no frame of reference to tell of we've missed updates
[junit4:junit4]   2> 24709 T1932 C144 P60982 oasc.RecoveryStrategy.doRecovery PeerSync Recovery was not successful - trying replication. core=collection1
[junit4:junit4]   2> 24709 T1932 C144 P60982 oasc.RecoveryStrategy.doRecovery Starting Replication Recovery. core=collection1
[junit4:junit4]   2> 24709 T1932 C144 P60982 oasc.RecoveryStrategy.doRecovery Begin buffering updates. core=collection1
[junit4:junit4]   2> 24710 T1932 C144 P60982 oasu.UpdateLog.bufferUpdates Starting to buffer updates. FSUpdateLog{state=ACTIVE, tlog=null}
[junit4:junit4]   2> 24710 T1932 C144 P60982 oasc.RecoveryStrategy.replicate Attempting to replicate from http://127.0.0.1:60975/hu_/j/collection1/. core=collection1
[junit4:junit4]   2> 24710 T1932 C144 P60982 oascsi.HttpClientUtil.createClient Creating new http client, config:maxConnections=128&maxConnectionsPerHost=32&followRedirects=false
[junit4:junit4]   2> 24718 T1842 oascc.ZkStateReader.updateClusterState Updating cloud state from ZooKeeper... 
[junit4:junit4]   2> ASYNC  NEW_CORE C146 name=collection1 org.apache.solr.core.SolrCore@7a53a543 url=http://127.0.0.1:60975/hu_/j/collection1 node=127.0.0.1:60975_hu_%2Fj C146_STATE=coll:collection1 core:collection1 props:{shard=shard2, roles=null, state=active, core=collection1, collection=collection1, node_name=127.0.0.1:60975_hu_%2Fj, base_url=http://127.0.0.1:60975/hu_/j, leader=true}
[junit4:junit4]   2> 24722 T1889 C146 P60975 REQ /get {getVersions=100&distrib=false&wt=javabin&qt=/get&version=2} status=0 QTime=1 
[junit4:junit4]   2> 24729 T1890 C146 P60975 oasu.DirectUpdateHandler2.commit start commit{,optimize=false,openSearcher=false,waitSearcher=true,expungeDeletes=false,softCommit=false}
[junit4:junit4]   2> 24730 T1890 C146 P60975 oasc.CachingDirectoryFactory.close Releasing directory:/usr/home/hudson/hudson-slave/workspace/Lucene-Solr-Tests-trunk-java7/solr/build/solr-core/test/J1/./org.apache.solr.cloud.BasicDistributedZkTest-1360668229211/jetty2
[junit4:junit4]   2> 24736 T1890 C146 P60975 oasc.SolrDeletionPolicy.onInit SolrDeletionPolicy.onInit: commits:num=1
[junit4:junit4]   2> 		commit{dir=RateLimitedDirectoryWrapper(NRTCachingDirectory(org.apache.lucene.store.NIOFSDirectory@/usr/home/hudson/hudson-slave/workspace/Lucene-Solr-Tests-trunk-java7/solr/build/solr-core/test/J1/org.apache.solr.cloud.BasicDistributedZkTest-1360668229211/jetty2/index lockFactory=org.apache.lucene.store.NativeFSLockFactory@12ed2889; maxCacheMB=48.0 maxMergeSizeMB=4.0)),segFN=segments_1,generation=1,filenames=[segments_1]
[junit4:junit4]   2> 24736 T1890 C146 P60975 oasc.SolrDeletionPolicy.updateCommits newest commit = 1[segments_1]
[junit4:junit4]   2> 24742 T1890 C146 P60975 oasc.SolrDeletionPolicy.onCommit SolrDeletionPolicy.onCommit: commits:num=2
[junit4:junit4]   2> 		commit{dir=RateLimitedDirectoryWrapper(NRTCachingDirectory(org.apache.lucene.store.NIOFSDirectory@/usr/home/hudson/hudson-slave/workspace/Lucene-Solr-Tests-trunk-java7/solr/build/solr-core/test/J1/org.apache.solr.cloud.BasicDistributedZkTest-1360668229211/jetty2/index lockFactory=org.apache.lucene.store.NativeFSLockFactory@12ed2889; maxCacheMB=48.0 maxMergeSizeMB=4.0)),segFN=segments_1,generation=1,filenames=[segments_1]
[junit4:junit4]   2> 		commit{dir=RateLimitedDirectoryWrapper(NRTCachingDirectory(org.apache.lucene.store.NIOFSDirectory@/usr/home/hudson/hudson-slave/workspace/Lucene-Solr-Tests-trunk-java7/solr/build/solr-core/test/J1/org.apache.solr.cloud.BasicDistributedZkTest-1360668229211/jetty2/index lockFactory=org.apache.lucene.store.NativeFSLockFactory@12ed2889; maxCacheMB=48.0 maxMergeSizeMB=4.0)),segFN=segments_2,generation=2,filenames=[segments_2]
[junit4:junit4]   2> 24743 T1890 C146 P60975 oasc.SolrDeletionPolicy.updateCommits newest commit = 2[segments_2]
[junit4:junit4]   2> 24744 T1890 C146 P60975 oasc.CachingDirectoryFactory.close Releasing directory:/usr/home/hudson/hudson-slave/workspace/Lucene-Solr-Tests-trunk-java7/solr/build/solr-core/test/J1/./org.apache.solr.cloud.BasicDistributedZkTest-1360668229211/jetty2
[junit4:junit4]   2> 24745 T1890 C146 P60975 oass.SolrIndexSearcher.<init> Opening Searcher@66a7ebee realtime
[junit4:junit4]   2> 24745 T1890 C146 P60975 oasu.DirectUpdateHandler2.commit end_commit_flush
[junit4:junit4]   2> 24746 T1890 C146 P60975 /update {waitSearcher=true&openSearcher=false&commit=true&wt=javabin&commit_end_point=true&version=2&softCommit=false} {commit=} 0 17
[junit4:junit4]   2> 24747 T1932 C144 P60982 oash.ReplicationHandler.inform Commits will be reserved for  10000
[junit4:junit4]   2> 24747 T1932 C144 P60982 oash.SnapPuller.<init>  No value set for 'pollInterval'. Timer Task not started.
[junit4:junit4]   2> 24749 T1891 C146 P60975 oash.ReplicationHandler.inform Commits will be reserved for  10000
[junit4:junit4]   2> 24749 T1891 C146 P60975 REQ /replication {command=indexversion&qt=/replication&wt=javabin&version=2} status=0 QTime=1 
[junit4:junit4]   2> 24750 T1932 C144 P60982 oash.SnapPuller.fetchLatestIndex Master's generation: 2
[junit4:junit4]   2> 24750 T1932 C144 P60982 oash.SnapPuller.fetchLatestIndex Slave's generation: 1
[junit4:junit4]   2> 24750 T1932 C144 P60982 oash.SnapPuller.fetchLatestIndex Starting replication process
[junit4:junit4]   2> 24753 T1891 C146 P60975 oasc.CachingDirectoryFactory.close Releasing directory:/usr/home/hudson/hudson-slave/workspace/Lucene-Solr-Tests-trunk-java7/solr/build/solr-core/test/J1/./org.apache.solr.cloud.BasicDistributedZkTest-1360668229211/jetty2
[junit4:junit4]   2> 24754 T1891 C146 P60975 oasc.CachingDirectoryFactory.close Releasing directory:/usr/home/hudson/hudson-slave/workspace/Lucene-Solr-Tests-trunk-java7/solr/build/solr-core/test/J1/./org.apache.solr.cloud.BasicDistributedZkTest-1360668229211/jetty2/index
[junit4:junit4]   2> 24754 T1891 C146 P60975 REQ /replication {command=filelist&qt=/replication&wt=javabin&generation=2&version=2} status=0 QTime=1 
[junit4:junit4]   2> 24755 T1932 C144 P60982 oash.SnapPuller.fetchLatestIndex Number of files in latest index in master: 1
[junit4:junit4]   2> 24756 T1932 C144 P60982 oasc.CachingDirectoryFactory.get return new directory for /usr/home/hudson/hudson-slave/workspace/Lucene-Solr-Tests-trunk-java7/solr/build/solr-core/test/J1/./org.apache.solr.cloud.BasicDistributedZkTest-1360668229211/jetty4/index.20130212232413961 forceNew:false
[junit4:junit4]   2> 24757 T1932 C144 P60982 oasc.CachingDirectoryFactory.close Releasing directory:/usr/home/hudson/hudson-slave/workspace/Lucene-Solr-Tests-trunk-java7/solr/build/solr-core/test/J1/./org.apache.solr.cloud.BasicDistributedZkTest-1360668229211/jetty4
[junit4:junit4]   2> 24757 T1932 C144 P60982 oash.SnapPuller.fetchLatestIndex Starting download to RateLimitedDirectoryWrapper(NRTCachingDirectory(org.apache.lucene.store.NIOFSDirectory@/usr/home/hudson/hudson-slave/workspace/Lucene-Solr-Tests-trunk-java7/solr/build/solr-core/test/J1/org.apache.solr.cloud.BasicDistributedZkTest-1360668229211/jetty4/index.20130212232413961 lockFactory=org.apache.lucene.store.NativeFSLockFactory@269d5687; maxCacheMB=48.0 maxMergeSizeMB=4.0)) fullCopy=true
[junit4:junit4]   2> 24761 T1891 C146 P60975 REQ /replication {file=segments_2&command=filecontent&checksum=true&wt=filestream&qt=/replication&generation=2} status=0 QTime=0 
[junit4:junit4]   2> 24763 T1932 C144 P60982 oasc.CachingDirectoryFactory.close Releasing directory:/usr/home/hudson/hudson-slave/workspace/Lucene-Solr-Tests-trunk-java7/solr/build/solr-core/test/J1/./org.apache.solr.cloud.BasicDistributedZkTest-1360668229211/jetty4/index
[junit4:junit4]   2> 24763 T1932 C144 P60982 oash.SnapPuller.fetchLatestIndex Total time taken for download : 0 secs
[junit4:junit4]   2> 24764 T1932 C144 P60982 oash.SnapPuller.modifyIndexProps New index installed. Updating index properties... index=index.20130212232413961
[junit4:junit4]   2> 24765 T1932 C144 P60982 oasc.CachingDirectoryFactory.close Releasing directory:/usr/home/hudson/hudson-slave/workspace/Lucene-Solr-Tests-trunk-java7/solr/build/solr-core/test/J1/./org.apache.solr.cloud.BasicDistributedZkTest-1360668229211/jetty4
[junit4:junit4]   2> 24766 T1932 C144 P60982 oasc.CachingDirectoryFactory.close Releasing directory:/usr/home/hudson/hudson-slave/workspace/Lucene-Solr-Tests-trunk-java7/solr/build/solr-core/test/J1/./org.apache.solr.cloud.BasicDistributedZkTest-1360668229211/jetty4
[junit4:junit4]   2> 24766 T1932 C144 P60982 oasc.SolrCore.getNewIndexDir New index directory detected: old=./org.apache.solr.cloud.BasicDistributedZkTest-1360668229211/jetty4/index/ new=./org.apache.solr.cloud.BasicDistributedZkTest-1360668229211/jetty4/index.20130212232413961
[junit4:junit4]   2> 24770 T1932 C144 P60982 oasc.SolrDeletionPolicy.onInit SolrDeletionPolicy.onInit: commits:num=1
[junit4:junit4]   2> 		commit{dir=RateLimitedDirectoryWrapper(NRTCachingDirectory(org.apache.lucene.store.NIOFSDirectory@/usr/home/hudson/hudson-slave/workspace/Lucene-Solr-Tests-trunk-java7/solr/build/solr-core/test/J1/org.apache.solr.cloud.BasicDistributedZkTest-1360668229211/jetty4/index.20130212232413961 lockFactory=org.apache.lucene.store.NativeFSLockFactory@269d5687; maxCacheMB=48.0 maxMergeSizeMB=4.0)),segFN=segments_2,generation=2,filenames=[segments_2]
[junit4:junit4]   2> 24770 T1932 C144 P60982 oasc.SolrDeletionPolicy.updateCommits newest commit = 2[segments_2]
[junit4:junit4]   2> 24772 T1932 C144 P60982 oasc.CachingDirectoryFactory.close Releasing directory:/usr/home/hudson/hudson-slave/workspace/Lucene-Solr-Tests-trunk-java7/solr/build/solr-core/test/J1/./org.apache.solr.cloud.BasicDistributedZkTest-1360668229211/jetty4
[junit4:junit4]   2> 24772 T1932 C144 P60982 oasu.DefaultSolrCoreState.newIndexWriter Creating new IndexWriter...
[junit4:junit4]   2> 24772 T1932 C144 P60982 oasu.DefaultSolrCoreState.newIndexWriter Waiting until IndexWriter is unused... core=collection1
[junit4:junit4]   2> 24772 T1932 C144 P60982 oasu.DefaultSolrCoreState.newIndexWriter Rollback old IndexWriter... core=collection1
[junit4:junit4]   2> 24773 T1932 C144 P60982 oasc.CachingDirectoryFactory.close Releasing directory:/usr/home/hudson/hudson-slave/workspace/Lucene-Solr-Tests-trunk-java7/solr/build/solr-core/test/J1/./org.apache.solr.cloud.BasicDistributedZkTest-1360668229211/jetty4/index.20130212232413961
[junit4:junit4]   2> 24774 T1932 C144 P60982 oasc.CachingDirectoryFactory.close Releasing directory:/usr/home/hudson/hudson-slave/workspace/Lucene-Solr-Tests-trunk-java7/solr/build/solr-core/test/J1/./org.apache.solr.cloud.BasicDistributedZkTest-1360668229211/jetty4
[junit4:junit4]   2> 24777 T1932 C144 P60982 oasc.SolrDeletionPolicy.onInit SolrDeletionPolicy.onInit: commits:num=1
[junit4:junit4]   2> 		commit{dir=RateLimitedDirectoryWrapper(NRTCachingDirectory(org.apache.lucene.store.NIOFSDirectory@/usr/home/hudson/hudson-slave/workspace/Lucene-Solr-Tests-trunk-java7/solr/build/solr-core/test/J1/org.apache.solr.cloud.BasicDistributedZkTest-1360668229211/jetty4/index.20130212232413961 lockFactory=org.apache.lucene.store.NativeFSLockFactory@269d5687; maxCacheMB=48.0 maxMergeSizeMB=4.0)),segFN=segments_2,generation=2,filenames=[segments_2]
[junit4:junit4]   2> 24778 T1932 C144 P60982 oasc.SolrDeletionPolicy.updateCommits newest commit = 2[segments_2]
[junit4:junit4]   2> 24778 T1932 C144 P60982 oasu.DefaultSolrCoreState.newIndexWriter New IndexWriter is ready to be used.
[junit4:junit4]   2> 24778 T1932 C144 P60982 oasc.CachingDirectoryFactory.close Releasing directory:/usr/home/hudson/hudson-slave/workspace/Lucene-Solr-Tests-trunk-java7/solr/build/solr-core/test/J1/./org.apache.solr.cloud.BasicDistributedZkTest-1360668229211/jetty4
[junit4:junit4]   2> 24779 T1932 C144 P60982 oass.SolrIndexSearcher.<init> Opening Searcher@152a071d main
[junit4:junit4]   2> 24781 T1931 oasc.SolrCore.registerSearcher [collection1] Registered new searcher Searcher@152a071d main{StandardDirectoryReader(segments_2:1:nrt)}
[junit4:junit4]   2> 24782 T1931 oasc.CachingDirectoryFactory.close Releasing directory:/usr/home/hudson/hudson-slave/workspace/Lucene-Solr-Tests-trunk-java7/solr/build/solr-core/test/J1/./org.apache.solr.cloud.BasicDistributedZkTest-1360668229211/jetty4/index
[junit4:junit4]   2> 24782 T1932 C144 P60982 oasu.DirectUpdateHandler2.commit start commit{,optimize=false,openSearcher=false,waitSearcher=false,expungeDeletes=false,softCommit=false}
[junit4:junit4]   2> 24786 T1932 C144 P60982 oasc.SolrDeletionPolicy.onCommit SolrDeletionPolicy.onCommit: commits:num=2
[junit4:junit4]   2> 		commit{dir=RateLimitedDirectoryWrapper(NRTCachingDirectory(org.apache.lucene.store.NIOFSDirectory@/usr/home/hudson/hudson-slave/workspace/Lucene-Solr-Tests-trunk-java7/solr/build/solr-core/test/J1/org.apache.solr.cloud.BasicDistributedZkTest-1360668229211/jetty4/index.20130212232413961 lockFactory=org.apache.lucene.store.NativeFSLockFactory@269d5687; maxCacheMB=48.0 maxMergeSizeMB=4.0)),segFN=segments_2,generation=2,filenames=[segments_2]
[junit4:junit4]   2> 		commit{dir=RateLimitedDirectoryWrapper(NRTCachingDirectory(org.apache.lucene.store.NIOFSDirectory@/usr/home/hudson/hudson-slave/workspace/Lucene-Solr-Tests-trunk-java7/solr/build/solr-core/test/J1/org.apache.solr.cloud.BasicDistributedZkTest-1360668229211/jetty4/index.20130212232413961 lockFactory=org.apache.lucene.store.NativeFSLockFactory@269d5687; maxCacheMB=48.0 maxMergeSizeMB=4.0)),segFN=segments_3,generation=3,filenames=[segments_3]
[junit4:junit4]   2> 24786 T1932 C144 P60982 oasc.SolrDeletionPolicy.updateCommits newest commit = 3[segments_3]
[junit4:junit4]   2> 24787 T1932 C144 P60982 oasc.CachingDirectoryFactory.close Releasing directory:/usr/home/hudson/hudson-slave/workspace/Lucene-Solr-Tests-trunk-java7/solr/build/solr-core/test/J1/./org.apache.solr.cloud.BasicDistributedZkTest-1360668229211/jetty4
[junit4:junit4]   2> 24788 T1932 C144 P60982 oasu.DirectUpdateHandler2.commit end_commit_flush
[junit4:junit4]   2> 24788 T1932 C144 P60982 oasc.CachingDirectoryFactory.close Releasing directory:/usr/home/hudson/hudson-slave/workspace/Lucene-Solr-Tests-trunk-java7/solr/build/solr-core/test/J1/./org.apache.solr.cloud.BasicDistributedZkTest-1360668229211/jetty4/index.20130212232413961
[junit4:junit4]   2> 24788 T1932 C144 P60982 oasc.CachingDirectoryFactory.close Releasing directory:/usr/home/hudson/hudson-slave/workspace/Lucene-Solr-Tests-trunk-java7/solr/build/solr-core/test/J1/./org.apache.solr.cloud.BasicDistributedZkTest-1360668229211/jetty4/index
[junit4:junit4]   2> 24788 T1932 C144 P60982 oasc.RecoveryStrategy.replay No replay needed. core=collection1
[junit4:junit4]   2> 24788 T1932 C144 P60982 oasc.RecoveryStrategy.doRecovery Replication Recovery was successful - registering as Active. core=collection1
[junit4:junit4]   2> 24789 T1932 C144 P60982 oasc.ZkController.publish publishing core=collection1 state=active
[junit4:junit4]   2> 24789 T1932 C144 P60982 oasc.ZkController.publish numShards not found on descriptor - reading it from system property
[junit4:junit4]   2> 24791 T1932 C144 P60982 oasc.RecoveryStrategy.doRecovery Finished recovery process. core=collection1
[junit4:junit4]   2> 25391 T1865 oascc.ZkStateReader.updateClusterState Updating cloud state from ZooKeeper... 
[junit4:junit4]   2> 25392 T1865 oasc.Overseer$ClusterStateUpdater.updateState Update state numShards=2 message={
[junit4:junit4]   2> 	  "operation":"state",
[junit4:junit4]   2> 	  "numShards":"2",
[junit4:junit4]   2> 	  "shard":"shard2",
[junit4:junit4]   2> 	  "roles":null,
[junit4:junit4]   2> 	  "state":"active",
[junit4:junit4]   2> 	  "core":"collection1",
[junit4:junit4]   2> 	  "collection":"collection1",
[junit4:junit4]   2> 	  "node_name":"127.0.0.1:60982_hu_%2Fj",
[junit4:junit4]   2> 	  "base_url":"http://127.0.0.1:60982/hu_/j"}
[junit4:junit4]   2> 25423 T1898 oascc.ZkStateReader$2.process A cluster state change: WatchedEvent state:SyncConnected type:NodeDataChanged path:/clusterstate.json, has occurred - updating... (live nodes size: 5)
[junit4:junit4]   2> 25423 T1864 oascc.ZkStateReader$2.process A cluster state change: WatchedEvent state:SyncConnected type:NodeDataChanged path:/clusterstate.json, has occurred - updating... (live nodes size: 5)
[junit4:junit4]   2> 25423 T1929 oascc.ZkStateReader$2.process A cluster state change: WatchedEvent state:SyncConnected type:NodeDataChanged path:/clusterstate.json, has occurred - updating... (live nodes size: 5)
[junit4:junit4]   2> 25423 T1913 oascc.ZkStateReader$2.process A cluster state change: WatchedEvent state:SyncConnected type:NodeDataChanged path:/clusterstate.json, has occurred - updating... (live nodes size: 5)
[junit4:junit4]   2> 25423 T1870 oascc.ZkStateReader$2.process A cluster state change: WatchedEvent state:SyncConnected type:NodeDataChanged path:/clusterstate.json, has occurred - updating... (live nodes size: 5)
[junit4:junit4]   2> 25423 T1883 oascc.ZkStateReader$2.process A cluster state change: WatchedEvent state:SyncConnected type:NodeDataChanged path:/clusterstate.json, has occurred - updating... (live nodes size: 5)
[junit4:junit4]   2> 25721 T1842 oascc.ZkStateReader.updateClusterState Updating cloud state from ZooKeeper... 
[junit4:junit4]   2> 25723 T1842 oasc.AbstractDistribZkTestBase.waitForRecoveriesToFinish Recoveries finished - collection: collection1
[junit4:junit4]   2> ASYNC  NEW_CORE C147 name=collection1 org.apache.solr.core.SolrCore@47414e2f url=http://127.0.0.1:60968/hu_/j/collection1 node=127.0.0.1:60968_hu_%2Fj C147_STATE=coll:control_collection core:collection1 props:{shard=shard1, roles=null, state=active, core=collection1, collection=control_collection, node_name=127.0.0.1:60968_hu_%2Fj, base_url=http://127.0.0.1:60968/hu_/j, leader=true}
[junit4:junit4]   2> 25742 T1854 C147 P60968 oasc.CachingDirectoryFactory.close Releasing directory:/usr/home/hudson/hudson-

[...truncated too long message...]

.testDistribSearch(BaseDistributedSearchTestCase.java:794)
[junit4:junit4]    > 	at sun.reflect.NativeMethodAccessorImpl.invoke0(Native Method)
[junit4:junit4]    > 	at sun.reflect.NativeMethodAccessorImpl.invoke(NativeMethodAccessorImpl.java:57)
[junit4:junit4]    > 	at sun.reflect.DelegatingMethodAccessorImpl.invoke(DelegatingMethodAccessorImpl.java:43)
[junit4:junit4]    > 	at java.lang.reflect.Method.invoke(Method.java:601)
[junit4:junit4]    > 	at com.carrotsearch.randomizedtesting.RandomizedRunner.invoke(RandomizedRunner.java:1559)
[junit4:junit4]    > 	at com.carrotsearch.randomizedtesting.RandomizedRunner.access$600(RandomizedRunner.java:79)
[junit4:junit4]    > 	at com.carrotsearch.randomizedtesting.RandomizedRunner$6.evaluate(RandomizedRunner.java:737)
[junit4:junit4]    > 	at com.carrotsearch.randomizedtesting.RandomizedRunner$7.evaluate(RandomizedRunner.java:773)
[junit4:junit4]    > 	at com.carrotsearch.randomizedtesting.RandomizedRunner$8.evaluate(RandomizedRunner.java:787)
[junit4:junit4]    > 	at com.carrotsearch.randomizedtesting.rules.SystemPropertiesRestoreRule$1.evaluate(SystemPropertiesRestoreRule.java:53)
[junit4:junit4]    > 	at org.apache.lucene.util.TestRuleSetupTeardownChained$1.evaluate(TestRuleSetupTeardownChained.java:50)
[junit4:junit4]    > 	at org.apache.lucene.util.TestRuleFieldCacheSanity$1.evaluate(TestRuleFieldCacheSanity.java:51)
[junit4:junit4]    > 	at org.apache.lucene.util.AbstractBeforeAfterRule$1.evaluate(AbstractBeforeAfterRule.java:46)
[junit4:junit4]    > 	at com.carrotsearch.randomizedtesting.rules.SystemPropertiesInvariantRule$1.evaluate(SystemPropertiesInvariantRule.java:55)
[junit4:junit4]    > 	at org.apache.lucene.util.TestRuleThreadAndTestName$1.evaluate(TestRuleThreadAndTestName.java:49)
[junit4:junit4]    > 	at org.apache.lucene.util.TestRuleIgnoreAfterMaxFailures$1.evaluate(TestRuleIgnoreAfterMaxFailures.java:70)
[junit4:junit4]    > 	at org.apache.lucene.util.TestRuleMarkFailure$1.evaluate(TestRuleMarkFailure.java:48)
[junit4:junit4]    > 	at com.carrotsearch.randomizedtesting.rules.StatementAdapter.evaluate(StatementAdapter.java:36)
[junit4:junit4]    > 	at com.carrotsearch.randomizedtesting.ThreadLeakControl$StatementRunner.run(ThreadLeakControl.java:358)
[junit4:junit4]    > 	at com.carrotsearch.randomizedtesting.ThreadLeakControl.forkTimeoutingTask(ThreadLeakControl.java:782)
[junit4:junit4]    > 	at com.carrotsearch.randomizedtesting.ThreadLeakControl$3.evaluate(ThreadLeakControl.java:442)
[junit4:junit4]    > 	at com.carrotsearch.randomizedtesting.RandomizedRunner.runSingleTest(RandomizedRunner.java:746)
[junit4:junit4]    > 	at com.carrotsearch.randomizedtesting.RandomizedRunner$3.evaluate(RandomizedRunner.java:648)
[junit4:junit4]    > 	at com.carrotsearch.randomizedtesting.RandomizedRunner$4.evaluate(RandomizedRunner.java:682)
[junit4:junit4]    > 	at com.carrotsearch.randomizedtesting.RandomizedRunner$5.evaluate(RandomizedRunner.java:693)
[junit4:junit4]    > 	at com.carrotsearch.randomizedtesting.rules.StatementAdapter.evaluate(StatementAdapter.java:36)
[junit4:junit4]    > 	at com.carrotsearch.randomizedtesting.rules.SystemPropertiesRestoreRule$1.evaluate(SystemPropertiesRestoreRule.java:53)
[junit4:junit4]    > 	at org.apache.lucene.util.AbstractBeforeAfterRule$1.evaluate(AbstractBeforeAfterRule.java:46)
[junit4:junit4]    > 	at org.apache.lucene.util.TestRuleStoreClassName$1.evaluate(TestRuleStoreClassName.java:42)
[junit4:junit4]    > 	at com.carrotsearch.randomizedtesting.rules.SystemPropertiesInvariantRule$1.evaluate(SystemPropertiesInvariantRule.java:55)
[junit4:junit4]    > 	at com.carrotsearch.randomizedtesting.rules.NoShadowingOrOverridesOnMethodsRule$1.evaluate(NoShadowingOrOverridesOnMethodsRule.java:39)
[junit4:junit4]    > 	at com.carrotsearch.randomizedtesting.rules.NoShadowingOrOverridesOnMethodsRule$1.evaluate(NoShadowingOrOverridesOnMethodsRule.java:39)
[junit4:junit4]    > 	at com.carrotsearch.randomizedtesting.rules.StatementAdapter.evaluate(StatementAdapter.java:36)
[junit4:junit4]    > 	at org.apache.lucene.util.TestRuleAssertionsRequired$1.evaluate(TestRuleAssertionsRequired.java:43)
[junit4:junit4]    > 	at org.apache.lucene.util.TestRuleMarkFailure$1.evaluate(TestRuleMarkFailure.java:48)
[junit4:junit4]    > 	at org.apache.lucene.util.TestRuleIgnoreAfterMaxFailures$1.evaluate(TestRuleIgnoreAfterMaxFailures.java:70)
[junit4:junit4]    > 	at org.apache.lucene.util.TestRuleIgnoreTestSuites$1.evaluate(TestRuleIgnoreTestSuites.java:55)
[junit4:junit4]    > 	at com.carrotsearch.randomizedtesting.rules.StatementAdapter.evaluate(StatementAdapter.java:36)
[junit4:junit4]    > 	at com.carrotsearch.randomizedtesting.ThreadLeakControl$StatementRunner.run(ThreadLeakControl.java:358)
[junit4:junit4]    > 	at java.lang.Thread.run(Thread.java:722)
[junit4:junit4]   2> 3421829 T1842 oas.SolrTestCaseJ4.deleteCore ###deleteCore
[junit4:junit4]   2> NOTE: test params are: codec=Lucene42: {n_f1=MockVariableIntBlock(baseBlockSize=93), foo_b=MockFixedIntBlock(blockSize=781), cat=PostingsFormat(name=Memory doPackFST= true), foo_d=Pulsing41(freqCutoff=2 minBlockSize=28 maxBlockSize=137), foo_f=MockFixedIntBlock(blockSize=781), n_tl1=MockVariableIntBlock(baseBlockSize=93), n_d1=PostingsFormat(name=Memory doPackFST= true), rnd_b=Pulsing41(freqCutoff=2 minBlockSize=28 maxBlockSize=137), intDefault=PostingsFormat(name=Memory doPackFST= true), n_td1=MockVariableIntBlock(baseBlockSize=93), timestamp=PostingsFormat(name=Memory doPackFST= true), id=Pulsing41(freqCutoff=2 minBlockSize=28 maxBlockSize=137), range_facet_sl=MockFixedIntBlock(blockSize=781), range_facet_si=MockVariableIntBlock(baseBlockSize=93), oddField_s=MockFixedIntBlock(blockSize=781), sequence_i=MockFixedIntBlock(blockSize=781), name=Pulsing41(freqCutoff=2 minBlockSize=28 maxBlockSize=137), foo_i=MockVariableIntBlock(baseBlockSize=93), regex_dup_B_s=PostingsFormat(name=Memory doPackFST= true), multiDefault=MockVariableIntBlock(baseBlockSize=93), n_tf1=PostingsFormat(name=Memory doPackFST= true), n_dt1=MockVariableIntBlock(baseBlockSize=93), genre_s=MockFixedIntBlock(blockSize=781), author_t=MockVariableIntBlock(baseBlockSize=93), n_ti1=Pulsing41(freqCutoff=2 minBlockSize=28 maxBlockSize=137), range_facet_l=PostingsFormat(name=Memory doPackFST= true), text=MockFixedIntBlock(blockSize=781), _version_=PostingsFormat(name=Memory doPackFST= true), val_i=Pulsing41(freqCutoff=2 minBlockSize=28 maxBlockSize=137), SubjectTerms_mfacet=PostingsFormat(name=Memory doPackFST= true), series_t=MockVariableIntBlock(baseBlockSize=93), a_t=PostingsFormat(name=Memory doPackFST= true), n_tdt1=PostingsFormat(name=Memory doPackFST= true), regex_dup_A_s=MockFixedIntBlock(blockSize=781), price=MockFixedIntBlock(blockSize=781), other_tl1=PostingsFormat(name=Memory doPackFST= true), n_l1=PostingsFormat(name=Memory doPackFST= true), a_si=MockVariableIntBlock(baseBlockSize=93), inStock=MockFixedIntBlock(blockSize=781)}, docValues:{}, sim=RandomSimilarityProvider(queryNorm=true,coord=crazy): {}, locale=nl_NL, timezone=Asia/Kamchatka
[junit4:junit4]   2> NOTE: FreeBSD 9.0-RELEASE amd64/Oracle Corporation 1.7.0_09 (64-bit)/cpus=16,threads=1,free=346336384,total=440401920
[junit4:junit4]   2> NOTE: All tests run in this JVM: [TestReload, ShowFileRequestHandlerTest, QueryParsingTest, TestCSVLoader, OutputWriterTest, DOMUtilTest, RAMDirectoryFactoryTest, TestRemoteStreaming, DistributedQueryElevationComponentTest, DebugComponentTest, ClusterStateTest, SuggesterTest, TestReplicationHandler, FileUtilsTest, TestSolrDeletionPolicy1, PolyFieldTest, SolrIndexConfigTest, SolrInfoMBeanTest, TestCSVResponseWriter, TestOmitPositions, XsltUpdateRequestHandlerTest, TestRealTimeGet, TestDistributedSearch, TestSurroundQueryParser, TestBinaryField, TestSolrDeletionPolicy2, TestSolr4Spatial, DirectSolrSpellCheckerTest, DocumentAnalysisRequestHandlerTest, RecoveryZkTest, TestSolrCoreProperties, TestCharFilters, PingRequestHandlerTest, TestDistributedGrouping, TestCodecSupport, TimeZoneUtilsTest, BasicDistributedZk2Test, TestMultiCoreConfBootstrap, TestSort, TestQuerySenderListener, ZkSolrClientTest, SuggesterTSTTest, FullSolrCloudDistribCmdsTest, SolrCoreTest, FieldMutatingUpdateProcessorTest, TestFunctionQuery, TestComponentsName, QueryEqualityTest, TestRecovery, TestZkChroot, TestBM25SimilarityFactory, SynonymTokenizerTest, LeaderElectionTest, PathHierarchyTokenizerFactoryTest, AnalysisAfterCoreReloadTest, IndexReaderFactoryTest, TestDocumentBuilder, BadIndexSchemaTest, TestSolrXMLSerializer, IndexSchemaRuntimeFieldTest, RequiredFieldsTest, TestArbitraryIndexDir, BasicDistributedZkTest]
[junit4:junit4] Completed on J1 in 3422.26s, 1 test, 1 error <<< FAILURES!

[...truncated 10 lines...]
BUILD FAILED
/usr/home/hudson/hudson-slave/workspace/Lucene-Solr-Tests-trunk-java7/build.xml:381: The following error occurred while executing this line:
/usr/home/hudson/hudson-slave/workspace/Lucene-Solr-Tests-trunk-java7/build.xml:361: The following error occurred while executing this line:
/usr/home/hudson/hudson-slave/workspace/Lucene-Solr-Tests-trunk-java7/build.xml:39: The following error occurred while executing this line:
/usr/home/hudson/hudson-slave/workspace/Lucene-Solr-Tests-trunk-java7/solr/build.xml:183: The following error occurred while executing this line:
/usr/home/hudson/hudson-slave/workspace/Lucene-Solr-Tests-trunk-java7/solr/common-build.xml:447: The following error occurred while executing this line:
/usr/home/hudson/hudson-slave/workspace/Lucene-Solr-Tests-trunk-java7/lucene/common-build.xml:1202: The following error occurred while executing this line:
/usr/home/hudson/hudson-slave/workspace/Lucene-Solr-Tests-trunk-java7/lucene/common-build.xml:865: There were test failures: 250 suites, 1040 tests, 1 error, 22 ignored (4 assumptions)

Total time: 93 minutes 9 seconds
Build step 'Invoke Ant' marked build as failure
Archiving artifacts
Recording test results
Email was triggered for: Failure
Sending email for trigger: Failure



Mime
View raw message