lucene-dev mailing list archives

Site index · List index
Message view « Date » · « Thread »
Top « Date » · « Thread »
From Apache Jenkins Server <jenk...@builds.apache.org>
Subject [JENKINS-MAVEN] Lucene-Solr-Maven-4.x #244: POMs out of sync
Date Tue, 12 Feb 2013 19:11:20 GMT
Build: https://builds.apache.org/job/Lucene-Solr-Maven-4.x/244/

22 tests failed.
FAILED:  org.apache.lucene.facet.collections.FloatToObjectMapTest.org.apache.lucene.facet.collections.FloatToObjectMapTest

Error Message:
A SPI class of type org.apache.lucene.codecs.DocValuesFormat with name 'Facet42' does not exist. You need to add the corresponding JAR file supporting this SPI to your classpath.The current classpath supports the following names: [Asserting, CheapBastard, Lucene42, Disk, SimpleText]

Stack Trace:
java.lang.IllegalArgumentException: A SPI class of type org.apache.lucene.codecs.DocValuesFormat with name 'Facet42' does not exist. You need to add the corresponding JAR file supporting this SPI to your classpath.The current classpath supports the following names: [Asserting, CheapBastard, Lucene42, Disk, SimpleText]
	at __randomizedtesting.SeedInfo.seed([744E78030761D4C5]:0)
	at org.apache.lucene.util.NamedSPILoader.lookup(NamedSPILoader.java:104)
	at org.apache.lucene.codecs.DocValuesFormat.forName(DocValuesFormat.java:97)
	at org.apache.lucene.facet.codecs.facet42.Facet42Codec.<init>(Facet42Codec.java:48)
	at org.apache.lucene.facet.codecs.facet42.Facet42Codec.<init>(Facet42Codec.java:54)
	at org.apache.lucene.facet.FacetTestCase.beforeClassFacetTestCase(FacetTestCase.java:58)
	at sun.reflect.GeneratedMethodAccessor6.invoke(Unknown Source)
	at sun.reflect.DelegatingMethodAccessorImpl.invoke(DelegatingMethodAccessorImpl.java:43)
	at java.lang.reflect.Method.invoke(Method.java:616)
	at com.carrotsearch.randomizedtesting.RandomizedRunner.invoke(RandomizedRunner.java:1559)
	at com.carrotsearch.randomizedtesting.RandomizedRunner.access$600(RandomizedRunner.java:79)
	at com.carrotsearch.randomizedtesting.RandomizedRunner$4.evaluate(RandomizedRunner.java:677)
	at com.carrotsearch.randomizedtesting.RandomizedRunner$5.evaluate(RandomizedRunner.java:693)
	at org.apache.lucene.util.AbstractBeforeAfterRule$1.evaluate(AbstractBeforeAfterRule.java:46)
	at org.apache.lucene.util.TestRuleStoreClassName$1.evaluate(TestRuleStoreClassName.java:42)
	at com.carrotsearch.randomizedtesting.rules.SystemPropertiesInvariantRule$1.evaluate(SystemPropertiesInvariantRule.java:55)
	at com.carrotsearch.randomizedtesting.rules.NoShadowingOrOverridesOnMethodsRule$1.evaluate(NoShadowingOrOverridesOnMethodsRule.java:39)
	at com.carrotsearch.randomizedtesting.rules.NoShadowingOrOverridesOnMethodsRule$1.evaluate(NoShadowingOrOverridesOnMethodsRule.java:39)
	at com.carrotsearch.randomizedtesting.rules.StatementAdapter.evaluate(StatementAdapter.java:36)
	at org.apache.lucene.util.TestRuleAssertionsRequired$1.evaluate(TestRuleAssertionsRequired.java:43)
	at org.apache.lucene.util.TestRuleMarkFailure$1.evaluate(TestRuleMarkFailure.java:48)
	at org.apache.lucene.util.TestRuleIgnoreAfterMaxFailures$1.evaluate(TestRuleIgnoreAfterMaxFailures.java:70)
	at org.apache.lucene.util.TestRuleIgnoreTestSuites$1.evaluate(TestRuleIgnoreTestSuites.java:55)
	at com.carrotsearch.randomizedtesting.rules.StatementAdapter.evaluate(StatementAdapter.java:36)
	at com.carrotsearch.randomizedtesting.ThreadLeakControl$StatementRunner.run(ThreadLeakControl.java:358)
	at java.lang.Thread.run(Thread.java:679)


FAILED:  org.apache.lucene.facet.collections.IntToObjectMapTest.org.apache.lucene.facet.collections.IntToObjectMapTest

Error Message:
A SPI class of type org.apache.lucene.codecs.DocValuesFormat with name 'Facet42' does not exist. You need to add the corresponding JAR file supporting this SPI to your classpath.The current classpath supports the following names: [Asserting, CheapBastard, Lucene42, Disk, SimpleText]

Stack Trace:
java.lang.IllegalArgumentException: A SPI class of type org.apache.lucene.codecs.DocValuesFormat with name 'Facet42' does not exist. You need to add the corresponding JAR file supporting this SPI to your classpath.The current classpath supports the following names: [Asserting, CheapBastard, Lucene42, Disk, SimpleText]
	at __randomizedtesting.SeedInfo.seed([2D21BAB48D1C9D11]:0)
	at org.apache.lucene.util.NamedSPILoader.lookup(NamedSPILoader.java:104)
	at org.apache.lucene.codecs.DocValuesFormat.forName(DocValuesFormat.java:97)
	at org.apache.lucene.facet.codecs.facet42.Facet42Codec.<init>(Facet42Codec.java:48)
	at org.apache.lucene.facet.codecs.facet42.Facet42Codec.<init>(Facet42Codec.java:54)
	at org.apache.lucene.facet.FacetTestCase.beforeClassFacetTestCase(FacetTestCase.java:58)
	at sun.reflect.NativeMethodAccessorImpl.invoke0(Native Method)
	at sun.reflect.NativeMethodAccessorImpl.invoke(NativeMethodAccessorImpl.java:57)
	at sun.reflect.DelegatingMethodAccessorImpl.invoke(DelegatingMethodAccessorImpl.java:43)
	at java.lang.reflect.Method.invoke(Method.java:616)
	at com.carrotsearch.randomizedtesting.RandomizedRunner.invoke(RandomizedRunner.java:1559)
	at com.carrotsearch.randomizedtesting.RandomizedRunner.access$600(RandomizedRunner.java:79)
	at com.carrotsearch.randomizedtesting.RandomizedRunner$4.evaluate(RandomizedRunner.java:677)
	at com.carrotsearch.randomizedtesting.RandomizedRunner$5.evaluate(RandomizedRunner.java:693)
	at org.apache.lucene.util.AbstractBeforeAfterRule$1.evaluate(AbstractBeforeAfterRule.java:46)
	at org.apache.lucene.util.TestRuleStoreClassName$1.evaluate(TestRuleStoreClassName.java:42)
	at com.carrotsearch.randomizedtesting.rules.SystemPropertiesInvariantRule$1.evaluate(SystemPropertiesInvariantRule.java:55)
	at com.carrotsearch.randomizedtesting.rules.NoShadowingOrOverridesOnMethodsRule$1.evaluate(NoShadowingOrOverridesOnMethodsRule.java:39)
	at com.carrotsearch.randomizedtesting.rules.NoShadowingOrOverridesOnMethodsRule$1.evaluate(NoShadowingOrOverridesOnMethodsRule.java:39)
	at com.carrotsearch.randomizedtesting.rules.StatementAdapter.evaluate(StatementAdapter.java:36)
	at org.apache.lucene.util.TestRuleAssertionsRequired$1.evaluate(TestRuleAssertionsRequired.java:43)
	at org.apache.lucene.util.TestRuleMarkFailure$1.evaluate(TestRuleMarkFailure.java:48)
	at org.apache.lucene.util.TestRuleIgnoreAfterMaxFailures$1.evaluate(TestRuleIgnoreAfterMaxFailures.java:70)
	at org.apache.lucene.util.TestRuleIgnoreTestSuites$1.evaluate(TestRuleIgnoreTestSuites.java:55)
	at com.carrotsearch.randomizedtesting.rules.StatementAdapter.evaluate(StatementAdapter.java:36)
	at com.carrotsearch.randomizedtesting.ThreadLeakControl$StatementRunner.run(ThreadLeakControl.java:358)
	at java.lang.Thread.run(Thread.java:679)


FAILED:  org.apache.lucene.facet.collections.ObjectToFloatMapTest.org.apache.lucene.facet.collections.ObjectToFloatMapTest

Error Message:
A SPI class of type org.apache.lucene.codecs.DocValuesFormat with name 'Facet42' does not exist. You need to add the corresponding JAR file supporting this SPI to your classpath.The current classpath supports the following names: [Asserting, CheapBastard, Lucene42, Disk, SimpleText]

Stack Trace:
java.lang.IllegalArgumentException: A SPI class of type org.apache.lucene.codecs.DocValuesFormat with name 'Facet42' does not exist. You need to add the corresponding JAR file supporting this SPI to your classpath.The current classpath supports the following names: [Asserting, CheapBastard, Lucene42, Disk, SimpleText]
	at __randomizedtesting.SeedInfo.seed([CBD3AED0604CDAB9]:0)
	at org.apache.lucene.util.NamedSPILoader.lookup(NamedSPILoader.java:104)
	at org.apache.lucene.codecs.DocValuesFormat.forName(DocValuesFormat.java:97)
	at org.apache.lucene.facet.codecs.facet42.Facet42Codec.<init>(Facet42Codec.java:48)
	at org.apache.lucene.facet.codecs.facet42.Facet42Codec.<init>(Facet42Codec.java:54)
	at org.apache.lucene.facet.FacetTestCase.beforeClassFacetTestCase(FacetTestCase.java:58)
	at sun.reflect.GeneratedMethodAccessor6.invoke(Unknown Source)
	at sun.reflect.DelegatingMethodAccessorImpl.invoke(DelegatingMethodAccessorImpl.java:43)
	at java.lang.reflect.Method.invoke(Method.java:616)
	at com.carrotsearch.randomizedtesting.RandomizedRunner.invoke(RandomizedRunner.java:1559)
	at com.carrotsearch.randomizedtesting.RandomizedRunner.access$600(RandomizedRunner.java:79)
	at com.carrotsearch.randomizedtesting.RandomizedRunner$4.evaluate(RandomizedRunner.java:677)
	at com.carrotsearch.randomizedtesting.RandomizedRunner$5.evaluate(RandomizedRunner.java:693)
	at org.apache.lucene.util.AbstractBeforeAfterRule$1.evaluate(AbstractBeforeAfterRule.java:46)
	at org.apache.lucene.util.TestRuleStoreClassName$1.evaluate(TestRuleStoreClassName.java:42)
	at com.carrotsearch.randomizedtesting.rules.SystemPropertiesInvariantRule$1.evaluate(SystemPropertiesInvariantRule.java:55)
	at com.carrotsearch.randomizedtesting.rules.NoShadowingOrOverridesOnMethodsRule$1.evaluate(NoShadowingOrOverridesOnMethodsRule.java:39)
	at com.carrotsearch.randomizedtesting.rules.NoShadowingOrOverridesOnMethodsRule$1.evaluate(NoShadowingOrOverridesOnMethodsRule.java:39)
	at com.carrotsearch.randomizedtesting.rules.StatementAdapter.evaluate(StatementAdapter.java:36)
	at org.apache.lucene.util.TestRuleAssertionsRequired$1.evaluate(TestRuleAssertionsRequired.java:43)
	at org.apache.lucene.util.TestRuleMarkFailure$1.evaluate(TestRuleMarkFailure.java:48)
	at org.apache.lucene.util.TestRuleIgnoreAfterMaxFailures$1.evaluate(TestRuleIgnoreAfterMaxFailures.java:70)
	at org.apache.lucene.util.TestRuleIgnoreTestSuites$1.evaluate(TestRuleIgnoreTestSuites.java:55)
	at com.carrotsearch.randomizedtesting.rules.StatementAdapter.evaluate(StatementAdapter.java:36)
	at com.carrotsearch.randomizedtesting.ThreadLeakControl$StatementRunner.run(ThreadLeakControl.java:358)
	at java.lang.Thread.run(Thread.java:679)


FAILED:  org.apache.lucene.facet.complements.TestFacetsAccumulatorWithComplement.org.apache.lucene.facet.complements.TestFacetsAccumulatorWithComplement

Error Message:
A SPI class of type org.apache.lucene.codecs.DocValuesFormat with name 'Facet42' does not exist. You need to add the corresponding JAR file supporting this SPI to your classpath.The current classpath supports the following names: [Asserting, CheapBastard, Lucene42, Disk, SimpleText]

Stack Trace:
java.lang.IllegalArgumentException: A SPI class of type org.apache.lucene.codecs.DocValuesFormat with name 'Facet42' does not exist. You need to add the corresponding JAR file supporting this SPI to your classpath.The current classpath supports the following names: [Asserting, CheapBastard, Lucene42, Disk, SimpleText]
	at __randomizedtesting.SeedInfo.seed([56FD69FD2D611E4C]:0)
	at org.apache.lucene.util.NamedSPILoader.lookup(NamedSPILoader.java:104)
	at org.apache.lucene.codecs.DocValuesFormat.forName(DocValuesFormat.java:97)
	at org.apache.lucene.facet.codecs.facet42.Facet42Codec.<init>(Facet42Codec.java:48)
	at org.apache.lucene.facet.codecs.facet42.Facet42Codec.<init>(Facet42Codec.java:54)
	at org.apache.lucene.facet.FacetTestCase.beforeClassFacetTestCase(FacetTestCase.java:58)
	at sun.reflect.GeneratedMethodAccessor6.invoke(Unknown Source)
	at sun.reflect.DelegatingMethodAccessorImpl.invoke(DelegatingMethodAccessorImpl.java:43)
	at java.lang.reflect.Method.invoke(Method.java:616)
	at com.carrotsearch.randomizedtesting.RandomizedRunner.invoke(RandomizedRunner.java:1559)
	at com.carrotsearch.randomizedtesting.RandomizedRunner.access$600(RandomizedRunner.java:79)
	at com.carrotsearch.randomizedtesting.RandomizedRunner$4.evaluate(RandomizedRunner.java:677)
	at com.carrotsearch.randomizedtesting.RandomizedRunner$5.evaluate(RandomizedRunner.java:693)
	at org.apache.lucene.util.AbstractBeforeAfterRule$1.evaluate(AbstractBeforeAfterRule.java:46)
	at org.apache.lucene.util.TestRuleStoreClassName$1.evaluate(TestRuleStoreClassName.java:42)
	at com.carrotsearch.randomizedtesting.rules.SystemPropertiesInvariantRule$1.evaluate(SystemPropertiesInvariantRule.java:55)
	at com.carrotsearch.randomizedtesting.rules.NoShadowingOrOverridesOnMethodsRule$1.evaluate(NoShadowingOrOverridesOnMethodsRule.java:39)
	at com.carrotsearch.randomizedtesting.rules.NoShadowingOrOverridesOnMethodsRule$1.evaluate(NoShadowingOrOverridesOnMethodsRule.java:39)
	at com.carrotsearch.randomizedtesting.rules.StatementAdapter.evaluate(StatementAdapter.java:36)
	at org.apache.lucene.util.TestRuleAssertionsRequired$1.evaluate(TestRuleAssertionsRequired.java:43)
	at org.apache.lucene.util.TestRuleMarkFailure$1.evaluate(TestRuleMarkFailure.java:48)
	at org.apache.lucene.util.TestRuleIgnoreAfterMaxFailures$1.evaluate(TestRuleIgnoreAfterMaxFailures.java:70)
	at org.apache.lucene.util.TestRuleIgnoreTestSuites$1.evaluate(TestRuleIgnoreTestSuites.java:55)
	at com.carrotsearch.randomizedtesting.rules.StatementAdapter.evaluate(StatementAdapter.java:36)
	at com.carrotsearch.randomizedtesting.ThreadLeakControl$StatementRunner.run(ThreadLeakControl.java:358)
	at java.lang.Thread.run(Thread.java:679)


FAILED:  org.apache.lucene.facet.complements.TestFacetsAccumulatorWithComplement.org.apache.lucene.facet.complements.TestFacetsAccumulatorWithComplement

Error Message:
this Directory is closed

Stack Trace:
org.apache.lucene.store.AlreadyClosedException: this Directory is closed
	at __randomizedtesting.SeedInfo.seed([56FD69FD2D611E4C]:0)
	at org.apache.lucene.store.Directory.ensureOpen(Directory.java:256)
	at org.apache.lucene.store.RAMDirectory.listAll(RAMDirectory.java:107)
	at org.apache.lucene.store.MockDirectoryWrapper.listAll(MockDirectoryWrapper.java:800)
	at org.apache.lucene.store.BaseDirectoryWrapper.indexPossiblyExists(BaseDirectoryWrapper.java:63)
	at org.apache.lucene.store.MockDirectoryWrapper.close(MockDirectoryWrapper.java:592)
	at org.apache.lucene.util.IOUtils.close(IOUtils.java:146)
	at org.apache.lucene.facet.FacetTestBase.afterClassFacetTestBase(FacetTestBase.java:107)
	at sun.reflect.NativeMethodAccessorImpl.invoke0(Native Method)
	at sun.reflect.NativeMethodAccessorImpl.invoke(NativeMethodAccessorImpl.java:57)
	at sun.reflect.DelegatingMethodAccessorImpl.invoke(DelegatingMethodAccessorImpl.java:43)
	at java.lang.reflect.Method.invoke(Method.java:616)
	at com.carrotsearch.randomizedtesting.RandomizedRunner.invoke(RandomizedRunner.java:1559)
	at com.carrotsearch.randomizedtesting.RandomizedRunner.access$600(RandomizedRunner.java:79)
	at com.carrotsearch.randomizedtesting.RandomizedRunner$5.evaluate(RandomizedRunner.java:700)
	at org.apache.lucene.util.AbstractBeforeAfterRule$1.evaluate(AbstractBeforeAfterRule.java:46)
	at org.apache.lucene.util.TestRuleStoreClassName$1.evaluate(TestRuleStoreClassName.java:42)
	at com.carrotsearch.randomizedtesting.rules.SystemPropertiesInvariantRule$1.evaluate(SystemPropertiesInvariantRule.java:55)
	at com.carrotsearch.randomizedtesting.rules.NoShadowingOrOverridesOnMethodsRule$1.evaluate(NoShadowingOrOverridesOnMethodsRule.java:39)
	at com.carrotsearch.randomizedtesting.rules.NoShadowingOrOverridesOnMethodsRule$1.evaluate(NoShadowingOrOverridesOnMethodsRule.java:39)
	at com.carrotsearch.randomizedtesting.rules.StatementAdapter.evaluate(StatementAdapter.java:36)
	at org.apache.lucene.util.TestRuleAssertionsRequired$1.evaluate(TestRuleAssertionsRequired.java:43)
	at org.apache.lucene.util.TestRuleMarkFailure$1.evaluate(TestRuleMarkFailure.java:48)
	at org.apache.lucene.util.TestRuleIgnoreAfterMaxFailures$1.evaluate(TestRuleIgnoreAfterMaxFailures.java:70)
	at org.apache.lucene.util.TestRuleIgnoreTestSuites$1.evaluate(TestRuleIgnoreTestSuites.java:55)
	at com.carrotsearch.randomizedtesting.rules.StatementAdapter.evaluate(StatementAdapter.java:36)
	at com.carrotsearch.randomizedtesting.ThreadLeakControl$StatementRunner.run(ThreadLeakControl.java:358)
	at java.lang.Thread.run(Thread.java:679)


FAILED:  org.apache.lucene.facet.params.PerDimensionIndexingParamsTest.org.apache.lucene.facet.params.PerDimensionIndexingParamsTest

Error Message:
A SPI class of type org.apache.lucene.codecs.DocValuesFormat with name 'Facet42' does not exist. You need to add the corresponding JAR file supporting this SPI to your classpath.The current classpath supports the following names: [Asserting, CheapBastard, Lucene42, Disk, SimpleText]

Stack Trace:
java.lang.IllegalArgumentException: A SPI class of type org.apache.lucene.codecs.DocValuesFormat with name 'Facet42' does not exist. You need to add the corresponding JAR file supporting this SPI to your classpath.The current classpath supports the following names: [Asserting, CheapBastard, Lucene42, Disk, SimpleText]
	at __randomizedtesting.SeedInfo.seed([A5B928BBAD7416EB]:0)
	at org.apache.lucene.util.NamedSPILoader.lookup(NamedSPILoader.java:104)
	at org.apache.lucene.codecs.DocValuesFormat.forName(DocValuesFormat.java:97)
	at org.apache.lucene.facet.codecs.facet42.Facet42Codec.<init>(Facet42Codec.java:48)
	at org.apache.lucene.facet.codecs.facet42.Facet42Codec.<init>(Facet42Codec.java:54)
	at org.apache.lucene.facet.FacetTestCase.beforeClassFacetTestCase(FacetTestCase.java:58)
	at sun.reflect.NativeMethodAccessorImpl.invoke0(Native Method)
	at sun.reflect.NativeMethodAccessorImpl.invoke(NativeMethodAccessorImpl.java:57)
	at sun.reflect.DelegatingMethodAccessorImpl.invoke(DelegatingMethodAccessorImpl.java:43)
	at java.lang.reflect.Method.invoke(Method.java:616)
	at com.carrotsearch.randomizedtesting.RandomizedRunner.invoke(RandomizedRunner.java:1559)
	at com.carrotsearch.randomizedtesting.RandomizedRunner.access$600(RandomizedRunner.java:79)
	at com.carrotsearch.randomizedtesting.RandomizedRunner$4.evaluate(RandomizedRunner.java:677)
	at com.carrotsearch.randomizedtesting.RandomizedRunner$5.evaluate(RandomizedRunner.java:693)
	at org.apache.lucene.util.AbstractBeforeAfterRule$1.evaluate(AbstractBeforeAfterRule.java:46)
	at org.apache.lucene.util.TestRuleStoreClassName$1.evaluate(TestRuleStoreClassName.java:42)
	at com.carrotsearch.randomizedtesting.rules.SystemPropertiesInvariantRule$1.evaluate(SystemPropertiesInvariantRule.java:55)
	at com.carrotsearch.randomizedtesting.rules.NoShadowingOrOverridesOnMethodsRule$1.evaluate(NoShadowingOrOverridesOnMethodsRule.java:39)
	at com.carrotsearch.randomizedtesting.rules.NoShadowingOrOverridesOnMethodsRule$1.evaluate(NoShadowingOrOverridesOnMethodsRule.java:39)
	at com.carrotsearch.randomizedtesting.rules.StatementAdapter.evaluate(StatementAdapter.java:36)
	at org.apache.lucene.util.TestRuleAssertionsRequired$1.evaluate(TestRuleAssertionsRequired.java:43)
	at org.apache.lucene.util.TestRuleMarkFailure$1.evaluate(TestRuleMarkFailure.java:48)
	at org.apache.lucene.util.TestRuleIgnoreAfterMaxFailures$1.evaluate(TestRuleIgnoreAfterMaxFailures.java:70)
	at org.apache.lucene.util.TestRuleIgnoreTestSuites$1.evaluate(TestRuleIgnoreTestSuites.java:55)
	at com.carrotsearch.randomizedtesting.rules.StatementAdapter.evaluate(StatementAdapter.java:36)
	at com.carrotsearch.randomizedtesting.ThreadLeakControl$StatementRunner.run(ThreadLeakControl.java:358)
	at java.lang.Thread.run(Thread.java:679)


FAILED:  org.apache.lucene.facet.sampling.OversampleWithDepthTest.org.apache.lucene.facet.sampling.OversampleWithDepthTest

Error Message:
A SPI class of type org.apache.lucene.codecs.DocValuesFormat with name 'Facet42' does not exist. You need to add the corresponding JAR file supporting this SPI to your classpath.The current classpath supports the following names: [Asserting, CheapBastard, Lucene42, Disk, SimpleText]

Stack Trace:
java.lang.IllegalArgumentException: A SPI class of type org.apache.lucene.codecs.DocValuesFormat with name 'Facet42' does not exist. You need to add the corresponding JAR file supporting this SPI to your classpath.The current classpath supports the following names: [Asserting, CheapBastard, Lucene42, Disk, SimpleText]
	at __randomizedtesting.SeedInfo.seed([993208DDD107FC88]:0)
	at org.apache.lucene.util.NamedSPILoader.lookup(NamedSPILoader.java:104)
	at org.apache.lucene.codecs.DocValuesFormat.forName(DocValuesFormat.java:97)
	at org.apache.lucene.facet.codecs.facet42.Facet42Codec.<init>(Facet42Codec.java:48)
	at org.apache.lucene.facet.codecs.facet42.Facet42Codec.<init>(Facet42Codec.java:54)
	at org.apache.lucene.facet.FacetTestCase.beforeClassFacetTestCase(FacetTestCase.java:58)
	at sun.reflect.NativeMethodAccessorImpl.invoke0(Native Method)
	at sun.reflect.NativeMethodAccessorImpl.invoke(NativeMethodAccessorImpl.java:57)
	at sun.reflect.DelegatingMethodAccessorImpl.invoke(DelegatingMethodAccessorImpl.java:43)
	at java.lang.reflect.Method.invoke(Method.java:616)
	at com.carrotsearch.randomizedtesting.RandomizedRunner.invoke(RandomizedRunner.java:1559)
	at com.carrotsearch.randomizedtesting.RandomizedRunner.access$600(RandomizedRunner.java:79)
	at com.carrotsearch.randomizedtesting.RandomizedRunner$4.evaluate(RandomizedRunner.java:677)
	at com.carrotsearch.randomizedtesting.RandomizedRunner$5.evaluate(RandomizedRunner.java:693)
	at org.apache.lucene.util.AbstractBeforeAfterRule$1.evaluate(AbstractBeforeAfterRule.java:46)
	at org.apache.lucene.util.TestRuleStoreClassName$1.evaluate(TestRuleStoreClassName.java:42)
	at com.carrotsearch.randomizedtesting.rules.SystemPropertiesInvariantRule$1.evaluate(SystemPropertiesInvariantRule.java:55)
	at com.carrotsearch.randomizedtesting.rules.NoShadowingOrOverridesOnMethodsRule$1.evaluate(NoShadowingOrOverridesOnMethodsRule.java:39)
	at com.carrotsearch.randomizedtesting.rules.NoShadowingOrOverridesOnMethodsRule$1.evaluate(NoShadowingOrOverridesOnMethodsRule.java:39)
	at com.carrotsearch.randomizedtesting.rules.StatementAdapter.evaluate(StatementAdapter.java:36)
	at org.apache.lucene.util.TestRuleAssertionsRequired$1.evaluate(TestRuleAssertionsRequired.java:43)
	at org.apache.lucene.util.TestRuleMarkFailure$1.evaluate(TestRuleMarkFailure.java:48)
	at org.apache.lucene.util.TestRuleIgnoreAfterMaxFailures$1.evaluate(TestRuleIgnoreAfterMaxFailures.java:70)
	at org.apache.lucene.util.TestRuleIgnoreTestSuites$1.evaluate(TestRuleIgnoreTestSuites.java:55)
	at com.carrotsearch.randomizedtesting.rules.StatementAdapter.evaluate(StatementAdapter.java:36)
	at com.carrotsearch.randomizedtesting.ThreadLeakControl$StatementRunner.run(ThreadLeakControl.java:358)
	at java.lang.Thread.run(Thread.java:679)


FAILED:  org.apache.lucene.facet.search.AdaptiveAccumulatorTest.org.apache.lucene.facet.search.AdaptiveAccumulatorTest

Error Message:
A SPI class of type org.apache.lucene.codecs.DocValuesFormat with name 'Facet42' does not exist. You need to add the corresponding JAR file supporting this SPI to your classpath.The current classpath supports the following names: [Asserting, CheapBastard, Lucene42, Disk, SimpleText]

Stack Trace:
java.lang.IllegalArgumentException: A SPI class of type org.apache.lucene.codecs.DocValuesFormat with name 'Facet42' does not exist. You need to add the corresponding JAR file supporting this SPI to your classpath.The current classpath supports the following names: [Asserting, CheapBastard, Lucene42, Disk, SimpleText]
	at __randomizedtesting.SeedInfo.seed([BF3A90B3DEB49AA1]:0)
	at org.apache.lucene.util.NamedSPILoader.lookup(NamedSPILoader.java:104)
	at org.apache.lucene.codecs.DocValuesFormat.forName(DocValuesFormat.java:97)
	at org.apache.lucene.facet.codecs.facet42.Facet42Codec.<init>(Facet42Codec.java:48)
	at org.apache.lucene.facet.codecs.facet42.Facet42Codec.<init>(Facet42Codec.java:54)
	at org.apache.lucene.facet.FacetTestCase.beforeClassFacetTestCase(FacetTestCase.java:58)
	at sun.reflect.NativeMethodAccessorImpl.invoke0(Native Method)
	at sun.reflect.NativeMethodAccessorImpl.invoke(NativeMethodAccessorImpl.java:57)
	at sun.reflect.DelegatingMethodAccessorImpl.invoke(DelegatingMethodAccessorImpl.java:43)
	at java.lang.reflect.Method.invoke(Method.java:616)
	at com.carrotsearch.randomizedtesting.RandomizedRunner.invoke(RandomizedRunner.java:1559)
	at com.carrotsearch.randomizedtesting.RandomizedRunner.access$600(RandomizedRunner.java:79)
	at com.carrotsearch.randomizedtesting.RandomizedRunner$4.evaluate(RandomizedRunner.java:677)
	at com.carrotsearch.randomizedtesting.RandomizedRunner$5.evaluate(RandomizedRunner.java:693)
	at org.apache.lucene.util.AbstractBeforeAfterRule$1.evaluate(AbstractBeforeAfterRule.java:46)
	at org.apache.lucene.util.TestRuleStoreClassName$1.evaluate(TestRuleStoreClassName.java:42)
	at com.carrotsearch.randomizedtesting.rules.SystemPropertiesInvariantRule$1.evaluate(SystemPropertiesInvariantRule.java:55)
	at com.carrotsearch.randomizedtesting.rules.NoShadowingOrOverridesOnMethodsRule$1.evaluate(NoShadowingOrOverridesOnMethodsRule.java:39)
	at com.carrotsearch.randomizedtesting.rules.NoShadowingOrOverridesOnMethodsRule$1.evaluate(NoShadowingOrOverridesOnMethodsRule.java:39)
	at com.carrotsearch.randomizedtesting.rules.StatementAdapter.evaluate(StatementAdapter.java:36)
	at org.apache.lucene.util.TestRuleAssertionsRequired$1.evaluate(TestRuleAssertionsRequired.java:43)
	at org.apache.lucene.util.TestRuleMarkFailure$1.evaluate(TestRuleMarkFailure.java:48)
	at org.apache.lucene.util.TestRuleIgnoreAfterMaxFailures$1.evaluate(TestRuleIgnoreAfterMaxFailures.java:70)
	at org.apache.lucene.util.TestRuleIgnoreTestSuites$1.evaluate(TestRuleIgnoreTestSuites.java:55)
	at com.carrotsearch.randomizedtesting.rules.StatementAdapter.evaluate(StatementAdapter.java:36)
	at com.carrotsearch.randomizedtesting.ThreadLeakControl$StatementRunner.run(ThreadLeakControl.java:358)
	at java.lang.Thread.run(Thread.java:679)


FAILED:  org.apache.lucene.facet.search.AdaptiveAccumulatorTest.org.apache.lucene.facet.search.AdaptiveAccumulatorTest

Error Message:
null

Stack Trace:
java.lang.NullPointerException
	at __randomizedtesting.SeedInfo.seed([BF3A90B3DEB49AA1]:0)
	at org.apache.lucene.facet.FacetTestBase.afterClassFacetTestBase(FacetTestBase.java:104)
	at sun.reflect.NativeMethodAccessorImpl.invoke0(Native Method)
	at sun.reflect.NativeMethodAccessorImpl.invoke(NativeMethodAccessorImpl.java:57)
	at sun.reflect.DelegatingMethodAccessorImpl.invoke(DelegatingMethodAccessorImpl.java:43)
	at java.lang.reflect.Method.invoke(Method.java:616)
	at com.carrotsearch.randomizedtesting.RandomizedRunner.invoke(RandomizedRunner.java:1559)
	at com.carrotsearch.randomizedtesting.RandomizedRunner.access$600(RandomizedRunner.java:79)
	at com.carrotsearch.randomizedtesting.RandomizedRunner$5.evaluate(RandomizedRunner.java:700)
	at org.apache.lucene.util.AbstractBeforeAfterRule$1.evaluate(AbstractBeforeAfterRule.java:46)
	at org.apache.lucene.util.TestRuleStoreClassName$1.evaluate(TestRuleStoreClassName.java:42)
	at com.carrotsearch.randomizedtesting.rules.SystemPropertiesInvariantRule$1.evaluate(SystemPropertiesInvariantRule.java:55)
	at com.carrotsearch.randomizedtesting.rules.NoShadowingOrOverridesOnMethodsRule$1.evaluate(NoShadowingOrOverridesOnMethodsRule.java:39)
	at com.carrotsearch.randomizedtesting.rules.NoShadowingOrOverridesOnMethodsRule$1.evaluate(NoShadowingOrOverridesOnMethodsRule.java:39)
	at com.carrotsearch.randomizedtesting.rules.StatementAdapter.evaluate(StatementAdapter.java:36)
	at org.apache.lucene.util.TestRuleAssertionsRequired$1.evaluate(TestRuleAssertionsRequired.java:43)
	at org.apache.lucene.util.TestRuleMarkFailure$1.evaluate(TestRuleMarkFailure.java:48)
	at org.apache.lucene.util.TestRuleIgnoreAfterMaxFailures$1.evaluate(TestRuleIgnoreAfterMaxFailures.java:70)
	at org.apache.lucene.util.TestRuleIgnoreTestSuites$1.evaluate(TestRuleIgnoreTestSuites.java:55)
	at com.carrotsearch.randomizedtesting.rules.StatementAdapter.evaluate(StatementAdapter.java:36)
	at com.carrotsearch.randomizedtesting.ThreadLeakControl$StatementRunner.run(ThreadLeakControl.java:358)
	at java.lang.Thread.run(Thread.java:679)


FAILED:  org.apache.lucene.facet.search.CountingFacetsAggregatorTest.org.apache.lucene.facet.search.CountingFacetsAggregatorTest

Error Message:
A SPI class of type org.apache.lucene.codecs.DocValuesFormat with name 'Facet42' does not exist. You need to add the corresponding JAR file supporting this SPI to your classpath.The current classpath supports the following names: [Asserting, CheapBastard, Lucene42, Disk, SimpleText]

Stack Trace:
java.lang.IllegalArgumentException: A SPI class of type org.apache.lucene.codecs.DocValuesFormat with name 'Facet42' does not exist. You need to add the corresponding JAR file supporting this SPI to your classpath.The current classpath supports the following names: [Asserting, CheapBastard, Lucene42, Disk, SimpleText]
	at __randomizedtesting.SeedInfo.seed([7CF66D85D79B9C47]:0)
	at org.apache.lucene.util.NamedSPILoader.lookup(NamedSPILoader.java:104)
	at org.apache.lucene.codecs.DocValuesFormat.forName(DocValuesFormat.java:97)
	at org.apache.lucene.facet.codecs.facet42.Facet42Codec.<init>(Facet42Codec.java:48)
	at org.apache.lucene.facet.codecs.facet42.Facet42Codec.<init>(Facet42Codec.java:54)
	at org.apache.lucene.facet.FacetTestCase.beforeClassFacetTestCase(FacetTestCase.java:58)
	at sun.reflect.NativeMethodAccessorImpl.invoke0(Native Method)
	at sun.reflect.NativeMethodAccessorImpl.invoke(NativeMethodAccessorImpl.java:57)
	at sun.reflect.DelegatingMethodAccessorImpl.invoke(DelegatingMethodAccessorImpl.java:43)
	at java.lang.reflect.Method.invoke(Method.java:616)
	at com.carrotsearch.randomizedtesting.RandomizedRunner.invoke(RandomizedRunner.java:1559)
	at com.carrotsearch.randomizedtesting.RandomizedRunner.access$600(RandomizedRunner.java:79)
	at com.carrotsearch.randomizedtesting.RandomizedRunner$4.evaluate(RandomizedRunner.java:677)
	at com.carrotsearch.randomizedtesting.RandomizedRunner$5.evaluate(RandomizedRunner.java:693)
	at org.apache.lucene.util.AbstractBeforeAfterRule$1.evaluate(AbstractBeforeAfterRule.java:46)
	at org.apache.lucene.util.TestRuleStoreClassName$1.evaluate(TestRuleStoreClassName.java:42)
	at com.carrotsearch.randomizedtesting.rules.SystemPropertiesInvariantRule$1.evaluate(SystemPropertiesInvariantRule.java:55)
	at com.carrotsearch.randomizedtesting.rules.NoShadowingOrOverridesOnMethodsRule$1.evaluate(NoShadowingOrOverridesOnMethodsRule.java:39)
	at com.carrotsearch.randomizedtesting.rules.NoShadowingOrOverridesOnMethodsRule$1.evaluate(NoShadowingOrOverridesOnMethodsRule.java:39)
	at com.carrotsearch.randomizedtesting.rules.StatementAdapter.evaluate(StatementAdapter.java:36)
	at org.apache.lucene.util.TestRuleAssertionsRequired$1.evaluate(TestRuleAssertionsRequired.java:43)
	at org.apache.lucene.util.TestRuleMarkFailure$1.evaluate(TestRuleMarkFailure.java:48)
	at org.apache.lucene.util.TestRuleIgnoreAfterMaxFailures$1.evaluate(TestRuleIgnoreAfterMaxFailures.java:70)
	at org.apache.lucene.util.TestRuleIgnoreTestSuites$1.evaluate(TestRuleIgnoreTestSuites.java:55)
	at com.carrotsearch.randomizedtesting.rules.StatementAdapter.evaluate(StatementAdapter.java:36)
	at com.carrotsearch.randomizedtesting.ThreadLeakControl$StatementRunner.run(ThreadLeakControl.java:358)
	at java.lang.Thread.run(Thread.java:679)


FAILED:  org.apache.lucene.facet.search.MultiCategoryListIteratorTest.org.apache.lucene.facet.search.MultiCategoryListIteratorTest

Error Message:
A SPI class of type org.apache.lucene.codecs.DocValuesFormat with name 'Facet42' does not exist. You need to add the corresponding JAR file supporting this SPI to your classpath.The current classpath supports the following names: [Asserting, CheapBastard, Lucene42, Disk, SimpleText]

Stack Trace:
java.lang.IllegalArgumentException: A SPI class of type org.apache.lucene.codecs.DocValuesFormat with name 'Facet42' does not exist. You need to add the corresponding JAR file supporting this SPI to your classpath.The current classpath supports the following names: [Asserting, CheapBastard, Lucene42, Disk, SimpleText]
	at __randomizedtesting.SeedInfo.seed([973CC90197190092]:0)
	at org.apache.lucene.util.NamedSPILoader.lookup(NamedSPILoader.java:104)
	at org.apache.lucene.codecs.DocValuesFormat.forName(DocValuesFormat.java:97)
	at org.apache.lucene.facet.codecs.facet42.Facet42Codec.<init>(Facet42Codec.java:48)
	at org.apache.lucene.facet.codecs.facet42.Facet42Codec.<init>(Facet42Codec.java:54)
	at org.apache.lucene.facet.FacetTestCase.beforeClassFacetTestCase(FacetTestCase.java:58)
	at sun.reflect.GeneratedMethodAccessor6.invoke(Unknown Source)
	at sun.reflect.DelegatingMethodAccessorImpl.invoke(DelegatingMethodAccessorImpl.java:43)
	at java.lang.reflect.Method.invoke(Method.java:616)
	at com.carrotsearch.randomizedtesting.RandomizedRunner.invoke(RandomizedRunner.java:1559)
	at com.carrotsearch.randomizedtesting.RandomizedRunner.access$600(RandomizedRunner.java:79)
	at com.carrotsearch.randomizedtesting.RandomizedRunner$4.evaluate(RandomizedRunner.java:677)
	at com.carrotsearch.randomizedtesting.RandomizedRunner$5.evaluate(RandomizedRunner.java:693)
	at org.apache.lucene.util.AbstractBeforeAfterRule$1.evaluate(AbstractBeforeAfterRule.java:46)
	at org.apache.lucene.util.TestRuleStoreClassName$1.evaluate(TestRuleStoreClassName.java:42)
	at com.carrotsearch.randomizedtesting.rules.SystemPropertiesInvariantRule$1.evaluate(SystemPropertiesInvariantRule.java:55)
	at com.carrotsearch.randomizedtesting.rules.NoShadowingOrOverridesOnMethodsRule$1.evaluate(NoShadowingOrOverridesOnMethodsRule.java:39)
	at com.carrotsearch.randomizedtesting.rules.NoShadowingOrOverridesOnMethodsRule$1.evaluate(NoShadowingOrOverridesOnMethodsRule.java:39)
	at com.carrotsearch.randomizedtesting.rules.StatementAdapter.evaluate(StatementAdapter.java:36)
	at org.apache.lucene.util.TestRuleAssertionsRequired$1.evaluate(TestRuleAssertionsRequired.java:43)
	at org.apache.lucene.util.TestRuleMarkFailure$1.evaluate(TestRuleMarkFailure.java:48)
	at org.apache.lucene.util.TestRuleIgnoreAfterMaxFailures$1.evaluate(TestRuleIgnoreAfterMaxFailures.java:70)
	at org.apache.lucene.util.TestRuleIgnoreTestSuites$1.evaluate(TestRuleIgnoreTestSuites.java:55)
	at com.carrotsearch.randomizedtesting.rules.StatementAdapter.evaluate(StatementAdapter.java:36)
	at com.carrotsearch.randomizedtesting.ThreadLeakControl$StatementRunner.run(ThreadLeakControl.java:358)
	at java.lang.Thread.run(Thread.java:679)


FAILED:  org.apache.lucene.facet.search.TestTopKInEachNodeResultHandler.org.apache.lucene.facet.search.TestTopKInEachNodeResultHandler

Error Message:
A SPI class of type org.apache.lucene.codecs.DocValuesFormat with name 'Facet42' does not exist. You need to add the corresponding JAR file supporting this SPI to your classpath.The current classpath supports the following names: [Asserting, CheapBastard, Lucene42, Disk, SimpleText]

Stack Trace:
java.lang.IllegalArgumentException: A SPI class of type org.apache.lucene.codecs.DocValuesFormat with name 'Facet42' does not exist. You need to add the corresponding JAR file supporting this SPI to your classpath.The current classpath supports the following names: [Asserting, CheapBastard, Lucene42, Disk, SimpleText]
	at __randomizedtesting.SeedInfo.seed([A0FE89B06237547E]:0)
	at org.apache.lucene.util.NamedSPILoader.lookup(NamedSPILoader.java:104)
	at org.apache.lucene.codecs.DocValuesFormat.forName(DocValuesFormat.java:97)
	at org.apache.lucene.facet.codecs.facet42.Facet42Codec.<init>(Facet42Codec.java:48)
	at org.apache.lucene.facet.codecs.facet42.Facet42Codec.<init>(Facet42Codec.java:54)
	at org.apache.lucene.facet.FacetTestCase.beforeClassFacetTestCase(FacetTestCase.java:58)
	at sun.reflect.GeneratedMethodAccessor6.invoke(Unknown Source)
	at sun.reflect.DelegatingMethodAccessorImpl.invoke(DelegatingMethodAccessorImpl.java:43)
	at java.lang.reflect.Method.invoke(Method.java:616)
	at com.carrotsearch.randomizedtesting.RandomizedRunner.invoke(RandomizedRunner.java:1559)
	at com.carrotsearch.randomizedtesting.RandomizedRunner.access$600(RandomizedRunner.java:79)
	at com.carrotsearch.randomizedtesting.RandomizedRunner$4.evaluate(RandomizedRunner.java:677)
	at com.carrotsearch.randomizedtesting.RandomizedRunner$5.evaluate(RandomizedRunner.java:693)
	at org.apache.lucene.util.AbstractBeforeAfterRule$1.evaluate(AbstractBeforeAfterRule.java:46)
	at org.apache.lucene.util.TestRuleStoreClassName$1.evaluate(TestRuleStoreClassName.java:42)
	at com.carrotsearch.randomizedtesting.rules.SystemPropertiesInvariantRule$1.evaluate(SystemPropertiesInvariantRule.java:55)
	at com.carrotsearch.randomizedtesting.rules.NoShadowingOrOverridesOnMethodsRule$1.evaluate(NoShadowingOrOverridesOnMethodsRule.java:39)
	at com.carrotsearch.randomizedtesting.rules.NoShadowingOrOverridesOnMethodsRule$1.evaluate(NoShadowingOrOverridesOnMethodsRule.java:39)
	at com.carrotsearch.randomizedtesting.rules.StatementAdapter.evaluate(StatementAdapter.java:36)
	at org.apache.lucene.util.TestRuleAssertionsRequired$1.evaluate(TestRuleAssertionsRequired.java:43)
	at org.apache.lucene.util.TestRuleMarkFailure$1.evaluate(TestRuleMarkFailure.java:48)
	at org.apache.lucene.util.TestRuleIgnoreAfterMaxFailures$1.evaluate(TestRuleIgnoreAfterMaxFailures.java:70)
	at org.apache.lucene.util.TestRuleIgnoreTestSuites$1.evaluate(TestRuleIgnoreTestSuites.java:55)
	at com.carrotsearch.randomizedtesting.rules.StatementAdapter.evaluate(StatementAdapter.java:36)
	at com.carrotsearch.randomizedtesting.ThreadLeakControl$StatementRunner.run(ThreadLeakControl.java:358)
	at java.lang.Thread.run(Thread.java:679)


FAILED:  org.apache.lucene.facet.search.TestTopKResultsHandler.org.apache.lucene.facet.search.TestTopKResultsHandler

Error Message:
A SPI class of type org.apache.lucene.codecs.DocValuesFormat with name 'Facet42' does not exist. You need to add the corresponding JAR file supporting this SPI to your classpath.The current classpath supports the following names: [Asserting, CheapBastard, Lucene42, Disk, SimpleText]

Stack Trace:
java.lang.IllegalArgumentException: A SPI class of type org.apache.lucene.codecs.DocValuesFormat with name 'Facet42' does not exist. You need to add the corresponding JAR file supporting this SPI to your classpath.The current classpath supports the following names: [Asserting, CheapBastard, Lucene42, Disk, SimpleText]
	at __randomizedtesting.SeedInfo.seed([B151E93424049155]:0)
	at org.apache.lucene.util.NamedSPILoader.lookup(NamedSPILoader.java:104)
	at org.apache.lucene.codecs.DocValuesFormat.forName(DocValuesFormat.java:97)
	at org.apache.lucene.facet.codecs.facet42.Facet42Codec.<init>(Facet42Codec.java:48)
	at org.apache.lucene.facet.codecs.facet42.Facet42Codec.<init>(Facet42Codec.java:54)
	at org.apache.lucene.facet.FacetTestCase.beforeClassFacetTestCase(FacetTestCase.java:58)
	at sun.reflect.NativeMethodAccessorImpl.invoke0(Native Method)
	at sun.reflect.NativeMethodAccessorImpl.invoke(NativeMethodAccessorImpl.java:57)
	at sun.reflect.DelegatingMethodAccessorImpl.invoke(DelegatingMethodAccessorImpl.java:43)
	at java.lang.reflect.Method.invoke(Method.java:616)
	at com.carrotsearch.randomizedtesting.RandomizedRunner.invoke(RandomizedRunner.java:1559)
	at com.carrotsearch.randomizedtesting.RandomizedRunner.access$600(RandomizedRunner.java:79)
	at com.carrotsearch.randomizedtesting.RandomizedRunner$4.evaluate(RandomizedRunner.java:677)
	at com.carrotsearch.randomizedtesting.RandomizedRunner$5.evaluate(RandomizedRunner.java:693)
	at org.apache.lucene.util.AbstractBeforeAfterRule$1.evaluate(AbstractBeforeAfterRule.java:46)
	at org.apache.lucene.util.TestRuleStoreClassName$1.evaluate(TestRuleStoreClassName.java:42)
	at com.carrotsearch.randomizedtesting.rules.SystemPropertiesInvariantRule$1.evaluate(SystemPropertiesInvariantRule.java:55)
	at com.carrotsearch.randomizedtesting.rules.NoShadowingOrOverridesOnMethodsRule$1.evaluate(NoShadowingOrOverridesOnMethodsRule.java:39)
	at com.carrotsearch.randomizedtesting.rules.NoShadowingOrOverridesOnMethodsRule$1.evaluate(NoShadowingOrOverridesOnMethodsRule.java:39)
	at com.carrotsearch.randomizedtesting.rules.StatementAdapter.evaluate(StatementAdapter.java:36)
	at org.apache.lucene.util.TestRuleAssertionsRequired$1.evaluate(TestRuleAssertionsRequired.java:43)
	at org.apache.lucene.util.TestRuleMarkFailure$1.evaluate(TestRuleMarkFailure.java:48)
	at org.apache.lucene.util.TestRuleIgnoreAfterMaxFailures$1.evaluate(TestRuleIgnoreAfterMaxFailures.java:70)
	at org.apache.lucene.util.TestRuleIgnoreTestSuites$1.evaluate(TestRuleIgnoreTestSuites.java:55)
	at com.carrotsearch.randomizedtesting.rules.StatementAdapter.evaluate(StatementAdapter.java:36)
	at com.carrotsearch.randomizedtesting.ThreadLeakControl$StatementRunner.run(ThreadLeakControl.java:358)
	at java.lang.Thread.run(Thread.java:679)


FAILED:  org.apache.lucene.facet.search.TestTopKResultsHandler.org.apache.lucene.facet.search.TestTopKResultsHandler

Error Message:
null

Stack Trace:
java.lang.NullPointerException
	at __randomizedtesting.SeedInfo.seed([B151E93424049155]:0)
	at org.apache.lucene.facet.FacetTestBase.afterClassFacetTestBase(FacetTestBase.java:104)
	at sun.reflect.NativeMethodAccessorImpl.invoke0(Native Method)
	at sun.reflect.NativeMethodAccessorImpl.invoke(NativeMethodAccessorImpl.java:57)
	at sun.reflect.DelegatingMethodAccessorImpl.invoke(DelegatingMethodAccessorImpl.java:43)
	at java.lang.reflect.Method.invoke(Method.java:616)
	at com.carrotsearch.randomizedtesting.RandomizedRunner.invoke(RandomizedRunner.java:1559)
	at com.carrotsearch.randomizedtesting.RandomizedRunner.access$600(RandomizedRunner.java:79)
	at com.carrotsearch.randomizedtesting.RandomizedRunner$5.evaluate(RandomizedRunner.java:700)
	at org.apache.lucene.util.AbstractBeforeAfterRule$1.evaluate(AbstractBeforeAfterRule.java:46)
	at org.apache.lucene.util.TestRuleStoreClassName$1.evaluate(TestRuleStoreClassName.java:42)
	at com.carrotsearch.randomizedtesting.rules.SystemPropertiesInvariantRule$1.evaluate(SystemPropertiesInvariantRule.java:55)
	at com.carrotsearch.randomizedtesting.rules.NoShadowingOrOverridesOnMethodsRule$1.evaluate(NoShadowingOrOverridesOnMethodsRule.java:39)
	at com.carrotsearch.randomizedtesting.rules.NoShadowingOrOverridesOnMethodsRule$1.evaluate(NoShadowingOrOverridesOnMethodsRule.java:39)
	at com.carrotsearch.randomizedtesting.rules.StatementAdapter.evaluate(StatementAdapter.java:36)
	at org.apache.lucene.util.TestRuleAssertionsRequired$1.evaluate(TestRuleAssertionsRequired.java:43)
	at org.apache.lucene.util.TestRuleMarkFailure$1.evaluate(TestRuleMarkFailure.java:48)
	at org.apache.lucene.util.TestRuleIgnoreAfterMaxFailures$1.evaluate(TestRuleIgnoreAfterMaxFailures.java:70)
	at org.apache.lucene.util.TestRuleIgnoreTestSuites$1.evaluate(TestRuleIgnoreTestSuites.java:55)
	at com.carrotsearch.randomizedtesting.rules.StatementAdapter.evaluate(StatementAdapter.java:36)
	at com.carrotsearch.randomizedtesting.ThreadLeakControl$StatementRunner.run(ThreadLeakControl.java:358)
	at java.lang.Thread.run(Thread.java:679)


FAILED:  org.apache.lucene.facet.search.TestTopKResultsHandlerRandom.org.apache.lucene.facet.search.TestTopKResultsHandlerRandom

Error Message:
A SPI class of type org.apache.lucene.codecs.DocValuesFormat with name 'Facet42' does not exist. You need to add the corresponding JAR file supporting this SPI to your classpath.The current classpath supports the following names: [Asserting, CheapBastard, Lucene42, Disk, SimpleText]

Stack Trace:
java.lang.IllegalArgumentException: A SPI class of type org.apache.lucene.codecs.DocValuesFormat with name 'Facet42' does not exist. You need to add the corresponding JAR file supporting this SPI to your classpath.The current classpath supports the following names: [Asserting, CheapBastard, Lucene42, Disk, SimpleText]
	at __randomizedtesting.SeedInfo.seed([C25D87C7843B58D2]:0)
	at org.apache.lucene.util.NamedSPILoader.lookup(NamedSPILoader.java:104)
	at org.apache.lucene.codecs.DocValuesFormat.forName(DocValuesFormat.java:97)
	at org.apache.lucene.facet.codecs.facet42.Facet42Codec.<init>(Facet42Codec.java:48)
	at org.apache.lucene.facet.codecs.facet42.Facet42Codec.<init>(Facet42Codec.java:54)
	at org.apache.lucene.facet.FacetTestCase.beforeClassFacetTestCase(FacetTestCase.java:58)
	at sun.reflect.GeneratedMethodAccessor6.invoke(Unknown Source)
	at sun.reflect.DelegatingMethodAccessorImpl.invoke(DelegatingMethodAccessorImpl.java:43)
	at java.lang.reflect.Method.invoke(Method.java:616)
	at com.carrotsearch.randomizedtesting.RandomizedRunner.invoke(RandomizedRunner.java:1559)
	at com.carrotsearch.randomizedtesting.RandomizedRunner.access$600(RandomizedRunner.java:79)
	at com.carrotsearch.randomizedtesting.RandomizedRunner$4.evaluate(RandomizedRunner.java:677)
	at com.carrotsearch.randomizedtesting.RandomizedRunner$5.evaluate(RandomizedRunner.java:693)
	at org.apache.lucene.util.AbstractBeforeAfterRule$1.evaluate(AbstractBeforeAfterRule.java:46)
	at org.apache.lucene.util.TestRuleStoreClassName$1.evaluate(TestRuleStoreClassName.java:42)
	at com.carrotsearch.randomizedtesting.rules.SystemPropertiesInvariantRule$1.evaluate(SystemPropertiesInvariantRule.java:55)
	at com.carrotsearch.randomizedtesting.rules.NoShadowingOrOverridesOnMethodsRule$1.evaluate(NoShadowingOrOverridesOnMethodsRule.java:39)
	at com.carrotsearch.randomizedtesting.rules.NoShadowingOrOverridesOnMethodsRule$1.evaluate(NoShadowingOrOverridesOnMethodsRule.java:39)
	at com.carrotsearch.randomizedtesting.rules.StatementAdapter.evaluate(StatementAdapter.java:36)
	at org.apache.lucene.util.TestRuleAssertionsRequired$1.evaluate(TestRuleAssertionsRequired.java:43)
	at org.apache.lucene.util.TestRuleMarkFailure$1.evaluate(TestRuleMarkFailure.java:48)
	at org.apache.lucene.util.TestRuleIgnoreAfterMaxFailures$1.evaluate(TestRuleIgnoreAfterMaxFailures.java:70)
	at org.apache.lucene.util.TestRuleIgnoreTestSuites$1.evaluate(TestRuleIgnoreTestSuites.java:55)
	at com.carrotsearch.randomizedtesting.rules.StatementAdapter.evaluate(StatementAdapter.java:36)
	at com.carrotsearch.randomizedtesting.ThreadLeakControl$StatementRunner.run(ThreadLeakControl.java:358)
	at java.lang.Thread.run(Thread.java:679)


FAILED:  org.apache.lucene.facet.search.TestTopKResultsHandlerRandom.org.apache.lucene.facet.search.TestTopKResultsHandlerRandom

Error Message:
this Directory is closed

Stack Trace:
org.apache.lucene.store.AlreadyClosedException: this Directory is closed
	at __randomizedtesting.SeedInfo.seed([C25D87C7843B58D2]:0)
	at org.apache.lucene.store.Directory.ensureOpen(Directory.java:256)
	at org.apache.lucene.store.RAMDirectory.listAll(RAMDirectory.java:107)
	at org.apache.lucene.store.MockDirectoryWrapper.listAll(MockDirectoryWrapper.java:800)
	at org.apache.lucene.store.BaseDirectoryWrapper.indexPossiblyExists(BaseDirectoryWrapper.java:63)
	at org.apache.lucene.store.MockDirectoryWrapper.close(MockDirectoryWrapper.java:592)
	at org.apache.lucene.util.IOUtils.close(IOUtils.java:146)
	at org.apache.lucene.facet.FacetTestBase.afterClassFacetTestBase(FacetTestBase.java:107)
	at sun.reflect.NativeMethodAccessorImpl.invoke0(Native Method)
	at sun.reflect.NativeMethodAccessorImpl.invoke(NativeMethodAccessorImpl.java:57)
	at sun.reflect.DelegatingMethodAccessorImpl.invoke(DelegatingMethodAccessorImpl.java:43)
	at java.lang.reflect.Method.invoke(Method.java:616)
	at com.carrotsearch.randomizedtesting.RandomizedRunner.invoke(RandomizedRunner.java:1559)
	at com.carrotsearch.randomizedtesting.RandomizedRunner.access$600(RandomizedRunner.java:79)
	at com.carrotsearch.randomizedtesting.RandomizedRunner$5.evaluate(RandomizedRunner.java:700)
	at org.apache.lucene.util.AbstractBeforeAfterRule$1.evaluate(AbstractBeforeAfterRule.java:46)
	at org.apache.lucene.util.TestRuleStoreClassName$1.evaluate(TestRuleStoreClassName.java:42)
	at com.carrotsearch.randomizedtesting.rules.SystemPropertiesInvariantRule$1.evaluate(SystemPropertiesInvariantRule.java:55)
	at com.carrotsearch.randomizedtesting.rules.NoShadowingOrOverridesOnMethodsRule$1.evaluate(NoShadowingOrOverridesOnMethodsRule.java:39)
	at com.carrotsearch.randomizedtesting.rules.NoShadowingOrOverridesOnMethodsRule$1.evaluate(NoShadowingOrOverridesOnMethodsRule.java:39)
	at com.carrotsearch.randomizedtesting.rules.StatementAdapter.evaluate(StatementAdapter.java:36)
	at org.apache.lucene.util.TestRuleAssertionsRequired$1.evaluate(TestRuleAssertionsRequired.java:43)
	at org.apache.lucene.util.TestRuleMarkFailure$1.evaluate(TestRuleMarkFailure.java:48)
	at org.apache.lucene.util.TestRuleIgnoreAfterMaxFailures$1.evaluate(TestRuleIgnoreAfterMaxFailures.java:70)
	at org.apache.lucene.util.TestRuleIgnoreTestSuites$1.evaluate(TestRuleIgnoreTestSuites.java:55)
	at com.carrotsearch.randomizedtesting.rules.StatementAdapter.evaluate(StatementAdapter.java:36)
	at com.carrotsearch.randomizedtesting.ThreadLeakControl$StatementRunner.run(ThreadLeakControl.java:358)
	at java.lang.Thread.run(Thread.java:679)


FAILED:  org.apache.lucene.facet.taxonomy.directory.TestAddTaxonomy.org.apache.lucene.facet.taxonomy.directory.TestAddTaxonomy

Error Message:
A SPI class of type org.apache.lucene.codecs.DocValuesFormat with name 'Facet42' does not exist. You need to add the corresponding JAR file supporting this SPI to your classpath.The current classpath supports the following names: [Asserting, CheapBastard, Lucene42, Disk, SimpleText]

Stack Trace:
java.lang.IllegalArgumentException: A SPI class of type org.apache.lucene.codecs.DocValuesFormat with name 'Facet42' does not exist. You need to add the corresponding JAR file supporting this SPI to your classpath.The current classpath supports the following names: [Asserting, CheapBastard, Lucene42, Disk, SimpleText]
	at __randomizedtesting.SeedInfo.seed([E9B8C3FD98B4A177]:0)
	at org.apache.lucene.util.NamedSPILoader.lookup(NamedSPILoader.java:104)
	at org.apache.lucene.codecs.DocValuesFormat.forName(DocValuesFormat.java:97)
	at org.apache.lucene.facet.codecs.facet42.Facet42Codec.<init>(Facet42Codec.java:48)
	at org.apache.lucene.facet.codecs.facet42.Facet42Codec.<init>(Facet42Codec.java:54)
	at org.apache.lucene.facet.FacetTestCase.beforeClassFacetTestCase(FacetTestCase.java:58)
	at sun.reflect.NativeMethodAccessorImpl.invoke0(Native Method)
	at sun.reflect.NativeMethodAccessorImpl.invoke(NativeMethodAccessorImpl.java:57)
	at sun.reflect.DelegatingMethodAccessorImpl.invoke(DelegatingMethodAccessorImpl.java:43)
	at java.lang.reflect.Method.invoke(Method.java:616)
	at com.carrotsearch.randomizedtesting.RandomizedRunner.invoke(RandomizedRunner.java:1559)
	at com.carrotsearch.randomizedtesting.RandomizedRunner.access$600(RandomizedRunner.java:79)
	at com.carrotsearch.randomizedtesting.RandomizedRunner$4.evaluate(RandomizedRunner.java:677)
	at com.carrotsearch.randomizedtesting.RandomizedRunner$5.evaluate(RandomizedRunner.java:693)
	at org.apache.lucene.util.AbstractBeforeAfterRule$1.evaluate(AbstractBeforeAfterRule.java:46)
	at org.apache.lucene.util.TestRuleStoreClassName$1.evaluate(TestRuleStoreClassName.java:42)
	at com.carrotsearch.randomizedtesting.rules.SystemPropertiesInvariantRule$1.evaluate(SystemPropertiesInvariantRule.java:55)
	at com.carrotsearch.randomizedtesting.rules.NoShadowingOrOverridesOnMethodsRule$1.evaluate(NoShadowingOrOverridesOnMethodsRule.java:39)
	at com.carrotsearch.randomizedtesting.rules.NoShadowingOrOverridesOnMethodsRule$1.evaluate(NoShadowingOrOverridesOnMethodsRule.java:39)
	at com.carrotsearch.randomizedtesting.rules.StatementAdapter.evaluate(StatementAdapter.java:36)
	at org.apache.lucene.util.TestRuleAssertionsRequired$1.evaluate(TestRuleAssertionsRequired.java:43)
	at org.apache.lucene.util.TestRuleMarkFailure$1.evaluate(TestRuleMarkFailure.java:48)
	at org.apache.lucene.util.TestRuleIgnoreAfterMaxFailures$1.evaluate(TestRuleIgnoreAfterMaxFailures.java:70)
	at org.apache.lucene.util.TestRuleIgnoreTestSuites$1.evaluate(TestRuleIgnoreTestSuites.java:55)
	at com.carrotsearch.randomizedtesting.rules.StatementAdapter.evaluate(StatementAdapter.java:36)
	at com.carrotsearch.randomizedtesting.ThreadLeakControl$StatementRunner.run(ThreadLeakControl.java:358)
	at java.lang.Thread.run(Thread.java:679)


FAILED:  org.apache.lucene.facet.taxonomy.directory.TestConcurrentFacetedIndexing.org.apache.lucene.facet.taxonomy.directory.TestConcurrentFacetedIndexing

Error Message:
A SPI class of type org.apache.lucene.codecs.DocValuesFormat with name 'Facet42' does not exist. You need to add the corresponding JAR file supporting this SPI to your classpath.The current classpath supports the following names: [Asserting, CheapBastard, Lucene42, Disk, SimpleText]

Stack Trace:
java.lang.IllegalArgumentException: A SPI class of type org.apache.lucene.codecs.DocValuesFormat with name 'Facet42' does not exist. You need to add the corresponding JAR file supporting this SPI to your classpath.The current classpath supports the following names: [Asserting, CheapBastard, Lucene42, Disk, SimpleText]
	at __randomizedtesting.SeedInfo.seed([98F0FB19429507CB]:0)
	at org.apache.lucene.util.NamedSPILoader.lookup(NamedSPILoader.java:104)
	at org.apache.lucene.codecs.DocValuesFormat.forName(DocValuesFormat.java:97)
	at org.apache.lucene.facet.codecs.facet42.Facet42Codec.<init>(Facet42Codec.java:48)
	at org.apache.lucene.facet.codecs.facet42.Facet42Codec.<init>(Facet42Codec.java:54)
	at org.apache.lucene.facet.FacetTestCase.beforeClassFacetTestCase(FacetTestCase.java:58)
	at sun.reflect.GeneratedMethodAccessor6.invoke(Unknown Source)
	at sun.reflect.DelegatingMethodAccessorImpl.invoke(DelegatingMethodAccessorImpl.java:43)
	at java.lang.reflect.Method.invoke(Method.java:616)
	at com.carrotsearch.randomizedtesting.RandomizedRunner.invoke(RandomizedRunner.java:1559)
	at com.carrotsearch.randomizedtesting.RandomizedRunner.access$600(RandomizedRunner.java:79)
	at com.carrotsearch.randomizedtesting.RandomizedRunner$4.evaluate(RandomizedRunner.java:677)
	at com.carrotsearch.randomizedtesting.RandomizedRunner$5.evaluate(RandomizedRunner.java:693)
	at org.apache.lucene.util.AbstractBeforeAfterRule$1.evaluate(AbstractBeforeAfterRule.java:46)
	at org.apache.lucene.util.TestRuleStoreClassName$1.evaluate(TestRuleStoreClassName.java:42)
	at com.carrotsearch.randomizedtesting.rules.SystemPropertiesInvariantRule$1.evaluate(SystemPropertiesInvariantRule.java:55)
	at com.carrotsearch.randomizedtesting.rules.NoShadowingOrOverridesOnMethodsRule$1.evaluate(NoShadowingOrOverridesOnMethodsRule.java:39)
	at com.carrotsearch.randomizedtesting.rules.NoShadowingOrOverridesOnMethodsRule$1.evaluate(NoShadowingOrOverridesOnMethodsRule.java:39)
	at com.carrotsearch.randomizedtesting.rules.StatementAdapter.evaluate(StatementAdapter.java:36)
	at org.apache.lucene.util.TestRuleAssertionsRequired$1.evaluate(TestRuleAssertionsRequired.java:43)
	at org.apache.lucene.util.TestRuleMarkFailure$1.evaluate(TestRuleMarkFailure.java:48)
	at org.apache.lucene.util.TestRuleIgnoreAfterMaxFailures$1.evaluate(TestRuleIgnoreAfterMaxFailures.java:70)
	at org.apache.lucene.util.TestRuleIgnoreTestSuites$1.evaluate(TestRuleIgnoreTestSuites.java:55)
	at com.carrotsearch.randomizedtesting.rules.StatementAdapter.evaluate(StatementAdapter.java:36)
	at com.carrotsearch.randomizedtesting.ThreadLeakControl$StatementRunner.run(ThreadLeakControl.java:358)
	at java.lang.Thread.run(Thread.java:679)


FAILED:  org.apache.lucene.facet.taxonomy.directory.TestDirectoryTaxonomyReader.org.apache.lucene.facet.taxonomy.directory.TestDirectoryTaxonomyReader

Error Message:
A SPI class of type org.apache.lucene.codecs.DocValuesFormat with name 'Facet42' does not exist. You need to add the corresponding JAR file supporting this SPI to your classpath.The current classpath supports the following names: [Asserting, CheapBastard, Lucene42, Disk, SimpleText]

Stack Trace:
java.lang.IllegalArgumentException: A SPI class of type org.apache.lucene.codecs.DocValuesFormat with name 'Facet42' does not exist. You need to add the corresponding JAR file supporting this SPI to your classpath.The current classpath supports the following names: [Asserting, CheapBastard, Lucene42, Disk, SimpleText]
	at __randomizedtesting.SeedInfo.seed([68AE7EE358C69785]:0)
	at org.apache.lucene.util.NamedSPILoader.lookup(NamedSPILoader.java:104)
	at org.apache.lucene.codecs.DocValuesFormat.forName(DocValuesFormat.java:97)
	at org.apache.lucene.facet.codecs.facet42.Facet42Codec.<init>(Facet42Codec.java:48)
	at org.apache.lucene.facet.codecs.facet42.Facet42Codec.<init>(Facet42Codec.java:54)
	at org.apache.lucene.facet.FacetTestCase.beforeClassFacetTestCase(FacetTestCase.java:58)
	at sun.reflect.GeneratedMethodAccessor6.invoke(Unknown Source)
	at sun.reflect.DelegatingMethodAccessorImpl.invoke(DelegatingMethodAccessorImpl.java:43)
	at java.lang.reflect.Method.invoke(Method.java:616)
	at com.carrotsearch.randomizedtesting.RandomizedRunner.invoke(RandomizedRunner.java:1559)
	at com.carrotsearch.randomizedtesting.RandomizedRunner.access$600(RandomizedRunner.java:79)
	at com.carrotsearch.randomizedtesting.RandomizedRunner$4.evaluate(RandomizedRunner.java:677)
	at com.carrotsearch.randomizedtesting.RandomizedRunner$5.evaluate(RandomizedRunner.java:693)
	at org.apache.lucene.util.AbstractBeforeAfterRule$1.evaluate(AbstractBeforeAfterRule.java:46)
	at org.apache.lucene.util.TestRuleStoreClassName$1.evaluate(TestRuleStoreClassName.java:42)
	at com.carrotsearch.randomizedtesting.rules.SystemPropertiesInvariantRule$1.evaluate(SystemPropertiesInvariantRule.java:55)
	at com.carrotsearch.randomizedtesting.rules.NoShadowingOrOverridesOnMethodsRule$1.evaluate(NoShadowingOrOverridesOnMethodsRule.java:39)
	at com.carrotsearch.randomizedtesting.rules.NoShadowingOrOverridesOnMethodsRule$1.evaluate(NoShadowingOrOverridesOnMethodsRule.java:39)
	at com.carrotsearch.randomizedtesting.rules.StatementAdapter.evaluate(StatementAdapter.java:36)
	at org.apache.lucene.util.TestRuleAssertionsRequired$1.evaluate(TestRuleAssertionsRequired.java:43)
	at org.apache.lucene.util.TestRuleMarkFailure$1.evaluate(TestRuleMarkFailure.java:48)
	at org.apache.lucene.util.TestRuleIgnoreAfterMaxFailures$1.evaluate(TestRuleIgnoreAfterMaxFailures.java:70)
	at org.apache.lucene.util.TestRuleIgnoreTestSuites$1.evaluate(TestRuleIgnoreTestSuites.java:55)
	at com.carrotsearch.randomizedtesting.rules.StatementAdapter.evaluate(StatementAdapter.java:36)
	at com.carrotsearch.randomizedtesting.ThreadLeakControl$StatementRunner.run(ThreadLeakControl.java:358)
	at java.lang.Thread.run(Thread.java:679)


FAILED:  org.apache.lucene.facet.taxonomy.writercache.cl2o.TestCharBlockArray.org.apache.lucene.facet.taxonomy.writercache.cl2o.TestCharBlockArray

Error Message:
A SPI class of type org.apache.lucene.codecs.DocValuesFormat with name 'Facet42' does not exist. You need to add the corresponding JAR file supporting this SPI to your classpath.The current classpath supports the following names: [Asserting, CheapBastard, Lucene42, Disk, SimpleText]

Stack Trace:
java.lang.IllegalArgumentException: A SPI class of type org.apache.lucene.codecs.DocValuesFormat with name 'Facet42' does not exist. You need to add the corresponding JAR file supporting this SPI to your classpath.The current classpath supports the following names: [Asserting, CheapBastard, Lucene42, Disk, SimpleText]
	at __randomizedtesting.SeedInfo.seed([228B1C24AC831FAF]:0)
	at org.apache.lucene.util.NamedSPILoader.lookup(NamedSPILoader.java:104)
	at org.apache.lucene.codecs.DocValuesFormat.forName(DocValuesFormat.java:97)
	at org.apache.lucene.facet.codecs.facet42.Facet42Codec.<init>(Facet42Codec.java:48)
	at org.apache.lucene.facet.codecs.facet42.Facet42Codec.<init>(Facet42Codec.java:54)
	at org.apache.lucene.facet.FacetTestCase.beforeClassFacetTestCase(FacetTestCase.java:58)
	at sun.reflect.NativeMethodAccessorImpl.invoke0(Native Method)
	at sun.reflect.NativeMethodAccessorImpl.invoke(NativeMethodAccessorImpl.java:57)
	at sun.reflect.DelegatingMethodAccessorImpl.invoke(DelegatingMethodAccessorImpl.java:43)
	at java.lang.reflect.Method.invoke(Method.java:616)
	at com.carrotsearch.randomizedtesting.RandomizedRunner.invoke(RandomizedRunner.java:1559)
	at com.carrotsearch.randomizedtesting.RandomizedRunner.access$600(RandomizedRunner.java:79)
	at com.carrotsearch.randomizedtesting.RandomizedRunner$4.evaluate(RandomizedRunner.java:677)
	at com.carrotsearch.randomizedtesting.RandomizedRunner$5.evaluate(RandomizedRunner.java:693)
	at org.apache.lucene.util.AbstractBeforeAfterRule$1.evaluate(AbstractBeforeAfterRule.java:46)
	at org.apache.lucene.util.TestRuleStoreClassName$1.evaluate(TestRuleStoreClassName.java:42)
	at com.carrotsearch.randomizedtesting.rules.SystemPropertiesInvariantRule$1.evaluate(SystemPropertiesInvariantRule.java:55)
	at com.carrotsearch.randomizedtesting.rules.NoShadowingOrOverridesOnMethodsRule$1.evaluate(NoShadowingOrOverridesOnMethodsRule.java:39)
	at com.carrotsearch.randomizedtesting.rules.NoShadowingOrOverridesOnMethodsRule$1.evaluate(NoShadowingOrOverridesOnMethodsRule.java:39)
	at com.carrotsearch.randomizedtesting.rules.StatementAdapter.evaluate(StatementAdapter.java:36)
	at org.apache.lucene.util.TestRuleAssertionsRequired$1.evaluate(TestRuleAssertionsRequired.java:43)
	at org.apache.lucene.util.TestRuleMarkFailure$1.evaluate(TestRuleMarkFailure.java:48)
	at org.apache.lucene.util.TestRuleIgnoreAfterMaxFailures$1.evaluate(TestRuleIgnoreAfterMaxFailures.java:70)
	at org.apache.lucene.util.TestRuleIgnoreTestSuites$1.evaluate(TestRuleIgnoreTestSuites.java:55)
	at com.carrotsearch.randomizedtesting.rules.StatementAdapter.evaluate(StatementAdapter.java:36)
	at com.carrotsearch.randomizedtesting.ThreadLeakControl$StatementRunner.run(ThreadLeakControl.java:358)
	at java.lang.Thread.run(Thread.java:679)


FAILED:  org.apache.lucene.facet.util.OrdinalMappingReaderTest.org.apache.lucene.facet.util.OrdinalMappingReaderTest

Error Message:
A SPI class of type org.apache.lucene.codecs.DocValuesFormat with name 'Facet42' does not exist. You need to add the corresponding JAR file supporting this SPI to your classpath.The current classpath supports the following names: [Asserting, CheapBastard, Lucene42, Disk, SimpleText]

Stack Trace:
java.lang.IllegalArgumentException: A SPI class of type org.apache.lucene.codecs.DocValuesFormat with name 'Facet42' does not exist. You need to add the corresponding JAR file supporting this SPI to your classpath.The current classpath supports the following names: [Asserting, CheapBastard, Lucene42, Disk, SimpleText]
	at __randomizedtesting.SeedInfo.seed([7C0271595E51EC73]:0)
	at org.apache.lucene.util.NamedSPILoader.lookup(NamedSPILoader.java:104)
	at org.apache.lucene.codecs.DocValuesFormat.forName(DocValuesFormat.java:97)
	at org.apache.lucene.facet.codecs.facet42.Facet42Codec.<init>(Facet42Codec.java:48)
	at org.apache.lucene.facet.codecs.facet42.Facet42Codec.<init>(Facet42Codec.java:54)
	at org.apache.lucene.facet.FacetTestCase.beforeClassFacetTestCase(FacetTestCase.java:58)
	at sun.reflect.GeneratedMethodAccessor6.invoke(Unknown Source)
	at sun.reflect.DelegatingMethodAccessorImpl.invoke(DelegatingMethodAccessorImpl.java:43)
	at java.lang.reflect.Method.invoke(Method.java:616)
	at com.carrotsearch.randomizedtesting.RandomizedRunner.invoke(RandomizedRunner.java:1559)
	at com.carrotsearch.randomizedtesting.RandomizedRunner.access$600(RandomizedRunner.java:79)
	at com.carrotsearch.randomizedtesting.RandomizedRunner$4.evaluate(RandomizedRunner.java:677)
	at com.carrotsearch.randomizedtesting.RandomizedRunner$5.evaluate(RandomizedRunner.java:693)
	at org.apache.lucene.util.AbstractBeforeAfterRule$1.evaluate(AbstractBeforeAfterRule.java:46)
	at org.apache.lucene.util.TestRuleStoreClassName$1.evaluate(TestRuleStoreClassName.java:42)
	at com.carrotsearch.randomizedtesting.rules.SystemPropertiesInvariantRule$1.evaluate(SystemPropertiesInvariantRule.java:55)
	at com.carrotsearch.randomizedtesting.rules.NoShadowingOrOverridesOnMethodsRule$1.evaluate(NoShadowingOrOverridesOnMethodsRule.java:39)
	at com.carrotsearch.randomizedtesting.rules.NoShadowingOrOverridesOnMethodsRule$1.evaluate(NoShadowingOrOverridesOnMethodsRule.java:39)
	at com.carrotsearch.randomizedtesting.rules.StatementAdapter.evaluate(StatementAdapter.java:36)
	at org.apache.lucene.util.TestRuleAssertionsRequired$1.evaluate(TestRuleAssertionsRequired.java:43)
	at org.apache.lucene.util.TestRuleMarkFailure$1.evaluate(TestRuleMarkFailure.java:48)
	at org.apache.lucene.util.TestRuleIgnoreAfterMaxFailures$1.evaluate(TestRuleIgnoreAfterMaxFailures.java:70)
	at org.apache.lucene.util.TestRuleIgnoreTestSuites$1.evaluate(TestRuleIgnoreTestSuites.java:55)
	at com.carrotsearch.randomizedtesting.rules.StatementAdapter.evaluate(StatementAdapter.java:36)
	at com.carrotsearch.randomizedtesting.ThreadLeakControl$StatementRunner.run(ThreadLeakControl.java:358)
	at java.lang.Thread.run(Thread.java:679)


FAILED:  org.apache.lucene.facet.util.TestScoredDocIDsUtils.org.apache.lucene.facet.util.TestScoredDocIDsUtils

Error Message:
A SPI class of type org.apache.lucene.codecs.DocValuesFormat with name 'Facet42' does not exist. You need to add the corresponding JAR file supporting this SPI to your classpath.The current classpath supports the following names: [Asserting, CheapBastard, Lucene42, Disk, SimpleText]

Stack Trace:
java.lang.IllegalArgumentException: A SPI class of type org.apache.lucene.codecs.DocValuesFormat with name 'Facet42' does not exist. You need to add the corresponding JAR file supporting this SPI to your classpath.The current classpath supports the following names: [Asserting, CheapBastard, Lucene42, Disk, SimpleText]
	at __randomizedtesting.SeedInfo.seed([A5845FC2135CCB3F]:0)
	at org.apache.lucene.util.NamedSPILoader.lookup(NamedSPILoader.java:104)
	at org.apache.lucene.codecs.DocValuesFormat.forName(DocValuesFormat.java:97)
	at org.apache.lucene.facet.codecs.facet42.Facet42Codec.<init>(Facet42Codec.java:48)
	at org.apache.lucene.facet.codecs.facet42.Facet42Codec.<init>(Facet42Codec.java:54)
	at org.apache.lucene.facet.FacetTestCase.beforeClassFacetTestCase(FacetTestCase.java:58)
	at sun.reflect.GeneratedMethodAccessor6.invoke(Unknown Source)
	at sun.reflect.DelegatingMethodAccessorImpl.invoke(DelegatingMethodAccessorImpl.java:43)
	at java.lang.reflect.Method.invoke(Method.java:616)
	at com.carrotsearch.randomizedtesting.RandomizedRunner.invoke(RandomizedRunner.java:1559)
	at com.carrotsearch.randomizedtesting.RandomizedRunner.access$600(RandomizedRunner.java:79)
	at com.carrotsearch.randomizedtesting.RandomizedRunner$4.evaluate(RandomizedRunner.java:677)
	at com.carrotsearch.randomizedtesting.RandomizedRunner$5.evaluate(RandomizedRunner.java:693)
	at org.apache.lucene.util.AbstractBeforeAfterRule$1.evaluate(AbstractBeforeAfterRule.java:46)
	at org.apache.lucene.util.TestRuleStoreClassName$1.evaluate(TestRuleStoreClassName.java:42)
	at com.carrotsearch.randomizedtesting.rules.SystemPropertiesInvariantRule$1.evaluate(SystemPropertiesInvariantRule.java:55)
	at com.carrotsearch.randomizedtesting.rules.NoShadowingOrOverridesOnMethodsRule$1.evaluate(NoShadowingOrOverridesOnMethodsRule.java:39)
	at com.carrotsearch.randomizedtesting.rules.NoShadowingOrOverridesOnMethodsRule$1.evaluate(NoShadowingOrOverridesOnMethodsRule.java:39)
	at com.carrotsearch.randomizedtesting.rules.StatementAdapter.evaluate(StatementAdapter.java:36)
	at org.apache.lucene.util.TestRuleAssertionsRequired$1.evaluate(TestRuleAssertionsRequired.java:43)
	at org.apache.lucene.util.TestRuleMarkFailure$1.evaluate(TestRuleMarkFailure.java:48)
	at org.apache.lucene.util.TestRuleIgnoreAfterMaxFailures$1.evaluate(TestRuleIgnoreAfterMaxFailures.java:70)
	at org.apache.lucene.util.TestRuleIgnoreTestSuites$1.evaluate(TestRuleIgnoreTestSuites.java:55)
	at com.carrotsearch.randomizedtesting.rules.StatementAdapter.evaluate(StatementAdapter.java:36)
	at com.carrotsearch.randomizedtesting.ThreadLeakControl$StatementRunner.run(ThreadLeakControl.java:358)
	at java.lang.Thread.run(Thread.java:679)




Build Log:
[...truncated 21829 lines...]



Mime
View raw message