lucene-dev mailing list archives

Site index · List index
Message view « Date » · « Thread »
Top « Date » · « Thread »
From Policeman Jenkins Server <jenk...@thetaphi.de>
Subject [JENKINS] Lucene-Solr-trunk-Windows (64bit/jdk1.7.0_10) - Build # 2589 - Still Failing!
Date Sat, 23 Feb 2013 20:19:20 GMT
Build: http://jenkins.thetaphi.de/job/Lucene-Solr-trunk-Windows/2589/
Java: 64bit/jdk1.7.0_10 -XX:+UseG1GC

2 tests failed.
REGRESSION:  org.apache.solr.handler.TestReplicationHandler.doTestSnapPullWithMasterUrl

Error Message:
expected:<null> but was:<[0][id][0]:0!=3>

Stack Trace:
java.lang.AssertionError: expected:<null> but was:<[0][id][0]:0!=3>
	at __randomizedtesting.SeedInfo.seed([BBECDFE83ECD4C13:20AA79992DBD195D]:0)
	at org.junit.Assert.fail(Assert.java:93)
	at org.junit.Assert.failNotEquals(Assert.java:647)
	at org.junit.Assert.assertEquals(Assert.java:128)
	at org.junit.Assert.assertEquals(Assert.java:147)
	at org.apache.solr.handler.TestReplicationHandler.doTestSnapPullWithMasterUrl(TestReplicationHandler.java:586)
	at sun.reflect.NativeMethodAccessorImpl.invoke0(Native Method)
	at sun.reflect.NativeMethodAccessorImpl.invoke(NativeMethodAccessorImpl.java:57)
	at sun.reflect.DelegatingMethodAccessorImpl.invoke(DelegatingMethodAccessorImpl.java:43)
	at java.lang.reflect.Method.invoke(Method.java:601)
	at com.carrotsearch.randomizedtesting.RandomizedRunner.invoke(RandomizedRunner.java:1559)
	at com.carrotsearch.randomizedtesting.RandomizedRunner.access$600(RandomizedRunner.java:79)
	at com.carrotsearch.randomizedtesting.RandomizedRunner$6.evaluate(RandomizedRunner.java:737)
	at com.carrotsearch.randomizedtesting.RandomizedRunner$7.evaluate(RandomizedRunner.java:773)
	at com.carrotsearch.randomizedtesting.RandomizedRunner$8.evaluate(RandomizedRunner.java:787)
	at com.carrotsearch.randomizedtesting.rules.SystemPropertiesRestoreRule$1.evaluate(SystemPropertiesRestoreRule.java:53)
	at org.apache.lucene.util.TestRuleSetupTeardownChained$1.evaluate(TestRuleSetupTeardownChained.java:50)
	at org.apache.lucene.util.TestRuleFieldCacheSanity$1.evaluate(TestRuleFieldCacheSanity.java:51)
	at org.apache.lucene.util.AbstractBeforeAfterRule$1.evaluate(AbstractBeforeAfterRule.java:46)
	at com.carrotsearch.randomizedtesting.rules.SystemPropertiesInvariantRule$1.evaluate(SystemPropertiesInvariantRule.java:55)
	at org.apache.lucene.util.TestRuleThreadAndTestName$1.evaluate(TestRuleThreadAndTestName.java:49)
	at org.apache.lucene.util.TestRuleIgnoreAfterMaxFailures$1.evaluate(TestRuleIgnoreAfterMaxFailures.java:70)
	at org.apache.lucene.util.TestRuleMarkFailure$1.evaluate(TestRuleMarkFailure.java:48)
	at com.carrotsearch.randomizedtesting.rules.StatementAdapter.evaluate(StatementAdapter.java:36)
	at com.carrotsearch.randomizedtesting.ThreadLeakControl$StatementRunner.run(ThreadLeakControl.java:358)
	at com.carrotsearch.randomizedtesting.ThreadLeakControl.forkTimeoutingTask(ThreadLeakControl.java:782)
	at com.carrotsearch.randomizedtesting.ThreadLeakControl$3.evaluate(ThreadLeakControl.java:442)
	at com.carrotsearch.randomizedtesting.RandomizedRunner.runSingleTest(RandomizedRunner.java:746)
	at com.carrotsearch.randomizedtesting.RandomizedRunner$3.evaluate(RandomizedRunner.java:648)
	at com.carrotsearch.randomizedtesting.RandomizedRunner$4.evaluate(RandomizedRunner.java:682)
	at com.carrotsearch.randomizedtesting.RandomizedRunner$5.evaluate(RandomizedRunner.java:693)
	at com.carrotsearch.randomizedtesting.rules.StatementAdapter.evaluate(StatementAdapter.java:36)
	at com.carrotsearch.randomizedtesting.rules.SystemPropertiesRestoreRule$1.evaluate(SystemPropertiesRestoreRule.java:53)
	at org.apache.lucene.util.AbstractBeforeAfterRule$1.evaluate(AbstractBeforeAfterRule.java:46)
	at org.apache.lucene.util.TestRuleStoreClassName$1.evaluate(TestRuleStoreClassName.java:42)
	at com.carrotsearch.randomizedtesting.rules.SystemPropertiesInvariantRule$1.evaluate(SystemPropertiesInvariantRule.java:55)
	at com.carrotsearch.randomizedtesting.rules.NoShadowingOrOverridesOnMethodsRule$1.evaluate(NoShadowingOrOverridesOnMethodsRule.java:39)
	at com.carrotsearch.randomizedtesting.rules.NoShadowingOrOverridesOnMethodsRule$1.evaluate(NoShadowingOrOverridesOnMethodsRule.java:39)
	at com.carrotsearch.randomizedtesting.rules.StatementAdapter.evaluate(StatementAdapter.java:36)
	at org.apache.lucene.util.TestRuleAssertionsRequired$1.evaluate(TestRuleAssertionsRequired.java:43)
	at org.apache.lucene.util.TestRuleMarkFailure$1.evaluate(TestRuleMarkFailure.java:48)
	at org.apache.lucene.util.TestRuleIgnoreAfterMaxFailures$1.evaluate(TestRuleIgnoreAfterMaxFailures.java:70)
	at org.apache.lucene.util.TestRuleIgnoreTestSuites$1.evaluate(TestRuleIgnoreTestSuites.java:55)
	at com.carrotsearch.randomizedtesting.rules.StatementAdapter.evaluate(StatementAdapter.java:36)
	at com.carrotsearch.randomizedtesting.ThreadLeakControl$StatementRunner.run(ThreadLeakControl.java:358)
	at java.lang.Thread.run(Thread.java:722)


FAILED:  org.apache.solr.handler.TestReplicationHandler.doTestIndexAndConfigAliasReplication

Error Message:
ERROR: [doc=2000] unknown field 'newname'

Stack Trace:
org.apache.solr.common.SolrException: ERROR: [doc=2000] unknown field 'newname'
	at __randomizedtesting.SeedInfo.seed([BBECDFE83ECD4C13:4C9F31B0F825E3F5]:0)
	at org.apache.solr.client.solrj.impl.HttpSolrServer.request(HttpSolrServer.java:404)
	at org.apache.solr.client.solrj.impl.HttpSolrServer.request(HttpSolrServer.java:181)
	at org.apache.solr.client.solrj.request.AbstractUpdateRequest.process(AbstractUpdateRequest.java:117)
	at org.apache.solr.client.solrj.SolrServer.add(SolrServer.java:116)
	at org.apache.solr.client.solrj.SolrServer.add(SolrServer.java:102)
	at org.apache.solr.handler.TestReplicationHandler.index(TestReplicationHandler.java:161)
	at org.apache.solr.handler.TestReplicationHandler.doTestIndexAndConfigAliasReplication(TestReplicationHandler.java:969)
	at sun.reflect.NativeMethodAccessorImpl.invoke0(Native Method)
	at sun.reflect.NativeMethodAccessorImpl.invoke(NativeMethodAccessorImpl.java:57)
	at sun.reflect.DelegatingMethodAccessorImpl.invoke(DelegatingMethodAccessorImpl.java:43)
	at java.lang.reflect.Method.invoke(Method.java:601)
	at com.carrotsearch.randomizedtesting.RandomizedRunner.invoke(RandomizedRunner.java:1559)
	at com.carrotsearch.randomizedtesting.RandomizedRunner.access$600(RandomizedRunner.java:79)
	at com.carrotsearch.randomizedtesting.RandomizedRunner$6.evaluate(RandomizedRunner.java:737)
	at com.carrotsearch.randomizedtesting.RandomizedRunner$7.evaluate(RandomizedRunner.java:773)
	at com.carrotsearch.randomizedtesting.RandomizedRunner$8.evaluate(RandomizedRunner.java:787)
	at com.carrotsearch.randomizedtesting.rules.SystemPropertiesRestoreRule$1.evaluate(SystemPropertiesRestoreRule.java:53)
	at org.apache.lucene.util.TestRuleSetupTeardownChained$1.evaluate(TestRuleSetupTeardownChained.java:50)
	at org.apache.lucene.util.TestRuleFieldCacheSanity$1.evaluate(TestRuleFieldCacheSanity.java:51)
	at org.apache.lucene.util.AbstractBeforeAfterRule$1.evaluate(AbstractBeforeAfterRule.java:46)
	at com.carrotsearch.randomizedtesting.rules.SystemPropertiesInvariantRule$1.evaluate(SystemPropertiesInvariantRule.java:55)
	at org.apache.lucene.util.TestRuleThreadAndTestName$1.evaluate(TestRuleThreadAndTestName.java:49)
	at org.apache.lucene.util.TestRuleIgnoreAfterMaxFailures$1.evaluate(TestRuleIgnoreAfterMaxFailures.java:70)
	at org.apache.lucene.util.TestRuleMarkFailure$1.evaluate(TestRuleMarkFailure.java:48)
	at com.carrotsearch.randomizedtesting.rules.StatementAdapter.evaluate(StatementAdapter.java:36)
	at com.carrotsearch.randomizedtesting.ThreadLeakControl$StatementRunner.run(ThreadLeakControl.java:358)
	at com.carrotsearch.randomizedtesting.ThreadLeakControl.forkTimeoutingTask(ThreadLeakControl.java:782)
	at com.carrotsearch.randomizedtesting.ThreadLeakControl$3.evaluate(ThreadLeakControl.java:442)
	at com.carrotsearch.randomizedtesting.RandomizedRunner.runSingleTest(RandomizedRunner.java:746)
	at com.carrotsearch.randomizedtesting.RandomizedRunner$3.evaluate(RandomizedRunner.java:648)
	at com.carrotsearch.randomizedtesting.RandomizedRunner$4.evaluate(RandomizedRunner.java:682)
	at com.carrotsearch.randomizedtesting.RandomizedRunner$5.evaluate(RandomizedRunner.java:693)
	at com.carrotsearch.randomizedtesting.rules.StatementAdapter.evaluate(StatementAdapter.java:36)
	at com.carrotsearch.randomizedtesting.rules.SystemPropertiesRestoreRule$1.evaluate(SystemPropertiesRestoreRule.java:53)
	at org.apache.lucene.util.AbstractBeforeAfterRule$1.evaluate(AbstractBeforeAfterRule.java:46)
	at org.apache.lucene.util.TestRuleStoreClassName$1.evaluate(TestRuleStoreClassName.java:42)
	at com.carrotsearch.randomizedtesting.rules.SystemPropertiesInvariantRule$1.evaluate(SystemPropertiesInvariantRule.java:55)
	at com.carrotsearch.randomizedtesting.rules.NoShadowingOrOverridesOnMethodsRule$1.evaluate(NoShadowingOrOverridesOnMethodsRule.java:39)
	at com.carrotsearch.randomizedtesting.rules.NoShadowingOrOverridesOnMethodsRule$1.evaluate(NoShadowingOrOverridesOnMethodsRule.java:39)
	at com.carrotsearch.randomizedtesting.rules.StatementAdapter.evaluate(StatementAdapter.java:36)
	at org.apache.lucene.util.TestRuleAssertionsRequired$1.evaluate(TestRuleAssertionsRequired.java:43)
	at org.apache.lucene.util.TestRuleMarkFailure$1.evaluate(TestRuleMarkFailure.java:48)
	at org.apache.lucene.util.TestRuleIgnoreAfterMaxFailures$1.evaluate(TestRuleIgnoreAfterMaxFailures.java:70)
	at org.apache.lucene.util.TestRuleIgnoreTestSuites$1.evaluate(TestRuleIgnoreTestSuites.java:55)
	at com.carrotsearch.randomizedtesting.rules.StatementAdapter.evaluate(StatementAdapter.java:36)
	at com.carrotsearch.randomizedtesting.ThreadLeakControl$StatementRunner.run(ThreadLeakControl.java:358)
	at java.lang.Thread.run(Thread.java:722)




Build Log:
[...truncated 9054 lines...]
[junit4:junit4] Suite: org.apache.solr.handler.TestReplicationHandler
[junit4:junit4]   2> 5 T2761 oas.SolrTestCaseJ4.setUp ###Starting doTestIndexAndConfigAliasReplication
[junit4:junit4]   2> 29 T2761 oejs.Server.doStart jetty-8.1.8.v20121106
[junit4:junit4]   2> 32 T2761 oejs.AbstractConnector.doStart Started SelectChannelConnector@127.0.0.1:59436
[junit4:junit4]   2> 32 T2761 oass.SolrDispatchFilter.init SolrDispatchFilter.init()
[junit4:junit4]   2> 34 T2761 oasc.SolrResourceLoader.locateSolrHome JNDI not configured for solr (NoInitialContextEx)
[junit4:junit4]   2> 34 T2761 oasc.SolrResourceLoader.locateSolrHome using system property solr.solr.home: .\org.apache.solr.handler.TestReplicationHandler$SolrInstance-1361649724667\master
[junit4:junit4]   2> 35 T2761 oasc.CoreContainer$Initializer.initialize looking for solr.xml: C:\Users\JenkinsSlave\workspace\Lucene-Solr-trunk-Windows\solr\build\solr-core\test\J0\.\org.apache.solr.handler.TestReplicationHandler$SolrInstance-1361649724667\master\solr.xml
[junit4:junit4]   2> 35 T2761 oasc.CoreContainer.<init> New CoreContainer 1148004937
[junit4:junit4]   2> 36 T2761 oasc.CoreContainer$Initializer.initialize no solr.xml file found - using default
[junit4:junit4]   2> 38 T2761 oasc.CoreContainer.load Loading CoreContainer using Solr Home: '.\org.apache.solr.handler.TestReplicationHandler$SolrInstance-1361649724667\master\'
[junit4:junit4]   2> 38 T2761 oasc.SolrResourceLoader.<init> new SolrResourceLoader for directory: '.\org.apache.solr.handler.TestReplicationHandler$SolrInstance-1361649724667\master\'
[junit4:junit4]   2> 88 T2761 oashc.HttpShardHandlerFactory.getParameter Setting socketTimeout to: 0
[junit4:junit4]   2> 89 T2761 oashc.HttpShardHandlerFactory.getParameter Setting urlScheme to: http://
[junit4:junit4]   2> 89 T2761 oashc.HttpShardHandlerFactory.getParameter Setting connTimeout to: 0
[junit4:junit4]   2> 89 T2761 oashc.HttpShardHandlerFactory.getParameter Setting maxConnectionsPerHost to: 20
[junit4:junit4]   2> 90 T2761 oashc.HttpShardHandlerFactory.getParameter Setting corePoolSize to: 0
[junit4:junit4]   2> 90 T2761 oashc.HttpShardHandlerFactory.getParameter Setting maximumPoolSize to: 2147483647
[junit4:junit4]   2> 91 T2761 oashc.HttpShardHandlerFactory.getParameter Setting maxThreadIdleTime to: 5
[junit4:junit4]   2> 91 T2761 oashc.HttpShardHandlerFactory.getParameter Setting sizeOfQueue to: -1
[junit4:junit4]   2> 91 T2761 oashc.HttpShardHandlerFactory.getParameter Setting fairnessPolicy to: false
[junit4:junit4]   2> 92 T2761 oascsi.HttpClientUtil.createClient Creating new http client, config:maxConnectionsPerHost=20&maxConnections=10000&socketTimeout=0&connTimeout=0&retry=false
[junit4:junit4]   2> 107 T2761 oasc.CoreContainer.load Registering Log Listener
[junit4:junit4]   2> 135 T2771 oasc.CoreContainer.create Creating SolrCore 'collection1' using instanceDir: .\org.apache.solr.handler.TestReplicationHandler$SolrInstance-1361649724667\master\collection1
[junit4:junit4]   2> 137 T2771 oasc.SolrResourceLoader.<init> new SolrResourceLoader for directory: '.\org.apache.solr.handler.TestReplicationHandler$SolrInstance-1361649724667\master\collection1\'
[junit4:junit4]   2> 184 T2771 oasc.SolrConfig.<init> Using Lucene MatchVersion: LUCENE_50
[junit4:junit4]   2> 246 T2771 oasc.SolrConfig.<init> Loaded SolrConfig: solrconfig.xml
[junit4:junit4]   2> 246 T2771 oass.IndexSchema.readSchema Reading Solr Schema
[junit4:junit4]   2> 250 T2771 oass.IndexSchema.readSchema Schema name=test
[junit4:junit4]   2> 274 T2771 oass.IndexSchema.readSchema unique key field: id
[junit4:junit4]   2> 275 T2771 oasc.SolrCore.<init> [collection1] Opening new SolrCore at .\org.apache.solr.handler.TestReplicationHandler$SolrInstance-1361649724667\master\collection1\, dataDir=.\org.apache.solr.handler.TestReplicationHandler$SolrInstance-1361649724667\master\collection1\data\
[junit4:junit4]   2> 275 T2771 oasc.SolrCore.<init> JMX monitoring not detected for core: collection1
[junit4:junit4]   2> 276 T2771 oasc.SolrCore.initDirectoryFactory org.apache.solr.core.MockDirectoryFactory
[junit4:junit4]   2> 276 T2771 oasc.CachingDirectoryFactory.get return new directory for C:\Users\JenkinsSlave\workspace\Lucene-Solr-trunk-Windows\solr\build\solr-core\test\J0\.\org.apache.solr.handler.TestReplicationHandler$SolrInstance-1361649724667\master\collection1\data forceNew:false
[junit4:junit4]   2> 277 T2771 oasc.CachingDirectoryFactory.close Releasing directory:C:\Users\JenkinsSlave\workspace\Lucene-Solr-trunk-Windows\solr\build\solr-core\test\J0\.\org.apache.solr.handler.TestReplicationHandler$SolrInstance-1361649724667\master\collection1\data
[junit4:junit4]   2> 277 T2771 oasc.SolrCore.getNewIndexDir New index directory detected: old=null new=.\org.apache.solr.handler.TestReplicationHandler$SolrInstance-1361649724667\master\collection1\data\index/
[junit4:junit4]   2> 278 T2771 oasc.SolrCore.initIndex WARNING [collection1] Solr index directory '.\org.apache.solr.handler.TestReplicationHandler$SolrInstance-1361649724667\master\collection1\data\index' doesn't exist. Creating new index...
[junit4:junit4]   2> 279 T2771 oasc.CachingDirectoryFactory.get return new directory for C:\Users\JenkinsSlave\workspace\Lucene-Solr-trunk-Windows\solr\build\solr-core\test\J0\.\org.apache.solr.handler.TestReplicationHandler$SolrInstance-1361649724667\master\collection1\data\index forceNew:false
[junit4:junit4]   2> 280 T2771 oasc.SolrDeletionPolicy.onCommit SolrDeletionPolicy.onCommit: commits:num=1
[junit4:junit4]   2> 		commit{dir=MockDirWrapper(org.apache.lucene.store.RAMDirectory@6eb02dc4 lockFactory=org.apache.lucene.store.SingleInstanceLockFactory@2ea0c4c1),segFN=segments_1,generation=1,filenames=[segments_1]
[junit4:junit4]   2> 281 T2771 oasc.SolrDeletionPolicy.updateCommits newest commit = 1[segments_1]
[junit4:junit4]   2> 281 T2771 oasc.CachingDirectoryFactory.close Releasing directory:C:\Users\JenkinsSlave\workspace\Lucene-Solr-trunk-Windows\solr\build\solr-core\test\J0\.\org.apache.solr.handler.TestReplicationHandler$SolrInstance-1361649724667\master\collection1\data\index
[junit4:junit4]   2> 282 T2771 oasc.RequestHandlers.initHandlersFromConfig created standard: solr.StandardRequestHandler
[junit4:junit4]   2> 282 T2771 oasc.RequestHandlers.initHandlersFromConfig created /replication: solr.ReplicationHandler
[junit4:junit4]   2> 282 T2771 oasc.RequestHandlers.initHandlersFromConfig created defaults: solr.StandardRequestHandler
[junit4:junit4]   2> 282 T2771 oasc.RequestHandlers.initHandlersFromConfig adding lazy requestHandler: solr.StandardRequestHandler
[junit4:junit4]   2> 284 T2771 oasc.RequestHandlers.initHandlersFromConfig created lazy: solr.StandardRequestHandler
[junit4:junit4]   2> 284 T2771 oasc.RequestHandlers.initHandlersFromConfig created /update: solr.UpdateRequestHandler
[junit4:junit4]   2> 293 T2771 oashl.XMLLoader.init xsltCacheLifetimeSeconds=60
[junit4:junit4]   2> 296 T2771 oasc.CachingDirectoryFactory.close Releasing directory:C:\Users\JenkinsSlave\workspace\Lucene-Solr-trunk-Windows\solr\build\solr-core\test\J0\.\org.apache.solr.handler.TestReplicationHandler$SolrInstance-1361649724667\master\collection1\data
[junit4:junit4]   2> 297 T2771 oass.SolrIndexSearcher.<init> Opening Searcher@7f74012f main
[junit4:junit4]   2> 297 T2771 oasu.CommitTracker.<init> Hard AutoCommit: disabled
[junit4:junit4]   2> 297 T2771 oasu.CommitTracker.<init> Soft AutoCommit: disabled
[junit4:junit4]   2> 300 T2771 oash.ReplicationHandler.inform Replication enabled for following config files: schema.xml,xslt/dummy.xsl
[junit4:junit4]   2> 300 T2771 oash.ReplicationHandler.inform Commits will be reserved for  10000
[junit4:junit4]   2> 300 T2771 oasc.CoreContainer.registerCore registering core: collection1
[junit4:junit4]   2> 300 T2772 oasc.SolrCore.registerSearcher [collection1] Registered new searcher Searcher@7f74012f main{StandardDirectoryReader(segments_1:1)}
[junit4:junit4]   2> 301 T2761 oass.SolrDispatchFilter.init user.dir=C:\Users\JenkinsSlave\workspace\Lucene-Solr-trunk-Windows\solr\build\solr-core\test\J0
[junit4:junit4]   2> 301 T2761 oass.SolrDispatchFilter.init SolrDispatchFilter.init() done
[junit4:junit4]   2> 301 T2761 oascsi.HttpClientUtil.createClient Creating new http client, config:maxConnections=128&maxConnectionsPerHost=32&followRedirects=false
[junit4:junit4]   2> 318 T2761 oejs.Server.doStart jetty-8.1.8.v20121106
[junit4:junit4]   2> 320 T2761 oejs.AbstractConnector.doStart Started SelectChannelConnector@127.0.0.1:59439
[junit4:junit4]   2> 322 T2761 oass.SolrDispatchFilter.init SolrDispatchFilter.init()
[junit4:junit4]   2> 322 T2761 oasc.SolrResourceLoader.locateSolrHome JNDI not configured for solr (NoInitialContextEx)
[junit4:junit4]   2> 322 T2761 oasc.SolrResourceLoader.locateSolrHome using system property solr.solr.home: .\org.apache.solr.handler.TestReplicationHandler$SolrInstance-1361649724966\slave
[junit4:junit4]   2> 323 T2761 oasc.CoreContainer$Initializer.initialize looking for solr.xml: C:\Users\JenkinsSlave\workspace\Lucene-Solr-trunk-Windows\solr\build\solr-core\test\J0\.\org.apache.solr.handler.TestReplicationHandler$SolrInstance-1361649724966\slave\solr.xml
[junit4:junit4]   2> 323 T2761 oasc.CoreContainer.<init> New CoreContainer 1709626418
[junit4:junit4]   2> 325 T2761 oasc.CoreContainer$Initializer.initialize no solr.xml file found - using default
[junit4:junit4]   2> 325 T2761 oasc.CoreContainer.load Loading CoreContainer using Solr Home: '.\org.apache.solr.handler.TestReplicationHandler$SolrInstance-1361649724966\slave\'
[junit4:junit4]   2> 326 T2761 oasc.SolrResourceLoader.<init> new SolrResourceLoader for directory: '.\org.apache.solr.handler.TestReplicationHandler$SolrInstance-1361649724966\slave\'
[junit4:junit4]   2> 349 T2761 oashc.HttpShardHandlerFactory.getParameter Setting socketTimeout to: 0
[junit4:junit4]   2> 350 T2761 oashc.HttpShardHandlerFactory.getParameter Setting urlScheme to: http://
[junit4:junit4]   2> 350 T2761 oashc.HttpShardHandlerFactory.getParameter Setting connTimeout to: 0
[junit4:junit4]   2> 351 T2761 oashc.HttpShardHandlerFactory.getParameter Setting maxConnectionsPerHost to: 20
[junit4:junit4]   2> 351 T2761 oashc.HttpShardHandlerFactory.getParameter Setting corePoolSize to: 0
[junit4:junit4]   2> 352 T2761 oashc.HttpShardHandlerFactory.getParameter Setting maximumPoolSize to: 2147483647
[junit4:junit4]   2> 352 T2761 oashc.HttpShardHandlerFactory.getParameter Setting maxThreadIdleTime to: 5
[junit4:junit4]   2> 352 T2761 oashc.HttpShardHandlerFactory.getParameter Setting sizeOfQueue to: -1
[junit4:junit4]   2> 353 T2761 oashc.HttpShardHandlerFactory.getParameter Setting fairnessPolicy to: false
[junit4:junit4]   2> 353 T2761 oascsi.HttpClientUtil.createClient Creating new http client, config:maxConnectionsPerHost=20&maxConnections=10000&socketTimeout=0&connTimeout=0&retry=false
[junit4:junit4]   2> 365 T2761 oasc.CoreContainer.load Registering Log Listener
[junit4:junit4]   2> 396 T2782 oasc.CoreContainer.create Creating SolrCore 'collection1' using instanceDir: .\org.apache.solr.handler.TestReplicationHandler$SolrInstance-1361649724966\slave\collection1
[junit4:junit4]   2> 398 T2782 oasc.SolrResourceLoader.<init> new SolrResourceLoader for directory: '.\org.apache.solr.handler.TestReplicationHandler$SolrInstance-1361649724966\slave\collection1\'
[junit4:junit4]   2> 447 T2782 oasc.SolrConfig.<init> Using Lucene MatchVersion: LUCENE_50
[junit4:junit4]   2> 505 T2782 oasc.SolrConfig.<init> Loaded SolrConfig: solrconfig.xml
[junit4:junit4]   2> 505 T2782 oass.IndexSchema.readSchema Reading Solr Schema
[junit4:junit4]   2> 509 T2782 oass.IndexSchema.readSchema Schema name=test
[junit4:junit4]   2> 530 T2782 oass.IndexSchema.readSchema unique key field: id
[junit4:junit4]   2> 531 T2782 oasc.SolrCore.<init> [collection1] Opening new SolrCore at .\org.apache.solr.handler.TestReplicationHandler$SolrInstance-1361649724966\slave\collection1\, dataDir=.\org.apache.solr.handler.TestReplicationHandler$SolrInstance-1361649724966\slave\collection1\data\
[junit4:junit4]   2> 532 T2782 oasc.SolrCore.<init> JMX monitoring not detected for core: collection1
[junit4:junit4]   2> 532 T2782 oasc.SolrCore.initDirectoryFactory org.apache.solr.core.MockDirectoryFactory
[junit4:junit4]   2> 532 T2782 oasc.CachingDirectoryFactory.get return new directory for C:\Users\JenkinsSlave\workspace\Lucene-Solr-trunk-Windows\solr\build\solr-core\test\J0\.\org.apache.solr.handler.TestReplicationHandler$SolrInstance-1361649724966\slave\collection1\data forceNew:false
[junit4:junit4]   2> 533 T2782 oasc.CachingDirectoryFactory.close Releasing directory:C:\Users\JenkinsSlave\workspace\Lucene-Solr-trunk-Windows\solr\build\solr-core\test\J0\.\org.apache.solr.handler.TestReplicationHandler$SolrInstance-1361649724966\slave\collection1\data
[junit4:junit4]   2> 533 T2782 oasc.SolrCore.getNewIndexDir New index directory detected: old=null new=.\org.apache.solr.handler.TestReplicationHandler$SolrInstance-1361649724966\slave\collection1\data\index/
[junit4:junit4]   2> 534 T2782 oasc.SolrCore.initIndex WARNING [collection1] Solr index directory '.\org.apache.solr.handler.TestReplicationHandler$SolrInstance-1361649724966\slave\collection1\data\index' doesn't exist. Creating new index...
[junit4:junit4]   2> 536 T2782 oasc.CachingDirectoryFactory.get return new directory for C:\Users\JenkinsSlave\workspace\Lucene-Solr-trunk-Windows\solr\build\solr-core\test\J0\.\org.apache.solr.handler.TestReplicationHandler$SolrInstance-1361649724966\slave\collection1\data\index forceNew:false
[junit4:junit4]   2> 537 T2782 oasc.SolrDeletionPolicy.onCommit SolrDeletionPolicy.onCommit: commits:num=1
[junit4:junit4]   2> 		commit{dir=MockDirWrapper(org.apache.lucene.store.RAMDirectory@3445cbe2 lockFactory=org.apache.lucene.store.SingleInstanceLockFactory@1bb25a01),segFN=segments_1,generation=1,filenames=[segments_1]
[junit4:junit4]   2> 537 T2782 oasc.SolrDeletionPolicy.updateCommits newest commit = 1[segments_1]
[junit4:junit4]   2> 537 T2782 oasc.CachingDirectoryFactory.close Releasing directory:C:\Users\JenkinsSlave\workspace\Lucene-Solr-trunk-Windows\solr\build\solr-core\test\J0\.\org.apache.solr.handler.TestReplicationHandler$SolrInstance-1361649724966\slave\collection1\data\index
[junit4:junit4]   2> 538 T2782 oasc.RequestHandlers.initHandlersFromConfig created standard: solr.StandardRequestHandler
[junit4:junit4]   2> 538 T2782 oasc.RequestHandlers.initHandlersFromConfig created defaults: solr.StandardRequestHandler
[junit4:junit4]   2> 538 T2782 oasc.RequestHandlers.initHandlersFromConfig adding lazy requestHandler: solr.StandardRequestHandler
[junit4:junit4]   2> 539 T2782 oasc.RequestHandlers.initHandlersFromConfig created lazy: solr.StandardRequestHandler
[junit4:junit4]   2> 539 T2782 oasc.RequestHandlers.initHandlersFromConfig created /update: solr.UpdateRequestHandler
[junit4:junit4]   2> 539 T2782 oasc.RequestHandlers.initHandlersFromConfig created /replication: solr.ReplicationHandler
[junit4:junit4]   2> 541 T2782 oashl.XMLLoader.init xsltCacheLifetimeSeconds=60
[junit4:junit4]   2> 545 T2782 oasc.CachingDirectoryFactory.close Releasing directory:C:\Users\JenkinsSlave\workspace\Lucene-Solr-trunk-Windows\solr\build\solr-core\test\J0\.\org.apache.solr.handler.TestReplicationHandler$SolrInstance-1361649724966\slave\collection1\data
[junit4:junit4]   2> 546 T2782 oass.SolrIndexSearcher.<init> Opening Searcher@2b8efe79 main
[junit4:junit4]   2> 546 T2782 oasu.CommitTracker.<init> Hard AutoCommit: disabled
[junit4:junit4]   2> 546 T2782 oasu.CommitTracker.<init> Soft AutoCommit: disabled
[junit4:junit4]   2> 547 T2782 oash.SnapPuller.startExecutorService Poll Scheduled at an interval of 1000ms
[junit4:junit4]   2> 547 T2782 oasc.CoreContainer.registerCore registering core: collection1
[junit4:junit4]   2> 547 T2783 oasc.SolrCore.registerSearcher [collection1] Registered new searcher Searcher@2b8efe79 main{StandardDirectoryReader(segments_1:1)}
[junit4:junit4]   2> 547 T2761 oass.SolrDispatchFilter.init user.dir=C:\Users\JenkinsSlave\workspace\Lucene-Solr-trunk-Windows\solr\build\solr-core\test\J0
[junit4:junit4]   2> 547 T2761 oass.SolrDispatchFilter.init SolrDispatchFilter.init() done
[junit4:junit4]   2> 547 T2761 oascsi.HttpClientUtil.createClient Creating new http client, config:maxConnections=128&maxConnectionsPerHost=32&followRedirects=false
[junit4:junit4]   2> ASYNC  NEW_CORE C175 name=collection1 org.apache.solr.core.SolrCore@8730a7a
[junit4:junit4]   2> 562 T2769 C175 REQ [collection1] webapp=/solr path=/select params={q=*:*&wt=javabin&version=2} hits=0 status=0 QTime=1 
[junit4:junit4]   2> 567 T2764 C175 oasc.CachingDirectoryFactory.close Releasing directory:C:\Users\JenkinsSlave\workspace\Lucene-Solr-trunk-Windows\solr\build\solr-core\test\J0\.\org.apache.solr.handler.TestReplicationHandler$SolrInstance-1361649724667\master\collection1\data
[junit4:junit4]   2> 568 T2764 C175 oasc.SolrDeletionPolicy.onInit SolrDeletionPolicy.onInit: commits:num=1
[junit4:junit4]   2> 		commit{dir=MockDirWrapper(org.apache.lucene.store.RAMDirectory@6eb02dc4 lockFactory=org.apache.lucene.store.SingleInstanceLockFactory@2ea0c4c1),segFN=segments_1,generation=1,filenames=[segments_1]
[junit4:junit4]   2> 569 T2764 C175 oasc.SolrDeletionPolicy.updateCommits newest commit = 1[segments_1]
[junit4:junit4]   2> 569 T2764 C175 UPDATE [collection1] webapp=/solr path=/update params={wt=javabin&version=2} {add=[0]} 0 3
[junit4:junit4]   2> 575 T2766 C175 UPDATE [collection1] webapp=/solr path=/update params={wt=javabin&version=2} {add=[1]} 0 1
[junit4:junit4]   2> 578 T2768 C175 UPDATE [collection1] webapp=/solr path=/update params={wt=javabin&version=2} {add=[2]} 0 0
[junit4:junit4]   2> 581 T2770 C175 UPDATE [collection1] webapp=/solr path=/update params={wt=javabin&version=2} {add=[3]} 0 0
[junit4:junit4]   2> 584 T2765 C175 UPDATE [collection1] webapp=/solr path=/update params={wt=javabin&version=2} {add=[4]} 0 0
[junit4:junit4]   2> 589 T2769 C175 UPDATE [collection1] webapp=/solr path=/update params={wt=javabin&version=2} {add=[5]} 0 0
[junit4:junit4]   2> 592 T2764 C175 UPDATE [collection1] webapp=/solr path=/update params={wt=javabin&version=2} {add=[6]} 0 0
[junit4:junit4]   2> 595 T2766 C175 UPDATE [collection1] webapp=/solr path=/update params={wt=javabin&version=2} {add=[7]} 0 0
[junit4:junit4]   2> 598 T2768 C175 UPDATE [collection1] webapp=/solr path=/update params={wt=javabin&version=2} {add=[8]} 0 0
[junit4:junit4]   2> 601 T2770 C175 UPDATE [collection1] webapp=/solr path=/update params={wt=javabin&version=2} {add=[9]} 0 0
[junit4:junit4]   2> 605 T2765 C175 UPDATE [collection1] webapp=/solr path=/update params={wt=javabin&version=2} {add=[10]} 0 0
[junit4:junit4]   2> 608 T2769 C175 UPDATE [collection1] webapp=/solr path=/update params={wt=javabin&version=2} {add=[11]} 0 0
[junit4:junit4]   2> 611 T2764 C175 UPDATE [collection1] webapp=/solr path=/update params={wt=javabin&version=2} {add=[12]} 0 0
[junit4:junit4]   2> 614 T2766 C175 UPDATE [collection1] webapp=/solr path=/update params={wt=javabin&version=2} {add=[13]} 0 0
[junit4:junit4]   2> 618 T2768 C175 UPDATE [collection1] webapp=/solr path=/update params={wt=javabin&version=2} {add=[14]} 0 0
[junit4:junit4]   2> 621 T2770 C175 UPDATE [collection1] webapp=/solr path=/update params={wt=javabin&version=2} {add=[15]} 0 0
[junit4:junit4]   2> 624 T2765 C175 UPDATE [collection1] webapp=/solr path=/update params={wt=javabin&version=2} {add=[16]} 0 0
[junit4:junit4]   2> 628 T2769 C175 UPDATE [collection1] webapp=/solr path=/update params={wt=javabin&version=2} {add=[17]} 0 0
[junit4:junit4]   2> 632 T2764 C175 UPDATE [collection1] webapp=/solr path=/update params={wt=javabin&version=2} {add=[18]} 0 0
[junit4:junit4]   2> 635 T2766 C175 UPDATE [collection1] webapp=/solr path=/update params={wt=javabin&version=2} {add=[19]} 0 0
[junit4:junit4]   2> 638 T2768 C175 UPDATE [collection1] webapp=/solr path=/update params={wt=javabin&version=2} {add=[20]} 0 0
[junit4:junit4]   2> 641 T2770 C175 UPDATE [collection1] webapp=/solr path=/update params={wt=javabin&version=2} {add=[21]} 0 0
[junit4:junit4]   2> 646 T2765 C175 UPDATE [collection1] webapp=/solr path=/update params={wt=javabin&version=2} {add=[22]} 0 0
[junit4:junit4]   2> 649 T2769 C175 UPDATE [collection1] webapp=/solr path=/update params={wt=javabin&version=2} {add=[23]} 0 0
[junit4:junit4]   2> 652 T2764 C175 UPDATE [collection1] webapp=/solr path=/update params={wt=javabin&version=2} {add=[24]} 0 0
[junit4:junit4]   2> 655 T2766 C175 UPDATE [collection1] webapp=/solr path=/update params={wt=javabin&version=2} {add=[25]} 0 0
[junit4:junit4]   2> 659 T2768 C175 UPDATE [collection1] webapp=/solr path=/update params={wt=javabin&version=2} {add=[26]} 0 0
[junit4:junit4]   2> 663 T2770 C175 UPDATE [collection1] webapp=/solr path=/update params={wt=javabin&version=2} {add=[27]} 0 0
[junit4:junit4]   2> 666 T2765 C175 UPDATE [collection1] webapp=/solr path=/update params={wt=javabin&version=2} {add=[28]} 0 0
[junit4:junit4]   2> 669 T2769 C175 UPDATE [collection1] webapp=/solr path=/update params={wt=javabin&version=2} {add=[29]} 0 0
[junit4:junit4]   2> 672 T2764 C175 UPDATE [collection1] webapp=/solr path=/update params={wt=javabin&version=2} {add=[30]} 0 0
[junit4:junit4]   2> 676 T2766 C175 UPDATE [collection1] webapp=/solr path=/update params={wt=javabin&version=2} {add=[31]} 0 0
[junit4:junit4]   2> 679 T2768 C175 UPDATE [collection1] webapp=/solr path=/update params={wt=javabin&version=2} {add=[32]} 0 0
[junit4:junit4]   2> 682 T2770 C175 UPDATE [collection1] webapp=/solr path=/update params={wt=javabin&version=2} {add=[33]} 0 0
[junit4:junit4]   2> 686 T2765 C175 UPDATE [collection1] webapp=/solr path=/update params={wt=javabin&version=2} {add=[34]} 0 0
[junit4:junit4]   2> 690 T2769 C175 UPDATE [collection1] webapp=/solr path=/update params={wt=javabin&version=2} {add=[35]} 0 0
[junit4:junit4]   2> 693 T2764 C175 UPDATE [collection1] webapp=/solr path=/update params={wt=javabin&version=2} {add=[36]} 0 0
[junit4:junit4]   2> 697 T2766 C175 UPDATE [collection1] webapp=/solr path=/update params={wt=javabin&version=2} {add=[37]} 0 0
[junit4:junit4]   2> 700 T2768 C175 UPDATE [collection1] webapp=/solr path=/update params={wt=javabin&version=2} {add=[38]} 0 0
[junit4:junit4]   2> 704 T2770 C175 UPDATE [collection1] webapp=/solr path=/update params={wt=javabin&version=2} {add=[39]} 0 0
[junit4:junit4]   2> 707 T2765 C175 UPDATE [collection1] webapp=/solr path=/update params={wt=javabin&version=2} {add=[40]} 0 0
[junit4:junit4]   2> 710 T2769 C175 UPDATE [collection1] webapp=/solr path=/update params={wt=javabin&version=2} {add=[41]} 0 0
[junit4:junit4]   2> 713 T2764 C175 UPDATE [collection1] webapp=/solr path=/update params={wt=javabin&version=2} {add=[42]} 0 0
[junit4:junit4]   2> 716 T2766 C175 UPDATE [collection1] webapp=/solr path=/update params={wt=javabin&version=2} {add=[43]} 0 0
[junit4:junit4]   2> 721 T2768 C175 UPDATE [collection1] webapp=/solr path=/update params={wt=javabin&version=2} {add=[44]} 0 0
[junit4:junit4]   2> 724 T2770 C175 UPDATE [collection1] webapp=/solr path=/update params={wt=javabin&version=2} {add=[45]} 0 0
[junit4:junit4]   2> 727 T2765 C175 UPDATE [collection1] webapp=/solr path=/update params={wt=javabin&version=2} {add=[46]} 0 0
[junit4:junit4]   2> 730 T2769 C175 UPDATE [collection1] webapp=/solr path=/update params={wt=javabin&version=2} {add=[47]} 0 0
[junit4:junit4]   2> 734 T2764 C175 UPDATE [collection1] webapp=/solr path=/update params={wt=javabin&version=2} {add=[48]} 0 0
[junit4:junit4]   2> 737 T2766 C175 UPDATE [collection1] webapp=/solr path=/update params={wt=javabin&version=2} {add=[49]} 0 0
[junit4:junit4]   2> 741 T2768 C175 UPDATE [collection1] webapp=/solr path=/update params={wt=javabin&version=2} {add=[50]} 0 0
[junit4:junit4]   2> 744 T2770 C175 UPDATE [collection1] webapp=/solr path=/update params={wt=javabin&version=2} {add=[51]} 0 0
[junit4:junit4]   2> 748 T2765 C175 UPDATE [collection1] webapp=/solr path=/update params={wt=javabin&version=2} {add=[52]} 0 0
[junit4:junit4]   2> 751 T2769 C175 UPDATE [collection1] webapp=/solr path=/update params={wt=javabin&version=2} {add=[53]} 0 0
[junit4:junit4]   2> 754 T2764 C175 UPDATE [collection1] webapp=/solr path=/update params={wt=javabin&version=2} {add=[54]} 0 0
[junit4:junit4]   2> 757 T2766 C175 UPDATE [collection1] webapp=/solr path=/update params={wt=javabin&version=2} {add=[55]} 0 0
[junit4:junit4]   2> 760 T2768 C175 UPDATE [collection1] webapp=/solr path=/update params={wt=javabin&version=2} {add=[56]} 0 0
[junit4:junit4]   2> 764 T2770 C175 UPDATE [collection1] webapp=/solr path=/update params={wt=javabin&version=2} {add=[57]} 0 0
[junit4:junit4]   2> 768 T2765 C175 UPDATE [collection1] webapp=/solr path=/update params={wt=javabin&version=2} {add=[58]} 0 0
[junit4:junit4]   2> 771 T2769 C175 UPDATE [collection1] webapp=/solr path=/update params={wt=javabin&version=2} {add=[59]} 0 0
[junit4:junit4]   2> 774 T2764 C175 UPDATE [collection1] webapp=/solr path=/update params={wt=javabin&version=2} {add=[60]} 0 0
[junit4:junit4]   2> 778 T2766 C175 UPDATE [collection1] webapp=/solr path=/update params={wt=javabin&version=2} {add=[61]} 0 0
[junit4:junit4]   2> 781 T2768 C175 UPDATE [collection1] webapp=/solr path=/update params={wt=javabin&version=2} {add=[62]} 0 0
[junit4:junit4]   2> 784 T2770 C175 UPDATE [collection1] webapp=/solr path=/update params={wt=javabin&version=2} {add=[63]} 0 0
[junit4:junit4]   2> 788 T2765 C175 UPDATE [collection1] webapp=/solr path=/update params={wt=javabin&version=2} {add=[64]} 0 0
[junit4:junit4]   2> 791 T2769 C175 UPDATE [collection1] webapp=/solr path=/update params={wt=javabin&version=2} {add=[65]} 0 0
[junit4:junit4]   2> 794 T2764 C175 UPDATE [collection1] webapp=/solr path=/update params={wt=javabin&version=2} {add=[66]} 0 0
[junit4:junit4]   2> 798 T2766 C175 UPDATE [collection1] webapp=/solr path=/update params={wt=javabin&version=2} {add=[67]} 0 0
[junit4:junit4]   2> 800 T2768 C175 UPDATE [collection1] webapp=/solr path=/update params={wt=javabin&version=2} {add=[68]} 0 0
[junit4:junit4]   2> 803 T2770 C175 UPDATE [collection1] webapp=/solr path=/update params={wt=javabin&version=2} {add=[69]} 0 0
[junit4:junit4]   2> 807 T2765 C175 UPDATE [collection1] webapp=/solr path=/update params={wt=javabin&version=2} {add=[70]} 0 0
[junit4:junit4]   2> 810 T2769 C175 UPDATE [collection1] webapp=/solr path=/update params={wt=javabin&version=2} {add=[71]} 0 0
[junit4:junit4]   2> 813 T2764 C175 UPDATE [collection1] webapp=/solr path=/update params={wt=javabin&version=2} {add=[72]} 0 0
[junit4:junit4]   2> 816 T2766 C175 UPDATE [collection1] webapp=/solr path=/update params={wt=javabin&version=2} {add=[73]} 0 0
[junit4:junit4]   2> 820 T2768 C175 UPDATE [collection1] webapp=/solr path=/update params={wt=javabin&version=2} {add=[74]} 0 0
[junit4:junit4]   2> 823 T2770 C175 UPDATE [collection1] webapp=/solr path=/update params={wt=javabin&version=2} {add=[75]} 0 0
[junit4:junit4]   2> 827 T2765 C175 UPDATE [collection1] webapp=/solr path=/update params={wt=javabin&version=2} {add=[76]} 0 0
[junit4:junit4]   2> 830 T2769 C175 UPDATE [collection1] webapp=/solr path=/update params={wt=javabin&version=2} {add=[77]} 0 0
[junit4:junit4]   2> 834 T2764 C175 UPDATE [collection1] webapp=/solr path=/update params={wt=javabin&version=2} {add=[78]} 0 0
[junit4:junit4]   2> 837 T2766 C175 UPDATE [collection1] webapp=/solr path=/update params={wt=javabin&version=2} {add=[79]} 0 0
[junit4:junit4]   2> 841 T2768 C175 UPDATE [collection1] webapp=/solr path=/update params={wt=javabin&version=2} {add=[80]} 0 0
[junit4:junit4]   2> 844 T2770 C175 UPDATE [collection1] webapp=/solr path=/update params={wt=javabin&version=2} {add=[81]} 0 0
[junit4:junit4]   2> 847 T2765 C175 UPDATE [collection1] webapp=/solr path=/update params={wt=javabin&version=2} {add=[82]} 0 0
[junit4:junit4]   2> 851 T2769 C175 UPDATE [collection1] webapp=/solr path=/update params={wt=javabin&version=2} {add=[83]} 0 0
[junit4:junit4]   2> 854 T2764 C175 UPDATE [collection1] webapp=/solr path=/update params={wt=javabin&version=2} {add=[84]} 0 0
[junit4:junit4]   2> 857 T2766 C175 UPDATE [collection1] webapp=/solr path=/update params={wt=javabin&version=2} {add=[85]} 0 0
[junit4:junit4]   2> 860 T2768 C175 UPDATE [collection1] webapp=/solr path=/update params={wt=javabin&version=2} {add=[86]} 0 0
[junit4:junit4]   2> 864 T2770 C175 UPDATE [collection1] webapp=/solr path=/update params={wt=javabin&version=2} {add=[87]} 0 0
[junit4:junit4]   2> 867 T2765 C175 UPDATE [collection1] webapp=/solr path=/update params={wt=javabin&version=2} {add=[88]} 0 0
[junit4:junit4]   2> 870 T2769 C175 UPDATE [collection1] webapp=/solr path=/update params={wt=javabin&version=2} {add=[89]} 0 0
[junit4:junit4]   2> 874 T2764 C175 UPDATE [collection1] webapp=/solr path=/update params={wt=javabin&version=2} {add=[90]} 0 0
[junit4:junit4]   2> 878 T2768 C175 UPDATE [collection1] webapp=/solr path=/update params={wt=javabin&version=2} {add=[91]} 0 0
[junit4:junit4]   2> 881 T2770 C175 UPDATE [collection1] webapp=/solr path=/update params={wt=javabin&version=2} {add=[92]} 0 0
[junit4:junit4]   2> 885 T2765 C175 UPDATE [collection1] webapp=/solr path=/update params={wt=javabin&version=2} {add=[93]} 0 0
[junit4:junit4]   2> 888 T2769 C175 UPDATE [collection1] webapp=/solr path=/update params={wt=javabin&version=2} {add=[94]} 0 0
[junit4:junit4]   2> 893 T2766 C175 UPDATE [collection1] webapp=/solr path=/update params={wt=javabin&version=2} {add=[95]} 0 0
[junit4:junit4]   2> 897 T2764 C175 UPDATE [collection1] webapp=/solr path=/update params={wt=javabin&version=2} {add=[96]} 0 0
[junit4:junit4]   2> 900 T2768 C175 UPDATE [collection1] webapp=/solr path=/update params={wt=javabin&version=2} {add=[97]} 0 0
[junit4:junit4]   2> 903 T2770 C175 UPDATE [collection1] webapp=/solr path=/update params={wt=javabin&version=2} {add=[98]} 0 0
[junit4:junit4]   2> 908 T2765 C175 UPDATE [collection1] webapp=/solr path=/update params={wt=javabin&version=2} {add=[99]} 0 0
[junit4:junit4]   2> 911 T2769 C175 UPDATE [collection1] webapp=/solr path=/update params={wt=javabin&version=2} {add=[100]} 0 0
[junit4:junit4]   2> 915 T2766 C175 UPDATE [collection1] webapp=/solr path=/update params={wt=javabin&version=2} {add=[101]} 0 0
[junit4:junit4]   2> 918 T2764 C175 UPDATE [collection1] webapp=/solr path=/update params={wt=javabin&version=2} {add=[102]} 0 0
[junit4:junit4]   2> 922 T2768 C175 UPDATE [collection1] webapp=/solr path=/update params={wt=javabin&version=2} {add=[103]} 0 0
[junit4:junit4]   2> 925 T2770 C175 UPDATE [collection1] webapp=/solr path=/update params={wt=javabin&version=2} {add=[104]} 0 0
[junit4:junit4]   2> 929 T2765 C175 UPDATE [collection1] webapp=/solr path=/update params={wt=javabin&version=2} {add=[105]} 0 0
[junit4:junit4]   2> 932 T2769 C175 UPDATE [collection1] webapp=/solr path=/update params={wt=javabin&version=2} {add=[106]} 0 0
[junit4:junit4]   2> 937 T2766 C175 UPDATE [collection1] webapp=/solr path=/update params={wt=javabin&version=2} {add=[107]} 0 0
[junit4:junit4]   2> 940 T2764 C175 UPDATE [collection1] webapp=/solr path=/update params={wt=javabin&version=2} {add=[108]} 0 0
[junit4:junit4]   2> 943 T2768 C175 UPDATE [collection1] webapp=/solr path=/update params={wt=javabin&version=2} {add=[109]} 0 0
[junit4:junit4]   2> 946 T2770 C175 UPDATE [collection1] webapp=/solr path=/update params={wt=javabin&version=2} {add=[110]} 0 0
[junit4:junit4]   2> 950 T2765 C175 UPDATE [collection1] webapp=/solr path=/update params={wt=javabin&version=2} {add=[111]} 0 0
[junit4:junit4]   2> 953 T2769 C175 UPDATE [collection1] webapp=/solr path=/update params={wt=javabin&version=2} {add=[112]} 0 0
[junit4:junit4]   2> 956 T2766 C175 UPDATE [collection1] webapp=/solr path=/update params={wt=javabin&version=2} {add=[113]} 0 0
[junit4:junit4]   2> 959 T2764 C175 UPDATE [collection1] webapp=/solr path=/update params={wt=javabin&version=2} {add=[114]} 0 0
[junit4:junit4]   2> 962 T2768 C175 UPDATE [collection1] webapp=/solr path=/update params={wt=javabin&version=2} {add=[115]} 0 0
[junit4:junit4]   2> 966 T2770 C175 UPDATE [collection1] webapp=/solr path=/update params={wt=javabin&version=2} {add=[116]} 0 0
[junit4:junit4]   2> 969 T2765 C175 UPDATE [collection1] webapp=/solr path=/update params={wt=javabin&version=2} {add=[117]} 0 0
[junit4:junit4]   2> 973 T2769 C175 UPDATE [collection1] webapp=/solr path=/update params={wt=javabin&version=2} {add=[118]} 0 0
[junit4:junit4]   2> 976 T2766 C175 UPDATE [collection1] webapp=/solr path=/update params={wt=javabin&version=2} {add=[119]} 0 0
[junit4:junit4]   2> 980 T2764 C175 UPDATE [collection1] webapp=/solr path=/update params={wt=javabin&version=2} {add=[120]} 0 0
[junit4:junit4]   2> 983 T2768 C175 UPDATE [collection1] webapp=/solr path=/update params={wt=javabin&version=2} {add=[121]} 0 0
[junit4:junit4]   2> 986 T2770 C175 UPDATE [collection1] webapp=/solr path=/update params={wt=javabin&version=2} {add=[122]} 0 0
[junit4:junit4]   2> 989 T2765 C175 UPDATE [collection1] webapp=/solr path=/update params={wt=javabin&version=2} {add=[123]} 0 0
[junit4:junit4]   2> 992 T2769 C175 UPDATE [collection1] webapp=/solr path=/update params={wt=javabin&version=2} {add=[124]} 0 0
[junit4:junit4]   2> 996 T2766 C175 UPDATE [collection1] webapp=/solr path=/update params={wt=javabin&version=2} {add=[125]} 0 0
[junit4:junit4]   2> 999 T2764 C175 UPDATE [collection1] webapp=/solr path=/update params={wt=javabin&version=2} {add=[126]} 0 0
[junit4:junit4]   2> 1002 T2768 C175 UPDATE [collection1] webapp=/solr path=/update params={wt=javabin&version=2} {add=[127]} 0 0
[junit4:junit4]   2> 1005 T2770 C175 UPDATE [collection1] webapp=/solr path=/update params={wt=javabin&version=2} {add=[128]} 0 0
[junit4:junit4]   2> 1009 T2765 C175 UPDATE [collection1] webapp=/solr path=/update params={wt=javabin&version=2} {add=[129]} 0 0
[junit4:junit4]   2> 1013 T2769 C175 UPDATE [collection1] webapp=/solr path=/update params={wt=javabin&version=2} {add=[130]} 0 0
[junit4:junit4]   2> 1016 T2766 C175 UPDATE [collection1] webapp=/solr path=/update params={wt=javabin&version=2} {add=[131]} 0 0
[junit4:junit4]   2> 1020 T2764 C175 UPDATE [collection1] webapp=/solr path=/update params={wt=javabin&version=2} {add=[132]} 0 0
[junit4:junit4]   2> 1025 T2768 C175 UPDATE [collection1] webapp=/solr path=/update params={wt=javabin&version=2} {add=[133]} 0 0
[junit4:junit4]   2> 1028 T2770 C175 UPDATE [collection1] webapp=/solr path=/update params={wt=javabin&version=2} {add=[134]} 0 0
[junit4:junit4]   2> 1031 T2765 C175 UPDATE [collection1] webapp=/solr path=/update params={wt=javabin&version=2} {add=[135]} 0 0
[junit4:junit4]   2> 1034 T2769 C175 UPDATE [collection1] webapp=/solr path=/update params={wt=javabin&version=2} {add=[136]} 0 0
[junit4:junit4]   2> 1039 T2766 C175 UPDATE [collection1] webapp=/solr path=/update params={wt=javabin&version=2} {add=[137]} 0 0
[junit4:junit4]   2> 1042 T2764 C175 UPDATE [collection1] webapp=/solr path=/update params={wt=javabin&version=2} {add=[138]} 0 0
[junit4:junit4]   2> 1045 T2768 C175 UPDATE [collection1] webapp=/solr path=/update params={wt=javabin&version=2} {add=[139]} 0 0
[junit4:junit4]   2> 1048 T2770 C175 UPDATE [collection1] webapp=/solr path=/update params={wt=javabin&version=2} {add=[140]} 0 0
[junit4:junit4]   2> 1052 T2765 C175 UPDATE [collection1] webapp=/solr path=/update params={wt=javabin&version=2} {add=[141]} 0 0
[junit4:junit4]   2> 1055 T2769 C175 UPDATE [collection1] webapp=/solr path=/update params={wt=javabin&version=2} {add=[142]} 0 0
[junit4:junit4]   2> 1058 T2766 C175 UPDATE [collection1] webapp=/solr path=/update params={wt=javabin&version=2} {add=[143]} 0 0
[junit4:junit4]   2> 1061 T2764 C175 UPDATE [collection1] webapp=/solr path=/update params={wt=javabin&version=2} {add=[144]} 0 0
[junit4:junit4]   2> 1064 T2768 C175 UPDATE [collection1] webapp=/solr path=/update params={wt=javabin&version=2} {add=[145]} 0 0
[junit4:junit4]   2> 1068 T2770 C175 UPDATE [collection1] webapp=/solr path=/update params={wt=javabin&version=2} {add=[146]} 0 0
[junit4:junit4]   2> 1072 T2765 C175 UPDATE [collection1] webapp=/solr path=/update params={wt=javabin&version=2} {add=[147]} 0 0
[junit4:junit4]   2> 1076 T2769 C175 UPDATE [collection1] webapp=/solr path=/update params={wt=javabin&version=2} {add=[148]} 0 0
[junit4:junit4]   2> 1079 T2766 C175 UPDATE [collection1] webapp=/solr path=/update params={wt=javabin&version=2} {add=[149]} 0 0
[junit4:junit4]   2> 1083 T2764 C175 UPDATE [collection1] webapp=/solr path=/update params={wt=javabin&version=2} {add=[150]} 0 0
[junit4:junit4]   2> 1086 T2768 C175 UPDATE [collection1] webapp=/solr path=/update params={wt=javabin&version=2} {add=[151]} 0 0
[junit4:junit4]   2> 1089 T2770 C175 UPDATE [collection1] webapp=/solr path=/update params={wt=javabin&version=2} {add=[152]} 0 0
[junit4:junit4]   2> 1092 T2765 C175 UPDATE [collection1] webapp=/solr path=/update params={wt=javabin&version=2} {add=[153]} 0 0
[junit4:junit4]   2> 1097 T2769 C175 UPDATE [collection1] webapp=/solr path=/update params={wt=javabin&version=2} {add=[154]} 0 0
[junit4:junit4]   2> 1100 T2766 C175 UPDATE [collection1] webapp=/solr path=/update params={wt=javabin&version=2} {add=[155]} 0 0
[junit4:junit4]   2> 1103 T2764 C175 UPDATE [collection1] webapp=/solr path=/update params={wt=javabin&version=2} {add=[156]} 0 0
[junit4:junit4]   2> 1106 T2768 C175 UPDATE [collection1] webapp=/solr path=/update params={wt=javabin&version=2} {add=[157]} 0 0
[junit4:junit4]   2> 1110 T2770 C175 UPDATE [collection1] webapp=/solr path=/update params={wt=javabin&version=2} {add=[158]} 0 0
[junit4:junit4]   2> 1113 T2765 C175 UPDATE [collection1] webapp=/solr path=/update params={wt=javabin&version=2} {add=[159]} 0 0
[junit4:junit4]   2> 1117 T2769 C175 UPDATE [collection1] webapp=/solr path=/update params={wt=javabin&version=2} {add=[160]} 0 0
[junit4:junit4]   2> 1120 T2766 C175 UPDATE [collection1] webapp=/solr path=/update params={wt=javabin&version=2} {add=[161]} 0 0
[junit4:junit4]   2> 1124 T2764 C175 UPDATE [collection1] webapp=/solr path=/update params={wt=javabin&version=2} {add=[162]} 0 0
[junit4:junit4]   2> 1127 T2768 C175 UPDATE [collection1] webapp=/solr path=/update params={wt=javabin&version=2} {add=[163]} 0 0
[junit4:junit4]   2> 1130 T2770 C175 UPDATE [collection1] webapp=/solr path=/update params={wt=javabin&version=2} {add=[164]} 0 0
[junit4:junit4]   2> 1133 T2765 C175 UPDATE [collection1] webapp=/solr path=/update params={wt=javabin&version=2} {add=[165]} 0 0
[junit4:junit4]   2> 1136 T2769 C175 UPDATE [collection1] webapp=/solr path=/update params={wt=javabin&version=2} {add=[166]} 0 0
[junit4:junit4]   2> 1140 T2766 C175 UPDATE [collection1] webapp=/solr path=/update params={wt=javabin&version=2} {add=[167]} 0 0
[junit4:junit4]   2> 1143 T2764 C175 UPDATE [collection1] webapp=/solr path=/update params={wt=javabin&version=2} {add=[168]} 0 0
[junit4:junit4]   2> 1146 T2768 C175 UPDATE [collection1] webapp=/solr path=/update params={wt=javabin&version=2} {add=[169]} 0 0
[junit4:junit4]   2> 1149 T2770 C175 UPDATE [collection1] webapp=/solr path=/update params={wt=javabin&version=2} {add=[170]} 0 0
[junit4:junit4]   2> 1153 T2765 C175 UPDATE [collection1] webapp=/solr path=/update params={wt=javabin&version=2} {add=[171]} 0 0
[junit4:junit4]   2> 1156 T2769 C175 UPDATE [collection1] webapp=/solr path=/update params={wt=javabin&version=2} {add=[172]} 0 0
[junit4:junit4]   2> 1160 T2766 C175 UPDATE [collection1] webapp=/solr path=/update params={wt=javabin&version=2} {add=[173]} 0 0
[junit4:junit4]   2> 1163 T2764 C175 UPDATE [collection1] webapp=/solr path=/update params={wt=javabin&version=2} {add=[174]} 0 0
[junit4:junit4]   2> 1167 T2768 C175 UPDATE [collection1] webapp=/solr path=/update params={wt=javabin&version=2} {add=[175]} 0 0
[junit4:junit4]   2> 1170 T2770 C175 UPDATE [collection1] webapp=/solr path=/update params={wt=javabin&version=2} {add=[176]} 0 0
[junit4:junit4]   2> 1173 T2765 C175 UPDATE [collection1] webapp=/solr path=/update params={wt=javabin&version=2} {add=[177]} 0 0
[junit4:junit4]   2> 1176 T2769 C175 UPDATE [collection1] webapp=/solr path=/update params={wt=javabin&version=2} {add=[178]} 0 0
[junit4:junit4]   2> 1180 T2766 C175 UPDATE [collection1] webapp=/solr path=/update params={wt=javabin&version=2} {add=[179]} 0 0
[junit4:junit4]   2> 1184 T2764 C175 UPDATE [collection1] webapp=/solr path=/update params={wt=javabin&version=2} {add=[180]} 0 0
[junit4:junit4]   2> 1187 T2768 C175 UPDATE [collection1] webapp=/solr path=/update params={wt=javabin&version=2} {add=[181]} 0 0
[junit4:junit4]   2> 1190 T2770 C175 UPDATE [collection1] webapp=/solr path=/update params={wt=javabin&version=2} {add=[182]} 0 0
[junit4:junit4]   2> 1193 T2765 C175 UPDATE [collection1] webapp=/solr path=/update params={wt=javabin&version=2} {add=[183]} 0 0
[junit4:junit4]   2> 1197 T2769 C175 UPDATE [collection1] webapp=/solr path=/update params={wt=javabin&version=2} {add=[184]} 0 0
[junit4:junit4]   2> 1200 T2766 C175 UPDATE [collection1] webapp=/solr path=/update params={wt=javabin&version=2} {add=[185]} 0 0
[junit4:junit4]   2> 1203 T2764 C175 UPDATE [collection1] webapp=/solr path=/update params={wt=javabin&version=2} {add=[186]} 0 0
[junit4:junit4]   2> 1206 T2768 C175 UPDATE [collection1] webapp=/solr path=/update params={wt=javabin&version=2} {add=[187]} 0 0
[junit4:junit4]   2> 1212 T2770 C175 UPDATE [collection1] webapp=/solr path=/update params={wt=javabin&version=2} {add=[188]} 0 0
[junit4:junit4]   2> 1215 T2765 C175 UPDATE [collection1] webapp=/solr path=/update params={wt=javabin&version=2} {add=[189]} 0 0
[junit4:junit4]   2> 1221 T2769 C175 UPDATE [collection1] webapp=/solr path=/update params={wt=javabin&version=2} {add=[190]} 0 0
[junit4:junit4]   2> 1228 T2766 C175 UPDATE [collection1] webapp=/solr path=/update params={wt=javabin&version=2} {add=[191]} 0 0
[junit4:junit4]   2> 1233 T2764 C175 UPDATE [collection1] webapp=/solr path=/update params={wt=javabin&version=2} {add=[192]} 0 0
[junit4:junit4]   2> 1236 T2768 C175 UPDATE [collection1] webapp=/solr path=/update params={wt=javabin&version=2} {add=[193]} 0 0
[junit4:junit4]   2> 1242 T2770 C175 UPDATE [collection1] webapp=/solr path=/update params={wt=javabin&version=2} {add=[194]} 0 0
[junit4:junit4]   2> 1247 T2765 C175 UPDATE [collection1] webapp=/solr path=/update params={wt=javabin&version=2} {add=[195]} 0 0
[junit4:junit4]   2> 1251 T2769 C175 UPDATE [collection1] webapp=/solr path=/update params={wt=javabin&version=2} {add=[196]} 0 0
[junit4:junit4]   2> 1256 T2766 C175 UPDATE [collection1] webapp=/solr path=/update params={wt=javabin&version=2} {add=[197]} 0 0
[junit4:junit4]   2> 1259 T2764 C175 UPDATE [collection1] webapp=/solr path=/update params={wt=javabin&version=2} {add=[198]} 0 0
[junit4:junit4]   2> 1262 T2768 C175 UPDATE [collection1] webapp=/solr path=/update params={wt=javabin&version=2} {add=[199]} 0 0
[junit4:junit4]   2> 1265 T2770 C175 UPDATE [collection1] webapp=/solr path=/update params={wt=javabin&version=2} {add=[200]} 0 0
[junit4:junit4]   2> 1269 T2765 C175 UPDATE [collection1] webapp=/solr path=/update params={wt=javabin&version=2} {add=[201]} 0 0
[junit4:junit4]   2> 1272 T2769 C175 UPDATE [collection1] webapp=/solr path=/update params={wt=javabin&version=2} {add=[202]} 0 0
[junit4:junit4]   2> 1275 T2766 C175 UPDATE [collection1] webapp=/solr path=/update params={wt=javabin&version=2} {add=[203]} 0 0
[junit4:junit4]   2> 1278 T2768 C175 UPDATE [collection1] webapp=/solr path=/update params={wt=javabin&version=2} {add=[204]} 0 0
[junit4:junit4]   2> 1281 T2770 C175 UPDATE [collection1] webapp=/solr path=/update params={wt=javabin&version=2} {add=[205]} 0 0
[junit4:junit4]   2> 1285 T2765 C175 UPDATE [collection1] webapp=/solr path=/update params={wt=javabin&version=2} {add=[206]} 0 0
[junit4:junit4]   2> 1288 T2769 C175 UPDATE [collection1] webapp=/solr path=/update params={wt=javabin&version=2} {add=[207]} 0 0
[junit4:junit4]   2> 1292 T2766 C175 UPDATE [collection1] webapp=/solr path=/update params={wt=javabin&version=2} {add=[208]} 0 0
[junit4:junit4]   2> 1295 T2764 C175 UPDATE [collection1] webapp=/solr path=/update params={wt=javabin&version=2} {add=[209]} 0 0
[junit4:junit4]   2> 1299 T2768 C175 UPDATE [collection1] webapp=/solr path=/update params={wt=javabin&version=2} {add=[210]} 0 0
[junit4:junit4]   2> 1302 T2770 C175 UPDATE [collection1] webapp=/solr path=/update params={wt=javabin&version=2} {add=[211]} 0 0
[junit4:junit4]   2> 1305 T2765 C175 UPDATE [collection1] webapp=/solr path=/update params={wt=javabin&version=2} {add=[212]} 0 0
[junit4:junit4]   2> 1309 T2769 C175 UPDATE [collection1] webapp=/solr path=/update params={wt=javabin&version=2} {add=[213]} 0 0
[junit4:junit4]   2> 1313 T2766 C175 UPDATE [collection1] webapp=/solr path=/update params={wt=javabin&version=2} {add=[214]} 0 0
[junit4:junit4]   2> 1316 T2764 C175 UPDATE [collection1] webapp=/solr path=/update params={wt=javabin&version=2} {add=[215]} 0 0
[junit4:junit4]   2> 1319 T2768 C175 UPDATE [collection1] webapp=/solr path=/update params={wt=javabin&version=2} {add=[216]} 0 0
[junit4:junit4]   2> 1322 T2770 C175 UPDATE [collection1] webapp=/solr path=/update params={wt=javabin&version=2} {add=[217]} 0 0
[junit4:junit4]   2> 1325 T2765 C175 UPDATE [collection1] webapp=/solr path=/update params={wt=javabin&version=2} {add=[218]} 0 0
[junit4:junit4]   2> 1329 T2769 C175 UPDATE [collection1] webapp=/solr path=/update params={wt=javabin&version=2} {add=[219]} 0 0
[junit4:junit4]   2> 1332 T2766 C175 UPDATE [collection1] webapp=/solr path=/update params={wt=javabin&version=2} {add=[220]} 0 0
[junit4:junit4]   2> 1335 T2764 C175 UPDATE [collection1] webapp=/solr path=/update params={wt=javabin&version=2} {add=[221]} 0 0
[junit4:junit4]   2> 1338 T2768 C175 UPDATE [collection1] webapp=/solr path=/update params={wt=javabin&version=2} {add=[222]} 0 0
[junit4:junit4]   2> 1343 T2770 C175 UPDATE [collection1] webapp=/solr path=/update params={wt=javabin&version=2} {add=[223]} 0 0
[junit4:junit4]   2> 1346 T2765 C175 UPDATE [collection1] webapp=/solr path=/update params={wt=javabin&version=2} {add=[224]} 0 0
[junit4:junit4]   2> 1349 T2769 C175 UPDATE [collection1] webapp=/solr path=/update params={wt=javabin&version=2} {add=[225]} 0 0
[junit4:junit4]   2> 1352 T2766 C175 UPDATE [collection1] webapp=/solr path=/update params={wt=javabin&version=2} {add=[226]} 0 0
[junit4:junit4]   2> 1356 T2764 C175 UPDATE [collection1] webapp=/solr path=/update params={wt=javabin&version=2} {add=[227]} 0 0
[junit4:junit4]   2> 1360 T2768 C175 UPDATE [collection1] webapp=/solr path=/update params={wt=javabin&version=2} {add=[228]} 0 0
[junit4:junit4]   2> 1363 T2770 C175 UPDATE [collection1] webapp=/solr path=/update params={wt=javabin&version=2} {add=[229]} 0 0
[junit4:junit4]   2> 1366 T2765 C175 UPDATE [collection1] webapp=/solr path=/update params={wt=javabin&version=2} {add=[230]} 0 0
[junit4:junit4]   2> 1370 T2769 C175 UPDATE [collection1] webapp=/solr path=/update params={wt=javabin&version=2} {add=[231]} 0 0
[junit4:junit4]   2> 1374 T2766 C175 UPDATE [collection1] webapp=/solr path=/update params={wt=javabin&version=2} {add=[232]} 0 0
[junit4:junit4]   2> 1377 T2764 C175 UPDATE [collection1] webapp=/solr path=/update params={wt=javabin&version=2} {add=[233]} 0 0
[junit4:junit4]   2> 1380 T2768 C175 UPDATE [collection1] webapp=/solr path=/update params={wt=javabin&version=2} {add=[234]} 0 0
[junit4:junit4]   2> 1383 T2770 C175 UPDATE [collection1] webapp=/solr path=/update params={wt=javabin&version=2} {add=[235]} 0 0
[junit4:junit4]   2> 1388 T2765 C175 UPDATE [collection1] webapp=/solr path=/update params={wt=javabin&version=2} {add=[236]} 0 0
[junit4:junit4]   2> 1391 T2769 C175 UPDATE [collection1] webapp=/solr path=/update params={wt=javabin&version=2} {add=[237]} 0 0
[junit4:junit4]   2> 1394 T2766 C175 UPDATE [collection1] webapp=/solr path=/update params={wt=javabin&version=2} {add=[238]} 0 0
[junit4:junit4]   2> 1397 T2764 C175 UPDATE [collection1] webapp=/solr path=/update params={wt=javabin&version=2} {add=[239]} 0 0
[junit4:junit4]   2> 1401 T2768 C175 UPDATE [collection1] webapp=/solr path=/update params={wt=javabin&version=2} {add=[240]} 0 0
[junit4:junit4]   2> 1404 T2770 C175 UPDATE [collection1] webapp=/solr path=/update params={wt=javabin&version=2} {add=[241]} 0 0
[junit4:junit4]   2> 1407 T2765 C175 UPDATE [collection1] webapp=/solr path=/update params={wt=javabin&version=2} {add=[242]} 0 0
[junit4:junit4]   2> 1410 T2769 C175 UPDATE [collection1] webapp=/solr path=/update params={wt=javabin&version=2} {add=[243]} 0 0
[junit4:junit4]   2> 1414 T2766 C175 UPDATE [collection1] webapp=/solr path=/update params={wt=javabin&version=2} {add=[244]} 0 0
[junit4:junit4]   2> 1417 T2764 C175 UPDATE [collection1] webapp=/solr path=/update params={wt=javabin&version=2} {add=[245]} 0 0
[junit4:junit4]   2> 1419 T2768 C175 REQ [collection1] webapp=/solr path=/replication params={command=indexversion&qt=/replication&wt=javabin&version=2} status=0 QTime=0 
[junit4:junit4]   2> 1420 T2770 C175 UPDATE [collection1] webapp=/solr path=/update params={wt=javabin&version=2} {add=[246]} 0 0
[junit4:junit4]   2> 1423 T2765 C175 UPDATE [collection1] webapp=/solr path=/update params={wt=javabin&version=2} {add=[247]} 0 0
[junit4:junit4]   2> 1426 T2769 C175 UPDATE [collection1] webapp=/solr path=/update params={wt=javabin&version=2} {add=[248]} 0 0
[junit4:junit4]   2> 1430 T2766 C175 UPDATE [collection1] webapp=/solr path=/update params={wt=javabin&version=2} {add=[249]} 0 0
[junit4:junit4]   2> 1433 T2764 C175 UPDATE [collection1] webapp=/solr path=/update params={wt=javabin&version=2} {add=[250]} 0 0
[junit4:junit4]   2> 1436 T2768 C175 UPDATE [collection1] webapp=/solr path=/update params={wt=javabin&version=2} {add=[251]} 0 0
[junit4:junit4]   2> 1440 T2770 C175 UPDATE [collection1] webapp=/solr path=/update params={wt=javabin&version=2} {add=[252]} 0 0
[junit4:junit4]   2> 1444 T2765 C175 UPDATE [collection1] webapp=/solr path=/update params={wt=javabin&version=2} {add=[253]} 0 0
[junit4:junit4]   2> 1447 T2769 C175 UPDATE [collection1] webapp=/solr path=/update params={wt=javabin&version=2} {add=[254]} 0 0
[junit4:junit4]   2> 1450 T2766 C175 UPDATE [collection1] webapp=/solr path=/update params={wt=javabin&version=2} {add=[255]} 0 0
[junit4:junit4]   2> 1453 T2764 C175 UPDATE [collection1] webapp=/solr path=/update params={wt=javabin&version=2} {add=[256]} 0 0
[junit4:junit4]   2> 1457 T2768 C175 UPDATE [collection1] webapp=/solr path=/update params={wt=javabin&version=2} {add=[257]} 0 0
[junit4:junit4]   2> 1460 T2770 C175 UPDATE [collection1] webapp=/solr path=/update params={wt=javabin&version=2} {add=[258]} 0 0
[junit4:junit4]   2> 1463 T2765 C175 UPDATE [collection1] webapp=/solr path=/update params={wt=javabin&version=2} {add=[259]} 0 0
[junit4:junit4]   2> 1466 T2769 C175 UPDATE [collection1] webapp=/solr path=/update params={wt=javabin&version=2} {add=[260]} 0 0
[junit4:junit4]   2> 1469 T2766 C175 UPDATE [collection1] webapp=/solr path=/update params={wt=javabin&version=2} {add=[261]} 0 0
[junit4:junit4]   2> 1473 T2764 C175 UPDATE [collection1] webapp=/solr path=/update params={wt=javabin&version=2} {add=[262]} 0 0
[junit4:junit4]   2> 1476 T2768 C175 UPDATE [collection1] webapp=/solr path=/update params={wt=javabin&version=2} {add=[263]} 0 0
[junit4:junit4]   2> 1479 T2770 C175 UPDATE [collection1] webapp=/solr path=/update params={wt=javabin&version=2} {add=[264]} 0 0
[junit4:junit4]   2> 1482 T2765 C175 UPDATE [collection1] webapp=/solr path=/update params={wt=javabin&version=2} {add=[265]} 0 0
[junit4:junit4]   2> 1486 T2769 C175 UPDATE [collection1] webapp=/solr path=/update params={wt=javabin&version=2} {add=[266]} 0 0
[junit4:junit4]   2> 1490 T2766 C175 UPDATE [collection1] webapp=/solr path=/update params={wt=javabin&version=2} {add=[267]} 0 0
[junit4:junit4]   2> 1493 T2764 C175 UPDATE [collection1] webapp=/solr path=/update params={wt=javabin&version=2} {add=[268]} 0 0
[junit4:junit4]   2> 1496 T2768 C175 UPDATE [collection1] webapp=/solr path=/update params={wt=javabin&version=2} {add=[269]} 0 0
[junit4:junit4]   2> 1500 T2770 C175 UPDATE [collection1] webapp=/solr path=/update params={wt=javabin&version=2} {add=[270]} 0 0
[junit4:junit4]   2> 1503 T2765 C175 UPDATE [collection1] webapp=/solr path=/update params={wt=javabin&version=2} {add=[271]} 0 0
[junit4:junit4]   2> 1506 T2769 C175 UPDATE [collection1] webapp=/solr path=/update params={wt=javabin&version=2} {add=[272]} 0 0
[junit4:junit4]   2> 1509 T2766 C175 UPDATE [collection1] webapp=/solr path=/update params={wt=javabin&version=2} {add=[273]} 0 0
[junit4:junit4]   2> 1512 T2764 C175 UPDATE [collection1] webapp=/solr path=/update params={wt=javabin&version=2} {add=[274]} 0 0
[junit4:junit4]   2> 1516 T2768 C175 UPDATE [collection1] webapp=/solr path=/update params={wt=javabin&version=2} {add=[275]} 0 0
[junit4:junit4]   2> 1519 T2770 C175 UPDATE [collection1] webapp=/solr path=/update params={wt=javabin&version=2} {add=[276]} 0 0
[junit4:junit4]   2> 1522 T2765 C175 UPDATE [collection1] webapp=/solr path=/update params={wt=javabin&version=2} {add=[277]} 0 0
[junit4:junit4]   2> 1526 T2769 C175 UPDATE [collection1] webapp=/solr path=/update params={wt=javabin&version=2} {add=[278]} 0 0
[junit4:junit4]   2> 1530 T2766 C175 UPDATE [collection1] webapp=/solr path=/update params={wt=javabin&version=2} {add=[279]} 0 0
[junit4:junit4]   2> 1533 T2764 C175 UPDATE [collection1] webapp=/solr path=/update params={wt=javabin&version=2} {add=[280]} 0 0
[junit4:junit4]   2> 1537 T2768 C175 UPDATE [collection1] webapp=/solr path=/update params={wt=javabin&version=2} {add=[281]} 0 0
[junit4:junit4]   2> 1540 T2770 C175 UPDATE [collection1] webapp=/solr path=/update params={wt=javabin&version=2} {add=[282]} 0 0
[junit4:junit4]   2> 1544 T2765 C175 UPDATE [collection1] webapp=/solr path=/update params={wt=javabin&version=2} {add=[283]} 0 0
[junit4:junit4]   2> 1547 T2769 C175 UPDATE [collection1] webapp=/solr path=/update params={wt=javabin&version=2} {add=[284]} 0 0
[junit4:junit4]   2> 1550 T2766 C175 UPDATE [collection1] webapp=/solr path=/update params={wt=javabin&version=2} {add=[285]} 0 0
[junit4:junit4]   2> 1553 T2764 C175 UPDATE [collection1] webapp=/solr path=/update params={wt=javabin&version=2} {add=[286]} 0 0
[junit4:junit4]   2> 1558 T2768 C175 UPDATE [collection1] webapp=/solr path=/update params={wt=javabin&version=2} {add=[287]} 0 0
[junit4:junit4]   2> 1561 T2770 C175 UPDATE [collection1] webapp=/solr path=/update params={wt=javabin&version=2} {add=[288]} 0 0
[junit4:junit4]   2> 1564 T2765 C175 UPDATE [collection1] webapp=/solr path=/update params={wt=javabin&version=2} {add=[289]} 0 0
[junit4:junit4]   2> 1567 T2769 C175 UPDATE [collection1] webapp=/solr path=/update params={wt=javabin&version=2} {add=[290]} 0 0
[junit4:junit4]   2> 1571 T2766 C175 UPDATE [collection1] webapp=/solr path=/update params={wt=javabin&version=2} {add=[291]} 0 0
[junit4:junit4]   2> 1575 T2764 C175 UPDATE [collection1] webapp=/solr path=/update params={wt=javabin&version=2} {add=[292]} 0 0
[junit4:junit4]   2> 1578 T2768 C175 UPDATE [collection1] webapp=/solr path=/update params={wt=javabin&version=2} {add=[293]} 0 0
[junit4:junit4]   2> 1581 T2770 C175 UPDATE [collection1] webapp=/solr path=/update params={wt=javabin&version=2} {add=[294]} 0 0
[junit4:junit4]   2> 1584 T2765 C175 UPDATE [collection1] webapp=/solr path=/update params={wt=javabin&version=2} {add=[295]} 0 0
[junit4:junit4]   2> 1589 T2769 C175 UPDATE [collection1] webapp=/solr path=/update params={wt=javabin&version=2} {add=[296]} 0 0
[junit4:junit4]   2> 1592 T2766 C175 UPDATE [collection1] webapp=/solr path=/update params={wt=javabin&version=2} {add=[297]} 0 0
[junit4:junit4]   2> 1595 T2764 C175 UPDATE [collection1] webapp=/solr path=/update params={wt=javabin&version=2} {add=[298]} 0 0
[junit4:junit4]   2> 1598 T2768 C175 UPDATE [collection1] webapp=/solr path=/update params={wt=javabin&version=2} {add=[299]} 0 0
[junit4:junit4]   2> 1603 T2770 C175 UPDATE [collection1] webapp=/solr path=/update params={wt=javabin&version=2} {add=[300]} 0 0
[junit4:junit4]   2> 1606 T2765 C175 UPDATE [collection1] webapp=/solr path=/update params={wt=javabin&version=2} {add=[301]} 0 0
[junit4:junit4]   2> 1609 T2769 C175 UPDATE [collection1] webapp=/solr path=/update params={wt=javabin&version=2} {add=[302]} 0 0
[junit4:junit4]   2> 1612 T2766 C175 UPDATE [collection1] webapp=/solr path=/update params={wt=javabin&version=2} {add=[303]} 0 0
[junit4:junit4]   2> 1616 T2764 C175 UPDATE [collection1] webapp=/solr path=/update params={wt=javabin&version=2} {add=[304]} 0 0
[junit4:junit4]   2> 1619 T2768 C175 UPDATE [collection1] webapp=/solr path=/update params={wt=javabin&version=2} {add=[305]} 0 0
[junit4:junit4]   2> 1622 T2770 C175 UPDATE [collection1] webapp=/solr path=/update params={wt=javabin&version=2} {add=[306]} 0 0
[junit4:junit4]   2> 1625 T2765 C175 UPDATE [collection1] webapp=/solr path=/update params={wt=javabin&version=2} {add=[307]} 0 0
[junit4:junit4]   2> 1628 T2769 C175 UPDATE [collection1] webapp=/solr path=/update params={wt=javabin&version=2} {add=[308]} 0 0
[junit4:junit4]   2> 1632 T2766 C175 UPDATE [collection1] webapp=/solr path=/update params={wt=javabin&version=2} {add=[309]} 0 0
[junit4:junit4]   2> 1636 T2764 C175 UPDATE [collection1] webapp=/solr path=/update params={wt=javabin&version=2} {add=[310]} 0 0
[junit4:junit4]   2> 1639 T2768 C175 UPDATE [collection1] webapp=/solr path=/update params={wt=javabin&version=2} {add=[311]} 0 0
[junit4:junit4]   2> 1642 T2770 C175 UPDATE [collection1] webapp=/solr path=/update params={wt=javabin&version=2} {add=[312]} 0 0
[junit4:junit4]   2> 1646 T2765 C175 UPDATE [collection1] webapp=/solr path=/update params={wt=javabin&version=2} {add=[313]} 0 0
[junit4:junit4]   2> 1649 T2769 C175 UPDATE [collection1] webapp=/solr path=/update params={wt=javabin&version=2} {add=[314]} 0 0
[junit4:junit4]   2> 1652 T2766 C175 UPDATE [collection1] webapp=/solr path=/update params={wt=javabin&version=2} {add=[315]} 0 0
[junit4:junit4]   2> 1655 T2764 C175 UPDATE [collection1] webapp=/solr path=/update params={wt=javabin&version=2} {add=[316]} 0 0
[junit4:junit4]   2> 1658 T2768 C175 UPDATE [collection1] webapp=/solr path=/update params={wt=javabin&version=2} {add=[317]} 0 0
[junit4:junit4]   2> 1662 T2770 C175 UPDATE [collection1] webapp=/solr path=/update params={wt=javabin&version=2} {add=[318]} 0 0
[junit4:junit4]   2> 1665 T2765 C175 UPDATE [collection1] webapp=/solr path=/update params={wt=javabin&version=2} {add=[319]} 0 0
[junit4:junit4]   2> 1668 T2769 C175 UPDATE [collection1] webapp=/solr path=/update params={wt=javabin&version=2} {add=[320]} 0 0
[junit4:junit4]   2> 1671 T2766 C175 UPDATE [collection1] webapp=/solr path=/update params={wt=javabin&version=2} {add=[321]} 0 0
[junit4:junit4]   2> 1676 T2764 C175 UPDATE [collection1] webapp=/solr path=/update params={wt=javabin&version=2} {add=[322]} 0 0
[junit4:junit4]   2> 1679 T2770 C175 UPDATE [collection1] webapp=/solr path=/update params={wt=javabin&version=2} {add=[323]} 0 0
[junit4:junit4]   2> 1682 T2765 C175 UPDATE [collection1] webapp=/solr path=/update params={wt=javabin&version=2} {add=[324]} 0 0
[junit4:junit4]   2> 1685 T2769 C175 UPDATE [collection1] webapp=/solr path=/update params={wt=javabin&version=2} {add=[325]} 0 0
[junit4:junit4]   2> 1689 T2766 C175 UPDATE [collection1] webapp=/solr path=/update params={wt=javabin&version=2} {add=[326]} 0 0
[junit4:junit4]   2> 1692 T2768 C175 UPDATE [collection1] webapp=/solr path=/update params={wt=javabin&version=2} {add=[327]} 0 0
[junit4:junit4]   2> 1695 T2764 C175 UPDATE [collection1] webapp=/solr path=/update params={wt=javabin&version=2} {add=[328]} 0 0
[junit4:junit4]   2> 1698 T2770 C175 UPDATE [collection1] webapp=/solr path=/update params={wt=javabin&version=2} {add=[329]} 0 0
[junit4:junit4]   2> 1701 T2765 C175 UPDATE [collection1] webapp=/solr path=/update params={wt=javabin&version=2} {add=[330]} 0 0
[junit4:junit4]   2> 1705 T2769 C175 UPDATE [collection1] webapp=/solr path=/update params={wt=javabin&version=2} {add=[331]} 0 0
[junit4:junit4]   2> 1708 T2766 C175 UPDATE [collection1] webapp=/solr path=/update params={wt=javabin&version=2} {add=[332]} 0 0
[junit4:junit4]   2> 1711 T2768 C175 UPDATE [collection1] webapp=/solr path=/update params={wt=javabin&version=2} {add=[333]} 0 0
[junit4:junit4]   2> 1714 T2764 C175 UPDATE [collection1] webapp=/solr path=/update params={wt=javabin&version=2} {add=[334]} 0 0
[junit4:junit4]   2> 1718 T2770 C175 UPDATE [collection1] webapp=/solr path=/update params={wt=javabin&version=2} {add=[335]} 0 0
[junit4:junit4]   2> 1721 T2765 C175 UPDATE [collection1] webapp=/solr path=/update params={wt=javabin&version=2} {add=[336]} 0 0
[junit4:junit4]   2> 1724 T2769 C175 UPDATE [collection1] webapp=/solr path=/update params={wt=javabin&version=2} {add=[337]} 0 0
[junit4:junit4]   2> 1727 T2766 C175 UPDATE [collection1] webapp=/solr path=/update params={wt=javabin&version=2} {add=[338]} 0 0
[junit4:junit4]   2> 1730 T2768 C175 UPDATE [collection1] webapp=/solr path=/update params={wt=javabin&version=2} {add=[339]} 0 0
[junit4:junit4]   2> 1734 T2764 C175 UPDATE [collection1] webapp=/solr path=/update params={wt=javabin&version=2} {add=[340]} 0 0
[junit4:junit4]   2> 1737 T2770 C175 UPDATE [collection1] webapp=/solr path=/update params={wt=javabin&version=2} {add=[341]} 0 0
[junit4:junit4]   2> 1740 T2765 C175 UPDATE [collection1] webapp=/solr path=/update params={wt=javabin&version=2} {add=[342]} 0 0
[junit4:junit4]   2> 1743 T2769 C175 UPDATE [collection1] webapp=/solr path=/update params={wt=javabin&version=2} {add=[343]} 0 0
[junit4:junit4]   2> 1747 T2766 C175 UPDATE [collection1] webapp=/solr path=/update params={wt=javabin&version=2} {add=[344]} 0 0
[junit4:junit4]   2> 1750 T2768 C175 UPDATE [collection1] webapp=/solr path=/update params={wt=javabin&version=2} {add=[345]} 0 0
[junit4:junit4]   2> 1753 T2764 C175 UPDATE [collection1] webapp=/solr path=/update params={wt=javabin&version=2} {add=[346]} 0 0
[junit4:junit4]   2> 1756 T2770 C175 UPDATE [collection1] webapp=/solr path=/update params={wt=javabin&version=2} {add=[347]} 0 0
[junit4:junit4]   2> 1759 T2765 C175 UPDATE [collection1] webapp=/solr path=/update params={wt=javabin&version=2} {add=[348]} 0 0
[junit4:junit4]   2> 1763 T2769 C175 UPDATE [collection1] webapp=/solr path=/update params={wt=javabin&version=2} {add=[349]} 0 0
[junit4:junit4]   2> 1766 T2766 C175 UPDATE [collection1] webapp=/solr path=/update params={wt=javabin&version=2} {add=[350]} 0 0
[junit4:junit4]   2> 1769 T2768 C175 UPDATE [collection1] webapp=/solr path=/update params={wt=javabin&version=2} {add=[351]} 0 0
[junit4:junit4]   2> 1772 T2764 C175 UPDATE [collection1] webapp=/solr path=/update params={wt=javabin&version=2} {add=[352]} 0 0
[junit4:junit4]   2> 1776 T2770 C175 UPDATE [collection1] webapp=/solr path=/update params={wt=javabin&version=2} {add=[353]} 0 0
[junit4:junit4]   2> 1779 T2765 C175 UPDATE [collection1] webapp=/solr path=/update params={wt=javabin&version=2} {add=[354]} 0 0
[junit4:junit4]   2> 1783 T2769 C175 UPDATE [collection1] webapp=/solr path=/update params={wt=javabin&version=2} {add=[355]} 0 0
[junit4:junit4]   2> 1786 T2766 C175 UPDATE [collection1] webapp=/solr path=/update params={wt=javabin&version=2} {add=[356]} 0 0
[junit4:junit4]   2> 1790 T2768 C175 UPDATE [collection1] webapp=/solr path=/update params={wt=javabin&version=2} {add=[357]} 0 0
[junit4:junit4]   2> 1793 T2764 C175 UPDATE [collection1] webapp=/solr path=/update params={wt=javabin&version=2} {add=[358]} 0 0
[junit4:junit4]   2> 1796 T2770 C175 UPDATE [collection1] webapp=/solr path=/update params={wt=javabin&version=2} {add=[359]} 0 0
[junit4:junit4]   2> 1799 T2765 C175 UPDATE [collection1] webapp=/solr path=/update params={wt=javabin&version=2} {add=[360]} 0 0
[junit4:junit4]   2> 1802 T2769 C175 UPDATE [collection1] webapp=/solr path=/update params={wt=javabin&version=2} {add=[361]} 0 0
[junit4:junit4]   2> 1806 T2766 C175 UPDATE [collection1] webapp=/solr path=/update params={wt=javabin&version=2} {add=[362]} 0 0
[junit4:junit4]   2> 1809 T2768 C175 UPDATE [collection1] webapp=/solr path=/update params={wt=javabin&version=2} {add=[363]} 0 0
[junit4:junit4]   2> 1812 T2764 C175 UPDATE [collection1] webapp=/solr path=/update params={wt=javabin&version=2} {add=[364]} 0 0
[junit4:junit4]   2> 1815 T2770 C175 UPDATE [collection1] webapp=/solr path=/update params={wt=javabin&version=2} {add=[365]} 0 0
[junit4:junit4]   2> 1819 T2765 C175 UPDATE [collection1] webapp=/solr path=/update params={wt=javabin&version=2} {add=[366]} 0 0
[junit4:junit4]   2> 1822 T2769 C175 UPDATE [collection1] webapp=/solr path=/update params={wt=javabin&version=2} {add=[367]} 0 0
[junit4:junit4]   2> 1825 T2766 C175 UPDATE [collection1] webapp=/solr path=/update params={wt=javabin&version=2} {add=[368]} 0 0
[junit4:junit4]   2> 1829 T2768 C175 UPDATE [collection1] webapp=/solr path=/update params={wt=javabin&version=2} {add=[369]} 0 0
[junit4:junit4]   2> 1833 T2764 C175 UPDATE [collection1] webapp=/solr path=/update params={wt=javabin&version=2} {add=[370]} 0 0
[junit4:junit4]   2> 1836 T2770 C175 UPDATE [collection1] webapp=/solr path=/update params={wt=javabin&version=2} {add=[371]} 0 0
[junit4:junit4]   2> 1839 T2765 C175 UPDATE [collection1] webapp=/solr path=/update params={wt=javabin&version=2} {add=[372]} 0 0
[junit4:junit4]   2> 1842 T2769 C175 UPDATE [collection1] webapp=/solr path=/update params={wt=javabin&version=2} {add=[373]} 0 0
[junit4:junit4]   2> 1845 T2766 C175 UPDATE [collection1] webapp=/solr path=/update params={wt=javabin&version=2} {add=[374]} 0 0
[junit4:junit4]   2> 1850 T2768 C175 UPDATE [collection1] webapp=/solr path=/update params={wt=javabin&version=2} {add=[375]} 0 0
[junit4:junit4]   2> 1852 T2764 C175 UPDATE [collection1] webapp=/solr path=/update params={wt=javabin&version=2} {add=[376]} 0 0
[junit4:junit4]   2> 1855 T2770 C175 UPDATE [collection1] webapp=/solr path=/update params={wt=javabin&version=2} {add=[377]} 0 0
[junit4:junit4]   2> 1858 T2765 C175 UPDATE [collection1] webapp=/solr path=/update params={wt=javabin&version=2} {add=[378]} 0 0
[junit4:junit4]   2> 1863 T2769 C175 UPDATE [collection1] webapp=/solr path=/update params={wt=javabin&version=2} {add=[379]} 0 0
[junit4:junit4]   2> 1866 T2766 C175 UPDATE [collection1] webapp=/solr path=/update params={wt=javabin&version=2} {add=[380]} 0 0
[junit4:junit4]   2> 1869 T2768 C175 UPDATE [collection1] webapp=/solr path=/update params={wt=javabin&version=2} {add=[381]} 0 0
[junit4:junit4]   2> 1870 T1948 oasc.OverseerCollectionProcessor.run WARNING Overseer cannot talk to ZK
[junit4:junit4]   2> 1872 T2764 C175 UPDATE [collection1] webapp=/solr path=/update params={wt=javabin&version=2} {add=[382]} 0 0
[junit4:junit4]   2> 1875 T2770 C175 UPDATE [collection1] webapp=/solr path=/update params={wt=javabin&version=2} {add=[383]} 0 0
[junit4:junit4]   2> 1880 T2765 C175 UPDATE [collection1] webapp=/solr path=/update params={wt=javabin&version=2} {add=[384]} 0 0
[junit4:junit4]   2> 1883 T2769 C175 UPDATE [collection1] webapp=/solr path=/update params={wt=javabin&version=2} {add=[385]} 0 0
[junit4:junit4]   2> 1886 T2766 C175 UPDATE [collection1] webapp=/solr path=/update params={wt=javabin&version=2} {add=[386]} 0 0
[junit4:junit4]   2> 1889 T2768 C175 UPDATE [collection1] webapp=/solr path=/update params={wt=javabin&version=2} {add=[387]} 0 0
[junit4:junit4]   2> 1893 T2764 C175 UPDATE [collection1] webapp=/solr path=/update params={wt=javabin&version=2} {add=[388]} 0 0
[junit4:junit4]   2> 1896 T2770 C175 UPDATE [collection1] webapp=/solr path=/update params={wt=javabin&version=2} {add=[389]} 0 0
[junit4:junit4]   2> 1899 T2765 C175 UPDATE [collection1] webapp=/solr path=/update params={wt=javabin&version=2} {add=[390]} 0 0
[junit4:junit4]   2> 1902 T2769 C175 UPDATE [collection1] webapp=/solr path=/update params={wt=javabin&version=2} {add=[391]} 0 0
[junit4:junit4]   2> 1906 T2766 C175 UPDATE [collection1] webapp=/solr path=/update params={wt=javabin&version=2} {add=[392]} 0 0
[junit4:junit4]   2> 1909 T2768 C175 UPDATE [collection1] webapp=/solr path=/update params={wt=javabin&version=2} {add=[393]} 0 0
[junit4:junit4]   2> 1912 T2764 C175 UPDATE [collection1] webapp=/solr path=/update params={wt=javabin&version=2} {add=[394]} 0 0
[junit4:junit4]   2> 1915 T2770 C175 UPDATE [collection1] webapp=/solr path=/update params={wt=javabin&version=2} {add=[395]} 0 0
[junit4:junit4]   2> 1918 T2765 C175 UPDATE [collection1] webapp=/solr path=/update params={wt=javabin&version=2} {add=[396]} 0 0
[junit4:junit4]   2> 1922 T2769 C175 UPDATE [collection1] webapp=/solr path=/update params={wt=javabin&version=2} {add=[397]} 0 0
[junit4:junit4]   2> 1926 T2766 C175 UPDATE [collection1] webapp=/solr path=/update params={wt=javabin&version=2} {add=[398]} 0 0
[junit4:junit4]   2> 1929 T2768 C175 UPDATE [collection1] webapp=/solr path=/update params={wt=javabin&version=2} {add=[399]} 0 0
[junit4:junit4]   2> 1932 T2764 C175 UPDATE [collection1] webapp=/solr path=/update params={wt=javabin&version=2} {add=[400]} 0 0
[junit4:junit4]   2> 1936 T2770 C175 UPDATE [collection1] webapp=/solr path=/update params={wt=javabin&version=2} {add=[401]} 0 0
[junit4:junit4]   2> 1939 T2765 C175 UPDATE [collection1] webapp=/solr path=/update params={wt=javabin&version=2} {add=[402]} 0 0
[junit4:junit4]   2> 1942 T2769 C175 UPDATE [collection1] webapp=/solr path=/update params={wt=javabin&version=2} {add=[403]} 0 0
[junit4:junit4]   2> 1947 T2766 C175 UPDATE [collection1] webapp=/solr path=/update params={wt=javabin&version=2} {add=[404]} 0 1
[junit4:junit4]   2> 1951 T2768 C175 UPDATE [collection1] webapp=/solr path=/update params={wt=javabin&version=2} {add=[405]} 0 0
[junit4:junit4]   2> 1954 T2764 C175 UPDATE [collection1] webapp=/solr path=/update params={wt=javabin&version=2} {add=[406]} 0 0
[junit4:junit4]   2> 1957 T2770 C175 UPDATE [collection1] webapp=/solr path=/update params={wt=javabin&version=2} {add=[407]} 0 0
[junit4:junit4]   2> 1960 T2765 C175 UPDATE [collection1] webapp=/solr path=/update params={wt=javabin&version=2} {add=[408]} 0 0
[junit4:junit4]   2> 1964 T2769 C175 UPDATE [collection1] webapp=/solr path=/update params={wt=javabin&version=2} {add=[409]} 0 0
[junit4:junit4]   2> 1967 T2766 C175 UPDATE [collection1] webapp=/solr path=/update params={wt=javabin&version=2} {add=[410]} 0 0
[junit4:junit4]   2> 1970 T2768 C175 UPDATE [collection1] webapp=/solr path=/update params={wt=javabin&version=2} {add=[411]} 0 0
[junit4:junit4]   2> 1973 T2764 C175 UPDATE [collection1] webapp=/solr path=/update params={wt=javabin&version=2} {add=[412]} 0 0
[junit4:junit4]   2> 1978 T2770 C175 UPDATE [collection1] webapp=/solr path=/update params={wt=javabin&version=2} {add=[413]} 0 0
[junit4:junit4]   2> 1981 T2765 C175 UPDATE [collection1] webapp=/solr path=/update params={wt=javabin&version=2} {add=[414]} 0 0
[junit4:junit4]   2> 1984 T2769 C175 UPDATE [collection1] webapp=/solr path=/update params={wt=javabin&version=2} {add=[415]} 0 0
[junit4:junit4]   2> 1987 T2766 C175 UPDATE [collection1] webapp=/solr path=/update params={wt=javabin&version=2} {add=[416]} 0 0
[junit4:junit4]   2> 1990 T2768 C175 UPDATE [collection1] webapp=/solr path=/update params={wt=javabin&version=2} {add=[417]} 0 0
[junit4:junit4]   2> 1994 T2764 C175 UPDATE [collection1] webapp=/solr path=/update params={wt=javabin&version=2} {add=[418]} 0 0
[junit4:junit4]   2> 1998 T2770 C175 UPDATE [collection1] webapp=/solr path=/update params={wt=javabin&version=2} {add=[419]} 0 0
[junit4:junit4]   2> 2001 T2765 C175 UPDATE [collection1] webapp=/solr path=/update params={wt=javabin&version=2} {add=[420]} 0 0
[junit4:junit4]   2> 2004 T2769 C175 UPDATE [collection1] webapp=/solr path=/update params={wt=javabin&version=2} {add=[421]} 0 0
[junit4:junit4]   2> 2008 T2766 C175 UPDATE [collection1] webapp=/solr path=/update params={wt=javabin&version=2} {add=[422]} 0 0
[junit4:junit4]   2> 2011 T2768 C175 UPDATE [collection1] webapp=/solr path=/update params={wt=javabin&version=2} {add=[423]} 0 0
[junit4:junit4]   2> 2014 T2764 C175 UPDATE [collection1] webapp=/solr path=/update params={wt=javabin&version=2} {add=[424]} 0 0
[junit4:junit4]   2> 2017 T2770 C175 UPDATE [collection1] webapp=/solr path=/update params={wt=javabin&version=2} {add=[425]} 0 0
[junit4:junit4]   2> 2020 T2765 C175 UPDATE [collection1] webapp=/solr path=/update params={wt=javabin&version=2} {add=[426]} 0 0
[junit4:junit4]   2> 2024 T2769 C175 UPDATE [collection1] webapp=/solr path=/update params={wt=javabin&version=2} {add=[427]} 0 0
[junit4:junit4]   2> 2027 T2766 C175 UPDATE [collection1] webapp=/solr path=/update params={wt=javabin&version=2} {add=[428]} 0 0
[junit4:junit4]   2> 2030 T2768 C175 UPDATE [collection1] webapp=/solr path=/update params={wt=javabin&version=2} {add=[429]} 0 0
[junit4:junit4]   2> 2033 T2764 C175 UPDATE [collection1] webapp=/solr path=/update params={wt=javabin&version=2} {add=[430]} 0 0
[junit4:junit4]   2> 2037 T2770 C175 UPDATE [collection1] webapp=/solr path=/update params={wt=javabin&version=2} {add=[431]} 0 0
[junit4:junit4]   2> 2040 T2765 C175 UPDATE [collection1] webapp=/solr path=/update params={wt=javabin&version=2} {add=[432]} 0 0
[junit4:junit4]   2> 2043 T2769 C175 UPDATE [collection1] webapp=/solr path=/update params={wt=javabin&version=2} {add=[433]} 0 0
[junit4:junit4]   2> 2047 T2766 C175 UPDATE [collection1] webapp=/solr path=/update params={wt=javabin&version=2} {add=[434]} 0 0
[junit4:junit4]   2> 2051 T2768 C175 UPDATE [collection1] webapp=/solr path=/update params={wt=javabin&version=2} {add=[435]} 0 0
[junit4:junit4]   2> 2055 T2764 C175 UPDATE [collection1] webapp=/solr path=/update params={wt=javabin&version=2} {add=[436]} 0 0
[junit4:junit4]   2> 2062 T2770 C175 UPDATE [collection1] webapp=/solr path=/update params={wt=javabin&version=2} {add=[437]} 0 3
[junit4:junit4]   2> 2065 T2765 C175 UPDATE [collection1] webapp=/solr path=/update params={wt=javabin&version=2} {add=[438]} 0 0
[junit4:junit4]   2> 2068 T2769 C175 UPDATE [collection1] webapp=/solr path=/update params={wt=javabin&version=2} {add=[439]} 0 0
[junit4:junit4]   2> 2073 T2766 C175 UPDATE [collection1] webapp=/solr path=/update params={wt=javabin&version=2} {add=[440]} 0 0
[junit4:junit4]   2> 2077 T2768 C175 UPDATE [collection1] webapp=/solr path=/update params={wt=javabin&version=2} {add=[441]} 0 0
[junit4:junit4]   2> 2083 T2770 C175 UPDATE [collection1] webapp=/solr path=/update params={wt=javabin&version=2} {add=[442]} 0 0
[junit4:junit4]   2> 2086 T2765 C175 UPDATE [collection1] webapp=/solr path=/update params={wt=javabin&version=2} {add=[443]} 0 0
[junit4:junit4]   2> 2089 T2769 C175 UPDATE [collection1] webapp=/solr path=/update params={wt=javabin&version=2} {add=[444]} 0 0
[junit4:junit4]   2> 2092 T2766 C175 UPDATE [collection1] webapp=/solr path=/update params={wt=javabin&version=2} {add=[445]} 0 0
[junit4:junit4]   2> 2096 T2764 C175 UPDATE [collection1] webapp=/solr path=/update params={wt=javabin&version=2} {add=[446]} 0 0
[junit4:junit4]   2> 2100 T2768 C175 UPDATE [collection1] webapp=/solr path=/update params={wt=javabin&version=2} {add=[447]} 0 0
[junit4:junit4]   2> 2103 T2770 C175 UPDATE [collection1] webapp=/solr path=/update params={wt=javabin&version=2} {add=[448]} 0 0
[junit4:junit4]   2> 2106 T2765 C175 UPDATE [collection1] webapp=/solr path=/update params={wt=javabin&version=2} {add=[449]} 0 0
[junit4:junit4]   2> 2110 T2769 C175 UPDATE [collection1] webapp=/solr path=/update params={wt=javabin&version=2} {add=[450]} 0 0
[junit4:junit4]   2> 2114 T2766 C175 UPDATE [collection1] webapp=/solr path=/update params={wt=javabin&version=2} {add=[451]} 0 0
[junit4:junit4]   2> 2117 T2764 C175 UPDATE [collection1] webapp=/solr path=/update params={wt=javabin&version=2} {add=[452]} 0 0
[junit4:junit4]   2> 2120 T2768 C175 UPDATE [collection1] webapp=/solr path=/update params={wt=javabin&version=2} {add=[453]} 0 0
[junit4:junit4]   2> 2124 T2770 C175 UPDATE [collection1] webapp=/solr path=/update params={wt=javabin&version=2} {add=[454]} 0 0
[junit4:junit4]   2> 2127 T2765 C175 UPDATE [collection1] webapp=/solr path=/update params={wt=javabin&version=2} {add=[455]} 0 0
[junit4:junit4]   2> 2131 T2769 C175 UPDATE [collection1] webapp=/solr path=/update params={wt=javabin&version=2} {add=[456]} 0 0
[junit4:junit4]   2> 2134 T2766 C175 UPDATE [collection1] webapp=/solr path=/update params={wt=javabin&version=2} {add=[457]} 0 0
[junit4:junit4]   2> 2138 T2764 C175 UPDATE [collection1] webapp=/solr path=/update params={wt=javabin&version=2} {add=[458]} 0 0
[junit4:junit4]   2> 2141 T2768 C175 UPDATE [collection1] webapp=/solr path=/update params={wt=javabin&version=2} {add=[459]} 0 0
[junit4:junit4]   2> 2144 T2770 C175 UPDATE [collection1] webapp=/solr path=/update params={wt=javabin&version=2} {add=[460]} 0 0
[junit4:junit4]   2> 2148 T2765 C175 UPDATE [collection1] webapp=/solr path=/update params={wt=javabin&version=2} {add=[461]} 0 0
[junit4:junit4]   2> 2152 T2769 C175 UPDATE [collection1] webapp=/solr path=/update params={wt=javabin&version=2} {add=[462]} 0 0
[junit4:junit4]   2> 2155 T2766 C175 UPDATE [collection1] webapp=/solr path=/update params={wt=javabin&version=2} {add=[463]} 0 0
[junit4:junit4]   2> 2158 T2764 C175 UPDATE [collection1] webapp=/solr path=/update params={wt=javabin&version=2} {add=[464]} 0 0
[junit4:junit4]   2> 2161 T2768 C175 UPDATE [collection1] webapp=/solr path=/update params={wt=javabin&version=2} {add=[465]} 0 0
[junit4:junit4]   2> 2166 T2770 C175 UPDATE [collection1] webapp=/solr path=/update params={wt=javabin&version=2} {add=[466]} 0 0
[junit4:junit4]   2> 2169 T2765 C175 UPDATE [collection1] webapp=/solr path=/update params={wt=javabin&version=2} {add=[467]} 0 0
[junit4:junit4]   2> 2172 T2769 C175 UPDATE [collection1] webapp=/solr path=/update params={wt=javabin&version=2} {add=[468]} 0 0
[junit4:junit4]   2> 2175 T2766 C175 UPDATE [collection1] webapp=/solr path=/update params={wt=javabin&version=2} {add=[469]} 0 0
[junit4:junit4]   2> 2178 T2764 C175 UPDATE [collection1] webapp=/solr path=/update params={wt=javabin&version=2} {add=[470]} 0 0
[junit4:junit4]   2> 2182 T2768 C175 UPDATE [collection1] webapp=/solr path=/update params={wt=javabin&version=2} {add=[471]} 0 0
[junit4:junit4]   2> 2185 T2770 C175 UPDATE [collection1] webapp=/solr path=/update params={wt=javabin&version=2} {add=[472]} 0 0
[junit4:junit4]   2> 2188 T2765 C175 UPDATE [collection1] webapp=/solr path=/update params={wt=javabin&version=2} {add=[473]} 0 0
[junit4:junit4]   2> 2192 T2769 C175 UPDATE [collection1] webapp=/solr path=/update params={wt=javabin&version=2} {add=[474]} 0 0
[junit4:junit4]   2> 2195 T2766 C175 UPDATE [collection1] webapp=/solr path=/update params={wt=javabin&version=2} {add=[475]} 0 0
[junit4:junit4]   2> 2198 T2764 C175 UPDATE [collection1] webapp=/solr path=/update params={wt=javabin&version=2} {add=[476]} 0 0
[junit4:junit4]   2> 2201 T2768 C175 UPDATE [collection1] webapp=/solr path=/update params={wt=javabin&version=2} {add=[477]} 0 0
[junit4:junit4]   2> 2204 T2770 C175 UPDATE [collection1] webapp=/solr path=/update params={wt=javabin&version=2} {add=[478]} 0 0
[junit4:junit4]   2> 2208 T2765 C175 UPDATE [collection1] webapp=/solr path=/update params={wt=javabin&version=2} {add=[479]} 0 0
[junit4:junit4]   2> 2212 T2769 C175 UPDATE [collection1] webapp=/solr path=/update params={wt=javabin&version=2} {add=[480]} 0 0
[junit4:junit4]   2> 2215 T2766 C175 UPDATE [collection1] webapp=/solr path=/update params={wt=javabin&version=2} {add=[481]} 0 0
[junit4:junit4]   2> 2218 T2764 C175 UPDATE [collection1] webapp=/solr path=/update params={wt=javabin&version=2} {add=[482]} 0 0
[junit4:junit4]   2> 2221 T2768 C175 UPDATE [collection1] webapp=/solr path=/update params={wt=javabin&version=2} {add=[483]} 0 0
[junit4:junit4]   2> 2225 T2770 C175 UPDATE [collection1] webapp=/solr path=/update params={wt=javabin&version=2} {add=[484]} 0 0
[junit4:junit4]   2> 2228 T2765 C175 UPDATE [collection1] webapp=/solr path=/update params={wt=javabin&version=2} {add=[485]} 0 0
[junit4:junit4]   2> 2231 T2769 C175 UPDATE [collection1] webapp=/solr path=/update params={wt=javabin&version=2} {add=[486]} 0 0
[junit4:junit4]   2> 2234 T2766 C175 UPDATE [collection1] webapp=/solr path=/update params={wt=javabin&version=2} {add=[487]} 0 0
[junit4:junit4]   2> 2237 T2764 C175 UPDATE [collection1] webapp=/solr path=/update params={wt=javabin&version=2} {add=[488]} 0 0
[junit4:junit4]   2> 2242 T2768 C175 UPDATE [collection1] webapp=/solr path=/update params={wt=javabin&version=2} {add=[489]} 0 0
[junit4:junit4]   2> 2245 T2770 C175 UPDATE [collection1] webapp=/solr path=/update params={wt=javabin&version=2} {add=[490]} 0 0
[junit4:junit4]   2> 2248 T2765 C175 UPDATE [collection1] webapp=/solr path=/update params={wt=javabin&version=2} {add=[491]} 0 0
[junit4:junit4]   2> 2251 T2769 C175 UPDATE [collection1] webapp=/solr path=/update params={wt=javabin&version=2} {add=[492]} 0 0
[junit4:junit4]   2> 2255 T2766 C175 UPDATE [collection1] webapp=/solr path=/update params={wt=javabin&version=2} {add=[493]} 0 0
[junit4:junit4]   2> 2259 T2764 C175 UPDATE [collection1] webapp=/solr path=/update params={wt=javabin&version=2} {add=[494]} 0 0
[junit4:junit4]   2> 2262 T2768 C175 UPDATE [collection1] webapp=/solr path=/update params={wt=javabin&version=2} {add=[495]} 0 0
[junit4:junit4]   2> 2266 T2770 C175 UPDATE [collection1] webapp=/solr path=/update params={wt=javabin&version=2} {add=[496]} 0 1
[junit4:junit4]   2> 2269 T2765 C175 UPDATE [collection1] webapp=/solr path=/update params={wt=javabin&version=2} {add=[497]} 0 0
[junit4:junit4]   2> 2272 T2769 C175 UPDATE [collection1] webapp=/solr path=/update params={wt=javabin&version=2} {add=[498]} 0 0
[junit4:junit4]   2> 2275 T2766 C175 oasu.DirectUpdateHandler2.commit start commit{,optimize=false,openSearcher=true,waitSearcher=true,expungeDeletes=false,softCommit=false,prepareCommit=false}
[junit4:junit4]   2> 2284 T2766 C175 oasc.SolrDeletionPolicy.onCommit SolrDeletionPolicy.onCommit: commits:num=2
[junit4:junit4]   2> 		commit{dir=MockDirWrapper(org.apache.lucene.store.RAMDirectory@6eb02dc4 lockFactory=org.apache.lucene.store.SingleInstanceLockFactory@2ea0c4c1),segFN=segments_1,generation=1,filenames=[segments_1]
[junit4:junit4]   2> 		commit{dir=MockDirWrapper(org.apache.lucene.store.RAMDirectory@6eb02dc4 lockFactory=org.apache.lucene.store.SingleInstanceLockFactory@2ea0c4c1),segFN=segments_2,generation=2,filenames=[_0_Lucene40_0.tim, _0.fnm, _0_Lucene40_0.frq, _0_nrm.cfe, segments_2, _0.fdx, _0_nrm.cfs, _0.si, _0.fdt, _0_Lucene40_0.tip]
[junit4:junit4]   2> 2284 T2766 C175 oasc.SolrDeletionPolicy.updateCommits newest commit = 2[_0_Lucene40_0.tim, _0.fnm, _0_Lucene40_0.frq, _0_nrm.cfe, segments_2, _0.fdx, _0_nrm.cfs, _0.si, _0.fdt, _0_Lucene40_0.tip]
[junit4:junit4]   2> 2286 T2766 C175 oasc.CachingDirectoryFactory.close Releasing directory:C:\Users\JenkinsSlave\workspace\Lucene-Solr-trunk-Windows\solr\build\solr-core\test\J0\.\org.apache.solr.handler.TestReplicationHandler$SolrInstance-1361649724667\master\collection1\data
[junit4:junit4]   2> 2287 T2766 C175 oass.SolrIndexSearcher.<init> Opening Searcher@3743c840 main
[junit4:junit4]   2> 2287 T2766 C175 oasu.DirectUpdateHandler2.commit end_commit_flush
[junit4:junit4]   2> 2287 T2772 oasc.SolrCore.registerSearcher [collection1] Registered new searcher Searcher@3743c840 main{StandardDirectoryReader(segments_2:3 _0(5.0):C499)}
[junit4:junit4]   2> 2288 T2772 oasc.CachingDirectoryFactory.close Releasing directory:C:\Users\JenkinsSlave\workspace\Lucene-Solr-trunk-Windows\solr\build\solr-core\test\J0\.\org.apache.solr.handler.TestReplicationHandler$SolrInstance-1361649724667\master\collection1\data\index
[junit4:junit4]   2> 2288 T2766 C175 UPDATE [collection1] webapp=/solr path=/update params={waitSearcher=true&commit=true&wt=javabin&version=2&softCommit=false} {commit=} 0 13
[junit4:junit4]   2> 2291 T2764 C175 REQ [collection1] webapp=/solr path=/select params={q=*:*&wt=javabin&version=2} hits=499 status=0 QTime=0 
[junit4:junit4]   2> ASYNC  NEW_CORE C176 name=collection1 org.apache.solr.core.SolrCore@7796a530
[junit4:junit4]   2> 2415 T2780 C176 REQ [collection1] webapp=/solr path=/select params={q=*:*&wt=javabin&version=2} hits=0 status=0 QTime=1 
[junit4:junit4]   2> 2510 T2768 C175 REQ [collection1] webapp=/solr path=/replication params={command=indexversion&qt=/replication&wt=javabin&version=2} status=0 QTime=0 
[junit4:junit4]   2> 2511 T2784 oash.SnapPuller.fetchLatestIndex Master's generation: 2
[junit4:junit4]   2> 2511 T2784 oash.SnapPuller.fetchLatestIndex Slave's generation: 1
[junit4:junit4]   2> 2511 T2784 oash.SnapPuller.fetchLatestIndex Starting replication process
[junit4:junit4]   2> 2515 T2765 C175 oasc.CachingDirectoryFactory.close Releasing directory:C:\Users\JenkinsSlave\workspace\Lucene-Solr-trunk-Windows\solr\build\solr-core\test\J0\.\org.apache.solr.handler.TestReplicationHandler$SolrInstance-1361649724667\master\collection1\data
[junit4:junit4]   2> 2516 T2765 C175 oasc.CachingDirectoryFactory.close Releasing directory:C:\Users\JenkinsSlave\workspace\Lucene-Solr-trunk-Windows\solr\build\solr-core\test\J0\.\org.apache.solr.handler.TestReplicationHandler$SolrInstance-1361649724667\master\collection1\data\index
[junit4:junit4]   2> 2521 T2765 C175 REQ [collection1] webapp=/solr path=/replication params={command=filelist&qt=/replication&wt=javabin&generation=2&version=2} status=0 QTime=6 
[junit4:junit4]   2> 2522 T2784 oash.SnapPuller.fetchLatestIndex Number of files in latest index in master: 10
[junit4:junit4]   2> 2523 T2784 oasc.CachingDirectoryFactory.get return new directory for C:\Users\JenkinsSlave\workspace\Lucene-Solr-trunk-Windows\solr\build\solr-core\test\J0\.\org.apache.solr.handler.TestReplicationHandler$SolrInstance-1361649724966\slave\collection1\data\index.20130223130207183 forceNew:false
[junit4:junit4]   2> 2523 T2784 oasc.CachingDirectoryFactory.close Releasing directory:C:\Users\JenkinsSlave\workspace\Lucene-Solr-trunk-Windows\solr\build\solr-core\test\J0\.\org.apache.solr.handler.TestReplicationHandler$SolrInstance-1361649724966\slave\collection1\data
[junit4:junit4]   2> 2523 T2784 oash.SnapPuller.fetchLatestIndex Starting download to MockDirWrapper(org.apache.lucene.store.RAMDirectory@7e0f5d9f lockFactory=org.apache.lucene.store.SingleInstanceLockFactory@6b2c101f) fullCopy=false
[junit4:junit4]   2> 2526 T2769 C175 REQ [collection1] webapp=/solr path=/replication params={file=_0_Lucene40_0.tim&command=filecontent&checksum=true&wt=filestream&qt=/replication&generation=2} status=0 QTime=0 
[junit4:junit4]   2> 2531 T2781 C176 REQ [collection1] webapp=/solr path=/select params={q=*:*&wt=javabin&version=2} hits=0 status=0 QTime=1 
[junit4:junit4]   2> 2532 T2766 C175 REQ [collection1] webapp=/solr path=/replication params={file=_0.fnm&command=filecontent&checksum=true&wt=filestream&qt=/replication&generation=2} status=0 QTime=0 
[junit4:junit4]   2> 2536 T2764 C175 REQ [collection1] webapp=/solr path=/replication params={file=_0_Lucene40_0.frq&command=filecontent&checksum=true&wt=filestream&qt=/replication&generation=2} status=0 QTime=0 
[junit4:junit4]   2> 2539 T2770 C175 REQ [collection1] webapp=/solr path=/replication params={file=_0_nrm.cfe&command=filecontent&checksum=true&wt=filestream&qt=/replication&generation=2} status=0 QTime=0 
[junit4:junit4]   2> 2543 T2768 C175 REQ [collection1] webapp=/solr path=/replication params={file=segments_2&command=filecontent&checksum=true&wt=filestream&qt=/replication&generation=2} status=0 QTime=0 
[junit4:junit4]   2> 2548 T2765 C175 REQ [collection1] webapp=/solr path=/replication params={file=_0.fdx&command=filecontent&checksum=true&wt=filestream&qt=/replication&generation=2} status=0 QTime=0 
[junit4:junit4]   2> 2551 T2769 C175 REQ [collection1] webapp=/solr path=/replication params={file=_0_nrm.cfs&command=filecontent&checksum=true&wt=filestream&qt=/replication&generation=2} status=0 QTime=0 
[junit4:junit4]   2> 2554 T2766 C175 REQ [collection1] webapp=/solr path=/replication params={file=_0.si&command=filecontent&checksum=true&wt=filestream&qt=/replication&generation=2} status=0 QTime=0 
[junit4:junit4]   2> 2558 T2764 C175 REQ [collection1] webapp=/solr path=/replication params={file=_0.fdt&command=filecontent&checksum=true&wt=filestream&qt=/replication&generation=2} status=0 QTime=0 
[junit4:junit4]   2> 2561 T2770 C175 REQ [collection1] webapp=/solr path=/replication params={file=_0_Lucene40_0.tip&command=filecontent&checksum=true&wt=filestream&qt=/replication&generation=2} status=0 QTime=0 
[junit4:junit4]   2> 2562 T2784 oasc.CachingDirectoryFactory.close Releasing directory:C:\Users\JenkinsSlave\workspace\Lucene-Solr-trunk-Windows\solr\build\solr-core\test\J0\.\org.apache.solr.handler.TestReplicationHandler$SolrInstance-1361649724966\slave\collection1\data\index
[junit4:junit4]   2> 2562 T2784 oash.SnapPuller.fetchLatestIndex Total time taken for download : 0 secs
[junit4:junit4]   2> 2565 T2784 oasc.CachingDirectoryFactory.close Releasing directory:C:\Users\JenkinsSlave\workspace\Lucene-Solr-trunk-Windows\solr\build\solr-core\test\J0\.\org.apache.solr.handler.TestReplicationHandler$SolrInstance-1361649724966\slave\collection1\data
[junit4:junit4]   2> 2566 T2784 oasc.CachingDirectoryFactory.close Releasing directory:C:\Users\JenkinsSlave\workspace\Lucene-Solr-trunk-Windows\solr\build\solr-core\test\J0\.\org.apache.solr.handler.TestReplicationHandler$SolrInstance-1361649724966\slave\collection1\data
[junit4:junit4]   2> 2566 T2784 oasu.DefaultSolrCoreState.newIndexWriter Creating new IndexWriter...
[junit4:junit4]   2> 2566 T2784 oasu.DefaultSolrCoreState.newIndexWriter Waiting until IndexWriter is unused... core=collection1
[junit4:junit4]   2> 2566 T2784 oasc.CachingDirectoryFactory.close Releasing directory:C:\Users\JenkinsSlave\workspace\Lucene-Solr-trunk-Windows\solr\build\solr-core\test\J0\.\org.apache.solr.handler.TestReplicationHandler$SolrInstance-1361649724966\slave\collection1\data
[junit4:junit4]   2> 2567 T2784 oasc.SolrDeletionPolicy.onInit SolrDeletionPolicy.onInit: commits:num=2
[junit4:junit4]   2> 		commit{dir=MockDirWrapper(org.apache.lucene.store.RAMDirectory@3445cbe2 lockFactory=org.apache.lucene.store.SingleInstanceLockFactory@1bb25a01),segFN=segments_1,generation=1,filenames=[segments_1]
[junit4:junit4]   2> 		commit{dir=MockDirWrapper(org.apache.lucene.store.RAMDirectory@3445cbe2 lockFactory=org.apache.lucene.store.SingleInstanceLockFactory@1bb25a01),segFN=segments_2,generation=2,filenames=[_0_Lucene40_0.tim, _0.fnm, _0_Lucene40_0.frq, _0_nrm.cfe, segments_2, _0.fdx, _0_nrm.cfs, _0.si, _0.fdt, _0_Lucene40_0.tip]
[junit4:junit4]   2> 2568 T2784 oasc.SolrDeletionPolicy.updateCommits newest commit = 2[_0_Lucene40_0.tim, _0.fnm, _0_Lucene40_0.frq, _0_nrm.cfe, segments_2, _0.fdx, _0_nrm.cfs, _0.si, _0.fdt, _0_Lucene40_0.tip]
[junit4:junit4]   2> 2568 T2784 oasu.DefaultSolrCoreState.newIndexWriter New IndexWriter is ready to be used.
[junit4:junit4]   2> 2568 T2784 oasc.CachingDirectoryFactory.close Releasing directory:C:\Users\JenkinsSlave\workspace\Lucene-Solr-trunk-Windows\solr\build\solr-core\test\J0\.\org.apache.solr.handler.TestReplicationHandler$SolrInstance-1361649724966\slave\collection1\data
[junit4:junit4]   2> 2569 T2784 oass.SolrIndexSearcher.<init> Opening Searcher@1e1dc5f0 main
[junit4:junit4]   2> 2569 T2783 oasc.SolrCore.registerSearcher [collection1] Registered new searcher Searcher@1e1dc5f0 main{StandardDirectoryReader(segments_2:3:nrt _0(5.0):C499)}
[junit4:junit4]   2> 2569 T2783 oasc.CachingDirectoryFactory.close Releasing directory:C:\Users\JenkinsSlave\workspace\Lucene-Solr-trunk-Windows\solr\build\solr-core\test\J0\.\org.apache.solr.handler.TestReplicationHandler$SolrInstance-1361649724966\slave\collection1\data\index
[junit4:junit4]   2> 2569 T2784 oash.SnapPuller.fetchLatestIndex removing temporary index download directory files MockDirWrapper(org.apache.lucene.store.RAMDirectory@7e0f5d9f lockFactory=org.apache.lucene.store.SingleInstanceLockFactory@6b2c101f)
[junit4:junit4]   2> 2570 T2784 oasc.CachingDirectoryFactory.close Releasing directory:C:\Users\JenkinsSlave\workspace\Lucene-Solr-trunk-Windows\solr\build\solr-core\test\J0\.\org.apache.solr.handler.TestReplicationHandler$SolrInstance-1361649724966\slave\collection1\data\index.20130223130207183
[junit4:junit4]   2> 2570 T2784 oasc.CachingDirectoryFactory.close Releasing directory:C:\Users\JenkinsSlave\workspace\Lucene-Solr-trunk-Windows\solr\build\solr-core\test\J0\.\org.apache.solr.handler.TestReplicationHandler$SolrInstance-1361649724966\slave\collection1\data\index
[junit4:junit4]   2> 2644 T2777 C176 REQ [collection1] webapp=/solr path=/select params={q=*:*&wt=javabin&version=2} hits=499 status=0 QTime=0 
[junit4:junit4]   2> 2758 T2768 C175 oasu.DirectUpdateHandler2.deleteAll [collection1] REMOVING ALL DOCUMENTS FROM INDEX
[junit4:junit4]   2> 2760 T2768 C175 UPDATE [collection1] webapp=/solr path=/update params={wt=javabin&version=2} {deleteByQuery=*:*} 0 3
[junit4:junit4]   2> 2763 T2765 C175 oasu.DirectUpdateHandler2.commit start commit{,optimize=false,openSearcher=true,waitSearcher=true,expungeDeletes=false,softCommit=false,prepareCommit=false}
[junit4:junit4]   2> 2765 T2765 C175 oasc.SolrDeletionPolicy.onCommit SolrDeletionPolicy.onCommit: commits:num=3
[junit4:junit4]   2> 		commit{dir=MockDirWrapper(org.apache.lucene.store.RAMDirectory@6eb02dc4 lockFactory=org.apache.lucene.store.SingleInstanceLockFactory@2ea0c4c1),segFN=segments_1,generation=1,filenames=[segments_1]
[junit4:junit4]   2> 		commit{dir=MockDirWrapper(org.apache.lucene.store.RAMDirectory@6eb02dc4 lockFactory=org.apache.lucene.store.SingleInstanceLockFactory@2ea0c4c1),segFN=segments_2,generation=2,filenames=[_0_Lucene40_0.tim, _0.fnm, _0_Lucene40_0.frq, _0_nrm.cfe, segments_2, _0.fdx, _0_nrm.cfs, _0.si, _0.fdt, _0_Lucene40_0.tip]
[junit4:junit4]   2> 		commit{dir=MockDirWrapper(org.apache.lucene.store.RAMDirectory@6eb02dc4 lockFactory=org.apache.lucene.store.SingleInstanceLockFactory@2ea0c4c1),segFN=segments_3,generation=3,filenames=[segments_3]
[junit4:junit4]   2> 2766 T2765 C175 oasc.SolrDeletionPolicy.updateCommits newest commit = 3[segments_3]
[junit4:junit4]   2> 2766 T2765 C175 oasc.CachingDirectoryFactory.close Releasing directory:C:\Users\JenkinsSlave\workspace\Lucene-Solr-trunk-Windows\solr\build\solr-core\test\J0\.\org.apache.solr.handler.TestReplicationHandler$SolrInstance-1361649724667\master\collection1\data
[junit4:junit4]   2> 2767 T2765 C175 oass.SolrIndexSearcher.<init> Opening Searcher@14e85425 main
[junit4:junit4]   2> 2767 T2765 C175 oasu.DirectUpdateHandler2.commit end_commit_flush
[junit4:junit4]   2> 2768 T2772 oasc.SolrCore.registerSearcher [collection1] Registered new searcher Searcher@14e85425 main{StandardDirectoryReader(segments_3:4)}
[junit4:junit4]   2> 2768 T2772 oasc.CachingDirectoryFactory.close Releasing directory:C:\Users\JenkinsSlave\workspace\Lucene-Solr-trunk-Windows\solr\build\solr-core\test\J0\.\org.apache.solr.handler.TestReplicationHandler$SolrInstance-1361649724667\master\collection1\data\index
[junit4:junit4]   2> 2768 T2765 C175 UPDATE [collection1] webapp=/solr path=/update params={waitSearcher=true&commit=true&wt=javabin&version=2&softCommit=false} {commit=} 0 5
[junit4:junit4]   2> 2792 T2761 oasc.CoreContainer.shutdown Shutting down CoreContainer instance=1148004937
[junit4:junit4]   2> 2793 T2761 oasc.SolrCore.close [collection1]  CLOSING SolrCore org.apache.solr.core.SolrCore@8730a7a
[junit4:junit4]   2> 2793 T2761 oasu.DirectUpdateHandler2.close closing DirectUpdateHandler2{commits=2,autocommits=0,soft autocommits=0,optimizes=0,rollbacks=0,expungeDeletes=0,docsPending=0,adds=0,deletesById=0,deletesByQuery=0,errors=0,cumulative_adds=499,cumulative_deletesById=0,cumulative_deletesByQuery=1,cumulative_errors=0}
[junit4:junit4]   2> 2794 T2761 oasu.SolrCoreState.decrefSolrCoreState Closing SolrCoreState
[junit4:junit4]   2> 2794 T2761 oasu.DefaultSolrCoreState.closeIndexWriter SolrCoreState ref count has reached 0 - closing IndexWriter
[junit4:junit4]   2> 2794 T2761 oasu.DefaultSolrCoreState.closeIndexWriter closing IndexWriter with IndexWriterCloser
[junit4:junit4]   2> 2796 T2761 C175 oasc.CachingDirectoryFactory.close Releasing directory:C:\Users\JenkinsSlave\workspace\Lucene-Solr-trunk-Windows\solr\build\solr-core\test\J0\.\org.apache.solr.handler.TestReplicationHandler$SolrInstance-1361649724667\master\collection1\data\index
[junit4:junit4]   2> 2797 T2761 oasc.SolrCore.closeSearcher [collection1] Closing main searcher on request.
[junit4:junit4]   2> 2797 T2761 oasc.CachingDirectoryFactory.close Releasing directory:C:\Users\JenkinsSlave\workspace\Lucene-Solr-trunk-Windows\solr\build\solr-core\test\J0\.\org.apache.solr.handler.TestReplicationHandler$SolrInstance-1361649724667\master\collection1\data\index
[junit4:junit4]   2> 2797 T2761 oasc.CachingDirectoryFactory.close Closing directory when closing factory:C:\Users\JenkinsSlave\workspace\Lucene-Solr-trunk-Windows\solr\build\solr-core\test\J0\.\org.apache.solr.handler.TestReplicationHandler$SolrInstance-1361649724667\master\collection1\data
[junit4:junit4]   2> 2798 T2761 oasc.CachingDirectoryFactory.closeDirectory Closing directory:C:\Users\JenkinsSlave\workspace\Lucene-Solr-trunk-Windows\solr\build\solr-core\test\J0\.\org.apache.solr.handler.TestReplicationHandler$SolrInstance-1361649724667\master\collection1\data
[junit4:junit4]   2> 2798 T2761 oasc.CachingDirectoryFactory.close Closing directory when closing factory:C:\Users\JenkinsSlave\workspace\Lucene-Solr-trunk-Windows\solr\build\solr-core\test\J0\.\org.apache.solr.handler.TestReplicationHandler$SolrInstance-1361649724667\master\collection1\data\index
[junit4:junit4]   2> 2798 T2761 oasc.CachingDirectoryFactory.closeDirectory Closing directory:C:\Users\JenkinsSlave\workspace\Lucene-Solr-trunk-Windows\solr\build\solr-core\test\J0\.\org.apache.solr.handler.TestReplicationHandler$SolrInstance-1361649724667\master\collection1\data\index
[junit4:junit4]   2> 2798 T2761 oejsh.ContextHandler.doStop stopped o.e.j.s.ServletContextHandler{/solr,null}
[junit4:junit4]   2> 2851 T2761 oejs.Server.doStart jetty-8.1.8.v20121106
[junit4:junit4]   2> 2854 T2761 oejs.AbstractConnector.doStart Started SelectChannelConnector@127.0.0.1:59445
[junit4:junit4]   2> 2855 T2761 oass.SolrDispatchFilter.init SolrDispatchFilter.init()
[junit4:junit4]   2> 2856 T2761 oasc.SolrResourceLoader.locateSolrHome JNDI not configured for solr (NoInitialContextEx)
[junit4:junit4]   2> 2856 T2761 oasc.SolrResourceLoader.locateSolrHome using system property solr.solr.home: .\org.apache.solr.handler.TestReplicationHandler$SolrInstance-1361649724667\master
[junit4:junit4]   2> 2856 T2761 oasc.CoreContainer$Initializer.initialize looking for solr.xml: C:\Users\JenkinsSlave\workspace\Lucene-Solr-trunk-Windows\solr\build\solr-core\test\J0\.\org.apache.solr.handler.TestReplicationHandler$SolrInstance-1361649724667\master\solr.xml
[junit4:junit4]   2> 2857 T2761 oasc.CoreContainer.<init> New CoreContainer 1002692103
[junit4:junit4]   2> 2858 T2761 oasc.CoreContainer$Initializer.initialize no solr.xml file found - using default
[junit4:junit4]   2> 2858 T2761 oasc.CoreContainer.load Loading CoreContainer using Solr Home: '.\org.apache.solr.handler.TestReplicationHandler$SolrInstance-1361649724667\master\'
[junit4:junit4]   2> 2859 T2761 oasc.SolrResourceLoader.<init> new SolrResourceLoader for directory: '.\org.apache.solr.handler.TestReplicationHandler$SolrInstance-1361649724667\master\'
[junit4:junit4]   2> 2907 T2761 oashc.HttpShardHandlerFactory.getParameter Setting socketTimeout to: 0
[junit4:junit4]   2> 2907 T2761 oashc.HttpShardHandlerFactory.getParameter Setting urlScheme to: http://
[junit4:junit4]   2> 2907 T2761 oashc.HttpShardHandlerFactory.getParameter Setting connTimeout to: 0
[junit4:junit4]   2> 2908 T2761 oashc.HttpShardHandlerFactory.getParameter Setting maxConnectionsPerHost to: 20
[junit4:junit4]   2> 2908 T2761 oashc.HttpShardHandlerFactory.getParameter Setting corePoolSize to: 0
[junit4:junit4]   2> 2909 T2761 oashc.HttpShardHandlerFactory.getParameter Setting maximumPoolSize to: 2147483647
[junit4:junit4]   2> 2909 T2761 oashc.HttpShardHandlerFactory.getParameter Setting maxThreadIdleTime to: 5
[junit4:junit4]   2> 2909 T2761 oashc.HttpShardHandlerFactory.getParameter Setting sizeOfQueue to: -1
[junit4:junit4]   2> 2910 T2761 oashc.HttpShardHandlerFactory.getParameter Setting fairnessPolicy to: false
[junit4:junit4]   2> 2910 T2761 oascsi.HttpClientUtil.createClient Creating new http client, config:maxConnectionsPerHost=20&maxConnections=10000&socketTimeout=0&connTimeout=0&retry=false
[junit4:junit4]   2> 2925 T2761 oasc.CoreContainer.load Registering Log Listener
[junit4:junit4]   2> 2953 T2795 oasc.CoreContainer.create Creating SolrCore 'collection1' using instanceDir: .\org.apache.solr.handler.TestReplicationHandler$SolrInstance-1361649724667\master\collection1
[junit4:junit4]   2> 2954 T2795 oasc.SolrResourceLoader.<init> new SolrResourceLoader for directory: '.\org.apache.solr.handler.TestReplicationHandler$SolrInstance-1361649724667\master\collection1\'
[junit4:junit4]   2> 3007 T2795 oasc.SolrConfig.<init> Using Lucene MatchVersion: LUCENE_50
[junit4:junit4]   2> 3069 T2795 oasc.SolrConfig.<init> Loaded SolrConfig: solrconfig.xml
[junit4:junit4]   2> 3070 T2795 oass.IndexSchema.readSchema Reading Solr Schema
[junit4:junit4]   2> 3073 T2795 oass.IndexSchema.readSchema Schema name=test
[junit4:junit4]   2> 3096 T2795 oass.IndexSchema.readSchema unique key field: id
[junit4:junit4]   2> 3098 T2795 oasc.SolrCore.<init> [collection1] Opening new SolrCore at .\org.apache.solr.handler.TestReplicationHandler$SolrInstance-1361649724667\master\collection1\, dataDir=.\org.apache.solr.handler.TestReplicationHandler$SolrInstance-1361649724667\master\collection1\data\
[junit4:junit4]   2> 3098 T2795 oasc.SolrCore.<init> JMX monitoring not detected for core: collection1
[junit4:junit4]   2> 3099 T2795 oasc.SolrCore.initDirectoryFactory org.apache.solr.core.MockDirectoryFactory
[junit4:junit4]   2> 3099 T2795 oasc.CachingDirectoryFactory.get return new directory for C:\Users\JenkinsSlave\workspace\Lucene-Solr-trunk-Windows\solr\build\solr-core\test\J0\.\org.apache.solr.handler.TestReplicationHandler$SolrInstance-1361649724667\master\collection1\data forceNew:false
[junit4:junit4]   2> 3099 T2795 oasc.CachingDirectoryFactory.close Releasing directory:C:\Users\JenkinsSlave\workspace\Lucene-Solr-trunk-Windows\solr\build\solr-core\test\J0\.\org.apache.solr.handler.TestReplicationHandler$SolrInstance-1361649724667\master\collection1\data
[junit4:junit4]   2> 3099 T2795 oasc.SolrCore.getNewIndexDir New index directory detected: old=null new=.\org.apache.solr.handler.TestReplicationHandler$SolrInstance-1361649724667\master\collection1\data\index/
[junit4:junit4]   2> 3101 T2795 oasc.SolrCore.initIndex WARNING [collection1] Solr index directory '.\org.apache.solr.handler.TestReplicationHandler$SolrInstance-1361649724667\master\collection1\data\index' doesn't exist. Creating new index...
[junit4:junit4]   2> 3101 T2795 oasc.CachingDirectoryFactory.get return new directory for C:\Users\JenkinsSlave\workspace\Lucene-Solr-trunk-Windows\solr\build\solr-core\test\J0\.\org.apache.solr.handler.TestReplicationHandler$SolrInstance-1361649724667\master\collection1\data\index forceNew:false
[junit4:junit4]   2> 3102 T2795 oasc.SolrDeletionPolicy.onCommit SolrDeletionPolicy.onCommit: commits:num=1
[junit4:junit4]   2> 		commit{dir=MockDirWrapper(org.apache.lucene.store.RAMDirectory@64c5f7e4 lockFactory=org.apache.lucene.store.SingleInstanceLockFactory@3e616e02),segFN=segments_1,generation=1,filenames=[segments_1]
[junit4:junit4]   2> 3103 T2795 oasc.SolrDeletionPolicy.updateCommits newest commit = 1[segments_1]
[junit4:junit4]   2> 3103 T2795 oasc.CachingDirectoryFactory.close Releasing directory:C:\Users\JenkinsSlave\workspace\Lucene-Solr-trunk-Windows\solr\build\solr-core\test\J0\.\org.apache.solr.handler.TestReplicationHandler$SolrInstance-1361649724667\master\collection1\data\index
[junit4:junit4]   2> 3103 T2795 oasc.RequestHandlers.initHandlersFromConfig created standard: solr.StandardRequestHandler
[junit4:junit4]   2> 3103 T2795 oasc.RequestHandlers.initHandlersFromConfig created /replication: solr.ReplicationHandler
[junit4:junit4]   2> 3104 T2795 oasc.RequestHandlers.initHandlersFromConfig created defaults: solr.StandardRequestHandler
[junit4:junit4]   2> 3104 T2795 oasc.RequestHandlers.initHandlersFromConfig adding lazy requestHandler: solr.StandardRequestHandler
[junit4:junit4]   2> 3104 T2795 oasc.RequestHandlers.initHandlersFromConfig created lazy: solr.StandardRequestHandler
[junit4:junit4]   2> 3105 T2795 oasc.RequestHandlers.initHandlersFromConfig created /update: solr.UpdateRequestHandler
[junit4:junit4]   2> 3114 T2795 oashl.XMLLoader.init xsltCacheLifetimeSeconds=60
[junit4:junit4]   2> 3117 T2795 oasc.CachingDirectoryFactory.close Releasing directory:C:\Users\JenkinsSlave\workspace\Lucene-Solr-trunk-Windows\solr\build\solr-core\test\J0\.\org.apache.solr.handler.TestReplicationHandler$SolrInstance-1361649724667\master\collection1\data
[junit4:junit4]   2> 3118 T2795 oass.SolrIndexSearcher.<init> Opening Searcher@51ed33a5 main
[junit4:junit4]   2> 3118 T2795 oasu.CommitTracker.<init> Hard AutoCommit: disabled
[junit4:junit4]   2> 3118 T2795 oasu.CommitTracker.<init> Soft AutoCommit: disabled
[junit4:junit4]   2> 3119 T2795 oash.ReplicationHandler.inform Replication enabled for following config files: schema-replication2.xml:schema.xml
[junit4:junit4]   2> 3119 T2795 oash.ReplicationHandler.inform Commits will be reserved for  10000
[junit4:junit4]   2> 3119 T2795 oasc.CoreContainer.registerCore registering core: collection1
[junit4:junit4]   2> 3119 T2796 oasc.SolrCore.registerSearcher [collection1] Registered new searcher Searcher@51ed33a5 main{StandardDirectoryReader(segments_1:1)}
[junit4:junit4]   2> 3119 T2761 oass.SolrDispatchFilter.init user.dir=C:\Users\JenkinsSlave\workspace\Lucene-Solr-trunk-Windows\solr\build\solr-core\test\J0
[junit4:junit4]   2> 3120 T2761 oass.SolrDispatchFilter.init SolrDispatchFilter.init() done
[junit4:junit4]   2> 3120 T2761 oascsi.HttpClientUtil.createClient Creating new http client, config:maxConnections=128&maxConnectionsPerHost=32&followRedirects=false
[junit4:junit4]   2> 3140 T2761 oasc.CoreContainer.shutdown Shutting down CoreContainer instance=1709626418
[junit4:junit4]   2> 3141 T2761 oasc.SolrCore.close [collection1]  CLOSING SolrCore org.apache.solr.core.SolrCore@7796a530
[junit4:junit4]   2> 3142 T2761 oasu.DirectUpdateHandler2.close closing DirectUpdateHandler2{commits=0,autocommits=0,soft autocommits=0,optimizes=0,rollbacks=0,expungeDeletes=0,docsPending=0,adds=0,deletesById=0,deletesByQuery=0,errors=0,cumulative_adds=0,cumulative_deletesById=0,cumulative_deletesByQuery=0,cumulative_errors=0}
[junit4:junit4]   2> 3143 T2761 oasu.SolrCoreState.decrefSolrCoreState Closing SolrCoreState
[junit4:junit4]   2> 3143 T2761 oasu.DefaultSolrCoreState.closeIndexWriter SolrCoreState ref count has reached 0 - closing IndexWriter
[junit4:junit4]   2> 3143 T2761 oasu.DefaultSolrCoreState.closeIndexWriter closing IndexWriter with IndexWriterCloser
[junit4:junit4]   2> 3144 T2761 C176 oasc.CachingDirectoryFactory.close Releasing directory:C:\Users\JenkinsSlave\workspace\Lucene-Solr-trunk-Windows\solr\build\solr-core\test\J0\.\org.apache.solr.handler.TestReplicationHandler$SolrInstance-1361649724966\slave\collection1\data\index
[junit4:junit4]   2> 3145 T2761 oasc.SolrCore.closeSearcher [collection1] Closing main searcher on request.
[junit4:junit4]   2> 3145 T2761 oasc.CachingDirectoryFactory.close Releasing directory:C:\Users\JenkinsSlave\workspace\Lucene-Solr-trunk-Windows\solr\build\solr-core\test\J0\.\org.apache.solr.handler.TestReplicationHandler$SolrInstance-1361649724966\slave\collection1\data\index
[junit4:junit4]   2> 3145 T2761 oasc.CachingDirectoryFactory.close Closing directory when closing factory:C:\Users\JenkinsSlave\workspace\Lucene-Solr-trunk-Windows\solr\build\solr-core\test\J0\.\org.apache.solr.handler.TestReplicationHandler$SolrInstance-1361649724966\slave\collection1\data
[junit4:junit4]   2> 3146 T2761 oasc.CachingDirectoryFactory.closeDirectory Closing directory:C:\Users\JenkinsSlave\workspace\Lucene-Solr-trunk-Windows\solr\build\solr-core\test\J0\.\org.apache.solr.handler.TestReplicationHandler$SolrInstance-1361649724966\slave\collection1\data
[junit4:junit4]   2> 3146 T2761 oasc.CachingDirectoryFactory.close Closing directory when closing factory:C:\Users\JenkinsSlave\workspace\Lucene-Solr-trunk-Windows\solr\build\solr-core\test\J0\.\org.apache.solr.handler.TestReplicationHandler$SolrInstance-1361649724966\slave\collection1\data\index.20130223130207183
[junit4:junit4]   2> 3147 T2761 oasc.CachingDirectoryFactory.closeDirectory Closing directory:C:\Users\JenkinsSlave\workspace\Lucene-Solr-trunk-Windows\solr\build\solr-core\test\J0\.\org.apache.solr.handler.TestReplicationHandler$SolrInstance-1361649724966\slave\collection1\data\index.20130223130207183
[junit4:junit4]   2> 3147 T2761 oasc.CachingDirectoryFactory.close Closing directory when closing factory:C:\Users\JenkinsSlave\workspace\Lucene-Solr-trunk-Windows\solr\build\solr-core\test\J0\.\org.apache.solr.handler.TestReplicationHandler$SolrInstance-1361649724966\slave\collection1\data\index
[junit4:junit4]   2> 3148 T2761 oasc.CachingDirectoryFactory.closeDirectory Closing directory:C:\Users\JenkinsSlave\workspace\Lucene-Solr-trunk-Windows\solr\build\solr-core\test\J0\.\org.apache.solr.handler.TestReplicationHandler$SolrInstance-1361649724966\slave\collection1\data\index
[junit4:junit4]   2> 3148 T2761 oejsh.ContextHandler.doStop stopped o.e.j.s.ServletContextHandler{/solr,null}
[junit4:junit4]   2> 3201 T2761 oejs.Server.doStart jetty-8.1.8.v20121106
[junit4:junit4]   2> 3205 T2761 oejs.AbstractConnector.doStart Started SelectChannelConnector@127.0.0.1:59448
[junit4:junit4]   2> 3206 T2761 oass.SolrDispatchFilter.init SolrDispatchFilter.init()
[junit4:junit4]   2> 3207 T2761 oasc.SolrResourceLoader.locateSolrHome JNDI not configured for solr (NoInitialContextEx)
[junit4:junit4]   2> 3207 T2761 oasc.SolrResourceLoader.locateSolrHome using system property solr.solr.home: .\org.apache.solr.handler.TestReplicationHandler$SolrInstance-1361649724966\slave
[junit4:junit4]   2> 3207 T2761 oasc.CoreContainer$Initializer.initialize looking for solr.xml: C:\Users\JenkinsSlave\workspace\Lucene-Solr-trunk-Windows\solr\build\solr-core\test\J0\.\org.apache.solr.handler.TestReplicationHandler$SolrInstance-1361649724966\slave\solr.xml
[junit4:junit4]   2> 3209 T2761 oasc.CoreContainer.<init> New CoreContainer 1966451757
[junit4:junit4]   2> 3209 T2761 oasc.CoreContainer$Initializer.initialize no solr.xml file found - using default
[junit4:junit4]   2> 3209 T2761 oasc.CoreContainer.load Loading CoreContainer using Solr Home: '.\org.apache.solr.handler.TestReplicationHandler$SolrInstance-1361649724966\slave\'
[junit4:junit4]   2> 3210 T2761 oasc.SolrResourceLoader.<init> new SolrResourceLoader for directory: '.\org.apache.solr.handler.TestReplicationHandler$SolrInstance-1361649724966\slave\'
[junit4:junit4]   2> 3230 T2761 oashc.HttpShardHandlerFactory.getParameter Setting socketTimeout to: 0
[junit4:junit4]   2> 3230 T2761 oashc.HttpShardHandlerFactory.getParameter Setting urlScheme to: http://
[junit4:junit4]   2> 3231 T2761 oashc.HttpShardHandlerFactory.getParameter Setting connTimeout to: 0
[junit4:junit4]   2> 3231 T2761 oashc.HttpShardHandlerFactory.getParameter Setting maxConnectionsPerHost to: 20
[junit4:junit4]   2> 3231 T2761 oashc.HttpShardHandlerFactory.getParameter Setting corePoolSize to: 0
[junit4:junit4]   2> 3232 T2761 oashc.HttpShardHandlerFactory.getParameter Setting maximumPoolSize to: 2147483647
[junit4:junit4]   2> 3232 T2761 oashc.HttpShardHandlerFactory.getParameter Setting maxThreadIdleTime to: 5
[junit4:junit4]   2> 3233 T2761 oashc.HttpShardHandlerFactory.getParameter Setting sizeOfQueue to: -1
[junit4:junit4]   2> 3233 T2761 oashc.HttpShardHandlerFactory.getParameter Setting fairnessPolicy to: false
[junit4:junit4]   2> 3233 T2761 oascsi.HttpClientUtil.createClient Creating new http client, config:maxConnectionsPerHost=20&maxConnections=10000&socketTimeout=0&connTimeout=0&retry=false
[junit4:junit4]   2> 3246 T2761 oasc.CoreContainer.load Registering Log Listener
[junit4:junit4]   2> 3275 T2806 oasc.CoreContainer.create Creating SolrCore 'collection1' using instanceDir: .\org.apache.solr.handler.TestReplicationHandler$SolrInstance-1361649724966\slave\collection1
[junit4:junit4]   2> 3276 T2806 oasc.SolrResourceLoader.<init> new SolrResourceLoader for directory: '.\org.apache.solr.handler.TestReplicationHandler$SolrInstance-1361649724966\slave\collection1\'
[junit4:junit4]   2> 3360 T2806 oasc.SolrConfig.<init> Using Lucene MatchVersion: LUCENE_50
[junit4:junit4]   2> 3421 T2806 oasc.SolrConfig.<init> Loaded SolrConfig: solrconfig.xml
[junit4:junit4]   2> 3421 T2806 oass.IndexSchema.readSchema Reading Solr Schema
[junit4:junit4]   2> 3428 T2806 oass.IndexSchema.readSchema Schema name=test
[junit4:junit4]   2> 3452 T2806 oass.IndexSchema.readSchema unique key field: id
[junit4:junit4]   2> 3453 T2806 oasc.SolrCore.<init> [collection1] Opening new SolrCore at .\org.apache.solr.handler.TestReplicationHandler$SolrInstance-1361649724966\slave\collection1\, dataDir=.\org.apache.solr.handler.TestReplicationHandler$SolrInstance-1361649724966\slave\collection1\data\
[junit4:junit4]   2> 3453 T2806 oasc.SolrCore.<init> JMX monitoring not detected for core: collection1
[junit4:junit4]   2> 3453 T2806 oasc.SolrCore.initDirectoryFactory org.apache.solr.core.MockDirectoryFactory
[junit4:junit4]   2> 3455 T2806 oasc.CachingDirectoryFactory.get return new directory for C:\Users\JenkinsSlave\workspace\Lucene-Solr-trunk-Windows\solr\build\solr-core\test\J0\.\org.apache.solr.handler.TestReplicationHandler$SolrInstance-1361649724966\slave\collection1\data forceNew:false
[junit4:junit4]   2> 3456 T2806 oasc.CachingDirectoryFactory.close Releasing directory:C:\Users\JenkinsSlave\workspace\Lucene-Solr-trunk-Windows\solr\build\solr-core\test\J0\.\org.apache.solr.handler.TestReplicationHandler$SolrInstance-1361649724966\slave\collection1\data
[junit4:junit4]   2> 3456 T2806 oasc.SolrCore.getNewIndexDir New index directory detected: old=null new=.\org.apache.solr.handler.TestReplicationHandler$SolrInstance-1361649724966\slave\collection1\data\index/
[junit4:junit4]   2> 3456 T2806 oasc.SolrCore.initIndex WARNING [collection1] Solr index directory '.\org.apache.solr.handler.TestReplicationHandler$SolrInstance-1361649724966\slave\collection1\data\index' doesn't exist. Creating new index...
[junit4:junit4]   2> 3457 T2806 oasc.CachingDirectoryFactory.get return new directory for C:\Users\JenkinsSlave\workspace\Lucene-Solr-trunk-Windows\solr\build\solr-core\test\J0\.\org.apache.solr.handler.TestReplicationHandler$SolrInstance-1361649724966\slave\collection1\data\index forceNew:false
[junit4:junit4]   2> 3458 T2806 oasc.SolrDeletionPolicy.onCommit SolrDeletionPolicy.onCommit: commits:num=1
[junit4:junit4]   2> 		commit{dir=MockDirWrapper(org.apache.lucene.store.RAMDirectory@568b76f lockFactory=org.apache.lucene.store.SingleInstanceLockFactory@18a3f9fd),segFN=segments_1,generation=1,filenames=[segments_1]
[junit4:junit4]   2> 3458 T2806 oasc.SolrDeletionPolicy.updateCommits newest commit = 1[segments_1]
[junit4:junit4]   2> 3458 T2806 oasc.CachingDirectoryFactory.close Releasing directory:C:\Users\JenkinsSlave\workspace\Lucene-Solr-trunk-Windows\solr\build\solr-core\test\J0\.\org.apache.solr.handler.TestReplicationHandler$SolrInstance-1361649724966\slave\collection1\data\index
[junit4:junit4]   2> 3459 T2806 oasc.RequestHandlers.initHandlersFromConfig created standard: solr.StandardRequestHandler
[junit4:junit4]   2> 3459 T2806 oasc.RequestHandlers.initHandlersFromConfig created defaults: solr.StandardRequestHandler
[junit4:junit4]   2> 3460 T2806 oasc.RequestHandlers.initHandlersFromConfig adding lazy requestHandler: solr.StandardRequestHandler
[junit4:junit4]   2> 3460 T2806 oasc.RequestHandlers.initHandlersFromConfig created lazy: solr.StandardRequestHandler
[junit4:junit4]   2> 3460 T2806 oasc.RequestHandlers.initHandlersFromConfig created /update: solr.UpdateRequestHandler
[junit4:junit4]   2> 3460 T2806 oasc.RequestHandlers.initHandlersFromConfig created /replication: solr.ReplicationHandler
[junit4:junit4]   2> 3462 T2806 oashl.XMLLoader.init xsltCacheLifetimeSeconds=60
[junit4:junit4]   2> 3466 T2806 oasc.CachingDirectoryFactory.close Releasing directory:C:\Users\JenkinsSlave\workspace\Lucene-Solr-trunk-Windows\solr\build\solr-core\test\J0\.\org.apache.solr.handler.TestReplicationHandler$SolrInstance-1361649724966\slave\collection1\data
[junit4:junit4]   2> 3466 T2806 oass.SolrIndexSearcher.<init> Opening Searcher@583662ef main
[junit4:junit4]   2> 3466 T2806 oasu.CommitTracker.<init> Hard AutoCommit: disabled
[junit4:junit4]   2> 3467 T2806 oasu.CommitTracker.<init> Soft AutoCommit: disabled
[junit4:junit4]   2> 3467 T2806 oash.SnapPuller.startExecutorService Poll Scheduled at an interval of 1000ms
[junit4:junit4]   2> 3467 T2806 oasc.CoreContainer.registerCore registering core: collection1
[junit4:junit4]   2> 3467 T2807 oasc.SolrCore.registerSearcher [collection1] Registered new searcher Searcher@583662ef main{StandardDirectoryReader(segments_1:1)}
[junit4:junit4]   2> 3469 T2761 oass.SolrDispatchFilter.init user.dir=C:\Users\JenkinsSlave\workspace\Lucene-Solr-trunk-Windows\solr\build\solr-core\test\J0
[junit4:junit4]   2> 3469 T2761 oass.SolrDispatchFilter.init SolrDispatchFilter.init() done
[junit4:junit4]   2> 3470 T2761 oascsi.HttpClientUtil.createClient Creating new http client, config:maxConnections=128&maxConnectionsPerHost=32&followRedirects=false
[junit4:junit4]   2> ASYNC  NEW_CORE C177 name=collection1 org.apache.solr.core.SolrCore@16dcc655
[junit4:junit4]   2> 3484 T2790 C177 oasc.CachingDirectoryFactory.close Releasing directory:C:\Users\JenkinsSlave\workspace\Lucene-Solr-trunk-Windows\solr\build\solr-core\test\J0\.\org.apache.solr.handler.TestReplicationHandler$SolrInstance-1361649724667\master\collection1\data
[junit4:junit4]   2> 3485 T2790 C177 oasc.SolrDeletionPolicy.onInit SolrDeletionPolicy.onInit: commits:num=1
[junit4:junit4]   2> 		commit{dir=MockDirWrapper(org.apache.lucene.store.RAMDirectory@64c5f7e4 lockFactory=org.apache.lucene.store.SingleInstanceLockFactory@3e616e02),segFN=segments_1,generation=1,filenames=[segments_1]
[junit4:junit4]   2> 3486 T2790 C177 oasc.SolrDeletionPolicy.updateCommits newest commit = 1[segments_1]
[junit4:junit4]   2> 3486 T2790 C177 UPDATE [collection1] webapp=/solr path=/update params={wt=javabin&version=2} {add=[2000]} 0 4
[junit4:junit4]   2> 3489 T2791 C177 oasu.DirectUpdateHandler2.commit start commit{,optimize=false,openSearcher=true,waitSearcher=true,expungeDeletes=false,softCommit=false,prepareCommit=false}
[junit4:junit4]   2> 3492 T2791 C177 oasc.SolrDeletionPolicy.onCommit SolrDeletionPolicy.onCommit: commits:num=2
[junit4:junit4]   2> 		commit{dir=MockDirWrapper(org.apache.lucene.store.RAMDirectory@64c5f7e4 lockFactory=org.apache.lucene.store.SingleInstanceLockFactory@3e616e02),segFN=segments_1,generation=1,filenames=[segments_1]
[junit4:junit4]   2> 		commit{dir=MockDirWrapper(org.apache.lucene.store.RAMDirectory@64c5f7e4 lockFactory=org.apache.lucene.store.SingleInstanceLockFactory@3e616e02),segFN=segments_2,generation=2,filenames=[_0_Lucene40_0.tim, _0.fnm, _0_Lucene40_0.frq, _0_nrm.cfe, segments_2, _0.fdx, _0_nrm.cfs, _0.si, _0.fdt, _0_Lucene40_0.tip]
[junit4:junit4]   2> 3492 T2791 C177 oasc.SolrDeletionPolicy.updateCommits newest commit = 2[_0_Lucene40_0.tim, _0.fnm, _0_Lucene40_0.frq, _0_nrm.cfe, segments_2, _0.fdx, _0_nrm.cfs, _0.si, _0.fdt, _0_Lucene40_0.tip]
[junit4:junit4]   2> 3493 T2791 C177 oasc.CachingDirectoryFactory.close Releasing directory:C:\Users\JenkinsSlave\workspace\Lucene-Solr-trunk-Windows\solr\build\solr-core\test\J0\.\org.apache.solr.handler.TestReplicationHandler$SolrInstance-1361649724667\master\collection1\data
[junit4:junit4]   2> 3494 T2791 C177 oass.SolrIndexSearcher.<init> Opening Searcher@48ed10bc main
[junit4:junit4]   2> 3494 T2791 C177 oasu.DirectUpdateHandler2.commit end_commit_flush
[junit4:junit4]   2> 3495 T2796 oasc.SolrCore.registerSearcher [collection1] Registered new searcher Searcher@48ed10bc main{StandardDirectoryReader(segments_2:3 _0(5.0):C1)}
[junit4:junit4]   2> 3495 T2796 oasc.CachingDirectoryFactory.close Releasing directory:C:\Users\JenkinsSlave\workspace\Lucene-Solr-trunk-Windows\solr\build\solr-core\test\J0\.\org.apache.solr.handler.TestReplicationHandler$SolrInstance-1361649724667\master\collection1\data\index
[junit4:junit4]   2> 3495 T2791 C177 UPDATE [collection1] webapp=/solr path=/update params={waitSearcher=true&commit=true&wt=javabin&version=2&softCommit=false} {commit=} 0 6
[junit4:junit4]   2> 3499 T2792 C177 REQ [collection1] webapp=/solr path=/select params={q=*:*&wt=javabin&version=2} hits=1 status=0 QTime=0 
[junit4:junit4]   2> ASYNC  NEW_CORE C178 name=collection1 org.apache.solr.core.SolrCore@12ee7d8
[junit4:junit4]   2> 3618 T2801 C178 REQ [collection1] webapp=/solr path=/select params={q=*:*&wt=javabin&version=2} hits=0 status=0 QTime=0 
[junit4:junit4]   2> 3733 T2802 C178 REQ [collection1] webapp=/solr path=/select params={q=*:*&wt=javabin&version=2} hits=0 status=0 QTime=0 
[junit4:junit4]   2> 3848 T2804 C178 REQ [collection1] webapp=/solr path=/select params={q=*:*&wt=javabin&version=2} hits=0 status=0 QTime=0 
[junit4:junit4]   2> 3962 T2803 C178 REQ [collection1] webapp=/solr path=/select params={q=*:*&wt=javabin&version=2} hits=0 status=0 QTime=1 
[junit4:junit4]   2> 4074 T2805 C178 REQ [collection1] webapp=/solr path=/select params={q=*:*&wt=javabin&version=2} hits=0 status=0 QTime=0 
[junit4:junit4]   2> 4188 T2801 C178 REQ [collection1] webapp=/solr path=/select params={q=*:*&wt=javabin&version=2} hits=0 status=0 QTime=0 
[junit4:junit4]   2> 4300 T2802 C178 REQ [collection1] webapp=/solr path=/select params={q=*:*&wt=javabin&version=2} hits=0 status=0 QTime=0 
[junit4:junit4]   2> 4404 T2804 C178 REQ [collection1] webapp=/solr path=/select params={q=*:*&wt=javabin&version=2} hits=0 status=0 QTime=0 
[junit4:junit4]   2> 4414 T2789 C177 REQ [collection1] webapp=/solr path=/replication params={command=indexversion&qt=/replication&wt=javabin&version=2} status=0 QTime=1 
[junit4:junit4]   2> 4415 T2808 oash.SnapPuller.fetchLatestIndex Master's generation: 2
[junit4:junit4]   2> 4415 T2808 oash.SnapPuller.fetchLatestIndex Slave's generation: 1
[junit4:junit4]   2> 4415 T2808 oash.SnapPuller.fetchLatestIndex Starting replication process
[junit4:junit4]   2> 4417 T2790 C177 oasc.CachingDirectoryFactory.close Releasing directory:C:\Users\JenkinsSlave\workspace\Lucene-Solr-trunk-Windows\solr\build\solr-core\test\J0\.\org.apache.solr.handler.TestReplicationHandler$SolrInstance-1361649724667\master\collection1\data
[junit4:junit4]   2> 4418 T2790 C177 oasc.CachingDirectoryFactory.close Releasing directory:C:\Users\JenkinsSlave\workspace\Lucene-Solr-trunk-Windows\solr\build\solr-core\test\J0\.\org.apache.solr.handler.TestReplicationHandler$SolrInstance-1361649724667\master\collection1\data\index
[junit4:junit4]   2> 4420 T2790 C177 REQ [collection1] webapp=/solr path=/replication params={command=filelist&qt=/replication&wt=javabin&generation=2&version=2} status=0 QTime=3 
[junit4:junit4]   2> 4421 T2808 oash.SnapPuller.fetchLatestIndex Number of files in latest index in master: 10
[junit4:junit4]   2> 4423 T2808 oasc.CachingDirectoryFactory.get return new directory for C:\Users\JenkinsSlave\workspace\Lucene-Solr-trunk-Windows\solr\build\solr-core\test\J0\.\org.apache.solr.handler.TestReplicationHandler$SolrInstance-1361649724966\slave\collection1\data\index.20130223130209082 forceNew:false
[junit4:junit4]   2> 4423 T2808 oasc.CachingDirectoryFactory.close Releasing directory:C:\Users\JenkinsSlave\workspace\Lucene-Solr-trunk-Windows\solr\build\solr-core\test\J0\.\org.apache.solr.handler.TestReplicationHandler$SolrInstance-1361649724966\slave\collection1\data
[junit4:junit4]   2> 4423 T2808 oash.SnapPuller.fetchLatestIndex Starting download to MockDirWrapper(org.apache.lucene.store.RAMDirectory@35b7b77b lockFactory=org.apache.lucene.store.SingleInstanceLockFactory@4968779d) fullCopy=false
[junit4:junit4]   2> 4425 T2791 C177 REQ [collection1] webapp=/solr path=/replication params={file=_0_Lucene40_0.tim&command=filecontent&checksum=true&compression=true&wt=filestream&qt=/replication&generation=2} status=0 QTime=0 
[junit4:junit4]   2> 4429 T2792 C177 REQ [collection1] webapp=/solr path=/replication params={file=_0.fnm&command=filecontent&checksum=true&compression=true&wt=filestream&qt=/replication&generation=2} status=0 QTime=0 
[junit4:junit4]   2> 4432 T2793 C177 REQ [collection1] webapp=/solr path=/replication params={file=_0_Lucene40_0.frq&command=filecontent&checksum=true&compression=true&wt=filestream&qt=/replication&generation=2} status=0 QTime=0 
[junit4:junit4]   2> 4436 T2794 C177 REQ [collection1] webapp=/solr path=/replication params={file=_0_nrm.cfe&command=filecontent&checksum=true&compression=true&wt=filestream&qt=/replication&generation=2} status=0 QTime=0 
[junit4:junit4]   2> 4440 T2789 C177 REQ [collection1] webapp=/solr path=/replication params={file=segments_2&command=filecontent&checksum=true&compression=true&wt=filestream&qt=/replication&generation=2} status=0 QTime=0 
[junit4:junit4]   2> 4443 T2790 C177 REQ [collection1] webapp=/solr path=/replication params={file=_0.fdx&command=filecontent&checksum=true&compression=true&wt=filestream&qt=/replication&generation=2} status=0 QTime=0 
[junit4:junit4]   2> 4446 T2791 C177 REQ [collection1] webapp=/solr path=/replication params={file=_0_nrm.cfs&command=filecontent&checksum=true&compression=true&wt=filestream&qt=/replication&generation=2} status=0 QTime=0 
[junit4:junit4]   2> 4449 T2792 C177 REQ [collection1] webapp=/solr path=/replication params={file=_0.si&command=filecontent&checksum=true&compression=true&wt=filestream&qt=/replication&generation=2} status=0 QTime=0 
[junit4:junit4]   2> 4452 T2793 C177 REQ [collection1] webapp=/solr path=/replication params={file=_0.fdt&command=filecontent&checksum=true&compression=true&wt=filestream&qt=/replication&generation=2} status=0 QTime=0 
[junit4:junit4]   2> 4455 T2794 C177 REQ [collection1] webapp=/solr path=/replication params={file=_0_Lucene40_0.tip&command=filecontent&checksum=true&compression=true&wt=filestream&qt=/replication&generation=2} status=0 QTime=0 
[junit4:junit4]   2> 4456 T2808 oasc.CachingDirectoryFactory.close Releasing directory:C:\Users\JenkinsSlave\workspace\Lucene-Solr-trunk-Windows\solr\build\solr-core\test\J0\.\org.apache.solr.handler.TestReplicationHandler$SolrInstance-1361649724966\slave\collection1\data\index
[junit4:junit4]   2> 4456 T2808 oash.SnapPuller.fetchLatestIndex Total time taken for download : 0 secs
[junit4:junit4]   2> 4458 T2808 oash.SnapPuller.downloadConfFiles Starting download of configuration files from master: [{alias=schema.xml, name=schema-replication2.xml, checksum=1505963717, size=1634}]
[junit4:junit4]   2> 4465 T2789 C177 REQ [collection1] webapp=/solr path=/replication params={command=filecontent&checksum=true&compression=true&wt=filestream&cf=schema-replication2.xml&qt=/replication&generation=2} status=0 QTime=0 
[junit4:junit4]   2> 4487 T2808 oash.SnapPuller.fetchLatestIndex Configuration files are modified, core will be reloaded
[junit4:junit4]   2> 4488 T2808 oasc.CachingDirectoryFactory.close Releasing directory:C:\Users\JenkinsSlave\workspace\Lucene-Solr-trunk-Windows\solr\build\solr-core\test\J0\.\org.apache.solr.handler.TestReplicationHandler$SolrInstance-1361649724966\slave\collection1\data
[junit4:junit4]   2> 4489 T2808 oasc.CachingDirectoryFactory.close Releasing directory:C:\Users\JenkinsSlave\workspace\Lucene-Solr-trunk-Windows\solr\build\solr-core\test\J0\.\org.apache.solr.handler.TestReplicationHandler$SolrInstance-1361649724966\slave\collection1\data
[junit4:junit4]   2> 4490 T2808 oasu.DefaultSolrCoreState.newIndexWriter Creating new IndexWriter...
[junit4:junit4]   2> 4490 T2810 oasc.CoreContainer.reload Reloading SolrCore 'collection1' using instanceDir: C:\Users\JenkinsSlave\workspace\Lucene-Solr-trunk-Windows\solr\build\solr-core\test\J0\.\org.apache.solr.handler.TestReplicationHandler$SolrInstance-1361649724966\slave\collection1
[junit4:junit4]   2> 4490 T2808 oasu.DefaultSolrCoreState.newIndexWriter Waiting until IndexWriter is unused... core=collection1
[junit4:junit4]   2> 4490 T2808 oasc.CachingDirectoryFactory.close Releasing directory:C:\Users\JenkinsSlave\workspace\Lucene-Solr-trunk-Windows\solr\build\solr-core\test\J0\.\org.apache.solr.handler.TestReplicationHandler$SolrInstance-1361649724966\slave\collection1\data
[junit4:junit4]   2> 4491 T2810 oasc.SolrResourceLoader.<init> new SolrResourceLoader for directory: 'C:\Users\JenkinsSlave\workspace\Lucene-Solr-trunk-Windows\solr\build\solr-core\test\J0\.\org.apache.solr.handler.TestReplicationHandler$SolrInstance-1361649724966\slave\collection1\'
[junit4:junit4]   2> 4491 T2808 oasc.SolrDeletionPolicy.onInit SolrDeletionPolicy.onInit: commits:num=2
[junit4:junit4]   2> 		commit{dir=MockDirWrapper(org.apache.lucene.store.RAMDirectory@568b76f lockFactory=org.apache.lucene.store.SingleInstanceLockFactory@18a3f9fd),segFN=segments_1,generation=1,filenames=[segments_1]
[junit4:junit4]   2> 		commit{dir=MockDirWrapper(org.apache.lucene.store.RAMDirectory@568b76f lockFactory=org.apache.lucene.store.SingleInstanceLockFactory@18a3f9fd),segFN=segments_2,generation=2,filenames=[_0_Lucene40_0.tim, _0.fnm, _0_Lucene40_0.frq, _0_nrm.cfe, segments_2, _0.fdx, _0_nrm.cfs, _0.si, _0.fdt, _0_Lucene40_0.tip]
[junit4:junit4]   2> 4492 T2808 oasc.SolrDeletionPolicy.updateCommits newest commit = 2[_0_Lucene40_0.tim, _0.fnm, _0_Lucene40_0.frq, _0_nrm.cfe, segments_2, _0.fdx, _0_nrm.cfs, _0.si, _0.fdt, _0_Lucene40_0.tip]
[junit4:junit4]   2> 4493 T2808 oasu.DefaultSolrCoreState.newIndexWriter New IndexWriter is ready to be used.
[junit4:junit4]   2> 4493 T2808 oasc.CachingDirectoryFactory.close Releasing directory:C:\Users\JenkinsSlave\workspace\Lucene-Solr-trunk-Windows\solr\build\solr-core\test\J0\.\org.apache.solr.handler.TestReplicationHandler$SolrInstance-1361649724966\slave\collection1\data
[junit4:junit4]   2> 4494 T2808 oass.SolrIndexSearcher.<init> Opening Searcher@6a220756 main
[junit4:junit4]   2> 4494 T2807 oasc.SolrCore.registerSearcher [collection1] Registered new searcher Searcher@6a220756 main{StandardDirectoryReader(segments_2:3:nrt _0(5.0):C1)}
[junit4:junit4]   2> 4494 T2807 oasc.CachingDirectoryFactory.close Releasing directory:C:\Users\JenkinsSlave\workspace\Lucene-Solr-trunk-Windows\solr\build\solr-core\test\J0\.\org.apache.solr.handler.TestReplicationHandler$SolrInstance-1361649724966\slave\collection1\data\index
[junit4:junit4]   2> 4494 T2808 oash.SnapPuller.fetchLatestIndex removing temporary index download directory files MockDirWrapper(org.apache.lucene.store.RAMDirectory@35b7b77b lockFactory=org.apache.lucene.store.SingleInstanceLockFactory@4968779d)
[junit4:junit4]   2> 4494 T2808 oasc.CachingDirectoryFactory.close Releasing directory:C:\Users\JenkinsSlave\workspace\Lucene-Solr-trunk-Windows\solr\build\solr-core\test\J0\.\org.apache.solr.handler.TestReplicationHandler$SolrInstance-1361649724966\slave\collection1\data\index.20130223130209082
[junit4:junit4]   2> 4495 T2808 oasc.CachingDirectoryFactory.close Releasing directory:C:\Users\JenkinsSlave\workspace\Lucene-Solr-trunk-Windows\solr\build\solr-core\test\J0\.\org.apache.solr.handler.TestReplicationHandler$SolrInstance-1361649724966\slave\collection1\data\index
[junit4:junit4]   2> 4507 T2803 C178 REQ [collection1] webapp=/solr path=/select params={q=*:*&wt=javabin&version=2} hits=1 status=0 QTime=0 
[junit4:junit4]   2> 4554 T2810 oasc.SolrConfig.<init> Using Lucene MatchVersion: LUCENE_50
[junit4:junit4]   2> 4609 T2810 oasc.SolrConfig.<init> Loaded SolrConfig: solrconfig.xml
[junit4:junit4]   2> 4610 T2810 oass.IndexSchema.readSchema Reading Solr Schema
[junit4:junit4]   2> 4611 T2805 C178 UPDATE [collection1] webapp=/solr path=/update params={wt=javabin&version=2} {} 0 1
[junit4:junit4]   2> 4612 T2805 C178 oasc.SolrException.log SEVERE org.apache.solr.common.SolrException: ERROR: [doc=2000] unknown field 'newname'
[junit4:junit4]   2> 		at org.apache.solr.update.DocumentBuilder.toDocument(DocumentBuilder.java:305)
[junit4:junit4]   2> 		at org.apache.solr.update.AddUpdateCommand.getLuceneDocument(AddUpdateCommand.java:73)
[junit4:junit4]   2> 		at org.apache.solr.update.DirectUpdateHandler2.addDoc(DirectUpdateHandler2.java:204)
[junit4:junit4]   2> 		at org.apache.solr.update.processor.RunUpdateProcessor.processAdd(RunUpdateProcessorFactory.java:69)
[junit4:junit4]   2> 		at org.apache.solr.update.processor.UpdateRequestProcessor.processAdd(UpdateRequestProcessor.java:51)
[junit4:junit4]   2> 		at org.apache.solr.update.processor.DistributedUpdateProcessor.versionAdd(DistributedUpdateProcessor.java:481)
[junit4:junit4]   2> 		at org.apache.solr.update.processor.DistributedUpdateProcessor.processAdd(DistributedUpdateProcessor.java:350)
[junit4:junit4]   2> 		at org.apache.solr.update.processor.LogUpdateProcessor.processAdd(LogUpdateProcessorFactory.java:100)
[junit4:junit4]   2> 		at org.apache.solr.handler.loader.XMLLoader.processUpdate(XMLLoader.java:246)
[junit4:junit4]   2> 		at org.apache.solr.handler.loader.XMLLoader.load(XMLLoader.java:173)
[junit4:junit4]   2> 		at org.apache.solr.handler.UpdateRequestHandler$1.load(UpdateRequestHandler.java:92)
[junit4:junit4]   2> 		at org.apache.solr.handler.ContentStreamHandlerBase.handleRequestBody(ContentStreamHandlerBase.java:74)
[junit4:junit4]   2> 		at org.apache.solr.handler.RequestHandlerBase.handleRequest(RequestHandlerBase.java:135)
[junit4:junit4]   2> 		at org.apache.solr.core.SolrCore.execute(SolrCore.java:1808)
[junit4:junit4]   2> 		at org.apache.solr.servlet.SolrDispatchFilter.execute(SolrDispatchFilter.java:448)
[junit4:junit4]   2> 		at org.apache.solr.servlet.SolrDispatchFilter.doFilter(SolrDispatchFilter.java:269)
[junit4:junit4]   2> 		at org.eclipse.jetty.servlet.ServletHandler$CachedChain.doFilter(ServletHandler.java:1307)
[junit4:junit4]   2> 		at org.apache.solr.client.solrj.embedded.JettySolrRunner$DebugFilter.doFilter(JettySolrRunner.java:123)
[junit4:junit4]   2> 		at org.eclipse.jetty.servlet.ServletHandler$CachedChain.doFilter(ServletHandler.java:1307)
[junit4:junit4]   2> 		at org.eclipse.jetty.servlet.ServletHandler.doHandle(ServletHandler.java:453)
[junit4:junit4]   2> 		at org.eclipse.jetty.server.session.SessionHandler.doHandle(SessionHandler.java:229)
[junit4:junit4]   2> 		at org.eclipse.jetty.server.handler.ScopedHandler.handle(ScopedHandler.java:137)
[junit4:junit4]   2> 		at org.eclipse.jetty.server.handler.GzipHandler.handle(GzipHandler.java:275)
[junit4:junit4]   2> 		at org.eclipse.jetty.server.handler.ContextHandler.doHandle(ContextHandler.java:1074)
[junit4:junit4]   2> 		at org.eclipse.jetty.servlet.ServletHandler.doScope(ServletHandler.java:382)
[junit4:junit4]   2> 		at org.eclipse.jetty.server.session.SessionHandler.doScope(SessionHandler.java:193)
[junit4:junit4]   2> 		at org.eclipse.jetty.server.handler.ContextHandler.doScope(ContextHandler.java:1006)
[junit4:junit4]   2> 		at org.eclipse.jetty.server.handler.ScopedHandler.handle(ScopedHandler.java:135)
[junit4:junit4]   2> 		at org.eclipse.jetty.server.handler.HandlerWrapper.handle(HandlerWrapper.java:116)
[junit4:junit4]   2> 		at org.eclipse.jetty.server.Server.handle(Server.java:365)
[junit4:junit4]   2> 		at org.eclipse.jetty.server.AbstractHttpConnection.handleRequest(AbstractHttpConnection.java:485)
[junit4:junit4]   2> 		at org.eclipse.jetty.server.AbstractHttpConnection.content(AbstractHttpConnection.java:937)
[junit4:junit4]   2> 		at org.eclipse.jetty.server.AbstractHttpConnection$RequestHandler.content(AbstractHttpConnection.java:998)
[junit4:junit4]   2> 		at org.eclipse.jetty.http.HttpParser.parseNext(HttpParser.java:948)
[junit4:junit4]   2> 		at org.eclipse.jetty.http.HttpParser.parseAvailable(HttpParser.java:240)
[junit4:junit4]   2> 		at org.eclipse.jetty.server.AsyncHttpConnection.handle(AsyncHttpConnection.java:82)
[junit4:junit4]   2> 		at org.eclipse.jetty.io.nio.SelectChannelEndPoint.handle(SelectChannelEndPoint.java:628)
[junit4:junit4]   2> 		at org.eclipse.jetty.io.nio.SelectChannelEndPoint$1.run(SelectChannelEndPoint.java:52)
[junit4:junit4]   2> 		at org.eclipse.jetty.util.thread.QueuedThreadPool.runJob(QueuedThreadPool.java:608)
[junit4:junit4]   2> 		at org.eclipse.jetty.util.thread.QueuedThreadPool$3.run(QueuedThreadPool.java:543)
[junit4:junit4]   2> 		at java.lang.Thread.run(Thread.java:722)
[junit4:junit4]   2> 	
[junit4:junit4]   2> 4613 T2761 oas.SolrTestCaseJ4.tearDown ###Ending doTestIndexAndConfigAliasReplication
[junit4:junit4]   2> 4615 T2810 oass.IndexSchema.readSchema Schema name=test
[junit4:junit4]   2> 4626 T2761 oasc.CoreContainer.shutdown Shutting down CoreContainer instance=1002692103
[junit4:junit4]   2> 4627 T2761 oasc.SolrCore.close [collection1]  CLOSING SolrCore org.apache.solr.core.SolrCore@16dcc655
[junit4:junit4]   2> 4628 T2761 oasu.DirectUpdateHandler2.close closing DirectUpdateHandler2{commits=1,autocommits=0,soft autocommits=0,optimizes=0,rollbacks=0,expungeDeletes=0,docsPending=0,adds=0,deletesById=0,deletesByQuery=0,errors=0,cumulative_adds=1,cumulative_deletesById=0,cumulative_deletesByQuery=0,cumulative_errors=0}
[junit4:junit4]   2> 4629 T2761 oasu.SolrCoreState.decrefSolrCoreState Closing SolrCoreState
[junit4:junit4]   2> 4629 T2761 oasu.DefaultSolrCoreState.closeIndexWriter SolrCoreState ref count has reached 0 - closing IndexWriter
[junit4:junit4]   2> 4629 T2761 oasu.DefaultSolrCoreState.closeIndexWriter closing IndexWriter with IndexWriterCloser
[junit4:junit4]   2> 4633 T2761 C177 oasc.CachingDirectoryFactory.close Releasing directory:C:\Users\JenkinsSlave\workspace\Lucene-Solr-trunk-Windows\solr\build\solr-core\test\J0\.\org.apache.solr.handler.TestReplicationHandler$SolrInstance-1361649724667\master\collection1\data\index
[junit4:junit4]   2> 4633 T2761 oasc.SolrCore.closeSearcher [collection1] Closing main searcher on request.
[junit4:junit4]   2> 4634 T2761 oasc.CachingDirectoryFactory.close Releasing directory:C:\Users\JenkinsSlave\workspace\Lucene-Solr-trunk-Windows\solr\build\solr-core\test\J0\.\org.apache.solr.handler.TestReplicationHandler$SolrInstance-1361649724667\master\collection1\data\index
[junit4:junit4]   2> 4634 T2761 oasc.CachingDirectoryFactory.close Closing directory when closing factory:C:\Users\JenkinsSlave\workspace\Lucene-Solr-trunk-Windows\solr\build\solr-core\test\J0\.\org.apache.solr.handler.TestReplicationHandler$SolrInstance-1361649724667\master\collection1\data\index
[junit4:junit4]   2> 4634 T2761 oasc.CachingDirectoryFactory.closeDirectory Closing directory:C:\Users\JenkinsSlave\workspace\Lucene-Solr-trunk-Windows\solr\build\solr-core\test\J0\.\org.apache.solr.handler.TestReplicationHandler$SolrInstance-1361649724667\master\collection1\data\index
[junit4:junit4]   2> 4634 T2761 oasc.CachingDirectoryFactory.close Closing directory when closing factory:C:\Users\JenkinsSlave\workspace\Lucene-Solr-trunk-Windows\solr\build\solr-core\test\J0\.\org.apache.solr.handler.TestReplicationHandler$SolrInstance-1361649724667\master\collection1\data
[junit4:junit4]   2> 4635 T2761 oasc.CachingDirectoryFactory.closeDirectory Closing directory:C:\Users\JenkinsSlave\workspace\Lucene-Solr-trunk-Windows\solr\build\solr-core\test\J0\.\org.apache.solr.handler.TestReplicationHandler$SolrInstance-1361649724667\master\collection1\data
[junit4:junit4]   2> 4635 T2761 oejsh.ContextHandler.doStop stopped o.e.j.s.ServletContextHandler{/solr,null}
[junit4:junit4]   2> 4649 T2810 oass.IndexSchema.readSchema unique key field: id
[junit4:junit4]   2> 4651 T2810 oasc.CachingDirectoryFactory.close Releasing directory:C:\Users\JenkinsSlave\workspace\Lucene-Solr-trunk-Windows\solr\build\solr-core\test\J0\.\org.apache.solr.handler.TestReplicationHandler$SolrInstance-1361649724966\slave\collection1\data
[junit4:junit4]   2> 4651 T2810 oasc.SolrCore.<init> [collection1] Opening new SolrCore at C:\Users\JenkinsSlave\workspace\Lucene-Solr-trunk-Windows\solr\build\solr-core\test\J0\.\org.apache.solr.handler.TestReplicationHandler$SolrInstance-1361649724966\slave\collection1\, dataDir=.\org.apache.solr.handler.TestReplicationHandler$SolrInstance-1361649724966\slave\collection1\data\
[junit4:junit4]   2> 4651 T2810 oasc.SolrCore.<init> JMX monitoring not detected for core: collection1
[junit4:junit4]   2> 4651 T2810 oasc.CachingDirectoryFactory.close Releasing directory:C:\Users\JenkinsSlave\workspace\Lucene-Solr-trunk-Windows\solr\build\solr-core\test\J0\.\org.apache.solr.handler.TestReplicationHandler$SolrInstance-1361649724966\slave\collection1\data
[junit4:junit4]   2> 4652 T2810 oasc.SolrCore.getNewIndexDir New index directory detected: old=null new=.\org.apache.solr.handler.TestReplicationHandler$SolrInstance-1361649724966\slave\collection1\data\index/
[junit4:junit4]   2> 4654 T2810 oasc.RequestHandlers.initHandlersFromConfig created standard: solr.StandardRequestHandler
[junit4:junit4]   2> 4654 T2810 oasc.RequestHandlers.initHandlersFromConfig created defaults: solr.StandardRequestHandler
[junit4:junit4]   2> 4654 T2810 oasc.RequestHandlers.initHandlersFromConfig adding lazy requestHandler: solr.StandardRequestHandler
[junit4:junit4]   2> 4654 T2810 oasc.RequestHandlers.initHandlersFromConfig created lazy: solr.StandardRequestHandler
[junit4:junit4]   2> 4654 T2810 oasc.RequestHandlers.initHandlersFromConfig created /update: solr.UpdateRequestHandler
[junit4:junit4]   2> 4655 T2810 oasc.RequestHandlers.initHandlersFromConfig created /replication: solr.ReplicationHandler
[junit4:junit4]   2> 4663 T2810 oashl.XMLLoader.init xsltCacheLifetimeSeconds=60
[junit4:junit4]   2> 4666 T2810 oasc.CachingDirectoryFactory.close Releasing directory:C:\Users\JenkinsSlave\workspace\Lucene-Solr-trunk-Windows\solr\build\solr-core\test\J0\.\org.apache.solr.handler.TestReplicationHandler$SolrInstance-1361649724966\slave\collection1\data
[junit4:junit4]   2> 4668 T2810 oass.SolrIndexSearcher.<init> Opening Searcher@291ed63b main
[junit4:junit4]   2> 4669 T2810 oasu.CommitTracker.<init> Hard AutoCommit: disabled
[junit4:junit4]   2> 4669 T2810 oasu.CommitTracker.<init> Soft AutoCommit: disabled
[junit4:junit4]   2> 4669 T2810 oash.SnapPuller.startExecutorService Poll Scheduled at an interval of 1000ms
[junit4:junit4]   2> 4669 T2810 oasu.DefaultSolrCoreState.newIndexWriter Creating new IndexWriter...
[junit4:junit4]   2> 4669 T2811 oasc.SolrCore.registerSearcher [collection1] Registered new searcher Searcher@291ed63b main{StandardDirectoryReader(segments_2:3:nrt _0(5.0):C1)}
[junit4:junit4]   2> 4669 T2810 oasu.DefaultSolrCoreState.newIndexWriter Waiting until IndexWriter is unused... core=collection1
[junit4:junit4]   2> 4670 T2810 oasu.DefaultSolrCoreState.newIndexWriter Closing old IndexWriter... core=collection1
[junit4:junit4]   2> 4670 T2810 oasc.CachingDirectoryFactory.close Releasing directory:C:\Users\JenkinsSlave\workspace\Lucene-Solr-trunk-Windows\solr\build\solr-core\test\J0\.\org.apache.solr.handler.TestReplicationHandler$SolrInstance-1361649724966\slave\collection1\data\index
[junit4:junit4]   2> 4670 T2810 oasc.CachingDirectoryFactory.close Releasing directory:C:\Users\JenkinsSlave\workspace\Lucene-Solr-trunk-Windows\solr\build\solr-core\test\J0\.\org.apache.solr.handler.TestReplicationHandler$SolrInstance-1361649724966\slave\collection1\data
[junit4:junit4]   2> 4672 T2810 oasc.SolrDeletionPolicy.onInit SolrDeletionPolicy.onInit: commits:num=1
[junit4:junit4]   2> 		commit{dir=MockDirWrapper(org.apache.lucene.store.RAMDirectory@568b76f lockFactory=org.apache.lucene.store.SingleInstanceLockFactory@18a3f9fd),segFN=segments_2,generation=2,filenames=[_0_Lucene40_0.tim, _0.fnm, _0_Lucene40_0.frq, _0_nrm.cfe, segments_2, _0.fdx, _0_nrm.cfs, _0.si, _0.fdt, _0_Lucene40_0.tip]
[junit4:junit4]   2> 4672 T2810 oasc.SolrDeletionPolicy.updateCommits newest commit = 2[_0_Lucene40_0.tim, _0.fnm, _0_Lucene40_0.frq, _0_nrm.cfe, segments_2, _0.fdx, _0_nrm.cfs, _0.si, _0.fdt, _0_Lucene40_0.tip]
[junit4:junit4]   2> 4673 T2810 oasu.DefaultSolrCoreState.newIndexWriter New IndexWriter is ready to be used.
[junit4:junit4]   2> 4673 T2810 oasc.CachingDirectoryFactory.close Releasing directory:C:\Users\JenkinsSlave\workspace\Lucene-Solr-trunk-Windows\solr\build\solr-core\test\J0\.\org.apache.solr.handler.TestReplicationHandler$SolrInstance-1361649724966\slave\collection1\data
[junit4:junit4]   2> 4674 T2810 oass.SolrIndexSearcher.<init> Opening Searcher@22065f1b main
[junit4:junit4]   2> 4674 T2810 oasc.CoreContainer.registerCore replacing core: collection1
[junit4:junit4]   2> 4674 T2811 oasc.SolrCore.registerSearcher [collection1] Registered new searcher Searcher@22065f1b main{StandardDirectoryReader(segments_2:3:nrt _0(5.0):C1)}
[junit4:junit4]   2> 4674 T2810 oasc.SolrCore.close [collection1]  CLOSING SolrCore org.apache.solr.core.SolrCore@12ee7d8
[junit4:junit4]   2> 4675 T2811 oasc.CachingDirectoryFactory.close Releasing directory:C:\Users\JenkinsSlave\workspace\Lucene-Solr-trunk-Windows\solr\build\solr-core\test\J0\.\org.apache.solr.handler.TestReplicationHandler$SolrInstance-1361649724966\slave\collection1\data\index
[junit4:junit4]   2> 4675 T2810 oasu.DirectUpdateHandler2.close closing DirectUpdateHandler2{commits=0,autocommits=0,soft autocommits=0,optimizes=0,rollbacks=0,expungeDeletes=0,docsPending=0,adds=1,deletesById=0,deletesByQuery=0,errors=1,cumulative_adds=1,cumulative_deletesById=0,cumulative_deletesByQuery=0,cumulative_errors=1}
[junit4:junit4]   2> 4676 T2810 oasc.SolrCore.closeSearcher [collection1] Closing main searcher on request.
[junit4:junit4]   2> 4676 T2810 oasc.CachingDirectoryFactory.close Releasing directory:C:\Users\JenkinsSlave\workspace\Lucene-Solr-trunk-Windows\solr\build\solr-core\test\J0\.\org.apache.solr.handler.TestReplicationHandler$SolrInstance-1361649724966\slave\collection1\data\index
[junit4:junit4]   2> 4700 T2761 oasc.CoreContainer.shutdown Shutting down CoreContainer instance=1966451757
[junit4:junit4]   2> 4701 T2761 oasc.SolrCore.close [collection1]  CLOSING SolrCore org.apache.solr.core.SolrCore@504df710
[junit4:junit4]   2> 4703 T2761 oasu.DirectUpdateHandler2.close closing DirectUpdateHandler2{commits=0,autocommits=0,soft autocommits=0,optimizes=0,rollbacks=0,expungeDeletes=0,docsPending=0,adds=0,deletesById=0,deletesByQuery=0,errors=0,cumulative_adds=0,cumulative_deletesById=0,cumulative_deletesByQuery=0,cumulative_errors=0}
[junit4:junit4]   2> 4703 T2761 oasu.SolrCoreState.decrefSolrCoreState Closing SolrCoreState
[junit4:junit4]   2> 4703 T2761 oasu.DefaultSolrCoreState.closeIndexWriter SolrCoreState ref count has reached 0 - closing IndexWriter
[junit4:junit4]   2> 4705 T2761 oasu.DefaultSolrCoreState.closeIndexWriter closing IndexWriter with IndexWriterCloser
[junit4:junit4]   2> ASYNC  NEW_CORE C179 name=collection1 org.apache.solr.core.SolrCore@504df710
[junit4:junit4]   2> 4706 T2761 C179 oasc.CachingDirectoryFactory.close Releasing directory:C:\Users\JenkinsSlave\workspace\Lucene-Solr-trunk-Windows\solr\build\solr-core\test\J0\.\org.apache.solr.handler.TestReplicationHandler$SolrInstance-1361649724966\slave\collection1\data\index
[junit4:junit4]   2> 4707 T2761 oasc.SolrCore.closeSearcher [collection1] Closing main searcher on request.
[junit4:junit4]   2> 4707 T2761 oasc.CachingDirectoryFactory.close Releasing directory:C:\Users\JenkinsSlave\workspace\Lucene-Solr-trunk-Windows\solr\build\solr-core\test\J0\.\org.apache.solr.handler.TestReplicationHandler$SolrInstance-1361649724966\slave\collection1\data\index
[junit4:junit4]   2> 4709 T2761 oasc.CachingDirectoryFactory.close Closing directory when closing factory:C:\Users\JenkinsSlave\workspace\Lucene-Solr-trunk-Windows\solr\build\solr-core\test\J0\.\org.apache.solr.handler.TestReplicationHandler$SolrInstance-1361649724966\slave\collection1\data
[junit4:junit4]   2> 4709 T2761 oasc.CachingDirectoryFactory.closeDirectory Closing directory:C:\Users\JenkinsSlave\workspace\Lucene-Solr-trunk-Windows\solr\build\solr-core\test\J0\.\org.apache.solr.handler.TestReplicationHandler$SolrInstance-1361649724966\slave\collection1\data
[junit4:junit4]   2> 4710 T2761 oasc.CachingDirectoryFactory.close Closing directory when closing factory:C:\Users\JenkinsSlave\workspace\Lucene-Solr-trunk-Windows\solr\build\solr-core\test\J0\.\org.apache.solr.handler.TestReplicationHandler$SolrInstance-1361649724966\slave\collection1\data\index
[junit4:junit4]   2> 4710 T2761 oasc.CachingDirectoryFactory.closeDirectory Closing directory:C:\Users\JenkinsSlave\workspace\Lucene-Solr-trunk-Windows\solr\build\solr-core\test\J0\.\org.apache.solr.handler.TestReplicationHandler$SolrInstance-1361649724966\slave\collection1\data\index
[junit4:junit4]   2> 4711 T2761 oasc.CachingDirectoryFactory.close Closing directory when closing factory:C:\Users\JenkinsSlave\workspace\Lucene-Solr-trunk-Windows\solr\build\solr-core\test\J0\.\org.apache.solr.handler.TestReplicationHandler$SolrInstance-1361649724966\slave\collection1\data\index.20130223130209082
[junit4:junit4]   2> 4712 T2761 oasc.CachingDirectoryFactory.closeDirectory Closing directory:C:\Users\JenkinsSlave\workspace\Lucene-Solr-trunk-Windows\solr\build\solr-core\test\J0\.\org.apache.solr.handler.TestReplicationHandler$SolrInstance-1361649724966\slave\collection1\data\index.20130223130209082
[junit4:junit4]   2> 4712 T2761 oejsh.ContextHandler.doStop stopped o.e.j.s.ServletContextHandler{/solr,null}
[junit4:junit4]   2> NOTE: reproduce with: ant test  -Dtestcase=TestReplicationHandler -Dtests.method=doTestIndexAndConfigAliasReplication -Dtests.seed=BBECDFE83ECD4C13 -Dtests.slow=true -Dtests.locale=ar_AE -Dtests.timezone=America/Yellowknife -Dtests.file.encoding=ISO-8859-1
[junit4:junit4] ERROR   4.81s | TestReplicationHandler.doTestIndexAndConfigAliasReplication <<<
[junit4:junit4]    > Throwable #1: org.apache.solr.common.SolrException: ERROR: [doc=2000] unknown field 'newname'
[junit4:junit4]    > 	at __randomizedtesting.SeedInfo.seed([BBECDFE83ECD4C13:4C9F31B0F825E3F5]:0)
[junit4:junit4]    > 	at org.apache.solr.client.solrj.impl.HttpSolrServer.request(HttpSolrServer.java:404)
[junit4:junit4]    > 	at org.apache.solr.client.solrj.impl.HttpSolrServer.request(HttpSolrServer.java:181)
[junit4:junit4]    > 	at org.apache.solr.client.solrj.request.AbstractUpdateRequest.process(AbstractUpdateRequest.java:117)
[junit4:junit4]    > 	at org.apache.solr.client.solrj.SolrServer.add(SolrServer.java:116)
[junit4:junit4]    > 	at org.apache.solr.client.solrj.SolrServer.add(SolrServer.java:102)
[junit4:junit4]    > 	at org.apache.solr.handler.TestReplicationHandler.index(TestReplicationHandler.java:161)
[junit4:junit4]    > 	at org.apache.solr.handler.TestReplicationHandler.doTestIndexAndConfigAliasReplication(TestReplicationHandler.java:969)
[junit4:junit4]    > 	at sun.reflect.NativeMethodAccessorImpl.invoke0(Native Method)
[junit4:junit4]    > 	at sun.reflect.NativeMethodAccessorImpl.invoke(NativeMethodAccessorImpl.java:57)
[junit4:junit4]    > 	at sun.reflect.DelegatingMethodAccessorImpl.invoke(DelegatingMethodAccessorImpl.java:43)
[junit4:junit4]    > 	at java.lang.reflect.Method.invoke(Method.java:601)
[junit4:junit4]    > 	at com.carrotsearch.randomizedtesting.RandomizedRunner.invoke(RandomizedRunner.java:1559)
[junit4:junit4]    > 	at com.carrotsearch.randomizedtesting.RandomizedRunner.access$600(RandomizedRunner.java:79)
[junit4:junit4]    > 	at com.carrotsearch.randomizedtesting.RandomizedRunner$6.evaluate(RandomizedRunner.java:737)
[junit4:junit4]    > 	at com.carrotsearch.randomizedtesting.RandomizedRunner$7.evaluate(RandomizedRunner.java:773)
[junit4:junit4]    > 	at com.carrotsearch.randomizedtesting.RandomizedRunner$8.evaluate(RandomizedRunner.java:787)
[junit4:junit4]    > 	at com.carrotsearch.randomizedtesting.rules.SystemPropertiesRestoreRule$1.evaluate(SystemPropertiesRestoreRule.java:53)
[junit4:junit4]    > 	at org.apache.lucene.util.TestRuleSetupTeardownChained$1.evaluate(TestRuleSetupTeardownChained.java:50)
[junit4:junit4]    > 	at org.apache.lucene.util.TestRuleFieldCacheSanity$1.evaluate(TestRuleFieldCacheSanity.java:51)
[junit4:junit4]    > 	at org.apache.lucene.util.AbstractBeforeAfterRule$1.evaluate(AbstractBeforeAfterRule.java:46)
[junit4:junit4]    > 	at com.carrotsearch.randomizedtesting.rules.SystemPropertiesInvariantRule$1.evaluate(SystemPropertiesInvariantRule.java:55)
[junit4:junit4]    > 	at org.apache.lucene.util.TestRuleThreadAndTestName$1.evaluate(TestRuleThreadAndTestName.java:49)
[junit4:junit4]    > 	at org.apache.lucene.util.TestRuleIgnoreAfterMaxFailures$1.evaluate(TestRuleIgnoreAfterMaxFailures.java:70)
[junit4:junit4]    > 	at org.apache.lucene.util.TestRuleMarkFailure$1.evaluate(TestRuleMarkFailure.java:48)
[junit4:junit4]    > 	at com.carrotsearch.randomizedtesting.rules.StatementAdapter.evaluate(StatementAdapter.java:36)
[junit4:junit4]    > 	at com.carrotsearch.randomizedtesting.ThreadLeakControl$StatementRunner.run(ThreadLeakControl.java:358)
[junit4:junit4]    > 	at com.carrotsearch.randomizedtesting.ThreadLeakControl.forkTimeoutingTask(ThreadLeakControl.java:782)
[junit4:junit4]    > 	at com.carrotsearch.randomizedtesting.ThreadLeakControl$3.evaluate(ThreadLeakControl.java:442)
[junit4:junit4]    > 	at com.carrotsearch.randomizedtesting.RandomizedRunner.runSingleTest(RandomizedRunner.java:746)
[junit4:junit4]    > 	at com.carrotsearch.randomizedtesting.RandomizedRunner$3.evaluate(RandomizedRunner.java:648)
[junit4:junit4]    > 	at com.carrotsearch.randomizedtesting.RandomizedRunner$4.evaluate(RandomizedRunner.java:682)
[junit4:junit4]    > 	at com.carrotsearch.randomizedtesting.RandomizedRunner$5.evaluate(RandomizedRunner.java:693)
[junit4:junit4]    > 	at com.carrotsearch.randomizedtesting.rules.StatementAdapter.evaluate(StatementAdapter.java:36)
[junit4:junit4]    > 	at com.carrotsearch.randomizedtesting.rules.SystemPropertiesRestoreRule$1.evaluate(SystemPropertiesRestoreRule.java:53)
[junit4:junit4]    > 	at org.apache.lucene.util.AbstractBeforeAfterRule$1.evaluate(AbstractBeforeAfterRule.java:46)
[junit4:junit4]    > 	at org.apache.lucene.util.TestRuleStoreClassName$1.evaluate(TestRuleStoreClassName.java:42)
[junit4:junit4]    > 	at com.carrotsearch.randomizedtesting.rules.SystemPropertiesInvariantRule$1.evaluate(SystemPropertiesInvariantRule.java:55)
[junit4:junit4]    > 	at com.carrotsearch.randomizedtesting.rules.NoShadowingOrOverridesOnMethodsRule$1.evaluate(NoShadowingOrOverridesOnMethodsRule.java:39)
[junit4:junit4]    > 	at com.carrotsearch.randomizedtesting.rules.NoShadowingOrOverridesOnMethodsRule$1.evaluate(NoShadowingOrOverridesOnMethodsRule.java:39)
[junit4:junit4]    > 	at com.carrotsearch.randomizedtesting.rules.StatementAdapter.evaluate(StatementAdapter.java:36)
[junit4:junit4]    > 	at org.apache.lucene.util.TestRuleAssertionsRequired$1.evaluate(TestRuleAssertionsRequired.java:43)
[junit4:junit4]    > 	at org.apache.lucene.util.TestRuleMarkFailure$1.evaluate(TestRuleMarkFailure.java:48)
[junit4:junit4]    > 	at org.apache.lucene.util.TestRuleIgnoreAfterMaxFailures$1.evaluate(TestRuleIgnoreAfterMaxFailures.java:70)
[junit4:junit4]    > 	at org.apache.lucene.util.TestRuleIgnoreTestSuites$1.evaluate(TestRuleIgnoreTestSuites.java:55)
[junit4:junit4]    > 	at com.carrotsearch.randomizedtesting.rules.StatementAdapter.evaluate(StatementAdapter.java:36)
[junit4:junit4]    > 	at com.carrotsearch.randomizedtesting.ThreadLeakControl$StatementRunner.run(ThreadLeakControl.java:358)
[junit4:junit4]    > 	at java.lang.Thread.run(Thread.java:722)
[junit4:junit4]   2> 4817 T2761 oas.SolrTestCaseJ4.setUp ###Starting doTestBackup
[junit4:junit4]   2> 4831 T2761 oejs.Server.doStart jetty-8.1.8.v20121106
[junit4:junit4]   2> 4835 T2761 oejs.AbstractConnector.doStart Started SelectChannelConnector@127.0.0.1:59454
[junit4:junit4]   2> 4835 T2761 oass.SolrDispatchFilter.init SolrDispatchFilter.init()
[junit4:junit4]   2> 4836 T2761 oasc.SolrResourceLoader.locateSolrHome JNDI not configured for solr (NoInitialContextEx)
[junit4:junit4]   2> 4836 T2761 oasc.SolrResourceLoader.locateSolrHome using system property solr.solr.home: .\org.apache.solr.handler.TestReplicationHandler$SolrInstance-1361649729478\master
[junit4:junit4]   2> 4836 T2761 oasc.CoreContainer$Initializer.initialize looking for solr.xml: C:\Users\JenkinsSlave\workspace\Lucene-Solr-trunk-Windows\solr\build\solr-core\test\J0\.\org.apache.solr.handler.TestReplicationHandler$SolrInstance-1361649729478\master\solr.xml
[junit4:junit4]   2> 4838 T2761 oasc.CoreContainer.<init> New CoreContainer 1710146340
[junit4:junit4]   2> 4839 T2761 oasc.CoreContainer$Initializer.initialize no solr.xml file found - using default
[junit4:junit4]   2> 4840 T2761 oasc.CoreContainer.load Loading CoreContainer using Solr Home: '.\org.apache.solr.handler.TestReplicationHandler$SolrInstance-1361649729478\master\'
[junit4:junit4]   2> 4840 T2761 oasc.SolrResourceLoader.<init> new SolrResourceLoader for directory: '.\org.apache.solr.handler.TestReplicationHandler$SolrInstance-1361649729478\master\'
[junit4:junit4]   2> 4888 T2761 oashc.HttpShardHandlerFactory.getParameter Setting socketTimeout to: 0
[junit4:junit4]   2> 4889 T2761 oashc.HttpShardHandlerFactory.getParameter Setting urlScheme to: http://
[junit4:junit4]   2> 4889 T2761 oashc.HttpShardHandlerFactory.getParameter Setting connTimeout to: 0
[junit4:junit4]   2> 4889 T2761 oashc.HttpShardHandlerFactory.getParameter Setting maxConnectionsPerHost to: 20
[junit4:junit4]   2> 4890 T2761 oashc.HttpShardHandlerFactory.getParameter Setting corePoolSize to: 0
[junit4:junit4]   2> 4890 T2761 oashc.HttpShardHandlerFactory.getParameter Setting maximumPoolSize to: 2147483647
[junit4:junit4]   2> 4890 T2761 oashc.HttpShardHandlerFactory.getParameter Setting maxThreadIdleTime to: 5
[junit4:junit4]   2> 4890 T2761 oashc.HttpShardHandlerFactory.getParameter Setting sizeOfQueue to: -1
[junit4:junit4]   2> 4891 T2761 oashc.HttpShardHandlerFactory.getParameter Setting fairnessPolicy to: false
[junit4:junit4]   2> 4891 T2761 oascsi.HttpClientUtil.createClient Creating new http client, config:maxConnectionsPerHost=20&maxConnections=10000&socketTimeout=0&connTimeout=0&retry=false
[junit4:junit4]   2> 4905 T2761 oasc.CoreContainer.load Registering Log Listener
[junit4:junit4]   2> 4930 T2822 oasc.CoreContainer.create Creating SolrCore 'collection1' using instanceDir: .\org.apache.solr.handler.TestReplicationHandler$SolrInstance-1361649729478\master\collection1
[junit4:junit4]   2> 4933 T2822 oasc.SolrResourceLoader.<init> new SolrResourceLoader for directory: '.\org.apache.solr.handler.TestReplicationHandler$SolrInstance-1361649729478\master\collection1\'
[junit4:junit4]   2> 4981 T2822 oasc.SolrConfig.<init> Using Lucene MatchVersion: LUCENE_50
[junit4:junit4]   2> 5035 T2822 oasc.SolrConfig.<init> Loaded SolrConfig: solrconfig.xml
[junit4:junit4]   2> 5035 T2822 oass.IndexSchema.readSchema Reading Solr Schema
[junit4:junit4]   2> 5039 T2822 oass.IndexSchema.readSchema Schema name=test
[junit4:junit4]   2> 5059 T2822 oass.IndexSchema.readSchema unique key field: id
[junit4:junit4]   2> 5061 T2822 oasc.SolrCore.<init> [collection1] Opening new SolrCore at .\org.apache.solr.handler.TestReplicationHandler$SolrInstance-1361649729478\master\collection1\, dataDir=.\org.apache.solr.handler.TestReplicationHandler$SolrInstance-1361649729478\master\collection1\data\
[junit4:junit4]   2> 5061 T2822 oasc.SolrCore.<init> JMX monitoring not detected for core: collection1
[junit4:junit4]   2> 5061 T2822 oasc.SolrCore.initDirectoryFactory org.apache.solr.core.MockDirectoryFactory
[junit4:junit4]   2> 5062 T2822 oasc.CachingDirectoryFactory.get return new directory for C:\Users\JenkinsSlave\workspace\Lucene-Solr-trunk-Windows\solr\build\solr-core\test\J0\.\org.apache.solr.handler.TestReplicationHandler$SolrInstance-1361649729478\master\collection1\data forceNew:false
[junit4:junit4]   2> 5062 T2822 oasc.CachingDirectoryFactory.close Releasing directory:C:\Users\JenkinsSlave\workspace\Lucene-Solr-trunk-Windows\solr\build\solr-core\test\J0\.\org.apache.solr.handler.TestReplicationHandler$SolrInstance-1361649729478\master\collection1\data
[junit4:junit4]   2> 5062 T2822 oasc.SolrCore.getNewIndexDir New index directory detected: old=null new=.\org.apache.solr.handler.TestReplicationHandler$SolrInstance-1361649729478\master\collection1\data\index/
[junit4:junit4]   2> 5063 T2822 oasc.SolrCore.initIndex WARNING [collection1] Solr index directory '.\org.apache.solr.handler.TestReplicationHandler$SolrInstance-1361649729478\master\collection1\data\index' doesn't exist. Creating new index...
[junit4:junit4]   2> 5064 T2822 oasc.CachingDirectoryFactory.get return new directory for C:\Users\JenkinsSlave\workspace\Lucene-Solr-trunk-Windows\solr\build\solr-core\test\J0\.\org.apache.solr.handler.TestReplicationHandler$SolrInstance-1361649729478\master\collection1\data\index forceNew:false
[junit4:junit4]   2> 5065 T2822 oasc.SolrDeletionPolicy.onCommit SolrDeletionPolicy.onCommit: commits:num=1
[junit4:junit4]   2> 		commit{dir=MockDirWrapper(org.apache.lucene.store.RAMDirectory@6ae27547 lockFactory=org.apache.lucene.store.SingleInstanceLockFactory@752bb053),segFN=segments_1,generation=1,filenames=[segments_1]
[junit4:junit4]   2> 5065 T2822 oasc.SolrDeletionPolicy.updateCommits newest commit = 1[segments_1]
[junit4:junit4]   2> 5065 T2822 oasc.CachingDirectoryFactory.close Releasing directory:C:\Users\JenkinsSlave\workspace\Lucene-Solr-trunk-Windows\solr\build\solr-core\test\J0\.\org.apache.solr.handler.TestReplicationHandler$SolrInstance-1361649729478\master\collection1\data\index
[junit4:junit4]   2> 5066 T2822 oasc.RequestHandlers.initHandlersFromConfig created standard: solr.StandardRequestHandler
[junit4:junit4]   2> 5066 T2822 oasc.RequestHandlers.initHandlersFromConfig created /replication: solr.ReplicationHandler
[junit4:junit4]   2> 5066 T2822 oasc.RequestHandlers.initHandlersFromConfig created defaults: solr.StandardRequestHandler
[junit4:junit4]   2> 5067 T2822 oasc.RequestHandlers.initHandlersFromConfig adding lazy requestHandler: solr.StandardRequestHandler
[junit4:junit4]   2> 5067 T2822 oasc.RequestHandlers.initHandlersFromConfig created lazy: solr.StandardRequestHandler
[junit4:junit4]   2> 5067 T2822 oasc.RequestHandlers.initHandlersFromConfig created /update: solr.UpdateRequestHandler
[junit4:junit4]   2> 5076 T2822 oashl.XMLLoader.init xsltCacheLifetimeSeconds=60
[junit4:junit4]   2> 5078 T2822 oasc.CachingDirectoryFactory.close Releasing directory:C:\Users\JenkinsSlave\workspace\Lucene-Solr-trunk-Windows\solr\build\solr-core\test\J0\.\org.apache.solr.handler.TestReplicationHandler$SolrInstance-1361649729478\master\collection1\data
[junit4:junit4]   2> 5078 T2822 oass.SolrIndexSearcher.<init> Opening Searcher@6a0ae8fe main
[junit4:junit4]   2> 5079 T2822 oasu.CommitTracker.<init> Hard AutoCommit: disabled
[junit4:junit4]   2> 5079 T2822 oasu.CommitTracker.<init> Soft AutoCommit: disabled
[junit4:junit4]   2> 5079 T2822 oash.ReplicationHandler.inform Replication enabled for following config files: schema.xml,xslt/dummy.xsl
[junit4:junit4]   2> 5079 T2822 oash.ReplicationHandler.inform Commits will be reserved for  10000
[junit4:junit4]   2> 5080 T2822 oasc.CoreContainer.registerCore registering core: collection1
[junit4:junit4]   2> 5080 T2823 oasc.SolrCore.registerSearcher [collection1] Registered new searcher Searcher@6a0ae8fe main{StandardDirectoryReader(segments_1:1)}
[junit4:junit4]   2> 5080 T2761 oass.SolrDispatchFilter.init user.dir=C:\Users\JenkinsSlave\workspace\Lucene-Solr-trunk-Windows\solr\build\solr-core\test\J0
[junit4:junit4]   2> 5080 T2761 oass.SolrDispatchFilter.init SolrDispatchFilter.init() done
[junit4:junit4]   2> 5081 T2761 oascsi.HttpClientUtil.createClient Creating new http client, config:maxConnections=128&maxConnectionsPerHost=32&followRedirects=false
[junit4:junit4]   2> 5096 T2761 oejs.Server.doStart jetty-8.1.8.v20121106
[junit4:junit4]   2> 5099 T2761 oejs.AbstractConnector.doStart Started SelectChannelConnector@127.0.0.1:59457
[junit4:junit4]   2> 5101 T2761 oass.SolrDispatchFilter.init SolrDispatchFilter.init()
[junit4:junit4]   2> 5101 T2761 oasc.SolrResourceLoader.locateSolrHome JNDI not configured for solr (NoInitialContextEx)
[junit4:junit4]   2> 5102 T2761 oasc.SolrResourceLoader.locateSolrHome using system property solr.solr.home: .\org.apache.solr.handler.TestReplicationHandler$SolrInstance-1361649729746\slave
[junit4:junit4]   2> 5102 T2761 oasc.CoreContainer$Initializer.initialize looking for solr.xml: C:\Users\JenkinsSlave\workspace\Lucene-Solr-trunk-Windows\solr\build\solr-core\test\J0\.\org.apache.solr.handler.TestReplicationHandler$SolrInstance-1361649729746\slave\solr.xml
[junit4:junit4]   2> 5102 T2761 oasc.CoreContainer.<init> New CoreContainer 2103346263
[junit4:junit4]   2> 5104 T2761 oasc.CoreContainer$Initializer.initialize no solr.xml file found - using default
[junit4:junit4]   2> 5104 T2761 oasc.CoreContainer.load Loading CoreContainer using Solr Home: '.\org.apache.solr.handler.TestReplicationHandler$SolrInstance-1361649729746\slave\'
[junit4:junit4]   2> 5104 T2761 oasc.SolrResourceLoader.<init> new SolrResourceLoader for directory: '.\org.apache.solr.handler.TestReplicationHandler$SolrInstance-1361649729746\slave\'
[junit4:junit4]   2> 5124 T2761 oashc.HttpShardHandlerFactory.getParameter Setting socketTimeout to: 0
[junit4:junit4]   2> 5124 T2761 oashc.HttpShardHandlerFactory.getParameter Setting urlScheme to: http://
[junit4:junit4]   2> 5125 T2761 oashc.HttpShardHandlerFactory.getParameter Setting connTimeout to: 0
[junit4:junit4]   2> 5125 T2761 oashc.HttpShardHandlerFactory.getParameter Setting maxConnectionsPerHost to: 20
[junit4:junit4]   2> 5125 T2761 oashc.HttpShardHandlerFactory.getParameter Setting corePoolSize to: 0
[junit4:junit4]   2> 5126 T2761 oashc.HttpShardHandlerFactory.getParameter Setting maximumPoolSize to: 2147483647
[junit4:junit4]   2> 5126 T2761 oashc.HttpShardHandlerFactory.getParameter Setting maxThreadIdleTime to: 5
[junit4:junit4]   2> 5126 T2761 oashc.HttpShardHandlerFactory.getParameter Setting sizeOfQueue to: -1
[junit4:junit4]   2> 5127 T2761 oashc.HttpShardHandlerFactory.getParameter Setting fairnessPolicy to: false
[junit4:junit4]   2> 5127 T2761 oascsi.HttpClientUtil.createClient Creating new http client, config:maxConnectionsPerHost=20&maxConnections=10000&socketTimeout=0&connTimeout=0&retry=false
[junit4:junit4]   2> 5137 T2761 oasc.CoreContainer.load Registering Log Listener
[junit4:junit4]   2> 5164 T2833 oasc.CoreContainer.create Creating SolrCore 'collection1' using instanceDir: .\org.apache.solr.handler.TestReplicationHandler$SolrInstance-1361649729746\slave\collection1
[junit4:junit4]   2> 5166 T2833 oasc.SolrResourceLoader.<init> new SolrResourceLoader for directory: '.\org.apache.solr.handler.TestReplicationHandler$SolrInstance-1361649729746\slave\collection1\'
[junit4:junit4]   2> 5207 T2833 oasc.SolrConfig.<init> Using Lucene MatchVersion: LUCENE_50
[junit4:junit4]   2> 5261 T2833 oasc.SolrConfig.<init> Loaded SolrConfig: solrconfig.xml
[junit4:junit4]   2> 5262 T2833 oass.IndexSchema.readSchema Reading Solr Schema
[junit4:junit4]   2> 5265 T2833 oass.IndexSchema.readSchema Schema name=test
[junit4:junit4]   2> 5283 T2833 oass.IndexSchema.readSchema unique key field: id
[junit4:junit4]   2> 5285 T2833 oasc.SolrCore.<init> [collection1] Opening new SolrCore at .\org.apache.solr.handler.TestReplicationHandler$SolrInstance-1361649729746\slave\collection1\, dataDir=.\org.apache.solr.handler.TestReplicationHandler$SolrInstance-1361649729746\slave\collection1\data\
[junit4:junit4]   2> 5285 T2833 oasc.SolrCore.<init> JMX monitoring not detected for core: collection1
[junit4:junit4]   2> 5285 T2833 oasc.SolrCore.initDirectoryFactory org.apache.solr.core.MockDirectoryFactory
[junit4:junit4]   2> 5286 T2833 oasc.CachingDirectoryFactory.get return new directory for C:\Users\JenkinsSlave\workspace\Lucene-Solr-trunk-Windows\solr\build\solr-core\test\J0\.\org.apache.solr.handler.TestReplicationHandler$SolrInstance-1361649729746\slave\collection1\data forceNew:false
[junit4:junit4]   2> 5286 T2833 oasc.CachingDirectoryFactory.close Releasing directory:C:\Users\JenkinsSlave\workspace\Lucene-Solr-trunk-Windows\solr\build\solr-core\test\J0\.\org.apache.solr.handler.TestReplicationHandler$SolrInstance-1361649729746\slave\collection1\data
[junit4:junit4]   2> 5286 T2833 oasc.SolrCore.getNewIndexDir New index directory detected: old=null new=.\org.apache.solr.handler.TestReplicationHandler$SolrInstance-1361649729746\slave\collection1\data\index/
[junit4:junit4]   2> 5288 T2833 oasc.SolrCore.initIndex WARNING [collection1] Solr index directory '.\org.apache.solr.handler.TestReplicationHandler$SolrInstance-1361649729746\slave\collection1\data\index' doesn't exist. Creating new index...
[junit4:junit4]   2> 5289 T2833 oasc.CachingDirectoryFactory.get return new directory for C:\Users\JenkinsSlave\workspace\Lucene-Solr-trunk-Windows\solr\build\solr-core\test\J0\.\org.apache.solr.handler.TestReplicationHandler$SolrInstance-1361649729746\slave\collection1\data\index forceNew:false
[junit4:junit4]   2> 5289 T2833 oasc.SolrDeletionPolicy.onCommit SolrDeletionPolicy.onCommit: commits:num=1
[junit4:junit4]   2> 		commit{dir=MockDirWrapper(org.apache.lucene.store.RAMDirectory@31d708c4 lockFactory=org.apache.lucene.store.SingleInstanceLockFactory@3dd1f412),segFN=segments_1,generation=1,filenames=[segments_1]
[junit4:junit4]   2> 5290 T2833 oasc.SolrDeletionPolicy.updateCommits newest commit = 1[segments_1]
[junit4:junit4]   2> 5290 T2833 oasc.CachingDirectoryFactory.close Releasing directory:C:\Users\JenkinsSlave\workspace\Lucene-Solr-trunk-Windows\solr\build\solr-core\test\J0\.\org.apache.solr.handler.TestReplicationHandler$SolrInstance-1361649729746\slave\collection1\data\index
[junit4:junit4]   2> 5290 T2833 oasc.RequestHandlers.initHandlersFromConfig created standard: solr.StandardRequestHandler
[junit4:junit4]   2> 5291 T2833 oasc.RequestHandlers.initHandlersFromConfig created defaults: solr.StandardRequestHandler
[junit4:junit4]   2> 5291 T2833 oasc.RequestHandlers.initHandlersFromConfig adding lazy requestHandler: solr.StandardRequestHandler
[junit4:junit4]   2> 5291 T2833 oasc.RequestHandlers.initHandlersFromConfig created lazy: solr.StandardRequestHandler
[junit4:junit4]   2> 5292 T2833 oasc.RequestHandlers.initHandlersFromConfig created /update: solr.UpdateRequestHandler
[junit4:junit4]   2> 5293 T2833 oasc.RequestHandlers.initHandlersFromConfig created /replication: solr.ReplicationHandler
[junit4:junit4]   2> 5294 T2833 oashl.XMLLoader.init xsltCacheLifetimeSeconds=60
[junit4:junit4]   2> 5298 T2833 oasc.CachingDirectoryFactory.close Releasing directory:C:\Users\JenkinsSlave\workspace\Lucene-Solr-trunk-Windows\solr\build\solr-core\test\J0\.\org.apache.solr.handler.TestReplicationHandler$SolrInstance-1361649729746\slave\collection1\data
[junit4:junit4]   2> 5298 T2833 oass.SolrIndexSearcher.<init> Opening Searcher@210283cf main
[junit4:junit4]   2> 5298 T2833 oasu.CommitTracker.<init> Hard AutoCommit: disabled
[junit4:junit4]   2> 5298 T2833 oasu.CommitTracker.<init> Soft AutoCommit: disabled
[junit4:junit4]   2> 5299 T2833 oash.SnapPuller.startExecutorService Poll Scheduled at an interval of 1000ms
[junit4:junit4]   2> 5299 T2833 oasc.CoreContainer.registerCore registering core: collection1
[junit4:junit4]   2> 5299 T2834 oasc.SolrCore.registerSearcher [collection1] Registered new searcher Searcher@210283cf main{StandardDirectoryReader(segments_1:1)}
[junit4:junit4]   2> 5299 T2761 oass.SolrDispatchFilter.init user.dir=C:\Users\JenkinsSlave\workspace\Lucene-Solr-trunk-Windows\solr\build\solr-core\test\J0
[junit4:junit4]   2> 5299 T2761 oass.SolrDispatchFilter.init SolrDispatchFilter.init() done
[junit4:junit4]   2> 5301 T2761 oascsi.HttpClientUtil.createClient Creating new http client, config:maxConnections=128&maxConnectionsPerHost=32&followRedirects=false
[junit4:junit4]   2> 5319 T2761 oasc.CoreContainer.shutdown Shutting down CoreContainer instance=1710146340
[junit4:junit4]   2> 5321 T2761 oasc.SolrCore.close [collection1]  CLOSING SolrCore org.apache.solr.core.SolrCore@c649800
[junit4:junit4]   2> 5321 T2761 oasu.DirectUpdateHandler2.close closing DirectUpdateHandler2{commits=0,autocommits=0,soft autocommits=0,optimizes=0,rollbacks=0,expungeDeletes=0,docsPending=0,adds=0,deletesById=0,deletesByQuery=0,errors=0,cumulative_adds=0,cumulative_deletesById=0,cumulative_deletesByQuery=0,cumulative_errors=0}
[junit4:junit4]   2> 5322 T2761 oasu.SolrCoreState.decrefSolrCoreState Closing SolrCoreState
[junit4:junit4]   2> 5322 T2761 oasu.DefaultSolrCoreState.closeIndexWriter SolrCoreState ref count has reached 0 - closing IndexWriter
[junit4:junit4]   2> 5322 T2761 oasu.DefaultSolrCoreState.closeIndexWriter closing IndexWriter with IndexWriterCloser
[junit4:junit4]   2> 5323 T2761 oasc.SolrCore.closeSearcher [collection1] Closing main searcher on request.
[junit4:junit4]   2> 5325 T2761 oasc.CachingDirectoryFactory.close Releasing directory:C:\Users\JenkinsSlave\workspace\Lucene-Solr-trunk-Windows\solr\build\solr-core\test\J0\.\org.apache.solr.handler.TestReplicationHandler$SolrInstance-1361649729478\master\collection1\data\index
[junit4:junit4]   2> 5325 T2761 oasc.CachingDirectoryFactory.close Closing directory when closing factory:C:\Users\JenkinsSlave\workspace\Lucene-Solr-trunk-Windows\solr\build\solr-core\test\J0\.\org.apache.solr.handler.TestReplicationHandler$SolrInstance-1361649729478\master\collection1\data
[junit4:junit4]   2> 5325 T2761 oasc.CachingDirectoryFactory.closeDirectory Closing directory:C:\Users\JenkinsSlave\workspace\Lucene-Solr-trunk-Windows\solr\build\solr-core\test\J0\.\org.apache.solr.handler.TestReplicationHandler$SolrInstance-1361649729478\master\collection1\data
[junit4:junit4]   2> 5326 T2761 oasc.CachingDirectoryFactory.close Closing directory when closing factory:C:\Users\JenkinsSlave\workspace\Lucene-Solr-trunk-Windows\solr\build\solr-core\test\J0\.\org.apache.solr.handler.TestReplicationHandler$SolrInstance-1361649729478\master\collection1\data\index
[junit4:junit4]   2> 5326 T2761 oasc.CachingDirectoryFactory.closeDirectory Closing directory:C:\Users\JenkinsSlave\workspace\Lucene-Solr-trunk-Windows\solr\build\solr-core\test\J0\.\org.apache.solr.handler.TestReplicationHandler$SolrInstance-1361649729478\master\collection1\data\index
[junit4:junit4]   2> 5327 T2761 oejsh.ContextHandler.doStop stopped o.e.j.s.ServletContextHandler{/solr,null}
[junit4:junit4]   2> 5384 T2761 oejs.Server.doStart jetty-8.1.8.v20121106
[junit4:junit4]   2> 5387 T2761 oejs.AbstractConnector.doStart Started SelectChannelConnector@127.0.0.1:59460
[junit4:junit4]   2> 5388 T2761 oass.SolrDispatchFilter.init SolrDispatchFilter.init()
[junit4:junit4]   2> 5389 T2761 oasc.SolrResourceLoader.locateSolrHome JNDI not configured for solr (NoInitialContextEx)
[junit4:junit4]   2> 5389 T2761 oasc.SolrResourceLoader.locateSolrHome using system property solr.solr.home: .\org.apache.solr.handler.TestReplicationHandler$SolrInstance-1361649729478\master
[junit4:junit4]   2> 5390 T2761 oasc.CoreContainer$Initializer.initialize looking for solr.xml: C:\Users\JenkinsSlave\workspace\Lucene-Solr-trunk-Windows\solr\build\solr-core\test\J0\.\org.apache.solr.handler.TestReplicationHandler$SolrInstance-1361649729478\master\solr.xml
[junit4:junit4]   2> 5390 T2761 oasc.CoreContainer.<init> New CoreContainer 1761611808
[junit4:junit4]   2> 5391 T2761 oasc.CoreContainer$Initializer.initialize no solr.xml file found - using default
[junit4:junit4]   2> 5391 T2761 oasc.CoreContainer.load Loading CoreContainer using Solr Home: '.\org.apache.solr.handler.TestReplicationHandler$SolrInstance-1361649729478\master\'
[junit4:junit4]   2> 5391 T2761 oasc.SolrResourceLoader.<init> new SolrResourceLoader for directory: '.\org.apache.solr.handler.TestReplicationHandler$SolrInstance-1361649729478\master\'
[junit4:junit4]   2> 5408 T2761 oashc.HttpShardHandlerFactory.getParameter Setting socketTimeout to: 0
[junit4:junit4]   2> 5409 T2761 oashc.HttpShardHandlerFactory.getParameter Setting urlScheme to: http://
[junit4:junit4]   2> 5409 T2761 oashc.HttpShardHandlerFactory.getParameter Setting connTimeout to: 0
[junit4:junit4]   2> 5410 T2761 oashc.HttpShardHandlerFactory.getParameter Setting maxConnectionsPerHost to: 20
[junit4:junit4]   2> 5410 T2761 oashc.HttpShardHandlerFactory.getParameter Setting corePoolSize to: 0
[junit4:junit4]   2> 5410 T2761 oashc.HttpShardHandlerFactory.getParameter Setting maximumPoolSize to: 2147483647
[junit4:junit4]   2> 5411 T2761 oashc.HttpShardHandlerFactory.getParameter Setting maxThreadIdleTime to: 5
[junit4:junit4]   2> 5411 T2761 oashc.HttpShardHandlerFactory.getParameter Setting sizeOfQueue to: -1
[junit4:junit4]   2> 5412 T2761 oashc.HttpShardHandlerFactory.getParameter Setting fairnessPolicy to: false
[junit4:junit4]   2> 5412 T2761 oascsi.HttpClientUtil.createClient Creating new http client, config:maxConnectionsPerHost=20&maxConnections=10000&socketTimeout=0&connTimeout=0&retry=false
[junit4:junit4]   2> 5423 T2761 oasc.CoreContainer.load Registering Log Listener
[junit4:junit4]   2> 5449 T2845 oasc.CoreContainer.create Creating SolrCore 'collection1' using instanceDir: .\org.apache.solr.handler.TestReplicationHandler$SolrInstance-1361649729478\master\collection1
[junit4:junit4]   2> 5450 T2845 oasc.SolrResourceLoader.<init> new SolrResourceLoader for directory: '.\org.apache.solr.handler.TestReplicationHandler$SolrInstance-1361649729478\master\collection1\'
[junit4:junit4]   2> 5489 T2845 oasc.SolrConfig.<init> Using Lucene MatchVersion: LUCENE_50
[junit4:junit4]   2> 5542 T2845 oasc.SolrConfig.<init> Loaded SolrConfig: solrconfig.xml
[junit4:junit4]   2> 5542 T2845 oass.IndexSchema.readSchema Reading Solr Schema
[

[...truncated too long message...]

SolrCoreState Closing SolrCoreState
[junit4:junit4]   2> 42300 T2761 oasu.DefaultSolrCoreState.closeIndexWriter SolrCoreState ref count has reached 0 - closing IndexWriter
[junit4:junit4]   2> 42300 T2761 oasu.DefaultSolrCoreState.closeIndexWriter closing IndexWriter with IndexWriterCloser
[junit4:junit4]   2> 42301 T2761 oasc.SolrCore.closeSearcher [collection1] Closing main searcher on request.
[junit4:junit4]   2> 42302 T2761 oasc.CachingDirectoryFactory.close Releasing directory:C:\Users\JenkinsSlave\workspace\Lucene-Solr-trunk-Windows\solr\build\solr-core\test\J0\.\org.apache.solr.handler.TestReplicationHandler$SolrInstance-1361649761021\master\collection1\data\index
[junit4:junit4]   2> 42302 T2761 oasc.CachingDirectoryFactory.close Closing directory when closing factory:C:\Users\JenkinsSlave\workspace\Lucene-Solr-trunk-Windows\solr\build\solr-core\test\J0\.\org.apache.solr.handler.TestReplicationHandler$SolrInstance-1361649761021\master\collection1\data
[junit4:junit4]   2> 42302 T2761 oasc.CachingDirectoryFactory.closeDirectory Closing directory:C:\Users\JenkinsSlave\workspace\Lucene-Solr-trunk-Windows\solr\build\solr-core\test\J0\.\org.apache.solr.handler.TestReplicationHandler$SolrInstance-1361649761021\master\collection1\data
[junit4:junit4]   2> 42302 T2761 oasc.CachingDirectoryFactory.close Closing directory when closing factory:C:\Users\JenkinsSlave\workspace\Lucene-Solr-trunk-Windows\solr\build\solr-core\test\J0\.\org.apache.solr.handler.TestReplicationHandler$SolrInstance-1361649761021\master\collection1\data\index
[junit4:junit4]   2> 42303 T2761 oasc.CachingDirectoryFactory.closeDirectory Closing directory:C:\Users\JenkinsSlave\workspace\Lucene-Solr-trunk-Windows\solr\build\solr-core\test\J0\.\org.apache.solr.handler.TestReplicationHandler$SolrInstance-1361649761021\master\collection1\data\index
[junit4:junit4]   2> 42303 T2761 oejsh.ContextHandler.doStop stopped o.e.j.s.ServletContextHandler{/solr,null}
[junit4:junit4]   2> 42369 T2761 oasc.CoreContainer.shutdown Shutting down CoreContainer instance=119019268
[junit4:junit4]   2> 42369 T2761 oasc.SolrCore.close [collection1]  CLOSING SolrCore org.apache.solr.core.SolrCore@222630af
[junit4:junit4]   2> 43413 T3271 oash.SnapPuller.fetchLatestIndex SEVERE Master at: http://127.0.0.1:59598/solr is not available. Index fetch failed. Exception: org.apache.solr.client.solrj.SolrServerException: Server refused connection at: http://127.0.0.1:59598/solr
[junit4:junit4]   2> 43414 T3271 oasc.CachingDirectoryFactory.close Releasing directory:C:\Users\JenkinsSlave\workspace\Lucene-Solr-trunk-Windows\solr\build\solr-core\test\J0\.\org.apache.solr.handler.TestReplicationHandler$SolrInstance-1361649761309\slave\collection1\data
[junit4:junit4]   2> 43415 T3271 oasc.CachingDirectoryFactory.close Releasing directory:C:\Users\JenkinsSlave\workspace\Lucene-Solr-trunk-Windows\solr\build\solr-core\test\J0\.\org.apache.solr.handler.TestReplicationHandler$SolrInstance-1361649761309\slave\collection1\data
[junit4:junit4]   2> 43415 T2761 oasu.DirectUpdateHandler2.close closing DirectUpdateHandler2{commits=0,autocommits=0,soft autocommits=0,optimizes=0,rollbacks=0,expungeDeletes=0,docsPending=0,adds=0,deletesById=0,deletesByQuery=0,errors=0,cumulative_adds=0,cumulative_deletesById=0,cumulative_deletesByQuery=0,cumulative_errors=0}
[junit4:junit4]   2> 43415 T2761 oasu.SolrCoreState.decrefSolrCoreState Closing SolrCoreState
[junit4:junit4]   2> 43416 T2761 oasu.DefaultSolrCoreState.closeIndexWriter SolrCoreState ref count has reached 0 - closing IndexWriter
[junit4:junit4]   2> 43416 T2761 oasu.DefaultSolrCoreState.closeIndexWriter closing IndexWriter with IndexWriterCloser
[junit4:junit4]   2> 43417 T2761 oasc.SolrCore.closeSearcher [collection1] Closing main searcher on request.
[junit4:junit4]   2> 43417 T2761 oasc.CachingDirectoryFactory.close Releasing directory:C:\Users\JenkinsSlave\workspace\Lucene-Solr-trunk-Windows\solr\build\solr-core\test\J0\.\org.apache.solr.handler.TestReplicationHandler$SolrInstance-1361649761309\slave\collection1\data\index
[junit4:junit4]   2> 43417 T2761 oasc.CachingDirectoryFactory.close Closing directory when closing factory:C:\Users\JenkinsSlave\workspace\Lucene-Solr-trunk-Windows\solr\build\solr-core\test\J0\.\org.apache.solr.handler.TestReplicationHandler$SolrInstance-1361649761309\slave\collection1\data\index
[junit4:junit4]   2> 43418 T2761 oasc.CachingDirectoryFactory.closeDirectory Closing directory:C:\Users\JenkinsSlave\workspace\Lucene-Solr-trunk-Windows\solr\build\solr-core\test\J0\.\org.apache.solr.handler.TestReplicationHandler$SolrInstance-1361649761309\slave\collection1\data\index
[junit4:junit4]   2> 43418 T2761 oasc.CachingDirectoryFactory.close Closing directory when closing factory:C:\Users\JenkinsSlave\workspace\Lucene-Solr-trunk-Windows\solr\build\solr-core\test\J0\.\org.apache.solr.handler.TestReplicationHandler$SolrInstance-1361649761309\slave\collection1\data
[junit4:junit4]   2> 43419 T2761 oasc.CachingDirectoryFactory.closeDirectory Closing directory:C:\Users\JenkinsSlave\workspace\Lucene-Solr-trunk-Windows\solr\build\solr-core\test\J0\.\org.apache.solr.handler.TestReplicationHandler$SolrInstance-1361649761309\slave\collection1\data
[junit4:junit4]   2> 43419 T2761 oejsh.ContextHandler.doStop stopped o.e.j.s.ServletContextHandler{/solr,null}
[junit4:junit4]   2> 43514 T2761 oas.SolrTestCaseJ4.deleteCore ###deleteCore
[junit4:junit4]   2> NOTE: test params are: codec=Lucene40, sim=RandomSimilarityProvider(queryNorm=false,coord=crazy): {}, locale=ar_AE, timezone=America/Yellowknife
[junit4:junit4]   2> NOTE: Windows 7 6.1 amd64/Oracle Corporation 1.7.0_10 (64-bit)/cpus=2,threads=1,free=378606304,total=536870912
[junit4:junit4]   2> NOTE: All tests run in this JVM: [TestDocumentBuilder, TestCoreContainer, FullSolrCloudDistribCmdsTest, UniqFieldsUpdateProcessorFactoryTest, DistributedTermsComponentTest, TestLFUCache, SolrInfoMBeanTest, SyncSliceTest, AutoCommitTest, TestExtendedDismaxParser, IndexReaderFactoryTest, SortByFunctionTest, SpellingQueryConverterTest, FileBasedSpellCheckerTest, SimpleFacetsTest, FieldMutatingUpdateProcessorTest, BasicFunctionalityTest, TestSolrDeletionPolicy1, TestPostingsSolrHighlighter, TestPHPSerializedResponseWriter, TestArbitraryIndexDir, LeaderElectionIntegrationTest, MultiTermTest, CacheHeaderTest, TestBinaryResponseWriter, MBeansHandlerTest, TestNumberUtils, TestValueSourceCache, HardAutoCommitTest, SolrCmdDistributorTest, SuggesterWFSTTest, TestSolrCoreProperties, TestGroupingSearch, SolrCoreCheckLockOnStartupTest, ClusterStateTest, TestPseudoReturnFields, NoCacheHeaderTest, TestElisionMultitermQuery, TestIBSimilarityFactory, JsonLoaderTest, ShowFileRequestHandlerTest, BasicDistributedZkTest, SpellCheckComponentTest, TestConfig, RecoveryZkTest, ExternalFileFieldSortTest, DirectSolrConnectionTest, OverseerCollectionProcessorTest, PreAnalyzedFieldTest, ShardRoutingCustomTest, NotRequiredUniqueKeyTest, TestCSVResponseWriter, StatelessScriptUpdateProcessorFactoryTest, IndexSchemaTest, ResourceLoaderTest, TestLMJelinekMercerSimilarityFactory, TestFunctionQuery, IndexBasedSpellCheckerTest, FastVectorHighlighterTest, ChaosMonkeyNothingIsSafeTest, XsltUpdateRequestHandlerTest, ZkCLITest, OutputWriterTest, TestIndexSearcher, TestSurroundQueryParser, TestSort, OverseerTest, DefaultValueUpdateProcessorTest, SearchHandlerTest, TestTrie, TestOmitPositions, TestPropInjectDefaults, CoreAdminHandlerTest, URLClassifyProcessorTest, DirectUpdateHandlerTest, DocumentAnalysisRequestHandlerTest, RequiredFieldsTest, SuggesterFSTTest, ScriptEngineTest, SystemInfoHandlerTest, SolrIndexSplitterTest, TestRemoteStreaming, TestFuzzyAnalyzedSuggestions, TestLuceneMatchVersion, CoreContainerCoreInitFailuresTest, TestFastLRUCache, CopyFieldTest, TestBadConfig, TestQuerySenderNoQuery, TestLRUCache, RequestHandlersTest, SolrPluginUtilsTest, TestReload, TestLMDirichletSimilarityFactory, BadComponentTest, MinimalSchemaTest, UnloadDistributedZkTest, TestDefaultSimilarityFactory, ZkSolrClientTest, DistributedQueryElevationComponentTest, TermsComponentTest, TestPartialUpdateDeduplication, PrimUtilsTest, TestMergePolicyConfig, TestRealTimeGet, TestBinaryField, ZkControllerTest, TestSolrIndexConfig, DistributedSpellCheckComponentTest, HighlighterConfigTest, TestDFRSimilarityFactory, OpenExchangeRatesOrgProviderTest, TestFastWriter, CircularListTest, SchemaVersionSpecificBehaviorTest, BinaryUpdateRequestHandlerTest, ZkNodePropsTest, StatsComponentTest, ClusterStateUpdateTest, SliceStateUpdateTest, TestJmxIntegration, TestReplicationHandler]
[junit4:junit4] Completed in 43.54s, 10 tests, 1 failure, 1 error <<< FAILURES!

[...truncated 403 lines...]
BUILD FAILED
C:\Users\JenkinsSlave\workspace\Lucene-Solr-trunk-Windows\build.xml:381: The following error occurred while executing this line:
C:\Users\JenkinsSlave\workspace\Lucene-Solr-trunk-Windows\build.xml:361: The following error occurred while executing this line:
C:\Users\JenkinsSlave\workspace\Lucene-Solr-trunk-Windows\build.xml:39: The following error occurred while executing this line:
C:\Users\JenkinsSlave\workspace\Lucene-Solr-trunk-Windows\solr\build.xml:183: The following error occurred while executing this line:
C:\Users\JenkinsSlave\workspace\Lucene-Solr-trunk-Windows\solr\common-build.xml:447: The following error occurred while executing this line:
C:\Users\JenkinsSlave\workspace\Lucene-Solr-trunk-Windows\lucene\common-build.xml:1202: The following error occurred while executing this line:
C:\Users\JenkinsSlave\workspace\Lucene-Solr-trunk-Windows\lucene\common-build.xml:865: There were test failures: 254 suites, 1063 tests, 1 error, 1 failure, 13 ignored (8 assumptions)

Total time: 64 minutes 53 seconds
Build step 'Invoke Ant' marked build as failure
Archiving artifacts
Recording test results
Description set: Java: 64bit/jdk1.7.0_10 -XX:+UseG1GC
Email was triggered for: Failure
Sending email for trigger: Failure



Mime
View raw message