lucene-dev mailing list archives

Site index · List index
Message view « Date » · « Thread »
Top « Date » · « Thread »
From Policeman Jenkins Server <jenk...@thetaphi.de>
Subject [JENKINS] Lucene-Solr-trunk-MacOSX (64bit/jdk1.7.0) - Build # 168 - Still Failing!
Date Fri, 01 Feb 2013 14:14:01 GMT
Build: http://jenkins.thetaphi.de/job/Lucene-Solr-trunk-MacOSX/168/
Java: 64bit/jdk1.7.0 -XX:+UseG1GC

1 tests failed.
FAILED:  org.apache.solr.cloud.BasicDistributedZkTest.testDistribSearch

Error Message:
There are still nodes recoverying - waited for 230 seconds

Stack Trace:
java.lang.AssertionError: There are still nodes recoverying - waited for 230 seconds
	at __randomizedtesting.SeedInfo.seed([F6B85628C068C5AD:775ED830B737A591]:0)
	at org.junit.Assert.fail(Assert.java:93)
	at org.apache.solr.cloud.AbstractDistribZkTestBase.waitForRecoveriesToFinish(AbstractDistribZkTestBase.java:168)
	at org.apache.solr.cloud.AbstractDistribZkTestBase.waitForRecoveriesToFinish(AbstractDistribZkTestBase.java:126)
	at org.apache.solr.cloud.AbstractDistribZkTestBase.waitForRecoveriesToFinish(AbstractDistribZkTestBase.java:121)
	at org.apache.solr.cloud.BasicDistributedZkTest.testCoreUnloadAndLeaders(BasicDistributedZkTest.java:586)
	at org.apache.solr.cloud.BasicDistributedZkTest.doTest(BasicDistributedZkTest.java:337)
	at org.apache.solr.BaseDistributedSearchTestCase.testDistribSearch(BaseDistributedSearchTestCase.java:794)
	at sun.reflect.NativeMethodAccessorImpl.invoke0(Native Method)
	at sun.reflect.NativeMethodAccessorImpl.invoke(NativeMethodAccessorImpl.java:57)
	at sun.reflect.DelegatingMethodAccessorImpl.invoke(DelegatingMethodAccessorImpl.java:43)
	at java.lang.reflect.Method.invoke(Method.java:601)
	at com.carrotsearch.randomizedtesting.RandomizedRunner.invoke(RandomizedRunner.java:1559)
	at com.carrotsearch.randomizedtesting.RandomizedRunner.access$600(RandomizedRunner.java:79)
	at com.carrotsearch.randomizedtesting.RandomizedRunner$6.evaluate(RandomizedRunner.java:737)
	at com.carrotsearch.randomizedtesting.RandomizedRunner$7.evaluate(RandomizedRunner.java:773)
	at com.carrotsearch.randomizedtesting.RandomizedRunner$8.evaluate(RandomizedRunner.java:787)
	at com.carrotsearch.randomizedtesting.rules.SystemPropertiesRestoreRule$1.evaluate(SystemPropertiesRestoreRule.java:53)
	at org.apache.lucene.util.TestRuleSetupTeardownChained$1.evaluate(TestRuleSetupTeardownChained.java:50)
	at org.apache.lucene.util.TestRuleFieldCacheSanity$1.evaluate(TestRuleFieldCacheSanity.java:51)
	at org.apache.lucene.util.AbstractBeforeAfterRule$1.evaluate(AbstractBeforeAfterRule.java:46)
	at com.carrotsearch.randomizedtesting.rules.SystemPropertiesInvariantRule$1.evaluate(SystemPropertiesInvariantRule.java:55)
	at org.apache.lucene.util.TestRuleThreadAndTestName$1.evaluate(TestRuleThreadAndTestName.java:49)
	at org.apache.lucene.util.TestRuleIgnoreAfterMaxFailures$1.evaluate(TestRuleIgnoreAfterMaxFailures.java:70)
	at org.apache.lucene.util.TestRuleMarkFailure$1.evaluate(TestRuleMarkFailure.java:48)
	at com.carrotsearch.randomizedtesting.rules.StatementAdapter.evaluate(StatementAdapter.java:36)
	at com.carrotsearch.randomizedtesting.ThreadLeakControl$StatementRunner.run(ThreadLeakControl.java:358)
	at com.carrotsearch.randomizedtesting.ThreadLeakControl.forkTimeoutingTask(ThreadLeakControl.java:782)
	at com.carrotsearch.randomizedtesting.ThreadLeakControl$3.evaluate(ThreadLeakControl.java:442)
	at com.carrotsearch.randomizedtesting.RandomizedRunner.runSingleTest(RandomizedRunner.java:746)
	at com.carrotsearch.randomizedtesting.RandomizedRunner$3.evaluate(RandomizedRunner.java:648)
	at com.carrotsearch.randomizedtesting.RandomizedRunner$4.evaluate(RandomizedRunner.java:682)
	at com.carrotsearch.randomizedtesting.RandomizedRunner$5.evaluate(RandomizedRunner.java:693)
	at com.carrotsearch.randomizedtesting.rules.StatementAdapter.evaluate(StatementAdapter.java:36)
	at com.carrotsearch.randomizedtesting.rules.SystemPropertiesRestoreRule$1.evaluate(SystemPropertiesRestoreRule.java:53)
	at org.apache.lucene.util.AbstractBeforeAfterRule$1.evaluate(AbstractBeforeAfterRule.java:46)
	at org.apache.lucene.util.TestRuleStoreClassName$1.evaluate(TestRuleStoreClassName.java:42)
	at com.carrotsearch.randomizedtesting.rules.SystemPropertiesInvariantRule$1.evaluate(SystemPropertiesInvariantRule.java:55)
	at com.carrotsearch.randomizedtesting.rules.NoShadowingOrOverridesOnMethodsRule$1.evaluate(NoShadowingOrOverridesOnMethodsRule.java:39)
	at com.carrotsearch.randomizedtesting.rules.NoShadowingOrOverridesOnMethodsRule$1.evaluate(NoShadowingOrOverridesOnMethodsRule.java:39)
	at com.carrotsearch.randomizedtesting.rules.StatementAdapter.evaluate(StatementAdapter.java:36)
	at org.apache.lucene.util.TestRuleAssertionsRequired$1.evaluate(TestRuleAssertionsRequired.java:43)
	at org.apache.lucene.util.TestRuleMarkFailure$1.evaluate(TestRuleMarkFailure.java:48)
	at org.apache.lucene.util.TestRuleIgnoreAfterMaxFailures$1.evaluate(TestRuleIgnoreAfterMaxFailures.java:70)
	at org.apache.lucene.util.TestRuleIgnoreTestSuites$1.evaluate(TestRuleIgnoreTestSuites.java:55)
	at com.carrotsearch.randomizedtesting.rules.StatementAdapter.evaluate(StatementAdapter.java:36)
	at com.carrotsearch.randomizedtesting.ThreadLeakControl$StatementRunner.run(ThreadLeakControl.java:358)
	at java.lang.Thread.run(Thread.java:722)




Build Log:
[...truncated 8985 lines...]
[junit4:junit4] Suite: org.apache.solr.cloud.BasicDistributedZkTest
[junit4:junit4]   2> 0 T3247 oas.BaseDistributedSearchTestCase.initHostContext Setting hostContext system property: /_/
[junit4:junit4]   2> 8 T3247 oas.SolrTestCaseJ4.setUp ###Starting testDistribSearch
[junit4:junit4]   2> Creating dataDir: /Users/jenkins/jenkins-slave/workspace/Lucene-Solr-trunk-MacOSX/solr/build/solr-core/test/J0/./solrtest-BasicDistributedZkTest-1359727154251
[junit4:junit4]   2> 9 T3247 oasc.ZkTestServer.run STARTING ZK TEST SERVER
[junit4:junit4]   2> 10 T3248 oasc.ZkTestServer$ZKServerMain.runFromConfig Starting server
[junit4:junit4]   2> 12 T3248 oazs.ZooKeeperServer.setTickTime tickTime set to 1000
[junit4:junit4]   2> 12 T3248 oazs.ZooKeeperServer.setMinSessionTimeout minSessionTimeout set to -1
[junit4:junit4]   2> 12 T3248 oazs.ZooKeeperServer.setMaxSessionTimeout maxSessionTimeout set to -1
[junit4:junit4]   2> 13 T3248 oazs.NIOServerCnxnFactory.configure binding to port 0.0.0.0/0.0.0.0:0
[junit4:junit4]   2> 14 T3248 oazsp.FileTxnSnapLog.save Snapshotting: 0x0 to /Users/jenkins/jenkins-slave/workspace/Lucene-Solr-trunk-MacOSX/solr/build/solr-core/test/J0/./org.apache.solr.cloud.BasicDistributedZkTest-1359727154250/zookeeper/server1/data/version-2/snapshot.0
[junit4:junit4]   2> 113 T3247 oasc.ZkTestServer.run start zk server on port:50258
[junit4:junit4]   2> 113 T3247 oaz.ZooKeeper.<init> Initiating client connection, connectString=127.0.0.1:50258 sessionTimeout=10000 watcher=org.apache.solr.common.cloud.ConnectionManager@5df8e8d7
[junit4:junit4]   2> 114 T3247 oascc.ConnectionManager.waitForConnected Waiting for client to connect to ZooKeeper
[junit4:junit4]   2> 114 T3253 oaz.ClientCnxn$SendThread.logStartConnect Opening socket connection to server localhost/127.0.0.1:50258. Will not attempt to authenticate using SASL (access denied ("javax.security.auth.AuthPermission" "getLoginConfiguration"))
[junit4:junit4]   2> 115 T3253 oaz.ClientCnxn$SendThread.primeConnection Socket connection established to localhost/127.0.0.1:50258, initiating session
[junit4:junit4]   2> 115 T3249 oazs.NIOServerCnxnFactory.run Accepted socket connection from /127.0.0.1:50259
[junit4:junit4]   2> 116 T3249 oazs.ZooKeeperServer.processConnectRequest Client attempting to establish new session at /127.0.0.1:50259
[junit4:junit4]   2> 116 T3251 oazsp.FileTxnLog.append Creating new log file: log.1
[junit4:junit4]   2> 118 T3251 oazs.ZooKeeperServer.finishSessionInit Established session 0x13c960dd4510000 with negotiated timeout 10000 for client /127.0.0.1:50259
[junit4:junit4]   2> 118 T3253 oaz.ClientCnxn$SendThread.onConnected Session establishment complete on server localhost/127.0.0.1:50258, sessionid = 0x13c960dd4510000, negotiated timeout = 10000
[junit4:junit4]   2> 119 T3254 oascc.ConnectionManager.process Watcher org.apache.solr.common.cloud.ConnectionManager@5df8e8d7 name:ZooKeeperConnection Watcher:127.0.0.1:50258 got event WatchedEvent state:SyncConnected type:None path:null path:null type:None
[junit4:junit4]   2> 120 T3247 oascc.ConnectionManager.waitForConnected Client is connected to ZooKeeper
[junit4:junit4]   2> 121 T3247 oascc.SolrZkClient.makePath makePath: /solr
[junit4:junit4]   2> 123 T3252 oazs.PrepRequestProcessor.pRequest2Txn Processed session termination for sessionid: 0x13c960dd4510000
[junit4:junit4]   2> 125 T3249 oazs.NIOServerCnxn.closeSock Closed socket connection for client /127.0.0.1:50259 which had sessionid 0x13c960dd4510000
[junit4:junit4]   2> 124 T3247 oaz.ZooKeeper.close Session: 0x13c960dd4510000 closed
[junit4:junit4]   2> 125 T3254 oaz.ClientCnxn$EventThread.run EventThread shut down
[junit4:junit4]   2> 126 T3247 oaz.ZooKeeper.<init> Initiating client connection, connectString=127.0.0.1:50258/solr sessionTimeout=10000 watcher=org.apache.solr.common.cloud.ConnectionManager@21e9200
[junit4:junit4]   2> 126 T3247 oascc.ConnectionManager.waitForConnected Waiting for client to connect to ZooKeeper
[junit4:junit4]   2> 127 T3255 oaz.ClientCnxn$SendThread.logStartConnect Opening socket connection to server localhost/127.0.0.1:50258. Will not attempt to authenticate using SASL (access denied ("javax.security.auth.AuthPermission" "getLoginConfiguration"))
[junit4:junit4]   2> 128 T3255 oaz.ClientCnxn$SendThread.primeConnection Socket connection established to localhost/127.0.0.1:50258, initiating session
[junit4:junit4]   2> 128 T3249 oazs.NIOServerCnxnFactory.run Accepted socket connection from /127.0.0.1:50260
[junit4:junit4]   2> 128 T3249 oazs.ZooKeeperServer.processConnectRequest Client attempting to establish new session at /127.0.0.1:50260
[junit4:junit4]   2> 129 T3251 oazs.ZooKeeperServer.finishSessionInit Established session 0x13c960dd4510001 with negotiated timeout 10000 for client /127.0.0.1:50260
[junit4:junit4]   2> 129 T3255 oaz.ClientCnxn$SendThread.onConnected Session establishment complete on server localhost/127.0.0.1:50258, sessionid = 0x13c960dd4510001, negotiated timeout = 10000
[junit4:junit4]   2> 130 T3256 oascc.ConnectionManager.process Watcher org.apache.solr.common.cloud.ConnectionManager@21e9200 name:ZooKeeperConnection Watcher:127.0.0.1:50258/solr got event WatchedEvent state:SyncConnected type:None path:null path:null type:None
[junit4:junit4]   2> 131 T3247 oascc.ConnectionManager.waitForConnected Client is connected to ZooKeeper
[junit4:junit4]   2> 131 T3247 oascc.SolrZkClient.makePath makePath: /collections/collection1
[junit4:junit4]   2> 136 T3247 oascc.SolrZkClient.makePath makePath: /collections/collection1/shards
[junit4:junit4]   2> 140 T3247 oascc.SolrZkClient.makePath makePath: /collections/control_collection
[junit4:junit4]   2> 144 T3247 oascc.SolrZkClient.makePath makePath: /collections/control_collection/shards
[junit4:junit4]   2> 149 T3247 oasc.AbstractZkTestCase.putConfig put /Users/jenkins/jenkins-slave/workspace/Lucene-Solr-trunk-MacOSX/solr/build/solr-core/test-files/solr/collection1/conf/solrconfig.xml to /configs/conf1/solrconfig.xml
[junit4:junit4]   2> 150 T3247 oascc.SolrZkClient.makePath makePath: /configs/conf1/solrconfig.xml
[junit4:junit4]   2> 157 T3247 oasc.AbstractZkTestCase.putConfig put /Users/jenkins/jenkins-slave/workspace/Lucene-Solr-trunk-MacOSX/solr/build/solr-core/test-files/solr/collection1/conf/schema.xml to /configs/conf1/schema.xml
[junit4:junit4]   2> 158 T3247 oascc.SolrZkClient.makePath makePath: /configs/conf1/schema.xml
[junit4:junit4]   2> 163 T3247 oasc.AbstractZkTestCase.putConfig put /Users/jenkins/jenkins-slave/workspace/Lucene-Solr-trunk-MacOSX/solr/build/solr-core/test-files/solr/collection1/conf/stopwords.txt to /configs/conf1/stopwords.txt
[junit4:junit4]   2> 163 T3247 oascc.SolrZkClient.makePath makePath: /configs/conf1/stopwords.txt
[junit4:junit4]   2> 168 T3247 oasc.AbstractZkTestCase.putConfig put /Users/jenkins/jenkins-slave/workspace/Lucene-Solr-trunk-MacOSX/solr/build/solr-core/test-files/solr/collection1/conf/protwords.txt to /configs/conf1/protwords.txt
[junit4:junit4]   2> 169 T3247 oascc.SolrZkClient.makePath makePath: /configs/conf1/protwords.txt
[junit4:junit4]   2> 174 T3247 oasc.AbstractZkTestCase.putConfig put /Users/jenkins/jenkins-slave/workspace/Lucene-Solr-trunk-MacOSX/solr/build/solr-core/test-files/solr/collection1/conf/currency.xml to /configs/conf1/currency.xml
[junit4:junit4]   2> 175 T3247 oascc.SolrZkClient.makePath makePath: /configs/conf1/currency.xml
[junit4:junit4]   2> 179 T3247 oasc.AbstractZkTestCase.putConfig put /Users/jenkins/jenkins-slave/workspace/Lucene-Solr-trunk-MacOSX/solr/build/solr-core/test-files/solr/collection1/conf/open-exchange-rates.json to /configs/conf1/open-exchange-rates.json
[junit4:junit4]   2> 180 T3247 oascc.SolrZkClient.makePath makePath: /configs/conf1/open-exchange-rates.json
[junit4:junit4]   2> 185 T3247 oasc.AbstractZkTestCase.putConfig put /Users/jenkins/jenkins-slave/workspace/Lucene-Solr-trunk-MacOSX/solr/build/solr-core/test-files/solr/collection1/conf/mapping-ISOLatin1Accent.txt to /configs/conf1/mapping-ISOLatin1Accent.txt
[junit4:junit4]   2> 185 T3247 oascc.SolrZkClient.makePath makePath: /configs/conf1/mapping-ISOLatin1Accent.txt
[junit4:junit4]   2> 190 T3247 oasc.AbstractZkTestCase.putConfig put /Users/jenkins/jenkins-slave/workspace/Lucene-Solr-trunk-MacOSX/solr/build/solr-core/test-files/solr/collection1/conf/old_synonyms.txt to /configs/conf1/old_synonyms.txt
[junit4:junit4]   2> 190 T3247 oascc.SolrZkClient.makePath makePath: /configs/conf1/old_synonyms.txt
[junit4:junit4]   2> 195 T3247 oasc.AbstractZkTestCase.putConfig put /Users/jenkins/jenkins-slave/workspace/Lucene-Solr-trunk-MacOSX/solr/build/solr-core/test-files/solr/collection1/conf/synonyms.txt to /configs/conf1/synonyms.txt
[junit4:junit4]   2> 196 T3247 oascc.SolrZkClient.makePath makePath: /configs/conf1/synonyms.txt
[junit4:junit4]   2> 201 T3252 oazs.PrepRequestProcessor.pRequest2Txn Processed session termination for sessionid: 0x13c960dd4510001
[junit4:junit4]   2> 201 T3249 oazs.NIOServerCnxn.closeSock Closed socket connection for client /127.0.0.1:50260 which had sessionid 0x13c960dd4510001
[junit4:junit4]   2> 201 T3247 oaz.ZooKeeper.close Session: 0x13c960dd4510001 closed
[junit4:junit4]   2> 202 T3256 oaz.ClientCnxn$EventThread.run EventThread shut down
[junit4:junit4]   2> 376 T3247 oejs.Server.doStart jetty-8.1.8.v20121106
[junit4:junit4]   2> 382 T3247 oejs.AbstractConnector.doStart Started SelectChannelConnector@127.0.0.1:50261
[junit4:junit4]   2> 383 T3247 oass.SolrDispatchFilter.init SolrDispatchFilter.init()
[junit4:junit4]   2> 383 T3247 oasc.SolrResourceLoader.locateSolrHome JNDI not configured for solr (NoInitialContextEx)
[junit4:junit4]   2> 384 T3247 oasc.SolrResourceLoader.locateSolrHome using system property solr.solr.home: /Users/jenkins/jenkins-slave/workspace/Lucene-Solr-trunk-MacOSX/solr/build/solr-core/test/J0/./org.apache.solr.cloud.BasicDistributedZkTest-controljetty-1359727154444
[junit4:junit4]   2> 385 T3247 oasc.CoreContainer$Initializer.initialize looking for solr.xml: /Users/jenkins/jenkins-slave/workspace/Lucene-Solr-trunk-MacOSX/solr/build/solr-core/test/J0/./org.apache.solr.cloud.BasicDistributedZkTest-controljetty-1359727154444/solr.xml
[junit4:junit4]   2> 385 T3247 oasc.CoreContainer.<init> New CoreContainer 1925207343
[junit4:junit4]   2> 386 T3247 oasc.CoreContainer.load Loading CoreContainer using Solr Home: '/Users/jenkins/jenkins-slave/workspace/Lucene-Solr-trunk-MacOSX/solr/build/solr-core/test/J0/./org.apache.solr.cloud.BasicDistributedZkTest-controljetty-1359727154444/'
[junit4:junit4]   2> 387 T3247 oasc.SolrResourceLoader.<init> new SolrResourceLoader for directory: '/Users/jenkins/jenkins-slave/workspace/Lucene-Solr-trunk-MacOSX/solr/build/solr-core/test/J0/./org.apache.solr.cloud.BasicDistributedZkTest-controljetty-1359727154444/'
[junit4:junit4]   2> 424 T3247 oashc.HttpShardHandlerFactory.getParameter Setting socketTimeout to: 60000
[junit4:junit4]   2> 425 T3247 oashc.HttpShardHandlerFactory.getParameter Setting urlScheme to: http://
[junit4:junit4]   2> 426 T3247 oashc.HttpShardHandlerFactory.getParameter Setting connTimeout to: 15000
[junit4:junit4]   2> 426 T3247 oashc.HttpShardHandlerFactory.getParameter Setting maxConnectionsPerHost to: 20
[junit4:junit4]   2> 427 T3247 oashc.HttpShardHandlerFactory.getParameter Setting corePoolSize to: 0
[junit4:junit4]   2> 427 T3247 oashc.HttpShardHandlerFactory.getParameter Setting maximumPoolSize to: 2147483647
[junit4:junit4]   2> 428 T3247 oashc.HttpShardHandlerFactory.getParameter Setting maxThreadIdleTime to: 5
[junit4:junit4]   2> 428 T3247 oashc.HttpShardHandlerFactory.getParameter Setting sizeOfQueue to: -1
[junit4:junit4]   2> 429 T3247 oashc.HttpShardHandlerFactory.getParameter Setting fairnessPolicy to: false
[junit4:junit4]   2> 429 T3247 oascsi.HttpClientUtil.createClient Creating new http client, config:maxConnectionsPerHost=20&maxConnections=10000&socketTimeout=60000&connTimeout=15000&retry=false
[junit4:junit4]   2> 443 T3247 oasc.CoreContainer.load Registering Log Listener
[junit4:junit4]   2> 463 T3247 oasc.CoreContainer.initZooKeeper Zookeeper client=127.0.0.1:50258/solr
[junit4:junit4]   2> 464 T3247 oasc.ZkController.checkChrootPath zkHost includes chroot
[junit4:junit4]   2> 464 T3247 oaz.ZooKeeper.<init> Initiating client connection, connectString=127.0.0.1:50258 sessionTimeout=60000 watcher=org.apache.solr.common.cloud.ConnectionManager@4f8cbc1b
[junit4:junit4]   2> 466 T3247 oascc.ConnectionManager.waitForConnected Waiting for client to connect to ZooKeeper
[junit4:junit4]   2> 466 T3266 oaz.ClientCnxn$SendThread.logStartConnect Opening socket connection to server localhost/127.0.0.1:50258. Will not attempt to authenticate using SASL (access denied ("javax.security.auth.AuthPermission" "getLoginConfiguration"))
[junit4:junit4]   2> 467 T3266 oaz.ClientCnxn$SendThread.primeConnection Socket connection established to localhost/127.0.0.1:50258, initiating session
[junit4:junit4]   2> 468 T3249 oazs.NIOServerCnxnFactory.run Accepted socket connection from /127.0.0.1:50262
[junit4:junit4]   2> 468 T3249 oazs.ZooKeeperServer.processConnectRequest Client attempting to establish new session at /127.0.0.1:50262
[junit4:junit4]   2> 469 T3251 oazs.ZooKeeperServer.finishSessionInit Established session 0x13c960dd4510002 with negotiated timeout 20000 for client /127.0.0.1:50262
[junit4:junit4]   2> 469 T3266 oaz.ClientCnxn$SendThread.onConnected Session establishment complete on server localhost/127.0.0.1:50258, sessionid = 0x13c960dd4510002, negotiated timeout = 20000
[junit4:junit4]   2> 470 T3267 oascc.ConnectionManager.process Watcher org.apache.solr.common.cloud.ConnectionManager@4f8cbc1b name:ZooKeeperConnection Watcher:127.0.0.1:50258 got event WatchedEvent state:SyncConnected type:None path:null path:null type:None
[junit4:junit4]   2> 470 T3247 oascc.ConnectionManager.waitForConnected Client is connected to ZooKeeper
[junit4:junit4]   2> 473 T3252 oazs.PrepRequestProcessor.pRequest2Txn Processed session termination for sessionid: 0x13c960dd4510002
[junit4:junit4]   2> 474 T3249 oazs.NIOServerCnxn.closeSock Closed socket connection for client /127.0.0.1:50262 which had sessionid 0x13c960dd4510002
[junit4:junit4]   2> 474 T3247 oaz.ZooKeeper.close Session: 0x13c960dd4510002 closed
[junit4:junit4]   2> 474 T3267 oaz.ClientCnxn$EventThread.run EventThread shut down
[junit4:junit4]   2> 475 T3247 oascsi.HttpClientUtil.createClient Creating new http client, config:maxConnections=500&maxConnectionsPerHost=16&socketTimeout=60000&connTimeout=15000
[junit4:junit4]   2> 481 T3247 oaz.ZooKeeper.<init> Initiating client connection, connectString=127.0.0.1:50258/solr sessionTimeout=30000 watcher=org.apache.solr.common.cloud.ConnectionManager@3f13a310
[junit4:junit4]   2> 482 T3247 oascc.ConnectionManager.waitForConnected Waiting for client to connect to ZooKeeper
[junit4:junit4]   2> 483 T3268 oaz.ClientCnxn$SendThread.logStartConnect Opening socket connection to server localhost/127.0.0.1:50258. Will not attempt to authenticate using SASL (access denied ("javax.security.auth.AuthPermission" "getLoginConfiguration"))
[junit4:junit4]   2> 484 T3268 oaz.ClientCnxn$SendThread.primeConnection Socket connection established to localhost/127.0.0.1:50258, initiating session
[junit4:junit4]   2> 484 T3249 oazs.NIOServerCnxnFactory.run Accepted socket connection from /127.0.0.1:50263
[junit4:junit4]   2> 485 T3249 oazs.ZooKeeperServer.processConnectRequest Client attempting to establish new session at /127.0.0.1:50263
[junit4:junit4]   2> 486 T3251 oazs.ZooKeeperServer.finishSessionInit Established session 0x13c960dd4510003 with negotiated timeout 20000 for client /127.0.0.1:50263
[junit4:junit4]   2> 486 T3268 oaz.ClientCnxn$SendThread.onConnected Session establishment complete on server localhost/127.0.0.1:50258, sessionid = 0x13c960dd4510003, negotiated timeout = 20000
[junit4:junit4]   2> 486 T3269 oascc.ConnectionManager.process Watcher org.apache.solr.common.cloud.ConnectionManager@3f13a310 name:ZooKeeperConnection Watcher:127.0.0.1:50258/solr got event WatchedEvent state:SyncConnected type:None path:null path:null type:None
[junit4:junit4]   2> 486 T3247 oascc.ConnectionManager.waitForConnected Client is connected to ZooKeeper
[junit4:junit4]   2> 489 T3252 oazs.PrepRequestProcessor.pRequest Got user-level KeeperException when processing sessionid:0x13c960dd4510003 type:create cxid:0x2 zxid:0x1a txntype:-1 reqpath:n/a Error Path:/solr/overseer Error:KeeperErrorCode = NodeExists for /solr/overseer
[junit4:junit4]   2> 490 T3247 oascc.SolrZkClient.makePath makePath: /live_nodes
[junit4:junit4]   2> 493 T3247 oasc.ZkController.createEphemeralLiveNode Register node as live in ZooKeeper:/live_nodes/127.0.0.1:50261__
[junit4:junit4]   2> 494 T3252 oazs.PrepRequestProcessor.pRequest Got user-level KeeperException when processing sessionid:0x13c960dd4510003 type:delete cxid:0x7 zxid:0x1c txntype:-1 reqpath:n/a Error Path:/solr/live_nodes/127.0.0.1:50261__ Error:KeeperErrorCode = NoNode for /solr/live_nodes/127.0.0.1:50261__
[junit4:junit4]   2> 495 T3247 oascc.SolrZkClient.makePath makePath: /live_nodes/127.0.0.1:50261__
[junit4:junit4]   2> 501 T3247 oascc.SolrZkClient.makePath makePath: /overseer_elect/election
[junit4:junit4]   2> 507 T3252 oazs.PrepRequestProcessor.pRequest Got user-level KeeperException when processing sessionid:0x13c960dd4510003 type:delete cxid:0x15 zxid:0x21 txntype:-1 reqpath:n/a Error Path:/solr/overseer_elect/leader Error:KeeperErrorCode = NoNode for /solr/overseer_elect/leader
[junit4:junit4]   2> 508 T3247 oascc.SolrZkClient.makePath makePath: /overseer_elect/leader
[junit4:junit4]   2> 512 T3247 oasc.Overseer.start Overseer (id=89111078781386755-127.0.0.1:50261__-n_0000000000) starting
[junit4:junit4]   2> 513 T3252 oazs.PrepRequestProcessor.pRequest Got user-level KeeperException when processing sessionid:0x13c960dd4510003 type:create cxid:0x1a zxid:0x23 txntype:-1 reqpath:n/a Error Path:/solr/overseer Error:KeeperErrorCode = NodeExists for /solr/overseer
[junit4:junit4]   2> 514 T3252 oazs.PrepRequestProcessor.pRequest Got user-level KeeperException when processing sessionid:0x13c960dd4510003 type:create cxid:0x1b zxid:0x24 txntype:-1 reqpath:n/a Error Path:/solr/overseer Error:KeeperErrorCode = NodeExists for /solr/overseer
[junit4:junit4]   2> 515 T3252 oazs.PrepRequestProcessor.pRequest Got user-level KeeperException when processing sessionid:0x13c960dd4510003 type:create cxid:0x1c zxid:0x25 txntype:-1 reqpath:n/a Error Path:/solr/overseer Error:KeeperErrorCode = NodeExists for /solr/overseer
[junit4:junit4]   2> 516 T3252 oazs.PrepRequestProcessor.pRequest Got user-level KeeperException when processing sessionid:0x13c960dd4510003 type:create cxid:0x1d zxid:0x26 txntype:-1 reqpath:n/a Error Path:/solr/overseer Error:KeeperErrorCode = NodeExists for /solr/overseer
[junit4:junit4]   2> 518 T3271 oasc.OverseerCollectionProcessor.run Process current queue of collection creations
[junit4:junit4]   2> 518 T3247 oascc.SolrZkClient.makePath makePath: /clusterstate.json
[junit4:junit4]   2> 522 T3247 oascc.ZkStateReader.createClusterStateWatchersAndUpdate Updating cluster state from ZooKeeper... 
[junit4:junit4]   2> 525 T3270 oasc.Overseer$ClusterStateUpdater.run Starting to work on the main queue
[junit4:junit4]   2> 528 T3272 oasc.CoreContainer.create Creating SolrCore 'collection1' using instanceDir: /Users/jenkins/jenkins-slave/workspace/Lucene-Solr-trunk-MacOSX/solr/build/solr-core/test/J0/./org.apache.solr.cloud.BasicDistributedZkTest-controljetty-1359727154444/collection1
[junit4:junit4]   2> 528 T3272 oasc.ZkController.createCollectionZkNode Check for collection zkNode:control_collection
[junit4:junit4]   2> 529 T3272 oasc.ZkController.createCollectionZkNode Collection zkNode exists
[junit4:junit4]   2> 529 T3272 oasc.ZkController.readConfigName Load collection config from:/collections/control_collection
[junit4:junit4]   2> 531 T3272 oasc.SolrResourceLoader.<init> new SolrResourceLoader for directory: '/Users/jenkins/jenkins-slave/workspace/Lucene-Solr-trunk-MacOSX/solr/build/solr-core/test/J0/./org.apache.solr.cloud.BasicDistributedZkTest-controljetty-1359727154444/collection1/'
[junit4:junit4]   2> 532 T3272 oasc.SolrResourceLoader.replaceClassLoader Adding 'file:/Users/jenkins/jenkins-slave/workspace/Lucene-Solr-trunk-MacOSX/solr/build/solr-core/test/J0/org.apache.solr.cloud.BasicDistributedZkTest-controljetty-1359727154444/collection1/lib/classes/' to classloader
[junit4:junit4]   2> 533 T3272 oasc.SolrResourceLoader.replaceClassLoader Adding 'file:/Users/jenkins/jenkins-slave/workspace/Lucene-Solr-trunk-MacOSX/solr/build/solr-core/test/J0/org.apache.solr.cloud.BasicDistributedZkTest-controljetty-1359727154444/collection1/lib/README' to classloader
[junit4:junit4]   2> 582 T3272 oasc.SolrConfig.<init> Using Lucene MatchVersion: LUCENE_50
[junit4:junit4]   2> 653 T3272 oasc.SolrConfig.<init> Loaded SolrConfig: solrconfig.xml
[junit4:junit4]   2> 656 T3272 oass.IndexSchema.readSchema Reading Solr Schema
[junit4:junit4]   2> 664 T3272 oass.IndexSchema.readSchema Schema name=test
[junit4:junit4]   2> 1313 T3272 oass.OpenExchangeRatesOrgProvider.init Initialized with rates=open-exchange-rates.json, refreshInterval=1440.
[junit4:junit4]   2> 1322 T3272 oass.IndexSchema.readSchema default search field in schema is text
[junit4:junit4]   2> 1327 T3272 oass.IndexSchema.readSchema unique key field: id
[junit4:junit4]   2> 1348 T3272 oass.FileExchangeRateProvider.reload Reloading exchange rates from file currency.xml
[junit4:junit4]   2> 1354 T3272 oass.FileExchangeRateProvider.reload Reloading exchange rates from file currency.xml
[junit4:junit4]   2> 1359 T3272 oass.OpenExchangeRatesOrgProvider.reload Reloading exchange rates from open-exchange-rates.json
[junit4:junit4]   2> 1361 T3272 oass.OpenExchangeRatesOrgProvider.reload Reloading exchange rates from open-exchange-rates.json
[junit4:junit4]   2> 1363 T3272 oasc.SolrCore.<init> [collection1] Opening new SolrCore at /Users/jenkins/jenkins-slave/workspace/Lucene-Solr-trunk-MacOSX/solr/build/solr-core/test/J0/./org.apache.solr.cloud.BasicDistributedZkTest-controljetty-1359727154444/collection1/, dataDir=./org.apache.solr.cloud.BasicDistributedZkTest-1359727154250/control/data/
[junit4:junit4]   2> 1364 T3272 oasc.JmxMonitoredMap.<init> JMX monitoring is enabled. Adding Solr mbeans to JMX Server: com.sun.jmx.mbeanserver.JmxMBeanServer@3a0ac259
[junit4:junit4]   2> 1364 T3272 oasc.SolrCore.initDirectoryFactory solr.NRTCachingDirectoryFactory
[junit4:junit4]   2> 1365 T3272 oasc.CachingDirectoryFactory.get return new directory for /Users/jenkins/jenkins-slave/workspace/Lucene-Solr-trunk-MacOSX/solr/build/solr-core/test/J0/./org.apache.solr.cloud.BasicDistributedZkTest-1359727154250/control/data forceNew:false
[junit4:junit4]   2> 1366 T3272 oasc.CachingDirectoryFactory.close Releasing directory:/Users/jenkins/jenkins-slave/workspace/Lucene-Solr-trunk-MacOSX/solr/build/solr-core/test/J0/./org.apache.solr.cloud.BasicDistributedZkTest-1359727154250/control/data
[junit4:junit4]   2> 1366 T3272 oasc.SolrCore.getNewIndexDir New index directory detected: old=null new=./org.apache.solr.cloud.BasicDistributedZkTest-1359727154250/control/data/index/
[junit4:junit4]   2> 1366 T3272 oasc.SolrCore.initIndex WARNING [collection1] Solr index directory './org.apache.solr.cloud.BasicDistributedZkTest-1359727154250/control/data/index' doesn't exist. Creating new index...
[junit4:junit4]   2> 1368 T3272 oasc.CachingDirectoryFactory.get return new directory for /Users/jenkins/jenkins-slave/workspace/Lucene-Solr-trunk-MacOSX/solr/build/solr-core/test/J0/./org.apache.solr.cloud.BasicDistributedZkTest-1359727154250/control/data/index forceNew:false
[junit4:junit4]   2> 1373 T3272 oasc.SolrDeletionPolicy.onCommit SolrDeletionPolicy.onCommit: commits:num=1
[junit4:junit4]   2> 		commit{dir=RateLimitedDirectoryWrapper(NRTCachingDirectory(org.apache.lucene.store.NIOFSDirectory@/Users/jenkins/jenkins-slave/workspace/Lucene-Solr-trunk-MacOSX/solr/build/solr-core/test/J0/org.apache.solr.cloud.BasicDistributedZkTest-1359727154250/control/data/index lockFactory=org.apache.lucene.store.NativeFSLockFactory@435daf21; maxCacheMB=48.0 maxMergeSizeMB=4.0)),segFN=segments_1,generation=1,filenames=[segments_1]
[junit4:junit4]   2> 1374 T3272 oasc.SolrDeletionPolicy.updateCommits newest commit = 1[segments_1]
[junit4:junit4]   2> 1375 T3272 oasc.CachingDirectoryFactory.close Releasing directory:/Users/jenkins/jenkins-slave/workspace/Lucene-Solr-trunk-MacOSX/solr/build/solr-core/test/J0/./org.apache.solr.cloud.BasicDistributedZkTest-1359727154250/control/data/index
[junit4:junit4]   2> 1375 T3272 oasc.SolrCore.initWriters created xml: solr.XMLResponseWriter
[junit4:junit4]   2> 1377 T3272 oasup.UpdateRequestProcessorChain.init inserting DistributedUpdateProcessorFactory into updateRequestProcessorChain "dedupe"
[junit4:junit4]   2> 1378 T3272 oasup.UpdateRequestProcessorChain.init inserting DistributedUpdateProcessorFactory into updateRequestProcessorChain "dedupe-allfields"
[junit4:junit4]   2> 1378 T3272 oasup.UpdateRequestProcessorChain.init inserting DistributedUpdateProcessorFactory into updateRequestProcessorChain "stored_sig"
[junit4:junit4]   2> 1379 T3272 oasup.UpdateRequestProcessorChain.init inserting DistributedUpdateProcessorFactory into updateRequestProcessorChain "uniq-fields"
[junit4:junit4]   2> 1380 T3272 oasup.UpdateRequestProcessorChain.init inserting DistributedUpdateProcessorFactory into updateRequestProcessorChain "distrib-dup-test-chain-implicit"
[junit4:junit4]   2> 1380 T3272 oasc.RequestHandlers.initHandlersFromConfig adding lazy requestHandler: solr.ReplicationHandler
[junit4:junit4]   2> 1380 T3272 oasc.RequestHandlers.initHandlersFromConfig created /replication: solr.ReplicationHandler
[junit4:junit4]   2> 1381 T3272 oasc.RequestHandlers.initHandlersFromConfig created standard: solr.StandardRequestHandler
[junit4:junit4]   2> 1382 T3272 oasc.RequestHandlers.initHandlersFromConfig created /get: solr.RealTimeGetHandler
[junit4:junit4]   2> 1382 T3272 oasc.RequestHandlers.initHandlersFromConfig created dismax: solr.SearchHandler
[junit4:junit4]   2> 1383 T3272 oasc.RequestHandlers.initHandlersFromConfig created mock: org.apache.solr.core.MockQuerySenderListenerReqHandler
[junit4:junit4]   2> 1383 T3272 oasc.RequestHandlers.initHandlersFromConfig created /admin/: org.apache.solr.handler.admin.AdminHandlers
[junit4:junit4]   2> 1384 T3272 oasc.RequestHandlers.initHandlersFromConfig created defaults: solr.StandardRequestHandler
[junit4:junit4]   2> 1384 T3272 oasc.RequestHandlers.initHandlersFromConfig adding lazy requestHandler: solr.StandardRequestHandler
[junit4:junit4]   2> 1385 T3272 oasc.RequestHandlers.initHandlersFromConfig created lazy: solr.StandardRequestHandler
[junit4:junit4]   2> 1385 T3272 oasc.RequestHandlers.initHandlersFromConfig created /update: solr.UpdateRequestHandler
[junit4:junit4]   2> 1386 T3272 oasc.RequestHandlers.initHandlersFromConfig created /terms: org.apache.solr.handler.component.SearchHandler
[junit4:junit4]   2> 1386 T3272 oasc.RequestHandlers.initHandlersFromConfig created spellCheckCompRH: org.apache.solr.handler.component.SearchHandler
[junit4:junit4]   2> 1387 T3272 oasc.RequestHandlers.initHandlersFromConfig created spellCheckCompRH_Direct: org.apache.solr.handler.component.SearchHandler
[junit4:junit4]   2> 1387 T3272 oasc.RequestHandlers.initHandlersFromConfig created spellCheckWithWordbreak: org.apache.solr.handler.component.SearchHandler
[junit4:junit4]   2> 1388 T3272 oasc.RequestHandlers.initHandlersFromConfig created spellCheckWithWordbreak_Direct: org.apache.solr.handler.component.SearchHandler
[junit4:junit4]   2> 1388 T3272 oasc.RequestHandlers.initHandlersFromConfig created spellCheckCompRH1: org.apache.solr.handler.component.SearchHandler
[junit4:junit4]   2> 1389 T3272 oasc.RequestHandlers.initHandlersFromConfig created mltrh: org.apache.solr.handler.component.SearchHandler
[junit4:junit4]   2> 1389 T3272 oasc.RequestHandlers.initHandlersFromConfig created tvrh: org.apache.solr.handler.component.SearchHandler
[junit4:junit4]   2> 1390 T3272 oasc.RequestHandlers.initHandlersFromConfig created /mlt: solr.MoreLikeThisHandler
[junit4:junit4]   2> 1390 T3272 oasc.RequestHandlers.initHandlersFromConfig created /debug/dump: solr.DumpRequestHandler
[junit4:junit4]   2> 1399 T3272 oashl.XMLLoader.init xsltCacheLifetimeSeconds=60
[junit4:junit4]   2> 1402 T3272 oasc.SolrCore.initDeprecatedSupport WARNING solrconfig.xml uses deprecated <admin/gettableFiles>, Please update your config to use the ShowFileRequestHandler.
[junit4:junit4]   2> 1404 T3272 oasc.SolrCore.initDeprecatedSupport WARNING adding ShowFileRequestHandler with hidden files: [SCHEMA.XML, OLD_SYNONYMS.TXT, STOPWORDS.TXT, PROTWORDS.TXT, OPEN-EXCHANGE-RATES.JSON, SYNONYMS.TXT, CURRENCY.XML, MAPPING-ISOLATIN1ACCENT.TXT]
[junit4:junit4]   2> 1407 T3272 oasc.CachingDirectoryFactory.close Releasing directory:/Users/jenkins/jenkins-slave/workspace/Lucene-Solr-trunk-MacOSX/solr/build/solr-core/test/J0/./org.apache.solr.cloud.BasicDistributedZkTest-1359727154250/control/data
[junit4:junit4]   2> 1408 T3272 oass.SolrIndexSearcher.<init> Opening Searcher@12fed324 main
[junit4:junit4]   2> 1410 T3272 oasu.CommitTracker.<init> Hard AutoCommit: disabled
[junit4:junit4]   2> 1410 T3272 oasu.CommitTracker.<init> Soft AutoCommit: disabled
[junit4:junit4]   2> 1410 T3272 oashc.SpellCheckComponent.inform Initializing spell checkers
[junit4:junit4]   2> 1417 T3272 oass.DirectSolrSpellChecker.init init: {name=direct,classname=DirectSolrSpellChecker,field=lowerfilt,minQueryLength=3}
[junit4:junit4]   2> 1453 T3273 oasc.SolrCore.registerSearcher [collection1] Registered new searcher Searcher@12fed324 main{StandardDirectoryReader(segments_1:1)}
[junit4:junit4]   2> 1457 T3272 oasc.ZkController.publish publishing core=collection1 state=down
[junit4:junit4]   2> 1458 T3272 oasc.ZkController.publish numShards not found on descriptor - reading it from system property
[junit4:junit4]   2> 1459 T3252 oazs.PrepRequestProcessor.pRequest Got user-level KeeperException when processing sessionid:0x13c960dd4510003 type:create cxid:0x50 zxid:0x29 txntype:-1 reqpath:n/a Error Path:/solr/overseer/queue Error:KeeperErrorCode = NoNode for /solr/overseer/queue
[junit4:junit4]   2> 2033 T3270 oascc.ZkStateReader.updateClusterState Updating cloud state from ZooKeeper... 
[junit4:junit4]   2> 2035 T3270 oasc.Overseer$ClusterStateUpdater.updateState Update state numShards=1 message={
[junit4:junit4]   2> 	  "operation":"state",
[junit4:junit4]   2> 	  "numShards":"1",
[junit4:junit4]   2> 	  "shard":null,
[junit4:junit4]   2> 	  "roles":null,
[junit4:junit4]   2> 	  "state":"down",
[junit4:junit4]   2> 	  "core":"collection1",
[junit4:junit4]   2> 	  "collection":"control_collection",
[junit4:junit4]   2> 	  "node_name":"127.0.0.1:50261__",
[junit4:junit4]   2> 	  "base_url":"http://127.0.0.1:50261/_"}
[junit4:junit4]   2> 2035 T3270 oasc.Overseer$ClusterStateUpdater.createCollection Create collection control_collection with numShards 1
[junit4:junit4]   2> 2036 T3270 oasc.Overseer$ClusterStateUpdater.updateState Assigning new node to shard shard=shard1
[junit4:junit4]   2> 2037 T3252 oazs.PrepRequestProcessor.pRequest Got user-level KeeperException when processing sessionid:0x13c960dd4510003 type:create cxid:0x58 zxid:0x2c txntype:-1 reqpath:n/a Error Path:/solr/overseer/queue-work Error:KeeperErrorCode = NoNode for /solr/overseer/queue-work
[junit4:junit4]   2> 2047 T3269 oascc.ZkStateReader$2.process A cluster state change: WatchedEvent state:SyncConnected type:NodeDataChanged path:/clusterstate.json, has occurred - updating... (live nodes size: 1)
[junit4:junit4]   2> 2464 T3272 oasc.CoreContainer.registerCore registering core: collection1
[junit4:junit4]   2> 2465 T3272 oasc.ZkController.register Register replica - core:collection1 address:http://127.0.0.1:50261/_ collection:control_collection shard:shard1
[junit4:junit4]   2> 2467 T3272 oascc.SolrZkClient.makePath makePath: /collections/control_collection/leader_elect/shard1/election
[junit4:junit4]   2> 2491 T3252 oazs.PrepRequestProcessor.pRequest Got user-level KeeperException when processing sessionid:0x13c960dd4510003 type:delete cxid:0x72 zxid:0x36 txntype:-1 reqpath:n/a Error Path:/solr/collections/control_collection/leaders Error:KeeperErrorCode = NoNode for /solr/collections/control_collection/leaders
[junit4:junit4]   2> 2493 T3272 oasc.ShardLeaderElectionContext.runLeaderProcess Running the leader process.
[junit4:junit4]   2> 2495 T3252 oazs.PrepRequestProcessor.pRequest Got user-level KeeperException when processing sessionid:0x13c960dd4510003 type:create cxid:0x73 zxid:0x37 txntype:-1 reqpath:n/a Error Path:/solr/overseer Error:KeeperErrorCode = NodeExists for /solr/overseer
[junit4:junit4]   2> 2501 T3272 oasc.ShardLeaderElectionContext.waitForReplicasToComeUp Enough replicas found to continue.
[junit4:junit4]   2> 2502 T3272 oasc.ShardLeaderElectionContext.runLeaderProcess I may be the new leader - try and sync
[junit4:junit4]   2> 2503 T3272 oasc.SyncStrategy.sync Sync replicas to http://127.0.0.1:50261/_/collection1/
[junit4:junit4]   2> 2504 T3272 oasc.SyncStrategy.syncReplicas Sync Success - now sync replicas to me
[junit4:junit4]   2> 2504 T3272 oasc.SyncStrategy.syncToMe http://127.0.0.1:50261/_/collection1/ has no replicas
[junit4:junit4]   2> 2505 T3272 oasc.ShardLeaderElectionContext.runLeaderProcess I am the new leader: http://127.0.0.1:50261/_/collection1/
[junit4:junit4]   2> 2506 T3272 oascc.SolrZkClient.makePath makePath: /collections/control_collection/leaders/shard1
[junit4:junit4]   2> 2521 T3252 oazs.PrepRequestProcessor.pRequest Got user-level KeeperException when processing sessionid:0x13c960dd4510003 type:create cxid:0x7d zxid:0x3b txntype:-1 reqpath:n/a Error Path:/solr/overseer Error:KeeperErrorCode = NodeExists for /solr/overseer
[junit4:junit4]   2> 3558 T3270 oascc.ZkStateReader.updateClusterState Updating cloud state from ZooKeeper... 
[junit4:junit4]   2> 3573 T3269 oascc.ZkStateReader$2.process A cluster state change: WatchedEvent state:SyncConnected type:NodeDataChanged path:/clusterstate.json, has occurred - updating... (live nodes size: 1)
[junit4:junit4]   2> 3610 T3272 oasc.ZkController.register We are http://127.0.0.1:50261/_/collection1/ and leader is http://127.0.0.1:50261/_/collection1/
[junit4:junit4]   2> 3610 T3272 oasc.ZkController.register No LogReplay needed for core=collection1 baseURL=http://127.0.0.1:50261/_
[junit4:junit4]   2> 3611 T3272 oasc.ZkController.checkRecovery I am the leader, no recovery necessary
[junit4:junit4]   2> 3611 T3272 oasc.ZkController.publish publishing core=collection1 state=active
[junit4:junit4]   2> 3611 T3272 oasc.ZkController.publish numShards not found on descriptor - reading it from system property
[junit4:junit4]   2> 3614 T3272 oascc.ZkStateReader.updateClusterState Updating cloud state from ZooKeeper... 
[junit4:junit4]   2> 3616 T3247 oass.SolrDispatchFilter.init user.dir=/Users/jenkins/jenkins-slave/workspace/Lucene-Solr-trunk-MacOSX/solr/build/solr-core/test/J0
[junit4:junit4]   2> 3616 T3247 oass.SolrDispatchFilter.init SolrDispatchFilter.init() done
[junit4:junit4]   2> 3617 T3247 oascsi.HttpClientUtil.createClient Creating new http client, config:maxConnections=128&maxConnectionsPerHost=32&followRedirects=false
[junit4:junit4]   2> 3623 T3247 oascsi.HttpClientUtil.createClient Creating new http client, config:
[junit4:junit4]   2> 3628 T3247 oaz.ZooKeeper.<init> Initiating client connection, connectString=127.0.0.1:50258/solr sessionTimeout=10000 watcher=org.apache.solr.common.cloud.ConnectionManager@123e2a12
[junit4:junit4]   2> 3629 T3247 oascc.ConnectionManager.waitForConnected Waiting for client to connect to ZooKeeper
[junit4:junit4]   2> 3630 T3274 oaz.ClientCnxn$SendThread.logStartConnect Opening socket connection to server localhost/127.0.0.1:50258. Will not attempt to authenticate using SASL (access denied ("javax.security.auth.AuthPermission" "getLoginConfiguration"))
[junit4:junit4]   2> 3630 T3274 oaz.ClientCnxn$SendThread.primeConnection Socket connection established to localhost/127.0.0.1:50258, initiating session
[junit4:junit4]   2> 3631 T3249 oazs.NIOServerCnxnFactory.run Accepted socket connection from /127.0.0.1:50264
[junit4:junit4]   2> 3631 T3249 oazs.ZooKeeperServer.processConnectRequest Client attempting to establish new session at /127.0.0.1:50264
[junit4:junit4]   2> 3633 T3251 oazs.ZooKeeperServer.finishSessionInit Established session 0x13c960dd4510004 with negotiated timeout 10000 for client /127.0.0.1:50264
[junit4:junit4]   2> 3633 T3274 oaz.ClientCnxn$SendThread.onConnected Session establishment complete on server localhost/127.0.0.1:50258, sessionid = 0x13c960dd4510004, negotiated timeout = 10000
[junit4:junit4]   2> 3633 T3275 oascc.ConnectionManager.process Watcher org.apache.solr.common.cloud.ConnectionManager@123e2a12 name:ZooKeeperConnection Watcher:127.0.0.1:50258/solr got event WatchedEvent state:SyncConnected type:None path:null path:null type:None
[junit4:junit4]   2> 3634 T3247 oascc.ConnectionManager.waitForConnected Client is connected to ZooKeeper
[junit4:junit4]   2> 3635 T3247 oascc.ZkStateReader.createClusterStateWatchersAndUpdate Updating cluster state from ZooKeeper... 
[junit4:junit4]   2> 3638 T3247 oasc.ChaosMonkey.monkeyLog monkey: init - expire sessions:true cause connection loss:true
[junit4:junit4]   2> 3823 T3247 oejs.Server.doStart jetty-8.1.8.v20121106
[junit4:junit4]   2> 3828 T3247 oejs.AbstractConnector.doStart Started SelectChannelConnector@127.0.0.1:50265
[junit4:junit4]   2> 3829 T3247 oass.SolrDispatchFilter.init SolrDispatchFilter.init()
[junit4:junit4]   2> 3829 T3247 oasc.SolrResourceLoader.locateSolrHome JNDI not configured for solr (NoInitialContextEx)
[junit4:junit4]   2> 3830 T3247 oasc.SolrResourceLoader.locateSolrHome using system property solr.solr.home: /Users/jenkins/jenkins-slave/workspace/Lucene-Solr-trunk-MacOSX/solr/build/solr-core/test/J0/./org.apache.solr.cloud.BasicDistributedZkTest-jetty1-1359727157881
[junit4:junit4]   2> 3830 T3247 oasc.CoreContainer$Initializer.initialize looking for solr.xml: /Users/jenkins/jenkins-slave/workspace/Lucene-Solr-trunk-MacOSX/solr/build/solr-core/test/J0/./org.apache.solr.cloud.BasicDistributedZkTest-jetty1-1359727157881/solr.xml
[junit4:junit4]   2> 3831 T3247 oasc.CoreContainer.<init> New CoreContainer 2092425966
[junit4:junit4]   2> 3832 T3247 oasc.CoreContainer.load Loading CoreContainer using Solr Home: '/Users/jenkins/jenkins-slave/workspace/Lucene-Solr-trunk-MacOSX/solr/build/solr-core/test/J0/./org.apache.solr.cloud.BasicDistributedZkTest-jetty1-1359727157881/'
[junit4:junit4]   2> 3833 T3247 oasc.SolrResourceLoader.<init> new SolrResourceLoader for directory: '/Users/jenkins/jenkins-slave/workspace/Lucene-Solr-trunk-MacOSX/solr/build/solr-core/test/J0/./org.apache.solr.cloud.BasicDistributedZkTest-jetty1-1359727157881/'
[junit4:junit4]   2> 3870 T3247 oashc.HttpShardHandlerFactory.getParameter Setting socketTimeout to: 60000
[junit4:junit4]   2> 3871 T3247 oashc.HttpShardHandlerFactory.getParameter Setting urlScheme to: http://
[junit4:junit4]   2> 3872 T3247 oashc.HttpShardHandlerFactory.getParameter Setting connTimeout to: 15000
[junit4:junit4]   2> 3873 T3247 oashc.HttpShardHandlerFactory.getParameter Setting maxConnectionsPerHost to: 20
[junit4:junit4]   2> 3874 T3247 oashc.HttpShardHandlerFactory.getParameter Setting corePoolSize to: 0
[junit4:junit4]   2> 3875 T3247 oashc.HttpShardHandlerFactory.getParameter Setting maximumPoolSize to: 2147483647
[junit4:junit4]   2> 3876 T3247 oashc.HttpShardHandlerFactory.getParameter Setting maxThreadIdleTime to: 5
[junit4:junit4]   2> 3877 T3247 oashc.HttpShardHandlerFactory.getParameter Setting sizeOfQueue to: -1
[junit4:junit4]   2> 3877 T3247 oashc.HttpShardHandlerFactory.getParameter Setting fairnessPolicy to: false
[junit4:junit4]   2> 3878 T3247 oascsi.HttpClientUtil.createClient Creating new http client, config:maxConnectionsPerHost=20&maxConnections=10000&socketTimeout=60000&connTimeout=15000&retry=false
[junit4:junit4]   2> 3897 T3247 oasc.CoreContainer.load Registering Log Listener
[junit4:junit4]   2> 3919 T3247 oasc.CoreContainer.initZooKeeper Zookeeper client=127.0.0.1:50258/solr
[junit4:junit4]   2> 3920 T3247 oasc.ZkController.checkChrootPath zkHost includes chroot
[junit4:junit4]   2> 3920 T3247 oaz.ZooKeeper.<init> Initiating client connection, connectString=127.0.0.1:50258 sessionTimeout=60000 watcher=org.apache.solr.common.cloud.ConnectionManager@5c12493a
[junit4:junit4]   2> 3922 T3247 oascc.ConnectionManager.waitForConnected Waiting for client to connect to ZooKeeper
[junit4:junit4]   2> 3923 T3285 oaz.ClientCnxn$SendThread.logStartConnect Opening socket connection to server localhost/127.0.0.1:50258. Will not attempt to authenticate using SASL (access denied ("javax.security.auth.AuthPermission" "getLoginConfiguration"))
[junit4:junit4]   2> 3924 T3285 oaz.ClientCnxn$SendThread.primeConnection Socket connection established to localhost/127.0.0.1:50258, initiating session
[junit4:junit4]   2> 3925 T3249 oazs.NIOServerCnxnFactory.run Accepted socket connection from /127.0.0.1:50266
[junit4:junit4]   2> 3926 T3249 oazs.ZooKeeperServer.processConnectRequest Client attempting to establish new session at /127.0.0.1:50266
[junit4:junit4]   2> 4953 T3251 oazsp.FileTxnLog.commit WARNING fsync-ing the write ahead log in SyncThread:0 took 1026ms which will adversely effect operation latency. See the ZooKeeper troubleshooting guide
[junit4:junit4]   2> 4955 T3251 oazs.ZooKeeperServer.finishSessionInit Established session 0x13c960dd4510005 with negotiated timeout 20000 for client /127.0.0.1:50266
[junit4:junit4]   2> 4955 T3285 oaz.ClientCnxn$SendThread.onConnected Session establishment complete on server localhost/127.0.0.1:50258, sessionid = 0x13c960dd4510005, negotiated timeout = 20000
[junit4:junit4]   2> 4956 T3286 oascc.ConnectionManager.process Watcher org.apache.solr.common.cloud.ConnectionManager@5c12493a name:ZooKeeperConnection Watcher:127.0.0.1:50258 got event WatchedEvent state:SyncConnected type:None path:null path:null type:None
[junit4:junit4]   2> 4957 T3247 oascc.ConnectionManager.waitForConnected Client is connected to ZooKeeper
[junit4:junit4]   2> 4960 T3252 oazs.PrepRequestProcessor.pRequest2Txn Processed session termination for sessionid: 0x13c960dd4510005
[junit4:junit4]   2> 4962 T3249 oazs.NIOServerCnxn.closeSock Closed socket connection for client /127.0.0.1:50266 which had sessionid 0x13c960dd4510005
[junit4:junit4]   2> 4962 T3286 oaz.ClientCnxn$EventThread.run EventThread shut down
[junit4:junit4]   2> 4962 T3247 oaz.ZooKeeper.close Session: 0x13c960dd4510005 closed
[junit4:junit4]   2> 4964 T3247 oascsi.HttpClientUtil.createClient Creating new http client, config:maxConnections=500&maxConnectionsPerHost=16&socketTimeout=60000&connTimeout=15000
[junit4:junit4]   2> 4972 T3247 oaz.ZooKeeper.<init> Initiating client connection, connectString=127.0.0.1:50258/solr sessionTimeout=30000 watcher=org.apache.solr.common.cloud.ConnectionManager@7726b320
[junit4:junit4]   2> 4974 T3287 oaz.ClientCnxn$SendThread.logStartConnect Opening socket connection to server localhost/127.0.0.1:50258. Will not attempt to authenticate using SASL (access denied ("javax.security.auth.AuthPermission" "getLoginConfiguration"))
[junit4:junit4]   2> 4974 T3247 oascc.ConnectionManager.waitForConnected Waiting for client to connect to ZooKeeper
[junit4:junit4]   2> 4976 T3287 oaz.ClientCnxn$SendThread.primeConnection Socket connection established to localhost/127.0.0.1:50258, initiating session
[junit4:junit4]   2> 4977 T3249 oazs.NIOServerCnxnFactory.run Accepted socket connection from /127.0.0.1:50267
[junit4:junit4]   2> 4978 T3249 oazs.ZooKeeperServer.processConnectRequest Client attempting to establish new session at /127.0.0.1:50267
[junit4:junit4]   2> 4979 T3251 oazs.ZooKeeperServer.finishSessionInit Established session 0x13c960dd4510006 with negotiated timeout 20000 for client /127.0.0.1:50267
[junit4:junit4]   2> 4980 T3287 oaz.ClientCnxn$SendThread.onConnected Session establishment complete on server localhost/127.0.0.1:50258, sessionid = 0x13c960dd4510006, negotiated timeout = 20000
[junit4:junit4]   2> 4981 T3288 oascc.ConnectionManager.process Watcher org.apache.solr.common.cloud.ConnectionManager@7726b320 name:ZooKeeperConnection Watcher:127.0.0.1:50258/solr got event WatchedEvent state:SyncConnected type:None path:null path:null type:None
[junit4:junit4]   2> 4981 T3247 oascc.ConnectionManager.waitForConnected Client is connected to ZooKeeper
[junit4:junit4]   2> 4983 T3252 oazs.PrepRequestProcessor.pRequest Got user-level KeeperException when processing sessionid:0x13c960dd4510006 type:create cxid:0x1 zxid:0x49 txntype:-1 reqpath:n/a Error Path:/solr/overseer Error:KeeperErrorCode = NodeExists for /solr/overseer
[junit4:junit4]   2> 4985 T3252 oazs.PrepRequestProcessor.pRequest Got user-level KeeperException when processing sessionid:0x13c960dd4510006 type:create cxid:0x2 zxid:0x4a txntype:-1 reqpath:n/a Error Path:/solr/overseer Error:KeeperErrorCode = NodeExists for /solr/overseer
[junit4:junit4]   2> 4988 T3247 oasc.ZkController.createEphemeralLiveNode Register node as live in ZooKeeper:/live_nodes/127.0.0.1:50265__
[junit4:junit4]   2> 4989 T3252 oazs.PrepRequestProcessor.pRequest Got user-level KeeperException when processing sessionid:0x13c960dd4510006 type:delete cxid:0x4 zxid:0x4b txntype:-1 reqpath:n/a Error Path:/solr/live_nodes/127.0.0.1:50265__ Error:KeeperErrorCode = NoNode for /solr/live_nodes/127.0.0.1:50265__
[junit4:junit4]   2> 4991 T3247 oascc.SolrZkClient.makePath makePath: /live_nodes/127.0.0.1:50265__
[junit4:junit4]   2> 4996 T3269 oascc.ZkStateReader$3.process Updating live nodes... (2)
[junit4:junit4]   2> 4996 T3275 oascc.ZkStateReader$3.process Updating live nodes... (2)
[junit4:junit4]   2> 4996 T3269 oascc.ZkStateReader$2.process A cluster state change: WatchedEvent state:SyncConnected type:NodeChildrenChanged path:/live_nodes, has occurred - updating... (live nodes size: 2)
[junit4:junit4]   2> 5004 T3247 oascc.ZkStateReader.createClusterStateWatchersAndUpdate Updating cluster state from ZooKeeper... 
[junit4:junit4]   2> 5011 T3289 oasc.CoreContainer.create Creating SolrCore 'collection1' using instanceDir: /Users/jenkins/jenkins-slave/workspace/Lucene-Solr-trunk-MacOSX/solr/build/solr-core/test/J0/./org.apache.solr.cloud.BasicDistributedZkTest-jetty1-1359727157881/collection1
[junit4:junit4]   2> 5011 T3289 oasc.ZkController.createCollectionZkNode Check for collection zkNode:collection1
[junit4:junit4]   2> 5012 T3289 oasc.ZkController.createCollectionZkNode Collection zkNode exists
[junit4:junit4]   2> 5012 T3289 oasc.ZkController.readConfigName Load collection config from:/collections/collection1
[junit4:junit4]   2> 5014 T3289 oasc.SolrResourceLoader.<init> new SolrResourceLoader for directory: '/Users/jenkins/jenkins-slave/workspace/Lucene-Solr-trunk-MacOSX/solr/build/solr-core/test/J0/./org.apache.solr.cloud.BasicDistributedZkTest-jetty1-1359727157881/collection1/'
[junit4:junit4]   2> 5015 T3289 oasc.SolrResourceLoader.replaceClassLoader Adding 'file:/Users/jenkins/jenkins-slave/workspace/Lucene-Solr-trunk-MacOSX/solr/build/solr-core/test/J0/org.apache.solr.cloud.BasicDistributedZkTest-jetty1-1359727157881/collection1/lib/classes/' to classloader
[junit4:junit4]   2> 5015 T3289 oasc.SolrResourceLoader.replaceClassLoader Adding 'file:/Users/jenkins/jenkins-slave/workspace/Lucene-Solr-trunk-MacOSX/solr/build/solr-core/test/J0/org.apache.solr.cloud.BasicDistributedZkTest-jetty1-1359727157881/collection1/lib/README' to classloader
[junit4:junit4]   2> 5061 T3289 oasc.SolrConfig.<init> Using Lucene MatchVersion: LUCENE_50
[junit4:junit4]   2> 5082 T3270 oascc.ZkStateReader.updateClusterState Updating cloud state from ZooKeeper... 
[junit4:junit4]   2> 5083 T3270 oasc.Overseer$ClusterStateUpdater.updateState Update state numShards=1 message={
[junit4:junit4]   2> 	  "operation":"state",
[junit4:junit4]   2> 	  "numShards":"1",
[junit4:junit4]   2> 	  "shard":"shard1",
[junit4:junit4]   2> 	  "roles":null,
[junit4:junit4]   2> 	  "state":"active",
[junit4:junit4]   2> 	  "core":"collection1",
[junit4:junit4]   2> 	  "collection":"control_collection",
[junit4:junit4]   2> 	  "node_name":"127.0.0.1:50261__",
[junit4:junit4]   2> 	  "base_url":"http://127.0.0.1:50261/_"}
[junit4:junit4]   2> 5088 T3269 oascc.ZkStateReader$2.process A cluster state change: WatchedEvent state:SyncConnected type:NodeDataChanged path:/clusterstate.json, has occurred - updating... (live nodes size: 2)
[junit4:junit4]   2> 5093 T3288 oascc.ZkStateReader$2.process A cluster state change: WatchedEvent state:SyncConnected type:NodeDataChanged path:/clusterstate.json, has occurred - updating... (live nodes size: 2)
[junit4:junit4]   2> 5093 T3275 oascc.ZkStateReader$2.process A cluster state change: WatchedEvent state:SyncConnected type:NodeDataChanged path:/clusterstate.json, has occurred - updating... (live nodes size: 2)
[junit4:junit4]   2> 5129 T3289 oasc.SolrConfig.<init> Loaded SolrConfig: solrconfig.xml
[junit4:junit4]   2> 5130 T3289 oass.IndexSchema.readSchema Reading Solr Schema
[junit4:junit4]   2> 5136 T3289 oass.IndexSchema.readSchema Schema name=test
[junit4:junit4]   2> 5772 T3289 oass.OpenExchangeRatesOrgProvider.init Initialized with rates=open-exchange-rates.json, refreshInterval=1440.
[junit4:junit4]   2> 5781 T3289 oass.IndexSchema.readSchema default search field in schema is text
[junit4:junit4]   2> 5786 T3289 oass.IndexSchema.readSchema unique key field: id
[junit4:junit4]   2> 5806 T3289 oass.FileExchangeRateProvider.reload Reloading exchange rates from file currency.xml
[junit4:junit4]   2> 5811 T3289 oass.FileExchangeRateProvider.reload Reloading exchange rates from file currency.xml
[junit4:junit4]   2> 5816 T3289 oass.OpenExchangeRatesOrgProvider.reload Reloading exchange rates from open-exchange-rates.json
[junit4:junit4]   2> 5818 T3289 oass.OpenExchangeRatesOrgProvider.reload Reloading exchange rates from open-exchange-rates.json
[junit4:junit4]   2> 5821 T3289 oasc.SolrCore.<init> [collection1] Opening new SolrCore at /Users/jenkins/jenkins-slave/workspace/Lucene-Solr-trunk-MacOSX/solr/build/solr-core/test/J0/./org.apache.solr.cloud.BasicDistributedZkTest-jetty1-1359727157881/collection1/, dataDir=./org.apache.solr.cloud.BasicDistributedZkTest-1359727154250/jetty1/
[junit4:junit4]   2> 5821 T3289 oasc.JmxMonitoredMap.<init> JMX monitoring is enabled. Adding Solr mbeans to JMX Server: com.sun.jmx.mbeanserver.JmxMBeanServer@3a0ac259
[junit4:junit4]   2> 5822 T3289 oasc.SolrCore.initDirectoryFactory solr.NRTCachingDirectoryFactory
[junit4:junit4]   2> 5823 T3289 oasc.CachingDirectoryFactory.get return new directory for /Users/jenkins/jenkins-slave/workspace/Lucene-Solr-trunk-MacOSX/solr/build/solr-core/test/J0/./org.apache.solr.cloud.BasicDistributedZkTest-1359727154250/jetty1 forceNew:false
[junit4:junit4]   2> 5824 T3289 oasc.CachingDirectoryFactory.close Releasing directory:/Users/jenkins/jenkins-slave/workspace/Lucene-Solr-trunk-MacOSX/solr/build/solr-core/test/J0/./org.apache.solr.cloud.BasicDistributedZkTest-1359727154250/jetty1
[junit4:junit4]   2> 5824 T3289 oasc.SolrCore.getNewIndexDir New index directory detected: old=null new=./org.apache.solr.cloud.BasicDistributedZkTest-1359727154250/jetty1/index/
[junit4:junit4]   2> 5825 T3289 oasc.SolrCore.initIndex WARNING [collection1] Solr index directory './org.apache.solr.cloud.BasicDistributedZkTest-1359727154250/jetty1/index' doesn't exist. Creating new index...
[junit4:junit4]   2> 5826 T3289 oasc.CachingDirectoryFactory.get return new directory for /Users/jenkins/jenkins-slave/workspace/Lucene-Solr-trunk-MacOSX/solr/build/solr-core/test/J0/./org.apache.solr.cloud.BasicDistributedZkTest-1359727154250/jetty1/index forceNew:false
[junit4:junit4]   2> 5831 T3289 oasc.SolrDeletionPolicy.onCommit SolrDeletionPolicy.onCommit: commits:num=1
[junit4:junit4]   2> 		commit{dir=RateLimitedDirectoryWrapper(NRTCachingDirectory(org.apache.lucene.store.NIOFSDirectory@/Users/jenkins/jenkins-slave/workspace/Lucene-Solr-trunk-MacOSX/solr/build/solr-core/test/J0/org.apache.solr.cloud.BasicDistributedZkTest-1359727154250/jetty1/index lockFactory=org.apache.lucene.store.NativeFSLockFactory@13e9a5b3; maxCacheMB=48.0 maxMergeSizeMB=4.0)),segFN=segments_1,generation=1,filenames=[segments_1]
[junit4:junit4]   2> 5831 T3289 oasc.SolrDeletionPolicy.updateCommits newest commit = 1[segments_1]
[junit4:junit4]   2> 5832 T3289 oasc.CachingDirectoryFactory.close Releasing directory:/Users/jenkins/jenkins-slave/workspace/Lucene-Solr-trunk-MacOSX/solr/build/solr-core/test/J0/./org.apache.solr.cloud.BasicDistributedZkTest-1359727154250/jetty1/index
[junit4:junit4]   2> 5832 T3289 oasc.SolrCore.initWriters created xml: solr.XMLResponseWriter
[junit4:junit4]   2> 5835 T3289 oasup.UpdateRequestProcessorChain.init inserting DistributedUpdateProcessorFactory into updateRequestProcessorChain "dedupe"
[junit4:junit4]   2> 5835 T3289 oasup.UpdateRequestProcessorChain.init inserting DistributedUpdateProcessorFactory into updateRequestProcessorChain "dedupe-allfields"
[junit4:junit4]   2> 5836 T3289 oasup.UpdateRequestProcessorChain.init inserting DistributedUpdateProcessorFactory into updateRequestProcessorChain "stored_sig"
[junit4:junit4]   2> 5836 T3289 oasup.UpdateRequestProcessorChain.init inserting DistributedUpdateProcessorFactory into updateRequestProcessorChain "uniq-fields"
[junit4:junit4]   2> 5837 T3289 oasup.UpdateRequestProcessorChain.init inserting DistributedUpdateProcessorFactory into updateRequestProcessorChain "distrib-dup-test-chain-implicit"
[junit4:junit4]   2> 5838 T3289 oasc.RequestHandlers.initHandlersFromConfig adding lazy requestHandler: solr.ReplicationHandler
[junit4:junit4]   2> 5838 T3289 oasc.RequestHandlers.initHandlersFromConfig created /replication: solr.ReplicationHandler
[junit4:junit4]   2> 5839 T3289 oasc.RequestHandlers.initHandlersFromConfig created standard: solr.StandardRequestHandler
[junit4:junit4]   2> 5840 T3289 oasc.RequestHandlers.initHandlersFromConfig created /get: solr.RealTimeGetHandler
[junit4:junit4]   2> 5840 T3289 oasc.RequestHandlers.initHandlersFromConfig created dismax: solr.SearchHandler
[junit4:junit4]   2> 5841 T3289 oasc.RequestHandlers.initHandlersFromConfig created mock: org.apache.solr.core.MockQuerySenderListenerReqHandler
[junit4:junit4]   2> 5842 T3289 oasc.RequestHandlers.initHandlersFromConfig created /admin/: org.apache.solr.handler.admin.AdminHandlers
[junit4:junit4]   2> 5842 T3289 oasc.RequestHandlers.initHandlersFromConfig created defaults: solr.StandardRequestHandler
[junit4:junit4]   2> 5842 T3289 oasc.RequestHandlers.initHandlersFromConfig adding lazy requestHandler: solr.StandardRequestHandler
[junit4:junit4]   2> 5843 T3289 oasc.RequestHandlers.initHandlersFromConfig created lazy: solr.StandardRequestHandler
[junit4:junit4]   2> 5844 T3289 oasc.RequestHandlers.initHandlersFromConfig created /update: solr.UpdateRequestHandler
[junit4:junit4]   2> 5844 T3289 oasc.RequestHandlers.initHandlersFromConfig created /terms: org.apache.solr.handler.component.SearchHandler
[junit4:junit4]   2> 5845 T3289 oasc.RequestHandlers.initHandlersFromConfig created spellCheckCompRH: org.apache.solr.handler.component.SearchHandler
[junit4:junit4]   2> 5845 T3289 oasc.RequestHandlers.initHandlersFromConfig created spellCheckCompRH_Direct: org.apache.solr.handler.component.SearchHandler
[junit4:junit4]   2> 5846 T3289 oasc.RequestHandlers.initHandlersFromConfig created spellCheckWithWordbreak: org.apache.solr.handler.component.SearchHandler
[junit4:junit4]   2> 5847 T3289 oasc.RequestHandlers.initHandlersFromConfig created spellCheckWithWordbreak_Direct: org.apache.solr.handler.component.SearchHandler
[junit4:junit4]   2> 5847 T3289 oasc.RequestHandlers.initHandlersFromConfig created spellCheckCompRH1: org.apache.solr.handler.component.SearchHandler
[junit4:junit4]   2> 5848 T3289 oasc.RequestHandlers.initHandlersFromConfig created mltrh: org.apache.solr.handler.component.SearchHandler
[junit4:junit4]   2> 5849 T3289 oasc.RequestHandlers.initHandlersFromConfig created tvrh: org.apache.solr.handler.component.SearchHandler
[junit4:junit4]   2> 5849 T3289 oasc.RequestHandlers.initHandlersFromConfig created /mlt: solr.MoreLikeThisHandler
[junit4:junit4]   2> 5850 T3289 oasc.RequestHandlers.initHandlersFromConfig created /debug/dump: solr.DumpRequestHandler
[junit4:junit4]   2> 5857 T3289 oashl.XMLLoader.init xsltCacheLifetimeSeconds=60
[junit4:junit4]   2> 5860 T3289 oasc.SolrCore.initDeprecatedSupport WARNING solrconfig.xml uses deprecated <admin/gettableFiles>, Please update your config to use the ShowFileRequestHandler.
[junit4:junit4]   2> 5862 T3289 oasc.SolrCore.initDeprecatedSupport WARNING adding ShowFileRequestHandler with hidden files: [SCHEMA.XML, OLD_SYNONYMS.TXT, STOPWORDS.TXT, PROTWORDS.TXT, OPEN-EXCHANGE-RATES.JSON, SYNONYMS.TXT, CURRENCY.XML, MAPPING-ISOLATIN1ACCENT.TXT]
[junit4:junit4]   2> 5864 T3289 oasc.CachingDirectoryFactory.close Releasing directory:/Users/jenkins/jenkins-slave/workspace/Lucene-Solr-trunk-MacOSX/solr/build/solr-core/test/J0/./org.apache.solr.cloud.BasicDistributedZkTest-1359727154250/jetty1
[junit4:junit4]   2> 5866 T3289 oass.SolrIndexSearcher.<init> Opening Searcher@44bb42c9 main
[junit4:junit4]   2> 5867 T3289 oasu.CommitTracker.<init> Hard AutoCommit: disabled
[junit4:junit4]   2> 5868 T3289 oasu.CommitTracker.<init> Soft AutoCommit: disabled
[junit4:junit4]   2> 5868 T3289 oashc.SpellCheckComponent.inform Initializing spell checkers
[junit4:junit4]   2> 5876 T3289 oass.DirectSolrSpellChecker.init init: {name=direct,classname=DirectSolrSpellChecker,field=lowerfilt,minQueryLength=3}
[junit4:junit4]   2> 5911 T3290 oasc.SolrCore.registerSearcher [collection1] Registered new searcher Searcher@44bb42c9 main{StandardDirectoryReader(segments_1:1)}
[junit4:junit4]   2> 5919 T3289 oasc.ZkController.publish publishing core=collection1 state=down
[junit4:junit4]   2> 5919 T3289 oasc.ZkController.publish numShards not found on descriptor - reading it from system property
[junit4:junit4]   2> 6597 T3270 oascc.ZkStateReader.updateClusterState Updating cloud state from ZooKeeper... 
[junit4:junit4]   2> 6598 T3270 oasc.Overseer$ClusterStateUpdater.updateState Update state numShards=2 message={
[junit4:junit4]   2> 	  "operation":"state",
[junit4:junit4]   2> 	  "numShards":"2",
[junit4:junit4]   2> 	  "shard":null,
[junit4:junit4]   2> 	  "roles":null,
[junit4:junit4]   2> 	  "state":"down",
[junit4:junit4]   2> 	  "core":"collection1",
[junit4:junit4]   2> 	  "collection":"collection1",
[junit4:junit4]   2> 	  "node_name":"127.0.0.1:50265__",
[junit4:junit4]   2> 	  "base_url":"http://127.0.0.1:50265/_"}
[junit4:junit4]   2> 6599 T3270 oasc.Overseer$ClusterStateUpdater.createCollection Create collection collection1 with numShards 2
[junit4:junit4]   2> 6599 T3270 oasc.Overseer$ClusterStateUpdater.updateState Assigning new node to shard shard=shard1
[junit4:junit4]   2> 6606 T3269 oascc.ZkStateReader$2.process A cluster state change: WatchedEvent state:SyncConnected type:NodeDataChanged path:/clusterstate.json, has occurred - updating... (live nodes size: 2)
[junit4:junit4]   2> 6606 T3275 oascc.ZkStateReader$2.process A cluster state change: WatchedEvent state:SyncConnected type:NodeDataChanged path:/clusterstate.json, has occurred - updating... (live nodes size: 2)
[junit4:junit4]   2> 6606 T3288 oascc.ZkStateReader$2.process A cluster state change: WatchedEvent state:SyncConnected type:NodeDataChanged path:/clusterstate.json, has occurred - updating... (live nodes size: 2)
[junit4:junit4]   2> 6927 T3289 oasc.CoreContainer.registerCore registering core: collection1
[junit4:junit4]   2> 6927 T3289 oasc.ZkController.register Register replica - core:collection1 address:http://127.0.0.1:50265/_ collection:collection1 shard:shard1
[junit4:junit4]   2> 6929 T3289 oascc.SolrZkClient.makePath makePath: /collections/collection1/leader_elect/shard1/election
[junit4:junit4]   2> 6940 T3252 oazs.PrepRequestProcessor.pRequest Got user-level KeeperException when processing sessionid:0x13c960dd4510006 type:delete cxid:0x45 zxid:0x5b txntype:-1 reqpath:n/a Error Path:/solr/collections/collection1/leaders Error:KeeperErrorCode = NoNode for /solr/collections/collection1/leaders
[junit4:junit4]   2> 6941 T3289 oasc.ShardLeaderElectionContext.runLeaderProcess Running the leader process.
[junit4:junit4]   2> 6942 T3252 oazs.PrepRequestProcessor.pRequest Got user-level KeeperException when processing sessionid:0x13c960dd4510006 type:create cxid:0x46 zxid:0x5c txntype:-1 reqpath:n/a Error Path:/solr/overseer Error:KeeperErrorCode = NodeExists for /solr/overseer
[junit4:junit4]   2> 6944 T3289 oasc.ShardLeaderElectionContext.waitForReplicasToComeUp Enough replicas found to continue.
[junit4:junit4]   2> 6945 T3289 oasc.ShardLeaderElectionContext.runLeaderProcess I may be the new leader - try and sync
[junit4:junit4]   2> 6945 T3289 oasc.SyncStrategy.sync Sync replicas to http://127.0.0.1:50265/_/collection1/
[junit4:junit4]   2> 6945 T3289 oasc.SyncStrategy.syncReplicas Sync Success - now sync replicas to me
[junit4:junit4]   2> 6945 T3289 oasc.SyncStrategy.syncToMe http://127.0.0.1:50265/_/collection1/ has no replicas
[junit4:junit4]   2> 6946 T3289 oasc.ShardLeaderElectionContext.runLeaderProcess I am the new leader: http://127.0.0.1:50265/_/collection1/
[junit4:junit4]   2> 6946 T3289 oascc.SolrZkClient.makePath makePath: /collections/collection1/leaders/shard1
[junit4:junit4]   2> 6953 T3252 oazs.PrepRequestProcessor.pRequest Got user-level KeeperException when processing sessionid:0x13c960dd4510006 type:create cxid:0x50 zxid:0x60 txntype:-1 reqpath:n/a Error Path:/solr/overseer Error:KeeperErrorCode = NodeExists for /solr/overseer
[junit4:junit4]   2> 8118 T3270 oascc.ZkStateReader.updateClusterState Updating cloud state from ZooKeeper... 
[junit4:junit4]   2> 8146 T3275 oascc.ZkStateReader$2.process A cluster state change: WatchedEvent state:SyncConnected type:NodeDataChanged path:/clusterstate.json, has occurred - updating... (live nodes size: 2)
[junit4:junit4]   2> 8147 T3269 oascc.ZkStateReader$2.process A cluster state change: WatchedEvent state:SyncConnected type:NodeDataChanged path:/clusterstate.json, has occurred - updating... (live nodes size: 2)
[junit4:junit4]   2> 8147 T3288 oascc.ZkStateReader$2.process A cluster state change: WatchedEvent state:SyncConnected type:NodeDataChanged path:/clusterstate.json, has occurred - updating... (live nodes size: 2)
[junit4:junit4]   2> 8199 T3289 oasc.ZkController.register We are http://127.0.0.1:50265/_/collection1/ and leader is http://127.0.0.1:50265/_/collection1/
[junit4:junit4]   2> 8200 T3289 oasc.ZkController.register No LogReplay needed for core=collection1 baseURL=http://127.0.0.1:50265/_
[junit4:junit4]   2> 8202 T3289 oasc.ZkController.checkRecovery I am the leader, no recovery necessary
[junit4:junit4]   2> 8202 T3289 oasc.ZkController.publish publishing core=collection1 state=active
[junit4:junit4]   2> 8203 T3289 oasc.ZkController.publish numShards not found on descriptor - reading it from system property
[junit4:junit4]   2> 8206 T3289 oascc.ZkStateReader.updateClusterState Updating cloud state from ZooKeeper... 
[junit4:junit4]   2> 8207 T3247 oass.SolrDispatchFilter.init user.dir=/Users/jenkins/jenkins-slave/workspace/Lucene-Solr-trunk-MacOSX/solr/build/solr-core/test/J0
[junit4:junit4]   2> 8208 T3247 oass.SolrDispatchFilter.init SolrDispatchFilter.init() done
[junit4:junit4]   2> 8209 T3247 oascsi.HttpClientUtil.createClient Creating new http client, config:maxConnections=128&maxConnectionsPerHost=32&followRedirects=false
[junit4:junit4]   2> 8383 T3247 oejs.Server.doStart jetty-8.1.8.v20121106
[junit4:junit4]   2> 8387 T3247 oejs.AbstractConnector.doStart Started SelectChannelConnector@127.0.0.1:50268
[junit4:junit4]   2> 8388 T3247 oass.SolrDispatchFilter.init SolrDispatchFilter.init()
[junit4:junit4]   2> 8388 T3247 oasc.SolrResourceLoader.locateSolrHome JNDI not configured for solr (NoInitialContextEx)
[junit4:junit4]   2> 8389 T3247 oasc.SolrResourceLoader.locateSolrHome using system property solr.solr.home: /Users/jenkins/jenkins-slave/workspace/Lucene-Solr-trunk-MacOSX/solr/build/solr-core/test/J0/./org.apache.solr.cloud.BasicDistributedZkTest-jetty2-1359727162457
[junit4:junit4]   2> 8389 T3247 oasc.CoreContainer$Initializer.initialize looking for solr.xml: /Users/jenkins/jenkins-slave/workspace/Lucene-Solr-trunk-MacOSX/solr/build/solr-core/test/J0/./org.apache.solr.cloud.BasicDistributedZkTest-jetty2-1359727162457/solr.xml
[junit4:junit4]   2> 8390 T3247 oasc.CoreContainer.<init> New CoreContainer 1144306908
[junit4:junit4]   2> 8390 T3247 oasc.CoreContainer.load Loading CoreContainer using Solr Home: '/Users/jenkins/jenkins-slave/workspace/Lucene-Solr-trunk-MacOSX/solr/build/solr-core/test/J0/./org.apache.solr.cloud.BasicDistributedZkTest-jetty2-1359727162457/'
[junit4:junit4]   2> 8391 T3247 oasc.SolrResourceLoader.<init> new SolrResourceLoader for directory: '/Users/jenkins/jenkins-slave/workspace/Lucene-Solr-trunk-MacOSX/solr/build/solr-core/test/J0/./org.apache.solr.cloud.BasicDistributedZkTest-jetty2-1359727162457/'
[junit4:junit4]   2> 8426 T3247 oashc.HttpShardHandlerFactory.getParameter Setting socketTimeout to: 60000
[junit4:junit4]   2> 8427 T3247 oashc.HttpShardHandlerFactory.getParameter Setting urlScheme to: http://
[junit4:junit4]   2> 8427 T3247 oashc.HttpShardHandlerFactory.getParameter Setting connTimeout to: 15000
[junit4:junit4]   2> 8428 T3247 oashc.HttpShardHandlerFactory.getParameter Setting maxConnectionsPerHost to: 20
[junit4:junit4]   2> 8429 T3247 oashc.HttpShardHandlerFactory.getParameter Setting corePoolSize to: 0
[junit4:junit4]   2> 8429 T3247 oashc.HttpShardHandlerFactory.getParameter Setting maximumPoolSize to: 2147483647
[junit4:junit4]   2> 8430 T3247 oashc.HttpShardHandlerFactory.getParameter Setting maxThreadIdleTime to: 5
[junit4:junit4]   2> 8430 T3247 oashc.HttpShardHandlerFactory.getParameter Setting sizeOfQueue to: -1
[junit4:junit4]   2> 8431 T3247 oashc.HttpShardHandlerFactory.getParameter Setting fairnessPolicy to: false
[junit4:junit4]   2> 8431 T3247 oascsi.HttpClientUtil.createClient Creating new http client, config:maxConnectionsPerHost=20&maxConnections=10000&socketTimeout=60000&connTimeout=15000&retry=false
[junit4:junit4]   2> 8444 T3247 oasc.CoreContainer.load Registering Log Listener
[junit4:junit4]   2> 8463 T3247 oasc.CoreContainer.initZooKeeper Zookeeper client=127.0.0.1:50258/solr
[junit4:junit4]   2> 8464 T3247 oasc.ZkController.checkChrootPath zkHost includes chroot
[junit4:junit4]   2> 8464 T3247 oaz.ZooKeeper.<init> Initiating client connection, connectString=127.0.0.1:50258 sessionTimeout=60000 watcher=org.apache.solr.common.cloud.ConnectionManager@548ad11b
[junit4:junit4]   2> 8465 T3247 oascc.ConnectionManager.waitForConnected Waiting for client to connect to ZooKeeper
[junit4:junit4]   2> 8466 T3300 oaz.ClientCnxn$SendThread.logStartConnect Opening socket connection to server localhost/127.0.0.1:50258. Will not attempt to authenticate using SASL (access denied ("javax.security.auth.AuthPermission" "getLoginConfiguration"))
[junit4:junit4]   2> 8467 T3300 oaz.ClientCnxn$SendThread.primeConnection Socket connection established to localhost/127.0.0.1:50258, initiating session
[junit4:junit4]   2> 8468 T3249 oazs.NIOServerCnxnFactory.run Accepted socket connection from /127.0.0.1:50269
[junit4:junit4]   2> 8468 T3249 oazs.ZooKeeperServer.processConnectRequest Client attempting to establish new session at /127.0.0.1:50269
[junit4:junit4]   2> 8469 T3251 oazs.ZooKeeperServer.finishSessionInit Established session 0x13c960dd4510007 with negotiated timeout 20000 for client /127.0.0.1:50269
[junit4:junit4]   2> 8469 T3300 oaz.ClientCnxn$SendThread.onConnected Session establishment complete on server localhost/127.0.0.1:50258, sessionid = 0x13c960dd4510007, negotiated timeout = 20000
[junit4:junit4]   2> 8470 T3301 oascc.ConnectionManager.process Watcher org.apache.solr.common.cloud.ConnectionManager@548ad11b name:ZooKeeperConnection Watcher:127.0.0.1:50258 got event WatchedEvent state:SyncConnected type:None path:null path:null type:None
[junit4:junit4]   2> 8470 T3247 oascc.ConnectionManager.waitForConnected Client is connected to ZooKeeper
[junit4:junit4]   2> 8472 T3252 oazs.PrepRequestProcessor.pRequest2Txn Processed session termination for sessionid: 0x13c960dd4510007
[junit4:junit4]   2> 8473 T3249 oazs.NIOServerCnxn.closeSock Closed socket connection for client /127.0.0.1:50269 which had sessionid 0x13c960dd4510007
[junit4:junit4]   2> 8473 T3247 oaz.ZooKeeper.close Session: 0x13c960dd4510007 closed
[junit4:junit4]   2> 8473 T3301 oaz.ClientCnxn$EventThread.run EventThread shut down
[junit4:junit4]   2> 8474 T3247 oascsi.HttpClientUtil.createClient Creating new http client, config:maxConnections=500&maxConnectionsPerHost=16&socketTimeout=60000&connTimeout=15000
[junit4:junit4]   2> 8479 T3247 oaz.ZooKeeper.<init> Initiating client connection, connectString=127.0.0.1:50258/solr sessionTimeout=30000 watcher=org.apache.solr.common.cloud.ConnectionManager@625240b9
[junit4:junit4]   2> 8481 T3247 oascc.ConnectionManager.waitForConnected Waiting for client to connect to ZooKeeper
[junit4:junit4]   2> 8481 T3302 oaz.ClientCnxn$SendThread.logStartConnect Opening socket connection to server localhost/127.0.0.1:50258. Will not attempt to authenticate using SASL (access denied ("javax.security.auth.AuthPermission" "getLoginConfiguration"))
[junit4:junit4]   2> 8482 T3302 oaz.ClientCnxn$SendThread.primeConnection Socket connection established to localhost/127.0.0.1:50258, initiating session
[junit4:junit4]   2> 8482 T3249 oazs.NIOServerCnxnFactory.run Accepted socket connection from /127.0.0.1:50270
[junit4:junit4]   2> 8483 T3249 oazs.ZooKeeperServer.processConnectRequest Client attempting to establish new session at /127.0.0.1:50270
[junit4:junit4]   2> 8484 T3251 oazs.ZooKeeperServer.finishSessionInit Established session 0x13c960dd4510008 with negotiated timeout 20000 for client /127.0.0.1:50270
[junit4:junit4]   2> 8484 T3302 oaz.ClientCnxn$SendThread.onConnected Session establishment complete on server localhost/127.0.0.1:50258, sessionid = 0x13c960dd4510008, negotiated timeout = 20000
[junit4:junit4]   2> 8485 T3303 oascc.ConnectionManager.process Watcher org.apache.solr.common.cloud.ConnectionManager@625240b9 name:ZooKeeperConnection Watcher:127.0.0.1:50258/solr got event WatchedEvent state:SyncConnected type:None path:null path:null type:None
[junit4:junit4]   2> 8485 T3247 oascc.ConnectionManager.waitForConnected Client is connected to ZooKeeper
[junit4:junit4]   2> 8486 T3252 oazs.PrepRequestProcessor.pRequest Got user-level KeeperException when processing sessionid:0x13c960dd4510008 type:create cxid:0x1 zxid:0x6d txntype:-1 reqpath:n/a Error Path:/solr/overseer Error:KeeperErrorCode = NodeExists for /solr/overseer
[junit4:junit4]   2> 8488 T3252 oazs.PrepRequestProcessor.pRequest Got user-level KeeperException when processing sessionid:0x13c960dd4510008 type:create cxid:0x2 zxid:0x6e txntype:-1 reqpath:n/a Error Path:/solr/overseer Error:KeeperErrorCode = NodeExists for /solr/overseer
[junit4:junit4]   2> 8489 T3247 oasc.ZkController.createEphemeralLiveNode Register node as live in ZooKeeper:/live_nodes/127.0.0.1:50268__
[junit4:junit4]   2> 8490 T3252 oazs.PrepRequestProcessor.pRequest Got user-level KeeperException when processing sessionid:0x13c960dd4510008 type:delete cxid:0x4 zxid:0x6f txntype:-1 reqpath:n/a Error Path:/solr/live_nodes/127.0.0.1:50268__ Error:KeeperErrorCode = NoNode for /solr/live_nodes/127.0.0.1:50268__
[junit4:junit4]   2> 8491 T3247 oascc.SolrZkClient.makePath makePath: /live_nodes/127.0.0.1:50268__
[junit4:junit4]   2> 8496 T3269 oascc.ZkStateReader$3.process Updating live nodes... (3)
[junit4:junit4]   2> 8496 T3288 oascc.ZkStateReader$3.process Updating live nodes... (3)
[junit4:junit4]   2> 8496 T3288 oascc.ZkStateReader$2.process A cluster state change: WatchedEvent state:SyncConnected type:NodeChildrenChanged path:/live_nodes, has occurred - updating... (live nodes size: 3)
[junit4:junit4]   2> 8496 T3275 oascc.ZkStateReader$3.process Updating live nodes... (3)
[junit4:junit4]   2> 8497 T3275 oascc.ZkStateReader$2.process A cluster state change: WatchedEvent state:SyncConnected type:NodeChildrenChanged path:/live_nodes, has occurred - updating... (live nodes size: 3)
[junit4:junit4]   2> 8497 T3269 oascc.ZkStateReader$2.process A cluster state change: WatchedEvent state:SyncConnected type:NodeChildrenChanged path:/live_nodes, has occurred - updating... (live nodes size: 3)
[junit4:junit4]   2> 8502 T3247 oascc.ZkStateReader.createClusterStateWatchersAndUpdate Updating cluster state from ZooKeeper... 
[junit4:junit4]   2> 8510 T3304 oasc.CoreContainer.create Creating SolrCore 'collection1' using instanceDir: /Users/jenkins/jenkins-slave/workspace/Lucene-Solr-trunk-MacOSX/solr/build/solr-core/test/J0/./org.apache.solr.cloud.BasicDistributedZkTest-jetty2-1359727162457/collection1
[junit4:junit4]   2> 8511 T3304 oasc.ZkController.createCollectionZkNode Check for collection zkNode:collection1
[junit4:junit4]   2> 8512 T3304 oasc.ZkController.createCollectionZkNode Collection zkNode exists
[junit4:junit4]   2> 8512 T3304 oasc.ZkController.readConfigName Load collection config from:/collections/collection1
[junit4:junit4]   2> 8514 T3304 oasc.SolrResourceLoader.<init> new SolrResourceLoader for directory: '/Users/jenkins/jenkins-slave/workspace/Lucene-Solr-trunk-MacOSX/solr/build/solr-core/test/J0/./org.apache.solr.cloud.BasicDistributedZkTest-jetty2-1359727162457/collection1/'
[junit4:junit4]   2> 8515 T3304 oasc.SolrResourceLoader.replaceClassLoader Adding 'file:/Users/jenkins/jenkins-slave/workspace/Lucene-Solr-trunk-MacOSX/solr/build/solr-core/test/J0/org.apache.solr.cloud.BasicDistributedZkTest-jetty2-1359727162457/collection1/lib/classes/' to classloader
[junit4:junit4]   2> 8515 T3304 oasc.SolrResourceLoader.replaceClassLoader Adding 'file:/Users/jenkins/jenkins-slave/workspace/Lucene-Solr-trunk-MacOSX/solr/build/solr-core/test/J0/org.apache.solr.cloud.BasicDistributedZkTest-jetty2-1359727162457/collection1/lib/README' to classloader
[junit4:junit4]   2> 8564 T3304 oasc.SolrConfig.<init> Using Lucene MatchVersion: LUCENE_50
[junit4:junit4]   2> 8640 T3304 oasc.SolrConfig.<init> Loaded SolrConfig: solrconfig.xml
[junit4:junit4]   2> 8643 T3304 oass.IndexSchema.readSchema Reading Solr Schema
[junit4:junit4]   2> 8649 T3304 oass.IndexSchema.readSchema Schema name=test
[junit4:junit4]   2> 9260 T3304 oass.OpenExchangeRatesOrgProvider.init Initialized with rates=open-exchange-rates.json, refreshInterval=1440.
[junit4:junit4]   2> 9270 T3304 oass.IndexSchema.readSchema default search field in schema is text
[junit4:junit4]   2> 9274 T3304 oass.IndexSchema.readSchema unique key field: id
[junit4:junit4]   2> 9299 T3304 oass.FileExchangeRateProvider.reload Reloading exchange rates from file currency.xml
[junit4:junit4]   2> 9306 T3304 oass.FileExchangeRateProvider.reload Reloading exchange rates from file currency.xml
[junit4:junit4]   2> 9312 T3304 oass.OpenExchangeRatesOrgProvider.reload Reloading exchange rates from open-exchange-rates.json
[junit4:junit4]   2> 9314 T3304 oass.OpenExchangeRatesOrgProvider.reload Reloading exchange rates from open-exchange-rates.json
[junit4:junit4]   2> 9317 T3304 oasc.SolrCore.<init> [collection1] Opening new SolrCore at /Users/jenkins/jenkins-slave/workspace/Lucene-Solr-trunk-MacOSX/solr/build/solr-core/test/J0/./org.apache.solr.cloud.BasicDistributedZkTest-jetty2-1359727162457/collection1/, dataDir=./org.apache.solr.cloud.BasicDistributedZkTest-1359727154250/jetty2/
[junit4:junit4]   2> 9317 T3304 oasc.JmxMonitoredMap.<init> JMX monitoring is enabled. Adding Solr mbeans to JMX Server: com.sun.jmx.mbeanserver.JmxMBeanServer@3a0ac259
[junit4:junit4]   2> 9318 T3304 oasc.SolrCore.initDirectoryFactory solr.NRTCachingDirectoryFactory
[junit4:junit4]   2> 9319 T3304 oasc.CachingDirectoryFactory.get return new directory for /Users/jenkins/jenkins-slave/workspace/Lucene-Solr-trunk-MacOSX/solr/build/solr-core/test/J0/./org.apache.solr.cloud.BasicDistributedZkTest-1359727154250/jetty2 forceNew:false
[junit4:junit4]   2> 9319 T3304 oasc.CachingDirectoryFactory.close Releasing directory:/Users/jenkins/jenkins-slave/workspace/Lucene-Solr-trunk-MacOSX/solr/build/solr-core/test/J0/./org.apache.solr.cloud.BasicDistributedZkTest-1359727154250/jetty2
[junit4:junit4]   2> 9319 T3304 oasc.SolrCore.getNewIndexDir New index directory detected: old=null new=./org.apache.solr.cloud.BasicDistributedZkTest-1359727154250/jetty2/index/
[junit4:junit4]   2> 9320 T3304 oasc.SolrCore.initIndex WARNING [collection1] Solr index directory './org.apache.solr.cloud.BasicDistributedZkTest-1359727154250/jetty2/index' doesn't exist. Creating new index...
[junit4:junit4]   2> 9321 T3304 oasc.CachingDirectoryFactory.get return new directory for /Users/jenkins/jenkins-slave/workspace/Lucene-Solr-trunk-MacOSX/solr/build/solr-core/test/J0/./org.apache.solr.cloud.BasicDistributedZkTest-1359727154250/jetty2/index forceNew:false
[junit4:junit4]   2> 9326 T3304 oasc.SolrDeletionPolicy.onCommit SolrDeletionPolicy.onCommit: commits:num=1
[junit4:junit4]   2> 		commit{dir=RateLimitedDirectoryWrapper(NRTCachingDirectory(org.apache.lucene.store.NIOFSDirectory@/Users/jenkins/jenkins-slave/workspace/Lucene-Solr-trunk-MacOSX/solr/build/solr-core/test/J0/org.apache.solr.cloud.BasicDistributedZkTest-1359727154250/jetty2/index lockFactory=org.apache.lucene.store.NativeFSLockFactory@327352a6; maxCacheMB=48.0 maxMergeSizeMB=4.0)),segFN=segments_1,generation=1,filenames=[segments_1]
[junit4:junit4]   2> 9326 T3304 oasc.SolrDeletionPolicy.updateCommits newest commit = 1[segments_1]
[junit4:junit4]   2> 9327 T3304 oasc.CachingDirectoryFactory.close Releasing directory:/Users/jenkins/jenkins-slave/workspace/Lucene-Solr-trunk-MacOSX/solr/build/solr-core/test/J0/./org.apache.solr.cloud.BasicDistributedZkTest-1359727154250/jetty2/index
[junit4:junit4]   2> 9328 T3304 oasc.SolrCore.initWriters created xml: solr.XMLResponseWriter
[junit4:junit4]   2> 9330 T3304 oasup.UpdateRequestProcessorChain.init inserting DistributedUpdateProcessorFactory into updateRequestProcessorChain "dedupe"
[junit4:junit4]   2> 9331 T3304 oasup.UpdateRequestProcessorChain.init inserting DistributedUpdateProcessorFactory into updateRequestProcessorChain "dedupe-allfields"
[junit4:junit4]   2> 9331 T3304 oasup.UpdateRequestProcessorChain.init inserting DistributedUpdateProcessorFactory into updateRequestProcessorChain "stored_sig"
[junit4:junit4]   2> 9332 T3304 oasup.UpdateRequestProcessorChain.init inserting DistributedUpdateProcessorFactory into updateRequestProcessorChain "uniq-fields"
[junit4:junit4]   2> 9332 T3304 oasup.UpdateRequestProcessorChain.init inserting DistributedUpdateProcessorFactory into updateRequestProcessorChain "distrib-dup-test-chain-implicit"
[junit4:junit4]   2> 9333 T3304 oasc.RequestHandlers.initHandlersFromConfig adding lazy requestHandler: solr.ReplicationHandler
[junit4:junit4]   2> 9333 T3304 oasc.RequestHandlers.initHandlersFromConfig created /replication: solr.ReplicationHandler
[junit4:junit4]   2> 9334 T3304 oasc.RequestHandlers.initHandlersFromConfig created standard: solr.StandardRequestHandler
[junit4:junit4]   2> 9335 T3304 oasc.RequestHandlers.initHandlersFromConfig created /get: solr.RealTimeGetHandler
[junit4:junit4]   2> 9336 T3304 oasc.RequestHandlers.initHandlersFromConfig created dismax: solr.SearchHandler
[junit4:junit4]   2> 9336 T3304 oasc.RequestHandlers.initHandlersFromConfig created mock: org.apache.solr.core.MockQuerySenderListenerReqHandler
[junit4:junit4]   2> 9337 T3304 oasc.RequestHandlers.initHandlersFromConfig created /admin/: org.apache.solr.handler.admin.AdminHandlers
[junit4:junit4]   2> 9337 T3304 oasc.RequestHandlers.initHandlersFromConfig created defaults: solr.StandardRequestHandler
[junit4:junit4]   2> 9338 T3304 oasc.RequestHandlers.initHandlersFromConfig adding lazy requestHandler: solr.StandardRequestHandler
[junit4:junit4]   2> 9338 T3304 oasc.RequestHandlers.initHandlersFromConfig created lazy: solr.StandardRequestHandler
[junit4:junit4]   2> 9339 T3304 oasc.RequestHandlers.initHandlersFromConfig created /update: solr.UpdateRequestHandler
[junit4:junit4]   2> 9340 T3304 oasc.RequestHandlers.initHandlersFromConfig created /terms: org.apache.solr.handler.component.SearchHandler
[junit4:junit4]   2> 9340 T3304 oasc.RequestHandlers.initHandlersFromConfig created spellCheckCompRH: org.apache.solr.handler.component.SearchHandler
[junit4:junit4]   2> 9341 T3304 oasc.RequestHandlers.initHandlersFromConfig created spellCheckCompRH_Direct: org.apache.solr.handler.component.SearchHandler
[junit4:junit4]   2> 9342 T3304 oasc.RequestHandlers.initHandlersFromConfig created spellCheckWithWordbreak: org.apache.solr.handler.component.SearchHandler
[junit4:junit4]   2> 9342 T3304 oasc.RequestHandlers.initHandlersFromConfig created spellCheckWithWordbreak_Direct: org.apache.solr.handler.component.SearchHandler
[junit4:junit4]   2> 9343 T3304 oasc.RequestHandlers.initHandlersFromConfig created spellCheckCompRH1: org.apache.solr.handler.component.SearchHandler
[junit4:junit4]   2> 9344 T3304 oasc.RequestHandlers.initHandlersFromConfig created mltrh: org.apache.solr.handler.component.SearchHandler
[junit4:junit4]   2> 9344 T3304 oasc.RequestHandlers.initHandlersFromConfig created tvrh: org.apache.solr.handler.component.SearchHandler
[junit4:junit4]   2> 9345 T3304 oasc.RequestHandlers.initHandlersFromConfig created /mlt: solr.MoreLikeThisHandler
[junit4:junit4]   2> 9346 T3304 oasc.RequestHandlers.initHandlersFromConfig created /debug/dump: solr.DumpRequestHandler
[junit4:junit4]   2> 9352 T3304 oashl.XMLLoader.init xsltCacheLifetimeSeconds=60
[junit4:junit4]   2> 9356 T3304 oasc.SolrCore.initDeprecatedSupport WARNING solrconfig.xml uses deprecated <admin/gettableFiles>, Please update your config to use the ShowFileRequestHandler.
[junit4:junit4]   2> 9358 T3304 oasc.SolrCore.initDeprecatedSupport WARNING adding ShowFileRequestHandler with hidden files: [SCHEMA.XML, OLD_SYNONYMS.TXT, STOPWORDS.TXT, PROTWORDS.TXT, OPEN-EXCHANGE-RATES.JSON, SYNONYMS.TXT, CURRENCY.XML, MAPPING-ISOLATIN1ACCENT.TXT]
[junit4:junit4]   2> 9360 T3304 oasc.CachingDirectoryFactory.close Releasing directory:/Users/jenkins/jenkins-slave/workspace/Lucene-Solr-trunk-MacOSX/solr/build/solr-core/test/J0/./org.apache.solr.cloud.BasicDistributedZkTest-1359727154250/jetty2
[junit4:junit4]   2> 9362 T3304 oass.SolrIndexSearcher.<init> Opening Searcher@733af2fb main
[junit4:junit4]   2> 9363 T3304 oasu.CommitTracker.<init> Hard AutoCommit: disabled
[junit4:junit4]   2> 9363 T3304 oasu.CommitTracker.<init> Soft AutoCommit: disabled
[junit4:junit4]   2> 9364 T3304 oashc.SpellCheckComponent.inform Initializing spell checkers
[junit4:junit4]   2> 9371 T3304 oass.DirectSolrSpellChecker.init init: {name=direct,classname=DirectSolrSpellChecker,field=lowerfilt,minQueryLength=3}
[junit4:junit4]   2> 9409 T3305 oasc.SolrCore.registerSearcher [collection1] Registered new searcher Searcher@733af2fb main{StandardDirectoryReader(segments_1:1)}
[junit4:junit4]   2> 9416 T3304 oasc.ZkController.publish publishing core=collection1 state=down
[junit4:junit4]   2> 9416 T3304 oasc.ZkController.publish numShards not found on descriptor - reading it from system property
[junit4:junit4]   2> 9672 T3270 oascc.ZkStateReader.updateClusterState Updating cloud state from ZooKeeper... 
[junit4:junit4]   2> 9673 T3270 oasc.Overseer$ClusterStateUpdater.updateState Update state numShards=2 message={
[junit4:junit4]   2> 	  "operation":"state",
[junit4:junit4]   2> 	  "numShards":"2",
[junit4:junit4]   2> 	  "shard":"shard1",
[junit4:junit4]   2> 	  "roles":null,
[junit4:junit4]   2> 	  "state":"active",
[junit4:junit4]   2> 	  "core":"collection1",
[junit4:junit4]   2> 	  "collection":"collection1",
[junit4:junit4]   2> 	  "node_name":"127.0.0.1:50265__",
[junit4:junit4]   2> 	  "base_url":"http://127.0.0.1:50265/_"}
[junit4:junit4]   2> 9683 T3270 oasc.Overseer$ClusterStateUpdater.updateState Update state numShards=2 message={
[junit4:junit4]   2> 	  "operation":"state",
[junit4:junit4]   2> 	  "numShards":"2",
[junit4:junit4]   2> 	  "shard":null,
[junit4:junit4]   2> 	  "roles":null,
[junit4:junit4]   2> 	  "state":"down",
[junit4:junit4]   2> 	  "core":"collection1",
[junit4:junit4]   2> 	  "collection":"collection1",
[junit4:junit4]   2> 	  "node_name":"127.0.0.1:50268__",
[junit4:junit4]   2> 	  "base_url":"http://127.0.0.1:50268/_"}
[junit4:junit4]   2> 9684 T3270 oasc.Overseer$ClusterStateUpdater.updateState Collection already exists with numShards=2
[junit4:junit4]   2> 9684 T3270 oasc.Overseer$ClusterStateUpdater.updateState Assigning new node to shard shard=shard2
[junit4:junit4]   2> 9692 T3269 oascc.ZkStateReader$2.process A cluster state change: WatchedEvent state:SyncConnected type:NodeDataChanged path:/clusterstate.json, has occurred - updating... (live nodes size: 3)
[junit4:junit4]   2> 9693 T3303 oascc.ZkStateReader$2.process A cluster state change: WatchedEvent state:SyncConnected type:NodeDataChanged path:/clusterstate.json, has occurred - updating... (live nodes size: 3)
[junit4:junit4]   2> 9693 T3288 oascc.ZkStateReader$2.process A cluster state change: WatchedEvent state:SyncConnected type:NodeDataChanged path:/clusterstate.json, has occurred - updating... (live nodes size: 3)
[junit4:junit4]   2> 9693 T3275 oascc.ZkStateReader$2.process A cluster state change: WatchedEvent state:SyncConnected type:NodeDataChanged path:/clusterstate.json, has occurred - updating... (live nodes size: 3)
[junit4:junit4]   2> 10420 T3304 oasc.CoreContainer.registerCore registering core: collection1
[junit4:junit4]   2> 10420 T3304 oasc.ZkController.register Register replica - core:collection1 address:http://127.0.0.1:50268/_ collection:collection1 shard:shard2
[junit4:junit4]   2> 10422 T3304 oascc.SolrZkClient.makePath makePath: /collections/collection1/leader_elect/shard2/election
[junit4:junit4]   2> 10431 T3252 oazs.PrepRequestProcessor.pRequest Got user-level KeeperException when processing sessionid:0x13c960dd4510008 type:delete cxid:0x42 zxid:0x7d txntype:-1 reqpath:n/a Error Path:/solr/collections/collection1/leaders/shard2 Error:KeeperErrorCode = NoNode for /solr/collections/collection1/leaders/shard2
[junit4:junit4]   2> 10432 T3304 oasc.ShardLeaderElectionContext.runLeaderProcess Running the leader process.
[junit4:junit4]   2> 10433 T3252 oazs.PrepRequestProcessor.pRequest Got user-level KeeperException when processing sessionid:0x13c960dd4510008 type:create cxid:0x43 zxid:0x7e txntype:-1 reqpath:n/a Error Path:/solr/overseer Error:KeeperErrorCode = NodeExists for /solr/overseer
[junit4:junit4]   2> 10436 T3304 oasc.ShardLeaderElectionContext.waitForReplicasToComeUp Enough replicas found to continue.
[junit4:junit4]   2> 10436 T3304 oasc.ShardLeaderElectionContext.runLeaderProcess I may be the new leader - try and sync
[junit4:junit4]   2> 10437 T3304 oasc.SyncStrategy.sync Sync replicas to http://127.0.0.1:50268/_/collection1/
[junit4:junit4]   2> 10437 T3304 oasc.SyncStrategy.syncReplicas Sync Success - now sync replicas to me
[junit4:junit4]   2> 10438 T3304 oasc.SyncStrategy.syncToMe http://127.0.0.1:50268/_/collection1/ has no replicas
[junit4:junit4]   2> 10438 T3304 oasc.ShardLeaderElectionContext.runLeaderProcess I am the new leader: http://127.0.0.1:50268/_/collection1/
[junit4:junit4]   2> 10439 T3304 oascc.SolrZkClient.makePath makePath: /collections/collection1/leaders/shard2
[junit4:junit4]   2> 10448 T3252 oazs.PrepRequestProcessor.pRequest Got user-level KeeperException when processing sessionid:0x13c960dd4510008 type:create cxid:0x4c zxid:0x81 txntype:-1 reqpath:n/a Error Path:/solr/overseer Error:KeeperErrorCode = NodeExists for /solr/overseer
[junit4:junit4]   2> 11209 T3270 oascc.ZkStateReader.updateClusterState Updating cloud state from ZooKeeper... 
[junit4:junit4]   2> 11260 T3288 oascc.ZkStateReader$2.process A cluster state change: WatchedEvent state:SyncConnected type:NodeDataChanged path:/clusterstate.json, has occurred - updating... (live nodes size: 3)
[junit4:junit4]   2> 11261 T3269 oascc.ZkStateReader$2.process A cluster state change: WatchedEvent state:SyncConnected type:NodeDataChanged path:/clusterstate.json, has occurred - updating... (live nodes size: 3)
[junit4:junit4]   2> 11262 T3275 oascc.ZkStateReader$2.process A cluster state change: WatchedEvent state:SyncConnected type:NodeDataChanged path:/clusterstate.json, has occurred - updating... (live nodes size: 3)
[junit4:junit4]   2> 11261 T3303 oascc.ZkStateReader$2.process A cluster state change: WatchedEvent state:SyncConnected type:NodeDataChanged path:/clusterstate.json, has occurred - updating... (live nodes size: 3)
[junit4:junit4]   2> 11270 T3304 oasc.ZkController.register We are http://127.0.0.1:50268/_/collection1/ and leader is http://127.0.0.1:50268/_/collection1/
[junit4:junit4]   2> 11271 T3304 oasc.ZkController.register No LogReplay needed for core=collection1 baseURL=http://127.0.0.1:50268/_
[junit4:junit4]   2> 11271 T3304 oasc.ZkController.checkRecovery I am the leader, no recovery necessary
[junit4:junit4]   2> 11272 T3304 oasc.ZkController.publish publishing core=collection1 state=active
[junit4:junit4]   2> 11273 T3304 oasc.ZkController.publish numShards not found on descriptor - reading it from system property
[junit4:junit4]   2> 11279 T3304 oascc.ZkStateReader.updateClusterState Updating cloud state from ZooKeeper... 
[junit4:junit4]   2> 11284 T3247 oass.SolrDispatchFilter.init user.dir=/Users/jenkins/jenkins-slave/workspace/Lucene-Solr-trunk-MacOSX/solr/build/solr-core/test/J0
[junit4:junit4]   2> 11285 T3247 oass.SolrDispatchFilter.init SolrDispatchFilter.init() done
[junit4:junit4]   2> 11285 T3247 oascsi.HttpClientUtil.createClient Creating new http client, config:maxConnections=128&maxConnectionsPerHost=32&followRedirects=false
[junit4:junit4]   2> 11467 T3247 oejs.Server.doStart jetty-8.1.8.v20121106
[junit4:junit4]   2> 11470 T3247 oejs.AbstractConnector.doStart Started SelectChannelConnector@127.0.0.1:50271
[junit4:junit4]   2> 11471 T3247 oass.SolrDispatchFilter.init SolrDispatchFilter.init()
[junit4:junit4]   2> 11472 T3247 oasc.SolrResourceLoader.locateSolrHome JNDI not configured for solr (NoInitialContextEx)
[junit4:junit4]   2> 11474 T3247 oasc.SolrResourceLoader.locateSolrHome using system property solr.solr.home: /Users/jenkins/jenkins-slave/workspace/Lucene-Solr-trunk-MacOSX/solr/build/solr-core/test/J0/./org.apache.solr.cloud.BasicDistributedZkTest-jetty3-1359727165535
[junit4:junit4]   2> 11474 T3247 oasc.CoreContainer$Initializer.initialize looking for solr.xml: /Users/jenkins/jenkins-slave/workspace/Lucene-Solr-trunk-MacOSX/solr/build/solr-core/test/J0/./org.apache.solr.cloud.BasicDistributedZkTest-jetty3-1359727165535/solr.xml
[junit4:junit4]   2> 11475 T3247 oasc.CoreContainer.<init> New CoreContainer 1463443944
[junit4:junit4]   2> 11476 T3247 oasc.CoreContainer.load Loading CoreContainer using Solr Home: '/Users/jenkins/jenkins-slave/workspace/Lucene-Solr-trunk-MacOSX/solr/build/solr-core/test/J0/./org.apache.solr.cloud.BasicDistributedZkTest-jetty3-1359727165535/'
[junit4:junit4]   2> 11476 T3247 oasc.SolrResourceLoader.<init> new SolrResourceLoader for directory: '/Users/jenkins/jenkins-slave/workspace/Lucene-Solr-trunk-MacOSX/solr/build/solr-core/test/J0/./org.apache.solr.cloud.BasicDistributedZkTest-jetty3-1359727165535/'
[junit4:junit4]   2> 11521 T3247 oashc.HttpShardHandlerFactory.getParameter Setting socketTimeout to: 60000
[junit4:junit4]   2> 11522 T3247 oashc.HttpShardHandlerFactory.getParameter Setting urlScheme to: http://
[junit4:junit4]   2> 11523 T3247 oashc.HttpShardHandlerFactory.getParameter Setting connTimeout to: 15000
[junit4:junit4]   2> 11523 T3247 oashc.HttpShardHandlerFactory.getParameter Setting maxConnectionsPerHost to: 20
[junit4:junit4]   2> 11524 T3247 oashc.HttpShardHandlerFactory.getParameter Setting corePoolSize to: 0
[junit4:junit4]   2> 11525 T3247 oashc.HttpShardHandlerFactory.getParameter Setting maximumPoolSize to: 2147483647
[junit4:junit4]   2> 11526 T3247 oashc.HttpShardHandlerFactory.getParameter Setting maxThreadIdleTime to: 5
[junit4:junit4]   2> 11526 T3247 oashc.HttpShardHandlerFactory.getParameter Setting sizeOfQueue to: -1
[junit4:junit4]   2> 11527 T3247 oashc.HttpShardHandlerFactory.getParameter Setting fairnessPolicy to: false
[junit4:junit4]   2> 11527 T3247 oascsi.HttpClientUtil.createClient Creating new http client, config:maxConnectionsPerHost=20&maxConnections=10000&socketTimeout=60000&connTimeout=15000&retry=false
[junit4:junit4]   2> 11545 T3247 oasc.CoreContainer.load Registering Log Listener
[junit4:junit4]   2> 11634 T3247 oasc.CoreContainer.initZooKeeper Zookeeper client=127.0.0.1:50258/solr
[junit4:junit4]   2> 11635 T3247 oasc.ZkController.checkChrootPath zkHost includes chroot
[junit4:junit4]   2> 11636 T3247 oaz.ZooKeeper.<init> Initiating client connection, connectString=127.0.0.1:50258 sessionTimeout=60000 watcher=org.apache.solr.common.cloud.ConnectionManager@33a48b1
[junit4:junit4]   2> 11637 T3247 oascc.ConnectionManager.waitForConnected Waiting for client to connect to ZooKeeper
[junit4:junit4]   2> 11638 T3315 oaz.ClientCnxn$SendThread.logStartConnect Opening socket connection to server localhost/127.0.0.1:50258. Will not attempt to authenticate using SASL (access denied ("javax.security.auth.AuthPermission" "getLoginConfiguration"))
[junit4:junit4]   2> 11640 T3315 oaz.ClientCnxn$SendThread.primeConnection Socket connection established to localhost/127.0.0.1:50258, initiating session
[junit4:junit4]   2> 11640 T3249 oazs.NIOServerCnxnFactory.run Accepted socket connection from /127.0.0.1:50272
[junit4:junit4]   2> 11640 T3249 oazs.ZooKeeperServer.processConnectRequest Client attempting to establish new session at /127.0.0.1:50272
[junit4:junit4]   2> 11642 T3251 oazs.ZooKeeperServer.finishSessionInit Established session 0x13c960dd4510009 with negotiated timeout 20000 for client /127.0.0.1:50272
[junit4:junit4]   2> 11642 T3315 oaz.ClientCnxn$SendThread.onConnected Session establishment complete on server localhost/127.0.0.1:50258, sessionid = 0x13c960dd4510009, negotiated timeout = 20000
[junit4:junit4]   2> 11642 T3316 oascc.ConnectionManager.process Watcher org.apache.solr.common.cloud.ConnectionManager@33a48b1 name:ZooKeeperConnection Watcher:127.0.0.1:50258 got event WatchedEvent state:SyncConnected type:None path:null path:null type:None
[junit4:junit4]   2> 11642 T3247 oascc.ConnectionManager.waitForConnected Client is connected to ZooKeeper
[junit4:junit4]   2> 11644 T3252 oazs.PrepRequestProcessor.pRequest2Txn Processed session termination for sessionid: 0x13c960dd4510009
[junit4:junit4]   2> 11646 T3249 oazs.NIOServerCnxn.closeSock Closed socket connection for client /127.0.0.1:50272 which had sessionid 0x13c960dd4510009
[junit4:junit4]   2> 11646 T3316 oaz.ClientCnxn$EventThread.run EventThread shut down
[junit4:junit4]   2> 11646 T3247 oaz.ZooKeeper.close Session: 0x13c960dd4510009 closed
[junit4:junit4]   2> 11647 T3247 oascsi.HttpClientUtil.createClient Creating new http client, config:maxConnections=500&maxConnectionsPerHost=16&socketTimeout=60000&connTimeout=15000
[junit4:junit4]   2> 11653 T3247 oaz.ZooKeeper.<init> Initiating client connection, connectString=127.0.0.1:50258/solr sessionTimeout=30000 watcher=org.apache.solr.common.cloud.ConnectionManager@273722c9
[junit4:junit4]   2> 11654 T3247 oascc.ConnectionManager.waitForConnected Waiting for client to connect to ZooKeeper
[junit4:junit4]   2> 11655 T3317 oaz.ClientCnxn$SendThread.logStartConnect Opening socket connection to server localhost/127.0.0.1:50258. Will not attempt to authenticate using SASL (access denied ("javax.security.auth.AuthPermission" "getLoginConfiguration"))
[junit4:junit4]   2> 11656 T3317 oaz.ClientCnxn$SendThread.primeConnection Socket connection established to localhost/127.0.0.1:50258, initiating session
[junit4:junit4]   2> 11656 T3249 oazs.NIOServerCnxnFactory.run Accepted socket connection from /127.0.0.1:50273
[junit4:junit4]   2> 11657 T3249 oazs.ZooKeeperServer.processConnectRequest Client attempting to establish new session at /127.0.0.1:50273
[junit4:junit4]   2> 11658 T3317 oaz.ClientCnxn$SendThread.onConnected Session establishment complete on server localhost/127.0.0.1:50258, sessionid = 0x13c960dd451000a, negotiated timeout = 20000
[junit4:junit4]   2> 11659 T3318 oascc.ConnectionManager.process Watcher org.apache.solr.common.cloud.ConnectionManager@273722c9 name:ZooKeeperConnection Watcher:127.0.0.1:50258/solr got event WatchedEvent state:SyncConnected type:None path:null path:null type:None
[junit4:junit4]   2> 11658 T3251 oazs.ZooKeeperServer.finishSessionInit Established session 0x13c960dd451000a with negotiated timeout 20000 for client /127.0.0.1:50273
[junit4:junit4]   2> 11659 T3247 oascc.ConnectionManager.waitForConnected Client is connected to ZooKeeper
[junit4:junit4]   2> 11660 T3252 oazs.PrepRequestProcessor.pRequest Got user-level KeeperException when processing sessionid:0x13c960dd451000a type:create cxid:0x1 zxid:0x8e txntype:-1 reqpath:n/a Error Path:/solr/overseer Error:KeeperErrorCode = NodeExists for /solr/overseer
[junit4:junit4]   2> 11662 T3252 oazs.PrepRequestProcessor.pRequest Got user-level KeeperException when processing sessionid:0x13c960dd451000a type:create cxid:0x2 zxid:0x8f txntype:-1 reqpath:n/a Error Path:/solr/overseer Error:KeeperErrorCode = NodeExists for /solr/overseer
[junit4:junit4]   2> 11663 T3247 oasc.ZkController.createEphemeralLiveNode Register node as live in ZooKeeper:/live_nodes/127.0.0.1:50271__
[junit4:junit4]   2> 11664 T3252 oazs.PrepRequestProcessor.pRequest Got user-level KeeperException when processing sessionid:0x13c960dd451000a type:delete cxid:0x4 zxid:0x90 txntype:-1 reqpath:n/a Error Path:/solr/live_nodes/127.0.0.1:50271__ Error:KeeperErrorCode = NoNode for /solr/live_nodes/127.0.0.1:50271__
[junit4:junit4]   2> 11665 T3247 oascc.SolrZkClient.makePath makePath: /live_nodes/127.0.0.1:50271__
[junit4:junit4]   2> 11670 T3303 oascc.ZkStateReader$3.process Updating live nodes... (4)
[junit4:junit4]   2> 11670 T3303 oascc.ZkStateReader$2.process A cluster state change: WatchedEvent state:SyncConnected type:NodeChildrenChanged path:/live_nodes, has occurred - updating... (live nodes size: 4)
[junit4:junit4]   2> 11671 T3288 oascc.ZkStateReader$3.process Updating live nodes... (4)
[junit4:junit4]   2> 11671 T3275 oascc.ZkStateReader$3.process Updating live nodes... (4)
[junit4:junit4]   2> 11671 T3275 oascc.ZkStateReader$2.process A cluster state change: WatchedEvent state:SyncConnected type:NodeChildrenChanged path:/live_nodes, has occurred - updating... (live nodes size: 4)
[junit4:junit4]   2> 11671 T3288 oascc.ZkStateReader$2.process A cluster state change: WatchedEvent state:SyncConnected type:NodeChildrenChanged path:/live_nodes, has occurred - updating... (live nodes size: 4)
[junit4:junit4]   2> 11673 T3269 oascc.ZkStateReader$3.process Updating live nodes... (4)
[junit4:junit4]   2> 11673 T3269 oascc.ZkStateReader$2.process A cluster state change: WatchedEvent state:SyncConnected type:NodeChildrenChanged path:/live_nodes, has occurred - updating... (live nodes size: 4)
[junit4:junit4]   2> 11679 T3247 oascc.ZkStateReader.createClusterStateWatchersAndUpdate Updating cluster state from ZooKeeper... 
[junit4:junit4]   2> 11693 T3319 oasc.CoreContainer.create Creating SolrCore 'collection1' using instanceDir: /Users/jenkins/jenkins-slave/workspace/Lucene-Solr-trunk-MacOSX/solr/build/solr-core/test/J0/./org.apache.solr.cloud.BasicDistributedZkTest-jetty3-1359727165535/collection1
[junit4:junit4]   2> 11694 T3319 oasc.ZkController.createCollectionZkNode Check for collection zkNode:collection1
[junit4:junit4]   2> 11694 T3319 oasc.ZkController.createCollectionZkNode Collection zkNode exists
[junit4:junit4]   2> 11695 T3319 oasc.ZkController.readConfigName Load collection config from:/collections/collection1
[junit4:junit4]   2> 11697 T3319 oasc.SolrResourceLoader.<init> new SolrResourceLoader for directory: '/Users/jenkins/jenkins-slave/workspace/Lucene-Solr-trunk-MacOSX/solr/build/solr-core/test/J0/./org.apache.solr.cloud.BasicDistributedZkTest-jetty3-1359727165535/collection1/'
[junit4:junit4]   2> 11698 T3319 oasc.SolrResourceLoader.replaceClassLoader Adding 'file:/Users/jenkins/jenkins-slave/workspace/Lucene-Solr-trunk-MacOSX/solr/build/solr-core/test/J0/org.apache.solr.cloud.BasicDistributedZkTest-jetty3-1359727165535/collection1/lib/classes/' to classloader
[junit4:junit4]   2> 11698 T3319 oasc.SolrResourceLoader.replaceClassLoader Adding 'file:/Users/jenkins/jenkins-slave/workspace/Lucene-Solr-trunk-MacOSX/solr/build/solr-core/test/J0/org.apache.solr.cloud.BasicDistributedZkTest-jetty3-1359727165535/collection1/lib/README' to classloader
[junit4:junit4]   2> 11750 T3319 oasc.SolrConfig.<init> Using Lucene MatchVersion: LUCENE_50
[junit4:junit4]   2> 11835 T3319 oasc.SolrConfig.<init> Loaded SolrConfig: solrconfig.xml
[junit4:junit4]   2> 11836 T3319 oass.IndexSchema.readSchema Reading Solr Schema
[junit4:junit4]   2> 11842 T3319 oass.IndexSchema.readSchema Schema name=test
[junit4:junit4]   2> 12420 T3319 oass.OpenExchangeRatesOrgProvider.init Initialized with rates=open-exchange-rates.json, refreshInterval=1440.
[junit4:junit4]   2> 12430 T3319 oass.IndexSchema.readSchema default search field in schema is text
[junit4:junit4]   2> 12434 T3319 oass.IndexSchema.readSchema unique key field: id
[junit4:junit4]   2> 12454 T3319 oass.FileExchangeRateProvider.reload Reloading exchange rates from file currency.xml
[junit4:junit4]   2> 12460 T3319 oass.FileExchangeRateProvider.reload Reloading exchange rates from file currency.xml
[junit4:junit4]   2> 12465 T3319 oass.OpenExchangeRatesOrgProvider.reload Reloading exchange rates from open-exchange-rates.json
[junit4:junit4]   2> 12467 T3319 oass.OpenExchangeRatesOrgProvider.reload Reloading exchange rates from open-exchange-rates.json
[junit4:junit4]   2> 12469 T3319 oasc.SolrCore.<init> [collection1] Opening new SolrCore at /Users/jenkins/jenkins-slave/workspace/Lucene-Solr-trunk-MacOSX/solr/build/solr-core/test/J0/./org.apache.solr.cloud.BasicDistributedZkTest-jetty3-1359727165535/collection1/, dataDir=./org.apache.solr.cloud.BasicDistributedZkTest-1359727154250/jetty3/
[junit4:junit4]   2> 12469 T3319 oasc.JmxMonitoredMap.<init> JMX monitoring is enabled. Adding Solr mbeans to JMX Server: com.sun.jmx.mbeanserver.JmxMBeanServer@3a0ac259
[junit4:junit4]   2> 12470 T3319 oasc.SolrCore.initDirectoryFactory solr.NRTCachingDirectoryFactory
[junit4:junit4]   2> 12471 T3319 oasc.CachingDirectoryFactory.get return new directory for /Users/jenkins/jenkins-slave/workspace/Lucene-Solr-trunk-MacOSX/solr/build/solr-core/test/J0/./org.apache.solr.cloud.BasicDistributedZkTest-1359727154250/jetty3 forceNew:false
[junit4:junit4]   2> 12471 T3319 oasc.CachingDirectoryFactory.close Releasing directory:/Users/jenkins/jenkins-slave/workspace/Lucene-Solr-trunk-MacOSX/solr/build/solr-core/test/J0/./org.apache.solr.cloud.BasicDistributedZkTest-1359727154250/jetty3
[junit4:junit4]   2> 12471 T3319 oasc.SolrCore.getNewIndexDir New index directory detected: old=null new=./org.apache.solr.cloud.BasicDistributedZkTest-1359727154250/jetty3/index/
[junit4:junit4]   2> 12472 T3319 oasc.SolrCore.initIndex WARNING [collection1] Solr index directory './org.apache.solr.cloud.BasicDistributedZkTest-1359727154250/jetty3/index' doesn't exist. Creating new index...
[junit4:junit4]   2> 12472 T3319 oasc.CachingDirectoryFactory.get return new directory for /Users/jenkins/jenkins-slave/workspace/Lucene-Solr-trunk-MacOSX/solr/build/solr-core/test/J0/./org.apache.solr.cloud.BasicDistributedZkTest-1359727154250/jetty3/index forceNew:false
[junit4:junit4]   2> 12477 T3319 oasc.SolrDeletionPolicy.onCommit SolrDeletionPolicy.onCommit: commits:num=1
[junit4:junit4]   2> 		commit{dir=RateLimitedDirectoryWrapper(NRTCachingDirectory(org.apache.lucene.store.NIOFSDirectory@/Users/jenkins/jenkins-slave/workspace/Lucene-Solr-trunk-MacOSX/solr/build/solr-core/test/J0/org.apache.solr.cloud.BasicDistributedZkTest-1359727154250/jetty3/index lockFactory=org.apache.lucene.store.NativeFSLockFactory@4b6fba2d; maxCacheMB=48.0 maxMergeSizeMB=4.0)),segFN=segments_1,generation=1,filenames=[segments_1]
[junit4:junit4]   2> 12477 T3319 oasc.SolrDeletionPolicy.updateCommits newest commit = 1[segments_1]
[junit4:junit4]   2> 12478 T3319 oasc.CachingDirectoryFactory.close Releasing directory:/Users/jenkins/jenkins-slave/workspace/Lucene-Solr-trunk-MacOSX/solr/build/solr-core/test/J0/./org.apache.solr.cloud.BasicDistributedZkTest-1359727154250/jetty3/index
[junit4:junit4]   2> 12478 T3319 oasc.SolrCore.initWriters created xml: solr.XMLResponseWriter
[junit4:junit4]   2> 12481 T3319 oasup.UpdateRequestProcessorChain.init inserting DistributedUpdateProcessorFactory into updateRequestProcessorChain "dedupe"
[junit4:junit4]   2> 12481 T3319 oasup.UpdateRequestProcessorChain.init inserting DistributedUpdateProcessorFactory into updateRequestProcessorChain "dedupe-allfields"
[junit4:junit4]   2> 12481 T3319 oasup.UpdateRequestProcessorChain.init inserting DistributedUpdateProcessorFactory into updateRequestProcessorChain "stored_sig"
[junit4:junit4]   2> 12482 T3319 oasup.UpdateRequestProcessorChain.init inserting DistributedUpdateProcessorFactory into updateRequestProcessorChain "uniq-fields"
[junit4:junit4]   2> 12482 T3319 oasup.UpdateRequestProcessorChain.init inserting DistributedUpdateProcessorFactory into updateRequestProcessorChain "distrib-dup-test-chain-implicit"
[junit4:junit4]   2> 12483 T3319 oasc.RequestHandlers.initHandlersFromConfig adding lazy requestHandler: solr.ReplicationHandler
[junit4:junit4]   2> 12483 T3319 oasc.RequestHandlers.initHandlersFromConfig created /replication: solr.ReplicationHandler
[junit4:junit4]   2> 12484 T3319 oasc.RequestHandlers.initHandlersFromConfig created standard: solr.StandardRequestHandler
[junit4:junit4]   2> 12485 T3319 oasc.RequestHandlers.initHandlersFromConfig created /get: solr.RealTimeGetHandler
[junit4:junit4]   2> 12485 T3319 oasc.RequestHandlers.initHandlersFromConfig created dismax: solr.SearchHandler
[junit4:junit4]   2> 12486 T3319 oasc.RequestHandlers.initHandlersFromConfig created mock: org.apache.solr.core.MockQuerySenderListenerReqHandler
[junit4:junit4]   2> 12486 T3319 oasc.RequestHandlers.initHandlersFromConfig created /admin/: org.apache.solr.handler.admin.AdminHandlers
[junit4:junit4]   2> 12487 T3319 oasc.RequestHandlers.initHandlersFromConfig created defaults: solr.StandardRequestHandler
[junit4:junit4]   2> 12487 T3319 oasc.RequestHandlers.initHandlersFromConfig adding lazy requestHandler: solr.StandardRequestHandler
[junit4:junit4]   2> 12488 T3319 oasc.RequestHandlers.initHandlersFromConfig created lazy: solr.StandardRequestHandler
[junit4:junit4]   2> 12488 T3319 oasc.RequestHandlers.initHandlersFromConfig created /update: solr.UpdateRequestHandler
[junit4:junit4]   2> 12489 T3319 oasc.RequestHandlers.initHandlersFromConfig created /terms: org.apache.solr.handler.component.SearchHandler
[junit4:junit4]   2> 12489 T3319 oasc.RequestHandlers.initHandlersFromConfig created spellCheckCompRH: org.apache.solr.handler.component.SearchHandler
[junit4:junit4]   2> 12490 T3319 oasc.RequestHandlers.initHandlersFromConfig created spellCheckCompRH_Direct: org.apache.solr.handler.component.SearchHandler
[junit4:junit4]   2> 12491 T3319 oasc.RequestHandlers.initHandlersFromConfig created spellCheckWithWordbreak: org.apache.solr.handler.component.SearchHandler
[junit4:junit4]   2> 12491 T3319 oasc.RequestHandlers.initHandlersFromConfig created spellCheckWithWordbreak_Direct: org.apache.solr.handler.component.SearchHandler
[junit4:junit4]   2> 12493 T3319 oasc.RequestHandlers.initHandlersFromConfig created spellCheckCompRH1: org.apache.solr.handler.component.SearchHandler
[junit4:junit4]   2> 12493 T3319 oasc.RequestHandlers.initHandlersFromConfig created mltrh: org.apache.solr.handler.component.SearchHandler
[junit4:junit4]   2> 12494 T3319 oasc.RequestHandlers.initHandlersFromConfig created tvrh: org.apache.solr.handler.component.SearchHandler
[junit4:junit4]   2> 12494 T3319 oasc.RequestHandlers.initHandlersFromConfig created /mlt: solr.MoreLikeThisHandler
[junit4:junit4]   2> 12495 T3319 oasc.RequestHandlers.initHandlersFromConfig created /debug/dump: solr.DumpRequestHandler
[junit4:junit4]   2> 12501 T3319 oashl.XMLLoader.init xsltCacheLifetimeSeconds=60
[junit4:junit4]   2> 12504 T3319 oasc.SolrCore.initDeprecatedSupport WARNING solrconfig.xml uses deprecated <admin/gettableFiles>, Please update your config to use the ShowFileRequestHandler.
[junit4:junit4]   2> 12506 T3319 oasc.SolrCore.initDeprecatedSupport WARNING adding ShowFileRequestHandler with hidden files: [SCHEMA.XML, OLD_SYNONYMS.TXT, STOPWORDS.TXT, PROTWORDS.TXT, OPEN-EXCHANGE-RATES.JSON, SYNONYMS.TXT, CURRENCY.XML, MAPPING-ISOLATIN1ACCENT.TXT]
[junit4:junit4]   2> 12509 T3319 oasc.CachingDirectoryFactory.close Releasing directory:/Users/jenkins/jenkins-slave/workspace/Lucene-Solr-trunk-MacOSX/solr/build/solr-core/test/J0/./org.apache.solr.cloud.BasicDistributedZkTest-1359727154250/jetty3
[junit4:junit4]   2> 12510 T3319 oass.SolrIndexSearcher.<init> Opening Searcher@f147e09 main
[junit4:junit4]   2> 12511 T3319 oasu.CommitTracker.<init> Hard AutoCommit: disabled
[junit4:junit4]   2> 12511 T3319 oasu.CommitTracker.<init> Soft AutoCommit: disabled
[junit4:junit4]   2> 12512 T3319 oashc.SpellCheckComponent.inform Initializing spell checkers
[junit4:junit4]   2> 12517 T3319 oass.DirectSolrSpellChecker.init init: {name=direct,classname=DirectSolrSpellChecker,field=lowerfilt,minQueryLength=3}
[junit4:junit4]   2> 12549 T3320 oasc.SolrCore.registerSearcher [collection1] Registered new searcher Searcher@f147e09 main{StandardDirectoryReader(segments_1:1)}
[junit4:junit4]   2> 12555 T3319 oasc.ZkController.publish publishing core=collection1 state=down
[junit4:junit4]   2> 12556 T3319 oasc.ZkController.publish numShards not found on descriptor - reading it from system property
[junit4:junit4]   2> 12787 T3270 oascc.ZkStateReader.updateClusterState Updating cloud state from ZooKeeper... 
[junit4:junit4]   2> 12788 T3270 oasc.Overseer$ClusterStateUpdater.updateState Update state numShards=2 message={
[junit4:junit4]   2> 	  "operation":"state",
[junit4:junit4]   2> 	  "numShards":"2",
[junit4:junit4]   2> 	  "shard":"shard2",
[junit4:junit4]   2> 	  "roles":null,
[junit4:junit4]   2> 	  "state":"active",
[junit4:junit4]   2> 	  "core":"collection1",
[junit4:junit4]   2> 	  "collection":"collection1",
[junit4:junit4]   2> 	  "node_name":"127.0.0.1:50268__",
[junit4:junit4]   2> 	  "base_url":"http://127.0.0.1:50268/_"}
[junit4:junit4]   2> 12794 T3270 oasc.Overseer$ClusterStateUpdater.updateState Update state numShards=2 message={
[junit4:junit4]   2> 	  "operation":"state",
[junit4:junit4]   2> 	  "numShards":"2",
[junit4:junit4]   2> 	  "shard":null,
[junit4:junit4]   2> 	  "roles":null,
[junit4:junit4]   2> 	  "state":"down",
[junit4:junit4]   2> 	  "core":"collection1",
[junit4:junit4]   2> 	  "collection":"collection1",
[junit4:junit4]   2> 	  "node_name":"127.0.0.1:50271__",
[junit4:junit4]   2> 	  "base_url":"http://127.0.0.1:50271/_"}
[junit4:junit4]   2> 12795 T3270 oasc.Overseer$ClusterStateUpdater.updateState Collection already exists with numShards=2
[junit4:junit4]   2> 12795 T3270 oasc.Overseer$ClusterStateUpdater.updateState Assigning new node to shard shard=shard1
[junit4:junit4]   2> 12802 T3318 oascc.ZkStateReader$2.process A cluster state change: WatchedEvent state:SyncConnected type:NodeDataChanged path:/clusterstate.json, has occurred - updating... (live nodes size: 4)
[junit4:junit4]   2> 12803 T3303 oascc.ZkStateReader$2.process A cluster state change: WatchedEvent state:SyncConnected type:NodeDataChanged path:/clusterstate.json, has occurred - updating... (live nodes size: 4)
[junit4:junit4]   2> 12803 T3269 oascc.ZkStateReader$2.process A cluster state change: WatchedEvent state:SyncConnected type:NodeDataChanged path:/clusterstate.json, has occurred - updating... (live nodes size: 4)
[junit4:junit4]   2> 12803 T3288 oascc.ZkStateReader$2.process A cluster state change: WatchedEvent state:SyncConnected type:NodeDataChanged path:/clusterstate.json, has occurred - updating... (live nodes size: 4)
[junit4:junit4]   2> 12803 T3275 oascc.ZkStateReader$2.process A cluster state change: WatchedEvent state:SyncConnected type:NodeDataChanged path:/clusterstate.json, has occurred - updating... (live nodes size: 4)
[junit4:junit4]   2> 13559 T3319 oasc.CoreContainer.registerCore registering core: collection1
[junit4:junit4]   2> 13560 T3319 oasc.ZkController.register Register replica - core:collection1 address:http://127.0.0.1:50271/_ collection:collection1 shard:shard1
[junit4:junit4]   2> 13570 T3319 oasc.ZkController.register We are http://127.0.0.1:50271/_/collection1/ and leader is http://127.0.0.1:50265/_/collection1/
[junit4:junit4]   2> 13571 T3319 oasc.ZkController.register No LogReplay needed for core=collection1 baseURL=http://127.0.0.1:50271/_
[junit4:junit4]   2> 13571 T3319 oasc.ZkController.checkRecovery Core needs to recover:collection1
[junit4:junit4]   2> 13572 T3319 oasu.DefaultSolrCoreState.doRecovery Running recovery - first canceling any ongoing recovery
[junit4:junit4]   2> ASYNC  NEW_CORE C197 name=collection1 org.apache.solr.core.SolrCore@5711f9e9 url=http://127.0.0.1:50271/_/collection1 node=127.0.0.1:50271__ C197_STATE=coll:collection1 core:collection1 props:{shard=null, roles=null, state=down, core=collection1, collection=collection1, node_name=127.0.0.1:50271__, base_url=http://127.0.0.1:50271/_}
[junit4:junit4]   2> 13574 T3321 C197 P50271 oasc.RecoveryStrategy.run Starting recovery process.  core=collection1 recoveringAfterStartup=true
[junit4:junit4]   2> 13577 T3321 C197 P50271 oasc.RecoveryStrategy.doRecovery ###### startupVersions=[]
[junit4:junit4]   2> 13576 T3319 oascc.ZkStateReader.updateClusterState Updating cloud state from ZooKeeper... 
[junit4:junit4]   2> 13578 T3321 C197 P50271 oasc.ZkController.publish publishing core=collection1 state=recovering
[junit4:junit4]   2> 13579 T3321 C197 P50271 oasc.ZkController.publish numShards not found on descriptor - reading it from system property
[junit4:junit4]   2> 13581 T3247 oass.SolrDispatchFilter.init user.dir=/Users/jenkins/jenkins-slave/workspace/Lucene-Solr-trunk-MacOSX/solr/build/solr-core/test/J0
[junit4:junit4]   2> 13583 T3321 C197 P50271 oascsi.HttpClientUtil.createClient Creating new http client, config:maxConnections=128&maxConnectionsPerHost=32&followRedirects=false
[junit4:junit4]   2> 13582 T3247 oass.SolrDispatchFilter.init SolrDispatchFilter.init() done
[junit4:junit4]   2> 13584 T3247 oascsi.HttpClientUtil.createClient Creating new http client, config:maxConnections=128&maxConnectionsPerHost=32&followRedirects=false
[junit4:junit4]   2> 13770 T3247 oejs.Server.doStart jetty-8.1.8.v20121106
[junit4:junit4]   2> 13774 T3247 oejs.AbstractConnector.doStart Started SelectChannelConnector@127.0.0.1:50275
[junit4:junit4]   2> 13775 T3247 oass.SolrDispatchFilter.init SolrDispatchFilter.init()
[junit4:junit4]   2> 13776 T3247 oasc.SolrResourceLoader.locateSolrHome JNDI not configured for solr (NoInitialContextEx)
[junit4:junit4]   2> 13776 T3247 oasc.SolrResourceLoader.locateSolrHome using system property solr.solr.home: /Users/jenkins/jenkins-slave/workspace/Lucene-Solr-trunk-MacOSX/solr/build/solr-core/test/J0/./org.apache.solr.cloud.BasicDistributedZkTest-jetty4-1359727167845
[junit4:junit4]   2> 13777 T3247 oasc.CoreContainer$Initializer.initialize looking for solr.xml: /Users/jenkins/jenkins-slave/workspace/Lucene-Solr-trunk-MacOSX/solr/build/solr-core/test/J0/./org.apache.solr.cloud.BasicDistributedZkTest-jetty4-1359727167845/solr.xml
[junit4:junit4]   2> 13777 T3247 oasc.CoreContainer.<init> New CoreContainer 761087583
[junit4:junit4]   2> 13778 T3247 oasc.CoreContainer.load Loading CoreContainer using Solr Home: '/Users/jenkins/jenkins-slave/workspace/Lucene-Solr-trunk-MacOSX/solr/build/solr-core/test/J0/./org.apache.solr.cloud.BasicDistributedZkTest-jetty4-1359727167845/'
[junit4:junit4]   2> 13779 T3247 oasc.SolrResourceLoader.<init> new SolrResourceLoader for directory: '/Users/jenkins/jenkins-slave/workspace/Lucene-Solr-trunk-MacOSX/solr/build/solr-core/test/J0/./org.apache.solr.cloud.BasicDistributedZkTest-jetty4-1359727167845/'
[junit4:junit4]   2> 13814 T3247 oashc.HttpShardHandlerFactory.getParameter Setting socketTimeout to: 60000
[junit4:junit4]   2> 13814 T3247 oashc.HttpShardHandlerFactory.getParameter Setting urlScheme to: http://
[junit4:junit4]   2> 13815 T3247 oashc.HttpShardHandlerFactory.getParameter Setting connTimeout to: 15000
[junit4:junit4]   2> 13815 T3247 oashc.HttpShardHandlerFactory.getParameter Setting maxConnectionsPerHost to: 20
[junit4:junit4]   2> 13818 T3247 oashc.HttpShardHandlerFactory.getParameter Setting corePoolSize to: 0
[junit4:junit4]   2> 13818 T3247 oashc.HttpShardHandlerFactory.getParameter Setting maximumPoolSize to: 2147483647
[junit4:junit4]   2> 13819 T3247 oashc.HttpShardHandlerFactory.getParameter Setting maxThreadIdleTime to: 5
[junit4:junit4]   2> 13819 T3247 oashc.HttpShardHandlerFactory.getParameter Setting sizeOfQueue to: -1
[junit4:junit4]   2> 13820 T3247 oashc.HttpShardHandlerFactory.getParameter Setting fairnessPolicy to: false
[junit4:junit4]   2> 13820 T3247 oascsi.HttpClientUtil.createClient Creating new http client, config:maxConnectionsPerHost=20&maxConnections=10000&socketTimeout=60000&connTimeout=15000&retry=false
[junit4:junit4]   2> 13833 T3247 oasc.CoreContainer.load Registering Log Listener
[junit4:junit4]   2> 13850 T3247 oasc.CoreContainer.initZooKeeper Zookeeper client=127.0.0.1:50258/solr
[junit4:junit4]   2> 13851 T3247 oasc.ZkController.checkChrootPath zkHost includes chroot
[junit4:junit4]   2> 13852 T3247 oaz.ZooKeeper.<init> Initiating client connection, connectString=127.0.0.1:50258 sessionTimeout=60000 watcher=org.apache.solr.common.cloud.ConnectionManager@77ed3200
[junit4:junit4]   2> 13853 T3247 oascc.ConnectionManager.waitForConnected Waiting for client to connect to ZooKeeper
[junit4:junit4]   2> 13854 T3331 oaz.ClientCnxn$SendThread.logStartConnect Opening socket connection to server localhost/127.0.0.1:50258. Will not attempt to authenticate using SASL (access denied ("javax.security.auth.AuthPermission" "getLoginConfiguration"))
[junit4:junit4]   2> 13855 T3331 oaz.ClientCnxn$SendThread.primeConnection Socket connection established to localhost/127.0.0.1:50258, initiating session
[junit4:junit4]   2> 13855 T3249 oazs.NIOServerCnxnFactory.run Accepted socket connection from /127.0.0.1:50276
[junit4:junit4]   2> 13856 T3249 oazs.ZooKeeperServer.processConnectRequest Client attempting to establish new session at /127.0.0.1:50276
[junit4:junit4]   2> 14060 T3251 oazs.ZooKeeperServer.finishSessionInit Established session 0x13c960dd451000b with negotiated timeout 20000 for client /127.0.0.1:50276
[junit4:junit4]   2> 14060 T3331 oaz.ClientCnxn$SendThread.onConnected Session establishment complete on server localhost/127.0.0.1:50258, sessionid = 0x13c960dd451000b, negotiated timeout = 20000
[junit4:junit4]   2> 14062 T3332 oascc.ConnectionManager.process Watcher org.apache.solr.common.cloud.ConnectionManager@77ed3200 name:ZooKeeperConnection Watcher:127.0.0.1:50258 got event WatchedEvent state:SyncConnected type:None path:null path:null type:None
[junit4:junit4]   2> 14062 T3247 oascc.ConnectionManager.waitForConnected Client is connected to ZooKeeper
[junit4:junit4]   2> 14066 T3252 oazs.PrepRequestProcessor.pRequest2Txn Processed session termination for sessionid: 0x13c960dd451000b
[junit4:junit4]   2> 14068 T3249 oazs.NIOServerCnxn.closeSock Closed socket connection for client /127.0.0.1:50276 which had sessionid 0x13c960dd451000b
[junit4:junit4]   2> 14068 T3247 oaz.ZooKeeper.close Session: 0x13c960dd451000b closed
[junit4:junit4]   2> 14068 T3332 oaz.ClientCnxn$EventThread.run EventThread shut down
[junit4:junit4]   2> 14069 T3247 oascsi.HttpClientUtil.createClient Creating new http client, config:maxConnections=500&maxConnectionsPerHost=16&socketTimeout=60000&connTimeout=15000
[junit4:junit4]   2> 14085 T3247 oaz.ZooKeeper.<init> Initiating client connection, connectString=127.0.0.1:50258/solr sessionTimeout=30000 watcher=org.apache.solr.common.cloud.ConnectionManager@483a8e1
[junit4:junit4]   2> 14086 T3247 oascc.ConnectionManager.waitForConnected Waiting for client to connect to ZooKeeper
[junit4:junit4]   2> 14086 T3333 oaz.ClientCnxn$SendThread.logStartConnect Opening socket connection to server localhost/127.0.0.1:50258. Will not attempt to authenticate using SASL (access denied ("javax.security.auth.AuthPermission" "getLoginConfiguration"))
[junit4:junit4]   2> 14087 T3333 oaz.ClientCnxn$SendThread.primeConnection Socket connection established to localhost/127.0.0.1:50258, initiating session
[junit4:junit4]   2> 14087 T3249 oazs.NIOServerCnxnFactory.run Accepted socket connection from /127.0.0.1:50277
[junit4:junit4]   2> 14088 T3249 oazs.ZooKeeperServer.processConnectRequest Client attempting to establish new session at /127.0.0.1:50277
[junit4:junit4]   2> 14089 T3251 oazs.ZooKeeperServer.finishSessionInit Established session 0x13c960dd451000c with negotiated timeout 20000 for client /127.0.0.1:50277
[junit4:junit4]   2> 14089 T3333 oaz.ClientCnxn$SendThread.onConnected Session establishment complete on server localhost/127.0.0.1:50258, sessionid = 0x13c960dd451000c, negotiated timeout = 20000
[junit4:junit4]   2> 14090 T3334 oascc.ConnectionManager.process Watcher org.apache.solr.common.cloud.ConnectionManager@483a8e1 name:ZooKeeperConnection Watcher:127.0.0.1:50258/solr got event WatchedEvent state:SyncConnected type:None path:null path:null type:None
[junit4:junit4]   2> 14090 T3247 oascc.ConnectionManager.waitForConnected Client is connected to ZooKeeper
[junit4:junit4]   2> 14091 T3252 oazs.PrepRequestProcessor.pRequest Got user-level KeeperException when processing sessionid:0x13c960dd451000c type:create cxid:0x1 zxid:0xa0 txntype:-1 reqpath:n/a Error Path:/solr/overseer Error:KeeperErrorCode = NodeExists for /solr/overseer
[junit4:junit4]   2> 14092 T3252 oazs.PrepRequestProcessor.pRequest Got user-level KeeperException when processing sessionid:0x13c960dd451000c type:create cxid:0x2 zxid:0xa1 txntype:-1 reqpath:n/a Error Path:/solr/overseer Error:KeeperErrorCode = NodeExists for /solr/overseer
[junit4:junit4]   2> 14094 T3247 oasc.ZkController.createEphemeralLiveNode Register node as live in ZooKeeper:/live_nodes/127.0.0.1:50275__
[junit4:junit4]   2> 14095 T3252 oazs.PrepRequestProcessor.pRequest Got user-level KeeperException when processing sessionid:0x13c960dd451000c type:delete cxid:0x4 zxid:0xa2 txntype:-1 reqpath:n/a Error Path:/solr/live_nodes/127.0.0.1:50275__ Error:KeeperErrorCode = NoNode for /solr/live_nodes/127.0.0.1:50275__
[junit4:junit4]   2> 14096 T3247 oascc.SolrZkClient.makePath makePath: /live_nodes/127.0.0.1:50275__
[junit4:junit4]   2> 14099 T3318 oascc.ZkStateReader$2.process A cluster state change: WatchedEvent state:SyncConnected type:NodeChildrenChanged path:/live_nodes, has occurred - updating... (live nodes size: 4)
[junit4:junit4]   2> 14100 T3269 oascc.ZkStateReader$3.process Updating live nodes... (5)
[junit4:junit4]   2> 14101 T3269 oascc.ZkStateReader$2.process A cluster state change: WatchedEvent state:SyncConnected type:NodeChildrenChanged path:/live_nodes, has occurred - updating... (live nodes size: 5)
[junit4:junit4]   2> 14101 T3288 oascc.ZkStateReader$3.process Updating live nodes... (5)
[junit4:junit4]   2> 14101 T3288 oascc.ZkStateReader$2.process A cluster state change: WatchedEvent state:SyncConnected type:NodeChildrenChanged path:/live_nodes, has occurred - updating... (live nodes size: 5)
[junit4:junit4]   2> 14102 T3275 oascc.ZkStateReader$3.process Updating live nodes... (5)
[junit4:junit4]   2> 14102 T3275 oascc.ZkStateReader$2.process A cluster state change: WatchedEvent state:SyncConnected type:NodeChildrenChanged path:/live_nodes, has occurred - updating... (live nodes size: 5)
[junit4:junit4]   2> 14101 T3303 oascc.ZkStateReader$3.process Updating live nodes... (5)
[junit4:junit4]   2> 14102 T3303 oascc.ZkStateReader$2.process A cluster state change: WatchedEvent state:SyncConnected type:NodeChildrenChanged path:/live_nodes, has occurred - updating... (live nodes size: 5)
[junit4:junit4]   2> 14105 T3318 oascc.ZkStateReader$3.process Updating live nodes... (5)
[junit4:junit4]   2> 14109 T3247 oascc.ZkStateReader.createClusterStateWatchersAndUpdate Updating cluster state from ZooKeeper... 
[junit4:junit4]   2> 14116 T3335 oasc.CoreContainer.create Creating SolrCore 'collection1' using instanceDir: /Users/jenkins/jenkins-slave/workspace/Lucene-Solr-trunk-MacOSX/solr/build/solr-core/test/J0/./org.apache.solr.cloud.BasicDistributedZkTest-jetty4-1359727167845/collection1
[junit4:junit4]   2> 14116 T3335 oasc.ZkController.createCollectionZkNode Check for collection zkNode:collection1
[junit4:junit4]   2> 14118 T3335 oasc.ZkController.createCollectionZkNode Collection zkNode exists
[junit4:junit4]   2> 14118 T3335 oasc.ZkController.readConfigName Load collection config from:/collections/collection1
[junit4:junit4]   2> 14120 T3335 oasc.SolrResourceLoader.<init> new SolrResourceLoader for directory: '/Users/jenkins/jenkins-slave/workspace/Lucene-Solr-trunk-MacOSX/solr/build/solr-core/test/J0/./org.apache.solr.cloud.BasicDistributedZkTest-jetty4-1359727167845/collection1/'
[junit4:junit4]   2> 14120 T3335 oasc.SolrResourceLoader.replaceClassLoader Adding 'file:/Users/jenkins/jenkins-slave/workspace/Lucene-Solr-trunk-MacOSX/solr/build/solr-core/test/J0/org.apache.solr.cloud.BasicDistributedZkTest-jetty4-1359727167845/collection1/lib/classes/' to classloader
[junit4:junit4]   2> 14121 T3335 oasc.SolrResourceLoader.replaceClassLoader Adding 'file:/Users/jenkins/jenkins-slave/workspace/Lucene-Solr-trunk-MacOSX/solr/build/solr-core/test/J0/org.apache.solr.cloud.BasicDistributedZkTest-jetty4-1359727167845/collection1/lib/README' to classloader
[junit4:junit4]   2> 14173 T3335 oasc.SolrConfig.<init> Using Lucene MatchVersion: LUCENE_50
[junit4:junit4]   2> 14250 T3335 oasc.SolrConfig.<init> Loaded SolrConfig: solrconfig.xml
[junit4:junit4]   2> 14252 T3335 oass.IndexSchema.readSchema Reading Solr Schema
[junit4:junit4]   2> 14256 T3335 oass.IndexSchema.readSchema Schema name=test
[junit4:junit4]   2> 14319 T3270 oascc.ZkStateReader.updateClusterState Updating cloud state from ZooKeeper... 
[junit4:junit4]   2> 14320 T3270 oasc.Overseer$ClusterStateUpdater.updateState Update state numShards=2 message={
[junit4:junit4]   2> 	  "operation":"state",
[junit4:junit4]   2> 	  "numShards":"2",
[junit4:junit4]   2> 	  "shard":"shard1",
[junit4:junit4]   2> 	  "roles":null,
[junit4:junit4]   2> 	  "state":"recovering",
[junit4:junit4]   2> 	  "core":"collection1",
[junit4:junit4]   2> 	  "collection":"collection1",
[junit4:junit4]   2> 	  "node_name":"127.0.0.1:50271__",
[junit4:junit4]   2> 	  "base_url":"http://127.0.0.1:50271/_"}
[junit4:junit4]   2> 14326 T3334 oascc.ZkStateReader$2.process A cluster state change: WatchedEvent state:SyncConnected type:NodeDataChanged path:/clusterstate.json, has occurred - updating... (live nodes size: 5)
[junit4:junit4]   2> 14326 T3303 oascc.ZkStateReader$2.process A cluster state change: WatchedEvent state:SyncConnected type:NodeDataChanged path:/clusterstate.json, has occurred - updating... (live nodes size: 5)
[junit4:junit4]   2> 14327 T3318 oascc.ZkStateReader$2.process A cluster state change: WatchedEvent state:SyncConnected type:NodeDataChanged path:/clusterstate.json, has occurred - updating... (live nodes size: 5)
[junit4:junit4]   2> 14327 T3288 oascc.ZkStateReader$2.process A cluster state change: WatchedEvent state:SyncConnected type:NodeDataChanged path:/clusterstate.json, has occurred - updating... (live nodes size: 5)
[junit4:junit4]   2> 14327 T3269 oascc.ZkStateReader$2.process A cluster state change: WatchedEvent state:SyncConnected type:NodeDataChanged path:/clusterstate.json, has occurred - updating... (live nodes size: 5)
[junit4:junit4]   2> 14328 T3275 oascc.ZkStateReader$2.process A cluster state change: WatchedEvent state:SyncConnected type:NodeDataChanged path:/clusterstate.json, has occurred - updating... (live nodes size: 5)
[junit4:junit4]   2> 14878 T3335 oass.OpenExchangeRatesOrgProvider.init Initialized with rates=open-exchange-rates.json, refreshInterval=1440.
[junit4:junit4]   2> 14888 T3335 oass.IndexSchema.readSchema default search field in schema is text
[junit4:junit4]   2> 14891 T3335 oass.IndexSchema.readSchema unique key field: id
[junit4:junit4]   2> 14913 T3335 oass.FileExchangeRateProvider.reload Reloading exchange rates from file currency.xml
[junit4:junit4]   2> 14918 T3335 oass.FileExchangeRateProvider.reload Reloading exchange rates from file currency.xml
[junit4:junit4]   2> 14923 T3335 oass.OpenExchangeRatesOrgProvider.reload Reloading exchange rates from open-exchange-rates.json
[junit4:junit4]   2> 14926 T3335 oass.OpenExchangeRatesOrgProvider.reload Reloading exchange rates from open-exchange-rates.json
[junit4:junit4]   2> 14928 T3335 oasc.SolrCore.<init> [collection1] Opening new SolrCore at /Users/jenkins/jenkins-slave/workspace/Lucene-Solr-trunk-MacOSX/solr/build/solr-core/test/J0/./org.apache.solr.cloud.BasicDistributedZkTest-jetty4-1359727167845/collection1/, dataDir=./org.apache.solr.cloud.BasicDistributedZkTest-1359727154250/jetty4/
[junit4:junit4]   2> 14928 T3335 oasc.JmxMonitoredMap.<init> JMX monitoring is enabled. Adding Solr mbeans to JMX Server: com.sun.jmx.mbeanserver.JmxMBeanServer@3a0ac259
[junit4:junit4]   2> 14929 T3335 oasc.SolrCore.initDirectoryFactory solr.NRTCachingDirectoryFactory
[junit4:junit4]   2> 14929 T3335 oasc.CachingDirectoryFactory.get return new directory for /Users/jenkins/jenkins-slave/workspace/Lucene-Solr-trunk-MacOSX/solr/build/solr-core/test/J0/./org.apache.solr.cloud.BasicDistributedZkTest-1359727154250/jetty4 forceNew:false
[junit4:junit4]   2> 14930 T3335 oasc.CachingDirectoryFactory.close Releasing directory:/Users/jenkins/jenkins-slave/workspace/Lucene-Solr-trunk-MacOSX/solr/build/solr-core/test/J0/./org.apache.solr.cloud.BasicDistributedZkTest-1359727154250/jetty4
[junit4:junit4]   2> 14930 T3335 oasc.SolrCore.getNewIndexDir New index directory detected: old=null new=./org.apache.solr.cloud.BasicDistributedZkTest-1359727154250/jetty4/index/
[junit4:junit4]   2> 14931 T3335 oasc.SolrCore.initIndex WARNING [collection1] Solr index directory './org.apache.solr.cloud.BasicDistributedZkTest-1359727154250/jetty4/index' doesn't exist. Creating new index...
[junit4:junit4]   2> 14932 T3335 oasc.CachingDirectoryFactory.get return new directory for /Users/jenkins/jenkins-slave/workspace/Lucene-Solr-trunk-MacOSX/solr/build/solr-core/test/J0/./org.apache.solr.cloud.BasicDistributedZkTest-1359727154250/jetty4/index forceNew:false
[junit4:junit4]   2> 14937 T3335 oasc.SolrDeletionPolicy.onCommit SolrDeletionPolicy.onCommit: commits:num=1
[junit4:junit4]   2> 		commit{dir=RateLimitedDirectoryWrapper(NRTCachingDirectory(org.apache.lucene.store.NIOFSDirectory@/Users/jenkins/jenkins-slave/workspace/Lucene-Solr-trunk-MacOSX/solr/build/solr-core/test/J0/org.apache.solr.cloud.BasicDistributedZkTest-1359727154250/jetty4/index lockFactory=org.apache.lucene.store.NativeFSLockFactory@1c579c57; maxCacheMB=48.0 maxMergeSizeMB=4.0)),segFN=segments_1,generation=1,filenames=[segments_1]
[junit4:junit4]   2> 14938 T3335 oasc.SolrDeletionPolicy.updateCommits newest commit = 1[segments_1]
[junit4:junit4]   2> 14939 T3335 oasc.CachingDirectoryFactory.close Releasing directory:/Users/jenkins/jenkins-slave/workspace/Lucene-Solr-trunk-MacOSX/solr/build/solr-core/test/J0/./org.apache.solr.cloud.BasicDistributedZkTest-1359727154250/jetty4/index
[junit4:junit4]   2> 14940 T3335 oasc.SolrCore.initWriters created xml: solr.XMLResponseWriter
[junit4:junit4]   2> 14943 T3335 oasup.UpdateRequestProcessorChain.init inserting DistributedUpdateProcessorFactory into updateRequestProcessorChain "dedupe"
[junit4:junit4]   2> 14943 T3335 oasup.UpdateRequestProcessorChain.init inserting DistributedUpdateProcessorFactory into updateRequestProcessorChain "dedupe-allfields"
[junit4:junit4]   2> 14944 T3335 oasup.UpdateRequestProcessorChain.init inserting DistributedUpdateProcessorFactory into updateRequestProcessorChain "stored_sig"
[junit4:junit4]   2> 14944 T3335 oasup.UpdateRequestProcessorChain.init inserting DistributedUpdateProcessorFactory into updateRequestProcessorChain "uniq-fields"
[junit4:junit4]   2> 14945 T3335 oasup.UpdateRequestProcessorChain.init inserting DistributedUpdateProcessorFactory into updateRequestProcessorChain "distrib-dup-test-chain-implicit"
[junit4:junit4]   2> 14945 T3335 oasc.RequestHandlers.initHandlersFromConfig adding lazy requestHandler: solr.ReplicationHandler
[junit4:junit4]   2> 14947 T3335 oasc.RequestHandlers.initHandlersFromConfig created /replication: solr.ReplicationHandler
[junit4:junit4]   2> 14947 T3335 oasc.RequestHandlers.initHandlersFromConfig created standard: solr.StandardRequestHandler
[junit4:junit4]   2> 14948 T3335 oasc.RequestHandlers.initHandlersFromConfig created /get: solr.RealTimeGetHandler
[junit4:junit4]   2> 14949 T3335 oasc.RequestHandlers.initHandlersFromConfig created dismax: solr.SearchHandler
[junit4:junit4]   2> 14949 T3335 oasc.RequestHandlers.initHandlersFromConfig created mock: org.apache.solr.core.MockQuerySenderListenerReqHandler
[junit4:junit4]   2> 14950 T3335 oasc.RequestHandlers.initHandlersFromConfig created /admin/: org.apache.solr.handler.admin.AdminHandlers
[junit4:junit4]   2> 14950 T3335 oasc.RequestHandlers.initHandlersFromConfig created defaults: solr.StandardRequestHandler
[junit4:junit4]   2> 14950 T3335 oasc.RequestHandlers.initHandlersFromConfig adding lazy requestHandler: solr.StandardRequestHandler
[junit4:junit4]   2> 14951 T3335 oasc.RequestHandlers.initHandlersFromConfig created lazy: solr.StandardRequestHandler
[junit4:junit4]   2> 14952 T3335 oasc.RequestHandlers.initHandlersFromConfig created /update: solr.UpdateRequestHandler
[junit4:junit4]   2> 14952 T3335 oasc.RequestHandlers.initHandlersFromConfig created /terms: org.apache.solr.handler.component.SearchHandler
[junit4:junit4]   2> 14953 T3335 oasc.RequestHandlers.initHandlersFromConfig created spellCheckCompRH: org.apache.solr.handler.component.SearchHandler
[junit4:junit4]   2> 14954 T3335 oasc.RequestHandlers.initHandlersFromConfig created spellCheckCompRH_Direct: org.apache.solr.handler.component.SearchHandler
[junit4:junit4]   2> 14955 T3335 oasc.RequestHandlers.initHandlersFromConfig created spellCheckWithWordbreak: org.apache.solr.handler.component.SearchHandler
[junit4:junit4]   2> 14955 T3335 oasc.RequestHandlers.initHandlersFromConfig created spellCheckWithWordbreak_Direct: org.apache.solr.handler.component.SearchHandler
[junit4:junit4]   2> 14956 T3335 oasc.RequestHandlers.initHandlersFromConfig created spellCheckCompRH1: org.apache.solr.handler.component.SearchHandler
[junit4:junit4]   2> 14956 T3335 oasc.RequestHandlers.initHandlersFromConfig created mltrh: org.apache.solr.handler.component.SearchHandler
[junit4:junit4]   2> 14957 T3335 oasc.RequestHandlers.initHandlersFromConfig created tvrh: org.apache.solr.handler.component.SearchHandler
[junit4:junit4]   2> 14958 T3335 oasc.RequestHandlers.initHandlersFromConfig created /mlt: solr.MoreLikeThisHandler
[junit4:junit4]   2> 14958 T3335 oasc.RequestHandlers.initHandlersFromConfig created /debug/dump: solr.DumpRequestHandler
[junit4:junit4]   2> 14965 T3335 oashl.XMLLoader.init xsltCacheLifetimeSeconds=60
[junit4:junit4]   2> 14968 T3335 oasc.SolrCore.initDeprecatedSupport WARNING solrconfig.xml uses deprecated <admin/gettableFiles>, Please update your config to use the ShowFileRequestHandler.
[junit4:junit4]   2> 14969 T3335 oasc.SolrCore.initDeprecatedSupport WARNING adding ShowFileRequestHandler with hidden files: [SCHEMA.XML, OLD_SYNONYMS.TXT, STOPWORDS.TXT, PROTWORDS.TXT, OPEN-EXCHANGE-RATES.JSON, SYNONYMS.TXT, CURRENCY.XML, MAPPING-ISOLATIN1ACCENT.TXT]
[junit4:junit4]   2> 14972 T3335 oasc.CachingDirectoryFactory.close Releasing directory:/Users/jenkins/jenkins-slave/workspace/Lucene-Solr-trunk-MacOSX/solr/build/solr-core/test/J0/./org.apache.solr.cloud.BasicDistributedZkTest-1359727154250/jetty4
[junit4:junit4]   2> 14973 T3335 oass.SolrIndexSearcher.<init> Opening Searcher@cf4724b main
[junit4:junit4]   2> 14974 T3335 oasu.CommitTracker.<init> Hard AutoCommit: disabled
[junit4:junit4]   2> 14975 T3335 oasu.CommitTracker.<init> Soft AutoCommit: disabled
[junit4:junit4]   2> 14975 T3335 oashc.SpellCheckComponent.inform Initializing spell checkers
[junit4:junit4]   2> 14981 T3335 oass.DirectSolrSpellChecker.init init: {name=direct,classname=DirectSolrSpellChecker,field=lowerfilt,minQueryLength=3}
[junit4:junit4]   2> 15014 T3336 oasc.SolrCore.registerSearcher [collection1] Registered new searcher Searcher@cf4724b main{StandardDirectoryReader(segments_1:1)}
[junit4:junit4]   2> 15021 T3335 oasc.ZkController.publish publishing core=collection1 state=down
[junit4:junit4]   2> 15022 T3335 oasc.ZkController.publish numShards not found on descriptor - reading it from system property
[junit4:junit4]   2> 15841 T3270 oascc.ZkStateReader.updateClusterState Updating cloud state from ZooKeeper... 
[junit4:junit4]   2> 15844 T3270 oasc.Overseer$ClusterStateUpdater.updateState Update state numShards=2 message={
[junit4:junit4]   2> 	  "operation":"state",
[junit4:junit4]   2> 	  "numShards":"2",
[junit4:junit4]   2> 	  "shard":null,
[junit4:junit4]   2> 	  "roles":null,
[junit4:junit4]   2> 	  "state":"down",
[junit4:junit4]   2> 	  "core":"collection1",
[junit4:junit4]   2> 	  "collection":"collection1",
[junit4:junit4]   2> 	  "node_name":"127.0.0.1:50275__",
[junit4:junit4]   2> 	  "base_url":"http://127.0.0.1:50275/_"}
[junit4:junit4]   2> 15845 T3270 oasc.Overseer$ClusterStateUpdater.updateState Collection already exists with numShards=2
[junit4:junit4]   2> 15845 T3270 oasc.Overseer$ClusterStateUpdater.updateState Assigning new node to shard shard=shard2
[junit4:junit4]   2> 15859 T3334 oascc.ZkStateReader$2.process A cluster state change: WatchedEvent state:SyncConnected type:NodeDataChanged path:/clusterstate.json, has occurred - updating... (live nodes size: 5)
[junit4:junit4]   2> 15859 T3269 oascc.ZkStateReader$2.process A cluster state change: WatchedEvent state:SyncConnected type:NodeDataChanged path:/clusterstate.json, has occurred - updating... (live nodes size: 5)
[junit4:junit4]   2> 15860 T3275 oascc.ZkStateReader$2.process A cluster state change: WatchedEvent state:SyncConnected type:NodeDataChanged path:/clusterstate.json, has occurred - updating... (live nodes size: 5)
[junit4:junit4]   2> 15860 T3288 oascc.ZkStateReader$2.process A cluster state change: WatchedEvent state:SyncConnected type:NodeDataChanged path:/clusterstate.json, has occurred - updating... (live nodes size: 5)
[junit4:junit4]   2> 15859 T3318 oascc.ZkStateReader$2.process A cluster state change: WatchedEvent state:SyncConnected type:NodeDataChanged path:/clusterstate.json, has occurred - updating... (live nodes size: 5)
[junit4:junit4]   2> 15859 T3303 oascc.ZkStateReader$2.process A cluster state change: WatchedEvent state:SyncConnected type:NodeDataChanged path:/clusterstate.json, has occurred - updating... (live nodes size: 5)
[junit4:junit4]   2> 16024 T3335 oasc.CoreContainer.registerCore registering core: collection1
[junit4:junit4]   2> 16025 T3335 oasc.ZkController.register Register replica - core:collection1 address:http://127.0.0.1:50275/_ collection:collection1 shard:shard2
[junit4:junit4]   2> 16039 T3335 oasc.ZkController.register We are http://127.0.0.1:50275/_/collection1/ and leader is http://127.0.0.1:50268/_/collection1/
[junit4:junit4]   2> 16040 T3335 oasc.ZkController.register No LogReplay needed for core=collection1 baseURL=http://127.0.0.1:50275/_
[junit4:junit4]   2> 16041 T3335 oasc.ZkController.checkRecovery Core needs to recover:collection1
[junit4:junit4]   2> 16042 T3335 oasu.DefaultSolrCoreState.doRecovery Running recovery - first canceling any ongoing recovery
[junit4:junit4]   2> ASYNC  NEW_CORE C198 name=collection1 org.apache.solr.core.SolrCore@292e48db url=http://127.0.0.1:50275/_/collection1 node=127.0.0.1:50275__ C198_STATE=coll:collection1 core:collection1 props:{shard=null, roles=null, state=down, core=collection1, collection=collection1, node_name=127.0.0.1:50275__, base_url=http://127.0.0.1:50275/_}
[junit4:junit4]   2> 16044 T3337 C198 P50275 oasc.RecoveryStrategy.run Starting recovery process.  core=collection1 recoveringAfterStartup=true
[junit4:junit4]   2> 16047 T3337 C198 P50275 oasc.RecoveryStrategy.doRecovery ###### startupVersions=[]
[junit4:junit4]   2> 16047 T3335 oascc.ZkStateReader.updateClusterState Updating cloud state from ZooKeeper... 
[junit4:junit4]   2> 16048 T3337 C198 P50275 oasc.ZkController.publish publishing core=collection1 state=recovering
[junit4:junit4]   2> 16049 T3337 C198 P50275 oasc.ZkController.publish numShards not found on descriptor - reading it from system property
[junit4:junit4]   2> 16053 T3337 C198 P50275 oascsi.HttpClientUtil.createClient Creating new http client, config:maxConnections=128&maxConnectionsPerHost=32&followRedirects=false
[junit4:junit4]   2> 16052 T3247 oass.SolrDispatchFilter.init user.dir=/Users/jenkins/jenkins-slave/workspace/Lucene-Solr-trunk-MacOSX/solr/build/solr-core/test/J0
[junit4:junit4]   2> 16056 T3247 oass.SolrDispatchFilter.init SolrDispatchFilter.init() done
[junit4:junit4]   2> 16059 T3247 oascsi.HttpClientUtil.createClient Creating new http client, config:maxConnections=128&maxConnectionsPerHost=32&followRedirects=false
[junit4:junit4]   2> 16070 T3247 oascc.ZkStateReader.updateClusterState Updating cloud state from ZooKeeper... 
[junit4:junit4]   2> 16072 T3247 oasc.AbstractDistribZkTestBase.waitForRecoveriesToFinish Wait for recoveries to finish - collection: collection1 failOnTimeout:true timeout (sec):230
[junit4:junit4]   2> 16074 T3247 oascc.ZkStateReader.updateClusterState Updating cloud state from ZooKeeper... 
[junit4:junit4]   2>  C197_STATE=coll:collection1 core:collection1 props:{shard=shard1, roles=null, state=recovering, core=collection1, collection=collection1, node_name=127.0.0.1:50271__, base_url=http://127.0.0.1:50271/_}
[junit4:junit4]   2> 16622 T3321 C197 P50271 oasc.RecoveryStrategy.doRecovery Attempting to PeerSync from http://127.0.0.1:50265/_/collection1/ core=collection1 - recoveringAfterStartup=true
[junit4:junit4]   2> 16624 T3321 C197 P50271 oasu.PeerSync.sync PeerSync: core=collection1 url=http://127.0.0.1:50271/_ START replicas=[http://127.0.0.1:50265/_/collection1/] nUpdates=100
[junit4:junit4]   2> 16625 T3321 C197 P50271 oasu.PeerSync.sync WARNING no frame of reference to tell of we've missed updates
[junit4:junit4]   2> 16626 T3321 C197 P50271 oasc.RecoveryStrategy.doRecovery PeerSync Recovery was not successful - trying replication. core=collection1
[junit4:junit4]   2> 16626 T3321 C197 P50271 oasc.RecoveryStrategy.doRecovery Starting Replication Recovery. core=collection1
[junit4:junit4]   2> 16626 T3321 C197 P50271 oasc.RecoveryStrategy.doRecovery Begin buffering updates. core=collection1
[junit4:junit4]   2> 16627 T3321 C197 P50271 oasu.UpdateLog.bufferUpdates Starting to buffer updates. FSUpdateLog{state=ACTIVE, tlog=null}
[junit4:junit4]   2> 16627 T3321 C197 P50271 oasc.RecoveryStrategy.replicate Attempting to replicate from http://127.0.0.1:50265/_/collection1/. core=collection1
[junit4:junit4]   2> 16627 T3321 C197 P50271 oascsi.HttpClientUtil.createClient Creating new http client, config:maxConnections=128&maxConnectionsPerHost=32&followRedirects=false
[junit4:junit4]   2> ASYNC  NEW_CORE C199 name=collection1 org.apache.solr.core.SolrCore@c6a9b1a url=http://127.0.0.1:50265/_/collection1 node=127.0.0.1:50265__ C199_STATE=coll:collection1 core:collection1 props:{shard=shard1, roles=null, state=active, core=collection1, collection=collection1, node_name=127.0.0.1:50265__, base_url=http://127.0.0.1:50265/_, leader=true}
[junit4:junit4]   2> 16634 T3284 C199 P50265 REQ /get {getVersions=100&distrib=false&wt=javabin&qt=/get&version=2} status=0 QTime=1 
[junit4:junit4]   2> 16634 T3282 C199 P50265 oasu.DirectUpdateHandler2.commit start commit{,optimize=false,openSearcher=false,waitSearcher=true,expungeDeletes=false,softCommit=false}
[junit4:junit4]   2> 16635 T3282 C199 P50265 oasc.CachingDirectoryFactory.close Releasing directory:/Users/jenkins/jenkins-slave/workspace/Lucene-Solr-trunk-MacOSX/solr/build/solr-core/test/J0/./org.apache.solr.cloud.BasicDistributedZkTest-1359727154250/jetty1
[junit4:junit4]   2> 16638 T3282 C199 P50265 oasc.SolrDeletionPolicy.onInit SolrDeletionPolicy.onInit: commits:num=1
[junit4:junit4]   2> 		commit{dir=RateLimitedDirectoryWrapper(NRTCachingDirectory(org.apache.lucene.store.NIOFSDirectory@/Users/jenkins/jenkins-slave/workspace/Lucene-Solr-trunk-MacOSX/solr/build/solr-core/test/J0/org.apache.solr.cloud.BasicDistributedZkTest-1359727154250/jetty1/index lockFactory=org.apache.lucene.store.NativeFSLockFactory@13e9a5b3; maxCacheMB=48.0 maxMergeSizeMB=4.0)),segFN=segments_1,generation=1,filenames=[segments_1]
[junit4:junit4]   2> 16639 T3282 C199 P50265 oasc.SolrDeletionPolicy.updateCommits newest commit = 1[segments_1]
[junit4:junit4]   2> 16642 T3282 C199 P50265 oasc.SolrDeletionPolicy.onCommit SolrDeletionPolicy.onCommit: commits:num=2
[junit4:junit4]   2> 		commit{dir=RateLimitedDirectoryWrapper(NRTCachingDirectory(org.apache.lucene.store.NIOFSDirectory@/Users/jenkins/jenkins-slave/workspace/Lucene-Solr-trunk-MacOSX/solr/build/solr-core/test/J0/org.apache.solr.cloud.BasicDistributedZkTest-1359727154250/jetty1/index lockFactory=org.apache.lucene.store.NativeFSLockFactory@13e9a5b3; maxCacheMB=48.0 maxMergeSizeMB=4.0)),segFN=segments_1,generation=1,filenames=[segments_1]
[junit4:junit4]   2> 		commit{dir=RateLimitedDirectoryWrapper(NRTCachingDirectory(org.apache.lucene.store.NIOFSDirectory@/Users/jenkins/jenkins-slave/workspace/Lucene-Solr-trunk-MacOSX/solr/build/solr-core/test/J0/org.apache.solr.cloud.BasicDistributedZkTest-1359727154250/jetty1/index lockFactory=org.apache.lucene.store.NativeFSLockFactory@13e9a5b3; maxCacheMB=48.0 maxMergeSizeMB=4.0)),segFN=segments_2,generation=2,filenames=[segments_2]
[junit4:junit4]   2> 16642 T3282 C199 P50265 oasc.SolrDeletionPolicy.updateCommits newest commit = 2[segments_2]
[junit4:junit4]   2> 16643 T3282 C199 P50265 oasc.CachingDirectoryFactory.close Releasing directory:/Users/jenkins/jenkins-slave/workspace/Lucene-Solr-trunk-MacOSX/solr/build/solr-core/test/J0/./org.apache.solr.cloud.BasicDistributedZkTest-1359727154250/jetty1
[junit4:junit4]   2> 16644 T3282 C199 P50265 oass.SolrIndexSearcher.<init> Opening Searcher@272a8f9 realtime
[junit4:junit4]   2> 16645 T3282 C199 P50265 oasu.DirectUpdateHandler2.commit end_commit_flush
[junit4:junit4]   2> 16646 T3282 C199 P50265 /update {waitSearcher=true&openSearcher=false&commit=true&wt=javabin&commit_end_point=true&version=2&softCommit=false} {commit=} 0 12
[junit4:junit4]   2> 16648 T3321 C197 P50271 oash.ReplicationHandler.inform Commits will be reserved for  10000
[junit4:junit4]   2> 16648 T3321 C197 P50271 oash.SnapPuller.<init>  No value set for 'pollInterval'. Timer Task not started.
[junit4:junit4]   2> 16651 T3279 C199 P50265 oash.ReplicationHandler.inform Commits will be reserved for  10000
[junit4:junit4]   2> 16652 T3279 C199 P50265 REQ /replication {command=indexversion&qt=/replication&wt=javabin&version=2} status=0 QTime=2 
[junit4:junit4]   2> 16653 T3321 C197 P50271 oash.SnapPuller.fetchLatestIndex Master's generation: 2
[junit4:junit4]   2> 16653 T3321 C197 P50271 oash.SnapPuller.fetchLatestIndex Slave's generation: 1
[junit4:junit4]   2> 16653 T3321 C197 P50271 oash.SnapPuller.fetchLatestIndex Starting replication process
[junit4:junit4]   2> 16656 T3280 C199 P50265 oasc.CachingDirectoryFactory.close Releasing directory:/Users/jenkins/jenkins-slave/workspace/Lucene-Solr-trunk-MacOSX/solr/build/solr-core/test/J0/./org.apache.solr.cloud.BasicDistributedZkTest-1359727154250/jetty1
[junit4:junit4]   2> 16657 T3280 C199 P50265 oasc.CachingDirectoryFactory.close Releasing directory:/Users/jenkins/jenkins-slave/workspace/Lucene-Solr-trunk-MacOSX/solr/build/solr-core/test/J0/./org.apache.solr.cloud.BasicDistributedZkTest-1359727154250/jetty1/index
[junit4:junit4]   2> 16657 T3280 C199 P50265 REQ /replication {command=filelist&qt=/replication&wt=javabin&generation=2&version=2} status=0 QTime=1 
[junit4:junit4]   2> 16658 T3321 C197 P50271 oash.SnapPuller.fetchLatestIndex Number of files in latest index in master: 1
[junit4:junit4]   2> 16659 T3321 C197 P50271 oasc.CachingDirectoryFactory.get return new directory for /Users/jenkins/jenkins-slave/workspace/Lucene-Solr-trunk-MacOSX/solr/build/solr-core/test/J0/./org.apache.solr.cloud.BasicDistributedZkTest-1359727154250/jetty3/index.20130201095930900 forceNew:false
[junit4:junit4]   2> 16659 T3321 C197 P50271 oasc.CachingDirectoryFactory.close Releasing directory:/Users/jenkins/jenkins-slave/workspace/Lucene-Solr-trunk-MacOSX/solr/build/solr-core/test/J0/./org.apache.solr.cloud.BasicDistributedZkTest-1359727154250/jetty3
[junit4:junit4]   2> 16660 T3321 C197 P50271 oash.SnapPuller.fetchLatestIndex Starting download to RateLimitedDirectoryWrapper(NRTCachingDirectory(org.apache.lucene.store.NIOFSDirectory@/Users/jenkins/jenkins-slave/workspace/Lucene-Solr-trunk-MacOSX/solr/build/solr-core/test/J0/org.apache.solr.cloud.BasicDistributedZkTest-1359727154250/jetty3/index.20130201095930900 lockFactory=org.apache.lucene.store.NativeFSLockFactory@7ee72fa; maxCacheMB=48.0 maxMergeSizeMB=4.0)) fullCopy=true
[junit4:junit4]   2> 16662 T3281 C199 P50265 REQ /replication {file=segments_2&command=filecontent&checksum=true&wt=filestream&qt=/replication&generation=2} status=0 QTime=0 
[junit4:junit4]   2> 16665 T3321 C197 P50271 oasc.CachingDirectoryFactory.close Releasing directory:/Users/jenkins/jenkins-slave/workspace/Lucene-Solr-trunk-MacOSX/solr/build/solr-core/test/J0/./org.apache.solr.cloud.BasicDistributedZkTest-1359727154250/jetty3/index
[junit4:junit4]   2> 16665 T3321 C197 P50271 oash.SnapPuller.fetchLatestIndex Total time taken for download : 0 secs
[junit4:junit4]   2> 16665 T3321 C197 P50271 oash.SnapPuller.modifyIndexProps New index installed. Updating index properties... index=index.20130201095930900
[junit4:junit4]   2> 16667 T3321 C197 P50271 oasc.CachingDirectoryFactory.close Releasing directory:/Users/jenkins/jenkins-slave/workspace/Lucene-Solr-trunk-MacOSX/solr/build/solr-core/test/J0/./org.apache.solr.cloud.BasicDistributedZkTest-1359727154250/jetty3
[junit4:junit4]   2> 16667 T3321 C197 P50271 oasc.CachingDirectoryFactory.close Releasing directory:/Users/jenkins/jenkins-slave/workspace/Lucene-Solr-trunk-MacOSX/solr/build/solr-core/test/J0/./org.apache.solr.cloud.BasicDistributedZkTest-1359727154250/jetty3
[junit4:junit4]   2> 16668 T3321 C197 P50271 oasc.SolrCore.getNewIndexDir New index directory detected: old=./org.apache.solr.cloud.BasicDistributedZkTest-1359727154250/jetty3/index/ new=./org.apache.solr.cloud.BasicDistributedZkTest-1359727154250/jetty3/index.20130201095930900
[junit4:junit4]   2> 16670 T3321 C197 P50271 oasc.SolrDeletionPolicy.onInit SolrDeletionPolicy.onInit: commits:num=1
[junit4:junit4]   2> 		commit{dir=RateLimitedDirectoryWrapper(NRTCachingDirectory(org.apache.lucene.store.NIOFSDirectory@/Users/jenkins/jenkins-slave/workspace/Lucene-Solr-trunk-MacOSX/solr/build/solr-core/test/J0/org.apache.solr.cloud.BasicDistributedZkTest-1359727154250/jetty3/index.20130201095930900 lockFactory=org.apache.lucene.store.NativeFSLockFactory@7ee72fa; maxCacheMB=48.0 maxMergeSizeMB=4.0)),segFN=segments_2,generation=2,filenames=[segments_2]
[junit4:junit4]   2> 16671 T3321 C197 P50271 oasc.SolrDeletionPolicy.updateCommits newest commit = 2[segments_2]
[junit4:junit4]   2> 16673 T3321 C197 P50271 oasc.CachingDirectoryFactory.close Releasing directory:/Users/jenkins/jenkins-slave/workspace/Lucene-Solr-trunk-MacOSX/solr/build/solr-core/test/J0/./org.apache.solr.cloud.BasicDistributedZkTest-1359727154250/jetty3
[junit4:junit4]   2> 16673 T3321 C197 P50271 oasu.DefaultSolrCoreState.newIndexWriter Creating new IndexWriter...
[junit4:junit4]   2> 16673 T3321 C197 P50271 oasu.DefaultSolrCoreState.newIndexWriter Waiting until IndexWriter is unused... core=collection1
[junit4:junit4]   2> 16673 T3321 C197 P50271 oasu.DefaultSolrCoreState.newIndexWriter Rollback old IndexWriter... core=collection1
[junit4:junit4]   2> 16674 T3321 C197 P50271 oasc.CachingDirectoryFactory.close Releasing directory:/Users/jenkins/jenkins-slave/workspace/Lucene-Solr-trunk-MacOSX/solr/build/solr-core/test/J0/./org.apache.solr.cloud.BasicDistributedZkTest-1359727154250/jetty3/index.20130201095930900
[junit4:junit4]   2> 16675 T3321 C197 P50271 oasc.CachingDirectoryFactory.close Releasing directory:/Users/jenkins/jenkins-slave/workspace/Lucene-Solr-trunk-MacOSX/solr/build/solr-core/test/J0/./org.apache.solr.cloud.BasicDistributedZkTest-1359727154250/jetty3
[junit4:junit4]   2> 16678 T3321 C197 P50271 oasc.SolrDeletionPolicy.onInit SolrDeletionPolicy.onInit: commits:num=1
[junit4:junit4]   2> 		commit{dir=RateLimitedDirectoryWrapper(NRTCachingDirectory(org.apache.lucene.store.NIOFSDirectory@/Users/jenkins/jenkins-slave/workspace/Lucene-Solr-trunk-MacOSX/solr/build/solr-core/test/J0/org.apache.solr.cloud.BasicDistributedZkTest-1359727154250/jetty3/index.20130201095930900 lockFactory=org.apache.lucene.store.NativeFSLockFactory@7ee72fa; maxCacheMB=48.0 maxMergeSizeMB=4.0)),segFN=segments_2,generation=2,filenames=[segments_2]
[junit4:junit4]   2> 16678 T3321 C197 P50271 oasc.SolrDeletionPolicy.updateCommits newest commit = 2[segments_2]
[junit4:junit4]   2> 16678 T3321 C197 P50271 oasu.DefaultSolrCoreState.newIndexWriter New IndexWriter is ready to be used.
[junit4:junit4]   2> 16679 T3321 C197 P50271 oasc.CachingDirectoryFactory.close Releasing directory:/Users/jenkins/jenkins-slave/workspace/Lucene-Solr-trunk-MacOSX/solr/build/solr-core/test/J0/./org.apache.solr.cloud.BasicDistributedZkTest-1359727154250/jetty3
[junit4:junit4]   2> 16679 T3321 C197 P50271 oass.SolrIndexSearcher.<init> Opening Searcher@695adaaf main
[junit4:junit4]   2> 16681 T3320 oasc.SolrCore.registerSearcher [collection1] Registered new searcher Searcher@695adaaf main{StandardDirectoryReader(segments_2:1:nrt)}
[junit4:junit4]   2> 16681 T3320 oasc.CachingDirectoryFactory.close Releasing directory:/Users/jenkins/jenkins-slave/workspace/Lucene-Solr-trunk-MacOSX/solr/build/solr-core/test/J0/./org.apache.solr.cloud.BasicDistributedZkTest-1359727154250/jetty3/index
[junit4:junit4]   2> 16681 T3321 C197 P50271 oasu.DirectUpdateHandler2.commit start commit{,optimize=false,openSearcher=false,waitSearcher=false,expungeDeletes=false,softCommit=false}
[junit4:junit4]   2> 16684 T3321 C197 P50271 oasc.SolrDeletionPolicy.onCommit SolrDeletionPolicy.onCommit: commits:num=2
[junit4:junit4]   2> 		commit{dir=RateLimitedDirectoryWrapper(NRTCachingDirectory(org.apache.lucene.store.NIOFSDirectory@/Users/jenkins/jenkins-slave/workspace/Lucene-Solr-trunk-MacOSX/solr/build/solr-core/test/J0/org.apache.solr.cloud.BasicDistributedZkTest-1359727154250/jetty3/index.20130201095930900 lockFactory=org.apache.lucene.store.NativeFSLockFactory@7ee72fa; maxCacheMB=48.0 maxMergeSizeMB=4.0)),segFN=segments_2,generation=2,filenames=[segments_2]
[junit4:junit4]   2> 		commit{dir=RateLimitedDirectoryWrapper(NRTCachingDirectory(org.apache.lucene.store.NIOFSDirectory@/Users/jenkins/jenkins-slave/workspace/Lucene-Solr-trunk-MacOSX/solr/build/solr-core/test/J0/org.apache.solr.cloud.BasicDistributedZkTest-1359727154250/jetty3/index.20130201095930900 lockFactory=org.apache.lucene.store.NativeFSLockFactory@7ee72fa; maxCacheMB=48.0 maxMergeSizeMB=4.0)),segFN=segments_3,generation=3,filenames=[segments_3]
[junit4:junit4]   2> 16685 T3321 C197 P50271 oasc.SolrDeletionPolicy.updateCommits newest commit = 3[segments_3]
[junit4:junit4]   2> 16686 T3321 C197 P50271 oasc.CachingDirectoryFactory.close Releasing directory:/Users/jenkins/jenkins-slave/workspace/Lucene-Solr-trunk-MacOSX/solr/build/solr-core/test/J0/./org.apache.solr.cloud.BasicDistributedZkTest-1359727154250/jetty3
[junit4:junit4]   2> 16686 T3321 C197 P50271 oasu.DirectUpdateHandler2.commit end_commit_flush
[junit4:junit4]   2> 16686 T3321 C197 P50271 oasc.CachingDirectoryFactory.close Releasing directory:/Users/jenkins/jenkins-slave/workspace/Lucene-Solr-trunk-MacOSX/solr/build/solr-core/test/J0/./org.apache.solr.cloud.BasicDistributedZkTest-1359727154250/jetty3/index.20130201095930900
[junit4:junit4]   2> 16686 T3321 C197 P50271 oasc.CachingDirectoryFactory.close Releasing directory:/Users/jenkins/jenkins-slave/workspace/Lucene-Solr-trunk-MacOSX/solr/build/solr-core/test/J0/./org.apache.solr.cloud.BasicDistributedZkTest-1359727154250/jetty3/index
[junit4:junit4]   2> 16687 T3321 C197 P50271 oasc.RecoveryStrategy.replay No replay needed. core=collection1
[junit4:junit4]   2> 16687 T3321 C197 P50271 oasc.RecoveryStrategy.doRecovery Replication Recovery was successful - registering as Active. core=collection1
[junit4:junit4]   2> 16687 T3321 C197 P50271 oasc.ZkController.publish publishing core=collection1 state=active
[junit4:junit4]   2> 16687 T3321 C197 P50271 oasc.ZkController.publish numShards not found on descriptor - reading it from system property
[junit4:junit4]   2> 16689 T3321 C197 P50271 oasc.RecoveryStrategy.doRecovery Finished recovery process. core=collection1
[junit4:junit4]   2> 17084 T3247 oascc.ZkStateReader.updateClusterState Updating cloud state from ZooKeeper... 
[junit4:junit4]   2> 17380 T3270 oascc.ZkStateReader.updateClusterState Updating cloud state from ZooKeeper... 
[junit4:junit4]   2> 17382 T3270 oasc.Overseer$ClusterStateUpdater.updateState Update state numShards=2 message={
[junit4:junit4]   2> 	  "operation":"state",
[junit4:junit4]   2> 	  "numShards":"2",
[junit4:junit4]   2> 	  "shard":"shard2",
[junit4:junit4]   2> 	  "roles":null,
[junit4:junit4]   2> 	  "state":"recovering",
[junit4:junit4]   2> 	  "core":"collection1",
[junit4:junit4]   2> 	  "collection":"collection1",
[junit4:junit4]   2> 	  "node_name":"127.0.0.1:50275__",
[junit4:junit4]   2> 	  "base_url":"http://127.0.0.1:50275/_"}
[junit4:junit4]   2> 17390 T3270 oasc.Overseer$ClusterStateUpdater.updateState Update state numShards=2 message={
[junit4:junit4]   2> 	  "operation":"state",
[junit4:junit4]   2> 	  "numShards":"2",
[junit4:junit4]   2> 	  "shard":"shard1",
[junit4:junit4]   2> 	  "roles":null,
[junit4:junit4]   2> 	  "state":"active",
[junit4:junit4]   2> 	  "core":"collection1",
[junit4:junit4]   2> 	  "collection":"collection1",
[junit4:junit4]   2> 	  "node_name":"127.0.0.1:50271__",
[junit4:junit4]   2> 	  "base_url":"http://127.0.0.1:50271/_"}
[junit4:junit4]   2> 17397 T3334 oascc.ZkStateReader$2.process A cluster state change: WatchedEvent state:SyncConnected type:NodeDataChanged path:/clusterstate.json, has occurred - updating... (live nodes size: 5)
[junit4:junit4]   2> 17397 T3318 oascc.ZkStateReader$2.process A cluster state change: WatchedEvent state:SyncConnected type:NodeDataChanged path:/clusterstate.json, has occurred - updating... (live nodes size: 5)
[junit4:junit4]   2> 17397 T3269 oascc.ZkStateReader$2.process A cluster state change: WatchedEvent state:SyncConnected type:NodeDataChanged path:/clusterstate.json, has occurred - updating... (live nodes size: 5)
[junit4:junit4]   2> 17398 T3288 oascc.ZkStateReader$2.process A cluster state change: WatchedEvent state:SyncConnected type:NodeDataChanged path:/clusterstate.json, has occurred - updating... (live nodes size: 5)
[junit4:junit4]   2> 17398 T3275 oascc.ZkStateReader$2.process A cluster state change: WatchedEvent state:SyncConnected type:NodeDataChanged path:/clusterstate.json, has occurred - updating... (live nodes size: 5)
[junit4:junit4]   2> 17398 T3303 oascc.ZkStateReader$2.process A cluster state change: WatchedEvent state:SyncConnected type:NodeDataChanged path:/clusterstate.json, has occurred - updating... (live nodes size: 5)
[junit4:junit4]   2> 18088 T3247 oascc.ZkStateReader.updateClusterState Updating cloud state from ZooKeeper... 
[junit4:junit4]   2> 19094 T3247 oascc.ZkStateReader.updateClusterState Updating cloud state from ZooKeeper... 
[junit4:junit4]   2>  C198_STATE=coll:collection1 core:collection1 props:{shard=shard2, roles=null, state=recovering, core=collection1, collection=collection1, node_name=127.0.0.1:50275__, base_url=http://127.0.0.1:50275/_}
[junit4:junit4]   2> 20078 T3337 C198 P50275 oasc.RecoveryStrategy.doRecovery Attempting to PeerSync from http://127.0.0.1:50268/_/collection1/ core=collection1 - recoveringAfterStartup=true
[junit4:junit4]   2> 20079 T3337 C198 P50275 oasu.PeerSync.sync PeerSync: core=collection1 url=http://127.0.0.1:50275/_ START replicas=[http://127.0.0.1:50268/_/collection1/] nUpdates=100
[junit4:junit4]   2> 20080 T3337 C198 P50275 oasu.PeerSync.sync WARNING no frame of reference to tell of we've missed updates
[junit4:junit4]   2> 20081 T3337 C198 P50275 oasc.RecoveryStrategy.doRecovery PeerSync Recovery was not successful - trying replication. core=collection1
[junit4:junit4]   2> 20082 T3337 C198 P50275 oasc.RecoveryStrategy.doRecovery Starting Replication Recovery. core=collection1
[junit4:junit4]   2> 20082 T3337 C198 P50275 oasc.RecoveryStrategy.doRecovery Begin buffering updates. core=collection1
[junit4:junit4]   2> 20083 T3337 C198 P50275 oasu.UpdateLog.bufferUpdates Starting to buffer updates. FSUpdateLog{state=ACTIVE, tlog=null}
[junit4:junit4]   2> 20085 T3337 C198 P50275 oasc.RecoveryStrategy.replicate Attempting to replicate from http://127.0.0.1:50268/_/collection1/. core=collection1
[junit4:junit4]   2> 20086 T3337 C198 P50275 oascsi.HttpClientUtil.createClient Creating new http client, config:maxConnections=128&maxConnectionsPerHost=32&followRedirects=false
[junit4:junit4]   2> 20107 T3247 oascc.ZkStateReader.updateClusterState Updating cloud state from ZooKeeper... 
[junit4:junit4]   2> ASYNC  NEW_CORE C200 name=collection1 org.apache.solr.core.SolrCore@73b2b526 url=http://127.0.0.1:50268/_/collection1 node=127.0.0.1:50268__ C200_STATE=coll:collection1 core:collection1 props:{shard=shard2, roles=null, state=active, core=collection1, collection=collection1, node_name=127.0.0.1:50268__, base_url=http://127.0.0.1:50268/_, leader=true}
[junit4:junit4]   2> 20108 T3295 C200 P50268 REQ /get {getVersions=100&distrib=false&wt=javabin&qt=/get&version=2} status=0 QTime=1 
[junit4:junit4]   2> 20110 T3294 C200 P50268 oasu.DirectUpdateHandler2.commit start commit{,optimize=false,openSearcher=false,waitSearcher=true,expungeDeletes=false,softCommit=false}
[junit4:junit4]   2> 20111 T3294 C200 P50268 oasc.CachingDirectoryFactory.close Releasing directory:/Users/jenkins/jenkins-slave/workspace/Lucene-Solr-trunk-MacOSX/solr/build/solr-core/test/J0/./org.apache.solr.cloud.BasicDistributedZkTest-1359727154250/jetty2
[junit4:junit4]   2> 20114 T3294 C200 P50268 oasc.SolrDeletionPolicy.onInit SolrDeletionPolicy.onInit: commits:num=1
[junit4:junit4]   2> 		commit{dir=RateLimitedDirectoryWrapper(NRTCachingDirectory(org.apache.lucene.store.NIOFSDirectory@/Users/jenkins/jenkins-slave/workspace/Lucene-Solr-trunk-MacOSX/solr/build/solr-core/test/J0/org.apache.solr.cloud.BasicDistributedZkTest-1359727154250/jetty2/index lockFactory=org.apache.lucene.store.NativeFSLockFactory@327352a6; maxCacheMB=48.0 maxMergeSizeMB=4.0)),segFN=segments_1,generation=1,filenames=[segments_1]
[junit4:junit4]   2> 20115 T3294 C200 P50268 oasc.SolrDeletionPolicy.updateCommits newest commit = 1[segments_1]
[junit4:junit4]   2> 20117 T3294 C200 P50268 oasc.SolrDeletionPolicy.onCommit SolrDeletionPolicy.onCommit: commits:num=2
[junit4:junit4]   2> 		commit{dir=RateLimitedDirectoryWrapper(NRTCachingDirectory(org.apache.lucene.store.NIOFSDirectory@/Users/jenkins/jenkins-slave/workspace/Lucene-Solr-trunk-MacOSX/solr/build/solr-core/test/J0/org.apache.solr.cloud.BasicDistributedZkTest-1359727154250/jetty2/index lockFactory=org.apache.lucene.store.NativeFSLockFactory@327352a6; maxCacheMB=48.0 maxMergeSizeMB=4.0)),segFN=segments_1,generation=1,filenames=[segments_1]
[junit4:junit4]   2> 		commit{dir=RateLimitedDirectoryWrapper(NRTCachingDirectory(org.apache.lucene.store.NIOFSDirectory@/Users/jenkins/jenkins-slave/workspace/Lucene-Solr-trunk-MacOSX/solr/build/solr-core/test/J0/org.apache.solr.cloud.BasicDistributedZkTest-1359727154250/jetty2/index lockFactory=org.apache.lucene.store.NativeFSLockFactory@327352a6; maxCacheMB=48.0 maxMergeSizeMB=4.0)),segFN=segments_2,generation=2,filenames=[segments_2]
[junit4:junit4]   2> 20118 T3294 C200 P50268 oasc.SolrDeletionPolicy.updateCommits newest commit = 2[segments_2]
[junit4:junit4]   2> 20119 T3294 C200 P50268 oasc.CachingDirectoryFactory.close Releasing directory:/Users/jenkins/jenkins-slave/workspace/Lucene-Solr-trunk-MacOSX/solr/build/solr-core/test/J0/./org.apache.solr.cloud.BasicDistributedZkTest-1359727154250/jetty2
[junit4:junit4]   2> 20119 T3294 C200 P50268 oass.SolrIndexSearcher.<init> Opening Searcher@24e73119 realtime
[junit4:junit4]   2> 20120 T3294 C200 P50268 oasu.DirectUpdateHandler2.commit end_commit_flush
[junit4:junit4]   2> 20120 T3294 C200 P50268 /update {waitSearcher=true&openSearcher=false&commit=true&wt=javabin&commit_end_point=true&version=2&softCommit=false} {commit=} 0 10
[junit4:junit4]   2> 20122 T3337 C198 P50275 oash.ReplicationHandler.inform Commits will be reserved for  10000
[junit4:junit4]   2> 20122 T3337 C198 P50275 oash.SnapPuller.<init>  No value set for 'pollInterval'. Timer Task not started.
[junit4:junit4]   2> 20125 T3298 C200 P50268 oash.ReplicationHandler.inform Commits will be reserved for  10000
[junit4:junit4]   2> 20125 T3298 C200 P50268 REQ /replication {command=indexversion&qt=/replication&wt=javabin&version=2} status=0 QTime=1 
[junit4:junit4]   2> 20126 T3337 C198 P50275 oash.SnapPuller.fetchLatestIndex Master's generation: 2
[junit4:junit4]   2> 20126 T3337 C198 P50275 oash.SnapPuller.fetchLatestIndex Slave's generation: 1
[junit4:junit4]   2> 20126 T3337 C198 P50275 oash.SnapPuller.fetchLatestIndex Starting replication process
[junit4:junit4]   2> 20128 T3299 C200 P50268 oasc.CachingDirectoryFactory.close Releasing directory:/Users/jenkins/jenkins-slave/workspace/Lucene-Solr-trunk-MacOSX/solr/build/solr-core/test/J0/./org.apache.solr.cloud.BasicDistributedZkTest-1359727154250/jetty2
[junit4:junit4]   2> 20129 T3299 C200 P50268 oasc.CachingDirectoryFactory.close Releasing directory:/Users/jenkins/jenkins-slave/workspace/Lucene-Solr-trunk-MacOSX/solr/build/solr-core/test/J0/./org.apache.solr.cloud.BasicDistributedZkTest-1359727154250/jetty2/index
[junit4:junit4]   2> 20130 T3299 C200 P50268 REQ /replication {command=filelist&qt=/replication&wt=javabin&generation=2&version=2} status=0 QTime=2 
[junit4:junit4]   2> 20130 T3337 C198 P50275 oash.SnapPuller.fetchLatestIndex Number of files in latest index in master: 1
[junit4:junit4]   2> 20131 T3337 C198 P50275 oasc.CachingDirectoryFactory.get return new directory for /Users/jenkins/jenkins-slave/workspace/Lucene-Solr-trunk-MacOSX/solr/build/solr-core/test/J0/./org.apache.solr.cloud.BasicDistributedZkTest-1359727154250/jetty4/index.20130201095934373 forceNew:false
[junit4:junit4]   2> 20132 T3337 C198 P50275 oasc.CachingDirectoryFactory.close Releasing directory:/Users/jenkins/jenkins-slave/workspace/Lucene-Solr-trunk-MacOSX/solr/build/solr-core/test/J0/./org.apache.solr.cloud.BasicDistributedZkTest-1359727154250/jetty4
[junit4:junit4]   2> 20132 T3337 C198 P50275 oash.SnapPuller.fetchLatestIndex Starting download to RateLimitedDirectoryWrapper(NRTCachingDirectory(org.apache.lucene.store.NIOFSDirectory@/Users/jenkins/jenkins-slave/workspace/Lucene-Solr-trunk-MacOSX/solr/build/solr-core/test/J0/org.apache.solr.cloud.BasicDistributedZkTest-1359727154250/jetty4/index.20130201095934373 lockFactory=org.apache.lucene.store.NativeFSLockFactory@6bd0619e; maxCacheMB=48.0 maxMergeSizeMB=4.0)) fullCopy=true
[junit4:junit4]   2> 20136 T3295 C200 P50268 REQ /replication {file=segments_2&command=filecontent&checksum=true&wt=filestream&qt=/replication&generation=2} status=0 QTime=1 
[junit4:junit4]   2> 20137 T3337 C198 P50275 oasc.CachingDirectoryFactory.close Releasing directory:/Users/jenkins/jenkins-slave/workspace/Lucene-Solr-trunk-MacOSX/solr/build/solr-core/test/J0/./org.apache.solr.cloud.BasicDistributedZkTest-1359727154250/jetty4/index
[junit4:junit4]   2> 20138 T3337 C198 P50275 oash.SnapPuller.fetchLatestIndex Total time taken for download : 0 secs
[junit4:junit4]   2> 20138 T3337 C198 P50275 oash.SnapPuller.modifyIndexProps New index installed. Updating index properties... index=index.20130201095934373
[junit4:junit4]   2> 20139 T3337 C198 P50275 oasc.CachingDirectoryFactory.close Releasing directory:/Users/jenkins/jenkins-slave/workspace/Lucene-Solr-trunk-MacOSX/solr/build/solr-core/test/J0/./org.apache.solr.cloud.BasicDistributedZkTest-1359727154250/jetty4
[junit4:junit4]   2> 20140 T3337 C198 P50275 oasc.CachingDirectoryFactory.close Releasing directory:/Users/jenkins/jenkins-slave/workspace/Lucene-Solr-trunk-MacOSX/solr/build/solr-core/test/J0/./org.apache.solr.cloud.BasicDistributedZkTest-1359727154250/jetty4
[junit4:junit4]   2> 20140 T3337 C198 P50275 oasc.SolrCore.getNewIndexDir New index directory detected: old=./org.apache.solr.cloud.BasicDistributedZkTest-1359727154250/jetty4/index/ new=./org.apache.solr.cloud.BasicDistributedZkTest-1359727154250/jetty4/index.20130201095934373
[junit4:junit4]   2> 20143 T3337 C198 P50275 oasc.SolrDeletionPolicy.onInit SolrDeletionPolicy.onInit: commits:num=1
[junit4:junit4]   2> 		commit{dir=RateLimitedDirectoryWrapper(NRTCachingDirectory(org.apache.lucene.store.NIOFSDirectory@/Users/jenkins/jenkins-slave/workspace/Lucene-Solr-trunk-MacOSX/solr/build/solr-core/test/J0/org.apache.solr.cloud.BasicDistributedZkTest-1359727154250/jetty4/index.20130201095934373 lockFactory=org.apache.lucene.store.NativeFSLockFactory@6bd0619e; maxCacheMB=48.0 maxMergeSizeMB=4.0)),segFN=segments_2,generation=2,filenames=[segments_2]
[junit4:junit4]   2> 20144 T3337 C198 P50275 oasc.SolrDeletionPolicy.updateCommits newest commit = 2[segments_2]
[junit4:junit4]   2> 20145 T3337 C198 P50275 oasc.CachingDirectoryFactory.close Releasing directory:/Users/jenkins/jenkins-slave/workspace/Lucene-Solr-trunk-MacOSX/solr/build/solr-core/test/J0/./org.apache.solr.cloud.BasicDistributedZkTest-1359727154250/jetty4
[junit4:junit4]   2> 20145 T3337 C198 P50275 oasu.DefaultSolrCoreState.newIndexWriter Creating new IndexWriter...
[junit4:junit4]   2> 20145 T3337 C198 P50275 oasu.DefaultSolrCoreState.newIndexWriter Waiting until IndexWriter is unused... core=collection1
[junit4:junit4]   2> 20146 T3337 C198 P50275 oasu.DefaultSolrCoreState.newIndexWriter Rollback old IndexWriter... core=collection1
[junit4:junit4]   2> 20146 T3337 C198 P50275 oasc.CachingDirectoryFactory.close Releasing directory:/Users/jenkins/jenkins-slave/workspace/Lucene-Solr-trunk-MacOSX/solr/build/solr-core/test/J0/./org.apache.solr.cloud.BasicDistributedZkTest-1359727154250/jetty4/index.20130201095934373
[junit4:junit4]   2> 20147 T3337 C198 P50275 oasc.CachingDirectoryFactory.close Releasing directory:/Users/jenkins/jenkins-slave/workspace/Lucene-Solr-trunk-MacOSX/solr/build/solr-core/test/J0/./org.apache.solr.cloud.BasicDistributedZkTest-1359727154250/jetty4
[junit4:junit4]   2> 20149 T3337 C198 P50275 oasc.SolrDeletionPolicy.onInit SolrDeletionPolicy.onInit: commits:num=1
[junit4:junit4]   2> 		commit{dir=RateLimitedDirectoryWrapper(NRTCachingDirectory(org.apache.lucene.store.NIOFSDirectory@/Users/jenkins/jenkins-slave/workspace/Lucene-Solr-trunk-MacOSX/solr/build/solr-core/test/J0/org.apache.solr.cloud.BasicDistributedZkTest-1359727154250/jetty4/index.20130201095934373 lockFactory=org.apache.lucene.store.NativeFSLockFactory@6bd0619e; maxCacheMB=48.0 maxMergeSizeMB=4.0)),segFN=segments_2,generation=2,filenames=[segments_2]
[junit4:junit4]   2> 20150 T3337 C198 P50275 oasc.SolrDeletionPolicy.updateCommits newest commit = 2[segments_2]
[junit4:junit4]   2> 20150 T3337 C198 P50275 oasu.DefaultSolrCoreState.newIndexWriter New IndexWriter is ready to be used.
[junit4:junit4]   2> 20151 T3337 C198 P50275 oasc.CachingDirectoryFactory.close Releasing directory:/Users/jenkins/jenkins-slave/workspace/Lucene-Solr-trunk-MacOSX/solr/build/solr-core/test/J0/./org.apache.solr.cloud.BasicDistributedZkTest-1359727154250/jetty4
[junit4:junit4]   2> 20151 T3337 C198 P50275 oass.SolrIndexSearcher.<init> Opening Searcher@1648186f main
[junit4:junit4]   2> 20153 T3336 oasc.SolrCore.registerSearcher [collection1] Registered new searcher Searcher@1648186f main{StandardDirectoryReader(segments_2:1:nrt)}
[junit4:junit4]   2> 20154 T3336 oasc.CachingDirectoryFactory.close Releasing directory:/Users/jenkins/jenkins-slave/workspace/Lucene-Solr-trunk-MacOSX/solr/build/solr-core/test/J0/./org.apache.solr.cloud.BasicDistributedZkTest-1359727154250/jetty4/index
[junit4:junit4]   2> 20154 T3337 C198 P50275 oasu.DirectUpdateHandler2.commit start commit{,optimize=false,openSearcher=false,waitSearcher=false,expungeDeletes=false,softCommit=false}
[junit4:junit4]   2> 20156 T3337 C198 P50275 oasc.SolrDeletionPolicy.onCommit SolrDeletionPolicy.onCommit: commits:num=2
[junit4:junit4]   2> 		commit{dir=RateLimitedDirectoryWrapper(NRTCachingDirectory(org.apache.lucene.store.NIOFSDirectory@/Users/jenkins/jenkins-slave/workspace/Lucene-Solr-trunk-MacOSX/solr/build/solr-core/test/J0/org.apache.solr.cloud.BasicDistributedZkTest-1359727154250/jetty4/index.20130201095934373 lockFactory=org.apache.lucene.store.NativeFSLockFactory@6bd0619e; maxCacheMB=48.0 maxMergeSizeMB=4.0)),segFN=segments_2,generation=2,filenames=[segments_2]
[junit4:junit4]   2> 		commit{dir=RateLimitedDirectoryWrapper(NRTCachingDirectory(org.apache.lucene.store.NIOFSDirectory@/Users/jenkins/jenkins-slave/workspace/Lucene-Solr-trunk-MacOSX/solr/build/solr-core/test/J0/org.apache.solr.cloud.BasicDistributedZkTest-1359727154250/jetty4/index.20130201095934373 lockFactory=org.apache.lucene.store.NativeFSLockFactory@6bd0619e; maxCacheMB=48.0 maxMergeSizeMB=4.0)),segFN=segments_3,generation=3,filenames=[segments_3]
[junit4:junit4]   2> 20156 T3337 C198 P50275 oasc.SolrDeletionPolicy.updateCommits newest commit = 3[segments_3]
[junit4:junit4]   2> 20157 T3337 C198 P50275 oasc.CachingDirectoryFactory.close Releasing directory:/Users/jenkins/jenkins-slave/workspace/Lucene-Solr-trunk-MacOSX/solr/build/solr-core/test/J0/./org.apache.solr.cloud.BasicDistributedZkTest-1359727154250/jetty4
[junit4:junit4]   2> 20158 T3337 C198 P50275 oasu.DirectUpdateHandler2.commit end_commit_flush
[junit4:junit4]   2> 20158 T3337 C198 P50275 oasc.CachingDirectoryFactory.close Releasing directory:/Users/jenkins/jenkins-slave/workspace/Lucene-Solr-trunk-MacOSX/solr/build/solr-core/test/J0/./org.apache.solr.cloud.BasicDistributedZkTest-1359727154250/jetty4/index.20130201095934373
[junit4:junit4]   2> 20158 T3337 C198 P50275 oasc.CachingDirectoryFactory.close Releasing directory:/Users/jenkins/jenkins-slave/workspace/Lucene-Solr-trunk-MacOSX/solr/build/solr-core/test/J0/./org.apache.solr.cloud.BasicDistributedZkTest-1359727154250/jetty4/index
[junit4:junit4]   2> 20158 T3337 C198 P50275 oasc.RecoveryStrategy.replay No replay needed. core=collection1
[junit4:junit4]   2> 20159 T3337 C198 P50275 oasc.RecoveryStrategy.doRecovery Replication Recovery was successful - registering as Active. core=collection1
[junit4:junit4]   2> 20159 T3337 C198 P50275 oasc.ZkController.publish publishing core=collection1 state=active
[junit4:junit4]   2> 20159 T3337 C198 P50275 oasc.ZkController.publish numShards not found on descriptor - reading it from system property
[junit4:junit4]   2> 20160 T3337 C198 P50275 oasc.RecoveryStrategy.doRecovery Finished recovery process. core=collection1
[junit4:junit4]   2> 20421 T3270 oascc.ZkStateReader.updateClusterState Updating cloud state from ZooKeeper... 
[junit4:junit4]   2> 20423 T3270 oasc.Overseer$ClusterStateUpdater.updateState Update state numShards=2 message={
[junit4:junit4]   2> 	  "operation":"state",
[junit4:junit4]   2> 	  "numShards":"2",
[junit4:junit4]   2> 	  "shard":"shard2",
[junit4:junit4]   2> 	  "roles":null,
[junit4:junit4]   2> 	  "state":"active",
[junit4:junit4]   2> 	  "core":"collection1",
[junit4:junit4]   2> 	  "collection":"collection1",
[junit4:junit4]   2> 	  "node_name":"127.0.0.1:50275__",
[junit4:junit4]   2> 	  "base_url":"http://127.0.0.1:50275/_"}
[junit4:junit4]   2> 20436 T3334 oascc.ZkStateReader$2.process A cluster state change: WatchedEvent state:SyncConnected type:NodeDataChanged path:/clusterstate.json, has occurred - updating... (live nodes size: 5)
[junit4:junit4]   2> 20437 T3275 oascc.ZkStateReader$2.process A cluster state change: WatchedEvent state:SyncConnected type:NodeDataChanged path:/clusterstate.json, has occurred - updating... (live nodes size: 5)
[junit4:junit4]   2> 20437 T3288 oascc.ZkStateReader$2.process A cluster state change: WatchedEvent state:SyncConnected type:NodeDataChanged path:/clusterstate.json, has occurred - updating... (live nodes size: 5)
[junit4:junit4]   2> 20438 T3318 oascc.ZkStateReader$2.process A cluster state change: WatchedEvent state:SyncConnected type:NodeDataChanged path:/clusterstate.json, has occurred - updating... (live nodes size: 5)
[junit4:junit4]   2> 20439 T3303 oascc.ZkStateReader$2.process A cluster state change: WatchedEvent state:SyncConnected type:NodeDataChanged path:/clusterstate.json, has occurred - updating... (live nodes size: 5)
[junit4:junit4]   2> 20439 T3269 oascc.ZkStateReader$2.process A cluster state change: WatchedEvent state:SyncConnected type:NodeDataChanged path:/clusterstate.json, has occurred - updating... (live nodes size: 5)
[junit4:junit4]   2> 21111 T3247 oascc.ZkStateReader.updateClusterState Updating cloud state from ZooKeeper... 
[junit4:junit4]   2> 21113 T3247 oasc.AbstractDistribZkTestBase.waitForRecoveriesToFinish Recoveries finished - collection: collection1
[junit4:junit4]   2> ASYNC  NEW_CORE C201 name=collection1 org.apache.solr.core.SolrCore@7dfb47c8 url=http://127.0.0.1:50261/_/collection1 node=127.0.0.1:50261__ C201_STATE=coll:control_collection core:collection1 props:{shard=shard1, roles=null, state=active, core=collection1, collection=control_collection, node_name=127.0.0.1:50261__, base_url=http://127.0.0.1:50261/_, leader=true}
[junit4:junit4]   2> 21127 T3262 C201 P50261 oasc.CachingDirectoryFactory.close Releasing directory:/Users/jenkins/jenkins-slave/workspace/Lucene-Solr-trunk-MacOSX/solr/build/solr-core/test/J0/./org.apache.solr.cloud.BasicDistributedZkTest-1359727154250/control/data
[junit4:junit4]   2> 21130 T3262 C201 P50261 oasc.SolrDeletionPolicy.onInit SolrDeletionPolicy.onInit: commits:num=1
[junit4:junit4]   2> 		commit{dir=RateLimitedDirectoryWrapper(NRTCachingDirectory(org.apache.lucene.store.NIOFSDirectory@/Users/jenkins/jenkins-slave/workspace/Lucene-Solr-trunk-MacOSX/solr/build/solr-core/test/J0/org.apache.solr.cloud.BasicDistributedZkTest-1359727154250/control/data/index lockFactory=org.apache.lucene.store.NativeFSLockFactory@435daf21; maxCacheMB=48.0 maxMergeSizeMB=4.0)),segFN=segments_1,generation=1,filenames=[segments_1]
[junit4:junit4]   2> 21131 T3262 C201 P50261 oasc.SolrDeletionPolicy.updateCommits newest commit = 1[segments_1]
[junit4:junit4]   2> 21132 T3262 C201 P50261 oasc.CachingDirectoryFactory.close Releasing directory:/Users/jenkins/jenkins-slave/workspace/Lucene-Solr-trunk-MacOSX/solr/build/solr-core/test/J0/./org.apache.solr.cloud.BasicDistributedZkTest-1359727154250/control/data
[junit4:junit4]   2> 21133 T3262 C201 P50261 oass.SolrIndexSearcher.<init> Opening Searcher@2900a939 realtime
[junit4:junit4]   2> 21134 T3262 C201 P50261 /update {wt=javabin&version=2} {deleteByQuery=*:* (-1425777282638675968)} 0 9
[junit4:junit4]   2> 21138 T3284 C199 P50265 oasc.CachingDirectoryFactory.close Releasing directory:/Users/jenkins/jenkins-slave/workspace/Lucene-Solr-trunk-MacOSX/solr/build/solr-core/test/J0/./org.apache.solr.cloud.BasicDistributedZkTest-1359727154250/jetty1
[junit4:junit4]   2> 21144 T3297 C200 P50268 oasc.CachingDirectoryFactory.close Releasing directory:/Users/jenkins/jenkins-slave/workspace/Lucene-Solr-trunk-MacOSX/solr/build/solr-core/test/J0/./org.apache.solr.cloud.BasicDistributedZkTest-1359727154250/jetty2
[junit4:junit4]   2>  C197_STATE=coll:collection1 core:collection1 props:{shard=shard1, roles=null, state=active, core=collection1, collection=collection1, node_name=127.0.0.1:50271__, base_url=http://127.0.0.1:50271/_}
[junit4:junit4]   2> 21152 T3308 C197 P50271 oasc.CachingDirectoryFactory.close Releasing directory:/Users/jenkins/jenkins-slave/workspace/Lucene-Solr-trunk-MacOSX/solr/build/solr-core/test/J0/./org.apache.solr.cloud.BasicDistributedZkTest-1359727154250/jetty3
[junit4:junit4]   2> 21153 T3308 C197 P50271 /update {update.distrib=FROMLEADER&_version_=-1425777282649161728&update.from=http://127.0.0.1:50265/_/collection1/&wt=javabin&version=2} {deleteByQuery=*:* (-1425777282649161728)} 0 3
[junit4:junit4]   2>  C198_STATE=coll:collection1 core:collection1 props:{shard=shard2, roles=null, state=active, core=collection1, collection=collection1, node_name=127.0.0.1:50275__, base_url=http://127.0.0.1:50275/_}
[junit4:junit4]   2> 21157 T3330 C198 P50275 oasc.CachingDirectoryFactory.close Releasing directory:/Users/jenkins/jenkins-slave/workspace/Lucene-Solr-trunk-MacOSX/solr/build/solr-core/test/J0/./org.apache.solr.cloud.BasicDistributedZkTest-1359727154250/jetty4
[junit4:junit4]   2> 21158 T3330 C198 P50275 /update {update.distrib=FROMLEADER&_version_=-1425777282656501760&update.from=http://127.0.0.1:50268/_/collection1/&wt=javabin&version=2} {deleteByQuery=*:* (-1425777282656501760)} 0 4
[junit4:junit4]   2> 21159 T3297 C200 P50268 /update {update.distrib=TOLEADER&wt=javabin&version=2} {deleteByQuery=*:* (-1425777282656501760)} 0 16
[junit4:junit4]   2> 21160 T3284 C199 P50265 /update {wt=javabin&version=2} {deleteByQuery=*:* (-1425777282649161728)} 0 24
[junit4:junit4]   2> 21167 T3263 C201 P50261 /update {wt=javabin&version=2} {add=[1 (1425777282678521856)]} 0 3
[junit4:junit4]   2> 21181 T3309 C197 P50271 /update {distrib.from=http://127.0.0.1:50265/_/collection1/&update.distrib=FROMLEADER&wt=javabin&version=2} {add=[1 (1425777282685861888)]} 0 4
[junit4:junit4]   2> 21182 T3282 C199 P50265 /update {wt=javabin&version=2} {add=[1 (1425777282685861888)]} 0 12
[junit4:junit4]   2> 21187 T3264 C201 P50261 /update {wt=javabin&version=2} {add=[2 (1425777282700541952)]} 0 2
[junit4:junit4]   2> 21201 T3325 C198 P50275 /update {distrib.from=http://127.0.0.1:50268/_/collection1/&update.distrib=FROMLEADER&wt=javabin&version=2} {add=[2 (1425777282706833408)]} 0 4
[junit4:junit4]   2> 21202 T3298 C200 P50268 /update {wt=javabin&version=2} {add=[2 (1425777282706833408)]} 0 11
[junit4:junit4]   2> 21207 T3265 C201 P50261 /update {wt=javabin&version=2} {add=[3 (1425777282721513472)]} 0 2
[junit4:junit4]   2> 21216 T3326 C198 P50275 /update {distrib.from=http://127.0.0.1:50268/_/collection1/&update.distrib=FROMLEADER&wt=javabin&version=2} {add=[3 (1425777282726756352)]} 0 2
[junit4:junit4]   2> 21217 T3299 C200 P50268 /update {wt=javabin&version=2} {add=[3 (1425777282726756352)]} 0 7
[junit4:junit4]   2> 21222 T3260 C201 P50261 /update {wt=javabin&version=2} {add=[4 (1425777282738290688)]} 0 2
[junit4:junit4]   2> 21237 T3310 C197 P50271 /update {distrib.from=http://127.0.0.1:50265/_/collection1/&update.distrib=FROMLEADER&wt=javabin&version=2} {add=[4 (1425777282745630720)]} 0 2
[jun

[...truncated too long message...]

nit4]    > 	at com.carrotsearch.randomizedtesting.rules.SystemPropertiesRestoreRule$1.evaluate(SystemPropertiesRestoreRule.java:53)
[junit4:junit4]    > 	at org.apache.lucene.util.TestRuleSetupTeardownChained$1.evaluate(TestRuleSetupTeardownChained.java:50)
[junit4:junit4]    > 	at org.apache.lucene.util.TestRuleFieldCacheSanity$1.evaluate(TestRuleFieldCacheSanity.java:51)
[junit4:junit4]    > 	at org.apache.lucene.util.AbstractBeforeAfterRule$1.evaluate(AbstractBeforeAfterRule.java:46)
[junit4:junit4]    > 	at com.carrotsearch.randomizedtesting.rules.SystemPropertiesInvariantRule$1.evaluate(SystemPropertiesInvariantRule.java:55)
[junit4:junit4]    > 	at org.apache.lucene.util.TestRuleThreadAndTestName$1.evaluate(TestRuleThreadAndTestName.java:49)
[junit4:junit4]    > 	at org.apache.lucene.util.TestRuleIgnoreAfterMaxFailures$1.evaluate(TestRuleIgnoreAfterMaxFailures.java:70)
[junit4:junit4]    > 	at org.apache.lucene.util.TestRuleMarkFailure$1.evaluate(TestRuleMarkFailure.java:48)
[junit4:junit4]    > 	at com.carrotsearch.randomizedtesting.rules.StatementAdapter.evaluate(StatementAdapter.java:36)
[junit4:junit4]    > 	at com.carrotsearch.randomizedtesting.ThreadLeakControl$StatementRunner.run(ThreadLeakControl.java:358)
[junit4:junit4]    > 	at com.carrotsearch.randomizedtesting.ThreadLeakControl.forkTimeoutingTask(ThreadLeakControl.java:782)
[junit4:junit4]    > 	at com.carrotsearch.randomizedtesting.ThreadLeakControl$3.evaluate(ThreadLeakControl.java:442)
[junit4:junit4]    > 	at com.carrotsearch.randomizedtesting.RandomizedRunner.runSingleTest(RandomizedRunner.java:746)
[junit4:junit4]    > 	at com.carrotsearch.randomizedtesting.RandomizedRunner$3.evaluate(RandomizedRunner.java:648)
[junit4:junit4]    > 	at com.carrotsearch.randomizedtesting.RandomizedRunner$4.evaluate(RandomizedRunner.java:682)
[junit4:junit4]    > 	at com.carrotsearch.randomizedtesting.RandomizedRunner$5.evaluate(RandomizedRunner.java:693)
[junit4:junit4]    > 	at com.carrotsearch.randomizedtesting.rules.StatementAdapter.evaluate(StatementAdapter.java:36)
[junit4:junit4]    > 	at com.carrotsearch.randomizedtesting.rules.SystemPropertiesRestoreRule$1.evaluate(SystemPropertiesRestoreRule.java:53)
[junit4:junit4]    > 	at org.apache.lucene.util.AbstractBeforeAfterRule$1.evaluate(AbstractBeforeAfterRule.java:46)
[junit4:junit4]    > 	at org.apache.lucene.util.TestRuleStoreClassName$1.evaluate(TestRuleStoreClassName.java:42)
[junit4:junit4]    > 	at com.carrotsearch.randomizedtesting.rules.SystemPropertiesInvariantRule$1.evaluate(SystemPropertiesInvariantRule.java:55)
[junit4:junit4]    > 	at com.carrotsearch.randomizedtesting.rules.NoShadowingOrOverridesOnMethodsRule$1.evaluate(NoShadowingOrOverridesOnMethodsRule.java:39)
[junit4:junit4]    > 	at com.carrotsearch.randomizedtesting.rules.NoShadowingOrOverridesOnMethodsRule$1.evaluate(NoShadowingOrOverridesOnMethodsRule.java:39)
[junit4:junit4]    > 	at com.carrotsearch.randomizedtesting.rules.StatementAdapter.evaluate(StatementAdapter.java:36)
[junit4:junit4]    > 	at org.apache.lucene.util.TestRuleAssertionsRequired$1.evaluate(TestRuleAssertionsRequired.java:43)
[junit4:junit4]    > 	at org.apache.lucene.util.TestRuleMarkFailure$1.evaluate(TestRuleMarkFailure.java:48)
[junit4:junit4]    > 	at org.apache.lucene.util.TestRuleIgnoreAfterMaxFailures$1.evaluate(TestRuleIgnoreAfterMaxFailures.java:70)
[junit4:junit4]    > 	at org.apache.lucene.util.TestRuleIgnoreTestSuites$1.evaluate(TestRuleIgnoreTestSuites.java:55)
[junit4:junit4]    > 	at com.carrotsearch.randomizedtesting.rules.StatementAdapter.evaluate(StatementAdapter.java:36)
[junit4:junit4]    > 	at com.carrotsearch.randomizedtesting.ThreadLeakControl$StatementRunner.run(ThreadLeakControl.java:358)
[junit4:junit4]    > 	at java.lang.Thread.run(Thread.java:722)
[junit4:junit4]   2> 381881 T3247 oas.SolrTestCaseJ4.deleteCore ###deleteCore
[junit4:junit4]   2> NOTE: test params are: codec=Lucene41: {n_f1=PostingsFormat(name=Lucene41WithOrds), foo_b=PostingsFormat(name=TestBloomFilteredLucene41Postings), cat=PostingsFormat(name=MockRandom), foo_d=PostingsFormat(name=Memory doPackFST= false), foo_f=PostingsFormat(name=TestBloomFilteredLucene41Postings), n_tl1=PostingsFormat(name=Lucene41WithOrds), n_d1=PostingsFormat(name=MockRandom), rnd_b=PostingsFormat(name=Memory doPackFST= false), intDefault=PostingsFormat(name=Lucene41WithOrds), n_td1=PostingsFormat(name=Lucene41WithOrds), timestamp=PostingsFormat(name=MockRandom), id=PostingsFormat(name=Memory doPackFST= false), range_facet_sl=PostingsFormat(name=Memory doPackFST= false), range_facet_si=PostingsFormat(name=MockRandom), oddField_s=PostingsFormat(name=Memory doPackFST= false), sequence_i=PostingsFormat(name=Memory doPackFST= false), name=PostingsFormat(name=Memory doPackFST= false), foo_i=PostingsFormat(name=Lucene41WithOrds), regex_dup_B_s=PostingsFormat(name=MockRandom), multiDefault=PostingsFormat(name=MockRandom), n_tf1=PostingsFormat(name=MockRandom), n_dt1=PostingsFormat(name=Lucene41WithOrds), genre_s=PostingsFormat(name=Memory doPackFST= false), author_t=PostingsFormat(name=Lucene41WithOrds), n_ti1=PostingsFormat(name=Memory doPackFST= false), range_facet_l=PostingsFormat(name=MockRandom), text=PostingsFormat(name=TestBloomFilteredLucene41Postings), _version_=PostingsFormat(name=Lucene41WithOrds), val_i=PostingsFormat(name=Memory doPackFST= false), SubjectTerms_mfacet=PostingsFormat(name=Lucene41WithOrds), series_t=PostingsFormat(name=Lucene41WithOrds), a_t=PostingsFormat(name=MockRandom), n_tdt1=PostingsFormat(name=Lucene41WithOrds), regex_dup_A_s=PostingsFormat(name=TestBloomFilteredLucene41Postings), price=PostingsFormat(name=TestBloomFilteredLucene41Postings), other_tl1=PostingsFormat(name=Lucene41WithOrds), n_l1=PostingsFormat(name=MockRandom), a_si=PostingsFormat(name=Lucene41WithOrds), inStock=PostingsFormat(name=TestBloomFilteredLucene41Postings)}, sim=DefaultSimilarity, locale=in, timezone=SystemV/AST4
[junit4:junit4]   2> NOTE: Mac OS X 10.8.2 x86_64/Oracle Corporation 1.7.0_10 (64-bit)/cpus=2,threads=1,free=109854064,total=531628032
[junit4:junit4]   2> NOTE: All tests run in this JVM: [SpellCheckCollatorTest, TestCharFilters, WordBreakSolrSpellCheckerTest, SyncSliceTest, TestUpdate, BasicZkTest, ResponseLogComponentTest, DateMathParserTest, TestPluginEnable, TermVectorComponentTest, StandardRequestHandlerTest, LukeRequestHandlerTest, TestLMJelinekMercerSimilarityFactory, TestPartialUpdateDeduplication, TestQuerySenderNoQuery, MinimalSchemaTest, TestDistributedSearch, TestCoreContainer, RecoveryZkTest, TestStressLucene, SpatialFilterTest, TestTrie, SolrPluginUtilsTest, DirectUpdateHandlerTest, TestArbitraryIndexDir, TestHashPartitioner, SpellingQueryConverterTest, XsltUpdateRequestHandlerTest, SampleTest, TestFastOutputStream, DirectUpdateHandlerOptimizeTest, ReturnFieldsTest, ExternalFileFieldSortTest, OverseerCollectionProcessorTest, TestSolrQueryParser, ChaosMonkeyNothingIsSafeTest, TestPropInjectDefaults, UpdateParamsTest, ShardRoutingTest, ChaosMonkeySafeLeaderTest, TestLazyCores, TestAtomicUpdateErrorCases, CopyFieldTest, TestUtils, SuggesterFSTTest, TestDocumentBuilder, BasicDistributedZk2Test, DisMaxRequestHandlerTest, HighlighterTest, FieldAnalysisRequestHandlerTest, TestZkChroot, ZkNodePropsTest, FullSolrCloudDistribCmdsTest, TestNumberUtils, DirectSolrConnectionTest, TestPropInject, TestCodecSupport, SolrRequestParserTest, TestCollationField, TestWordDelimiterFilterFactory, TestJoin, TestFastLRUCache, TestComponentsName, NotRequiredUniqueKeyTest, ZkSolrClientTest, QueryElevationComponentTest, OverseerTest, DistributedSpellCheckComponentTest, TestSolr4Spatial, TestIndexSearcher, TestXIncludeConfig, FileUtilsTest, TestFastWriter, DocumentAnalysisRequestHandlerTest, StatelessScriptUpdateProcessorFactoryTest, TestDefaultSimilarityFactory, TestGroupingSearch, TestFaceting, UUIDFieldTest, ScriptEngineTest, SolrCmdDistributorTest, TestRangeQuery, LeaderElectionTest, TestSort, CoreAdminHandlerTest, TermVectorComponentDistributedTest, BadIndexSchemaTest, SolrCoreTest, ClusterStateUpdateTest, SOLR749Test, TestStressReorder, TestFiltering, TestLFUCache, PingRequestHandlerTest, BadComponentTest, AnalysisAfterCoreReloadTest, TestQueryTypes, ConvertedLegacyTest, SolrCoreCheckLockOnStartupTest, ClusterStateTest, TestRTGBase, TestRandomFaceting, TestSolrCoreProperties, MultiTermTest, TestWriterPerf, HighlighterConfigTest, CoreContainerCoreInitFailuresTest, TestCSVLoader, TestPostingsSolrHighlighter, CollectionsAPIDistributedZkTest, PreAnalyzedFieldTest, TestBM25SimilarityFactory, QueryEqualityTest, AutoCommitTest, BasicFunctionalityTest, TestValueSourceCache, TestCSVResponseWriter, SpellPossibilityIteratorTest, DebugComponentTest, BasicDistributedZkTest]
[junit4:junit4] Completed in 382.23s, 1 test, 1 failure <<< FAILURES!

[...truncated 378 lines...]
BUILD FAILED
/Users/jenkins/jenkins-slave/workspace/Lucene-Solr-trunk-MacOSX/build.xml:346: The following error occurred while executing this line:
/Users/jenkins/jenkins-slave/workspace/Lucene-Solr-trunk-MacOSX/build.xml:39: The following error occurred while executing this line:
/Users/jenkins/jenkins-slave/workspace/Lucene-Solr-trunk-MacOSX/solr/build.xml:178: The following error occurred while executing this line:
/Users/jenkins/jenkins-slave/workspace/Lucene-Solr-trunk-MacOSX/solr/common-build.xml:428: The following error occurred while executing this line:
/Users/jenkins/jenkins-slave/workspace/Lucene-Solr-trunk-MacOSX/lucene/common-build.xml:1176: The following error occurred while executing this line:
/Users/jenkins/jenkins-slave/workspace/Lucene-Solr-trunk-MacOSX/lucene/common-build.xml:841: There were test failures: 248 suites, 1037 tests, 1 failure, 14 ignored (3 assumptions)

Total time: 60 minutes 51 seconds
Build step 'Invoke Ant' marked build as failure
Archiving artifacts
Recording test results
Description set: Java: 64bit/jdk1.7.0 -XX:+UseG1GC
Email was triggered for: Failure
Sending email for trigger: Failure



Mime
View raw message