lucene-dev mailing list archives

Site index · List index
Message view « Date » · « Thread »
Top « Date » · « Thread »
From Policeman Jenkins Server <jenk...@thetaphi.de>
Subject [JENKINS] Lucene-Solr-4.x-MacOSX (64bit/jdk1.7.0) - Build # 156 - Failure!
Date Fri, 01 Feb 2013 20:07:09 GMT
Build: http://jenkins.thetaphi.de/job/Lucene-Solr-4.x-MacOSX/156/
Java: 64bit/jdk1.7.0 -XX:+UseG1GC

1 tests failed.
REGRESSION:  org.apache.solr.cloud.BasicDistributedZkTest.testDistribSearch

Error Message:
There are still nodes recoverying - waited for 230 seconds

Stack Trace:
java.lang.AssertionError: There are still nodes recoverying - waited for 230 seconds
	at __randomizedtesting.SeedInfo.seed([BA40ACD262782E43:3BA622CA15274E7F]:0)
	at org.junit.Assert.fail(Assert.java:93)
	at org.apache.solr.cloud.AbstractDistribZkTestBase.waitForRecoveriesToFinish(AbstractDistribZkTestBase.java:168)
	at org.apache.solr.cloud.AbstractDistribZkTestBase.waitForRecoveriesToFinish(AbstractDistribZkTestBase.java:126)
	at org.apache.solr.cloud.AbstractDistribZkTestBase.waitForRecoveriesToFinish(AbstractDistribZkTestBase.java:121)
	at org.apache.solr.cloud.BasicDistributedZkTest.testCoreUnloadAndLeaders(BasicDistributedZkTest.java:586)
	at org.apache.solr.cloud.BasicDistributedZkTest.doTest(BasicDistributedZkTest.java:337)
	at org.apache.solr.BaseDistributedSearchTestCase.testDistribSearch(BaseDistributedSearchTestCase.java:794)
	at sun.reflect.NativeMethodAccessorImpl.invoke0(Native Method)
	at sun.reflect.NativeMethodAccessorImpl.invoke(NativeMethodAccessorImpl.java:57)
	at sun.reflect.DelegatingMethodAccessorImpl.invoke(DelegatingMethodAccessorImpl.java:43)
	at java.lang.reflect.Method.invoke(Method.java:601)
	at com.carrotsearch.randomizedtesting.RandomizedRunner.invoke(RandomizedRunner.java:1559)
	at com.carrotsearch.randomizedtesting.RandomizedRunner.access$600(RandomizedRunner.java:79)
	at com.carrotsearch.randomizedtesting.RandomizedRunner$6.evaluate(RandomizedRunner.java:737)
	at com.carrotsearch.randomizedtesting.RandomizedRunner$7.evaluate(RandomizedRunner.java:773)
	at com.carrotsearch.randomizedtesting.RandomizedRunner$8.evaluate(RandomizedRunner.java:787)
	at com.carrotsearch.randomizedtesting.rules.SystemPropertiesRestoreRule$1.evaluate(SystemPropertiesRestoreRule.java:53)
	at org.apache.lucene.util.TestRuleSetupTeardownChained$1.evaluate(TestRuleSetupTeardownChained.java:50)
	at org.apache.lucene.util.TestRuleFieldCacheSanity$1.evaluate(TestRuleFieldCacheSanity.java:51)
	at org.apache.lucene.util.AbstractBeforeAfterRule$1.evaluate(AbstractBeforeAfterRule.java:46)
	at com.carrotsearch.randomizedtesting.rules.SystemPropertiesInvariantRule$1.evaluate(SystemPropertiesInvariantRule.java:55)
	at org.apache.lucene.util.TestRuleThreadAndTestName$1.evaluate(TestRuleThreadAndTestName.java:49)
	at org.apache.lucene.util.TestRuleIgnoreAfterMaxFailures$1.evaluate(TestRuleIgnoreAfterMaxFailures.java:70)
	at org.apache.lucene.util.TestRuleMarkFailure$1.evaluate(TestRuleMarkFailure.java:48)
	at com.carrotsearch.randomizedtesting.rules.StatementAdapter.evaluate(StatementAdapter.java:36)
	at com.carrotsearch.randomizedtesting.ThreadLeakControl$StatementRunner.run(ThreadLeakControl.java:358)
	at com.carrotsearch.randomizedtesting.ThreadLeakControl.forkTimeoutingTask(ThreadLeakControl.java:782)
	at com.carrotsearch.randomizedtesting.ThreadLeakControl$3.evaluate(ThreadLeakControl.java:442)
	at com.carrotsearch.randomizedtesting.RandomizedRunner.runSingleTest(RandomizedRunner.java:746)
	at com.carrotsearch.randomizedtesting.RandomizedRunner$3.evaluate(RandomizedRunner.java:648)
	at com.carrotsearch.randomizedtesting.RandomizedRunner$4.evaluate(RandomizedRunner.java:682)
	at com.carrotsearch.randomizedtesting.RandomizedRunner$5.evaluate(RandomizedRunner.java:693)
	at com.carrotsearch.randomizedtesting.rules.StatementAdapter.evaluate(StatementAdapter.java:36)
	at com.carrotsearch.randomizedtesting.rules.SystemPropertiesRestoreRule$1.evaluate(SystemPropertiesRestoreRule.java:53)
	at org.apache.lucene.util.AbstractBeforeAfterRule$1.evaluate(AbstractBeforeAfterRule.java:46)
	at org.apache.lucene.util.TestRuleStoreClassName$1.evaluate(TestRuleStoreClassName.java:42)
	at com.carrotsearch.randomizedtesting.rules.SystemPropertiesInvariantRule$1.evaluate(SystemPropertiesInvariantRule.java:55)
	at com.carrotsearch.randomizedtesting.rules.NoShadowingOrOverridesOnMethodsRule$1.evaluate(NoShadowingOrOverridesOnMethodsRule.java:39)
	at com.carrotsearch.randomizedtesting.rules.NoShadowingOrOverridesOnMethodsRule$1.evaluate(NoShadowingOrOverridesOnMethodsRule.java:39)
	at com.carrotsearch.randomizedtesting.rules.StatementAdapter.evaluate(StatementAdapter.java:36)
	at org.apache.lucene.util.TestRuleAssertionsRequired$1.evaluate(TestRuleAssertionsRequired.java:43)
	at org.apache.lucene.util.TestRuleMarkFailure$1.evaluate(TestRuleMarkFailure.java:48)
	at org.apache.lucene.util.TestRuleIgnoreAfterMaxFailures$1.evaluate(TestRuleIgnoreAfterMaxFailures.java:70)
	at org.apache.lucene.util.TestRuleIgnoreTestSuites$1.evaluate(TestRuleIgnoreTestSuites.java:55)
	at com.carrotsearch.randomizedtesting.rules.StatementAdapter.evaluate(StatementAdapter.java:36)
	at com.carrotsearch.randomizedtesting.ThreadLeakControl$StatementRunner.run(ThreadLeakControl.java:358)
	at java.lang.Thread.run(Thread.java:722)




Build Log:
[...truncated 9034 lines...]
[junit4:junit4] Suite: org.apache.solr.cloud.BasicDistributedZkTest
[junit4:junit4]   2> 0 T1842 oas.BaseDistributedSearchTestCase.initHostContext Setting hostContext system property: /i
[junit4:junit4]   2> 7 T1842 oas.SolrTestCaseJ4.setUp ###Starting testDistribSearch
[junit4:junit4]   2> Creating dataDir: /Users/jenkins/jenkins-slave/workspace/Lucene-Solr-4.x-MacOSX/solr/build/solr-core/test/J0/./solrtest-BasicDistributedZkTest-1359747998898
[junit4:junit4]   2> 8 T1842 oasc.ZkTestServer.run STARTING ZK TEST SERVER
[junit4:junit4]   2> 9 T1843 oasc.ZkTestServer$ZKServerMain.runFromConfig Starting server
[junit4:junit4]   2> 10 T1843 oazs.ZooKeeperServer.setTickTime tickTime set to 1000
[junit4:junit4]   2> 10 T1843 oazs.ZooKeeperServer.setMinSessionTimeout minSessionTimeout set to -1
[junit4:junit4]   2> 11 T1843 oazs.ZooKeeperServer.setMaxSessionTimeout maxSessionTimeout set to -1
[junit4:junit4]   2> 11 T1843 oazs.NIOServerCnxnFactory.configure binding to port 0.0.0.0/0.0.0.0:0
[junit4:junit4]   2> 12 T1843 oazsp.FileTxnSnapLog.save Snapshotting: 0x0 to /Users/jenkins/jenkins-slave/workspace/Lucene-Solr-4.x-MacOSX/solr/build/solr-core/test/J0/./org.apache.solr.cloud.BasicDistributedZkTest-1359747998897/zookeeper/server1/data/version-2/snapshot.0
[junit4:junit4]   2> 111 T1842 oasc.ZkTestServer.run start zk server on port:51271
[junit4:junit4]   2> 112 T1842 oaz.ZooKeeper.<init> Initiating client connection, connectString=127.0.0.1:51271 sessionTimeout=10000 watcher=org.apache.solr.common.cloud.ConnectionManager@7c15aa4e
[junit4:junit4]   2> 113 T1842 oascc.ConnectionManager.waitForConnected Waiting for client to connect to ZooKeeper
[junit4:junit4]   2> 113 T1848 oaz.ClientCnxn$SendThread.logStartConnect Opening socket connection to server localhost/127.0.0.1:51271. Will not attempt to authenticate using SASL (access denied ("javax.security.auth.AuthPermission" "getLoginConfiguration"))
[junit4:junit4]   2> 114 T1848 oaz.ClientCnxn$SendThread.primeConnection Socket connection established to localhost/127.0.0.1:51271, initiating session
[junit4:junit4]   2> 114 T1844 oazs.NIOServerCnxnFactory.run Accepted socket connection from /127.0.0.1:51272
[junit4:junit4]   2> 114 T1844 oazs.ZooKeeperServer.processConnectRequest Client attempting to establish new session at /127.0.0.1:51272
[junit4:junit4]   2> 115 T1846 oazsp.FileTxnLog.append Creating new log file: log.1
[junit4:junit4]   2> 117 T1846 oazs.ZooKeeperServer.finishSessionInit Established session 0x13c974be4b70000 with negotiated timeout 10000 for client /127.0.0.1:51272
[junit4:junit4]   2> 117 T1848 oaz.ClientCnxn$SendThread.onConnected Session establishment complete on server localhost/127.0.0.1:51271, sessionid = 0x13c974be4b70000, negotiated timeout = 10000
[junit4:junit4]   2> 118 T1849 oascc.ConnectionManager.process Watcher org.apache.solr.common.cloud.ConnectionManager@7c15aa4e name:ZooKeeperConnection Watcher:127.0.0.1:51271 got event WatchedEvent state:SyncConnected type:None path:null path:null type:None
[junit4:junit4]   2> 118 T1842 oascc.ConnectionManager.waitForConnected Client is connected to ZooKeeper
[junit4:junit4]   2> 119 T1842 oascc.SolrZkClient.makePath makePath: /solr
[junit4:junit4]   2> 123 T1847 oazs.PrepRequestProcessor.pRequest2Txn Processed session termination for sessionid: 0x13c974be4b70000
[junit4:junit4]   2> 124 T1849 oaz.ClientCnxn$EventThread.run EventThread shut down
[junit4:junit4]   2> 124 T1842 oaz.ZooKeeper.close Session: 0x13c974be4b70000 closed
[junit4:junit4]   2> 125 T1844 oazs.NIOServerCnxn.closeSock Closed socket connection for client /127.0.0.1:51272 which had sessionid 0x13c974be4b70000
[junit4:junit4]   2> 125 T1842 oaz.ZooKeeper.<init> Initiating client connection, connectString=127.0.0.1:51271/solr sessionTimeout=10000 watcher=org.apache.solr.common.cloud.ConnectionManager@1dc94510
[junit4:junit4]   2> 126 T1842 oascc.ConnectionManager.waitForConnected Waiting for client to connect to ZooKeeper
[junit4:junit4]   2> 126 T1850 oaz.ClientCnxn$SendThread.logStartConnect Opening socket connection to server localhost/127.0.0.1:51271. Will not attempt to authenticate using SASL (access denied ("javax.security.auth.AuthPermission" "getLoginConfiguration"))
[junit4:junit4]   2> 127 T1850 oaz.ClientCnxn$SendThread.primeConnection Socket connection established to localhost/127.0.0.1:51271, initiating session
[junit4:junit4]   2> 128 T1844 oazs.NIOServerCnxnFactory.run Accepted socket connection from /127.0.0.1:51273
[junit4:junit4]   2> 128 T1844 oazs.ZooKeeperServer.processConnectRequest Client attempting to establish new session at /127.0.0.1:51273
[junit4:junit4]   2> 129 T1846 oazs.ZooKeeperServer.finishSessionInit Established session 0x13c974be4b70001 with negotiated timeout 10000 for client /127.0.0.1:51273
[junit4:junit4]   2> 129 T1850 oaz.ClientCnxn$SendThread.onConnected Session establishment complete on server localhost/127.0.0.1:51271, sessionid = 0x13c974be4b70001, negotiated timeout = 10000
[junit4:junit4]   2> 130 T1851 oascc.ConnectionManager.process Watcher org.apache.solr.common.cloud.ConnectionManager@1dc94510 name:ZooKeeperConnection Watcher:127.0.0.1:51271/solr got event WatchedEvent state:SyncConnected type:None path:null path:null type:None
[junit4:junit4]   2> 130 T1842 oascc.ConnectionManager.waitForConnected Client is connected to ZooKeeper
[junit4:junit4]   2> 131 T1842 oascc.SolrZkClient.makePath makePath: /collections/collection1
[junit4:junit4]   2> 135 T1842 oascc.SolrZkClient.makePath makePath: /collections/collection1/shards
[junit4:junit4]   2> 140 T1842 oascc.SolrZkClient.makePath makePath: /collections/control_collection
[junit4:junit4]   2> 144 T1842 oascc.SolrZkClient.makePath makePath: /collections/control_collection/shards
[junit4:junit4]   2> 148 T1842 oasc.AbstractZkTestCase.putConfig put /Users/jenkins/jenkins-slave/workspace/Lucene-Solr-4.x-MacOSX/solr/build/solr-core/test-files/solr/collection1/conf/solrconfig.xml to /configs/conf1/solrconfig.xml
[junit4:junit4]   2> 149 T1842 oascc.SolrZkClient.makePath makePath: /configs/conf1/solrconfig.xml
[junit4:junit4]   2> 156 T1842 oasc.AbstractZkTestCase.putConfig put /Users/jenkins/jenkins-slave/workspace/Lucene-Solr-4.x-MacOSX/solr/build/solr-core/test-files/solr/collection1/conf/schema.xml to /configs/conf1/schema.xml
[junit4:junit4]   2> 157 T1842 oascc.SolrZkClient.makePath makePath: /configs/conf1/schema.xml
[junit4:junit4]   2> 162 T1842 oasc.AbstractZkTestCase.putConfig put /Users/jenkins/jenkins-slave/workspace/Lucene-Solr-4.x-MacOSX/solr/build/solr-core/test-files/solr/collection1/conf/stopwords.txt to /configs/conf1/stopwords.txt
[junit4:junit4]   2> 163 T1842 oascc.SolrZkClient.makePath makePath: /configs/conf1/stopwords.txt
[junit4:junit4]   2> 168 T1842 oasc.AbstractZkTestCase.putConfig put /Users/jenkins/jenkins-slave/workspace/Lucene-Solr-4.x-MacOSX/solr/build/solr-core/test-files/solr/collection1/conf/protwords.txt to /configs/conf1/protwords.txt
[junit4:junit4]   2> 168 T1842 oascc.SolrZkClient.makePath makePath: /configs/conf1/protwords.txt
[junit4:junit4]   2> 173 T1842 oasc.AbstractZkTestCase.putConfig put /Users/jenkins/jenkins-slave/workspace/Lucene-Solr-4.x-MacOSX/solr/build/solr-core/test-files/solr/collection1/conf/currency.xml to /configs/conf1/currency.xml
[junit4:junit4]   2> 174 T1842 oascc.SolrZkClient.makePath makePath: /configs/conf1/currency.xml
[junit4:junit4]   2> 179 T1842 oasc.AbstractZkTestCase.putConfig put /Users/jenkins/jenkins-slave/workspace/Lucene-Solr-4.x-MacOSX/solr/build/solr-core/test-files/solr/collection1/conf/open-exchange-rates.json to /configs/conf1/open-exchange-rates.json
[junit4:junit4]   2> 180 T1842 oascc.SolrZkClient.makePath makePath: /configs/conf1/open-exchange-rates.json
[junit4:junit4]   2> 185 T1842 oasc.AbstractZkTestCase.putConfig put /Users/jenkins/jenkins-slave/workspace/Lucene-Solr-4.x-MacOSX/solr/build/solr-core/test-files/solr/collection1/conf/mapping-ISOLatin1Accent.txt to /configs/conf1/mapping-ISOLatin1Accent.txt
[junit4:junit4]   2> 186 T1842 oascc.SolrZkClient.makePath makePath: /configs/conf1/mapping-ISOLatin1Accent.txt
[junit4:junit4]   2> 191 T1842 oasc.AbstractZkTestCase.putConfig put /Users/jenkins/jenkins-slave/workspace/Lucene-Solr-4.x-MacOSX/solr/build/solr-core/test-files/solr/collection1/conf/old_synonyms.txt to /configs/conf1/old_synonyms.txt
[junit4:junit4]   2> 192 T1842 oascc.SolrZkClient.makePath makePath: /configs/conf1/old_synonyms.txt
[junit4:junit4]   2> 197 T1842 oasc.AbstractZkTestCase.putConfig put /Users/jenkins/jenkins-slave/workspace/Lucene-Solr-4.x-MacOSX/solr/build/solr-core/test-files/solr/collection1/conf/synonyms.txt to /configs/conf1/synonyms.txt
[junit4:junit4]   2> 198 T1842 oascc.SolrZkClient.makePath makePath: /configs/conf1/synonyms.txt
[junit4:junit4]   2> 203 T1847 oazs.PrepRequestProcessor.pRequest2Txn Processed session termination for sessionid: 0x13c974be4b70001
[junit4:junit4]   2> 204 T1844 oazs.NIOServerCnxn.closeSock Closed socket connection for client /127.0.0.1:51273 which had sessionid 0x13c974be4b70001
[junit4:junit4]   2> 204 T1842 oaz.ZooKeeper.close Session: 0x13c974be4b70001 closed
[junit4:junit4]   2> 205 T1851 oaz.ClientCnxn$EventThread.run EventThread shut down
[junit4:junit4]   2> 391 T1842 oejs.Server.doStart jetty-8.1.8.v20121106
[junit4:junit4]   2> 403 T1842 oejs.AbstractConnector.doStart Started SelectChannelConnector@127.0.0.1:51274
[junit4:junit4]   2> 404 T1842 oass.SolrDispatchFilter.init SolrDispatchFilter.init()
[junit4:junit4]   2> 404 T1842 oasc.SolrResourceLoader.locateSolrHome JNDI not configured for solr (NoInitialContextEx)
[junit4:junit4]   2> 405 T1842 oasc.SolrResourceLoader.locateSolrHome using system property solr.solr.home: /Users/jenkins/jenkins-slave/workspace/Lucene-Solr-4.x-MacOSX/solr/build/solr-core/test/J0/./org.apache.solr.cloud.BasicDistributedZkTest-controljetty-1359747999096
[junit4:junit4]   2> 405 T1842 oasc.CoreContainer$Initializer.initialize looking for solr.xml: /Users/jenkins/jenkins-slave/workspace/Lucene-Solr-4.x-MacOSX/solr/build/solr-core/test/J0/./org.apache.solr.cloud.BasicDistributedZkTest-controljetty-1359747999096/solr.xml
[junit4:junit4]   2> 406 T1842 oasc.CoreContainer.<init> New CoreContainer 1697085528
[junit4:junit4]   2> 407 T1842 oasc.CoreContainer.load Loading CoreContainer using Solr Home: '/Users/jenkins/jenkins-slave/workspace/Lucene-Solr-4.x-MacOSX/solr/build/solr-core/test/J0/./org.apache.solr.cloud.BasicDistributedZkTest-controljetty-1359747999096/'
[junit4:junit4]   2> 407 T1842 oasc.SolrResourceLoader.<init> new SolrResourceLoader for directory: '/Users/jenkins/jenkins-slave/workspace/Lucene-Solr-4.x-MacOSX/solr/build/solr-core/test/J0/./org.apache.solr.cloud.BasicDistributedZkTest-controljetty-1359747999096/'
[junit4:junit4]   2> 446 T1842 oashc.HttpShardHandlerFactory.getParameter Setting socketTimeout to: 60000
[junit4:junit4]   2> 447 T1842 oashc.HttpShardHandlerFactory.getParameter Setting urlScheme to: http://
[junit4:junit4]   2> 448 T1842 oashc.HttpShardHandlerFactory.getParameter Setting connTimeout to: 15000
[junit4:junit4]   2> 448 T1842 oashc.HttpShardHandlerFactory.getParameter Setting maxConnectionsPerHost to: 20
[junit4:junit4]   2> 449 T1842 oashc.HttpShardHandlerFactory.getParameter Setting corePoolSize to: 0
[junit4:junit4]   2> 449 T1842 oashc.HttpShardHandlerFactory.getParameter Setting maximumPoolSize to: 2147483647
[junit4:junit4]   2> 451 T1842 oashc.HttpShardHandlerFactory.getParameter Setting maxThreadIdleTime to: 5
[junit4:junit4]   2> 451 T1842 oashc.HttpShardHandlerFactory.getParameter Setting sizeOfQueue to: -1
[junit4:junit4]   2> 452 T1842 oashc.HttpShardHandlerFactory.getParameter Setting fairnessPolicy to: false
[junit4:junit4]   2> 452 T1842 oascsi.HttpClientUtil.createClient Creating new http client, config:maxConnectionsPerHost=20&maxConnections=10000&socketTimeout=60000&connTimeout=15000&retry=false
[junit4:junit4]   2> 467 T1842 oasc.CoreContainer.load Registering Log Listener
[junit4:junit4]   2> 486 T1842 oasc.CoreContainer.initZooKeeper Zookeeper client=127.0.0.1:51271/solr
[junit4:junit4]   2> 487 T1842 oasc.ZkController.checkChrootPath zkHost includes chroot
[junit4:junit4]   2> 487 T1842 oaz.ZooKeeper.<init> Initiating client connection, connectString=127.0.0.1:51271 sessionTimeout=60000 watcher=org.apache.solr.common.cloud.ConnectionManager@3494aef8
[junit4:junit4]   2> 489 T1842 oascc.ConnectionManager.waitForConnected Waiting for client to connect to ZooKeeper
[junit4:junit4]   2> 489 T1861 oaz.ClientCnxn$SendThread.logStartConnect Opening socket connection to server localhost/127.0.0.1:51271. Will not attempt to authenticate using SASL (access denied ("javax.security.auth.AuthPermission" "getLoginConfiguration"))
[junit4:junit4]   2> 490 T1861 oaz.ClientCnxn$SendThread.primeConnection Socket connection established to localhost/127.0.0.1:51271, initiating session
[junit4:junit4]   2> 490 T1844 oazs.NIOServerCnxnFactory.run Accepted socket connection from /127.0.0.1:51275
[junit4:junit4]   2> 491 T1844 oazs.ZooKeeperServer.processConnectRequest Client attempting to establish new session at /127.0.0.1:51275
[junit4:junit4]   2> 492 T1846 oazs.ZooKeeperServer.finishSessionInit Established session 0x13c974be4b70002 with negotiated timeout 20000 for client /127.0.0.1:51275
[junit4:junit4]   2> 492 T1861 oaz.ClientCnxn$SendThread.onConnected Session establishment complete on server localhost/127.0.0.1:51271, sessionid = 0x13c974be4b70002, negotiated timeout = 20000
[junit4:junit4]   2> 493 T1862 oascc.ConnectionManager.process Watcher org.apache.solr.common.cloud.ConnectionManager@3494aef8 name:ZooKeeperConnection Watcher:127.0.0.1:51271 got event WatchedEvent state:SyncConnected type:None path:null path:null type:None
[junit4:junit4]   2> 493 T1842 oascc.ConnectionManager.waitForConnected Client is connected to ZooKeeper
[junit4:junit4]   2> 496 T1847 oazs.PrepRequestProcessor.pRequest2Txn Processed session termination for sessionid: 0x13c974be4b70002
[junit4:junit4]   2> 497 T1844 oazs.NIOServerCnxn.closeSock Closed socket connection for client /127.0.0.1:51275 which had sessionid 0x13c974be4b70002
[junit4:junit4]   2> 497 T1842 oaz.ZooKeeper.close Session: 0x13c974be4b70002 closed
[junit4:junit4]   2> 497 T1862 oaz.ClientCnxn$EventThread.run EventThread shut down
[junit4:junit4]   2> 497 T1842 oascsi.HttpClientUtil.createClient Creating new http client, config:maxConnections=500&maxConnectionsPerHost=16&socketTimeout=60000&connTimeout=15000
[junit4:junit4]   2> 506 T1842 oaz.ZooKeeper.<init> Initiating client connection, connectString=127.0.0.1:51271/solr sessionTimeout=30000 watcher=org.apache.solr.common.cloud.ConnectionManager@15a55678
[junit4:junit4]   2> 508 T1842 oascc.ConnectionManager.waitForConnected Waiting for client to connect to ZooKeeper
[junit4:junit4]   2> 508 T1863 oaz.ClientCnxn$SendThread.logStartConnect Opening socket connection to server localhost/127.0.0.1:51271. Will not attempt to authenticate using SASL (access denied ("javax.security.auth.AuthPermission" "getLoginConfiguration"))
[junit4:junit4]   2> 509 T1863 oaz.ClientCnxn$SendThread.primeConnection Socket connection established to localhost/127.0.0.1:51271, initiating session
[junit4:junit4]   2> 509 T1844 oazs.NIOServerCnxnFactory.run Accepted socket connection from /127.0.0.1:51276
[junit4:junit4]   2> 510 T1844 oazs.ZooKeeperServer.processConnectRequest Client attempting to establish new session at /127.0.0.1:51276
[junit4:junit4]   2> 511 T1846 oazs.ZooKeeperServer.finishSessionInit Established session 0x13c974be4b70003 with negotiated timeout 20000 for client /127.0.0.1:51276
[junit4:junit4]   2> 511 T1863 oaz.ClientCnxn$SendThread.onConnected Session establishment complete on server localhost/127.0.0.1:51271, sessionid = 0x13c974be4b70003, negotiated timeout = 20000
[junit4:junit4]   2> 512 T1864 oascc.ConnectionManager.process Watcher org.apache.solr.common.cloud.ConnectionManager@15a55678 name:ZooKeeperConnection Watcher:127.0.0.1:51271/solr got event WatchedEvent state:SyncConnected type:None path:null path:null type:None
[junit4:junit4]   2> 512 T1842 oascc.ConnectionManager.waitForConnected Client is connected to ZooKeeper
[junit4:junit4]   2> 515 T1847 oazs.PrepRequestProcessor.pRequest Got user-level KeeperException when processing sessionid:0x13c974be4b70003 type:create cxid:0x2 zxid:0x1a txntype:-1 reqpath:n/a Error Path:/solr/overseer Error:KeeperErrorCode = NodeExists for /solr/overseer
[junit4:junit4]   2> 517 T1842 oascc.SolrZkClient.makePath makePath: /live_nodes
[junit4:junit4]   2> 521 T1842 oasc.ZkController.createEphemeralLiveNode Register node as live in ZooKeeper:/live_nodes/127.0.0.1:51274_i
[junit4:junit4]   2> 522 T1847 oazs.PrepRequestProcessor.pRequest Got user-level KeeperException when processing sessionid:0x13c974be4b70003 type:delete cxid:0x7 zxid:0x1c txntype:-1 reqpath:n/a Error Path:/solr/live_nodes/127.0.0.1:51274_i Error:KeeperErrorCode = NoNode for /solr/live_nodes/127.0.0.1:51274_i
[junit4:junit4]   2> 523 T1842 oascc.SolrZkClient.makePath makePath: /live_nodes/127.0.0.1:51274_i
[junit4:junit4]   2> 529 T1842 oascc.SolrZkClient.makePath makePath: /overseer_elect/election
[junit4:junit4]   2> 537 T1847 oazs.PrepRequestProcessor.pRequest Got user-level KeeperException when processing sessionid:0x13c974be4b70003 type:delete cxid:0x15 zxid:0x21 txntype:-1 reqpath:n/a Error Path:/solr/overseer_elect/leader Error:KeeperErrorCode = NoNode for /solr/overseer_elect/leader
[junit4:junit4]   2> 538 T1842 oascc.SolrZkClient.makePath makePath: /overseer_elect/leader
[junit4:junit4]   2> 542 T1842 oasc.Overseer.start Overseer (id=89112444856107011-127.0.0.1:51274_i-n_0000000000) starting
[junit4:junit4]   2> 544 T1847 oazs.PrepRequestProcessor.pRequest Got user-level KeeperException when processing sessionid:0x13c974be4b70003 type:create cxid:0x1a zxid:0x23 txntype:-1 reqpath:n/a Error Path:/solr/overseer Error:KeeperErrorCode = NodeExists for /solr/overseer
[junit4:junit4]   2> 545 T1847 oazs.PrepRequestProcessor.pRequest Got user-level KeeperException when processing sessionid:0x13c974be4b70003 type:create cxid:0x1b zxid:0x24 txntype:-1 reqpath:n/a Error Path:/solr/overseer Error:KeeperErrorCode = NodeExists for /solr/overseer
[junit4:junit4]   2> 547 T1847 oazs.PrepRequestProcessor.pRequest Got user-level KeeperException when processing sessionid:0x13c974be4b70003 type:create cxid:0x1c zxid:0x25 txntype:-1 reqpath:n/a Error Path:/solr/overseer Error:KeeperErrorCode = NodeExists for /solr/overseer
[junit4:junit4]   2> 548 T1847 oazs.PrepRequestProcessor.pRequest Got user-level KeeperException when processing sessionid:0x13c974be4b70003 type:create cxid:0x1d zxid:0x26 txntype:-1 reqpath:n/a Error Path:/solr/overseer Error:KeeperErrorCode = NodeExists for /solr/overseer
[junit4:junit4]   2> 550 T1866 oasc.OverseerCollectionProcessor.run Process current queue of collection creations
[junit4:junit4]   2> 551 T1842 oascc.SolrZkClient.makePath makePath: /clusterstate.json
[junit4:junit4]   2> 555 T1842 oascc.ZkStateReader.createClusterStateWatchersAndUpdate Updating cluster state from ZooKeeper... 
[junit4:junit4]   2> 559 T1865 oasc.Overseer$ClusterStateUpdater.run Starting to work on the main queue
[junit4:junit4]   2> 565 T1867 oasc.CoreContainer.create Creating SolrCore 'collection1' using instanceDir: /Users/jenkins/jenkins-slave/workspace/Lucene-Solr-4.x-MacOSX/solr/build/solr-core/test/J0/./org.apache.solr.cloud.BasicDistributedZkTest-controljetty-1359747999096/collection1
[junit4:junit4]   2> 565 T1867 oasc.ZkController.createCollectionZkNode Check for collection zkNode:control_collection
[junit4:junit4]   2> 566 T1867 oasc.ZkController.createCollectionZkNode Collection zkNode exists
[junit4:junit4]   2> 567 T1867 oasc.ZkController.readConfigName Load collection config from:/collections/control_collection
[junit4:junit4]   2> 569 T1867 oasc.SolrResourceLoader.<init> new SolrResourceLoader for directory: '/Users/jenkins/jenkins-slave/workspace/Lucene-Solr-4.x-MacOSX/solr/build/solr-core/test/J0/./org.apache.solr.cloud.BasicDistributedZkTest-controljetty-1359747999096/collection1/'
[junit4:junit4]   2> 570 T1867 oasc.SolrResourceLoader.replaceClassLoader Adding 'file:/Users/jenkins/jenkins-slave/workspace/Lucene-Solr-4.x-MacOSX/solr/build/solr-core/test/J0/org.apache.solr.cloud.BasicDistributedZkTest-controljetty-1359747999096/collection1/lib/classes/' to classloader
[junit4:junit4]   2> 571 T1867 oasc.SolrResourceLoader.replaceClassLoader Adding 'file:/Users/jenkins/jenkins-slave/workspace/Lucene-Solr-4.x-MacOSX/solr/build/solr-core/test/J0/org.apache.solr.cloud.BasicDistributedZkTest-controljetty-1359747999096/collection1/lib/README' to classloader
[junit4:junit4]   2> 625 T1867 oasc.SolrConfig.<init> Using Lucene MatchVersion: LUCENE_42
[junit4:junit4]   2> 693 T1867 oasc.SolrConfig.<init> Loaded SolrConfig: solrconfig.xml
[junit4:junit4]   2> 694 T1867 oass.IndexSchema.readSchema Reading Solr Schema
[junit4:junit4]   2> 700 T1867 oass.IndexSchema.readSchema Schema name=test
[junit4:junit4]   2> 1290 T1867 oass.OpenExchangeRatesOrgProvider.init Initialized with rates=open-exchange-rates.json, refreshInterval=1440.
[junit4:junit4]   2> 1301 T1867 oass.IndexSchema.readSchema default search field in schema is text
[junit4:junit4]   2> 1308 T1867 oass.IndexSchema.readSchema unique key field: id
[junit4:junit4]   2> 1340 T1867 oass.FileExchangeRateProvider.reload Reloading exchange rates from file currency.xml
[junit4:junit4]   2> 1346 T1867 oass.FileExchangeRateProvider.reload Reloading exchange rates from file currency.xml
[junit4:junit4]   2> 1356 T1867 oass.OpenExchangeRatesOrgProvider.reload Reloading exchange rates from open-exchange-rates.json
[junit4:junit4]   2> 1359 T1867 oass.OpenExchangeRatesOrgProvider.reload Reloading exchange rates from open-exchange-rates.json
[junit4:junit4]   2> 1361 T1867 oasc.SolrCore.<init> [collection1] Opening new SolrCore at /Users/jenkins/jenkins-slave/workspace/Lucene-Solr-4.x-MacOSX/solr/build/solr-core/test/J0/./org.apache.solr.cloud.BasicDistributedZkTest-controljetty-1359747999096/collection1/, dataDir=./org.apache.solr.cloud.BasicDistributedZkTest-1359747998897/control/data/
[junit4:junit4]   2> 1362 T1867 oasc.JmxMonitoredMap.<init> JMX monitoring is enabled. Adding Solr mbeans to JMX Server: com.sun.jmx.mbeanserver.JmxMBeanServer@67b38e47
[junit4:junit4]   2> 1362 T1867 oasc.SolrCore.initDirectoryFactory solr.NRTCachingDirectoryFactory
[junit4:junit4]   2> 1363 T1867 oasc.CachingDirectoryFactory.get return new directory for /Users/jenkins/jenkins-slave/workspace/Lucene-Solr-4.x-MacOSX/solr/build/solr-core/test/J0/./org.apache.solr.cloud.BasicDistributedZkTest-1359747998897/control/data forceNew:false
[junit4:junit4]   2> 1364 T1867 oasc.CachingDirectoryFactory.close Releasing directory:/Users/jenkins/jenkins-slave/workspace/Lucene-Solr-4.x-MacOSX/solr/build/solr-core/test/J0/./org.apache.solr.cloud.BasicDistributedZkTest-1359747998897/control/data
[junit4:junit4]   2> 1364 T1867 oasc.SolrCore.getNewIndexDir New index directory detected: old=null new=./org.apache.solr.cloud.BasicDistributedZkTest-1359747998897/control/data/index/
[junit4:junit4]   2> 1365 T1867 oasc.SolrCore.initIndex WARNING [collection1] Solr index directory './org.apache.solr.cloud.BasicDistributedZkTest-1359747998897/control/data/index' doesn't exist. Creating new index...
[junit4:junit4]   2> 1365 T1867 oasc.CachingDirectoryFactory.get return new directory for /Users/jenkins/jenkins-slave/workspace/Lucene-Solr-4.x-MacOSX/solr/build/solr-core/test/J0/./org.apache.solr.cloud.BasicDistributedZkTest-1359747998897/control/data/index forceNew:false
[junit4:junit4]   2> 1419 T1867 oasc.SolrDeletionPolicy.onCommit SolrDeletionPolicy.onCommit: commits:num=1
[junit4:junit4]   2> 		commit{dir=RateLimitedDirectoryWrapper(NRTCachingDirectory(org.apache.lucene.store.NIOFSDirectory@/Users/jenkins/jenkins-slave/workspace/Lucene-Solr-4.x-MacOSX/solr/build/solr-core/test/J0/org.apache.solr.cloud.BasicDistributedZkTest-1359747998897/control/data/index lockFactory=org.apache.lucene.store.NativeFSLockFactory@2ba97721; maxCacheMB=48.0 maxMergeSizeMB=4.0)),segFN=segments_1,generation=1,filenames=[segments_1]
[junit4:junit4]   2> 1419 T1867 oasc.SolrDeletionPolicy.updateCommits newest commit = 1[segments_1]
[junit4:junit4]   2> 1420 T1867 oasc.CachingDirectoryFactory.close Releasing directory:/Users/jenkins/jenkins-slave/workspace/Lucene-Solr-4.x-MacOSX/solr/build/solr-core/test/J0/./org.apache.solr.cloud.BasicDistributedZkTest-1359747998897/control/data/index
[junit4:junit4]   2> 1421 T1867 oasc.SolrCore.initWriters created xml: solr.XMLResponseWriter
[junit4:junit4]   2> 1423 T1867 oasup.UpdateRequestProcessorChain.init inserting DistributedUpdateProcessorFactory into updateRequestProcessorChain "dedupe"
[junit4:junit4]   2> 1424 T1867 oasup.UpdateRequestProcessorChain.init inserting DistributedUpdateProcessorFactory into updateRequestProcessorChain "dedupe-allfields"
[junit4:junit4]   2> 1424 T1867 oasup.UpdateRequestProcessorChain.init inserting DistributedUpdateProcessorFactory into updateRequestProcessorChain "stored_sig"
[junit4:junit4]   2> 1425 T1867 oasup.UpdateRequestProcessorChain.init inserting DistributedUpdateProcessorFactory into updateRequestProcessorChain "uniq-fields"
[junit4:junit4]   2> 1426 T1867 oasup.UpdateRequestProcessorChain.init inserting DistributedUpdateProcessorFactory into updateRequestProcessorChain "distrib-dup-test-chain-implicit"
[junit4:junit4]   2> 1426 T1867 oasc.RequestHandlers.initHandlersFromConfig adding lazy requestHandler: solr.ReplicationHandler
[junit4:junit4]   2> 1426 T1867 oasc.RequestHandlers.initHandlersFromConfig created /replication: solr.ReplicationHandler
[junit4:junit4]   2> 1427 T1867 oasc.RequestHandlers.initHandlersFromConfig created standard: solr.StandardRequestHandler
[junit4:junit4]   2> 1427 T1867 oasc.RequestHandlers.initHandlersFromConfig created /get: solr.RealTimeGetHandler
[junit4:junit4]   2> 1428 T1867 oasc.RequestHandlers.initHandlersFromConfig created dismax: solr.SearchHandler
[junit4:junit4]   2> 1429 T1867 oasc.RequestHandlers.initHandlersFromConfig created mock: org.apache.solr.core.MockQuerySenderListenerReqHandler
[junit4:junit4]   2> 1429 T1867 oasc.RequestHandlers.initHandlersFromConfig created /admin/: org.apache.solr.handler.admin.AdminHandlers
[junit4:junit4]   2> 1430 T1867 oasc.RequestHandlers.initHandlersFromConfig created defaults: solr.StandardRequestHandler
[junit4:junit4]   2> 1430 T1867 oasc.RequestHandlers.initHandlersFromConfig adding lazy requestHandler: solr.StandardRequestHandler
[junit4:junit4]   2> 1431 T1867 oasc.RequestHandlers.initHandlersFromConfig created lazy: solr.StandardRequestHandler
[junit4:junit4]   2> 1431 T1867 oasc.RequestHandlers.initHandlersFromConfig created /update: solr.UpdateRequestHandler
[junit4:junit4]   2> 1432 T1867 oasc.RequestHandlers.initHandlersFromConfig created /terms: org.apache.solr.handler.component.SearchHandler
[junit4:junit4]   2> 1432 T1867 oasc.RequestHandlers.initHandlersFromConfig created spellCheckCompRH: org.apache.solr.handler.component.SearchHandler
[junit4:junit4]   2> 1433 T1867 oasc.RequestHandlers.initHandlersFromConfig created spellCheckCompRH_Direct: org.apache.solr.handler.component.SearchHandler
[junit4:junit4]   2> 1433 T1867 oasc.RequestHandlers.initHandlersFromConfig created spellCheckWithWordbreak: org.apache.solr.handler.component.SearchHandler
[junit4:junit4]   2> 1434 T1867 oasc.RequestHandlers.initHandlersFromConfig created spellCheckWithWordbreak_Direct: org.apache.solr.handler.component.SearchHandler
[junit4:junit4]   2> 1435 T1867 oasc.RequestHandlers.initHandlersFromConfig created spellCheckCompRH1: org.apache.solr.handler.component.SearchHandler
[junit4:junit4]   2> 1435 T1867 oasc.RequestHandlers.initHandlersFromConfig created mltrh: org.apache.solr.handler.component.SearchHandler
[junit4:junit4]   2> 1436 T1867 oasc.RequestHandlers.initHandlersFromConfig created tvrh: org.apache.solr.handler.component.SearchHandler
[junit4:junit4]   2> 1436 T1867 oasc.RequestHandlers.initHandlersFromConfig created /mlt: solr.MoreLikeThisHandler
[junit4:junit4]   2> 1437 T1867 oasc.RequestHandlers.initHandlersFromConfig created /debug/dump: solr.DumpRequestHandler
[junit4:junit4]   2> 1444 T1867 oashl.XMLLoader.init xsltCacheLifetimeSeconds=60
[junit4:junit4]   2> 1448 T1867 oasc.SolrCore.initDeprecatedSupport WARNING solrconfig.xml uses deprecated <admin/gettableFiles>, Please update your config to use the ShowFileRequestHandler.
[junit4:junit4]   2> 1449 T1867 oasc.SolrCore.initDeprecatedSupport WARNING adding ShowFileRequestHandler with hidden files: [SCHEMA.XML, OLD_SYNONYMS.TXT, STOPWORDS.TXT, PROTWORDS.TXT, OPEN-EXCHANGE-RATES.JSON, SYNONYMS.TXT, CURRENCY.XML, MAPPING-ISOLATIN1ACCENT.TXT]
[junit4:junit4]   2> 1452 T1867 oasc.CachingDirectoryFactory.close Releasing directory:/Users/jenkins/jenkins-slave/workspace/Lucene-Solr-4.x-MacOSX/solr/build/solr-core/test/J0/./org.apache.solr.cloud.BasicDistributedZkTest-1359747998897/control/data
[junit4:junit4]   2> 1453 T1867 oass.SolrIndexSearcher.<init> Opening Searcher@40455afe main
[junit4:junit4]   2> 1454 T1867 oasu.CommitTracker.<init> Hard AutoCommit: disabled
[junit4:junit4]   2> 1455 T1867 oasu.CommitTracker.<init> Soft AutoCommit: disabled
[junit4:junit4]   2> 1456 T1867 oashc.SpellCheckComponent.inform Initializing spell checkers
[junit4:junit4]   2> 1462 T1867 oass.DirectSolrSpellChecker.init init: {name=direct,classname=DirectSolrSpellChecker,field=lowerfilt,minQueryLength=3}
[junit4:junit4]   2> 1500 T1868 oasc.SolrCore.registerSearcher [collection1] Registered new searcher Searcher@40455afe main{StandardDirectoryReader(segments_1:1)}
[junit4:junit4]   2> 1507 T1867 oasc.ZkController.publish publishing core=collection1 state=down
[junit4:junit4]   2> 1507 T1867 oasc.ZkController.publish numShards not found on descriptor - reading it from system property
[junit4:junit4]   2> 1508 T1847 oazs.PrepRequestProcessor.pRequest Got user-level KeeperException when processing sessionid:0x13c974be4b70003 type:create cxid:0x50 zxid:0x29 txntype:-1 reqpath:n/a Error Path:/solr/overseer/queue Error:KeeperErrorCode = NoNode for /solr/overseer/queue
[junit4:junit4]   2> 2067 T1865 oascc.ZkStateReader.updateClusterState Updating cloud state from ZooKeeper... 
[junit4:junit4]   2> 2069 T1865 oasc.Overseer$ClusterStateUpdater.updateState Update state numShards=1 message={
[junit4:junit4]   2> 	  "operation":"state",
[junit4:junit4]   2> 	  "numShards":"1",
[junit4:junit4]   2> 	  "shard":null,
[junit4:junit4]   2> 	  "roles":null,
[junit4:junit4]   2> 	  "state":"down",
[junit4:junit4]   2> 	  "core":"collection1",
[junit4:junit4]   2> 	  "collection":"control_collection",
[junit4:junit4]   2> 	  "node_name":"127.0.0.1:51274_i",
[junit4:junit4]   2> 	  "base_url":"http://127.0.0.1:51274/i"}
[junit4:junit4]   2> 2069 T1865 oasc.Overseer$ClusterStateUpdater.createCollection Create collection control_collection with numShards 1
[junit4:junit4]   2> 2070 T1865 oasc.Overseer$ClusterStateUpdater.updateState Assigning new node to shard shard=shard1
[junit4:junit4]   2> 2071 T1847 oazs.PrepRequestProcessor.pRequest Got user-level KeeperException when processing sessionid:0x13c974be4b70003 type:create cxid:0x58 zxid:0x2c txntype:-1 reqpath:n/a Error Path:/solr/overseer/queue-work Error:KeeperErrorCode = NoNode for /solr/overseer/queue-work
[junit4:junit4]   2> 2081 T1864 oascc.ZkStateReader$2.process A cluster state change: WatchedEvent state:SyncConnected type:NodeDataChanged path:/clusterstate.json, has occurred - updating... (live nodes size: 1)
[junit4:junit4]   2> 2513 T1867 oasc.CoreContainer.registerCore registering core: collection1
[junit4:junit4]   2> 2513 T1867 oasc.ZkController.register Register replica - core:collection1 address:http://127.0.0.1:51274/i collection:control_collection shard:shard1
[junit4:junit4]   2> 2515 T1867 oascc.SolrZkClient.makePath makePath: /collections/control_collection/leader_elect/shard1/election
[junit4:junit4]   2> 2526 T1847 oazs.PrepRequestProcessor.pRequest Got user-level KeeperException when processing sessionid:0x13c974be4b70003 type:delete cxid:0x72 zxid:0x36 txntype:-1 reqpath:n/a Error Path:/solr/collections/control_collection/leaders Error:KeeperErrorCode = NoNode for /solr/collections/control_collection/leaders
[junit4:junit4]   2> 2528 T1867 oasc.ShardLeaderElectionContext.runLeaderProcess Running the leader process.
[junit4:junit4]   2> 2528 T1847 oazs.PrepRequestProcessor.pRequest Got user-level KeeperException when processing sessionid:0x13c974be4b70003 type:create cxid:0x73 zxid:0x37 txntype:-1 reqpath:n/a Error Path:/solr/overseer Error:KeeperErrorCode = NodeExists for /solr/overseer
[junit4:junit4]   2> 2532 T1867 oasc.ShardLeaderElectionContext.waitForReplicasToComeUp Enough replicas found to continue.
[junit4:junit4]   2> 2532 T1867 oasc.ShardLeaderElectionContext.runLeaderProcess I may be the new leader - try and sync
[junit4:junit4]   2> 2533 T1867 oasc.SyncStrategy.sync Sync replicas to http://127.0.0.1:51274/i/collection1/
[junit4:junit4]   2> 2533 T1867 oasc.SyncStrategy.syncReplicas Sync Success - now sync replicas to me
[junit4:junit4]   2> 2534 T1867 oasc.SyncStrategy.syncToMe http://127.0.0.1:51274/i/collection1/ has no replicas
[junit4:junit4]   2> 2534 T1867 oasc.ShardLeaderElectionContext.runLeaderProcess I am the new leader: http://127.0.0.1:51274/i/collection1/
[junit4:junit4]   2> 2535 T1867 oascc.SolrZkClient.makePath makePath: /collections/control_collection/leaders/shard1
[junit4:junit4]   2> 2543 T1847 oazs.PrepRequestProcessor.pRequest Got user-level KeeperException when processing sessionid:0x13c974be4b70003 type:create cxid:0x7d zxid:0x3b txntype:-1 reqpath:n/a Error Path:/solr/overseer Error:KeeperErrorCode = NodeExists for /solr/overseer
[junit4:junit4]   2> 3592 T1865 oascc.ZkStateReader.updateClusterState Updating cloud state from ZooKeeper... 
[junit4:junit4]   2> 3607 T1864 oascc.ZkStateReader$2.process A cluster state change: WatchedEvent state:SyncConnected type:NodeDataChanged path:/clusterstate.json, has occurred - updating... (live nodes size: 1)
[junit4:junit4]   2> 3623 T1867 oasc.ZkController.register We are http://127.0.0.1:51274/i/collection1/ and leader is http://127.0.0.1:51274/i/collection1/
[junit4:junit4]   2> 3624 T1867 oasc.ZkController.register No LogReplay needed for core=collection1 baseURL=http://127.0.0.1:51274/i
[junit4:junit4]   2> 3624 T1867 oasc.ZkController.checkRecovery I am the leader, no recovery necessary
[junit4:junit4]   2> 3625 T1867 oasc.ZkController.publish publishing core=collection1 state=active
[junit4:junit4]   2> 3625 T1867 oasc.ZkController.publish numShards not found on descriptor - reading it from system property
[junit4:junit4]   2> 3628 T1867 oascc.ZkStateReader.updateClusterState Updating cloud state from ZooKeeper... 
[junit4:junit4]   2> 3630 T1842 oass.SolrDispatchFilter.init user.dir=/Users/jenkins/jenkins-slave/workspace/Lucene-Solr-4.x-MacOSX/solr/build/solr-core/test/J0
[junit4:junit4]   2> 3631 T1842 oass.SolrDispatchFilter.init SolrDispatchFilter.init() done
[junit4:junit4]   2> 3632 T1842 oascsi.HttpClientUtil.createClient Creating new http client, config:maxConnections=128&maxConnectionsPerHost=32&followRedirects=false
[junit4:junit4]   2> 3641 T1842 oascsi.HttpClientUtil.createClient Creating new http client, config:
[junit4:junit4]   2> 3648 T1842 oaz.ZooKeeper.<init> Initiating client connection, connectString=127.0.0.1:51271/solr sessionTimeout=10000 watcher=org.apache.solr.common.cloud.ConnectionManager@2427359b
[junit4:junit4]   2> 3649 T1842 oascc.ConnectionManager.waitForConnected Waiting for client to connect to ZooKeeper
[junit4:junit4]   2> 3650 T1869 oaz.ClientCnxn$SendThread.logStartConnect Opening socket connection to server localhost/127.0.0.1:51271. Will not attempt to authenticate using SASL (access denied ("javax.security.auth.AuthPermission" "getLoginConfiguration"))
[junit4:junit4]   2> 3651 T1869 oaz.ClientCnxn$SendThread.primeConnection Socket connection established to localhost/127.0.0.1:51271, initiating session
[junit4:junit4]   2> 3651 T1844 oazs.NIOServerCnxnFactory.run Accepted socket connection from /127.0.0.1:51277
[junit4:junit4]   2> 3652 T1844 oazs.ZooKeeperServer.processConnectRequest Client attempting to establish new session at /127.0.0.1:51277
[junit4:junit4]   2> 3654 T1846 oazs.ZooKeeperServer.finishSessionInit Established session 0x13c974be4b70004 with negotiated timeout 10000 for client /127.0.0.1:51277
[junit4:junit4]   2> 3654 T1869 oaz.ClientCnxn$SendThread.onConnected Session establishment complete on server localhost/127.0.0.1:51271, sessionid = 0x13c974be4b70004, negotiated timeout = 10000
[junit4:junit4]   2> 3655 T1870 oascc.ConnectionManager.process Watcher org.apache.solr.common.cloud.ConnectionManager@2427359b name:ZooKeeperConnection Watcher:127.0.0.1:51271/solr got event WatchedEvent state:SyncConnected type:None path:null path:null type:None
[junit4:junit4]   2> 3655 T1842 oascc.ConnectionManager.waitForConnected Client is connected to ZooKeeper
[junit4:junit4]   2> 3657 T1842 oascc.ZkStateReader.createClusterStateWatchersAndUpdate Updating cluster state from ZooKeeper... 
[junit4:junit4]   2> 3660 T1842 oasc.ChaosMonkey.monkeyLog monkey: init - expire sessions:true cause connection loss:true
[junit4:junit4]   2> 3825 T1842 oejs.Server.doStart jetty-8.1.8.v20121106
[junit4:junit4]   2> 3830 T1842 oejs.AbstractConnector.doStart Started SelectChannelConnector@127.0.0.1:51278
[junit4:junit4]   2> 3831 T1842 oass.SolrDispatchFilter.init SolrDispatchFilter.init()
[junit4:junit4]   2> 3832 T1842 oasc.SolrResourceLoader.locateSolrHome JNDI not configured for solr (NoInitialContextEx)
[junit4:junit4]   2> 3832 T1842 oasc.SolrResourceLoader.locateSolrHome using system property solr.solr.home: /Users/jenkins/jenkins-slave/workspace/Lucene-Solr-4.x-MacOSX/solr/build/solr-core/test/J0/./org.apache.solr.cloud.BasicDistributedZkTest-jetty1-1359748002551
[junit4:junit4]   2> 3833 T1842 oasc.CoreContainer$Initializer.initialize looking for solr.xml: /Users/jenkins/jenkins-slave/workspace/Lucene-Solr-4.x-MacOSX/solr/build/solr-core/test/J0/./org.apache.solr.cloud.BasicDistributedZkTest-jetty1-1359748002551/solr.xml
[junit4:junit4]   2> 3834 T1842 oasc.CoreContainer.<init> New CoreContainer 873109371
[junit4:junit4]   2> 3835 T1842 oasc.CoreContainer.load Loading CoreContainer using Solr Home: '/Users/jenkins/jenkins-slave/workspace/Lucene-Solr-4.x-MacOSX/solr/build/solr-core/test/J0/./org.apache.solr.cloud.BasicDistributedZkTest-jetty1-1359748002551/'
[junit4:junit4]   2> 3836 T1842 oasc.SolrResourceLoader.<init> new SolrResourceLoader for directory: '/Users/jenkins/jenkins-slave/workspace/Lucene-Solr-4.x-MacOSX/solr/build/solr-core/test/J0/./org.apache.solr.cloud.BasicDistributedZkTest-jetty1-1359748002551/'
[junit4:junit4]   2> 3878 T1842 oashc.HttpShardHandlerFactory.getParameter Setting socketTimeout to: 60000
[junit4:junit4]   2> 3879 T1842 oashc.HttpShardHandlerFactory.getParameter Setting urlScheme to: http://
[junit4:junit4]   2> 3879 T1842 oashc.HttpShardHandlerFactory.getParameter Setting connTimeout to: 15000
[junit4:junit4]   2> 3880 T1842 oashc.HttpShardHandlerFactory.getParameter Setting maxConnectionsPerHost to: 20
[junit4:junit4]   2> 3880 T1842 oashc.HttpShardHandlerFactory.getParameter Setting corePoolSize to: 0
[junit4:junit4]   2> 3881 T1842 oashc.HttpShardHandlerFactory.getParameter Setting maximumPoolSize to: 2147483647
[junit4:junit4]   2> 3881 T1842 oashc.HttpShardHandlerFactory.getParameter Setting maxThreadIdleTime to: 5
[junit4:junit4]   2> 3882 T1842 oashc.HttpShardHandlerFactory.getParameter Setting sizeOfQueue to: -1
[junit4:junit4]   2> 3882 T1842 oashc.HttpShardHandlerFactory.getParameter Setting fairnessPolicy to: false
[junit4:junit4]   2> 3883 T1842 oascsi.HttpClientUtil.createClient Creating new http client, config:maxConnectionsPerHost=20&maxConnections=10000&socketTimeout=60000&connTimeout=15000&retry=false
[junit4:junit4]   2> 3899 T1842 oasc.CoreContainer.load Registering Log Listener
[junit4:junit4]   2> 3920 T1842 oasc.CoreContainer.initZooKeeper Zookeeper client=127.0.0.1:51271/solr
[junit4:junit4]   2> 3920 T1842 oasc.ZkController.checkChrootPath zkHost includes chroot
[junit4:junit4]   2> 3921 T1842 oaz.ZooKeeper.<init> Initiating client connection, connectString=127.0.0.1:51271 sessionTimeout=60000 watcher=org.apache.solr.common.cloud.ConnectionManager@42a4d979
[junit4:junit4]   2> 3922 T1842 oascc.ConnectionManager.waitForConnected Waiting for client to connect to ZooKeeper
[junit4:junit4]   2> 3923 T1880 oaz.ClientCnxn$SendThread.logStartConnect Opening socket connection to server localhost/127.0.0.1:51271. Will not attempt to authenticate using SASL (access denied ("javax.security.auth.AuthPermission" "getLoginConfiguration"))
[junit4:junit4]   2> 3924 T1880 oaz.ClientCnxn$SendThread.primeConnection Socket connection established to localhost/127.0.0.1:51271, initiating session
[junit4:junit4]   2> 3924 T1844 oazs.NIOServerCnxnFactory.run Accepted socket connection from /127.0.0.1:51279
[junit4:junit4]   2> 3925 T1844 oazs.ZooKeeperServer.processConnectRequest Client attempting to establish new session at /127.0.0.1:51279
[junit4:junit4]   2> 3926 T1846 oazs.ZooKeeperServer.finishSessionInit Established session 0x13c974be4b70005 with negotiated timeout 20000 for client /127.0.0.1:51279
[junit4:junit4]   2> 3926 T1880 oaz.ClientCnxn$SendThread.onConnected Session establishment complete on server localhost/127.0.0.1:51271, sessionid = 0x13c974be4b70005, negotiated timeout = 20000
[junit4:junit4]   2> 3927 T1881 oascc.ConnectionManager.process Watcher org.apache.solr.common.cloud.ConnectionManager@42a4d979 name:ZooKeeperConnection Watcher:127.0.0.1:51271 got event WatchedEvent state:SyncConnected type:None path:null path:null type:None
[junit4:junit4]   2> 3927 T1842 oascc.ConnectionManager.waitForConnected Client is connected to ZooKeeper
[junit4:junit4]   2> 3929 T1847 oazs.PrepRequestProcessor.pRequest2Txn Processed session termination for sessionid: 0x13c974be4b70005
[junit4:junit4]   2> 3930 T1844 oazs.NIOServerCnxn.closeSock Closed socket connection for client /127.0.0.1:51279 which had sessionid 0x13c974be4b70005
[junit4:junit4]   2> 3931 T1881 oaz.ClientCnxn$EventThread.run EventThread shut down
[junit4:junit4]   2> 3930 T1842 oaz.ZooKeeper.close Session: 0x13c974be4b70005 closed
[junit4:junit4]   2> 3932 T1842 oascsi.HttpClientUtil.createClient Creating new http client, config:maxConnections=500&maxConnectionsPerHost=16&socketTimeout=60000&connTimeout=15000
[junit4:junit4]   2> 3943 T1842 oaz.ZooKeeper.<init> Initiating client connection, connectString=127.0.0.1:51271/solr sessionTimeout=30000 watcher=org.apache.solr.common.cloud.ConnectionManager@65f5d6e0
[junit4:junit4]   2> 3945 T1842 oascc.ConnectionManager.waitForConnected Waiting for client to connect to ZooKeeper
[junit4:junit4]   2> 3945 T1882 oaz.ClientCnxn$SendThread.logStartConnect Opening socket connection to server localhost/127.0.0.1:51271. Will not attempt to authenticate using SASL (access denied ("javax.security.auth.AuthPermission" "getLoginConfiguration"))
[junit4:junit4]   2> 3947 T1882 oaz.ClientCnxn$SendThread.primeConnection Socket connection established to localhost/127.0.0.1:51271, initiating session
[junit4:junit4]   2> 3947 T1844 oazs.NIOServerCnxnFactory.run Accepted socket connection from /127.0.0.1:51280
[junit4:junit4]   2> 3948 T1844 oazs.ZooKeeperServer.processConnectRequest Client attempting to establish new session at /127.0.0.1:51280
[junit4:junit4]   2> 3949 T1846 oazs.ZooKeeperServer.finishSessionInit Established session 0x13c974be4b70006 with negotiated timeout 20000 for client /127.0.0.1:51280
[junit4:junit4]   2> 3949 T1882 oaz.ClientCnxn$SendThread.onConnected Session establishment complete on server localhost/127.0.0.1:51271, sessionid = 0x13c974be4b70006, negotiated timeout = 20000
[junit4:junit4]   2> 3950 T1883 oascc.ConnectionManager.process Watcher org.apache.solr.common.cloud.ConnectionManager@65f5d6e0 name:ZooKeeperConnection Watcher:127.0.0.1:51271/solr got event WatchedEvent state:SyncConnected type:None path:null path:null type:None
[junit4:junit4]   2> 3950 T1842 oascc.ConnectionManager.waitForConnected Client is connected to ZooKeeper
[junit4:junit4]   2> 3952 T1847 oazs.PrepRequestProcessor.pRequest Got user-level KeeperException when processing sessionid:0x13c974be4b70006 type:create cxid:0x1 zxid:0x49 txntype:-1 reqpath:n/a Error Path:/solr/overseer Error:KeeperErrorCode = NodeExists for /solr/overseer
[junit4:junit4]   2> 3954 T1847 oazs.PrepRequestProcessor.pRequest Got user-level KeeperException when processing sessionid:0x13c974be4b70006 type:create cxid:0x2 zxid:0x4a txntype:-1 reqpath:n/a Error Path:/solr/overseer Error:KeeperErrorCode = NodeExists for /solr/overseer
[junit4:junit4]   2> 3956 T1842 oasc.ZkController.createEphemeralLiveNode Register node as live in ZooKeeper:/live_nodes/127.0.0.1:51278_i
[junit4:junit4]   2> 3957 T1847 oazs.PrepRequestProcessor.pRequest Got user-level KeeperException when processing sessionid:0x13c974be4b70006 type:delete cxid:0x4 zxid:0x4b txntype:-1 reqpath:n/a Error Path:/solr/live_nodes/127.0.0.1:51278_i Error:KeeperErrorCode = NoNode for /solr/live_nodes/127.0.0.1:51278_i
[junit4:junit4]   2> 3959 T1842 oascc.SolrZkClient.makePath makePath: /live_nodes/127.0.0.1:51278_i
[junit4:junit4]   2> 3964 T1864 oascc.ZkStateReader$3.process Updating live nodes... (2)
[junit4:junit4]   2> 3964 T1864 oascc.ZkStateReader$2.process A cluster state change: WatchedEvent state:SyncConnected type:NodeChildrenChanged path:/live_nodes, has occurred - updating... (live nodes size: 2)
[junit4:junit4]   2> 3965 T1870 oascc.ZkStateReader$3.process Updating live nodes... (2)
[junit4:junit4]   2> 3969 T1842 oascc.ZkStateReader.createClusterStateWatchersAndUpdate Updating cluster state from ZooKeeper... 
[junit4:junit4]   2> 3983 T1884 oasc.CoreContainer.create Creating SolrCore 'collection1' using instanceDir: /Users/jenkins/jenkins-slave/workspace/Lucene-Solr-4.x-MacOSX/solr/build/solr-core/test/J0/./org.apache.solr.cloud.BasicDistributedZkTest-jetty1-1359748002551/collection1
[junit4:junit4]   2> 3983 T1884 oasc.ZkController.createCollectionZkNode Check for collection zkNode:collection1
[junit4:junit4]   2> 3985 T1884 oasc.ZkController.createCollectionZkNode Collection zkNode exists
[junit4:junit4]   2> 3985 T1884 oasc.ZkController.readConfigName Load collection config from:/collections/collection1
[junit4:junit4]   2> 3988 T1884 oasc.SolrResourceLoader.<init> new SolrResourceLoader for directory: '/Users/jenkins/jenkins-slave/workspace/Lucene-Solr-4.x-MacOSX/solr/build/solr-core/test/J0/./org.apache.solr.cloud.BasicDistributedZkTest-jetty1-1359748002551/collection1/'
[junit4:junit4]   2> 3988 T1884 oasc.SolrResourceLoader.replaceClassLoader Adding 'file:/Users/jenkins/jenkins-slave/workspace/Lucene-Solr-4.x-MacOSX/solr/build/solr-core/test/J0/org.apache.solr.cloud.BasicDistributedZkTest-jetty1-1359748002551/collection1/lib/classes/' to classloader
[junit4:junit4]   2> 3989 T1884 oasc.SolrResourceLoader.replaceClassLoader Adding 'file:/Users/jenkins/jenkins-slave/workspace/Lucene-Solr-4.x-MacOSX/solr/build/solr-core/test/J0/org.apache.solr.cloud.BasicDistributedZkTest-jetty1-1359748002551/collection1/lib/README' to classloader
[junit4:junit4]   2> 4044 T1884 oasc.SolrConfig.<init> Using Lucene MatchVersion: LUCENE_42
[junit4:junit4]   2> 4125 T1884 oasc.SolrConfig.<init> Loaded SolrConfig: solrconfig.xml
[junit4:junit4]   2> 4126 T1884 oass.IndexSchema.readSchema Reading Solr Schema
[junit4:junit4]   2> 4130 T1884 oass.IndexSchema.readSchema Schema name=test
[junit4:junit4]   2> 4849 T1884 oass.OpenExchangeRatesOrgProvider.init Initialized with rates=open-exchange-rates.json, refreshInterval=1440.
[junit4:junit4]   2> 4870 T1884 oass.IndexSchema.readSchema default search field in schema is text
[junit4:junit4]   2> 4876 T1884 oass.IndexSchema.readSchema unique key field: id
[junit4:junit4]   2> 4913 T1884 oass.FileExchangeRateProvider.reload Reloading exchange rates from file currency.xml
[junit4:junit4]   2> 4922 T1884 oass.FileExchangeRateProvider.reload Reloading exchange rates from file currency.xml
[junit4:junit4]   2> 4931 T1884 oass.OpenExchangeRatesOrgProvider.reload Reloading exchange rates from open-exchange-rates.json
[junit4:junit4]   2> 4935 T1884 oass.OpenExchangeRatesOrgProvider.reload Reloading exchange rates from open-exchange-rates.json
[junit4:junit4]   2> 4938 T1884 oasc.SolrCore.<init> [collection1] Opening new SolrCore at /Users/jenkins/jenkins-slave/workspace/Lucene-Solr-4.x-MacOSX/solr/build/solr-core/test/J0/./org.apache.solr.cloud.BasicDistributedZkTest-jetty1-1359748002551/collection1/, dataDir=./org.apache.solr.cloud.BasicDistributedZkTest-1359747998897/jetty1/
[junit4:junit4]   2> 4938 T1884 oasc.JmxMonitoredMap.<init> JMX monitoring is enabled. Adding Solr mbeans to JMX Server: com.sun.jmx.mbeanserver.JmxMBeanServer@67b38e47
[junit4:junit4]   2> 4939 T1884 oasc.SolrCore.initDirectoryFactory solr.NRTCachingDirectoryFactory
[junit4:junit4]   2> 4940 T1884 oasc.CachingDirectoryFactory.get return new directory for /Users/jenkins/jenkins-slave/workspace/Lucene-Solr-4.x-MacOSX/solr/build/solr-core/test/J0/./org.apache.solr.cloud.BasicDistributedZkTest-1359747998897/jetty1 forceNew:false
[junit4:junit4]   2> 4941 T1884 oasc.CachingDirectoryFactory.close Releasing directory:/Users/jenkins/jenkins-slave/workspace/Lucene-Solr-4.x-MacOSX/solr/build/solr-core/test/J0/./org.apache.solr.cloud.BasicDistributedZkTest-1359747998897/jetty1
[junit4:junit4]   2> 4942 T1884 oasc.SolrCore.getNewIndexDir New index directory detected: old=null new=./org.apache.solr.cloud.BasicDistributedZkTest-1359747998897/jetty1/index/
[junit4:junit4]   2> 4943 T1884 oasc.SolrCore.initIndex WARNING [collection1] Solr index directory './org.apache.solr.cloud.BasicDistributedZkTest-1359747998897/jetty1/index' doesn't exist. Creating new index...
[junit4:junit4]   2> 4943 T1884 oasc.CachingDirectoryFactory.get return new directory for /Users/jenkins/jenkins-slave/workspace/Lucene-Solr-4.x-MacOSX/solr/build/solr-core/test/J0/./org.apache.solr.cloud.BasicDistributedZkTest-1359747998897/jetty1/index forceNew:false
[junit4:junit4]   2> 4951 T1884 oasc.SolrDeletionPolicy.onCommit SolrDeletionPolicy.onCommit: commits:num=1
[junit4:junit4]   2> 		commit{dir=RateLimitedDirectoryWrapper(NRTCachingDirectory(org.apache.lucene.store.NIOFSDirectory@/Users/jenkins/jenkins-slave/workspace/Lucene-Solr-4.x-MacOSX/solr/build/solr-core/test/J0/org.apache.solr.cloud.BasicDistributedZkTest-1359747998897/jetty1/index lockFactory=org.apache.lucene.store.NativeFSLockFactory@4b4308a6; maxCacheMB=48.0 maxMergeSizeMB=4.0)),segFN=segments_1,generation=1,filenames=[segments_1]
[junit4:junit4]   2> 4951 T1884 oasc.SolrDeletionPolicy.updateCommits newest commit = 1[segments_1]
[junit4:junit4]   2> 4952 T1884 oasc.CachingDirectoryFactory.close Releasing directory:/Users/jenkins/jenkins-slave/workspace/Lucene-Solr-4.x-MacOSX/solr/build/solr-core/test/J0/./org.apache.solr.cloud.BasicDistributedZkTest-1359747998897/jetty1/index
[junit4:junit4]   2> 4953 T1884 oasc.SolrCore.initWriters created xml: solr.XMLResponseWriter
[junit4:junit4]   2> 4956 T1884 oasup.UpdateRequestProcessorChain.init inserting DistributedUpdateProcessorFactory into updateRequestProcessorChain "dedupe"
[junit4:junit4]   2> 4956 T1884 oasup.UpdateRequestProcessorChain.init inserting DistributedUpdateProcessorFactory into updateRequestProcessorChain "dedupe-allfields"
[junit4:junit4]   2> 4957 T1884 oasup.UpdateRequestProcessorChain.init inserting DistributedUpdateProcessorFactory into updateRequestProcessorChain "stored_sig"
[junit4:junit4]   2> 4957 T1884 oasup.UpdateRequestProcessorChain.init inserting DistributedUpdateProcessorFactory into updateRequestProcessorChain "uniq-fields"
[junit4:junit4]   2> 4959 T1884 oasup.UpdateRequestProcessorChain.init inserting DistributedUpdateProcessorFactory into updateRequestProcessorChain "distrib-dup-test-chain-implicit"
[junit4:junit4]   2> 4959 T1884 oasc.RequestHandlers.initHandlersFromConfig adding lazy requestHandler: solr.ReplicationHandler
[junit4:junit4]   2> 4960 T1884 oasc.RequestHandlers.initHandlersFromConfig created /replication: solr.ReplicationHandler
[junit4:junit4]   2> 4961 T1884 oasc.RequestHandlers.initHandlersFromConfig created standard: solr.StandardRequestHandler
[junit4:junit4]   2> 4961 T1884 oasc.RequestHandlers.initHandlersFromConfig created /get: solr.RealTimeGetHandler
[junit4:junit4]   2> 4962 T1884 oasc.RequestHandlers.initHandlersFromConfig created dismax: solr.SearchHandler
[junit4:junit4]   2> 4963 T1884 oasc.RequestHandlers.initHandlersFromConfig created mock: org.apache.solr.core.MockQuerySenderListenerReqHandler
[junit4:junit4]   2> 4964 T1884 oasc.RequestHandlers.initHandlersFromConfig created /admin/: org.apache.solr.handler.admin.AdminHandlers
[junit4:junit4]   2> 4964 T1884 oasc.RequestHandlers.initHandlersFromConfig created defaults: solr.StandardRequestHandler
[junit4:junit4]   2> 4965 T1884 oasc.RequestHandlers.initHandlersFromConfig adding lazy requestHandler: solr.StandardRequestHandler
[junit4:junit4]   2> 4965 T1884 oasc.RequestHandlers.initHandlersFromConfig created lazy: solr.StandardRequestHandler
[junit4:junit4]   2> 4966 T1884 oasc.RequestHandlers.initHandlersFromConfig created /update: solr.UpdateRequestHandler
[junit4:junit4]   2> 4967 T1884 oasc.RequestHandlers.initHandlersFromConfig created /terms: org.apache.solr.handler.component.SearchHandler
[junit4:junit4]   2> 4967 T1884 oasc.RequestHandlers.initHandlersFromConfig created spellCheckCompRH: org.apache.solr.handler.component.SearchHandler
[junit4:junit4]   2> 4968 T1884 oasc.RequestHandlers.initHandlersFromConfig created spellCheckCompRH_Direct: org.apache.solr.handler.component.SearchHandler
[junit4:junit4]   2> 4969 T1884 oasc.RequestHandlers.initHandlersFromConfig created spellCheckWithWordbreak: org.apache.solr.handler.component.SearchHandler
[junit4:junit4]   2> 4970 T1884 oasc.RequestHandlers.initHandlersFromConfig created spellCheckWithWordbreak_Direct: org.apache.solr.handler.component.SearchHandler
[junit4:junit4]   2> 4970 T1884 oasc.RequestHandlers.initHandlersFromConfig created spellCheckCompRH1: org.apache.solr.handler.component.SearchHandler
[junit4:junit4]   2> 4971 T1884 oasc.RequestHandlers.initHandlersFromConfig created mltrh: org.apache.solr.handler.component.SearchHandler
[junit4:junit4]   2> 4972 T1884 oasc.RequestHandlers.initHandlersFromConfig created tvrh: org.apache.solr.handler.component.SearchHandler
[junit4:junit4]   2> 4973 T1884 oasc.RequestHandlers.initHandlersFromConfig created /mlt: solr.MoreLikeThisHandler
[junit4:junit4]   2> 4973 T1884 oasc.RequestHandlers.initHandlersFromConfig created /debug/dump: solr.DumpRequestHandler
[junit4:junit4]   2> 4981 T1884 oashl.XMLLoader.init xsltCacheLifetimeSeconds=60
[junit4:junit4]   2> 4984 T1884 oasc.SolrCore.initDeprecatedSupport WARNING solrconfig.xml uses deprecated <admin/gettableFiles>, Please update your config to use the ShowFileRequestHandler.
[junit4:junit4]   2> 4986 T1884 oasc.SolrCore.initDeprecatedSupport WARNING adding ShowFileRequestHandler with hidden files: [SCHEMA.XML, OLD_SYNONYMS.TXT, STOPWORDS.TXT, PROTWORDS.TXT, OPEN-EXCHANGE-RATES.JSON, SYNONYMS.TXT, CURRENCY.XML, MAPPING-ISOLATIN1ACCENT.TXT]
[junit4:junit4]   2> 4990 T1884 oasc.CachingDirectoryFactory.close Releasing directory:/Users/jenkins/jenkins-slave/workspace/Lucene-Solr-4.x-MacOSX/solr/build/solr-core/test/J0/./org.apache.solr.cloud.BasicDistributedZkTest-1359747998897/jetty1
[junit4:junit4]   2> 4992 T1884 oass.SolrIndexSearcher.<init> Opening Searcher@d0a2764 main
[junit4:junit4]   2> 4995 T1884 oasu.CommitTracker.<init> Hard AutoCommit: disabled
[junit4:junit4]   2> 4995 T1884 oasu.CommitTracker.<init> Soft AutoCommit: disabled
[junit4:junit4]   2> 4996 T1884 oashc.SpellCheckComponent.inform Initializing spell checkers
[junit4:junit4]   2> 5003 T1884 oass.DirectSolrSpellChecker.init init: {name=direct,classname=DirectSolrSpellChecker,field=lowerfilt,minQueryLength=3}
[junit4:junit4]   2> 5047 T1885 oasc.SolrCore.registerSearcher [collection1] Registered new searcher Searcher@d0a2764 main{StandardDirectoryReader(segments_1:1)}
[junit4:junit4]   2> 5057 T1884 oasc.ZkController.publish publishing core=collection1 state=down
[junit4:junit4]   2> 5057 T1884 oasc.ZkController.publish numShards not found on descriptor - reading it from system property
[junit4:junit4]   2> 5125 T1865 oascc.ZkStateReader.updateClusterState Updating cloud state from ZooKeeper... 
[junit4:junit4]   2> 5127 T1865 oasc.Overseer$ClusterStateUpdater.updateState Update state numShards=1 message={
[junit4:junit4]   2> 	  "operation":"state",
[junit4:junit4]   2> 	  "numShards":"1",
[junit4:junit4]   2> 	  "shard":"shard1",
[junit4:junit4]   2> 	  "roles":null,
[junit4:junit4]   2> 	  "state":"active",
[junit4:junit4]   2> 	  "core":"collection1",
[junit4:junit4]   2> 	  "collection":"control_collection",
[junit4:junit4]   2> 	  "node_name":"127.0.0.1:51274_i",
[junit4:junit4]   2> 	  "base_url":"http://127.0.0.1:51274/i"}
[junit4:junit4]   2> 5133 T1865 oasc.Overseer$ClusterStateUpdater.updateState Update state numShards=2 message={
[junit4:junit4]   2> 	  "operation":"state",
[junit4:junit4]   2> 	  "numShards":"2",
[junit4:junit4]   2> 	  "shard":null,
[junit4:junit4]   2> 	  "roles":null,
[junit4:junit4]   2> 	  "state":"down",
[junit4:junit4]   2> 	  "core":"collection1",
[junit4:junit4]   2> 	  "collection":"collection1",
[junit4:junit4]   2> 	  "node_name":"127.0.0.1:51278_i",
[junit4:junit4]   2> 	  "base_url":"http://127.0.0.1:51278/i"}
[junit4:junit4]   2> 5134 T1865 oasc.Overseer$ClusterStateUpdater.createCollection Create collection collection1 with numShards 2
[junit4:junit4]   2> 5134 T1865 oasc.Overseer$ClusterStateUpdater.updateState Assigning new node to shard shard=shard1
[junit4:junit4]   2> 5143 T1870 oascc.ZkStateReader$2.process A cluster state change: WatchedEvent state:SyncConnected type:NodeDataChanged path:/clusterstate.json, has occurred - updating... (live nodes size: 2)
[junit4:junit4]   2> 5143 T1883 oascc.ZkStateReader$2.process A cluster state change: WatchedEvent state:SyncConnected type:NodeDataChanged path:/clusterstate.json, has occurred - updating... (live nodes size: 2)
[junit4:junit4]   2> 5144 T1864 oascc.ZkStateReader$2.process A cluster state change: WatchedEvent state:SyncConnected type:NodeDataChanged path:/clusterstate.json, has occurred - updating... (live nodes size: 2)
[junit4:junit4]   2> 6061 T1884 oasc.CoreContainer.registerCore registering core: collection1
[junit4:junit4]   2> 6061 T1884 oasc.ZkController.register Register replica - core:collection1 address:http://127.0.0.1:51278/i collection:collection1 shard:shard1
[junit4:junit4]   2> 6063 T1884 oascc.SolrZkClient.makePath makePath: /collections/collection1/leader_elect/shard1/election
[junit4:junit4]   2> 6081 T1847 oazs.PrepRequestProcessor.pRequest Got user-level KeeperException when processing sessionid:0x13c974be4b70006 type:delete cxid:0x43 zxid:0x5a txntype:-1 reqpath:n/a Error Path:/solr/collections/collection1/leaders Error:KeeperErrorCode = NoNode for /solr/collections/collection1/leaders
[junit4:junit4]   2> 6082 T1884 oasc.ShardLeaderElectionContext.runLeaderProcess Running the leader process.
[junit4:junit4]   2> 6083 T1847 oazs.PrepRequestProcessor.pRequest Got user-level KeeperException when processing sessionid:0x13c974be4b70006 type:create cxid:0x44 zxid:0x5b txntype:-1 reqpath:n/a Error Path:/solr/overseer Error:KeeperErrorCode = NodeExists for /solr/overseer
[junit4:junit4]   2> 6087 T1884 oasc.ShardLeaderElectionContext.waitForReplicasToComeUp Enough replicas found to continue.
[junit4:junit4]   2> 6087 T1884 oasc.ShardLeaderElectionContext.runLeaderProcess I may be the new leader - try and sync
[junit4:junit4]   2> 6087 T1884 oasc.SyncStrategy.sync Sync replicas to http://127.0.0.1:51278/i/collection1/
[junit4:junit4]   2> 6088 T1884 oasc.SyncStrategy.syncReplicas Sync Success - now sync replicas to me
[junit4:junit4]   2> 6088 T1884 oasc.SyncStrategy.syncToMe http://127.0.0.1:51278/i/collection1/ has no replicas
[junit4:junit4]   2> 6088 T1884 oasc.ShardLeaderElectionContext.runLeaderProcess I am the new leader: http://127.0.0.1:51278/i/collection1/
[junit4:junit4]   2> 6088 T1884 oascc.SolrZkClient.makePath makePath: /collections/collection1/leaders/shard1
[junit4:junit4]   2> 6096 T1847 oazs.PrepRequestProcessor.pRequest Got user-level KeeperException when processing sessionid:0x13c974be4b70006 type:create cxid:0x4e zxid:0x5f txntype:-1 reqpath:n/a Error Path:/solr/overseer Error:KeeperErrorCode = NodeExists for /solr/overseer
[junit4:junit4]   2> 6660 T1865 oascc.ZkStateReader.updateClusterState Updating cloud state from ZooKeeper... 
[junit4:junit4]   2> 6680 T1883 oascc.ZkStateReader$2.process A cluster state change: WatchedEvent state:SyncConnected type:NodeDataChanged path:/clusterstate.json, has occurred - updating... (live nodes size: 2)
[junit4:junit4]   2> 6680 T1864 oascc.ZkStateReader$2.process A cluster state change: WatchedEvent state:SyncConnected type:NodeDataChanged path:/clusterstate.json, has occurred - updating... (live nodes size: 2)
[junit4:junit4]   2> 6680 T1870 oascc.ZkStateReader$2.process A cluster state change: WatchedEvent state:SyncConnected type:NodeDataChanged path:/clusterstate.json, has occurred - updating... (live nodes size: 2)
[junit4:junit4]   2> 6720 T1884 oasc.ZkController.register We are http://127.0.0.1:51278/i/collection1/ and leader is http://127.0.0.1:51278/i/collection1/
[junit4:junit4]   2> 6721 T1884 oasc.ZkController.register No LogReplay needed for core=collection1 baseURL=http://127.0.0.1:51278/i
[junit4:junit4]   2> 6721 T1884 oasc.ZkController.checkRecovery I am the leader, no recovery necessary
[junit4:junit4]   2> 6721 T1884 oasc.ZkController.publish publishing core=collection1 state=active
[junit4:junit4]   2> 6722 T1884 oasc.ZkController.publish numShards not found on descriptor - reading it from system property
[junit4:junit4]   2> 6725 T1884 oascc.ZkStateReader.updateClusterState Updating cloud state from ZooKeeper... 
[junit4:junit4]   2> 6728 T1842 oass.SolrDispatchFilter.init user.dir=/Users/jenkins/jenkins-slave/workspace/Lucene-Solr-4.x-MacOSX/solr/build/solr-core/test/J0
[junit4:junit4]   2> 6729 T1842 oass.SolrDispatchFilter.init SolrDispatchFilter.init() done
[junit4:junit4]   2> 6729 T1842 oascsi.HttpClientUtil.createClient Creating new http client, config:maxConnections=128&maxConnectionsPerHost=32&followRedirects=false
[junit4:junit4]   2> 6966 T1842 oejs.Server.doStart jetty-8.1.8.v20121106
[junit4:junit4]   2> 6970 T1842 oejs.AbstractConnector.doStart Started SelectChannelConnector@127.0.0.1:51281
[junit4:junit4]   2> 6972 T1842 oass.SolrDispatchFilter.init SolrDispatchFilter.init()
[junit4:junit4]   2> 6973 T1842 oasc.SolrResourceLoader.locateSolrHome JNDI not configured for solr (NoInitialContextEx)
[junit4:junit4]   2> 6974 T1842 oasc.SolrResourceLoader.locateSolrHome using system property solr.solr.home: /Users/jenkins/jenkins-slave/workspace/Lucene-Solr-4.x-MacOSX/solr/build/solr-core/test/J0/./org.apache.solr.cloud.BasicDistributedZkTest-jetty2-1359748005632
[junit4:junit4]   2> 6974 T1842 oasc.CoreContainer$Initializer.initialize looking for solr.xml: /Users/jenkins/jenkins-slave/workspace/Lucene-Solr-4.x-MacOSX/solr/build/solr-core/test/J0/./org.apache.solr.cloud.BasicDistributedZkTest-jetty2-1359748005632/solr.xml
[junit4:junit4]   2> 6976 T1842 oasc.CoreContainer.<init> New CoreContainer 663479488
[junit4:junit4]   2> 6976 T1842 oasc.CoreContainer.load Loading CoreContainer using Solr Home: '/Users/jenkins/jenkins-slave/workspace/Lucene-Solr-4.x-MacOSX/solr/build/solr-core/test/J0/./org.apache.solr.cloud.BasicDistributedZkTest-jetty2-1359748005632/'
[junit4:junit4]   2> 6977 T1842 oasc.SolrResourceLoader.<init> new SolrResourceLoader for directory: '/Users/jenkins/jenkins-slave/workspace/Lucene-Solr-4.x-MacOSX/solr/build/solr-core/test/J0/./org.apache.solr.cloud.BasicDistributedZkTest-jetty2-1359748005632/'
[junit4:junit4]   2> 7020 T1842 oashc.HttpShardHandlerFactory.getParameter Setting socketTimeout to: 60000
[junit4:junit4]   2> 7022 T1842 oashc.HttpShardHandlerFactory.getParameter Setting urlScheme to: http://
[junit4:junit4]   2> 7022 T1842 oashc.HttpShardHandlerFactory.getParameter Setting connTimeout to: 15000
[junit4:junit4]   2> 7023 T1842 oashc.HttpShardHandlerFactory.getParameter Setting maxConnectionsPerHost to: 20
[junit4:junit4]   2> 7023 T1842 oashc.HttpShardHandlerFactory.getParameter Setting corePoolSize to: 0
[junit4:junit4]   2> 7024 T1842 oashc.HttpShardHandlerFactory.getParameter Setting maximumPoolSize to: 2147483647
[junit4:junit4]   2> 7025 T1842 oashc.HttpShardHandlerFactory.getParameter Setting maxThreadIdleTime to: 5
[junit4:junit4]   2> 7025 T1842 oashc.HttpShardHandlerFactory.getParameter Setting sizeOfQueue to: -1
[junit4:junit4]   2> 7026 T1842 oashc.HttpShardHandlerFactory.getParameter Setting fairnessPolicy to: false
[junit4:junit4]   2> 7026 T1842 oascsi.HttpClientUtil.createClient Creating new http client, config:maxConnectionsPerHost=20&maxConnections=10000&socketTimeout=60000&connTimeout=15000&retry=false
[junit4:junit4]   2> 7044 T1842 oasc.CoreContainer.load Registering Log Listener
[junit4:junit4]   2> 7067 T1842 oasc.CoreContainer.initZooKeeper Zookeeper client=127.0.0.1:51271/solr
[junit4:junit4]   2> 7068 T1842 oasc.ZkController.checkChrootPath zkHost includes chroot
[junit4:junit4]   2> 7069 T1842 oaz.ZooKeeper.<init> Initiating client connection, connectString=127.0.0.1:51271 sessionTimeout=60000 watcher=org.apache.solr.common.cloud.ConnectionManager@52ace044
[junit4:junit4]   2> 7070 T1842 oascc.ConnectionManager.waitForConnected Waiting for client to connect to ZooKeeper
[junit4:junit4]   2> 7071 T1895 oaz.ClientCnxn$SendThread.logStartConnect Opening socket connection to server localhost/127.0.0.1:51271. Will not attempt to authenticate using SASL (access denied ("javax.security.auth.AuthPermission" "getLoginConfiguration"))
[junit4:junit4]   2> 7073 T1895 oaz.ClientCnxn$SendThread.primeConnection Socket connection established to localhost/127.0.0.1:51271, initiating session
[junit4:junit4]   2> 7073 T1844 oazs.NIOServerCnxnFactory.run Accepted socket connection from /127.0.0.1:51282
[junit4:junit4]   2> 7074 T1844 oazs.ZooKeeperServer.processConnectRequest Client attempting to establish new session at /127.0.0.1:51282
[junit4:junit4]   2> 7076 T1846 oazs.ZooKeeperServer.finishSessionInit Established session 0x13c974be4b70007 with negotiated timeout 20000 for client /127.0.0.1:51282
[junit4:junit4]   2> 7076 T1895 oaz.ClientCnxn$SendThread.onConnected Session establishment complete on server localhost/127.0.0.1:51271, sessionid = 0x13c974be4b70007, negotiated timeout = 20000
[junit4:junit4]   2> 7077 T1896 oascc.ConnectionManager.process Watcher org.apache.solr.common.cloud.ConnectionManager@52ace044 name:ZooKeeperConnection Watcher:127.0.0.1:51271 got event WatchedEvent state:SyncConnected type:None path:null path:null type:None
[junit4:junit4]   2> 7077 T1842 oascc.ConnectionManager.waitForConnected Client is connected to ZooKeeper
[junit4:junit4]   2> 7079 T1847 oazs.PrepRequestProcessor.pRequest2Txn Processed session termination for sessionid: 0x13c974be4b70007
[junit4:junit4]   2> 7081 T1844 oazs.NIOServerCnxn.closeSock Closed socket connection for client /127.0.0.1:51282 which had sessionid 0x13c974be4b70007
[junit4:junit4]   2> 7081 T1896 oaz.ClientCnxn$EventThread.run EventThread shut down
[junit4:junit4]   2> 7081 T1842 oaz.ZooKeeper.close Session: 0x13c974be4b70007 closed
[junit4:junit4]   2> 7083 T1842 oascsi.HttpClientUtil.createClient Creating new http client, config:maxConnections=500&maxConnectionsPerHost=16&socketTimeout=60000&connTimeout=15000
[junit4:junit4]   2> 7091 T1842 oaz.ZooKeeper.<init> Initiating client connection, connectString=127.0.0.1:51271/solr sessionTimeout=30000 watcher=org.apache.solr.common.cloud.ConnectionManager@255a4e80
[junit4:junit4]   2> 7093 T1842 oascc.ConnectionManager.waitForConnected Waiting for client to connect to ZooKeeper
[junit4:junit4]   2> 7094 T1897 oaz.ClientCnxn$SendThread.logStartConnect Opening socket connection to server localhost/127.0.0.1:51271. Will not attempt to authenticate using SASL (access denied ("javax.security.auth.AuthPermission" "getLoginConfiguration"))
[junit4:junit4]   2> 7095 T1897 oaz.ClientCnxn$SendThread.primeConnection Socket connection established to localhost/127.0.0.1:51271, initiating session
[junit4:junit4]   2> 7096 T1844 oazs.NIOServerCnxnFactory.run Accepted socket connection from /127.0.0.1:51283
[junit4:junit4]   2> 7097 T1844 oazs.ZooKeeperServer.processConnectRequest Client attempting to establish new session at /127.0.0.1:51283
[junit4:junit4]   2> 7099 T1846 oazs.ZooKeeperServer.finishSessionInit Established session 0x13c974be4b70008 with negotiated timeout 20000 for client /127.0.0.1:51283
[junit4:junit4]   2> 7099 T1897 oaz.ClientCnxn$SendThread.onConnected Session establishment complete on server localhost/127.0.0.1:51271, sessionid = 0x13c974be4b70008, negotiated timeout = 20000
[junit4:junit4]   2> 7100 T1898 oascc.ConnectionManager.process Watcher org.apache.solr.common.cloud.ConnectionManager@255a4e80 name:ZooKeeperConnection Watcher:127.0.0.1:51271/solr got event WatchedEvent state:SyncConnected type:None path:null path:null type:None
[junit4:junit4]   2> 7100 T1842 oascc.ConnectionManager.waitForConnected Client is connected to ZooKeeper
[junit4:junit4]   2> 7102 T1847 oazs.PrepRequestProcessor.pRequest Got user-level KeeperException when processing sessionid:0x13c974be4b70008 type:create cxid:0x1 zxid:0x6c txntype:-1 reqpath:n/a Error Path:/solr/overseer Error:KeeperErrorCode = NodeExists for /solr/overseer
[junit4:junit4]   2> 7103 T1847 oazs.PrepRequestProcessor.pRequest Got user-level KeeperException when processing sessionid:0x13c974be4b70008 type:create cxid:0x2 zxid:0x6d txntype:-1 reqpath:n/a Error Path:/solr/overseer Error:KeeperErrorCode = NodeExists for /solr/overseer
[junit4:junit4]   2> 7106 T1842 oasc.ZkController.createEphemeralLiveNode Register node as live in ZooKeeper:/live_nodes/127.0.0.1:51281_i
[junit4:junit4]   2> 7107 T1847 oazs.PrepRequestProcessor.pRequest Got user-level KeeperException when processing sessionid:0x13c974be4b70008 type:delete cxid:0x4 zxid:0x6e txntype:-1 reqpath:n/a Error Path:/solr/live_nodes/127.0.0.1:51281_i Error:KeeperErrorCode = NoNode for /solr/live_nodes/127.0.0.1:51281_i
[junit4:junit4]   2> 7108 T1842 oascc.SolrZkClient.makePath makePath: /live_nodes/127.0.0.1:51281_i
[junit4:junit4]   2> 7112 T1883 oascc.ZkStateReader$2.process A cluster state change: WatchedEvent state:SyncConnected type:NodeChildrenChanged path:/live_nodes, has occurred - updating... (live nodes size: 2)
[junit4:junit4]   2> 7115 T1870 oascc.ZkStateReader$3.process Updating live nodes... (3)
[junit4:junit4]   2> 7115 T1864 oascc.ZkStateReader$3.process Updating live nodes... (3)
[junit4:junit4]   2> 7115 T1864 oascc.ZkStateReader$2.process A cluster state change: WatchedEvent state:SyncConnected type:NodeChildrenChanged path:/live_nodes, has occurred - updating... (live nodes size: 3)
[junit4:junit4]   2> 7115 T1870 oascc.ZkStateReader$2.process A cluster state change: WatchedEvent state:SyncConnected type:NodeChildrenChanged path:/live_nodes, has occurred - updating... (live nodes size: 3)
[junit4:junit4]   2> 7120 T1883 oascc.ZkStateReader$3.process Updating live nodes... (3)
[junit4:junit4]   2> 7122 T1842 oascc.ZkStateReader.createClusterStateWatchersAndUpdate Updating cluster state from ZooKeeper... 
[junit4:junit4]   2> 7132 T1899 oasc.CoreContainer.create Creating SolrCore 'collection1' using instanceDir: /Users/jenkins/jenkins-slave/workspace/Lucene-Solr-4.x-MacOSX/solr/build/solr-core/test/J0/./org.apache.solr.cloud.BasicDistributedZkTest-jetty2-1359748005632/collection1
[junit4:junit4]   2> 7132 T1899 oasc.ZkController.createCollectionZkNode Check for collection zkNode:collection1
[junit4:junit4]   2> 7133 T1899 oasc.ZkController.createCollectionZkNode Collection zkNode exists
[junit4:junit4]   2> 7134 T1899 oasc.ZkController.readConfigName Load collection config from:/collections/collection1
[junit4:junit4]   2> 7136 T1899 oasc.SolrResourceLoader.<init> new SolrResourceLoader for directory: '/Users/jenkins/jenkins-slave/workspace/Lucene-Solr-4.x-MacOSX/solr/build/solr-core/test/J0/./org.apache.solr.cloud.BasicDistributedZkTest-jetty2-1359748005632/collection1/'
[junit4:junit4]   2> 7137 T1899 oasc.SolrResourceLoader.replaceClassLoader Adding 'file:/Users/jenkins/jenkins-slave/workspace/Lucene-Solr-4.x-MacOSX/solr/build/solr-core/test/J0/org.apache.solr.cloud.BasicDistributedZkTest-jetty2-1359748005632/collection1/lib/classes/' to classloader
[junit4:junit4]   2> 7138 T1899 oasc.SolrResourceLoader.replaceClassLoader Adding 'file:/Users/jenkins/jenkins-slave/workspace/Lucene-Solr-4.x-MacOSX/solr/build/solr-core/test/J0/org.apache.solr.cloud.BasicDistributedZkTest-jetty2-1359748005632/collection1/lib/README' to classloader
[junit4:junit4]   2> 7189 T1899 oasc.SolrConfig.<init> Using Lucene MatchVersion: LUCENE_42
[junit4:junit4]   2> 7265 T1899 oasc.SolrConfig.<init> Loaded SolrConfig: solrconfig.xml
[junit4:junit4]   2> 7267 T1899 oass.IndexSchema.readSchema Reading Solr Schema
[junit4:junit4]   2> 7274 T1899 oass.IndexSchema.readSchema Schema name=test
[junit4:junit4]   2> 7903 T1899 oass.OpenExchangeRatesOrgProvider.init Initialized with rates=open-exchange-rates.json, refreshInterval=1440.
[junit4:junit4]   2> 7923 T1899 oass.IndexSchema.readSchema default search field in schema is text
[junit4:junit4]   2> 7934 T1899 oass.IndexSchema.readSchema unique key field: id
[junit4:junit4]   2> 7970 T1899 oass.FileExchangeRateProvider.reload Reloading exchange rates from file currency.xml
[junit4:junit4]   2> 7980 T1899 oass.FileExchangeRateProvider.reload Reloading exchange rates from file currency.xml
[junit4:junit4]   2> 7989 T1899 oass.OpenExchangeRatesOrgProvider.reload Reloading exchange rates from open-exchange-rates.json
[junit4:junit4]   2> 7991 T1899 oass.OpenExchangeRatesOrgProvider.reload Reloading exchange rates from open-exchange-rates.json
[junit4:junit4]   2> 7994 T1899 oasc.SolrCore.<init> [collection1] Opening new SolrCore at /Users/jenkins/jenkins-slave/workspace/Lucene-Solr-4.x-MacOSX/solr/build/solr-core/test/J0/./org.apache.solr.cloud.BasicDistributedZkTest-jetty2-1359748005632/collection1/, dataDir=./org.apache.solr.cloud.BasicDistributedZkTest-1359747998897/jetty2/
[junit4:junit4]   2> 7994 T1899 oasc.JmxMonitoredMap.<init> JMX monitoring is enabled. Adding Solr mbeans to JMX Server: com.sun.jmx.mbeanserver.JmxMBeanServer@67b38e47
[junit4:junit4]   2> 7995 T1899 oasc.SolrCore.initDirectoryFactory solr.NRTCachingDirectoryFactory
[junit4:junit4]   2> 7996 T1899 oasc.CachingDirectoryFactory.get return new directory for /Users/jenkins/jenkins-slave/workspace/Lucene-Solr-4.x-MacOSX/solr/build/solr-core/test/J0/./org.apache.solr.cloud.BasicDistributedZkTest-1359747998897/jetty2 forceNew:false
[junit4:junit4]   2> 7997 T1899 oasc.CachingDirectoryFactory.close Releasing directory:/Users/jenkins/jenkins-slave/workspace/Lucene-Solr-4.x-MacOSX/solr/build/solr-core/test/J0/./org.apache.solr.cloud.BasicDistributedZkTest-1359747998897/jetty2
[junit4:junit4]   2> 7997 T1899 oasc.SolrCore.getNewIndexDir New index directory detected: old=null new=./org.apache.solr.cloud.BasicDistributedZkTest-1359747998897/jetty2/index/
[junit4:junit4]   2> 7998 T1899 oasc.SolrCore.initIndex WARNING [collection1] Solr index directory './org.apache.solr.cloud.BasicDistributedZkTest-1359747998897/jetty2/index' doesn't exist. Creating new index...
[junit4:junit4]   2> 7998 T1899 oasc.CachingDirectoryFactory.get return new directory for /Users/jenkins/jenkins-slave/workspace/Lucene-Solr-4.x-MacOSX/solr/build/solr-core/test/J0/./org.apache.solr.cloud.BasicDistributedZkTest-1359747998897/jetty2/index forceNew:false
[junit4:junit4]   2> 8005 T1899 oasc.SolrDeletionPolicy.onCommit SolrDeletionPolicy.onCommit: commits:num=1
[junit4:junit4]   2> 		commit{dir=RateLimitedDirectoryWrapper(NRTCachingDirectory(org.apache.lucene.store.NIOFSDirectory@/Users/jenkins/jenkins-slave/workspace/Lucene-Solr-4.x-MacOSX/solr/build/solr-core/test/J0/org.apache.solr.cloud.BasicDistributedZkTest-1359747998897/jetty2/index lockFactory=org.apache.lucene.store.NativeFSLockFactory@276eb37b; maxCacheMB=48.0 maxMergeSizeMB=4.0)),segFN=segments_1,generation=1,filenames=[segments_1]
[junit4:junit4]   2> 8005 T1899 oasc.SolrDeletionPolicy.updateCommits newest commit = 1[segments_1]
[junit4:junit4]   2> 8006 T1899 oasc.CachingDirectoryFactory.close Releasing directory:/Users/jenkins/jenkins-slave/workspace/Lucene-Solr-4.x-MacOSX/solr/build/solr-core/test/J0/./org.apache.solr.cloud.BasicDistributedZkTest-1359747998897/jetty2/index
[junit4:junit4]   2> 8006 T1899 oasc.SolrCore.initWriters created xml: solr.XMLResponseWriter
[junit4:junit4]   2> 8009 T1899 oasup.UpdateRequestProcessorChain.init inserting DistributedUpdateProcessorFactory into updateRequestProcessorChain "dedupe"
[junit4:junit4]   2> 8011 T1899 oasup.UpdateRequestProcessorChain.init inserting DistributedUpdateProcessorFactory into updateRequestProcessorChain "dedupe-allfields"
[junit4:junit4]   2> 8011 T1899 oasup.UpdateRequestProcessorChain.init inserting DistributedUpdateProcessorFactory into updateRequestProcessorChain "stored_sig"
[junit4:junit4]   2> 8012 T1899 oasup.UpdateRequestProcessorChain.init inserting DistributedUpdateProcessorFactory into updateRequestProcessorChain "uniq-fields"
[junit4:junit4]   2> 8013 T1899 oasup.UpdateRequestProcessorChain.init inserting DistributedUpdateProcessorFactory into updateRequestProcessorChain "distrib-dup-test-chain-implicit"
[junit4:junit4]   2> 8013 T1899 oasc.RequestHandlers.initHandlersFromConfig adding lazy requestHandler: solr.ReplicationHandler
[junit4:junit4]   2> 8014 T1899 oasc.RequestHandlers.initHandlersFromConfig created /replication: solr.ReplicationHandler
[junit4:junit4]   2> 8014 T1899 oasc.RequestHandlers.initHandlersFromConfig created standard: solr.StandardRequestHandler
[junit4:junit4]   2> 8015 T1899 oasc.RequestHandlers.initHandlersFromConfig created /get: solr.RealTimeGetHandler
[junit4:junit4]   2> 8017 T1899 oasc.RequestHandlers.initHandlersFromConfig created dismax: solr.SearchHandler
[junit4:junit4]   2> 8017 T1899 oasc.RequestHandlers.initHandlersFromConfig created mock: org.apache.solr.core.MockQuerySenderListenerReqHandler
[junit4:junit4]   2> 8018 T1899 oasc.RequestHandlers.initHandlersFromConfig created /admin/: org.apache.solr.handler.admin.AdminHandlers
[junit4:junit4]   2> 8019 T1899 oasc.RequestHandlers.initHandlersFromConfig created defaults: solr.StandardRequestHandler
[junit4:junit4]   2> 8019 T1899 oasc.RequestHandlers.initHandlersFromConfig adding lazy requestHandler: solr.StandardRequestHandler
[junit4:junit4]   2> 8020 T1899 oasc.RequestHandlers.initHandlersFromConfig created lazy: solr.StandardRequestHandler
[junit4:junit4]   2> 8021 T1899 oasc.RequestHandlers.initHandlersFromConfig created /update: solr.UpdateRequestHandler
[junit4:junit4]   2> 8022 T1899 oasc.RequestHandlers.initHandlersFromConfig created /terms: org.apache.solr.handler.component.SearchHandler
[junit4:junit4]   2> 8023 T1899 oasc.RequestHandlers.initHandlersFromConfig created spellCheckCompRH: org.apache.solr.handler.component.SearchHandler
[junit4:junit4]   2> 8024 T1899 oasc.RequestHandlers.initHandlersFromConfig created spellCheckCompRH_Direct: org.apache.solr.handler.component.SearchHandler
[junit4:junit4]   2> 8025 T1899 oasc.RequestHandlers.initHandlersFromConfig created spellCheckWithWordbreak: org.apache.solr.handler.component.SearchHandler
[junit4:junit4]   2> 8025 T1899 oasc.RequestHandlers.initHandlersFromConfig created spellCheckWithWordbreak_Direct: org.apache.solr.handler.component.SearchHandler
[junit4:junit4]   2> 8026 T1899 oasc.RequestHandlers.initHandlersFromConfig created spellCheckCompRH1: org.apache.solr.handler.component.SearchHandler
[junit4:junit4]   2> 8027 T1899 oasc.RequestHandlers.initHandlersFromConfig created mltrh: org.apache.solr.handler.component.SearchHandler
[junit4:junit4]   2> 8028 T1899 oasc.RequestHandlers.initHandlersFromConfig created tvrh: org.apache.solr.handler.component.SearchHandler
[junit4:junit4]   2> 8029 T1899 oasc.RequestHandlers.initHandlersFromConfig created /mlt: solr.MoreLikeThisHandler
[junit4:junit4]   2> 8030 T1899 oasc.RequestHandlers.initHandlersFromConfig created /debug/dump: solr.DumpRequestHandler
[junit4:junit4]   2> 8039 T1899 oashl.XMLLoader.init xsltCacheLifetimeSeconds=60
[junit4:junit4]   2> 8043 T1899 oasc.SolrCore.initDeprecatedSupport WARNING solrconfig.xml uses deprecated <admin/gettableFiles>, Please update your config to use the ShowFileRequestHandler.
[junit4:junit4]   2> 8045 T1899 oasc.SolrCore.initDeprecatedSupport WARNING adding ShowFileRequestHandler with hidden files: [SCHEMA.XML, OLD_SYNONYMS.TXT, STOPWORDS.TXT, PROTWORDS.TXT, OPEN-EXCHANGE-RATES.JSON, SYNONYMS.TXT, CURRENCY.XML, MAPPING-ISOLATIN1ACCENT.TXT]
[junit4:junit4]   2> 8048 T1899 oasc.CachingDirectoryFactory.close Releasing directory:/Users/jenkins/jenkins-slave/workspace/Lucene-Solr-4.x-MacOSX/solr/build/solr-core/test/J0/./org.apache.solr.cloud.BasicDistributedZkTest-1359747998897/jetty2
[junit4:junit4]   2> 8050 T1899 oass.SolrIndexSearcher.<init> Opening Searcher@2dfd5b14 main
[junit4:junit4]   2> 8051 T1899 oasu.CommitTracker.<init> Hard AutoCommit: disabled
[junit4:junit4]   2> 8051 T1899 oasu.CommitTracker.<init> Soft AutoCommit: disabled
[junit4:junit4]   2> 8052 T1899 oashc.SpellCheckComponent.inform Initializing spell checkers
[junit4:junit4]   2> 8059 T1899 oass.DirectSolrSpellChecker.init init: {name=direct,classname=DirectSolrSpellChecker,field=lowerfilt,minQueryLength=3}
[junit4:junit4]   2> 8101 T1900 oasc.SolrCore.registerSearcher [collection1] Registered new searcher Searcher@2dfd5b14 main{StandardDirectoryReader(segments_1:1)}
[junit4:junit4]   2> 8113 T1899 oasc.ZkController.publish publishing core=collection1 state=down
[junit4:junit4]   2> 8113 T1899 oasc.ZkController.publish numShards not found on descriptor - reading it from system property
[junit4:junit4]   2> 8194 T1865 oascc.ZkStateReader.updateClusterState Updating cloud state from ZooKeeper... 
[junit4:junit4]   2> 8195 T1865 oasc.Overseer$ClusterStateUpdater.updateState Update state numShards=2 message={
[junit4:junit4]   2> 	  "operation":"state",
[junit4:junit4]   2> 	  "numShards":"2",
[junit4:junit4]   2> 	  "shard":"shard1",
[junit4:junit4]   2> 	  "roles":null,
[junit4:junit4]   2> 	  "state":"active",
[junit4:junit4]   2> 	  "core":"collection1",
[junit4:junit4]   2> 	  "collection":"collection1",
[junit4:junit4]   2> 	  "node_name":"127.0.0.1:51278_i",
[junit4:junit4]   2> 	  "base_url":"http://127.0.0.1:51278/i"}
[junit4:junit4]   2> 8203 T1865 oasc.Overseer$ClusterStateUpdater.updateState Update state numShards=2 message={
[junit4:junit4]   2> 	  "operation":"state",
[junit4:junit4]   2> 	  "numShards":"2",
[junit4:junit4]   2> 	  "shard":null,
[junit4:junit4]   2> 	  "roles":null,
[junit4:junit4]   2> 	  "state":"down",
[junit4:junit4]   2> 	  "core":"collection1",
[junit4:junit4]   2> 	  "collection":"collection1",
[junit4:junit4]   2> 	  "node_name":"127.0.0.1:51281_i",
[junit4:junit4]   2> 	  "base_url":"http://127.0.0.1:51281/i"}
[junit4:junit4]   2> 8204 T1865 oasc.Overseer$ClusterStateUpdater.updateState Collection already exists with numShards=2
[junit4:junit4]   2> 8204 T1865 oasc.Overseer$ClusterStateUpdater.updateState Assigning new node to shard shard=shard2
[junit4:junit4]   2> 8212 T1864 oascc.ZkStateReader$2.process A cluster state change: WatchedEvent state:SyncConnected type:NodeDataChanged path:/clusterstate.json, has occurred - updating... (live nodes size: 3)
[junit4:junit4]   2> 8212 T1883 oascc.ZkStateReader$2.process A cluster state change: WatchedEvent state:SyncConnected type:NodeDataChanged path:/clusterstate.json, has occurred - updating... (live nodes size: 3)
[junit4:junit4]   2> 8213 T1870 oascc.ZkStateReader$2.process A cluster state change: WatchedEvent state:SyncConnected type:NodeDataChanged path:/clusterstate.json, has occurred - updating... (live nodes size: 3)
[junit4:junit4]   2> 8213 T1898 oascc.ZkStateReader$2.process A cluster state change: WatchedEvent state:SyncConnected type:NodeDataChanged path:/clusterstate.json, has occurred - updating... (live nodes size: 3)
[junit4:junit4]   2> 9122 T1899 oasc.CoreContainer.registerCore registering core: collection1
[junit4:junit4]   2> 9123 T1899 oasc.ZkController.register Register replica - core:collection1 address:http://127.0.0.1:51281/i collection:collection1 shard:shard2
[junit4:junit4]   2> 9125 T1899 oascc.SolrZkClient.makePath makePath: /collections/collection1/leader_elect/shard2/election
[junit4:junit4]   2> 9134 T1847 oazs.PrepRequestProcessor.pRequest Got user-level KeeperException when processing sessionid:0x13c974be4b70008 type:delete cxid:0x42 zxid:0x7c txntype:-1 reqpath:n/a Error Path:/solr/collections/collection1/leaders/shard2 Error:KeeperErrorCode = NoNode for /solr/collections/collection1/leaders/shard2
[junit4:junit4]   2> 9135 T1899 oasc.ShardLeaderElectionContext.runLeaderProcess Running the leader process.
[junit4:junit4]   2> 9136 T1847 oazs.PrepRequestProcessor.pRequest Got user-level KeeperException when processing sessionid:0x13c974be4b70008 type:create cxid:0x43 zxid:0x7d txntype:-1 reqpath:n/a Error Path:/solr/overseer Error:KeeperErrorCode = NodeExists for /solr/overseer
[junit4:junit4]   2> 9139 T1899 oasc.ShardLeaderElectionContext.waitForReplicasToComeUp Enough replicas found to continue.
[junit4:junit4]   2> 9139 T1899 oasc.ShardLeaderElectionContext.runLeaderProcess I may be the new leader - try and sync
[junit4:junit4]   2> 9139 T1899 oasc.SyncStrategy.sync Sync replicas to http://127.0.0.1:51281/i/collection1/
[junit4:junit4]   2> 9140 T1899 oasc.SyncStrategy.syncReplicas Sync Success - now sync replicas to me
[junit4:junit4]   2> 9140 T1899 oasc.SyncStrategy.syncToMe http://127.0.0.1:51281/i/collection1/ has no replicas
[junit4:junit4]   2> 9140 T1899 oasc.ShardLeaderElectionContext.runLeaderProcess I am the new leader: http://127.0.0.1:51281/i/collection1/
[junit4:junit4]   2> 9140 T1899 oascc.SolrZkClient.makePath makePath: /collections/collection1/leaders/shard2
[junit4:junit4]   2> 9147 T1847 oazs.PrepRequestProcessor.pRequest Got user-level KeeperException when processing sessionid:0x13c974be4b70008 type:create cxid:0x4c zxid:0x80 txntype:-1 reqpath:n/a Error Path:/solr/overseer Error:KeeperErrorCode = NodeExists for /solr/overseer
[junit4:junit4]   2> 9730 T1865 oascc.ZkStateReader.updateClusterState Updating cloud state from ZooKeeper... 
[junit4:junit4]   2> 9751 T1883 oascc.ZkStateReader$2.process A cluster state change: WatchedEvent state:SyncConnected type:NodeDataChanged path:/clusterstate.json, has occurred - updating... (live nodes size: 3)
[junit4:junit4]   2> 9752 T1898 oascc.ZkStateReader$2.process A cluster state change: WatchedEvent state:SyncConnected type:NodeDataChanged path:/clusterstate.json, has occurred - updating... (live nodes size: 3)
[junit4:junit4]   2> 9752 T1864 oascc.ZkStateReader$2.process A cluster state change: WatchedEvent state:SyncConnected type:NodeDataChanged path:/clusterstate.json, has occurred - updating... (live nodes size: 3)
[junit4:junit4]   2> 9751 T1870 oascc.ZkStateReader$2.process A cluster state change: WatchedEvent state:SyncConnected type:NodeDataChanged path:/clusterstate.json, has occurred - updating... (live nodes size: 3)
[junit4:junit4]   2> 9783 T1899 oasc.ZkController.register We are http://127.0.0.1:51281/i/collection1/ and leader is http://127.0.0.1:51281/i/collection1/
[junit4:junit4]   2> 9784 T1899 oasc.ZkController.register No LogReplay needed for core=collection1 baseURL=http://127.0.0.1:51281/i
[junit4:junit4]   2> 9784 T1899 oasc.ZkController.checkRecovery I am the leader, no recovery necessary
[junit4:junit4]   2> 9785 T1899 oasc.ZkController.publish publishing core=collection1 state=active
[junit4:junit4]   2> 9785 T1899 oasc.ZkController.publish numShards not found on descriptor - reading it from system property
[junit4:junit4]   2> 9789 T1899 oascc.ZkStateReader.updateClusterState Updating cloud state from ZooKeeper... 
[junit4:junit4]   2> 9791 T1842 oass.SolrDispatchFilter.init user.dir=/Users/jenkins/jenkins-slave/workspace/Lucene-Solr-4.x-MacOSX/solr/build/solr-core/test/J0
[junit4:junit4]   2> 9792 T1842 oass.SolrDispatchFilter.init SolrDispatchFilter.init() done
[junit4:junit4]   2> 9793 T1842 oascsi.HttpClientUtil.createClient Creating new http client, config:maxConnections=128&maxConnectionsPerHost=32&followRedirects=false
[junit4:junit4]   2> 10036 T1842 oejs.Server.doStart jetty-8.1.8.v20121106
[junit4:junit4]   2> 10041 T1842 oejs.AbstractConnector.doStart Started SelectChannelConnector@127.0.0.1:51284
[junit4:junit4]   2> 10042 T1842 oass.SolrDispatchFilter.init SolrDispatchFilter.init()
[junit4:junit4]   2> 10043 T1842 oasc.SolrResourceLoader.locateSolrHome JNDI not configured for solr (NoInitialContextEx)
[junit4:junit4]   2> 10043 T1842 oasc.SolrResourceLoader.locateSolrHome using system property solr.solr.home: /Users/jenkins/jenkins-slave/workspace/Lucene-Solr-4.x-MacOSX/solr/build/solr-core/test/J0/./org.apache.solr.cloud.BasicDistributedZkTest-jetty3-1359748008696
[junit4:junit4]   2> 10043 T1842 oasc.CoreContainer$Initializer.initialize looking for solr.xml: /Users/jenkins/jenkins-slave/workspace/Lucene-Solr-4.x-MacOSX/solr/build/solr-core/test/J0/./org.apache.solr.cloud.BasicDistributedZkTest-jetty3-1359748008696/solr.xml
[junit4:junit4]   2> 10045 T1842 oasc.CoreContainer.<init> New CoreContainer 1223672497
[junit4:junit4]   2> 10045 T1842 oasc.CoreContainer.load Loading CoreContainer using Solr Home: '/Users/jenkins/jenkins-slave/workspace/Lucene-Solr-4.x-MacOSX/solr/build/solr-core/test/J0/./org.apache.solr.cloud.BasicDistributedZkTest-jetty3-1359748008696/'
[junit4:junit4]   2> 10046 T1842 oasc.SolrResourceLoader.<init> new SolrResourceLoader for directory: '/Users/jenkins/jenkins-slave/workspace/Lucene-Solr-4.x-MacOSX/solr/build/solr-core/test/J0/./org.apache.solr.cloud.BasicDistributedZkTest-jetty3-1359748008696/'
[junit4:junit4]   2> 10084 T1842 oashc.HttpShardHandlerFactory.getParameter Setting socketTimeout to: 60000
[junit4:junit4]   2> 10084 T1842 oashc.HttpShardHandlerFactory.getParameter Setting urlScheme to: http://
[junit4:junit4]   2> 10085 T1842 oashc.HttpShardHandlerFactory.getParameter Setting connTimeout to: 15000
[junit4:junit4]   2> 10085 T1842 oashc.HttpShardHandlerFactory.getParameter Setting maxConnectionsPerHost to: 20
[junit4:junit4]   2> 10086 T1842 oashc.HttpShardHandlerFactory.getParameter Setting corePoolSize to: 0
[junit4:junit4]   2> 10086 T1842 oashc.HttpShardHandlerFactory.getParameter Setting maximumPoolSize to: 2147483647
[junit4:junit4]   2> 10086 T1842 oashc.HttpShardHandlerFactory.getParameter Setting maxThreadIdleTime to: 5
[junit4:junit4]   2> 10087 T1842 oashc.HttpShardHandlerFactory.getParameter Setting sizeOfQueue to: -1
[junit4:junit4]   2> 10087 T1842 oashc.HttpShardHandlerFactory.getParameter Setting fairnessPolicy to: false
[junit4:junit4]   2> 10087 T1842 oascsi.HttpClientUtil.createClient Creating new http client, config:maxConnectionsPerHost=20&maxConnections=10000&socketTimeout=60000&connTimeout=15000&retry=false
[junit4:junit4]   2> 10101 T1842 oasc.CoreContainer.load Registering Log Listener
[junit4:junit4]   2> 10123 T1842 oasc.CoreContainer.initZooKeeper Zookeeper client=127.0.0.1:51271/solr
[junit4:junit4]   2> 10124 T1842 oasc.ZkController.checkChrootPath zkHost includes chroot
[junit4:junit4]   2> 10125 T1842 oaz.ZooKeeper.<init> Initiating client connection, connectString=127.0.0.1:51271 sessionTimeout=60000 watcher=org.apache.solr.common.cloud.ConnectionManager@5f269bdb
[junit4:junit4]   2> 10126 T1842 oascc.ConnectionManager.waitForConnected Waiting for client to connect to ZooKeeper
[junit4:junit4]   2> 10127 T1910 oaz.ClientCnxn$SendThread.logStartConnect Opening socket connection to server localhost/127.0.0.1:51271. Will not attempt to authenticate using SASL (access denied ("javax.security.auth.AuthPermission" "getLoginConfiguration"))
[junit4:junit4]   2> 10127 T1910 oaz.ClientCnxn$SendThread.primeConnection Socket connection established to localhost/127.0.0.1:51271, initiating session
[junit4:junit4]   2> 10128 T1844 oazs.NIOServerCnxnFactory.run Accepted socket connection from /127.0.0.1:51285
[junit4:junit4]   2> 10128 T1844 oazs.ZooKeeperServer.processConnectRequest Client attempting to establish new session at /127.0.0.1:51285
[junit4:junit4]   2> 10571 T1846 oazs.ZooKeeperServer.finishSessionInit Established session 0x13c974be4b70009 with negotiated timeout 20000 for client /127.0.0.1:51285
[junit4:junit4]   2> 10571 T1910 oaz.ClientCnxn$SendThread.onConnected Session establishment complete on server localhost/127.0.0.1:51271, sessionid = 0x13c974be4b70009, negotiated timeout = 20000
[junit4:junit4]   2> 10571 T1911 oascc.ConnectionManager.process Watcher org.apache.solr.common.cloud.ConnectionManager@5f269bdb name:ZooKeeperConnection Watcher:127.0.0.1:51271 got event WatchedEvent state:SyncConnected type:None path:null path:null type:None
[junit4:junit4]   2> 10572 T1842 oascc.ConnectionManager.waitForConnected Client is connected to ZooKeeper
[junit4:junit4]   2> 10574 T1847 oazs.PrepRequestProcessor.pRequest2Txn Processed session termination for sessionid: 0x13c974be4b70009
[junit4:junit4]   2> 10575 T1844 oazs.NIOServerCnxn.closeSock Closed socket connection for client /127.0.0.1:51285 which had sessionid 0x13c974be4b70009
[junit4:junit4]   2> 10575 T1842 oaz.ZooKeeper.close Session: 0x13c974be4b70009 closed
[junit4:junit4]   2> 10575 T1911 oaz.ClientCnxn$EventThread.run EventThread shut down
[junit4:junit4]   2> 10575 T1842 oascsi.HttpClientUtil.createClient Creating new http client, config:maxConnections=500&maxConnectionsPerHost=16&socketTimeout=60000&connTimeout=15000
[junit4:junit4]   2> 10582 T1842 oaz.ZooKeeper.<init> Initiating client connection, connectString=127.0.0.1:51271/solr sessionTimeout=30000 watcher=org.apache.solr.common.cloud.ConnectionManager@5fc625c3
[junit4:junit4]   2> 10584 T1842 oascc.ConnectionManager.waitForConnected Waiting for client to connect to ZooKeeper
[junit4:junit4]   2> 10584 T1912 oaz.ClientCnxn$SendThread.logStartConnect Opening socket connection to server localhost/127.0.0.1:51271. Will not attempt to authenticate using SASL (access denied ("javax.security.auth.AuthPermission" "getLoginConfiguration"))
[junit4:junit4]   2> 10585 T1912 oaz.ClientCnxn$SendThread.primeConnection Socket connection established to localhost/127.0.0.1:51271, initiating session
[junit4:junit4]   2> 10585 T1844 oazs.NIOServerCnxnFactory.run Accepted socket connection from /127.0.0.1:51286
[junit4:junit4]   2> 10586 T1844 oazs.ZooKeeperServer.processConnectRequest Client attempting to establish new session at /127.0.0.1:51286
[junit4:junit4]   2> 10587 T1846 oazs.ZooKeeperServer.finishSessionInit Established session 0x13c974be4b7000a with negotiated timeout 20000 for client /127.0.0.1:51286
[junit4:junit4]   2> 10588 T1912 oaz.ClientCnxn$SendThread.onConnected Session establishment complete on server localhost/127.0.0.1:51271, sessionid = 0x13c974be4b7000a, negotiated timeout = 20000
[junit4:junit4]   2> 10588 T1913 oascc.ConnectionManager.process Watcher org.apache.solr.common.cloud.ConnectionManager@5fc625c3 name:ZooKeeperConnection Watcher:127.0.0.1:51271/solr got event WatchedEvent state:SyncConnected type:None path:null path:null type:None
[junit4:junit4]   2> 10588 T1842 oascc.ConnectionManager.waitForConnected Client is connected to ZooKeeper
[junit4:junit4]   2> 10590 T1847 oazs.PrepRequestProcessor.pRequest Got user-level KeeperException when processing sessionid:0x13c974be4b7000a type:create cxid:0x1 zxid:0x8d txntype:-1 reqpath:n/a Error Path:/solr/overseer Error:KeeperErrorCode = NodeExists for /solr/overseer
[junit4:junit4]   2> 10591 T1847 oazs.PrepRequestProcessor.pRequest Got user-level KeeperException when processing sessionid:0x13c974be4b7000a type:create cxid:0x2 zxid:0x8e txntype:-1 reqpath:n/a Error Path:/solr/overseer Error:KeeperErrorCode = NodeExists for /solr/overseer
[junit4:junit4]   2> 10593 T1842 oasc.ZkController.createEphemeralLiveNode Register node as live in ZooKeeper:/live_nodes/127.0.0.1:51284_i
[junit4:junit4]   2> 10594 T1847 oazs.PrepRequestProcessor.pRequest Got user-level KeeperException when processing sessionid:0x13c974be4b7000a type:delete cxid:0x4 zxid:0x8f txntype:-1 reqpath:n/a Error Path:/solr/live_nodes/127.0.0.1:51284_i Error:KeeperErrorCode = NoNode for /solr/live_nodes/127.0.0.1:51284_i
[junit4:junit4]   2> 10595 T1842 oascc.SolrZkClient.makePath makePath: /live_nodes/127.0.0.1:51284_i
[junit4:junit4]   2> 10598 T1883 oascc.ZkStateReader$2.process A cluster state change: WatchedEvent state:SyncConnected type:NodeChildrenChanged path:/live_nodes, has occurred - updating... (live nodes size: 3)
[junit4:junit4]   2> 10599 T1898 oascc.ZkStateReader$2.process A cluster state change: WatchedEvent state:SyncConnected type:NodeChildrenChanged path:/live_nodes, has occurred - updating... (live nodes size: 3)
[junit4:junit4]   2> 10601 T1864 oascc.ZkStateReader$3.process Updating live nodes... (4)
[junit4:junit4]   2> 10601 T1864 oascc.ZkStateReader$2.process A cluster state change: WatchedEvent state:SyncConnected type:NodeChildrenChanged path:/live_nodes, has occurred - updating... (live nodes size: 4)
[junit4:junit4]   2> 10601 T1870 oascc.ZkStateReader$3.process Updating live nodes... (4)
[junit4:junit4]   2> 10603 T1870 oascc.ZkStateReader$2.process A cluster state change: WatchedEvent state:SyncConnected type:NodeChildrenChanged path:/live_nodes, has occurred - updating... (live nodes size: 4)
[junit4:junit4]   2> 10607 T1883 oascc.ZkStateReader$3.process Updating live nodes... (4)
[junit4:junit4]   2> 10607 T1898 oascc.ZkStateReader$3.process Updating live nodes... (4)
[junit4:junit4]   2> 10611 T1842 oascc.ZkStateReader.createClusterStateWatchersAndUpdate Updating cluster state from ZooKeeper... 
[junit4:junit4]   2> 10683 T1914 oasc.CoreContainer.create Creating SolrCore 'collection1' using instanceDir: /Users/jenkins/jenkins-slave/workspace/Lucene-Solr-4.x-MacOSX/solr/build/solr-core/test/J0/./org.apache.solr.cloud.BasicDistributedZkTest-jetty3-1359748008696/collection1
[junit4:junit4]   2> 10683 T1914 oasc.ZkController.createCollectionZkNode Check for collection zkNode:collection1
[junit4:junit4]   2> 10685 T1914 oasc.ZkController.createCollectionZkNode Collection zkNode exists
[junit4:junit4]   2> 10685 T1914 oasc.ZkController.readConfigName Load collection config from:/collections/collection1
[junit4:junit4]   2> 10688 T1914 oasc.SolrResourceLoader.<init> new SolrResourceLoader for directory: '/Users/jenkins/jenkins-slave/workspace/Lucene-Solr-4.x-MacOSX/solr/build/solr-core/test/J0/./org.apache.solr.cloud.BasicDistributedZkTest-jetty3-1359748008696/collection1/'
[junit4:junit4]   2> 10689 T1914 oasc.SolrResourceLoader.replaceClassLoader Adding 'file:/Users/jenkins/jenkins-slave/workspace/Lucene-Solr-4.x-MacOSX/solr/build/solr-core/test/J0/org.apache.solr.cloud.BasicDistributedZkTest-jetty3-1359748008696/collection1/lib/classes/' to classloader
[junit4:junit4]   2> 10690 T1914 oasc.SolrResourceLoader.replaceClassLoader Adding 'file:/Users/jenkins/jenkins-slave/workspace/Lucene-Solr-4.x-MacOSX/solr/build/solr-core/test/J0/org.apache.solr.cloud.BasicDistributedZkTest-jetty3-1359748008696/collection1/lib/README' to classloader
[junit4:junit4]   2> 10748 T1914 oasc.SolrConfig.<init> Using Lucene MatchVersion: LUCENE_42
[junit4:junit4]   2> 10845 T1914 oasc.SolrConfig.<init> Loaded SolrConfig: solrconfig.xml
[junit4:junit4]   2> 10847 T1914 oass.IndexSchema.readSchema Reading Solr Schema
[junit4:junit4]   2> 10859 T1914 oass.IndexSchema.readSchema Schema name=test
[junit4:junit4]   2> 11269 T1865 oascc.ZkStateReader.updateClusterState Updating cloud state from ZooKeeper... 
[junit4:junit4]   2> 11270 T1865 oasc.Overseer$ClusterStateUpdater.updateState Update state numShards=2 message={
[junit4:junit4]   2> 	  "operation":"state",
[junit4:junit4]   2> 	  "numShards":"2",
[junit4:junit4]   2> 	  "shard":"shard2",
[junit4:junit4]   2> 	  "roles":null,
[junit4:junit4]   2> 	  "state":"active",
[junit4:junit4]   2> 	  "core":"collection1",
[junit4:junit4]   2> 	  "collection":"collection1",
[junit4:junit4]   2> 	  "node_name":"127.0.0.1:51281_i",
[junit4:junit4]   2> 	  "base_url":"http://127.0.0.1:51281/i"}
[junit4:junit4]   2> 11279 T1913 oascc.ZkStateReader$2.process A cluster state change: WatchedEvent state:SyncConnected type:NodeDataChanged path:/clusterstate.json, has occurred - updating... (live nodes size: 4)
[junit4:junit4]   2> 11280 T1864 oascc.ZkStateReader$2.process A cluster state change: WatchedEvent state:SyncConnected type:NodeDataChanged path:/clusterstate.json, has occurred - updating... (live nodes size: 4)
[junit4:junit4]   2> 11280 T1883 oascc.ZkStateReader$2.process A cluster state change: WatchedEvent state:SyncConnected type:NodeDataChanged path:/clusterstate.json, has occurred - updating... (live nodes size: 4)
[junit4:junit4]   2> 11280 T1870 oascc.ZkStateReader$2.process A cluster state change: WatchedEvent state:SyncConnected type:NodeDataChanged path:/clusterstate.json, has occurred - updating... (live nodes size: 4)
[junit4:junit4]   2> 11281 T1898 oascc.ZkStateReader$2.process A cluster state change: WatchedEvent state:SyncConnected type:NodeDataChanged path:/clusterstate.json, has occurred - updating... (live nodes size: 4)
[junit4:junit4]   2> 11587 T1914 oass.OpenExchangeRatesOrgProvider.init Initialized with rates=open-exchange-rates.json, refreshInterval=1440.
[junit4:junit4]   2> 11600 T1914 oass.IndexSchema.readSchema default search field in schema is text
[junit4:junit4]   2> 11605 T1914 oass.IndexSchema.readSchema unique key field: id
[junit4:junit4]   2> 11633 T1914 oass.FileExchangeRateProvider.reload Reloading exchange rates from file currency.xml
[junit4:junit4]   2> 11640 T1914 oass.FileExchangeRateProvider.reload Reloading exchange rates from file currency.xml
[junit4:junit4]   2> 11647 T1914 oass.OpenExchangeRatesOrgProvider.reload Reloading exchange rates from open-exchange-rates.json
[junit4:junit4]   2> 11650 T1914 oass.OpenExchangeRatesOrgProvider.reload Reloading exchange rates from open-exchange-rates.json
[junit4:junit4]   2> 11653 T1914 oasc.SolrCore.<init> [collection1] Opening new SolrCore at /Users/jenkins/jenkins-slave/workspace/Lucene-Solr-4.x-MacOSX/solr/build/solr-core/test/J0/./org.apache.solr.cloud.BasicDistributedZkTest-jetty3-1359748008696/collection1/, dataDir=./org.apache.solr.cloud.BasicDistributedZkTest-1359747998897/jetty3/
[junit4:junit4]   2> 11653 T1914 oasc.JmxMonitoredMap.<init> JMX monitoring is enabled. Adding Solr mbeans to JMX Server: com.sun.jmx.mbeanserver.JmxMBeanServer@67b38e47
[junit4:junit4]   2> 11654 T1914 oasc.SolrCore.initDirectoryFactory solr.NRTCachingDirectoryFactory
[junit4:junit4]   2> 11655 T1914 oasc.CachingDirectoryFactory.get return new directory for /Users/jenkins/jenkins-slave/workspace/Lucene-Solr-4.x-MacOSX/solr/build/solr-core/test/J0/./org.apache.solr.cloud.BasicDistributedZkTest-1359747998897/jetty3 forceNew:false
[junit4:junit4]   2> 11656 T1914 oasc.CachingDirectoryFactory.close Releasing directory:/Users/jenkins/jenkins-slave/workspace/Lucene-Solr-4.x-MacOSX/solr/build/solr-core/test/J0/./org.apache.solr.cloud.BasicDistributedZkTest-1359747998897/jetty3
[junit4:junit4]   2> 11656 T1914 oasc.SolrCore.getNewIndexDir New index directory detected: old=null new=./org.apache.solr.cloud.BasicDistributedZkTest-1359747998897/jetty3/index/
[junit4:junit4]   2> 11657 T1914 oasc.SolrCore.initIndex WARNING [collection1] Solr index directory './org.apache.solr.cloud.BasicDistributedZkTest-1359747998897/jetty3/index' doesn't exist. Creating new index...
[junit4:junit4]   2> 11657 T1914 oasc.CachingDirectoryFactory.get return new directory for /Users/jenkins/jenkins-slave/workspace/Lucene-Solr-4.x-MacOSX/solr/build/solr-core/test/J0/./org.apache.solr.cloud.BasicDistributedZkTest-1359747998897/jetty3/index forceNew:false
[junit4:junit4]   2> 11663 T1914 oasc.SolrDeletionPolicy.onCommit SolrDeletionPolicy.onCommit: commits:num=1
[junit4:junit4]   2> 		commit{dir=RateLimitedDirectoryWrapper(NRTCachingDirectory(org.apache.lucene.store.NIOFSDirectory@/Users/jenkins/jenkins-slave/workspace/Lucene-Solr-4.x-MacOSX/solr/build/solr-core/test/J0/org.apache.solr.cloud.BasicDistributedZkTest-1359747998897/jetty3/index lockFactory=org.apache.lucene.store.NativeFSLockFactory@3c7f058a; maxCacheMB=48.0 maxMergeSizeMB=4.0)),segFN=segments_1,generation=1,filenames=[segments_1]
[junit4:junit4]   2> 11663 T1914 oasc.SolrDeletionPolicy.updateCommits newest commit = 1[segments_1]
[junit4:junit4]   2> 11664 T1914 oasc.CachingDirectoryFactory.close Releasing directory:/Users/jenkins/jenkins-slave/workspace/Lucene-Solr-4.x-MacOSX/solr/build/solr-core/test/J0/./org.apache.solr.cloud.BasicDistributedZkTest-1359747998897/jetty3/index
[junit4:junit4]   2> 11665 T1914 oasc.SolrCore.initWriters created xml: solr.XMLResponseWriter
[junit4:junit4]   2> 11668 T1914 oasup.UpdateRequestProcessorChain.init inserting DistributedUpdateProcessorFactory into updateRequestProcessorChain "dedupe"
[junit4:junit4]   2> 11668 T1914 oasup.UpdateRequestProcessorChain.init inserting DistributedUpdateProcessorFactory into updateRequestProcessorChain "dedupe-allfields"
[junit4:junit4]   2> 11669 T1914 oasup.UpdateRequestProcessorChain.init inserting DistributedUpdateProcessorFactory into updateRequestProcessorChain "stored_sig"
[junit4:junit4]   2> 11669 T1914 oasup.UpdateRequestProcessorChain.init inserting DistributedUpdateProcessorFactory into updateRequestProcessorChain "uniq-fields"
[junit4:junit4]   2> 11670 T1914 oasup.UpdateRequestProcessorChain.init inserting DistributedUpdateProcessorFactory into updateRequestProcessorChain "distrib-dup-test-chain-implicit"
[junit4:junit4]   2> 11671 T1914 oasc.RequestHandlers.initHandlersFromConfig adding lazy requestHandler: solr.ReplicationHandler
[junit4:junit4]   2> 11671 T1914 oasc.RequestHandlers.initHandlersFromConfig created /replication: solr.ReplicationHandler
[junit4:junit4]   2> 11672 T1914 oasc.RequestHandlers.initHandlersFromConfig created standard: solr.StandardRequestHandler
[junit4:junit4]   2> 11673 T1914 oasc.RequestHandlers.initHandlersFromConfig created /get: solr.RealTimeGetHandler
[junit4:junit4]   2> 11674 T1914 oasc.RequestHandlers.initHandlersFromConfig created dismax: solr.SearchHandler
[junit4:junit4]   2> 11675 T1914 oasc.RequestHandlers.initHandlersFromConfig created mock: org.apache.solr.core.MockQuerySenderListenerReqHandler
[junit4:junit4]   2> 11675 T1914 oasc.RequestHandlers.initHandlersFromConfig created /admin/: org.apache.solr.handler.admin.AdminHandlers
[junit4:junit4]   2> 11676 T1914 oasc.RequestHandlers.initHandlersFromConfig created defaults: solr.StandardRequestHandler
[junit4:junit4]   2> 11676 T1914 oasc.RequestHandlers.initHandlersFromConfig adding lazy requestHandler: solr.StandardRequestHandler
[junit4:junit4]   2> 11677 T1914 oasc.RequestHandlers.initHandlersFromConfig created lazy: solr.StandardRequestHandler
[junit4:junit4]   2> 11678 T1914 oasc.RequestHandlers.initHandlersFromConfig created /update: solr.UpdateRequestHandler
[junit4:junit4]   2> 11678 T1914 oasc.RequestHandlers.initHandlersFromConfig created /terms: org.apache.solr.handler.component.SearchHandler
[junit4:junit4]   2> 11679 T1914 oasc.RequestHandlers.initHandlersFromConfig created spellCheckCompRH: org.apache.solr.handler.component.SearchHandler
[junit4:junit4]   2> 11681 T1914 oasc.RequestHandlers.initHandlersFromConfig created spellCheckCompRH_Direct: org.apache.solr.handler.component.SearchHandler
[junit4:junit4]   2> 11681 T1914 oasc.RequestHandlers.initHandlersFromConfig created spellCheckWithWordbreak: org.apache.solr.handler.component.SearchHandler
[junit4:junit4]   2> 11682 T1914 oasc.RequestHandlers.initHandlersFromConfig created spellCheckWithWordbreak_Direct: org.apache.solr.handler.component.SearchHandler
[junit4:junit4]   2> 11683 T1914 oasc.RequestHandlers.initHandlersFromConfig created spellCheckCompRH1: org.apache.solr.handler.component.SearchHandler
[junit4:junit4]   2> 11684 T1914 oasc.RequestHandlers.initHandlersFromConfig created mltrh: org.apache.solr.handler.component.SearchHandler
[junit4:junit4]   2> 11685 T1914 oasc.RequestHandlers.initHandlersFromConfig created tvrh: org.apache.solr.handler.component.SearchHandler
[junit4:junit4]   2> 11685 T1914 oasc.RequestHandlers.initHandlersFromConfig created /mlt: solr.MoreLikeThisHandler
[junit4:junit4]   2> 11686 T1914 oasc.RequestHandlers.initHandlersFromConfig created /debug/dump: solr.DumpRequestHandler
[junit4:junit4]   2> 11694 T1914 oashl.XMLLoader.init xsltCacheLifetimeSeconds=60
[junit4:junit4]   2> 11699 T1914 oasc.SolrCore.initDeprecatedSupport WARNING solrconfig.xml uses deprecated <admin/gettableFiles>, Please update your config to use the ShowFileRequestHandler.
[junit4:junit4]   2> 11701 T1914 oasc.SolrCore.initDeprecatedSupport WARNING adding ShowFileRequestHandler with hidden files: [SCHEMA.XML, OLD_SYNONYMS.TXT, STOPWORDS.TXT, PROTWORDS.TXT, OPEN-EXCHANGE-RATES.JSON, SYNONYMS.TXT, CURRENCY.XML, MAPPING-ISOLATIN1ACCENT.TXT]
[junit4:junit4]   2> 11704 T1914 oasc.CachingDirectoryFactory.close Releasing directory:/Users/jenkins/jenkins-slave/workspace/Lucene-Solr-4.x-MacOSX/solr/build/solr-core/test/J0/./org.apache.solr.cloud.BasicDistributedZkTest-1359747998897/jetty3
[junit4:junit4]   2> 11706 T1914 oass.SolrIndexSearcher.<init> Opening Searcher@1a41dd1 main
[junit4:junit4]   2> 11707 T1914 oasu.CommitTracker.<init> Hard AutoCommit: disabled
[junit4:junit4]   2> 11708 T1914 oasu.CommitTracker.<init> Soft AutoCommit: disabled
[junit4:junit4]   2> 11708 T1914 oashc.SpellCheckComponent.inform Initializing spell checkers
[junit4:junit4]   2> 11715 T1914 oass.DirectSolrSpellChecker.init init: {name=direct,classname=DirectSolrSpellChecker,field=lowerfilt,minQueryLength=3}
[junit4:junit4]   2> 11759 T1915 oasc.SolrCore.registerSearcher [collection1] Registered new searcher Searcher@1a41dd1 main{StandardDirectoryReader(segments_1:1)}
[junit4:junit4]   2> 11769 T1914 oasc.ZkController.publish publishing core=collection1 state=down
[junit4:junit4]   2> 11770 T1914 oasc.ZkController.publish numShards not found on descriptor - reading it from system property
[junit4:junit4]   2> 12795 T1865 oascc.ZkStateReader.updateClusterState Updating cloud state from ZooKeeper... 
[junit4:junit4]   2> 12797 T1865 oasc.Overseer$ClusterStateUpdater.updateState Update state numShards=2 message={
[junit4:junit4]   2> 	  "operation":"state",
[junit4:junit4]   2> 	  "numShards":"2",
[junit4:junit4]   2> 	  "shard":null,
[junit4:junit4]   2> 	  "roles":null,
[junit4:junit4]   2> 	  "state":"down",
[junit4:junit4]   2> 	  "core":"collection1",
[junit4:junit4]   2> 	  "collection":"collection1",
[junit4:junit4]   2> 	  "node_name":"127.0.0.1:51284_i",
[junit4:junit4]   2> 	  "base_url":"http://127.0.0.1:51284/i"}
[junit4:junit4]   2> 12797 T1865 oasc.Overseer$ClusterStateUpdater.updateState Collection already exists with numShards=2
[junit4:junit4]   2> 12797 T1865 oasc.Overseer$ClusterStateUpdater.updateState Assigning new node to shard shard=shard1
[junit4:junit4]   2> 12806 T1864 oascc.ZkStateReader$2.process A cluster state change: WatchedEvent state:SyncConnected type:NodeDataChanged path:/clusterstate.json, has occurred - updating... (live nodes size: 4)
[junit4:junit4]   2> 12807 T1883 oascc.ZkStateReader$2.process A cluster state change: WatchedEvent state:SyncConnected type:NodeDataChanged path:/clusterstate.json, has occurred - updating... (live nodes size: 4)
[junit4:junit4]   2> 12807 T1913 oascc.ZkStateReader$2.process A cluster state change: WatchedEvent state:SyncConnected type:NodeDataChanged path:/clusterstate.json, has occurred - updating... (live nodes size: 4)
[junit4:junit4]   2> 12808 T1870 oascc.ZkStateReader$2.process A cluster state change: WatchedEvent state:SyncConnected type:NodeDataChanged path:/clusterstate.json, has occurred - updating... (live nodes size: 4)
[junit4:junit4]   2> 12808 T1898 oascc.ZkStateReader$2.process A cluster state change: WatchedEvent state:SyncConnected type:NodeDataChanged path:/clusterstate.json, has occurred - updating... (live nodes size: 4)
[junit4:junit4]   2> 13774 T1914 oasc.CoreContainer.registerCore registering core: collection1
[junit4:junit4]   2> 13775 T1914 oasc.ZkController.register Register replica - core:collection1 address:http://127.0.0.1:51284/i collection:collection1 shard:shard1
[junit4:junit4]   2> 13781 T1914 oasc.ZkController.register We are http://127.0.0.1:51284/i/collection1/ and leader is http://127.0.0.1:51278/i/collection1/
[junit4:junit4]   2> 13781 T1914 oasc.ZkController.register No LogReplay needed for core=collection1 baseURL=http://127.0.0.1:51284/i
[junit4:junit4]   2> 13781 T1914 oasc.ZkController.checkRecovery Core needs to recover:collection1
[junit4:junit4]   2> 13781 T1914 oasu.DefaultSolrCoreState.doRecovery Running recovery - first canceling any ongoing recovery
[junit4:junit4]   2> ASYNC  NEW_CORE C117 name=collection1 org.apache.solr.core.SolrCore@6ddd0479 url=http://127.0.0.1:51284/i/collection1 node=127.0.0.1:51284_i C117_STATE=coll:collection1 core:collection1 props:{shard=null, roles=null, state=down, core=collection1, collection=collection1, node_name=127.0.0.1:51284_i, base_url=http://127.0.0.1:51284/i}
[junit4:junit4]   2> 13782 T1916 C117 P51284 oasc.RecoveryStrategy.run Starting recovery process.  core=collection1 recoveringAfterStartup=true
[junit4:junit4]   2> 13782 T1914 oascc.ZkStateReader.updateClusterState Updating cloud state from ZooKeeper... 
[junit4:junit4]   2> 13784 T1916 C117 P51284 oasc.RecoveryStrategy.doRecovery ###### startupVersions=[]
[junit4:junit4]   2> 13784 T1916 C117 P51284 oasc.ZkController.publish publishing core=collection1 state=recovering
[junit4:junit4]   2> 13784 T1916 C117 P51284 oasc.ZkController.publish numShards not found on descriptor - reading it from system property
[junit4:junit4]   2> 13785 T1842 oass.SolrDispatchFilter.init user.dir=/Users/jenkins/jenkins-slave/workspace/Lucene-Solr-4.x-MacOSX/solr/build/solr-core/test/J0
[junit4:junit4]   2> 13785 T1842 oass.SolrDispatchFilter.init SolrDispatchFilter.init() done
[junit4:junit4]   2> 13785 T1916 C117 P51284 oascsi.HttpClientUtil.createClient Creating new http client, config:maxConnections=128&maxConnectionsPerHost=32&followRedirects=false
[junit4:junit4]   2> 13786 T1842 oascsi.HttpClientUtil.createClient Creating new http client, config:maxConnections=128&maxConnectionsPerHost=32&followRedirects=false
[junit4:junit4]   2> 14018 T1842 oejs.Server.doStart jetty-8.1.8.v20121106
[junit4:junit4]   2> 14025 T1842 oejs.AbstractConnector.doStart Started SelectChannelConnector@127.0.0.1:51288
[junit4:junit4]   2> 14027 T1842 oass.SolrDispatchFilter.init SolrDispatchFilter.init()
[junit4:junit4]   2> 14028 T1842 oasc.SolrResourceLoader.locateSolrHome JNDI not configured for solr (NoInitialContextEx)
[junit4:junit4]   2> 14029 T1842 oasc.SolrResourceLoader.locateSolrHome using system property solr.solr.home: /Users/jenkins/jenkins-slave/workspace/Lucene-Solr-4.x-MacOSX/solr/build/solr-core/test/J0/./org.apache.solr.cloud.BasicDistributedZkTest-jetty4-1359748012683
[junit4:junit4]   2> 14030 T1842 oasc.CoreContainer$Initializer.initialize looking for solr.xml: /Users/jenkins/jenkins-slave/workspace/Lucene-Solr-4.x-MacOSX/solr/build/solr-core/test/J0/./org.apache.solr.cloud.BasicDistributedZkTest-jetty4-1359748012683/solr.xml
[junit4:junit4]   2> 14031 T1842 oasc.CoreContainer.<init> New CoreContainer 238062864
[junit4:junit4]   2> 14032 T1842 oasc.CoreContainer.load Loading CoreContainer using Solr Home: '/Users/jenkins/jenkins-slave/workspace/Lucene-Solr-4.x-MacOSX/solr/build/solr-core/test/J0/./org.apache.solr.cloud.BasicDistributedZkTest-jetty4-1359748012683/'
[junit4:junit4]   2> 14033 T1842 oasc.SolrResourceLoader.<init> new SolrResourceLoader for directory: '/Users/jenkins/jenkins-slave/workspace/Lucene-Solr-4.x-MacOSX/solr/build/solr-core/test/J0/./org.apache.solr.cloud.BasicDistributedZkTest-jetty4-1359748012683/'
[junit4:junit4]   2> 14101 T1842 oashc.HttpShardHandlerFactory.getParameter Setting socketTimeout to: 60000
[junit4:junit4]   2> 14103 T1842 oashc.HttpShardHandlerFactory.getParameter Setting urlScheme to: http://
[junit4:junit4]   2> 14104 T1842 oashc.HttpShardHandlerFactory.getParameter Setting connTimeout to: 15000
[junit4:junit4]   2> 14104 T1842 oashc.HttpShardHandlerFactory.getParameter Setting maxConnectionsPerHost to: 20
[junit4:junit4]   2> 14105 T1842 oashc.HttpShardHandlerFactory.getParameter Setting corePoolSize to: 0
[junit4:junit4]   2> 14106 T1842 oashc.HttpShardHandlerFactory.getParameter Setting maximumPoolSize to: 2147483647
[junit4:junit4]   2> 14107 T1842 oashc.HttpShardHandlerFactory.getParameter Setting maxThreadIdleTime to: 5
[junit4:junit4]   2> 14109 T1842 oashc.HttpShardHandlerFactory.getParameter Setting sizeOfQueue to: -1
[junit4:junit4]   2> 14110 T1842 oashc.HttpShardHandlerFactory.getParameter Setting fairnessPolicy to: false
[junit4:junit4]   2> 14111 T1842 oascsi.HttpClientUtil.createClient Creating new http client, config:maxConnectionsPerHost=20&maxConnections=10000&socketTimeout=60000&connTimeout=15000&retry=false
[junit4:junit4]   2> 14137 T1842 oasc.CoreContainer.load Registering Log Listener
[junit4:junit4]   2> 14171 T1842 oasc.CoreContainer.initZooKeeper Zookeeper client=127.0.0.1:51271/solr
[junit4:junit4]   2> 14172 T1842 oasc.ZkController.checkChrootPath zkHost includes chroot
[junit4:junit4]   2> 14173 T1842 oaz.ZooKeeper.<init> Initiating client connection, connectString=127.0.0.1:51271 sessionTimeout=60000 watcher=org.apache.solr.common.cloud.ConnectionManager@20e664dc
[junit4:junit4]   2> 14175 T1842 oascc.ConnectionManager.waitForConnected Waiting for client to connect to ZooKeeper
[junit4:junit4]   2> 14176 T1926 oaz.ClientCnxn$SendThread.logStartConnect Opening socket connection to server localhost/127.0.0.1:51271. Will not attempt to authenticate using SASL (access denied ("javax.security.auth.AuthPermission" "getLoginConfiguration"))
[junit4:junit4]   2> 14179 T1926 oaz.ClientCnxn$SendThread.primeConnection Socket connection established to localhost/127.0.0.1:51271, initiating session
[junit4:junit4]   2> 14179 T1844 oazs.NIOServerCnxnFactory.run Accepted socket connection from /127.0.0.1:51289
[junit4:junit4]   2> 14180 T1844 oazs.ZooKeeperServer.processConnectRequest Client attempting to establish new session at /127.0.0.1:51289
[junit4:junit4]   2> 14182 T1846 oazs.ZooKeeperServer.finishSessionInit Established session 0x13c974be4b7000b with negotiated timeout 20000 for client /127.0.0.1:51289
[junit4:junit4]   2> 14182 T1926 oaz.ClientCnxn$SendThread.onConnected Session establishment complete on server localhost/127.0.0.1:51271, sessionid = 0x13c974be4b7000b, negotiated timeout = 20000
[junit4:junit4]   2> 14183 T1927 oascc.ConnectionManager.process Watcher org.apache.solr.common.cloud.ConnectionManager@20e664dc name:ZooKeeperConnection Watcher:127.0.0.1:51271 got event WatchedEvent state:SyncConnected type:None path:null path:null type:None
[junit4:junit4]   2> 14183 T1842 oascc.ConnectionManager.waitForConnected Client is connected to ZooKeeper
[junit4:junit4]   2> 14185 T1847 oazs.PrepRequestProcessor.pRequest2Txn Processed session termination for sessionid: 0x13c974be4b7000b
[junit4:junit4]   2> 14187 T1844 oazs.NIOServerCnxn.closeSock Closed socket connection for client /127.0.0.1:51289 which had sessionid 0x13c974be4b7000b
[junit4:junit4]   2> 14187 T1842 oaz.ZooKeeper.close Session: 0x13c974be4b7000b closed
[junit4:junit4]   2> 14187 T1927 oaz.ClientCnxn$EventThread.run EventThread shut down
[junit4:junit4]   2> 14188 T1842 oascsi.HttpClientUtil.createClient Creating new http client, config:maxConnections=500&maxConnectionsPerHost=16&socketTimeout=60000&connTimeout=15000
[junit4:junit4]   2> 14203 T1842 oaz.ZooKeeper.<init> Initiating client connection, connectString=127.0.0.1:51271/solr sessionTimeout=30000 watcher=org.apache.solr.common.cloud.ConnectionManager@2834840e
[junit4:junit4]   2> 14206 T1842 oascc.ConnectionManager.waitForConnected Waiting for client to connect to ZooKeeper
[junit4:junit4]   2> 14206 T1928 oaz.ClientCnxn$SendThread.logStartConnect Opening socket connection to server localhost/127.0.0.1:51271. Will not attempt to authenticate using SASL (access denied ("javax.security.auth.AuthPermission" "getLoginConfiguration"))
[junit4:junit4]   2> 14208 T1928 oaz.ClientCnxn$SendThread.primeConnection Socket connection established to localhost/127.0.0.1:51271, initiating session
[junit4:junit4]   2> 14209 T1844 oazs.NIOServerCnxnFactory.run Accepted socket connection from /127.0.0.1:51290
[junit4:junit4]   2> 14209 T1844 oazs.ZooKeeperServer.processConnectRequest Client attempting to establish new session at /127.0.0.1:51290
[junit4:junit4]   2> 14211 T1846 oazs.ZooKeeperServer.finishSessionInit Established session 0x13c974be4b7000c with negotiated timeout 20000 for client /127.0.0.1:51290
[junit4:junit4]   2> 14212 T1928 oaz.ClientCnxn$SendThread.onConnected Session establishment complete on server localhost/127.0.0.1:51271, sessionid = 0x13c974be4b7000c, negotiated timeout = 20000
[junit4:junit4]   2> 14212 T1929 oascc.ConnectionManager.process Watcher org.apache.solr.common.cloud.ConnectionManager@2834840e name:ZooKeeperConnection Watcher:127.0.0.1:51271/solr got event WatchedEvent state:SyncConnected type:None path:null path:null type:None
[junit4:junit4]   2> 14213 T1842 oascc.ConnectionManager.waitForConnected Client is connected to ZooKeeper
[junit4:junit4]   2> 14215 T1847 oazs.PrepRequestProcessor.pRequest Got user-level KeeperException when processing sessionid:0x13c974be4b7000c type:create cxid:0x1 zxid:0xa0 txntype:-1 reqpath:n/a Error Path:/solr/overseer Error:KeeperErrorCode = NodeExists for /solr/overseer
[junit4:junit4]   2> 14217 T1847 oazs.PrepRequestProcessor.pRequest Got user-level KeeperException when processing sessionid:0x13c974be4b7000c type:create cxid:0x2 zxid:0xa1 txntype:-1 reqpath:n/a Error Path:/solr/overseer Error:KeeperErrorCode = NodeExists for /solr/overseer
[junit4:junit4]   2> 14219 T1842 oasc.ZkController.createEphemeralLiveNode Register node as live in ZooKeeper:/live_nodes/127.0.0.1:51288_i
[junit4:junit4]   2> 14221 T1847 oazs.PrepRequestProcessor.pRequest Got user-level KeeperException when processing sessionid:0x13c974be4b7000c type:delete cxid:0x4 zxid:0xa2 txntype:-1 reqpath:n/a Error Path:/solr/live_nodes/127.0.0.1:51288_i Error:KeeperErrorCode = NoNode for /solr/live_nodes/127.0.0.1:51288_i
[junit4:junit4]   2> 14222 T1842 oascc.SolrZkClient.makePath makePath: /live_nodes/127.0.0.1:51288_i
[junit4:junit4]   2> 14228 T1883 oascc.ZkStateReader$2.process A cluster state change: WatchedEvent state:SyncConnected type:NodeChildrenChanged path:/live_nodes, has occurred - updating... (live nodes size: 4)
[junit4:junit4]   2> 14228 T1898 oascc.ZkStateReader$2.process A cluster state change: WatchedEvent state:SyncConnected type:NodeChildrenChanged path:/live_nodes, has occurred - updating... (live nodes size: 4)
[junit4:junit4]   2> 14228 T1913 oascc.ZkStateReader$2.process A cluster state change: WatchedEvent state:SyncConnected type:NodeChildrenChanged path:/live_nodes, has occurred - updating... (live nodes size: 4)
[junit4:junit4]   2> 14230 T1870 oascc.ZkStateReader$3.process Updating live nodes... (5)
[junit4:junit4]   2> 14230 T1870 oascc.ZkStateReader$2.process A cluster state change: WatchedEvent state:SyncConnected type:NodeChildrenChanged path:/live_nodes, has occurred - updating... (live nodes size: 5)
[junit4:junit4]   2> 14231 T1864 oascc.ZkStateReader$3.process Updating live nodes... (5)
[junit4:junit4]   2> 14231 T1864 oascc.ZkStateReader$2.process A cluster state change: WatchedEvent state:SyncConnected type:NodeChildrenChanged path:/live_nodes, has occurred - updating... (live nodes size: 5)
[junit4:junit4]   2> 14235 T1898 oascc.ZkStateReader$3.process Updating live nodes... (5)
[junit4:junit4]   2> 14236 T1883 oascc.ZkStateReader$3.process Updating live nodes... (5)
[junit4:junit4]   2> 14236 T1913 oascc.ZkStateReader$3.process Updating live nodes... (5)
[junit4:junit4]   2> 14240 T1842 oascc.ZkStateReader.createClusterStateWatchersAndUpdate Updating cluster state from ZooKeeper... 
[junit4:junit4]   2> 14254 T1930 oasc.CoreContainer.create Creating SolrCore 'collection1' using instanceDir: /Users/jenkins/jenkins-slave/workspace/Lucene-Solr-4.x-MacOSX/solr/build/solr-core/test/J0/./org.apache.solr.cloud.BasicDistributedZkTest-jetty4-1359748012683/collection1
[junit4:junit4]   2> 14254 T1930 oasc.ZkController.createCollectionZkNode Check for collection zkNode:collection1
[junit4:junit4]   2> 14255 T1930 oasc.ZkController.createCollectionZkNode Collection zkNode exists
[junit4:junit4]   2> 14256 T1930 oasc.ZkController.readConfigName Load collection config from:/collections/collection1
[junit4:junit4]   2> 14259 T1930 oasc.SolrResourceLoader.<init> new SolrResourceLoader for directory: '/Users/jenkins/jenkins-slave/workspace/Lucene-Solr-4.x-MacOSX/solr/build/solr-core/test/J0/./org.apache.solr.cloud.BasicDistributedZkTest-jetty4-1359748012683/collection1/'
[junit4:junit4]   2> 14260 T1930 oasc.SolrResourceLoader.replaceClassLoader Adding 'file:/Users/jenkins/jenkins-slave/workspace/Lucene-Solr-4.x-MacOSX/solr/build/solr-core/test/J0/org.apache.solr.cloud.BasicDistributedZkTest-jetty4-1359748012683/collection1/lib/classes/' to classloader
[junit4:junit4]   2> 14261 T1930 oasc.SolrResourceLoader.replaceClassLoader Adding 'file:/Users/jenkins/jenkins-slave/workspace/Lucene-Solr-4.x-MacOSX/solr/build/solr-core/test/J0/org.apache.solr.cloud.BasicDistributedZkTest-jetty4-1359748012683/collection1/lib/README' to classloader
[junit4:junit4]   2> 14320 T1865 oascc.ZkStateReader.updateClusterState Updating cloud state from ZooKeeper... 
[junit4:junit4]   2> 14321 T1865 oasc.Overseer$ClusterStateUpdater.updateState Update state numShards=2 message={
[junit4:junit4]   2> 	  "operation":"state",
[junit4:junit4]   2> 	  "numShards":"2",
[junit4:junit4]   2> 	  "shard":"shard1",
[junit4:junit4]   2> 	  "roles":null,
[junit4:junit4]   2> 	  "state":"recovering",
[junit4:junit4]   2> 	  "core":"collection1",
[junit4:junit4]   2> 	  "collection":"collection1",
[junit4:junit4]   2> 	  "node_name":"127.0.0.1:51284_i",
[junit4:junit4]   2> 	  "base_url":"http://127.0.0.1:51284/i"}
[junit4:junit4]   2> 14331 T1913 oascc.ZkStateReader$2.process A cluster state change: WatchedEvent state:SyncConnected type:NodeDataChanged path:/clusterstate.json, has occurred - updating... (live nodes size: 5)
[junit4:junit4]   2> 14332 T1864 oascc.ZkStateReader$2.process A cluster state change: WatchedEvent state:SyncConnected type:NodeDataChanged path:/clusterstate.json, has occurred - updating... (live nodes size: 5)
[junit4:junit4]   2> 14333 T1870 oascc.ZkStateReader$2.process A cluster state change: WatchedEvent state:SyncConnected type:NodeDataChanged path:/clusterstate.json, has occurred - updating... (live nodes size: 5)
[junit4:junit4]   2> 14333 T1898 oascc.ZkStateReader$2.process A cluster state change: WatchedEvent state:SyncConnected type:NodeDataChanged path:/clusterstate.json, has occurred - updating... (live nodes size: 5)
[junit4:junit4]   2> 14341 T1883 oascc.ZkStateReader$2.process A cluster state change: WatchedEvent state:SyncConnected type:NodeDataChanged path:/clusterstate.json, has occurred - updating... (live nodes size: 5)
[junit4:junit4]   2> 14342 T1929 oascc.ZkStateReader$2.process A cluster state change: WatchedEvent state:SyncConnected type:NodeDataChanged path:/clusterstate.json, has occurred - updating... (live nodes size: 5)
[junit4:junit4]   2> 14356 T1930 oasc.SolrConfig.<init> Using Lucene MatchVersion: LUCENE_42
[junit4:junit4]   2> 14467 T1930 oasc.SolrConfig.<init> Loaded SolrConfig: solrconfig.xml
[junit4:junit4]   2> 14469 T1930 oass.IndexSchema.readSchema Reading Solr Schema
[junit4:junit4]   2> 14480 T1930 oass.IndexSchema.readSchema Schema name=test
[junit4:junit4]   2> 15160 T1930 oass.OpenExchangeRatesOrgProvider.init Initialized with rates=open-exchange-rates.json, refreshInterval=1440.
[junit4:junit4]   2> 15171 T1930 oass.IndexSchema.readSchema default search field in schema is text
[junit4:junit4]   2> 15175 T1930 oass.IndexSchema.readSchema unique key field: id
[junit4:junit4]   2> 15202 T1930 oass.FileExchangeRateProvider.reload Reloading exchange rates from file currency.xml
[junit4:junit4]   2> 15208 T1930 oass.FileExchangeRateProvider.reload Reloading exchange rates from file currency.xml
[junit4:junit4]   2> 15215 T1930 oass.OpenExchangeRatesOrgProvider.reload Reloading exchange rates from open-exchange-rates.json
[junit4:junit4]   2> 15218 T1930 oass.OpenExchangeRatesOrgProvider.reload Reloading exchange rates from open-exchange-rates.json
[junit4:junit4]   2> 15220 T1930 oasc.SolrCore.<init> [collection1] Opening new SolrCore at /Users/jenkins/jenkins-slave/workspace/Lucene-Solr-4.x-MacOSX/solr/build/solr-core/test/J0/./org.apache.solr.cloud.BasicDistributedZkTest-jetty4-1359748012683/collection1/, dataDir=./org.apache.solr.cloud.BasicDistributedZkTest-1359747998897/jetty4/
[junit4:junit4]   2> 15221 T1930 oasc.JmxMonitoredMap.<init> JMX monitoring is enabled. Adding Solr mbeans to JMX Server: com.sun.jmx.mbeanserver.JmxMBeanServer@67b38e47
[junit4:junit4]   2> 15221 T1930 oasc.SolrCore.initDirectoryFactory solr.NRTCachingDirectoryFactory
[junit4:junit4]   2> 15222 T1930 oasc.CachingDirectoryFactory.get return new directory for /Users/jenkins/jenkins-slave/workspace/Lucene-Solr-4.x-MacOSX/solr/build/solr-core/test/J0/./org.apache.solr.cloud.BasicDistributedZkTest-1359747998897/jetty4 forceNew:false
[junit4:junit4]   2> 15223 T1930 oasc.CachingDirectoryFactory.close Releasing directory:/Users/jenkins/jenkins-slave/workspace/Lucene-Solr-4.x-MacOSX/solr/build/solr-core/test/J0/./org.apache.solr.cloud.BasicDistributedZkTest-1359747998897/jetty4
[junit4:junit4]   2> 15223 T1930 oasc.SolrCore.getNewIndexDir New index directory detected: old=null new=./org.apache.solr.cloud.BasicDistributedZkTest-1359747998897/jetty4/index/
[junit4:junit4]   2> 15224 T1930 oasc.SolrCore.initIndex WARNING [collection1] Solr index directory './org.apache.solr.cloud.BasicDistributedZkTest-1359747998897/jetty4/index' doesn't exist. Creating new index...
[junit4:junit4]   2> 15224 T1930 oasc.CachingDirectoryFactory.get return new directory for /Users/jenkins/jenkins-slave/workspace/Lucene-Solr-4.x-MacOSX/solr/build/solr-core/test/J0/./org.apache.solr.cloud.BasicDistributedZkTest-1359747998897/jetty4/index forceNew:false
[junit4:junit4]   2> 15230 T1930 oasc.SolrDeletionPolicy.onCommit SolrDeletionPolicy.onCommit: commits:num=1
[junit4:junit4]   2> 		commit{dir=RateLimitedDirectoryWrapper(NRTCachingDirectory(org.apache.lucene.store.NIOFSDirectory@/Users/jenkins/jenkins-slave/workspace/Lucene-Solr-4.x-MacOSX/solr/build/solr-core/test/J0/org.apache.solr.cloud.BasicDistributedZkTest-1359747998897/jetty4/index lockFactory=org.apache.lucene.store.NativeFSLockFactory@5ea6ee2d; maxCacheMB=48.0 maxMergeSizeMB=4.0)),segFN=segments_1,generation=1,filenames=[segments_1]
[junit4:junit4]   2> 15230 T1930 oasc.SolrDeletionPolicy.updateCommits newest commit = 1[segments_1]
[junit4:junit4]   2> 15231 T1930 oasc.CachingDirectoryFactory.close Releasing directory:/Users/jenkins/jenkins-slave/workspace/Lucene-Solr-4.x-MacOSX/solr/build/solr-core/test/J0/./org.apache.solr.cloud.BasicDistributedZkTest-1359747998897/jetty4/index
[junit4:junit4]   2> 15232 T1930 oasc.SolrCore.initWriters created xml: solr.XMLResponseWriter
[junit4:junit4]   2> 15236 T1930 oasup.UpdateRequestProcessorChain.init inserting DistributedUpdateProcessorFactory into updateRequestProcessorChain "dedupe"
[junit4:junit4]   2> 15236 T1930 oasup.UpdateRequestProcessorChain.init inserting DistributedUpdateProcessorFactory into updateRequestProcessorChain "dedupe-allfields"
[junit4:junit4]   2> 15237 T1930 oasup.UpdateRequestProcessorChain.init inserting DistributedUpdateProcessorFactory into updateRequestProcessorChain "stored_sig"
[junit4:junit4]   2> 15238 T1930 oasup.UpdateRequestProcessorChain.init inserting DistributedUpdateProcessorFactory into updateRequestProcessorChain "uniq-fields"
[junit4:junit4]   2> 15239 T1930 oasup.UpdateRequestProcessorChain.init inserting DistributedUpdateProcessorFactory into updateRequestProcessorChain "distrib-dup-test-chain-implicit"
[junit4:junit4]   2> 15239 T1930 oasc.RequestHandlers.initHandlersFromConfig adding lazy requestHandler: solr.ReplicationHandler
[junit4:junit4]   2> 15240 T1930 oasc.RequestHandlers.initHandlersFromConfig created /replication: solr.ReplicationHandler
[junit4:junit4]   2> 15242 T1930 oasc.RequestHandlers.initHandlersFromConfig created standard: solr.StandardRequestHandler
[junit4:junit4]   2> 15243 T1930 oasc.RequestHandlers.initHandlersFromConfig created /get: solr.RealTimeGetHandler
[junit4:junit4]   2> 15244 T1930 oasc.RequestHandlers.initHandlersFromConfig created dismax: solr.SearchHandler
[junit4:junit4]   2> 15245 T1930 oasc.RequestHandlers.initHandlersFromConfig created mock: org.apache.solr.core.MockQuerySenderListenerReqHandler
[junit4:junit4]   2> 15246 T1930 oasc.RequestHandlers.initHandlersFromConfig created /admin/: org.apache.solr.handler.admin.AdminHandlers
[junit4:junit4]   2> 15247 T1930 oasc.RequestHandlers.initHandlersFromConfig created defaults: solr.StandardRequestHandler
[junit4:junit4]   2> 15248 T1930 oasc.RequestHandlers.initHandlersFromConfig adding lazy requestHandler: solr.StandardRequestHandler
[junit4:junit4]   2> 15248 T1930 oasc.RequestHandlers.initHandlersFromConfig created lazy: solr.StandardRequestHandler
[junit4:junit4]   2> 15252 T1930 oasc.RequestHandlers.initHandlersFromConfig created /update: solr.UpdateRequestHandler
[junit4:junit4]   2> 15253 T1930 oasc.RequestHandlers.initHandlersFromConfig created /terms: org.apache.solr.handler.component.SearchHandler
[junit4:junit4]   2> 15254 T1930 oasc.RequestHandlers.initHandlersFromConfig created spellCheckCompRH: org.apache.solr.handler.component.SearchHandler
[junit4:junit4]   2> 15255 T1930 oasc.RequestHandlers.initHandlersFromConfig created spellCheckCompRH_Direct: org.apache.solr.handler.component.SearchHandler
[junit4:junit4]   2> 15256 T1930 oasc.RequestHandlers.initHandlersFromConfig created spellCheckWithWordbreak: org.apache.solr.handler.component.SearchHandler
[junit4:junit4]   2> 15257 T1930 oasc.RequestHandlers.initHandlersFromConfig created spellCheckWithWordbreak_Direct: org.apache.solr.handler.component.SearchHandler
[junit4:junit4]   2> 15258 T1930 oasc.RequestHandlers.initHandlersFromConfig created spellCheckCompRH1: org.apache.solr.handler.component.SearchHandler
[junit4:junit4]   2> 15259 T1930 oasc.RequestHandlers.initHandlersFromConfig created mltrh: org.apache.solr.handler.component.SearchHandler
[junit4:junit4]   2> 15260 T1930 oasc.RequestHandlers.initHandlersFromConfig created tvrh: org.apache.solr.handler.component.SearchHandler
[junit4:junit4]   2> 15261 T1930 oasc.RequestHandlers.initHandlersFromConfig created /mlt: solr.MoreLikeThisHandler
[junit4:junit4]   2> 15262 T1930 oasc.RequestHandlers.initHandlersFromConfig created /debug/dump: solr.DumpRequestHandler
[junit4:junit4]   2> 15269 T1930 oashl.XMLLoader.init xsltCacheLifetimeSeconds=60
[junit4:junit4]   2> 15273 T1930 oasc.SolrCore.initDeprecatedSupport WARNING solrconfig.xml uses deprecated <admin/gettableFiles>, Please update your config to use the ShowFileRequestHandler.
[junit4:junit4]   2> 15275 T1930 oasc.SolrCore.initDeprecatedSupport WARNING adding ShowFileRequestHandler with hidden files: [SCHEMA.XML, OLD_SYNONYMS.TXT, STOPWORDS.TXT, PROTWORDS.TXT, OPEN-EXCHANGE-RATES.JSON, SYNONYMS.TXT, CURRENCY.XML, MAPPING-ISOLATIN1ACCENT.TXT]
[junit4:junit4]   2> 15278 T1930 oasc.CachingDirectoryFactory.close Releasing directory:/Users/jenkins/jenkins-slave/workspace/Lucene-Solr-4.x-MacOSX/solr/build/solr-core/test/J0/./org.apache.solr.cloud.BasicDistributedZkTest-1359747998897/jetty4
[junit4:junit4]   2> 15280 T1930 oass.SolrIndexSearcher.<init> Opening Searcher@5df8c337 main
[junit4:junit4]   2> 15281 T1930 oasu.CommitTracker.<init> Hard AutoCommit: disabled
[junit4:junit4]   2> 15282 T1930 oasu.CommitTracker.<init> Soft AutoCommit: disabled
[junit4:junit4]   2> 15283 T1930 oashc.SpellCheckComponent.inform Initializing spell checkers
[junit4:junit4]   2> 15293 T1930 oass.DirectSolrSpellChecker.init init: {name=direct,classname=DirectSolrSpellChecker,field=lowerfilt,minQueryLength=3}
[junit4:junit4]   2> 15332 T1931 oasc.SolrCore.registerSearcher [collection1] Registered new searcher Searcher@5df8c337 main{StandardDirectoryReader(segments_1:1)}
[junit4:junit4]   2> 15340 T1930 oasc.ZkController.publish publishing core=collection1 state=down
[junit4:junit4]   2> 15340 T1930 oasc.ZkController.publish numShards not found on descriptor - reading it from system property
[junit4:junit4]   2> 15848 T1865 oascc.ZkStateReader.updateClusterState Updating cloud state from ZooKeeper... 
[junit4:junit4]   2> 15849 T1865 oasc.Overseer$ClusterStateUpdater.updateState Update state numShards=2 message={
[junit4:junit4]   2> 	  "operation":"state",
[junit4:junit4]   2> 	  "numShards":"2",
[junit4:junit4]   2> 	  "shard":null,
[junit4:junit4]   2> 	  "roles":null,
[junit4:junit4]   2> 	  "state":"down",
[junit4:junit4]   2> 	  "core":"collection1",
[junit4:junit4]   2> 	  "collection":"collection1",
[junit4:junit4]   2> 	  "node_name":"127.0.0.1:51288_i",
[junit4:junit4]   2> 	  "base_url":"http://127.0.0.1:51288/i"}
[junit4:junit4]   2> 15850 T1865 oasc.Overseer$ClusterStateUpdater.updateState Collection already exists with numShards=2
[junit4:junit4]   2> 15850 T1865 oasc.Overseer$ClusterStateUpdater.updateState Assigning new node to shard shard=shard2
[junit4:junit4]   2> 15857 T1913 oascc.ZkStateReader$2.process A cluster state change: WatchedEvent state:SyncConnected type:NodeDataChanged path:/clusterstate.json, has occurred - updating... (live nodes size: 5)
[junit4:junit4]   2> 15857 T1883 oascc.ZkStateReader$2.process A cluster state change: WatchedEvent state:SyncConnected type:NodeDataChanged path:/clusterstate.json, has occurred - updating... (live nodes size: 5)
[junit4:junit4]   2> 15858 T1898 oascc.ZkStateReader$2.process A cluster state change: WatchedEvent state:SyncConnected type:NodeDataChanged path:/clusterstate.json, has occurred - updating... (live nodes size: 5)
[junit4:junit4]   2> 15857 T1929 oascc.ZkStateReader$2.process A cluster state change: WatchedEvent state:SyncConnected type:NodeDataChanged path:/clusterstate.json, has occurred - updating... (live nodes size: 5)
[junit4:junit4]   2> 15858 T1870 oascc.ZkStateReader$2.process A cluster state change: WatchedEvent state:SyncConnected type:NodeDataChanged path:/clusterstate.json, has occurred - updating... (live nodes size: 5)
[junit4:junit4]   2> 15857 T1864 oascc.ZkStateReader$2.process A cluster state change: WatchedEvent state:SyncConnected type:NodeDataChanged path:/clusterstate.json, has occurred - updating... (live nodes size: 5)
[junit4:junit4]   2> 16344 T1930 oasc.CoreContainer.registerCore registering core: collection1
[junit4:junit4]   2> 16344 T1930 oasc.ZkController.register Register replica - core:collection1 address:http://127.0.0.1:51288/i collection:collection1 shard:shard2
[junit4:junit4]   2> 16351 T1930 oasc.ZkController.register We are http://127.0.0.1:51288/i/collection1/ and leader is http://127.0.0.1:51281/i/collection1/
[junit4:junit4]   2> 16352 T1930 oasc.ZkController.register No LogReplay needed for core=collection1 baseURL=http://127.0.0.1:51288/i
[junit4:junit4]   2> 16352 T1930 oasc.ZkController.checkRecovery Core needs to recover:collection1
[junit4:junit4]   2> 16353 T1930 oasu.DefaultSolrCoreState.doRecovery Running recovery - first canceling any ongoing recovery
[junit4:junit4]   2> ASYNC  NEW_CORE C118 name=collection1 org.apache.solr.core.SolrCore@6836b284 url=http://127.0.0.1:51288/i/collection1 node=127.0.0.1:51288_i C118_STATE=coll:collection1 core:collection1 props:{shard=null, roles=null, state=down, core=collection1, collection=collection1, node_name=127.0.0.1:51288_i, base_url=http://127.0.0.1:51288/i}
[junit4:junit4]   2> 16354 T1932 C118 P51288 oasc.RecoveryStrategy.run Starting recovery process.  core=collection1 recoveringAfterStartup=true
[junit4:junit4]   2> 16356 T1932 C118 P51288 oasc.RecoveryStrategy.doRecovery ###### startupVersions=[]
[junit4:junit4]   2> 16355 T1930 oascc.ZkStateReader.updateClusterState Updating cloud state from ZooKeeper... 
[junit4:junit4]   2> 16356 T1932 C118 P51288 oasc.ZkController.publish publishing core=collection1 state=recovering
[junit4:junit4]   2> 16357 T1932 C118 P51288 oasc.ZkController.publish numShards not found on descriptor - reading it from system property
[junit4:junit4]   2> 16359 T1932 C118 P51288 oascsi.HttpClientUtil.createClient Creating new http client, config:maxConnections=128&maxConnectionsPerHost=32&followRedirects=false
[junit4:junit4]   2> 16358 T1842 oass.SolrDispatchFilter.init user.dir=/Users/jenkins/jenkins-slave/workspace/Lucene-Solr-4.x-MacOSX/solr/build/solr-core/test/J0
[junit4:junit4]   2> 16360 T1842 oass.SolrDispatchFilter.init SolrDispatchFilter.init() done
[junit4:junit4]   2> 16361 T1842 oascsi.HttpClientUtil.createClient Creating new http client, config:maxConnections=128&maxConnectionsPerHost=32&followRedirects=false
[junit4:junit4]   2> 16376 T1842 oascc.ZkStateReader.updateClusterState Updating cloud state from ZooKeeper... 
[junit4:junit4]   2> 16379 T1842 oasc.AbstractDistribZkTestBase.waitForRecoveriesToFinish Wait for recoveries to finish - collection: collection1 failOnTimeout:true timeout (sec):230
[junit4:junit4]   2> 16381 T1842 oascc.ZkStateReader.updateClusterState Updating cloud state from ZooKeeper... 
[junit4:junit4]   2>  C117_STATE=coll:collection1 core:collection1 props:{shard=shard1, roles=null, state=recovering, core=collection1, collection=collection1, node_name=127.0.0.1:51284_i, base_url=http://127.0.0.1:51284/i}
[junit4:junit4]   2> 16805 T1916 C117 P51284 oasc.RecoveryStrategy.doRecovery Attempting to PeerSync from http://127.0.0.1:51278/i/collection1/ core=collection1 - recoveringAfterStartup=true
[junit4:junit4]   2> 16805 T1916 C117 P51284 oasu.PeerSync.sync PeerSync: core=collection1 url=http://127.0.0.1:51284/i START replicas=[http://127.0.0.1:51278/i/collection1/] nUpdates=100
[junit4:junit4]   2> 16806 T1916 C117 P51284 oasu.PeerSync.sync WARNING no frame of reference to tell of we've missed updates
[junit4:junit4]   2> 16806 T1916 C117 P51284 oasc.RecoveryStrategy.doRecovery PeerSync Recovery was not successful - trying replication. core=collection1
[junit4:junit4]   2> 16806 T1916 C117 P51284 oasc.RecoveryStrategy.doRecovery Starting Replication Recovery. core=collection1
[junit4:junit4]   2> 16806 T1916 C117 P51284 oasc.RecoveryStrategy.doRecovery Begin buffering updates. core=collection1
[junit4:junit4]   2> 16807 T1916 C117 P51284 oasu.UpdateLog.bufferUpdates Starting to buffer updates. FSUpdateLog{state=ACTIVE, tlog=null}
[junit4:junit4]   2> 16807 T1916 C117 P51284 oasc.RecoveryStrategy.replicate Attempting to replicate from http://127.0.0.1:51278/i/collection1/. core=collection1
[junit4:junit4]   2> 16808 T1916 C117 P51284 oascsi.HttpClientUtil.createClient Creating new http client, config:maxConnections=128&maxConnectionsPerHost=32&followRedirects=false
[junit4:junit4]   2> ASYNC  NEW_CORE C119 name=collection1 org.apache.solr.core.SolrCore@4b0d9912 url=http://127.0.0.1:51278/i/collection1 node=127.0.0.1:51278_i C119_STATE=coll:collection1 core:collection1 props:{shard=shard1, roles=null, state=active, core=collection1, collection=collection1, node_name=127.0.0.1:51278_i, base_url=http://127.0.0.1:51278/i, leader=true}
[junit4:junit4]   2> 16820 T1879 C119 P51278 REQ /get {getVersions=100&distrib=false&wt=javabin&qt=/get&version=2} status=0 QTime=1 
[junit4:junit4]   2> 16819 T1876 C119 P51278 oasu.DirectUpdateHandler2.commit start commit{,optimize=false,openSearcher=false,waitSearcher=true,expungeDeletes=false,softCommit=false}
[junit4:junit4]   2> 16822 T1876 C119 P51278 oasc.CachingDirectoryFactory.close Releasing directory:/Users/jenkins/jenkins-slave/workspace/Lucene-Solr-4.x-MacOSX/solr/build/solr-core/test/J0/./org.apache.solr.cloud.BasicDistributedZkTest-1359747998897/jetty1
[junit4:junit4]   2> 16825 T1876 C119 P51278 oasc.SolrDeletionPolicy.onInit SolrDeletionPolicy.onInit: commits:num=1
[junit4:junit4]   2> 		commit{dir=RateLimitedDirectoryWrapper(NRTCachingDirectory(org.apache.lucene.store.NIOFSDirectory@/Users/jenkins/jenkins-slave/workspace/Lucene-Solr-4.x-MacOSX/solr/build/solr-core/test/J0/org.apache.solr.cloud.BasicDistributedZkTest-1359747998897/jetty1/index lockFactory=org.apache.lucene.store.NativeFSLockFactory@4b4308a6; maxCacheMB=48.0 maxMergeSizeMB=4.0)),segFN=segments_1,generation=1,filenames=[segments_1]
[junit4:junit4]   2> 16826 T1876 C119 P51278 oasc.SolrDeletionPolicy.updateCommits newest commit = 1[segments_1]
[junit4:junit4]   2> 16828 T1876 C119 P51278 oasc.SolrDeletionPolicy.onCommit SolrDeletionPolicy.onCommit: commits:num=2
[junit4:junit4]   2> 		commit{dir=RateLimitedDirectoryWrapper(NRTCachingDirectory(org.apache.lucene.store.NIOFSDirectory@/Users/jenkins/jenkins-slave/workspace/Lucene-Solr-4.x-MacOSX/solr/build/solr-core/test/J0/org.apache.solr.cloud.BasicDistributedZkTest-1359747998897/jetty1/index lockFactory=org.apache.lucene.store.NativeFSLockFactory@4b4308a6; maxCacheMB=48.0 maxMergeSizeMB=4.0)),segFN=segments_1,generation=1,filenames=[segments_1]
[junit4:junit4]   2> 		commit{dir=RateLimitedDirectoryWrapper(NRTCachingDirectory(org.apache.lucene.store.NIOFSDirectory@/Users/jenkins/jenkins-slave/workspace/Lucene-Solr-4.x-MacOSX/solr/build/solr-core/test/J0/org.apache.solr.cloud.BasicDistributedZkTest-1359747998897/jetty1/index lockFactory=org.apache.lucene.store.NativeFSLockFactory@4b4308a6; maxCacheMB=48.0 maxMergeSizeMB=4.0)),segFN=segments_2,generation=2,filenames=[segments_2]
[junit4:junit4]   2> 16829 T1876 C119 P51278 oasc.SolrDeletionPolicy.updateCommits newest commit = 2[segments_2]
[junit4:junit4]   2> 16829 T1876 C119 P51278 oasc.CachingDirectoryFactory.close Releasing directory:/Users/jenkins/jenkins-slave/workspace/Lucene-Solr-4.x-MacOSX/solr/build/solr-core/test/J0/./org.apache.solr.cloud.BasicDistributedZkTest-1359747998897/jetty1
[junit4:junit4]   2> 16830 T1876 C119 P51278 oass.SolrIndexSearcher.<init> Opening Searcher@2a5bb17e realtime
[junit4:junit4]   2> 16830 T1876 C119 P51278 oasu.DirectUpdateHandler2.commit end_commit_flush
[junit4:junit4]   2> 16830 T1876 C119 P51278 /update {waitSearcher=true&openSearcher=false&commit=true&wt=javabin&commit_end_point=true&version=2&softCommit=false} {commit=} 0 11
[junit4:junit4]   2> 16833 T1916 C117 P51284 oash.ReplicationHandler.inform Commits will be reserved for  10000
[junit4:junit4]   2> 16833 T1916 C117 P51284 oash.SnapPuller.<init>  No value set for 'pollInterval'. Timer Task not started.
[junit4:junit4]   2> 16838 T1874 C119 P51278 oash.ReplicationHandler.inform Commits will be reserved for  10000
[junit4:junit4]   2> 16838 T1874 C119 P51278 REQ /replication {command=indexversion&qt=/replication&wt=javabin&version=2} status=0 QTime=2 
[junit4:junit4]   2> 16839 T1916 C117 P51284 oash.SnapPuller.fetchLatestIndex Master's generation: 2
[junit4:junit4]   2> 16840 T1916 C117 P51284 oash.SnapPuller.fetchLatestIndex Slave's generation: 1
[junit4:junit4]   2> 16840 T1916 C117 P51284 oash.SnapPuller.fetchLatestIndex Starting replication process
[junit4:junit4]   2> 16843 T1875 C119 P51278 oasc.CachingDirectoryFactory.close Releasing directory:/Users/jenkins/jenkins-slave/workspace/Lucene-Solr-4.x-MacOSX/solr/build/solr-core/test/J0/./org.apache.solr.cloud.BasicDistributedZkTest-1359747998897/jetty1
[junit4:junit4]   2> 16844 T1875 C119 P51278 oasc.CachingDirectoryFactory.close Releasing directory:/Users/jenkins/jenkins-slave/workspace/Lucene-Solr-4.x-MacOSX/solr/build/solr-core/test/J0/./org.apache.solr.cloud.BasicDistributedZkTest-1359747998897/jetty1/index
[junit4:junit4]   2> 16845 T1875 C119 P51278 REQ /replication {command=filelist&qt=/replication&wt=javabin&generation=2&version=2} status=0 QTime=2 
[junit4:junit4]   2> 16846 T1916 C117 P51284 oash.SnapPuller.fetchLatestIndex Number of files in latest index in master: 1
[junit4:junit4]   2> 16847 T1916 C117 P51284 oasc.CachingDirectoryFactory.get return new directory for /Users/jenkins/jenkins-slave/workspace/Lucene-Solr-4.x-MacOSX/solr/build/solr-core/test/J0/./org.apache.solr.cloud.BasicDistributedZkTest-1359747998897/jetty3/index.20130201144655736 forceNew:false
[junit4:junit4]   2> 16848 T1916 C117 P51284 oasc.CachingDirectoryFactory.close Releasing directory:/Users/jenkins/jenkins-slave/workspace/Lucene-Solr-4.x-MacOSX/solr/build/solr-core/test/J0/./org.apache.solr.cloud.BasicDistributedZkTest-1359747998897/jetty3
[junit4:junit4]   2> 16849 T1916 C117 P51284 oash.SnapPuller.fetchLatestIndex Starting download to RateLimitedDirectoryWrapper(NRTCachingDirectory(org.apache.lucene.store.NIOFSDirectory@/Users/jenkins/jenkins-slave/workspace/Lucene-Solr-4.x-MacOSX/solr/build/solr-core/test/J0/org.apache.solr.cloud.BasicDistributedZkTest-1359747998897/jetty3/index.20130201144655736 lockFactory=org.apache.lucene.store.NativeFSLockFactory@5083416b; maxCacheMB=48.0 maxMergeSizeMB=4.0)) fullCopy=true
[junit4:junit4]   2> 16854 T1877 C119 P51278 REQ /replication {file=segments_2&command=filecontent&checksum=true&wt=filestream&qt=/replication&generation=2} status=0 QTime=1 
[junit4:junit4]   2> 16857 T1916 C117 P51284 oasc.CachingDirectoryFactory.close Releasing directory:/Users/jenkins/jenkins-slave/workspace/Lucene-Solr-4.x-MacOSX/solr/build/solr-core/test/J0/./org.apache.solr.cloud.BasicDistributedZkTest-1359747998897/jetty3/index
[junit4:junit4]   2> 16857 T1916 C117 P51284 oash.SnapPuller.fetchLatestIndex Total time taken for download : 0 secs
[junit4:junit4]   2> 16858 T1916 C117 P51284 oash.SnapPuller.modifyIndexProps New index installed. Updating index properties... index=index.20130201144655736
[junit4:junit4]   2> 16859 T1916 C117 P51284 oasc.CachingDirectoryFactory.close Releasing directory:/Users/jenkins/jenkins-slave/workspace/Lucene-Solr-4.x-MacOSX/solr/build/solr-core/test/J0/./org.apache.solr.cloud.BasicDistributedZkTest-1359747998897/jetty3
[junit4:junit4]   2> 16860 T1916 C117 P51284 oasc.CachingDirectoryFactory.close Releasing directory:/Users/jenkins/jenkins-slave/workspace/Lucene-Solr-4.x-MacOSX/solr/build/solr-core/test/J0/./org.apache.solr.cloud.BasicDistributedZkTest-1359747998897/jetty3
[junit4:junit4]   2> 16860 T1916 C117 P51284 oasc.SolrCore.getNewIndexDir New index directory detected: old=./org.apache.solr.cloud.BasicDistributedZkTest-1359747998897/jetty3/index/ new=./org.apache.solr.cloud.BasicDistributedZkTest-1359747998897/jetty3/index.20130201144655736
[junit4:junit4]   2> 16863 T1916 C117 P51284 oasc.SolrDeletionPolicy.onInit SolrDeletionPolicy.onInit: commits:num=1
[junit4:junit4]   2> 		commit{dir=RateLimitedDirectoryWrapper(NRTCachingDirectory(org.apache.lucene.store.NIOFSDirectory@/Users/jenkins/jenkins-slave/workspace/Lucene-Solr-4.x-MacOSX/solr/build/solr-core/test/J0/org.apache.solr.cloud.BasicDistributedZkTest-1359747998897/jetty3/index.20130201144655736 lockFactory=org.apache.lucene.store.NativeFSLockFactory@5083416b; maxCacheMB=48.0 maxMergeSizeMB=4.0)),segFN=segments_2,generation=2,filenames=[segments_2]
[junit4:junit4]   2> 16865 T1916 C117 P51284 oasc.SolrDeletionPolicy.updateCommits newest commit = 2[segments_2]
[junit4:junit4]   2> 16867 T1916 C117 P51284 oasc.CachingDirectoryFactory.close Releasing directory:/Users/jenkins/jenkins-slave/workspace/Lucene-Solr-4.x-MacOSX/solr/build/solr-core/test/J0/./org.apache.solr.cloud.BasicDistributedZkTest-1359747998897/jetty3
[junit4:junit4]   2> 16867 T1916 C117 P51284 oasu.DefaultSolrCoreState.newIndexWriter Creating new IndexWriter...
[junit4:junit4]   2> 16867 T1916 C117 P51284 oasu.DefaultSolrCoreState.newIndexWriter Waiting until IndexWriter is unused... core=collection1
[junit4:junit4]   2> 16868 T1916 C117 P51284 oasu.DefaultSolrCoreState.newIndexWriter Rollback old IndexWriter... core=collection1
[junit4:junit4]   2> 16869 T1916 C117 P51284 oasc.CachingDirectoryFactory.close Releasing directory:/Users/jenkins/jenkins-slave/workspace/Lucene-Solr-4.x-MacOSX/solr/build/solr-core/test/J0/./org.apache.solr.cloud.BasicDistributedZkTest-1359747998897/jetty3/index.20130201144655736
[junit4:junit4]   2> 16870 T1916 C117 P51284 oasc.CachingDirectoryFactory.close Releasing directory:/Users/jenkins/jenkins-slave/workspace/Lucene-Solr-4.x-MacOSX/solr/build/solr-core/test/J0/./org.apache.solr.cloud.BasicDistributedZkTest-1359747998897/jetty3
[junit4:junit4]   2> 16874 T1916 C117 P51284 oasc.SolrDeletionPolicy.onInit SolrDeletionPolicy.onInit: commits:num=1
[junit4:junit4]   2> 		commit{dir=RateLimitedDirectoryWrapper(NRTCachingDirectory(org.apache.lucene.store.NIOFSDirectory@/Users/jenkins/jenkins-slave/workspace/Lucene-Solr-4.x-MacOSX/solr/build/solr-core/test/J0/org.apache.solr.cloud.BasicDistributedZkTest-1359747998897/jetty3/index.20130201144655736 lockFactory=org.apache.lucene.store.NativeFSLockFactory@5083416b; maxCacheMB=48.0 maxMergeSizeMB=4.0)),segFN=segments_2,generation=2,filenames=[segments_2]
[junit4:junit4]   2> 16874 T1916 C117 P51284 oasc.SolrDeletionPolicy.updateCommits newest commit = 2[segments_2]
[junit4:junit4]   2> 16875 T1916 C117 P51284 oasu.DefaultSolrCoreState.newIndexWriter New IndexWriter is ready to be used.
[junit4:junit4]   2> 16875 T1916 C117 P51284 oasc.CachingDirectoryFactory.close Releasing directory:/Users/jenkins/jenkins-slave/workspace/Lucene-Solr-4.x-MacOSX/solr/build/solr-core/test/J0/./org.apache.solr.cloud.BasicDistributedZkTest-1359747998897/jetty3
[junit4:junit4]   2> 16876 T1916 C117 P51284 oass.SolrIndexSearcher.<init> Opening Searcher@52cab5c3 main
[junit4:junit4]   2> 16878 T1915 oasc.SolrCore.registerSearcher [collection1] Registered new searcher Searcher@52cab5c3 main{StandardDirectoryReader(segments_2:1:nrt)}
[junit4:junit4]   2> 16879 T1915 oasc.CachingDirectoryFactory.close Releasing directory:/Users/jenkins/jenkins-slave/workspace/Lucene-Solr-4.x-MacOSX/solr/build/solr-core/test/J0/./org.apache.solr.cloud.BasicDistributedZkTest-1359747998897/jetty3/index
[junit4:junit4]   2> 16879 T1916 C117 P51284 oasu.DirectUpdateHandler2.commit start commit{,optimize=false,openSearcher=false,waitSearcher=false,expungeDeletes=false,softCommit=false}
[junit4:junit4]   2> 16882 T1916 C117 P51284 oasc.SolrDeletionPolicy.onCommit SolrDeletionPolicy.onCommit: commits:num=2
[junit4:junit4]   2> 		commit{dir=RateLimitedDirectoryWrapper(NRTCachingDirectory(org.apache.lucene.store.NIOFSDirectory@/Users/jenkins/jenkins-slave/workspace/Lucene-Solr-4.x-MacOSX/solr/build/solr-core/test/J0/org.apache.solr.cloud.BasicDistributedZkTest-1359747998897/jetty3/index.20130201144655736 lockFactory=org.apache.lucene.store.NativeFSLockFactory@5083416b; maxCacheMB=48.0 maxMergeSizeMB=4.0)),segFN=segments_2,generation=2,filenames=[segments_2]
[junit4:junit4]   2> 		commit{dir=RateLimitedDirectoryWrapper(NRTCachingDirectory(org.apache.lucene.store.NIOFSDirectory@/Users/jenkins/jenkins-slave/workspace/Lucene-Solr-4.x-MacOSX/solr/build/solr-core/test/J0/org.apache.solr.cloud.BasicDistributedZkTest-1359747998897/jetty3/index.20130201144655736 lockFactory=org.apache.lucene.store.NativeFSLockFactory@5083416b; maxCacheMB=48.0 maxMergeSizeMB=4.0)),segFN=segments_3,generation=3,filenames=[segments_3]
[junit4:junit4]   2> 16882 T1916 C117 P51284 oasc.SolrDeletionPolicy.updateCommits newest commit = 3[segments_3]
[junit4:junit4]   2> 16883 T1916 C117 P51284 oasc.CachingDirectoryFactory.close Releasing directory:/Users/jenkins/jenkins-slave/workspace/Lucene-Solr-4.x-MacOSX/solr/build/solr-core/test/J0/./org.apache.solr.cloud.BasicDistributedZkTest-1359747998897/jetty3
[junit4:junit4]   2> 16884 T1916 C117 P51284 oasu.DirectUpdateHandler2.commit end_commit_flush
[junit4:junit4]   2> 16884 T1916 C117 P51284 oasc.CachingDirectoryFactory.close Releasing directory:/Users/jenkins/jenkins-slave/workspace/Lucene-Solr-4.x-MacOSX/solr/build/solr-core/test/J0/./org.apache.solr.cloud.BasicDistributedZkTest-1359747998897/jetty3/index.20130201144655736
[junit4:junit4]   2> 16884 T1916 C117 P51284 oasc.CachingDirectoryFactory.close Releasing directory:/Users/jenkins/jenkins-slave/workspace/Lucene-Solr-4.x-MacOSX/solr/build/solr-core/test/J0/./org.apache.solr.cloud.BasicDistributedZkTest-1359747998897/jetty3/index
[junit4:junit4]   2> 16884 T1916 C117 P51284 oasc.RecoveryStrategy.replay No replay needed. core=collection1
[junit4:junit4]   2> 16885 T1916 C117 P51284 oasc.RecoveryStrategy.doRecovery Replication Recovery was successful - registering as Active. core=collection1
[junit4:junit4]   2> 16885 T1916 C117 P51284 oasc.ZkController.publish publishing core=collection1 state=active
[junit4:junit4]   2> 16885 T1916 C117 P51284 oasc.ZkController.publish numShards not found on descriptor - reading it from system property
[junit4:junit4]   2> 16888 T1916 C117 P51284 oasc.RecoveryStrategy.doRecovery Finished recovery process. core=collection1
[junit4:junit4]   2> 17373 T1865 oascc.ZkStateReader.updateClusterState Updating cloud state from ZooKeeper... 
[junit4:junit4]   2> 17374 T1865 oasc.Overseer$ClusterStateUpdater.updateState Update state numShards=2 message={
[junit4:junit4]   2> 	  "operation":"state",
[junit4:junit4]   2> 	  "numShards":"2",
[junit4:junit4]   2> 	  "shard":"shard2",
[junit4:junit4]   2> 	  "roles":null,
[junit4:junit4]   2> 	  "state":"recovering",
[junit4:junit4]   2> 	  "core":"collection1",
[junit4:junit4]   2> 	  "collection":"collection1",
[junit4:junit4]   2> 	  "node_name":"127.0.0.1:51288_i",
[junit4:junit4]   2> 	  "base_url":"http://127.0.0.1:51288/i"}
[junit4:junit4]   2> 17381 T1865 oasc.Overseer$ClusterStateUpdater.updateState Update state numShards=2 message={
[junit4:junit4]   2> 	  "operation":"state",
[junit4:junit4]   2> 	  "numShards":"2",
[junit4:junit4]   2> 	  "shard":"shard1",
[junit4:junit4]   2> 	  "roles":null,
[junit4:junit4]   2> 	  "state":"active",
[junit4:junit4]   2> 	  "core":"collection1",
[junit4:junit4]   2> 	  "collection":"collection1",
[junit4:junit4]   2> 	  "node_name":"127.0.0.1:51284_i",
[junit4:junit4]   2> 	  "base_url":"http://127.0.0.1:51284/i"}
[junit4:junit4]   2> 17386 T1842 oascc.ZkStateReader.updateClusterState Updating cloud state from ZooKeeper... 
[junit4:junit4]   2> 17389 T1913 oascc.ZkStateReader$2.process A cluster state change: WatchedEvent state:SyncConnected type:NodeDataChanged path:/clusterstate.json, has occurred - updating... (live nodes size: 5)
[junit4:junit4]   2> 17389 T1929 oascc.ZkStateReader$2.process A cluster state change: WatchedEvent state:SyncConnected type:NodeDataChanged path:/clusterstate.json, has occurred - updating... (live nodes size: 5)
[junit4:junit4]   2> 17389 T1870 oascc.ZkStateReader$2.process A cluster state change: WatchedEvent state:SyncConnected type:NodeDataChanged path:/clusterstate.json, has occurred - updating... (live nodes size: 5)
[junit4:junit4]   2> 17389 T1898 oascc.ZkStateReader$2.process A cluster state change: WatchedEvent state:SyncConnected type:NodeDataChanged path:/clusterstate.json, has occurred - updating... (live nodes size: 5)
[junit4:junit4]   2> 17389 T1864 oascc.ZkStateReader$2.process A cluster state change: WatchedEvent state:SyncConnected type:NodeDataChanged path:/clusterstate.json, has occurred - updating... (live nodes size: 5)
[junit4:junit4]   2> 17389 T1883 oascc.ZkStateReader$2.process A cluster state change: WatchedEvent state:SyncConnected type:NodeDataChanged path:/clusterstate.json, has occurred - updating... (live nodes size: 5)
[junit4:junit4]   2> 18394 T1842 oascc.ZkStateReader.updateClusterState Updating cloud state from ZooKeeper... 
[junit4:junit4]   2> 19399 T1842 oascc.ZkStateReader.updateClusterState Updating cloud state from ZooKeeper... 
[junit4:junit4]   2>  C118_STATE=coll:collection1 core:collection1 props:{shard=shard2, roles=null, state=recovering, core=collection1, collection=collection1, node_name=127.0.0.1:51288_i, base_url=http://127.0.0.1:51288/i}
[junit4:junit4]   2> 20382 T1932 C118 P51288 oasc.RecoveryStrategy.doRecovery Attempting to PeerSync from http://127.0.0.1:51281/i/collection1/ core=collection1 - recoveringAfterStartup=true
[junit4:junit4]   2> 20383 T1932 C118 P51288 oasu.PeerSync.sync PeerSync: core=collection1 url=http://127.0.0.1:51288/i START replicas=[http://127.0.0.1:51281/i/collection1/] nUpdates=100
[junit4:junit4]   2> 20383 T1932 C118 P51288 oasu.PeerSync.sync WARNING no frame of reference to tell of we've missed updates
[junit4:junit4]   2> 20384 T1932 C118 P51288 oasc.RecoveryStrategy.doRecovery PeerSync Recovery was not successful - trying replication. core=collection1
[junit4:junit4]   2> 20384 T1932 C118 P51288 oasc.RecoveryStrategy.doRecovery Starting Replication Recovery. core=collection1
[junit4:junit4]   2> 20384 T1932 C118 P51288 oasc.RecoveryStrategy.doRecovery Begin buffering updates. core=collection1
[junit4:junit4]   2> 20384 T1932 C118 P51288 oasu.UpdateLog.bufferUpdates Starting to buffer updates. FSUpdateLog{state=ACTIVE, tlog=null}
[junit4:junit4]   2> 20385 T1932 C118 P51288 oasc.RecoveryStrategy.replicate Attempting to replicate from http://127.0.0.1:51281/i/collection1/. core=collection1
[junit4:junit4]   2> 20385 T1932 C118 P51288 oascsi.HttpClientUtil.createClient Creating new http client, config:maxConnections=128&maxConnectionsPerHost=32&followRedirects=false
[junit4:junit4]   2> ASYNC  NEW_CORE C120 name=collection1 org.apache.solr.core.SolrCore@71cd3bef url=http://127.0.0.1:51281/i/collection1 node=127.0.0.1:51281_i C120_STATE=coll:collection1 core:collection1 props:{shard=shard2, roles=null, state=active, core=collection1, collection=collection1, node_name=127.0.0.1:51281_i, base_url=http://127.0.0.1:51281/i, leader=true}
[junit4:junit4]   2> 20398 T1893 C120 P51281 REQ /get {getVersions=100&distrib=false&wt=javabin&qt=/get&version=2} status=0 QTime=1 
[junit4:junit4]   2> 20400 T1894 C120 P51281 oasu.DirectUpdateHandler2.commit start commit{,optimize=false,openSearcher=false,waitSearcher=true,expungeDeletes=false,softCommit=false}
[junit4:junit4]   2> 20402 T1894 C120 P51281 oasc.CachingDirectoryFactory.close Releasing directory:/Users/jenkins/jenkins-slave/workspace/Lucene-Solr-4.x-MacOSX/solr/build/solr-core/test/J0/./org.apache.solr.cloud.BasicDistributedZkTest-1359747998897/jetty2
[junit4:junit4]   2> 20403 T1842 oascc.ZkStateReader.updateClusterState Updating cloud state from ZooKeeper... 
[junit4:junit4]   2> 20407 T1894 C120 P51281 oasc.SolrDeletionPolicy.onInit SolrDeletionPolicy.onInit: commits:num=1
[junit4:junit4]   2> 		commit{dir=RateLimitedDirectoryWrapper(NRTCachingDirectory(org.apache.lucene.store.NIOFSDirectory@/Users/jenkins/jenkins-slave/workspace/Lucene-Solr-4.x-MacOSX/solr/build/solr-core/test/J0/org.apache.solr.cloud.BasicDistributedZkTest-1359747998897/jetty2/index lockFactory=org.apache.lucene.store.NativeFSLockFactory@276eb37b; maxCacheMB=48.0 maxMergeSizeMB=4.0)),segFN=segments_1,generation=1,filenames=[segments_1]
[junit4:junit4]   2> 20409 T1894 C120 P51281 oasc.SolrDeletionPolicy.updateCommits newest commit = 1[segments_1]
[junit4:junit4]   2> 20412 T1894 C120 P51281 oasc.SolrDeletionPolicy.onCommit SolrDeletionPolicy.onCommit: commits:num=2
[junit4:junit4]   2> 		commit{dir=RateLimitedDirectoryWrapper(NRTCachingDirectory(org.apache.lucene.store.NIOFSDirectory@/Users/jenkins/jenkins-slave/workspace/Lucene-Solr-4.x-MacOSX/solr/build/solr-core/test/J0/org.apache.solr.cloud.BasicDistributedZkTest-1359747998897/jetty2/index lockFactory=org.apache.lucene.store.NativeFSLockFactory@276eb37b; maxCacheMB=48.0 maxMergeSizeMB=4.0)),segFN=segments_1,generation=1,filenames=[segments_1]
[junit4:junit4]   2> 		commit{dir=RateLimitedDirectoryWrapper(NRTCachingDirectory(org.apache.lucene.store.NIOFSDirectory@/Users/jenkins/jenkins-slave/workspace/Lucene-Solr-4.x-MacOSX/solr/build/solr-core/test/J0/org.apache.solr.cloud.BasicDistributedZkTest-1359747998897/jetty2/index lockFactory=org.apache.lucene.store.NativeFSLockFactory@276eb37b; maxCacheMB=48.0 maxMergeSizeMB=4.0)),segFN=segments_2,generation=2,filenames=[segments_2]
[junit4:junit4]   2> 20413 T1894 C120 P51281 oasc.SolrDeletionPolicy.updateCommits newest commit = 2[segments_2]
[junit4:junit4]   2> 20414 T1894 C120 P51281 oasc.CachingDirectoryFactory.close Releasing directory:/Users/jenkins/jenkins-slave/workspace/Lucene-Solr-4.x-MacOSX/solr/build/solr-core/test/J0/./org.apache.solr.cloud.BasicDistributedZkTest-1359747998897/jetty2
[junit4:junit4]   2> 20415 T1894 C120 P51281 oass.SolrIndexSearcher.<init> Opening Searcher@2af6c2b8 realtime
[junit4:junit4]   2> 20415 T1894 C120 P51281 oasu.DirectUpdateHandler2.commit end_commit_flush
[junit4:junit4]   2> 20415 T1894 C120 P51281 /update {waitSearcher=true&openSearcher=false&commit=true&wt=javabin&commit_end_point=true&version=2&softCommit=false} {commit=} 0 15
[junit4:junit4]   2> 20417 T1932 C118 P51288 oash.ReplicationHandler.inform Commits will be reserved for  10000
[junit4:junit4]   2> 20417 T1932 C118 P51288 oash.SnapPuller.<init>  No value set for 'pollInterval'. Timer Task not started.
[junit4:junit4]   2> 20421 T1890 C120 P51281 oash.ReplicationHandler.inform Commits will be reserved for  10000
[junit4:junit4]   2> 20421 T1890 C120 P51281 REQ /replication {command=indexversion&qt=/replication&wt=javabin&version=2} status=0 QTime=1 
[junit4:junit4]   2> 20423 T1932 C118 P51288 oash.SnapPuller.fetchLatestIndex Master's generation: 2
[junit4:junit4]   2> 20423 T1932 C118 P51288 oash.SnapPuller.fetchLatestIndex Slave's generation: 1
[junit4:junit4]   2> 20423 T1932 C118 P51288 oash.SnapPuller.fetchLatestIndex Starting replication process
[junit4:junit4]   2> 20430 T1891 C120 P51281 oasc.CachingDirectoryFactory.close Releasing directory:/Users/jenkins/jenkins-slave/workspace/Lucene-Solr-4.x-MacOSX/solr/build/solr-core/test/J0/./org.apache.solr.cloud.BasicDistributedZkTest-1359747998897/jetty2
[junit4:junit4]   2> 20430 T1891 C120 P51281 oasc.CachingDirectoryFactory.close Releasing directory:/Users/jenkins/jenkins-slave/workspace/Lucene-Solr-4.x-MacOSX/solr/build/solr-core/test/J0/./org.apache.solr.cloud.BasicDistributedZkTest-1359747998897/jetty2/index
[junit4:junit4]   2> 20430 T1891 C120 P51281 REQ /replication {command=filelist&qt=/replication&wt=javabin&generation=2&version=2} status=0 QTime=1 
[junit4:junit4]   2> 20431 T1932 C118 P51288 oash.SnapPuller.fetchLatestIndex Number of files in latest index in master: 1
[junit4:junit4]   2> 20433 T1932 C118 P51288 oasc.CachingDirectoryFactory.get return new directory for /Users/jenkins/jenkins-slave/workspace/Lucene-Solr-4.x-MacOSX/solr/build/solr-core/test/J0/./org.apache.solr.cloud.BasicDistributedZkTest-1359747998897/jetty4/index.20130201144659322 forceNew:false
[junit4:junit4]   2> 20434 T1932 C118 P51288 oasc.CachingDirectoryFactory.close Releasing directory:/Users/jenkins/jenkins-slave/workspace/Lucene-Solr-4.x-MacOSX/solr/build/solr-core/test/J0/./org.apache.solr.cloud.BasicDistributedZkTest-1359747998897/jetty4
[junit4:junit4]   2> 20435 T1932 C118 P51288 oash.SnapPuller.fetchLatestIndex Starting download to RateLimitedDirectoryWrapper(NRTCachingDirectory(org.apache.lucene.store.NIOFSDirectory@/Users/jenkins/jenkins-slave/workspace/Lucene-Solr-4.x-MacOSX/solr/build/solr-core/test/J0/org.apache.solr.cloud.BasicDistributedZkTest-1359747998897/jetty4/index.20130201144659322 lockFactory=org.apache.lucene.store.NativeFSLockFactory@a6ae96c; maxCacheMB=48.0 maxMergeSizeMB=4.0)) fullCopy=true
[junit4:junit4]   2> 20438 T1893 C120 P51281 REQ /replication {file=segments_2&command=filecontent&checksum=true&wt=filestream&qt=/replication&generation=2} status=0 QTime=0 
[junit4:junit4]   2> 20441 T1932 C118 P51288 oasc.CachingDirectoryFactory.close Releasing directory:/Users/jenkins/jenkins-slave/workspace/Lucene-Solr-4.x-MacOSX/solr/build/solr-core/test/J0/./org.apache.solr.cloud.BasicDistributedZkTest-1359747998897/jetty4/index
[junit4:junit4]   2> 20441 T1932 C118 P51288 oash.SnapPuller.fetchLatestIndex Total time taken for download : 0 secs
[junit4:junit4]   2> 20442 T1932 C118 P51288 oash.SnapPuller.modifyIndexProps New index installed. Updating index properties... index=index.20130201144659322
[junit4:junit4]   2> 20443 T1932 C118 P51288 oasc.CachingDirectoryFactory.close Releasing directory:/Users/jenkins/jenkins-slave/workspace/Lucene-Solr-4.x-MacOSX/solr/build/solr-core/test/J0/./org.apache.solr.cloud.BasicDistributedZkTest-1359747998897/jetty4
[junit4:junit4]   2> 20444 T1932 C118 P51288 oasc.CachingDirectoryFactory.close Releasing directory:/Users/jenkins/jenkins-slave/workspace/Lucene-Solr-4.x-MacOSX/solr/build/solr-core/test/J0/./org.apache.solr.cloud.BasicDistributedZkTest-1359747998897/jetty4
[junit4:junit4]   2> 20444 T1932 C118 P51288 oasc.SolrCore.getNewIndexDir New index directory detected: old=./org.apache.solr.cloud.BasicDistributedZkTest-1359747998897/jetty4/index/ new=./org.apache.solr.cloud.BasicDistributedZkTest-1359747998897/jetty4/index.20130201144659322
[junit4:junit4]   2> 20446 T1932 C118 P51288 oasc.SolrDeletionPolicy.onInit SolrDeletionPolicy.onInit: commits:num=1
[junit4:junit4]   2> 		commit{dir=RateLimitedDirectoryWrapper(NRTCachingDirectory(org.apache.lucene.store.NIOFSDirectory@/Users/jenkins/jenkins-slave/workspace/Lucene-Solr-4.x-MacOSX/solr/build/solr-core/test/J0/org.apache.solr.cloud.BasicDistributedZkTest-1359747998897/jetty4/index.20130201144659322 lockFactory=org.apache.lucene.store.NativeFSLockFactory@a6ae96c; maxCacheMB=48.0 maxMergeSizeMB=4.0)),segFN=segments_2,generation=2,filenames=[segments_2]
[junit4:junit4]   2> 20447 T1932 C118 P51288 oasc.SolrDeletionPolicy.updateCommits newest commit = 2[segments_2]
[junit4:junit4]   2> 20449 T1932 C118 P51288 oasc.CachingDirectoryFactory.close Releasing directory:/Users/jenkins/jenkins-slave/workspace/Lucene-Solr-4.x-MacOSX/solr/build/solr-core/test/J0/./org.apache.solr.cloud.BasicDistributedZkTest-1359747998897/jetty4
[junit4:junit4]   2> 20449 T1932 C118 P51288 oasu.DefaultSolrCoreState.newIndexWriter Creating new IndexWriter...
[junit4:junit4]   2> 20449 T1932 C118 P51288 oasu.DefaultSolrCoreState.newIndexWriter Waiting until IndexWriter is unused... core=collection1
[junit4:junit4]   2> 20450 T1932 C118 P51288 oasu.DefaultSolrCoreState.newIndexWriter Rollback old IndexWriter... core=collection1
[junit4:junit4]   2> 20451 T1932 C118 P51288 oasc.CachingDirectoryFactory.close Releasing directory:/Users/jenkins/jenkins-slave/workspace/Lucene-Solr-4.x-MacOSX/solr/build/solr-core/test/J0/./org.apache.solr.cloud.BasicDistributedZkTest-1359747998897/jetty4/index.20130201144659322
[junit4:junit4]   2> 20451 T1932 C118 P51288 oasc.CachingDirectoryFactory.close Releasing directory:/Users/jenkins/jenkins-slave/workspace/Lucene-Solr-4.x-MacOSX/solr/build/solr-core/test/J0/./org.apache.solr.cloud.BasicDistributedZkTest-1359747998897/jetty4
[junit4:junit4]   2> 20454 T1932 C118 P51288 oasc.SolrDeletionPolicy.onInit SolrDeletionPolicy.onInit: commits:num=1
[junit4:junit4]   2> 		commit{dir=RateLimitedDirectoryWrapper(NRTCachingDirectory(org.apache.lucene.store.NIOFSDirectory@/Users/jenkins/jenkins-slave/workspace/Lucene-Solr-4.x-MacOSX/solr/build/solr-core/test/J0/org.apache.solr.cloud.BasicDistributedZkTest-1359747998897/jetty4/index.20130201144659322 lockFactory=org.apache.lucene.store.NativeFSLockFactory@a6ae96c; maxCacheMB=48.0 maxMergeSizeMB=4.0)),segFN=segments_2,generation=2,filenames=[segments_2]
[junit4:junit4]   2> 20455 T1932 C118 P51288 oasc.SolrDeletionPolicy.updateCommits newest commit = 2[segments_2]
[junit4:junit4]   2> 20455 T1932 C118 P51288 oasu.DefaultSolrCoreState.newIndexWriter New IndexWriter is ready to be used.
[junit4:junit4]   2> 20456 T1932 C118 P51288 oasc.CachingDirectoryFactory.close Releasing directory:/Users/jenkins/jenkins-slave/workspace/Lucene-Solr-4.x-MacOSX/solr/build/solr-core/test/J0/./org.apache.solr.cloud.BasicDistributedZkTest-1359747998897/jetty4
[junit4:junit4]   2> 20456 T1932 C118 P51288 oass.SolrIndexSearcher.<init> Opening Searcher@1a5f94b6 main
[junit4:junit4]   2> 20459 T1931 oasc.SolrCore.registerSearcher [collection1] Registered new searcher Searcher@1a5f94b6 main{StandardDirectoryReader(segments_2:1:nrt)}
[junit4:junit4]   2> 20459 T1931 oasc.CachingDirectoryFactory.close Releasing directory:/Users/jenkins/jenkins-slave/workspace/Lucene-Solr-4.x-MacOSX/solr/build/solr-core/test/J0/./org.apache.solr.cloud.BasicDistributedZkTest-1359747998897/jetty4/index
[junit4:junit4]   2> 20460 T1932 C118 P51288 oasu.DirectUpdateHandler2.commit start commit{,optimize=false,openSearcher=false,waitSearcher=false,expungeDeletes=false,softCommit=false}
[junit4:junit4]   2> 20463 T1932 C118 P51288 oasc.SolrDeletionPolicy.onCommit SolrDeletionPolicy.onCommit: commits:num=2
[junit4:junit4]   2> 		commit{dir=RateLimitedDirectoryWrapper(NRTCachingDirectory(org.apache.lucene.store.NIOFSDirectory@/Users/jenkins/jenkins-slave/workspace/Lucene-Solr-4.x-MacOSX/solr/build/solr-core/test/J0/org.apache.solr.cloud.BasicDistributedZkTest-1359747998897/jetty4/index.20130201144659322 lockFactory=org.apache.lucene.store.NativeFSLockFactory@a6ae96c; maxCacheMB=48.0 maxMergeSizeMB=4.0)),segFN=segments_2,generation=2,filenames=[segments_2]
[junit4:junit4]   2> 		commit{dir=RateLimitedDirectoryWrapper(NRTCachingDirectory(org.apache.lucene.store.NIOFSDirectory@/Users/jenkins/jenkins-slave/workspace/Lucene-Solr-4.x-MacOSX/solr/build/solr-core/test/J0/org.apache.solr.cloud.BasicDistributedZkTest-1359747998897/jetty4/index.20130201144659322 lockFactory=org.apache.lucene.store.NativeFSLockFactory@a6ae96c; maxCacheMB=48.0 maxMergeSizeMB=4.0)),segFN=segments_3,generation=3,filenames=[segments_3]
[junit4:junit4]   2> 20463 T1932 C118 P51288 oasc.SolrDeletionPolicy.updateCommits newest commit = 3[segments_3]
[junit4:junit4]   2> 20464 T1932 C118 P51288 oasc.CachingDirectoryFactory.close Releasing directory:/Users/jenkins/jenkins-slave/workspace/Lucene-Solr-4.x-MacOSX/solr/build/solr-core/test/J0/./org.apache.solr.cloud.BasicDistributedZkTest-1359747998897/jetty4
[junit4:junit4]   2> 20464 T1932 C118 P51288 oasu.DirectUpdateHandler2.commit end_commit_flush
[junit4:junit4]   2> 20465 T1932 C118 P51288 oasc.CachingDirectoryFactory.close Releasing directory:/Users/jenkins/jenkins-slave/workspace/Lucene-Solr-4.x-MacOSX/solr/build/solr-core/test/J0/./org.apache.solr.cloud.BasicDistributedZkTest-1359747998897/jetty4/index.20130201144659322
[junit4:junit4]   2> 20465 T1932 C118 P51288 oasc.CachingDirectoryFactory.close Releasing directory:/Users/jenkins/jenkins-slave/workspace/Lucene-Solr-4.x-MacOSX/solr/build/solr-core/test/J0/./org.apache.solr.cloud.BasicDistributedZkTest-1359747998897/jetty4/index
[junit4:junit4]   2> 20465 T1932 C118 P51288 oasc.RecoveryStrategy.replay No replay needed. core=collection1
[junit4:junit4]   2> 20466 T1932 C118 P51288 oasc.RecoveryStrategy.doRecovery Replication Recovery was successful - registering as Active. core=collection1
[junit4:junit4]   2> 20466 T1932 C118 P51288 oasc.ZkController.publish publishing core=collection1 state=active
[junit4:junit4]   2> 20466 T1932 C118 P51288 oasc.ZkController.publish numShards not found on descriptor - reading it from system property
[junit4:junit4]   2> 20469 T1932 C118 P51288 oasc.RecoveryStrategy.doRecovery Finished recovery process. core=collection1
[junit4:junit4]   2> 21407 T1842 oascc.ZkStateReader.updateClusterState Updating cloud state from ZooKeeper... 
[junit4:junit4]   2> 21915 T1865 oascc.ZkStateReader.updateClusterState Updating cloud state from ZooKeeper... 
[junit4:junit4]   2> 21916 T1865 oasc.Overseer$ClusterStateUpdater.updateState Update state numShards=2 message={
[junit4:junit4]   2> 	  "operation":"state",
[junit4:junit4]   2> 	  "numShards":"2",
[junit4:junit4]   2> 	  "shard":"shard2",
[junit4:junit4]   2> 	  "roles":null,
[junit4:junit4]   2> 	  "state":"active",
[junit4:junit4]   2> 	  "core":"collection1",
[junit4:junit4]   2> 	  "collection":"collection1",
[junit4:junit4]   2> 	  "node_name":"127.0.0.1:51288_i",
[junit4:junit4]   2> 	  "base_url":"http://127.0.0.1:51288/i"}
[junit4:junit4]   2> 21924 T1864 oascc.ZkStateReader$2.process A cluster state change: WatchedEvent state:SyncConnected type:NodeDataChanged path:/clusterstate.json, has occurred - updating... (live nodes size: 5)
[junit4:junit4]   2> 21924 T1883 oascc.ZkStateReader$2.process A cluster state change: WatchedEvent state:SyncConnected type:NodeDataChanged path:/clusterstate.json, has occurred - updating... (live nodes size: 5)
[junit4:junit4]   2> 21925 T1870 oascc.ZkStateReader$2.process A cluster state change: WatchedEvent state:SyncConnected type:NodeDataChanged path:/clusterstate.json, has occurred - updating... (live nodes size: 5)
[junit4:junit4]   2> 21924 T1929 oascc.ZkStateReader$2.process A cluster state change: WatchedEvent state:SyncConnected type:NodeDataChanged path:/clusterstate.json, has occurred - updating... (live nodes size: 5)
[junit4:junit4]   2> 21925 T1913 oascc.ZkStateReader$2.process A cluster state change: WatchedEvent state:SyncConnected type:NodeDataChanged path:/clusterstate.json, has occurred - updating... (live nodes size: 5)
[junit4:junit4]   2> 21925 T1898 oascc.ZkStateReader$2.process A cluster state change: WatchedEvent state:SyncConnected type:NodeDataChanged path:/clusterstate.json, has occurred - updating... (live nodes size: 5)
[junit4:junit4]   2> 22410 T1842 oascc.ZkStateReader.updateClusterState Updating cloud state from ZooKeeper... 
[junit4:junit4]   2> 22412 T1842 oasc.AbstractDistribZkTestBase.waitForRecoveriesToFinish Recoveries finished - collection: collection1
[junit4:junit4]   2> ASYNC  NEW_CORE C121 name=collection1 org.apache.solr.core.SolrCore@207e5de3 url=http://127.0.0.1:51274/i/collection1 node=127.0.0.1:51274_i C121_STATE=coll:control_collection core:collection1 props:{shard=shard1, roles=null, state=active, core=collection1, collection=control_collection, node_name=127.0.0.1:51274_i, base_url=http://127.0.0.1:51274/i, leader=true}
[junit4:junit4]   2> 22423 T1859 C121 P51274 oasc.CachingDirectoryFactory.close Releasing directory:/Users/jenkins/jenkins-slave/workspace/Lucene-Solr-4.x-MacOSX/solr/build/solr-core/test/J0/./org.apache.solr.cloud.BasicDistributedZkTest-1359747998897/control/data
[junit4:junit4]   2> 22427 T1859 C121 P51274 oasc.SolrDeletionPolicy.onInit SolrDeletionPolicy.onInit: commits:num=1
[junit4:junit4]   2> 		commit{dir=RateLimitedDirectoryWrapper(NRTCachingDirectory(org.apache.lucene.store.NIOFSDirectory@/Users/jenkins/jenkins-slave/workspace/Lucene-Solr-4.x-MacOSX/solr/build/solr-core/test/J0/org.apache.solr.cloud.BasicDistributedZkTest-1359747998897/control/data/index lockFactory=org.apache.lucene.store.NativeFSLockFactory@2ba97721; maxCacheMB=48.0 maxMergeSizeMB=4.0)),segFN=segments_1,generation=1,filenames=[segments_1]
[junit4:junit4]   2> 22428 T1859 C121 P51274 oasc.SolrDeletionPolicy.updateCommits newest commit = 1[segments_1]
[junit4:junit4]   2> 22430 T1859 C121 P51274 oasc.CachingDirectoryFactory.close Releasing directory:/Users/jenkins/jenkins-slave/workspace/Lucene-Solr-4.x-MacOSX/solr/build/solr-core/test/J0/./org.apache.solr.cloud.BasicDistributedZkTest-1359747998897/control/data
[junit4:junit4]   2> 22430 T1859 C121 P51274 oass.SolrIndexSearcher.<init> Opening Searcher@2a71ea22 realtime
[junit4:junit4]   2> 22431 T1859 C121 P51274 /update {wt=javabin&version=2} {deleteByQuery=*:* (-1425799141195251712)} 0 10
[junit4:junit4]   2> 22437 T1891 C120 P51281 oasc.CachingDirectoryFactory.close Releasing directory:/Users/jenkins/jenkins-slave/workspace/Lucene-Solr-4.x-MacOSX/solr/build/solr-core/test/J0/./org.apache.solr.cloud.BasicDistributedZkTest-1359747998897/jetty2
[junit4:junit4]   2> 22444 T1879 C119 P51278 oasc.CachingDirectoryFactory.close Releasing directory:/Users/jenkins/jenkins-slave/workspace/Lucene-Solr-4.x-MacOSX/solr/build/solr-core/test/J0/./org.apache.solr.cloud.BasicDistributedZkTest-1359747998897/jetty1
[junit4:junit4]   2>  C118_STATE=coll:collection1 core:collection1 props:{shard=shard2, roles=null, state=active, core=collection1, collection=collection1, node_name=127.0.0.1:51288_i, base_url=http://127.0.0.1:51288/i}
[junit4:junit4]   2> 22454 T1922 C118 P51288 oasc.CachingDirectoryFactory.close Releasing directory:/Users/jenkins/jenkins-slave/workspace/Lucene-Solr-4.x-MacOSX/solr/build/solr-core/test/J0/./org.apache.solr.cloud.BasicDistributedZkTest-1359747998897/jetty4
[junit4:junit4]   2> 22455 T1922 C118 P51288 /update {update.distrib=FROMLEADER&_version_=-1425799141207834624&update.from=http://127.0.0.1:51281/i/collection1/&wt=javabin&version=2} {deleteByQuery=*:* (-1425799141207834624)} 0 4
[junit4:junit4]   2>  C117_STATE=coll:collection1 core:collection1 props:{shard=shard1, roles=null, state=active, core=collection1, collection=collection1, node_name=127.0.0.1:51284_i, base_url=http://127.0.0.1:51284/i}
[junit4:junit4]   2> 22459 T1905 C117 P51284 oasc.CachingDirectoryFactory.close Releasing directory:/Users/jenkins/jenkins-slave/workspace/Lucene-Solr-4.x-MacOSX/solr/build/solr-core/test/J0/./org.apache.solr.cloud.BasicDistributedZkTest-1359747998897/jetty3
[junit4:junit4]   2> 22461 T1905 C117 P51284 /update {update.distrib=FROMLEADER&_version_=-1425799141216223232&update.from=http://127.0.0.1:51278/i/collection1/&wt=javabin&version=2} {deleteByQuery=*:* (-1425799141216223232)} 0 4
[junit4:junit4]   2> 22462 T1879 C119 P51278 /update {update.distrib=TOLEADER&wt=javabin&version=2} {deleteByQuery=*:* (-1425799141216223232)} 0 20
[junit4:junit4]   2> 22464 T1891 C120 P51281 /update {wt=javabin&version=2} {deleteByQuery=*:* (-1425799141207834624)} 0 30
[junit4:junit4]   2> 22473 T1860 C121 P51274 /update {wt=javabin&version=2} {add=[1 (1425799141243486208)]} 0 5
[junit4:junit4]   2> 22492 T1906 C117 P51284 /update {distrib.from=http://127.0.0.1:51278/i/collection1/&update.distrib=FROMLEADER&wt=javabin&version=2} {add=[1 (1425799141258166272)]} 0 4
[junit4:junit4]   2> 22493 T1876 C119 P51278 /update {distrib.from=http://127.0.0.1:51281/i/collection1/&update.distrib=TOLEADER&wt=javabin&version=2} {add=[1 (1425799141258166272)]} 0 11
[junit4:junit4]   2> 22494 T1892 C120 P51281 /update {wt=javabin&version=2} {add=[1]} 0 18
[junit4:junit4]   2> 22500 T1855 C121 P51274 /update {wt=javabin&version=2} {add=[2 (1425799141275992064)]} 0 2
[junit4:junit4]   2> 22515 T1923 C118 P51288 /update {distrib.from=http://127.0.0.1:51281/i/collection1/&update.distrib=FROMLEADER&wt=javabin&version=2} {add=[2 (1425799141282283520)]} 0 3
[junit4:junit4]   2> 22517 T1894 C120 P51281 /update {wt=javabin&version=2} {add=[2 (1425799141282283520)]} 0 12
[junit4:junit4]   2> 22526 T1857 C121 P51274 /update {wt=javabin&version=2} {add=[3 (1425799141302206464)]} 0 2
[junit4:junit4]   2> 22544 T1925 C118 P51288 /update {distrib.from=http://127.0.0.1:51281/i/collection1/&update.distrib=FROMLEADER&wt=javabin&version=2} {add=[3 (1425799141310595072)]} 0 2
[junit4:junit4]   2> 22545 T1889 C120 P51281 /update {distrib.from=http://127.0.0.1:51278/i/collection1/&update.distrib=TOLEADER&wt=javabin&version=2} {add=[3 (1425799141310595072)]} 0 13
[junit4:junit4]   2> 22546 T1874 C119 P51278 

[...truncated too long message...]

.RandomizedRunner$7.evaluate(RandomizedRunner.java:773)
[junit4:junit4]    > 	at com.carrotsearch.randomizedtesting.RandomizedRunner$8.evaluate(RandomizedRunner.java:787)
[junit4:junit4]    > 	at com.carrotsearch.randomizedtesting.rules.SystemPropertiesRestoreRule$1.evaluate(SystemPropertiesRestoreRule.java:53)
[junit4:junit4]    > 	at org.apache.lucene.util.TestRuleSetupTeardownChained$1.evaluate(TestRuleSetupTeardownChained.java:50)
[junit4:junit4]    > 	at org.apache.lucene.util.TestRuleFieldCacheSanity$1.evaluate(TestRuleFieldCacheSanity.java:51)
[junit4:junit4]    > 	at org.apache.lucene.util.AbstractBeforeAfterRule$1.evaluate(AbstractBeforeAfterRule.java:46)
[junit4:junit4]    > 	at com.carrotsearch.randomizedtesting.rules.SystemPropertiesInvariantRule$1.evaluate(SystemPropertiesInvariantRule.java:55)
[junit4:junit4]    > 	at org.apache.lucene.util.TestRuleThreadAndTestName$1.evaluate(TestRuleThreadAndTestName.java:49)
[junit4:junit4]    > 	at org.apache.lucene.util.TestRuleIgnoreAfterMaxFailures$1.evaluate(TestRuleIgnoreAfterMaxFailures.java:70)
[junit4:junit4]    > 	at org.apache.lucene.util.TestRuleMarkFailure$1.evaluate(TestRuleMarkFailure.java:48)
[junit4:junit4]    > 	at com.carrotsearch.randomizedtesting.rules.StatementAdapter.evaluate(StatementAdapter.java:36)
[junit4:junit4]    > 	at com.carrotsearch.randomizedtesting.ThreadLeakControl$StatementRunner.run(ThreadLeakControl.java:358)
[junit4:junit4]    > 	at com.carrotsearch.randomizedtesting.ThreadLeakControl.forkTimeoutingTask(ThreadLeakControl.java:782)
[junit4:junit4]    > 	at com.carrotsearch.randomizedtesting.ThreadLeakControl$3.evaluate(ThreadLeakControl.java:442)
[junit4:junit4]    > 	at com.carrotsearch.randomizedtesting.RandomizedRunner.runSingleTest(RandomizedRunner.java:746)
[junit4:junit4]    > 	at com.carrotsearch.randomizedtesting.RandomizedRunner$3.evaluate(RandomizedRunner.java:648)
[junit4:junit4]    > 	at com.carrotsearch.randomizedtesting.RandomizedRunner$4.evaluate(RandomizedRunner.java:682)
[junit4:junit4]    > 	at com.carrotsearch.randomizedtesting.RandomizedRunner$5.evaluate(RandomizedRunner.java:693)
[junit4:junit4]    > 	at com.carrotsearch.randomizedtesting.rules.StatementAdapter.evaluate(StatementAdapter.java:36)
[junit4:junit4]    > 	at com.carrotsearch.randomizedtesting.rules.SystemPropertiesRestoreRule$1.evaluate(SystemPropertiesRestoreRule.java:53)
[junit4:junit4]    > 	at org.apache.lucene.util.AbstractBeforeAfterRule$1.evaluate(AbstractBeforeAfterRule.java:46)
[junit4:junit4]    > 	at org.apache.lucene.util.TestRuleStoreClassName$1.evaluate(TestRuleStoreClassName.java:42)
[junit4:junit4]    > 	at com.carrotsearch.randomizedtesting.rules.SystemPropertiesInvariantRule$1.evaluate(SystemPropertiesInvariantRule.java:55)
[junit4:junit4]    > 	at com.carrotsearch.randomizedtesting.rules.NoShadowingOrOverridesOnMethodsRule$1.evaluate(NoShadowingOrOverridesOnMethodsRule.java:39)
[junit4:junit4]    > 	at com.carrotsearch.randomizedtesting.rules.NoShadowingOrOverridesOnMethodsRule$1.evaluate(NoShadowingOrOverridesOnMethodsRule.java:39)
[junit4:junit4]    > 	at com.carrotsearch.randomizedtesting.rules.StatementAdapter.evaluate(StatementAdapter.java:36)
[junit4:junit4]    > 	at org.apache.lucene.util.TestRuleAssertionsRequired$1.evaluate(TestRuleAssertionsRequired.java:43)
[junit4:junit4]    > 	at org.apache.lucene.util.TestRuleMarkFailure$1.evaluate(TestRuleMarkFailure.java:48)
[junit4:junit4]    > 	at org.apache.lucene.util.TestRuleIgnoreAfterMaxFailures$1.evaluate(TestRuleIgnoreAfterMaxFailures.java:70)
[junit4:junit4]    > 	at org.apache.lucene.util.TestRuleIgnoreTestSuites$1.evaluate(TestRuleIgnoreTestSuites.java:55)
[junit4:junit4]    > 	at com.carrotsearch.randomizedtesting.rules.StatementAdapter.evaluate(StatementAdapter.java:36)
[junit4:junit4]    > 	at com.carrotsearch.randomizedtesting.ThreadLeakControl$StatementRunner.run(ThreadLeakControl.java:358)
[junit4:junit4]    > 	at java.lang.Thread.run(Thread.java:722)
[junit4:junit4]   2> 393116 T1842 oas.SolrTestCaseJ4.deleteCore ###deleteCore
[junit4:junit4]   2> NOTE: test params are: codec=Lucene42: {n_f1=PostingsFormat(name=Lucene41WithOrds), foo_b=PostingsFormat(name=MockRandom), cat=PostingsFormat(name=Memory doPackFST= true), foo_d=PostingsFormat(name=MockSep), foo_f=PostingsFormat(name=MockRandom), n_tl1=PostingsFormat(name=Lucene41WithOrds), n_d1=PostingsFormat(name=Memory doPackFST= true), rnd_b=PostingsFormat(name=MockSep), intDefault=PostingsFormat(name=Memory doPackFST= true), n_td1=PostingsFormat(name=Lucene41WithOrds), timestamp=PostingsFormat(name=Memory doPackFST= true), id=PostingsFormat(name=MockSep), range_facet_sl=PostingsFormat(name=MockRandom), range_facet_si=PostingsFormat(name=Lucene41WithOrds), oddField_s=PostingsFormat(name=MockRandom), sequence_i=PostingsFormat(name=MockRandom), name=PostingsFormat(name=MockSep), foo_i=PostingsFormat(name=Lucene41WithOrds), regex_dup_B_s=PostingsFormat(name=Memory doPackFST= true), multiDefault=PostingsFormat(name=Lucene41WithOrds), n_tf1=PostingsFormat(name=Memory doPackFST= true), n_dt1=PostingsFormat(name=Lucene41WithOrds), genre_s=PostingsFormat(name=MockRandom), author_t=PostingsFormat(name=Lucene41WithOrds), n_ti1=PostingsFormat(name=MockSep), range_facet_l=PostingsFormat(name=Memory doPackFST= true), text=PostingsFormat(name=MockRandom), _version_=PostingsFormat(name=Memory doPackFST= true), val_i=PostingsFormat(name=MockSep), SubjectTerms_mfacet=PostingsFormat(name=Memory doPackFST= true), series_t=PostingsFormat(name=Lucene41WithOrds), a_t=PostingsFormat(name=Memory doPackFST= true), n_tdt1=PostingsFormat(name=Memory doPackFST= true), regex_dup_A_s=PostingsFormat(name=MockRandom), price=PostingsFormat(name=MockRandom), other_tl1=PostingsFormat(name=Memory doPackFST= true), n_l1=PostingsFormat(name=Memory doPackFST= true), a_si=PostingsFormat(name=Lucene41WithOrds), inStock=PostingsFormat(name=MockRandom)}, sim=DefaultSimilarity, locale=zh_HK, timezone=America/Detroit
[junit4:junit4]   2> NOTE: Mac OS X 10.8.2 x86_64/Oracle Corporation 1.7.0_10 (64-bit)/cpus=2,threads=1,free=309641248,total=536870912
[junit4:junit4]   2> NOTE: All tests run in this JVM: [TestDocSet, TestBM25SimilarityFactory, SpellingQueryConverterTest, TestLRUCache, TermVectorComponentTest, TestFastLRUCache, NotRequiredUniqueKeyTest, SolrRequestParserTest, IndexBasedSpellCheckerTest, TestLazyCores, TermsComponentTest, TestArbitraryIndexDir, QueryParsingTest, TestJoin, DateMathParserTest, DisMaxRequestHandlerTest, TestSolrDeletionPolicy1, LoggingHandlerTest, TestPhraseSuggestions, SimpleFacetsTest, TestPostingsSolrHighlighter, MoreLikeThisHandlerTest, ResponseLogComponentTest, RequestHandlersTest, OverseerTest, TestSolrCoreProperties, TestStressVersions, TestSuggestSpellingConverter, PluginInfoTest, TestLFUCache, TestMergePolicyConfig, TestXIncludeConfig, SchemaVersionSpecificBehaviorTest, TestFuzzyAnalyzedSuggestions, StandardRequestHandlerTest, MBeansHandlerTest, TestBinaryField, SolrCoreTest, TestBadConfig, FileUtilsTest, SearchHandlerTest, ExternalFileFieldSortTest, TestOmitPositions, IndexSchemaRuntimeFieldTest, BadIndexSchemaTest, DefaultValueUpdateProcessorTest, TestSolrDeletionPolicy2, TestCharFilters, TestDocumentBuilder, MinimalSchemaTest, LukeRequestHandlerTest, DebugComponentTest, TestPerFieldSimilarity, DirectUpdateHandlerTest, TestFaceting, IndexReaderFactoryTest, ClusterStateTest, TestCSVResponseWriter, URLClassifyProcessorTest, CoreContainerCoreInitFailuresTest, TestComponentsName, TestPseudoReturnFields, DistributedQueryElevationComponentTest, ZkControllerTest, DirectSolrSpellCheckerTest, BasicZkTest, TestWordDelimiterFilterFactory, PingRequestHandlerTest, TestDefaultSimilarityFactory, ChaosMonkeySafeLeaderTest, TestIndexSearcher, MultiTermTest, SynonymTokenizerTest, TestWriterPerf, StatsComponentTest, SyncSliceTest, SolrInfoMBeanTest, LeaderElectionTest, TestCSVLoader, SpellPossibilityIteratorTest, TestAtomicUpdateErrorCases, TestElisionMultitermQuery, TestCollationField, PeerSyncTest, QueryEqualityTest, TestRealTimeGet, TestCollationKeyRangeQueries, TestAnalyzedSuggestions, TestTrie, TestRangeQuery, TestQuerySenderNoQuery, TestDFRSimilarityFactory, JSONWriterTest, TestLuceneMatchVersion, TestSolr4Spatial, SuggesterTSTTest, CircularListTest, SortByFunctionTest, TestFastOutputStream, ZkNodePropsTest, TestDistributedGrouping, AutoCommitTest, SolrCmdDistributorTest, SolrPluginUtilsTest, BasicFunctionalityTest, TestRecovery, IndexSchemaTest, TestFiltering, PrimitiveFieldTypeTest, EchoParamsTest, TestHashPartitioner, TestUpdate, TestSearchPerf, TestFunctionQuery, PolyFieldTest, SoftAutoCommitTest, CopyFieldTest, TestExtendedDismaxParser, TestPHPSerializedResponseWriter, TestPluginEnable, BasicDistributedZkTest]
[junit4:junit4] Completed in 393.49s, 1 test, 1 failure <<< FAILURES!

[...truncated 384 lines...]
BUILD FAILED
/Users/jenkins/jenkins-slave/workspace/Lucene-Solr-4.x-MacOSX/build.xml:346: The following error occurred while executing this line:
/Users/jenkins/jenkins-slave/workspace/Lucene-Solr-4.x-MacOSX/build.xml:39: The following error occurred while executing this line:
/Users/jenkins/jenkins-slave/workspace/Lucene-Solr-4.x-MacOSX/solr/build.xml:178: The following error occurred while executing this line:
/Users/jenkins/jenkins-slave/workspace/Lucene-Solr-4.x-MacOSX/solr/common-build.xml:428: The following error occurred while executing this line:
/Users/jenkins/jenkins-slave/workspace/Lucene-Solr-4.x-MacOSX/lucene/common-build.xml:1176: The following error occurred while executing this line:
/Users/jenkins/jenkins-slave/workspace/Lucene-Solr-4.x-MacOSX/lucene/common-build.xml:841: There were test failures: 250 suites, 1041 tests, 1 failure, 14 ignored (3 assumptions)

Total time: 62 minutes 39 seconds
Build step 'Invoke Ant' marked build as failure
Archiving artifacts
Recording test results
Description set: Java: 64bit/jdk1.7.0 -XX:+UseG1GC
Email was triggered for: Failure
Sending email for trigger: Failure



Mime
View raw message