lucene-dev mailing list archives

Site index · List index
Message view « Date » · « Thread »
Top « Date » · « Thread »
From Policeman Jenkins Server <jenk...@thetaphi.de>
Subject [JENKINS] Lucene-Solr-trunk-Linux (64bit/jdk1.8.0-ea-b65) - Build # 4424 - Still Failing!
Date Fri, 22 Feb 2013 07:37:23 GMT
Build: http://jenkins.thetaphi.de/job/Lucene-Solr-trunk-Linux/4424/
Java: 64bit/jdk1.8.0-ea-b65 -XX:+UseConcMarkSweepGC

1 tests failed.
FAILED:  org.apache.solr.cloud.UnloadDistributedZkTest.testDistribSearch

Error Message:
Still found shard

Stack Trace:
java.lang.AssertionError: Still found shard
	at __randomizedtesting.SeedInfo.seed([C1A5B098B4F3912:8DFCD511FC10592E]:0)
	at org.junit.Assert.fail(Assert.java:93)
	at org.apache.solr.cloud.UnloadDistributedZkTest.testUnloadShardAndCollection(UnloadDistributedZkTest.java:120)
	at org.apache.solr.cloud.UnloadDistributedZkTest.doTest(UnloadDistributedZkTest.java:73)
	at org.apache.solr.BaseDistributedSearchTestCase.testDistribSearch(BaseDistributedSearchTestCase.java:794)
	at sun.reflect.NativeMethodAccessorImpl.invoke0(Native Method)
	at sun.reflect.NativeMethodAccessorImpl.invoke(NativeMethodAccessorImpl.java:57)
	at sun.reflect.DelegatingMethodAccessorImpl.invoke(DelegatingMethodAccessorImpl.java:43)
	at java.lang.reflect.Method.invoke(Method.java:474)
	at com.carrotsearch.randomizedtesting.RandomizedRunner.invoke(RandomizedRunner.java:1559)
	at com.carrotsearch.randomizedtesting.RandomizedRunner.access$600(RandomizedRunner.java:79)
	at com.carrotsearch.randomizedtesting.RandomizedRunner$6.evaluate(RandomizedRunner.java:737)
	at com.carrotsearch.randomizedtesting.RandomizedRunner$7.evaluate(RandomizedRunner.java:773)
	at com.carrotsearch.randomizedtesting.RandomizedRunner$8.evaluate(RandomizedRunner.java:787)
	at com.carrotsearch.randomizedtesting.rules.SystemPropertiesRestoreRule$1.evaluate(SystemPropertiesRestoreRule.java:53)
	at org.apache.lucene.util.TestRuleSetupTeardownChained$1.evaluate(TestRuleSetupTeardownChained.java:50)
	at org.apache.lucene.util.TestRuleFieldCacheSanity$1.evaluate(TestRuleFieldCacheSanity.java:51)
	at org.apache.lucene.util.AbstractBeforeAfterRule$1.evaluate(AbstractBeforeAfterRule.java:46)
	at com.carrotsearch.randomizedtesting.rules.SystemPropertiesInvariantRule$1.evaluate(SystemPropertiesInvariantRule.java:55)
	at org.apache.lucene.util.TestRuleThreadAndTestName$1.evaluate(TestRuleThreadAndTestName.java:49)
	at org.apache.lucene.util.TestRuleIgnoreAfterMaxFailures$1.evaluate(TestRuleIgnoreAfterMaxFailures.java:70)
	at org.apache.lucene.util.TestRuleMarkFailure$1.evaluate(TestRuleMarkFailure.java:48)
	at com.carrotsearch.randomizedtesting.rules.StatementAdapter.evaluate(StatementAdapter.java:36)
	at com.carrotsearch.randomizedtesting.ThreadLeakControl$StatementRunner.run(ThreadLeakControl.java:358)
	at com.carrotsearch.randomizedtesting.ThreadLeakControl.forkTimeoutingTask(ThreadLeakControl.java:782)
	at com.carrotsearch.randomizedtesting.ThreadLeakControl$3.evaluate(ThreadLeakControl.java:442)
	at com.carrotsearch.randomizedtesting.RandomizedRunner.runSingleTest(RandomizedRunner.java:746)
	at com.carrotsearch.randomizedtesting.RandomizedRunner$3.evaluate(RandomizedRunner.java:648)
	at com.carrotsearch.randomizedtesting.RandomizedRunner$4.evaluate(RandomizedRunner.java:682)
	at com.carrotsearch.randomizedtesting.RandomizedRunner$5.evaluate(RandomizedRunner.java:693)
	at com.carrotsearch.randomizedtesting.rules.StatementAdapter.evaluate(StatementAdapter.java:36)
	at com.carrotsearch.randomizedtesting.rules.SystemPropertiesRestoreRule$1.evaluate(SystemPropertiesRestoreRule.java:53)
	at org.apache.lucene.util.AbstractBeforeAfterRule$1.evaluate(AbstractBeforeAfterRule.java:46)
	at org.apache.lucene.util.TestRuleStoreClassName$1.evaluate(TestRuleStoreClassName.java:42)
	at com.carrotsearch.randomizedtesting.rules.SystemPropertiesInvariantRule$1.evaluate(SystemPropertiesInvariantRule.java:55)
	at com.carrotsearch.randomizedtesting.rules.NoShadowingOrOverridesOnMethodsRule$1.evaluate(NoShadowingOrOverridesOnMethodsRule.java:39)
	at com.carrotsearch.randomizedtesting.rules.NoShadowingOrOverridesOnMethodsRule$1.evaluate(NoShadowingOrOverridesOnMethodsRule.java:39)
	at com.carrotsearch.randomizedtesting.rules.StatementAdapter.evaluate(StatementAdapter.java:36)
	at org.apache.lucene.util.TestRuleAssertionsRequired$1.evaluate(TestRuleAssertionsRequired.java:43)
	at org.apache.lucene.util.TestRuleMarkFailure$1.evaluate(TestRuleMarkFailure.java:48)
	at org.apache.lucene.util.TestRuleIgnoreAfterMaxFailures$1.evaluate(TestRuleIgnoreAfterMaxFailures.java:70)
	at org.apache.lucene.util.TestRuleIgnoreTestSuites$1.evaluate(TestRuleIgnoreTestSuites.java:55)
	at com.carrotsearch.randomizedtesting.rules.StatementAdapter.evaluate(StatementAdapter.java:36)
	at com.carrotsearch.randomizedtesting.ThreadLeakControl$StatementRunner.run(ThreadLeakControl.java:358)
	at java.lang.Thread.run(Thread.java:722)




Build Log:
[...truncated 8738 lines...]
[junit4:junit4] Suite: org.apache.solr.cloud.UnloadDistributedZkTest
[junit4:junit4]   2> 0 T40 oas.BaseDistributedSearchTestCase.initHostContext Setting hostContext system property: /
[junit4:junit4]   2> 5 T40 oas.SolrTestCaseJ4.setUp ###Starting testDistribSearch
[junit4:junit4]   2> Creating dataDir: /mnt/ssd/jenkins/workspace/Lucene-Solr-trunk-Linux/solr/build/solr-core/test/J1/./solrtest-UnloadDistributedZkTest-1361517762959
[junit4:junit4]   2> 8 T40 oasc.ZkTestServer.run STARTING ZK TEST SERVER
[junit4:junit4]   2> 10 T41 oasc.ZkTestServer$ZKServerMain.runFromConfig Starting server
[junit4:junit4]   2> 37 T41 oaz.Environment.logEnv Server environment:zookeeper.version=3.4.5-1392090, built on 09/30/2012 17:52 GMT
[junit4:junit4]   2> 38 T41 oaz.Environment.logEnv Server environment:host.name=serv1
[junit4:junit4]   2> 38 T41 oaz.Environment.logEnv Server environment:java.version=1.8.0-ea
[junit4:junit4]   2> 38 T41 oaz.Environment.logEnv Server environment:java.vendor=Oracle Corporation
[junit4:junit4]   2> 38 T41 oaz.Environment.logEnv Server environment:java.home=/var/lib/jenkins/tools/java/64bit/jdk1.8.0-ea-b65/jre
[junit4:junit4]   2> 38 T41 oaz.Environment.logEnv Server environment:java.class.path=/mnt/ssd/jenkins/workspace/Lucene-Solr-trunk-Linux/solr/build/solr-core/classes/test:/mnt/ssd/jenkins/workspace/Lucene-Solr-trunk-Linux/solr/build/solr-test-framework/classes/java:/mnt/ssd/jenkins/workspace/Lucene-Solr-trunk-Linux/solr/build/solr-core/test-files:/mnt/ssd/jenkins/workspace/Lucene-Solr-trunk-Linux/lucene/build/test-framework/classes/java:/mnt/ssd/jenkins/workspace/Lucene-Solr-trunk-Linux/lucene/build/codecs/classes/java:/mnt/ssd/jenkins/workspace/Lucene-Solr-trunk-Linux/solr/build/solr-solrj/classes/java:/mnt/ssd/jenkins/workspace/Lucene-Solr-trunk-Linux/solr/build/solr-core/classes/java:/mnt/ssd/jenkins/workspace/Lucene-Solr-trunk-Linux/lucene/build/analysis/common/lucene-analyzers-common-5.0-SNAPSHOT.jar:/mnt/ssd/jenkins/workspace/Lucene-Solr-trunk-Linux/lucene/build/analysis/kuromoji/lucene-analyzers-kuromoji-5.0-SNAPSHOT.jar:/mnt/ssd/jenkins/workspace/Lucene-Solr-trunk-Linux/lucene/build/analysis/phonetic/lucene-analyzers-phonetic-5.0-SNAPSHOT.jar:/mnt/ssd/jenkins/workspace/Lucene-Solr-trunk-Linux/lucene/build/highlighter/lucene-highlighter-5.0-SNAPSHOT.jar:/mnt/ssd/jenkins/workspace/Lucene-Solr-trunk-Linux/lucene/build/memory/lucene-memory-5.0-SNAPSHOT.jar:/mnt/ssd/jenkins/workspace/Lucene-Solr-trunk-Linux/lucene/build/misc/lucene-misc-5.0-SNAPSHOT.jar:/mnt/ssd/jenkins/workspace/Lucene-Solr-trunk-Linux/lucene/build/spatial/lucene-spatial-5.0-SNAPSHOT.jar:/mnt/ssd/jenkins/workspace/Lucene-Solr-trunk-Linux/lucene/build/suggest/lucene-suggest-5.0-SNAPSHOT.jar:/mnt/ssd/jenkins/workspace/Lucene-Solr-trunk-Linux/lucene/build/grouping/lucene-grouping-5.0-SNAPSHOT.jar:/mnt/ssd/jenkins/workspace/Lucene-Solr-trunk-Linux/lucene/build/queries/lucene-queries-5.0-SNAPSHOT.jar:/mnt/ssd/jenkins/workspace/Lucene-Solr-trunk-Linux/lucene/build/queryparser/lucene-queryparser-5.0-SNAPSHOT.jar:/mnt/ssd/jenkins/workspace/Lucene-Solr-trunk-Linux/solr/core/lib/cglib-nodep-2.2.jar:/mnt/ssd/jenkins/workspace/Lucene-Solr-trunk-Linux/solr/core/lib/commons-cli-1.2.jar:/mnt/ssd/jenkins/workspace/Lucene-Solr-trunk-Linux/solr/core/lib/commons-codec-1.7.jar:/mnt/ssd/jenkins/workspace/Lucene-Solr-trunk-Linux/solr/core/lib/commons-fileupload-1.2.1.jar:/mnt/ssd/jenkins/workspace/Lucene-Solr-trunk-Linux/solr/core/lib/commons-lang-2.6.jar:/mnt/ssd/jenkins/workspace/Lucene-Solr-trunk-Linux/solr/core/lib/easymock-3.0.jar:/mnt/ssd/jenkins/workspace/Lucene-Solr-trunk-Linux/solr/core/lib/guava-13.0.1.jar:/mnt/ssd/jenkins/workspace/Lucene-Solr-trunk-Linux/solr/core/lib/javax.servlet-api-3.0.1.jar:/mnt/ssd/jenkins/workspace/Lucene-Solr-trunk-Linux/solr/core/lib/objenesis-1.2.jar:/mnt/ssd/jenkins/workspace/Lucene-Solr-trunk-Linux/solr/core/lib/spatial4j-0.3.jar:/mnt/ssd/jenkins/workspace/Lucene-Solr-trunk-Linux/solr/solrj/lib/commons-io-2.1.jar:/mnt/ssd/jenkins/workspace/Lucene-Solr-trunk-Linux/solr/solrj/lib/httpclient-4.2.3.jar:/mnt/ssd/jenkins/workspace/Lucene-Solr-trunk-Linux/solr/solrj/lib/httpcore-4.2.2.jar:/mnt/ssd/jenkins/workspace/Lucene-Solr-trunk-Linux/solr/solrj/lib/httpmime-4.2.3.jar:/mnt/ssd/jenkins/workspace/Lucene-Solr-trunk-Linux/solr/solrj/lib/jcl-over-slf4j-1.6.4.jar:/mnt/ssd/jenkins/workspace/Lucene-Solr-trunk-Linux/solr/solrj/lib/slf4j-api-1.6.4.jar:/mnt/ssd/jenkins/workspace/Lucene-Solr-trunk-Linux/solr/solrj/lib/slf4j-jdk14-1.6.4.jar:/mnt/ssd/jenkins/workspace/Lucene-Solr-trunk-Linux/solr/solrj/lib/wstx-asl-3.2.7.jar:/mnt/ssd/jenkins/workspace/Lucene-Solr-trunk-Linux/solr/solrj/lib/zookeeper-3.4.5.jar:/mnt/ssd/jenkins/workspace/Lucene-Solr-trunk-Linux/solr/example/lib/jetty-continuation-8.1.8.v20121106.jar:/mnt/ssd/jenkins/workspace/Lucene-Solr-trunk-Linux/solr/example/lib/jetty-deploy-8.1.8.v20121106.jar:/mnt/ssd/jenkins/workspace/Lucene-Solr-trunk-Linux/solr/example/lib/jetty-http-8.1.8.v20121106.jar:/mnt/ssd/jenkins/workspace/Lucene-Solr-trunk-Linux/solr/example/lib/jetty-io-8.1.8.v20121106.jar:/mnt/ssd/jenkins/workspace/Lucene-Solr-trunk-Linux/solr/example/lib/jetty-jmx-8.1.8.v20121106.jar:/mnt/ssd/jenkins/workspace/Lucene-Solr-trunk-Linux/solr/example/lib/jetty-security-8.1.8.v20121106.jar:/mnt/ssd/jenkins/workspace/Lucene-Solr-trunk-Linux/solr/example/lib/jetty-server-8.1.8.v20121106.jar:/mnt/ssd/jenkins/workspace/Lucene-Solr-trunk-Linux/solr/example/lib/jetty-servlet-8.1.8.v20121106.jar:/mnt/ssd/jenkins/workspace/Lucene-Solr-trunk-Linux/solr/example/lib/jetty-util-8.1.8.v20121106.jar:/mnt/ssd/jenkins/workspace/Lucene-Solr-trunk-Linux/solr/example/lib/jetty-webapp-8.1.8.v20121106.jar:/mnt/ssd/jenkins/workspace/Lucene-Solr-trunk-Linux/solr/example/lib/jetty-xml-8.1.8.v20121106.jar:/mnt/ssd/jenkins/workspace/Lucene-Solr-trunk-Linux/solr/example/lib/servlet-api-3.0.jar:/mnt/ssd/jenkins/workspace/Lucene-Solr-trunk-Linux/solr/example/example-DIH/solr/db/lib/derby-10.9.1.0.jar:/mnt/ssd/jenkins/workspace/Lucene-Solr-trunk-Linux/solr/example/example-DIH/solr/db/lib/hsqldb-1.8.0.10.jar:/mnt/ssd/jenkins/workspace/Lucene-Solr-trunk-Linux/lucene/build/core/classes/java:/mnt/ssd/jenkins/workspace/Lucene-Solr-trunk-Linux/lucene/test-framework/lib/junit-4.10.jar:/mnt/ssd/jenkins/workspace/Lucene-Solr-trunk-Linux/lucene/test-framework/lib/randomizedtesting-runner-2.0.8.jar:/var/lib/jenkins/tools/hudson.tasks.Ant_AntInstallation/ANT_1.8.2/lib/ant-launcher.jar:/var/lib/jenkins/.ant/lib/ivy-2.3.0.jar:/var/lib/jenkins/tools/hudson.tasks.Ant_AntInstallation/ANT_1.8.2/lib/ant-jai.jar:/var/lib/jenkins/tools/hudson.tasks.Ant_AntInstallation/ANT_1.8.2/lib/ant-swing.jar:/var/lib/jenkins/tools/hudson.tasks.Ant_AntInstallation/ANT_1.8.2/lib/ant-apache-oro.jar:/var/lib/jenkins/tools/hudson.tasks.Ant_AntInstallation/ANT_1.8.2/lib/ant-jmf.jar:/var/lib/jenkins/tools/hudson.tasks.Ant_AntInstallation/ANT_1.8.2/lib/ant-apache-xalan2.jar:/var/lib/jenkins/tools/hudson.tasks.Ant_AntInstallation/ANT_1.8.2/lib/ant-javamail.jar:/var/lib/jenkins/tools/hudson.tasks.Ant_AntInstallation/ANT_1.8.2/lib/ant-apache-resolver.jar:/var/lib/jenkins/tools/hudson.tasks.Ant_AntInstallation/ANT_1.8.2/lib/ant-testutil.jar:/var/lib/jenkins/tools/hudson.tasks.Ant_AntInstallation/ANT_1.8.2/lib/ant-commons-logging.jar:/var/lib/jenkins/tools/hudson.tasks.Ant_AntInstallation/ANT_1.8.2/lib/ant-apache-log4j.jar:/var/lib/jenkins/tools/hudson.tasks.Ant_AntInstallation/ANT_1.8.2/lib/ant-junit.jar:/var/lib/jenkins/tools/hudson.tasks.Ant_AntInstallation/ANT_1.8.2/lib/ant-jsch.jar:/var/lib/jenkins/tools/hudson.tasks.Ant_AntInstallation/ANT_1.8.2/lib/ant-commons-net.jar:/var/lib/jenkins/tools/hudson.tasks.Ant_AntInstallation/ANT_1.8.2/lib/ant-apache-bsf.jar:/var/lib/jenkins/tools/hudson.tasks.Ant_AntInstallation/ANT_1.8.2/lib/ant-jdepend.jar:/var/lib/jenkins/tools/hudson.tasks.Ant_AntInstallation/ANT_1.8.2/lib/ant-netrexx.jar:/var/lib/jenkins/tools/hudson.tasks.Ant_AntInstallation/ANT_1.8.2/lib/ant-apache-regexp.jar:/var/lib/jenkins/tools/hudson.tasks.Ant_AntInstallation/ANT_1.8.2/lib/ant-junit4.jar:/var/lib/jenkins/tools/hudson.tasks.Ant_AntInstallation/ANT_1.8.2/lib/ant.jar:/var/lib/jenkins/tools/hudson.tasks.Ant_AntInstallation/ANT_1.8.2/lib/ant-apache-bcel.jar:/var/lib/jenkins/tools/hudson.tasks.Ant_AntInstallation/ANT_1.8.2/lib/ant-antlr.jar:/var/lib/jenkins/tools/java/64bit/jdk1.8.0-ea-b65/lib/tools.jar:/var/lib/jenkins/.ivy2/cache/com.carrotsearch.randomizedtesting/junit4-ant/jars/junit4-ant-2.0.8.jar
[junit4:junit4]   2> 40 T41 oaz.Environment.logEnv Server environment:java.library.path=/var/lib/jenkins/tools/java/64bit/jdk1.8.0-ea-b65/jre/lib/amd64/server:/var/lib/jenkins/tools/java/64bit/jdk1.8.0-ea-b65/jre/lib/amd64:/var/lib/jenkins/tools/java/64bit/jdk1.8.0-ea-b65/jre/../lib/amd64:/usr/lib/jvm/j2sdk1.6-sun/jre/lib/amd64/server:/usr/lib/jvm/j2sdk1.6-sun/jre/lib/amd64:/usr/lib/jvm/j2sdk1.6-sun/jre/../lib/amd64:/usr/java/packages/lib/amd64:/usr/lib64:/lib64:/lib:/usr/lib
[junit4:junit4]   2> 40 T41 oaz.Environment.logEnv Server environment:java.io.tmpdir=.
[junit4:junit4]   2> 40 T41 oaz.Environment.logEnv Server environment:java.compiler=<NA>
[junit4:junit4]   2> 40 T41 oaz.Environment.logEnv Server environment:os.name=Linux
[junit4:junit4]   2> 40 T41 oaz.Environment.logEnv Server environment:os.arch=amd64
[junit4:junit4]   2> 41 T41 oaz.Environment.logEnv Server environment:os.version=3.2.0-38-generic
[junit4:junit4]   2> 41 T41 oaz.Environment.logEnv Server environment:user.name=jenkins
[junit4:junit4]   2> 43 T41 oaz.Environment.logEnv Server environment:user.home=/var/lib/jenkins
[junit4:junit4]   2> 44 T41 oaz.Environment.logEnv Server environment:user.dir=/mnt/ssd/jenkins/workspace/Lucene-Solr-trunk-Linux/solr/build/solr-core/test/J1
[junit4:junit4]   2> 58 T41 oazs.ZooKeeperServer.setTickTime tickTime set to 1000
[junit4:junit4]   2> 59 T41 oazs.ZooKeeperServer.setMinSessionTimeout minSessionTimeout set to -1
[junit4:junit4]   2> 59 T41 oazs.ZooKeeperServer.setMaxSessionTimeout maxSessionTimeout set to -1
[junit4:junit4]   2> 61 T41 oazs.NIOServerCnxnFactory.configure binding to port 0.0.0.0/0.0.0.0:0
[junit4:junit4]   2> 84 T41 oazsp.FileTxnSnapLog.save Snapshotting: 0x0 to /mnt/ssd/jenkins/workspace/Lucene-Solr-trunk-Linux/solr/build/solr-core/test/J1/./org.apache.solr.cloud.UnloadDistributedZkTest-1361517762958/zookeeper/server1/data/version-2/snapshot.0
[junit4:junit4]   2> 110 T40 oasc.ZkTestServer.run start zk server on port:36499
[junit4:junit4]   2> 140 T40 oaz.Environment.logEnv Client environment:zookeeper.version=3.4.5-1392090, built on 09/30/2012 17:52 GMT
[junit4:junit4]   2> 141 T40 oaz.Environment.logEnv Client environment:host.name=serv1
[junit4:junit4]   2> 141 T40 oaz.Environment.logEnv Client environment:java.version=1.8.0-ea
[junit4:junit4]   2> 142 T40 oaz.Environment.logEnv Client environment:java.vendor=Oracle Corporation
[junit4:junit4]   2> 142 T40 oaz.Environment.logEnv Client environment:java.home=/var/lib/jenkins/tools/java/64bit/jdk1.8.0-ea-b65/jre
[junit4:junit4]   2> 142 T40 oaz.Environment.logEnv Client environment:java.class.path=/mnt/ssd/jenkins/workspace/Lucene-Solr-trunk-Linux/solr/build/solr-core/classes/test:/mnt/ssd/jenkins/workspace/Lucene-Solr-trunk-Linux/solr/build/solr-test-framework/classes/java:/mnt/ssd/jenkins/workspace/Lucene-Solr-trunk-Linux/solr/build/solr-core/test-files:/mnt/ssd/jenkins/workspace/Lucene-Solr-trunk-Linux/lucene/build/test-framework/classes/java:/mnt/ssd/jenkins/workspace/Lucene-Solr-trunk-Linux/lucene/build/codecs/classes/java:/mnt/ssd/jenkins/workspace/Lucene-Solr-trunk-Linux/solr/build/solr-solrj/classes/java:/mnt/ssd/jenkins/workspace/Lucene-Solr-trunk-Linux/solr/build/solr-core/classes/java:/mnt/ssd/jenkins/workspace/Lucene-Solr-trunk-Linux/lucene/build/analysis/common/lucene-analyzers-common-5.0-SNAPSHOT.jar:/mnt/ssd/jenkins/workspace/Lucene-Solr-trunk-Linux/lucene/build/analysis/kuromoji/lucene-analyzers-kuromoji-5.0-SNAPSHOT.jar:/mnt/ssd/jenkins/workspace/Lucene-Solr-trunk-Linux/lucene/build/analysis/phonetic/lucene-analyzers-phonetic-5.0-SNAPSHOT.jar:/mnt/ssd/jenkins/workspace/Lucene-Solr-trunk-Linux/lucene/build/highlighter/lucene-highlighter-5.0-SNAPSHOT.jar:/mnt/ssd/jenkins/workspace/Lucene-Solr-trunk-Linux/lucene/build/memory/lucene-memory-5.0-SNAPSHOT.jar:/mnt/ssd/jenkins/workspace/Lucene-Solr-trunk-Linux/lucene/build/misc/lucene-misc-5.0-SNAPSHOT.jar:/mnt/ssd/jenkins/workspace/Lucene-Solr-trunk-Linux/lucene/build/spatial/lucene-spatial-5.0-SNAPSHOT.jar:/mnt/ssd/jenkins/workspace/Lucene-Solr-trunk-Linux/lucene/build/suggest/lucene-suggest-5.0-SNAPSHOT.jar:/mnt/ssd/jenkins/workspace/Lucene-Solr-trunk-Linux/lucene/build/grouping/lucene-grouping-5.0-SNAPSHOT.jar:/mnt/ssd/jenkins/workspace/Lucene-Solr-trunk-Linux/lucene/build/queries/lucene-queries-5.0-SNAPSHOT.jar:/mnt/ssd/jenkins/workspace/Lucene-Solr-trunk-Linux/lucene/build/queryparser/lucene-queryparser-5.0-SNAPSHOT.jar:/mnt/ssd/jenkins/workspace/Lucene-Solr-trunk-Linux/solr/core/lib/cglib-nodep-2.2.jar:/mnt/ssd/jenkins/workspace/Lucene-Solr-trunk-Linux/solr/core/lib/commons-cli-1.2.jar:/mnt/ssd/jenkins/workspace/Lucene-Solr-trunk-Linux/solr/core/lib/commons-codec-1.7.jar:/mnt/ssd/jenkins/workspace/Lucene-Solr-trunk-Linux/solr/core/lib/commons-fileupload-1.2.1.jar:/mnt/ssd/jenkins/workspace/Lucene-Solr-trunk-Linux/solr/core/lib/commons-lang-2.6.jar:/mnt/ssd/jenkins/workspace/Lucene-Solr-trunk-Linux/solr/core/lib/easymock-3.0.jar:/mnt/ssd/jenkins/workspace/Lucene-Solr-trunk-Linux/solr/core/lib/guava-13.0.1.jar:/mnt/ssd/jenkins/workspace/Lucene-Solr-trunk-Linux/solr/core/lib/javax.servlet-api-3.0.1.jar:/mnt/ssd/jenkins/workspace/Lucene-Solr-trunk-Linux/solr/core/lib/objenesis-1.2.jar:/mnt/ssd/jenkins/workspace/Lucene-Solr-trunk-Linux/solr/core/lib/spatial4j-0.3.jar:/mnt/ssd/jenkins/workspace/Lucene-Solr-trunk-Linux/solr/solrj/lib/commons-io-2.1.jar:/mnt/ssd/jenkins/workspace/Lucene-Solr-trunk-Linux/solr/solrj/lib/httpclient-4.2.3.jar:/mnt/ssd/jenkins/workspace/Lucene-Solr-trunk-Linux/solr/solrj/lib/httpcore-4.2.2.jar:/mnt/ssd/jenkins/workspace/Lucene-Solr-trunk-Linux/solr/solrj/lib/httpmime-4.2.3.jar:/mnt/ssd/jenkins/workspace/Lucene-Solr-trunk-Linux/solr/solrj/lib/jcl-over-slf4j-1.6.4.jar:/mnt/ssd/jenkins/workspace/Lucene-Solr-trunk-Linux/solr/solrj/lib/slf4j-api-1.6.4.jar:/mnt/ssd/jenkins/workspace/Lucene-Solr-trunk-Linux/solr/solrj/lib/slf4j-jdk14-1.6.4.jar:/mnt/ssd/jenkins/workspace/Lucene-Solr-trunk-Linux/solr/solrj/lib/wstx-asl-3.2.7.jar:/mnt/ssd/jenkins/workspace/Lucene-Solr-trunk-Linux/solr/solrj/lib/zookeeper-3.4.5.jar:/mnt/ssd/jenkins/workspace/Lucene-Solr-trunk-Linux/solr/example/lib/jetty-continuation-8.1.8.v20121106.jar:/mnt/ssd/jenkins/workspace/Lucene-Solr-trunk-Linux/solr/example/lib/jetty-deploy-8.1.8.v20121106.jar:/mnt/ssd/jenkins/workspace/Lucene-Solr-trunk-Linux/solr/example/lib/jetty-http-8.1.8.v20121106.jar:/mnt/ssd/jenkins/workspace/Lucene-Solr-trunk-Linux/solr/example/lib/jetty-io-8.1.8.v20121106.jar:/mnt/ssd/jenkins/workspace/Lucene-Solr-trunk-Linux/solr/example/lib/jetty-jmx-8.1.8.v20121106.jar:/mnt/ssd/jenkins/workspace/Lucene-Solr-trunk-Linux/solr/example/lib/jetty-security-8.1.8.v20121106.jar:/mnt/ssd/jenkins/workspace/Lucene-Solr-trunk-Linux/solr/example/lib/jetty-server-8.1.8.v20121106.jar:/mnt/ssd/jenkins/workspace/Lucene-Solr-trunk-Linux/solr/example/lib/jetty-servlet-8.1.8.v20121106.jar:/mnt/ssd/jenkins/workspace/Lucene-Solr-trunk-Linux/solr/example/lib/jetty-util-8.1.8.v20121106.jar:/mnt/ssd/jenkins/workspace/Lucene-Solr-trunk-Linux/solr/example/lib/jetty-webapp-8.1.8.v20121106.jar:/mnt/ssd/jenkins/workspace/Lucene-Solr-trunk-Linux/solr/example/lib/jetty-xml-8.1.8.v20121106.jar:/mnt/ssd/jenkins/workspace/Lucene-Solr-trunk-Linux/solr/example/lib/servlet-api-3.0.jar:/mnt/ssd/jenkins/workspace/Lucene-Solr-trunk-Linux/solr/example/example-DIH/solr/db/lib/derby-10.9.1.0.jar:/mnt/ssd/jenkins/workspace/Lucene-Solr-trunk-Linux/solr/example/example-DIH/solr/db/lib/hsqldb-1.8.0.10.jar:/mnt/ssd/jenkins/workspace/Lucene-Solr-trunk-Linux/lucene/build/core/classes/java:/mnt/ssd/jenkins/workspace/Lucene-Solr-trunk-Linux/lucene/test-framework/lib/junit-4.10.jar:/mnt/ssd/jenkins/workspace/Lucene-Solr-trunk-Linux/lucene/test-framework/lib/randomizedtesting-runner-2.0.8.jar:/var/lib/jenkins/tools/hudson.tasks.Ant_AntInstallation/ANT_1.8.2/lib/ant-launcher.jar:/var/lib/jenkins/.ant/lib/ivy-2.3.0.jar:/var/lib/jenkins/tools/hudson.tasks.Ant_AntInstallation/ANT_1.8.2/lib/ant-jai.jar:/var/lib/jenkins/tools/hudson.tasks.Ant_AntInstallation/ANT_1.8.2/lib/ant-swing.jar:/var/lib/jenkins/tools/hudson.tasks.Ant_AntInstallation/ANT_1.8.2/lib/ant-apache-oro.jar:/var/lib/jenkins/tools/hudson.tasks.Ant_AntInstallation/ANT_1.8.2/lib/ant-jmf.jar:/var/lib/jenkins/tools/hudson.tasks.Ant_AntInstallation/ANT_1.8.2/lib/ant-apache-xalan2.jar:/var/lib/jenkins/tools/hudson.tasks.Ant_AntInstallation/ANT_1.8.2/lib/ant-javamail.jar:/var/lib/jenkins/tools/hudson.tasks.Ant_AntInstallation/ANT_1.8.2/lib/ant-apache-resolver.jar:/var/lib/jenkins/tools/hudson.tasks.Ant_AntInstallation/ANT_1.8.2/lib/ant-testutil.jar:/var/lib/jenkins/tools/hudson.tasks.Ant_AntInstallation/ANT_1.8.2/lib/ant-commons-logging.jar:/var/lib/jenkins/tools/hudson.tasks.Ant_AntInstallation/ANT_1.8.2/lib/ant-apache-log4j.jar:/var/lib/jenkins/tools/hudson.tasks.Ant_AntInstallation/ANT_1.8.2/lib/ant-junit.jar:/var/lib/jenkins/tools/hudson.tasks.Ant_AntInstallation/ANT_1.8.2/lib/ant-jsch.jar:/var/lib/jenkins/tools/hudson.tasks.Ant_AntInstallation/ANT_1.8.2/lib/ant-commons-net.jar:/var/lib/jenkins/tools/hudson.tasks.Ant_AntInstallation/ANT_1.8.2/lib/ant-apache-bsf.jar:/var/lib/jenkins/tools/hudson.tasks.Ant_AntInstallation/ANT_1.8.2/lib/ant-jdepend.jar:/var/lib/jenkins/tools/hudson.tasks.Ant_AntInstallation/ANT_1.8.2/lib/ant-netrexx.jar:/var/lib/jenkins/tools/hudson.tasks.Ant_AntInstallation/ANT_1.8.2/lib/ant-apache-regexp.jar:/var/lib/jenkins/tools/hudson.tasks.Ant_AntInstallation/ANT_1.8.2/lib/ant-junit4.jar:/var/lib/jenkins/tools/hudson.tasks.Ant_AntInstallation/ANT_1.8.2/lib/ant.jar:/var/lib/jenkins/tools/hudson.tasks.Ant_AntInstallation/ANT_1.8.2/lib/ant-apache-bcel.jar:/var/lib/jenkins/tools/hudson.tasks.Ant_AntInstallation/ANT_1.8.2/lib/ant-antlr.jar:/var/lib/jenkins/tools/java/64bit/jdk1.8.0-ea-b65/lib/tools.jar:/var/lib/jenkins/.ivy2/cache/com.carrotsearch.randomizedtesting/junit4-ant/jars/junit4-ant-2.0.8.jar
[junit4:junit4]   2> 144 T40 oaz.Environment.logEnv Client environment:java.library.path=/var/lib/jenkins/tools/java/64bit/jdk1.8.0-ea-b65/jre/lib/amd64/server:/var/lib/jenkins/tools/java/64bit/jdk1.8.0-ea-b65/jre/lib/amd64:/var/lib/jenkins/tools/java/64bit/jdk1.8.0-ea-b65/jre/../lib/amd64:/usr/lib/jvm/j2sdk1.6-sun/jre/lib/amd64/server:/usr/lib/jvm/j2sdk1.6-sun/jre/lib/amd64:/usr/lib/jvm/j2sdk1.6-sun/jre/../lib/amd64:/usr/java/packages/lib/amd64:/usr/lib64:/lib64:/lib:/usr/lib
[junit4:junit4]   2> 144 T40 oaz.Environment.logEnv Client environment:java.io.tmpdir=.
[junit4:junit4]   2> 144 T40 oaz.Environment.logEnv Client environment:java.compiler=<NA>
[junit4:junit4]   2> 145 T40 oaz.Environment.logEnv Client environment:os.name=Linux
[junit4:junit4]   2> 145 T40 oaz.Environment.logEnv Client environment:os.arch=amd64
[junit4:junit4]   2> 146 T40 oaz.Environment.logEnv Client environment:os.version=3.2.0-38-generic
[junit4:junit4]   2> 146 T40 oaz.Environment.logEnv Client environment:user.name=jenkins
[junit4:junit4]   2> 146 T40 oaz.Environment.logEnv Client environment:user.home=/var/lib/jenkins
[junit4:junit4]   2> 147 T40 oaz.Environment.logEnv Client environment:user.dir=/mnt/ssd/jenkins/workspace/Lucene-Solr-trunk-Linux/solr/build/solr-core/test/J1
[junit4:junit4]   2> 149 T40 oaz.ZooKeeper.<init> Initiating client connection, connectString=127.0.0.1:36499 sessionTimeout=10000 watcher=org.apache.solr.common.cloud.ConnectionManager@47f56da4
[junit4:junit4]   2> 178 T40 oascc.ConnectionManager.waitForConnected Waiting for client to connect to ZooKeeper
[junit4:junit4]   2> 182 T46 oaz.ClientCnxn$SendThread.logStartConnect Opening socket connection to server localhost.localdomain/127.0.0.1:36499. Will not attempt to authenticate using SASL (access denied ("javax.security.auth.AuthPermission" "getLoginConfiguration"))
[junit4:junit4]   2> 182 T46 oaz.ClientCnxn$SendThread.primeConnection Socket connection established to localhost.localdomain/127.0.0.1:36499, initiating session
[junit4:junit4]   2> 183 T42 oazs.NIOServerCnxnFactory.run Accepted socket connection from /127.0.0.1:54193
[junit4:junit4]   2> 190 T42 oazs.ZooKeeperServer.processConnectRequest Client attempting to establish new session at /127.0.0.1:54193
[junit4:junit4]   2> 194 T44 oazsp.FileTxnLog.append Creating new log file: log.1
[junit4:junit4]   2> 222 T44 oazs.ZooKeeperServer.finishSessionInit Established session 0x13d00c859e70000 with negotiated timeout 10000 for client /127.0.0.1:54193
[junit4:junit4]   2> 222 T46 oaz.ClientCnxn$SendThread.onConnected Session establishment complete on server localhost.localdomain/127.0.0.1:36499, sessionid = 0x13d00c859e70000, negotiated timeout = 10000
[junit4:junit4]   2> 224 T47 oascc.ConnectionManager.process Watcher org.apache.solr.common.cloud.ConnectionManager@47f56da4 name:ZooKeeperConnection Watcher:127.0.0.1:36499 got event WatchedEvent state:SyncConnected type:None path:null path:null type:None
[junit4:junit4]   2> 224 T40 oascc.ConnectionManager.waitForConnected Client is connected to ZooKeeper
[junit4:junit4]   2> 226 T40 oascc.SolrZkClient.makePath makePath: /solr
[junit4:junit4]   2> 246 T45 oazs.PrepRequestProcessor.pRequest2Txn Processed session termination for sessionid: 0x13d00c859e70000
[junit4:junit4]   2> 247 T47 oaz.ClientCnxn$EventThread.run EventThread shut down
[junit4:junit4]   2> 247 T40 oaz.ZooKeeper.close Session: 0x13d00c859e70000 closed
[junit4:junit4]   2> 248 T40 oaz.ZooKeeper.<init> Initiating client connection, connectString=127.0.0.1:36499/solr sessionTimeout=10000 watcher=org.apache.solr.common.cloud.ConnectionManager@780a03a2
[junit4:junit4]   2> 249 T42 oazs.NIOServerCnxn.closeSock Closed socket connection for client /127.0.0.1:54193 which had sessionid 0x13d00c859e70000
[junit4:junit4]   2> 250 T40 oascc.ConnectionManager.waitForConnected Waiting for client to connect to ZooKeeper
[junit4:junit4]   2> 250 T48 oaz.ClientCnxn$SendThread.logStartConnect Opening socket connection to server localhost.localdomain/127.0.0.1:36499. Will not attempt to authenticate using SASL (access denied ("javax.security.auth.AuthPermission" "getLoginConfiguration"))
[junit4:junit4]   2> 251 T48 oaz.ClientCnxn$SendThread.primeConnection Socket connection established to localhost.localdomain/127.0.0.1:36499, initiating session
[junit4:junit4]   2> 251 T42 oazs.NIOServerCnxnFactory.run Accepted socket connection from /127.0.0.1:54194
[junit4:junit4]   2> 251 T42 oazs.ZooKeeperServer.processConnectRequest Client attempting to establish new session at /127.0.0.1:54194
[junit4:junit4]   2> 252 T44 oazs.ZooKeeperServer.finishSessionInit Established session 0x13d00c859e70001 with negotiated timeout 10000 for client /127.0.0.1:54194
[junit4:junit4]   2> 252 T48 oaz.ClientCnxn$SendThread.onConnected Session establishment complete on server localhost.localdomain/127.0.0.1:36499, sessionid = 0x13d00c859e70001, negotiated timeout = 10000
[junit4:junit4]   2> 252 T49 oascc.ConnectionManager.process Watcher org.apache.solr.common.cloud.ConnectionManager@780a03a2 name:ZooKeeperConnection Watcher:127.0.0.1:36499/solr got event WatchedEvent state:SyncConnected type:None path:null path:null type:None
[junit4:junit4]   2> 252 T40 oascc.ConnectionManager.waitForConnected Client is connected to ZooKeeper
[junit4:junit4]   2> 256 T40 oascc.SolrZkClient.makePath makePath: /collections/collection1
[junit4:junit4]   2> 261 T40 oascc.SolrZkClient.makePath makePath: /collections/collection1/shards
[junit4:junit4]   2> 264 T40 oascc.SolrZkClient.makePath makePath: /collections/control_collection
[junit4:junit4]   2> 267 T40 oascc.SolrZkClient.makePath makePath: /collections/control_collection/shards
[junit4:junit4]   2> 271 T40 oasc.AbstractZkTestCase.putConfig put /mnt/ssd/jenkins/workspace/Lucene-Solr-trunk-Linux/solr/build/solr-core/test-files/solr/collection1/conf/solrconfig-tlog.xml to /configs/conf1/solrconfig.xml
[junit4:junit4]   2> 282 T40 oascc.SolrZkClient.makePath makePath: /configs/conf1/solrconfig.xml
[junit4:junit4]   2> 288 T40 oasc.AbstractZkTestCase.putConfig put /mnt/ssd/jenkins/workspace/Lucene-Solr-trunk-Linux/solr/build/solr-core/test-files/solr/collection1/conf/schema.xml to /configs/conf1/schema.xml
[junit4:junit4]   2> 291 T40 oascc.SolrZkClient.makePath makePath: /configs/conf1/schema.xml
[junit4:junit4]   2> 299 T40 oasc.AbstractZkTestCase.putConfig put /mnt/ssd/jenkins/workspace/Lucene-Solr-trunk-Linux/solr/build/solr-core/test-files/solr/collection1/conf/stopwords.txt to /configs/conf1/stopwords.txt
[junit4:junit4]   2> 299 T40 oascc.SolrZkClient.makePath makePath: /configs/conf1/stopwords.txt
[junit4:junit4]   2> 303 T40 oasc.AbstractZkTestCase.putConfig put /mnt/ssd/jenkins/workspace/Lucene-Solr-trunk-Linux/solr/build/solr-core/test-files/solr/collection1/conf/protwords.txt to /configs/conf1/protwords.txt
[junit4:junit4]   2> 303 T40 oascc.SolrZkClient.makePath makePath: /configs/conf1/protwords.txt
[junit4:junit4]   2> 306 T40 oasc.AbstractZkTestCase.putConfig put /mnt/ssd/jenkins/workspace/Lucene-Solr-trunk-Linux/solr/build/solr-core/test-files/solr/collection1/conf/currency.xml to /configs/conf1/currency.xml
[junit4:junit4]   2> 307 T40 oascc.SolrZkClient.makePath makePath: /configs/conf1/currency.xml
[junit4:junit4]   2> 310 T40 oasc.AbstractZkTestCase.putConfig put /mnt/ssd/jenkins/workspace/Lucene-Solr-trunk-Linux/solr/build/solr-core/test-files/solr/collection1/conf/open-exchange-rates.json to /configs/conf1/open-exchange-rates.json
[junit4:junit4]   2> 311 T40 oascc.SolrZkClient.makePath makePath: /configs/conf1/open-exchange-rates.json
[junit4:junit4]   2> 314 T40 oasc.AbstractZkTestCase.putConfig put /mnt/ssd/jenkins/workspace/Lucene-Solr-trunk-Linux/solr/build/solr-core/test-files/solr/collection1/conf/mapping-ISOLatin1Accent.txt to /configs/conf1/mapping-ISOLatin1Accent.txt
[junit4:junit4]   2> 315 T40 oascc.SolrZkClient.makePath makePath: /configs/conf1/mapping-ISOLatin1Accent.txt
[junit4:junit4]   2> 318 T40 oasc.AbstractZkTestCase.putConfig put /mnt/ssd/jenkins/workspace/Lucene-Solr-trunk-Linux/solr/build/solr-core/test-files/solr/collection1/conf/old_synonyms.txt to /configs/conf1/old_synonyms.txt
[junit4:junit4]   2> 318 T40 oascc.SolrZkClient.makePath makePath: /configs/conf1/old_synonyms.txt
[junit4:junit4]   2> 324 T40 oasc.AbstractZkTestCase.putConfig put /mnt/ssd/jenkins/workspace/Lucene-Solr-trunk-Linux/solr/build/solr-core/test-files/solr/collection1/conf/synonyms.txt to /configs/conf1/synonyms.txt
[junit4:junit4]   2> 325 T40 oascc.SolrZkClient.makePath makePath: /configs/conf1/synonyms.txt
[junit4:junit4]   2> 330 T45 oazs.PrepRequestProcessor.pRequest2Txn Processed session termination for sessionid: 0x13d00c859e70001
[junit4:junit4]   2> 331 T49 oaz.ClientCnxn$EventThread.run EventThread shut down
[junit4:junit4]   2> 331 T42 oazs.NIOServerCnxn.closeSock Closed socket connection for client /127.0.0.1:54194 which had sessionid 0x13d00c859e70001
[junit4:junit4]   2> 331 T40 oaz.ZooKeeper.close Session: 0x13d00c859e70001 closed
[junit4:junit4]   2> 394 T40 oejs.Server.doStart jetty-8.1.8.v20121106
[junit4:junit4]   2> 409 T40 oejs.AbstractConnector.doStart Started SelectChannelConnector@127.0.0.1:41143
[junit4:junit4]   2> 410 T40 oass.SolrDispatchFilter.init SolrDispatchFilter.init()
[junit4:junit4]   2> 410 T40 oasc.SolrResourceLoader.locateSolrHome JNDI not configured for solr (NoInitialContextEx)
[junit4:junit4]   2> 411 T40 oasc.SolrResourceLoader.locateSolrHome using system property solr.solr.home: /mnt/ssd/jenkins/workspace/Lucene-Solr-trunk-Linux/solr/build/solr-core/test/J1/./org.apache.solr.cloud.UnloadDistributedZkTest-controljetty-1361517763285
[junit4:junit4]   2> 411 T40 oasc.CoreContainer$Initializer.initialize looking for solr.xml: /mnt/ssd/jenkins/workspace/Lucene-Solr-trunk-Linux/solr/build/solr-core/test/J1/./org.apache.solr.cloud.UnloadDistributedZkTest-controljetty-1361517763285/solr.xml
[junit4:junit4]   2> 411 T40 oasc.CoreContainer.<init> New CoreContainer 2075110044
[junit4:junit4]   2> 412 T40 oasc.CoreContainer.load Loading CoreContainer using Solr Home: '/mnt/ssd/jenkins/workspace/Lucene-Solr-trunk-Linux/solr/build/solr-core/test/J1/./org.apache.solr.cloud.UnloadDistributedZkTest-controljetty-1361517763285/'
[junit4:junit4]   2> 412 T40 oasc.SolrResourceLoader.<init> new SolrResourceLoader for directory: '/mnt/ssd/jenkins/workspace/Lucene-Solr-trunk-Linux/solr/build/solr-core/test/J1/./org.apache.solr.cloud.UnloadDistributedZkTest-controljetty-1361517763285/'
[junit4:junit4]   2> 432 T40 oashc.HttpShardHandlerFactory.getParameter Setting socketTimeout to: 120000
[junit4:junit4]   2> 432 T40 oashc.HttpShardHandlerFactory.getParameter Setting urlScheme to: http://
[junit4:junit4]   2> 432 T40 oashc.HttpShardHandlerFactory.getParameter Setting connTimeout to: 15000
[junit4:junit4]   2> 433 T40 oashc.HttpShardHandlerFactory.getParameter Setting maxConnectionsPerHost to: 20
[junit4:junit4]   2> 433 T40 oashc.HttpShardHandlerFactory.getParameter Setting corePoolSize to: 0
[junit4:junit4]   2> 433 T40 oashc.HttpShardHandlerFactory.getParameter Setting maximumPoolSize to: 2147483647
[junit4:junit4]   2> 434 T40 oashc.HttpShardHandlerFactory.getParameter Setting maxThreadIdleTime to: 5
[junit4:junit4]   2> 434 T40 oashc.HttpShardHandlerFactory.getParameter Setting sizeOfQueue to: -1
[junit4:junit4]   2> 434 T40 oashc.HttpShardHandlerFactory.getParameter Setting fairnessPolicy to: false
[junit4:junit4]   2> 435 T40 oascsi.HttpClientUtil.createClient Creating new http client, config:maxConnectionsPerHost=20&maxConnections=10000&socketTimeout=120000&connTimeout=15000&retry=false
[junit4:junit4]   2> 486 T40 oasc.CoreContainer.load Registering Log Listener
[junit4:junit4]   2> 497 T40 oasc.CoreContainer.initZooKeeper Zookeeper client=127.0.0.1:36499/solr
[junit4:junit4]   2> 504 T40 oasc.ZkController.checkChrootPath zkHost includes chroot
[junit4:junit4]   2> 505 T40 oaz.ZooKeeper.<init> Initiating client connection, connectString=127.0.0.1:36499 sessionTimeout=60000 watcher=org.apache.solr.common.cloud.ConnectionManager@7ce7341a
[junit4:junit4]   2> 506 T40 oascc.ConnectionManager.waitForConnected Waiting for client to connect to ZooKeeper
[junit4:junit4]   2> 506 T59 oaz.ClientCnxn$SendThread.logStartConnect Opening socket connection to server localhost.localdomain/127.0.0.1:36499. Will not attempt to authenticate using SASL (access denied ("javax.security.auth.AuthPermission" "getLoginConfiguration"))
[junit4:junit4]   2> 507 T59 oaz.ClientCnxn$SendThread.primeConnection Socket connection established to localhost.localdomain/127.0.0.1:36499, initiating session
[junit4:junit4]   2> 507 T42 oazs.NIOServerCnxnFactory.run Accepted socket connection from /127.0.0.1:54195
[junit4:junit4]   2> 507 T42 oazs.ZooKeeperServer.processConnectRequest Client attempting to establish new session at /127.0.0.1:54195
[junit4:junit4]   2> 508 T44 oazs.ZooKeeperServer.finishSessionInit Established session 0x13d00c859e70002 with negotiated timeout 20000 for client /127.0.0.1:54195
[junit4:junit4]   2> 508 T59 oaz.ClientCnxn$SendThread.onConnected Session establishment complete on server localhost.localdomain/127.0.0.1:36499, sessionid = 0x13d00c859e70002, negotiated timeout = 20000
[junit4:junit4]   2> 508 T60 oascc.ConnectionManager.process Watcher org.apache.solr.common.cloud.ConnectionManager@7ce7341a name:ZooKeeperConnection Watcher:127.0.0.1:36499 got event WatchedEvent state:SyncConnected type:None path:null path:null type:None
[junit4:junit4]   2> 508 T40 oascc.ConnectionManager.waitForConnected Client is connected to ZooKeeper
[junit4:junit4]   2> 510 T45 oazs.PrepRequestProcessor.pRequest2Txn Processed session termination for sessionid: 0x13d00c859e70002
[junit4:junit4]   2> 511 T60 oaz.ClientCnxn$EventThread.run EventThread shut down
[junit4:junit4]   2> 511 T40 oaz.ZooKeeper.close Session: 0x13d00c859e70002 closed
[junit4:junit4]   2> 511 T42 oazs.NIOServerCnxn.closeSock Closed socket connection for client /127.0.0.1:54195 which had sessionid 0x13d00c859e70002
[junit4:junit4]   2> 513 T40 oascsi.HttpClientUtil.createClient Creating new http client, config:maxConnections=500&maxConnectionsPerHost=16&socketTimeout=120000&connTimeout=15000
[junit4:junit4]   2> 519 T40 oaz.ZooKeeper.<init> Initiating client connection, connectString=127.0.0.1:36499/solr sessionTimeout=30000 watcher=org.apache.solr.common.cloud.ConnectionManager@7aca0a76
[junit4:junit4]   2> 520 T40 oascc.ConnectionManager.waitForConnected Waiting for client to connect to ZooKeeper
[junit4:junit4]   2> 520 T61 oaz.ClientCnxn$SendThread.logStartConnect Opening socket connection to server localhost.localdomain/127.0.0.1:36499. Will not attempt to authenticate using SASL (access denied ("javax.security.auth.AuthPermission" "getLoginConfiguration"))
[junit4:junit4]   2> 521 T61 oaz.ClientCnxn$SendThread.primeConnection Socket connection established to localhost.localdomain/127.0.0.1:36499, initiating session
[junit4:junit4]   2> 521 T42 oazs.NIOServerCnxnFactory.run Accepted socket connection from /127.0.0.1:54196
[junit4:junit4]   2> 521 T42 oazs.ZooKeeperServer.processConnectRequest Client attempting to establish new session at /127.0.0.1:54196
[junit4:junit4]   2> 522 T44 oazs.ZooKeeperServer.finishSessionInit Established session 0x13d00c859e70003 with negotiated timeout 20000 for client /127.0.0.1:54196
[junit4:junit4]   2> 522 T61 oaz.ClientCnxn$SendThread.onConnected Session establishment complete on server localhost.localdomain/127.0.0.1:36499, sessionid = 0x13d00c859e70003, negotiated timeout = 20000
[junit4:junit4]   2> 522 T62 oascc.ConnectionManager.process Watcher org.apache.solr.common.cloud.ConnectionManager@7aca0a76 name:ZooKeeperConnection Watcher:127.0.0.1:36499/solr got event WatchedEvent state:SyncConnected type:None path:null path:null type:None
[junit4:junit4]   2> 529 T40 oascc.ConnectionManager.waitForConnected Client is connected to ZooKeeper
[junit4:junit4]   2> 539 T45 oazs.PrepRequestProcessor.pRequest Got user-level KeeperException when processing sessionid:0x13d00c859e70003 type:create cxid:0x2 zxid:0x1a txntype:-1 reqpath:n/a Error Path:/solr/overseer Error:KeeperErrorCode = NodeExists for /solr/overseer
[junit4:junit4]   2> 544 T40 oascc.SolrZkClient.makePath makePath: /live_nodes
[junit4:junit4]   2> 546 T40 oasc.ZkController.createEphemeralLiveNode Register node as live in ZooKeeper:/live_nodes/127.0.0.1:41143_
[junit4:junit4]   2> 548 T45 oazs.PrepRequestProcessor.pRequest Got user-level KeeperException when processing sessionid:0x13d00c859e70003 type:delete cxid:0x8 zxid:0x1c txntype:-1 reqpath:n/a Error Path:/solr/live_nodes/127.0.0.1:41143_ Error:KeeperErrorCode = NoNode for /solr/live_nodes/127.0.0.1:41143_
[junit4:junit4]   2> 549 T40 oascc.SolrZkClient.makePath makePath: /live_nodes/127.0.0.1:41143_
[junit4:junit4]   2> 560 T40 oascc.SolrZkClient.makePath makePath: /overseer_elect/election
[junit4:junit4]   2> 570 T45 oazs.PrepRequestProcessor.pRequest Got user-level KeeperException when processing sessionid:0x13d00c859e70003 type:delete cxid:0x16 zxid:0x21 txntype:-1 reqpath:n/a Error Path:/solr/overseer_elect/leader Error:KeeperErrorCode = NoNode for /solr/overseer_elect/leader
[junit4:junit4]   2> 571 T40 oascc.SolrZkClient.makePath makePath: /overseer_elect/leader
[junit4:junit4]   2> 574 T40 oasc.Overseer.start Overseer (id=89228428119048195-127.0.0.1:41143_-n_0000000000) starting
[junit4:junit4]   2> 575 T45 oazs.PrepRequestProcessor.pRequest Got user-level KeeperException when processing sessionid:0x13d00c859e70003 type:create cxid:0x1b zxid:0x23 txntype:-1 reqpath:n/a Error Path:/solr/overseer Error:KeeperErrorCode = NodeExists for /solr/overseer
[junit4:junit4]   2> 582 T45 oazs.PrepRequestProcessor.pRequest Got user-level KeeperException when processing sessionid:0x13d00c859e70003 type:create cxid:0x1c zxid:0x24 txntype:-1 reqpath:n/a Error Path:/solr/overseer Error:KeeperErrorCode = NodeExists for /solr/overseer
[junit4:junit4]   2> 583 T45 oazs.PrepRequestProcessor.pRequest Got user-level KeeperException when processing sessionid:0x13d00c859e70003 type:create cxid:0x1d zxid:0x25 txntype:-1 reqpath:n/a Error Path:/solr/overseer Error:KeeperErrorCode = NodeExists for /solr/overseer
[junit4:junit4]   2> 586 T45 oazs.PrepRequestProcessor.pRequest Got user-level KeeperException when processing sessionid:0x13d00c859e70003 type:create cxid:0x1e zxid:0x26 txntype:-1 reqpath:n/a Error Path:/solr/overseer Error:KeeperErrorCode = NodeExists for /solr/overseer
[junit4:junit4]   2> 587 T64 oasc.OverseerCollectionProcessor.run Process current queue of collection creations
[junit4:junit4]   2> 587 T40 oascc.SolrZkClient.makePath makePath: /clusterstate.json
[junit4:junit4]   2> 589 T40 oascc.ZkStateReader.createClusterStateWatchersAndUpdate Updating cluster state from ZooKeeper... 
[junit4:junit4]   2> 596 T63 oasc.Overseer$ClusterStateUpdater.run Starting to work on the main queue
[junit4:junit4]   2> 600 T65 oasc.CoreContainer.create Creating SolrCore 'collection1' using instanceDir: /mnt/ssd/jenkins/workspace/Lucene-Solr-trunk-Linux/solr/build/solr-core/test/J1/./org.apache.solr.cloud.UnloadDistributedZkTest-controljetty-1361517763285/collection1
[junit4:junit4]   2> 600 T65 oasc.ZkController.createCollectionZkNode Check for collection zkNode:control_collection
[junit4:junit4]   2> 601 T65 oasc.ZkController.createCollectionZkNode Collection zkNode exists
[junit4:junit4]   2> 601 T65 oasc.ZkController.readConfigName Load collection config from:/collections/control_collection
[junit4:junit4]   2> 602 T65 oasc.SolrResourceLoader.<init> new SolrResourceLoader for directory: '/mnt/ssd/jenkins/workspace/Lucene-Solr-trunk-Linux/solr/build/solr-core/test/J1/./org.apache.solr.cloud.UnloadDistributedZkTest-controljetty-1361517763285/collection1/'
[junit4:junit4]   2> 603 T65 oasc.SolrResourceLoader.replaceClassLoader Adding 'file:/mnt/ssd/jenkins/workspace/Lucene-Solr-trunk-Linux/solr/build/solr-core/test/J1/org.apache.solr.cloud.UnloadDistributedZkTest-controljetty-1361517763285/collection1/lib/README' to classloader
[junit4:junit4]   2> 603 T65 oasc.SolrResourceLoader.replaceClassLoader Adding 'file:/mnt/ssd/jenkins/workspace/Lucene-Solr-trunk-Linux/solr/build/solr-core/test/J1/org.apache.solr.cloud.UnloadDistributedZkTest-controljetty-1361517763285/collection1/lib/classes/' to classloader
[junit4:junit4]   2> 639 T65 oasc.SolrConfig.<init> Using Lucene MatchVersion: LUCENE_50
[junit4:junit4]   2> 691 T65 oasc.SolrConfig.<init> Loaded SolrConfig: solrconfig.xml
[junit4:junit4]   2> 692 T65 oass.IndexSchema.readSchema Reading Solr Schema
[junit4:junit4]   2> 702 T65 oass.IndexSchema.readSchema Schema name=test
[junit4:junit4]   2> 1035 T65 oass.OpenExchangeRatesOrgProvider.init Initialized with rates=open-exchange-rates.json, refreshInterval=1440.
[junit4:junit4]   2> 1041 T65 oass.IndexSchema.readSchema default search field in schema is text
[junit4:junit4]   2> 1048 T65 oass.IndexSchema.readSchema unique key field: id
[junit4:junit4]   2> 1068 T65 oass.FileExchangeRateProvider.reload Reloading exchange rates from file currency.xml
[junit4:junit4]   2> 1072 T65 oass.FileExchangeRateProvider.reload Reloading exchange rates from file currency.xml
[junit4:junit4]   2> 1075 T65 oass.OpenExchangeRatesOrgProvider.reload Reloading exchange rates from open-exchange-rates.json
[junit4:junit4]   2> 1077 T65 oass.OpenExchangeRatesOrgProvider.reload Reloading exchange rates from open-exchange-rates.json
[junit4:junit4]   2> 1078 T65 oasc.SolrCore.<init> [collection1] Opening new SolrCore at /mnt/ssd/jenkins/workspace/Lucene-Solr-trunk-Linux/solr/build/solr-core/test/J1/./org.apache.solr.cloud.UnloadDistributedZkTest-controljetty-1361517763285/collection1/, dataDir=./org.apache.solr.cloud.UnloadDistributedZkTest-1361517762958/control/data/
[junit4:junit4]   2> 1079 T65 oasc.JmxMonitoredMap.<init> JMX monitoring is enabled. Adding Solr mbeans to JMX Server: com.sun.jmx.mbeanserver.JmxMBeanServer@36262bf5
[junit4:junit4]   2> 1081 T65 oasc.SolrCore.initDirectoryFactory org.apache.solr.core.MockDirectoryFactory
[junit4:junit4]   2> 1081 T65 oasc.CachingDirectoryFactory.get return new directory for /mnt/ssd/jenkins/workspace/Lucene-Solr-trunk-Linux/solr/build/solr-core/test/J1/./org.apache.solr.cloud.UnloadDistributedZkTest-1361517762958/control/data forceNew:false
[junit4:junit4]   2> 1081 T65 oasc.CachingDirectoryFactory.close Releasing directory:/mnt/ssd/jenkins/workspace/Lucene-Solr-trunk-Linux/solr/build/solr-core/test/J1/./org.apache.solr.cloud.UnloadDistributedZkTest-1361517762958/control/data
[junit4:junit4]   2> 1081 T65 oasc.SolrCore.getNewIndexDir New index directory detected: old=null new=./org.apache.solr.cloud.UnloadDistributedZkTest-1361517762958/control/data/index/
[junit4:junit4]   2> 1082 T65 oasc.SolrCore.initIndex WARNING [collection1] Solr index directory './org.apache.solr.cloud.UnloadDistributedZkTest-1361517762958/control/data/index' doesn't exist. Creating new index...
[junit4:junit4]   2> 1082 T65 oasc.CachingDirectoryFactory.get return new directory for /mnt/ssd/jenkins/workspace/Lucene-Solr-trunk-Linux/solr/build/solr-core/test/J1/./org.apache.solr.cloud.UnloadDistributedZkTest-1361517762958/control/data/index forceNew:false
[junit4:junit4]   2> 1083 T65 oasc.SolrDeletionPolicy.onCommit SolrDeletionPolicy.onCommit: commits:num=1
[junit4:junit4]   2> 		commit{dir=MockDirWrapper(org.apache.lucene.store.RAMDirectory@af7867f lockFactory=org.apache.lucene.store.NativeFSLockFactory@4719af40),segFN=segments_1,generation=1,filenames=[segments_1]
[junit4:junit4]   2> 1084 T65 oasc.SolrDeletionPolicy.updateCommits newest commit = 1[segments_1]
[junit4:junit4]   2> 1084 T65 oasc.CachingDirectoryFactory.close Releasing directory:/mnt/ssd/jenkins/workspace/Lucene-Solr-trunk-Linux/solr/build/solr-core/test/J1/./org.apache.solr.cloud.UnloadDistributedZkTest-1361517762958/control/data/index
[junit4:junit4]   2> 1094 T65 oasup.UpdateRequestProcessorChain.init inserting DistributedUpdateProcessorFactory into updateRequestProcessorChain "dedupe"
[junit4:junit4]   2> 1094 T65 oasup.UpdateRequestProcessorChain.init inserting DistributedUpdateProcessorFactory into updateRequestProcessorChain "stored_sig"
[junit4:junit4]   2> 1095 T65 oasup.UpdateRequestProcessorChain.init inserting DistributedUpdateProcessorFactory into updateRequestProcessorChain "distrib-dup-test-chain-implicit"
[junit4:junit4]   2> 1095 T65 oasc.RequestHandlers.initHandlersFromConfig created standard: solr.StandardRequestHandler
[junit4:junit4]   2> 1096 T65 oasc.RequestHandlers.initHandlersFromConfig created /get: solr.RealTimeGetHandler
[junit4:junit4]   2> 1096 T65 oasc.RequestHandlers.initHandlersFromConfig adding lazy requestHandler: solr.ReplicationHandler
[junit4:junit4]   2> 1096 T65 oasc.RequestHandlers.initHandlersFromConfig created /replication: solr.ReplicationHandler
[junit4:junit4]   2> 1096 T65 oasc.RequestHandlers.initHandlersFromConfig created /update: solr.UpdateRequestHandler
[junit4:junit4]   2> 1097 T65 oasc.RequestHandlers.initHandlersFromConfig created /admin/: org.apache.solr.handler.admin.AdminHandlers
[junit4:junit4]   2> 1099 T65 oashl.XMLLoader.init xsltCacheLifetimeSeconds=60
[junit4:junit4]   2> 1101 T65 oasc.CachingDirectoryFactory.close Releasing directory:/mnt/ssd/jenkins/workspace/Lucene-Solr-trunk-Linux/solr/build/solr-core/test/J1/./org.apache.solr.cloud.UnloadDistributedZkTest-1361517762958/control/data
[junit4:junit4]   2> 1101 T65 oass.SolrIndexSearcher.<init> Opening Searcher@76d03c4d main
[junit4:junit4]   2> 1103 T65 oasu.UpdateHandler.clearLog Clearing tlog files, tlogDir=./org.apache.solr.cloud.UnloadDistributedZkTest-1361517762958/control/data/tlog
[junit4:junit4]   2> 1108 T65 oasu.CommitTracker.<init> Hard AutoCommit: disabled
[junit4:junit4]   2> 1108 T65 oasu.CommitTracker.<init> Soft AutoCommit: disabled
[junit4:junit4]   2> 1110 T65 oasc.CachingDirectoryFactory.close Releasing directory:/mnt/ssd/jenkins/workspace/Lucene-Solr-trunk-Linux/solr/build/solr-core/test/J1/./org.apache.solr.cloud.UnloadDistributedZkTest-1361517762958/control/data
[junit4:junit4]   2> 1111 T66 oasc.SolrCore.registerSearcher [collection1] Registered new searcher Searcher@76d03c4d main{StandardDirectoryReader(segments_1:1)}
[junit4:junit4]   2> 1112 T65 oasc.ZkController.publish publishing core=collection1 state=down
[junit4:junit4]   2> 1112 T65 oasc.ZkController.publish numShards not found on descriptor - reading it from system property
[junit4:junit4]   2> 1113 T45 oazs.PrepRequestProcessor.pRequest Got user-level KeeperException when processing sessionid:0x13d00c859e70003 type:create cxid:0x50 zxid:0x29 txntype:-1 reqpath:n/a Error Path:/solr/overseer/queue Error:KeeperErrorCode = NoNode for /solr/overseer/queue
[junit4:junit4]   2> 2101 T63 oascc.ZkStateReader.updateClusterState Updating cloud state from ZooKeeper... 
[junit4:junit4]   2> 2101 T63 oasc.Overseer$ClusterStateUpdater.updateState Update state numShards=1 message={
[junit4:junit4]   2> 	  "core":"collection1",
[junit4:junit4]   2> 	  "numShards":"1",
[junit4:junit4]   2> 	  "shard":null,
[junit4:junit4]   2> 	  "roles":null,
[junit4:junit4]   2> 	  "state":"down",
[junit4:junit4]   2> 	  "base_url":"http://127.0.0.1:41143",
[junit4:junit4]   2> 	  "collection":"control_collection",
[junit4:junit4]   2> 	  "node_name":"127.0.0.1:41143_",
[junit4:junit4]   2> 	  "operation":"state"}
[junit4:junit4]   2> 2102 T63 oasc.Overseer$ClusterStateUpdater.createCollection Create collection control_collection with numShards 1
[junit4:junit4]   2> 2109 T63 oasc.Overseer$ClusterStateUpdater.updateState Assigning new node to shard shard=shard1
[junit4:junit4]   2> 2109 T45 oazs.PrepRequestProcessor.pRequest Got user-level KeeperException when processing sessionid:0x13d00c859e70003 type:create cxid:0x58 zxid:0x2c txntype:-1 reqpath:n/a Error Path:/solr/overseer/queue-work Error:KeeperErrorCode = NoNode for /solr/overseer/queue-work
[junit4:junit4]   2> 2118 T62 oascc.ZkStateReader$2.process A cluster state change: WatchedEvent state:SyncConnected type:NodeDataChanged path:/clusterstate.json, has occurred - updating... (live nodes size: 1)
[junit4:junit4]   2> 3116 T65 oasc.CoreContainer.registerCore registering core: collection1
[junit4:junit4]   2> 3116 T65 oasc.ZkController.register Register replica - core:collection1 address:http://127.0.0.1:41143 collection:control_collection shard:shard1
[junit4:junit4]   2> 3121 T65 oascsi.HttpClientUtil.createClient Creating new http client, config:maxConnections=10000&maxConnectionsPerHost=20&connTimeout=30000&socketTimeout=30000&retry=false
[junit4:junit4]   2> 3126 T65 oascc.SolrZkClient.makePath makePath: /collections/control_collection/leader_elect/shard1/election
[junit4:junit4]   2> 3136 T45 oazs.PrepRequestProcessor.pRequest Got user-level KeeperException when processing sessionid:0x13d00c859e70003 type:delete cxid:0x72 zxid:0x36 txntype:-1 reqpath:n/a Error Path:/solr/collections/control_collection/leaders Error:KeeperErrorCode = NoNode for /solr/collections/control_collection/leaders
[junit4:junit4]   2> 3137 T65 oasc.ShardLeaderElectionContext.runLeaderProcess Running the leader process.
[junit4:junit4]   2> 3137 T45 oazs.PrepRequestProcessor.pRequest Got user-level KeeperException when processing sessionid:0x13d00c859e70003 type:create cxid:0x73 zxid:0x37 txntype:-1 reqpath:n/a Error Path:/solr/overseer Error:KeeperErrorCode = NodeExists for /solr/overseer
[junit4:junit4]   2> 3140 T65 oasc.ShardLeaderElectionContext.waitForReplicasToComeUp Enough replicas found to continue.
[junit4:junit4]   2> 3140 T65 oasc.ShardLeaderElectionContext.runLeaderProcess I may be the new leader - try and sync
[junit4:junit4]   2> 3140 T65 oasc.SyncStrategy.sync Sync replicas to http://127.0.0.1:41143/collection1/
[junit4:junit4]   2> 3141 T65 oasc.SyncStrategy.syncReplicas Sync Success - now sync replicas to me
[junit4:junit4]   2> 3141 T65 oasc.SyncStrategy.syncToMe http://127.0.0.1:41143/collection1/ has no replicas
[junit4:junit4]   2> 3141 T65 oasc.ShardLeaderElectionContext.runLeaderProcess I am the new leader: http://127.0.0.1:41143/collection1/
[junit4:junit4]   2> 3142 T65 oascc.SolrZkClient.makePath makePath: /collections/control_collection/leaders/shard1
[junit4:junit4]   2> 3147 T45 oazs.PrepRequestProcessor.pRequest Got user-level KeeperException when processing sessionid:0x13d00c859e70003 type:create cxid:0x7d zxid:0x3b txntype:-1 reqpath:n/a Error Path:/solr/overseer Error:KeeperErrorCode = NodeExists for /solr/overseer
[junit4:junit4]   2> 3623 T63 oascc.ZkStateReader.updateClusterState Updating cloud state from ZooKeeper... 
[junit4:junit4]   2> 3636 T62 oascc.ZkStateReader$2.process A cluster state change: WatchedEvent state:SyncConnected type:NodeDataChanged path:/clusterstate.json, has occurred - updating... (live nodes size: 1)
[junit4:junit4]   2> 3652 T65 oasc.ZkController.register We are http://127.0.0.1:41143/collection1/ and leader is http://127.0.0.1:41143/collection1/
[junit4:junit4]   2> 3654 T65 oasc.ZkController.register No LogReplay needed for core=collection1 baseURL=http://127.0.0.1:41143
[junit4:junit4]   2> 3654 T65 oasc.ZkController.checkRecovery I am the leader, no recovery necessary
[junit4:junit4]   2> 3654 T65 oasc.ZkController.publish publishing core=collection1 state=active
[junit4:junit4]   2> 3655 T65 oasc.ZkController.publish numShards not found on descriptor - reading it from system property
[junit4:junit4]   2> 3657 T65 oascc.ZkStateReader.updateClusterState Updating cloud state from ZooKeeper... 
[junit4:junit4]   2> 3659 T40 oass.SolrDispatchFilter.init user.dir=/mnt/ssd/jenkins/workspace/Lucene-Solr-trunk-Linux/solr/build/solr-core/test/J1
[junit4:junit4]   2> 3660 T40 oass.SolrDispatchFilter.init SolrDispatchFilter.init() done
[junit4:junit4]   2> 3661 T40 oascsi.HttpClientUtil.createClient Creating new http client, config:maxConnections=128&maxConnectionsPerHost=32&followRedirects=false
[junit4:junit4]   2> 3670 T40 oascsi.HttpClientUtil.createClient Creating new http client, config:
[junit4:junit4]   2> 3675 T40 oaz.ZooKeeper.<init> Initiating client connection, connectString=127.0.0.1:36499/solr sessionTimeout=10000 watcher=org.apache.solr.common.cloud.ConnectionManager@2c8ac168
[junit4:junit4]   2> 3677 T40 oascc.ConnectionManager.waitForConnected Waiting for client to connect to ZooKeeper
[junit4:junit4]   2> 3678 T67 oaz.ClientCnxn$SendThread.logStartConnect Opening socket connection to server localhost.localdomain/127.0.0.1:36499. Will not attempt to authenticate using SASL (access denied ("javax.security.auth.AuthPermission" "getLoginConfiguration"))
[junit4:junit4]   2> 3679 T42 oazs.NIOServerCnxnFactory.run Accepted socket connection from /127.0.0.1:54200
[junit4:junit4]   2> 3679 T67 oaz.ClientCnxn$SendThread.primeConnection Socket connection established to localhost.localdomain/127.0.0.1:36499, initiating session
[junit4:junit4]   2> 3680 T42 oazs.ZooKeeperServer.processConnectRequest Client attempting to establish new session at /127.0.0.1:54200
[junit4:junit4]   2> 3681 T44 oazs.ZooKeeperServer.finishSessionInit Established session 0x13d00c859e70004 with negotiated timeout 10000 for client /127.0.0.1:54200
[junit4:junit4]   2> 3681 T67 oaz.ClientCnxn$SendThread.onConnected Session establishment complete on server localhost.localdomain/127.0.0.1:36499, sessionid = 0x13d00c859e70004, negotiated timeout = 10000
[junit4:junit4]   2> 3682 T68 oascc.ConnectionManager.process Watcher org.apache.solr.common.cloud.ConnectionManager@2c8ac168 name:ZooKeeperConnection Watcher:127.0.0.1:36499/solr got event WatchedEvent state:SyncConnected type:None path:null path:null type:None
[junit4:junit4]   2> 3682 T40 oascc.ConnectionManager.waitForConnected Client is connected to ZooKeeper
[junit4:junit4]   2> 3683 T40 oascc.ZkStateReader.createClusterStateWatchersAndUpdate Updating cluster state from ZooKeeper... 
[junit4:junit4]   2> 3686 T40 oasc.ChaosMonkey.monkeyLog monkey: init - expire sessions:true cause connection loss:true
[junit4:junit4]   2> 3746 T40 oejs.Server.doStart jetty-8.1.8.v20121106
[junit4:junit4]   2> 3749 T40 oejs.AbstractConnector.doStart Started SelectChannelConnector@127.0.0.1:37755
[junit4:junit4]   2> 3750 T40 oass.SolrDispatchFilter.init SolrDispatchFilter.init()
[junit4:junit4]   2> 3750 T40 oasc.SolrResourceLoader.locateSolrHome JNDI not configured for solr (NoInitialContextEx)
[junit4:junit4]   2> 3751 T40 oasc.SolrResourceLoader.locateSolrHome using system property solr.solr.home: /mnt/ssd/jenkins/workspace/Lucene-Solr-trunk-Linux/solr/build/solr-core/test/J1/./org.apache.solr.cloud.UnloadDistributedZkTest-jetty1-1361517766639
[junit4:junit4]   2> 3751 T40 oasc.CoreContainer$Initializer.initialize looking for solr.xml: /mnt/ssd/jenkins/workspace/Lucene-Solr-trunk-Linux/solr/build/solr-core/test/J1/./org.apache.solr.cloud.UnloadDistributedZkTest-jetty1-1361517766639/solr.xml
[junit4:junit4]   2> 3752 T40 oasc.CoreContainer.<init> New CoreContainer 1796085355
[junit4:junit4]   2> 3752 T40 oasc.CoreContainer.load Loading CoreContainer using Solr Home: '/mnt/ssd/jenkins/workspace/Lucene-Solr-trunk-Linux/solr/build/solr-core/test/J1/./org.apache.solr.cloud.UnloadDistributedZkTest-jetty1-1361517766639/'
[junit4:junit4]   2> 3753 T40 oasc.SolrResourceLoader.<init> new SolrResourceLoader for directory: '/mnt/ssd/jenkins/workspace/Lucene-Solr-trunk-Linux/solr/build/solr-core/test/J1/./org.apache.solr.cloud.UnloadDistributedZkTest-jetty1-1361517766639/'
[junit4:junit4]   2> 3771 T40 oashc.HttpShardHandlerFactory.getParameter Setting socketTimeout to: 120000
[junit4:junit4]   2> 3771 T40 oashc.HttpShardHandlerFactory.getParameter Setting urlScheme to: http://
[junit4:junit4]   2> 3772 T40 oashc.HttpShardHandlerFactory.getParameter Setting connTimeout to: 15000
[junit4:junit4]   2> 3772 T40 oashc.HttpShardHandlerFactory.getParameter Setting maxConnectionsPerHost to: 20
[junit4:junit4]   2> 3772 T40 oashc.HttpShardHandlerFactory.getParameter Setting corePoolSize to: 0
[junit4:junit4]   2> 3772 T40 oashc.HttpShardHandlerFactory.getParameter Setting maximumPoolSize to: 2147483647
[junit4:junit4]   2> 3773 T40 oashc.HttpShardHandlerFactory.getParameter Setting maxThreadIdleTime to: 5
[junit4:junit4]   2> 3773 T40 oashc.HttpShardHandlerFactory.getParameter Setting sizeOfQueue to: -1
[junit4:junit4]   2> 3773 T40 oashc.HttpShardHandlerFactory.getParameter Setting fairnessPolicy to: false
[junit4:junit4]   2> 3774 T40 oascsi.HttpClientUtil.createClient Creating new http client, config:maxConnectionsPerHost=20&maxConnections=10000&socketTimeout=120000&connTimeout=15000&retry=false
[junit4:junit4]   2> 3783 T40 oasc.CoreContainer.load Registering Log Listener
[junit4:junit4]   2> 3794 T40 oasc.CoreContainer.initZooKeeper Zookeeper client=127.0.0.1:36499/solr
[junit4:junit4]   2> 3795 T40 oasc.ZkController.checkChrootPath zkHost includes chroot
[junit4:junit4]   2> 3795 T40 oaz.ZooKeeper.<init> Initiating client connection, connectString=127.0.0.1:36499 sessionTimeout=60000 watcher=org.apache.solr.common.cloud.ConnectionManager@196dbccb
[junit4:junit4]   2> 3796 T40 oascc.ConnectionManager.waitForConnected Waiting for client to connect to ZooKeeper
[junit4:junit4]   2> 3796 T78 oaz.ClientCnxn$SendThread.logStartConnect Opening socket connection to server localhost.localdomain/127.0.0.1:36499. Will not attempt to authenticate using SASL (access denied ("javax.security.auth.AuthPermission" "getLoginConfiguration"))
[junit4:junit4]   2> 3797 T78 oaz.ClientCnxn$SendThread.primeConnection Socket connection established to localhost.localdomain/127.0.0.1:36499, initiating session
[junit4:junit4]   2> 3797 T42 oazs.NIOServerCnxnFactory.run Accepted socket connection from /127.0.0.1:54201
[junit4:junit4]   2> 3797 T42 oazs.ZooKeeperServer.processConnectRequest Client attempting to establish new session at /127.0.0.1:54201
[junit4:junit4]   2> 3798 T44 oazs.ZooKeeperServer.finishSessionInit Established session 0x13d00c859e70005 with negotiated timeout 20000 for client /127.0.0.1:54201
[junit4:junit4]   2> 3798 T78 oaz.ClientCnxn$SendThread.onConnected Session establishment complete on server localhost.localdomain/127.0.0.1:36499, sessionid = 0x13d00c859e70005, negotiated timeout = 20000
[junit4:junit4]   2> 3799 T79 oascc.ConnectionManager.process Watcher org.apache.solr.common.cloud.ConnectionManager@196dbccb name:ZooKeeperConnection Watcher:127.0.0.1:36499 got event WatchedEvent state:SyncConnected type:None path:null path:null type:None
[junit4:junit4]   2> 3799 T40 oascc.ConnectionManager.waitForConnected Client is connected to ZooKeeper
[junit4:junit4]   2> 3804 T45 oazs.PrepRequestProcessor.pRequest2Txn Processed session termination for sessionid: 0x13d00c859e70005
[junit4:junit4]   2> 3805 T79 oaz.ClientCnxn$EventThread.run EventThread shut down
[junit4:junit4]   2> 3805 T42 oazs.NIOServerCnxn.closeSock Closed socket connection for client /127.0.0.1:54201 which had sessionid 0x13d00c859e70005
[junit4:junit4]   2> 3805 T40 oaz.ZooKeeper.close Session: 0x13d00c859e70005 closed
[junit4:junit4]   2> 3807 T40 oascsi.HttpClientUtil.createClient Creating new http client, config:maxConnections=500&maxConnectionsPerHost=16&socketTimeout=120000&connTimeout=15000
[junit4:junit4]   2> 3810 T40 oaz.ZooKeeper.<init> Initiating client connection, connectString=127.0.0.1:36499/solr sessionTimeout=30000 watcher=org.apache.solr.common.cloud.ConnectionManager@456e5841
[junit4:junit4]   2> 3811 T40 oascc.ConnectionManager.waitForConnected Waiting for client to connect to ZooKeeper
[junit4:junit4]   2> 3811 T80 oaz.ClientCnxn$SendThread.logStartConnect Opening socket connection to server localhost.localdomain/127.0.0.1:36499. Will not attempt to authenticate using SASL (access denied ("javax.security.auth.AuthPermission" "getLoginConfiguration"))
[junit4:junit4]   2> 3812 T80 oaz.ClientCnxn$SendThread.primeConnection Socket connection established to localhost.localdomain/127.0.0.1:36499, initiating session
[junit4:junit4]   2> 3812 T42 oazs.NIOServerCnxnFactory.run Accepted socket connection from /127.0.0.1:54202
[junit4:junit4]   2> 3812 T42 oazs.ZooKeeperServer.processConnectRequest Client attempting to establish new session at /127.0.0.1:54202
[junit4:junit4]   2> 3813 T44 oazs.ZooKeeperServer.finishSessionInit Established session 0x13d00c859e70006 with negotiated timeout 20000 for client /127.0.0.1:54202
[junit4:junit4]   2> 3813 T80 oaz.ClientCnxn$SendThread.onConnected Session establishment complete on server localhost.localdomain/127.0.0.1:36499, sessionid = 0x13d00c859e70006, negotiated timeout = 20000
[junit4:junit4]   2> 3814 T81 oascc.ConnectionManager.process Watcher org.apache.solr.common.cloud.ConnectionManager@456e5841 name:ZooKeeperConnection Watcher:127.0.0.1:36499/solr got event WatchedEvent state:SyncConnected type:None path:null path:null type:None
[junit4:junit4]   2> 3814 T40 oascc.ConnectionManager.waitForConnected Client is connected to ZooKeeper
[junit4:junit4]   2> 3815 T45 oazs.PrepRequestProcessor.pRequest Got user-level KeeperException when processing sessionid:0x13d00c859e70006 type:create cxid:0x1 zxid:0x49 txntype:-1 reqpath:n/a Error Path:/solr/overseer Error:KeeperErrorCode = NodeExists for /solr/overseer
[junit4:junit4]   2> 3816 T45 oazs.PrepRequestProcessor.pRequest Got user-level KeeperException when processing sessionid:0x13d00c859e70006 type:create cxid:0x2 zxid:0x4a txntype:-1 reqpath:n/a Error Path:/solr/overseer Error:KeeperErrorCode = NodeExists for /solr/overseer
[junit4:junit4]   2> 3817 T40 oascc.ZkStateReader.createClusterStateWatchersAndUpdate Updating cluster state from ZooKeeper... 
[junit4:junit4]   2> 4821 T40 oasc.ZkController.createEphemeralLiveNode Register node as live in ZooKeeper:/live_nodes/127.0.0.1:37755_
[junit4:junit4]   2> 4822 T45 oazs.PrepRequestProcessor.pRequest Got user-level KeeperException when processing sessionid:0x13d00c859e70006 type:delete cxid:0x9 zxid:0x4b txntype:-1 reqpath:n/a Error Path:/solr/live_nodes/127.0.0.1:37755_ Error:KeeperErrorCode = NoNode for /solr/live_nodes/127.0.0.1:37755_
[junit4:junit4]   2> 4823 T40 oascc.SolrZkClient.makePath makePath: /live_nodes/127.0.0.1:37755_
[junit4:junit4]   2> 4829 T62 oascc.ZkStateReader$3.process Updating live nodes... (2)
[junit4:junit4]   2> 4829 T68 oascc.ZkStateReader$3.process Updating live nodes... (2)
[junit4:junit4]   2> 4829 T62 oascc.ZkStateReader$2.process A cluster state change: WatchedEvent state:SyncConnected type:NodeChildrenChanged path:/live_nodes, has occurred - updating... (live nodes size: 2)
[junit4:junit4]   2> 4831 T81 oascc.ZkStateReader$3.process Updating live nodes... (2)
[junit4:junit4]   2> 4845 T82 oasc.CoreContainer.create Creating SolrCore 'collection1' using instanceDir: /mnt/ssd/jenkins/workspace/Lucene-Solr-trunk-Linux/solr/build/solr-core/test/J1/./org.apache.solr.cloud.UnloadDistributedZkTest-jetty1-1361517766639/collection1
[junit4:junit4]   2> 4846 T82 oasc.ZkController.createCollectionZkNode Check for collection zkNode:collection1
[junit4:junit4]   2> 4848 T82 oasc.ZkController.createCollectionZkNode Collection zkNode exists
[junit4:junit4]   2> 4849 T82 oasc.ZkController.readConfigName Load collection config from:/collections/collection1
[junit4:junit4]   2> 4852 T82 oasc.SolrResourceLoader.<init> new SolrResourceLoader for directory: '/mnt/ssd/jenkins/workspace/Lucene-Solr-trunk-Linux/solr/build/solr-core/test/J1/./org.apache.solr.cloud.UnloadDistributedZkTest-jetty1-1361517766639/collection1/'
[junit4:junit4]   2> 4853 T82 oasc.SolrResourceLoader.replaceClassLoader Adding 'file:/mnt/ssd/jenkins/workspace/Lucene-Solr-trunk-Linux/solr/build/solr-core/test/J1/org.apache.solr.cloud.UnloadDistributedZkTest-jetty1-1361517766639/collection1/lib/README' to classloader
[junit4:junit4]   2> 4854 T82 oasc.SolrResourceLoader.replaceClassLoader Adding 'file:/mnt/ssd/jenkins/workspace/Lucene-Solr-trunk-Linux/solr/build/solr-core/test/J1/org.apache.solr.cloud.UnloadDistributedZkTest-jetty1-1361517766639/collection1/lib/classes/' to classloader
[junit4:junit4]   2> 4883 T82 oasc.SolrConfig.<init> Using Lucene MatchVersion: LUCENE_50
[junit4:junit4]   2> 4926 T82 oasc.SolrConfig.<init> Loaded SolrConfig: solrconfig.xml
[junit4:junit4]   2> 4927 T82 oass.IndexSchema.readSchema Reading Solr Schema
[junit4:junit4]   2> 4933 T82 oass.IndexSchema.readSchema Schema name=test
[junit4:junit4]   2> 5144 T63 oascc.ZkStateReader.updateClusterState Updating cloud state from ZooKeeper... 
[junit4:junit4]   2> 5144 T63 oasc.Overseer$ClusterStateUpdater.updateState Update state numShards=1 message={
[junit4:junit4]   2> 	  "core":"collection1",
[junit4:junit4]   2> 	  "numShards":"1",
[junit4:junit4]   2> 	  "shard":"shard1",
[junit4:junit4]   2> 	  "roles":null,
[junit4:junit4]   2> 	  "state":"active",
[junit4:junit4]   2> 	  "base_url":"http://127.0.0.1:41143",
[junit4:junit4]   2> 	  "collection":"control_collection",
[junit4:junit4]   2> 	  "node_name":"127.0.0.1:41143_",
[junit4:junit4]   2> 	  "operation":"state"}
[junit4:junit4]   2> 5148 T62 oascc.ZkStateReader$2.process A cluster state change: WatchedEvent state:SyncConnected type:NodeDataChanged path:/clusterstate.json, has occurred - updating... (live nodes size: 2)
[junit4:junit4]   2> 5148 T68 oascc.ZkStateReader$2.process A cluster state change: WatchedEvent state:SyncConnected type:NodeDataChanged path:/clusterstate.json, has occurred - updating... (live nodes size: 2)
[junit4:junit4]   2> 5148 T81 oascc.ZkStateReader$2.process A cluster state change: WatchedEvent state:SyncConnected type:NodeDataChanged path:/clusterstate.json, has occurred - updating... (live nodes size: 2)
[junit4:junit4]   2> 5239 T82 oass.OpenExchangeRatesOrgProvider.init Initialized with rates=open-exchange-rates.json, refreshInterval=1440.
[junit4:junit4]   2> 5245 T82 oass.IndexSchema.readSchema default search field in schema is text
[junit4:junit4]   2> 5251 T82 oass.IndexSchema.readSchema unique key field: id
[junit4:junit4]   2> 5275 T82 oass.FileExchangeRateProvider.reload Reloading exchange rates from file currency.xml
[junit4:junit4]   2> 5279 T82 oass.FileExchangeRateProvider.reload Reloading exchange rates from file currency.xml
[junit4:junit4]   2> 5284 T82 oass.OpenExchangeRatesOrgProvider.reload Reloading exchange rates from open-exchange-rates.json
[junit4:junit4]   2> 5286 T82 oass.OpenExchangeRatesOrgProvider.reload Reloading exchange rates from open-exchange-rates.json
[junit4:junit4]   2> 5288 T82 oasc.SolrCore.<init> [collection1] Opening new SolrCore at /mnt/ssd/jenkins/workspace/Lucene-Solr-trunk-Linux/solr/build/solr-core/test/J1/./org.apache.solr.cloud.UnloadDistributedZkTest-jetty1-1361517766639/collection1/, dataDir=./org.apache.solr.cloud.UnloadDistributedZkTest-1361517762958/jetty1/
[junit4:junit4]   2> 5289 T82 oasc.JmxMonitoredMap.<init> JMX monitoring is enabled. Adding Solr mbeans to JMX Server: com.sun.jmx.mbeanserver.JmxMBeanServer@36262bf5
[junit4:junit4]   2> 5289 T82 oasc.SolrCore.initDirectoryFactory org.apache.solr.core.MockDirectoryFactory
[junit4:junit4]   2> 5290 T82 oasc.CachingDirectoryFactory.get return new directory for /mnt/ssd/jenkins/workspace/Lucene-Solr-trunk-Linux/solr/build/solr-core/test/J1/./org.apache.solr.cloud.UnloadDistributedZkTest-1361517762958/jetty1 forceNew:false
[junit4:junit4]   2> 5290 T82 oasc.CachingDirectoryFactory.close Releasing directory:/mnt/ssd/jenkins/workspace/Lucene-Solr-trunk-Linux/solr/build/solr-core/test/J1/./org.apache.solr.cloud.UnloadDistributedZkTest-1361517762958/jetty1
[junit4:junit4]   2> 5290 T82 oasc.SolrCore.getNewIndexDir New index directory detected: old=null new=./org.apache.solr.cloud.UnloadDistributedZkTest-1361517762958/jetty1/index/
[junit4:junit4]   2> 5291 T82 oasc.SolrCore.initIndex WARNING [collection1] Solr index directory './org.apache.solr.cloud.UnloadDistributedZkTest-1361517762958/jetty1/index' doesn't exist. Creating new index...
[junit4:junit4]   2> 5291 T82 oasc.CachingDirectoryFactory.get return new directory for /mnt/ssd/jenkins/workspace/Lucene-Solr-trunk-Linux/solr/build/solr-core/test/J1/./org.apache.solr.cloud.UnloadDistributedZkTest-1361517762958/jetty1/index forceNew:false
[junit4:junit4]   2> 5293 T82 oasc.SolrDeletionPolicy.onCommit SolrDeletionPolicy.onCommit: commits:num=1
[junit4:junit4]   2> 		commit{dir=MockDirWrapper(org.apache.lucene.store.RAMDirectory@3bcc7247 lockFactory=org.apache.lucene.store.NativeFSLockFactory@1c934e78),segFN=segments_1,generation=1,filenames=[segments_1]
[junit4:junit4]   2> 5293 T82 oasc.SolrDeletionPolicy.updateCommits newest commit = 1[segments_1]
[junit4:junit4]   2> 5294 T82 oasc.CachingDirectoryFactory.close Releasing directory:/mnt/ssd/jenkins/workspace/Lucene-Solr-trunk-Linux/solr/build/solr-core/test/J1/./org.apache.solr.cloud.UnloadDistributedZkTest-1361517762958/jetty1/index
[junit4:junit4]   2> 5296 T82 oasup.UpdateRequestProcessorChain.init inserting DistributedUpdateProcessorFactory into updateRequestProcessorChain "dedupe"
[junit4:junit4]   2> 5296 T82 oasup.UpdateRequestProcessorChain.init inserting DistributedUpdateProcessorFactory into updateRequestProcessorChain "stored_sig"
[junit4:junit4]   2> 5297 T82 oasup.UpdateRequestProcessorChain.init inserting DistributedUpdateProcessorFactory into updateRequestProcessorChain "distrib-dup-test-chain-implicit"
[junit4:junit4]   2> 5297 T82 oasc.RequestHandlers.initHandlersFromConfig created standard: solr.StandardRequestHandler
[junit4:junit4]   2> 5298 T82 oasc.RequestHandlers.initHandlersFromConfig created /get: solr.RealTimeGetHandler
[junit4:junit4]   2> 5298 T82 oasc.RequestHandlers.initHandlersFromConfig adding lazy requestHandler: solr.ReplicationHandler
[junit4:junit4]   2> 5298 T82 oasc.RequestHandlers.initHandlersFromConfig created /replication: solr.ReplicationHandler
[junit4:junit4]   2> 5299 T82 oasc.RequestHandlers.initHandlersFromConfig created /update: solr.UpdateRequestHandler
[junit4:junit4]   2> 5299 T82 oasc.RequestHandlers.initHandlersFromConfig created /admin/: org.apache.solr.handler.admin.AdminHandlers
[junit4:junit4]   2> 5302 T82 oashl.XMLLoader.init xsltCacheLifetimeSeconds=60
[junit4:junit4]   2> 5305 T82 oasc.CachingDirectoryFactory.close Releasing directory:/mnt/ssd/jenkins/workspace/Lucene-Solr-trunk-Linux/solr/build/solr-core/test/J1/./org.apache.solr.cloud.UnloadDistributedZkTest-1361517762958/jetty1
[junit4:junit4]   2> 5306 T82 oass.SolrIndexSearcher.<init> Opening Searcher@65a26ea0 main
[junit4:junit4]   2> 5306 T82 oasu.UpdateHandler.clearLog Clearing tlog files, tlogDir=./org.apache.solr.cloud.UnloadDistributedZkTest-1361517762958/jetty1/tlog
[junit4:junit4]   2> 5307 T82 oasu.CommitTracker.<init> Hard AutoCommit: disabled
[junit4:junit4]   2> 5307 T82 oasu.CommitTracker.<init> Soft AutoCommit: disabled
[junit4:junit4]   2> 5311 T82 oasc.CachingDirectoryFactory.close Releasing directory:/mnt/ssd/jenkins/workspace/Lucene-Solr-trunk-Linux/solr/build/solr-core/test/J1/./org.apache.solr.cloud.UnloadDistributedZkTest-1361517762958/jetty1
[junit4:junit4]   2> 5314 T82 oasc.ZkController.publish publishing core=collection1 state=down
[junit4:junit4]   2> 5314 T82 oasc.ZkController.publish numShards not found on descriptor - reading it from system property
[junit4:junit4]   2> 5322 T83 oasc.SolrCore.registerSearcher [collection1] Registered new searcher Searcher@65a26ea0 main{StandardDirectoryReader(segments_1:1)}
[junit4:junit4]   2> 6653 T63 oascc.ZkStateReader.updateClusterState Updating cloud state from ZooKeeper... 
[junit4:junit4]   2> 6654 T63 oasc.Overseer$ClusterStateUpdater.updateState Update state numShards=2 message={
[junit4:junit4]   2> 	  "core":"collection1",
[junit4:junit4]   2> 	  "numShards":"2",
[junit4:junit4]   2> 	  "shard":null,
[junit4:junit4]   2> 	  "roles":null,
[junit4:junit4]   2> 	  "state":"down",
[junit4:junit4]   2> 	  "base_url":"http://127.0.0.1:37755",
[junit4:junit4]   2> 	  "collection":"collection1",
[junit4:junit4]   2> 	  "node_name":"127.0.0.1:37755_",
[junit4:junit4]   2> 	  "operation":"state"}
[junit4:junit4]   2> 6654 T63 oasc.Overseer$ClusterStateUpdater.createCollection Create collection collection1 with numShards 2
[junit4:junit4]   2> 6655 T63 oasc.Overseer$ClusterStateUpdater.updateState Assigning new node to shard shard=shard2
[junit4:junit4]   2> 6661 T81 oascc.ZkStateReader$2.process A cluster state change: WatchedEvent state:SyncConnected type:NodeDataChanged path:/clusterstate.json, has occurred - updating... (live nodes size: 2)
[junit4:junit4]   2> 6661 T68 oascc.ZkStateReader$2.process A cluster state change: WatchedEvent state:SyncConnected type:NodeDataChanged path:/clusterstate.json, has occurred - updating... (live nodes size: 2)
[junit4:junit4]   2> 6661 T62 oascc.ZkStateReader$2.process A cluster state change: WatchedEvent state:SyncConnected type:NodeDataChanged path:/clusterstate.json, has occurred - updating... (live nodes size: 2)
[junit4:junit4]   2> 7316 T82 oasc.CoreContainer.registerCore registering core: collection1
[junit4:junit4]   2> 7316 T82 oasc.ZkController.register Register replica - core:collection1 address:http://127.0.0.1:37755 collection:collection1 shard:shard2
[junit4:junit4]   2> 7318 T82 oascc.SolrZkClient.makePath makePath: /collections/collection1/leader_elect/shard2/election
[junit4:junit4]   2> 7330 T45 oazs.PrepRequestProcessor.pRequest Got user-level KeeperException when processing sessionid:0x13d00c859e70006 type:delete cxid:0x46 zxid:0x5b txntype:-1 reqpath:n/a Error Path:/solr/collections/collection1/leaders Error:KeeperErrorCode = NoNode for /solr/collections/collection1/leaders
[junit4:junit4]   2> 7331 T82 oasc.ShardLeaderElectionContext.runLeaderProcess Running the leader process.
[junit4:junit4]   2> 7331 T45 oazs.PrepRequestProcessor.pRequest Got user-level KeeperException when processing sessionid:0x13d00c859e70006 type:create cxid:0x47 zxid:0x5c txntype:-1 reqpath:n/a Error Path:/solr/overseer Error:KeeperErrorCode = NodeExists for /solr/overseer
[junit4:junit4]   2> 7334 T82 oasc.ShardLeaderElectionContext.waitForReplicasToComeUp Enough replicas found to continue.
[junit4:junit4]   2> 7335 T82 oasc.ShardLeaderElectionContext.runLeaderProcess I may be the new leader - try and sync
[junit4:junit4]   2> 7335 T82 oasc.SyncStrategy.sync Sync replicas to http://127.0.0.1:37755/collection1/
[junit4:junit4]   2> 7336 T82 oasc.SyncStrategy.syncReplicas Sync Success - now sync replicas to me
[junit4:junit4]   2> 7336 T82 oasc.SyncStrategy.syncToMe http://127.0.0.1:37755/collection1/ has no replicas
[junit4:junit4]   2> 7336 T82 oasc.ShardLeaderElectionContext.runLeaderProcess I am the new leader: http://127.0.0.1:37755/collection1/
[junit4:junit4]   2> 7337 T82 oascc.SolrZkClient.makePath makePath: /collections/collection1/leaders/shard2
[junit4:junit4]   2> 7344 T45 oazs.PrepRequestProcessor.pRequest Got user-level KeeperException when processing sessionid:0x13d00c859e70006 type:create cxid:0x51 zxid:0x60 txntype:-1 reqpath:n/a Error Path:/solr/overseer Error:KeeperErrorCode = NodeExists for /solr/overseer
[junit4:junit4]   2> 8166 T63 oascc.ZkStateReader.updateClusterState Updating cloud state from ZooKeeper... 
[junit4:junit4]   2> 8176 T62 oascc.ZkStateReader$2.process A cluster state change: WatchedEvent state:SyncConnected type:NodeDataChanged path:/clusterstate.json, has occurred - updating... (live nodes size: 2)
[junit4:junit4]   2> 8176 T68 oascc.ZkStateReader$2.process A cluster state change: WatchedEvent state:SyncConnected type:NodeDataChanged path:/clusterstate.json, has occurred - updating... (live nodes size: 2)
[junit4:junit4]   2> 8176 T81 oascc.ZkStateReader$2.process A cluster state change: WatchedEvent state:SyncConnected type:NodeDataChanged path:/clusterstate.json, has occurred - updating... (live nodes size: 2)
[junit4:junit4]   2> 8199 T82 oasc.ZkController.register We are http://127.0.0.1:37755/collection1/ and leader is http://127.0.0.1:37755/collection1/
[junit4:junit4]   2> 8199 T82 oasc.ZkController.register No LogReplay needed for core=collection1 baseURL=http://127.0.0.1:37755
[junit4:junit4]   2> 8200 T82 oasc.ZkController.checkRecovery I am the leader, no recovery necessary
[junit4:junit4]   2> 8200 T82 oasc.ZkController.publish publishing core=collection1 state=active
[junit4:junit4]   2> 8200 T82 oasc.ZkController.publish numShards not found on descriptor - reading it from system property
[junit4:junit4]   2> 8202 T82 oascc.ZkStateReader.updateClusterState Updating cloud state from ZooKeeper... 
[junit4:junit4]   2> 8203 T40 oass.SolrDispatchFilter.init user.dir=/mnt/ssd/jenkins/workspace/Lucene-Solr-trunk-Linux/solr/build/solr-core/test/J1
[junit4:junit4]   2> 8203 T40 oass.SolrDispatchFilter.init SolrDispatchFilter.init() done
[junit4:junit4]   2> 8204 T40 oascsi.HttpClientUtil.createClient Creating new http client, config:maxConnections=128&maxConnectionsPerHost=32&followRedirects=false
[junit4:junit4]   2> 8259 T40 oejs.Server.doStart jetty-8.1.8.v20121106
[junit4:junit4]   2> 8261 T40 oejs.AbstractConnector.doStart Started SelectChannelConnector@127.0.0.1:41721
[junit4:junit4]   2> 8262 T40 oass.SolrDispatchFilter.init SolrDispatchFilter.init()
[junit4:junit4]   2> 8262 T40 oasc.SolrResourceLoader.locateSolrHome JNDI not configured for solr (NoInitialContextEx)
[junit4:junit4]   2> 8263 T40 oasc.SolrResourceLoader.locateSolrHome using system property solr.solr.home: /mnt/ssd/jenkins/workspace/Lucene-Solr-trunk-Linux/solr/build/solr-core/test/J1/./org.apache.solr.cloud.UnloadDistributedZkTest-jetty2-1361517771160
[junit4:junit4]   2> 8263 T40 oasc.CoreContainer$Initializer.initialize looking for solr.xml: /mnt/ssd/jenkins/workspace/Lucene-Solr-trunk-Linux/solr/build/solr-core/test/J1/./org.apache.solr.cloud.UnloadDistributedZkTest-jetty2-1361517771160/solr.xml
[junit4:junit4]   2> 8263 T40 oasc.CoreContainer.<init> New CoreContainer 1706576125
[junit4:junit4]   2> 8264 T40 oasc.CoreContainer.load Loading CoreContainer using Solr Home: '/mnt/ssd/jenkins/workspace/Lucene-Solr-trunk-Linux/solr/build/solr-core/test/J1/./org.apache.solr.cloud.UnloadDistributedZkTest-jetty2-1361517771160/'
[junit4:junit4]   2> 8264 T40 oasc.SolrResourceLoader.<init> new SolrResourceLoader for directory: '/mnt/ssd/jenkins/workspace/Lucene-Solr-trunk-Linux/solr/build/solr-core/test/J1/./org.apache.solr.cloud.UnloadDistributedZkTest-jetty2-1361517771160/'
[junit4:junit4]   2> 8289 T40 oashc.HttpShardHandlerFactory.getParameter Setting socketTimeout to: 120000
[junit4:junit4]   2> 8290 T40 oashc.HttpShardHandlerFactory.getParameter Setting urlScheme to: http://
[junit4:junit4]   2> 8290 T40 oashc.HttpShardHandlerFactory.getParameter Setting connTimeout to: 15000
[junit4:junit4]   2> 8290 T40 oashc.HttpShardHandlerFactory.getParameter Setting maxConnectionsPerHost to: 20
[junit4:junit4]   2> 8291 T40 oashc.HttpShardHandlerFactory.getParameter Setting corePoolSize to: 0
[junit4:junit4]   2> 8291 T40 oashc.HttpShardHandlerFactory.getParameter Setting maximumPoolSize to: 2147483647
[junit4:junit4]   2> 8291 T40 oashc.HttpShardHandlerFactory.getParameter Setting maxThreadIdleTime to: 5
[junit4:junit4]   2> 8292 T40 oashc.HttpShardHandlerFactory.getParameter Setting sizeOfQueue to: -1
[junit4:junit4]   2> 8292 T40 oashc.HttpShardHandlerFactory.getParameter Setting fairnessPolicy to: false
[junit4:junit4]   2> 8292 T40 oascsi.HttpClientUtil.createClient Creating new http client, config:maxConnectionsPerHost=20&maxConnections=10000&socketTimeout=120000&connTimeout=15000&retry=false
[junit4:junit4]   2> 8299 T40 oasc.CoreContainer.load Registering Log Listener
[junit4:junit4]   2> 8309 T40 oasc.CoreContainer.initZooKeeper Zookeeper client=127.0.0.1:36499/solr
[junit4:junit4]   2> 8309 T40 oasc.ZkController.checkChrootPath zkHost includes chroot
[junit4:junit4]   2> 8310 T40 oaz.ZooKeeper.<init> Initiating client connection, connectString=127.0.0.1:36499 sessionTimeout=60000 watcher=org.apache.solr.common.cloud.ConnectionManager@5018259d
[junit4:junit4]   2> 8310 T40 oascc.ConnectionManager.waitForConnected Waiting for client to connect to ZooKeeper
[junit4:junit4]   2> 8311 T93 oaz.ClientCnxn$SendThread.logStartConnect Opening socket connection to server localhost.localdomain/127.0.0.1:36499. Will not attempt to authenticate using SASL (access denied ("javax.security.auth.AuthPermission" "getLoginConfiguration"))
[junit4:junit4]   2> 8311 T93 oaz.ClientCnxn$SendThread.primeConnection Socket connection established to localhost.localdomain/127.0.0.1:36499, initiating session
[junit4:junit4]   2> 8312 T42 oazs.NIOServerCnxnFactory.run Accepted socket connection from /127.0.0.1:54205
[junit4:junit4]   2> 8312 T42 oazs.ZooKeeperServer.processConnectRequest Client attempting to establish new session at /127.0.0.1:54205
[junit4:junit4]   2> 8314 T44 oazs.ZooKeeperServer.finishSessionInit Established session 0x13d00c859e70007 with negotiated timeout 20000 for client /127.0.0.1:54205
[junit4:junit4]   2> 8314 T93 oaz.ClientCnxn$SendThread.onConnected Session establishment complete on server localhost.localdomain/127.0.0.1:36499, sessionid = 0x13d00c859e70007, negotiated timeout = 20000
[junit4:junit4]   2> 8315 T94 oascc.ConnectionManager.process Watcher org.apache.solr.common.cloud.ConnectionManager@5018259d name:ZooKeeperConnection Watcher:127.0.0.1:36499 got event WatchedEvent state:SyncConnected type:None path:null path:null type:None
[junit4:junit4]   2> 8315 T40 oascc.ConnectionManager.waitForConnected Client is connected to ZooKeeper
[junit4:junit4]   2> 8316 T45 oazs.PrepRequestProcessor.pRequest2Txn Processed session termination for sessionid: 0x13d00c859e70007
[junit4:junit4]   2> 8317 T94 oaz.ClientCnxn$EventThread.run EventThread shut down
[junit4:junit4]   2> 8317 T40 oaz.ZooKeeper.close Session: 0x13d00c859e70007 closed
[junit4:junit4]   2> 8318 T42 oazs.NIOServerCnxn.closeSock Closed socket connection for client /127.0.0.1:54205 which had sessionid 0x13d00c859e70007
[junit4:junit4]   2> 8318 T40 oascsi.HttpClientUtil.createClient Creating new http client, config:maxConnections=500&maxConnectionsPerHost=16&socketTimeout=120000&connTimeout=15000
[junit4:junit4]   2> 8322 T40 oaz.ZooKeeper.<init> Initiating client connection, connectString=127.0.0.1:36499/solr sessionTimeout=30000 watcher=org.apache.solr.common.cloud.ConnectionManager@492b8031
[junit4:junit4]   2> 8323 T40 oascc.ConnectionManager.waitForConnected Waiting for client to connect to ZooKeeper
[junit4:junit4]   2> 8323 T95 oaz.ClientCnxn$SendThread.logStartConnect Opening socket connection to server localhost.localdomain/127.0.0.1:36499. Will not attempt to authenticate using SASL (access denied ("javax.security.auth.AuthPermission" "getLoginConfiguration"))
[junit4:junit4]   2> 8324 T42 oazs.NIOServerCnxnFactory.run Accepted socket connection from /127.0.0.1:54206
[junit4:junit4]   2> 8325 T95 oaz.ClientCnxn$SendThread.primeConnection Socket connection established to localhost.localdomain/127.0.0.1:36499, initiating session
[junit4:junit4]   2> 8325 T42 oazs.ZooKeeperServer.processConnectRequest Client attempting to establish new session at /127.0.0.1:54206
[junit4:junit4]   2> 8326 T44 oazs.ZooKeeperServer.finishSessionInit Established session 0x13d00c859e70008 with negotiated timeout 20000 for client /127.0.0.1:54206
[junit4:junit4]   2> 8326 T95 oaz.ClientCnxn$SendThread.onConnected Session establishment complete on server localhost.localdomain/127.0.0.1:36499, sessionid = 0x13d00c859e70008, negotiated timeout = 20000
[junit4:junit4]   2> 8327 T96 oascc.ConnectionManager.process Watcher org.apache.solr.common.cloud.ConnectionManager@492b8031 name:ZooKeeperConnection Watcher:127.0.0.1:36499/solr got event WatchedEvent state:SyncConnected type:None path:null path:null type:None
[junit4:junit4]   2> 8327 T40 oascc.ConnectionManager.waitForConnected Client is connected to ZooKeeper
[junit4:junit4]   2> 8328 T45 oazs.PrepRequestProcessor.pRequest Got user-level KeeperException when processing sessionid:0x13d00c859e70008 type:create cxid:0x1 zxid:0x6d txntype:-1 reqpath:n/a Error Path:/solr/overseer Error:KeeperErrorCode = NodeExists for /solr/overseer
[junit4:junit4]   2> 8329 T45 oazs.PrepRequestProcessor.pRequest Got user-level KeeperException when processing sessionid:0x13d00c859e70008 type:create cxid:0x2 zxid:0x6e txntype:-1 reqpath:n/a Error Path:/solr/overseer Error:KeeperErrorCode = NodeExists for /solr/overseer
[junit4:junit4]   2> 8330 T40 oascc.ZkStateReader.createClusterStateWatchersAndUpdate Updating cluster state from ZooKeeper... 
[junit4:junit4]   2> 9337 T40 oasc.ZkController.createEphemeralLiveNode Register node as live in ZooKeeper:/live_nodes/127.0.0.1:41721_
[junit4:junit4]   2> 9338 T45 oazs.PrepRequestProcessor.pRequest Got user-level KeeperException when processing sessionid:0x13d00c859e70008 type:delete cxid:0x9 zxid:0x6f txntype:-1 reqpath:n/a Error Path:/solr/live_nodes/127.0.0.1:41721_ Error:KeeperErrorCode = NoNode for /solr/live_nodes/127.0.0.1:41721_
[junit4:junit4]   2> 9339 T40 oascc.SolrZkClient.makePath makePath: /live_nodes/127.0.0.1:41721_
[junit4:junit4]   2> 9343 T62 oascc.ZkStateReader$2.process A cluster state change: WatchedEvent state:SyncConnected type:NodeChildrenChanged path:/live_nodes, has occurred - updating... (live nodes size: 2)
[junit4:junit4]   2> 9343 T68 oascc.ZkStateReader$2.process A cluster state change: WatchedEvent state:SyncConnected type:NodeChildrenChanged path:/live_nodes, has occurred - updating... (live nodes size: 2)
[junit4:junit4]   2> 9344 T81 oascc.ZkStateReader$3.process Updating live nodes... (3)
[junit4:junit4]   2> 9344 T81 oascc.ZkStateReader$2.process A cluster state change: WatchedEvent state:SyncConnected type:NodeChildrenChanged path:/live_nodes, has occurred - updating... (live nodes size: 3)
[junit4:junit4]   2> 9345 T96 oascc.ZkStateReader$3.process Updating live nodes... (3)
[junit4:junit4]   2> 9347 T62 oascc.ZkStateReader$3.process Updating live nodes... (3)
[junit4:junit4]   2> 9348 T68 oascc.ZkStateReader$3.process Updating live nodes... (3)
[junit4:junit4]   2> 9356 T97 oasc.CoreContainer.create Creating SolrCore 'collection1' using instanceDir: /mnt/ssd/jenkins/workspace/Lucene-Solr-trunk-Linux/solr/build/solr-core/test/J1/./org.apache.solr.cloud.UnloadDistributedZkTest-jetty2-1361517771160/collection1
[junit4:junit4]   2> 9357 T97 oasc.ZkController.createCollectionZkNode Check for collection zkNode:collection1
[junit4:junit4]   2> 9358 T97 oasc.ZkController.createCollectionZkNode Collection zkNode exists
[junit4:junit4]   2> 9358 T97 oasc.ZkController.readConfigName Load collection config from:/collections/collection1
[junit4:junit4]   2> 9361 T97 oasc.SolrResourceLoader.<init> new SolrResourceLoader for directory: '/mnt/ssd/jenkins/workspace/Lucene-Solr-trunk-Linux/solr/build/solr-core/test/J1/./org.apache.solr.cloud.UnloadDistributedZkTest-jetty2-1361517771160/collection1/'
[junit4:junit4]   2> 9362 T97 oasc.SolrResourceLoader.replaceClassLoader Adding 'file:/mnt/ssd/jenkins/workspace/Lucene-Solr-trunk-Linux/solr/build/solr-core/test/J1/org.apache.solr.cloud.UnloadDistributedZkTest-jetty2-1361517771160/collection1/lib/README' to classloader
[junit4:junit4]   2> 9362 T97 oasc.SolrResourceLoader.replaceClassLoader Adding 'file:/mnt/ssd/jenkins/workspace/Lucene-Solr-trunk-Linux/solr/build/solr-core/test/J1/org.apache.solr.cloud.UnloadDistributedZkTest-jetty2-1361517771160/collection1/lib/classes/' to classloader
[junit4:junit4]   2> 9398 T97 oasc.SolrConfig.<init> Using Lucene MatchVersion: LUCENE_50
[junit4:junit4]   2> 9425 T97 oasc.SolrConfig.<init> Loaded SolrConfig: solrconfig.xml
[junit4:junit4]   2> 9426 T97 oass.IndexSchema.readSchema Reading Solr Schema
[junit4:junit4]   2> 9431 T97 oass.IndexSchema.readSchema Schema name=test
[junit4:junit4]   2> 9687 T63 oascc.ZkStateReader.updateClusterState Updating cloud state from ZooKeeper... 
[junit4:junit4]   2> 9688 T63 oasc.Overseer$ClusterStateUpdater.updateState Update state numShards=2 message={
[junit4:junit4]   2> 	  "core":"collection1",
[junit4:junit4]   2> 	  "numShards":"2",
[junit4:junit4]   2> 	  "shard":"shard2",
[junit4:junit4]   2> 	  "roles":null,
[junit4:junit4]   2> 	  "state":"active",
[junit4:junit4]   2> 	  "base_url":"http://127.0.0.1:37755",
[junit4:junit4]   2> 	  "collection":"collection1",
[junit4:junit4]   2> 	  "node_name":"127.0.0.1:37755_",
[junit4:junit4]   2> 	  "operation":"state"}
[junit4:junit4]   2> 9692 T81 oascc.ZkStateReader$2.process A cluster state change: WatchedEvent state:SyncConnected type:NodeDataChanged path:/clusterstate.json, has occurred - updating... (live nodes size: 3)
[junit4:junit4]   2> 9692 T62 oascc.ZkStateReader$2.process A cluster state change: WatchedEvent state:SyncConnected type:NodeDataChanged path:/clusterstate.json, has occurred - updating... (live nodes size: 3)
[junit4:junit4]   2> 9692 T68 oascc.ZkStateReader$2.process A cluster state change: WatchedEvent state:SyncConnected type:NodeDataChanged path:/clusterstate.json, has occurred - updating... (live nodes size: 3)
[junit4:junit4]   2> 9692 T96 oascc.ZkStateReader$2.process A cluster state change: WatchedEvent state:SyncConnected type:NodeDataChanged path:/clusterstate.json, has occurred - updating... (live nodes size: 3)
[junit4:junit4]   2> 9722 T97 oass.OpenExchangeRatesOrgProvider.init Initialized with rates=open-exchange-rates.json, refreshInterval=1440.
[junit4:junit4]   2> 9727 T97 oass.IndexSchema.readSchema default search field in schema is text
[junit4:junit4]   2> 9729 T97 oass.IndexSchema.readSchema unique key field: id
[junit4:junit4]   2> 9744 T97 oass.FileExchangeRateProvider.reload Reloading exchange rates from file currency.xml
[junit4:junit4]   2> 9747 T97 oass.FileExchangeRateProvider.reload Reloading exchange rates from file currency.xml
[junit4:junit4]   2> 9750 T97 oass.OpenExchangeRatesOrgProvider.reload Reloading exchange rates from open-exchange-rates.json
[junit4:junit4]   2> 9751 T97 oass.OpenExchangeRatesOrgProvider.reload Reloading exchange rates from open-exchange-rates.json
[junit4:junit4]   2> 9753 T97 oasc.SolrCore.<init> [collection1] Opening new SolrCore at /mnt/ssd/jenkins/workspace/Lucene-Solr-trunk-Linux/solr/build/solr-core/test/J1/./org.apache.solr.cloud.UnloadDistributedZkTest-jetty2-1361517771160/collection1/, dataDir=./org.apache.solr.cloud.UnloadDistributedZkTest-1361517762958/jetty2/
[junit4:junit4]   2> 9753 T97 oasc.JmxMonitoredMap.<init> JMX monitoring is enabled. Adding Solr mbeans to JMX Server: com.sun.jmx.mbeanserver.JmxMBeanServer@36262bf5
[junit4:junit4]   2> 9754 T97 oasc.SolrCore.initDirectoryFactory org.apache.solr.core.MockDirectoryFactory
[junit4:junit4]   2> 9754 T97 oasc.CachingDirectoryFactory.get return new directory for /mnt/ssd/jenkins/workspace/Lucene-Solr-trunk-Linux/solr/build/solr-core/test/J1/./org.apache.solr.cloud.UnloadDistributedZkTest-1361517762958/jetty2 forceNew:false
[junit4:junit4]   2> 9754 T97 oasc.CachingDirectoryFactory.close Releasing directory:/mnt/ssd/jenkins/workspace/Lucene-Solr-trunk-Linux/solr/build/solr-core/test/J1/./org.apache.solr.cloud.UnloadDistributedZkTest-1361517762958/jetty2
[junit4:junit4]   2> 9754 T97 oasc.SolrCore.getNewIndexDir New index directory detected: old=null new=./org.apache.solr.cloud.UnloadDistributedZkTest-1361517762958/jetty2/index/
[junit4:junit4]   2> 9755 T97 oasc.SolrCore.initIndex WARNING [collection1] Solr index directory './org.apache.solr.cloud.UnloadDistributedZkTest-1361517762958/jetty2/index' doesn't exist. Creating new index...
[junit4:junit4]   2> 9756 T97 oasc.CachingDirectoryFactory.get return new directory for /mnt/ssd/jenkins/workspace/Lucene-Solr-trunk-Linux/solr/build/solr-core/test/J1/./org.apache.solr.cloud.UnloadDistributedZkTest-1361517762958/jetty2/index forceNew:false
[junit4:junit4]   2> 9757 T97 oasc.SolrDeletionPolicy.onCommit SolrDeletionPolicy.onCommit: commits:num=1
[junit4:junit4]   2> 		commit{dir=MockDirWrapper(org.apache.lucene.store.RAMDirectory@2dba911d lockFactory=org.apache.lucene.store.NativeFSLockFactory@75c50969),segFN=segments_1,generation=1,filenames=[segments_1]
[junit4:junit4]   2> 9757 T97 oasc.SolrDeletionPolicy.updateCommits newest commit = 1[segments_1]
[junit4:junit4]   2> 9757 T97 oasc.CachingDirectoryFactory.close Releasing directory:/mnt/ssd/jenkins/workspace/Lucene-Solr-trunk-Linux/solr/build/solr-core/test/J1/./org.apache.solr.cloud.UnloadDistributedZkTest-1361517762958/jetty2/index
[junit4:junit4]   2> 9759 T97 oasup.UpdateRequestProcessorChain.init inserting DistributedUpdateProcessorFactory into updateRequestProcessorChain "dedupe"
[junit4:junit4]   2> 9759 T97 oasup.UpdateRequestProcessorChain.init inserting DistributedUpdateProcessorFactory into updateRequestProcessorChain "stored_sig"
[junit4:junit4]   2> 9760 T97 oasup.UpdateRequestProcessorChain.init inserting DistributedUpdateProcessorFactory into updateRequestProcessorChain "distrib-dup-test-chain-implicit"
[junit4:junit4]   2> 9761 T97 oasc.RequestHandlers.initHandlersFromConfig created standard: solr.StandardRequestHandler
[junit4:junit4]   2> 9761 T97 oasc.RequestHandlers.initHandlersFromConfig created /get: solr.RealTimeGetHandler
[junit4:junit4]   2> 9761 T97 oasc.RequestHandlers.initHandlersFromConfig adding lazy requestHandler: solr.ReplicationHandler
[junit4:junit4]   2> 9761 T97 oasc.RequestHandlers.initHandlersFromConfig created /replication: solr.ReplicationHandler
[junit4:junit4]   2> 9762 T97 oasc.RequestHandlers.initHandlersFromConfig created /update: solr.UpdateRequestHandler
[junit4:junit4]   2> 9762 T97 oasc.RequestHandlers.initHandlersFromConfig created /admin/: org.apache.solr.handler.admin.AdminHandlers
[junit4:junit4]   2> 9764 T97 oashl.XMLLoader.init xsltCacheLifetimeSeconds=60
[junit4:junit4]   2> 9766 T97 oasc.CachingDirectoryFactory.close Releasing directory:/mnt/ssd/jenkins/workspace/Lucene-Solr-trunk-Linux/solr/build/solr-core/test/J1/./org.apache.solr.cloud.UnloadDistributedZkTest-1361517762958/jetty2
[junit4:junit4]   2> 9767 T97 oass.SolrIndexSearcher.<init> Opening Searcher@26febb57 main
[junit4:junit4]   2> 9767 T97 oasu.UpdateHandler.clearLog Clearing tlog files, tlogDir=./org.apache.solr.cloud.UnloadDistributedZkTest-1361517762958/jetty2/tlog
[junit4:junit4]   2> 9768 T97 oasu.CommitTracker.<init> Hard AutoCommit: disabled
[junit4:junit4]   2> 9768 T97 oasu.CommitTracker.<init> Soft AutoCommit: disabled
[junit4:junit4]   2> 9771 T98 oasc.SolrCore.registerSearcher [collection1] Registered new searcher Searcher@26febb57 main{StandardDirectoryReader(segments_1:1)}
[junit4:junit4]   2> 9773 T97 oasc.ZkController.publish publishing core=collection1 state=down
[junit4:junit4]   2> 9773 T97 oasc.ZkController.publish numShards not found on descriptor - reading it from system property
[junit4:junit4]   2> 11199 T63 oascc.ZkStateReader.updateClusterState Updating cloud state from ZooKeeper... 
[junit4:junit4]   2> 11200 T63 oasc.Overseer$ClusterStateUpdater.updateState Update state numShards=2 message={
[junit4:junit4]   2> 	  "core":"collection1",
[junit4:junit4]   2> 	  "numShards":"2",
[junit4:junit4]   2> 	  "shard":null,
[junit4:junit4]   2> 	  "roles":null,
[junit4:junit4]   2> 	  "state":"down",
[junit4:junit4]   2> 	  "base_url":"http://127.0.0.1:41721",
[junit4:junit4]   2> 	  "collection":"collection1",
[junit4:junit4]   2> 	  "node_name":"127.0.0.1:41721_",
[junit4:junit4]   2> 	  "operation":"state"}
[junit4:junit4]   2> 11201 T63 oasc.Overseer$ClusterStateUpdater.updateState Collection already exists with numShards=2
[junit4:junit4]   2> 11201 T63 oasc.Overseer$ClusterStateUpdater.updateState Assigning new node to shard shard=shard1
[junit4:junit4]   2> 11206 T81 oascc.ZkStateReader$2.process A cluster state change: WatchedEvent state:SyncConnected type:NodeDataChanged path:/clusterstate.json, has occurred - updating... (live nodes size: 3)
[junit4:junit4]   2> 11206 T68 oascc.ZkStateReader$2.process A cluster state change: WatchedEvent state:SyncConnected type:NodeDataChanged path:/clusterstate.json, has occurred - updating... (live nodes size: 3)
[junit4:junit4]   2> 11206 T62 oascc.ZkStateReader$2.process A cluster state change: WatchedEvent state:SyncConnected type:NodeDataChanged path:/clusterstate.json, has occurred - updating... (live nodes size: 3)
[junit4:junit4]   2> 11206 T96 oascc.ZkStateReader$2.process A cluster state change: WatchedEvent state:SyncConnected type:NodeDataChanged path:/clusterstate.json, has occurred - updating... (live nodes size: 3)
[junit4:junit4]   2> 11774 T97 oasc.CoreContainer.registerCore registering core: collection1
[junit4:junit4]   2> 11775 T97 oasc.ZkController.register Register replica - core:collection1 address:http://127.0.0.1:41721 collection:collection1 shard:shard1
[junit4:junit4]   2> 11776 T97 oascc.SolrZkClient.makePath makePath: /collections/collection1/leader_elect/shard1/election
[junit4:junit4]   2> 11786 T45 oazs.PrepRequestProcessor.pRequest Got user-level KeeperException when processing sessionid:0x13d00c859e70008 type:delete cxid:0x45 zxid:0x7e txntype:-1 reqpath:n/a Error Path:/solr/collections/collection1/leaders/shard1 Error:KeeperErrorCode = NoNode for /solr/collections/collection1/leaders/shard1
[junit4:junit4]   2> 11787 T97 oasc.ShardLeaderElectionContext.runLeaderProcess Running the leader process.
[junit4:junit4]   2> 11787 T45 oazs.PrepRequestProcessor.pRequest Got user-level KeeperException when processing sessionid:0x13d00c859e70008 type:create cxid:0x46 zxid:0x7f txntype:-1 reqpath:n/a Error Path:/solr/overseer Error:KeeperErrorCode = NodeExists for /solr/overseer
[junit4:junit4]   2> 11789 T97 oasc.ShardLeaderElectionContext.waitForReplicasToComeUp Enough replicas found to continue.
[junit4:junit4]   2> 11789 T97 oasc.ShardLeaderElectionContext.runLeaderProcess I may be the new leader - try and sync
[junit4:junit4]   2> 11789 T97 oasc.SyncStrategy.sync Sync replicas to http://127.0.0.1:41721/collection1/
[junit4:junit4]   2> 11790 T97 oasc.SyncStrategy.syncReplicas Sync Success - now sync replicas to me
[junit4:junit4]   2> 11790 T97 oasc.SyncStrategy.syncToMe http://127.0.0.1:41721/collection1/ has no replicas
[junit4:junit4]   2> 11790 T97 oasc.ShardLeaderElectionContext.runLeaderProcess I am the new leader: http://127.0.0.1:41721/collection1/
[junit4:junit4]   2> 11790 T97 oascc.SolrZkClient.makePath makePath: /collections/collection1/leaders/shard1
[junit4:junit4]   2> 11793 T45 oazs.PrepRequestProcessor.pRequest Got user-level KeeperException when processing sessionid:0x13d00c859e70008 type:create cxid:0x4f zxid:0x82 txntype:-1 reqpath:n/a Error Path:/solr/overseer Error:KeeperErrorCode = NodeExists for /solr/overseer
[junit4:junit4]   2> 12711 T63 oascc.ZkStateReader.updateClusterState Updating cloud state from ZooKeeper... 
[junit4:junit4]   2> 12717 T62 oascc.ZkStateReader$2.process A cluster state change: WatchedEvent state:SyncConnected type:NodeDataChanged path:/clusterstate.json, has occurred - updating... (live nodes size: 3)
[junit4:junit4]   2> 12717 T81 oascc.ZkStateReader$2.process A cluster state change: WatchedEvent state:SyncConnected type:NodeDataChanged path:/clusterstate.json, has occurred - updating... (live nodes size: 3)
[junit4:junit4]   2> 12718 T96 oascc.ZkStateReader$2.process A cluster state change: WatchedEvent state:SyncConnected type:NodeDataChanged path:/clusterstate.json, has occurred - updating... (live nodes size: 3)
[junit4:junit4]   2> 12718 T68 oascc.ZkStateReader$2.process A cluster state change: WatchedEvent state:SyncConnected type:NodeDataChanged path:/clusterstate.json, has occurred - updating... (live nodes size: 3)
[junit4:junit4]   2> 12746 T97 oasc.ZkController.register We are http://127.0.0.1:41721/collection1/ and leader is http://127.0.0.1:41721/collection1/
[junit4:junit4]   2> 12747 T97 oasc.ZkController.register No LogReplay needed for core=collection1 baseURL=http://127.0.0.1:41721
[junit4:junit4]   2> 12747 T97 oasc.ZkController.checkRecovery I am the leader, no recovery necessary
[junit4:junit4]   2> 12747 T97 oasc.ZkController.publish publishing core=collection1 state=active
[junit4:junit4]   2> 12747 T97 oasc.ZkController.publish numShards not found on descriptor - reading it from system property
[junit4:junit4]   2> 12749 T97 oascc.ZkStateReader.updateClusterState Updating cloud state from ZooKeeper... 
[junit4:junit4]   2> 12750 T40 oass.SolrDispatchFilter.init user.dir=/mnt/ssd/jenkins/workspace/Lucene-Solr-trunk-Linux/solr/build/solr-core/test/J1
[junit4:junit4]   2> 12750 T40 oass.SolrDispatchFilter.init SolrDispatchFilter.init() done
[junit4:junit4]   2> 12750 T40 oascsi.HttpClientUtil.createClient Creating new http client, config:maxConnections=128&maxConnectionsPerHost=32&followRedirects=false
[junit4:junit4]   2> 12799 T40 oejs.Server.doStart jetty-8.1.8.v20121106
[junit4:junit4]   2> 12801 T40 oejs.AbstractConnector.doStart Started SelectChannelConnector@127.0.0.1:50857
[junit4:junit4]   2> 12801 T40 oass.SolrDispatchFilter.init SolrDispatchFilter.init()
[junit4:junit4]   2> 12802 T40 oasc.SolrResourceLoader.locateSolrHome JNDI not configured for solr (NoInitialContextEx)
[junit4:junit4]   2> 12802 T40 oasc.SolrResourceLoader.locateSolrHome using system property solr.solr.home: /mnt/ssd/jenkins/workspace/Lucene-Solr-trunk-Linux/solr/build/solr-core/test/J1/./org.apache.solr.cloud.UnloadDistributedZkTest-jetty3-1361517775706
[junit4:junit4]   2> 12802 T40 oasc.CoreContainer$Initializer.initialize looking for solr.xml: /mnt/ssd/jenkins/workspace/Lucene-Solr-trunk-Linux/solr/build/solr-core/test/J1/./org.apache.solr.cloud.UnloadDistributedZkTest-jetty3-1361517775706/solr.xml
[junit4:junit4]   2> 12803 T40 oasc.CoreContainer.<init> New CoreContainer 1056157384
[junit4:junit4]   2> 12803 T40 oasc.CoreContainer.load Loading CoreContainer using Solr Home: '/mnt/ssd/jenkins/workspace/Lucene-Solr-trunk-Linux/solr/build/solr-core/test/J1/./org.apache.solr.cloud.UnloadDistributedZkTest-jetty3-1361517775706/'
[junit4:junit4]   2> 12803 T40 oasc.SolrResourceLoader.<init> new SolrResourceLoader for directory: '/mnt/ssd/jenkins/workspace/Lucene-Solr-trunk-Linux/solr/build/solr-core/test/J1/./org.apache.solr.cloud.UnloadDistributedZkTest-jetty3-1361517775706/'
[junit4:junit4]   2> 12820 T40 oashc.HttpShardHandlerFactory.getParameter Setting socketTimeout to: 120000
[junit4:junit4]   2> 12820 T40 oashc.HttpShardHandlerFactory.getParameter Setting urlScheme to: http://
[junit4:junit4]   2> 12821 T40 oashc.HttpShardHandlerFactory.getParameter Setting connTimeout to: 15000
[junit4:junit4]   2> 12821 T40 oashc.HttpShardHandlerFactory.getParameter Setting maxConnectionsPerHost to: 20
[junit4:junit4]   2> 12821 T40 oashc.HttpShardHandlerFactory.getParameter Setting corePoolSize to: 0
[junit4:junit4]   2> 12822 T40 oashc.HttpShardHandlerFactory.getParameter Setting maximumPoolSize to: 2147483647
[junit4:junit4]   2> 12822 T40 oashc.HttpShardHandlerFactory.getParameter Setting maxThreadIdleTime to: 5
[junit4:junit4]   2> 12822 T40 oashc.HttpShardHandlerFactory.getParameter Setting sizeOfQueue to: -1
[junit4:junit4]   2> 12822 T40 oashc.HttpShardHandlerFactory.getParameter Setting fairnessPolicy to: false
[junit4:junit4]   2> 12823 T40 oascsi.HttpClientUtil.createClient Creating new http client, config:maxConnectionsPerHost=20&maxConnections=10000&socketTimeout=120000&connTimeout=15000&retry=false
[junit4:junit4]   2> 12829 T40 oasc.CoreContainer.load Registering Log Listener
[junit4:junit4]   2> 12838 T40 oasc.CoreContainer.initZooKeeper Zookeeper client=127.0.0.1:36499/solr
[junit4:junit4]   2> 12838 T40 oasc.ZkController.checkChrootPath zkHost includes chroot
[junit4:junit4]   2> 12839 T40 oaz.ZooKeeper.<init> Initiating client connection, connectString=127.0.0.1:36499 sessionTimeout=60000 watcher=org.apache.solr.common.cloud.ConnectionManager@1aeb7308
[junit4:junit4]   2> 12840 T40 oascc.ConnectionManager.waitForConnected Waiting for client to connect to ZooKeeper
[junit4:junit4]   2> 12840 T108 oaz.ClientCnxn$SendThread.logStartConnect Opening socket connection to server localhost.localdomain/127.0.0.1:36499. Will not attempt to authenticate using SASL (access denied ("javax.security.auth.AuthPermission" "getLoginConfiguration"))
[junit4:junit4]   2> 12840 T108 oaz.ClientCnxn$SendThread.primeConnection Socket connection established to localhost.localdomain/127.0.0.1:36499, initiating session
[junit4:junit4]   2> 12841 T42 oazs.NIOServerCnxnFactory.run Accepted socket connection from /127.0.0.1:54209
[junit4:junit4]   2> 12841 T42 oazs.ZooKeeperServer.processConnectRequest Client attempting to establish new session at /127.0.0.1:54209
[junit4:junit4]   2> 12842 T44 oazs.ZooKeeperServer.finishSessionInit Established session 0x13d00c859e70009 with negotiated timeout 20000 for client /127.0.0.1:54209
[junit4:junit4]   2> 12842 T108 oaz.ClientCnxn$SendThread.onConnected Session establishment complete on server localhost.localdomain/127.0.0.1:36499, sessionid = 0x13d00c859e70009, negotiated timeout = 20000
[junit4:junit4]   2> 12842 T109 oascc.ConnectionManager.process Watcher org.apache.solr.common.cloud.ConnectionManager@1aeb7308 name:ZooKeeperConnection Watcher:127.0.0.1:36499 got event WatchedEvent state:SyncConnected type:None path:null path:null type:None
[junit4:junit4]   2> 12842 T40 oascc.ConnectionManager.waitForConnected Client is connected to ZooKeeper
[junit4:junit4]   2> 12843 T45 oazs.PrepRequestProcessor.pRequest2Txn Processed session termination for sessionid: 0x13d00c859e70009
[junit4:junit4]   2> 12844 T109 oaz.ClientCnxn$EventThread.run EventThread shut down
[junit4:junit4]   2> 12844 T42 oazs.NIOServerCnxn.closeSock Closed socket connection for client /127.0.0.1:54209 which had sessionid 0x13d00c859e70009
[junit4:junit4]   2> 12844 T40 oaz.ZooKeeper.close Session: 0x13d00c859e70009 closed
[junit4:junit4]   2> 12844 T40 oascsi.HttpClientUtil.createClient Creating new http client, config:maxConnections=500&maxConnectionsPerHost=16&socketTimeout=120000&connTimeout=15000
[junit4:junit4]   2> 12847 T40 oaz.ZooKeeper.<init> Initiating client connection, connectString=127.0.0.1:36499/solr sessionTimeout=30000 watcher=org.apache.solr.common.cloud.ConnectionManager@51154edd
[junit4:junit4]   2> 12848 T40 oascc.ConnectionManager.waitForConnected Waiting for client to connect to ZooKeeper
[junit4:junit4]   2> 12848 T110 oaz.ClientCnxn$SendThread.logStartConnect Opening socket connection to server localhost.localdomain/127.0.0.1:36499. Will not attempt to authenticate using SASL (access denied ("javax.security.auth.AuthPermission" "getLoginConfiguration"))
[junit4:junit4]   2> 12849 T110 oaz.ClientCnxn$SendThread.primeConnection Socket connection established to localhost.localdomain/127.0.0.1:36499, initiating session
[junit4:junit4]   2> 12849 T42 oazs.NIOServerCnxnFactory.run Accepted socket connection from /127.0.0.1:54210
[junit4:junit4]   2> 12849 T42 oazs.ZooKeeperServer.processConnectRequest Client attempting to establish new session at /127.0.0.1:54210
[junit4:junit4]   2> 12850 T44 oazs.ZooKeeperServer.finishSessionInit Established session 0x13d00c859e7000a with negotiated timeout 20000 for client /127.0.0.1:54210
[junit4:junit4]   2> 12850 T110 oaz.ClientCnxn$SendThread.onConnected Session establishment complete on server localhost.localdomain/127.0.0.1:36499, sessionid = 0x13d00c859e7000a, negotiated timeout = 20000
[junit4:junit4]   2> 12850 T111 oascc.ConnectionManager.process Watcher org.apache.solr.common.cloud.ConnectionManager@51154edd name:ZooKeeperConnection Watcher:127.0.0.1:36499/solr got event WatchedEvent state:SyncConnected type:None path:null path:null type:None
[junit4:junit4]   2> 12850 T40 oascc.ConnectionManager.waitForConnected Client is connected to ZooKeeper
[junit4:junit4]   2> 12851 T45 oazs.PrepRequestProcessor.pRequest Got user-level KeeperException when processing sessionid:0x13d00c859e7000a type:create cxid:0x1 zxid:0x8f txntype:-1 reqpath:n/a Error Path:/solr/overseer Error:KeeperErrorCode = NodeExists for /solr/overseer
[junit4:junit4]   2> 12852 T45 oazs.PrepRequestProcessor.pRequest Got user-level KeeperException when processing sessionid:0x13d00c859e7000a type:create cxid:0x2 zxid:0x90 txntype:-1 reqpath:n/a Error Path:/solr/overseer Error:KeeperErrorCode = NodeExists for /solr/overseer
[junit4:junit4]   2> 12853 T40 oascc.ZkStateReader.createClusterStateWatchersAndUpdate Updating cluster state from ZooKeeper... 
[junit4:junit4]   2> 13855 T40 oasc.ZkController.createEphemeralLiveNode Register node as live in ZooKeeper:/live_nodes/127.0.0.1:50857_
[junit4:junit4]   2> 13857 T45 oazs.PrepRequestProcessor.pRequest Got user-level KeeperException when processing sessionid:0x13d00c859e7000a type:delete cxid:0x9 zxid:0x91 txntype:-1 reqpath:n/a Error Path:/solr/live_nodes/127.0.0.1:50857_ Error:KeeperErrorCode = NoNode for /solr/live_nodes/127.0.0.1:50857_
[junit4:junit4]   2> 13858 T40 oascc.SolrZkClient.makePath makePath: /live_nodes/127.0.0.1:50857_
[junit4:junit4]   2> 13861 T68 oascc.ZkStateReader$2.process A cluster state change: WatchedEvent state:SyncConnected type:NodeChildrenChanged path:/live_nodes, has occurred - updating... (live nodes size: 3)
[junit4:junit4]   2> 13861 T96 oascc.ZkStateReader$2.process A cluster state change: WatchedEvent state:SyncConnected type:NodeChildrenChanged path:/live_nodes, has occurred - updating... (live nodes size: 3)
[junit4:junit4]   2> 13861 T81 oascc.ZkStateReader$3.process Updating live nodes... (4)
[junit4:junit4]   2> 13861 T81 oascc.ZkStateReader$2.process A cluster state change: WatchedEvent state:SyncConnected type:NodeChildrenChanged path:/live_nodes, has occurred - updating... (live nodes size: 4)
[junit4:junit4]   2> 13862 T62 oascc.ZkStateReader$3.process Updating live nodes... (4)
[junit4:junit4]   2> 13862 T62 oascc.ZkStateReader$2.process A cluster state change: WatchedEvent state:SyncConnected type:NodeChildrenChanged path:/live_nodes, has occurred - updating... (live nodes size: 4)
[junit4:junit4]   2> 13862 T68 oascc.ZkStateReader$3.process Updating live nodes... (4)
[junit4:junit4]   2> 13863 T96 oascc.ZkStateReader$3.process Updating live nodes... (4)
[junit4:junit4]   2> 13863 T111 oascc.ZkStateReader$3.process Updating live nodes... (4)
[junit4:junit4]   2> 13869 T112 oasc.CoreContainer.create Creating SolrCore 'collection1' using instanceDir: /mnt/ssd/jenkins/workspace/Lucene-Solr-trunk-Linux/solr/build/solr-core/test/J1/./org.apache.solr.cloud.UnloadDistributedZkTest-jetty3-1361517775706/collection1
[junit4:junit4]   2> 13870 T112 oasc.ZkController.createCollectionZkNode Check for collection zkNode:collection1
[junit4:junit4]   2> 13870 T112 oasc.ZkController.createCollectionZkNode Collection zkNode exists
[junit4:junit4]   2> 13870 T112 oasc.ZkController.readConfigName Load collection config from:/collections/collection1
[junit4:junit4]   2> 13871 T112 oasc.SolrResourceLoader.<init> new SolrResourceLoader for directory: '/mnt/ssd/jenkins/workspace/Lucene-Solr-trunk-Linux/solr/build/solr-core/test/J1/./org.apache.solr.cloud.UnloadDistributedZkTest-jetty3-1361517775706/collection1/'
[junit4:junit4]   2> 13872 T112 oasc.SolrResourceLoader.replaceClassLoader Adding 'file:/mnt/ssd/jenkins/workspace/Lucene-Solr-trunk-Linux/solr/build/solr-core/test/J1/org.apache.solr.cloud.UnloadDistributedZkTest-jetty3-1361517775706/collection1/lib/README' to classloader
[junit4:junit4]   2> 13872 T112 oasc.SolrResourceLoader.replaceClassLoader Adding 'file:/mnt/ssd/jenkins/workspace/Lucene-Solr-trunk-Linux/solr/build/solr-core/test/J1/org.apache.solr.cloud.UnloadDistributedZkTest-jetty3-1361517775706/collection1/lib/classes/' to classloader
[junit4:junit4]   2> 13900 T112 oasc.SolrConfig.<init> Using Lucene MatchVersion: LUCENE_50
[junit4:junit4]   2> 13926 T112 oasc.SolrConfig.<init> Loaded SolrConfig: solrconfig.xml
[junit4:junit4]   2> 13927 T112 oass.IndexSchema.readSchema Reading Solr Schema
[junit4:junit4]   2> 13931 T112 oass.IndexSchema.readSchema Schema name=test
[junit4:junit4]   2> 14224 T63 oascc.ZkStateReader.updateClusterState Updating cloud state from ZooKeeper... 
[junit4:junit4]   2> 14225 T63 oasc.Overseer$ClusterStateUpdater.updateState Update state numShards=2 message={
[junit4:junit4]   2> 	  "core":"collection1",
[junit4:junit4]   2> 	  "numShards":"2",
[junit4:junit4]   2> 	  "shard":"shard1",
[junit4:junit4]   2> 	  "roles":null,
[junit4:junit4]   2> 	  "state":"active",
[junit4:junit4]   2> 	  "base_url":"http://127.0.0.1:41721",
[junit4:junit4]   2> 	  "collection":"collection1",
[junit4:junit4]   2> 	  "node_name":"127.0.0.1:41721_",
[junit4:junit4]   2> 	  "operation":"state"}
[junit4:junit4]   2> 14231 T62 oascc.ZkStateReader$2.process A cluster state change: WatchedEvent state:SyncConnected type:NodeDataChanged path:/clusterstate.json, has occurred - updating... (live nodes size: 4)
[junit4:junit4]   2> 14231 T96 oascc.ZkStateReader$2.process A cluster state change: WatchedEvent state:SyncConnected type:NodeDataChanged path:/clusterstate.json, has occurred - updating... (live nodes size: 4)
[junit4:junit4]   2> 14231 T68 oascc.ZkStateReader$2.process A cluster state change: WatchedEvent state:SyncConnected type:NodeDataChanged path:/clusterstate.json, has occurred - updating... (live nodes size: 4)
[junit4:junit4]   2> 14231 T81 oascc.ZkStateReader$2.process A cluster state change: WatchedEvent state:SyncConnected type:NodeDataChanged path:/clusterstate.json, has occurred - updating... (live nodes size: 4)
[junit4:junit4]   2> 14231 T111 oascc.ZkStateReader$2.process A cluster state change: WatchedEvent state:SyncConnected type:NodeDataChanged path:/clusterstate.json, has occurred - updating... (live nodes size: 4)
[junit4:junit4]   2> 14248 T112 oass.OpenExchangeRatesOrgProvider.init Initialized with rates=open-exchange-rates.json, refreshInterval=1440.
[junit4:junit4]   2> 14253 T112 oass.IndexSchema.readSchema default search field in schema is text
[junit4:junit4]   2> 14255 T112 oass.IndexSchema.readSchema unique key field: id
[junit4:junit4]   2> 14268 T112 oass.FileExchangeRateProvider.reload Reloading exchange rates from file currency.xml
[junit4:junit4]   2> 14271 T112 oass.FileExchangeRateProvider.reload Reloading exchange rates from file currency.xml
[junit4:junit4]   2> 14274 T112 oass.OpenExchangeRatesOrgProvider.reload Reloading exchange rates from open-exchange-rates.json
[junit4:junit4]   2> 14275 T112 oass.OpenExchangeRatesOrgProvider.reload Reloading exchange rates from open-exchange-rates.json
[junit4:junit4]   2> 14276 T112 oasc.SolrCore.<init> [collection1] Opening new SolrCore at /mnt/ssd/jenkins/workspace/Lucene-Solr-trunk-Linux/solr/build/solr-core/test/J1/./org.apache.solr.cloud.UnloadDistributedZkTest-jetty3-1361517775706/collection1/, dataDir=./org.apache.solr.cloud.UnloadDistributedZkTest-1361517762958/jetty3/
[junit4:junit4]   2> 14276 T112 oasc.JmxMonitoredMap.<init> JMX monitoring is enabled. Adding Solr mbeans to JMX Server: com.sun.jmx.mbeanserver.JmxMBeanServer@36262bf5
[junit4:junit4]   2> 14277 T112 oasc.SolrCore.initDirectoryFactory org.apache.solr.core.MockDirectoryFactory
[junit4:junit4]   2> 14277 T112 oasc.CachingDirectoryFactory.get return new directory for /mnt/ssd/jenkins/workspace/Lucene-Solr-trunk-Linux/solr/build/solr-core/test/J1/./org.apache.solr.cloud.UnloadDistributedZkTest-1361517762958/jetty3 forceNew:false
[junit4:junit4]   2> 14277 T112 oasc.CachingDirectoryFactory.close Releasing directory:/mnt/ssd/jenkins/workspace/Lucene-Solr-trunk-Linux/solr/build/solr-core/test/J1/./org.apache.solr.cloud.UnloadDistributedZkTest-1361517762958/jetty3
[junit4:junit4]   2> 14278 T112 oasc.SolrCore.getNewIndexDir New index directory detected: old=null new=./org.apache.solr.cloud.UnloadDistributedZkTest-1361517762958/jetty3/index/
[junit4:junit4]   2> 14278 T112 oasc.SolrCore.initIndex WARNING [collection1] Solr index directory './org.apache.solr.cloud.UnloadDistributedZkTest-1361517762958/jetty3/index' doesn't exist. Creating new index...
[junit4:junit4]   2> 14279 T112 oasc.CachingDirectoryFactory.get return new directory for /mnt/ssd/jenkins/workspace/Lucene-Solr-trunk-Linux/solr/build/solr-core/test/J1/./org.apache.solr.cloud.UnloadDistributedZkTest-1361517762958/jetty3/index forceNew:false
[junit4:junit4]   2> 14280 T112 oasc.SolrDeletionPolicy.onCommit SolrDeletionPolicy.onCommit: commits:num=1
[junit4:junit4]   2> 		commit{dir=MockDirWrapper(org.apache.lucene.store.RAMDirectory@6791237e lockFactory=org.apache.lucene.store.NativeFSLockFactory@7aa07065),segFN=segments_1,generation=1,filenames=[segments_1]
[junit4:junit4]   2> 14280 T112 oasc.SolrDeletionPolicy.updateCommits newest commit = 1[segments_1]
[junit4:junit4]   2> 14281 T112 oasc.CachingDirectoryFactory.close Releasing directory:/mnt/ssd/jenkins/workspace/Lucene-Solr-trunk-Linux/solr/build/solr-core/test/J1/./org.apache.solr.cloud.UnloadDistributedZkTest-1361517762958/jetty3/index
[junit4:junit4]   2> 14282 T112 oasup.UpdateRequestProcessorChain.init inserting DistributedUpdateProcessorFactory into updateRequestProcessorChain "dedupe"
[junit4:junit4]   2> 14283 T112 oasup.UpdateRequestProcessorChain.init inserting DistributedUpdateProcessorFactory into updateRequestProcessorChain "stored_sig"
[junit4:junit4]   2> 14283 T112 oasup.UpdateRequestProcessorChain.init inserting DistributedUpdateProcessorFactory into updateRequestProcessorChain "distrib-dup-test-chain-implicit"
[junit4:junit4]   2> 14283 T112 oasc.RequestHandlers.initHandlersFromConfig created standard: solr.StandardRequestHandler
[junit4:junit4]   2> 14284 T112 oasc.RequestHandlers.initHandlersFromConfig created /get: solr.RealTimeGetHandler
[junit4:junit4]   2> 14284 T112 oasc.RequestHandlers.initHandlersFromConfig adding lazy requestHandler: solr.ReplicationHandler
[junit4:junit4]   2> 14284 T112 oasc.RequestHandlers.initHandlersFromConfig created /replication: solr.ReplicationHandler
[junit4:junit4]   2> 14285 T112 oasc.RequestHandlers.initHandlersFromConfig created /update: solr.UpdateRequestHandler
[junit4:junit4]   2> 14285 T112 oasc.RequestHandlers.initHandlersFromConfig created /admin/: org.apache.solr.handler.admin.AdminHandlers
[junit4:junit4]   2> 14287 T112 oashl.XMLLoader.init xsltCacheLifetimeSeconds=60
[junit4:junit4]   2> 14289 T112 oasc.CachingDirectoryFactory.close Releasing directory:/mnt/ssd/jenkins/workspace/Lucene-Solr-trunk-Linux/solr/build/solr-core/test/J1/./org.apache.solr.cloud.UnloadDistributedZkTest-1361517762958/jetty3
[junit4:junit4]   2> 14289 T112 oass.SolrIndexSearcher.<init> Opening Searcher@60630531 main
[junit4:junit4]   2> 14290 T112 oasu.UpdateHandler.clearLog Clearing tlog files, tlogDir=./org.apache.solr.cloud.UnloadDistributedZkTest-1361517762958/jetty3/tlog
[junit4:junit4]   2> 14290 T112 oasu.CommitTracker.<init> Hard AutoCommit: disabled
[junit4:junit4]   2> 14290 T112 oasu.CommitTracker.<init> Soft AutoCommit: disabled
[junit4:junit4]   2> 14294 T113 oasc.SolrCore.registerSearcher [collection1] Registered new searcher Searcher@60630531 main{StandardDirectoryReader(segments_1:1)}
[junit4:junit4]   2> 14297 T112 oasc.ZkController.publish publishing core=collection1 state=down
[junit4:junit4]   2> 14297 T112 oasc.ZkController.publish numShards not found on descriptor - reading it from system property
[junit4:junit4]   2> 15738 T63 oascc.ZkStateReader.updateClusterState Updating cloud state from ZooKeeper... 
[junit4:junit4]   2> 15740 T63 oasc.Overseer$ClusterStateUpdater.updateState Update state numShards=2 message={
[junit4:junit4]   2> 	  "core":"collection1",
[junit4:junit4]   2> 	  "numShards":"2",
[junit4:junit4]   2> 	  "shard":null,
[junit4:junit4]   2> 	  "roles":null,
[junit4:junit4]   2> 	  "state":"down",
[junit4:junit4]   2> 	  "base_url":"http://127.0.0.1:50857",
[junit4:junit4]   2> 	  "collection":"collection1",
[junit4:junit4]   2> 	  "node_name":"127.0.0.1:50857_",
[junit4:junit4]   2> 	  "operation":"state"}
[junit4:junit4]   2> 15740 T63 oasc.Overseer$ClusterStateUpdater.updateState Collection already exists with numShards=2
[junit4:junit4]   2> 15740 T63 oasc.Overseer$ClusterStateUpdater.updateState Assigning new node to shard shard=shard2
[junit4:junit4]   2> 15748 T81 oascc.ZkStateReader$2.process A cluster state change: WatchedEvent state:SyncConnected type:NodeDataChanged path:/clusterstate.json, has occurred - updating... (live nodes size: 4)
[junit4:junit4]   2> 15748 T68 oascc.ZkStateReader$2.process A cluster state change: WatchedEvent state:SyncConnected type:NodeDataChanged path:/clusterstate.json, has occurred - updating... (live nodes size: 4)
[junit4:junit4]   2> 15748 T62 oascc.ZkStateReader$2.process A cluster state change: WatchedEvent state:SyncConnected type:NodeDataChanged path:/clusterstate.json, has occurred - updating... (live nodes size: 4)
[junit4:junit4]   2> 15748 T111 oascc.ZkStateReader$2.process A cluster state change: WatchedEvent state:SyncConnected type:NodeDataChanged path:/clusterstate.json, has occurred - updating... (live nodes size: 4)
[junit4:junit4]   2> 15748 T96 oascc.ZkStateReader$2.process A cluster state change: WatchedEvent state:SyncConnected type:NodeDataChanged path:/clusterstate.json, has occurred - updating... (live nodes size: 4)
[junit4:junit4]   2> 16299 T112 oasc.CoreContainer.registerCore registering core: collection1
[junit4:junit4]   2> 16299 T112 oasc.ZkController.register Register replica - core:collection1 address:http://127.0.0.1:50857 collection:collection1 shard:shard2
[junit4:junit4]   2> 16306 T112 oasc.ZkController.register We are http://127.0.0.1:50857/collection1/ and leader is http://127.0.0.1:37755/collection1/
[junit4:junit4]   2> 16307 T112 oasc.ZkController.register No LogReplay needed for core=collection1 baseURL=http://127.0.0.1:50857
[junit4:junit4]   2> 16307 T112 oasc.ZkController.checkRecovery Core needs to recover:collection1
[junit4:junit4]   2> 16307 T112 oasu.DefaultSolrCoreState.doRecovery Running recovery - first canceling any ongoing recovery
[junit4:junit4]   2> ASYNC  NEW_CORE C5 name=collection1 org.apache.solr.core.SolrCore@6c99cdbd url=http://127.0.0.1:50857/collection1 node=127.0.0.1:50857_ C5_STATE=coll:collection1 core:collection1 props:{core=collection1, shard=null, roles=null, state=down, base_url=http://127.0.0.1:50857, collection=collection1, node_name=127.0.0.1:50857_}
[junit4:junit4]   2> 16311 T114 C5 P50857 oasc.RecoveryStrategy.run Starting recovery process.  core=collection1 recoveringAfterStartup=true
[junit4:junit4]   2> 16312 T112 oascc.ZkStateReader.updateClusterState Updating cloud state from ZooKeeper... 
[junit4:junit4]   2> 16312 T114 C5 P50857 oasc.RecoveryStrategy.doRecovery ###### startupVersions=[]
[junit4:junit4]   2> 16313 T114 C5 P50857 oasc.ZkController.publish publishing core=collection1 state=recovering
[junit4:junit4]   2> 16313 T40 oass.SolrDispatchFilter.init user.dir=/mnt/ssd/jenkins/workspace/Lucene-Solr-trunk-Linux/solr/build/solr-core/test/J1
[junit4:junit4]   2> 16313 T114 C5 P50857 oasc.ZkController.publish numShards not found on descriptor - reading it from system property
[junit4:junit4]   2> 16313 T40 oass.SolrDispatchFilter.init SolrDispatchFilter.init() done
[junit4:junit4]   2> 16314 T40 oascsi.HttpClientUtil.createClient Creating new http client, config:maxConnections=128&maxConnectionsPerHost=32&followRedirects=false
[junit4:junit4]   2> 16315 T114 C5 P50857 oascsi.HttpClientUtil.createClient Creating new http client, config:maxConnections=128&maxConnectionsPerHost=32&followRedirects=false
[junit4:junit4]   2> 16366 T40 oejs.Server.doStart jetty-8.1.8.v20121106
[junit4:junit4]   2> 16369 T40 oejs.AbstractConnector.doStart Started SelectChannelConnector@127.0.0.1:37087
[junit4:junit4]   2> 16370 T40 oass.SolrDispatchFilter.init SolrDispatchFilter.init()
[junit4:junit4]   2> 16370 T40 oasc.SolrResourceLoader.locateSolrHome JNDI not configured for solr (NoInitialContextEx)
[junit4:junit4]   2> 16370 T40 oasc.SolrResourceLoader.locateSolrHome using system property solr.solr.home: /mnt/ssd/jenkins/workspace/Lucene-Solr-trunk-Linux/solr/build/solr-core/test/J1/./org.apache.solr.cloud.UnloadDistributedZkTest-jetty4-1361517779270
[junit4:junit4]   2> 16371 T40 oasc.CoreContainer$Initializer.initialize looking for solr.xml: /mnt/ssd/jenkins/workspace/Lucene-Solr-trunk-Linux/solr/build/solr-core/test/J1/./org.apache.solr.cloud.UnloadDistributedZkTest-jetty4-1361517779270/solr.xml
[junit4:junit4]   2> 16371 T40 oasc.CoreContainer.<init> New CoreContainer 321429476
[junit4:junit4]   2> 16371 T40 oasc.CoreContainer.load Loading CoreContainer using Solr Home: '/mnt/ssd/jenkins/workspace/Lucene-Solr-trunk-Linux/solr/build/solr-core/test/J1/./org.apache.solr.cloud.UnloadDistributedZkTest-jetty4-1361517779270/'
[junit4:junit4]   2> 16372 T40 oasc.SolrResourceLoader.<init> new SolrResourceLoader for directory: '/mnt/ssd/jenkins/workspace/Lucene-Solr-trunk-Linux/solr/build/solr-core/test/J1/./org.apache.solr.cloud.UnloadDistributedZkTest-jetty4-1361517779270/'
[junit4:junit4]   2> 16399 T40 oashc.HttpShardHandlerFactory.getParameter Setting socketTimeout to: 120000
[junit4:junit4]   2> 16400 T40 oashc.HttpShardHandlerFactory.getParameter Setting urlScheme to: http://
[junit4:junit4]   2> 16400 T40 oashc.HttpShardHandlerFactory.getParameter Setting connTimeout to: 15000
[junit4:junit4]   2> 16400 T40 oashc.HttpShardHandlerFactory.getParameter Setting maxConnectionsPerHost to: 20
[junit4:junit4]   2> 16401 T40 oashc.HttpShardHandlerFactory.getParameter Setting corePoolSize to: 0
[junit4:junit4]   2> 16401 T40 oashc.HttpShardHandlerFactory.getParameter Setting maximumPoolSize to: 2147483647
[junit4:junit4]   2> 16401 T40 oashc.HttpShardHandlerFactory.getParameter Setting maxThreadIdleTime to: 5
[junit4:junit4]   2> 16402 T40 oashc.HttpShardHandlerFactory.getParameter Setting sizeOfQueue to: -1
[junit4:junit4]   2> 16402 T40 oashc.HttpShardHandlerFactory.getParameter Setting fairnessPolicy to: false
[junit4:junit4]   2> 16402 T40 oascsi.HttpClientUtil.createClient Creating new http client, config:maxConnectionsPerHost=20&maxConnections=10000&socketTimeout=120000&connTimeout=15000&retry=false
[junit4:junit4]   2> 16413 T40 oasc.CoreContainer.load Registering Log Listener
[junit4:junit4]   2> 16423 T40 oasc.CoreContainer.initZooKeeper Zookeeper client=127.0.0.1:36499/solr
[junit4:junit4]   2> 16423 T40 oasc.ZkController.checkChrootPath zkHost includes chroot
[junit4:junit4]   2> 16424 T40 oaz.ZooKeeper.<init> Initiating client connection, connectString=127.0.0.1:36499 sessionTimeout=60000 watcher=org.apache.solr.common.cloud.ConnectionManager@32f7b6b5
[junit4:junit4]   2> 16425 T40 oascc.ConnectionManager.waitForConnected Waiting for client to connect to ZooKeeper
[junit4:junit4]   2> 16425 T124 oaz.ClientCnxn$SendThread.logStartConnect Opening socket connection to server localhost.localdomain/127.0.0.1:36499. Will not attempt to authenticate using SASL (access denied ("javax.security.auth.AuthPermission" "getLoginConfiguration"))
[junit4:junit4]   2> 16425 T124 oaz.ClientCnxn$SendThread.primeConnection Socket connection established to localhost.localdomain/127.0.0.1:36499, initiating session
[junit4:junit4]   2> 16426 T42 oazs.NIOServerCnxnFactory.run Accepted socket connection from /127.0.0.1:54215
[junit4:junit4]   2> 16426 T42 oazs.ZooKeeperServer.processConnectRequest Client attempting to establish new session at /127.0.0.1:54215
[junit4:junit4]   2> 16427 T44 oazs.ZooKeeperServer.finishSessionInit Established session 0x13d00c859e7000b with negotiated timeout 20000 for client /127.0.0.1:54215
[junit4:junit4]   2> 16427 T124 oaz.ClientCnxn$SendThread.onConnected Session establishment complete on server localhost.localdomain/127.0.0.1:36499, sessionid = 0x13d00c859e7000b, negotiated timeout = 20000
[junit4:junit4]   2> 16428 T125 oascc.ConnectionManager.process Watcher org.apache.solr.common.cloud.ConnectionManager@32f7b6b5 name:ZooKeeperConnection Watcher:127.0.0.1:36499 got event WatchedEvent state:SyncConnected type:None path:null path:null type:None
[junit4:junit4]   2> 16428 T40 oascc.ConnectionManager.waitForConnected Client is connected to ZooKeeper
[junit4:junit4]   2> 16430 T45 oazs.PrepRequestProcessor.pRequest2Txn Processed session termination for sessionid: 0x13d00c859e7000b
[junit4:junit4]   2> 16430 T125 oaz.ClientCnxn$EventThread.run EventThread shut down
[junit4:junit4]   2> 16430 T40 oaz.ZooKeeper.close Session: 0x13d00c859e7000b closed
[junit4:junit4]   2> 16430 T42 oazs.NIOServerCnxn.closeSock Closed socket connection for client /127.0.0.1:54215 which had sessionid 0x13d00c859e7000b
[junit4:junit4]   2> 16431 T40 oascsi.HttpClientUtil.createClient Creating new http client, config:maxConnections=500&maxConnectionsPerHost=16&socketTimeout=120000&connTimeout=15000
[junit4:junit4]   2> 16434 T40 oaz.ZooKeeper.<init> Initiating client connection, connectString=127.0.0.1:36499/solr sessionTimeout=30000 watcher=org.apache.solr.common.cloud.ConnectionManager@793f31e5
[junit4:junit4]   2> 16434 T40 oascc.ConnectionManager.waitForConnected Waiting for client to connect to ZooKeeper
[junit4:junit4]   2> 16435 T126 oaz.ClientCnxn$SendThread.logStartConnect Opening socket connection to server localhost.localdomain/127.0.0.1:36499. Will not attempt to authenticate using SASL (access denied ("javax.security.auth.AuthPermission" "getLoginConfiguration"))
[junit4:junit4]   2> 16436 T126 oaz.ClientCnxn$SendThread.primeConnection Socket connection established to localhost.localdomain/127.0.0.1:36499, initiating session
[junit4:junit4]   2> 16436 T42 oazs.NIOServerCnxnFactory.run Accepted socket connection from /127.0.0.1:54216
[junit4:junit4]   2> 16436 T42 oazs.ZooKeeperServer.processConnectRequest Client attempting to establish new session at /127.0.0.1:54216
[junit4:junit4]   2> 16437 T44 oazs.ZooKeeperServer.finishSessionInit Established session 0x13d00c859e7000c with negotiated timeout 20000 for client /127.0.0.1:54216
[junit4:junit4]   2> 16437 T126 oaz.ClientCnxn$SendThread.onConnected Session establishment complete on server localhost.localdomain/127.0.0.1:36499, sessionid = 0x13d00c859e7000c, negotiated timeout = 20000
[junit4:junit4]   2> 16438 T127 oascc.ConnectionManager.process Watcher org.apache.solr.common.cloud.ConnectionManager@793f31e5 name:ZooKeeperConnection Watcher:127.0.0.1:36499/solr got event WatchedEvent state:SyncConnected type:None path:null path:null type:None
[junit4:junit4]   2> 16438 T40 oascc.ConnectionManager.waitForConnected Client is connected to ZooKeeper
[junit4:junit4]   2> 16439 T45 oazs.PrepRequestProcessor.pRequest Got user-level KeeperException when processing sessionid:0x13d00c859e7000c type:create cxid:0x1 zxid:0xa2 txntype:-1 reqpath:n/a Error Path:/solr/overseer Error:KeeperErrorCode = NodeExists for /solr/overseer
[junit4:junit4]   2> 16440 T45 oazs.PrepRequestProcessor.pRequest Got user-level KeeperException when processing sessionid:0x13d00c859e7000c type:create cxid:0x2 zxid:0xa3 txntype:-1 reqpath:n/a Error Path:/solr/overseer Error:KeeperErrorCode = NodeExists for /solr/overseer
[junit4:junit4]   2> 16441 T40 oascc.ZkStateReader.createClusterStateWatchersAndUpdate Updating cluster state from ZooKeeper... 
[junit4:junit4]   2> 17256 T63 oascc.ZkStateReader.updateClusterState Updating cloud state from ZooKeeper... 
[junit4:junit4]   2> 17257 T63 oasc.Overseer$ClusterStateUpdater.updateState Update state numShards=2 message={
[junit4:junit4]   2> 	  "core":"collection1",
[junit4:junit4]   2> 	  "numShards":"2",
[junit4:junit4]   2> 	  "shard":"shard2",
[junit4:junit4]   2> 	  "roles":null,
[junit4:junit4]   2> 	  "state":"recovering",
[junit4:junit4]   2> 	  "base_url":"http://127.0.0.1:50857",
[junit4:junit4]   2> 	  "collection":"collection1",
[junit4:junit4]   2> 	  "node_name":"127.0.0.1:50857_",
[junit4:junit4]   2> 	  "operation":"state"}
[junit4:junit4]   2> 17267 T127 oascc.ZkStateReader$2.process A cluster state change: WatchedEvent state:SyncConnected type:NodeDataChanged path:/clusterstate.json, has occurred - updating... (live nodes size: 4)
[junit4:junit4]   2> 17267 T81 oascc.ZkStateReader$2.process A cluster state change: WatchedEvent state:SyncConnected type:NodeDataChanged path:/clusterstate.json, has occurred - updating... (live nodes size: 4)
[junit4:junit4]   2> 17268 T96 oascc.ZkStateReader$2.process A cluster state change: WatchedEvent state:SyncConnected type:NodeDataChanged path:/clusterstate.json, has occurred - updating... (live nodes size: 4)
[junit4:junit4]   2> 17267 T62 oascc.ZkStateReader$2.process A cluster state change: WatchedEvent state:SyncConnected type:NodeDataChanged path:/clusterstate.json, has occurred - updating... (live nodes size: 4)
[junit4:junit4]   2> 17267 T68 oascc.ZkStateReader$2.process A cluster state change: WatchedEvent state:SyncConnected type:NodeDataChanged path:/clusterstate.json, has occurred - updating... (live nodes size: 4)
[junit4:junit4]   2> 17267 T111 oascc.ZkStateReader$2.process A cluster state change: WatchedEvent state:SyncConnected type:NodeDataChanged path:/clusterstate.json, has occurred - updating... (live nodes size: 4)
[junit4:junit4]   2> 17444 T40 oasc.ZkController.createEphemeralLiveNode Register node as live in ZooKeeper:/live_nodes/127.0.0.1:37087_
[junit4:junit4]   2> 17445 T45 oazs.PrepRequestProcessor.pRequest Got user-level KeeperException when processing sessionid:0x13d00c859e7000c type:delete cxid:0xb zxid:0xa8 txntype:-1 reqpath:n/a Error Path:/solr/live_nodes/127.0.0.1:37087_ Error:KeeperErrorCode = NoNode for /solr/live_nodes/127.0.0.1:37087_
[junit4:junit4]   2> 17446 T40 oascc.SolrZkClient.makePath makePath: /live_nodes/127.0.0.1:37087_
[junit4:junit4]   2> 17449 T68 oascc.ZkStateReader$2.process A cluster state change: WatchedEvent state:SyncConnected type:NodeChildrenChanged path:/live_nodes, has occurred - updating... (live nodes size: 4)
[junit4:junit4]   2> 17449 T127 oascc.ZkStateReader$2.process A cluster state change: WatchedEvent state:SyncConnected type:NodeChildrenChanged path:/live_nodes, has occurred - updating... (live nodes size: 4)
[junit4:junit4]   2> 17449 T62 oascc.ZkStateReader$2.process A cluster state change: WatchedEvent state:SyncConnected type:NodeChildrenChanged path:/live_nodes, has occurred - updating... (live nodes size: 4)
[junit4:junit4]   2> 17450 T96 oascc.ZkStateReader$3.process Updating live nodes... (5)
[junit4:junit4]   2> 17450 T81 oascc.ZkStateReader$3.process Updating live nodes... (5)
[junit4:junit4]   2> 17451 T111 oascc.ZkStateReader$3.process Updating live nodes... (5)
[junit4:junit4]   2> 17451 T96 oascc.ZkStateReader$2.process A cluster state change: WatchedEvent state:SyncConnected type:NodeChildrenChanged path:/live_nodes, has occurred - updating... (live nodes size: 5)
[junit4:junit4]   2> 17451 T81 oascc.ZkStateReader$2.process A cluster state change: WatchedEvent state:SyncConnected type:NodeChildrenChanged path:/live_nodes, has occurred - updating... (live nodes size: 5)
[junit4:junit4]   2> 17451 T111 oascc.ZkStateReader$2.process A cluster state change: WatchedEvent state:SyncConnected type:NodeChildrenChanged path:/live_nodes, has occurred - updating... (live nodes size: 5)
[junit4:junit4]   2> 17454 T68 oascc.ZkStateReader$3.process Updating live nodes... (5)
[junit4:junit4]   2> 17455 T62 oascc.ZkStateReader$3.process Updating live nodes... (5)
[junit4:junit4]   2> 17455 T127 oascc.ZkStateReader$3.process Updating live nodes... (5)
[junit4:junit4]   2> 17460 T128 oasc.CoreContainer.create Creating SolrCore 'collection1' using instanceDir: /mnt/ssd/jenkins/workspace/Lucene-Solr-trunk-Linux/solr/build/solr-core/test/J1/./org.apache.solr.cloud.UnloadDistributedZkTest-jetty4-1361517779270/collection1
[junit4:junit4]   2> 17460 T128 oasc.ZkController.createCollectionZkNode Check for collection zkNode:collection1
[junit4:junit4]   2> 17461 T128 oasc.ZkController.createCollectionZkNode Collection zkNode exists
[junit4:junit4]   2> 17461 T128 oasc.ZkController.readConfigName Load collection config from:/collections/collection1
[junit4:junit4]   2> 17462 T128 oasc.SolrResourceLoader.<init> new SolrResourceLoader for directory: '/mnt/ssd/jenkins/workspace/Lucene-Solr-trunk-Linux/solr/build/solr-core/test/J1/./org.apache.solr.cloud.UnloadDistributedZkTest-jetty4-1361517779270/collection1/'
[junit4:junit4]   2> 17463 T128 oasc.SolrResourceLoader.replaceClassLoader Adding 'file:/mnt/ssd/jenkins/workspace/Lucene-Solr-trunk-Linux/solr/build/solr-core/test/J1/org.apache.solr.cloud.UnloadDistributedZkTest-jetty4-1361517779270/collection1/lib/README' to classloader
[junit4:junit4]   2> 17463 T128 oasc.SolrResourceLoader.replaceClassLoader Adding 'file:/mnt/ssd/jenkins/workspace/Lucene-Solr-trunk-Linux/solr/build/solr-core/test/J1/org.apache.solr.cloud.UnloadDistributedZkTest-jetty4-1361517779270/collection1/lib/classes/' to classloader
[junit4:junit4]   2> 17486 T128 oasc.SolrConfig.<init> Using Lucene MatchVersion: LUCENE_50
[junit4:junit4]   2> 17516 T128 oasc.SolrConfig.<init> Loaded SolrConfig: solrconfig.xml
[junit4:junit4]   2> 17517 T128 oass.IndexSchema.readSchema Reading Solr Schema
[junit4:junit4]   2> 17522 T128 oass.IndexSchema.readSchema Schema name=test
[junit4:junit4]   2> 17818 T128 oass.OpenExchangeRatesOrgProvider.init Initialized with rates=open-exchange-rates.json, refreshInterval=1440.
[junit4:junit4]   2> 17823 T128 oass.IndexSchema.readSchema default search field in schema is text
[junit4:junit4]   2> 17825 T128 oass.IndexSchema.readSchema unique key field: id
[junit4:junit4]   2> 17841 T128 oass.FileExchangeRateProvider.reload Reloading exchange rates from file currency.xml
[junit4:junit4]   2> 17844 T128 oass.FileExchangeRateProvider.reload Reloading exchange rates from file currency.xml
[junit4:junit4]   2> 17847 T128 oass.OpenExchangeRatesOrgProvider.reload Reloading exchange rates from open-exchange-rates.json
[junit4:junit4]   2> 17848 T128 oass.OpenExchangeRatesOrgProvider.reload Reloading exchange rates from open-exchange-rates.json
[junit4:junit4]   2> 17850 T128 oasc.SolrCore.<init> [collection1] Opening new SolrCore at /mnt/ssd/jenkins/workspace/Lucene-Solr-trunk-Linux/solr/build/solr-core/test/J1/./org.apache.solr.cloud.UnloadDistributedZkTest-jetty4-1361517779270/collection1/, dataDir=./org.apache.solr.cloud.UnloadDistributedZkTest-1361517762958/jetty4/
[junit4:junit4]   2> 17850 T128 oasc.JmxMonitoredMap.<init> JMX monitoring is enabled. Adding Solr mbeans to JMX Server: com.sun.jmx.mbeanserver.JmxMBeanServer@36262bf5
[junit4:junit4]   2> 17850 T128 oasc.SolrCore.initDirectoryFactory org.apache.solr.core.MockDirectoryFactory
[junit4:junit4]   2> 17851 T128 oasc.CachingDirectoryFactory.get return new directory for /mnt/ssd/jenkins/workspace/Lucene-Solr-trunk-Linux/solr/build/solr-core/test/J1/./org.apache.solr.cloud.UnloadDistributedZkTest-1361517762958/jetty4 forceNew:false
[junit4:junit4]   2> 17851 T128 oasc.CachingDirectoryFactory.close Releasing directory:/mnt/ssd/jenkins/workspace/Lucene-Solr-trunk-Linux/solr/build/solr-core/test/J1/./org.apache.solr.cloud.UnloadDistributedZkTest-1361517762958/jetty4
[junit4:junit4]   2> 17851 T128 oasc.SolrCore.getNewIndexDir New index directory detected: old=null new=./org.apache.solr.cloud.UnloadDistributedZkTest-1361517762958/jetty4/index/
[junit4:junit4]   2> 17851 T128 oasc.SolrCore.initIndex WARNING [collection1] Solr index directory './org.apache.solr.cloud.UnloadDistributedZkTest-1361517762958/jetty4/index' doesn't exist. Creating new index...
[junit4:junit4]   2> 17852 T128 oasc.CachingDirectoryFactory.get return new directory for /mnt/ssd/jenkins/workspace/Lucene-Solr-trunk-Linux/solr/build/solr-core/test/J1/./org.apache.solr.cloud.UnloadDistributedZkTest-1361517762958/jetty4/index forceNew:false
[junit4:junit4]   2> 17853 T128 oasc.SolrDeletionPolicy.onCommit SolrDeletionPolicy.onCommit: commits:num=1
[junit4:junit4]   2> 		commit{dir=MockDirWrapper(org.apache.lucene.store.RAMDirectory@b5aed85 lockFactory=org.apache.lucene.store.NativeFSLockFactory@29161b25),segFN=segments_1,generation=1,filenames=[segments_1]
[junit4:junit4]   2> 17853 T128 oasc.SolrDeletionPolicy.updateCommits newest commit = 1[segments_1]
[junit4:junit4]   2> 17854 T128 oasc.CachingDirectoryFactory.close Releasing directory:/mnt/ssd/jenkins/workspace/Lucene-Solr-trunk-Linux/solr/build/solr-core/test/J1/./org.apache.solr.cloud.UnloadDistributedZkTest-1361517762958/jetty4/index
[junit4:junit4]   2> 17855 T128 oasup.UpdateRequestProcessorChain.init inserting DistributedUpdateProcessorFactory into updateRequestProcessorChain "dedupe"
[junit4:junit4]   2> 17855 T128 oasup.UpdateRequestProcessorChain.init inserting DistributedUpdateProcessorFactory into updateRequestProcessorChain "stored_sig"
[junit4:junit4]   2> 17856 T128 oasup.UpdateRequestProcessorChain.init inserting DistributedUpdateProcessorFactory into updateRequestProcessorChain "distrib-dup-test-chain-implicit"
[junit4:junit4]   2> 17856 T128 oasc.RequestHandlers.initHandlersFromConfig created standard: solr.StandardRequestHandler
[junit4:junit4]   2> 17857 T128 oasc.RequestHandlers.initHandlersFromConfig created /get: solr.RealTimeGetHandler
[junit4:junit4]   2> 17857 T128 oasc.RequestHandlers.initHandlersFromConfig adding lazy requestHandler: solr.ReplicationHandler
[junit4:junit4]   2> 17857 T128 oasc.RequestHandlers.initHandlersFromConfig created /replication: solr.ReplicationHandler
[junit4:junit4]   2> 17857 T128 oasc.RequestHandlers.initHandlersFromConfig created /update: solr.UpdateRequestHandler
[junit4:junit4]   2> 17858 T128 oasc.RequestHandlers.initHandlersFromConfig created /admin/: org.apache.solr.handler.admin.AdminHandlers
[junit4:junit4]   2> 17861 T128 oashl.XMLLoader.init xsltCacheLifetimeSeconds=60
[junit4:junit4]   2> 17863 T128 oasc.CachingDirectoryFactory.close Releasing directory:/mnt/ssd/jenkins/workspace/Lucene-Solr-trunk-Linux/solr/build/solr-core/test/J1/./org.apache.solr.cloud.UnloadDistributedZkTest-1361517762958/jetty4
[junit4:junit4]   2> 17864 T128 oass.SolrIndexSearcher.<init> Opening Searcher@1b22e5be main
[junit4:junit4]   2> 17864 T128 oasu.UpdateHandler.clearLog Clearing tlog files, tlogDir=./org.apache.solr.cloud.UnloadDistributedZkTest-1361517762958/jetty4/tlog
[junit4:junit4]   2> 17864 T128 oasu.CommitTracker.<init> Hard AutoCommit: disabled
[junit4:junit4]   2> 17864 T128 oasu.CommitTracker.<init> Soft AutoCommit: disabled
[junit4:junit4]   2> 17868 T129 oasc.SolrCore.registerSearcher [collection1] Registered new searcher Searcher@1b22e5be main{StandardDirectoryReader(segments_1:1)}
[junit4:junit4]   2> 17869 T128 oasc.ZkController.publish publishing core=collection1 state=down
[junit4:junit4]   2> 17869 T128 oasc.ZkController.publish numShards not found on descriptor - reading it from system property
[junit4:junit4]   2> 18774 T63 oascc.ZkStateReader.updateClusterState Updating cloud state from ZooKeeper... 
[junit4:junit4]   2> 18776 T63 oasc.Overseer$ClusterStateUpdater.updateState Update state numShards=2 message={
[junit4:junit4]   2> 	  "core":"collection1",
[junit4:junit4]   2> 	  "numShards":"2",
[junit4:junit4]   2> 	  "shard":null,
[junit4:junit4]   2> 	  "roles":null,
[junit4:junit4]   2> 	  "state":"down",
[junit4:junit4]   2> 	  "base_url":"http://127.0.0.1:37087",
[junit4:junit4]   2> 	  "collection":"collection1",
[junit4:junit4]   2> 	  "node_name":"127.0.0.1:37087_",
[junit4:junit4]   2> 	  "operation":"state"}
[junit4:junit4]   2> 18776 T63 oasc.Overseer$ClusterStateUpdater.updateState Collection already exists with numShards=2
[junit4:junit4]   2> 18776 T63 oasc.Overseer$ClusterStateUpdater.updateState Assigning new node to shard shard=shard1
[junit4:junit4]   2> 18782 T68 oascc.ZkStateReader$2.process A cluster state change: WatchedEvent state:SyncConnected type:NodeDataChanged path:/clusterstate.json, has occurred - updating... (live nodes size: 5)
[junit4:junit4]   2> 18782 T81 oascc.ZkStateReader$2.process A cluster state change: WatchedEvent state:SyncConnected type:NodeDataChanged path:/clusterstate.json, has occurred - updating... (live nodes size: 5)
[junit4:junit4]   2> 18782 T127 oascc.ZkStateReader$2.process A cluster state change: WatchedEvent state:SyncConnected type:NodeDataChanged path:/clusterstate.json, has occurred - updating... (live nodes size: 5)
[junit4:junit4]   2> 18782 T111 oascc.ZkStateReader$2.process A cluster state change: WatchedEvent state:SyncConnected type:NodeDataChanged path:/clusterstate.json, has occurred - updating... (live nodes size: 5)
[junit4:junit4]   2> 18782 T62 oascc.ZkStateReader$2.process A cluster state change: WatchedEvent state:SyncConnected type:NodeDataChanged path:/clusterstate.json, has occurred - updating... (live nodes size: 5)
[junit4:junit4]   2> 18782 T96 oascc.ZkStateReader$2.process A cluster state change: WatchedEvent state:SyncConnected type:NodeDataChanged path:/clusterstate.json, has occurred - updating... (live nodes size: 5)
[junit4:junit4]   2> 18871 T128 oasc.CoreContainer.registerCore registering core: collection1
[junit4:junit4]   2> 18871 T128 oasc.ZkController.register Register replica - core:collection1 address:http://127.0.0.1:37087 collection:collection1 shard:shard1
[junit4:junit4]   2> 18876 T128 oasc.ZkController.register We are http://127.0.0.1:37087/collection1/ and leader is http://127.0.0.1:41721/collection1/
[junit4:junit4]   2> 18876 T128 oasc.ZkController.register No LogReplay needed for core=collection1 baseURL=http://127.0.0.1:37087
[junit4:junit4]   2> 18876 T128 oasc.ZkController.checkRecovery Core needs to recover:collection1
[junit4:junit4]   2> 18876 T128 oasu.DefaultSolrCoreState.doRecovery Running recovery - first canceling any ongoing recovery
[junit4:junit4]   2> ASYNC  NEW_CORE C6 name=collection1 org.apache.solr.core.SolrCore@4f63c7f5 url=http://127.0.0.1:37087/collection1 node=127.0.0.1:37087_ C6_STATE=coll:collection1 core:collection1 props:{core=collection1, shard=null, roles=null, state=down, base_url=http://127.0.0.1:37087, collection=collection1, node_name=127.0.0.1:37087_}
[junit4:junit4]   2> 18877 T130 C6 P37087 oasc.RecoveryStrategy.run Starting recovery process.  core=collection1 recoveringAfterStartup=true
[junit4:junit4]   2> 18878 T130 C6 P37087 oasc.RecoveryStrategy.doRecovery ###### startupVersions=[]
[junit4:junit4]   2> 18878 T128 oascc.ZkStateReader.updateClusterState Updating cloud state from ZooKeeper... 
[junit4:junit4]   2> 18878 T130 C6 P37087 oasc.ZkController.publish publishing core=collection1 state=recovering
[junit4:junit4]   2> 18879 T130 C6 P37087 oasc.ZkController.publish numShards not found on descriptor - reading it from system property
[junit4:junit4]   2> 18880 T40 oass.SolrDispatchFilter.init user.dir=/mnt/ssd/jenkins/workspace/Lucene-Solr-trunk-Linux/solr/build/solr-core/test/J1
[junit4:junit4]   2> 18880 T40 oass.SolrDispatchFilter.init SolrDispatchFilter.init() done
[junit4:junit4]   2> 18880 T130 C6 P37087 oascsi.HttpClientUtil.createClient Creating new http client, config:maxConnections=128&maxConnectionsPerHost=32&followRedirects=false
[junit4:junit4]   2> 18880 T40 oascsi.HttpClientUtil.createClient Creating new http client, config:maxConnections=128&maxConnectionsPerHost=32&followRedirects=false
[junit4:junit4]   2> 18884 T40 oascc.ZkStateReader.updateClusterState Updating cloud state from ZooKeeper... 
[junit4:junit4]   2> 18886 T40 oascsi.HttpClientUtil.createClient Creating new http client, config:maxConnections=128&maxConnectionsPerHost=32&followRedirects=false
[junit4:junit4]   2> 18892 T74 oasc.CoreContainer.create Creating SolrCore 'unloadcollection1' using instanceDir: /mnt/ssd/jenkins/workspace/Lucene-Solr-trunk-Linux/solr/build/solr-core/test/J1/./org.apache.solr.cloud.UnloadDistributedZkTest-jetty1-1361517766639/unloadcollection1
[junit4:junit4]   2> 18892 T74 oasc.ZkController.createCollectionZkNode Check for collection zkNode:unloadcollection
[junit4:junit4]   2> 18893 T74 oasc.ZkController.createCollectionZkNode Creating collection in ZooKeeper:unloadcollection
[junit4:junit4]   2> 18893 T74 oasc.ZkController.getConfName Looking for collection configName
[junit4:junit4]   2> 18894 T74 oasc.ZkController.getConfName Only one config set found in zk - using it:conf1
[junit4:junit4]   2> 18895 T74 oascc.SolrZkClient.makePath makePath: /collections/unloadcollection
[junit4:junit4]   2> 18896 T74 oasc.ZkController.readConfigName Load collection config from:/collections/unloadcollection
[junit4:junit4]   2> 18898 T74 oasc.SolrResourceLoader.<init> new SolrResourceLoader for directory: '/mnt/ssd/jenkins/workspace/Lucene-Solr-trunk-Linux/solr/build/solr-core/test/J1/./org.apache.solr.cloud.UnloadDistributedZkTest-jetty1-1361517766639/unloadcollection1/'
[junit4:junit4]   2> 18941 T74 oasc.SolrConfig.<init> Using Lucene MatchVersion: LUCENE_50
[junit4:junit4]   2> 18981 T74 oasc.SolrConfig.<init> Loaded SolrConfig: solrconfig.xml
[junit4:junit4]   2> 18982 T74 oass.IndexSchema.readSchema Reading Solr Schema
[junit4:junit4]   2> 18986 T74 oass.IndexSchema.readSchema Schema name=test
[junit4:junit4]   2> 19299 T74 oass.OpenExchangeRatesOrgProvider.init Initialized with rates=open-exchange-rates.json, refreshInterval=1440.
[junit4:junit4]   2> 19304 T74 oass.IndexSchema.readSchema default search field in schema is text
[junit4:junit4]   2> 19306 T74 oass.IndexSchema.readSchema unique key field: id
[junit4:junit4]   2> 19320 T74 oass.FileExchangeRateProvider.reload Reloading exchange rates from file currency.xml
[junit4:junit4]   2> 19325 T74 oass.FileExchangeRateProvider.reload Reloading exchange rates from file currency.xml
[junit4:junit4]   2> 19329 T74 oass.OpenExchangeRatesOrgProvider.reload Reloading exchange rates from open-exchange-rates.json
[junit4:junit4]   2>  C5_STATE=coll:collection1 core:collection1 props:{core=collection1, shard=shard2, roles=null, state=recovering, base_url=http://127.0.0.1:50857, collection=collection1, node_name=127.0.0.1:50857_}
[junit4:junit4]   2> 19330 T114 C5 P50857 oasc.RecoveryStrategy.doRecovery Attempting to PeerSync from http://127.0.0.1:37755/collection1/ core=collection1 - recoveringAfterStartup=true
[junit4:junit4]   2> 19331 T74 oass.OpenExchangeRatesOrgProvider.reload Reloading exchange rates from open-exchange-rates.json
[junit4:junit4]   2> 19332 T74 oasc.SolrCore.<init> [unloadcollection1] Opening new SolrCore at /mnt/ssd/jenkins/workspace/Lucene-Solr-trunk-Linux/solr/build/solr-core/test/J1/./org.apache.solr.cloud.UnloadDistributedZkTest-jetty1-1361517766639/unloadcollection1/, dataDir=/mnt/ssd/jenkins/workspace/Lucene-Solr-trunk-Linux/solr/build/solr-core/test/J1/./solrtest-UnloadDistributedZkTest-1361517762959/1361517781843unloadcollection1_1n/
[junit4:junit4]   2> 19333 T74 oasc.JmxMonitoredMap.<init> JMX monitoring is enabled. Adding Solr mbeans to JMX Server: com.sun.jmx.mbeanserver.JmxMBeanServer@36262bf5
[junit4:junit4]   2> 19333 T114 C5 P50857 oascsi.HttpClientUtil.createClient Creating new http client, config:maxConnectionsPerHost=20&maxConnections=10000&connTimeout=30000&socketTimeout=30000&retry=false
[junit4:junit4]   2> 19334 T74 oasc.SolrCore.initDirectoryFactory org.apache.solr.core.MockDirectoryFactory
[junit4:junit4]   2> 19335 T74 oasc.CachingDirectoryFactory.get return new directory for /mnt/ssd/jenkins/workspace/Lucene-Solr-trunk-Linux/solr/build/solr-core/test/J1/./solrtest-UnloadDistributedZkTest-1361517762959/1361517781843unloadcollection1_1n forceNew:false
[junit4:junit4]   2> 19335 T74 oasc.CachingDirectoryFactory.close Releasing directory:/mnt/ssd/jenkins/workspace/Lucene-Solr-trunk-Linux/solr/build/solr-core/test/J1/./solrtest-UnloadDistributedZkTest-1361517762959/1361517781843unloadcollection1_1n
[junit4:junit4]   2> 19335 T74 oasc.SolrCore.getNewIndexDir New index directory detected: old=null new=/mnt/ssd/jenkins/workspace/Lucene-Solr-trunk-Linux/solr/build/solr-core/test/J1/./solrtest-UnloadDistributedZkTest-1361517762959/1361517781843unloadcollection1_1n/index/
[junit4:junit4]   2> 19336 T74 oasc.SolrCore.initIndex WARNING [unloadcollection1] Solr index directory '/mnt/ssd/jenkins/workspace/Lucene-Solr-trunk-Linux/solr/build/solr-core/test/J1/./solrtest-UnloadDistributedZkTest-1361517762959/1361517781843unloadcollection1_1n/index' doesn't exist. Creating new index...
[junit4:junit4]   2> 19337 T74 oasc.CachingDirectoryFactory.get return new directory for /mnt/ssd/jenkins/workspace/Lucene-Solr-trunk-Linux/solr/build/solr-core/test/J1/./solrtest-UnloadDistributedZkTest-1361517762959/1361517781843unloadcollection1_1n/index forceNew:false
[junit4:junit4]   2> 19344 T114 C5 P50857 oasu.PeerSync.sync PeerSync: core=collection1 url=http://127.0.0.1:50857 START replicas=[http://127.0.0.1:37755/collection1/] nUpdates=100
[junit4:junit4]   2> 19348 T114 C5 P50857 oasu.PeerSync.sync WARNING no frame of reference to tell of we've missed updates
[junit4:junit4]   2> 19348 T114 C5 P50857 oasc.RecoveryStrategy.doRecovery PeerSync Recovery was not successful - trying replication. core=collection1
[junit4:junit4]   2> 19348 T114 C5 P50857 oasc.RecoveryStrategy.doRecovery Starting Replication Recovery. core=collection1
[junit4:junit4]   2> 19349 T114 C5 P50857 oasc.RecoveryStrategy.doRecovery Begin buffering updates. core=collection1
[junit4:junit4]   2> 19349 T114 C5 P50857 oasu.UpdateLog.bufferUpdates Starting to buffer updates. FSUpdateLog{state=ACTIVE, tlog=null}
[junit4:junit4]   2> 19349 T114 C5 P50857 oasc.RecoveryStrategy.replicate Attempting to replicate from http://127.0.0.1:37755/collection1/. core=collection1
[junit4:junit4]   2> 19349 T114 C5 P50857 oascsi.HttpClientUtil.createClient Creating new http client, config:maxConnections=128&maxConnectionsPerHost=32&followRedirects=false
[junit4:junit4]   2> 19350 T74 oasc.SolrDeletionPolicy.onCommit SolrDeletionPolicy.onCommit: commits:num=1
[junit4:junit4]   2> 		commit{dir=MockDirWrapper(org.apache.lucene.store.RAMDirectory@191871a2 lockFactory=org.apache.lucene.store.NativeFSLockFactory@4a7abc22),segFN=segments_1,generation=1,filenames=[segments_1]
[junit4:junit4]   2> 19350 T74 oasc.SolrDeletionPolicy.updateCommits newest commit = 1[segments_1]
[junit4:junit4]   2> 19351 T74 oasc.CachingDirectoryFactory.close Releasing directory:/mnt/ssd/jenkins/workspace/Lucene-Solr-trunk-Linux/solr/build/solr-core/test/J1/./solrtest-UnloadDistributedZkTest-1361517762959/1361517781843unloadcollection1_1n/index
[junit4:junit4]   2> 19353 T74 oasup.UpdateRequestProcessorChain.init inserting DistributedUpdateProcessorFactory into updateRequestProcessorChain "dedupe"
[junit4:junit4]   2> 19354 T74 oasup.UpdateRequestProcessorChain.init inserting DistributedUpdateProcessorFactory into updateRequestProcessorChain "stored_sig"
[junit4:junit4]   2> 19355 T74 oasup.UpdateRequestProcessorChain.init inserting DistributedUpdateProcessorFactory into updateRequestProcessorChain "distrib-dup-test-chain-implicit"
[junit4:junit4]   2> 19355 T74 oasc.RequestHandlers.initHandlersFromConfig created standard: solr.StandardRequestHandler
[junit4:junit4]   2> 19356 T74 oasc.RequestHandlers.initHandlersFromConfig created /get: solr.RealTimeGetHandler
[junit4:junit4]   2> 19356 T74 oasc.RequestHandlers.initHandlersFromConfig adding lazy requestHandler: solr.ReplicationHandler
[junit4:junit4]   2> 19357 T74 oasc.RequestHandlers.initHandlersFromConfig created /replication: solr.ReplicationHandler
[junit4:junit4]   2> 19357 T74 oasc.RequestHandlers.initHandlersFromConfig created /update: solr.UpdateRequestHandler
[junit4:junit4]   2> 19358 T74 oasc.RequestHandlers.initHandlersFromConfig created /admin/: org.apache.solr.handler.admin.AdminHandlers
[junit4:junit4]   2> ASYNC  NEW_CORE C7 name=collection1 org.apache.solr.core.SolrCore@3828ac2f url=http://127.0.0.1:37755/collection1 node=127.0.0.1:37755_ C7_STATE=coll:collection1 core:collection1 props:{core=collection1, shard=shard2, roles=null, state=active, base_url=http://127.0.0.1:37755, collection=collection1, node_name=127.0.0.1:37755_, leader=true}
[junit4:junit4]   2> 19359 T76 C7 P37755 REQ /get {getVersions=100&qt=/get&version=2&wt=javabin&distrib=false} status=0 QTime=1 
[junit4:junit4]   2> 19361 T74 oashl.XMLLoader.init xsltCacheLifetimeSeconds=60
[junit4:junit4]   2> 19364 T74 oasc.CachingDirectoryFactory.close Releasing directory:/mnt/ssd/jenkins/workspace/Lucene-Solr-trunk-Linux/solr/build/solr-core/test/J1/./solrtest-UnloadDistributedZkTest-1361517762959/1361517781843unloadcollection1_1n
[junit4:junit4]   2> 19365 T74 oass.SolrIndexSearcher.<init> Opening Searcher@1b906ce8 main
[junit4:junit4]   2> 19365 T74 oasu.UpdateHandler.clearLog Clearing tlog files, tlogDir=/mnt/ssd/jenkins/workspace/Lucene-Solr-trunk-Linux/solr/build/solr-core/test/J1/./solrtest-UnloadDistributedZkTest-1361517762959/1361517781843unloadcollection1_1n/tlog
[junit4:junit4]   2> 19366 T74 oasu.CommitTracker.<init> Hard AutoCommit: disabled
[junit4:junit4]   2> 19366 T74 oasu.CommitTracker.<init> Soft AutoCommit: disabled
[junit4:junit4]   2> 19367 T75 C7 P37755 oasu.DirectUpdateHandler2.commit start commit{,optimize=false,openSearcher=false,waitSearcher=true,expungeDeletes=false,softCommit=false}
[junit4:junit4]   2> 19368 T75 C7 P37755 oasc.CachingDirectoryFactory.close Releasing directory:/mnt/ssd/jenkins/workspace/Lucene-Solr-trunk-Linux/solr/build/solr-core/test/J1/./org.apache.solr.cloud.UnloadDistributedZkTest-1361517762958/jetty1
[junit4:junit4]   2> 19369 T74 oasc.CachingDirectoryFactory.close Releasing directory:/mnt/ssd/jenkins/workspace/Lucene-Solr-trunk-Linux/solr/build/solr-core/test/J1/./solrtest-UnloadDistributedZkTest-1361517762959/1361517781843unloadcollection1_1n
[junit4:junit4]   2> 19369 T75 C7 P37755 oasc.SolrDeletionPolicy.onInit SolrDeletionPolicy.onInit: commits:num=1
[junit4:junit4]   2> 		commit{dir=MockDirWrapper(org.apache.lucene.store.RAMDirectory@3bcc7247 lockFactory=org.apache.lucene.store.NativeFSLockFactory@1c934e78),segFN=segments_1,generation=1,filenames=[segments_1]
[junit4:junit4]   2> 19370 T75 C7 P37755 oasc.SolrDeletionPolicy.updateCommits newest commit = 1[segments_1]
[junit4:junit4]   2> 19371 T74 oasc.ZkController.publish publishing core=unloadcollection1 state=down
[junit4:junit4]   2> 19371 T75 C7 P37755 oasc.SolrDeletionPolicy.onCommit SolrDeletionPolicy.onCommit: commits:num=2
[junit4:junit4]   2> 		commit{dir=MockDirWrapper(org.apache.lucene.store.RAMDirectory@3bcc7247 lockFactory=org.apache.lucene.store.NativeFSLockFactory@1c934e78),segFN=segments_1,generation=1,filenames=[segments_1]
[junit4:junit4]   2> 		commit{dir=MockDirWrapper(org.apache.lucene.store.RAMDirectory@3bcc7247 lockFactory=org.apache.lucene.store.NativeFSLockFactory@1c934e78),segFN=segments_2,generation=2,filenames=[segments_2]
[junit4:junit4]   2> 19371 T132 oasc.SolrCore.registerSearcher [unloadcollection1] Registered new searcher Searcher@1b906ce8 main{StandardDirectoryReader(segments_1:1)}
[junit4:junit4]   2> 19371 T75 C7 P37755 oasc.SolrDeletionPolicy.updateCommits newest commit = 2[segments_2]
[junit4:junit4]   2> 19372 T75 C7 P37755 oasc.CachingDirectoryFactory.close Releasing directory:/mnt/ssd/jenkins/workspace/Lucene-Solr-trunk-Linux/solr/build/solr-core/test/J1/./org.apache.solr.cloud.UnloadDistributedZkTest-1361517762958/jetty1
[junit4:junit4]   2> 19372 T75 C7 P37755 oass.SolrIndexSearcher.<init> Opening Searcher@766c6aef realtime
[junit4:junit4]   2> 19373 T75 C7 P37755 oasu.DirectUpdateHandler2.commit end_commit_flush
[junit4:junit4]   2> 19373 T75 C7 P37755 /update {softCommit=false&commit=true&openSearcher=false&version=2&wt=javabin&commit_end_point=true&waitSearcher=true} {commit=} 0 12
[junit4:junit4]   2> 19399 T114 C5 P50857 oash.ReplicationHandler.inform Commits will be reserved for  10000
[junit4:junit4]   2> 19399 T114 C5 P50857 oascsi.HttpClientUtil.createClient Creating new http client, config:connTimeout=5000&socketTimeout=20000&allowCompression=false&maxConnections=10000&maxConnectionsPerHost=10000
[junit4:junit4]   2> 19404 T114 C5 P50857 oash.SnapPuller.<init>  No value set for 'pollInterval'. Timer Task not started.
[junit4:junit4]   2> 19415 T76 C7 P37755 oash.ReplicationHandler.inform Commits will be reserved for  10000
[junit4:junit4]   2> 19415 T76 C7 P37755 REQ /replication {qt=/replication&version=2&wt=javabin&command=indexversion} status=0 QTime=9 
[junit4:junit4]   2> 19417 T114 C5 P50857 oash.SnapPuller.fetchLatestIndex Master's generation: 2
[junit4:junit4]   2> 19418 T114 C5 P50857 oash.SnapPuller.fetchLatestIndex Slave's generation: 1
[junit4:junit4]   2> 19418 T114 C5 P50857 oash.SnapPuller.fetchLatestIndex Starting replication process
[junit4:junit4]   2> 19421 T75 C7 P37755 oasc.CachingDirectoryFactory.close Releasing directory:/mnt/ssd/jenkins/workspace/Lucene-Solr-trunk-Linux/solr/build/solr-core/test/J1/./org.apache.solr.cloud.UnloadDistributedZkTest-1361517762958/jetty1
[junit4:junit4]   2> 19421 T75 C7 P37755 oasc.CachingDirectoryFactory.close Releasing directory:/mnt/ssd/jenkins/workspace/Lucene-Solr-trunk-Linux/solr/build/solr-core/test/J1/./org.apache.solr.cloud.UnloadDistributedZkTest-1361517762958/jetty1/index
[junit4:junit4]   2> 19422 T75 C7 P37755 REQ /replication {generation=2&qt=/replication&version=2&wt=javabin&command=filelist} status=0 QTime=1 
[junit4:junit4]   2> 19423 T114 C5 P50857 oash.SnapPuller.fetchLatestIndex Number of files in latest index in master: 1
[junit4:junit4]   2> 19424 T114 C5 P50857 oasc.CachingDirectoryFactory.get return new directory for /mnt/ssd/jenkins/workspace/Lucene-Solr-trunk-Linux/solr/build/solr-core/test/J1/./org.apache.solr.cloud.UnloadDistributedZkTest-1361517762958/jetty3/index.20130222102302377 forceNew:false
[junit4:junit4]   2> 19424 T114 C5 P50857 oasc.CachingDirectoryFactory.close Releasing directory:/mnt/ssd/jenkins/workspace/Lucene-Solr-trunk-Linux/solr/build/solr-core/test/J1/./org.apache.solr.cloud.UnloadDistributedZkTest-1361517762958/jetty3
[junit4:junit4]   2> 19425 T114 C5 P50857 oash.SnapPuller.fetchLatestIndex Starting download to MockDirWrapper(org.apache.lucene.store.RAMDirectory@f143878 lockFactory=org.apache.lucene.store.NativeFSLockFactory@7d201cc6) fullCopy=true
[junit4:junit4]   2> 19432 T77 C7 P37755 REQ /replication {checksum=true&generation=2&qt=/replication&wt=filestream&file=segments_2&command=filecontent} status=0 QTime=2 
[junit4:junit4]   2> 19436 T114 C5 P50857 oasc.CachingDirectoryFactory.close Releasing directory:/mnt/ssd/jenkins/workspace/Lucene-Solr-trunk-Linux/solr/build/solr-core/test/J1/./org.apache.solr.cloud.UnloadDistributedZkTest-1361517762958/jetty3/index
[junit4:junit4]   2> 19437 T114 C5 P50857 oash.SnapPuller.fetchLatestIndex Total time taken for download : 0 secs
[junit4:junit4]   2> 19437 T114 C5 P50857 oash.SnapPuller.modifyIndexProps New index installed. Updating index properties... index=index.20130222102302377
[junit4:junit4]   2> 19446 T114 C5 P50857 oasc.CachingDirectoryFactory.close Releasing directory:/mnt/ssd/jenkins/workspace/Lucene-Solr-trunk-Linux/solr/build/solr-core/test/J1/./org.apache.solr.cloud.UnloadDistributedZkTest-1361517762958/jetty3
[junit4:junit4]   2> 19447 T114 C5 P50857 oasc.CachingDirectoryFactory.close Releasing directory:/mnt/ssd/jenkins/workspace/Lucene-Solr-trunk-Linux/solr/build/solr-core/test/J1/./org.apache.solr.cloud.UnloadDistributedZkTest-1361517762958/jetty3
[junit4:junit4]   2> 19447 T114 C5 P50857 oasc.SolrCore.getNewIndexDir New index directory detected: old=./org.apache.solr.cloud.UnloadDistributedZkTest-1361517762958/jetty3/index/ new=./org.apache.solr.cloud.UnloadDistributedZkTest-1361517762958/jetty3/index.20130222102302377
[junit4:junit4]   2> 19448 T114 C5 P50857 oasc.SolrDeletionPolicy.onInit SolrDeletionPolicy.onInit: commits:num=1
[junit4:junit4]   2> 		commit{dir=MockDirWrapper(org.apache.lucene.store.RAMDirectory@f143878 lockFactory=org.apache.lucene.store.NativeFSLockFactory@7d201cc6),segFN=segments_2,generation=2,filenames=[segments_2]
[junit4:junit4]   2> 19449 T114 C5 P50857 oasc.SolrDeletionPolicy.updateCommits newest commit = 2[segments_2]
[junit4:junit4]   2> 19450 T114 C5 P50857 oasc.CachingDirectoryFactory.close Releasing directory:/mnt/ssd/jenkins/workspace/Lucene-Solr-trunk-Linux/solr/build/solr-core/test/J1/./org.apache.solr.cloud.UnloadDistributedZkTest-1361517762958/jetty3
[junit4:junit4]   2> 19451 T114 C5 P50857 oasu.DefaultSolrCoreState.newIndexWriter Creating new IndexWriter...
[junit4:junit4]   2> 19451 T114 C5 P50857 oasu.DefaultSolrCoreState.newIndexWriter Waiting until IndexWriter is unused... core=collection1
[junit4:junit4]   2> 19452 T114 C5 P50857 oasu.DefaultSolrCoreState.newIndexWriter Rollback old IndexWriter... core=collection1
[junit4:junit4]   2> 19452 T114 C5 P50857 oasc.CachingDirectoryFactory.close Releasing directory:/mnt/ssd/jenkins/workspace/Lucene-Solr-trunk-Linux/solr/build/solr-core/test/J1/./org.apache.solr.cloud.UnloadDistributedZkTest-1361517762958/jetty3/index.20130222102302377
[junit4:junit4]   2> 19453 T114 C5 P50857 oasc.CachingDirectoryFactory.close Releasing directory:/mnt/ssd/jenkins/workspace/Lucene-Solr-trunk-Linux/solr/build/solr-core/test/J1/./org.apache.solr.cloud.UnloadDistributedZkTest-1361517762958/jetty3
[junit4:junit4]   2> 19454 T114 C5 P50857 oasc.SolrDeletionPolicy.onInit SolrDeletionPolicy.onInit: commits:num=1
[junit4:junit4]   2> 		commit{dir=MockDirWrapper(org.apache.lucene.store.RAMDirectory@f143878 lockFactory=org.apache.lucene.store.NativeFSLockFactory@7d201cc6),segFN=segments_2,generation=2,filenames=[segments_2]
[junit4:junit4]   2> 19454 T114 C5 P50857 oasc.SolrDeletionPolicy.updateCommits newest commit = 2[segments_2]
[junit4:junit4]   2> 19454 T114 C5 P50857 oasu.DefaultSolrCoreState.newIndexWriter New IndexWriter is ready to be used.
[junit4:junit4]   2> 19455 T114 C5 P50857 oasc.CachingDirectoryFactory.close Releasing directory:/mnt/ssd/jenkins/workspace/Lucene-Solr-trunk-Linux/solr/build/solr-core/test/J1/./org.apache.solr.cloud.UnloadDistributedZkTest-1361517762958/jetty3
[junit4:junit4]   2> 19455 T114 C5 P50857 oass.SolrIndexSearcher.<init> Opening Searcher@6957edea main
[junit4:junit4]   2> 19456 T113 oasc.SolrCore.registerSearcher [collection1] Registered new searcher Searcher@6957edea main{StandardDirectoryReader(segments_2:1:nrt)}
[junit4:junit4]   2> 19457 T113 oasc.CachingDirectoryFactory.close Releasing directory:/mnt/ssd/jenkins/workspace/Lucene-Solr-trunk-Linux/solr/build/solr-core/test/J1/./org.apache.solr.cloud.UnloadDistributedZkTest-1361517762958/jetty3/index
[junit4:junit4]   2> 19457 T114 C5 P50857 oasu.DirectUpdateHandler2.commit start commit{,optimize=false,openSearcher=false,waitSearcher=false,expungeDeletes=false,softCommit=false}
[junit4:junit4]   2> 19457 T114 C5 P50857 oasc.SolrDeletionPolicy.onCommit SolrDeletionPolicy.onCommit: commits:num=2
[junit4:junit4]   2> 		commit{dir=MockDirWrapper(org.apache.lucene.store.RAMDirectory@f143878 lockFactory=org.apache.lucene.store.NativeFSLockFactory@7d201cc6),segFN=segments_2,generation=2,filenames=[segments_2]
[junit4:junit4]   2> 		commit{dir=MockDirWrapper(org.apache.lucene.store.RAMDirectory@f143878 lockFactory=org.apache.lucene.store.NativeFSLockFactory@7d201cc6),segFN=segments_3,generation=3,filenames=[segments_3]
[junit4:junit4]   2> 19458 T114 C5 P50857 oasc.SolrDeletionPolicy.updateCommits newest commit = 3[segments_3]
[junit4:junit4]   2> 19458 T114 C5 P50857 oasc.CachingDirectoryFactory.close Releasing directory:/mnt/ssd/jenkins/workspace/Lucene-Solr-trunk-Linux/solr/build/solr-core/test/J1/./org.apache.solr.cloud.UnloadDistributedZkTest-1361517762958/jetty3
[junit4:junit4]   2> 19459 T114 C5 P50857 oasu.DirectUpdateHandler2.commit end_commit_flush
[junit4:junit4]   2> 19459 T114 C5 P50857 oasc.CachingDirectoryFactory.close Releasing directory:/mnt/ssd/jenkins/workspace/Lucene-Solr-trunk-Linux/solr/build/solr-core/test/J1/./org.apache.solr.cloud.UnloadDistributedZkTest-1361517762958/jetty3/index.20130222102302377
[junit4:junit4]   2> 19459 T114 C5 P50857 oasc.CachingDirectoryFactory.close Releasing directory:/mnt/ssd/jenkins/workspace/Lucene-Solr-trunk-Linux/solr/build/solr-core/test/J1/./org.apache.solr.cloud.UnloadDistributedZkTest-1361517762958/jetty3/index
[junit4:junit4]   2> 19459 T114 C5 P50857 oasc.RecoveryStrategy.replay No replay needed. core=collection1
[junit4:junit4]   2> 19459 T114 C5 P50857 oasc.RecoveryStrategy.doRecovery Replication Recovery was successful - registering as Active. core=collection1
[junit4:junit4]   2> 19460 T114 C5 P50857 oasc.ZkController.publish publishing core=collection1 state=active
[junit4:junit4]   2> 19460 T114 C5 P50857 oasc.ZkController.publish numShards not found on descriptor - reading it from system property
[junit4:junit4]   2> 19462 T114 C5 P50857 oasc.RecoveryStrategy.doRecovery Finished recovery process. core=collection1
[junit4:junit4]   2> 20289 T63 oascc.ZkStateReader.updateClusterState Updating cloud state from ZooKeeper... 
[junit4:junit4]   2> 20290 T63 oasc.Overseer$ClusterStateUpdater.updateState Update state numShards=2 message={
[junit4:junit4]   2> 	  "core":"collection1",
[junit4:junit4]   2> 	  "numShards":"2",
[junit4:junit4]   2> 	  "shard":"shard1",
[junit4:junit4]   2> 	  "roles":null,
[junit4:junit4]   2> 	  "state":"recovering",
[junit4:junit4]   2> 	  "base_url":"http://127.0.0.1:37087",
[junit4:junit4]   2> 	  "collection":"collection1",
[junit4:junit4]   2> 	  "node_name":"127.0.0.1:37087_",
[junit4:junit4]   2> 	  "operation":"state"}
[junit4:junit4]   2> 20293 T63 oasc.Overseer$ClusterStateUpdater.updateState Update state numShards=1 message={
[junit4:junit4]   2> 	  "core":"unloadcollection1",
[junit4:junit4]   2> 	  "numShards":"1",
[junit4:junit4]   2> 	  "shard":null,
[junit4:junit4]   2> 	  "roles":null,
[junit4:junit4]   2> 	  "state":"down",
[junit4:junit4]   2> 	  "base_url":"http://127.0.0.1:37755",
[junit4:junit4]   2> 	  "collection":"unloadcollection",
[junit4:junit4]   2> 	  "node_name":"127.0.0.1:37755_",
[junit4:junit4]   2> 	  "operation":"state"}
[junit4:junit4]   2> 20293 T63 oasc.Overseer$ClusterStateUpdater.createCollection Create collection unloadcollection with numShards 1
[junit4:junit4]   2> 20293 T63 oasc.Overseer$ClusterStateUpdater.updateState Assigning new node to shard shard=shard1
[junit4:junit4]   2> 20297 T63 oasc.Overseer$ClusterStateUpdater.updateState Update state numShards=2 message={
[junit4:junit4]   2> 	  "core":"collection1",
[junit4:junit4]   2> 	  "numShards":"2",
[junit4:junit4]   2> 	  "shard":"shard2",
[junit4:junit4]   2> 	  "roles":null,
[junit4:junit4]   2> 	  "state":"active",
[junit4:junit4]   2> 	  "base_url":"http://127.0.0.1:50857",
[junit4:junit4]   2> 	  "collection":"collection1",
[junit4:junit4]   2> 	  "node_name":"127.0.0.1:50857_",
[junit4:junit4]   2> 	  "operation":"state"}
[junit4:junit4]   2> 20309 T68 oascc.ZkStateReader$2.process A cluster state change: WatchedEvent state:SyncConnected type:NodeDataChanged path:/clusterstate.json, has occurred - updating... (live nodes size: 5)
[junit4:junit4]   2> 20309 T81 oascc.ZkStateReader$2.process A cluster state change: WatchedEvent state:SyncConnected type:NodeDataChanged path:/clusterstate.json, has occurred - updating... (live nodes size: 5)
[junit4:junit4]   2> 20310 T127 oascc.ZkStateReader$2.process A cluster state change: WatchedEvent state:SyncConnected type:NodeDataChanged path:/clusterstate.json, has occurred - updating... (live nodes size: 5)
[junit4:junit4]   2> 20310 T96 oascc.ZkStateReader$2.process A cluster state change: WatchedEvent state:SyncConnected type:NodeDataChanged path:/clusterstate.json, has occurred - updating... (live nodes size: 5)
[junit4:junit4]   2> 20310 T62 oascc.ZkStateReader$2.process A cluster state change: WatchedEvent state:SyncConnected type:NodeDataChanged path:/clusterstate.json, has occurred - updating... (live nodes size: 5)
[junit4:junit4]   2> 20310 T111 oascc.ZkStateReader$2.process A cluster state change: WatchedEvent state:SyncConnected type:NodeDataChanged path:/clusterstate.json, has occurred - updating... (live nodes size: 5)
[junit4:junit4]   2> 20372 T74 oasc.CoreContainer.registerCore registering core: unloadcollection1
[junit4:junit4]   2> 20373 T74 oasc.ZkController.register Register replica - core:unloadcollection1 address:http://127.0.0.1:37755 collection:unloadcollection shard:shard1
[junit4:junit4]   2> 20374 T74 oascc.SolrZkClient.makePath makePath: /collections/unloadcollection/leader_elect/shard1/election
[junit4:junit4]   2> 20381 T45 oazs.PrepRequestProcessor.pRequest Got user-level KeeperException when processing sessionid:0x13d00c859e70006 type:delete cxid:0xa6 zxid:0xc3 txntype:-1 reqpath:n/a Error Path:/solr/collections/unloadcollection/leaders Error:KeeperErrorCode = NoNode for /solr/collections/unloadcollection/leaders
[junit4:junit4]   2> 20382 T74 oasc.ShardLeaderElectionContext.runLeaderProcess Running the leader process.
[junit4:junit4]   2> 20383 T45 oazs.PrepRequestProcessor.pRequest Got user-level KeeperException when processing sessionid:0x13d00c859e70006 type:create cxid:0xa7 zxid:0xc4 txntype:-1 reqpath:n/a Error Path:/solr/overseer Error:KeeperErrorCode = NodeExists for /solr/overseer
[junit4:junit4]   2> 20384 T74 oasc.ShardLeaderElectionContext.waitForReplicasToComeUp Enough replicas found to continue.
[junit4:junit4]   2> 20384 T74 oasc.ShardLeaderElectionContext.runLeaderProcess I may be the new leader - try and sync
[junit4:junit4]   2> 20385 T74 oasc.SyncStrategy.sync Sync replicas to http://127.0.0.1:37755/unloadcollection1/
[junit4:junit4]   2> 20385 T74 oasc.SyncStrategy.syncReplicas Sync Success - now sync replicas to me
[junit4:junit4]   2> 20385 T74 oasc.SyncStrategy.syncToMe http://127.0.0.1:37755/unloadcollection1/ has no replicas
[junit4:junit4]   2> 20385 T74 oasc.ShardLeaderElectionContext.runLeaderProcess I am the new leader: http://127.0.0.1:37755/unloadcollection1/
[junit4:junit4]   2> 20385 T74 oascc.SolrZkClient.makePath makePath: /collections/unloadcollection/leaders/shard1
[junit4:junit4]   2> 20388 T45 oazs.PrepRequestProcessor.pRequest Got user-level KeeperException when processing sessionid:0x13d00c859e70006 type:create cxid:0xb1 zxid:0xc8 txntype:-1 reqpath:n/a Error Path:/solr/overseer Error:KeeperErrorCode = NodeExists for /solr/overseer
[junit4:junit4]   2> 21822 T63 oascc.ZkStateReader.updateClusterState Updating cloud state from ZooKeeper... 
[junit4:junit4]   2> 21834 T111 oascc.ZkStateReader$2.process A cluster state change: WatchedEvent state:SyncConnected type:NodeDataChanged path:/clusterstate.json, has occurred - updating... (live nodes size: 5)
[junit4:junit4]   2> 21834 T81 oascc.ZkStateReader$2.process A cluster state change: WatchedEvent state:SyncConnected type:NodeDataChanged path:/clusterstate.json, has occurred - updating... (live nodes size: 5)
[junit4:junit4]   2> 21834 T62 oascc.ZkStateReader$2.process A cluster state change: WatchedEvent state:SyncConnected type:NodeDataChanged path:/clusterstate.json, has occurred - updating... (live nodes size: 5)
[junit4:junit4]   2> 21834 T68 oascc.ZkStateReader$2.process A cluster state change: WatchedEvent state:SyncConnected type:NodeDataChanged path:/clusterstate.json, has occurred - updating... (live nodes size: 5)
[junit4:junit4]   2> 21834 T96 oascc.ZkStateReader$2.process A cluster state change: WatchedEvent state:SyncConnected type:NodeDataChanged path:/clusterstate.json, has occurred - updating... (live nodes size: 5)
[junit4:junit4]   2> 21834 T127 oascc.ZkStateReader$2.process A cluster state change: WatchedEvent state:SyncConnected type:NodeDataChanged path:/clusterstate.json, has occurred - updating... (live nodes size: 5)
[junit4:junit4]   2> 21844 T74 oasc.ZkController.register We are http://127.0.0.1:37755/unloadcollection1/ and leader is http://127.0.0.1:37755/unloadcollection1/
[junit4:junit4]   2> 21844 T74 oasc.ZkController.register No LogReplay needed for core=unloadcollection1 baseURL=http://127.0.0.1:37755
[junit4:junit4]   2> 21845 T74 oasc.ZkController.checkRecovery I am the leader, no recovery necessary
[junit4:junit4]   2> 21845 T74 oasc.ZkController.publish publishing core=unloadcollection1 state=active
[junit4:junit4]   2> 21847 T74 oascc.ZkStateReader.updateClusterState Updating cloud state from ZooKeeper... 
[junit4:junit4]   2> 21848 T74 oasc.CoreContainer.persistFile Persisting cores config to /mnt/ssd/jenkins/workspace/Lucene-Solr-trunk-Linux/solr/build/solr-core/test/J1/./org.apache.solr.cloud.UnloadDistributedZkTest-jetty1-1361517766639/solr.xml
[junit4:junit4]   2> 21860 T74 oasc.SolrXMLSerializer.persistFile Persisting cores config to /mnt/ssd/jenkins/workspace/Lucene-Solr-trunk-Linux/solr/build/solr-core/test/J1/./org.apache.solr.cloud.UnloadDistributedZkTest-jetty1-1361517766639/solr.xml
[junit4:junit4]   2> 21862 T40 oascsi.HttpClientUtil.createClient Creating new http client, config:
[junit4:junit4]   2> 21865 T40 oaz.ZooKeeper.<init> Initiating client connection, connectString=127.0.0.1:36499/solr sessionTimeout=10000 watcher=org.apache.solr.common.cloud.ConnectionManager@21306e0a
[junit4:junit4]   2> 21866 T40 oascc.ConnectionManager.waitForConnected Waiting for client to connect to ZooKeeper
[junit4:junit4]   2> 21866 T134 oaz.ClientCnxn$SendThread.logStartConnect Opening socket connection to server localhost.localdomain/127.0.0.1:36499. Will not attempt to authenticate using SASL (access denied ("javax.security.auth.AuthPermission" "getLoginConfiguration"))
[junit4:junit4]   2> 21866 T134 oaz.ClientCnxn$SendThread.primeConnection Socket connection established to localhost.localdomain/127.0.0.1:36499, initiating session
[junit4:junit4]   2> 21866 T42 oazs.NIOServerCnxnFactory.run Accepted socket connection from /127.0.0.1:54230
[junit4:junit4]   2> 21867 T42 oazs.ZooKeeperServer.processConnectRequest Client attempting to establish new session at /127.0.0.1:54230
[junit4:junit4]   2> 21868 T44 oazs.ZooKeeperServer.finishSessionInit Established session 0x13d00c859e7000d with negotiated timeout 10000 for client /127.0.0.1:54230
[junit4:junit4]   2> 21868 T134 oaz.ClientCnxn$SendThread.onConnected Session establishment complete on server localhost.localdomain/127.0.0.1:36499, sessionid = 0x13d00c859e7000d, negotiated timeout = 10000
[junit4:junit4]   2> 21869 T135 oascc.ConnectionManager.process Watcher org.apache.solr.common.cloud.ConnectionManager@21306e0a name:ZooKeeperConnection Watcher:127.0.0.1:36499/solr got event WatchedEvent state:SyncConnected type:None path:null path:null type:None
[junit4:junit4]   2> 21869 T40 oascc.ConnectionManager.waitForConnected Client is connected to ZooKeeper
[junit4:junit4]   2> 21870 T40 oascc.ZkStateReader.createClusterStateWatchersAndUpdate Updating cluster state from ZooKeeper... 
[junit4:junit4]   2> 21872 T40 oascc.ZkStateReader.updateClusterState Updating cloud state from ZooKeeper... 
[junit4:junit4]   2> 21873 T40 oascsi.HttpClientUtil.createClient Creating new http client, config:maxConnections=128&maxConnectionsPerHost=32&followRedirects=false
[junit4:junit4]   2> 21878 T89 oasc.CoreContainer.create Creating SolrCore 'unloadcollection2' using instanceDir: /mnt/ssd/jenkins/workspace/Lucene-Solr-trunk-Linux/solr/build/solr-core/test/J1/./org.apache.solr.cloud.UnloadDistributedZkTest-jetty2-1361517771160/unloadcollection2
[junit4:junit4]   2> 21878 T89 oasc.ZkController.createCollectionZkNode Check for collection zkNode:unloadcollection
[junit4:junit4]   2> 21879 T89 oasc.ZkController.createCollectionZkNode Collection zkNode exists
[junit4:junit4]   2> 21879 T89 oasc.ZkController.readConfigName Load collection config from:/collections/unloadcollection
[junit4:junit4]   2> 21880 T89 oasc.SolrResourceLoader.<init> new SolrResourceLoader for directory: '/mnt/ssd/jenkins/workspace/Lucene-Solr-trunk-Linux/solr/build/solr-core/test/J1/./org.apache.solr.cloud.UnloadDistributedZkTest-jetty2-1361517771160/unloadcollection2/'
[junit4:junit4]   2> 21921 T89 oasc.SolrConfig.<init> Using Lucene MatchVersion: LUCENE_50
[junit4:junit4]   2> 21970 T89 oasc.SolrConfig.<init> Loaded SolrConfig: solrconfig.xml
[junit4:junit4]   2> 21972 T89 oass.IndexSchema.readSchema Reading Solr Schema
[junit4:junit4]   2> 21976 T89 oass.IndexSchema.readSchema Schema name=test
[junit4:junit4]   2> 22335 T89 oass.OpenExchangeRatesOrgProvider.init Initialized with rates=open-exchange-rates.json, refreshInterval=1440.
[junit4:junit4]   2> 22349 T89 oass.IndexSchema.readSchema default search field in schema is text
[junit4:junit4]   2> 22352 T89 oass.IndexSchema.readSchema unique key field: id
[junit4:junit4]   2> 22372 T89 oass.FileExchangeRateProvider.reload Reloading exchange rates from file currency.xml
[junit4:junit4]   2> 22375 T89 oass.FileExchangeRateProvider.reload Reloading exchange rates from file currency.xml
[junit4:junit4]   2> 22378 T89 oass.OpenExchangeRatesOrgProvider.reload Reloading exchange rates from open-exchange-rates.json
[junit4:junit4]   2> 22379 T89 oass.OpenExchangeRatesOrgProvider.reload Reloading exchange rates from open-exchange-rates.json
[junit4:junit4]   2> 22380 T89 oasc.SolrCore.<init> [unloadcollection2] Opening new SolrCore at /mnt/ssd/jenkins/workspace/Lucene-Solr-trunk-Linux/solr/build/solr-core/test/J1/./org.apache.solr.cloud.UnloadDistributedZkTest-jetty2-1361517771160/unloadcollection2/, dataDir=/mnt/ssd/jenkins/workspace/Lucene-Solr-trunk-Linux/solr/build/solr-core/test/J1/./solrtest-UnloadDistributedZkTest-1361517762959/1361517784828unloadcollection1_2n/
[junit4:junit4]   2> 22381 T89 oasc.JmxMonitoredMap.<init> JMX monitoring is enabled. Adding Solr mbeans to JMX Server: com.sun.jmx.mbeanserver.JmxMBeanServer@36262bf5
[junit4:junit4]   2> 22381 T89 oasc.SolrCore.initDirectoryFactory org.apache.solr.core.MockDirectoryFactory
[junit4:junit4]   2> 22382 T89 oasc.CachingDirectoryFactory.get return new directory for /mnt/ssd/jenkins/workspace/Lucene-Solr-trunk-Linux/solr/build/solr-core/test/J1/./solrtest-UnloadDistributedZkTest-1361517762959/1361517784828unloadcollection1_2n forceNew:false
[junit4:junit4]   2> 22382 T89 oasc.CachingDirectoryFactory.close Releasing directory:/mnt/ssd/jenkins/workspace/Lucene-Solr-trunk-Linux/solr/build/solr-core/test/J1/./solrtest-UnloadDistributedZkTest-1361517762959/1361517784828unloadcollection1_2n
[junit4:junit4]   2> 22382 T89 oasc.SolrCore.getNewIndexDir New index directory detected: old=null new=/mnt/ssd/jenkins/workspace/Lucene-Solr-trunk-Linux/solr/build/solr-core/test/J1/./solrtest-UnloadDistributedZkTest-1361517762959/1361517784828unloadcollection1_2n/index/
[junit4:junit4]   2> 22383 T89 oasc.SolrCore.initIndex WARNING [unloadcollection2] Solr index directory '/mnt/ssd/jenkins/workspace/Lucene-Solr-trunk-Linux/solr/build/solr-core/test/J1/./solrtest-UnloadDistributedZkTest-1361517762959/1361517784828unloadcollection1_2n/index' doesn't exist. Creating new index...
[junit4:junit4]   2> 22384 T89 oasc.CachingDirectoryFactory.get return new directory for /mnt/ssd/jenkins/workspace/Lucene-Solr-trunk-Linux/solr/build/solr-core/test/J1/./solrtest-UnloadDistributedZkTest-1361517762959/1361517784828unloadcollection1_2n/index forceNew:false
[junit4:junit4]   2> 22385 T89 oasc.SolrDeletionPolicy.onCommit SolrDeletionPolicy.onCommit: commits:num=1
[junit4:junit4]   2> 		commit{dir=MockDirWrapper(org.apache.lucene.store.RAMDirectory@7848213d lockFactory=org.apache.lucene.store.NativeFSLockFactory@3c3f708f),segFN=segments_1,generation=1,filenames=[segments_1]
[junit4:junit4]   2> 22385 T89 oasc.SolrDeletionPolicy.updateCommits newest commit = 1[segments_1]
[junit4:junit4]   2> 22386 T89 oasc.CachingDirectoryFactory.close Releasing directory:/mnt/ssd/jenkins/workspace/Lucene-Solr-trunk-Linux/solr/build/solr-core/test/J1/./solrtest-UnloadDistributedZkTest-1361517762959/1361517784828unloadcollection1_2n/index
[junit4:junit4]   2> 22387 T89 oasup.UpdateRequestProcessorChain.init inserting DistributedUpdateProcessorFactory into updateRequestProcessorChain "dedupe"
[junit4:junit4]   2> 22388 T89 oasup.UpdateRequestProcessorChain.init inserting DistributedUpdateProcessorFactory into updateRequestProcessorChain "stored_sig"
[junit4:junit4]   2> 22388 T89 oasup.UpdateRequestProcessorChain.init inserting DistributedUpdateProcessorFactory into updateRequestProcessorChain "distrib-dup-test-chain-implicit"
[junit4:junit4]   2> 22389 T89 oasc.RequestHandlers.initHandlersFromConfig created standard: solr.StandardRequestHandler
[junit4:junit4]   2> 22389 T89 oasc.RequestHandlers.initHandlersFromConfig created /get: solr.RealTimeGetHandler
[junit4:junit4]   2> 22390 T89 oasc.RequestHandlers.initHandlersFromConfig adding lazy requestHandler: solr.ReplicationHandler
[junit4:junit4]   2> 22390 T89 oasc.RequestHandlers.initHandlersFromConfig created /replication: solr.ReplicationHandler
[junit4:junit4]   2> 22390 T89 oasc.RequestHandlers.initHandlersFromConfig created /update: solr.UpdateRequestHandler
[junit4:junit4]   2> 22391 T89 oasc.RequestHandlers.initHandlersFromConfig created /admin/: org.apache.solr.handler.admin.AdminHandlers
[junit4:junit4]   2> 22393 T89 oashl.XMLLoader.init xsltCacheLifetimeSeconds=60
[junit4:junit4]   2> 22395 T89 oasc.CachingDirectoryFactory.close Releasing directory:/mnt/ssd/jenkins/workspace/Lucene-Solr-trunk-Linux/solr/build/solr-core/test/J1/./solrtest-UnloadDistributedZkTest-1361517762959/1361517784828unloadcollection1_2n
[junit4:junit4]   2> 22395 T89 oass.SolrIndexSearcher.<init> Opening Searcher@69058404 main
[junit4:junit4]   2> 22396 T89 oasu.UpdateHandler.clearLog Clearing tlog files, tlogDir=/mnt/ssd/jenkins/workspace/Lucene-Solr-trunk-Linux/solr/build/solr-core/test/J1/./solrtest-UnloadDistributedZkTest-1361517762959/1361517784828unloadcollection1_2n/tlog
[junit4:junit4]   2> 22396 T89 oasu.CommitTracker.<init> Hard AutoCommit: disabled
[junit4:junit4]   2> 22397 T89 oasu.CommitTracker.<init> Soft AutoCommit: disabled
[junit4:junit4]   2> 22399 T89 oasc.CachingDirectoryFactory.close Releasing directory:/mnt/ssd/jenkins/workspace/Lucene-Solr-trunk-Linux/solr/build/solr-core/test/J1/./solrtest-UnloadDistributedZkTest-1361517762959/1361517784828unloadcollection1_2n
[junit4:junit4]   2> 22400 T136 oasc.SolrCore.registerSearcher [unloadcollection2] Registered new searcher Searcher@69058404 main{StandardDirectoryReader(segments_1:1)}
[junit4:junit4]   2> 22400 T89 oasc.ZkController.publish publishing core=unloadcollection2 state=down
[junit4:junit4]   2> 22401 T89 oasc.ZkController.publish numShards not found on descriptor - reading it from system property
[junit4:junit4]   2>  C6_STATE=coll:collection1 core:collection1 props:{core=collection1, sha

[...truncated too long message...]

tion_2",
[junit4:junit4]   1>            "base_url":"http://127.0.0.1:37755",
[junit4:junit4]   1>            "node_name":"127.0.0.1:37755_"}
[junit4:junit4]   1>     /solr/collections/test_unload_shard_and_collection/leader_elect (2)
[junit4:junit4]   1>      /solr/collections/test_unload_shard_and_collection/leader_elect/shard2 (1)
[junit4:junit4]   1>       /solr/collections/test_unload_shard_and_collection/leader_elect/shard2/election (1)
[junit4:junit4]   1>        /solr/collections/test_unload_shard_and_collection/leader_elect/shard2/election/89228428119048198-127.0.0.1:37755__test_unload_shard_and_collection_1-n_0000000000 (0)
[junit4:junit4]   1>      /solr/collections/test_unload_shard_and_collection/leader_elect/shard1 (1)
[junit4:junit4]   1>       /solr/collections/test_unload_shard_and_collection/leader_elect/shard1/election (0)
[junit4:junit4]   1>    /solr/collections/control_collection (3)
[junit4:junit4]   1>    DATA:
[junit4:junit4]   1>        {"configName":"conf1"}
[junit4:junit4]   1>     /solr/collections/control_collection/leaders (1)
[junit4:junit4]   1>      /solr/collections/control_collection/leaders/shard1 (0)
[junit4:junit4]   1>      DATA:
[junit4:junit4]   1>          {
[junit4:junit4]   1>            "core":"collection1",
[junit4:junit4]   1>            "base_url":"http://127.0.0.1:41143",
[junit4:junit4]   1>            "node_name":"127.0.0.1:41143_"}
[junit4:junit4]   1>     /solr/collections/control_collection/leader_elect (1)
[junit4:junit4]   1>      /solr/collections/control_collection/leader_elect/shard1 (1)
[junit4:junit4]   1>       /solr/collections/control_collection/leader_elect/shard1/election (1)
[junit4:junit4]   1>        /solr/collections/control_collection/leader_elect/shard1/election/89228428119048195-127.0.0.1:41143__collection1-n_0000000000 (0)
[junit4:junit4]   1>     /solr/collections/control_collection/shards (0)
[junit4:junit4]   1>  /zookeeper (1)
[junit4:junit4]   1>  DATA:
[junit4:junit4]   1>      
[junit4:junit4]   1> 
[junit4:junit4]   2> NOTE: reproduce with: ant test  -Dtestcase=UnloadDistributedZkTest -Dtests.method=testDistribSearch -Dtests.seed=C1A5B098B4F3912 -Dtests.multiplier=3 -Dtests.slow=true -Dtests.locale=zh_CN -Dtests.timezone=Asia/Bahrain -Dtests.file.encoding=US-ASCII
[junit4:junit4] FAILURE  152s J1 | UnloadDistributedZkTest.testDistribSearch <<<
[junit4:junit4]    > Throwable #1: java.lang.AssertionError: Still found shard
[junit4:junit4]    > 	at __randomizedtesting.SeedInfo.seed([C1A5B098B4F3912:8DFCD511FC10592E]:0)
[junit4:junit4]    > 	at org.junit.Assert.fail(Assert.java:93)
[junit4:junit4]    > 	at org.apache.solr.cloud.UnloadDistributedZkTest.testUnloadShardAndCollection(UnloadDistributedZkTest.java:120)
[junit4:junit4]    > 	at org.apache.solr.cloud.UnloadDistributedZkTest.doTest(UnloadDistributedZkTest.java:73)
[junit4:junit4]    > 	at org.apache.solr.BaseDistributedSearchTestCase.testDistribSearch(BaseDistributedSearchTestCase.java:794)
[junit4:junit4]    > 	at sun.reflect.NativeMethodAccessorImpl.invoke0(Native Method)
[junit4:junit4]    > 	at sun.reflect.NativeMethodAccessorImpl.invoke(NativeMethodAccessorImpl.java:57)
[junit4:junit4]    > 	at sun.reflect.DelegatingMethodAccessorImpl.invoke(DelegatingMethodAccessorImpl.java:43)
[junit4:junit4]    > 	at java.lang.reflect.Method.invoke(Method.java:474)
[junit4:junit4]    > 	at com.carrotsearch.randomizedtesting.RandomizedRunner.invoke(RandomizedRunner.java:1559)
[junit4:junit4]    > 	at com.carrotsearch.randomizedtesting.RandomizedRunner.access$600(RandomizedRunner.java:79)
[junit4:junit4]    > 	at com.carrotsearch.randomizedtesting.RandomizedRunner$6.evaluate(RandomizedRunner.java:737)
[junit4:junit4]    > 	at com.carrotsearch.randomizedtesting.RandomizedRunner$7.evaluate(RandomizedRunner.java:773)
[junit4:junit4]    > 	at com.carrotsearch.randomizedtesting.RandomizedRunner$8.evaluate(RandomizedRunner.java:787)
[junit4:junit4]    > 	at com.carrotsearch.randomizedtesting.rules.SystemPropertiesRestoreRule$1.evaluate(SystemPropertiesRestoreRule.java:53)
[junit4:junit4]    > 	at org.apache.lucene.util.TestRuleSetupTeardownChained$1.evaluate(TestRuleSetupTeardownChained.java:50)
[junit4:junit4]    > 	at org.apache.lucene.util.TestRuleFieldCacheSanity$1.evaluate(TestRuleFieldCacheSanity.java:51)
[junit4:junit4]    > 	at org.apache.lucene.util.AbstractBeforeAfterRule$1.evaluate(AbstractBeforeAfterRule.java:46)
[junit4:junit4]    > 	at com.carrotsearch.randomizedtesting.rules.SystemPropertiesInvariantRule$1.evaluate(SystemPropertiesInvariantRule.java:55)
[junit4:junit4]    > 	at org.apache.lucene.util.TestRuleThreadAndTestName$1.evaluate(TestRuleThreadAndTestName.java:49)
[junit4:junit4]    > 	at org.apache.lucene.util.TestRuleIgnoreAfterMaxFailures$1.evaluate(TestRuleIgnoreAfterMaxFailures.java:70)
[junit4:junit4]    > 	at org.apache.lucene.util.TestRuleMarkFailure$1.evaluate(TestRuleMarkFailure.java:48)
[junit4:junit4]    > 	at com.carrotsearch.randomizedtesting.rules.StatementAdapter.evaluate(StatementAdapter.java:36)
[junit4:junit4]    > 	at com.carrotsearch.randomizedtesting.ThreadLeakControl$StatementRunner.run(ThreadLeakControl.java:358)
[junit4:junit4]    > 	at com.carrotsearch.randomizedtesting.ThreadLeakControl.forkTimeoutingTask(ThreadLeakControl.java:782)
[junit4:junit4]    > 	at com.carrotsearch.randomizedtesting.ThreadLeakControl$3.evaluate(ThreadLeakControl.java:442)
[junit4:junit4]    > 	at com.carrotsearch.randomizedtesting.RandomizedRunner.runSingleTest(RandomizedRunner.java:746)
[junit4:junit4]    > 	at com.carrotsearch.randomizedtesting.RandomizedRunner$3.evaluate(RandomizedRunner.java:648)
[junit4:junit4]    > 	at com.carrotsearch.randomizedtesting.RandomizedRunner$4.evaluate(RandomizedRunner.java:682)
[junit4:junit4]    > 	at com.carrotsearch.randomizedtesting.RandomizedRunner$5.evaluate(RandomizedRunner.java:693)
[junit4:junit4]    > 	at com.carrotsearch.randomizedtesting.rules.StatementAdapter.evaluate(StatementAdapter.java:36)
[junit4:junit4]    > 	at com.carrotsearch.randomizedtesting.rules.SystemPropertiesRestoreRule$1.evaluate(SystemPropertiesRestoreRule.java:53)
[junit4:junit4]    > 	at org.apache.lucene.util.AbstractBeforeAfterRule$1.evaluate(AbstractBeforeAfterRule.java:46)
[junit4:junit4]    > 	at org.apache.lucene.util.TestRuleStoreClassName$1.evaluate(TestRuleStoreClassName.java:42)
[junit4:junit4]    > 	at com.carrotsearch.randomizedtesting.rules.SystemPropertiesInvariantRule$1.evaluate(SystemPropertiesInvariantRule.java:55)
[junit4:junit4]    > 	at com.carrotsearch.randomizedtesting.rules.NoShadowingOrOverridesOnMethodsRule$1.evaluate(NoShadowingOrOverridesOnMethodsRule.java:39)
[junit4:junit4]    > 	at com.carrotsearch.randomizedtesting.rules.NoShadowingOrOverridesOnMethodsRule$1.evaluate(NoShadowingOrOverridesOnMethodsRule.java:39)
[junit4:junit4]    > 	at com.carrotsearch.randomizedtesting.rules.StatementAdapter.evaluate(StatementAdapter.java:36)
[junit4:junit4]    > 	at org.apache.lucene.util.TestRuleAssertionsRequired$1.evaluate(TestRuleAssertionsRequired.java:43)
[junit4:junit4]    > 	at org.apache.lucene.util.TestRuleMarkFailure$1.evaluate(TestRuleMarkFailure.java:48)
[junit4:junit4]    > 	at org.apache.lucene.util.TestRuleIgnoreAfterMaxFailures$1.evaluate(TestRuleIgnoreAfterMaxFailures.java:70)
[junit4:junit4]    > 	at org.apache.lucene.util.TestRuleIgnoreTestSuites$1.evaluate(TestRuleIgnoreTestSuites.java:55)
[junit4:junit4]    > 	at com.carrotsearch.randomizedtesting.rules.StatementAdapter.evaluate(StatementAdapter.java:36)
[junit4:junit4]    > 	at com.carrotsearch.randomizedtesting.ThreadLeakControl$StatementRunner.run(ThreadLeakControl.java:358)
[junit4:junit4]    > 	at java.lang.Thread.run(Thread.java:722)
[junit4:junit4]   2> 152351 T40 oas.SolrTestCaseJ4.deleteCore ###deleteCore
[junit4:junit4]   2> 152367 T39 ccr.ThreadLeakControl.checkThreadLeaks WARNING Will linger awaiting termination of 2 leaked thread(s).
[junit4:junit4]   2> 153047 T43 oazs.SessionTrackerImpl.run SessionTrackerImpl exited loop!
[junit4:junit4]   2> NOTE: test params are: codec=FastCompressingStoredFields(storedFieldsFormat=CompressingStoredFieldsFormat(compressionMode=FAST, chunkSize=445), termVectorsFormat=CompressingTermVectorsFormat(compressionMode=FAST, chunkSize=445)), sim=DefaultSimilarity, locale=zh_CN, timezone=Asia/Bahrain
[junit4:junit4]   2> NOTE: Linux 3.2.0-38-generic amd64/Oracle Corporation 1.8.0-ea (64-bit)/cpus=8,threads=1,free=63946464,total=126418944
[junit4:junit4]   2> NOTE: All tests run in this JVM: [TestRemoteStreaming, DirectSolrSpellCheckerTest, IndexSchemaTest, TestReversedWildcardFilterFactory, TestComponentsName, UnloadDistributedZkTest]
[junit4:junit4] Completed on J1 in 153.14s, 1 test, 1 failure <<< FAILURES!

[...truncated 726 lines...]
BUILD FAILED
/mnt/ssd/jenkins/workspace/Lucene-Solr-trunk-Linux/build.xml:381: The following error occurred while executing this line:
/mnt/ssd/jenkins/workspace/Lucene-Solr-trunk-Linux/build.xml:361: The following error occurred while executing this line:
/mnt/ssd/jenkins/workspace/Lucene-Solr-trunk-Linux/build.xml:39: The following error occurred while executing this line:
/mnt/ssd/jenkins/workspace/Lucene-Solr-trunk-Linux/solr/build.xml:183: The following error occurred while executing this line:
/mnt/ssd/jenkins/workspace/Lucene-Solr-trunk-Linux/solr/common-build.xml:447: The following error occurred while executing this line:
/mnt/ssd/jenkins/workspace/Lucene-Solr-trunk-Linux/lucene/common-build.xml:1202: The following error occurred while executing this line:
/mnt/ssd/jenkins/workspace/Lucene-Solr-trunk-Linux/lucene/common-build.xml:865: There were test failures: 254 suites, 1053 tests, 1 failure, 8 ignored (3 assumptions)

Total time: 38 minutes 28 seconds
Build step 'Invoke Ant' marked build as failure
Archiving artifacts
Recording test results
Description set: Java: 64bit/jdk1.8.0-ea-b65 -XX:+UseConcMarkSweepGC
Email was triggered for: Failure
Sending email for trigger: Failure



Mime
View raw message