lucene-dev mailing list archives

Site index · List index
Message view « Date » · « Thread »
Top « Date » · « Thread »
From Apache Jenkins Server <jenk...@builds.apache.org>
Subject [JENKINS] Lucene-Solr-NightlyTests-trunk - Build # 180 - Still Failing
Date Fri, 15 Feb 2013 13:39:30 GMT
Build: https://builds.apache.org/job/Lucene-Solr-NightlyTests-trunk/180/

2 tests failed.
REGRESSION:  org.apache.lucene.search.TestSearcherManager.testSearcherManager

Error Message:
Test abandoned because suite timeout was reached.

Stack Trace:
java.lang.Exception: Test abandoned because suite timeout was reached.
	at __randomizedtesting.SeedInfo.seed([F2018D8395CAAB09]:0)


FAILED:  junit.framework.TestSuite.org.apache.lucene.search.TestSearcherManager

Error Message:
Suite timeout exceeded (>= 7200000 msec).

Stack Trace:
java.lang.Exception: Suite timeout exceeded (>= 7200000 msec).
	at __randomizedtesting.SeedInfo.seed([F2018D8395CAAB09]:0)




Build Log:
[...truncated 1212 lines...]
[junit4:junit4] Suite: org.apache.lucene.search.TestSearcherManager
[junit4:junit4]   2> 15/02/2013 02:32:08 ? com.carrotsearch.randomizedtesting.ThreadLeakControl$2 evaluate
[junit4:junit4]   2> WARNING: Suite execution timed out: org.apache.lucene.search.TestSearcherManager
[junit4:junit4]   2> ==== jstack at approximately timeout time ====
[junit4:junit4]   2> "Thread-656" ID=792 BLOCKED on org.apache.lucene.index.SerialMergeScheduler@2bbec682 owned by "Thread-655" ID=791
[junit4:junit4]   2> 	at org.apache.lucene.index.SerialMergeScheduler.merge(SerialMergeScheduler.java:37)
[junit4:junit4]   2> 	- blocked on org.apache.lucene.index.SerialMergeScheduler@2bbec682
[junit4:junit4]   2> 	at org.apache.lucene.index.IndexWriter.maybeMerge(IndexWriter.java:1845)
[junit4:junit4]   2> 	at org.apache.lucene.index.IndexWriter.getReader(IndexWriter.java:388)
[junit4:junit4]   2> 	at org.apache.lucene.index.StandardDirectoryReader.doOpenFromWriter(StandardDirectoryReader.java:270)
[junit4:junit4]   2> 	at org.apache.lucene.index.StandardDirectoryReader.doOpenIfChanged(StandardDirectoryReader.java:245)
[junit4:junit4]   2> 	at org.apache.lucene.index.StandardDirectoryReader.doOpenIfChanged(StandardDirectoryReader.java:235)
[junit4:junit4]   2> 	at org.apache.lucene.index.DirectoryReader.openIfChanged(DirectoryReader.java:169)
[junit4:junit4]   2> 	at org.apache.lucene.search.SearcherManager.refreshIfNeeded(SearcherManager.java:118)
[junit4:junit4]   2> 	at org.apache.lucene.search.SearcherManager.refreshIfNeeded(SearcherManager.java:58)
[junit4:junit4]   2> 	at org.apache.lucene.search.ReferenceManager.doMaybeRefresh(ReferenceManager.java:155)
[junit4:junit4]   2> 	at org.apache.lucene.search.ReferenceManager.maybeRefresh(ReferenceManager.java:204)
[junit4:junit4]   2> 	at org.apache.lucene.search.TestSearcherManager.getCurrentSearcher(TestSearcherManager.java:144)
[junit4:junit4]   2> 	at org.apache.lucene.index.ThreadedIndexingAndSearchingTestCase$2.run(ThreadedIndexingAndSearchingTestCase.java:332)
[junit4:junit4]   2> 	Locked synchronizers:
[junit4:junit4]   2> 	- java.util.concurrent.locks.ReentrantLock$NonfairSync@34c42ad1
[junit4:junit4]   2> 
[junit4:junit4]   2> "Thread-655" ID=791 RUNNABLE
[junit4:junit4]   2> 	at java.lang.StrictMath.ceil(Native Method)
[junit4:junit4]   2> 	at java.lang.Math.ceil(Math.java:405)
[junit4:junit4]   2> 	at org.apache.lucene.util.packed.PackedInts$Format$1.byteCount(PackedInts.java:95)
[junit4:junit4]   2> 	at org.apache.lucene.util.packed.Packed64.<init>(Packed64.java:90)
[junit4:junit4]   2> 	at org.apache.lucene.util.packed.PackedInts.getReaderNoHeader(PackedInts.java:845)
[junit4:junit4]   2> 	at org.apache.lucene.codecs.compressing.CompressingTermVectorsReader.get(CompressingTermVectorsReader.java:271)
[junit4:junit4]   2> 	at org.apache.lucene.index.SegmentReader.getTermVectors(SegmentReader.java:175)
[junit4:junit4]   2> 	at org.apache.lucene.index.IndexReader.getTermVector(IndexReader.java:295)
[junit4:junit4]   2> 	at org.apache.lucene.index.ParallelAtomicReader.getTermVectors(ParallelAtomicReader.java:236)
[junit4:junit4]   2> 	at org.apache.lucene.index.BaseCompositeReader.getTermVectors(BaseCompositeReader.java:97)
[junit4:junit4]   2> 	at org.apache.lucene.index.SlowCompositeReaderWrapper.getTermVectors(SlowCompositeReaderWrapper.java:147)
[junit4:junit4]   2> 	at org.apache.lucene.index.FilterAtomicReader.getTermVectors(FilterAtomicReader.java:344)
[junit4:junit4]   2> 	at org.apache.lucene.index.FieldFilterAtomicReader.getTermVectors(FieldFilterAtomicReader.java:61)
[junit4:junit4]   2> 	at org.apache.lucene.index.IndexReader.getTermVector(IndexReader.java:295)
[junit4:junit4]   2> 	at org.apache.lucene.index.ParallelAtomicReader.getTermVectors(ParallelAtomicReader.java:236)
[junit4:junit4]   2> 	at org.apache.lucene.index.FilterAtomicReader.getTermVectors(FilterAtomicReader.java:344)
[junit4:junit4]   2> 	at org.apache.lucene.index.FieldFilterAtomicReader.getTermVectors(FieldFilterAtomicReader.java:61)
[junit4:junit4]   2> 	at org.apache.lucene.index.IndexReader.getTermVector(IndexReader.java:295)
[junit4:junit4]   2> 	at org.apache.lucene.index.ParallelAtomicReader.getTermVectors(ParallelAtomicReader.java:236)
[junit4:junit4]   2> 	at org.apache.lucene.index.IndexReader.getTermVector(IndexReader.java:295)
[junit4:junit4]   2> 	at org.apache.lucene.index.ParallelAtomicReader.getTermVectors(ParallelAtomicReader.java:236)
[junit4:junit4]   2> 	at org.apache.lucene.index.CheckIndex.testTermVectors(CheckIndex.java:1414)
[junit4:junit4]   2> 	at org.apache.lucene.util._TestUtil.checkReader(_TestUtil.java:242)
[junit4:junit4]   2> 	at org.apache.lucene.util._TestUtil.checkReader(_TestUtil.java:232)
[junit4:junit4]   2> 	at org.apache.lucene.util.LuceneTestCase.newSearcher(LuceneTestCase.java:1250)
[junit4:junit4]   2> 	at org.apache.lucene.util.LuceneTestCase.newSearcher(LuceneTestCase.java:1235)
[junit4:junit4]   2> 	at org.apache.lucene.index.ThreadedIndexingAndSearchingTestCase$3.warm(ThreadedIndexingAndSearchingTestCase.java:472)
[junit4:junit4]   2> 	at org.apache.lucene.index.IndexWriter.mergeMiddle(IndexWriter.java:3771)
[junit4:junit4]   2> 	at org.apache.lucene.index.IndexWriter.merge(IndexWriter.java:3251)
[junit4:junit4]   2> 	at org.apache.lucene.index.SerialMergeScheduler.merge(SerialMergeScheduler.java:40)
[junit4:junit4]   2> 	- locked org.apache.lucene.index.SerialMergeScheduler@2bbec682
[junit4:junit4]   2> 	at org.apache.lucene.index.IndexWriter.maybeMerge(IndexWriter.java:1845)
[junit4:junit4]   2> 	at org.apache.lucene.index.IndexWriter.prepareCommitInternal(IndexWriter.java:2687)
[junit4:junit4]   2> 	- locked java.lang.Object@3ad71a67
[junit4:junit4]   2> 	at org.apache.lucene.index.IndexWriter.commitInternal(IndexWriter.java:2782)
[junit4:junit4]   2> 	- locked java.lang.Object@3ad71a67
[junit4:junit4]   2> 	at org.apache.lucene.index.IndexWriter.commit(IndexWriter.java:2762)
[junit4:junit4]   2> 	at org.apache.lucene.search.TestSearcherManager$2.run(TestSearcherManager.java:109)
[junit4:junit4]   2> 
[junit4:junit4]   2> "Thread-654" ID=790 BLOCKED on org.apache.lucene.index.SerialMergeScheduler@2bbec682 owned by "Thread-655" ID=791
[junit4:junit4]   2> 	at org.apache.lucene.index.SerialMergeScheduler.merge(SerialMergeScheduler.java:37)
[junit4:junit4]   2> 	- blocked on org.apache.lucene.index.SerialMergeScheduler@2bbec682
[junit4:junit4]   2> 	at org.apache.lucene.index.IndexWriter.maybeMerge(IndexWriter.java:1845)
[junit4:junit4]   2> 	at org.apache.lucene.index.IndexWriter.updateDocument(IndexWriter.java:1482)
[junit4:junit4]   2> 	at org.apache.lucene.index.IndexWriter.updateDocument(IndexWriter.java:1443)
[junit4:junit4]   2> 	at org.apache.lucene.index.ThreadedIndexingAndSearchingTestCase.updateDocument(ThreadedIndexingAndSearchingTestCase.java:105)
[junit4:junit4]   2> 	at org.apache.lucene.index.ThreadedIndexingAndSearchingTestCase$1.run(ThreadedIndexingAndSearchingTestCase.java:252)
[junit4:junit4]   2> 
[junit4:junit4]   2> "Thread-653" ID=789 BLOCKED on org.apache.lucene.index.SerialMergeScheduler@2bbec682 owned by "Thread-655" ID=791
[junit4:junit4]   2> 	at org.apache.lucene.index.SerialMergeScheduler.merge(SerialMergeScheduler.java:37)
[junit4:junit4]   2> 	- blocked on org.apache.lucene.index.SerialMergeScheduler@2bbec682
[junit4:junit4]   2> 	at org.apache.lucene.index.IndexWriter.maybeMerge(IndexWriter.java:1845)
[junit4:junit4]   2> 	at org.apache.lucene.index.IndexWriter.updateDocument(IndexWriter.java:1482)
[junit4:junit4]   2> 	at org.apache.lucene.index.IndexWriter.updateDocument(IndexWriter.java:1443)
[junit4:junit4]   2> 	at org.apache.lucene.index.ThreadedIndexingAndSearchingTestCase.updateDocument(ThreadedIndexingAndSearchingTestCase.java:105)
[junit4:junit4]   2> 	at org.apache.lucene.index.ThreadedIndexingAndSearchingTestCase$1.run(ThreadedIndexingAndSearchingTestCase.java:252)
[junit4:junit4]   2> 
[junit4:junit4]   2> "Thread-652" ID=788 BLOCKED on org.apache.lucene.index.SerialMergeScheduler@2bbec682 owned by "Thread-655" ID=791
[junit4:junit4]   2> 	at org.apache.lucene.index.SerialMergeScheduler.merge(SerialMergeScheduler.java:37)
[junit4:junit4]   2> 	- blocked on org.apache.lucene.index.SerialMergeScheduler@2bbec682
[junit4:junit4]   2> 	at org.apache.lucene.index.IndexWriter.maybeMerge(IndexWriter.java:1845)
[junit4:junit4]   2> 	at org.apache.lucene.index.IndexWriter.updateDocument(IndexWriter.java:1482)
[junit4:junit4]   2> 	at org.apache.lucene.index.IndexWriter.addDocument(IndexWriter.java:1146)
[junit4:junit4]   2> 	at org.apache.lucene.index.IndexWriter.addDocument(IndexWriter.java:1127)
[junit4:junit4]   2> 	at org.apache.lucene.index.ThreadedIndexingAndSearchingTestCase.addDocument(ThreadedIndexingAndSearchingTestCase.java:101)
[junit4:junit4]   2> 	at org.apache.lucene.index.ThreadedIndexingAndSearchingTestCase$1.run(ThreadedIndexingAndSearchingTestCase.java:233)
[junit4:junit4]   2> 
[junit4:junit4]   2> "Thread-651" ID=787 BLOCKED on org.apache.lucene.index.SerialMergeScheduler@2bbec682 owned by "Thread-655" ID=791
[junit4:junit4]   2> 	at org.apache.lucene.index.SerialMergeScheduler.merge(SerialMergeScheduler.java:37)
[junit4:junit4]   2> 	- blocked on org.apache.lucene.index.SerialMergeScheduler@2bbec682
[junit4:junit4]   2> 	at org.apache.lucene.index.IndexWriter.maybeMerge(IndexWriter.java:1845)
[junit4:junit4]   2> 	at org.apache.lucene.index.IndexWriter.updateDocuments(IndexWriter.java:1256)
[junit4:junit4]   2> 	at org.apache.lucene.index.IndexWriter.updateDocuments(IndexWriter.java:1223)
[junit4:junit4]   2> 	at org.apache.lucene.index.ThreadedIndexingAndSearchingTestCase.updateDocuments(ThreadedIndexingAndSearchingTestCase.java:93)
[junit4:junit4]   2> 	at org.apache.lucene.index.ThreadedIndexingAndSearchingTestCase$1.run(ThreadedIndexingAndSearchingTestCase.java:211)
[junit4:junit4]   2> 
[junit4:junit4]   2> "TEST-TestSearcherManager.testSearcherManager-seed#[F2018D8395CAAB09]" ID=784 WAITING on org.apache.lucene.index.ThreadedIndexingAndSearchingTestCase$2@7920183
[junit4:junit4]   2> 	at java.lang.Object.wait(Native Method)
[junit4:junit4]   2> 	- waiting on org.apache.lucene.index.ThreadedIndexingAndSearchingTestCase$2@7920183
[junit4:junit4]   2> 	at java.lang.Thread.join(Thread.java:1203)
[junit4:junit4]   2> 	at java.lang.Thread.join(Thread.java:1256)
[junit4:junit4]   2> 	at org.apache.lucene.index.ThreadedIndexingAndSearchingTestCase.runSearchThreads(ThreadedIndexingAndSearchingTestCase.java:405)
[junit4:junit4]   2> 	at org.apache.lucene.search.TestSearcherManager.doSearching(TestSearcherManager.java:132)
[junit4:junit4]   2> 	at org.apache.lucene.index.ThreadedIndexingAndSearchingTestCase.runTest(ThreadedIndexingAndSearchingTestCase.java:507)
[junit4:junit4]   2> 	at org.apache.lucene.search.TestSearcherManager.testSearcherManager(TestSearcherManager.java:55)
[junit4:junit4]   2> 	at sun.reflect.NativeMethodAccessorImpl.invoke0(Native Method)
[junit4:junit4]   2> 	at sun.reflect.NativeMethodAccessorImpl.invoke(NativeMethodAccessorImpl.java:57)
[junit4:junit4]   2> 	at sun.reflect.DelegatingMethodAccessorImpl.invoke(DelegatingMethodAccessorImpl.java:43)
[junit4:junit4]   2> 	at java.lang.reflect.Method.invoke(Method.java:616)
[junit4:junit4]   2> 	at com.carrotsearch.randomizedtesting.RandomizedRunner.invoke(RandomizedRunner.java:1559)
[junit4:junit4]   2> 	at com.carrotsearch.randomizedtesting.RandomizedRunner.access$600(RandomizedRunner.java:79)
[junit4:junit4]   2> 	at com.carrotsearch.randomizedtesting.RandomizedRunner$6.evaluate(RandomizedRunner.java:737)
[junit4:junit4]   2> 	at com.carrotsearch.randomizedtesting.RandomizedRunner$7.evaluate(RandomizedRunner.java:773)
[junit4:junit4]   2> 	at com.carrotsearch.randomizedtesting.RandomizedRunner$8.evaluate(RandomizedRunner.java:787)
[junit4:junit4]   2> 	at org.apache.lucene.util.TestRuleSetupTeardownChained$1.evaluate(TestRuleSetupTeardownChained.java:50)
[junit4:junit4]   2> 	at org.apache.lucene.util.TestRuleFieldCacheSanity$1.evaluate(TestRuleFieldCacheSanity.java:51)
[junit4:junit4]   2> 	at org.apache.lucene.util.AbstractBeforeAfterRule$1.evaluate(AbstractBeforeAfterRule.java:46)
[junit4:junit4]   2> 	at com.carrotsearch.randomizedtesting.rules.SystemPropertiesInvariantRule$1.evaluate(SystemPropertiesInvariantRule.java:55)
[junit4:junit4]   2> 	at org.apache.lucene.util.TestRuleThreadAndTestName$1.evaluate(TestRuleThreadAndTestName.java:49)
[junit4:junit4]   2> 	at org.apache.lucene.util.TestRuleIgnoreAfterMaxFailures$1.evaluate(TestRuleIgnoreAfterMaxFailures.java:70)
[junit4:junit4]   2> 	at org.apache.lucene.util.TestRuleMarkFailure$1.evaluate(TestRuleMarkFailure.java:48)
[junit4:junit4]   2> 	at com.carrotsearch.randomizedtesting.rules.StatementAdapter.evaluate(StatementAdapter.java:36)
[junit4:junit4]   2> 	at com.carrotsearch.randomizedtesting.ThreadLeakControl$StatementRunner.run(ThreadLeakControl.java:358)
[junit4:junit4]   2> 	at com.carrotsearch.randomizedtesting.ThreadLeakControl.forkTimeoutingTask(ThreadLeakControl.java:782)
[junit4:junit4]   2> 	at com.carrotsearch.randomizedtesting.ThreadLeakControl$3.evaluate(ThreadLeakControl.java:442)
[junit4:junit4]   2> 	at com.carrotsearch.randomizedtesting.RandomizedRunner.runSingleTest(RandomizedRunner.java:746)
[junit4:junit4]   2> 	at com.carrotsearch.randomizedtesting.RandomizedRunner$3.evaluate(RandomizedRunner.java:648)
[junit4:junit4]   2> 	at com.carrotsearch.randomizedtesting.RandomizedRunner$4.evaluate(RandomizedRunner.java:682)
[junit4:junit4]   2> 	at com.carrotsearch.randomizedtesting.RandomizedRunner$5.evaluate(RandomizedRunner.java:693)
[junit4:junit4]   2> 	at org.apache.lucene.util.AbstractBeforeAfterRule$1.evaluate(AbstractBeforeAfterRule.java:46)
[junit4:junit4]   2> 	at org.apache.lucene.util.TestRuleStoreClassName$1.evaluate(TestRuleStoreClassName.java:42)
[junit4:junit4]   2> 	at com.carrotsearch.randomizedtesting.rules.SystemPropertiesInvariantRule$1.evaluate(SystemPropertiesInvariantRule.java:55)
[junit4:junit4]   2> 	at com.carrotsearch.randomizedtesting.rules.NoShadowingOrOverridesOnMethodsRule$1.evaluate(NoShadowingOrOverridesOnMethodsRule.java:39)
[junit4:junit4]   2> 	at com.carrotsearch.randomizedtesting.rules.NoShadowingOrOverridesOnMethodsRule$1.evaluate(NoShadowingOrOverridesOnMethodsRule.java:39)
[junit4:junit4]   2> 	at com.carrotsearch.randomizedtesting.rules.StatementAdapter.evaluate(StatementAdapter.java:36)
[junit4:junit4]   2> 	at org.apache.lucene.util.TestRuleAssertionsRequired$1.evaluate(TestRuleAssertionsRequired.java:43)
[junit4:junit4]   2> 	at org.apache.lucene.util.TestRuleMarkFailure$1.evaluate(TestRuleMarkFailure.java:48)
[junit4:junit4]   2> 	at org.apache.lucene.util.TestRuleIgnoreAfterMaxFailures$1.evaluate(TestRuleIgnoreAfterMaxFailures.java:70)
[junit4:junit4]   2> 	at org.apache.lucene.util.TestRuleIgnoreTestSuites$1.evaluate(TestRuleIgnoreTestSuites.java:55)
[junit4:junit4]   2> 	at com.carrotsearch.randomizedtesting.rules.StatementAdapter.evaluate(StatementAdapter.java:36)
[junit4:junit4]   2> 	at com.carrotsearch.randomizedtesting.ThreadLeakControl$StatementRunner.run(ThreadLeakControl.java:358)
[junit4:junit4]   2> 	at java.lang.Thread.run(Thread.java:679)
[junit4:junit4]   2> 
[junit4:junit4]   2> "SUITE-TestSearcherManager-seed#[F2018D8395CAAB09]" ID=783 RUNNABLE
[junit4:junit4]   2> 	at sun.management.ThreadImpl.dumpThreads0(Native Method)
[junit4:junit4]   2> 	at sun.management.ThreadImpl.dumpAllThreads(ThreadImpl.java:392)
[junit4:junit4]   2> 	at com.carrotsearch.randomizedtesting.ThreadLeakControl.formatThreadStacksFull(ThreadLeakControl.java:655)
[junit4:junit4]   2> 	at com.carrotsearch.randomizedtesting.ThreadLeakControl.access$800(ThreadLeakControl.java:60)
[junit4:junit4]   2> 	at com.carrotsearch.randomizedtesting.ThreadLeakControl$2.evaluate(ThreadLeakControl.java:396)
[junit4:junit4]   2> 	- locked java.lang.Object@67e5f
[junit4:junit4]   2> 	at com.carrotsearch.randomizedtesting.RandomizedRunner.runSuite(RandomizedRunner.java:556)
[junit4:junit4]   2> 	at com.carrotsearch.randomizedtesting.RandomizedRunner.access$200(RandomizedRunner.java:79)
[junit4:junit4]   2> 	at com.carrotsearch.randomizedtesting.RandomizedRunner$1.run(RandomizedRunner.java:492)
[junit4:junit4]   2> 
[junit4:junit4]   2> "Signal Dispatcher" ID=4 RUNNABLE
[junit4:junit4]   2> 
[junit4:junit4]   2> "Finalizer" ID=3 WAITING on java.lang.ref.ReferenceQueue$Lock@2a528efc
[junit4:junit4]   2> 	at java.lang.Object.wait(Native Method)
[junit4:junit4]   2> 	- waiting on java.lang.ref.ReferenceQueue$Lock@2a528efc
[junit4:junit4]   2> 	at java.lang.ref.ReferenceQueue.remove(ReferenceQueue.java:133)
[junit4:junit4]   2> 	at java.lang.ref.ReferenceQueue.remove(ReferenceQueue.java:149)
[junit4:junit4]   2> 	at java.lang.ref.Finalizer$FinalizerThread.run(Finalizer.java:177)
[junit4:junit4]   2> 
[junit4:junit4]   2> "Reference Handler" ID=2 WAITING on java.lang.ref.Reference$Lock@12295819
[junit4:junit4]   2> 	at java.lang.Object.wait(Native Method)
[junit4:junit4]   2> 	- waiting on java.lang.ref.Reference$Lock@12295819
[junit4:junit4]   2> 	at java.lang.Object.wait(Object.java:502)
[junit4:junit4]   2> 	at java.lang.ref.Reference$ReferenceHandler.run(Reference.java:133)
[junit4:junit4]   2> 
[junit4:junit4]   2> "main" ID=1 WAITING on com.carrotsearch.randomizedtesting.RandomizedRunner$1@ab6404a
[junit4:junit4]   2> 	at java.lang.Object.wait(Native Method)
[junit4:junit4]   2> 	- waiting on com.carrotsearch.randomizedtesting.RandomizedRunner$1@ab6404a
[junit4:junit4]   2> 	at java.lang.Thread.join(Thread.java:1203)
[junit4:junit4]   2> 	at java.lang.Thread.join(Thread.java:1256)
[junit4:junit4]   2> 	at com.carrotsearch.randomizedtesting.RandomizedRunner.runSuite(RandomizedRunner.java:502)
[junit4:junit4]   2> 	at com.carrotsearch.randomizedtesting.RandomizedRunner.run(RandomizedRunner.java:399)
[junit4:junit4]   2> 	at com.carrotsearch.ant.tasks.junit4.slave.SlaveMain.execute(SlaveMain.java:180)
[junit4:junit4]   2> 	at com.carrotsearch.ant.tasks.junit4.slave.SlaveMain.main(SlaveMain.java:275)
[junit4:junit4]   2> 	at com.carrotsearch.ant.tasks.junit4.slave.SlaveMainSafe.main(SlaveMainSafe.java:12)
[junit4:junit4]   2> 
[junit4:junit4]   2> ^^==============================================
[junit4:junit4]   2> 
[junit4:junit4]   2> NOTE: download the large Jenkins line-docs file by running 'ant get-jenkins-line-docs' in the lucene directory.
[junit4:junit4]   2> NOTE: reproduce with: ant test  -Dtestcase=TestSearcherManager -Dtests.method=testSearcherManager -Dtests.seed=F2018D8395CAAB09 -Dtests.multiplier=2 -Dtests.nightly=true -Dtests.slow=true -Dtests.linedocsfile=/home/hudson/lucene-data/enwiki.random.lines.txt -Dtests.locale=ar_OM -Dtests.timezone=Africa/Algiers -Dtests.file.encoding=ISO-8859-1
[junit4:junit4] ERROR   7200s J0 | TestSearcherManager.testSearcherManager <<<
[junit4:junit4]    > Throwable #1: java.lang.Exception: Test abandoned because suite timeout was reached.
[junit4:junit4]    > 	at __randomizedtesting.SeedInfo.seed([F2018D8395CAAB09]:0)
[junit4:junit4]   2> 15/02/2013 02:32:08 ? com.carrotsearch.randomizedtesting.ThreadLeakControl checkThreadLeaks
[junit4:junit4]   2> WARNING: Will linger awaiting termination of 7 leaked thread(s).
[junit4:junit4]   2> 15/02/2013 02:32:28 ? com.carrotsearch.randomizedtesting.ThreadLeakControl checkThreadLeaks
[junit4:junit4]   2> SEVERE: 7 threads leaked from SUITE scope at org.apache.lucene.search.TestSearcherManager: 
[junit4:junit4]   2>    1) Thread[id=788, name=Thread-652, state=BLOCKED, group=TGRP-TestSearcherManager]
[junit4:junit4]   2>         at org.apache.lucene.index.SerialMergeScheduler.merge(SerialMergeScheduler.java:37)
[junit4:junit4]   2>         at org.apache.lucene.index.IndexWriter.maybeMerge(IndexWriter.java:1845)
[junit4:junit4]   2>         at org.apache.lucene.index.IndexWriter.updateDocument(IndexWriter.java:1482)
[junit4:junit4]   2>         at org.apache.lucene.index.IndexWriter.addDocument(IndexWriter.java:1146)
[junit4:junit4]   2>         at org.apache.lucene.index.IndexWriter.addDocument(IndexWriter.java:1127)
[junit4:junit4]   2>         at org.apache.lucene.index.ThreadedIndexingAndSearchingTestCase.addDocument(ThreadedIndexingAndSearchingTestCase.java:101)
[junit4:junit4]   2>         at org.apache.lucene.index.ThreadedIndexingAndSearchingTestCase$1.run(ThreadedIndexingAndSearchingTestCase.java:233)
[junit4:junit4]   2>    2) Thread[id=784, name=TEST-TestSearcherManager.testSearcherManager-seed#[F2018D8395CAAB09], state=WAITING, group=TGRP-TestSearcherManager]
[junit4:junit4]   2>         at java.lang.Object.wait(Native Method)
[junit4:junit4]   2>         at java.lang.Thread.join(Thread.java:1203)
[junit4:junit4]   2>         at java.lang.Thread.join(Thread.java:1256)
[junit4:junit4]   2>         at org.apache.lucene.index.ThreadedIndexingAndSearchingTestCase.runSearchThreads(ThreadedIndexingAndSearchingTestCase.java:405)
[junit4:junit4]   2>         at org.apache.lucene.search.TestSearcherManager.doSearching(TestSearcherManager.java:132)
[junit4:junit4]   2>         at org.apache.lucene.index.ThreadedIndexingAndSearchingTestCase.runTest(ThreadedIndexingAndSearchingTestCase.java:507)
[junit4:junit4]   2>         at org.apache.lucene.search.TestSearcherManager.testSearcherManager(TestSearcherManager.java:55)
[junit4:junit4]   2>         at sun.reflect.NativeMethodAccessorImpl.invoke0(Native Method)
[junit4:junit4]   2>         at sun.reflect.NativeMethodAccessorImpl.invoke(NativeMethodAccessorImpl.java:57)
[junit4:junit4]   2>         at sun.reflect.DelegatingMethodAccessorImpl.invoke(DelegatingMethodAccessorImpl.java:43)
[junit4:junit4]   2>         at java.lang.reflect.Method.invoke(Method.java:616)
[junit4:junit4]   2>         at com.carrotsearch.randomizedtesting.RandomizedRunner.invoke(RandomizedRunner.java:1559)
[junit4:junit4]   2>         at com.carrotsearch.randomizedtesting.RandomizedRunner.access$600(RandomizedRunner.java:79)
[junit4:junit4]   2>         at com.carrotsearch.randomizedtesting.RandomizedRunner$6.evaluate(RandomizedRunner.java:737)
[junit4:junit4]   2>         at com.carrotsearch.randomizedtesting.RandomizedRunner$7.evaluate(RandomizedRunner.java:773)
[junit4:junit4]   2>         at com.carrotsearch.randomizedtesting.RandomizedRunner$8.evaluate(RandomizedRunner.java:787)
[junit4:junit4]   2>         at org.apache.lucene.util.TestRuleSetupTeardownChained$1.evaluate(TestRuleSetupTeardownChained.java:50)
[junit4:junit4]   2>         at org.apache.lucene.util.TestRuleFieldCacheSanity$1.evaluate(TestRuleFieldCacheSanity.java:51)
[junit4:junit4]   2>         at org.apache.lucene.util.AbstractBeforeAfterRule$1.evaluate(AbstractBeforeAfterRule.java:46)
[junit4:junit4]   2>         at com.carrotsearch.randomizedtesting.rules.SystemPropertiesInvariantRule$1.evaluate(SystemPropertiesInvariantRule.java:55)
[junit4:junit4]   2>         at org.apache.lucene.util.TestRuleThreadAndTestName$1.evaluate(TestRuleThreadAndTestName.java:49)
[junit4:junit4]   2>         at org.apache.lucene.util.TestRuleIgnoreAfterMaxFailures$1.evaluate(TestRuleIgnoreAfterMaxFailures.java:70)
[junit4:junit4]   2>         at org.apache.lucene.util.TestRuleMarkFailure$1.evaluate(TestRuleMarkFailure.java:48)
[junit4:junit4]   2>         at com.carrotsearch.randomizedtesting.rules.StatementAdapter.evaluate(StatementAdapter.java:36)
[junit4:junit4]   2>         at com.carrotsearch.randomizedtesting.ThreadLeakControl$StatementRunner.run(ThreadLeakControl.java:358)
[junit4:junit4]   2>         at com.carrotsearch.randomizedtesting.ThreadLeakControl.forkTimeoutingTask(ThreadLeakControl.java:782)
[junit4:junit4]   2>         at com.carrotsearch.randomizedtesting.ThreadLeakControl$3.evaluate(ThreadLeakControl.java:442)
[junit4:junit4]   2>         at com.carrotsearch.randomizedtesting.RandomizedRunner.runSingleTest(RandomizedRunner.java:746)
[junit4:junit4]   2>         at com.carrotsearch.randomizedtesting.RandomizedRunner$3.evaluate(RandomizedRunner.java:648)
[junit4:junit4]   2>         at com.carrotsearch.randomizedtesting.RandomizedRunner$4.evaluate(RandomizedRunner.java:682)
[junit4:junit4]   2>         at com.carrotsearch.randomizedtesting.RandomizedRunner$5.evaluate(RandomizedRunner.java:693)
[junit4:junit4]   2>         at org.apache.lucene.util.AbstractBeforeAfterRule$1.evaluate(AbstractBeforeAfterRule.java:46)
[junit4:junit4]   2>         at org.apache.lucene.util.TestRuleStoreClassName$1.evaluate(TestRuleStoreClassName.java:42)
[junit4:junit4]   2>         at com.carrotsearch.randomizedtesting.rules.SystemPropertiesInvariantRule$1.evaluate(SystemPropertiesInvariantRule.java:55)
[junit4:junit4]   2>         at com.carrotsearch.randomizedtesting.rules.NoShadowingOrOverridesOnMethodsRule$1.evaluate(NoShadowingOrOverridesOnMethodsRule.java:39)
[junit4:junit4]   2>         at com.carrotsearch.randomizedtesting.rules.NoShadowingOrOverridesOnMethodsRule$1.evaluate(NoShadowingOrOverridesOnMethodsRule.java:39)
[junit4:junit4]   2>         at com.carrotsearch.randomizedtesting.rules.StatementAdapter.evaluate(StatementAdapter.java:36)
[junit4:junit4]   2>         at org.apache.lucene.util.TestRuleAssertionsRequired$1.evaluate(TestRuleAssertionsRequired.java:43)
[junit4:junit4]   2>         at org.apache.lucene.util.TestRuleMarkFailure$1.evaluate(TestRuleMarkFailure.java:48)
[junit4:junit4]   2>         at org.apache.lucene.util.TestRuleIgnoreAfterMaxFailures$1.evaluate(TestRuleIgnoreAfterMaxFailures.java:70)
[junit4:junit4]   2>         at org.apache.lucene.util.TestRuleIgnoreTestSuites$1.evaluate(TestRuleIgnoreTestSuites.java:55)
[junit4:junit4]   2>         at com.carrotsearch.randomizedtesting.rules.StatementAdapter.evaluate(StatementAdapter.java:36)
[junit4:junit4]   2>         at com.carrotsearch.randomizedtesting.ThreadLeakControl$StatementRunner.run(ThreadLeakControl.java:358)
[junit4:junit4]   2>         at java.lang.Thread.run(Thread.java:679)
[junit4:junit4]   2>    3) Thread[id=792, name=Thread-656, state=BLOCKED, group=TGRP-TestSearcherManager]
[junit4:junit4]   2>         at org.apache.lucene.index.SerialMergeScheduler.merge(SerialMergeScheduler.java:37)
[junit4:junit4]   2>         at org.apache.lucene.index.IndexWriter.maybeMerge(IndexWriter.java:1845)
[junit4:junit4]   2>         at org.apache.lucene.index.IndexWriter.getReader(IndexWriter.java:388)
[junit4:junit4]   2>         at org.apache.lucene.index.StandardDirectoryReader.doOpenFromWriter(StandardDirectoryReader.java:270)
[junit4:junit4]   2>         at org.apache.lucene.index.StandardDirectoryReader.doOpenIfChanged(StandardDirectoryReader.java:245)
[junit4:junit4]   2>         at org.apache.lucene.index.StandardDirectoryReader.doOpenIfChanged(StandardDirectoryReader.java:235)
[junit4:junit4]   2>         at org.apache.lucene.index.DirectoryReader.openIfChanged(DirectoryReader.java:169)
[junit4:junit4]   2>         at org.apache.lucene.search.SearcherManager.refreshIfNeeded(SearcherManager.java:118)
[junit4:junit4]   2>         at org.apache.lucene.search.SearcherManager.refreshIfNeeded(SearcherManager.java:58)
[junit4:junit4]   2>         at org.apache.lucene.search.ReferenceManager.doMaybeRefresh(ReferenceManager.java:155)
[junit4:junit4]   2>         at org.apache.lucene.search.ReferenceManager.maybeRefresh(ReferenceManager.java:204)
[junit4:junit4]   2>         at org.apache.lucene.search.TestSearcherManager.getCurrentSearcher(TestSearcherManager.java:144)
[junit4:junit4]   2>         at org.apache.lucene.index.ThreadedIndexingAndSearchingTestCase$2.run(ThreadedIndexingAndSearchingTestCase.java:332)
[junit4:junit4]   2>    4) Thread[id=787, name=Thread-651, state=BLOCKED, group=TGRP-TestSearcherManager]
[junit4:junit4]   2>         at org.apache.lucene.index.SerialMergeScheduler.merge(SerialMergeScheduler.java:37)
[junit4:junit4]   2>         at org.apache.lucene.index.IndexWriter.maybeMerge(IndexWriter.java:1845)
[junit4:junit4]   2>         at org.apache.lucene.index.IndexWriter.updateDocuments(IndexWriter.java:1256)
[junit4:junit4]   2>         at org.apache.lucene.index.IndexWriter.updateDocuments(IndexWriter.java:1223)
[junit4:junit4]   2>         at org.apache.lucene.index.ThreadedIndexingAndSearchingTestCase.updateDocuments(ThreadedIndexingAndSearchingTestCase.java:93)
[junit4:junit4]   2>         at org.apache.lucene.index.ThreadedIndexingAndSearchingTestCase$1.run(ThreadedIndexingAndSearchingTestCase.java:211)
[junit4:junit4]   2>    5) Thread[id=791, name=Thread-655, state=RUNNABLE, group=TGRP-TestSearcherManager]
[junit4:junit4]   2>         at sun.nio.ch.NativeThread.current(Native Method)
[junit4:junit4]   2>         at sun.nio.ch.NativeThreadSet.add(NativeThreadSet.java:45)
[junit4:junit4]   2>         at sun.nio.ch.FileChannelImpl.read(FileChannelImpl.java:661)
[junit4:junit4]   2>         at org.apache.lucene.store.NIOFSDirectory$NIOFSIndexInput.readInternal(NIOFSDirectory.java:167)
[junit4:junit4]   2>         at org.apache.lucene.store.BufferedIndexInput.refill(BufferedIndexInput.java:272)
[junit4:junit4]   2>         at org.apache.lucene.store.BufferedIndexInput.readBytes(BufferedIndexInput.java:138)
[junit4:junit4]   2>         at org.apache.lucene.store.BufferedIndexInput.readBytes(BufferedIndexInput.java:113)
[junit4:junit4]   2>         at org.apache.lucene.store.MockIndexInputWrapper.readBytes(MockIndexInputWrapper.java:118)
[junit4:junit4]   2>         at org.apache.lucene.codecs.compressing.LZ4.decompress(LZ4.java:101)
[junit4:junit4]   2>         at org.apache.lucene.codecs.compressing.CompressionMode$4.decompress(CompressionMode.java:135)
[junit4:junit4]   2>         at org.apache.lucene.codecs.compressing.CompressingTermVectorsReader.get(CompressingTermVectorsReader.java:493)
[junit4:junit4]   2>         at org.apache.lucene.index.SegmentReader.getTermVectors(SegmentReader.java:175)
[junit4:junit4]   2>         at org.apache.lucene.index.IndexReader.getTermVector(IndexReader.java:295)
[junit4:junit4]   2>         at org.apache.lucene.index.ParallelAtomicReader.getTermVectors(ParallelAtomicReader.java:236)
[junit4:junit4]   2>         at org.apache.lucene.index.BaseCompositeReader.getTermVectors(BaseCompositeReader.java:97)
[junit4:junit4]   2>         at org.apache.lucene.index.SlowCompositeReaderWrapper.getTermVectors(SlowCompositeReaderWrapper.java:147)
[junit4:junit4]   2>         at org.apache.lucene.index.FilterAtomicReader.getTermVectors(FilterAtomicReader.java:344)
[junit4:junit4]   2>         at org.apache.lucene.index.FieldFilterAtomicReader.getTermVectors(FieldFilterAtomicReader.java:61)
[junit4:junit4]   2>         at org.apache.lucene.index.IndexReader.getTermVector(IndexReader.java:295)
[junit4:junit4]   2>         at org.apache.lucene.index.ParallelAtomicReader.getTermVectors(ParallelAtomicReader.java:236)
[junit4:junit4]   2>         at org.apache.lucene.index.FilterAtomicReader.getTermVectors(FilterAtomicReader.java:344)
[junit4:junit4]   2>         at org.apache.lucene.index.FieldFilterAtomicReader.getTermVectors(FieldFilterAtomicReader.java:61)
[junit4:junit4]   2>         at org.apache.lucene.index.IndexReader.getTermVector(IndexReader.java:295)
[junit4:junit4]   2>         at org.apache.lucene.index.ParallelAtomicReader.getTermVectors(ParallelAtomicReader.java:236)
[junit4:junit4]   2>         at org.apache.lucene.index.IndexReader.getTermVector(IndexReader.java:295)
[junit4:junit4]   2>         at org.apache.lucene.index.ParallelAtomicReader.getTermVectors(ParallelAtomicReader.java:236)
[junit4:junit4]   2>         at org.apache.lucene.index.CheckIndex.testTermVectors(CheckIndex.java:1414)
[junit4:junit4]   2>         at org.apache.lucene.util._TestUtil.checkReader(_TestUtil.java:242)
[junit4:junit4]   2>         at org.apache.lucene.util._TestUtil.checkReader(_TestUtil.java:232)
[junit4:junit4]   2>         at org.apache.lucene.util.LuceneTestCase.newSearcher(LuceneTestCase.java:1250)
[junit4:junit4]   2>         at org.apache.lucene.util.LuceneTestCase.newSearcher(LuceneTestCase.java:1235)
[junit4:junit4]   2>         at org.apache.lucene.index.ThreadedIndexingAndSearchingTestCase$3.warm(ThreadedIndexingAndSearchingTestCase.java:472)
[junit4:junit4]   2>         at org.apache.lucene.index.IndexWriter.mergeMiddle(IndexWriter.java:3771)
[junit4:junit4]   2>         at org.apache.lucene.index.IndexWriter.merge(IndexWriter.java:3251)
[junit4:junit4]   2>         at org.apache.lucene.index.SerialMergeScheduler.merge(SerialMergeScheduler.java:40)
[junit4:junit4]   2>         at org.apache.lucene.index.IndexWriter.maybeMerge(IndexWriter.java:1845)
[junit4:junit4]   2>         at org.apache.lucene.index.IndexWriter.prepareCommitInternal(IndexWriter.java:2687)
[junit4:junit4]   2>         at org.apache.lucene.index.IndexWriter.commitInternal(IndexWriter.java:2782)
[junit4:junit4]   2>         at org.apache.lucene.index.IndexWriter.commit(IndexWriter.java:2762)
[junit4:junit4]   2>         at org.apache.lucene.search.TestSearcherManager$2.run(TestSearcherManager.java:109)
[junit4:junit4]   2>    6) Thread[id=789, name=Thread-653, state=BLOCKED, group=TGRP-TestSearcherManager]
[junit4:junit4]   2>         at org.apache.lucene.index.SerialMergeScheduler.merge(SerialMergeScheduler.java:37)
[junit4:junit4]   2>         at org.apache.lucene.index.IndexWriter.maybeMerge(IndexWriter.java:1845)
[junit4:junit4]   2>         at org.apache.lucene.index.IndexWriter.updateDocument(IndexWriter.java:1482)
[junit4:junit4]   2>         at org.apache.lucene.index.IndexWriter.updateDocument(IndexWriter.java:1443)
[junit4:junit4]   2>         at org.apache.lucene.index.ThreadedIndexingAndSearchingTestCase.updateDocument(ThreadedIndexingAndSearchingTestCase.java:105)
[junit4:junit4]   2>         at org.apache.lucene.index.ThreadedIndexingAndSearchingTestCase$1.run(ThreadedIndexingAndSearchingTestCase.java:252)
[junit4:junit4]   2>    7) Thread[id=790, name=Thread-654, state=BLOCKED, group=TGRP-TestSearcherManager]
[junit4:junit4]   2>         at org.apache.lucene.index.SerialMergeScheduler.merge(SerialMergeScheduler.java:37)
[junit4:junit4]   2>         at org.apache.lucene.index.IndexWriter.maybeMerge(IndexWriter.java:1845)
[junit4:junit4]   2>         at org.apache.lucene.index.IndexWriter.updateDocument(IndexWriter.java:1482)
[junit4:junit4]   2>         at org.apache.lucene.index.IndexWriter.updateDocument(IndexWriter.java:1443)
[junit4:junit4]   2>         at org.apache.lucene.index.ThreadedIndexingAndSearchingTestCase.updateDocument(ThreadedIndexingAndSearchingTestCase.java:105)
[junit4:junit4]   2>         at org.apache.lucene.index.ThreadedIndexingAndSearchingTestCase$1.run(ThreadedIndexingAndSearchingTestCase.java:252)
[junit4:junit4]   2> 15/02/2013 02:32:28 ? com.carrotsearch.randomizedtesting.ThreadLeakControl tryToInterruptAll
[junit4:junit4]   2> INFO: Starting to interrupt leaked threads:
[junit4:junit4]   2>    1) Thread[id=788, name=Thread-652, state=BLOCKED, group=TGRP-TestSearcherManager]
[junit4:junit4]   2>    2) Thread[id=784, name=TEST-TestSearcherManager.testSearcherManager-seed#[F2018D8395CAAB09], state=WAITING, group=TGRP-TestSearcherManager]
[junit4:junit4]   2>    3) Thread[id=792, name=Thread-656, state=BLOCKED, group=TGRP-TestSearcherManager]
[junit4:junit4]   2>    4) Thread[id=787, name=Thread-651, state=BLOCKED, group=TGRP-TestSearcherManager]
[junit4:junit4]   2>    5) Thread[id=791, name=Thread-655, state=RUNNABLE, group=TGRP-TestSearcherManager]
[junit4:junit4]   2>    6) Thread[id=789, name=Thread-653, state=BLOCKED, group=TGRP-TestSearcherManager]
[junit4:junit4]   2>    7) Thread[id=790, name=Thread-654, state=BLOCKED, group=TGRP-TestSearcherManager]
[junit4:junit4]   1> CheckReader failed
[junit4:junit4]   1>     test: field norms.........OK [42 fields]
[junit4:junit4]   1>     test: terms, freq, prox...OK [133636 terms; 327258 terms/docs pairs; 562058 tokens]
[junit4:junit4]   1>     test: stored fields.......OK [14798 total field count; avg 5.077 fields per doc]
[junit4:junit4]   1>     test: term vectors........ERROR [null: NIOFSIndexInput(_4l.tvd in path="/usr/home/hudson/hudson-slave/workspace/Lucene-Solr-NightlyTests-trunk/lucene/build/core/test/J0/TestSearcherManager1556515650tmp/_4l.cfs" slice=593522:4209825)]
[junit4:junit4]   1> java.io.IOException: null: NIOFSIndexInput(_4l.tvd in path="/usr/home/hudson/hudson-slave/workspace/Lucene-Solr-NightlyTests-trunk/lucene/build/core/test/J0/TestSearcherManager1556515650tmp/_4l.cfs" slice=593522:4209825)
[junit4:junit4]   1> 	at org.apache.lucene.store.NIOFSDirectory$NIOFSIndexInput.readInternal(NIOFSDirectory.java:182)
[junit4:junit4]   1> 	at org.apache.lucene.store.BufferedIndexInput.refill(BufferedIndexInput.java:272)
[junit4:junit4]   1> 	at org.apache.lucene.store.BufferedIndexInput.readByte(BufferedIndexInput.java:51)
[junit4:junit4]   1> 	at org.apache.lucene.store.DataInput.readVInt(DataInput.java:108)
[junit4:junit4]   1> 	at org.apache.lucene.store.BufferedIndexInput.readVInt(BufferedIndexInput.java:219)
[junit4:junit4]   1> 	at org.apache.lucene.store.MockIndexInputWrapper.readVInt(MockIndexInputWrapper.java:161)
[junit4:junit4]   1> 	at org.apache.lucene.codecs.compressing.CompressingTermVectorsReader.get(CompressingTermVectorsReader.java:187)
[junit4:junit4]   1> 	at org.apache.lucene.index.SegmentReader.getTermVectors(SegmentReader.java:175)
[junit4:junit4]   1> 	at org.apache.lucene.index.IndexReader.getTermVector(IndexReader.java:295)
[junit4:junit4]   1> 	at org.apache.lucene.index.ParallelAtomicReader.getTermVectors(ParallelAtomicReader.java:236)
[junit4:junit4]   1> 	at org.apache.lucene.index.BaseCompositeReader.getTermVectors(BaseCompositeReader.java:97)
[junit4:junit4]   1> 	at org.apache.lucene.index.SlowCompositeReaderWrapper.getTermVectors(SlowCompositeReaderWrapper.java:147)
[junit4:junit4]   1> 	at org.apache.lucene.index.FilterAtomicReader.getTermVectors(FilterAtomicReader.java:344)
[junit4:junit4]   1> 	at org.apache.lucene.index.FieldFilterAtomicReader.getTermVectors(FieldFilterAtomicReader.java:61)
[junit4:junit4]   1> 	at org.apache.lucene.index.IndexReader.getTermVector(IndexReader.java:295)
[junit4:junit4]   1> 	at org.apache.lucene.index.ParallelAtomicReader.getTermVectors(ParallelAtomicReader.java:236)
[junit4:junit4]   1> 	at org.apache.lucene.index.FilterAtomicReader.getTermVectors(FilterAtomicReader.java:344)
[junit4:junit4]   1> 	at org.apache.lucene.index.FieldFilterAtomicReader.getTermVectors(FieldFilterAtomicReader.java:61)
[junit4:junit4]   1> 	at org.apache.lucene.index.IndexReader.getTermVector(IndexReader.java:295)
[junit4:junit4]   1> 	at org.apache.lucene.index.ParallelAtomicReader.getTermVectors(ParallelAtomicReader.java:236)
[junit4:junit4]   1> 	at org.apache.lucene.index.IndexReader.getTermVector(IndexReader.java:295)
[junit4:junit4]   1> 	at org.apache.lucene.index.ParallelAtomicReader.getTermVectors(ParallelAtomicReader.java:236)
[junit4:junit4]   1> 	at org.apache.lucene.index.CheckIndex.testTermVectors(CheckIndex.java:1414)
[junit4:junit4]   1> 	at org.apache.lucene.util._TestUtil.checkReader(_TestUtil.java:242)
[junit4:junit4]   1> 	at org.apache.lucene.util._TestUtil.checkReader(_TestUtil.java:232)
[junit4:junit4]   1> 	at org.apache.lucene.util.LuceneTestCase.newSearcher(LuceneTestCase.java:1250)
[junit4:junit4]   1> 	at org.apache.lucene.util.LuceneTestCase.newSearcher(LuceneTestCase.java:1235)
[junit4:junit4]   1> 	at org.apache.lucene.index.ThreadedIndexingAndSearchingTestCase$3.warm(ThreadedIndexingAndSearchingTestCase.java:472)
[junit4:junit4]   1> 	at org.apache.lucene.index.IndexWriter.mergeMiddle(IndexWriter.java:3771)
[junit4:junit4]   1> 	at org.apache.lucene.index.IndexWriter.merge(IndexWriter.java:3251)
[junit4:junit4]   1> 	at org.apache.lucene.index.SerialMergeScheduler.merge(SerialMergeScheduler.java:40)
[junit4:junit4]   1> 	at org.apache.lucene.index.IndexWriter.maybeMerge(IndexWriter.java:1845)
[junit4:junit4]   1> 	at org.apache.lucene.index.IndexWriter.prepareCommitInternal(IndexWriter.java:2687)
[junit4:junit4]   1> 	at org.apache.lucene.index.IndexWriter.commitInternal(IndexWriter.java:2782)
[junit4:junit4]   1> 	at org.apache.lucene.index.IndexWriter.commit(IndexWriter.java:2762)
[junit4:junit4]   1> 	at org.apache.lucene.search.TestSearcherManager$2.run(TestSearcherManager.java:109)
[junit4:junit4]   1> Caused by: java.nio.channels.ClosedChannelException
[junit4:junit4]   1> 	at sun.nio.ch.FileChannelImpl.ensureOpen(FileChannelImpl.java:109)
[junit4:junit4]   1> 	at sun.nio.ch.FileChannelImpl.read(FileChannelImpl.java:654)
[junit4:junit4]   1> 	at org.apache.lucene.store.NIOFSDirectory$NIOFSIndexInput.readInternal(NIOFSDirectory.java:167)
[junit4:junit4]   1> 	... 35 more
[junit4:junit4]   1>     test: docvalues...........ERROR [null: NIOFSIndexInput(_4l_Lucene42_0.dvd in path="/usr/home/hudson/hudson-slave/workspace/Lucene-Solr-NightlyTests-trunk/lucene/build/core/test/J0/TestSearcherManager1556515650tmp/_4l.cfs" slice=31:99085)]
[junit4:junit4]   1> java.io.IOException: null: NIOFSIndexInput(_4l_Lucene42_0.dvd in path="/usr/home/hudson/hudson-slave/workspace/Lucene-Solr-NightlyTests-trunk/lucene/build/core/test/J0/TestSearcherManager1556515650tmp/_4l.cfs" slice=31:99085)
[junit4:junit4]   1> 	at org.apache.lucene.store.NIOFSDirectory$NIOFSIndexInput.readInternal(NIOFSDirectory.java:182)
[junit4:junit4]   1> 	at org.apache.lucene.store.BufferedIndexInput.refill(BufferedIndexInput.java:272)
[junit4:junit4]   1> 	at org.apache.lucene.store.BufferedIndexInput.readByte(BufferedIndexInput.java:51)
[junit4:junit4]   1> 	at org.apache.lucene.store.DataInput.readInt(DataInput.java:84)
[junit4:junit4]   1> 	at org.apache.lucene.store.BufferedIndexInput.readInt(BufferedIndexInput.java:181)
[junit4:junit4]   1> 	at org.apache.lucene.store.MockIndexInputWrapper.readInt(MockIndexInputWrapper.java:137)
[junit4:junit4]   1> 	at org.apache.lucene.codecs.CodecUtil.checkHeader(CodecUtil.java:126)
[junit4:junit4]   1> 	at org.apache.lucene.util.fst.FST.<init>(FST.java:313)
[junit4:junit4]   1> 	at org.apache.lucene.util.fst.FST.<init>(FST.java:299)
[junit4:junit4]   1> 	at org.apache.lucene.codecs.lucene42.Lucene42DocValuesProducer.getSorted(Lucene42DocValuesProducer.java:231)
[junit4:junit4]   1> 	at org.apache.lucene.codecs.perfield.PerFieldDocValuesFormat$FieldsReader.getSorted(PerFieldDocValuesFormat.java:254)
[junit4:junit4]   1> 	at org.apache.lucene.index.SegmentCoreReaders.getSortedDocValues(SegmentCoreReaders.java:250)
[junit4:junit4]   1> 	at org.apache.lucene.index.SegmentReader.getSortedDocValues(SegmentReader.java:247)
[junit4:junit4]   1> 	at org.apache.lucene.index.ParallelAtomicReader.getSortedDocValues(ParallelAtomicReader.java:284)
[junit4:junit4]   1> 	at org.apache.lucene.index.MultiDocValues.getSortedValues(MultiDocValues.java:195)
[junit4:junit4]   1> 	at org.apache.lucene.index.SlowCompositeReaderWrapper.getSortedDocValues(SlowCompositeReaderWrapper.java:106)
[junit4:junit4]   1> 	at org.apache.lucene.index.FilterAtomicReader.getSortedDocValues(FilterAtomicReader.java:423)
[junit4:junit4]   1> 	at org.apache.lucene.index.FieldFilterAtomicReader.getSortedDocValues(FieldFilterAtomicReader.java:131)
[junit4:junit4]   1> 	at org.apache.lucene.index.ParallelAtomicReader.getSortedDocValues(ParallelAtomicReader.java:284)
[junit4:junit4]   1> 	at org.apache.lucene.index.FilterAtomicReader.getSortedDocValues(FilterAtomicReader.java:423)
[junit4:junit4]   1> 	at org.apache.lucene.index.FieldFilterAtomicReader.getSortedDocValues(FieldFilterAtomicReader.java:131)
[junit4:junit4]   1> 	at org.apache.lucene.index.ParallelAtomicReader.getSortedDocValues(ParallelAtomicReader.java:284)
[junit4:junit4]   1> 	at org.apache.lucene.index.ParallelAtomicReader.getSortedDocValues(ParallelAtomicReader.java:284)
[junit4:junit4]   1> 	at org.apache.lucene.index.CheckIndex.checkDocValues(CheckIndex.java:1345)
[junit4:junit4]   1> 	at org.apache.lucene.index.CheckIndex.testDocValues(CheckIndex.java:1274)
[junit4:junit4]   1> 	at org.apache.lucene.util._TestUtil.checkReader(_TestUtil.java:243)
[junit4:junit4]   1> 	at org.apache.lucene.util._TestUtil.checkReader(_TestUtil.java:232)
[junit4:junit4]   1> 	at org.apache.lucene.util.LuceneTestCase.newSearcher(LuceneTestCase.java:1250)
[junit4:junit4]   1> 	at org.apache.lucene.util.LuceneTestCase.newSearcher(LuceneTestCase.java:1235)
[junit4:junit4]   1> 	at org.apache.lucene.index.ThreadedIndexingAndSearchingTestCase$3.warm(ThreadedIndexingAndSearchingTestCase.java:472)
[junit4:junit4]   1> 	at org.apache.lucene.index.IndexWriter.mergeMiddle(IndexWriter.java:3771)
[junit4:junit4]   1> 	at org.apache.lucene.index.IndexWriter.merge(IndexWriter.java:3251)
[junit4:junit4]   1> 	at org.apache.lucene.index.SerialMergeScheduler.merge(SerialMergeScheduler.java:40)
[junit4:junit4]   1> 	at org.apache.lucene.index.IndexWriter.maybeMerge(IndexWriter.java:1845)
[junit4:junit4]   1> 	at org.apache.lucene.index.IndexWriter.prepareCommitInternal(IndexWriter.java:2687)
[junit4:junit4]   1> 	at org.apache.lucene.index.IndexWriter.commitInternal(IndexWriter.java:2782)
[junit4:junit4]   1> 	at org.apache.lucene.index.IndexWriter.commit(IndexWriter.java:2762)
[junit4:junit4]   1> 	at org.apache.lucene.search.TestSearcherManager$2.run(TestSearcherManager.java:109)
[junit4:junit4]   1> Caused by: java.nio.channels.ClosedChannelException
[junit4:junit4]   1> 	at sun.nio.ch.FileChannelImpl.ensureOpen(FileChannelImpl.java:109)
[junit4:junit4]   1> 	at sun.nio.ch.FileChannelImpl.read(FileChannelImpl.java:654)
[junit4:junit4]   1> 	at org.apache.lucene.store.NIOFSDirectory$NIOFSIndexInput.readInternal(NIOFSDirectory.java:167)
[junit4:junit4]   1> 	... 37 more
[junit4:junit4]   1> 
[junit4:junit4]   1> Thread-656: hit exc
[junit4:junit4]   2> 15/02/2013 02:32:28 ? com.carrotsearch.randomizedtesting.ThreadLeakControl tryToInterruptAll
[junit4:junit4]   2> INFO: All leaked threads terminated.
[junit4:junit4]   1> java.io.IOException: null: NIOFSIndexInput(path="/usr/home/hudson/hudson-slave/workspace/Lucene-Solr-NightlyTests-trunk/lucene/build/core/test/J0/TestSearcherManager1556515650tmp/_1p_Lucene41_0.tim")
[junit4:junit4]   1> 	at org.apache.lucene.store.NIOFSDirectory$NIOFSIndexInput.readInternal(NIOFSDirectory.java:182)
[junit4:junit4]   1> 	at org.apache.lucene.store.BufferedIndexInput.refill(BufferedIndexInput.java:272)
[junit4:junit4]   1> 	at org.apache.lucene.store.BufferedIndexInput.readByte(BufferedIndexInput.java:51)
[junit4:junit4]   1> 	at org.apache.lucene.store.DataInput.readVInt(DataInput.java:108)
[junit4:junit4]   1> 	at org.apache.lucene.store.BufferedIndexInput.readVInt(BufferedIndexInput.java:219)
[junit4:junit4]   1> 	at org.apache.lucene.store.MockIndexInputWrapper.readVInt(MockIndexInputWrapper.java:161)
[junit4:junit4]   1> 	at org.apache.lucene.codecs.BlockTreeTermsReader$FieldReader$SegmentTermsEnum$Frame.loadBlock(BlockTreeTermsReader.java:2357)
[junit4:junit4]   1> 	at org.apache.lucene.codecs.BlockTreeTermsReader$FieldReader$SegmentTermsEnum.seekExact(BlockTreeTermsReader.java:1745)
[junit4:junit4]   1> 	at org.apache.lucene.index.TermContext.build(TermContext.java:95)
[junit4:junit4]   1> 	at org.apache.lucene.search.TermQuery.createWeight(TermQuery.java:167)
[junit4:junit4]   1> 	at org.apache.lucene.search.IndexSearcher.createNormalizedWeight(IndexSearcher.java:657)
[junit4:junit4]   1> 	at org.apache.lucene.search.IndexSearcher.search(IndexSearcher.java:274)
[junit4:junit4]   1> 	at org.apache.lucene.search.IndexSearcher.search(IndexSearcher.java:262)
[junit4:junit4]   1> 	at org.apache.lucene.search.TestSearcherManager$1.newSearcher(TestSearcherManager.java:79)
[junit4:junit4]   1> 	at org.apache.lucene.search.SearcherManager.getSearcher(SearcherManager.java:152)
[junit4:junit4]   1> 	at org.apache.lucene.search.SearcherManager.refreshIfNeeded(SearcherManager.java:122)
[junit4:junit4]   1> 	at org.apache.lucene.search.SearcherManager.refreshIfNeeded(SearcherManager.java:58)
[junit4:junit4]   1> 	at org.apache.lucene.search.ReferenceManager.doMaybeRefresh(ReferenceManager.java:155)
[junit4:junit4]   1> 	at org.apache.lucene.search.ReferenceManager.maybeRefresh(ReferenceManager.java:204)
[junit4:junit4]   1> 	at org.apache.lucene.search.TestSearcherManager.getCurrentSearcher(TestSearcherManager.java:144)
[junit4:junit4]   1> 	at org.apache.lucene.index.ThreadedIndexingAndSearchingTestCase$2.run(ThreadedIndexingAndSearchingTestCase.java:332)
[junit4:junit4]   1> Caused by: java.nio.channels.ClosedByInterruptException
[junit4:junit4]   1> 	at java.nio.channels.spi.AbstractInterruptibleChannel.end(AbstractInterruptibleChannel.java:201)
[junit4:junit4]   1> 	at sun.nio.ch.FileChannelImpl.read(FileChannelImpl.java:668)
[junit4:junit4]   1> 	at org.apache.lucene.store.NIOFSDirectory$NIOFSIndexInput.readInternal(NIOFSDirectory.java:167)
[junit4:junit4]   1> 	... 20 more
[junit4:junit4]   2> NOTE: test params are: codec=FastCompressingStoredFields(storedFieldsFormat=CompressingStoredFieldsFormat(compressionMode=FAST, chunkSize=238), termVectorsFormat=CompressingTermVectorsFormat(compressionMode=FAST, chunkSize=238)), sim=DefaultSimilarity, locale=ar_OM, timezone=Africa/Algiers
[junit4:junit4]   2> NOTE: FreeBSD 9.0-RELEASE amd64/Sun Microsystems Inc. 1.6.0_32 (64-bit)/cpus=16,threads=1,free=14438552,total=156499968
[junit4:junit4]   2> NOTE: All tests run in this JVM: [TestMultiTermConstantScore, TestStressIndexing, TestFieldCacheTermsFilter, TestFlex, TestCachingTokenFilter, TestBagOfPostings, TestIndexInput, TestSearchForDuplicates, TestGraphTokenizers, TestCustomSearcherSort, TestTermVectorsReader, TestRollingUpdates, Nested1, TestThreadedForceMerge, TestSizeBoundedForceMerge, TestPrefixRandom, TestNamedSPILoader, TestExternalCodecs, TestRegexpRandom, TestVersion, TestAtomicUpdate, TestBlockPostingsFormat2, TestStressIndexing2, Test4GBStoredFields, TestWeakIdentityMap, TestNoDeletionPolicy, TestMultiValuedNumericRangeQuery, TestElevationComparator, TestDirectoryReaderReopen, TestReaderClosed, TestDateFilter, TestSimpleExplanations, Test2BPostingsBytes, TestSloppyPhraseQuery, TestScorerPerf, TestCopyBytes, TestTwoPhaseCommitTool, TestTermVectorsFormat, TestConcurrentMergeScheduler, TestVersionComparator, TestShardSearching, TestNot, TestUTF32ToUTF8, TestHighCompressionMode, TestDoubleBarrelLRUCache, TestAttributeSource, NestedSetupChain, NestedTeardownChain, TestPayloadSpans, TestMultiFields, TestBooleanScorer, TestField, TestNGramPhraseQuery, TestIndexableField, TestSearcherManager]
[junit4:junit4]   2> NOTE: download the large Jenkins line-docs file by running 'ant get-jenkins-line-docs' in the lucene directory.
[junit4:junit4]   2> NOTE: reproduce with: ant test  -Dtestcase=TestSearcherManager -Dtests.seed=F2018D8395CAAB09 -Dtests.multiplier=2 -Dtests.nightly=true -Dtests.slow=true -Dtests.linedocsfile=/home/hudson/lucene-data/enwiki.random.lines.txt -Dtests.locale=ar_OM -Dtests.timezone=Africa/Algiers -Dtests.file.encoding=ISO-8859-1
[junit4:junit4] ERROR   0.00s J0 | TestSearcherManager (suite) <<<
[junit4:junit4]    > Throwable #1: java.lang.Exception: Suite timeout exceeded (>= 7200000 msec).
[junit4:junit4]    > 	at __randomizedtesting.SeedInfo.seed([F2018D8395CAAB09]:0)
[junit4:junit4] Completed on J0 in 7220.38s, 7 tests, 2 errors <<< FAILURES!

[...truncated 111 lines...]
BUILD FAILED
/usr/home/hudson/hudson-slave/workspace/Lucene-Solr-NightlyTests-trunk/build.xml:388: The following error occurred while executing this line:
/usr/home/hudson/hudson-slave/workspace/Lucene-Solr-NightlyTests-trunk/build.xml:361: The following error occurred while executing this line:
/usr/home/hudson/hudson-slave/workspace/Lucene-Solr-NightlyTests-trunk/build.xml:39: The following error occurred while executing this line:
/usr/home/hudson/hudson-slave/workspace/Lucene-Solr-NightlyTests-trunk/lucene/build.xml:50: The following error occurred while executing this line:
/usr/home/hudson/hudson-slave/workspace/Lucene-Solr-NightlyTests-trunk/lucene/common-build.xml:1202: The following error occurred while executing this line:
/usr/home/hudson/hudson-slave/workspace/Lucene-Solr-NightlyTests-trunk/lucene/common-build.xml:865: There were test failures: 343 suites, 2059 tests, 1 suite-level error, 1 error, 12 ignored

Total time: 131 minutes 9 seconds
Build step 'Invoke Ant' marked build as failure
Archiving artifacts
Recording test results
Email was triggered for: Failure
Sending email for trigger: Failure



Mime
View raw message