lucene-dev mailing list archives

Site index · List index
Message view « Date » · « Thread »
Top « Date » · « Thread »
From Apache Jenkins Server <jenk...@builds.apache.org>
Subject [JENKINS] Lucene-Solr-Tests-4.x-Java6 - Build # 1303 - Still Failing
Date Sat, 02 Feb 2013 20:06:14 GMT
Build: https://builds.apache.org/job/Lucene-Solr-Tests-4.x-Java6/1303/

1 tests failed.
FAILED:  org.apache.solr.cloud.SyncSliceTest.testDistribSearch

Error Message:
shard1 should have just been set up to be inconsistent - but it's still consistent

Stack Trace:
java.lang.AssertionError: shard1 should have just been set up to be inconsistent - but it's still consistent
	at __randomizedtesting.SeedInfo.seed([6AA35BCDC70B7AFA:EB45D5D5B0541AC6]:0)
	at org.junit.Assert.fail(Assert.java:93)
	at org.junit.Assert.assertTrue(Assert.java:43)
	at org.junit.Assert.assertNotNull(Assert.java:526)
	at org.apache.solr.cloud.SyncSliceTest.doTest(SyncSliceTest.java:214)
	at org.apache.solr.BaseDistributedSearchTestCase.testDistribSearch(BaseDistributedSearchTestCase.java:794)
	at sun.reflect.NativeMethodAccessorImpl.invoke0(Native Method)
	at sun.reflect.NativeMethodAccessorImpl.invoke(NativeMethodAccessorImpl.java:57)
	at sun.reflect.DelegatingMethodAccessorImpl.invoke(DelegatingMethodAccessorImpl.java:43)
	at java.lang.reflect.Method.invoke(Method.java:616)
	at com.carrotsearch.randomizedtesting.RandomizedRunner.invoke(RandomizedRunner.java:1559)
	at com.carrotsearch.randomizedtesting.RandomizedRunner.access$600(RandomizedRunner.java:79)
	at com.carrotsearch.randomizedtesting.RandomizedRunner$6.evaluate(RandomizedRunner.java:737)
	at com.carrotsearch.randomizedtesting.RandomizedRunner$7.evaluate(RandomizedRunner.java:773)
	at com.carrotsearch.randomizedtesting.RandomizedRunner$8.evaluate(RandomizedRunner.java:787)
	at com.carrotsearch.randomizedtesting.rules.SystemPropertiesRestoreRule$1.evaluate(SystemPropertiesRestoreRule.java:53)
	at org.apache.lucene.util.TestRuleSetupTeardownChained$1.evaluate(TestRuleSetupTeardownChained.java:50)
	at org.apache.lucene.util.TestRuleFieldCacheSanity$1.evaluate(TestRuleFieldCacheSanity.java:51)
	at org.apache.lucene.util.AbstractBeforeAfterRule$1.evaluate(AbstractBeforeAfterRule.java:46)
	at com.carrotsearch.randomizedtesting.rules.SystemPropertiesInvariantRule$1.evaluate(SystemPropertiesInvariantRule.java:55)
	at org.apache.lucene.util.TestRuleThreadAndTestName$1.evaluate(TestRuleThreadAndTestName.java:49)
	at org.apache.lucene.util.TestRuleIgnoreAfterMaxFailures$1.evaluate(TestRuleIgnoreAfterMaxFailures.java:70)
	at org.apache.lucene.util.TestRuleMarkFailure$1.evaluate(TestRuleMarkFailure.java:48)
	at com.carrotsearch.randomizedtesting.rules.StatementAdapter.evaluate(StatementAdapter.java:36)
	at com.carrotsearch.randomizedtesting.ThreadLeakControl$StatementRunner.run(ThreadLeakControl.java:358)
	at com.carrotsearch.randomizedtesting.ThreadLeakControl.forkTimeoutingTask(ThreadLeakControl.java:782)
	at com.carrotsearch.randomizedtesting.ThreadLeakControl$3.evaluate(ThreadLeakControl.java:442)
	at com.carrotsearch.randomizedtesting.RandomizedRunner.runSingleTest(RandomizedRunner.java:746)
	at com.carrotsearch.randomizedtesting.RandomizedRunner$3.evaluate(RandomizedRunner.java:648)
	at com.carrotsearch.randomizedtesting.RandomizedRunner$4.evaluate(RandomizedRunner.java:682)
	at com.carrotsearch.randomizedtesting.RandomizedRunner$5.evaluate(RandomizedRunner.java:693)
	at com.carrotsearch.randomizedtesting.rules.StatementAdapter.evaluate(StatementAdapter.java:36)
	at com.carrotsearch.randomizedtesting.rules.SystemPropertiesRestoreRule$1.evaluate(SystemPropertiesRestoreRule.java:53)
	at org.apache.lucene.util.AbstractBeforeAfterRule$1.evaluate(AbstractBeforeAfterRule.java:46)
	at org.apache.lucene.util.TestRuleStoreClassName$1.evaluate(TestRuleStoreClassName.java:42)
	at com.carrotsearch.randomizedtesting.rules.SystemPropertiesInvariantRule$1.evaluate(SystemPropertiesInvariantRule.java:55)
	at com.carrotsearch.randomizedtesting.rules.NoShadowingOrOverridesOnMethodsRule$1.evaluate(NoShadowingOrOverridesOnMethodsRule.java:39)
	at com.carrotsearch.randomizedtesting.rules.NoShadowingOrOverridesOnMethodsRule$1.evaluate(NoShadowingOrOverridesOnMethodsRule.java:39)
	at com.carrotsearch.randomizedtesting.rules.StatementAdapter.evaluate(StatementAdapter.java:36)
	at org.apache.lucene.util.TestRuleAssertionsRequired$1.evaluate(TestRuleAssertionsRequired.java:43)
	at org.apache.lucene.util.TestRuleMarkFailure$1.evaluate(TestRuleMarkFailure.java:48)
	at org.apache.lucene.util.TestRuleIgnoreAfterMaxFailures$1.evaluate(TestRuleIgnoreAfterMaxFailures.java:70)
	at org.apache.lucene.util.TestRuleIgnoreTestSuites$1.evaluate(TestRuleIgnoreTestSuites.java:55)
	at com.carrotsearch.randomizedtesting.rules.StatementAdapter.evaluate(StatementAdapter.java:36)
	at com.carrotsearch.randomizedtesting.ThreadLeakControl$StatementRunner.run(ThreadLeakControl.java:358)
	at java.lang.Thread.run(Thread.java:679)




Build Log:
[...truncated 8188 lines...]
[junit4:junit4] Suite: org.apache.solr.cloud.SyncSliceTest
[junit4:junit4]   2> 0 T1179 oas.BaseDistributedSearchTestCase.initHostContext Setting hostContext system property: /i_d/ql
[junit4:junit4]   2> 3 T1179 oas.SolrTestCaseJ4.setUp ###Starting testDistribSearch
[junit4:junit4]   2> Creating dataDir: /usr/home/hudson/hudson-slave/workspace/Lucene-Solr-Tests-4.x-Java6/solr/build/solr-core/test/J1/./solrtest-SyncSliceTest-1359834888038
[junit4:junit4]   2> 4 T1179 oasc.ZkTestServer.run STARTING ZK TEST SERVER
[junit4:junit4]   2> 5 T1180 oasc.ZkTestServer$ZKServerMain.runFromConfig Starting server
[junit4:junit4]   2> 7 T1180 oazs.ZooKeeperServer.setTickTime tickTime set to 1000
[junit4:junit4]   2> 7 T1180 oazs.ZooKeeperServer.setMinSessionTimeout minSessionTimeout set to -1
[junit4:junit4]   2> 7 T1180 oazs.ZooKeeperServer.setMaxSessionTimeout maxSessionTimeout set to -1
[junit4:junit4]   2> 7 T1180 oazs.NIOServerCnxnFactory.configure binding to port 0.0.0.0/0.0.0.0:0
[junit4:junit4]   2> 8 T1180 oazsp.FileTxnSnapLog.save Snapshotting: 0x0 to /usr/home/hudson/hudson-slave/workspace/Lucene-Solr-Tests-4.x-Java6/solr/build/solr-core/test/J1/./org.apache.solr.cloud.SyncSliceTest-1359834888038/zookeeper/server1/data/version-2/snapshot.0
[junit4:junit4]   2> 106 T1179 oasc.ZkTestServer.run start zk server on port:37189
[junit4:junit4]   2> 106 T1179 oaz.ZooKeeper.<init> Initiating client connection, connectString=127.0.0.1:37189 sessionTimeout=10000 watcher=org.apache.solr.common.cloud.ConnectionManager@1740f923
[junit4:junit4]   2> 107 T1179 oascc.ConnectionManager.waitForConnected Waiting for client to connect to ZooKeeper
[junit4:junit4]   2> 107 T1185 oaz.ClientCnxn$SendThread.logStartConnect Opening socket connection to server localhost/127.0.0.1:37189. Will not attempt to authenticate using SASL (access denied (javax.security.auth.AuthPermission getLoginConfiguration))
[junit4:junit4]   2> 108 T1185 oaz.ClientCnxn$SendThread.primeConnection Socket connection established to localhost/127.0.0.1:37189, initiating session
[junit4:junit4]   2> 108 T1181 oazs.NIOServerCnxnFactory.run Accepted socket connection from /140.211.11.196:37190
[junit4:junit4]   2> 108 T1181 oazs.ZooKeeperServer.processConnectRequest Client attempting to establish new session at /140.211.11.196:37190
[junit4:junit4]   2> 109 T1183 oazsp.FileTxnLog.append Creating new log file: log.1
[junit4:junit4]   2> 136 T1183 oazs.ZooKeeperServer.finishSessionInit Established session 0x13c9c79b76a0000 with negotiated timeout 10000 for client /140.211.11.196:37190
[junit4:junit4]   2> 136 T1185 oaz.ClientCnxn$SendThread.onConnected Session establishment complete on server localhost/127.0.0.1:37189, sessionid = 0x13c9c79b76a0000, negotiated timeout = 10000
[junit4:junit4]   2> 136 T1186 oascc.ConnectionManager.process Watcher org.apache.solr.common.cloud.ConnectionManager@1740f923 name:ZooKeeperConnection Watcher:127.0.0.1:37189 got event WatchedEvent state:SyncConnected type:None path:null path:null type:None
[junit4:junit4]   2> 137 T1179 oascc.ConnectionManager.waitForConnected Client is connected to ZooKeeper
[junit4:junit4]   2> 137 T1179 oascc.SolrZkClient.makePath makePath: /solr
[junit4:junit4]   2> 140 T1184 oazs.PrepRequestProcessor.pRequest2Txn Processed session termination for sessionid: 0x13c9c79b76a0000
[junit4:junit4]   2> 147 T1186 oaz.ClientCnxn$EventThread.run EventThread shut down
[junit4:junit4]   2> 147 T1179 oaz.ZooKeeper.close Session: 0x13c9c79b76a0000 closed
[junit4:junit4]   2> 147 T1181 oazs.NIOServerCnxn.closeSock Closed socket connection for client /140.211.11.196:37190 which had sessionid 0x13c9c79b76a0000
[junit4:junit4]   2> 147 T1179 oaz.ZooKeeper.<init> Initiating client connection, connectString=127.0.0.1:37189/solr sessionTimeout=10000 watcher=org.apache.solr.common.cloud.ConnectionManager@4b492b79
[junit4:junit4]   2> 148 T1179 oascc.ConnectionManager.waitForConnected Waiting for client to connect to ZooKeeper
[junit4:junit4]   2> 148 T1187 oaz.ClientCnxn$SendThread.logStartConnect Opening socket connection to server localhost/127.0.0.1:37189. Will not attempt to authenticate using SASL (access denied (javax.security.auth.AuthPermission getLoginConfiguration))
[junit4:junit4]   2> 149 T1187 oaz.ClientCnxn$SendThread.primeConnection Socket connection established to localhost/127.0.0.1:37189, initiating session
[junit4:junit4]   2> 149 T1181 oazs.NIOServerCnxnFactory.run Accepted socket connection from /140.211.11.196:37191
[junit4:junit4]   2> 149 T1181 oazs.ZooKeeperServer.processConnectRequest Client attempting to establish new session at /140.211.11.196:37191
[junit4:junit4]   2> 150 T1183 oazs.ZooKeeperServer.finishSessionInit Established session 0x13c9c79b76a0001 with negotiated timeout 10000 for client /140.211.11.196:37191
[junit4:junit4]   2> 151 T1187 oaz.ClientCnxn$SendThread.onConnected Session establishment complete on server localhost/127.0.0.1:37189, sessionid = 0x13c9c79b76a0001, negotiated timeout = 10000
[junit4:junit4]   2> 151 T1188 oascc.ConnectionManager.process Watcher org.apache.solr.common.cloud.ConnectionManager@4b492b79 name:ZooKeeperConnection Watcher:127.0.0.1:37189/solr got event WatchedEvent state:SyncConnected type:None path:null path:null type:None
[junit4:junit4]   2> 151 T1179 oascc.ConnectionManager.waitForConnected Client is connected to ZooKeeper
[junit4:junit4]   2> 151 T1179 oascc.SolrZkClient.makePath makePath: /collections/collection1
[junit4:junit4]   2> 161 T1179 oascc.SolrZkClient.makePath makePath: /collections/collection1/shards
[junit4:junit4]   2> 165 T1179 oascc.SolrZkClient.makePath makePath: /collections/control_collection
[junit4:junit4]   2> 169 T1179 oascc.SolrZkClient.makePath makePath: /collections/control_collection/shards
[junit4:junit4]   2> 173 T1179 oasc.AbstractZkTestCase.putConfig put /usr/home/hudson/hudson-slave/workspace/Lucene-Solr-Tests-4.x-Java6/solr/build/solr-core/test-files/solr/collection1/conf/solrconfig.xml to /configs/conf1/solrconfig.xml
[junit4:junit4]   2> 173 T1179 oascc.SolrZkClient.makePath makePath: /configs/conf1/solrconfig.xml
[junit4:junit4]   2> 185 T1179 oasc.AbstractZkTestCase.putConfig put /usr/home/hudson/hudson-slave/workspace/Lucene-Solr-Tests-4.x-Java6/solr/build/solr-core/test-files/solr/collection1/conf/schema.xml to /configs/conf1/schema.xml
[junit4:junit4]   2> 185 T1179 oascc.SolrZkClient.makePath makePath: /configs/conf1/schema.xml
[junit4:junit4]   2> 289 T1179 oasc.AbstractZkTestCase.putConfig put /usr/home/hudson/hudson-slave/workspace/Lucene-Solr-Tests-4.x-Java6/solr/build/solr-core/test-files/solr/collection1/conf/stopwords.txt to /configs/conf1/stopwords.txt
[junit4:junit4]   2> 290 T1179 oascc.SolrZkClient.makePath makePath: /configs/conf1/stopwords.txt
[junit4:junit4]   2> 293 T1179 oasc.AbstractZkTestCase.putConfig put /usr/home/hudson/hudson-slave/workspace/Lucene-Solr-Tests-4.x-Java6/solr/build/solr-core/test-files/solr/collection1/conf/protwords.txt to /configs/conf1/protwords.txt
[junit4:junit4]   2> 293 T1179 oascc.SolrZkClient.makePath makePath: /configs/conf1/protwords.txt
[junit4:junit4]   2> 304 T1179 oasc.AbstractZkTestCase.putConfig put /usr/home/hudson/hudson-slave/workspace/Lucene-Solr-Tests-4.x-Java6/solr/build/solr-core/test-files/solr/collection1/conf/currency.xml to /configs/conf1/currency.xml
[junit4:junit4]   2> 305 T1179 oascc.SolrZkClient.makePath makePath: /configs/conf1/currency.xml
[junit4:junit4]   2> 309 T1179 oasc.AbstractZkTestCase.putConfig put /usr/home/hudson/hudson-slave/workspace/Lucene-Solr-Tests-4.x-Java6/solr/build/solr-core/test-files/solr/collection1/conf/open-exchange-rates.json to /configs/conf1/open-exchange-rates.json
[junit4:junit4]   2> 309 T1179 oascc.SolrZkClient.makePath makePath: /configs/conf1/open-exchange-rates.json
[junit4:junit4]   2> 313 T1179 oasc.AbstractZkTestCase.putConfig put /usr/home/hudson/hudson-slave/workspace/Lucene-Solr-Tests-4.x-Java6/solr/build/solr-core/test-files/solr/collection1/conf/mapping-ISOLatin1Accent.txt to /configs/conf1/mapping-ISOLatin1Accent.txt
[junit4:junit4]   2> 313 T1179 oascc.SolrZkClient.makePath makePath: /configs/conf1/mapping-ISOLatin1Accent.txt
[junit4:junit4]   2> 317 T1179 oasc.AbstractZkTestCase.putConfig put /usr/home/hudson/hudson-slave/workspace/Lucene-Solr-Tests-4.x-Java6/solr/build/solr-core/test-files/solr/collection1/conf/old_synonyms.txt to /configs/conf1/old_synonyms.txt
[junit4:junit4]   2> 318 T1179 oascc.SolrZkClient.makePath makePath: /configs/conf1/old_synonyms.txt
[junit4:junit4]   2> 322 T1179 oasc.AbstractZkTestCase.putConfig put /usr/home/hudson/hudson-slave/workspace/Lucene-Solr-Tests-4.x-Java6/solr/build/solr-core/test-files/solr/collection1/conf/synonyms.txt to /configs/conf1/synonyms.txt
[junit4:junit4]   2> 322 T1179 oascc.SolrZkClient.makePath makePath: /configs/conf1/synonyms.txt
[junit4:junit4]   2> 327 T1184 oazs.PrepRequestProcessor.pRequest2Txn Processed session termination for sessionid: 0x13c9c79b76a0001
[junit4:junit4]   2> 328 T1188 oaz.ClientCnxn$EventThread.run EventThread shut down
[junit4:junit4]   2> 328 T1181 oazs.NIOServerCnxn.closeSock Closed socket connection for client /140.211.11.196:37191 which had sessionid 0x13c9c79b76a0001
[junit4:junit4]   2> 328 T1179 oaz.ZooKeeper.close Session: 0x13c9c79b76a0001 closed
[junit4:junit4]   2> 437 T1179 oejs.Server.doStart jetty-8.1.8.v20121106
[junit4:junit4]   2> 441 T1179 oejs.AbstractConnector.doStart Started SocketConnector@127.0.0.1:37192
[junit4:junit4]   2> 441 T1179 oass.SolrDispatchFilter.init SolrDispatchFilter.init()
[junit4:junit4]   2> 442 T1179 oasc.SolrResourceLoader.locateSolrHome JNDI not configured for solr (NoInitialContextEx)
[junit4:junit4]   2> 442 T1179 oasc.SolrResourceLoader.locateSolrHome using system property solr.solr.home: /usr/home/hudson/hudson-slave/workspace/Lucene-Solr-Tests-4.x-Java6/solr/build/solr-core/test/J1/./org.apache.solr.cloud.SyncSliceTest-controljetty-1359834888366
[junit4:junit4]   2> 442 T1179 oasc.CoreContainer$Initializer.initialize looking for solr.xml: /usr/home/hudson/hudson-slave/workspace/Lucene-Solr-Tests-4.x-Java6/solr/build/solr-core/test/J1/./org.apache.solr.cloud.SyncSliceTest-controljetty-1359834888366/solr.xml
[junit4:junit4]   2> 443 T1179 oasc.CoreContainer.<init> New CoreContainer 455096628
[junit4:junit4]   2> 443 T1179 oasc.CoreContainer.load Loading CoreContainer using Solr Home: '/usr/home/hudson/hudson-slave/workspace/Lucene-Solr-Tests-4.x-Java6/solr/build/solr-core/test/J1/./org.apache.solr.cloud.SyncSliceTest-controljetty-1359834888366/'
[junit4:junit4]   2> 444 T1179 oasc.SolrResourceLoader.<init> new SolrResourceLoader for directory: '/usr/home/hudson/hudson-slave/workspace/Lucene-Solr-Tests-4.x-Java6/solr/build/solr-core/test/J1/./org.apache.solr.cloud.SyncSliceTest-controljetty-1359834888366/'
[junit4:junit4]   2> 472 T1179 oashc.HttpShardHandlerFactory.getParameter Setting socketTimeout to: 60000
[junit4:junit4]   2> 472 T1179 oashc.HttpShardHandlerFactory.getParameter Setting urlScheme to: http://
[junit4:junit4]   2> 472 T1179 oashc.HttpShardHandlerFactory.getParameter Setting connTimeout to: 15000
[junit4:junit4]   2> 473 T1179 oashc.HttpShardHandlerFactory.getParameter Setting maxConnectionsPerHost to: 20
[junit4:junit4]   2> 473 T1179 oashc.HttpShardHandlerFactory.getParameter Setting corePoolSize to: 0
[junit4:junit4]   2> 473 T1179 oashc.HttpShardHandlerFactory.getParameter Setting maximumPoolSize to: 2147483647
[junit4:junit4]   2> 473 T1179 oashc.HttpShardHandlerFactory.getParameter Setting maxThreadIdleTime to: 5
[junit4:junit4]   2> 474 T1179 oashc.HttpShardHandlerFactory.getParameter Setting sizeOfQueue to: -1
[junit4:junit4]   2> 474 T1179 oashc.HttpShardHandlerFactory.getParameter Setting fairnessPolicy to: false
[junit4:junit4]   2> 474 T1179 oascsi.HttpClientUtil.createClient Creating new http client, config:maxConnectionsPerHost=20&maxConnections=10000&socketTimeout=60000&connTimeout=15000&retry=false
[junit4:junit4]   2> 488 T1179 oasc.CoreContainer.load Registering Log Listener
[junit4:junit4]   2> 501 T1179 oasc.CoreContainer.initZooKeeper Zookeeper client=127.0.0.1:37189/solr
[junit4:junit4]   2> 501 T1179 oasc.ZkController.checkChrootPath zkHost includes chroot
[junit4:junit4]   2> 502 T1179 oaz.ZooKeeper.<init> Initiating client connection, connectString=127.0.0.1:37189 sessionTimeout=60000 watcher=org.apache.solr.common.cloud.ConnectionManager@6b550f77
[junit4:junit4]   2> 502 T1179 oascc.ConnectionManager.waitForConnected Waiting for client to connect to ZooKeeper
[junit4:junit4]   2> 503 T1198 oaz.ClientCnxn$SendThread.logStartConnect Opening socket connection to server localhost/127.0.0.1:37189. Will not attempt to authenticate using SASL (access denied (javax.security.auth.AuthPermission getLoginConfiguration))
[junit4:junit4]   2> 504 T1198 oaz.ClientCnxn$SendThread.primeConnection Socket connection established to localhost/127.0.0.1:37189, initiating session
[junit4:junit4]   2> 504 T1181 oazs.NIOServerCnxnFactory.run Accepted socket connection from /140.211.11.196:37193
[junit4:junit4]   2> 504 T1181 oazs.ZooKeeperServer.processConnectRequest Client attempting to establish new session at /140.211.11.196:37193
[junit4:junit4]   2> 506 T1183 oazs.ZooKeeperServer.finishSessionInit Established session 0x13c9c79b76a0002 with negotiated timeout 20000 for client /140.211.11.196:37193
[junit4:junit4]   2> 506 T1198 oaz.ClientCnxn$SendThread.onConnected Session establishment complete on server localhost/127.0.0.1:37189, sessionid = 0x13c9c79b76a0002, negotiated timeout = 20000
[junit4:junit4]   2> 506 T1199 oascc.ConnectionManager.process Watcher org.apache.solr.common.cloud.ConnectionManager@6b550f77 name:ZooKeeperConnection Watcher:127.0.0.1:37189 got event WatchedEvent state:SyncConnected type:None path:null path:null type:None
[junit4:junit4]   2> 506 T1179 oascc.ConnectionManager.waitForConnected Client is connected to ZooKeeper
[junit4:junit4]   2> 508 T1184 oazs.PrepRequestProcessor.pRequest2Txn Processed session termination for sessionid: 0x13c9c79b76a0002
[junit4:junit4]   2> 509 T1199 oaz.ClientCnxn$EventThread.run EventThread shut down
[junit4:junit4]   2> 509 T1181 oazs.NIOServerCnxn.closeSock Closed socket connection for client /140.211.11.196:37193 which had sessionid 0x13c9c79b76a0002
[junit4:junit4]   2> 509 T1179 oaz.ZooKeeper.close Session: 0x13c9c79b76a0002 closed
[junit4:junit4]   2> 509 T1179 oascsi.HttpClientUtil.createClient Creating new http client, config:maxConnections=500&maxConnectionsPerHost=16&socketTimeout=60000&connTimeout=15000
[junit4:junit4]   2> 517 T1179 oaz.ZooKeeper.<init> Initiating client connection, connectString=127.0.0.1:37189/solr sessionTimeout=30000 watcher=org.apache.solr.common.cloud.ConnectionManager@49f65429
[junit4:junit4]   2> 518 T1179 oascc.ConnectionManager.waitForConnected Waiting for client to connect to ZooKeeper
[junit4:junit4]   2> 518 T1200 oaz.ClientCnxn$SendThread.logStartConnect Opening socket connection to server localhost/127.0.0.1:37189. Will not attempt to authenticate using SASL (access denied (javax.security.auth.AuthPermission getLoginConfiguration))
[junit4:junit4]   2> 518 T1200 oaz.ClientCnxn$SendThread.primeConnection Socket connection established to localhost/127.0.0.1:37189, initiating session
[junit4:junit4]   2> 519 T1181 oazs.NIOServerCnxnFactory.run Accepted socket connection from /140.211.11.196:37194
[junit4:junit4]   2> 519 T1181 oazs.ZooKeeperServer.processConnectRequest Client attempting to establish new session at /140.211.11.196:37194
[junit4:junit4]   2> 520 T1183 oazs.ZooKeeperServer.finishSessionInit Established session 0x13c9c79b76a0003 with negotiated timeout 20000 for client /140.211.11.196:37194
[junit4:junit4]   2> 520 T1200 oaz.ClientCnxn$SendThread.onConnected Session establishment complete on server localhost/127.0.0.1:37189, sessionid = 0x13c9c79b76a0003, negotiated timeout = 20000
[junit4:junit4]   2> 520 T1201 oascc.ConnectionManager.process Watcher org.apache.solr.common.cloud.ConnectionManager@49f65429 name:ZooKeeperConnection Watcher:127.0.0.1:37189/solr got event WatchedEvent state:SyncConnected type:None path:null path:null type:None
[junit4:junit4]   2> 521 T1179 oascc.ConnectionManager.waitForConnected Client is connected to ZooKeeper
[junit4:junit4]   2> 523 T1184 oazs.PrepRequestProcessor.pRequest Got user-level KeeperException when processing sessionid:0x13c9c79b76a0003 type:create cxid:0x2 zxid:0x1a txntype:-1 reqpath:n/a Error Path:/solr/overseer Error:KeeperErrorCode = NodeExists for /solr/overseer
[junit4:junit4]   2> 531 T1179 oascc.SolrZkClient.makePath makePath: /live_nodes
[junit4:junit4]   2> 533 T1179 oasc.ZkController.createEphemeralLiveNode Register node as live in ZooKeeper:/live_nodes/127.0.0.1:37192_i_d%2Fql
[junit4:junit4]   2> 534 T1184 oazs.PrepRequestProcessor.pRequest Got user-level KeeperException when processing sessionid:0x13c9c79b76a0003 type:delete cxid:0x7 zxid:0x1c txntype:-1 reqpath:n/a Error Path:/solr/live_nodes/127.0.0.1:37192_i_d%2Fql Error:KeeperErrorCode = NoNode for /solr/live_nodes/127.0.0.1:37192_i_d%2Fql
[junit4:junit4]   2> 535 T1179 oascc.SolrZkClient.makePath makePath: /live_nodes/127.0.0.1:37192_i_d%2Fql
[junit4:junit4]   2> 545 T1179 oascc.SolrZkClient.makePath makePath: /overseer_elect/election
[junit4:junit4]   2> 557 T1184 oazs.PrepRequestProcessor.pRequest Got user-level KeeperException when processing sessionid:0x13c9c79b76a0003 type:delete cxid:0x15 zxid:0x21 txntype:-1 reqpath:n/a Error Path:/solr/overseer_elect/leader Error:KeeperErrorCode = NoNode for /solr/overseer_elect/leader
[junit4:junit4]   2> 558 T1179 oascc.SolrZkClient.makePath makePath: /overseer_elect/leader
[junit4:junit4]   2> 565 T1179 oasc.Overseer.start Overseer (id=89118139222720515-127.0.0.1:37192_i_d%2Fql-n_0000000000) starting
[junit4:junit4]   2> 565 T1184 oazs.PrepRequestProcessor.pRequest Got user-level KeeperException when processing sessionid:0x13c9c79b76a0003 type:create cxid:0x1a zxid:0x23 txntype:-1 reqpath:n/a Error Path:/solr/overseer Error:KeeperErrorCode = NodeExists for /solr/overseer
[junit4:junit4]   2> 566 T1184 oazs.PrepRequestProcessor.pRequest Got user-level KeeperException when processing sessionid:0x13c9c79b76a0003 type:create cxid:0x1b zxid:0x24 txntype:-1 reqpath:n/a Error Path:/solr/overseer Error:KeeperErrorCode = NodeExists for /solr/overseer
[junit4:junit4]   2> 568 T1184 oazs.PrepRequestProcessor.pRequest Got user-level KeeperException when processing sessionid:0x13c9c79b76a0003 type:create cxid:0x1c zxid:0x25 txntype:-1 reqpath:n/a Error Path:/solr/overseer Error:KeeperErrorCode = NodeExists for /solr/overseer
[junit4:junit4]   2> 577 T1184 oazs.PrepRequestProcessor.pRequest Got user-level KeeperException when processing sessionid:0x13c9c79b76a0003 type:create cxid:0x1d zxid:0x26 txntype:-1 reqpath:n/a Error Path:/solr/overseer Error:KeeperErrorCode = NodeExists for /solr/overseer
[junit4:junit4]   2> 579 T1203 oasc.OverseerCollectionProcessor.run Process current queue of collection creations
[junit4:junit4]   2> 580 T1179 oascc.SolrZkClient.makePath makePath: /clusterstate.json
[junit4:junit4]   2> 584 T1179 oascc.ZkStateReader.createClusterStateWatchersAndUpdate Updating cluster state from ZooKeeper... 
[junit4:junit4]   2> 586 T1202 oasc.Overseer$ClusterStateUpdater.run Starting to work on the main queue
[junit4:junit4]   2> 591 T1204 oasc.CoreContainer.create Creating SolrCore 'collection1' using instanceDir: /usr/home/hudson/hudson-slave/workspace/Lucene-Solr-Tests-4.x-Java6/solr/build/solr-core/test/J1/./org.apache.solr.cloud.SyncSliceTest-controljetty-1359834888366/collection1
[junit4:junit4]   2> 592 T1204 oasc.ZkController.createCollectionZkNode Check for collection zkNode:control_collection
[junit4:junit4]   2> 592 T1204 oasc.ZkController.createCollectionZkNode Collection zkNode exists
[junit4:junit4]   2> 593 T1204 oasc.ZkController.readConfigName Load collection config from:/collections/control_collection
[junit4:junit4]   2> 594 T1204 oasc.SolrResourceLoader.<init> new SolrResourceLoader for directory: '/usr/home/hudson/hudson-slave/workspace/Lucene-Solr-Tests-4.x-Java6/solr/build/solr-core/test/J1/./org.apache.solr.cloud.SyncSliceTest-controljetty-1359834888366/collection1/'
[junit4:junit4]   2> 595 T1204 oasc.SolrResourceLoader.replaceClassLoader Adding 'file:/usr/home/hudson/hudson-slave/workspace/Lucene-Solr-Tests-4.x-Java6/solr/build/solr-core/test/J1/org.apache.solr.cloud.SyncSliceTest-controljetty-1359834888366/collection1/lib/classes/' to classloader
[junit4:junit4]   2> 596 T1204 oasc.SolrResourceLoader.replaceClassLoader Adding 'file:/usr/home/hudson/hudson-slave/workspace/Lucene-Solr-Tests-4.x-Java6/solr/build/solr-core/test/J1/org.apache.solr.cloud.SyncSliceTest-controljetty-1359834888366/collection1/lib/README' to classloader
[junit4:junit4]   2> 648 T1204 oasc.SolrConfig.<init> Using Lucene MatchVersion: LUCENE_42
[junit4:junit4]   2> 719 T1204 oasc.SolrConfig.<init> Loaded SolrConfig: solrconfig.xml
[junit4:junit4]   2> 820 T1204 oass.IndexSchema.readSchema Reading Solr Schema
[junit4:junit4]   2> 826 T1204 oass.IndexSchema.readSchema Schema name=test
[junit4:junit4]   2> 1450 T1204 oass.OpenExchangeRatesOrgProvider.init Initialized with rates=open-exchange-rates.json, refreshInterval=1440.
[junit4:junit4]   2> 1461 T1204 oass.IndexSchema.readSchema default search field in schema is text
[junit4:junit4]   2> 1465 T1204 oass.IndexSchema.readSchema unique key field: id
[junit4:junit4]   2> 1485 T1204 oass.FileExchangeRateProvider.reload Reloading exchange rates from file currency.xml
[junit4:junit4]   2> 1490 T1204 oass.FileExchangeRateProvider.reload Reloading exchange rates from file currency.xml
[junit4:junit4]   2> 1495 T1204 oass.OpenExchangeRatesOrgProvider.reload Reloading exchange rates from open-exchange-rates.json
[junit4:junit4]   2> 1497 T1204 oass.OpenExchangeRatesOrgProvider.reload Reloading exchange rates from open-exchange-rates.json
[junit4:junit4]   2> 1498 T1204 oasc.SolrCore.<init> [collection1] Opening new SolrCore at /usr/home/hudson/hudson-slave/workspace/Lucene-Solr-Tests-4.x-Java6/solr/build/solr-core/test/J1/./org.apache.solr.cloud.SyncSliceTest-controljetty-1359834888366/collection1/, dataDir=./org.apache.solr.cloud.SyncSliceTest-1359834888038/control/data/
[junit4:junit4]   2> 1499 T1204 oasc.JmxMonitoredMap.<init> JMX monitoring is enabled. Adding Solr mbeans to JMX Server: com.sun.jmx.mbeanserver.JmxMBeanServer@b478a2d
[junit4:junit4]   2> 1499 T1204 oasc.SolrCore.initDirectoryFactory solr.NRTCachingDirectoryFactory
[junit4:junit4]   2> 1500 T1204 oasc.CachingDirectoryFactory.get return new directory for /usr/home/hudson/hudson-slave/workspace/Lucene-Solr-Tests-4.x-Java6/solr/build/solr-core/test/J1/./org.apache.solr.cloud.SyncSliceTest-1359834888038/control/data forceNew:false
[junit4:junit4]   2> 1501 T1204 oasc.CachingDirectoryFactory.close Releasing directory:/usr/home/hudson/hudson-slave/workspace/Lucene-Solr-Tests-4.x-Java6/solr/build/solr-core/test/J1/./org.apache.solr.cloud.SyncSliceTest-1359834888038/control/data
[junit4:junit4]   2> 1502 T1204 oasc.SolrCore.getNewIndexDir New index directory detected: old=null new=./org.apache.solr.cloud.SyncSliceTest-1359834888038/control/data/index/
[junit4:junit4]   2> 1503 T1204 oasc.SolrCore.initIndex WARNING [collection1] Solr index directory './org.apache.solr.cloud.SyncSliceTest-1359834888038/control/data/index' doesn't exist. Creating new index...
[junit4:junit4]   2> 1504 T1204 oasc.CachingDirectoryFactory.get return new directory for /usr/home/hudson/hudson-slave/workspace/Lucene-Solr-Tests-4.x-Java6/solr/build/solr-core/test/J1/./org.apache.solr.cloud.SyncSliceTest-1359834888038/control/data/index forceNew:false
[junit4:junit4]   2> 1528 T1204 oasc.SolrDeletionPolicy.onCommit SolrDeletionPolicy.onCommit: commits:num=1
[junit4:junit4]   2> 		commit{dir=RateLimitedDirectoryWrapper(NRTCachingDirectory(org.apache.lucene.store.NIOFSDirectory@/usr/home/hudson/hudson-slave/workspace/Lucene-Solr-Tests-4.x-Java6/solr/build/solr-core/test/J1/org.apache.solr.cloud.SyncSliceTest-1359834888038/control/data/index lockFactory=org.apache.lucene.store.NativeFSLockFactory@77624599; maxCacheMB=48.0 maxMergeSizeMB=4.0)),segFN=segments_1,generation=1,filenames=[segments_1]
[junit4:junit4]   2> 1529 T1204 oasc.SolrDeletionPolicy.updateCommits newest commit = 1[segments_1]
[junit4:junit4]   2> 1530 T1204 oasc.CachingDirectoryFactory.close Releasing directory:/usr/home/hudson/hudson-slave/workspace/Lucene-Solr-Tests-4.x-Java6/solr/build/solr-core/test/J1/./org.apache.solr.cloud.SyncSliceTest-1359834888038/control/data/index
[junit4:junit4]   2> 1530 T1204 oasc.SolrCore.initWriters created xml: solr.XMLResponseWriter
[junit4:junit4]   2> 1532 T1204 oasup.UpdateRequestProcessorChain.init inserting DistributedUpdateProcessorFactory into updateRequestProcessorChain "dedupe"
[junit4:junit4]   2> 1532 T1204 oasup.UpdateRequestProcessorChain.init inserting DistributedUpdateProcessorFactory into updateRequestProcessorChain "dedupe-allfields"
[junit4:junit4]   2> 1533 T1204 oasup.UpdateRequestProcessorChain.init inserting DistributedUpdateProcessorFactory into updateRequestProcessorChain "stored_sig"
[junit4:junit4]   2> 1533 T1204 oasup.UpdateRequestProcessorChain.init inserting DistributedUpdateProcessorFactory into updateRequestProcessorChain "uniq-fields"
[junit4:junit4]   2> 1534 T1204 oasup.UpdateRequestProcessorChain.init inserting DistributedUpdateProcessorFactory into updateRequestProcessorChain "distrib-dup-test-chain-implicit"
[junit4:junit4]   2> 1534 T1204 oasc.RequestHandlers.initHandlersFromConfig adding lazy requestHandler: solr.ReplicationHandler
[junit4:junit4]   2> 1534 T1204 oasc.RequestHandlers.initHandlersFromConfig created /replication: solr.ReplicationHandler
[junit4:junit4]   2> 1535 T1204 oasc.RequestHandlers.initHandlersFromConfig created standard: solr.StandardRequestHandler
[junit4:junit4]   2> 1535 T1204 oasc.RequestHandlers.initHandlersFromConfig created /get: solr.RealTimeGetHandler
[junit4:junit4]   2> 1536 T1204 oasc.RequestHandlers.initHandlersFromConfig created dismax: solr.SearchHandler
[junit4:junit4]   2> 1537 T1204 oasc.RequestHandlers.initHandlersFromConfig created mock: org.apache.solr.core.MockQuerySenderListenerReqHandler
[junit4:junit4]   2> 1537 T1204 oasc.RequestHandlers.initHandlersFromConfig created /admin/: org.apache.solr.handler.admin.AdminHandlers
[junit4:junit4]   2> 1537 T1204 oasc.RequestHandlers.initHandlersFromConfig created defaults: solr.StandardRequestHandler
[junit4:junit4]   2> 1538 T1204 oasc.RequestHandlers.initHandlersFromConfig adding lazy requestHandler: solr.StandardRequestHandler
[junit4:junit4]   2> 1538 T1204 oasc.RequestHandlers.initHandlersFromConfig created lazy: solr.StandardRequestHandler
[junit4:junit4]   2> 1539 T1204 oasc.RequestHandlers.initHandlersFromConfig created /update: solr.UpdateRequestHandler
[junit4:junit4]   2> 1539 T1204 oasc.RequestHandlers.initHandlersFromConfig created /terms: org.apache.solr.handler.component.SearchHandler
[junit4:junit4]   2> 1540 T1204 oasc.RequestHandlers.initHandlersFromConfig created spellCheckCompRH: org.apache.solr.handler.component.SearchHandler
[junit4:junit4]   2> 1540 T1204 oasc.RequestHandlers.initHandlersFromConfig created spellCheckCompRH_Direct: org.apache.solr.handler.component.SearchHandler
[junit4:junit4]   2> 1541 T1204 oasc.RequestHandlers.initHandlersFromConfig created spellCheckWithWordbreak: org.apache.solr.handler.component.SearchHandler
[junit4:junit4]   2> 1541 T1204 oasc.RequestHandlers.initHandlersFromConfig created spellCheckWithWordbreak_Direct: org.apache.solr.handler.component.SearchHandler
[junit4:junit4]   2> 1542 T1204 oasc.RequestHandlers.initHandlersFromConfig created spellCheckCompRH1: org.apache.solr.handler.component.SearchHandler
[junit4:junit4]   2> 1542 T1204 oasc.RequestHandlers.initHandlersFromConfig created mltrh: org.apache.solr.handler.component.SearchHandler
[junit4:junit4]   2> 1543 T1204 oasc.RequestHandlers.initHandlersFromConfig created tvrh: org.apache.solr.handler.component.SearchHandler
[junit4:junit4]   2> 1543 T1204 oasc.RequestHandlers.initHandlersFromConfig created /mlt: solr.MoreLikeThisHandler
[junit4:junit4]   2> 1544 T1204 oasc.RequestHandlers.initHandlersFromConfig created /debug/dump: solr.DumpRequestHandler
[junit4:junit4]   2> 1551 T1204 oashl.XMLLoader.init xsltCacheLifetimeSeconds=60
[junit4:junit4]   2> 1556 T1204 oasc.SolrCore.initDeprecatedSupport WARNING solrconfig.xml uses deprecated <admin/gettableFiles>, Please update your config to use the ShowFileRequestHandler.
[junit4:junit4]   2> 1558 T1204 oasc.SolrCore.initDeprecatedSupport WARNING adding ShowFileRequestHandler with hidden files: [SCHEMA.XML, OLD_SYNONYMS.TXT, STOPWORDS.TXT, PROTWORDS.TXT, OPEN-EXCHANGE-RATES.JSON, SYNONYMS.TXT, CURRENCY.XML, MAPPING-ISOLATIN1ACCENT.TXT]
[junit4:junit4]   2> 1560 T1204 oasc.CachingDirectoryFactory.close Releasing directory:/usr/home/hudson/hudson-slave/workspace/Lucene-Solr-Tests-4.x-Java6/solr/build/solr-core/test/J1/./org.apache.solr.cloud.SyncSliceTest-1359834888038/control/data
[junit4:junit4]   2> 1562 T1204 oass.SolrIndexSearcher.<init> Opening Searcher@269b96ed main
[junit4:junit4]   2> 1563 T1204 oasu.CommitTracker.<init> Hard AutoCommit: disabled
[junit4:junit4]   2> 1564 T1204 oasu.CommitTracker.<init> Soft AutoCommit: disabled
[junit4:junit4]   2> 1564 T1204 oashc.SpellCheckComponent.inform Initializing spell checkers
[junit4:junit4]   2> 1571 T1204 oass.DirectSolrSpellChecker.init init: {name=direct,classname=DirectSolrSpellChecker,field=lowerfilt,minQueryLength=3}
[junit4:junit4]   2> 1631 T1205 oasc.SolrCore.registerSearcher [collection1] Registered new searcher Searcher@269b96ed main{StandardDirectoryReader(segments_1:1)}
[junit4:junit4]   2> 1637 T1204 oasc.ZkController.publish publishing core=collection1 state=down
[junit4:junit4]   2> 1637 T1204 oasc.ZkController.publish numShards not found on descriptor - reading it from system property
[junit4:junit4]   2> 1638 T1184 oazs.PrepRequestProcessor.pRequest Got user-level KeeperException when processing sessionid:0x13c9c79b76a0003 type:create cxid:0x50 zxid:0x29 txntype:-1 reqpath:n/a Error Path:/solr/overseer/queue Error:KeeperErrorCode = NoNode for /solr/overseer/queue
[junit4:junit4]   2> 2092 T1202 oascc.ZkStateReader.updateClusterState Updating cloud state from ZooKeeper... 
[junit4:junit4]   2> 2093 T1202 oasc.Overseer$ClusterStateUpdater.updateState Update state numShards=1 message={
[junit4:junit4]   2> 	  "operation":"state",
[junit4:junit4]   2> 	  "numShards":"1",
[junit4:junit4]   2> 	  "shard":null,
[junit4:junit4]   2> 	  "roles":null,
[junit4:junit4]   2> 	  "state":"down",
[junit4:junit4]   2> 	  "core":"collection1",
[junit4:junit4]   2> 	  "collection":"control_collection",
[junit4:junit4]   2> 	  "node_name":"127.0.0.1:37192_i_d%2Fql",
[junit4:junit4]   2> 	  "base_url":"http://127.0.0.1:37192/i_d/ql"}
[junit4:junit4]   2> 2093 T1202 oasc.Overseer$ClusterStateUpdater.createCollection Create collection control_collection with numShards 1
[junit4:junit4]   2> 2093 T1202 oasc.Overseer$ClusterStateUpdater.updateState Assigning new node to shard shard=shard1
[junit4:junit4]   2> 2093 T1184 oazs.PrepRequestProcessor.pRequest Got user-level KeeperException when processing sessionid:0x13c9c79b76a0003 type:create cxid:0x58 zxid:0x2c txntype:-1 reqpath:n/a Error Path:/solr/overseer/queue-work Error:KeeperErrorCode = NoNode for /solr/overseer/queue-work
[junit4:junit4]   2> 2125 T1201 oascc.ZkStateReader$2.process A cluster state change: WatchedEvent state:SyncConnected type:NodeDataChanged path:/clusterstate.json, has occurred - updating... (live nodes size: 1)
[junit4:junit4]   2> 2652 T1204 oasc.CoreContainer.registerCore registering core: collection1
[junit4:junit4]   2> 2652 T1204 oasc.ZkController.register Register replica - core:collection1 address:http://127.0.0.1:37192/i_d/ql collection:control_collection shard:shard1
[junit4:junit4]   2> 2653 T1204 oascc.SolrZkClient.makePath makePath: /collections/control_collection/leader_elect/shard1/election
[junit4:junit4]   2> 2670 T1184 oazs.PrepRequestProcessor.pRequest Got user-level KeeperException when processing sessionid:0x13c9c79b76a0003 type:delete cxid:0x72 zxid:0x36 txntype:-1 reqpath:n/a Error Path:/solr/collections/control_collection/leaders Error:KeeperErrorCode = NoNode for /solr/collections/control_collection/leaders
[junit4:junit4]   2> 2671 T1204 oasc.ShardLeaderElectionContext.runLeaderProcess Running the leader process.
[junit4:junit4]   2> 2672 T1184 oazs.PrepRequestProcessor.pRequest Got user-level KeeperException when processing sessionid:0x13c9c79b76a0003 type:create cxid:0x73 zxid:0x37 txntype:-1 reqpath:n/a Error Path:/solr/overseer Error:KeeperErrorCode = NodeExists for /solr/overseer
[junit4:junit4]   2> 2681 T1204 oasc.ShardLeaderElectionContext.waitForReplicasToComeUp Enough replicas found to continue.
[junit4:junit4]   2> 2681 T1204 oasc.ShardLeaderElectionContext.runLeaderProcess I may be the new leader - try and sync
[junit4:junit4]   2> 2681 T1204 oasc.SyncStrategy.sync Sync replicas to http://127.0.0.1:37192/i_d/ql/collection1/
[junit4:junit4]   2> 2681 T1204 oasc.SyncStrategy.syncReplicas Sync Success - now sync replicas to me
[junit4:junit4]   2> 2681 T1204 oasc.SyncStrategy.syncToMe http://127.0.0.1:37192/i_d/ql/collection1/ has no replicas
[junit4:junit4]   2> 2682 T1204 oasc.ShardLeaderElectionContext.runLeaderProcess I am the new leader: http://127.0.0.1:37192/i_d/ql/collection1/
[junit4:junit4]   2> 2682 T1204 oascc.SolrZkClient.makePath makePath: /collections/control_collection/leaders/shard1
[junit4:junit4]   2> 2687 T1184 oazs.PrepRequestProcessor.pRequest Got user-level KeeperException when processing sessionid:0x13c9c79b76a0003 type:create cxid:0x7d zxid:0x3b txntype:-1 reqpath:n/a Error Path:/solr/overseer Error:KeeperErrorCode = NodeExists for /solr/overseer
[junit4:junit4]   2> 3636 T1202 oascc.ZkStateReader.updateClusterState Updating cloud state from ZooKeeper... 
[junit4:junit4]   2> 3655 T1201 oascc.ZkStateReader$2.process A cluster state change: WatchedEvent state:SyncConnected type:NodeDataChanged path:/clusterstate.json, has occurred - updating... (live nodes size: 1)
[junit4:junit4]   2> 3666 T1204 oasc.ZkController.register We are http://127.0.0.1:37192/i_d/ql/collection1/ and leader is http://127.0.0.1:37192/i_d/ql/collection1/
[junit4:junit4]   2> 3666 T1204 oasc.ZkController.register No LogReplay needed for core=collection1 baseURL=http://127.0.0.1:37192/i_d/ql
[junit4:junit4]   2> 3666 T1204 oasc.ZkController.checkRecovery I am the leader, no recovery necessary
[junit4:junit4]   2> 3666 T1204 oasc.ZkController.publish publishing core=collection1 state=active
[junit4:junit4]   2> 3666 T1204 oasc.ZkController.publish numShards not found on descriptor - reading it from system property
[junit4:junit4]   2> 3669 T1204 oascc.ZkStateReader.updateClusterState Updating cloud state from ZooKeeper... 
[junit4:junit4]   2> 3670 T1179 oass.SolrDispatchFilter.init user.dir=/usr/home/hudson/hudson-slave/workspace/Lucene-Solr-Tests-4.x-Java6/solr/build/solr-core/test/J1
[junit4:junit4]   2> 3671 T1179 oass.SolrDispatchFilter.init SolrDispatchFilter.init() done
[junit4:junit4]   2> 3672 T1179 oascsi.HttpClientUtil.createClient Creating new http client, config:maxConnections=128&maxConnectionsPerHost=32&followRedirects=false
[junit4:junit4]   2> 3686 T1179 oascsi.HttpClientUtil.createClient Creating new http client, config:
[junit4:junit4]   2> 3696 T1179 oaz.ZooKeeper.<init> Initiating client connection, connectString=127.0.0.1:37189/solr sessionTimeout=10000 watcher=org.apache.solr.common.cloud.ConnectionManager@3884b421
[junit4:junit4]   2> 3697 T1179 oascc.ConnectionManager.waitForConnected Waiting for client to connect to ZooKeeper
[junit4:junit4]   2> 3697 T1206 oaz.ClientCnxn$SendThread.logStartConnect Opening socket connection to server localhost/127.0.0.1:37189. Will not attempt to authenticate using SASL (access denied (javax.security.auth.AuthPermission getLoginConfiguration))
[junit4:junit4]   2> 3698 T1206 oaz.ClientCnxn$SendThread.primeConnection Socket connection established to localhost/127.0.0.1:37189, initiating session
[junit4:junit4]   2> 3698 T1181 oazs.NIOServerCnxnFactory.run Accepted socket connection from /140.211.11.196:37197
[junit4:junit4]   2> 3699 T1181 oazs.ZooKeeperServer.processConnectRequest Client attempting to establish new session at /140.211.11.196:37197
[junit4:junit4]   2> 3700 T1183 oazs.ZooKeeperServer.finishSessionInit Established session 0x13c9c79b76a0004 with negotiated timeout 10000 for client /140.211.11.196:37197
[junit4:junit4]   2> 3700 T1206 oaz.ClientCnxn$SendThread.onConnected Session establishment complete on server localhost/127.0.0.1:37189, sessionid = 0x13c9c79b76a0004, negotiated timeout = 10000
[junit4:junit4]   2> 3701 T1207 oascc.ConnectionManager.process Watcher org.apache.solr.common.cloud.ConnectionManager@3884b421 name:ZooKeeperConnection Watcher:127.0.0.1:37189/solr got event WatchedEvent state:SyncConnected type:None path:null path:null type:None
[junit4:junit4]   2> 3701 T1179 oascc.ConnectionManager.waitForConnected Client is connected to ZooKeeper
[junit4:junit4]   2> 3703 T1179 oascc.ZkStateReader.createClusterStateWatchersAndUpdate Updating cluster state from ZooKeeper... 
[junit4:junit4]   2> 3705 T1179 oasc.ChaosMonkey.monkeyLog monkey: init - expire sessions:true cause connection loss:true
[junit4:junit4]   2> 3869 T1179 oejs.Server.doStart jetty-8.1.8.v20121106
[junit4:junit4]   2> 3871 T1179 oejs.AbstractConnector.doStart Started SocketConnector@127.0.0.1:37198
[junit4:junit4]   2> 3872 T1179 oass.SolrDispatchFilter.init SolrDispatchFilter.init()
[junit4:junit4]   2> 3873 T1179 oasc.SolrResourceLoader.locateSolrHome JNDI not configured for solr (NoInitialContextEx)
[junit4:junit4]   2> 3873 T1179 oasc.SolrResourceLoader.locateSolrHome using system property solr.solr.home: /usr/home/hudson/hudson-slave/workspace/Lucene-Solr-Tests-4.x-Java6/solr/build/solr-core/test/J1/./org.apache.solr.cloud.SyncSliceTest-jetty1-1359834891739
[junit4:junit4]   2> 3873 T1179 oasc.CoreContainer$Initializer.initialize looking for solr.xml: /usr/home/hudson/hudson-slave/workspace/Lucene-Solr-Tests-4.x-Java6/solr/build/solr-core/test/J1/./org.apache.solr.cloud.SyncSliceTest-jetty1-1359834891739/solr.xml
[junit4:junit4]   2> 3874 T1179 oasc.CoreContainer.<init> New CoreContainer 1423504207
[junit4:junit4]   2> 3875 T1179 oasc.CoreContainer.load Loading CoreContainer using Solr Home: '/usr/home/hudson/hudson-slave/workspace/Lucene-Solr-Tests-4.x-Java6/solr/build/solr-core/test/J1/./org.apache.solr.cloud.SyncSliceTest-jetty1-1359834891739/'
[junit4:junit4]   2> 3875 T1179 oasc.SolrResourceLoader.<init> new SolrResourceLoader for directory: '/usr/home/hudson/hudson-slave/workspace/Lucene-Solr-Tests-4.x-Java6/solr/build/solr-core/test/J1/./org.apache.solr.cloud.SyncSliceTest-jetty1-1359834891739/'
[junit4:junit4]   2> 3919 T1179 oashc.HttpShardHandlerFactory.getParameter Setting socketTimeout to: 60000
[junit4:junit4]   2> 3920 T1179 oashc.HttpShardHandlerFactory.getParameter Setting urlScheme to: http://
[junit4:junit4]   2> 3920 T1179 oashc.HttpShardHandlerFactory.getParameter Setting connTimeout to: 15000
[junit4:junit4]   2> 3920 T1179 oashc.HttpShardHandlerFactory.getParameter Setting maxConnectionsPerHost to: 20
[junit4:junit4]   2> 3921 T1179 oashc.HttpShardHandlerFactory.getParameter Setting corePoolSize to: 0
[junit4:junit4]   2> 3921 T1179 oashc.HttpShardHandlerFactory.getParameter Setting maximumPoolSize to: 2147483647
[junit4:junit4]   2> 3922 T1179 oashc.HttpShardHandlerFactory.getParameter Setting maxThreadIdleTime to: 5
[junit4:junit4]   2> 3922 T1179 oashc.HttpShardHandlerFactory.getParameter Setting sizeOfQueue to: -1
[junit4:junit4]   2> 3923 T1179 oashc.HttpShardHandlerFactory.getParameter Setting fairnessPolicy to: false
[junit4:junit4]   2> 3923 T1179 oascsi.HttpClientUtil.createClient Creating new http client, config:maxConnectionsPerHost=20&maxConnections=10000&socketTimeout=60000&connTimeout=15000&retry=false
[junit4:junit4]   2> 3943 T1179 oasc.CoreContainer.load Registering Log Listener
[junit4:junit4]   2> 3962 T1179 oasc.CoreContainer.initZooKeeper Zookeeper client=127.0.0.1:37189/solr
[junit4:junit4]   2> 3963 T1179 oasc.ZkController.checkChrootPath zkHost includes chroot
[junit4:junit4]   2> 3963 T1179 oaz.ZooKeeper.<init> Initiating client connection, connectString=127.0.0.1:37189 sessionTimeout=60000 watcher=org.apache.solr.common.cloud.ConnectionManager@66901391
[junit4:junit4]   2> 3964 T1179 oascc.ConnectionManager.waitForConnected Waiting for client to connect to ZooKeeper
[junit4:junit4]   2> 3965 T1217 oaz.ClientCnxn$SendThread.logStartConnect Opening socket connection to server localhost/127.0.0.1:37189. Will not attempt to authenticate using SASL (access denied (javax.security.auth.AuthPermission getLoginConfiguration))
[junit4:junit4]   2> 3965 T1217 oaz.ClientCnxn$SendThread.primeConnection Socket connection established to localhost/127.0.0.1:37189, initiating session
[junit4:junit4]   2> 3966 T1181 oazs.NIOServerCnxnFactory.run Accepted socket connection from /140.211.11.196:37199
[junit4:junit4]   2> 3966 T1181 oazs.ZooKeeperServer.processConnectRequest Client attempting to establish new session at /140.211.11.196:37199
[junit4:junit4]   2> 3967 T1183 oazs.ZooKeeperServer.finishSessionInit Established session 0x13c9c79b76a0005 with negotiated timeout 20000 for client /140.211.11.196:37199
[junit4:junit4]   2> 3968 T1217 oaz.ClientCnxn$SendThread.onConnected Session establishment complete on server localhost/127.0.0.1:37189, sessionid = 0x13c9c79b76a0005, negotiated timeout = 20000
[junit4:junit4]   2> 3968 T1218 oascc.ConnectionManager.process Watcher org.apache.solr.common.cloud.ConnectionManager@66901391 name:ZooKeeperConnection Watcher:127.0.0.1:37189 got event WatchedEvent state:SyncConnected type:None path:null path:null type:None
[junit4:junit4]   2> 3968 T1179 oascc.ConnectionManager.waitForConnected Client is connected to ZooKeeper
[junit4:junit4]   2> 3970 T1184 oazs.PrepRequestProcessor.pRequest2Txn Processed session termination for sessionid: 0x13c9c79b76a0005
[junit4:junit4]   2> 3971 T1218 oaz.ClientCnxn$EventThread.run EventThread shut down
[junit4:junit4]   2> 3971 T1181 oazs.NIOServerCnxn.closeSock Closed socket connection for client /140.211.11.196:37199 which had sessionid 0x13c9c79b76a0005
[junit4:junit4]   2> 3971 T1179 oaz.ZooKeeper.close Session: 0x13c9c79b76a0005 closed
[junit4:junit4]   2> 3972 T1179 oascsi.HttpClientUtil.createClient Creating new http client, config:maxConnections=500&maxConnectionsPerHost=16&socketTimeout=60000&connTimeout=15000
[junit4:junit4]   2> 3983 T1179 oaz.ZooKeeper.<init> Initiating client connection, connectString=127.0.0.1:37189/solr sessionTimeout=30000 watcher=org.apache.solr.common.cloud.ConnectionManager@5775b96e
[junit4:junit4]   2> 3984 T1179 oascc.ConnectionManager.waitForConnected Waiting for client to connect to ZooKeeper
[junit4:junit4]   2> 3984 T1219 oaz.ClientCnxn$SendThread.logStartConnect Opening socket connection to server localhost/127.0.0.1:37189. Will not attempt to authenticate using SASL (access denied (javax.security.auth.AuthPermission getLoginConfiguration))
[junit4:junit4]   2> 3985 T1219 oaz.ClientCnxn$SendThread.primeConnection Socket connection established to localhost/127.0.0.1:37189, initiating session
[junit4:junit4]   2> 3985 T1181 oazs.NIOServerCnxnFactory.run Accepted socket connection from /140.211.11.196:37200
[junit4:junit4]   2> 3985 T1181 oazs.ZooKeeperServer.processConnectRequest Client attempting to establish new session at /140.211.11.196:37200
[junit4:junit4]   2> 3987 T1183 oazs.ZooKeeperServer.finishSessionInit Established session 0x13c9c79b76a0006 with negotiated timeout 20000 for client /140.211.11.196:37200
[junit4:junit4]   2> 3987 T1219 oaz.ClientCnxn$SendThread.onConnected Session establishment complete on server localhost/127.0.0.1:37189, sessionid = 0x13c9c79b76a0006, negotiated timeout = 20000
[junit4:junit4]   2> 3987 T1220 oascc.ConnectionManager.process Watcher org.apache.solr.common.cloud.ConnectionManager@5775b96e name:ZooKeeperConnection Watcher:127.0.0.1:37189/solr got event WatchedEvent state:SyncConnected type:None path:null path:null type:None
[junit4:junit4]   2> 3987 T1179 oascc.ConnectionManager.waitForConnected Client is connected to ZooKeeper
[junit4:junit4]   2> 3989 T1184 oazs.PrepRequestProcessor.pRequest Got user-level KeeperException when processing sessionid:0x13c9c79b76a0006 type:create cxid:0x1 zxid:0x49 txntype:-1 reqpath:n/a Error Path:/solr/overseer Error:KeeperErrorCode = NodeExists for /solr/overseer
[junit4:junit4]   2> 3990 T1184 oazs.PrepRequestProcessor.pRequest Got user-level KeeperException when processing sessionid:0x13c9c79b76a0006 type:create cxid:0x2 zxid:0x4a txntype:-1 reqpath:n/a Error Path:/solr/overseer Error:KeeperErrorCode = NodeExists for /solr/overseer
[junit4:junit4]   2> 3998 T1179 oasc.ZkController.createEphemeralLiveNode Register node as live in ZooKeeper:/live_nodes/127.0.0.1:37198_i_d%2Fql
[junit4:junit4]   2> 3999 T1184 oazs.PrepRequestProcessor.pRequest Got user-level KeeperException when processing sessionid:0x13c9c79b76a0006 type:delete cxid:0x4 zxid:0x4b txntype:-1 reqpath:n/a Error Path:/solr/live_nodes/127.0.0.1:37198_i_d%2Fql Error:KeeperErrorCode = NoNode for /solr/live_nodes/127.0.0.1:37198_i_d%2Fql
[junit4:junit4]   2> 4000 T1179 oascc.SolrZkClient.makePath makePath: /live_nodes/127.0.0.1:37198_i_d%2Fql
[junit4:junit4]   2> 4005 T1207 oascc.ZkStateReader$3.process Updating live nodes... (2)
[junit4:junit4]   2> 4005 T1201 oascc.ZkStateReader$3.process Updating live nodes... (2)
[junit4:junit4]   2> 4005 T1201 oascc.ZkStateReader$2.process A cluster state change: WatchedEvent state:SyncConnected type:NodeChildrenChanged path:/live_nodes, has occurred - updating... (live nodes size: 2)
[junit4:junit4]   2> 4009 T1179 oascc.ZkStateReader.createClusterStateWatchersAndUpdate Updating cluster state from ZooKeeper... 
[junit4:junit4]   2> 4017 T1221 oasc.CoreContainer.create Creating SolrCore 'collection1' using instanceDir: /usr/home/hudson/hudson-slave/workspace/Lucene-Solr-Tests-4.x-Java6/solr/build/solr-core/test/J1/./org.apache.solr.cloud.SyncSliceTest-jetty1-1359834891739/collection1
[junit4:junit4]   2> 4017 T1221 oasc.ZkController.createCollectionZkNode Check for collection zkNode:collection1
[junit4:junit4]   2> 4018 T1221 oasc.ZkController.createCollectionZkNode Collection zkNode exists
[junit4:junit4]   2> 4018 T1221 oasc.ZkController.readConfigName Load collection config from:/collections/collection1
[junit4:junit4]   2> 4020 T1221 oasc.SolrResourceLoader.<init> new SolrResourceLoader for directory: '/usr/home/hudson/hudson-slave/workspace/Lucene-Solr-Tests-4.x-Java6/solr/build/solr-core/test/J1/./org.apache.solr.cloud.SyncSliceTest-jetty1-1359834891739/collection1/'
[junit4:junit4]   2> 4021 T1221 oasc.SolrResourceLoader.replaceClassLoader Adding 'file:/usr/home/hudson/hudson-slave/workspace/Lucene-Solr-Tests-4.x-Java6/solr/build/solr-core/test/J1/org.apache.solr.cloud.SyncSliceTest-jetty1-1359834891739/collection1/lib/README' to classloader
[junit4:junit4]   2> 4022 T1221 oasc.SolrResourceLoader.replaceClassLoader Adding 'file:/usr/home/hudson/hudson-slave/workspace/Lucene-Solr-Tests-4.x-Java6/solr/build/solr-core/test/J1/org.apache.solr.cloud.SyncSliceTest-jetty1-1359834891739/collection1/lib/classes/' to classloader
[junit4:junit4]   2> 4075 T1221 oasc.SolrConfig.<init> Using Lucene MatchVersion: LUCENE_42
[junit4:junit4]   2> 4146 T1221 oasc.SolrConfig.<init> Loaded SolrConfig: solrconfig.xml
[junit4:junit4]   2> 4247 T1221 oass.IndexSchema.readSchema Reading Solr Schema
[junit4:junit4]   2> 4253 T1221 oass.IndexSchema.readSchema Schema name=test
[junit4:junit4]   2> 4879 T1221 oass.OpenExchangeRatesOrgProvider.init Initialized with rates=open-exchange-rates.json, refreshInterval=1440.
[junit4:junit4]   2> 4890 T1221 oass.IndexSchema.readSchema default search field in schema is text
[junit4:junit4]   2> 4895 T1221 oass.IndexSchema.readSchema unique key field: id
[junit4:junit4]   2> 4913 T1221 oass.FileExchangeRateProvider.reload Reloading exchange rates from file currency.xml
[junit4:junit4]   2> 4918 T1221 oass.FileExchangeRateProvider.reload Reloading exchange rates from file currency.xml
[junit4:junit4]   2> 4923 T1221 oass.OpenExchangeRatesOrgProvider.reload Reloading exchange rates from open-exchange-rates.json
[junit4:junit4]   2> 4925 T1221 oass.OpenExchangeRatesOrgProvider.reload Reloading exchange rates from open-exchange-rates.json
[junit4:junit4]   2> 4926 T1221 oasc.SolrCore.<init> [collection1] Opening new SolrCore at /usr/home/hudson/hudson-slave/workspace/Lucene-Solr-Tests-4.x-Java6/solr/build/solr-core/test/J1/./org.apache.solr.cloud.SyncSliceTest-jetty1-1359834891739/collection1/, dataDir=./org.apache.solr.cloud.SyncSliceTest-1359834888038/jetty1/
[junit4:junit4]   2> 4927 T1221 oasc.JmxMonitoredMap.<init> JMX monitoring is enabled. Adding Solr mbeans to JMX Server: com.sun.jmx.mbeanserver.JmxMBeanServer@b478a2d
[junit4:junit4]   2> 4927 T1221 oasc.SolrCore.initDirectoryFactory solr.NRTCachingDirectoryFactory
[junit4:junit4]   2> 4928 T1221 oasc.CachingDirectoryFactory.get return new directory for /usr/home/hudson/hudson-slave/workspace/Lucene-Solr-Tests-4.x-Java6/solr/build/solr-core/test/J1/./org.apache.solr.cloud.SyncSliceTest-1359834888038/jetty1 forceNew:false
[junit4:junit4]   2> 4929 T1221 oasc.CachingDirectoryFactory.close Releasing directory:/usr/home/hudson/hudson-slave/workspace/Lucene-Solr-Tests-4.x-Java6/solr/build/solr-core/test/J1/./org.apache.solr.cloud.SyncSliceTest-1359834888038/jetty1
[junit4:junit4]   2> 4929 T1221 oasc.SolrCore.getNewIndexDir New index directory detected: old=null new=./org.apache.solr.cloud.SyncSliceTest-1359834888038/jetty1/index/
[junit4:junit4]   2> 4930 T1221 oasc.SolrCore.initIndex WARNING [collection1] Solr index directory './org.apache.solr.cloud.SyncSliceTest-1359834888038/jetty1/index' doesn't exist. Creating new index...
[junit4:junit4]   2> 4931 T1221 oasc.CachingDirectoryFactory.get return new directory for /usr/home/hudson/hudson-slave/workspace/Lucene-Solr-Tests-4.x-Java6/solr/build/solr-core/test/J1/./org.apache.solr.cloud.SyncSliceTest-1359834888038/jetty1/index forceNew:false
[junit4:junit4]   2> 4969 T1221 oasc.SolrDeletionPolicy.onCommit SolrDeletionPolicy.onCommit: commits:num=1
[junit4:junit4]   2> 		commit{dir=RateLimitedDirectoryWrapper(NRTCachingDirectory(org.apache.lucene.store.NIOFSDirectory@/usr/home/hudson/hudson-slave/workspace/Lucene-Solr-Tests-4.x-Java6/solr/build/solr-core/test/J1/org.apache.solr.cloud.SyncSliceTest-1359834888038/jetty1/index lockFactory=org.apache.lucene.store.NativeFSLockFactory@628c5fdf; maxCacheMB=48.0 maxMergeSizeMB=4.0)),segFN=segments_1,generation=1,filenames=[segments_1]
[junit4:junit4]   2> 4969 T1221 oasc.SolrDeletionPolicy.updateCommits newest commit = 1[segments_1]
[junit4:junit4]   2> 4970 T1221 oasc.CachingDirectoryFactory.close Releasing directory:/usr/home/hudson/hudson-slave/workspace/Lucene-Solr-Tests-4.x-Java6/solr/build/solr-core/test/J1/./org.apache.solr.cloud.SyncSliceTest-1359834888038/jetty1/index
[junit4:junit4]   2> 4970 T1221 oasc.SolrCore.initWriters created xml: solr.XMLResponseWriter
[junit4:junit4]   2> 4972 T1221 oasup.UpdateRequestProcessorChain.init inserting DistributedUpdateProcessorFactory into updateRequestProcessorChain "dedupe"
[junit4:junit4]   2> 4973 T1221 oasup.UpdateRequestProcessorChain.init inserting DistributedUpdateProcessorFactory into updateRequestProcessorChain "dedupe-allfields"
[junit4:junit4]   2> 4973 T1221 oasup.UpdateRequestProcessorChain.init inserting DistributedUpdateProcessorFactory into updateRequestProcessorChain "stored_sig"
[junit4:junit4]   2> 4973 T1221 oasup.UpdateRequestProcessorChain.init inserting DistributedUpdateProcessorFactory into updateRequestProcessorChain "uniq-fields"
[junit4:junit4]   2> 4974 T1221 oasup.UpdateRequestProcessorChain.init inserting DistributedUpdateProcessorFactory into updateRequestProcessorChain "distrib-dup-test-chain-implicit"
[junit4:junit4]   2> 4974 T1221 oasc.RequestHandlers.initHandlersFromConfig adding lazy requestHandler: solr.ReplicationHandler
[junit4:junit4]   2> 4975 T1221 oasc.RequestHandlers.initHandlersFromConfig created /replication: solr.ReplicationHandler
[junit4:junit4]   2> 4975 T1221 oasc.RequestHandlers.initHandlersFromConfig created standard: solr.StandardRequestHandler
[junit4:junit4]   2> 4976 T1221 oasc.RequestHandlers.initHandlersFromConfig created /get: solr.RealTimeGetHandler
[junit4:junit4]   2> 4976 T1221 oasc.RequestHandlers.initHandlersFromConfig created dismax: solr.SearchHandler
[junit4:junit4]   2> 4977 T1221 oasc.RequestHandlers.initHandlersFromConfig created mock: org.apache.solr.core.MockQuerySenderListenerReqHandler
[junit4:junit4]   2> 4977 T1221 oasc.RequestHandlers.initHandlersFromConfig created /admin/: org.apache.solr.handler.admin.AdminHandlers
[junit4:junit4]   2> 4978 T1221 oasc.RequestHandlers.initHandlersFromConfig created defaults: solr.StandardRequestHandler
[junit4:junit4]   2> 4978 T1221 oasc.RequestHandlers.initHandlersFromConfig adding lazy requestHandler: solr.StandardRequestHandler
[junit4:junit4]   2> 4979 T1221 oasc.RequestHandlers.initHandlersFromConfig created lazy: solr.StandardRequestHandler
[junit4:junit4]   2> 4979 T1221 oasc.RequestHandlers.initHandlersFromConfig created /update: solr.UpdateRequestHandler
[junit4:junit4]   2> 4980 T1221 oasc.RequestHandlers.initHandlersFromConfig created /terms: org.apache.solr.handler.component.SearchHandler
[junit4:junit4]   2> 4980 T1221 oasc.RequestHandlers.initHandlersFromConfig created spellCheckCompRH: org.apache.solr.handler.component.SearchHandler
[junit4:junit4]   2> 4981 T1221 oasc.RequestHandlers.initHandlersFromConfig created spellCheckCompRH_Direct: org.apache.solr.handler.component.SearchHandler
[junit4:junit4]   2> 4981 T1221 oasc.RequestHandlers.initHandlersFromConfig created spellCheckWithWordbreak: org.apache.solr.handler.component.SearchHandler
[junit4:junit4]   2> 4982 T1221 oasc.RequestHandlers.initHandlersFromConfig created spellCheckWithWordbreak_Direct: org.apache.solr.handler.component.SearchHandler
[junit4:junit4]   2> 4982 T1221 oasc.RequestHandlers.initHandlersFromConfig created spellCheckCompRH1: org.apache.solr.handler.component.SearchHandler
[junit4:junit4]   2> 4983 T1221 oasc.RequestHandlers.initHandlersFromConfig created mltrh: org.apache.solr.handler.component.SearchHandler
[junit4:junit4]   2> 4983 T1221 oasc.RequestHandlers.initHandlersFromConfig created tvrh: org.apache.solr.handler.component.SearchHandler
[junit4:junit4]   2> 4984 T1221 oasc.RequestHandlers.initHandlersFromConfig created /mlt: solr.MoreLikeThisHandler
[junit4:junit4]   2> 4984 T1221 oasc.RequestHandlers.initHandlersFromConfig created /debug/dump: solr.DumpRequestHandler
[junit4:junit4]   2> 4992 T1221 oashl.XMLLoader.init xsltCacheLifetimeSeconds=60
[junit4:junit4]   2> 4996 T1221 oasc.SolrCore.initDeprecatedSupport WARNING solrconfig.xml uses deprecated <admin/gettableFiles>, Please update your config to use the ShowFileRequestHandler.
[junit4:junit4]   2> 4998 T1221 oasc.SolrCore.initDeprecatedSupport WARNING adding ShowFileRequestHandler with hidden files: [SCHEMA.XML, OLD_SYNONYMS.TXT, STOPWORDS.TXT, PROTWORDS.TXT, OPEN-EXCHANGE-RATES.JSON, SYNONYMS.TXT, CURRENCY.XML, MAPPING-ISOLATIN1ACCENT.TXT]
[junit4:junit4]   2> 5000 T1221 oasc.CachingDirectoryFactory.close Releasing directory:/usr/home/hudson/hudson-slave/workspace/Lucene-Solr-Tests-4.x-Java6/solr/build/solr-core/test/J1/./org.apache.solr.cloud.SyncSliceTest-1359834888038/jetty1
[junit4:junit4]   2> 5002 T1221 oass.SolrIndexSearcher.<init> Opening Searcher@c628e4 main
[junit4:junit4]   2> 5003 T1221 oasu.CommitTracker.<init> Hard AutoCommit: disabled
[junit4:junit4]   2> 5003 T1221 oasu.CommitTracker.<init> Soft AutoCommit: disabled
[junit4:junit4]   2> 5004 T1221 oashc.SpellCheckComponent.inform Initializing spell checkers
[junit4:junit4]   2> 5011 T1221 oass.DirectSolrSpellChecker.init init: {name=direct,classname=DirectSolrSpellChecker,field=lowerfilt,minQueryLength=3}
[junit4:junit4]   2> 5062 T1222 oasc.SolrCore.registerSearcher [collection1] Registered new searcher Searcher@c628e4 main{StandardDirectoryReader(segments_1:1)}
[junit4:junit4]   2> 5067 T1221 oasc.ZkController.publish publishing core=collection1 state=down
[junit4:junit4]   2> 5067 T1221 oasc.ZkController.publish numShards not found on descriptor - reading it from system property
[junit4:junit4]   2> 5163 T1202 oascc.ZkStateReader.updateClusterState Updating cloud state from ZooKeeper... 
[junit4:junit4]   2> 5164 T1202 oasc.Overseer$ClusterStateUpdater.updateState Update state numShards=1 message={
[junit4:junit4]   2> 	  "operation":"state",
[junit4:junit4]   2> 	  "numShards":"1",
[junit4:junit4]   2> 	  "shard":"shard1",
[junit4:junit4]   2> 	  "roles":null,
[junit4:junit4]   2> 	  "state":"active",
[junit4:junit4]   2> 	  "core":"collection1",
[junit4:junit4]   2> 	  "collection":"control_collection",
[junit4:junit4]   2> 	  "node_name":"127.0.0.1:37192_i_d%2Fql",
[junit4:junit4]   2> 	  "base_url":"http://127.0.0.1:37192/i_d/ql"}
[junit4:junit4]   2> 5169 T1202 oasc.Overseer$ClusterStateUpdater.updateState Update state numShards=1 message={
[junit4:junit4]   2> 	  "operation":"state",
[junit4:junit4]   2> 	  "numShards":"1",
[junit4:junit4]   2> 	  "shard":null,
[junit4:junit4]   2> 	  "roles":null,
[junit4:junit4]   2> 	  "state":"down",
[junit4:junit4]   2> 	  "core":"collection1",
[junit4:junit4]   2> 	  "collection":"collection1",
[junit4:junit4]   2> 	  "node_name":"127.0.0.1:37198_i_d%2Fql",
[junit4:junit4]   2> 	  "base_url":"http://127.0.0.1:37198/i_d/ql"}
[junit4:junit4]   2> 5170 T1202 oasc.Overseer$ClusterStateUpdater.createCollection Create collection collection1 with numShards 1
[junit4:junit4]   2> 5170 T1202 oasc.Overseer$ClusterStateUpdater.updateState Assigning new node to shard shard=shard1
[junit4:junit4]   2> 5181 T1220 oascc.ZkStateReader$2.process A cluster state change: WatchedEvent state:SyncConnected type:NodeDataChanged path:/clusterstate.json, has occurred - updating... (live nodes size: 2)
[junit4:junit4]   2> 5181 T1201 oascc.ZkStateReader$2.process A cluster state change: WatchedEvent state:SyncConnected type:NodeDataChanged path:/clusterstate.json, has occurred - updating... (live nodes size: 2)
[junit4:junit4]   2> 5181 T1207 oascc.ZkStateReader$2.process A cluster state change: WatchedEvent state:SyncConnected type:NodeDataChanged path:/clusterstate.json, has occurred - updating... (live nodes size: 2)
[junit4:junit4]   2> 6070 T1221 oasc.CoreContainer.registerCore registering core: collection1
[junit4:junit4]   2> 6070 T1221 oasc.ZkController.register Register replica - core:collection1 address:http://127.0.0.1:37198/i_d/ql collection:collection1 shard:shard1
[junit4:junit4]   2> 6071 T1221 oascc.SolrZkClient.makePath makePath: /collections/collection1/leader_elect/shard1/election
[junit4:junit4]   2> 6117 T1184 oazs.PrepRequestProcessor.pRequest Got user-level KeeperException when processing sessionid:0x13c9c79b76a0006 type:delete cxid:0x43 zxid:0x5a txntype:-1 reqpath:n/a Error Path:/solr/collections/collection1/leaders Error:KeeperErrorCode = NoNode for /solr/collections/collection1/leaders
[junit4:junit4]   2> 6117 T1221 oasc.ShardLeaderElectionContext.runLeaderProcess Running the leader process.
[junit4:junit4]   2> 6118 T1184 oazs.PrepRequestProcessor.pRequest Got user-level KeeperException when processing sessionid:0x13c9c79b76a0006 type:create cxid:0x44 zxid:0x5b txntype:-1 reqpath:n/a Error Path:/solr/overseer Error:KeeperErrorCode = NodeExists for /solr/overseer
[junit4:junit4]   2> 6129 T1221 oasc.ShardLeaderElectionContext.waitForReplicasToComeUp Enough replicas found to continue.
[junit4:junit4]   2> 6129 T1221 oasc.ShardLeaderElectionContext.runLeaderProcess I may be the new leader - try and sync
[junit4:junit4]   2> 6129 T1221 oasc.SyncStrategy.sync Sync replicas to http://127.0.0.1:37198/i_d/ql/collection1/
[junit4:junit4]   2> 6129 T1221 oasc.SyncStrategy.syncReplicas Sync Success - now sync replicas to me
[junit4:junit4]   2> 6130 T1221 oasc.SyncStrategy.syncToMe http://127.0.0.1:37198/i_d/ql/collection1/ has no replicas
[junit4:junit4]   2> 6130 T1221 oasc.ShardLeaderElectionContext.runLeaderProcess I am the new leader: http://127.0.0.1:37198/i_d/ql/collection1/
[junit4:junit4]   2> 6130 T1221 oascc.SolrZkClient.makePath makePath: /collections/collection1/leaders/shard1
[junit4:junit4]   2> 6136 T1184 oazs.PrepRequestProcessor.pRequest Got user-level KeeperException when processing sessionid:0x13c9c79b76a0006 type:create cxid:0x4e zxid:0x5f txntype:-1 reqpath:n/a Error Path:/solr/overseer Error:KeeperErrorCode = NodeExists for /solr/overseer
[junit4:junit4]   2> 6697 T1202 oascc.ZkStateReader.updateClusterState Updating cloud state from ZooKeeper... 
[junit4:junit4]   2> 6768 T1220 oascc.ZkStateReader$2.process A cluster state change: WatchedEvent state:SyncConnected type:NodeDataChanged path:/clusterstate.json, has occurred - updating... (live nodes size: 2)
[junit4:junit4]   2> 6768 T1207 oascc.ZkStateReader$2.process A cluster state change: WatchedEvent state:SyncConnected type:NodeDataChanged path:/clusterstate.json, has occurred - updating... (live nodes size: 2)
[junit4:junit4]   2> 6768 T1201 oascc.ZkStateReader$2.process A cluster state change: WatchedEvent state:SyncConnected type:NodeDataChanged path:/clusterstate.json, has occurred - updating... (live nodes size: 2)
[junit4:junit4]   2> 6809 T1221 oasc.ZkController.register We are http://127.0.0.1:37198/i_d/ql/collection1/ and leader is http://127.0.0.1:37198/i_d/ql/collection1/
[junit4:junit4]   2> 6809 T1221 oasc.ZkController.register No LogReplay needed for core=collection1 baseURL=http://127.0.0.1:37198/i_d/ql
[junit4:junit4]   2> 6809 T1221 oasc.ZkController.checkRecovery I am the leader, no recovery necessary
[junit4:junit4]   2> 6809 T1221 oasc.ZkController.publish publishing core=collection1 state=active
[junit4:junit4]   2> 6810 T1221 oasc.ZkController.publish numShards not found on descriptor - reading it from system property
[junit4:junit4]   2> 6812 T1221 oascc.ZkStateReader.updateClusterState Updating cloud state from ZooKeeper... 
[junit4:junit4]   2> 6813 T1179 oass.SolrDispatchFilter.init user.dir=/usr/home/hudson/hudson-slave/workspace/Lucene-Solr-Tests-4.x-Java6/solr/build/solr-core/test/J1
[junit4:junit4]   2> 6814 T1179 oass.SolrDispatchFilter.init SolrDispatchFilter.init() done
[junit4:junit4]   2> 6815 T1179 oascsi.HttpClientUtil.createClient Creating new http client, config:maxConnections=128&maxConnectionsPerHost=32&followRedirects=false
[junit4:junit4]   2> 6989 T1179 oejs.Server.doStart jetty-8.1.8.v20121106
[junit4:junit4]   2> 6993 T1179 oejs.AbstractConnector.doStart Started SocketConnector@127.0.0.1:37202
[junit4:junit4]   2> 6994 T1179 oass.SolrDispatchFilter.init SolrDispatchFilter.init()
[junit4:junit4]   2> 6994 T1179 oasc.SolrResourceLoader.locateSolrHome JNDI not configured for solr (NoInitialContextEx)
[junit4:junit4]   2> 6994 T1179 oasc.SolrResourceLoader.locateSolrHome using system property solr.solr.home: /usr/home/hudson/hudson-slave/workspace/Lucene-Solr-Tests-4.x-Java6/solr/build/solr-core/test/J1/./org.apache.solr.cloud.SyncSliceTest-jetty2-1359834894862
[junit4:junit4]   2> 6995 T1179 oasc.CoreContainer$Initializer.initialize looking for solr.xml: /usr/home/hudson/hudson-slave/workspace/Lucene-Solr-Tests-4.x-Java6/solr/build/solr-core/test/J1/./org.apache.solr.cloud.SyncSliceTest-jetty2-1359834894862/solr.xml
[junit4:junit4]   2> 6995 T1179 oasc.CoreContainer.<init> New CoreContainer 414298075
[junit4:junit4]   2> 6996 T1179 oasc.CoreContainer.load Loading CoreContainer using Solr Home: '/usr/home/hudson/hudson-slave/workspace/Lucene-Solr-Tests-4.x-Java6/solr/build/solr-core/test/J1/./org.apache.solr.cloud.SyncSliceTest-jetty2-1359834894862/'
[junit4:junit4]   2> 6997 T1179 oasc.SolrResourceLoader.<init> new SolrResourceLoader for directory: '/usr/home/hudson/hudson-slave/workspace/Lucene-Solr-Tests-4.x-Java6/solr/build/solr-core/test/J1/./org.apache.solr.cloud.SyncSliceTest-jetty2-1359834894862/'
[junit4:junit4]   2> 7039 T1179 oashc.HttpShardHandlerFactory.getParameter Setting socketTimeout to: 60000
[junit4:junit4]   2> 7039 T1179 oashc.HttpShardHandlerFactory.getParameter Setting urlScheme to: http://
[junit4:junit4]   2> 7040 T1179 oashc.HttpShardHandlerFactory.getParameter Setting connTimeout to: 15000
[junit4:junit4]   2> 7040 T1179 oashc.HttpShardHandlerFactory.getParameter Setting maxConnectionsPerHost to: 20
[junit4:junit4]   2> 7041 T1179 oashc.HttpShardHandlerFactory.getParameter Setting corePoolSize to: 0
[junit4:junit4]   2> 7041 T1179 oashc.HttpShardHandlerFactory.getParameter Setting maximumPoolSize to: 2147483647
[junit4:junit4]   2> 7042 T1179 oashc.HttpShardHandlerFactory.getParameter Setting maxThreadIdleTime to: 5
[junit4:junit4]   2> 7042 T1179 oashc.HttpShardHandlerFactory.getParameter Setting sizeOfQueue to: -1
[junit4:junit4]   2> 7043 T1179 oashc.HttpShardHandlerFactory.getParameter Setting fairnessPolicy to: false
[junit4:junit4]   2> 7043 T1179 oascsi.HttpClientUtil.createClient Creating new http client, config:maxConnectionsPerHost=20&maxConnections=10000&socketTimeout=60000&connTimeout=15000&retry=false
[junit4:junit4]   2> 7062 T1179 oasc.CoreContainer.load Registering Log Listener
[junit4:junit4]   2> 7080 T1179 oasc.CoreContainer.initZooKeeper Zookeeper client=127.0.0.1:37189/solr
[junit4:junit4]   2> 7081 T1179 oasc.ZkController.checkChrootPath zkHost includes chroot
[junit4:junit4]   2> 7081 T1179 oaz.ZooKeeper.<init> Initiating client connection, connectString=127.0.0.1:37189 sessionTimeout=60000 watcher=org.apache.solr.common.cloud.ConnectionManager@356fb597
[junit4:junit4]   2> 7082 T1179 oascc.ConnectionManager.waitForConnected Waiting for client to connect to ZooKeeper
[junit4:junit4]   2> 7083 T1232 oaz.ClientCnxn$SendThread.logStartConnect Opening socket connection to server localhost/127.0.0.1:37189. Will not attempt to authenticate using SASL (access denied (javax.security.auth.AuthPermission getLoginConfiguration))
[junit4:junit4]   2> 7084 T1232 oaz.ClientCnxn$SendThread.primeConnection Socket connection established to localhost/127.0.0.1:37189, initiating session
[junit4:junit4]   2> 7084 T1181 oazs.NIOServerCnxnFactory.run Accepted socket connection from /140.211.11.196:37203
[junit4:junit4]   2> 7084 T1181 oazs.ZooKeeperServer.processConnectRequest Client attempting to establish new session at /140.211.11.196:37203
[junit4:junit4]   2> 7091 T1183 oazs.ZooKeeperServer.finishSessionInit Established session 0x13c9c79b76a0007 with negotiated timeout 20000 for client /140.211.11.196:37203
[junit4:junit4]   2> 7091 T1232 oaz.ClientCnxn$SendThread.onConnected Session establishment complete on server localhost/127.0.0.1:37189, sessionid = 0x13c9c79b76a0007, negotiated timeout = 20000
[junit4:junit4]   2> 7091 T1233 oascc.ConnectionManager.process Watcher org.apache.solr.common.cloud.ConnectionManager@356fb597 name:ZooKeeperConnection Watcher:127.0.0.1:37189 got event WatchedEvent state:SyncConnected type:None path:null path:null type:None
[junit4:junit4]   2> 7091 T1179 oascc.ConnectionManager.waitForConnected Client is connected to ZooKeeper
[junit4:junit4]   2> 7093 T1184 oazs.PrepRequestProcessor.pRequest2Txn Processed session termination for sessionid: 0x13c9c79b76a0007
[junit4:junit4]   2> 7094 T1233 oaz.ClientCnxn$EventThread.run EventThread shut down
[junit4:junit4]   2> 7094 T1181 oazs.NIOServerCnxn.closeSock Closed socket connection for client /140.211.11.196:37203 which had sessionid 0x13c9c79b76a0007
[junit4:junit4]   2> 7094 T1179 oaz.ZooKeeper.close Session: 0x13c9c79b76a0007 closed
[junit4:junit4]   2> 7095 T1179 oascsi.HttpClientUtil.createClient Creating new http client, config:maxConnections=500&maxConnectionsPerHost=16&socketTimeout=60000&connTimeout=15000
[junit4:junit4]   2> 7104 T1179 oaz.ZooKeeper.<init> Initiating client connection, connectString=127.0.0.1:37189/solr sessionTimeout=30000 watcher=org.apache.solr.common.cloud.ConnectionManager@5d37f2ea
[junit4:junit4]   2> 7105 T1179 oascc.ConnectionManager.waitForConnected Waiting for client to connect to ZooKeeper
[junit4:junit4]   2> 7105 T1234 oaz.ClientCnxn$SendThread.logStartConnect Opening socket connection to server localhost/127.0.0.1:37189. Will not attempt to authenticate using SASL (access denied (javax.security.auth.AuthPermission getLoginConfiguration))
[junit4:junit4]   2> 7106 T1234 oaz.ClientCnxn$SendThread.primeConnection Socket connection established to localhost/127.0.0.1:37189, initiating session
[junit4:junit4]   2> 7106 T1181 oazs.NIOServerCnxnFactory.run Accepted socket connection from /140.211.11.196:37204
[junit4:junit4]   2> 7107 T1181 oazs.ZooKeeperServer.processConnectRequest Client attempting to establish new session at /140.211.11.196:37204
[junit4:junit4]   2> 7108 T1183 oazs.ZooKeeperServer.finishSessionInit Established session 0x13c9c79b76a0008 with negotiated timeout 20000 for client /140.211.11.196:37204
[junit4:junit4]   2> 7108 T1234 oaz.ClientCnxn$SendThread.onConnected Session establishment complete on server localhost/127.0.0.1:37189, sessionid = 0x13c9c79b76a0008, negotiated timeout = 20000
[junit4:junit4]   2> 7108 T1235 oascc.ConnectionManager.process Watcher org.apache.solr.common.cloud.ConnectionManager@5d37f2ea name:ZooKeeperConnection Watcher:127.0.0.1:37189/solr got event WatchedEvent state:SyncConnected type:None path:null path:null type:None
[junit4:junit4]   2> 7109 T1179 oascc.ConnectionManager.waitForConnected Client is connected to ZooKeeper
[junit4:junit4]   2> 7110 T1184 oazs.PrepRequestProcessor.pRequest Got user-level KeeperException when processing sessionid:0x13c9c79b76a0008 type:create cxid:0x1 zxid:0x6c txntype:-1 reqpath:n/a Error Path:/solr/overseer Error:KeeperErrorCode = NodeExists for /solr/overseer
[junit4:junit4]   2> 7111 T1184 oazs.PrepRequestProcessor.pRequest Got user-level KeeperException when processing sessionid:0x13c9c79b76a0008 type:create cxid:0x2 zxid:0x6d txntype:-1 reqpath:n/a Error Path:/solr/overseer Error:KeeperErrorCode = NodeExists for /solr/overseer
[junit4:junit4]   2> 7119 T1179 oasc.ZkController.createEphemeralLiveNode Register node as live in ZooKeeper:/live_nodes/127.0.0.1:37202_i_d%2Fql
[junit4:junit4]   2> 7120 T1184 oazs.PrepRequestProcessor.pRequest Got user-level KeeperException when processing sessionid:0x13c9c79b76a0008 type:delete cxid:0x4 zxid:0x6e txntype:-1 reqpath:n/a Error Path:/solr/live_nodes/127.0.0.1:37202_i_d%2Fql Error:KeeperErrorCode = NoNode for /solr/live_nodes/127.0.0.1:37202_i_d%2Fql
[junit4:junit4]   2> 7121 T1179 oascc.SolrZkClient.makePath makePath: /live_nodes/127.0.0.1:37202_i_d%2Fql
[junit4:junit4]   2> 7124 T1207 oascc.ZkStateReader$2.process A cluster state change: WatchedEvent state:SyncConnected type:NodeChildrenChanged path:/live_nodes, has occurred - updating... (live nodes size: 2)
[junit4:junit4]   2> 7125 T1220 oascc.ZkStateReader$3.process Updating live nodes... (3)
[junit4:junit4]   2> 7125 T1201 oascc.ZkStateReader$3.process Updating live nodes... (3)
[junit4:junit4]   2> 7125 T1220 oascc.ZkStateReader$2.process A cluster state change: WatchedEvent state:SyncConnected type:NodeChildrenChanged path:/live_nodes, has occurred - updating... (live nodes size: 3)
[junit4:junit4]   2> 7125 T1201 oascc.ZkStateReader$2.process A cluster state change: WatchedEvent state:SyncConnected type:NodeChildrenChanged path:/live_nodes, has occurred - updating... (live nodes size: 3)
[junit4:junit4]   2> 7127 T1207 oascc.ZkStateReader$3.process Updating live nodes... (3)
[junit4:junit4]   2> 7130 T1179 oascc.ZkStateReader.createClusterStateWatchersAndUpdate Updating cluster state from ZooKeeper... 
[junit4:junit4]   2> 7137 T1236 oasc.CoreContainer.create Creating SolrCore 'collection1' using instanceDir: /usr/home/hudson/hudson-slave/workspace/Lucene-Solr-Tests-4.x-Java6/solr/build/solr-core/test/J1/./org.apache.solr.cloud.SyncSliceTest-jetty2-1359834894862/collection1
[junit4:junit4]   2> 7137 T1236 oasc.ZkController.createCollectionZkNode Check for collection zkNode:collection1
[junit4:junit4]   2> 7138 T1236 oasc.ZkController.createCollectionZkNode Collection zkNode exists
[junit4:junit4]   2> 7138 T1236 oasc.ZkController.readConfigName Load collection config from:/collections/collection1
[junit4:junit4]   2> 7140 T1236 oasc.SolrResourceLoader.<init> new SolrResourceLoader for directory: '/usr/home/hudson/hudson-slave/workspace/Lucene-Solr-Tests-4.x-Java6/solr/build/solr-core/test/J1/./org.apache.solr.cloud.SyncSliceTest-jetty2-1359834894862/collection1/'
[junit4:junit4]   2> 7141 T1236 oasc.SolrResourceLoader.replaceClassLoader Adding 'file:/usr/home/hudson/hudson-slave/workspace/Lucene-Solr-Tests-4.x-Java6/solr/build/solr-core/test/J1/org.apache.solr.cloud.SyncSliceTest-jetty2-1359834894862/collection1/lib/README' to classloader
[junit4:junit4]   2> 7141 T1236 oasc.SolrResourceLoader.replaceClassLoader Adding 'file:/usr/home/hudson/hudson-slave/workspace/Lucene-Solr-Tests-4.x-Java6/solr/build/solr-core/test/J1/org.apache.solr.cloud.SyncSliceTest-jetty2-1359834894862/collection1/lib/classes/' to classloader
[junit4:junit4]   2> 7194 T1236 oasc.SolrConfig.<init> Using Lucene MatchVersion: LUCENE_42
[junit4:junit4]   2> 7275 T1236 oasc.SolrConfig.<init> Loaded SolrConfig: solrconfig.xml
[junit4:junit4]   2> 7376 T1236 oass.IndexSchema.readSchema Reading Solr Schema
[junit4:junit4]   2> 7382 T1236 oass.IndexSchema.readSchema Schema name=test
[junit4:junit4]   2> 8005 T1236 oass.OpenExchangeRatesOrgProvider.init Initialized with rates=open-exchange-rates.json, refreshInterval=1440.
[junit4:junit4]   2> 8016 T1236 oass.IndexSchema.readSchema default search field in schema is text
[junit4:junit4]   2> 8020 T1236 oass.IndexSchema.readSchema unique key field: id
[junit4:junit4]   2> 8043 T1236 oass.FileExchangeRateProvider.reload Reloading exchange rates from file currency.xml
[junit4:junit4]   2> 8048 T1236 oass.FileExchangeRateProvider.reload Reloading exchange rates from file currency.xml
[junit4:junit4]   2> 8053 T1236 oass.OpenExchangeRatesOrgProvider.reload Reloading exchange rates from open-exchange-rates.json
[junit4:junit4]   2> 8055 T1236 oass.OpenExchangeRatesOrgProvider.reload Reloading exchange rates from open-exchange-rates.json
[junit4:junit4]   2> 8057 T1236 oasc.SolrCore.<init> [collection1] Opening new SolrCore at /usr/home/hudson/hudson-slave/workspace/Lucene-Solr-Tests-4.x-Java6/solr/build/solr-core/test/J1/./org.apache.solr.cloud.SyncSliceTest-jetty2-1359834894862/collection1/, dataDir=./org.apache.solr.cloud.SyncSliceTest-1359834888038/jetty2/
[junit4:junit4]   2> 8057 T1236 oasc.JmxMonitoredMap.<init> JMX monitoring is enabled. Adding Solr mbeans to JMX Server: com.sun.jmx.mbeanserver.JmxMBeanServer@b478a2d
[junit4:junit4]   2> 8058 T1236 oasc.SolrCore.initDirectoryFactory solr.NRTCachingDirectoryFactory
[junit4:junit4]   2> 8059 T1236 oasc.CachingDirectoryFactory.get return new directory for /usr/home/hudson/hudson-slave/workspace/Lucene-Solr-Tests-4.x-Java6/solr/build/solr-core/test/J1/./org.apache.solr.cloud.SyncSliceTest-1359834888038/jetty2 forceNew:false
[junit4:junit4]   2> 8059 T1236 oasc.CachingDirectoryFactory.close Releasing directory:/usr/home/hudson/hudson-slave/workspace/Lucene-Solr-Tests-4.x-Java6/solr/build/solr-core/test/J1/./org.apache.solr.cloud.SyncSliceTest-1359834888038/jetty2
[junit4:junit4]   2> 8059 T1236 oasc.SolrCore.getNewIndexDir New index directory detected: old=null new=./org.apache.solr.cloud.SyncSliceTest-1359834888038/jetty2/index/
[junit4:junit4]   2> 8060 T1236 oasc.SolrCore.initIndex WARNING [collection1] Solr index directory './org.apache.solr.cloud.SyncSliceTest-1359834888038/jetty2/index' doesn't exist. Creating new index...
[junit4:junit4]   2> 8061 T1236 oasc.CachingDirectoryFactory.get return new directory for /usr/home/hudson/hudson-slave/workspace/Lucene-Solr-Tests-4.x-Java6/solr/build/solr-core/test/J1/./org.apache.solr.cloud.SyncSliceTest-1359834888038/jetty2/index forceNew:false
[junit4:junit4]   2> 8068 T1236 oasc.SolrDeletionPolicy.onCommit SolrDeletionPolicy.onCommit: commits:num=1
[junit4:junit4]   2> 		commit{dir=RateLimitedDirectoryWrapper(NRTCachingDirectory(org.apache.lucene.store.NIOFSDirectory@/usr/home/hudson/hudson-slave/workspace/Lucene-Solr-Tests-4.x-Java6/solr/build/solr-core/test/J1/org.apache.solr.cloud.SyncSliceTest-1359834888038/jetty2/index lockFactory=org.apache.lucene.store.NativeFSLockFactory@27a9195c; maxCacheMB=48.0 maxMergeSizeMB=4.0)),segFN=segments_1,generation=1,filenames=[segments_1]
[junit4:junit4]   2> 8068 T1236 oasc.SolrDeletionPolicy.updateCommits newest commit = 1[segments_1]
[junit4:junit4]   2> 8069 T1236 oasc.CachingDirectoryFactory.close Releasing directory:/usr/home/hudson/hudson-slave/workspace/Lucene-Solr-Tests-4.x-Java6/solr/build/solr-core/test/J1/./org.apache.solr.cloud.SyncSliceTest-1359834888038/jetty2/index
[junit4:junit4]   2> 8070 T1236 oasc.SolrCore.initWriters created xml: solr.XMLResponseWriter
[junit4:junit4]   2> 8072 T1236 oasup.UpdateRequestProcessorChain.init inserting DistributedUpdateProcessorFactory into updateRequestProcessorChain "dedupe"
[junit4:junit4]   2> 8072 T1236 oasup.UpdateRequestProcessorChain.init inserting DistributedUpdateProcessorFactory into updateRequestProcessorChain "dedupe-allfields"
[junit4:junit4]   2> 8072 T1236 oasup.UpdateRequestProcessorChain.init inserting DistributedUpdateProcessorFactory into updateRequestProcessorChain "stored_sig"
[junit4:junit4]   2> 8073 T1236 oasup.UpdateRequestProcessorChain.init inserting DistributedUpdateProcessorFactory into updateRequestProcessorChain "uniq-fields"
[junit4:junit4]   2> 8073 T1236 oasup.UpdateRequestProcessorChain.init inserting DistributedUpdateProcessorFactory into updateRequestProcessorChain "distrib-dup-test-chain-implicit"
[junit4:junit4]   2> 8074 T1236 oasc.RequestHandlers.initHandlersFromConfig adding lazy requestHandler: solr.ReplicationHandler
[junit4:junit4]   2> 8074 T1236 oasc.RequestHandlers.initHandlersFromConfig created /replication: solr.ReplicationHandler
[junit4:junit4]   2> 8075 T1236 oasc.RequestHandlers.initHandlersFromConfig created standard: solr.StandardRequestHandler
[junit4:junit4]   2> 8075 T1236 oasc.RequestHandlers.initHandlersFromConfig created /get: solr.RealTimeGetHandler
[junit4:junit4]   2> 8076 T1236 oasc.RequestHandlers.initHandlersFromConfig created dismax: solr.SearchHandler
[junit4:junit4]   2> 8076 T1236 oasc.RequestHandlers.initHandlersFromConfig created mock: org.apache.solr.core.MockQuerySenderListenerReqHandler
[junit4:junit4]   2> 8077 T1236 oasc.RequestHandlers.initHandlersFromConfig created /admin/: org.apache.solr.handler.admin.AdminHandlers
[junit4:junit4]   2> 8077 T1236 oasc.RequestHandlers.initHandlersFromConfig created defaults: solr.StandardRequestHandler
[junit4:junit4]   2> 8077 T1236 oasc.RequestHandlers.initHandlersFromConfig adding lazy requestHandler: solr.StandardRequestHandler
[junit4:junit4]   2> 8078 T1236 oasc.RequestHandlers.initHandlersFromConfig created lazy: solr.StandardRequestHandler
[junit4:junit4]   2> 8078 T1236 oasc.RequestHandlers.initHandlersFromConfig created /update: solr.UpdateRequestHandler
[junit4:junit4]   2> 8079 T1236 oasc.RequestHandlers.initHandlersFromConfig created /terms: org.apache.solr.handler.component.SearchHandler
[junit4:junit4]   2> 8079 T1236 oasc.RequestHandlers.initHandlersFromConfig created spellCheckCompRH: org.apache.solr.handler.component.SearchHandler
[junit4:junit4]   2> 8080 T1236 oasc.RequestHandlers.initHandlersFromConfig created spellCheckCompRH_Direct: org.apache.solr.handler.component.SearchHandler
[junit4:junit4]   2> 8081 T1236 oasc.RequestHandlers.initHandlersFromConfig created spellCheckWithWordbreak: org.apache.solr.handler.component.SearchHandler
[junit4:junit4]   2> 8081 T1236 oasc.RequestHandlers.initHandlersFromConfig created spellCheckWithWordbreak_Direct: org.apache.solr.handler.component.SearchHandler
[junit4:junit4]   2> 8082 T1236 oasc.RequestHandlers.initHandlersFromConfig created spellCheckCompRH1: org.apache.solr.handler.component.SearchHandler
[junit4:junit4]   2> 8082 T1236 oasc.RequestHandlers.initHandlersFromConfig created mltrh: org.apache.solr.handler.component.SearchHandler
[junit4:junit4]   2> 8083 T1236 oasc.RequestHandlers.initHandlersFromConfig created tvrh: org.apache.solr.handler.component.SearchHandler
[junit4:junit4]   2> 8083 T1236 oasc.RequestHandlers.initHandlersFromConfig created /mlt: solr.MoreLikeThisHandler
[junit4:junit4]   2> 8084 T1236 oasc.RequestHandlers.initHandlersFromConfig created /debug/dump: solr.DumpRequestHandler
[junit4:junit4]   2> 8091 T1236 oashl.XMLLoader.init xsltCacheLifetimeSeconds=60
[junit4:junit4]   2> 8096 T1236 oasc.SolrCore.initDeprecatedSupport WARNING solrconfig.xml uses deprecated <admin/gettableFiles>, Please update your config to use the ShowFileRequestHandler.
[junit4:junit4]   2> 8097 T1236 oasc.SolrCore.initDeprecatedSupport WARNING adding ShowFileRequestHandler with hidden files: [SCHEMA.XML, OLD_SYNONYMS.TXT, STOPWORDS.TXT, PROTWORDS.TXT, OPEN-EXCHANGE-RATES.JSON, SYNONYMS.TXT, CURRENCY.XML, MAPPING-ISOLATIN1ACCENT.TXT]
[junit4:junit4]   2> 8100 T1236 oasc.CachingDirectoryFactory.close Releasing directory:/usr/home/hudson/hudson-slave/workspace/Lucene-Solr-Tests-4.x-Java6/solr/build/solr-core/test/J1/./org.apache.solr.cloud.SyncSliceTest-1359834888038/jetty2
[junit4:junit4]   2> 8102 T1236 oass.SolrIndexSearcher.<init> Opening Searcher@6e07e6fc main
[junit4:junit4]   2> 8103 T1236 oasu.CommitTracker.<init> Hard AutoCommit: disabled
[junit4:junit4]   2> 8103 T1236 oasu.CommitTracker.<init> Soft AutoCommit: disabled
[junit4:junit4]   2> 8103 T1236 oashc.SpellCheckComponent.inform Initializing spell checkers
[junit4:junit4]   2> 8111 T1236 oass.DirectSolrSpellChecker.init init: {name=direct,classname=DirectSolrSpellChecker,field=lowerfilt,minQueryLength=3}
[junit4:junit4]   2> 8167 T1237 oasc.SolrCore.registerSearcher [collection1] Registered new searcher Searcher@6e07e6fc main{StandardDirectoryReader(segments_1:1)}
[junit4:junit4]   2> 8173 T1236 oasc.ZkController.publish publishing core=collection1 state=down
[junit4:junit4]   2> 8173 T1236 oasc.ZkController.publish numShards not found on descriptor - reading it from system property
[junit4:junit4]   2> 8305 T1202 oascc.ZkStateReader.updateClusterState Updating cloud state from ZooKeeper... 
[junit4:junit4]   2> 8306 T1202 oasc.Overseer$ClusterStateUpdater.updateState Update state numShards=1 message={
[junit4:junit4]   2> 	  "operation":"state",
[junit4:junit4]   2> 	  "numShards":"1",
[junit4:junit4]   2> 	  "shard":"shard1",
[junit4:junit4]   2> 	  "roles":null,
[junit4:junit4]   2> 	  "state":"active",
[junit4:junit4]   2> 	  "core":"collection1",
[junit4:junit4]   2> 	  "collection":"collection1",
[junit4:junit4]   2> 	  "node_name":"127.0.0.1:37198_i_d%2Fql",
[junit4:junit4]   2> 	  "base_url":"http://127.0.0.1:37198/i_d/ql"}
[junit4:junit4]   2> 8320 T1202 oasc.Overseer$ClusterStateUpdater.updateState Update state numShards=1 message={
[junit4:junit4]   2> 	  "operation":"state",
[junit4:junit4]   2> 	  "numShards":"1",
[junit4:junit4]   2> 	  "shard":null,
[junit4:junit4]   2> 	  "roles":null,
[junit4:junit4]   2> 	  "state":"down",
[junit4:junit4]   2> 	  "core":"collection1",
[junit4:junit4]   2> 	  "collection":"collection1",
[junit4:junit4]   2> 	  "node_name":"127.0.0.1:37202_i_d%2Fql",
[junit4:junit4]   2> 	  "base_url":"http://127.0.0.1:37202/i_d/ql"}
[junit4:junit4]   2> 8320 T1202 oasc.Overseer$ClusterStateUpdater.updateState Collection already exists with numShards=1
[junit4:junit4]   2> 8321 T1202 oasc.Overseer$ClusterStateUpdater.updateState Assigning new node to shard shard=shard1
[junit4:junit4]   2> 8333 T1235 oascc.ZkStateReader$2.process A cluster state change: WatchedEvent state:SyncConnected type:NodeDataChanged path:/clusterstate.json, has occurred - updating... (live nodes size: 3)
[junit4:junit4]   2> 8333 T1201 oascc.ZkStateReader$2.process A cluster state change: WatchedEvent state:SyncConnected type:NodeDataChanged path:/clusterstate.json, has occurred - updating... (live nodes size: 3)
[junit4:junit4]   2> 8334 T1220 oascc.ZkStateReader$2.process A cluster state change: WatchedEvent state:SyncConnected type:NodeDataChanged path:/clusterstate.json, has occurred - updating... (live nodes size: 3)
[junit4:junit4]   2> 8334 T1207 oascc.ZkStateReader$2.process A cluster state change: WatchedEvent state:SyncConnected type:NodeDataChanged path:/clusterstate.json, has occurred - updating... (live nodes size: 3)
[junit4:junit4]   2> 9176 T1236 oasc.CoreContainer.registerCore registering core: collection1
[junit4:junit4]   2> 9176 T1236 oasc.ZkController.register Register replica - core:collection1 address:http://127.0.0.1:37202/i_d/ql collection:collection1 shard:shard1
[junit4:junit4]   2> 9182 T1236 oasc.ZkController.register We are http://127.0.0.1:37202/i_d/ql/collection1/ and leader is http://127.0.0.1:37198/i_d/ql/collection1/
[junit4:junit4]   2> 9182 T1236 oasc.ZkController.register No LogReplay needed for core=collection1 baseURL=http://127.0.0.1:37202/i_d/ql
[junit4:junit4]   2> 9182 T1236 oasc.ZkController.checkRecovery Core needs to recover:collection1
[junit4:junit4]   2> 9182 T1236 oasu.DefaultSolrCoreState.doRecovery Running recovery - first canceling any ongoing recovery
[junit4:junit4]   2> ASYNC  NEW_CORE C105 name=collection1 org.apache.solr.core.SolrCore@793a532a url=http://127.0.0.1:37202/i_d/ql/collection1 node=127.0.0.1:37202_i_d%2Fql C105_STATE=coll:collection1 core:collection1 props:{shard=null, roles=null, state=down, core=collection1, collection=collection1, node_name=127.0.0.1:37202_i_d%2Fql, base_url=http://127.0.0.1:37202/i_d/ql}
[junit4:junit4]   2> 9183 T1238 C105 P37202 oasc.RecoveryStrategy.run Starting recovery process.  core=collection1 recoveringAfterStartup=true
[junit4:junit4]   2> 9183 T1236 oascc.ZkStateReader.updateClusterState Updating cloud state from ZooKeeper... 
[junit4:junit4]   2> 9184 T1238 C105 P37202 oasc.RecoveryStrategy.doRecovery ###### startupVersions=[]
[junit4:junit4]   2> 9184 T1238 C105 P37202 oasc.ZkController.publish publishing core=collection1 state=recovering
[junit4:junit4]   2> 9184 T1238 C105 P37202 oasc.ZkController.publish numShards not found on descriptor - reading it from system property
[junit4:junit4]   2> 9185 T1179 oass.SolrDispatchFilter.init user.dir=/usr/home/hudson/hudson-slave/workspace/Lucene-Solr-Tests-4.x-Java6/solr/build/solr-core/test/J1
[junit4:junit4]   2> 9186 T1179 oass.SolrDispatchFilter.init SolrDispatchFilter.init() done
[junit4:junit4]   2> 9186 T1179 oascsi.HttpClientUtil.createClient Creating new http client, config:maxConnections=128&maxConnectionsPerHost=32&followRedirects=false
[junit4:junit4]   2> 9187 T1238 C105 P37202 oascsi.HttpClientUtil.createClient Creating new http client, config:maxConnections=128&maxConnectionsPerHost=32&followRedirects=false
[junit4:junit4]   2> 9378 T1179 oejs.Server.doStart jetty-8.1.8.v20121106
[junit4:junit4]   2> 9381 T1179 oejs.AbstractConnector.doStart Started SocketConnector@127.0.0.1:37212
[junit4:junit4]   2> 9382 T1179 oass.SolrDispatchFilter.init SolrDispatchFilter.init()
[junit4:junit4]   2> 9383 T1179 oasc.SolrResourceLoader.locateSolrHome JNDI not configured for solr (NoInitialContextEx)
[junit4:junit4]   2> 9383 T1179 oasc.SolrResourceLoader.locateSolrHome using system property solr.solr.home: /usr/home/hudson/hudson-slave/workspace/Lucene-Solr-Tests-4.x-Java6/solr/build/solr-core/test/J1/./org.apache.solr.cloud.SyncSliceTest-jetty3-1359834897243
[junit4:junit4]   2> 9383 T1179 oasc.CoreContainer$Initializer.initialize looking for solr.xml: /usr/home/hudson/hudson-slave/workspace/Lucene-Solr-Tests-4.x-Java6/solr/build/solr-core/test/J1/./org.apache.solr.cloud.SyncSliceTest-jetty3-1359834897243/solr.xml
[junit4:junit4]   2> 9384 T1179 oasc.CoreContainer.<init> New CoreContainer 674562309
[junit4:junit4]   2> 9385 T1179 oasc.CoreContainer.load Loading CoreContainer using Solr Home: '/usr/home/hudson/hudson-slave/workspace/Lucene-Solr-Tests-4.x-Java6/solr/build/solr-core/test/J1/./org.apache.solr.cloud.SyncSliceTest-jetty3-1359834897243/'
[junit4:junit4]   2> 9385 T1179 oasc.SolrResourceLoader.<init> new SolrResourceLoader for directory: '/usr/home/hudson/hudson-slave/workspace/Lucene-Solr-Tests-4.x-Java6/solr/build/solr-core/test/J1/./org.apache.solr.cloud.SyncSliceTest-jetty3-1359834897243/'
[junit4:junit4]   2> 9432 T1179 oashc.HttpShardHandlerFactory.getParameter Setting socketTimeout to: 60000
[junit4:junit4]   2> 9432 T1179 oashc.HttpShardHandlerFactory.getParameter Setting urlScheme to: http://
[junit4:junit4]   2> 9433 T1179 oashc.HttpShardHandlerFactory.getParameter Setting connTimeout to: 15000
[junit4:junit4]   2> 9433 T1179 oashc.HttpShardHandlerFactory.getParameter Setting maxConnectionsPerHost to: 20
[junit4:junit4]   2> 9434 T1179 oashc.HttpShardHandlerFactory.getParameter Setting corePoolSize to: 0
[junit4:junit4]   2> 9434 T1179 oashc.HttpShardHandlerFactory.getParameter Setting maximumPoolSize to: 2147483647
[junit4:junit4]   2> 9434 T1179 oashc.HttpShardHandlerFactory.getParameter Setting maxThreadIdleTime to: 5
[junit4:junit4]   2> 9435 T1179 oashc.HttpShardHandlerFactory.getParameter Setting sizeOfQueue to: -1
[junit4:junit4]   2> 9435 T1179 oashc.HttpShardHandlerFactory.getParameter Setting fairnessPolicy to: false
[junit4:junit4]   2> 9436 T1179 oascsi.HttpClientUtil.createClient Creating new http client, config:maxConnectionsPerHost=20&maxConnections=10000&socketTimeout=60000&connTimeout=15000&retry=false
[junit4:junit4]   2> 9459 T1179 oasc.CoreContainer.load Registering Log Listener
[junit4:junit4]   2> 9479 T1179 oasc.CoreContainer.initZooKeeper Zookeeper client=127.0.0.1:37189/solr
[junit4:junit4]   2> 9480 T1179 oasc.ZkController.checkChrootPath zkHost includes chroot
[junit4:junit4]   2> 9480 T1179 oaz.ZooKeeper.<init> Initiating client connection, connectString=127.0.0.1:37189 sessionTimeout=60000 watcher=org.apache.solr.common.cloud.ConnectionManager@b9902f7
[junit4:junit4]   2> 9481 T1179 oascc.ConnectionManager.waitForConnected Waiting for client to connect to ZooKeeper
[junit4:junit4]   2> 9482 T1248 oaz.ClientCnxn$SendThread.logStartConnect Opening socket connection to server localhost/127.0.0.1:37189. Will not attempt to authenticate using SASL (access denied (javax.security.auth.AuthPermission getLoginConfiguration))
[junit4:junit4]   2> 9483 T1248 oaz.ClientCnxn$SendThread.primeConnection Socket connection established to localhost/127.0.0.1:37189, initiating session
[junit4:junit4]   2> 9483 T1181 oazs.NIOServerCnxnFactory.run Accepted socket connection from /140.211.11.196:37214
[junit4:junit4]   2> 9484 T1181 oazs.ZooKeeperServer.processConnectRequest Client attempting to establish new session at /140.211.11.196:37214
[junit4:junit4]   2> 9485 T1183 oazs.ZooKeeperServer.finishSessionInit Established session 0x13c9c79b76a0009 with negotiated timeout 20000 for client /140.211.11.196:37214
[junit4:junit4]   2> 9486 T1248 oaz.ClientCnxn$SendThread.onConnected Session establishment complete on server localhost/127.0.0.1:37189, sessionid = 0x13c9c79b76a0009, negotiated timeout = 20000
[junit4:junit4]   2> 9486 T1249 oascc.ConnectionManager.process Watcher org.apache.solr.common.cloud.ConnectionManager@b9902f7 name:ZooKeeperConnection Watcher:127.0.0.1:37189 got event WatchedEvent state:SyncConnected type:None path:null path:null type:None
[junit4:junit4]   2> 9486 T1179 oascc.ConnectionManager.waitForConnected Client is connected to ZooKeeper
[junit4:junit4]   2> 9488 T1184 oazs.PrepRequestProcessor.pRequest2Txn Processed session termination for sessionid: 0x13c9c79b76a0009
[junit4:junit4]   2> 9495 T1249 oaz.ClientCnxn$EventThread.run EventThread shut down
[junit4:junit4]   2> 9496 T1181 oazs.NIOServerCnxn.closeSock Closed socket connection for client /140.211.11.196:37214 which had sessionid 0x13c9c79b76a0009
[junit4:junit4]   2> 9495 T1179 oaz.ZooKeeper.close Session: 0x13c9c79b76a0009 closed
[junit4:junit4]   2> 9496 T1179 oascsi.HttpClientUtil.createClient Creating new http client, config:maxConnections=500&maxConnectionsPerHost=16&socketTimeout=60000&connTimeout=15000
[junit4:junit4]   2> 9507 T1179 oaz.ZooKeeper.<init> Initiating client connection, connectString=127.0.0.1:37189/solr sessionTimeout=30000 watcher=org.apache.solr.common.cloud.ConnectionManager@2202931f
[junit4:junit4]   2> 9508 T1179 oascc.ConnectionManager.waitForConnected Waiting for client to connect to ZooKeeper
[junit4:junit4]   2> 9508 T1250 oaz.ClientCnxn$SendThread.logStartConnect Opening socket connection to server localhost/127.0.0.1:37189. Will not attempt to authenticate using SASL (access denied (javax.security.auth.AuthPermission getLoginConfiguration))
[junit4:junit4]   2> 9509 T1250 oaz.ClientCnxn$SendThread.primeConnection Socket connection established to localhost/127.0.0.1:37189, initiating session
[junit4:junit4]   2> 9509 T1181 oazs.NIOServerCnxnFactory.run Accepted socket connection from /140.211.11.196:37215
[junit4:junit4]   2> 9510 T1181 oazs.ZooKeeperServer.processConnectRequest Client attempting to establish new session at /140.211.11.196:37215
[junit4:junit4]   2> 9511 T1183 oazs.ZooKeeperServer.finishSessionInit Established session 0x13c9c79b76a000a with negotiated timeout 20000 for client /140.211.11.196:37215
[junit4:junit4]   2> 9511 T1250 oaz.ClientCnxn$SendThread.onConnected Session establishment complete on server localhost/127.0.0.1:37189, sessionid = 0x13c9c79b76a000a, negotiated timeout = 20000
[junit4:junit4]   2> 9512 T1251 oascc.ConnectionManager.process Watcher org.apache.solr.common.cloud.ConnectionManager@2202931f name:ZooKeeperConnection Watcher:127.0.0.1:37189/solr got event WatchedEvent state:SyncConnected type:None path:null path:null type:None
[junit4:junit4]   2> 9512 T1179 oascc.ConnectionManager.waitForConnected Client is connected to ZooKeeper
[junit4:junit4]   2> 9513 T1184 oazs.PrepRequestProcessor.pRequest Got user-level KeeperException when processing sessionid:0x13c9c79b76a000a type:create cxid:0x1 zxid:0x7e txntype:-1 reqpath:n/a Error Path:/solr/overseer Error:KeeperErrorCode = NodeExists for /solr/overseer
[junit4:junit4]   2> 9515 T1184 oazs.PrepRequestProcessor.pRequest Got user-level KeeperException when processing sessionid:0x13c9c79b76a000a type:create cxid:0x2 zxid:0x7f txntype:-1 reqpath:n/a Error Path:/solr/overseer Error:KeeperErrorCode = NodeExists for /solr/overseer
[junit4:junit4]   2> 9522 T1179 oasc.ZkController.createEphemeralLiveNode Register node as live in ZooKeeper:/live_nodes/127.0.0.1:37212_i_d%2Fql
[junit4:junit4]   2> 9523 T1184 oazs.PrepRequestProcessor.pRequest Got user-level KeeperException when processing sessionid:0x13c9c79b76a000a type:delete cxid:0x4 zxid:0x80 txntype:-1 reqpath:n/a Error Path:/solr/live_nodes/127.0.0.1:37212_i_d%2Fql Error:KeeperErrorCode = NoNode for /solr/live_nodes/127.0.0.1:37212_i_d%2Fql
[junit4:junit4]   2> 9524 T1179 oascc.SolrZkClient.makePath makePath: /live_nodes/127.0.0.1:37212_i_d%2Fql
[junit4:junit4]   2> 9527 T1235 oascc.ZkStateReader$2.process A cluster state change: WatchedEvent state:SyncConnected type:NodeChildrenChanged path:/live_nodes, has occurred - updating... (live nodes size: 3)
[junit4:junit4]   2> 9528 T1207 oascc.ZkStateReader$2.process A cluster state change: WatchedEvent state:SyncConnected type:NodeChildrenChanged path:/live_nodes, has occurred - updating... (live nodes size: 3)
[junit4:junit4]   2> 9528 T1201 oascc.ZkStateReader$3.process Updating live nodes... (4)
[junit4:junit4]   2> 9528 T1220 oascc.ZkStateReader$3.process Updating live nodes... (4)
[junit4:junit4]   2> 9528 T1201 oascc.ZkStateReader$2.process A cluster state change: WatchedEvent state:SyncConnected type:NodeChildrenChanged path:/live_nodes, has occurred - updating... (live nodes size: 4)
[junit4:junit4]   2> 9529 T1220 oascc.ZkStateReader$2.process A cluster state change: WatchedEvent state:SyncConnected type:NodeChildrenChanged path:/live_nodes, has occurred - updating... (live nodes size: 4)
[junit4:junit4]   2> 9530 T1235 oascc.ZkStateReader$3.process Updating live nodes... (4)
[junit4:junit4]   2> 9532 T1207 oascc.ZkStateReader$3.process Updating live nodes... (4)
[junit4:junit4]   2> 9533 T1179 oascc.ZkStateReader.createClusterStateWatchersAndUpdate Updating cluster state from ZooKeeper... 
[junit4:junit4]   2> 9541 T1252 oasc.CoreContainer.create Creating SolrCore 'collection1' using instanceDir: /usr/home/hudson/hudson-slave/workspace/Lucene-Solr-Tests-4.x-Java6/solr/build/solr-core/test/J1/./org.apache.solr.cloud.SyncSliceTest-jetty3-1359834897243/collection1
[junit4:junit4]   2> 9541 T1252 oasc.ZkController.createCollectionZkNode Check for collection zkNode:collection1
[junit4:junit4]   2> 9542 T1252 oasc.ZkController.createCollectionZkNode Collection zkNode exists
[junit4:junit4]   2> 9542 T1252 oasc.ZkController.readConfigName Load collection config from:/collections/collection1
[junit4:junit4]   2> 9544 T1252 oasc.SolrResourceLoader.<init> new SolrResourceLoader for directory: '/usr/home/hudson/hudson-slave/workspace/Lucene-Solr-Tests-4.x-Java6/solr/build/solr-core/test/J1/./org.apache.solr.cloud.SyncSliceTest-jetty3-1359834897243/collection1/'
[junit4:junit4]   2> 9545 T1252 oasc.SolrResourceLoader.replaceClassLoader Adding 'file:/usr/home/hudson/hudson-slave/workspace/Lucene-Solr-Tests-4.x-Java6/solr/build/solr-core/test/J1/org.apache.solr.cloud.SyncSliceTest-jetty3-1359834897243/collection1/lib/README' to classloader
[junit4:junit4]   2> 9546 T1252 oasc.SolrResourceLoader.replaceClassLoader Adding 'file:/usr/home/hudson/hudson-slave/workspace/Lucene-Solr-Tests-4.x-Java6/solr/build/solr-core/test/J1/org.apache.solr.cloud.SyncSliceTest-jetty3-1359834897243/collection1/lib/classes/' to classloader
[junit4:junit4]   2> 9602 T1252 oasc.SolrConfig.<init> Using Lucene MatchVersion: LUCENE_42
[junit4:junit4]   2> 9682 T1252 oasc.SolrConfig.<init> Loaded SolrConfig: solrconfig.xml
[junit4:junit4]   2> 9783 T1252 oass.IndexSchema.readSchema Reading Solr Schema
[junit4:junit4]   2> 9789 T1252 oass.IndexSchema.readSchema Schema name=test
[junit4:junit4]   2> 9843 T1202 oascc.ZkStateReader.updateClusterState Updating cloud state from ZooKeeper... 
[junit4:junit4]   2> 9844 T1202 oasc.Overseer$ClusterStateUpdater.updateState Update state numShards=1 message={
[junit4:junit4]   2> 	  "operation":"state",
[junit4:junit4]   2> 	  "numShards":"1",
[junit4:junit4]   2> 	  "shard":"shard1",
[junit4:junit4]   2> 	  "roles":null,
[junit4:junit4]   2> 	  "state":"recovering",
[junit4:junit4]   2> 	  "core":"collection1",
[junit4:junit4]   2> 	  "collection":"collection1",
[junit4:junit4]   2> 	  "node_name":"127.0.0.1:37202_i_d%2Fql",
[junit4:junit4]   2> 	  "base_url":"http://127.0.0.1:37202/i_d/ql"}
[junit4:junit4]   2> 9859 T1201 oascc.ZkStateReader$2.process A cluster state change: WatchedEvent state:SyncConnected type:NodeDataChanged path:/clusterstate.json, has occurred - updating... (live nodes size: 4)
[junit4:junit4]   2> 9859 T1235 oascc.ZkStateReader$2.process A cluster state change: WatchedEvent state:SyncConnected type:NodeDataChanged path:/clusterstate.json, has occurred - updating... (live nodes size: 4)
[junit4:junit4]   2> 9859 T1207 oascc.ZkStateReader$2.process A cluster state change: WatchedEvent state:SyncConnected type:NodeDataChanged path:/clusterstate.json, has occurred - updating... (live nodes size: 4)
[junit4:junit4]   2> 9859 T1220 oascc.ZkStateReader$2.process A cluster state change: WatchedEvent state:SyncConnected type:NodeDataChanged path:/clusterstate.json, has occurred - updating... (live nodes size: 4)
[junit4:junit4]   2> 9859 T1251 oascc.ZkStateReader$2.process A cluster state change: WatchedEvent state:SyncConnected type:NodeDataChanged path:/clusterstate.json, has occurred - updating... (live nodes size: 4)
[junit4:junit4]   2> 10441 T1252 oass.OpenExchangeRatesOrgProvider.init Initialized with rates=open-exchange-rates.json, refreshInterval=1440.
[junit4:junit4]   2> 10452 T1252 oass.IndexSchema.readSchema default search field in schema is text
[junit4:junit4]   2> 10457 T1252 oass.IndexSchema.readSchema unique key field: id
[junit4:junit4]   2> 10478 T1252 oass.FileExchangeRateProvider.reload Reloading exchange rates from file currency.xml
[junit4:junit4]   2> 10484 T1252 oass.FileExchangeRateProvider.reload Reloading exchange rates from file currency.xml
[junit4:junit4]   2> 10489 T1252 oass.OpenExchangeRatesOrgProvider.reload Reloading exchange rates from open-exchange-rates.json
[junit4:junit4]   2> 10491 T1252 oass.OpenExchangeRatesOrgProvider.reload Reloading exchange rates from open-exchange-rates.json
[junit4:junit4]   2> 10493 T1252 oasc.SolrCore.<init> [collection1] Opening new SolrCore at /usr/home/hudson/hudson-slave/workspace/Lucene-Solr-Tests-4.x-Java6/solr/build/solr-core/test/J1/./org.apache.solr.cloud.SyncSliceTest-jetty3-1359834897243/collection1/, dataDir=./org.apache.solr.cloud.SyncSliceTest-1359834888038/jetty3/
[junit4:junit4]   2> 10493 T1252 oasc.JmxMonitoredMap.<init> JMX monitoring is enabled. Adding Solr mbeans to JMX Server: com.sun.jmx.mbeanserver.JmxMBeanServer@b478a2d
[junit4:junit4]   2> 10494 T1252 oasc.SolrCore.initDirectoryFactory solr.NRTCachingDirectoryFactory
[junit4:junit4]   2> 10495 T1252 oasc.CachingDirectoryFactory.get return new directory for /usr/home/hudson/hudson-slave/workspace/Lucene-Solr-Tests-4.x-Java6/solr/build/solr-core/test/J1/./org.apache.solr.cloud.SyncSliceTest-1359834888038/jetty3 forceNew:false
[junit4:junit4]   2> 10495 T1252 oasc.CachingDirectoryFactory.close Releasing directory:/usr/home/hudson/hudson-slave/workspace/Lucene-Solr-Tests-4.x-Java6/solr/build/solr-core/test/J1/./org.apache.solr.cloud.SyncSliceTest-1359834888038/jetty3
[junit4:junit4]   2> 10496 T1252 oasc.SolrCore.getNewIndexDir New index directory detected: old=null new=./org.apache.solr.cloud.SyncSliceTest-1359834888038/jetty3/index/
[junit4:junit4]   2> 10496 T1252 oasc.SolrCore.initIndex WARNING [collection1] Solr index directory './org.apache.solr.cloud.SyncSliceTest-1359834888038/jetty3/index' doesn't exist. Creating new index...
[junit4:junit4]   2> 10498 T1252 oasc.CachingDirectoryFactory.get return new directory for /usr/home/hudson/hudson-slave/workspace/Lucene-Solr-Tests-4.x-Java6/solr/build/solr-core/test/J1/./org.apache.solr.cloud.SyncSliceTest-1359834888038/jetty3/index forceNew:false
[junit4:junit4]   2> 10503 T1252 oasc.SolrDeletionPolicy.onCommit SolrDeletionPolicy.onCommit: commits:num=1
[junit4:junit4]   2> 		commit{dir=RateLimitedDirectoryWrapper(NRTCachingDirectory(org.apache.lucene.store.NIOFSDirectory@/usr/home/hudson/hudson-slave/workspace/Lucene-Solr-Tests-4.x-Java6/solr/build/solr-core/test/J1/org.apache.solr.cloud.SyncSliceTest-1359834888038/jetty3/index lockFactory=org.apache.lucene.store.NativeFSLockFactory@1557bfc5; maxCacheMB=48.0 maxMergeSizeMB=4.0)),segFN=segments_1,generation=1,filenames=[segments_1]
[junit4:junit4]   2> 10504 T1252 oasc.SolrDeletionPolicy.updateCommits newest commit = 1[segments_1]
[junit4:junit4]   2> 10505 T1252 oasc.CachingDirectoryFactory.close Releasing directory:/usr/home/hudson/hudson-slave/workspace/Lucene-Solr-Tests-4.x-Java6/solr/build/solr-core/test/J1/./org.apache.solr.cloud.SyncSliceTest-1359834888038/jetty3/index
[junit4:junit4]   2> 10505 T1252 oasc.SolrCore.initWriters created xml: solr.XMLResponseWriter
[junit4:junit4]   2> 10507 T1252 oasup.UpdateRequestProcessorChain.init inserting DistributedUpdateProcessorFactory into updateRequestProcessorChain "dedupe"
[junit4:junit4]   2> 10507 T1252 oasup.UpdateRequestProcessorChain.init inserting DistributedUpdateProcessorFactory into updateRequestProcessorChain "dedupe-allfields"
[junit4:junit4]   2> 10508 T1252 oasup.UpdateRequestProcessorChain.init inserting DistributedUpdateProcessorFactory into updateRequestProcessorChain "stored_sig"
[junit4:junit4]   2> 10508 T1252 oasup.UpdateRequestProcessorChain.init inserting DistributedUpdateProcessorFactory into updateRequestProcessorChain "uniq-fields"
[junit4:junit4]   2> 10509 T1252 oasup.UpdateRequestProcessorChain.init inserting DistributedUpdateProcessorFactory into updateRequestProcessorChain "distrib-dup-test-chain-implicit"
[junit4:junit4]   2> 10509 T1252 oasc.RequestHandlers.initHandlersFromConfig adding lazy requestHandler: solr.ReplicationHandler
[junit4:junit4]   2> 10509 T1252 oasc.RequestHandlers.initHandlersFromConfig created /replication: solr.ReplicationHandler
[junit4:junit4]   2> 10510 T1252 oasc.RequestHandlers.initHandlersFromConfig created standard: solr.StandardRequestHandler
[junit4:junit4]   2> 10510 T1252 oasc.RequestHandlers.initHandlersFromConfig created /get: solr.RealTimeGetHandler
[junit4:junit4]   2> 10511 T1252 oasc.RequestHandlers.initHandlersFromConfig created dismax: solr.SearchHandler
[junit4:junit4]   2> 10512 T1252 oasc.RequestHandlers.initHandlersFromConfig created mock: org.apache.solr.core.MockQuerySenderListenerReqHandler
[junit4:junit4]   2> 10512 T1252 oasc.RequestHandlers.initHandlersFromConfig created /admin/: org.apache.solr.handler.admin.AdminHandlers
[junit4:junit4]   2> 10513 T1252 oasc.RequestHandlers.initHandlersFromConfig created defaults: solr.StandardRequestHandler
[junit4:junit4]   2> 10513 T1252 oasc.RequestHandlers.initHandlersFromConfig adding lazy requestHandler: solr.StandardRequestHandler
[junit4:junit4]   2> 10513 T1252 oasc.RequestHandlers.initHandlersFromConfig created lazy: solr.StandardRequestHandler
[junit4:junit4]   2> 10514 T1252 oasc.RequestHandlers.initHandlersFromConfig created /update: solr.UpdateRequestHandler
[junit4:junit4]   2> 10514 T1252 oasc.RequestHandlers.initHandlersFromConfig created /terms: org.apache.solr.handler.component.SearchHandler
[junit4:junit4]   2> 10515 T1252 oasc.RequestHandlers.initHandlersFromConfig created spellCheckCompRH: org.apache.solr.handler.component.SearchHandler
[junit4:junit4]   2> 10515 T1252 oasc.RequestHandlers.initHandlersFromConfig created spellCheckCompRH_Direct: org.apache.solr.handler.component.SearchHandler
[junit4:junit4]   2> 10516 T1252 oasc.RequestHandlers.initHandlersFromConfig created spellCheckWithWordbreak: org.apache.solr.handler.component.SearchHandler
[junit4:junit4]   2> 10516 T1252 oasc.RequestHandlers.initHandlersFromConfig created spellCheckWithWordbreak_Direct: org.apache.solr.handler.component.SearchHandler
[junit4:junit4]   2> 10517 T1252 oasc.RequestHandlers.initHandlersFromConfig created spellCheckCompRH1: org.apache.solr.handler.component.SearchHandler
[junit4:junit4]   2> 10517 T1252 oasc.RequestHandlers.initHandlersFromConfig created mltrh: org.apache.solr.handler.component.SearchHandler
[junit4:junit4]   2> 10518 T1252 oasc.RequestHandlers.initHandlersFromConfig created tvrh: org.apache.solr.handler.component.SearchHandler
[junit4:junit4]   2> 10518 T1252 oasc.RequestHandlers.initHandlersFromConfig created /mlt: solr.MoreLikeThisHandler
[junit4:junit4]   2> 10519 T1252 oasc.RequestHandlers.initHandlersFromConfig created /debug/dump: solr.DumpRequestHandler
[junit4:junit4]   2> 10526 T1252 oashl.XMLLoader.init xsltCacheLifetimeSeconds=60
[junit4:junit4]   2> 10531 T1252 oasc.SolrCore.initDeprecatedSupport WARNING solrconfig.xml uses deprecated <admin/gettableFiles>, Please update your config to use the ShowFileRequestHandler.
[junit4:junit4]   2> 10532 T1252 oasc.SolrCore.initDeprecatedSupport WARNING adding ShowFileRequestHandler with hidden files: [SCHEMA.XML, OLD_SYNONYMS.TXT, STOPWORDS.TXT, PROTWORDS.TXT, OPEN-EXCHANGE-RATES.JSON, SYNONYMS.TXT, CURRENCY.XML, MAPPING-ISOLATIN1ACCENT.TXT]
[junit4:junit4]   2> 10534 T1252 oasc.CachingDirectoryFactory.close Releasing directory:/usr/home/hudson/hudson-slave/workspace/Lucene-Solr-Tests-4.x-Java6/solr/build/solr-core/test/J1/./org.apache.solr.cloud.SyncSliceTest-1359834888038/jetty3
[junit4:junit4]   2> 10536 T1252 oass.SolrIndexSearcher.<init> Opening Searcher@5578a413 main
[junit4:junit4]   2> 10537 T1252 oasu.CommitTracker.<init> Hard AutoCommit: disabled
[junit4:junit4]   2> 10537 T1252 oasu.CommitTracker.<init> Soft AutoCommit: disabled
[junit4:junit4]   2> 10538 T1252 oashc.SpellCheckComponent.inform Initializing spell checkers
[junit4:junit4]   2> 10545 T1252 oass.DirectSolrSpellChecker.init init: {name=direct,classname=DirectSolrSpellChecker,field=lowerfilt,minQueryLength=3}
[junit4:junit4]   2> 10595 T1253 oasc.SolrCore.registerSearcher [collection1] Registered new searcher Searcher@5578a413 main{StandardDirectoryReader(segments_1:1)}
[junit4:junit4]   2> 10600 T1252 oasc.ZkController.publish publishing core=collection1 state=down
[junit4:junit4]   2> 10600 T1252 oasc.ZkController.publish numShards not found on descriptor - reading it from system property
[junit4:junit4]   2> 11366 T1202 oascc.ZkStateReader.updateClusterState Updating cloud state from ZooKeeper... 
[junit4:junit4]   2> 11367 T1202 oasc.Overseer$ClusterStateUpdater.updateState Update state numShards=1 message={
[junit4:junit4]   2> 	  "operation":"state",
[junit4:junit4]   2> 	  "numShards":"1",
[junit4:junit4]   2> 	  "shard":null,
[junit4:junit4]   2> 	  "roles":null,
[junit4:junit4]   2> 	  "state":"down",
[junit4:junit4]   2> 	  "core":"collection1",
[junit4:junit4]   2> 	  "collection":"collection1",
[junit4:junit4]   2> 	  "node_name":"127.0.0.1:37212_i_d%2Fql",
[junit4:junit4]   2> 	  "base_url":"http://127.0.0.1:37212/i_d/ql"}
[junit4:junit4]   2> 11367 T1202 oasc.Overseer$ClusterStateUpdater.updateState Collection already exists with numShards=1
[junit4:junit4]   2> 11368 T1202 oasc.Overseer$ClusterStateUpdater.updateState Assigning new node to shard shard=shard1
[junit4:junit4]   2> 11381 T1235 oascc.ZkStateReader$2.process A cluster state change: WatchedEvent state:SyncConnected type:NodeDataChanged path:/clusterstate.json, has occurred - updating... (live nodes size: 4)
[junit4:junit4]   2> 11382 T1201 oascc.ZkStateReader$2.process A cluster state change: WatchedEvent state:SyncConnected type:NodeDataChanged path:/clusterstate.json, has occurred - updating... (live nodes size: 4)
[junit4:junit4]   2> 11382 T1220 oascc.ZkStateReader$2.process A cluster state change: WatchedEvent state:SyncConnected type:NodeDataChanged path:/clusterstate.json, has occurred - updating... (live nodes size: 4)
[junit4:junit4]   2> 11382 T1207 oascc.ZkStateReader$2.process A cluster state change: WatchedEvent state:SyncConnected type:NodeDataChanged path:/clusterstate.json, has occurred - updating... (live nodes size: 4)
[junit4:junit4]   2> 11382 T1251 oascc.ZkStateReader$2.process A cluster state change: WatchedEvent state:SyncConnected type:NodeDataChanged path:/clusterstate.json, has occurred - updating... (live nodes size: 4)
[junit4:junit4]   2> 11603 T1252 oasc.CoreContainer.registerCore registering core: collection1
[junit4:junit4]   2> 11603 T1252 oasc.ZkController.register Register replica - core:collection1 address:http://127.0.0.1:37212/i_d/ql collection:collection1 shard:shard1
[junit4:junit4]   2> 11608 T1252 oasc.ZkController.register We are http://127.0.0.1:37212/i_d/ql/collection1/ and leader is http://127.0.0.1:37198/i_d/ql/collection1/
[junit4:junit4]   2> 11608 T1252 oasc.ZkController.register No LogReplay needed for core=collection1 baseURL=http://127.0.0.1:37212/i_d/ql
[junit4:junit4]   2> 11609 T1252 oasc.ZkController.checkRecovery Core needs to recover:collection1
[junit4:junit4]   2> 11609 T1252 oasu.DefaultSolrCoreState.doRecovery Running recovery - first canceling any ongoing recovery
[junit4:junit4]   2> ASYNC  NEW_CORE C106 name=collection1 org.apache.solr.core.SolrCore@3e88262b url=http://127.0.0.1:37212/i_d/ql/collection1 node=127.0.0.1:37212_i_d%2Fql C106_STATE=coll:collection1 core:collection1 props:{shard=null, roles=null, state=down, core=collection1, collection=collection1, node_name=127.0.0.1:37212_i_d%2Fql, base_url=http://127.0.0.1:37212/i_d/ql}
[junit4:junit4]   2> 11609 T1254 C106 P37212 oasc.RecoveryStrategy.run Starting recovery process.  core=collection1 recoveringAfterStartup=true
[junit4:junit4]   2> 11610 T1254 C106 P37212 oasc.RecoveryStrategy.doRecovery ###### startupVersions=[]
[junit4:junit4]   2> 11611 T1254 C106 P37212 oasc.ZkController.publish publishing core=collection1 state=recovering
[junit4:junit4]   2> 11611 T1252 oascc.ZkStateReader.updateClusterState Updating cloud state from ZooKeeper... 
[junit4:junit4]   2> 11611 T1254 C106 P37212 oasc.ZkController.publish numShards not found on descriptor - reading it from system property
[junit4:junit4]   2> 11612 T1179 oass.SolrDispatchFilter.init user.dir=/usr/home/hudson/hudson-slave/workspace/Lucene-Solr-Tests-4.x-Java6/solr/build/solr-core/test/J1
[junit4:junit4]   2> 11612 T1254 C106 P37212 oascsi.HttpClientUtil.createClient Creating new http client, config:maxConnections=128&maxConnectionsPerHost=32&followRedirects=false
[junit4:junit4]   2> 11612 T1179 oass.SolrDispatchFilter.init SolrDispatchFilter.init() done
[junit4:junit4]   2> 11613 T1179 oascsi.HttpClientUtil.createClient Creating new http client, config:maxConnections=128&maxConnectionsPerHost=32&followRedirects=false
[junit4:junit4]   2> 11793 T1179 oejs.Server.doStart jetty-8.1.8.v20121106
[junit4:junit4]   2> 11796 T1179 oejs.AbstractConnector.doStart Started SocketConnector@127.0.0.1:37217
[junit4:junit4]   2> 11797 T1179 oass.SolrDispatchFilter.init SolrDispatchFilter.init()
[junit4:junit4]   2> 11798 T1179 oasc.SolrResourceLoader.locateSolrHome JNDI not configured for solr (NoInitialContextEx)
[junit4:junit4]   2> 11798 T1179 oasc.SolrResourceLoader.locateSolrHome using system property solr.solr.home: /usr/home/hudson/hudson-slave/workspace/Lucene-Solr-Tests-4.x-Java6/solr/build/solr-core/test/J1/./org.apache.solr.cloud.SyncSliceTest-jetty4-1359834899661
[junit4:junit4]   2> 11798 T1179 oasc.CoreContainer$Initializer.initialize looking for solr.xml: /usr/home/hudson/hudson-slave/workspace/Lucene-Solr-Tests-4.x-Java6/solr/build/solr-core/test/J1/./org.apache.solr.cloud.SyncSliceTest-jetty4-1359834899661/solr.xml
[junit4:junit4]   2> 11799 T1179 oasc.CoreContainer.<init> New CoreContainer 1298734311
[junit4:junit4]   2> 11800 T1179 oasc.CoreContainer.load Loading CoreContainer using Solr Home: '/usr/home/hudson/hudson-slave/workspace/Lucene-Solr-Tests-4.x-Java6/solr/build/solr-core/test/J1/./org.apache.solr.cloud.SyncSliceTest-jetty4-1359834899661/'
[junit4:junit4]   2> 11800 T1179 oasc.SolrResourceLoader.<init> new SolrResourceLoader for directory: '/usr/home/hudson/hudson-slave/workspace/Lucene-Solr-Tests-4.x-Java6/solr/build/solr-core/test/J1/./org.apache.solr.cloud.SyncSliceTest-jetty4-1359834899661/'
[junit4:junit4]   2> 11843 T1179 oashc.HttpShardHandlerFactory.getParameter Setting socketTimeout to: 60000
[junit4:junit4]   2> 11843 T1179 oashc.HttpShardHandlerFactory.getParameter Setting urlScheme to: http://
[junit4:junit4]   2> 11844 T1179 oashc.HttpShardHandlerFactory.getParameter Setting connTimeout to: 15000
[junit4:junit4]   2> 11844 T1179 oashc.HttpShardHandlerFactory.getParameter Setting maxConnectionsPerHost to: 20
[junit4:junit4]   2> 11845 T1179 oashc.HttpShardHandlerFactory.getParameter Setting corePoolSize to: 0
[junit4:junit4]   2> 11845 T1179 oashc.HttpShardHandlerFactory.getParameter Setting maximumPoolSize to: 2147483647
[junit4:junit4]   2> 11846 T1179 oashc.HttpShardHandlerFactory.getParameter Setting maxThreadIdleTime to: 5
[junit4:junit4]   2> 11846 T1179 oashc.HttpShardHandlerFactory.getParameter Setting sizeOfQueue to: -1
[junit4:junit4]   2> 11846 T1179 oashc.HttpShardHandlerFactory.getParameter Setting fairnessPolicy to: false
[junit4:junit4]   2> 11847 T1179 oascsi.HttpClientUtil.createClient Creating new http client, config:maxConnectionsPerHost=20&maxConnections=10000&socketTimeout=60000&connTimeout=15000&retry=false
[junit4:junit4]   2> 11866 T1179 oasc.CoreContainer.load Registering Log Listener
[junit4:junit4]   2> 11884 T1179 oasc.CoreContainer.initZooKeeper Zookeeper client=127.0.0.1:37189/solr
[junit4:junit4]   2> 11885 T1179 oasc.ZkController.checkChrootPath zkHost includes chroot
[junit4:junit4]   2> 11886 T1179 oaz.ZooKeeper.<init> Initiating client connection, connectString=127.0.0.1:37189 sessionTimeout=60000 watcher=org.apache.solr.common.cloud.ConnectionManager@53c93e75
[junit4:junit4]   2> 11887 T1179 oascc.ConnectionManager.waitForConnected Waiting for client to connect to ZooKeeper
[junit4:junit4]   2> 11887 T1264 oaz.ClientCnxn$SendThread.logStartConnect Opening socket connection to server localhost/127.0.0.1:37189. Will not attempt to authenticate using SASL (access denied (javax.security.auth.AuthPermission getLoginConfiguration))
[junit4:junit4]   2> 11888 T1264 oaz.ClientCnxn$SendThread.primeConnection Socket connection established to localhost/127.0.0.1:37189, initiating session
[junit4:junit4]   2> 11888 T1181 oazs.NIOServerCnxnFactory.run Accepted socket connection from /140.211.11.196:37218
[junit4:junit4]   2> 11889 T1181 oazs.ZooKeeperServer.processConnectRequest Client attempting to establish new session at /140.211.11.196:37218
[junit4:junit4]   2> 11890 T1183 oazs.ZooKeeperServer.finishSessionInit Established session 0x13c9c79b76a000b with negotiated timeout 20000 for client /140.211.11.196:37218
[junit4:junit4]   2> 11890 T1264 oaz.ClientCnxn$SendThread.onConnected Session establishment complete on server localhost/127.0.0.1:37189, sessionid = 0x13c9c79b76a000b, negotiated timeout = 20000
[junit4:junit4]   2> 11891 T1265 oascc.ConnectionManager.process Watcher org.apache.solr.common.cloud.ConnectionManager@53c93e75 name:ZooKeeperConnection Watcher:127.0.0.1:37189 got event WatchedEvent state:SyncConnected type:None path:null path:null type:None
[junit4:junit4]   2> 11891 T1179 oascc.ConnectionManager.waitForConnected Client is connected to ZooKeeper
[junit4:junit4]   2> 11893 T1184 oazs.PrepRequestProcessor.pRequest2Txn Processed session termination for sessionid: 0x13c9c79b76a000b
[junit4:junit4]   2> 11916 T1265 oaz.ClientCnxn$EventThread.run EventThread shut down
[junit4:junit4]   2> 11916 T1181 oazs.NIOServerCnxn.closeSock Closed socket connection for client /140.211.11.196:37218 which had sessionid 0x13c9c79b76a000b
[junit4:junit4]   2> 11916 T1179 oaz.ZooKeeper.close Session: 0x13c9c79b76a000b closed
[junit4:junit4]   2> 11917 T1179 oascsi.HttpClientUtil.createClient Creating new http client, config:maxConnections=500&maxConnectionsPerHost=16&socketTimeout=60000&connTimeout=15000
[junit4:junit4]   2> 11926 T1179 oaz.ZooKeeper.<init> Initiating client connection, connectString=127.0.0.1:37189/solr sessionTimeout=30000 watcher=org.apache.solr.common.cloud.ConnectionManager@484e20a1
[junit4:junit4]   2> 11927 T1179 oascc.ConnectionManager.waitForConnected Waiting for client to connect to ZooKeeper
[junit4:junit4]   2> 11927 T1266 oaz.ClientCnxn$SendThread.logStartConnect Opening socket connection to server localhost/127.0.0.1:37189. Will not attempt to authenticate using SASL (access denied (javax.security.auth.AuthPermission getLoginConfiguration))
[junit4:junit4]   2> 11928 T1266 oaz.ClientCnxn$SendThread.primeConnection Socket connection established to localhost/127.0.0.1:37189, initiating session
[junit4:junit4]   2> 11928 T1181 oazs.NIOServerCnxnFactory.run Accepted socket connection from /140.211.11.196:37219
[junit4:junit4]   2> 11929 T1181 oazs.ZooKeeperServer.processConnectRequest Client attempting to establish new session at /140.211.11.196:37219
[junit4:junit4]   2> 11930 T1183 oazs.ZooKeeperServer.finishSessionInit Established session 0x13c9c79b76a000c with negotiated timeout 20000 for client /140.211.11.196:37219
[junit4:junit4]   2> 11930 T1266 oaz.ClientCnxn$SendThread.onConnected Session establishment complete on server localhost/127.0.0.1:37189, sessionid = 0x13c9c79b76a000c, negotiated timeout = 20000
[junit4:junit4]   2> 11930 T1267 oascc.ConnectionManager.process Watcher org.apache.solr.common.cloud.ConnectionManager@484e20a1 name:ZooKeeperConnection Watcher:127.0.0.1:37189/solr got event WatchedEvent state:SyncConnected type:None path:null path:null type:None
[junit4:junit4]   2> 11930 T1179 oascc.ConnectionManager.waitForConnected Client is connected to ZooKeeper
[junit4:junit4]   2> 11932 T1184 oazs.PrepRequestProcessor.pRequest Got user-level KeeperException when processing sessionid:0x13c9c79b76a000c type:create cxid:0x1 zxid:0x91 txntype:-1 reqpath:n/a Error Path:/solr/overseer Error:KeeperErrorCode = NodeExists for /solr/overseer
[junit4:junit4]   2> 11933 T1184 oazs.PrepRequestProcessor.pRequest Got user-level KeeperException when processing sessionid:0x13c9c79b76a000c type:create cxid:0x2 zxid:0x92 txntype:-1 reqpath:n/a Error Path:/solr/overseer Error:KeeperErrorCode = NodeExists for /solr/overseer
[junit4:junit4]   2> 11964 T1179 oasc.ZkController.createEphemeralLiveNode Register node as live in ZooKeeper:/live_nodes/127.0.0.1:37217_i_d%2Fql
[junit4:junit4]   2> 11965 T1184 oazs.PrepRequestProcessor.pRequest Got user-level KeeperException when processing sessionid:0x13c9c79b76a000c type:delete cxid:0x4 zxid:0x93 txntype:-1 reqpath:n/a Error Path:/solr/live_nodes/127.0.0.1:37217_i_d%2Fql Error:KeeperErrorCode = NoNode for /solr/live_nodes/127.0.0.1:37217_i_d%2Fql
[junit4:junit4]   2> 11966 T1179 oascc.SolrZkClient.makePath makePath: /live_nodes/127.0.0.1:37217_i_d%2Fql
[junit4:junit4]   2> 11969 T1251 oascc.ZkStateReader$2.process A cluster state change: WatchedEvent state:SyncConnected type:NodeChildrenChanged path:/live_nodes, has occurred - updating... (live nodes size: 4)
[junit4:junit4]   2> 11969 T1235 oascc.ZkStateReader$2.process A cluster state change: WatchedEvent state:SyncConnected type:NodeChildrenChanged path:/live_nodes, has occurred - updating... (live nodes size: 4)
[junit4:junit4]   2> 11969 T1207 oascc.ZkStateReader$2.process A cluster state change: WatchedEvent state:SyncConnected type:NodeChildrenChanged path:/live_nodes, has occurred - updating... (live nodes size: 4)
[junit4:junit4]   2> 11970 T1201 oascc.ZkStateReader$3.process Updating live nodes... (5)
[junit4:junit4]   2> 11970 T1220 oascc.ZkStateReader$3.process Updating live nodes... (5)
[junit4:junit4]   2> 11970 T1201 oascc.ZkStateReader$2.process A cluster state change: WatchedEvent state:SyncConnected type:NodeChildrenChanged path:/live_nodes, has occurred - updating... (live nodes size: 5)
[junit4:junit4]   2> 11970 T1220 oascc.ZkStateReader$2.process A cluster state change: WatchedEvent state:SyncConnected type:NodeChildrenChanged path:/live_nodes, has occurred - updating... (live nodes size: 5)
[junit4:junit4]   2> 11972 T1251 oascc.ZkStateReader$3.process Updating live nodes... (5)
[junit4:junit4]   2> 11972 T1235 oascc.ZkStateReader$3.process Updating live nodes... (5)
[junit4:junit4]   2> 11973 T1207 oascc.ZkStateReader$3.process Updating live nodes... (5)
[junit4:junit4]   2> 11975 T1179 oascc.ZkStateReader.createClusterStateWatchersAndUpdate Updating cluster state from ZooKeeper... 
[junit4:junit4]   2> 11982 T1268 oasc.CoreContainer.create Creating SolrCore 'collection1' using instanceDir: /usr/home/hudson/hudson-slave/workspace/Lucene-Solr-Tests-4.x-Java6/solr/build/solr-core/test/J1/./org.apache.solr.cloud.SyncSliceTest-jetty4-1359834899661/collection1
[junit4:junit4]   2> 11982 T1268 oasc.ZkController.createCollectionZkNode Check for collection zkNode:collection1
[junit4:junit4]   2> 11983 T1268 oasc.ZkController.createCollectionZkNode Collection zkNode exists
[junit4:junit4]   2> 11984 T1268 oasc.ZkController.readConfigName Load collection config from:/collections/collection1
[junit4:junit4]   2> 11985 T1268 oasc.SolrResourceLoader.<init> new SolrResourceLoader for directory: '/usr/home/hudson/hudson-slave/workspace/Lucene-Solr-Tests-4.x-Java6/solr/build/solr-core/test/J1/./org.apache.solr.cloud.SyncSliceTest-jetty4-1359834899661/collection1/'
[junit4:junit4]   2> 11986 T1268 oasc.SolrResourceLoader.replaceClassLoader Adding 'file:/usr/home/hudson/hudson-slave/workspace/Lucene-Solr-Tests-4.x-Java6/solr/build/solr-core/test/J1/org.apache.solr.cloud.SyncSliceTest-jetty4-1359834899661/collection1/lib/classes/' to classloader
[junit4:junit4]   2> 11987 T1268 oasc.SolrResourceLoader.replaceClassLoader Adding 'file:/usr/home/hudson/hudson-slave/workspace/Lucene-Solr-Tests-4.x-Java6/solr/build/solr-core/test/J1/org.apache.solr.cloud.SyncSliceTest-jetty4-1359834899661/collection1/lib/README' to classloader
[junit4:junit4]   2> 12039 T1268 oasc.SolrConfig.<init> Using Lucene MatchVersion: LUCENE_42
[junit4:junit4]   2> 12112 T1268 oasc.SolrConfig.<init> Loaded SolrConfig: solrconfig.xml
[junit4:junit4]   2>  C105_STATE=coll:collection1 core:collection1 props:{shard=shard1, roles=null, state=recovering, core=collection1, collection=collection1, node_name=127.0.0.1:37202_i_d%2Fql, base_url=http://127.0.0.1:37202/i_d/ql}
[junit4:junit4]   2> 12213 T1238 C105 P37202 oasc.RecoveryStrategy.doRecovery Attempting to PeerSync from http://127.0.0.1:37198/i_d/ql/collection1/ core=collection1 - recoveringAfterStartup=true
[junit4:junit4]   2> 12213 T1268 oass.IndexSchema.readSchema Reading Solr Schema
[junit4:junit4]   2> 12213 T1238 C105 P37202 oasu.PeerSync.sync PeerSync: core=collection1 url=http://127.0.0.1:37202/i_d/ql START replicas=[http://127.0.0.1:37198/i_d/ql/collection1/] nUpdates=100
[junit4:junit4]   2> 12214 T1238 C105 P37202 oasu.PeerSync.sync WARNING no frame of reference to tell of we've missed updates
[junit4:junit4]   2> 12215 T1238 C105 P37202 oasc.RecoveryStrategy.doRecovery PeerSync Recovery was not successful - trying replication. core=collection1
[junit4:junit4]   2> 12215 T1238 C105 P37202 oasc.RecoveryStrategy.doRecovery Starting Replication Recovery. core=collection1
[junit4:junit4]   2> 12215 T1238 C105 P37202 oasc.RecoveryStrategy.doRecovery Begin buffering updates. core=collection1
[junit4:junit4]   2> 12215 T1238 C105 P37202 oasu.UpdateLog.bufferUpdates Starting to buffer updates. FSUpdateLog{state=ACTIVE, tlog=null}
[junit4:junit4]   2> 12215 T1238 C105 P37202 oasc.RecoveryStrategy.replicate Attempting to replicate from http://127.0.0.1:37198/i_d/ql/collection1/. core=collection1
[junit4:junit4]   2> 12216 T1238 C105 P37202 oascsi.HttpClientUtil.createClient Creating new http client, config:maxConnections=128&maxConnectionsPerHost=32&followRedirects=false
[junit4:junit4]   2> 12220 T1268 oass.IndexSchema.readSchema Schema name=test
[junit4:junit4]   2> ASYNC  NEW_CORE C107 name=collection1 org.apache.solr.core.SolrCore@7cfee4d3 url=http://127.0.0.1:37198/i_d/ql/collection1 node=127.0.0.1:37198_i_d%2Fql C107_STATE=coll:collection1 core:collection1 props:{shard=shard1, roles=null, state=active, core=collection1, collection=collection1, node_name=127.0.0.1:37198_i_d%2Fql, base_url=http://127.0.0.1:37198/i_d/ql, leader=true}
[junit4:junit4]   2> 12223 T1212 C107 P37198 REQ /get {getVersions=100&distrib=false&wt=javabin&qt=/get&version=2} status=0 QTime=0 
[junit4:junit4]   2> 12231 T1213 C107 P37198 oasu.DirectUpdateHandler2.commit start commit{,optimize=false,openSearcher=false,waitSearcher=true,expungeDeletes=false,softCommit=false}
[junit4:junit4]   2> 12233 T1213 C107 P37198 oasc.CachingDirectoryFactory.close Releasing directory:/usr/home/hudson/hudson-slave/workspace/Lucene-Solr-Tests-4.x-Java6/solr/build/solr-core/test/J1/./org.apache.solr.cloud.SyncSliceTest-1359834888038/jetty1
[junit4:junit4]   2> 12237 T1213 C107 P37198 oasc.SolrDeletionPolicy.onInit SolrDeletionPolicy.onInit: commits:num=1
[junit4:junit4]   2> 		commit{dir=RateLimitedDirectoryWrapper(NRTCachingDirectory(org.apache.lucene.store.NIOFSDirectory@/usr/home/hudson/hudson-slave/workspace/Lucene-Solr-Tests-4.x-Java6/solr/build/solr-core/test/J1/org.apache.solr.cloud.SyncSliceTest-1359834888038/jetty1/index lockFactory=org.apache.lucene.store.NativeFSLockFactory@628c5fdf; maxCacheMB=48.0 maxMergeSizeMB=4.0)),segFN=segments_1,generation=1,filenames=[segments_1]
[junit4:junit4]   2> 12238 T1213 C107 P37198 oasc.SolrDeletionPolicy.updateCommits newest commit = 1[segments_1]
[junit4:junit4]   2> 12245 T1213 C107 P37198 oasc.SolrDeletionPolicy.onCommit SolrDeletionPolicy.onCommit: commits:num=2
[junit4:junit4]   2> 		commit{dir=RateLimitedDirectoryWrapper(NRTCachingDirectory(org.apache.lucene.store.NIOFSDirectory@/usr/home/hudson/hudson-slave/workspace/Lucene-Solr-Tests-4.x-Java6/solr/build/solr-core/test/J1/org.apache.solr.cloud.SyncSliceTest-1359834888038/jetty1/index lockFactory=org.apache.lucene.store.NativeFSLockFactory@628c5fdf; maxCacheMB=48.0 maxMergeSizeMB=4.0)),segFN=segments_1,generation=1,filenames=[segments_1]
[junit4:junit4]   2> 		commit{dir=RateLimitedDirectoryWrapper(NRTCachingDirectory(org.apache.lucene.store.NIOFSDirectory@/usr/home/hudson/hudson-slave/workspace/Lucene-Solr-Tests-4.x-Java6/solr/build/solr-core/test/J1/org.apache.solr.cloud.SyncSliceTest-1359834888038/jetty1/index lockFactory=org.apache.lucene.store.NativeFSLockFactory@628c5fdf; maxCacheMB=48.0 maxMergeSizeMB=4.0)),segFN=segments_2,generation=2,filenames=[segments_2]
[junit4:junit4]   2> 12246 T1213 C107 P37198 oasc.SolrDeletionPolicy.updateCommits newest commit = 2[segments_2]
[junit4:junit4]   2> 12247 T1213 C107 P37198 oasc.CachingDirectoryFactory.close Releasing directory:/usr/home/hudson/hudson-slave/workspace/Lucene-Solr-Tests-4.x-Java6/solr/build/solr-core/test/J1/./org.apache.solr.cloud.SyncSliceTest-1359834888038/jetty1
[junit4:junit4]   2> 12248 T1213 C107 P37198 oass.SolrIndexSearcher.<init> Opening Searcher@40d9be9f realtime
[junit4:junit4]   2> 12248 T1213 C107 P37198 oasu.DirectUpdateHandler2.commit end_commit_flush
[junit4:junit4]   2> 12249 T1213 C107 P37198 /update {waitSearcher=true&openSearcher=false&commit=true&wt=javabin&commit_end_point=true&version=2&softCommit=false} {commit=} 0 18
[junit4:junit4]   2> 12250 T1238 C105 P37202 oash.ReplicationHandler.inform Commits will be reserved for  10000
[junit4:junit4]   2> 12250 T1238 C105 P37202 oash.SnapPuller.<init>  No value set for 'pollInterval'. Timer Task not started.
[junit4:junit4]   2> 12252 T1214 C107 P37198 oash.ReplicationHandler.inform Commits will be reserved for  10000
[junit4:junit4]   2> 12252 T1214 C107 P37198 REQ /replication {command=indexversion&qt=/replication&wt=javabin&version=2} status=0 QTime=1 
[junit4:junit4]   2> 12253 T1238 C105 P37202 oash.SnapPuller.fetchLatestIndex Master's generation: 2
[junit4:junit4]   2> 12253 T1238 C105 P37202 oash.SnapPuller.fetchLatestIndex Slave's generation: 1
[junit4:junit4]   2> 12253 T1238 C105 P37202 oash.SnapPuller.fetchLatestIndex Starting replication process
[junit4:junit4]   2> 12255 T1214 C107 P37198 oasc.CachingDirectoryFactory.close Releasing directory:/usr/home/hudson/hudson-slave/workspace/Lucene-Solr-Tests-4.x-Java6/solr/build/solr-core/test/J1/./org.apache.solr.cloud.SyncSliceTest-1359834888038/jetty1
[junit4:junit4]   2> 12256 T1214 C107 P37198 oasc.CachingDirectoryFactory.close Releasing directory:/usr/home/hudson/hudson-slave/workspace/Lucene-Solr-Tests-4.x-Java6/solr/build/solr-core/test/J1/./org.apache.solr.cloud.SyncSliceTest-1359834888038/jetty1/index
[junit4:junit4]   2> 12256 T1214 C107 P37198 REQ /replication {command=filelist&qt=/replication&wt=javabin&generation=2&version=2} status=0 QTime=1 
[junit4:junit4]   2> 12257 T1238 C105 P37202 oash.SnapPuller.fetchLatestIndex Number of files in latest index in master: 1
[junit4:junit4]   2> 12258 T1238 C105 P37202 oasc.CachingDirectoryFactory.get return new directory for /usr/home/hudson/hudson-slave/workspace/Lucene-Solr-Tests-4.x-Java6/solr/build/solr-core/test/J1/./org.apache.solr.cloud.SyncSliceTest-1359834888038/jetty2/index.20130202225500291 forceNew:false
[junit4:junit4]   2> 12259 T1238 C105 P37202 oasc.CachingDirectoryFactory.close Releasing directory:/usr/home/hudson/hudson-slave/workspace/Lucene-Solr-Tests-4.x-Java6/solr/build/solr-core/test/J1/./org.apache.solr.cloud.SyncSliceTest-1359834888038/jetty2
[junit4:junit4]   2> 12260 T1238 C105 P37202 oash.SnapPuller.fetchLatestIndex Starting download to RateLimitedDirectoryWrapper(NRTCachingDirectory(org.apache.lucene.store.NIOFSDirectory@/usr/home/hudson/hudson-slave/workspace/Lucene-Solr-Tests-4.x-Java6/solr/build/solr-core/test/J1/org.apache.solr.cloud.SyncSliceTest-1359834888038/jetty2/index.20130202225500291 lockFactory=org.apache.lucene.store.NativeFSLockFactory@3400641d; maxCacheMB=48.0 maxMergeSizeMB=4.0)) fullCopy=true
[junit4:junit4]   2> 12263 T1214 C107 P37198 REQ /replication {file=segments_2&command=filecontent&checksum=true&wt=filestream&qt=/replication&generation=2} status=0 QTime=0 
[junit4:junit4]   2> 12264 T1238 C105 P37202 oasc.CachingDirectoryFactory.close Releasing directory:/usr/home/hudson/hudson-slave/workspace/Lucene-Solr-Tests-4.x-Java6/solr/build/solr-core/test/J1/./org.apache.solr.cloud.SyncSliceTest-1359834888038/jetty2/index
[junit4:junit4]   2> 12265 T1238 C105 P37202 oash.SnapPuller.fetchLatestIndex Total time taken for download : 0 secs
[junit4:junit4]   2> 12265 T1238 C105 P37202 oash.SnapPuller.modifyIndexProps New index installed. Updating index properties... index=index.20130202225500291
[junit4:junit4]   2> 12267 T1238 C105 P37202 oasc.CachingDirectoryFactory.close Releasing directory:/usr/home/hudson/hudson-slave/workspace/Lucene-Solr-Tests-4.x-Java6/solr/build/solr-core/test/J1/./org.apache.solr.cloud.SyncSliceTest-1359834888038/jetty2
[junit4:junit4]   2> 12267 T1238 C105 P37202 oasc.CachingDirectoryFactory.close Releasing directory:/usr/home/hudson/hudson-slave/workspace/Lucene-Solr-Tests-4.x-Java6/solr/build/solr-core/test/J1/./org.apache.solr.cloud.SyncSliceTest-1359834888038/jetty2
[junit4:junit4]   2> 12268 T1238 C105 P37202 oasc.SolrCore.getNewIndexDir New index directory detected: old=./org.apache.solr.cloud.SyncSliceTest-1359834888038/jetty2/index/ new=./org.apache.solr.cloud.SyncSliceTest-1359834888038/jetty2/index.20130202225500291
[junit4:junit4]   2> 12271 T1238 C105 P37202 oasc.SolrDeletionPolicy.onInit SolrDeletionPolicy.onInit: commits:num=1
[junit4:junit4]   2> 		commit{dir=RateLimitedDirectoryWrapper(NRTCachingDirectory(org.apache.lucene.store.NIOFSDirectory@/usr/home/hudson/hudson-slave/workspace/Lucene-Solr-Tests-4.x-Java6/solr/build/solr-core/test/J1/org.apache.solr.cloud.SyncSliceTest-1359834888038/jetty2/index.20130202225500291 lockFactory=org.apache.lucene.store.NativeFSLockFactory@3400641d; maxCacheMB=48.0 maxMergeSizeMB=4.0)),segFN=segments_2,generation=2,filenames=[segments_2]
[junit4:junit4]   2> 12272 T1238 C105 P37202 oasc.SolrDeletionPolicy.updateCommits newest commit = 2[segments_2]
[junit4:junit4]   2> 12273 T1238 C105 P37202 oasc.CachingDirectoryFactory.close Releasing directory:/usr/home/hudson/hudson-slave/workspace/Lucene-Solr-Tests-4.x-Java6/solr/build/solr-core/test/J1/./org.apache.solr.cloud.SyncSliceTest-1359834888038/jetty2
[junit4:junit4]   2> 12274 T1238 C105 P37202 oasu.DefaultSolrCoreState.newIndexWriter Creating new IndexWriter...
[junit4:junit4]   2> 12274 T1238 C105 P37202 oasu.DefaultSolrCoreState.newIndexWriter Waiting until IndexWriter is unused... core=collection1
[junit4:junit4]   2> 12274 T1238 C105 P37202 oasu.DefaultSolrCoreState.newIndexWriter Rollback old IndexWriter... core=collection1
[junit4:junit4]   2> 12275 T1238 C105 P37202 oasc.CachingDirectoryFactory.close Releasing directory:/usr/home/hudson/hudson-slave/workspace/Lucene-Solr-Tests-4.x-Java6/solr/build/solr-core/test/J1/./org.apache.solr.cloud.SyncSliceTest-1359834888038/jetty2/index.20130202225500291
[junit4:junit4]   2> 12276 T1238 C105 P37202 oasc.CachingDirectoryFactory.close Releasing directory:/usr/home/hudson/hudson-slave/workspace/Lucene-Solr-Tests-4.x-Java6/solr/build/solr-core/test/J1/./org.apache.solr.cloud.SyncSliceTest-1359834888038/jetty2
[junit4:junit4]   2> 12280 T1238 C105 P37202 oasc.SolrDeletionPolicy.onInit SolrDeletionPolicy.onInit: commits:num=1
[junit4:junit4]   2> 		commit{dir=RateLimitedDirectoryWrapper(NRTCachingDirectory(org.apache.lucene.store.NIOFSDirectory@/usr/home/hudson/hudson-slave/workspace/Lucene-Solr-Tests-4.x-Java6/solr/build/solr-core/test/J1/org.apache.solr.cloud.SyncSliceTest-1359834888038/jetty2/index.20130202225500291 lockFactory=org.apache.lucene.store.NativeFSLockFactory@3400641d; maxCacheMB=48.0 maxMergeSizeMB=4.0)),segFN=segments_2,generation=2,filenames=[segments_2]
[junit4:junit4]   2> 12280 T1238 C105 P37202 oasc.SolrDeletionPolicy.updateCommits newest commit = 2[segments_2]
[junit4:junit4]   2> 12280 T1238 C105 P37202 oasu.DefaultSolrCoreState.newIndexWriter New IndexWriter is ready to be used.
[junit4:junit4]   2> 12281 T1238 C105 P37202 oasc.CachingDirectoryFactory.close Releasing directory:/usr/home/hudson/hudson-slave/workspace/Lucene-Solr-Tests-4.x-Java6/solr/build/solr-core/test/J1/./org.apache.solr.cloud.SyncSliceTest-1359834888038/jetty2
[junit4:junit4]   2> 12281 T1238 C105 P37202 oass.SolrIndexSearcher.<init> Opening Searcher@2904f99d main
[junit4:junit4]   2> 12284 T1237 oasc.SolrCore.registerSearcher [collection1] Registered new searcher Searcher@2904f99d main{StandardDirectoryReader(segments_2:1:nrt)}
[junit4:junit4]   2> 12284 T1237 oasc.CachingDirectoryFactory.close Releasing directory:/usr/home/hudson/hudson-slave/workspace/Lucene-Solr-Tests-4.x-Java6/solr/build/solr-core/test/J1/./org.apache.solr.cloud.SyncSliceTest-1359834888038/jetty2/index
[junit4:junit4]   2> 12285 T1238 C105 P37202 oasu.DirectUpdateHandler2.commit start commit{,optimize=false,openSearcher=false,waitSearcher=false,expungeDeletes=false,softCommit=false}
[junit4:junit4]   2> 12289 T1238 C105 P37202 oasc.SolrDeletionPolicy.onCommit SolrDeletionPolicy.onCommit: commits:num=2
[junit4:junit4]   2> 		commit{dir=RateLimitedDirectoryWrapper(NRTCachingDirectory(org.apache.lucene.store.NIOFSDirectory@/usr/home/hudson/hudson-slave/workspace/Lucene-Solr-Tests-4.x-Java6/solr/build/solr-core/test/J1/org.apache.solr.cloud.SyncSliceTest-1359834888038/jetty2/index.20130202225500291 lockFactory=org.apache.lucene.store.NativeFSLockFactory@3400641d; maxCacheMB=48.0 maxMergeSizeMB=4.0)),segFN=segments_2,generation=2,filenames=[segments_2]
[junit4:junit4]   2> 		commit{dir=RateLimitedDirectoryWrapper(NRTCachingDirectory(org.apache.lucene.store.NIOFSDirectory@/usr/home/hudson/hudson-slave/workspace/Lucene-Solr-Tests-4.x-Java6/solr/build/solr-core/test/J1/org.apache.solr.cloud.SyncSliceTest-1359834888038/jetty2/index.20130202225500291 lockFactory=org.apache.lucene.store.NativeFSLockFactory@3400641d; maxCacheMB=48.0 maxMergeSizeMB=4.0)),segFN=segments_3,generation=3,filenames=[segments_3]
[junit4:junit4]   2> 12289 T1238 C105 P37202 oasc.SolrDeletionPolicy.updateCommits newest commit = 3[segments_3]
[junit4:junit4]   2> 12290 T1238 C105 P37202 oasc.CachingDirectoryFactory.close Releasing directory:/usr/home/hudson/hudson-slave/workspace/Lucene-Solr-Tests-4.x-Java6/solr/build/solr-core/test/J1/./org.apache.solr.cloud.SyncSliceTest-1359834888038/jetty2
[junit4:junit4]   2> 12291 T1238 C105 P37202 oasu.DirectUpdateHandler2.commit end_commit_flush
[junit4:junit4]   2> 12291 T1238 C105 P37202 oasc.CachingDirectoryFactory.close Releasing directory:/usr/home/hudson/hudson-slave/workspace/Lucene-Solr-Tests-4.x-Java6/solr/build/solr-core/test/J1/./org.apache.solr.cloud.SyncSliceTest-1359834888038/jetty2/index.20130202225500291
[junit4:junit4]   2> 12291 T1238 C105 P37202 oasc.CachingDirectoryFactory.close Releasing directory:/usr/home/hudson/hudson-slave/workspace/Lucene-Solr-Tests-4.x-Java6/solr/build/solr-core/test/J1/./org.apache.solr.cloud.SyncSliceTest-1359834888038/jetty2/index
[junit4:junit4]   2> 12291 T1238 C105 P37202 oasc.RecoveryStrategy.replay No replay needed. core=collection1
[junit4:junit4]   2> 12291 T1238 C105 P37202 oasc.RecoveryStrategy.doRecovery Replication Recovery was successful - registering as Active. core=collection1
[junit4:junit4]   2> 12292 T1238 C105 P37202 oasc.ZkController.publish publishing core=collection1 state=active
[junit4:junit4]   2> 12292 T1238 C105 P37202 oasc.ZkController.publish numShards not found on descriptor - reading it from system property
[junit4:junit4]   2> 12299 T1238 C105 P37202 oasc.RecoveryStrategy.doRecovery Finished recovery process. core=collection1
[junit4:junit4]   2> 12858 T1268 oass.OpenExchangeRatesOrgProvider.init Initialized with rates=open-exchange-rates.json, refreshInterval=1440.
[junit4:junit4]   2> 12869 T1268 oass.IndexSchema.readSchema default search field in schema is text
[junit4:junit4]   2> 12873 T1268 oass.IndexSchema.readSchema unique key field: id
[junit4:junit4]   2> 12888 T1202 oascc.ZkStateReader.updateClusterState Updating cloud state from ZooKeeper... 
[junit4:junit4]   2> 12889 T1202 oasc.Overseer$ClusterStateUpdater.updateState Update state numShards=1 message={
[junit4:junit4]   2> 	  "operation":"state",
[junit4:junit4]   2> 	  "numShards":"1",
[junit4:junit4]   2> 	  "shard":"shard1",
[junit4:junit4]   2> 	  "roles":null,
[junit4:junit4]   2> 	  "state":"recovering",
[junit4:junit4]   2> 	  "core":"collection1",
[junit4:junit4]   2> 	  "collection":"collection1",
[junit4:junit4]   2> 	  "node_name":"127.0.0.1:37212_i_d%2Fql",
[junit4:junit4]   2> 	  "base_url":"http://127.0.0.1:37212/i_d/ql"}
[junit4:junit4]   2> 12931 T1268 oass.FileExchangeRateProvider.reload Reloading exchange rates from file currency.xml
[junit4:junit4]   2> 12934 T1202 oasc.Overseer$ClusterStateUpdater.updateState Update state numShards=1 message={
[junit4:junit4]   2> 	  "operation":"state",
[junit4:junit4]   2> 	  "numShards":"1",
[junit4:junit4]   2> 	  "shard":"shard1",
[junit4:junit4]   2> 	  "roles":null,
[junit4:junit4]   2> 	  "state":"active",
[junit4:junit4]   2> 	  "core":"collection1",
[junit4:junit4]   2> 	  "collection":"collection1",
[junit4:junit4]   2> 	  "node_name":"127.0.0.1:37202_i_d%2Fql",
[junit4:junit4]   2> 	  "base_url":"http://127.0.0.1:37202/i_d/ql"}
[junit4:junit4]   2> 12942 T1268 oass.FileExchangeRateProvider.reload Reloading exchange rates from file currency.xml
[junit4:junit4]   2> 12948 T1235 oascc.ZkStateReader$2.process A cluster state change: WatchedEvent state:SyncConnected type:NodeDataChanged path:/clusterstate.json, has occurred - updating... (live nodes size: 5)
[junit4:junit4]   2> 12953 T1268 oass.OpenExchangeRatesOrgProvider.reload Reloading exchange rates from open-exchange-rates.json
[junit4:junit4]   2> 12953 T1251 oascc.ZkStateReader$2.process A cluster state change: WatchedEvent state:SyncConnected type:NodeDataChanged path:/clusterstate.json, has occurred - updating... (live nodes size: 5)
[junit4:junit4]   2> 12954 T1220 oascc.ZkStateReader$2.process A cluster state change: WatchedEvent state:SyncConnected type:NodeDataChanged path:/clusterstate.json, has occurred - updating... (live nodes size: 5)
[junit4:junit4]   2> 12953 T1207 oascc.ZkStateReader$2.process A cluster state change: WatchedEvent state:SyncConnected type:NodeDataChanged path:/clusterstate.json, has occurred - updating... (live nodes size: 5)
[junit4:junit4]   2> 12953 T1267 oascc.ZkStateReader$2.process A cluster state change: WatchedEvent state:SyncConnected type:NodeDataChanged path:/clusterstate.json, has occurred - updating... (live nodes size: 5)
[junit4:junit4]   2> 12948 T1201 oascc.ZkStateReader$2.process A cluster state change: WatchedEvent state:SyncConnected type:NodeDataChanged path:/clusterstate.json, has occurred - updating... (live nodes size: 5)
[junit4:junit4]   2> 12956 T1268 oass.OpenExchangeRatesOrgProvider.reload Reloading exchange rates from open-exchange-rates.json
[junit4:junit4]   2> 12958 T1268 oasc.SolrCore.<init> [collection1] Opening new SolrCore at /usr/home/hudson/hudson-slave/workspace/Lucene-Solr-Tests-4.x-Java6/solr/build/solr-core/test/J1/./org.apache.solr.cloud.SyncSliceTest-jetty4-1359834899661/collection1/, dataDir=./org.apache.solr.cloud.SyncSliceTest-1359834888038/jetty4/
[junit4:junit4]   2> 12958 T1268 oasc.JmxMonitoredMap.<init> JMX monitoring is enabled. Adding Solr mbeans to JMX Server: com.sun.jmx.mbeanserver.JmxMBeanServer@b478a2d
[junit4:junit4]   2> 12959 T1268 oasc.SolrCore.initDirectoryFactory solr.NRTCachingDirectoryFactory
[junit4:junit4]   2> 12960 T1268 oasc.CachingDirectoryFactory.get return new directory for /usr/home/hudson/hudson-slave/workspace/Lucene-Solr-Tests-4.x-Java6/solr/build/solr-core/test/J1/./org.apache.solr.cloud.SyncSliceTest-1359834888038/jetty4 forceNew:false
[junit4:junit4]   2> 12960 T1268 oasc.CachingDirectoryFactory.close Releasing directory:/usr/home/hudson/hudson-slave/workspace/Lucene-Solr-Tests-4.x-Java6/solr/build/solr-core/test/J1/./org.apache.solr.cloud.SyncSliceTest-1359834888038/jetty4
[junit4:junit4]   2> 12961 T1268 oasc.SolrCore.getNewIndexDir New index directory detected: old=null new=./org.apache.solr.cloud.SyncSliceTest-1359834888038/jetty4/index/
[junit4:junit4]   2> 12961 T1268 oasc.SolrCore.initIndex WARNING [collection1] Solr index directory './org.apache.solr.cloud.SyncSliceTest-1359834888038/jetty4/index' doesn't exist. Creating new index...
[junit4:junit4]   2> 12962 T1268 oasc.CachingDirectoryFactory.get return new directory for /usr/home/hudson/hudson-slave/workspace/Lucene-Solr-Tests-4.x-Java6/solr/build/solr-core/test/J1/./org.apache.solr.cloud.SyncSliceTest-1359834888038/jetty4/index forceNew:false
[junit4:junit4]   2> 12968 T1268 oasc.SolrDeletionPolicy.onCommit SolrDeletionPolicy.onCommit: commits:num=1
[junit4:junit4]   2> 		commit{dir=RateLimitedDirectoryWrapper(NRTCachingDirectory(org.apache.lucene.store.NIOFSDirectory@/usr/home/hudson/hudson-slave/workspace/Lucene-Solr-Tests-4.x-Java6/solr/build/solr-core/test/J1/org.apache.solr.cloud.SyncSliceTest-1359834888038/jetty4/index lockFactory=org.apache.lucene.store.NativeFSLockFactory@6ffb4985; maxCacheMB=48.0 maxMergeSizeMB=4.0)),segFN=segments_1,generation=1,filenames=[segments_1]
[junit4:junit4]   2> 12968 T1268 oasc.SolrDeletionPolicy.updateCommits newest commit = 1[segments_1]
[junit4:junit4]   2> 12969 T1268 oasc.CachingDirectoryFactory.close Releasing directory:/usr/home/hudson/hudson-slave/workspace/Lucene-Solr-Tests-4.x-Java6/solr/build/solr-core/test/J1/./org.apache.solr.cloud.SyncSliceTest-1359834888038/jetty4/index
[junit4:junit4]   2> 12969 T1268 oasc.SolrCore.initWriters created xml: solr.XMLResponseWriter
[junit4:junit4]   2> 12971 T1268 oasup.UpdateRequestProcessorChain.init inserting DistributedUpdateProcessorFactory into updateRequestProcessorChain "dedupe"
[junit4:junit4]   2> 12972 T1268 oasup.UpdateRequestProcessorChain.init inserting DistributedUpdateProcessorFactory into updateRequestProcessorChain "dedupe-allfields"
[junit4:junit4]   2> 12972 T1268 oasup.UpdateRequestProcessorChain.init inserting DistributedUpdateProcessorFactory into updateRequestProcessorChain "stored_sig"
[junit4:junit4]   2> 12972 T1268 oasup.UpdateRequestProcessorChain.init inserting DistributedUpdateProcessorFactory into updateRequestProcessorChain "uniq-fields"
[junit4:junit4]   2> 12973 T1268 oasup.UpdateRequestProcessorChain.init inserting DistributedUpdateProcessorFactory into updateRequestProcessorChain "distrib-dup-test-chain-implicit"
[junit4:junit4]   2> 12973 T1268 oasc.RequestHandlers.initHandlersFromConfig adding lazy requestHandler: solr.ReplicationHandler
[junit4:junit4]   2> 12973 T1268 oasc.RequestHandlers.initHandlersFromConfig created /replication: solr.ReplicationHandler
[junit4:junit4]   2> 12974 T1268 oasc.RequestHandlers.initHandlersFromConfig created standard: solr.StandardRequestHandler
[junit4:junit4]   2> 12975 T1268 oasc.RequestHandlers.initHandlersFromConfig created /get: solr.RealTimeGetHandler
[junit4:junit4]   2> 12975 T1268 oasc.RequestHandlers.initHandlersFromConfig created dismax: solr.SearchHandler
[junit4:junit4]   2> 12976 T1268 oasc.RequestHandlers.initHandlersFromConfig created mock: org.apache.solr.core.MockQuerySenderListenerReqHandler
[junit4:junit4]   2> 12976 T1268 oasc.RequestHandlers.initHandlersFromConfig created /admin/: org.apache.solr.handler.admin.AdminHandlers
[junit4:junit4]   2> 12977 T1268 oasc.RequestHandlers.initHandlersFromConfig created defaults: solr.StandardRequestHandler
[junit4:junit4]   2> 12977 T1268 oasc.RequestHandlers.initHandlersFromConfig adding lazy requestHandler: solr.StandardRequestHandler
[junit4:junit4]   2> 12977 T1268 oasc.RequestHandlers.initHandlersFromConfig created lazy: solr.StandardRequestHandler
[junit4:junit4]   2> 12978 T1268 oasc.RequestHandlers.initHandlersFromConfig created /update: solr.UpdateRequestHandler
[junit4:junit4]   2> 12978 T1268 oasc.RequestHandlers.initHandlersFromConfig created /terms: org.apache.solr.handler.component.SearchHandler
[junit4:junit4]   2> 12979 T1268 oasc.RequestHandlers.initHandlersFromConfig created spellCheckCompRH: org.apache.solr.handler.component.SearchHandler
[junit4:junit4]   2> 12979 T1268 oasc.RequestHandlers.initHandlersFromConfig created spellCheckCompRH_Direct: org.apache.solr.handler.component.SearchHandler
[junit4:junit4]   2> 12980 T1268 oasc.RequestHandlers.initHandlersFromConfig created spellCheckWithWordbreak: org.apache.solr.handler.component.SearchHandler
[junit4:junit4]   2> 12980 T1268 oasc.RequestHandlers.initHandlersFromConfig created spellCheckWithWordbreak_Direct: org.apache.solr.handler.component.SearchHandler
[junit4:junit4]   2> 12981 T1268 oasc.RequestHandlers.initHandlersFromConfig created spellCheckCompRH1: org.apache.solr.handler.component.SearchHandler
[junit4:junit4]   2> 12981 T1268 oasc.RequestHandlers.initHandlersFromConfig created mltrh: org.apache.solr.handler.component.SearchHandler
[junit4:junit4]   2> 12982 T1268 oasc.RequestHandlers.initHandlersFromConfig created tvrh: org.apache.solr.handler.component.SearchHandler
[junit4:junit4]   2> 12982 T1268 oasc.RequestHandlers.initHandlersFromConfig created /mlt: solr.MoreLikeThisHandler
[junit4:junit4]   2> 12983 T1268 oasc.RequestHandlers.initHandlersFromConfig created /debug/dump: solr.DumpRequestHandler
[junit4:junit4]   2> 12990 T1268 oashl.XMLLoader.init xsltCacheLifetimeSeconds=60
[junit4:junit4]   2> 12995 T1268 oasc.SolrCore.initDeprecatedSupport WARNING solrconfig.xml uses deprecated <admin/gettableFiles>, Please update your config to use the ShowFileRequestHandler.
[junit4:junit4]   2> 12996 T1268 oasc.SolrCore.initDeprecatedSupport WARNING adding ShowFileRequestHandler with hidden files: [SCHEMA.XML, OLD_SYNONYMS.TXT, STOPWORDS.TXT, PROTWORDS.TXT, OPEN-EXCHANGE-RATES.JSON, SYNONYMS.TXT, CURRENCY.XML, MAPPING-ISOLATIN1ACCENT.TXT]
[junit4:junit4]   2> 12998 T1268 oasc.CachingDirectoryFactory.close Releasing directory:/usr/home/hudson/hudson-slave/workspace/Lucene-Solr-Tests-4.x-Java6/solr/build/solr-core/test/J1/./org.apache.solr.cloud.SyncSliceTest-1359834888038/jetty4
[junit4:junit4]   2> 13000 T1268 oass.SolrIndexSearcher.<init> Opening Searcher@3d898ee3 main
[junit4:junit4]   2> 13001 T1268 oasu.CommitTracker.<init> Hard AutoCommit: disabled
[junit4:junit4]   2> 13001 T1268 oasu.CommitTracker.<init> Soft AutoCommit: disabled
[junit4:junit4]   2> 13002 T1268 oashc.SpellCheckComponent.inform Initializing spell checkers
[junit4:junit4]   2> 13008 T1268 oass.DirectSolrSpellChecker.init init: {name=direct,classname=DirectSolrSpellChecker,field=lowerfilt,minQueryLength=3}
[junit4:junit4]   2> 13072 T1271 oasc.SolrCore.registerSearcher [collection1] Registered new searcher Searcher@3d898ee3 main{StandardDirectoryReader(segments_1:1)}
[junit4:junit4]   2> 13077 T1268 oasc.ZkController.publish publishing core=collection1 state=down
[junit4:junit4]   2> 13077 T1268 oasc.ZkController.publish numShards not found on descriptor - reading it from system property
[junit4:junit4]   2> 14462 T1202 oascc.ZkStateReader.updateClusterState Updating cloud state from ZooKeeper... 
[junit4:junit4]   2> 14463 T1202 oasc.Overseer$ClusterStateUpdater.updateState Update state numShards=1 message={
[junit4:junit4]   2> 	  "operation":"state",
[junit4:junit4]   2> 	  "numShards":"1",
[junit4:junit4]   2> 	  "shard":null,
[junit4:junit4]   2> 	  "roles":null,
[junit4:junit4]   2> 	  "state":"down",
[junit4:junit4]   2> 	  "core":"collection1",
[junit4:junit4]   2> 	  "collection":"collection1",
[junit4:junit4]   2> 	  "node_name":"127.0.0.1:37217_i_d%2Fql",
[junit4:junit4]   2> 	  "base_url":"http://127.0.0.1:37217/i_d/ql"}
[junit4:junit4]   2> 14463 T1202 oasc.Overseer$ClusterStateUpdater.updateState Collection already exists with numShards=1
[junit4:junit4]   2> 14463 T1202 oasc.Overseer$ClusterStateUpdater.updateState Assigning new node to shard shard=shard1
[junit4:junit4]   2> 14493 T1235 oascc.ZkStateReader$2.process A cluster state change: WatchedEvent state:SyncConnected type:NodeDataChanged path:/clusterstate.json, has occurred - updating... (live nodes size: 5)
[junit4:junit4]   2> 14493 T1201 oascc.ZkStateReader$2.process A cluster state change: WatchedEvent state:SyncConnected type:NodeDataChanged path:/clusterstate.json, has occurred - updating... (live nodes size: 5)
[junit4:junit4]   2> 14493 T1207 oascc.ZkStateReader$2.process A cluster state change: WatchedEvent state:SyncConnected type:NodeDataChanged path:/clusterstate.json, has occurred - updating... (live nodes size: 5)
[junit4:junit4]   2> 14493 T1220 oascc.ZkStateReader$2.process A cluster state change: WatchedEvent state:SyncConnected type:NodeDataChanged path:/clusterstate.json, has occurred - updating... (live nodes size: 5)
[junit4:junit4]   2> 14493 T1267 oascc.ZkStateReader$2.process A cluster state change: WatchedEvent state:SyncConnected type:NodeDataChanged path:/clusterstate.json, has occurred - updating... (live nodes size: 5)
[junit4:junit4]   2> 14493 T1251 oascc.ZkStateReader$2.process A cluster state change: WatchedEvent state:SyncConnected type:NodeDataChanged path:/clusterstate.json, has occurred - updating... (live nodes size: 5)
[junit4:junit4]   2> 15081 T1268 oasc.CoreContainer.registerCore registering core: collection1
[junit4:junit4]   2> 15081 T1268 oasc.ZkController.register Register replica - core:collection1 address:http://127.0.0.1:37217/i_d/ql collection:collection1 shard:shard1
[junit4:junit4]   2> 15085 T1268 oasc.ZkController.register We are http://127.0.0.1:37217/i_d/ql/collection1/ and leader is http://127.0.0.1:37198/i_d/ql/collection1/
[junit4:junit4]   2> 15085 T1268 oasc.ZkController.register No LogReplay needed for core=collection1 baseURL=http://127.0.0.1:37217/i_d/ql
[junit4:junit4]   2> 15086 T1268 oasc.ZkController.checkRecovery Core needs to recover:collection1
[junit4:junit4]   2> 15086 T1268 oasu.DefaultSolrCoreState.doRecovery Running recovery - first canceling any ongoing recovery
[junit4:junit4]   2> ASYNC  NEW_CORE C108 name=collection1 org.apache.solr.core.SolrCore@2587053f url=http://127.0.0.1:37217/i_d/ql/collection1 node=127.0.0.1:37217_i_d%2Fql C108_STATE=coll:collection1 core:collection1 props:{shard=null, roles=null, state=down, core=collection1, collection=collection1, node_name=127.0.0.1:37217_i_d%2Fql, base_url=http://127.0.0.1:37217/i_d/ql}
[junit4:junit4]   2> 15087 T1272 C108 P37217 oasc.RecoveryStrategy.run Starting recovery process.  core=collection1 recoveringAfterStartup=true
[junit4:junit4]   2> 15088 T1272 C108 P37217 oasc.RecoveryStrategy.doRecovery ###### startupVersions=[]
[junit4:junit4]   2> 15088 T1268 oascc.ZkStateReader.updateClusterState Updating cloud state from ZooKeeper... 
[junit4:junit4]   2> 15088 T1272 C108 P37217 oasc.ZkController.publish publishing core=collection1 state=recovering
[junit4:junit4]   2> 15088 T1272 C108 P37217 oasc.ZkController.publish numShards not found on descriptor - reading it from system property
[junit4:junit4]   2> 15089 T1179 oass.SolrDispatchFilter.init user.dir=/usr/home/hudson/hudson-slave/workspace/Lucene-Solr-Tests-4.x-Java6/solr/build/solr-core/test/J1
[junit4:junit4]   2> 15090 T1272 C108 P37217 oascsi.HttpClientUtil.createClient Creating new http client, config:maxConnections=128&maxConnectionsPerHost=32&followRedirects=false
[junit4:junit4]   2> 15090 T1179 oass.SolrDispatchFilter.init SolrDispatchFilter.init() done
[junit4:junit4]   2> 15090 T1179 oascsi.HttpClientUtil.createClient Creating new http client, config:maxConnections=128&maxConnectionsPerHost=32&followRedirects=false
[junit4:junit4]   2> 15105 T1179 oascc.ZkStateReader.updateClusterState Updating cloud state from ZooKeeper... 
[junit4:junit4]   2> 15107 T1179 oasc.AbstractFullDistribZkTestBase.waitForThingsToLevelOut Wait for recoveries to finish - wait 15 for each attempt
[junit4:junit4]   2> 15107 T1179 oasc.AbstractDistribZkTestBase.waitForRecoveriesToFinish Wait for recoveries to finish - collection: collection1 failOnTimeout:true timeout (sec):15
[junit4:junit4]   2> 15108 T1179 oascc.ZkStateReader.updateClusterState Updating cloud state from ZooKeeper... 
[junit4:junit4]   2>  C106_STATE=coll:collection1 core:collection1 props:{shard=shard1, roles=null, state=recovering, core=collection1, collection=collection1, node_name=127.0.0.1:37212_i_d%2Fql, base_url=http://127.0.0.1:37212/i_d/ql}
[junit4:junit4]   2> 15631 T1254 C106 P37212 oasc.RecoveryStrategy.doRecovery Attempting to PeerSync from http://127.0.0.1:37198/i_d/ql/collection1/ core=collection1 - recoveringAfterStartup=true
[junit4:junit4]   2> 15631 T1254 C106 P37212 oasu.PeerSync.sync PeerSync: core=collection1 url=http://127.0.0.1:37212/i_d/ql START replicas=[http://127.0.0.1:37198/i_d/ql/collection1/] nUpdates=100
[junit4:junit4]   2> 15632 T1254 C106 P37212 oasu.PeerSync.sync WARNING no frame of reference to tell of we've missed updates
[junit4:junit4]   2> 15632 T1254 C106 P37212 oasc.RecoveryStrategy.doRecovery PeerSync Recovery was not successful - trying replication. core=collection1
[junit4:junit4]   2> 15632 T1254 C106 P37212 oasc.RecoveryStrategy.doRecovery Starting Replication Recovery. core=collection1
[junit4:junit4]   2> 15632 T1254 C106 P37212 oasc.RecoveryStrategy.doRecovery Begin buffering updates. core=collection1
[junit4:junit4]   2> 15632 T1254 C106 P37212 oasu.UpdateLog.bufferUpdates Starting to buffer updates. FSUpdateLog{state=ACTIVE, tlog=null}
[junit4:junit4]   2> 15632 T1254 C106 P37212 oasc.RecoveryStrategy.replicate Attempting to replicate from http://127.0.0.1:37198/i_d/ql/collection1/. core=collection1
[junit4:junit4]   2> 15633 T1254 C106 P37212 oascsi.HttpClientUtil.createClient Creating new http client, config:maxConnections=128&maxConnectionsPerHost=32&followRedirects=false
[junit4:junit4]   2> 15634 T1212 C107 P37198 REQ /get {getVersions=100&distrib=false&wt=javabin&qt=/get&version=2} status=0 QTime=0 
[junit4:junit4]   2> 15642 T1216 C107 P37198 oasu.DirectUpdateHandler2.commit start commit{,optimize=false,openSearcher=false,waitSearcher=true,expungeDeletes=false,softCommit=false}
[junit4:junit4]   2> 15648 T1216 C107 P37198 oasc.SolrDeletionPolicy.onCommit SolrDeletionPolicy.onCommit: commits:num=2
[junit4:junit4]   2> 		commit{dir=RateLimitedDirectoryWrapper(NRTCachingDirectory(org.apache.lucene.store.NIOFSDirectory@/usr/home/hudson/hudson-slave/workspace/Lucene-Solr-Tests-4.x-Java6/solr/build/solr-core/test/J1/org.apache.solr.cloud.SyncSliceTest-1359834888038/jetty1/index lockFactory=org.apache.lucene.store.NativeFSLockFactory@628c5fdf; maxCacheMB=48.0 maxMergeSizeMB=4.0)),segFN=segments_2,generation=2,filenames=[segments_2]
[junit4:junit4]   2> 		commit{dir=RateLimitedDirectoryWrapper(NRTCachingDirectory(org.apache.lucene.store.NIOFSDirectory@/usr/home/hudson/hudson-slave/workspace/Lucene-Solr-Tests-4.x-Java6/solr/build/solr-core/test/J1/org.apache.solr.cloud.SyncSliceTest-1359834888038/jetty1/index lockFactory=org.apache.lucene.store.NativeFSLockFactory@628c5fdf; maxCacheMB=48.0 maxMergeSizeMB=4.0)),segFN=segments_3,generation=3,filenames=[segments_3]
[junit4:junit4]   2> 15649 T1216 C107 P37198 oasc.SolrDeletionPolicy.updateCommits newest commit = 3[segments_3]
[junit4:junit4]   2> 15650 T1216 C107 P37198 oasc.CachingDirectoryFactory.close Releasing directory:/usr/home/hudson/hudson-slave/workspace/Lucene-Solr-Tests-4.x-Java6/solr/build/solr-core/test/J1/./org.apache.solr.cloud.SyncSliceTest-1359834888038/jetty1
[junit4:junit4]   2> 15650 T1216 C107 P37198 oasu.DirectUpdateHandler2.commit end_commit_flush
[junit4:junit4]   2> 15650 T1216 C107 P37198 /update {waitSearcher=true&openSearcher=false&commit=true&wt=javabin&commit_end_point=true&version=2&softCommit=false} {commit=} 0 8
[junit4:junit4]   2> 15651 T1254 C106 P37212 oash.ReplicationHandler.inform Commits will be reserved for  10000
[junit4:junit4]   2> 15651 T1254 C106 P37212 oash.SnapPuller.<init>  No value set for 'pollInterval'. Timer Task not started.
[junit4:junit4]   2> 15654 T1214 C107 P37198 REQ /replication {command=indexversion&qt=/replication&wt=javabin&version=2} status=0 QTime=0 
[junit4:junit4]   2> 15655 T1254 C106 P37212 oash.SnapPuller.fetchLatestIndex Master's generation: 3
[junit4:junit4]   2> 15655 T1254 C106 P37212 oash.SnapPuller.fetchLatestIndex Slave's generation: 1
[junit4:junit4]   2> 15655 T1254 C106 P37212 oash.SnapPuller.fetchLatestIndex Starting replication process
[junit4:junit4]   2> 15657 T1214 C107 P37198 oasc.CachingDirectoryFactory.close Releasing directory:/usr/home/hudson/hudson-slave/workspace/Lucene-Solr-Tests-4.x-Java6/solr/build/solr-core/test/J1/./org.apache.solr.cloud.SyncSliceTest-1359834888038/jetty1
[junit4:junit4]   2> 15658 T1214 C107 P37198 oasc.CachingDirectoryFactory.close Releasing directory:/usr/home/hudson/hudson-slave/workspace/Lucene-Solr-Tests-4.x-Java6/solr/build/solr-core/test/J1/./org.apache.solr.cloud.SyncSliceTest-1359834888038/jetty1/index
[junit4:junit4]   2> 15659 T1214 C107 P37198 REQ /replication {command=filelist&qt=/replication&wt=javabin&generation=3&version=2} status=0 QTime=2 
[junit4:junit4]   2> 15659 T1254 C106 P37212 oash.SnapPuller.fetchLatestIndex Number of files in latest index in master: 1
[junit4:junit4]   2> 15661 T1254 C106 P37212 oasc.CachingDirectoryFactory.get return new directory for /usr/home/hudson/hudson-slave/workspace/Lucene-Solr-Tests-4.x-Java6/solr/build/solr-core/test/J1/./org.apache.solr.cloud.SyncSliceTest-1359834888038/jetty3/index.20130202225503694 forceNew:false
[junit4:junit4]   2> 15661 T1254 C106 P37212 oasc.CachingDirectoryFactory.close Releasing directory:/usr/home/hudson/hudson-slave/workspace/Lucene-Solr-Tests-4.x-Java6/solr/build/solr-core/test/J1/./org.apache.solr.cloud.SyncSliceTest-1359834888038/jetty3
[junit4:junit4]   2> 15662 T1254 C106 P37212 oash.SnapPuller.fetchLatestIndex Starting download to RateLimitedDirectoryWrapper(NRTCachingDirectory(org.apache.lucene.store.NIOFSDirectory@/usr/home/hudson/hudson-slave/workspace/Lucene-Solr-Tests-4.x-Java6/solr/build/solr-core/test/J1/org.apache.solr.cloud.SyncSliceTest-1359834888038/jetty3/index.20130202225503694 lockFactory=org.apache.lucene.store.NativeFSLockFactory@e1e8e8a; maxCacheMB=48.0 maxMergeSizeMB=4.0)) fullCopy=true
[junit4:junit4]   2> 15666 T1214 C107 P37198 REQ /replication {file=segments_3&command=filecontent&checksum=true&wt=filestream&qt=/replication&generation=3} status=0 QTime=0 
[junit4:junit4]   2> 15668 T1254 C106 P37212 oasc.CachingDirectoryFactory.close Releasing directory:/usr/home/hudson/hudson-slave/workspace/Lucene-Solr-Tests-4.x-Java6/solr/build/solr-core/test/J1/./org.apache.solr.cloud.SyncSliceTest-1359834888038/jetty3/index
[junit4:junit4]   2> 15668 T1254 C106 P37212 oash.SnapPuller.fetchLatestIndex Total time taken for download : 0 secs
[junit4:junit4]   2> 15668 T1254 C106 P37212 oash.SnapPuller.modifyIndexProps New index installed. Updating index properties... index=index.20130202225503694
[junit4:junit4]   2> 15670 T1254 C106 P37212 oasc.CachingDirectoryFactory.close Releasing directory:/usr/home/hudson/hudson-slave/workspace/Lucene-Solr-Tests-4.x-Java6/solr/build/solr-core/test/J1/./org.apache.solr.cloud.SyncSliceTest-1359834888038/jetty3
[junit4:junit4]   2> 15670 T1254 C106 P37212 oasc.CachingDirectoryFactory.close Releasing directory:/usr/home/hudson/hudson-slave/workspace/Lucene-Solr-Tests-4.x-Java6/solr/build/solr-core/test/J1/./org.apache.solr.cloud.SyncSliceTest-1359834888038/jetty3
[junit4:junit4]   2> 15670 T1254 C106 P37212 oasc.SolrCore.getNewIndexDir New index directory detected: old=./org.apache.solr.cloud.SyncSliceTest-1359834888038/jetty3/index/ new=./org.apache.solr.cloud.SyncSliceTest-1359834888038/jetty3/index.20130202225503694
[junit4:junit4]   2> 15674 T1254 C106 P37212 oasc.SolrDeletionPolicy.onInit SolrDeletionPolicy.onInit: commits:num=1
[junit4:junit4]   2> 		commit{dir=RateLimitedDirectoryWrapper(NRTCachingDirectory(org.apache.lucene.store.NIOFSDirectory@/usr/home/hudson/hudson-slave/workspace/Lucene-Solr-Tests-4.x-Java6/solr/build/solr-core/test/J1/org.apache.solr.cloud.SyncSliceTest-1359834888038/jetty3/index.20130202225503694 lockFactory=org.apache.lucene.store.NativeFSLockFactory@e1e8e8a; maxCacheMB=48.0 maxMergeSizeMB=4.0)),segFN=segments_3,generation=3,filenames=[segments_3]
[junit4:junit4]   2> 15674 T1254 C106 P37212 oasc.SolrDeletionPolicy.updateCommits newest commit = 3[segments_3]
[junit4:junit4]   2> 15676 T1254 C106 P37212 oasc.CachingDirectoryFactory.close Releasing directory:/usr/home/hudson/hudson-slave/workspace/Lucene-Solr-Tests-4.x-Java6/solr/build/solr-core/test/J1/./org.apache.solr.cloud.SyncSliceTest-1359834888038/jetty3
[junit4:junit4]   2> 15676 T1254 C106 P37212 oasu.DefaultSolrCoreState.newIndexWriter Creating new IndexWriter...
[junit4:junit4]   2> 15676 T1254 C106 P37212 oasu.DefaultSolrCoreState.newIndexWriter Waiting until IndexWriter is unused... core=collection1
[junit4:junit4]   2> 15676 T1254 C106 P37212 oasu.DefaultSolrCoreState.newIndexWriter Rollback old IndexWriter... core=collection1
[junit4:junit4]   2> 15677 T1254 C106 P37212 oasc.CachingDirectoryFactory.close Releasing directory:/usr/home/hudson/hudson-slave/workspace/Lucene-Solr-Tests-4.x-Java6/solr/build/solr-core/test/J1/./org.apache.solr.cloud.SyncSliceTest-1359834888038/jetty3/index.20130202225503694
[junit4:junit4]   2> 15678 T1254 C106 P37212 oasc.CachingDirectoryFactory.close Releasing directory:/usr/home/hudson/hudson-slave/workspace/Lucene-Solr-Tests-4.x-Java6/solr/build/solr-core/test/J1/./org.apache.solr.cloud.SyncSliceTest-1359834888038/jetty3
[junit4:junit4]   2> 15681 T1254 C106 P37212 oasc.SolrDeletionPolicy.onInit SolrDeletionPolicy.onInit: commits:num=1
[junit4:junit4]   2> 		commit{dir=RateLimitedDirectoryWrapper(NRTCachingDirectory(org.apache.lucene.store.NIOFSDirectory@/usr/home/hudson/hudson-slave/workspace/Lucene-Solr-Tests-4.x-Java6/solr/build/solr-core/test/J1/org.apache.solr.cloud.SyncSliceTest-1359834888038/jetty3/index.20130202225503694 lockFactory=org.apache.lucene.store.NativeFSLockFactory@e1e8e8a; maxCacheMB=48.0 maxMergeSizeMB=4.0)),segFN=segments_3,generation=3,filenames=[segments_3]
[junit4:junit4]   2> 15681 T1254 C106 P37212 oasc.SolrDeletionPolicy.updateCommits newest commit = 3[segments_3]
[junit4:junit4]   2> 15682 T1254 C106 P37212 oasu.DefaultSolrCoreState.newIndexWriter New IndexWriter is ready to be used.
[junit4:junit4]   2> 15682 T1254 C106 P37212 oasc.CachingDirectoryFactory.close Releasing directory:/usr/home/hudson/hudson-slave/workspace/Lucene-Solr-Tests-4.x-Java6/solr/build/solr-core/test/J1/./org.apache.solr.cloud.SyncSliceTest-1359834888038/jetty3
[junit4:junit4]   2> 15683 T1254 C106 P37212 oass.SolrIndexSearcher.<init> Opening Searcher@7b58bfbd main
[junit4:junit4]   2> 15685 T1253 oasc.SolrCore.registerSearcher [collection1] Registered new searcher Searcher@7b58bfbd main{StandardDirectoryReader(segments_3:1:nrt)}
[junit4:junit4]   2> 15686 T1253 oasc.CachingDirectoryFactory.close Releasing directory:/usr/home/hudson/hudson-slave/workspace/Lucene-Solr-Tests-4.x-Java6/solr/build/solr-core/test/J1/./org.apache.solr.cloud.SyncSliceTest-1359834888038/jetty3/index
[junit4:junit4]   2> 15686 T1254 C106 P37212 oasu.DirectUpdateHandler2.commit start commit{,optimize=false,openSearcher=false,waitSearcher=false,expungeDeletes=false,softCommit=false}
[junit4:junit4]   2> 15699 T1254 C106 P37212 oasc.SolrDeletionPolicy.onCommit SolrDeletionPolicy.onCommit: commits:num=2
[junit4:junit4]   2> 		commit{dir=RateLimitedDirectoryWrapper(NRTCachingDirectory(org.apache.lucene.store.NIOFSDirectory@/usr/home/hudson/hudson-slave/workspace/Lucene-Solr-Tests-4.x-Java6/solr/build/solr-core/test/J1/org.apache.solr.cloud.SyncSliceTest-1359834888038/jetty3/index.20130202225503694 lockFactory=org.apache.lucene.store.NativeFSLockFactory@e1e8e8a; maxCacheMB=48.0 maxMergeSizeMB=4.0)),segFN=segments_3,generation=3,filenames=[segments_3]
[junit4:junit4]   2> 		commit{dir=RateLimitedDirectoryWrapper(NRTCachingDirectory(org.apache.lucene.store.NIOFSDirectory@/usr/home/hudson/hudson-slave/workspace/Lucene-Solr-Tests-4.x-Java6/solr/build/solr-core/test/J1/org.apache.solr.cloud.SyncSliceTest-1359834888038/jetty3/index.20130202225503694 lockFactory=org.apache.lucene.store.NativeFSLockFactory@e1e8e8a; maxCacheMB=48.0 maxMergeSizeMB=4.0)),segFN=segments_4,generation=4,filenames=[segments_4]
[junit4:junit4]   2> 15699 T1254 C106 P37212 oasc.SolrDeletionPolicy.updateCommits newest commit = 4[segments_4]
[junit4:junit4]   2> 15700 T1254 C106 P37212 oasc.CachingDirectoryFactory.close Releasing directory:/usr/home/hudson/hudson-slave/workspace/Lucene-Solr-Tests-4.x-Java6/solr/build/solr-core/test/J1/./org.apache.solr.cloud.SyncSliceTest-1359834888038/jetty3
[junit4:junit4]   2> 15701 T1254 C106 P37212 oasu.DirectUpdateHandler2.commit end_commit_flush
[junit4:junit4]   2> 15701 T1254 C106 P37212 oasc.CachingDirectoryFactory.close Releasing directory:/usr/home/hudson/hudson-slave/workspace/Lucene-Solr-Tests-4.x-Java6/solr/build/solr-core/test/J1/./org.apache.solr.cloud.SyncSliceTest-1359834888038/jetty3/index.20130202225503694
[junit4:junit4]   2> 15701 T1254 C106 P37212 oasc.CachingDirectoryFactory.close Releasing directory:/usr/home/hudson/hudson-slave/workspace/Lucene-Solr-Tests-4.x-Java6/solr/build/solr-core/test/J1/./org.apache.solr.cloud.SyncSliceTest-1359834888038/jetty3/index
[junit4:junit4]   2> 15701 T1254 C106 P37212 oasc.RecoveryStrategy.replay No replay needed. core=collection1
[junit4:junit4]   2> 15701 T1254 C106 P37212 oasc.RecoveryStrategy.doRecovery Replication Recovery was successful - registering as Active. core=collection1
[junit4:junit4]   2> 15702 T1254 C106 P37212 oasc.ZkController.publish publishing core=collection1 state=active
[junit4:junit4]   2> 15702 T1254 C106 P37212 oasc.ZkController.publish numShards not found on descriptor - reading it from system property
[junit4:junit4]   2> 15713 T1254 C106 P37212 oasc.RecoveryStrategy.doRecovery Finished recovery process. core=collection1
[junit4:junit4]   2> 15999 T1202 oascc.ZkStateReader.updateClusterState Updating cloud state from ZooKeeper... 
[junit4:junit4]   2> 16000 T1202 oasc.Overseer$ClusterStateUpdater.updateState Update state numShards=1 message={
[junit4:junit4]   2> 	  "operation":"state",
[junit4:junit4]   2> 	  "numShards":"1",
[junit4:junit4]   2> 	  "shard":"shard1",
[junit4:junit4]   2> 	  "roles":null,
[junit4:junit4]   2> 	  "state":"recovering",
[junit4:junit4]   2> 	  "core":"collection1",
[junit4:junit4]   2> 	  "collection":"collection1",
[junit4:junit4]   2> 	  "node_name":"127.0.0.1:37217_i_d%2Fql",
[junit4:junit4]   2> 	  "base_url":"http://127.0.0.1:37217/i_d/ql"}
[junit4:junit4]   2> 16005 T1202 oasc.Overseer$ClusterStateUpdater.updateState Update state numShards=1 message={
[junit4:junit4]   2> 	  "operation":"state",
[junit4:junit4]   2> 	  "numShards":"1",
[junit4:junit4]   2> 	  "shard":"shard1",
[junit4:junit4]   2> 	  "roles":null,
[junit4:junit4]   2> 	  "state":"active",
[junit4:junit4]   2> 	  "core":"collection1",
[junit4:junit4]   2> 	  "collection":"collection1",
[junit4:junit4]   2> 	  "node_name":"127.0.0.1:37212_i_d%2Fql",
[junit4:junit4]   2> 	  "base_url":"http://127.0.0.1:37212/i_d/ql"}
[junit4:junit4]   2> 16017 T1235 oascc.ZkStateReader$2.process A cluster state change: WatchedEvent state:SyncConnected type:NodeDataChanged path:/clusterstate.json, has occurred - updating... (live nodes size: 5)
[junit4:junit4]   2> 16017 T1201 oascc.ZkStateReader$2.process A cluster state change: WatchedEvent state:SyncConnected type:NodeDataChanged path:/clusterstate.json, has occurred - updating... (live nodes size: 5)
[junit4:junit4]   2> 16017 T1267 oascc.ZkStateReader$2.process A cluster state change: WatchedEvent state:SyncConnected type:NodeDataChanged path:/clusterstate.json, has occurred - updating... (live nodes size: 5)
[junit4:junit4]   2> 16017 T1220 oascc.ZkStateReader$2.process A cluster state change: WatchedEvent state:SyncConnected type:NodeDataChanged path:/clusterstate.json, has occurred - updating... (live nodes size: 5)
[junit4:junit4]   2> 16017 T1207 oascc.ZkStateReader$2.process A cluster state change: WatchedEvent state:SyncConnected type:NodeDataChanged path:/clusterstate.json, has occurred - updating... (live nodes size: 5)
[junit4:junit4]   2> 16017 T1251 oascc.ZkStateReader$2.process A cluster state change: WatchedEvent state:SyncConnected type:NodeDataChanged path:/clusterstate.json, has occurred - updating... (live nodes size: 5)
[junit4:junit4]   2> 16110 T1179 oascc.ZkStateReader.updateClusterState Updating cloud state from ZooKeeper... 
[junit4:junit4]   2> 17113 T1179 oascc.ZkStateReader.updateClusterState Updating cloud state from ZooKeeper... 
[junit4:junit4]   2>  C108_STATE=coll:collection1 core:collection1 props:{shard=shard1, roles=null, state=recovering, core=collection1, collection=collection1, node_name=127.0.0.1:37217_i_d%2Fql, base_url=http://127.0.0.1:37217/i_d/ql}
[junit4:junit4]   2> 18108 T1272 C108 P37217 oasc.RecoveryStrategy.doRecovery Attempting to PeerSync from http://127.0.0.1:37198/i_d/ql/collection1/ core=collection1 - recoveringAfterStartup=true
[junit4:junit4]   2> 18108 T1272 C108 P37217 oasu.PeerSync.sync PeerSync: core=collection1 url=http://127.0.0.1:37217/i_d/ql START replicas=[http://127.0.0.1:37198/i_d/ql/collection1/] nUpdates=100
[junit4:junit4]   2> 18109 T1272 C108 P37217 oasu.PeerSync.sync WARNING no frame of reference to tell of we've missed updates
[junit4:junit4]   2> 18109 T1272 C108 P37217 oasc.RecoveryStrategy.doRecovery PeerSync Recovery was not successful - trying replication. core=collection1
[junit4:junit4]   2> 18109 T1272 C108 P37217 oasc.RecoveryStrategy.doRecovery Starting Replication Recovery. core=collection1
[junit4:junit4]   2> 18109 T1272 C108 P37217 oasc.RecoveryStrategy.doRecovery Begin buffering updates. core=collection1
[junit4:junit4]   2> 18109 T1272 C108 P37217 oasu.UpdateLog.bufferUpdates Starting to buffer updates. FSUpdateLog{state=ACTIVE, tlog=null}
[junit4:junit4]   2> 18109 T1272 C108 P37217 oasc.RecoveryStrategy.replicate Attempting to replicate from http://127.0.0.1:37198/i_d/ql/collection1/. core=collection1
[junit4:junit4]   2> 18110 T1272 C108 P37217 oascsi.HttpClientUtil.createClient Creating new http client, config:maxConnections=128&maxConnectionsPerHost=32&followRedirects=false
[junit4:junit4]   2> 18111 T1212 C107 P37198 REQ /get {getVersions=100&distrib=false&wt=javabin&qt=/get&version=2} status=0 QTime=0 
[junit4:junit4]   2> 18115 T1179 oascc.ZkStateReader.updateClusterState Updating cloud state from ZooKeeper... 
[junit4:junit4]   2> 18125 T1210 C107 P37198 oasu.DirectUpdateHandler2.commit start commit{,optimize=false,openSearcher=false,waitSearcher=true,expungeDeletes=false,softCommit=false}
[junit4:junit4]   2> 18129 T1210 C107 P37198 oasc.SolrDeletionPolicy.onCommit SolrDeletionPolicy.onCommit: commits:num=3
[junit4:junit4]   2> 		commit{dir=RateLimitedDirectoryWrapper(NRTCachingDirectory(org.apache.lucene.store.NIOFSDirectory@/usr/home/hudson/hudson-slave/workspace/Lucene-Solr-Tests-4.x-Java6/solr/build/solr-core/test/J1/org.apache.solr.cloud.SyncSliceTest-1359834888038/jetty1/index lockFactory=org.apache.lucene.store.NativeFSLockFactory@628c5fdf; maxCacheMB=48.0 maxMergeSizeMB=4.0)),segFN=segments_2,generation=2,filenames=[segments_2]
[junit4:junit4]   2> 		commit{dir=RateLimitedDirectoryWrapper(NRTCachingDirectory(org.apache.lucene.store.NIOFSDirectory@/usr/home/hudson/hudson-slave/workspace/Lucene-Solr-Tests-4.x-Java6/solr/build/solr-core/test/J1/org.apache.solr.cloud.SyncSliceTest-1359834888038/jetty1/index lockFactory=org.apache.lucene.store.NativeFSLockFactory@628c5fdf; maxCacheMB=48.0 maxMergeSizeMB=4.0)),segFN=segments_3,generation=3,filenames=[segments_3]
[junit4:junit4]   2> 		commit{dir=RateLimitedDirectoryWrapper(NRTCachingDirectory(org.apache.lucene.store.NIOFSDirectory@/usr/home/hudson/hudson-slave/workspace/Lucene-Solr-Tests-4.x-Java6/solr/build/solr-core/test/J1/org.apache.solr.cloud.SyncSliceTest-1359834888038/jetty1/index lockFactory=org.apache.lucene.store.NativeFSLockFactory@628c5fdf; maxCacheMB=48.0 maxMergeSizeMB=4.0)),segFN=segments_4,generation=4,filenames=[segments_4]
[junit4:junit4]   2> 18130 T1210 C107 P37198 oasc.SolrDeletionPolicy.updateCommits newest commit = 4[segments_4]
[junit4:junit4]   2> 18131 T1210 C107 P37198 oasc.CachingDirectoryFactory.close Releasing directory:/usr/home/hudson/hudson-slave/workspace/Lucene-Solr-Tests-4.x-Java6/solr/build/solr-core/test/J1/./org.apache.solr.cloud.SyncSliceTest-1359834888038/jetty1
[junit4:junit4]   2> 18131 T1210 C107 P37198 oasu.DirectUpdateHandler2.commit end_commit_flush
[junit4:junit4]   2> 18131 T1210 C107 P37198 /update {waitSearcher=true&openSearcher=false&commit=true&wt=javabin&commit_end_point=true&version=2&softCommit=false} {commit=} 0 6
[junit4:junit4]   2> 18132 T1272 C108 P37217 oash.ReplicationHandler.inform Commits will be reserved for  10000
[junit4:junit4]   2> 18132 T1272 C108 P37217 oash.SnapPuller.<init>  No value set for 'pollInterval'. Timer Task not started.
[junit4:junit4]   2> 18135 T1214 C107 P37198 REQ /replication {command=indexversion&qt=/replication&wt=javabin&version=2} status=0 QTime=0 
[junit4:junit4]   2> 18136 T1272 C108 P37217 oash.SnapPuller.fetchLatestIndex Master's generation: 4
[junit4:junit4]   2> 18136 T1272 C108 P37217 oash.SnapPuller.fetchLatestIndex Slave's generation: 1
[junit4:junit4]   2> 18136 T1272 C108 P37217 oash.SnapPuller.fetchLatestIndex Starting replication process
[junit4:junit4]   2> 18139 T1214 C107 P37198 oasc.CachingDirectoryFactory.close Releasing directory:/usr/home/hudson/hudson-slave/workspace/Lucene-Solr-Tests-4.x-Java6/solr/build/solr-core/test/J1/./org.apache.solr.cloud.SyncSliceTest-1359834888038/jetty1
[junit4:junit4]   2> 18140 T1214 C107 P37198 oasc.CachingDirectoryFactory.close Releasing directory:/usr/home/hudson/hudson-slave/workspace/Lucene-Solr-Tests-4.x-Java6/solr/build/solr-core/test/J1/./org.apache.solr.cloud.SyncSliceTest-1359834888038/jetty1/index
[junit4:junit4]   2> 18141 T1214 C107 P37198 REQ /replication {command=filelist&qt=/replication&wt=javabin&generation=4&version=2} status=0 QTime=2 
[junit4:junit4]   2> 18142 T1272 C108 P37217 oash.SnapPuller.fetchLatestIndex Number of files in latest index in master: 1
[junit4:junit4]   2> 18143 T1272 C108 P37217 oasc.CachingDirectoryFactory.get return new directory for /usr/home/hudson/hudson-slave/workspace/Lucene-Solr-Tests-4.x-Java6/solr/build/solr-core/test/J1/./org.apache.solr.cloud.SyncSliceTest-1359834888038/jetty4/index.20130202225506176 forceNew:false
[junit4:junit4]   2> 18144 T1272 C108 P37217 oasc.CachingDirectoryFactory.close Releasing directory:/usr/home/hudson/hudson-slave/workspace/Lucene-Solr-Tests-4.x-Java6/solr/build/solr-core/test/J1/./org.apache.solr.cloud.SyncSliceTest-1359834888038/jetty4
[junit4:junit4]   2> 18145 T1272 C108 P37217 oash.SnapPuller.fetchLatestIndex Starting download to RateLimitedDirectoryWrapper(NRTCachingDirectory(org.apache.lucene.store.NIOFSDirectory@/usr/home/hudson/hudson-slave/workspace/Lucene-Solr-Tests-4.x-Java6/solr/build/solr-core/test/J1/org.apache.solr.cloud.SyncSliceTest-1359834888038/jetty4/index.20130202225506176 lockFactory=org.apache.lucene.store.NativeFSLockFactory@22c5480; maxCacheMB=48.0 maxMergeSizeMB=4.0)) fullCopy=true
[junit4:junit4]   2> 18148 T1214 C107 P37198 REQ /replication {file=segments_4&command=filecontent&checksum=true&wt=filestream&qt=/replication&generation=4} status=0 QTime=0 
[junit4:junit4]   2> 18150 T1272 C108 P37217 oasc.CachingDirectoryFactory.close Releasing directory:/usr/home/hudson/hudson-slave/workspace/Lucene-Solr-Tests-4.x-Java6/solr/build/solr-core/test/J1/./org.apache.solr.cloud.SyncSliceTest-1359834888038/jetty4/index
[junit4:junit4]   2> 18150 T1272 C108 P37217 oash.SnapPuller.fetchLatestIndex Total time taken for download : 0 secs
[junit4:junit4]   2> 18151 T1272 C108 P37217 oash.SnapPuller.modifyIndexProps New index installed. Updating index properties... index=index.20130202225506176
[junit4:junit4]   2> 18152 T1272 C108 P37217 oasc.CachingDirectoryFactory.close Releasing directory:/usr/home/hudson/hudson-slave/workspace/Lucene-Solr-Tests-4.x-Java6/solr/build/solr-core/test/J1/./org.apache.solr.cloud.SyncSliceTest-1359834888038/jetty4
[junit4:junit4]   2> 18153 T1272 C108 P37217 oasc.CachingDirectoryFactory.close Releasing directory:/usr/home/hudson/hudson-slave/workspace/Lucene-Solr-Tests-4.x-Java6/solr/build/solr-core/test/J1/./org.apache.solr.cloud.SyncSliceTest-1359834888038/jetty4
[junit4:junit4]   2> 18153 T1272 C108 P37217 oasc.SolrCore.getNewIndexDir New index directory detected: old=./org.apache.solr.cloud.SyncSliceTest-1359834888038/jetty4/index/ new=./org.apache.solr.cloud.SyncSliceTest-1359834888038/jetty4/index.20130202225506176
[junit4:junit4]   2> 18156 T1272 C108 P37217 oasc.SolrDeletionPolicy.onInit SolrDeletionPolicy.onInit: commits:num=1
[junit4:junit4]   2> 		commit{dir=RateLimitedDirectoryWrapper(NRTCachingDirectory(org.apache.lucene.store.NIOFSDirectory@/usr/home/hudson/hudson-slave/workspace/Lucene-Solr-Tests-4.x-Java6/solr/build/solr-core/test/J1/org.apache.solr.cloud.SyncSliceTest-1359834888038/jetty4/index.20130202225506176 lockFactory=org.apache.lucene.store.NativeFSLockFactory@22c5480; maxCacheMB=48.0 maxMergeSizeMB=4.0)),segFN=segments_4,generation=4,filenames=[segments_4]
[junit4:junit4]   2> 18157 T1272 C108 P37217 oasc.SolrDeletionPolicy.updateCommits newest commit = 4[segments_4]
[junit4:junit4]   2> 18158 T1272 C108 P37217 oasc.CachingDirectoryFactory.close Releasing directory:/usr/home/hudson/hudson-slave/workspace/Lucene-Solr-Tests-4.x-Java6/solr/build/solr-core/test/J1/./org.apache.solr.cloud.SyncSliceTest-1359834888038/jetty4
[junit4:junit4]   2> 18158 T1272 C108 P37217 oasu.DefaultSolrCoreState.newIndexWriter Creating new IndexWriter...
[junit4:junit4]   2> 18159 T1272 C108 P37217 oasu.DefaultSolrCoreState.newIndexWriter Waiting until IndexWriter is unused... core=collection1
[junit4:junit4]   2> 18159 T1272 C108 P37217 oasu.DefaultSolrCoreState.newIndexWriter Rollback old IndexWriter... core=collection1
[junit4:junit4]   2> 18160 T1272 C108 P37217 oasc.CachingDirectoryFactory.close Releasing directory:/usr/home/hudson/hudson-slave/workspace/Lucene-Solr-Tests-4.x-Java6/solr/build/solr-core/test/J1/./org.apache.solr.cloud.SyncSliceTest-1359834888038/jetty4/index.20130202225506176
[junit4:junit4]   2> 18160 T1272 C108 P37217 oasc.CachingDirectoryFactory.close Releasing directory:/usr/home/hudson/hudson-slave/workspace/Lucene-Solr-Tests-4.x-Java6/solr/build/solr-core/test/J1/./org.apache.solr.cloud.SyncSliceTest-1359834888038/jetty4
[junit4:junit4]   2> 18164 T1272 C108 P37217 oasc.SolrDeletionPolicy.onInit SolrDeletionPolicy.onInit: commits:num=1
[junit4:junit4]   2> 		commit{dir=RateLimitedDirectoryWrapper(NRTCachingDirectory(org.apache.lucene.store.NIOFSDirectory@/usr/home/hudson/hudson-slave/workspace/Lucene-Solr-Tests-4.x-Java6/solr/build/solr-core/test/J1/org.apache.solr.cloud.SyncSliceTest-1359834888038/jetty4/index.20130202225506176 lockFactory=org.apache.lucene.store.NativeFSLockFactory@22c5480; maxCacheMB=48.0 maxMergeSizeMB=4.0)),segFN=segments_4,generation=4,filenames=[segments_4]
[junit4:junit4]   2> 18164 T1272 C108 P37217 oasc.SolrDeletionPolicy.updateCommits newest commit = 4[segments_4]
[junit4:junit4]   2> 18164 T1272 C108 P37217 oasu.DefaultSolrCoreState.newIndexWriter New IndexWriter is ready to be used.
[junit4:junit4]   2> 18165 T1272 C108 P37217 oasc.CachingDirectoryFactory.close Releasing directory:/usr/home/hudson/hudson-slave/workspace/Lucene-Solr-Tests-4.x-Java6/solr/build/solr-core/test/J1/./org.apache.solr.cloud.SyncSliceTest-1359834888038/jetty4
[junit4:junit4]   2> 1816

[...truncated too long message...]

core/test/J1/./org.apache.solr.cloud.SyncSliceTest-1359834888038/jetty4
[junit4:junit4]   2> 145609 T1266 oaz.ClientCnxn$SendThread.logStartConnect Opening socket connection to server localhost/127.0.0.1:37189. Will not attempt to authenticate using SASL (access denied (javax.security.auth.AuthPermission getLoginConfiguration))
[junit4:junit4]   2> 164094 T1267 oaz.ClientCnxn$EventThread.run EventThread shut down
[junit4:junit4]   2> 164094 T1179 oaz.ZooKeeper.close Session: 0x13c9c79b76a000c closed
[junit4:junit4]   2> 164096 T1179 oejsh.ContextHandler.doStop stopped o.e.j.s.ServletContextHandler{/i_d/ql,null}
[junit4:junit4]   2> 164346 T1179 oas.SolrTestCaseJ4.tearDown ###Ending testDistribSearch
[junit4:junit4]   1> client port:0.0.0.0/0.0.0.0:0
[junit4:junit4]   2> NOTE: reproduce with: ant test  -Dtestcase=SyncSliceTest -Dtests.method=testDistribSearch -Dtests.seed=6AA35BCDC70B7AFA -Dtests.multiplier=3 -Dtests.slow=true -Dtests.locale=cs_CZ -Dtests.timezone=Asia/Baghdad -Dtests.file.encoding=UTF-8
[junit4:junit4] FAILURE  164s J1 | SyncSliceTest.testDistribSearch <<<
[junit4:junit4]    > Throwable #1: java.lang.AssertionError: shard1 should have just been set up to be inconsistent - but it's still consistent
[junit4:junit4]    > 	at __randomizedtesting.SeedInfo.seed([6AA35BCDC70B7AFA:EB45D5D5B0541AC6]:0)
[junit4:junit4]    > 	at org.junit.Assert.fail(Assert.java:93)
[junit4:junit4]    > 	at org.junit.Assert.assertTrue(Assert.java:43)
[junit4:junit4]    > 	at org.junit.Assert.assertNotNull(Assert.java:526)
[junit4:junit4]    > 	at org.apache.solr.cloud.SyncSliceTest.doTest(SyncSliceTest.java:214)
[junit4:junit4]    > 	at org.apache.solr.BaseDistributedSearchTestCase.testDistribSearch(BaseDistributedSearchTestCase.java:794)
[junit4:junit4]    > 	at sun.reflect.NativeMethodAccessorImpl.invoke0(Native Method)
[junit4:junit4]    > 	at sun.reflect.NativeMethodAccessorImpl.invoke(NativeMethodAccessorImpl.java:57)
[junit4:junit4]    > 	at sun.reflect.DelegatingMethodAccessorImpl.invoke(DelegatingMethodAccessorImpl.java:43)
[junit4:junit4]    > 	at java.lang.reflect.Method.invoke(Method.java:616)
[junit4:junit4]    > 	at com.carrotsearch.randomizedtesting.RandomizedRunner.invoke(RandomizedRunner.java:1559)
[junit4:junit4]    > 	at com.carrotsearch.randomizedtesting.RandomizedRunner.access$600(RandomizedRunner.java:79)
[junit4:junit4]    > 	at com.carrotsearch.randomizedtesting.RandomizedRunner$6.evaluate(RandomizedRunner.java:737)
[junit4:junit4]    > 	at com.carrotsearch.randomizedtesting.RandomizedRunner$7.evaluate(RandomizedRunner.java:773)
[junit4:junit4]    > 	at com.carrotsearch.randomizedtesting.RandomizedRunner$8.evaluate(RandomizedRunner.java:787)
[junit4:junit4]    > 	at com.carrotsearch.randomizedtesting.rules.SystemPropertiesRestoreRule$1.evaluate(SystemPropertiesRestoreRule.java:53)
[junit4:junit4]    > 	at org.apache.lucene.util.TestRuleSetupTeardownChained$1.evaluate(TestRuleSetupTeardownChained.java:50)
[junit4:junit4]    > 	at org.apache.lucene.util.TestRuleFieldCacheSanity$1.evaluate(TestRuleFieldCacheSanity.java:51)
[junit4:junit4]    > 	at org.apache.lucene.util.AbstractBeforeAfterRule$1.evaluate(AbstractBeforeAfterRule.java:46)
[junit4:junit4]    > 	at com.carrotsearch.randomizedtesting.rules.SystemPropertiesInvariantRule$1.evaluate(SystemPropertiesInvariantRule.java:55)
[junit4:junit4]    > 	at org.apache.lucene.util.TestRuleThreadAndTestName$1.evaluate(TestRuleThreadAndTestName.java:49)
[junit4:junit4]    > 	at org.apache.lucene.util.TestRuleIgnoreAfterMaxFailures$1.evaluate(TestRuleIgnoreAfterMaxFailures.java:70)
[junit4:junit4]    > 	at org.apache.lucene.util.TestRuleMarkFailure$1.evaluate(TestRuleMarkFailure.java:48)
[junit4:junit4]    > 	at com.carrotsearch.randomizedtesting.rules.StatementAdapter.evaluate(StatementAdapter.java:36)
[junit4:junit4]    > 	at com.carrotsearch.randomizedtesting.ThreadLeakControl$StatementRunner.run(ThreadLeakControl.java:358)
[junit4:junit4]    > 	at com.carrotsearch.randomizedtesting.ThreadLeakControl.forkTimeoutingTask(ThreadLeakControl.java:782)
[junit4:junit4]    > 	at com.carrotsearch.randomizedtesting.ThreadLeakControl$3.evaluate(ThreadLeakControl.java:442)
[junit4:junit4]    > 	at com.carrotsearch.randomizedtesting.RandomizedRunner.runSingleTest(RandomizedRunner.java:746)
[junit4:junit4]    > 	at com.carrotsearch.randomizedtesting.RandomizedRunner$3.evaluate(RandomizedRunner.java:648)
[junit4:junit4]    > 	at com.carrotsearch.randomizedtesting.RandomizedRunner$4.evaluate(RandomizedRunner.java:682)
[junit4:junit4]    > 	at com.carrotsearch.randomizedtesting.RandomizedRunner$5.evaluate(RandomizedRunner.java:693)
[junit4:junit4]    > 	at com.carrotsearch.randomizedtesting.rules.StatementAdapter.evaluate(StatementAdapter.java:36)
[junit4:junit4]    > 	at com.carrotsearch.randomizedtesting.rules.SystemPropertiesRestoreRule$1.evaluate(SystemPropertiesRestoreRule.java:53)
[junit4:junit4]    > 	at org.apache.lucene.util.AbstractBeforeAfterRule$1.evaluate(AbstractBeforeAfterRule.java:46)
[junit4:junit4]    > 	at org.apache.lucene.util.TestRuleStoreClassName$1.evaluate(TestRuleStoreClassName.java:42)
[junit4:junit4]    > 	at com.carrotsearch.randomizedtesting.rules.SystemPropertiesInvariantRule$1.evaluate(SystemPropertiesInvariantRule.java:55)
[junit4:junit4]    > 	at com.carrotsearch.randomizedtesting.rules.NoShadowingOrOverridesOnMethodsRule$1.evaluate(NoShadowingOrOverridesOnMethodsRule.java:39)
[junit4:junit4]    > 	at com.carrotsearch.randomizedtesting.rules.NoShadowingOrOverridesOnMethodsRule$1.evaluate(NoShadowingOrOverridesOnMethodsRule.java:39)
[junit4:junit4]    > 	at com.carrotsearch.randomizedtesting.rules.StatementAdapter.evaluate(StatementAdapter.java:36)
[junit4:junit4]    > 	at org.apache.lucene.util.TestRuleAssertionsRequired$1.evaluate(TestRuleAssertionsRequired.java:43)
[junit4:junit4]    > 	at org.apache.lucene.util.TestRuleMarkFailure$1.evaluate(TestRuleMarkFailure.java:48)
[junit4:junit4]    > 	at org.apache.lucene.util.TestRuleIgnoreAfterMaxFailures$1.evaluate(TestRuleIgnoreAfterMaxFailures.java:70)
[junit4:junit4]    > 	at org.apache.lucene.util.TestRuleIgnoreTestSuites$1.evaluate(TestRuleIgnoreTestSuites.java:55)
[junit4:junit4]    > 	at com.carrotsearch.randomizedtesting.rules.StatementAdapter.evaluate(StatementAdapter.java:36)
[junit4:junit4]    > 	at com.carrotsearch.randomizedtesting.ThreadLeakControl$StatementRunner.run(ThreadLeakControl.java:358)
[junit4:junit4]    > 	at java.lang.Thread.run(Thread.java:679)
[junit4:junit4]   2> 164367 T1179 oas.SolrTestCaseJ4.deleteCore ###deleteCore
[junit4:junit4]   2> NOTE: test params are: codec=Lucene42: {range_facet_l=MockFixedIntBlock(blockSize=1519), text=PostingsFormat(name=Direct), _version_=PostingsFormat(name=Memory doPackFST= true), rnd_b=PostingsFormat(name=Asserting), intDefault=PostingsFormat(name=Memory doPackFST= true), id=PostingsFormat(name=Asserting), timestamp=MockFixedIntBlock(blockSize=1519), a_t=MockFixedIntBlock(blockSize=1519), range_facet_sl=PostingsFormat(name=Asserting), range_facet_si=MockFixedIntBlock(blockSize=1519), other_tl1=PostingsFormat(name=Memory doPackFST= true), multiDefault=MockFixedIntBlock(blockSize=1519), a_si=PostingsFormat(name=Memory doPackFST= true)}, sim=RandomSimilarityProvider(queryNorm=false,coord=crazy): {}, locale=cs_CZ, timezone=Asia/Baghdad
[junit4:junit4]   2> NOTE: FreeBSD 9.0-RELEASE amd64/Sun Microsystems Inc. 1.6.0_32 (64-bit)/cpus=16,threads=2,free=151333704,total=430768128
[junit4:junit4]   2> NOTE: All tests run in this JVM: [DirectUpdateHandlerTest, TestOmitPositions, TestMergePolicyConfig, TestPropInject, BasicFunctionalityTest, TestSolrJ, TestLRUCache, PeerSyncTest, TestBinaryField, EchoParamsTest, QueryEqualityTest, UUIDFieldTest, DebugComponentTest, ClusterStateTest, HighlighterTest, TestCodecSupport, XsltUpdateRequestHandlerTest, TestDocSet, FileUtilsTest, DisMaxRequestHandlerTest, UpdateParamsTest, SuggesterTSTTest, StatelessScriptUpdateProcessorFactoryTest, TestPhraseSuggestions, TermVectorComponentTest, RecoveryZkTest, PrimitiveFieldTypeTest, OverseerCollectionProcessorTest, TestFunctionQuery, OpenExchangeRatesOrgProviderTest, TestCSVResponseWriter, RegexBoostProcessorTest, IndexReaderFactoryTest, TestSolrXMLSerializer, TestRealTimeGet, HardAutoCommitTest, URLClassifyProcessorTest, TestValueSourceCache, ShardRoutingCustomTest, XmlUpdateRequestHandlerTest, SolrIndexConfigTest, QueryParsingTest, LukeRequestHandlerTest, PrimUtilsTest, TestSurroundQueryParser, SoftAutoCommitTest, TestReplicationHandler, TestRTGBase, TestSolrDeletionPolicy2, TestDistributedGrouping, DOMUtilTest, TestReload, TermVectorComponentDistributedTest, IndexSchemaTest, TestAnalyzedSuggestions, TestPluginEnable, TestDFRSimilarityFactory, SyncSliceTest]
[junit4:junit4] Completed on J1 in 164.38s, 1 test, 1 failure <<< FAILURES!

[...truncated 453 lines...]
BUILD FAILED
/usr/home/hudson/hudson-slave/workspace/Lucene-Solr-Tests-4.x-Java6/build.xml:346: The following error occurred while executing this line:
/usr/home/hudson/hudson-slave/workspace/Lucene-Solr-Tests-4.x-Java6/build.xml:39: The following error occurred while executing this line:
/usr/home/hudson/hudson-slave/workspace/Lucene-Solr-Tests-4.x-Java6/solr/build.xml:178: The following error occurred while executing this line:
/usr/home/hudson/hudson-slave/workspace/Lucene-Solr-Tests-4.x-Java6/solr/common-build.xml:428: The following error occurred while executing this line:
/usr/home/hudson/hudson-slave/workspace/Lucene-Solr-Tests-4.x-Java6/lucene/common-build.xml:1176: The following error occurred while executing this line:
/usr/home/hudson/hudson-slave/workspace/Lucene-Solr-Tests-4.x-Java6/lucene/common-build.xml:841: There were test failures: 250 suites, 1041 tests, 1 failure, 23 ignored (5 assumptions)

Total time: 36 minutes 42 seconds
Build step 'Invoke Ant' marked build as failure
Archiving artifacts
Recording test results
Email was triggered for: Failure
Sending email for trigger: Failure



Mime
View raw message