lucene-dev mailing list archives

Site index · List index
Message view « Date » · « Thread »
Top « Date » · « Thread »
From Policeman Jenkins Server <jenk...@thetaphi.de>
Subject [JENKINS] Lucene-Solr-trunk-MacOSX (64bit/jdk1.7.0) - Build # 170 - Still Failing!
Date Fri, 01 Feb 2013 23:39:35 GMT
Build: http://jenkins.thetaphi.de/job/Lucene-Solr-trunk-MacOSX/170/
Java: 64bit/jdk1.7.0 -XX:+UseParallelGC

1 tests failed.
FAILED:  org.apache.solr.cloud.BasicDistributedZkTest.testDistribSearch

Error Message:
There are still nodes recoverying - waited for 230 seconds

Stack Trace:
java.lang.AssertionError: There are still nodes recoverying - waited for 230 seconds
	at __randomizedtesting.SeedInfo.seed([D40D6D0BC43D500A:55EBE313B3623036]:0)
	at org.junit.Assert.fail(Assert.java:93)
	at org.apache.solr.cloud.AbstractDistribZkTestBase.waitForRecoveriesToFinish(AbstractDistribZkTestBase.java:168)
	at org.apache.solr.cloud.AbstractDistribZkTestBase.waitForRecoveriesToFinish(AbstractDistribZkTestBase.java:126)
	at org.apache.solr.cloud.AbstractDistribZkTestBase.waitForRecoveriesToFinish(AbstractDistribZkTestBase.java:121)
	at org.apache.solr.cloud.BasicDistributedZkTest.testCoreUnloadAndLeaders(BasicDistributedZkTest.java:552)
	at org.apache.solr.cloud.BasicDistributedZkTest.doTest(BasicDistributedZkTest.java:337)
	at org.apache.solr.BaseDistributedSearchTestCase.testDistribSearch(BaseDistributedSearchTestCase.java:794)
	at sun.reflect.NativeMethodAccessorImpl.invoke0(Native Method)
	at sun.reflect.NativeMethodAccessorImpl.invoke(NativeMethodAccessorImpl.java:57)
	at sun.reflect.DelegatingMethodAccessorImpl.invoke(DelegatingMethodAccessorImpl.java:43)
	at java.lang.reflect.Method.invoke(Method.java:601)
	at com.carrotsearch.randomizedtesting.RandomizedRunner.invoke(RandomizedRunner.java:1559)
	at com.carrotsearch.randomizedtesting.RandomizedRunner.access$600(RandomizedRunner.java:79)
	at com.carrotsearch.randomizedtesting.RandomizedRunner$6.evaluate(RandomizedRunner.java:737)
	at com.carrotsearch.randomizedtesting.RandomizedRunner$7.evaluate(RandomizedRunner.java:773)
	at com.carrotsearch.randomizedtesting.RandomizedRunner$8.evaluate(RandomizedRunner.java:787)
	at com.carrotsearch.randomizedtesting.rules.SystemPropertiesRestoreRule$1.evaluate(SystemPropertiesRestoreRule.java:53)
	at org.apache.lucene.util.TestRuleSetupTeardownChained$1.evaluate(TestRuleSetupTeardownChained.java:50)
	at org.apache.lucene.util.TestRuleFieldCacheSanity$1.evaluate(TestRuleFieldCacheSanity.java:51)
	at org.apache.lucene.util.AbstractBeforeAfterRule$1.evaluate(AbstractBeforeAfterRule.java:46)
	at com.carrotsearch.randomizedtesting.rules.SystemPropertiesInvariantRule$1.evaluate(SystemPropertiesInvariantRule.java:55)
	at org.apache.lucene.util.TestRuleThreadAndTestName$1.evaluate(TestRuleThreadAndTestName.java:49)
	at org.apache.lucene.util.TestRuleIgnoreAfterMaxFailures$1.evaluate(TestRuleIgnoreAfterMaxFailures.java:70)
	at org.apache.lucene.util.TestRuleMarkFailure$1.evaluate(TestRuleMarkFailure.java:48)
	at com.carrotsearch.randomizedtesting.rules.StatementAdapter.evaluate(StatementAdapter.java:36)
	at com.carrotsearch.randomizedtesting.ThreadLeakControl$StatementRunner.run(ThreadLeakControl.java:358)
	at com.carrotsearch.randomizedtesting.ThreadLeakControl.forkTimeoutingTask(ThreadLeakControl.java:782)
	at com.carrotsearch.randomizedtesting.ThreadLeakControl$3.evaluate(ThreadLeakControl.java:442)
	at com.carrotsearch.randomizedtesting.RandomizedRunner.runSingleTest(RandomizedRunner.java:746)
	at com.carrotsearch.randomizedtesting.RandomizedRunner$3.evaluate(RandomizedRunner.java:648)
	at com.carrotsearch.randomizedtesting.RandomizedRunner$4.evaluate(RandomizedRunner.java:682)
	at com.carrotsearch.randomizedtesting.RandomizedRunner$5.evaluate(RandomizedRunner.java:693)
	at com.carrotsearch.randomizedtesting.rules.StatementAdapter.evaluate(StatementAdapter.java:36)
	at com.carrotsearch.randomizedtesting.rules.SystemPropertiesRestoreRule$1.evaluate(SystemPropertiesRestoreRule.java:53)
	at org.apache.lucene.util.AbstractBeforeAfterRule$1.evaluate(AbstractBeforeAfterRule.java:46)
	at org.apache.lucene.util.TestRuleStoreClassName$1.evaluate(TestRuleStoreClassName.java:42)
	at com.carrotsearch.randomizedtesting.rules.SystemPropertiesInvariantRule$1.evaluate(SystemPropertiesInvariantRule.java:55)
	at com.carrotsearch.randomizedtesting.rules.NoShadowingOrOverridesOnMethodsRule$1.evaluate(NoShadowingOrOverridesOnMethodsRule.java:39)
	at com.carrotsearch.randomizedtesting.rules.NoShadowingOrOverridesOnMethodsRule$1.evaluate(NoShadowingOrOverridesOnMethodsRule.java:39)
	at com.carrotsearch.randomizedtesting.rules.StatementAdapter.evaluate(StatementAdapter.java:36)
	at org.apache.lucene.util.TestRuleAssertionsRequired$1.evaluate(TestRuleAssertionsRequired.java:43)
	at org.apache.lucene.util.TestRuleMarkFailure$1.evaluate(TestRuleMarkFailure.java:48)
	at org.apache.lucene.util.TestRuleIgnoreAfterMaxFailures$1.evaluate(TestRuleIgnoreAfterMaxFailures.java:70)
	at org.apache.lucene.util.TestRuleIgnoreTestSuites$1.evaluate(TestRuleIgnoreTestSuites.java:55)
	at com.carrotsearch.randomizedtesting.rules.StatementAdapter.evaluate(StatementAdapter.java:36)
	at com.carrotsearch.randomizedtesting.ThreadLeakControl$StatementRunner.run(ThreadLeakControl.java:358)
	at java.lang.Thread.run(Thread.java:722)




Build Log:
[...truncated 9015 lines...]
[junit4:junit4] Suite: org.apache.solr.cloud.BasicDistributedZkTest
[junit4:junit4]   2> 1 T2451 oas.BaseDistributedSearchTestCase.initHostContext Setting hostContext system property: /
[junit4:junit4]   2> 11 T2451 oas.SolrTestCaseJ4.setUp ###Starting testDistribSearch
[junit4:junit4]   2> Creating dataDir: /Users/jenkins/jenkins-slave/workspace/Lucene-Solr-trunk-MacOSX/solr/build/solr-core/test/J0/./solrtest-BasicDistributedZkTest-1359760981067
[junit4:junit4]   2> 12 T2451 oasc.ZkTestServer.run STARTING ZK TEST SERVER
[junit4:junit4]   2> 13 T2452 oasc.ZkTestServer$ZKServerMain.runFromConfig Starting server
[junit4:junit4]   2> 16 T2452 oazs.ZooKeeperServer.setTickTime tickTime set to 1000
[junit4:junit4]   2> 16 T2452 oazs.ZooKeeperServer.setMinSessionTimeout minSessionTimeout set to -1
[junit4:junit4]   2> 17 T2452 oazs.ZooKeeperServer.setMaxSessionTimeout maxSessionTimeout set to -1
[junit4:junit4]   2> 18 T2452 oazs.NIOServerCnxnFactory.configure binding to port 0.0.0.0/0.0.0.0:0
[junit4:junit4]   2> 20 T2452 oazsp.FileTxnSnapLog.save Snapshotting: 0x0 to /Users/jenkins/jenkins-slave/workspace/Lucene-Solr-trunk-MacOSX/solr/build/solr-core/test/J0/./org.apache.solr.cloud.BasicDistributedZkTest-1359760981066/zookeeper/server1/data/version-2/snapshot.0
[junit4:junit4]   2> 114 T2451 oasc.ZkTestServer.run start zk server on port:49916
[junit4:junit4]   2> 114 T2451 oaz.ZooKeeper.<init> Initiating client connection, connectString=127.0.0.1:49916 sessionTimeout=10000 watcher=org.apache.solr.common.cloud.ConnectionManager@3e1ff2a6
[junit4:junit4]   2> 121 T2457 oaz.ClientCnxn$SendThread.logStartConnect Opening socket connection to server localhost/127.0.0.1:49916. Will not attempt to authenticate using SASL (access denied ("javax.security.auth.AuthPermission" "getLoginConfiguration"))
[junit4:junit4]   2> 118 T2451 oascc.ConnectionManager.waitForConnected Waiting for client to connect to ZooKeeper
[junit4:junit4]   2> 122 T2457 oaz.ClientCnxn$SendThread.primeConnection Socket connection established to localhost/127.0.0.1:49916, initiating session
[junit4:junit4]   2> 122 T2453 oazs.NIOServerCnxnFactory.run Accepted socket connection from /127.0.0.1:49917
[junit4:junit4]   2> 123 T2453 oazs.ZooKeeperServer.processConnectRequest Client attempting to establish new session at /127.0.0.1:49917
[junit4:junit4]   2> 123 T2455 oazsp.FileTxnLog.append Creating new log file: log.1
[junit4:junit4]   2> 126 T2455 oazs.ZooKeeperServer.finishSessionInit Established session 0x13c9811fc540000 with negotiated timeout 10000 for client /127.0.0.1:49917
[junit4:junit4]   2> 126 T2457 oaz.ClientCnxn$SendThread.onConnected Session establishment complete on server localhost/127.0.0.1:49916, sessionid = 0x13c9811fc540000, negotiated timeout = 10000
[junit4:junit4]   2> 127 T2458 oascc.ConnectionManager.process Watcher org.apache.solr.common.cloud.ConnectionManager@3e1ff2a6 name:ZooKeeperConnection Watcher:127.0.0.1:49916 got event WatchedEvent state:SyncConnected type:None path:null path:null type:None
[junit4:junit4]   2> 127 T2451 oascc.ConnectionManager.waitForConnected Client is connected to ZooKeeper
[junit4:junit4]   2> 128 T2451 oascc.SolrZkClient.makePath makePath: /solr
[junit4:junit4]   2> 134 T2456 oazs.PrepRequestProcessor.pRequest2Txn Processed session termination for sessionid: 0x13c9811fc540000
[junit4:junit4]   2> 136 T2453 oazs.NIOServerCnxn.closeSock Closed socket connection for client /127.0.0.1:49917 which had sessionid 0x13c9811fc540000
[junit4:junit4]   2> 137 T2458 oaz.ClientCnxn$EventThread.run EventThread shut down
[junit4:junit4]   2> 137 T2451 oaz.ZooKeeper.close Session: 0x13c9811fc540000 closed
[junit4:junit4]   2> 137 T2451 oaz.ZooKeeper.<init> Initiating client connection, connectString=127.0.0.1:49916/solr sessionTimeout=10000 watcher=org.apache.solr.common.cloud.ConnectionManager@24f60dce
[junit4:junit4]   2> 138 T2451 oascc.ConnectionManager.waitForConnected Waiting for client to connect to ZooKeeper
[junit4:junit4]   2> 139 T2459 oaz.ClientCnxn$SendThread.logStartConnect Opening socket connection to server localhost/127.0.0.1:49916. Will not attempt to authenticate using SASL (access denied ("javax.security.auth.AuthPermission" "getLoginConfiguration"))
[junit4:junit4]   2> 140 T2459 oaz.ClientCnxn$SendThread.primeConnection Socket connection established to localhost/127.0.0.1:49916, initiating session
[junit4:junit4]   2> 140 T2453 oazs.NIOServerCnxnFactory.run Accepted socket connection from /127.0.0.1:49918
[junit4:junit4]   2> 140 T2453 oazs.ZooKeeperServer.processConnectRequest Client attempting to establish new session at /127.0.0.1:49918
[junit4:junit4]   2> 142 T2455 oazs.ZooKeeperServer.finishSessionInit Established session 0x13c9811fc540001 with negotiated timeout 10000 for client /127.0.0.1:49918
[junit4:junit4]   2> 142 T2459 oaz.ClientCnxn$SendThread.onConnected Session establishment complete on server localhost/127.0.0.1:49916, sessionid = 0x13c9811fc540001, negotiated timeout = 10000
[junit4:junit4]   2> 143 T2460 oascc.ConnectionManager.process Watcher org.apache.solr.common.cloud.ConnectionManager@24f60dce name:ZooKeeperConnection Watcher:127.0.0.1:49916/solr got event WatchedEvent state:SyncConnected type:None path:null path:null type:None
[junit4:junit4]   2> 143 T2451 oascc.ConnectionManager.waitForConnected Client is connected to ZooKeeper
[junit4:junit4]   2> 143 T2451 oascc.SolrZkClient.makePath makePath: /collections/collection1
[junit4:junit4]   2> 148 T2451 oascc.SolrZkClient.makePath makePath: /collections/collection1/shards
[junit4:junit4]   2> 152 T2451 oascc.SolrZkClient.makePath makePath: /collections/control_collection
[junit4:junit4]   2> 161 T2451 oascc.SolrZkClient.makePath makePath: /collections/control_collection/shards
[junit4:junit4]   2> 165 T2451 oasc.AbstractZkTestCase.putConfig put /Users/jenkins/jenkins-slave/workspace/Lucene-Solr-trunk-MacOSX/solr/build/solr-core/test-files/solr/collection1/conf/solrconfig.xml to /configs/conf1/solrconfig.xml
[junit4:junit4]   2> 166 T2451 oascc.SolrZkClient.makePath makePath: /configs/conf1/solrconfig.xml
[junit4:junit4]   2> 172 T2451 oasc.AbstractZkTestCase.putConfig put /Users/jenkins/jenkins-slave/workspace/Lucene-Solr-trunk-MacOSX/solr/build/solr-core/test-files/solr/collection1/conf/schema.xml to /configs/conf1/schema.xml
[junit4:junit4]   2> 174 T2451 oascc.SolrZkClient.makePath makePath: /configs/conf1/schema.xml
[junit4:junit4]   2> 179 T2451 oasc.AbstractZkTestCase.putConfig put /Users/jenkins/jenkins-slave/workspace/Lucene-Solr-trunk-MacOSX/solr/build/solr-core/test-files/solr/collection1/conf/stopwords.txt to /configs/conf1/stopwords.txt
[junit4:junit4]   2> 180 T2451 oascc.SolrZkClient.makePath makePath: /configs/conf1/stopwords.txt
[junit4:junit4]   2> 183 T2451 oasc.AbstractZkTestCase.putConfig put /Users/jenkins/jenkins-slave/workspace/Lucene-Solr-trunk-MacOSX/solr/build/solr-core/test-files/solr/collection1/conf/protwords.txt to /configs/conf1/protwords.txt
[junit4:junit4]   2> 184 T2451 oascc.SolrZkClient.makePath makePath: /configs/conf1/protwords.txt
[junit4:junit4]   2> 192 T2451 oasc.AbstractZkTestCase.putConfig put /Users/jenkins/jenkins-slave/workspace/Lucene-Solr-trunk-MacOSX/solr/build/solr-core/test-files/solr/collection1/conf/currency.xml to /configs/conf1/currency.xml
[junit4:junit4]   2> 194 T2451 oascc.SolrZkClient.makePath makePath: /configs/conf1/currency.xml
[junit4:junit4]   2> 201 T2451 oasc.AbstractZkTestCase.putConfig put /Users/jenkins/jenkins-slave/workspace/Lucene-Solr-trunk-MacOSX/solr/build/solr-core/test-files/solr/collection1/conf/open-exchange-rates.json to /configs/conf1/open-exchange-rates.json
[junit4:junit4]   2> 202 T2451 oascc.SolrZkClient.makePath makePath: /configs/conf1/open-exchange-rates.json
[junit4:junit4]   2> 207 T2451 oasc.AbstractZkTestCase.putConfig put /Users/jenkins/jenkins-slave/workspace/Lucene-Solr-trunk-MacOSX/solr/build/solr-core/test-files/solr/collection1/conf/mapping-ISOLatin1Accent.txt to /configs/conf1/mapping-ISOLatin1Accent.txt
[junit4:junit4]   2> 208 T2451 oascc.SolrZkClient.makePath makePath: /configs/conf1/mapping-ISOLatin1Accent.txt
[junit4:junit4]   2> 212 T2451 oasc.AbstractZkTestCase.putConfig put /Users/jenkins/jenkins-slave/workspace/Lucene-Solr-trunk-MacOSX/solr/build/solr-core/test-files/solr/collection1/conf/old_synonyms.txt to /configs/conf1/old_synonyms.txt
[junit4:junit4]   2> 213 T2451 oascc.SolrZkClient.makePath makePath: /configs/conf1/old_synonyms.txt
[junit4:junit4]   2> 216 T2451 oasc.AbstractZkTestCase.putConfig put /Users/jenkins/jenkins-slave/workspace/Lucene-Solr-trunk-MacOSX/solr/build/solr-core/test-files/solr/collection1/conf/synonyms.txt to /configs/conf1/synonyms.txt
[junit4:junit4]   2> 218 T2451 oascc.SolrZkClient.makePath makePath: /configs/conf1/synonyms.txt
[junit4:junit4]   2> 222 T2456 oazs.PrepRequestProcessor.pRequest2Txn Processed session termination for sessionid: 0x13c9811fc540001
[junit4:junit4]   2> 223 T2453 oazs.NIOServerCnxn.closeSock Closed socket connection for client /127.0.0.1:49918 which had sessionid 0x13c9811fc540001
[junit4:junit4]   2> 224 T2460 oaz.ClientCnxn$EventThread.run EventThread shut down
[junit4:junit4]   2> 224 T2451 oaz.ZooKeeper.close Session: 0x13c9811fc540001 closed
[junit4:junit4]   2> 441 T2451 oejs.Server.doStart jetty-8.1.8.v20121106
[junit4:junit4]   2> 449 T2451 oejs.AbstractConnector.doStart Started SelectChannelConnector@127.0.0.1:49919
[junit4:junit4]   2> 450 T2451 oass.SolrDispatchFilter.init SolrDispatchFilter.init()
[junit4:junit4]   2> 451 T2451 oasc.SolrResourceLoader.locateSolrHome JNDI not configured for solr (NoInitialContextEx)
[junit4:junit4]   2> 451 T2451 oasc.SolrResourceLoader.locateSolrHome using system property solr.solr.home: /Users/jenkins/jenkins-slave/workspace/Lucene-Solr-trunk-MacOSX/solr/build/solr-core/test/J0/./org.apache.solr.cloud.BasicDistributedZkTest-controljetty-1359760981279
[junit4:junit4]   2> 452 T2451 oasc.CoreContainer$Initializer.initialize looking for solr.xml: /Users/jenkins/jenkins-slave/workspace/Lucene-Solr-trunk-MacOSX/solr/build/solr-core/test/J0/./org.apache.solr.cloud.BasicDistributedZkTest-controljetty-1359760981279/solr.xml
[junit4:junit4]   2> 452 T2451 oasc.CoreContainer.<init> New CoreContainer 1511930199
[junit4:junit4]   2> 453 T2451 oasc.CoreContainer.load Loading CoreContainer using Solr Home: '/Users/jenkins/jenkins-slave/workspace/Lucene-Solr-trunk-MacOSX/solr/build/solr-core/test/J0/./org.apache.solr.cloud.BasicDistributedZkTest-controljetty-1359760981279/'
[junit4:junit4]   2> 457 T2451 oasc.SolrResourceLoader.<init> new SolrResourceLoader for directory: '/Users/jenkins/jenkins-slave/workspace/Lucene-Solr-trunk-MacOSX/solr/build/solr-core/test/J0/./org.apache.solr.cloud.BasicDistributedZkTest-controljetty-1359760981279/'
[junit4:junit4]   2> 514 T2451 oashc.HttpShardHandlerFactory.getParameter Setting socketTimeout to: 60000
[junit4:junit4]   2> 515 T2451 oashc.HttpShardHandlerFactory.getParameter Setting urlScheme to: http://
[junit4:junit4]   2> 515 T2451 oashc.HttpShardHandlerFactory.getParameter Setting connTimeout to: 15000
[junit4:junit4]   2> 516 T2451 oashc.HttpShardHandlerFactory.getParameter Setting maxConnectionsPerHost to: 20
[junit4:junit4]   2> 516 T2451 oashc.HttpShardHandlerFactory.getParameter Setting corePoolSize to: 0
[junit4:junit4]   2> 517 T2451 oashc.HttpShardHandlerFactory.getParameter Setting maximumPoolSize to: 2147483647
[junit4:junit4]   2> 518 T2451 oashc.HttpShardHandlerFactory.getParameter Setting maxThreadIdleTime to: 5
[junit4:junit4]   2> 518 T2451 oashc.HttpShardHandlerFactory.getParameter Setting sizeOfQueue to: -1
[junit4:junit4]   2> 523 T2451 oashc.HttpShardHandlerFactory.getParameter Setting fairnessPolicy to: false
[junit4:junit4]   2> 525 T2451 oascsi.HttpClientUtil.createClient Creating new http client, config:maxConnectionsPerHost=20&maxConnections=10000&socketTimeout=60000&connTimeout=15000&retry=false
[junit4:junit4]   2> 537 T2451 oasc.CoreContainer.load Registering Log Listener
[junit4:junit4]   2> 554 T2451 oasc.CoreContainer.initZooKeeper Zookeeper client=127.0.0.1:49916/solr
[junit4:junit4]   2> 554 T2451 oasc.ZkController.checkChrootPath zkHost includes chroot
[junit4:junit4]   2> 555 T2451 oaz.ZooKeeper.<init> Initiating client connection, connectString=127.0.0.1:49916 sessionTimeout=60000 watcher=org.apache.solr.common.cloud.ConnectionManager@1ae67f17
[junit4:junit4]   2> 556 T2470 oaz.ClientCnxn$SendThread.logStartConnect Opening socket connection to server localhost/127.0.0.1:49916. Will not attempt to authenticate using SASL (access denied ("javax.security.auth.AuthPermission" "getLoginConfiguration"))
[junit4:junit4]   2> 557 T2451 oascc.ConnectionManager.waitForConnected Waiting for client to connect to ZooKeeper
[junit4:junit4]   2> 558 T2470 oaz.ClientCnxn$SendThread.primeConnection Socket connection established to localhost/127.0.0.1:49916, initiating session
[junit4:junit4]   2> 559 T2453 oazs.NIOServerCnxnFactory.run Accepted socket connection from /127.0.0.1:49920
[junit4:junit4]   2> 560 T2453 oazs.ZooKeeperServer.processConnectRequest Client attempting to establish new session at /127.0.0.1:49920
[junit4:junit4]   2> 561 T2455 oazs.ZooKeeperServer.finishSessionInit Established session 0x13c9811fc540002 with negotiated timeout 20000 for client /127.0.0.1:49920
[junit4:junit4]   2> 561 T2470 oaz.ClientCnxn$SendThread.onConnected Session establishment complete on server localhost/127.0.0.1:49916, sessionid = 0x13c9811fc540002, negotiated timeout = 20000
[junit4:junit4]   2> 561 T2471 oascc.ConnectionManager.process Watcher org.apache.solr.common.cloud.ConnectionManager@1ae67f17 name:ZooKeeperConnection Watcher:127.0.0.1:49916 got event WatchedEvent state:SyncConnected type:None path:null path:null type:None
[junit4:junit4]   2> 562 T2451 oascc.ConnectionManager.waitForConnected Client is connected to ZooKeeper
[junit4:junit4]   2> 563 T2456 oazs.PrepRequestProcessor.pRequest2Txn Processed session termination for sessionid: 0x13c9811fc540002
[junit4:junit4]   2> 564 T2453 oazs.NIOServerCnxn.closeSock Closed socket connection for client /127.0.0.1:49920 which had sessionid 0x13c9811fc540002
[junit4:junit4]   2> 564 T2451 oaz.ZooKeeper.close Session: 0x13c9811fc540002 closed
[junit4:junit4]   2> 565 T2451 oascsi.HttpClientUtil.createClient Creating new http client, config:maxConnections=500&maxConnectionsPerHost=16&socketTimeout=60000&connTimeout=15000
[junit4:junit4]   2> 567 T2471 oaz.ClientCnxn$EventThread.run EventThread shut down
[junit4:junit4]   2> 570 T2451 oaz.ZooKeeper.<init> Initiating client connection, connectString=127.0.0.1:49916/solr sessionTimeout=30000 watcher=org.apache.solr.common.cloud.ConnectionManager@7f6e8c23
[junit4:junit4]   2> 572 T2472 oaz.ClientCnxn$SendThread.logStartConnect Opening socket connection to server localhost/127.0.0.1:49916. Will not attempt to authenticate using SASL (access denied ("javax.security.auth.AuthPermission" "getLoginConfiguration"))
[junit4:junit4]   2> 572 T2451 oascc.ConnectionManager.waitForConnected Waiting for client to connect to ZooKeeper
[junit4:junit4]   2> 573 T2472 oaz.ClientCnxn$SendThread.primeConnection Socket connection established to localhost/127.0.0.1:49916, initiating session
[junit4:junit4]   2> 574 T2453 oazs.NIOServerCnxnFactory.run Accepted socket connection from /127.0.0.1:49921
[junit4:junit4]   2> 574 T2453 oazs.ZooKeeperServer.processConnectRequest Client attempting to establish new session at /127.0.0.1:49921
[junit4:junit4]   2> 575 T2455 oazs.ZooKeeperServer.finishSessionInit Established session 0x13c9811fc540003 with negotiated timeout 20000 for client /127.0.0.1:49921
[junit4:junit4]   2> 575 T2472 oaz.ClientCnxn$SendThread.onConnected Session establishment complete on server localhost/127.0.0.1:49916, sessionid = 0x13c9811fc540003, negotiated timeout = 20000
[junit4:junit4]   2> 576 T2473 oascc.ConnectionManager.process Watcher org.apache.solr.common.cloud.ConnectionManager@7f6e8c23 name:ZooKeeperConnection Watcher:127.0.0.1:49916/solr got event WatchedEvent state:SyncConnected type:None path:null path:null type:None
[junit4:junit4]   2> 576 T2451 oascc.ConnectionManager.waitForConnected Client is connected to ZooKeeper
[junit4:junit4]   2> 582 T2456 oazs.PrepRequestProcessor.pRequest Got user-level KeeperException when processing sessionid:0x13c9811fc540003 type:create cxid:0x2 zxid:0x1a txntype:-1 reqpath:n/a Error Path:/solr/overseer Error:KeeperErrorCode = NodeExists for /solr/overseer
[junit4:junit4]   2> 586 T2451 oascc.SolrZkClient.makePath makePath: /live_nodes
[junit4:junit4]   2> 591 T2451 oasc.ZkController.createEphemeralLiveNode Register node as live in ZooKeeper:/live_nodes/127.0.0.1:49919_
[junit4:junit4]   2> 592 T2456 oazs.PrepRequestProcessor.pRequest Got user-level KeeperException when processing sessionid:0x13c9811fc540003 type:delete cxid:0x7 zxid:0x1c txntype:-1 reqpath:n/a Error Path:/solr/live_nodes/127.0.0.1:49919_ Error:KeeperErrorCode = NoNode for /solr/live_nodes/127.0.0.1:49919_
[junit4:junit4]   2> 593 T2451 oascc.SolrZkClient.makePath makePath: /live_nodes/127.0.0.1:49919_
[junit4:junit4]   2> 598 T2451 oascc.SolrZkClient.makePath makePath: /overseer_elect/election
[junit4:junit4]   2> 606 T2456 oazs.PrepRequestProcessor.pRequest Got user-level KeeperException when processing sessionid:0x13c9811fc540003 type:delete cxid:0x15 zxid:0x21 txntype:-1 reqpath:n/a Error Path:/solr/overseer_elect/leader Error:KeeperErrorCode = NoNode for /solr/overseer_elect/leader
[junit4:junit4]   2> 607 T2451 oascc.SolrZkClient.makePath makePath: /overseer_elect/leader
[junit4:junit4]   2> 610 T2451 oasc.Overseer.start Overseer (id=89113295655796739-127.0.0.1:49919_-n_0000000000) starting
[junit4:junit4]   2> 611 T2456 oazs.PrepRequestProcessor.pRequest Got user-level KeeperException when processing sessionid:0x13c9811fc540003 type:create cxid:0x1a zxid:0x23 txntype:-1 reqpath:n/a Error Path:/solr/overseer Error:KeeperErrorCode = NodeExists for /solr/overseer
[junit4:junit4]   2> 612 T2456 oazs.PrepRequestProcessor.pRequest Got user-level KeeperException when processing sessionid:0x13c9811fc540003 type:create cxid:0x1b zxid:0x24 txntype:-1 reqpath:n/a Error Path:/solr/overseer Error:KeeperErrorCode = NodeExists for /solr/overseer
[junit4:junit4]   2> 613 T2456 oazs.PrepRequestProcessor.pRequest Got user-level KeeperException when processing sessionid:0x13c9811fc540003 type:create cxid:0x1c zxid:0x25 txntype:-1 reqpath:n/a Error Path:/solr/overseer Error:KeeperErrorCode = NodeExists for /solr/overseer
[junit4:junit4]   2> 615 T2456 oazs.PrepRequestProcessor.pRequest Got user-level KeeperException when processing sessionid:0x13c9811fc540003 type:create cxid:0x1d zxid:0x26 txntype:-1 reqpath:n/a Error Path:/solr/overseer Error:KeeperErrorCode = NodeExists for /solr/overseer
[junit4:junit4]   2> 617 T2475 oasc.OverseerCollectionProcessor.run Process current queue of collection creations
[junit4:junit4]   2> 619 T2451 oascc.SolrZkClient.makePath makePath: /clusterstate.json
[junit4:junit4]   2> 624 T2451 oascc.ZkStateReader.createClusterStateWatchersAndUpdate Updating cluster state from ZooKeeper... 
[junit4:junit4]   2> 627 T2474 oasc.Overseer$ClusterStateUpdater.run Starting to work on the main queue
[junit4:junit4]   2> 633 T2476 oasc.CoreContainer.create Creating SolrCore 'collection1' using instanceDir: /Users/jenkins/jenkins-slave/workspace/Lucene-Solr-trunk-MacOSX/solr/build/solr-core/test/J0/./org.apache.solr.cloud.BasicDistributedZkTest-controljetty-1359760981279/collection1
[junit4:junit4]   2> 633 T2476 oasc.ZkController.createCollectionZkNode Check for collection zkNode:control_collection
[junit4:junit4]   2> 634 T2476 oasc.ZkController.createCollectionZkNode Collection zkNode exists
[junit4:junit4]   2> 634 T2476 oasc.ZkController.readConfigName Load collection config from:/collections/control_collection
[junit4:junit4]   2> 636 T2476 oasc.SolrResourceLoader.<init> new SolrResourceLoader for directory: '/Users/jenkins/jenkins-slave/workspace/Lucene-Solr-trunk-MacOSX/solr/build/solr-core/test/J0/./org.apache.solr.cloud.BasicDistributedZkTest-controljetty-1359760981279/collection1/'
[junit4:junit4]   2> 637 T2476 oasc.SolrResourceLoader.replaceClassLoader Adding 'file:/Users/jenkins/jenkins-slave/workspace/Lucene-Solr-trunk-MacOSX/solr/build/solr-core/test/J0/org.apache.solr.cloud.BasicDistributedZkTest-controljetty-1359760981279/collection1/lib/classes/' to classloader
[junit4:junit4]   2> 637 T2476 oasc.SolrResourceLoader.replaceClassLoader Adding 'file:/Users/jenkins/jenkins-slave/workspace/Lucene-Solr-trunk-MacOSX/solr/build/solr-core/test/J0/org.apache.solr.cloud.BasicDistributedZkTest-controljetty-1359760981279/collection1/lib/README' to classloader
[junit4:junit4]   2> 688 T2476 oasc.SolrConfig.<init> Using Lucene MatchVersion: LUCENE_50
[junit4:junit4]   2> 772 T2476 oasc.SolrConfig.<init> Loaded SolrConfig: solrconfig.xml
[junit4:junit4]   2> 773 T2476 oass.IndexSchema.readSchema Reading Solr Schema
[junit4:junit4]   2> 786 T2476 oass.IndexSchema.readSchema Schema name=test
[junit4:junit4]   2> 1410 T2476 oass.OpenExchangeRatesOrgProvider.init Initialized with rates=open-exchange-rates.json, refreshInterval=1440.
[junit4:junit4]   2> 1419 T2476 oass.IndexSchema.readSchema default search field in schema is text
[junit4:junit4]   2> 1424 T2476 oass.IndexSchema.readSchema unique key field: id
[junit4:junit4]   2> 1442 T2476 oass.FileExchangeRateProvider.reload Reloading exchange rates from file currency.xml
[junit4:junit4]   2> 1447 T2476 oass.FileExchangeRateProvider.reload Reloading exchange rates from file currency.xml
[junit4:junit4]   2> 1451 T2476 oass.OpenExchangeRatesOrgProvider.reload Reloading exchange rates from open-exchange-rates.json
[junit4:junit4]   2> 1458 T2476 oass.OpenExchangeRatesOrgProvider.reload Reloading exchange rates from open-exchange-rates.json
[junit4:junit4]   2> 1460 T2476 oasc.SolrCore.<init> [collection1] Opening new SolrCore at /Users/jenkins/jenkins-slave/workspace/Lucene-Solr-trunk-MacOSX/solr/build/solr-core/test/J0/./org.apache.solr.cloud.BasicDistributedZkTest-controljetty-1359760981279/collection1/, dataDir=./org.apache.solr.cloud.BasicDistributedZkTest-1359760981066/control/data/
[junit4:junit4]   2> 1461 T2476 oasc.JmxMonitoredMap.<init> JMX monitoring is enabled. Adding Solr mbeans to JMX Server: com.sun.jmx.mbeanserver.JmxMBeanServer@455bac23
[junit4:junit4]   2> 1462 T2476 oasc.SolrCore.initDirectoryFactory solr.NRTCachingDirectoryFactory
[junit4:junit4]   2> 1463 T2476 oasc.CachingDirectoryFactory.get return new directory for /Users/jenkins/jenkins-slave/workspace/Lucene-Solr-trunk-MacOSX/solr/build/solr-core/test/J0/./org.apache.solr.cloud.BasicDistributedZkTest-1359760981066/control/data forceNew:false
[junit4:junit4]   2> 1464 T2476 oasc.CachingDirectoryFactory.close Releasing directory:/Users/jenkins/jenkins-slave/workspace/Lucene-Solr-trunk-MacOSX/solr/build/solr-core/test/J0/./org.apache.solr.cloud.BasicDistributedZkTest-1359760981066/control/data
[junit4:junit4]   2> 1464 T2476 oasc.SolrCore.getNewIndexDir New index directory detected: old=null new=./org.apache.solr.cloud.BasicDistributedZkTest-1359760981066/control/data/index/
[junit4:junit4]   2> 1465 T2476 oasc.SolrCore.initIndex WARNING [collection1] Solr index directory './org.apache.solr.cloud.BasicDistributedZkTest-1359760981066/control/data/index' doesn't exist. Creating new index...
[junit4:junit4]   2> 1466 T2476 oasc.CachingDirectoryFactory.get return new directory for /Users/jenkins/jenkins-slave/workspace/Lucene-Solr-trunk-MacOSX/solr/build/solr-core/test/J0/./org.apache.solr.cloud.BasicDistributedZkTest-1359760981066/control/data/index forceNew:false
[junit4:junit4]   2> 1474 T2476 oasc.SolrDeletionPolicy.onCommit SolrDeletionPolicy.onCommit: commits:num=1
[junit4:junit4]   2> 		commit{dir=RateLimitedDirectoryWrapper(NRTCachingDirectory(org.apache.lucene.store.NIOFSDirectory@/Users/jenkins/jenkins-slave/workspace/Lucene-Solr-trunk-MacOSX/solr/build/solr-core/test/J0/org.apache.solr.cloud.BasicDistributedZkTest-1359760981066/control/data/index lockFactory=org.apache.lucene.store.NativeFSLockFactory@39741482; maxCacheMB=48.0 maxMergeSizeMB=4.0)),segFN=segments_1,generation=1,filenames=[segments_1]
[junit4:junit4]   2> 1474 T2476 oasc.SolrDeletionPolicy.updateCommits newest commit = 1[segments_1]
[junit4:junit4]   2> 1475 T2476 oasc.CachingDirectoryFactory.close Releasing directory:/Users/jenkins/jenkins-slave/workspace/Lucene-Solr-trunk-MacOSX/solr/build/solr-core/test/J0/./org.apache.solr.cloud.BasicDistributedZkTest-1359760981066/control/data/index
[junit4:junit4]   2> 1476 T2476 oasc.SolrCore.initWriters created xml: solr.XMLResponseWriter
[junit4:junit4]   2> 1478 T2476 oasup.UpdateRequestProcessorChain.init inserting DistributedUpdateProcessorFactory into updateRequestProcessorChain "dedupe"
[junit4:junit4]   2> 1479 T2476 oasup.UpdateRequestProcessorChain.init inserting DistributedUpdateProcessorFactory into updateRequestProcessorChain "dedupe-allfields"
[junit4:junit4]   2> 1479 T2476 oasup.UpdateRequestProcessorChain.init inserting DistributedUpdateProcessorFactory into updateRequestProcessorChain "stored_sig"
[junit4:junit4]   2> 1495 T2476 oasup.UpdateRequestProcessorChain.init inserting DistributedUpdateProcessorFactory into updateRequestProcessorChain "uniq-fields"
[junit4:junit4]   2> 1496 T2476 oasup.UpdateRequestProcessorChain.init inserting DistributedUpdateProcessorFactory into updateRequestProcessorChain "distrib-dup-test-chain-implicit"
[junit4:junit4]   2> 1496 T2476 oasc.RequestHandlers.initHandlersFromConfig adding lazy requestHandler: solr.ReplicationHandler
[junit4:junit4]   2> 1497 T2476 oasc.RequestHandlers.initHandlersFromConfig created /replication: solr.ReplicationHandler
[junit4:junit4]   2> 1497 T2476 oasc.RequestHandlers.initHandlersFromConfig created standard: solr.StandardRequestHandler
[junit4:junit4]   2> 1497 T2476 oasc.RequestHandlers.initHandlersFromConfig created /get: solr.RealTimeGetHandler
[junit4:junit4]   2> 1498 T2476 oasc.RequestHandlers.initHandlersFromConfig created dismax: solr.SearchHandler
[junit4:junit4]   2> 1498 T2476 oasc.RequestHandlers.initHandlersFromConfig created mock: org.apache.solr.core.MockQuerySenderListenerReqHandler
[junit4:junit4]   2> 1499 T2476 oasc.RequestHandlers.initHandlersFromConfig created /admin/: org.apache.solr.handler.admin.AdminHandlers
[junit4:junit4]   2> 1499 T2476 oasc.RequestHandlers.initHandlersFromConfig created defaults: solr.StandardRequestHandler
[junit4:junit4]   2> 1499 T2476 oasc.RequestHandlers.initHandlersFromConfig adding lazy requestHandler: solr.StandardRequestHandler
[junit4:junit4]   2> 1500 T2476 oasc.RequestHandlers.initHandlersFromConfig created lazy: solr.StandardRequestHandler
[junit4:junit4]   2> 1500 T2476 oasc.RequestHandlers.initHandlersFromConfig created /update: solr.UpdateRequestHandler
[junit4:junit4]   2> 1501 T2476 oasc.RequestHandlers.initHandlersFromConfig created /terms: org.apache.solr.handler.component.SearchHandler
[junit4:junit4]   2> 1501 T2476 oasc.RequestHandlers.initHandlersFromConfig created spellCheckCompRH: org.apache.solr.handler.component.SearchHandler
[junit4:junit4]   2> 1501 T2476 oasc.RequestHandlers.initHandlersFromConfig created spellCheckCompRH_Direct: org.apache.solr.handler.component.SearchHandler
[junit4:junit4]   2> 1502 T2476 oasc.RequestHandlers.initHandlersFromConfig created spellCheckWithWordbreak: org.apache.solr.handler.component.SearchHandler
[junit4:junit4]   2> 1502 T2476 oasc.RequestHandlers.initHandlersFromConfig created spellCheckWithWordbreak_Direct: org.apache.solr.handler.component.SearchHandler
[junit4:junit4]   2> 1503 T2476 oasc.RequestHandlers.initHandlersFromConfig created spellCheckCompRH1: org.apache.solr.handler.component.SearchHandler
[junit4:junit4]   2> 1504 T2476 oasc.RequestHandlers.initHandlersFromConfig created mltrh: org.apache.solr.handler.component.SearchHandler
[junit4:junit4]   2> 1504 T2476 oasc.RequestHandlers.initHandlersFromConfig created tvrh: org.apache.solr.handler.component.SearchHandler
[junit4:junit4]   2> 1504 T2476 oasc.RequestHandlers.initHandlersFromConfig created /mlt: solr.MoreLikeThisHandler
[junit4:junit4]   2> 1505 T2476 oasc.RequestHandlers.initHandlersFromConfig created /debug/dump: solr.DumpRequestHandler
[junit4:junit4]   2> 1511 T2476 oashl.XMLLoader.init xsltCacheLifetimeSeconds=60
[junit4:junit4]   2> 1515 T2476 oasc.SolrCore.initDeprecatedSupport WARNING solrconfig.xml uses deprecated <admin/gettableFiles>, Please update your config to use the ShowFileRequestHandler.
[junit4:junit4]   2> 1516 T2476 oasc.SolrCore.initDeprecatedSupport WARNING adding ShowFileRequestHandler with hidden files: [SCHEMA.XML, OLD_SYNONYMS.TXT, STOPWORDS.TXT, PROTWORDS.TXT, OPEN-EXCHANGE-RATES.JSON, SYNONYMS.TXT, CURRENCY.XML, MAPPING-ISOLATIN1ACCENT.TXT]
[junit4:junit4]   2> 1521 T2476 oasc.CachingDirectoryFactory.close Releasing directory:/Users/jenkins/jenkins-slave/workspace/Lucene-Solr-trunk-MacOSX/solr/build/solr-core/test/J0/./org.apache.solr.cloud.BasicDistributedZkTest-1359760981066/control/data
[junit4:junit4]   2> 1525 T2476 oass.SolrIndexSearcher.<init> Opening Searcher@652cb4d7 main
[junit4:junit4]   2> 1529 T2476 oasu.CommitTracker.<init> Hard AutoCommit: disabled
[junit4:junit4]   2> 1529 T2476 oasu.CommitTracker.<init> Soft AutoCommit: disabled
[junit4:junit4]   2> 1529 T2476 oashc.SpellCheckComponent.inform Initializing spell checkers
[junit4:junit4]   2> 1537 T2476 oass.DirectSolrSpellChecker.init init: {name=direct,classname=DirectSolrSpellChecker,field=lowerfilt,minQueryLength=3}
[junit4:junit4]   2> 1575 T2477 oasc.SolrCore.registerSearcher [collection1] Registered new searcher Searcher@652cb4d7 main{StandardDirectoryReader(segments_1:1)}
[junit4:junit4]   2> 1590 T2476 oasc.ZkController.publish publishing core=collection1 state=down
[junit4:junit4]   2> 1590 T2476 oasc.ZkController.publish numShards not found on descriptor - reading it from system property
[junit4:junit4]   2> 1593 T2456 oazs.PrepRequestProcessor.pRequest Got user-level KeeperException when processing sessionid:0x13c9811fc540003 type:create cxid:0x50 zxid:0x29 txntype:-1 reqpath:n/a Error Path:/solr/overseer/queue Error:KeeperErrorCode = NoNode for /solr/overseer/queue
[junit4:junit4]   2> 2133 T2474 oascc.ZkStateReader.updateClusterState Updating cloud state from ZooKeeper... 
[junit4:junit4]   2> 2135 T2474 oasc.Overseer$ClusterStateUpdater.updateState Update state numShards=1 message={
[junit4:junit4]   2> 	  "operation":"state",
[junit4:junit4]   2> 	  "numShards":"1",
[junit4:junit4]   2> 	  "shard":null,
[junit4:junit4]   2> 	  "roles":null,
[junit4:junit4]   2> 	  "state":"down",
[junit4:junit4]   2> 	  "core":"collection1",
[junit4:junit4]   2> 	  "collection":"control_collection",
[junit4:junit4]   2> 	  "node_name":"127.0.0.1:49919_",
[junit4:junit4]   2> 	  "base_url":"http://127.0.0.1:49919"}
[junit4:junit4]   2> 2135 T2474 oasc.Overseer$ClusterStateUpdater.createCollection Create collection control_collection with numShards 1
[junit4:junit4]   2> 2135 T2474 oasc.Overseer$ClusterStateUpdater.updateState Assigning new node to shard shard=shard1
[junit4:junit4]   2> 2138 T2456 oazs.PrepRequestProcessor.pRequest Got user-level KeeperException when processing sessionid:0x13c9811fc540003 type:create cxid:0x58 zxid:0x2c txntype:-1 reqpath:n/a Error Path:/solr/overseer/queue-work Error:KeeperErrorCode = NoNode for /solr/overseer/queue-work
[junit4:junit4]   2> 2153 T2473 oascc.ZkStateReader$2.process A cluster state change: WatchedEvent state:SyncConnected type:NodeDataChanged path:/clusterstate.json, has occurred - updating... (live nodes size: 1)
[junit4:junit4]   2> 2604 T2476 oasc.CoreContainer.registerCore registering core: collection1
[junit4:junit4]   2> 2604 T2476 oasc.ZkController.register Register replica - core:collection1 address:http://127.0.0.1:49919 collection:control_collection shard:shard1
[junit4:junit4]   2> 2606 T2476 oascc.SolrZkClient.makePath makePath: /collections/control_collection/leader_elect/shard1/election
[junit4:junit4]   2> 2616 T2456 oazs.PrepRequestProcessor.pRequest Got user-level KeeperException when processing sessionid:0x13c9811fc540003 type:delete cxid:0x72 zxid:0x36 txntype:-1 reqpath:n/a Error Path:/solr/collections/control_collection/leaders Error:KeeperErrorCode = NoNode for /solr/collections/control_collection/leaders
[junit4:junit4]   2> 2617 T2476 oasc.ShardLeaderElectionContext.runLeaderProcess Running the leader process.
[junit4:junit4]   2> 2618 T2456 oazs.PrepRequestProcessor.pRequest Got user-level KeeperException when processing sessionid:0x13c9811fc540003 type:create cxid:0x73 zxid:0x37 txntype:-1 reqpath:n/a Error Path:/solr/overseer Error:KeeperErrorCode = NodeExists for /solr/overseer
[junit4:junit4]   2> 2621 T2476 oasc.ShardLeaderElectionContext.waitForReplicasToComeUp Enough replicas found to continue.
[junit4:junit4]   2> 2622 T2476 oasc.ShardLeaderElectionContext.runLeaderProcess I may be the new leader - try and sync
[junit4:junit4]   2> 2622 T2476 oasc.SyncStrategy.sync Sync replicas to http://127.0.0.1:49919/collection1/
[junit4:junit4]   2> 2622 T2476 oasc.SyncStrategy.syncReplicas Sync Success - now sync replicas to me
[junit4:junit4]   2> 2623 T2476 oasc.SyncStrategy.syncToMe http://127.0.0.1:49919/collection1/ has no replicas
[junit4:junit4]   2> 2623 T2476 oasc.ShardLeaderElectionContext.runLeaderProcess I am the new leader: http://127.0.0.1:49919/collection1/
[junit4:junit4]   2> 2623 T2476 oascc.SolrZkClient.makePath makePath: /collections/control_collection/leaders/shard1
[junit4:junit4]   2> 2629 T2456 oazs.PrepRequestProcessor.pRequest Got user-level KeeperException when processing sessionid:0x13c9811fc540003 type:create cxid:0x7d zxid:0x3b txntype:-1 reqpath:n/a Error Path:/solr/overseer Error:KeeperErrorCode = NodeExists for /solr/overseer
[junit4:junit4]   2> 3659 T2474 oascc.ZkStateReader.updateClusterState Updating cloud state from ZooKeeper... 
[junit4:junit4]   2> 3672 T2473 oascc.ZkStateReader$2.process A cluster state change: WatchedEvent state:SyncConnected type:NodeDataChanged path:/clusterstate.json, has occurred - updating... (live nodes size: 1)
[junit4:junit4]   2> 3720 T2476 oasc.ZkController.register We are http://127.0.0.1:49919/collection1/ and leader is http://127.0.0.1:49919/collection1/
[junit4:junit4]   2> 3720 T2476 oasc.ZkController.register No LogReplay needed for core=collection1 baseURL=http://127.0.0.1:49919
[junit4:junit4]   2> 3721 T2476 oasc.ZkController.checkRecovery I am the leader, no recovery necessary
[junit4:junit4]   2> 3721 T2476 oasc.ZkController.publish publishing core=collection1 state=active
[junit4:junit4]   2> 3721 T2476 oasc.ZkController.publish numShards not found on descriptor - reading it from system property
[junit4:junit4]   2> 3723 T2476 oascc.ZkStateReader.updateClusterState Updating cloud state from ZooKeeper... 
[junit4:junit4]   2> 3725 T2451 oass.SolrDispatchFilter.init user.dir=/Users/jenkins/jenkins-slave/workspace/Lucene-Solr-trunk-MacOSX/solr/build/solr-core/test/J0
[junit4:junit4]   2> 3725 T2451 oass.SolrDispatchFilter.init SolrDispatchFilter.init() done
[junit4:junit4]   2> 3726 T2451 oascsi.HttpClientUtil.createClient Creating new http client, config:maxConnections=128&maxConnectionsPerHost=32&followRedirects=false
[junit4:junit4]   2> 3732 T2451 oascsi.HttpClientUtil.createClient Creating new http client, config:
[junit4:junit4]   2> 3737 T2451 oaz.ZooKeeper.<init> Initiating client connection, connectString=127.0.0.1:49916/solr sessionTimeout=10000 watcher=org.apache.solr.common.cloud.ConnectionManager@6c7754bb
[junit4:junit4]   2> 3738 T2451 oascc.ConnectionManager.waitForConnected Waiting for client to connect to ZooKeeper
[junit4:junit4]   2> 3739 T2478 oaz.ClientCnxn$SendThread.logStartConnect Opening socket connection to server localhost/127.0.0.1:49916. Will not attempt to authenticate using SASL (access denied ("javax.security.auth.AuthPermission" "getLoginConfiguration"))
[junit4:junit4]   2> 3740 T2478 oaz.ClientCnxn$SendThread.primeConnection Socket connection established to localhost/127.0.0.1:49916, initiating session
[junit4:junit4]   2> 3740 T2453 oazs.NIOServerCnxnFactory.run Accepted socket connection from /127.0.0.1:49922
[junit4:junit4]   2> 3741 T2453 oazs.ZooKeeperServer.processConnectRequest Client attempting to establish new session at /127.0.0.1:49922
[junit4:junit4]   2> 3742 T2455 oazs.ZooKeeperServer.finishSessionInit Established session 0x13c9811fc540004 with negotiated timeout 10000 for client /127.0.0.1:49922
[junit4:junit4]   2> 3742 T2478 oaz.ClientCnxn$SendThread.onConnected Session establishment complete on server localhost/127.0.0.1:49916, sessionid = 0x13c9811fc540004, negotiated timeout = 10000
[junit4:junit4]   2> 3743 T2479 oascc.ConnectionManager.process Watcher org.apache.solr.common.cloud.ConnectionManager@6c7754bb name:ZooKeeperConnection Watcher:127.0.0.1:49916/solr got event WatchedEvent state:SyncConnected type:None path:null path:null type:None
[junit4:junit4]   2> 3743 T2451 oascc.ConnectionManager.waitForConnected Client is connected to ZooKeeper
[junit4:junit4]   2> 3744 T2451 oascc.ZkStateReader.createClusterStateWatchersAndUpdate Updating cluster state from ZooKeeper... 
[junit4:junit4]   2> 3746 T2451 oasc.ChaosMonkey.monkeyLog monkey: init - expire sessions:true cause connection loss:true
[junit4:junit4]   2> 3768 T1341 oasc.OverseerCollectionProcessor.run WARNING Overseer cannot talk to ZK
[junit4:junit4]   2> 3970 T2451 oejs.Server.doStart jetty-8.1.8.v20121106
[junit4:junit4]   2> 4030 T2451 oejs.AbstractConnector.doStart Started SelectChannelConnector@127.0.0.1:49923
[junit4:junit4]   2> 4039 T2451 oass.SolrDispatchFilter.init SolrDispatchFilter.init()
[junit4:junit4]   2> 4040 T2451 oasc.SolrResourceLoader.locateSolrHome JNDI not configured for solr (NoInitialContextEx)
[junit4:junit4]   2> 4040 T2451 oasc.SolrResourceLoader.locateSolrHome using system property solr.solr.home: /Users/jenkins/jenkins-slave/workspace/Lucene-Solr-trunk-MacOSX/solr/build/solr-core/test/J0/./org.apache.solr.cloud.BasicDistributedZkTest-jetty1-1359760984802
[junit4:junit4]   2> 4040 T2451 oasc.CoreContainer$Initializer.initialize looking for solr.xml: /Users/jenkins/jenkins-slave/workspace/Lucene-Solr-trunk-MacOSX/solr/build/solr-core/test/J0/./org.apache.solr.cloud.BasicDistributedZkTest-jetty1-1359760984802/solr.xml
[junit4:junit4]   2> 4041 T2451 oasc.CoreContainer.<init> New CoreContainer 2098098709
[junit4:junit4]   2> 4041 T2451 oasc.CoreContainer.load Loading CoreContainer using Solr Home: '/Users/jenkins/jenkins-slave/workspace/Lucene-Solr-trunk-MacOSX/solr/build/solr-core/test/J0/./org.apache.solr.cloud.BasicDistributedZkTest-jetty1-1359760984802/'
[junit4:junit4]   2> 4042 T2451 oasc.SolrResourceLoader.<init> new SolrResourceLoader for directory: '/Users/jenkins/jenkins-slave/workspace/Lucene-Solr-trunk-MacOSX/solr/build/solr-core/test/J0/./org.apache.solr.cloud.BasicDistributedZkTest-jetty1-1359760984802/'
[junit4:junit4]   2> 4085 T2451 oashc.HttpShardHandlerFactory.getParameter Setting socketTimeout to: 60000
[junit4:junit4]   2> 4086 T2451 oashc.HttpShardHandlerFactory.getParameter Setting urlScheme to: http://
[junit4:junit4]   2> 4086 T2451 oashc.HttpShardHandlerFactory.getParameter Setting connTimeout to: 15000
[junit4:junit4]   2> 4088 T2451 oashc.HttpShardHandlerFactory.getParameter Setting maxConnectionsPerHost to: 20
[junit4:junit4]   2> 4093 T2451 oashc.HttpShardHandlerFactory.getParameter Setting corePoolSize to: 0
[junit4:junit4]   2> 4094 T2451 oashc.HttpShardHandlerFactory.getParameter Setting maximumPoolSize to: 2147483647
[junit4:junit4]   2> 4095 T2451 oashc.HttpShardHandlerFactory.getParameter Setting maxThreadIdleTime to: 5
[junit4:junit4]   2> 4095 T2451 oashc.HttpShardHandlerFactory.getParameter Setting sizeOfQueue to: -1
[junit4:junit4]   2> 4096 T2451 oashc.HttpShardHandlerFactory.getParameter Setting fairnessPolicy to: false
[junit4:junit4]   2> 4096 T2451 oascsi.HttpClientUtil.createClient Creating new http client, config:maxConnectionsPerHost=20&maxConnections=10000&socketTimeout=60000&connTimeout=15000&retry=false
[junit4:junit4]   2> 4108 T2451 oasc.CoreContainer.load Registering Log Listener
[junit4:junit4]   2> 4128 T2451 oasc.CoreContainer.initZooKeeper Zookeeper client=127.0.0.1:49916/solr
[junit4:junit4]   2> 4128 T2451 oasc.ZkController.checkChrootPath zkHost includes chroot
[junit4:junit4]   2> 4129 T2451 oaz.ZooKeeper.<init> Initiating client connection, connectString=127.0.0.1:49916 sessionTimeout=60000 watcher=org.apache.solr.common.cloud.ConnectionManager@468f5c67
[junit4:junit4]   2> 4131 T2489 oaz.ClientCnxn$SendThread.logStartConnect Opening socket connection to server localhost/127.0.0.1:49916. Will not attempt to authenticate using SASL (access denied ("javax.security.auth.AuthPermission" "getLoginConfiguration"))
[junit4:junit4]   2> 4152 T2489 oaz.ClientCnxn$SendThread.primeConnection Socket connection established to localhost/127.0.0.1:49916, initiating session
[junit4:junit4]   2> 4130 T2451 oascc.ConnectionManager.waitForConnected Waiting for client to connect to ZooKeeper
[junit4:junit4]   2> 4156 T2453 oazs.NIOServerCnxnFactory.run Accepted socket connection from /127.0.0.1:49924
[junit4:junit4]   2> 4159 T2453 oazs.ZooKeeperServer.processConnectRequest Client attempting to establish new session at /127.0.0.1:49924
[junit4:junit4]   2> 4160 T2455 oazs.ZooKeeperServer.finishSessionInit Established session 0x13c9811fc540005 with negotiated timeout 20000 for client /127.0.0.1:49924
[junit4:junit4]   2> 4160 T2489 oaz.ClientCnxn$SendThread.onConnected Session establishment complete on server localhost/127.0.0.1:49916, sessionid = 0x13c9811fc540005, negotiated timeout = 20000
[junit4:junit4]   2> 4161 T2490 oascc.ConnectionManager.process Watcher org.apache.solr.common.cloud.ConnectionManager@468f5c67 name:ZooKeeperConnection Watcher:127.0.0.1:49916 got event WatchedEvent state:SyncConnected type:None path:null path:null type:None
[junit4:junit4]   2> 4161 T2451 oascc.ConnectionManager.waitForConnected Client is connected to ZooKeeper
[junit4:junit4]   2> 4163 T2456 oazs.PrepRequestProcessor.pRequest2Txn Processed session termination for sessionid: 0x13c9811fc540005
[junit4:junit4]   2> 4164 T2453 oazs.NIOServerCnxn.closeSock Closed socket connection for client /127.0.0.1:49924 which had sessionid 0x13c9811fc540005
[junit4:junit4]   2> 4164 T2490 oaz.ClientCnxn$EventThread.run EventThread shut down
[junit4:junit4]   2> 4165 T2451 oaz.ZooKeeper.close Session: 0x13c9811fc540005 closed
[junit4:junit4]   2> 4165 T2451 oascsi.HttpClientUtil.createClient Creating new http client, config:maxConnections=500&maxConnectionsPerHost=16&socketTimeout=60000&connTimeout=15000
[junit4:junit4]   2> 4170 T2451 oaz.ZooKeeper.<init> Initiating client connection, connectString=127.0.0.1:49916/solr sessionTimeout=30000 watcher=org.apache.solr.common.cloud.ConnectionManager@46e55b49
[junit4:junit4]   2> 4173 T2451 oascc.ConnectionManager.waitForConnected Waiting for client to connect to ZooKeeper
[junit4:junit4]   2> 4173 T2491 oaz.ClientCnxn$SendThread.logStartConnect Opening socket connection to server localhost/127.0.0.1:49916. Will not attempt to authenticate using SASL (access denied ("javax.security.auth.AuthPermission" "getLoginConfiguration"))
[junit4:junit4]   2> 4174 T2491 oaz.ClientCnxn$SendThread.primeConnection Socket connection established to localhost/127.0.0.1:49916, initiating session
[junit4:junit4]   2> 4175 T2453 oazs.NIOServerCnxnFactory.run Accepted socket connection from /127.0.0.1:49925
[junit4:junit4]   2> 4175 T2453 oazs.ZooKeeperServer.processConnectRequest Client attempting to establish new session at /127.0.0.1:49925
[junit4:junit4]   2> 4177 T2455 oazs.ZooKeeperServer.finishSessionInit Established session 0x13c9811fc540006 with negotiated timeout 20000 for client /127.0.0.1:49925
[junit4:junit4]   2> 4177 T2491 oaz.ClientCnxn$SendThread.onConnected Session establishment complete on server localhost/127.0.0.1:49916, sessionid = 0x13c9811fc540006, negotiated timeout = 20000
[junit4:junit4]   2> 4178 T2492 oascc.ConnectionManager.process Watcher org.apache.solr.common.cloud.ConnectionManager@46e55b49 name:ZooKeeperConnection Watcher:127.0.0.1:49916/solr got event WatchedEvent state:SyncConnected type:None path:null path:null type:None
[junit4:junit4]   2> 4178 T2451 oascc.ConnectionManager.waitForConnected Client is connected to ZooKeeper
[junit4:junit4]   2> 4179 T2456 oazs.PrepRequestProcessor.pRequest Got user-level KeeperException when processing sessionid:0x13c9811fc540006 type:create cxid:0x1 zxid:0x49 txntype:-1 reqpath:n/a Error Path:/solr/overseer Error:KeeperErrorCode = NodeExists for /solr/overseer
[junit4:junit4]   2> 4181 T2456 oazs.PrepRequestProcessor.pRequest Got user-level KeeperException when processing sessionid:0x13c9811fc540006 type:create cxid:0x2 zxid:0x4a txntype:-1 reqpath:n/a Error Path:/solr/overseer Error:KeeperErrorCode = NodeExists for /solr/overseer
[junit4:junit4]   2> 4182 T2451 oasc.ZkController.createEphemeralLiveNode Register node as live in ZooKeeper:/live_nodes/127.0.0.1:49923_
[junit4:junit4]   2> 4184 T2456 oazs.PrepRequestProcessor.pRequest Got user-level KeeperException when processing sessionid:0x13c9811fc540006 type:delete cxid:0x4 zxid:0x4b txntype:-1 reqpath:n/a Error Path:/solr/live_nodes/127.0.0.1:49923_ Error:KeeperErrorCode = NoNode for /solr/live_nodes/127.0.0.1:49923_
[junit4:junit4]   2> 4185 T2451 oascc.SolrZkClient.makePath makePath: /live_nodes/127.0.0.1:49923_
[junit4:junit4]   2> 4187 T2473 oascc.ZkStateReader$2.process A cluster state change: WatchedEvent state:SyncConnected type:NodeChildrenChanged path:/live_nodes, has occurred - updating... (live nodes size: 1)
[junit4:junit4]   2> 4189 T2479 oascc.ZkStateReader$3.process Updating live nodes... (2)
[junit4:junit4]   2> 4192 T2473 oascc.ZkStateReader$3.process Updating live nodes... (2)
[junit4:junit4]   2> 4195 T2451 oascc.ZkStateReader.createClusterStateWatchersAndUpdate Updating cluster state from ZooKeeper... 
[junit4:junit4]   2> 4202 T2493 oasc.CoreContainer.create Creating SolrCore 'collection1' using instanceDir: /Users/jenkins/jenkins-slave/workspace/Lucene-Solr-trunk-MacOSX/solr/build/solr-core/test/J0/./org.apache.solr.cloud.BasicDistributedZkTest-jetty1-1359760984802/collection1
[junit4:junit4]   2> 4203 T2493 oasc.ZkController.createCollectionZkNode Check for collection zkNode:collection1
[junit4:junit4]   2> 4204 T2493 oasc.ZkController.createCollectionZkNode Collection zkNode exists
[junit4:junit4]   2> 4204 T2493 oasc.ZkController.readConfigName Load collection config from:/collections/collection1
[junit4:junit4]   2> 4205 T2493 oasc.SolrResourceLoader.<init> new SolrResourceLoader for directory: '/Users/jenkins/jenkins-slave/workspace/Lucene-Solr-trunk-MacOSX/solr/build/solr-core/test/J0/./org.apache.solr.cloud.BasicDistributedZkTest-jetty1-1359760984802/collection1/'
[junit4:junit4]   2> 4206 T2493 oasc.SolrResourceLoader.replaceClassLoader Adding 'file:/Users/jenkins/jenkins-slave/workspace/Lucene-Solr-trunk-MacOSX/solr/build/solr-core/test/J0/org.apache.solr.cloud.BasicDistributedZkTest-jetty1-1359760984802/collection1/lib/classes/' to classloader
[junit4:junit4]   2> 4207 T2493 oasc.SolrResourceLoader.replaceClassLoader Adding 'file:/Users/jenkins/jenkins-slave/workspace/Lucene-Solr-trunk-MacOSX/solr/build/solr-core/test/J0/org.apache.solr.cloud.BasicDistributedZkTest-jetty1-1359760984802/collection1/lib/README' to classloader
[junit4:junit4]   2> 4270 T2493 oasc.SolrConfig.<init> Using Lucene MatchVersion: LUCENE_50
[junit4:junit4]   2> 4348 T2493 oasc.SolrConfig.<init> Loaded SolrConfig: solrconfig.xml
[junit4:junit4]   2> 4350 T2493 oass.IndexSchema.readSchema Reading Solr Schema
[junit4:junit4]   2> 4356 T2493 oass.IndexSchema.readSchema Schema name=test
[junit4:junit4]   2> 5852 T1358 oasc.OverseerCollectionProcessor.run WARNING Overseer cannot talk to ZK
[junit4:junit4]   2> 5855 T2474 oascc.ZkStateReader.updateClusterState Updating cloud state from ZooKeeper... 
[junit4:junit4]   2> 5856 T2474 oasc.Overseer$ClusterStateUpdater.updateState Update state numShards=1 message={
[junit4:junit4]   2> 	  "operation":"state",
[junit4:junit4]   2> 	  "numShards":"1",
[junit4:junit4]   2> 	  "shard":"shard1",
[junit4:junit4]   2> 	  "roles":null,
[junit4:junit4]   2> 	  "state":"active",
[junit4:junit4]   2> 	  "core":"collection1",
[junit4:junit4]   2> 	  "collection":"control_collection",
[junit4:junit4]   2> 	  "node_name":"127.0.0.1:49919_",
[junit4:junit4]   2> 	  "base_url":"http://127.0.0.1:49919"}
[junit4:junit4]   2> 5863 T2492 oascc.ZkStateReader$2.process A cluster state change: WatchedEvent state:SyncConnected type:NodeDataChanged path:/clusterstate.json, has occurred - updating... (live nodes size: 2)
[junit4:junit4]   2> 5864 T2473 oascc.ZkStateReader$2.process A cluster state change: WatchedEvent state:SyncConnected type:NodeDataChanged path:/clusterstate.json, has occurred - updating... (live nodes size: 2)
[junit4:junit4]   2> 5864 T2479 oascc.ZkStateReader$2.process A cluster state change: WatchedEvent state:SyncConnected type:NodeDataChanged path:/clusterstate.json, has occurred - updating... (live nodes size: 2)
[junit4:junit4]   2> 5937 T2493 oass.OpenExchangeRatesOrgProvider.init Initialized with rates=open-exchange-rates.json, refreshInterval=1440.
[junit4:junit4]   2> 5948 T2493 oass.IndexSchema.readSchema default search field in schema is text
[junit4:junit4]   2> 5951 T2493 oass.IndexSchema.readSchema unique key field: id
[junit4:junit4]   2> 5973 T2493 oass.FileExchangeRateProvider.reload Reloading exchange rates from file currency.xml
[junit4:junit4]   2> 5979 T2493 oass.FileExchangeRateProvider.reload Reloading exchange rates from file currency.xml
[junit4:junit4]   2> 5994 T2493 oass.OpenExchangeRatesOrgProvider.reload Reloading exchange rates from open-exchange-rates.json
[junit4:junit4]   2> 5996 T2493 oass.OpenExchangeRatesOrgProvider.reload Reloading exchange rates from open-exchange-rates.json
[junit4:junit4]   2> 5998 T2493 oasc.SolrCore.<init> [collection1] Opening new SolrCore at /Users/jenkins/jenkins-slave/workspace/Lucene-Solr-trunk-MacOSX/solr/build/solr-core/test/J0/./org.apache.solr.cloud.BasicDistributedZkTest-jetty1-1359760984802/collection1/, dataDir=./org.apache.solr.cloud.BasicDistributedZkTest-1359760981066/jetty1/
[junit4:junit4]   2> 5998 T2493 oasc.JmxMonitoredMap.<init> JMX monitoring is enabled. Adding Solr mbeans to JMX Server: com.sun.jmx.mbeanserver.JmxMBeanServer@455bac23
[junit4:junit4]   2> 5999 T2493 oasc.SolrCore.initDirectoryFactory solr.NRTCachingDirectoryFactory
[junit4:junit4]   2> 6000 T2493 oasc.CachingDirectoryFactory.get return new directory for /Users/jenkins/jenkins-slave/workspace/Lucene-Solr-trunk-MacOSX/solr/build/solr-core/test/J0/./org.apache.solr.cloud.BasicDistributedZkTest-1359760981066/jetty1 forceNew:false
[junit4:junit4]   2> 6001 T2493 oasc.CachingDirectoryFactory.close Releasing directory:/Users/jenkins/jenkins-slave/workspace/Lucene-Solr-trunk-MacOSX/solr/build/solr-core/test/J0/./org.apache.solr.cloud.BasicDistributedZkTest-1359760981066/jetty1
[junit4:junit4]   2> 6001 T2493 oasc.SolrCore.getNewIndexDir New index directory detected: old=null new=./org.apache.solr.cloud.BasicDistributedZkTest-1359760981066/jetty1/index/
[junit4:junit4]   2> 6001 T2493 oasc.SolrCore.initIndex WARNING [collection1] Solr index directory './org.apache.solr.cloud.BasicDistributedZkTest-1359760981066/jetty1/index' doesn't exist. Creating new index...
[junit4:junit4]   2> 6003 T2493 oasc.CachingDirectoryFactory.get return new directory for /Users/jenkins/jenkins-slave/workspace/Lucene-Solr-trunk-MacOSX/solr/build/solr-core/test/J0/./org.apache.solr.cloud.BasicDistributedZkTest-1359760981066/jetty1/index forceNew:false
[junit4:junit4]   2> 6008 T2493 oasc.SolrDeletionPolicy.onCommit SolrDeletionPolicy.onCommit: commits:num=1
[junit4:junit4]   2> 		commit{dir=RateLimitedDirectoryWrapper(NRTCachingDirectory(org.apache.lucene.store.NIOFSDirectory@/Users/jenkins/jenkins-slave/workspace/Lucene-Solr-trunk-MacOSX/solr/build/solr-core/test/J0/org.apache.solr.cloud.BasicDistributedZkTest-1359760981066/jetty1/index lockFactory=org.apache.lucene.store.NativeFSLockFactory@48e6ea3d; maxCacheMB=48.0 maxMergeSizeMB=4.0)),segFN=segments_1,generation=1,filenames=[segments_1]
[junit4:junit4]   2> 6008 T2493 oasc.SolrDeletionPolicy.updateCommits newest commit = 1[segments_1]
[junit4:junit4]   2> 6009 T2493 oasc.CachingDirectoryFactory.close Releasing directory:/Users/jenkins/jenkins-slave/workspace/Lucene-Solr-trunk-MacOSX/solr/build/solr-core/test/J0/./org.apache.solr.cloud.BasicDistributedZkTest-1359760981066/jetty1/index
[junit4:junit4]   2> 6009 T2493 oasc.SolrCore.initWriters created xml: solr.XMLResponseWriter
[junit4:junit4]   2> 6012 T2493 oasup.UpdateRequestProcessorChain.init inserting DistributedUpdateProcessorFactory into updateRequestProcessorChain "dedupe"
[junit4:junit4]   2> 6012 T2493 oasup.UpdateRequestProcessorChain.init inserting DistributedUpdateProcessorFactory into updateRequestProcessorChain "dedupe-allfields"
[junit4:junit4]   2> 6012 T2493 oasup.UpdateRequestProcessorChain.init inserting DistributedUpdateProcessorFactory into updateRequestProcessorChain "stored_sig"
[junit4:junit4]   2> 6013 T2493 oasup.UpdateRequestProcessorChain.init inserting DistributedUpdateProcessorFactory into updateRequestProcessorChain "uniq-fields"
[junit4:junit4]   2> 6014 T2493 oasup.UpdateRequestProcessorChain.init inserting DistributedUpdateProcessorFactory into updateRequestProcessorChain "distrib-dup-test-chain-implicit"
[junit4:junit4]   2> 6014 T2493 oasc.RequestHandlers.initHandlersFromConfig adding lazy requestHandler: solr.ReplicationHandler
[junit4:junit4]   2> 6015 T2493 oasc.RequestHandlers.initHandlersFromConfig created /replication: solr.ReplicationHandler
[junit4:junit4]   2> 6015 T2493 oasc.RequestHandlers.initHandlersFromConfig created standard: solr.StandardRequestHandler
[junit4:junit4]   2> 6016 T2493 oasc.RequestHandlers.initHandlersFromConfig created /get: solr.RealTimeGetHandler
[junit4:junit4]   2> 6017 T2493 oasc.RequestHandlers.initHandlersFromConfig created dismax: solr.SearchHandler
[junit4:junit4]   2> 6017 T2493 oasc.RequestHandlers.initHandlersFromConfig created mock: org.apache.solr.core.MockQuerySenderListenerReqHandler
[junit4:junit4]   2> 6018 T2493 oasc.RequestHandlers.initHandlersFromConfig created /admin/: org.apache.solr.handler.admin.AdminHandlers
[junit4:junit4]   2> 6018 T2493 oasc.RequestHandlers.initHandlersFromConfig created defaults: solr.StandardRequestHandler
[junit4:junit4]   2> 6019 T2493 oasc.RequestHandlers.initHandlersFromConfig adding lazy requestHandler: solr.StandardRequestHandler
[junit4:junit4]   2> 6019 T2493 oasc.RequestHandlers.initHandlersFromConfig created lazy: solr.StandardRequestHandler
[junit4:junit4]   2> 6019 T2493 oasc.RequestHandlers.initHandlersFromConfig created /update: solr.UpdateRequestHandler
[junit4:junit4]   2> 6020 T2493 oasc.RequestHandlers.initHandlersFromConfig created /terms: org.apache.solr.handler.component.SearchHandler
[junit4:junit4]   2> 6021 T2493 oasc.RequestHandlers.initHandlersFromConfig created spellCheckCompRH: org.apache.solr.handler.component.SearchHandler
[junit4:junit4]   2> 6021 T2493 oasc.RequestHandlers.initHandlersFromConfig created spellCheckCompRH_Direct: org.apache.solr.handler.component.SearchHandler
[junit4:junit4]   2> 6022 T2493 oasc.RequestHandlers.initHandlersFromConfig created spellCheckWithWordbreak: org.apache.solr.handler.component.SearchHandler
[junit4:junit4]   2> 6023 T2493 oasc.RequestHandlers.initHandlersFromConfig created spellCheckWithWordbreak_Direct: org.apache.solr.handler.component.SearchHandler
[junit4:junit4]   2> 6023 T2493 oasc.RequestHandlers.initHandlersFromConfig created spellCheckCompRH1: org.apache.solr.handler.component.SearchHandler
[junit4:junit4]   2> 6024 T2493 oasc.RequestHandlers.initHandlersFromConfig created mltrh: org.apache.solr.handler.component.SearchHandler
[junit4:junit4]   2> 6024 T2493 oasc.RequestHandlers.initHandlersFromConfig created tvrh: org.apache.solr.handler.component.SearchHandler
[junit4:junit4]   2> 6025 T2493 oasc.RequestHandlers.initHandlersFromConfig created /mlt: solr.MoreLikeThisHandler
[junit4:junit4]   2> 6026 T2493 oasc.RequestHandlers.initHandlersFromConfig created /debug/dump: solr.DumpRequestHandler
[junit4:junit4]   2> 6032 T2493 oashl.XMLLoader.init xsltCacheLifetimeSeconds=60
[junit4:junit4]   2> 6036 T2493 oasc.SolrCore.initDeprecatedSupport WARNING solrconfig.xml uses deprecated <admin/gettableFiles>, Please update your config to use the ShowFileRequestHandler.
[junit4:junit4]   2> 6038 T2493 oasc.SolrCore.initDeprecatedSupport WARNING adding ShowFileRequestHandler with hidden files: [SCHEMA.XML, OLD_SYNONYMS.TXT, STOPWORDS.TXT, PROTWORDS.TXT, OPEN-EXCHANGE-RATES.JSON, SYNONYMS.TXT, CURRENCY.XML, MAPPING-ISOLATIN1ACCENT.TXT]
[junit4:junit4]   2> 6043 T2493 oasc.CachingDirectoryFactory.close Releasing directory:/Users/jenkins/jenkins-slave/workspace/Lucene-Solr-trunk-MacOSX/solr/build/solr-core/test/J0/./org.apache.solr.cloud.BasicDistributedZkTest-1359760981066/jetty1
[junit4:junit4]   2> 6048 T2493 oass.SolrIndexSearcher.<init> Opening Searcher@3b31f9ba main
[junit4:junit4]   2> 6050 T2493 oasu.CommitTracker.<init> Hard AutoCommit: disabled
[junit4:junit4]   2> 6051 T2493 oasu.CommitTracker.<init> Soft AutoCommit: disabled
[junit4:junit4]   2> 6051 T2493 oashc.SpellCheckComponent.inform Initializing spell checkers
[junit4:junit4]   2> 6063 T2493 oass.DirectSolrSpellChecker.init init: {name=direct,classname=DirectSolrSpellChecker,field=lowerfilt,minQueryLength=3}
[junit4:junit4]   2> 6106 T2494 oasc.SolrCore.registerSearcher [collection1] Registered new searcher Searcher@3b31f9ba main{StandardDirectoryReader(segments_1:1)}
[junit4:junit4]   2> 6116 T2493 oasc.ZkController.publish publishing core=collection1 state=down
[junit4:junit4]   2> 6116 T2493 oasc.ZkController.publish numShards not found on descriptor - reading it from system property
[junit4:junit4]   2> 7374 T2474 oascc.ZkStateReader.updateClusterState Updating cloud state from ZooKeeper... 
[junit4:junit4]   2> 7376 T2474 oasc.Overseer$ClusterStateUpdater.updateState Update state numShards=2 message={
[junit4:junit4]   2> 	  "operation":"state",
[junit4:junit4]   2> 	  "numShards":"2",
[junit4:junit4]   2> 	  "shard":null,
[junit4:junit4]   2> 	  "roles":null,
[junit4:junit4]   2> 	  "state":"down",
[junit4:junit4]   2> 	  "core":"collection1",
[junit4:junit4]   2> 	  "collection":"collection1",
[junit4:junit4]   2> 	  "node_name":"127.0.0.1:49923_",
[junit4:junit4]   2> 	  "base_url":"http://127.0.0.1:49923"}
[junit4:junit4]   2> 7378 T2474 oasc.Overseer$ClusterStateUpdater.createCollection Create collection collection1 with numShards 2
[junit4:junit4]   2> 7380 T2474 oasc.Overseer$ClusterStateUpdater.updateState Assigning new node to shard shard=shard1
[junit4:junit4]   2> 7389 T2492 oascc.ZkStateReader$2.process A cluster state change: WatchedEvent state:SyncConnected type:NodeDataChanged path:/clusterstate.json, has occurred - updating... (live nodes size: 2)
[junit4:junit4]   2> 7389 T2473 oascc.ZkStateReader$2.process A cluster state change: WatchedEvent state:SyncConnected type:NodeDataChanged path:/clusterstate.json, has occurred - updating... (live nodes size: 2)
[junit4:junit4]   2> 7389 T2479 oascc.ZkStateReader$2.process A cluster state change: WatchedEvent state:SyncConnected type:NodeDataChanged path:/clusterstate.json, has occurred - updating... (live nodes size: 2)
[junit4:junit4]   2> 8123 T2493 oasc.CoreContainer.registerCore registering core: collection1
[junit4:junit4]   2> 8123 T2493 oasc.ZkController.register Register replica - core:collection1 address:http://127.0.0.1:49923 collection:collection1 shard:shard1
[junit4:junit4]   2> 8124 T2493 oascc.SolrZkClient.makePath makePath: /collections/collection1/leader_elect/shard1/election
[junit4:junit4]   2> 8135 T2456 oazs.PrepRequestProcessor.pRequest Got user-level KeeperException when processing sessionid:0x13c9811fc540006 type:delete cxid:0x45 zxid:0x5b txntype:-1 reqpath:n/a Error Path:/solr/collections/collection1/leaders Error:KeeperErrorCode = NoNode for /solr/collections/collection1/leaders
[junit4:junit4]   2> 8136 T2493 oasc.ShardLeaderElectionContext.runLeaderProcess Running the leader process.
[junit4:junit4]   2> 8136 T2456 oazs.PrepRequestProcessor.pRequest Got user-level KeeperException when processing sessionid:0x13c9811fc540006 type:create cxid:0x46 zxid:0x5c txntype:-1 reqpath:n/a Error Path:/solr/overseer Error:KeeperErrorCode = NodeExists for /solr/overseer
[junit4:junit4]   2> 8139 T2493 oasc.ShardLeaderElectionContext.waitForReplicasToComeUp Enough replicas found to continue.
[junit4:junit4]   2> 8139 T2493 oasc.ShardLeaderElectionContext.runLeaderProcess I may be the new leader - try and sync
[junit4:junit4]   2> 8140 T2493 oasc.SyncStrategy.sync Sync replicas to http://127.0.0.1:49923/collection1/
[junit4:junit4]   2> 8140 T2493 oasc.SyncStrategy.syncReplicas Sync Success - now sync replicas to me
[junit4:junit4]   2> 8140 T2493 oasc.SyncStrategy.syncToMe http://127.0.0.1:49923/collection1/ has no replicas
[junit4:junit4]   2> 8140 T2493 oasc.ShardLeaderElectionContext.runLeaderProcess I am the new leader: http://127.0.0.1:49923/collection1/
[junit4:junit4]   2> 8141 T2493 oascc.SolrZkClient.makePath makePath: /collections/collection1/leaders/shard1
[junit4:junit4]   2> 8146 T2456 oazs.PrepRequestProcessor.pRequest Got user-level KeeperException when processing sessionid:0x13c9811fc540006 type:create cxid:0x50 zxid:0x60 txntype:-1 reqpath:n/a Error Path:/solr/overseer Error:KeeperErrorCode = NodeExists for /solr/overseer
[junit4:junit4]   2> 8900 T2474 oascc.ZkStateReader.updateClusterState Updating cloud state from ZooKeeper... 
[junit4:junit4]   2> 8912 T2492 oascc.ZkStateReader$2.process A cluster state change: WatchedEvent state:SyncConnected type:NodeDataChanged path:/clusterstate.json, has occurred - updating... (live nodes size: 2)
[junit4:junit4]   2> 8917 T2479 oascc.ZkStateReader$2.process A cluster state change: WatchedEvent state:SyncConnected type:NodeDataChanged path:/clusterstate.json, has occurred - updating... (live nodes size: 2)
[junit4:junit4]   2> 8918 T2473 oascc.ZkStateReader$2.process A cluster state change: WatchedEvent state:SyncConnected type:NodeDataChanged path:/clusterstate.json, has occurred - updating... (live nodes size: 2)
[junit4:junit4]   2> 8920 T2493 oasc.ZkController.register We are http://127.0.0.1:49923/collection1/ and leader is http://127.0.0.1:49923/collection1/
[junit4:junit4]   2> 8920 T2493 oasc.ZkController.register No LogReplay needed for core=collection1 baseURL=http://127.0.0.1:49923
[junit4:junit4]   2> 8921 T2493 oasc.ZkController.checkRecovery I am the leader, no recovery necessary
[junit4:junit4]   2> 8921 T2493 oasc.ZkController.publish publishing core=collection1 state=active
[junit4:junit4]   2> 8921 T2493 oasc.ZkController.publish numShards not found on descriptor - reading it from system property
[junit4:junit4]   2> 8923 T2493 oascc.ZkStateReader.updateClusterState Updating cloud state from ZooKeeper... 
[junit4:junit4]   2> 8924 T2451 oass.SolrDispatchFilter.init user.dir=/Users/jenkins/jenkins-slave/workspace/Lucene-Solr-trunk-MacOSX/solr/build/solr-core/test/J0
[junit4:junit4]   2> 8925 T2451 oass.SolrDispatchFilter.init SolrDispatchFilter.init() done
[junit4:junit4]   2> 8925 T2451 oascsi.HttpClientUtil.createClient Creating new http client, config:maxConnections=128&maxConnectionsPerHost=32&followRedirects=false
[junit4:junit4]   2> 9153 T2451 oejs.Server.doStart jetty-8.1.8.v20121106
[junit4:junit4]   2> 9157 T2451 oejs.AbstractConnector.doStart Started SelectChannelConnector@127.0.0.1:49926
[junit4:junit4]   2> 9158 T2451 oass.SolrDispatchFilter.init SolrDispatchFilter.init()
[junit4:junit4]   2> 9159 T2451 oasc.SolrResourceLoader.locateSolrHome JNDI not configured for solr (NoInitialContextEx)
[junit4:junit4]   2> 9159 T2451 oasc.SolrResourceLoader.locateSolrHome using system property solr.solr.home: /Users/jenkins/jenkins-slave/workspace/Lucene-Solr-trunk-MacOSX/solr/build/solr-core/test/J0/./org.apache.solr.cloud.BasicDistributedZkTest-jetty2-1359760989988
[junit4:junit4]   2> 9160 T2451 oasc.CoreContainer$Initializer.initialize looking for solr.xml: /Users/jenkins/jenkins-slave/workspace/Lucene-Solr-trunk-MacOSX/solr/build/solr-core/test/J0/./org.apache.solr.cloud.BasicDistributedZkTest-jetty2-1359760989988/solr.xml
[junit4:junit4]   2> 9160 T2451 oasc.CoreContainer.<init> New CoreContainer 1909075829
[junit4:junit4]   2> 9161 T2451 oasc.CoreContainer.load Loading CoreContainer using Solr Home: '/Users/jenkins/jenkins-slave/workspace/Lucene-Solr-trunk-MacOSX/solr/build/solr-core/test/J0/./org.apache.solr.cloud.BasicDistributedZkTest-jetty2-1359760989988/'
[junit4:junit4]   2> 9161 T2451 oasc.SolrResourceLoader.<init> new SolrResourceLoader for directory: '/Users/jenkins/jenkins-slave/workspace/Lucene-Solr-trunk-MacOSX/solr/build/solr-core/test/J0/./org.apache.solr.cloud.BasicDistributedZkTest-jetty2-1359760989988/'
[junit4:junit4]   2> 9200 T2451 oashc.HttpShardHandlerFactory.getParameter Setting socketTimeout to: 60000
[junit4:junit4]   2> 9201 T2451 oashc.HttpShardHandlerFactory.getParameter Setting urlScheme to: http://
[junit4:junit4]   2> 9201 T2451 oashc.HttpShardHandlerFactory.getParameter Setting connTimeout to: 15000
[junit4:junit4]   2> 9202 T2451 oashc.HttpShardHandlerFactory.getParameter Setting maxConnectionsPerHost to: 20
[junit4:junit4]   2> 9202 T2451 oashc.HttpShardHandlerFactory.getParameter Setting corePoolSize to: 0
[junit4:junit4]   2> 9203 T2451 oashc.HttpShardHandlerFactory.getParameter Setting maximumPoolSize to: 2147483647
[junit4:junit4]   2> 9203 T2451 oashc.HttpShardHandlerFactory.getParameter Setting maxThreadIdleTime to: 5
[junit4:junit4]   2> 9204 T2451 oashc.HttpShardHandlerFactory.getParameter Setting sizeOfQueue to: -1
[junit4:junit4]   2> 9204 T2451 oashc.HttpShardHandlerFactory.getParameter Setting fairnessPolicy to: false
[junit4:junit4]   2> 9205 T2451 oascsi.HttpClientUtil.createClient Creating new http client, config:maxConnectionsPerHost=20&maxConnections=10000&socketTimeout=60000&connTimeout=15000&retry=false
[junit4:junit4]   2> 9217 T2451 oasc.CoreContainer.load Registering Log Listener
[junit4:junit4]   2> 9244 T2451 oasc.CoreContainer.initZooKeeper Zookeeper client=127.0.0.1:49916/solr
[junit4:junit4]   2> 9245 T2451 oasc.ZkController.checkChrootPath zkHost includes chroot
[junit4:junit4]   2> 9245 T2451 oaz.ZooKeeper.<init> Initiating client connection, connectString=127.0.0.1:49916 sessionTimeout=60000 watcher=org.apache.solr.common.cloud.ConnectionManager@28824487
[junit4:junit4]   2> 9246 T2451 oascc.ConnectionManager.waitForConnected Waiting for client to connect to ZooKeeper
[junit4:junit4]   2> 9247 T2504 oaz.ClientCnxn$SendThread.logStartConnect Opening socket connection to server localhost/127.0.0.1:49916. Will not attempt to authenticate using SASL (access denied ("javax.security.auth.AuthPermission" "getLoginConfiguration"))
[junit4:junit4]   2> 9249 T2453 oazs.NIOServerCnxnFactory.run Accepted socket connection from /127.0.0.1:49927
[junit4:junit4]   2> 9250 T2504 oaz.ClientCnxn$SendThread.primeConnection Socket connection established to localhost/127.0.0.1:49916, initiating session
[junit4:junit4]   2> 9250 T2453 oazs.ZooKeeperServer.processConnectRequest Client attempting to establish new session at /127.0.0.1:49927
[junit4:junit4]   2> 9251 T2455 oazs.ZooKeeperServer.finishSessionInit Established session 0x13c9811fc540007 with negotiated timeout 20000 for client /127.0.0.1:49927
[junit4:junit4]   2> 9251 T2504 oaz.ClientCnxn$SendThread.onConnected Session establishment complete on server localhost/127.0.0.1:49916, sessionid = 0x13c9811fc540007, negotiated timeout = 20000
[junit4:junit4]   2> 9252 T2505 oascc.ConnectionManager.process Watcher org.apache.solr.common.cloud.ConnectionManager@28824487 name:ZooKeeperConnection Watcher:127.0.0.1:49916 got event WatchedEvent state:SyncConnected type:None path:null path:null type:None
[junit4:junit4]   2> 9252 T2451 oascc.ConnectionManager.waitForConnected Client is connected to ZooKeeper
[junit4:junit4]   2> 9254 T2456 oazs.PrepRequestProcessor.pRequest2Txn Processed session termination for sessionid: 0x13c9811fc540007
[junit4:junit4]   2> 9255 T2453 oazs.NIOServerCnxn.closeSock Closed socket connection for client /127.0.0.1:49927 which had sessionid 0x13c9811fc540007
[junit4:junit4]   2> 9255 T2451 oaz.ZooKeeper.close Session: 0x13c9811fc540007 closed
[junit4:junit4]   2> 9256 T2451 oascsi.HttpClientUtil.createClient Creating new http client, config:maxConnections=500&maxConnectionsPerHost=16&socketTimeout=60000&connTimeout=15000
[junit4:junit4]   2> 9260 T2451 oaz.ZooKeeper.<init> Initiating client connection, connectString=127.0.0.1:49916/solr sessionTimeout=30000 watcher=org.apache.solr.common.cloud.ConnectionManager@302bdd12
[junit4:junit4]   2> 9261 T2505 oaz.ClientCnxn$EventThread.run EventThread shut down
[junit4:junit4]   2> 9262 T2506 oaz.ClientCnxn$SendThread.logStartConnect Opening socket connection to server localhost/127.0.0.1:49916. Will not attempt to authenticate using SASL (access denied ("javax.security.auth.AuthPermission" "getLoginConfiguration"))
[junit4:junit4]   2> 9263 T2506 oaz.ClientCnxn$SendThread.primeConnection Socket connection established to localhost/127.0.0.1:49916, initiating session
[junit4:junit4]   2> 9264 T2453 oazs.NIOServerCnxnFactory.run Accepted socket connection from /127.0.0.1:49928
[junit4:junit4]   2> 9264 T2453 oazs.ZooKeeperServer.processConnectRequest Client attempting to establish new session at /127.0.0.1:49928
[junit4:junit4]   2> 9269 T2455 oazs.ZooKeeperServer.finishSessionInit Established session 0x13c9811fc540008 with negotiated timeout 20000 for client /127.0.0.1:49928
[junit4:junit4]   2> 9269 T2451 oascc.ConnectionManager.waitForConnected Waiting for client to connect to ZooKeeper
[junit4:junit4]   2> 9270 T2506 oaz.ClientCnxn$SendThread.onConnected Session establishment complete on server localhost/127.0.0.1:49916, sessionid = 0x13c9811fc540008, negotiated timeout = 20000
[junit4:junit4]   2> 9270 T2507 oascc.ConnectionManager.process Watcher org.apache.solr.common.cloud.ConnectionManager@302bdd12 name:ZooKeeperConnection Watcher:127.0.0.1:49916/solr got event WatchedEvent state:SyncConnected type:None path:null path:null type:None
[junit4:junit4]   2> 9270 T2451 oascc.ConnectionManager.waitForConnected Client is connected to ZooKeeper
[junit4:junit4]   2> 9271 T2456 oazs.PrepRequestProcessor.pRequest Got user-level KeeperException when processing sessionid:0x13c9811fc540008 type:create cxid:0x1 zxid:0x6d txntype:-1 reqpath:n/a Error Path:/solr/overseer Error:KeeperErrorCode = NodeExists for /solr/overseer
[junit4:junit4]   2> 9272 T2456 oazs.PrepRequestProcessor.pRequest Got user-level KeeperException when processing sessionid:0x13c9811fc540008 type:create cxid:0x2 zxid:0x6e txntype:-1 reqpath:n/a Error Path:/solr/overseer Error:KeeperErrorCode = NodeExists for /solr/overseer
[junit4:junit4]   2> 9274 T2451 oasc.ZkController.createEphemeralLiveNode Register node as live in ZooKeeper:/live_nodes/127.0.0.1:49926_
[junit4:junit4]   2> 9274 T2456 oazs.PrepRequestProcessor.pRequest Got user-level KeeperException when processing sessionid:0x13c9811fc540008 type:delete cxid:0x4 zxid:0x6f txntype:-1 reqpath:n/a Error Path:/solr/live_nodes/127.0.0.1:49926_ Error:KeeperErrorCode = NoNode for /solr/live_nodes/127.0.0.1:49926_
[junit4:junit4]   2> 9275 T2451 oascc.SolrZkClient.makePath makePath: /live_nodes/127.0.0.1:49926_
[junit4:junit4]   2> 9278 T2492 oascc.ZkStateReader$2.process A cluster state change: WatchedEvent state:SyncConnected type:NodeChildrenChanged path:/live_nodes, has occurred - updating... (live nodes size: 2)
[junit4:junit4]   2> 9278 T2473 oascc.ZkStateReader$2.process A cluster state change: WatchedEvent state:SyncConnected type:NodeChildrenChanged path:/live_nodes, has occurred - updating... (live nodes size: 2)
[junit4:junit4]   2> 9280 T2479 oascc.ZkStateReader$3.process Updating live nodes... (3)
[junit4:junit4]   2> 9280 T2479 oascc.ZkStateReader$2.process A cluster state change: WatchedEvent state:SyncConnected type:NodeChildrenChanged path:/live_nodes, has occurred - updating... (live nodes size: 3)
[junit4:junit4]   2> 9283 T2492 oascc.ZkStateReader$3.process Updating live nodes... (3)
[junit4:junit4]   2> 9283 T2473 oascc.ZkStateReader$3.process Updating live nodes... (3)
[junit4:junit4]   2> 9289 T2451 oascc.ZkStateReader.createClusterStateWatchersAndUpdate Updating cluster state from ZooKeeper... 
[junit4:junit4]   2> 9296 T2508 oasc.CoreContainer.create Creating SolrCore 'collection1' using instanceDir: /Users/jenkins/jenkins-slave/workspace/Lucene-Solr-trunk-MacOSX/solr/build/solr-core/test/J0/./org.apache.solr.cloud.BasicDistributedZkTest-jetty2-1359760989988/collection1
[junit4:junit4]   2> 9296 T2508 oasc.ZkController.createCollectionZkNode Check for collection zkNode:collection1
[junit4:junit4]   2> 9297 T2508 oasc.ZkController.createCollectionZkNode Collection zkNode exists
[junit4:junit4]   2> 9298 T2508 oasc.ZkController.readConfigName Load collection config from:/collections/collection1
[junit4:junit4]   2> 9299 T2508 oasc.SolrResourceLoader.<init> new SolrResourceLoader for directory: '/Users/jenkins/jenkins-slave/workspace/Lucene-Solr-trunk-MacOSX/solr/build/solr-core/test/J0/./org.apache.solr.cloud.BasicDistributedZkTest-jetty2-1359760989988/collection1/'
[junit4:junit4]   2> 9300 T2508 oasc.SolrResourceLoader.replaceClassLoader Adding 'file:/Users/jenkins/jenkins-slave/workspace/Lucene-Solr-trunk-MacOSX/solr/build/solr-core/test/J0/org.apache.solr.cloud.BasicDistributedZkTest-jetty2-1359760989988/collection1/lib/classes/' to classloader
[junit4:junit4]   2> 9300 T2508 oasc.SolrResourceLoader.replaceClassLoader Adding 'file:/Users/jenkins/jenkins-slave/workspace/Lucene-Solr-trunk-MacOSX/solr/build/solr-core/test/J0/org.apache.solr.cloud.BasicDistributedZkTest-jetty2-1359760989988/collection1/lib/README' to classloader
[junit4:junit4]   2> 9352 T2508 oasc.SolrConfig.<init> Using Lucene MatchVersion: LUCENE_50
[junit4:junit4]   2> 9421 T2508 oasc.SolrConfig.<init> Loaded SolrConfig: solrconfig.xml
[junit4:junit4]   2> 9423 T2508 oass.IndexSchema.readSchema Reading Solr Schema
[junit4:junit4]   2> 9429 T2508 oass.IndexSchema.readSchema Schema name=test
[junit4:junit4]   2> 10029 T2508 oass.OpenExchangeRatesOrgProvider.init Initialized with rates=open-exchange-rates.json, refreshInterval=1440.
[junit4:junit4]   2> 10037 T2508 oass.IndexSchema.readSchema default search field in schema is text
[junit4:junit4]   2> 10041 T2508 oass.IndexSchema.readSchema unique key field: id
[junit4:junit4]   2> 10068 T2508 oass.FileExchangeRateProvider.reload Reloading exchange rates from file currency.xml
[junit4:junit4]   2> 10069 T1362 oasc.OverseerCollectionProcessor.run WARNING Overseer cannot talk to ZK
[junit4:junit4]   2> 10076 T2508 oass.FileExchangeRateProvider.reload Reloading exchange rates from file currency.xml
[junit4:junit4]   2> 10083 T2508 oass.OpenExchangeRatesOrgProvider.reload Reloading exchange rates from open-exchange-rates.json
[junit4:junit4]   2> 10085 T2508 oass.OpenExchangeRatesOrgProvider.reload Reloading exchange rates from open-exchange-rates.json
[junit4:junit4]   2> 10087 T2508 oasc.SolrCore.<init> [collection1] Opening new SolrCore at /Users/jenkins/jenkins-slave/workspace/Lucene-Solr-trunk-MacOSX/solr/build/solr-core/test/J0/./org.apache.solr.cloud.BasicDistributedZkTest-jetty2-1359760989988/collection1/, dataDir=./org.apache.solr.cloud.BasicDistributedZkTest-1359760981066/jetty2/
[junit4:junit4]   2> 10088 T2508 oasc.JmxMonitoredMap.<init> JMX monitoring is enabled. Adding Solr mbeans to JMX Server: com.sun.jmx.mbeanserver.JmxMBeanServer@455bac23
[junit4:junit4]   2> 10089 T2508 oasc.SolrCore.initDirectoryFactory solr.NRTCachingDirectoryFactory
[junit4:junit4]   2> 10090 T2508 oasc.CachingDirectoryFactory.get return new directory for /Users/jenkins/jenkins-slave/workspace/Lucene-Solr-trunk-MacOSX/solr/build/solr-core/test/J0/./org.apache.solr.cloud.BasicDistributedZkTest-1359760981066/jetty2 forceNew:false
[junit4:junit4]   2> 10090 T2508 oasc.CachingDirectoryFactory.close Releasing directory:/Users/jenkins/jenkins-slave/workspace/Lucene-Solr-trunk-MacOSX/solr/build/solr-core/test/J0/./org.apache.solr.cloud.BasicDistributedZkTest-1359760981066/jetty2
[junit4:junit4]   2> 10090 T2508 oasc.SolrCore.getNewIndexDir New index directory detected: old=null new=./org.apache.solr.cloud.BasicDistributedZkTest-1359760981066/jetty2/index/
[junit4:junit4]   2> 10091 T2508 oasc.SolrCore.initIndex WARNING [collection1] Solr index directory './org.apache.solr.cloud.BasicDistributedZkTest-1359760981066/jetty2/index' doesn't exist. Creating new index...
[junit4:junit4]   2> 10092 T2508 oasc.CachingDirectoryFactory.get return new directory for /Users/jenkins/jenkins-slave/workspace/Lucene-Solr-trunk-MacOSX/solr/build/solr-core/test/J0/./org.apache.solr.cloud.BasicDistributedZkTest-1359760981066/jetty2/index forceNew:false
[junit4:junit4]   2> 10098 T2508 oasc.SolrDeletionPolicy.onCommit SolrDeletionPolicy.onCommit: commits:num=1
[junit4:junit4]   2> 		commit{dir=RateLimitedDirectoryWrapper(NRTCachingDirectory(org.apache.lucene.store.NIOFSDirectory@/Users/jenkins/jenkins-slave/workspace/Lucene-Solr-trunk-MacOSX/solr/build/solr-core/test/J0/org.apache.solr.cloud.BasicDistributedZkTest-1359760981066/jetty2/index lockFactory=org.apache.lucene.store.NativeFSLockFactory@581ada72; maxCacheMB=48.0 maxMergeSizeMB=4.0)),segFN=segments_1,generation=1,filenames=[segments_1]
[junit4:junit4]   2> 10098 T2508 oasc.SolrDeletionPolicy.updateCommits newest commit = 1[segments_1]
[junit4:junit4]   2> 10099 T2508 oasc.CachingDirectoryFactory.close Releasing directory:/Users/jenkins/jenkins-slave/workspace/Lucene-Solr-trunk-MacOSX/solr/build/solr-core/test/J0/./org.apache.solr.cloud.BasicDistributedZkTest-1359760981066/jetty2/index
[junit4:junit4]   2> 10099 T2508 oasc.SolrCore.initWriters created xml: solr.XMLResponseWriter
[junit4:junit4]   2> 10102 T2508 oasup.UpdateRequestProcessorChain.init inserting DistributedUpdateProcessorFactory into updateRequestProcessorChain "dedupe"
[junit4:junit4]   2> 10102 T2508 oasup.UpdateRequestProcessorChain.init inserting DistributedUpdateProcessorFactory into updateRequestProcessorChain "dedupe-allfields"
[junit4:junit4]   2> 10102 T2508 oasup.UpdateRequestProcessorChain.init inserting DistributedUpdateProcessorFactory into updateRequestProcessorChain "stored_sig"
[junit4:junit4]   2> 10103 T2508 oasup.UpdateRequestProcessorChain.init inserting DistributedUpdateProcessorFactory into updateRequestProcessorChain "uniq-fields"
[junit4:junit4]   2> 10103 T2508 oasup.UpdateRequestProcessorChain.init inserting DistributedUpdateProcessorFactory into updateRequestProcessorChain "distrib-dup-test-chain-implicit"
[junit4:junit4]   2> 10104 T2508 oasc.RequestHandlers.initHandlersFromConfig adding lazy requestHandler: solr.ReplicationHandler
[junit4:junit4]   2> 10104 T2508 oasc.RequestHandlers.initHandlersFromConfig created /replication: solr.ReplicationHandler
[junit4:junit4]   2> 10105 T2508 oasc.RequestHandlers.initHandlersFromConfig created standard: solr.StandardRequestHandler
[junit4:junit4]   2> 10106 T2508 oasc.RequestHandlers.initHandlersFromConfig created /get: solr.RealTimeGetHandler
[junit4:junit4]   2> 10106 T2508 oasc.RequestHandlers.initHandlersFromConfig created dismax: solr.SearchHandler
[junit4:junit4]   2> 10107 T2508 oasc.RequestHandlers.initHandlersFromConfig created mock: org.apache.solr.core.MockQuerySenderListenerReqHandler
[junit4:junit4]   2> 10108 T2508 oasc.RequestHandlers.initHandlersFromConfig created /admin/: org.apache.solr.handler.admin.AdminHandlers
[junit4:junit4]   2> 10108 T2508 oasc.RequestHandlers.initHandlersFromConfig created defaults: solr.StandardRequestHandler
[junit4:junit4]   2> 10108 T2508 oasc.RequestHandlers.initHandlersFromConfig adding lazy requestHandler: solr.StandardRequestHandler
[junit4:junit4]   2> 10109 T2508 oasc.RequestHandlers.initHandlersFromConfig created lazy: solr.StandardRequestHandler
[junit4:junit4]   2> 10110 T2508 oasc.RequestHandlers.initHandlersFromConfig created /update: solr.UpdateRequestHandler
[junit4:junit4]   2> 10110 T2508 oasc.RequestHandlers.initHandlersFromConfig created /terms: org.apache.solr.handler.component.SearchHandler
[junit4:junit4]   2> 10112 T2508 oasc.RequestHandlers.initHandlersFromConfig created spellCheckCompRH: org.apache.solr.handler.component.SearchHandler
[junit4:junit4]   2> 10115 T2508 oasc.RequestHandlers.initHandlersFromConfig created spellCheckCompRH_Direct: org.apache.solr.handler.component.SearchHandler
[junit4:junit4]   2> 10117 T2508 oasc.RequestHandlers.initHandlersFromConfig created spellCheckWithWordbreak: org.apache.solr.handler.component.SearchHandler
[junit4:junit4]   2> 10117 T2508 oasc.RequestHandlers.initHandlersFromConfig created spellCheckWithWordbreak_Direct: org.apache.solr.handler.component.SearchHandler
[junit4:junit4]   2> 10118 T2508 oasc.RequestHandlers.initHandlersFromConfig created spellCheckCompRH1: org.apache.solr.handler.component.SearchHandler
[junit4:junit4]   2> 10119 T2508 oasc.RequestHandlers.initHandlersFromConfig created mltrh: org.apache.solr.handler.component.SearchHandler
[junit4:junit4]   2> 10121 T2508 oasc.RequestHandlers.initHandlersFromConfig created tvrh: org.apache.solr.handler.component.SearchHandler
[junit4:junit4]   2> 10121 T2508 oasc.RequestHandlers.initHandlersFromConfig created /mlt: solr.MoreLikeThisHandler
[junit4:junit4]   2> 10122 T2508 oasc.RequestHandlers.initHandlersFromConfig created /debug/dump: solr.DumpRequestHandler
[junit4:junit4]   2> 10128 T2508 oashl.XMLLoader.init xsltCacheLifetimeSeconds=60
[junit4:junit4]   2> 10131 T2508 oasc.SolrCore.initDeprecatedSupport WARNING solrconfig.xml uses deprecated <admin/gettableFiles>, Please update your config to use the ShowFileRequestHandler.
[junit4:junit4]   2> 10133 T2508 oasc.SolrCore.initDeprecatedSupport WARNING adding ShowFileRequestHandler with hidden files: [SCHEMA.XML, OLD_SYNONYMS.TXT, STOPWORDS.TXT, PROTWORDS.TXT, OPEN-EXCHANGE-RATES.JSON, SYNONYMS.TXT, CURRENCY.XML, MAPPING-ISOLATIN1ACCENT.TXT]
[junit4:junit4]   2> 10135 T2508 oasc.CachingDirectoryFactory.close Releasing directory:/Users/jenkins/jenkins-slave/workspace/Lucene-Solr-trunk-MacOSX/solr/build/solr-core/test/J0/./org.apache.solr.cloud.BasicDistributedZkTest-1359760981066/jetty2
[junit4:junit4]   2> 10136 T2508 oass.SolrIndexSearcher.<init> Opening Searcher@632100d4 main
[junit4:junit4]   2> 10137 T2508 oasu.CommitTracker.<init> Hard AutoCommit: disabled
[junit4:junit4]   2> 10138 T2508 oasu.CommitTracker.<init> Soft AutoCommit: disabled
[junit4:junit4]   2> 10138 T2508 oashc.SpellCheckComponent.inform Initializing spell checkers
[junit4:junit4]   2> 10143 T2508 oass.DirectSolrSpellChecker.init init: {name=direct,classname=DirectSolrSpellChecker,field=lowerfilt,minQueryLength=3}
[junit4:junit4]   2> 10177 T2509 oasc.SolrCore.registerSearcher [collection1] Registered new searcher Searcher@632100d4 main{StandardDirectoryReader(segments_1:1)}
[junit4:junit4]   2> 10193 T2508 oasc.ZkController.publish publishing core=collection1 state=down
[junit4:junit4]   2> 10193 T2508 oasc.ZkController.publish numShards not found on descriptor - reading it from system property
[junit4:junit4]   2> 10420 T2474 oascc.ZkStateReader.updateClusterState Updating cloud state from ZooKeeper... 
[junit4:junit4]   2> 10421 T2474 oasc.Overseer$ClusterStateUpdater.updateState Update state numShards=2 message={
[junit4:junit4]   2> 	  "operation":"state",
[junit4:junit4]   2> 	  "numShards":"2",
[junit4:junit4]   2> 	  "shard":"shard1",
[junit4:junit4]   2> 	  "roles":null,
[junit4:junit4]   2> 	  "state":"active",
[junit4:junit4]   2> 	  "core":"collection1",
[junit4:junit4]   2> 	  "collection":"collection1",
[junit4:junit4]   2> 	  "node_name":"127.0.0.1:49923_",
[junit4:junit4]   2> 	  "base_url":"http://127.0.0.1:49923"}
[junit4:junit4]   2> 10425 T2474 oasc.Overseer$ClusterStateUpdater.updateState Update state numShards=2 message={
[junit4:junit4]   2> 	  "operation":"state",
[junit4:junit4]   2> 	  "numShards":"2",
[junit4:junit4]   2> 	  "shard":null,
[junit4:junit4]   2> 	  "roles":null,
[junit4:junit4]   2> 	  "state":"down",
[junit4:junit4]   2> 	  "core":"collection1",
[junit4:junit4]   2> 	  "collection":"collection1",
[junit4:junit4]   2> 	  "node_name":"127.0.0.1:49926_",
[junit4:junit4]   2> 	  "base_url":"http://127.0.0.1:49926"}
[junit4:junit4]   2> 10426 T2474 oasc.Overseer$ClusterStateUpdater.updateState Collection already exists with numShards=2
[junit4:junit4]   2> 10426 T2474 oasc.Overseer$ClusterStateUpdater.updateState Assigning new node to shard shard=shard2
[junit4:junit4]   2> 10431 T2492 oascc.ZkStateReader$2.process A cluster state change: WatchedEvent state:SyncConnected type:NodeDataChanged path:/clusterstate.json, has occurred - updating... (live nodes size: 3)
[junit4:junit4]   2> 10432 T2473 oascc.ZkStateReader$2.process A cluster state change: WatchedEvent state:SyncConnected type:NodeDataChanged path:/clusterstate.json, has occurred - updating... (live nodes size: 3)
[junit4:junit4]   2> 10432 T2507 oascc.ZkStateReader$2.process A cluster state change: WatchedEvent state:SyncConnected type:NodeDataChanged path:/clusterstate.json, has occurred - updating... (live nodes size: 3)
[junit4:junit4]   2> 10432 T2479 oascc.ZkStateReader$2.process A cluster state change: WatchedEvent state:SyncConnected type:NodeDataChanged path:/clusterstate.json, has occurred - updating... (live nodes size: 3)
[junit4:junit4]   2> 11200 T2508 oasc.CoreContainer.registerCore registering core: collection1
[junit4:junit4]   2> 11201 T2508 oasc.ZkController.register Register replica - core:collection1 address:http://127.0.0.1:49926 collection:collection1 shard:shard2
[junit4:junit4]   2> 11202 T2508 oascc.SolrZkClient.makePath makePath: /collections/collection1/leader_elect/shard2/election
[junit4:junit4]   2> 11211 T2456 oazs.PrepRequestProcessor.pRequest Got user-level KeeperException when processing sessionid:0x13c9811fc540008 type:delete cxid:0x42 zxid:0x7d txntype:-1 reqpath:n/a Error Path:/solr/collections/collection1/leaders/shard2 Error:KeeperErrorCode = NoNode for /solr/collections/collection1/leaders/shard2
[junit4:junit4]   2> 11212 T2508 oasc.ShardLeaderElectionContext.runLeaderProcess Running the leader process.
[junit4:junit4]   2> 11213 T2456 oazs.PrepRequestProcessor.pRequest Got user-level KeeperException when processing sessionid:0x13c9811fc540008 type:create cxid:0x43 zxid:0x7e txntype:-1 reqpath:n/a Error Path:/solr/overseer Error:KeeperErrorCode = NodeExists for /solr/overseer
[junit4:junit4]   2> 11215 T2508 oasc.ShardLeaderElectionContext.waitForReplicasToComeUp Enough replicas found to continue.
[junit4:junit4]   2> 11216 T2508 oasc.ShardLeaderElectionContext.runLeaderProcess I may be the new leader - try and sync
[junit4:junit4]   2> 11216 T2508 oasc.SyncStrategy.sync Sync replicas to http://127.0.0.1:49926/collection1/
[junit4:junit4]   2> 11217 T2508 oasc.SyncStrategy.syncReplicas Sync Success - now sync replicas to me
[junit4:junit4]   2> 11217 T2508 oasc.SyncStrategy.syncToMe http://127.0.0.1:49926/collection1/ has no replicas
[junit4:junit4]   2> 11217 T2508 oasc.ShardLeaderElectionContext.runLeaderProcess I am the new leader: http://127.0.0.1:49926/collection1/
[junit4:junit4]   2> 11217 T2508 oascc.SolrZkClient.makePath makePath: /collections/collection1/leaders/shard2
[junit4:junit4]   2> 11222 T2456 oazs.PrepRequestProcessor.pRequest Got user-level KeeperException when processing sessionid:0x13c9811fc540008 type:create cxid:0x4c zxid:0x81 txntype:-1 reqpath:n/a Error Path:/solr/overseer Error:KeeperErrorCode = NodeExists for /solr/overseer
[junit4:junit4]   2> 11945 T2474 oascc.ZkStateReader.updateClusterState Updating cloud state from ZooKeeper... 
[junit4:junit4]   2> 11958 T2492 oascc.ZkStateReader$2.process A cluster state change: WatchedEvent state:SyncConnected type:NodeDataChanged path:/clusterstate.json, has occurred - updating... (live nodes size: 3)
[junit4:junit4]   2> 11958 T2473 oascc.ZkStateReader$2.process A cluster state change: WatchedEvent state:SyncConnected type:NodeDataChanged path:/clusterstate.json, has occurred - updating... (live nodes size: 3)
[junit4:junit4]   2> 11958 T2507 oascc.ZkStateReader$2.process A cluster state change: WatchedEvent state:SyncConnected type:NodeDataChanged path:/clusterstate.json, has occurred - updating... (live nodes size: 3)
[junit4:junit4]   2> 11959 T2479 oascc.ZkStateReader$2.process A cluster state change: WatchedEvent state:SyncConnected type:NodeDataChanged path:/clusterstate.json, has occurred - updating... (live nodes size: 3)
[junit4:junit4]   2> 12007 T2508 oasc.ZkController.register We are http://127.0.0.1:49926/collection1/ and leader is http://127.0.0.1:49926/collection1/
[junit4:junit4]   2> 12008 T2508 oasc.ZkController.register No LogReplay needed for core=collection1 baseURL=http://127.0.0.1:49926
[junit4:junit4]   2> 12008 T2508 oasc.ZkController.checkRecovery I am the leader, no recovery necessary
[junit4:junit4]   2> 12009 T2508 oasc.ZkController.publish publishing core=collection1 state=active
[junit4:junit4]   2> 12009 T2508 oasc.ZkController.publish numShards not found on descriptor - reading it from system property
[junit4:junit4]   2> 12011 T2508 oascc.ZkStateReader.updateClusterState Updating cloud state from ZooKeeper... 
[junit4:junit4]   2> 12013 T2451 oass.SolrDispatchFilter.init user.dir=/Users/jenkins/jenkins-slave/workspace/Lucene-Solr-trunk-MacOSX/solr/build/solr-core/test/J0
[junit4:junit4]   2> 12014 T2451 oass.SolrDispatchFilter.init SolrDispatchFilter.init() done
[junit4:junit4]   2> 12014 T2451 oascsi.HttpClientUtil.createClient Creating new http client, config:maxConnections=128&maxConnectionsPerHost=32&followRedirects=false
[junit4:junit4]   2> 12228 T2451 oejs.Server.doStart jetty-8.1.8.v20121106
[junit4:junit4]   2> 12232 T2451 oejs.AbstractConnector.doStart Started SelectChannelConnector@127.0.0.1:49929
[junit4:junit4]   2> 12233 T2451 oass.SolrDispatchFilter.init SolrDispatchFilter.init()
[junit4:junit4]   2> 12234 T2451 oasc.SolrResourceLoader.locateSolrHome JNDI not configured for solr (NoInitialContextEx)
[junit4:junit4]   2> 12234 T2451 oasc.SolrResourceLoader.locateSolrHome using system property solr.solr.home: /Users/jenkins/jenkins-slave/workspace/Lucene-Solr-trunk-MacOSX/solr/build/solr-core/test/J0/./org.apache.solr.cloud.BasicDistributedZkTest-jetty3-1359760993078
[junit4:junit4]   2> 12235 T2451 oasc.CoreContainer$Initializer.initialize looking for solr.xml: /Users/jenkins/jenkins-slave/workspace/Lucene-Solr-trunk-MacOSX/solr/build/solr-core/test/J0/./org.apache.solr.cloud.BasicDistributedZkTest-jetty3-1359760993078/solr.xml
[junit4:junit4]   2> 12235 T2451 oasc.CoreContainer.<init> New CoreContainer 415825597
[junit4:junit4]   2> 12236 T2451 oasc.CoreContainer.load Loading CoreContainer using Solr Home: '/Users/jenkins/jenkins-slave/workspace/Lucene-Solr-trunk-MacOSX/solr/build/solr-core/test/J0/./org.apache.solr.cloud.BasicDistributedZkTest-jetty3-1359760993078/'
[junit4:junit4]   2> 12236 T2451 oasc.SolrResourceLoader.<init> new SolrResourceLoader for directory: '/Users/jenkins/jenkins-slave/workspace/Lucene-Solr-trunk-MacOSX/solr/build/solr-core/test/J0/./org.apache.solr.cloud.BasicDistributedZkTest-jetty3-1359760993078/'
[junit4:junit4]   2> 12273 T2451 oashc.HttpShardHandlerFactory.getParameter Setting socketTimeout to: 60000
[junit4:junit4]   2> 12274 T2451 oashc.HttpShardHandlerFactory.getParameter Setting urlScheme to: http://
[junit4:junit4]   2> 12274 T2451 oashc.HttpShardHandlerFactory.getParameter Setting connTimeout to: 15000
[junit4:junit4]   2> 12275 T2451 oashc.HttpShardHandlerFactory.getParameter Setting maxConnectionsPerHost to: 20
[junit4:junit4]   2> 12276 T2451 oashc.HttpShardHandlerFactory.getParameter Setting corePoolSize to: 0
[junit4:junit4]   2> 12277 T2451 oashc.HttpShardHandlerFactory.getParameter Setting maximumPoolSize to: 2147483647
[junit4:junit4]   2> 12277 T2451 oashc.HttpShardHandlerFactory.getParameter Setting maxThreadIdleTime to: 5
[junit4:junit4]   2> 12278 T2451 oashc.HttpShardHandlerFactory.getParameter Setting sizeOfQueue to: -1
[junit4:junit4]   2> 12278 T2451 oashc.HttpShardHandlerFactory.getParameter Setting fairnessPolicy to: false
[junit4:junit4]   2> 12279 T2451 oascsi.HttpClientUtil.createClient Creating new http client, config:maxConnectionsPerHost=20&maxConnections=10000&socketTimeout=60000&connTimeout=15000&retry=false
[junit4:junit4]   2> 12291 T2451 oasc.CoreContainer.load Registering Log Listener
[junit4:junit4]   2> 12311 T2451 oasc.CoreContainer.initZooKeeper Zookeeper client=127.0.0.1:49916/solr
[junit4:junit4]   2> 12311 T2451 oasc.ZkController.checkChrootPath zkHost includes chroot
[junit4:junit4]   2> 12312 T2451 oaz.ZooKeeper.<init> Initiating client connection, connectString=127.0.0.1:49916 sessionTimeout=60000 watcher=org.apache.solr.common.cloud.ConnectionManager@7043bfdb
[junit4:junit4]   2> 12314 T2519 oaz.ClientCnxn$SendThread.logStartConnect Opening socket connection to server localhost/127.0.0.1:49916. Will not attempt to authenticate using SASL (access denied ("javax.security.auth.AuthPermission" "getLoginConfiguration"))
[junit4:junit4]   2> 12321 T2519 oaz.ClientCnxn$SendThread.primeConnection Socket connection established to localhost/127.0.0.1:49916, initiating session
[junit4:junit4]   2> 12323 T2453 oazs.NIOServerCnxnFactory.run Accepted socket connection from /127.0.0.1:49930
[junit4:junit4]   2> 12323 T2451 oascc.ConnectionManager.waitForConnected Waiting for client to connect to ZooKeeper
[junit4:junit4]   2> 12323 T2453 oazs.ZooKeeperServer.processConnectRequest Client attempting to establish new session at /127.0.0.1:49930
[junit4:junit4]   2> 12325 T2455 oazs.ZooKeeperServer.finishSessionInit Established session 0x13c9811fc540009 with negotiated timeout 20000 for client /127.0.0.1:49930
[junit4:junit4]   2> 12325 T2519 oaz.ClientCnxn$SendThread.onConnected Session establishment complete on server localhost/127.0.0.1:49916, sessionid = 0x13c9811fc540009, negotiated timeout = 20000
[junit4:junit4]   2> 12326 T2520 oascc.ConnectionManager.process Watcher org.apache.solr.common.cloud.ConnectionManager@7043bfdb name:ZooKeeperConnection Watcher:127.0.0.1:49916 got event WatchedEvent state:SyncConnected type:None path:null path:null type:None
[junit4:junit4]   2> 12326 T2451 oascc.ConnectionManager.waitForConnected Client is connected to ZooKeeper
[junit4:junit4]   2> 12328 T2456 oazs.PrepRequestProcessor.pRequest2Txn Processed session termination for sessionid: 0x13c9811fc540009
[junit4:junit4]   2> 12329 T2453 oazs.NIOServerCnxn.closeSock Closed socket connection for client /127.0.0.1:49930 which had sessionid 0x13c9811fc540009
[junit4:junit4]   2> 12329 T2520 oaz.ClientCnxn$EventThread.run EventThread shut down
[junit4:junit4]   2> 12329 T2451 oaz.ZooKeeper.close Session: 0x13c9811fc540009 closed
[junit4:junit4]   2> 12330 T2451 oascsi.HttpClientUtil.createClient Creating new http client, config:maxConnections=500&maxConnectionsPerHost=16&socketTimeout=60000&connTimeout=15000
[junit4:junit4]   2> 12335 T2451 oaz.ZooKeeper.<init> Initiating client connection, connectString=127.0.0.1:49916/solr sessionTimeout=30000 watcher=org.apache.solr.common.cloud.ConnectionManager@45d9ed30
[junit4:junit4]   2> 12338 T2451 oascc.ConnectionManager.waitForConnected Waiting for client to connect to ZooKeeper
[junit4:junit4]   2> 12339 T2521 oaz.ClientCnxn$SendThread.logStartConnect Opening socket connection to server localhost/127.0.0.1:49916. Will not attempt to authenticate using SASL (access denied ("javax.security.auth.AuthPermission" "getLoginConfiguration"))
[junit4:junit4]   2> 12340 T2521 oaz.ClientCnxn$SendThread.primeConnection Socket connection established to localhost/127.0.0.1:49916, initiating session
[junit4:junit4]   2> 12340 T2453 oazs.NIOServerCnxnFactory.run Accepted socket connection from /127.0.0.1:49931
[junit4:junit4]   2> 12341 T2453 oazs.ZooKeeperServer.processConnectRequest Client attempting to establish new session at /127.0.0.1:49931
[junit4:junit4]   2> 12342 T2455 oazs.ZooKeeperServer.finishSessionInit Established session 0x13c9811fc54000a with negotiated timeout 20000 for client /127.0.0.1:49931
[junit4:junit4]   2> 12343 T2521 oaz.ClientCnxn$SendThread.onConnected Session establishment complete on server localhost/127.0.0.1:49916, sessionid = 0x13c9811fc54000a, negotiated timeout = 20000
[junit4:junit4]   2> 12343 T2522 oascc.ConnectionManager.process Watcher org.apache.solr.common.cloud.ConnectionManager@45d9ed30 name:ZooKeeperConnection Watcher:127.0.0.1:49916/solr got event WatchedEvent state:SyncConnected type:None path:null path:null type:None
[junit4:junit4]   2> 12343 T2451 oascc.ConnectionManager.waitForConnected Client is connected to ZooKeeper
[junit4:junit4]   2> 12344 T2456 oazs.PrepRequestProcessor.pRequest Got user-level KeeperException when processing sessionid:0x13c9811fc54000a type:create cxid:0x1 zxid:0x8e txntype:-1 reqpath:n/a Error Path:/solr/overseer Error:KeeperErrorCode = NodeExists for /solr/overseer
[junit4:junit4]   2> 12345 T2456 oazs.PrepRequestProcessor.pRequest Got user-level KeeperException when processing sessionid:0x13c9811fc54000a type:create cxid:0x2 zxid:0x8f txntype:-1 reqpath:n/a Error Path:/solr/overseer Error:KeeperErrorCode = NodeExists for /solr/overseer
[junit4:junit4]   2> 12347 T2451 oasc.ZkController.createEphemeralLiveNode Register node as live in ZooKeeper:/live_nodes/127.0.0.1:49929_
[junit4:junit4]   2> 12348 T2456 oazs.PrepRequestProcessor.pRequest Got user-level KeeperException when processing sessionid:0x13c9811fc54000a type:delete cxid:0x4 zxid:0x90 txntype:-1 reqpath:n/a Error Path:/solr/live_nodes/127.0.0.1:49929_ Error:KeeperErrorCode = NoNode for /solr/live_nodes/127.0.0.1:49929_
[junit4:junit4]   2> 12348 T2451 oascc.SolrZkClient.makePath makePath: /live_nodes/127.0.0.1:49929_
[junit4:junit4]   2> 12352 T2492 oascc.ZkStateReader$2.process A cluster state change: WatchedEvent state:SyncConnected type:NodeChildrenChanged path:/live_nodes, has occurred - updating... (live nodes size: 3)
[junit4:junit4]   2> 12352 T2473 oascc.ZkStateReader$2.process A cluster state change: WatchedEvent state:SyncConnected type:NodeChildrenChanged path:/live_nodes, has occurred - updating... (live nodes size: 3)
[junit4:junit4]   2> 12354 T2479 oascc.ZkStateReader$3.process Updating live nodes... (4)
[junit4:junit4]   2> 12354 T2479 oascc.ZkStateReader$2.process A cluster state change: WatchedEvent state:SyncConnected type:NodeChildrenChanged path:/live_nodes, has occurred - updating... (live nodes size: 4)
[junit4:junit4]   2> 12354 T2507 oascc.ZkStateReader$3.process Updating live nodes... (4)
[junit4:junit4]   2> 12355 T2507 oascc.ZkStateReader$2.process A cluster state change: WatchedEvent state:SyncConnected type:NodeChildrenChanged path:/live_nodes, has occurred - updating... (live nodes size: 4)
[junit4:junit4]   2> 12360 T2492 oascc.ZkStateReader$3.process Updating live nodes... (4)
[junit4:junit4]   2> 12360 T2473 oascc.ZkStateReader$3.process Updating live nodes... (4)
[junit4:junit4]   2> 12363 T2451 oascc.ZkStateReader.createClusterStateWatchersAndUpdate Updating cluster state from ZooKeeper... 
[junit4:junit4]   2> 12371 T2523 oasc.CoreContainer.create Creating SolrCore 'collection1' using instanceDir: /Users/jenkins/jenkins-slave/workspace/Lucene-Solr-trunk-MacOSX/solr/build/solr-core/test/J0/./org.apache.solr.cloud.BasicDistributedZkTest-jetty3-1359760993078/collection1
[junit4:junit4]   2> 12371 T2523 oasc.ZkController.createCollectionZkNode Check for collection zkNode:collection1
[junit4:junit4]   2> 12372 T2523 oasc.ZkController.createCollectionZkNode Collection zkNode exists
[junit4:junit4]   2> 12372 T2523 oasc.ZkController.readConfigName Load collection config from:/collections/collection1
[junit4:junit4]   2> 12374 T2523 oasc.SolrResourceLoader.<init> new SolrResourceLoader for directory: '/Users/jenkins/jenkins-slave/workspace/Lucene-Solr-trunk-MacOSX/solr/build/solr-core/test/J0/./org.apache.solr.cloud.BasicDistributedZkTest-jetty3-1359760993078/collection1/'
[junit4:junit4]   2> 12375 T2523 oasc.SolrResourceLoader.replaceClassLoader Adding 'file:/Users/jenkins/jenkins-slave/workspace/Lucene-Solr-trunk-MacOSX/solr/build/solr-core/test/J0/org.apache.solr.cloud.BasicDistributedZkTest-jetty3-1359760993078/collection1/lib/classes/' to classloader
[junit4:junit4]   2> 12375 T2523 oasc.SolrResourceLoader.replaceClassLoader Adding 'file:/Users/jenkins/jenkins-slave/workspace/Lucene-Solr-trunk-MacOSX/solr/build/solr-core/test/J0/org.apache.solr.cloud.BasicDistributedZkTest-jetty3-1359760993078/collection1/lib/README' to classloader
[junit4:junit4]   2> 12428 T2523 oasc.SolrConfig.<init> Using Lucene MatchVersion: LUCENE_50
[junit4:junit4]   2> 12497 T2523 oasc.SolrConfig.<init> Loaded SolrConfig: solrconfig.xml
[junit4:junit4]   2> 12498 T2523 oass.IndexSchema.readSchema Reading Solr Schema
[junit4:junit4]   2> 12504 T2523 oass.IndexSchema.readSchema Schema name=test
[junit4:junit4]   2> 13213 T2523 oass.OpenExchangeRatesOrgProvider.init Initialized with rates=open-exchange-rates.json, refreshInterval=1440.
[junit4:junit4]   2> 13230 T2523 oass.IndexSchema.readSchema default search field in schema is text
[junit4:junit4]   2> 13234 T2523 oass.IndexSchema.readSchema unique key field: id
[junit4:junit4]   2> 13254 T2523 oass.FileExchangeRateProvider.reload Reloading exchange rates from file currency.xml
[junit4:junit4]   2> 13259 T2523 oass.FileExchangeRateProvider.reload Reloading exchange rates from file currency.xml
[junit4:junit4]   2> 13266 T2523 oass.OpenExchangeRatesOrgProvider.reload Reloading exchange rates from open-exchange-rates.json
[junit4:junit4]   2> 13269 T2523 oass.OpenExchangeRatesOrgProvider.reload Reloading exchange rates from open-exchange-rates.json
[junit4:junit4]   2> 13270 T2523 oasc.SolrCore.<init> [collection1] Opening new SolrCore at /Users/jenkins/jenkins-slave/workspace/Lucene-Solr-trunk-MacOSX/solr/build/solr-core/test/J0/./org.apache.solr.cloud.BasicDistributedZkTest-jetty3-1359760993078/collection1/, dataDir=./org.apache.solr.cloud.BasicDistributedZkTest-1359760981066/jetty3/
[junit4:junit4]   2> 13271 T2523 oasc.JmxMonitoredMap.<init> JMX monitoring is enabled. Adding Solr mbeans to JMX Server: com.sun.jmx.mbeanserver.JmxMBeanServer@455bac23
[junit4:junit4]   2> 13271 T2523 oasc.SolrCore.initDirectoryFactory solr.NRTCachingDirectoryFactory
[junit4:junit4]   2> 13272 T2523 oasc.CachingDirectoryFactory.get return new directory for /Users/jenkins/jenkins-slave/workspace/Lucene-Solr-trunk-MacOSX/solr/build/solr-core/test/J0/./org.apache.solr.cloud.BasicDistributedZkTest-1359760981066/jetty3 forceNew:false
[junit4:junit4]   2> 13273 T2523 oasc.CachingDirectoryFactory.close Releasing directory:/Users/jenkins/jenkins-slave/workspace/Lucene-Solr-trunk-MacOSX/solr/build/solr-core/test/J0/./org.apache.solr.cloud.BasicDistributedZkTest-1359760981066/jetty3
[junit4:junit4]   2> 13273 T2523 oasc.SolrCore.getNewIndexDir New index directory detected: old=null new=./org.apache.solr.cloud.BasicDistributedZkTest-1359760981066/jetty3/index/
[junit4:junit4]   2> 13274 T2523 oasc.SolrCore.initIndex WARNING [collection1] Solr index directory './org.apache.solr.cloud.BasicDistributedZkTest-1359760981066/jetty3/index' doesn't exist. Creating new index...
[junit4:junit4]   2> 13274 T2523 oasc.CachingDirectoryFactory.get return new directory for /Users/jenkins/jenkins-slave/workspace/Lucene-Solr-trunk-MacOSX/solr/build/solr-core/test/J0/./org.apache.solr.cloud.BasicDistributedZkTest-1359760981066/jetty3/index forceNew:false
[junit4:junit4]   2> 13280 T2523 oasc.SolrDeletionPolicy.onCommit SolrDeletionPolicy.onCommit: commits:num=1
[junit4:junit4]   2> 		commit{dir=RateLimitedDirectoryWrapper(NRTCachingDirectory(org.apache.lucene.store.NIOFSDirectory@/Users/jenkins/jenkins-slave/workspace/Lucene-Solr-trunk-MacOSX/solr/build/solr-core/test/J0/org.apache.solr.cloud.BasicDistributedZkTest-1359760981066/jetty3/index lockFactory=org.apache.lucene.store.NativeFSLockFactory@1d3c0182; maxCacheMB=48.0 maxMergeSizeMB=4.0)),segFN=segments_1,generation=1,filenames=[segments_1]
[junit4:junit4]   2> 13280 T2523 oasc.SolrDeletionPolicy.updateCommits newest commit = 1[segments_1]
[junit4:junit4]   2> 13281 T2523 oasc.CachingDirectoryFactory.close Releasing directory:/Users/jenkins/jenkins-slave/workspace/Lucene-Solr-trunk-MacOSX/solr/build/solr-core/test/J0/./org.apache.solr.cloud.BasicDistributedZkTest-1359760981066/jetty3/index
[junit4:junit4]   2> 13282 T2523 oasc.SolrCore.initWriters created xml: solr.XMLResponseWriter
[junit4:junit4]   2> 13285 T2523 oasup.UpdateRequestProcessorChain.init inserting DistributedUpdateProcessorFactory into updateRequestProcessorChain "dedupe"
[junit4:junit4]   2> 13290 T2523 oasup.UpdateRequestProcessorChain.init inserting DistributedUpdateProcessorFactory into updateRequestProcessorChain "dedupe-allfields"
[junit4:junit4]   2> 13290 T2523 oasup.UpdateRequestProcessorChain.init inserting DistributedUpdateProcessorFactory into updateRequestProcessorChain "stored_sig"
[junit4:junit4]   2> 13290 T2523 oasup.UpdateRequestProcessorChain.init inserting DistributedUpdateProcessorFactory into updateRequestProcessorChain "uniq-fields"
[junit4:junit4]   2> 13291 T2523 oasup.UpdateRequestProcessorChain.init inserting DistributedUpdateProcessorFactory into updateRequestProcessorChain "distrib-dup-test-chain-implicit"
[junit4:junit4]   2> 13291 T2523 oasc.RequestHandlers.initHandlersFromConfig adding lazy requestHandler: solr.ReplicationHandler
[junit4:junit4]   2> 13291 T2523 oasc.RequestHandlers.initHandlersFromConfig created /replication: solr.ReplicationHandler
[junit4:junit4]   2> 13292 T2523 oasc.RequestHandlers.initHandlersFromConfig created standard: solr.StandardRequestHandler
[junit4:junit4]   2> 13292 T2523 oasc.RequestHandlers.initHandlersFromConfig created /get: solr.RealTimeGetHandler
[junit4:junit4]   2> 13293 T2523 oasc.RequestHandlers.initHandlersFromConfig created dismax: solr.SearchHandler
[junit4:junit4]   2> 13293 T2523 oasc.RequestHandlers.initHandlersFromConfig created mock: org.apache.solr.core.MockQuerySenderListenerReqHandler
[junit4:junit4]   2> 13294 T2523 oasc.RequestHandlers.initHandlersFromConfig created /admin/: org.apache.solr.handler.admin.AdminHandlers
[junit4:junit4]   2> 13294 T2523 oasc.RequestHandlers.initHandlersFromConfig created defaults: solr.StandardRequestHandler
[junit4:junit4]   2> 13294 T2523 oasc.RequestHandlers.initHandlersFromConfig adding lazy requestHandler: solr.StandardRequestHandler
[junit4:junit4]   2> 13295 T2523 oasc.RequestHandlers.initHandlersFromConfig created lazy: solr.StandardRequestHandler
[junit4:junit4]   2> 13295 T2523 oasc.RequestHandlers.initHandlersFromConfig created /update: solr.UpdateRequestHandler
[junit4:junit4]   2> 13296 T2523 oasc.RequestHandlers.initHandlersFromConfig created /terms: org.apache.solr.handler.component.SearchHandler
[junit4:junit4]   2> 13296 T2523 oasc.RequestHandlers.initHandlersFromConfig created spellCheckCompRH: org.apache.solr.handler.component.SearchHandler
[junit4:junit4]   2> 13297 T2523 oasc.RequestHandlers.initHandlersFromConfig created spellCheckCompRH_Direct: org.apache.solr.handler.component.SearchHandler
[junit4:junit4]   2> 13297 T2523 oasc.RequestHandlers.initHandlersFromConfig created spellCheckWithWordbreak: org.apache.solr.handler.component.SearchHandler
[junit4:junit4]   2> 13298 T2523 oasc.RequestHandlers.initHandlersFromConfig created spellCheckWithWordbreak_Direct: org.apache.solr.handler.component.SearchHandler
[junit4:junit4]   2> 13298 T2523 oasc.RequestHandlers.initHandlersFromConfig created spellCheckCompRH1: org.apache.solr.handler.component.SearchHandler
[junit4:junit4]   2> 13302 T2523 oasc.RequestHandlers.initHandlersFromConfig created mltrh: org.apache.solr.handler.component.SearchHandler
[junit4:junit4]   2> 13303 T2523 oasc.RequestHandlers.initHandlersFromConfig created tvrh: org.apache.solr.handler.component.SearchHandler
[junit4:junit4]   2> 13304 T2523 oasc.RequestHandlers.initHandlersFromConfig created /mlt: solr.MoreLikeThisHandler
[junit4:junit4]   2> 13304 T2523 oasc.RequestHandlers.initHandlersFromConfig created /debug/dump: solr.DumpRequestHandler
[junit4:junit4]   2> 13322 T2523 oashl.XMLLoader.init xsltCacheLifetimeSeconds=60
[junit4:junit4]   2> 13325 T2523 oasc.SolrCore.initDeprecatedSupport WARNING solrconfig.xml uses deprecated <admin/gettableFiles>, Please update your config to use the ShowFileRequestHandler.
[junit4:junit4]   2> 13327 T2523 oasc.SolrCore.initDeprecatedSupport WARNING adding ShowFileRequestHandler with hidden files: [SCHEMA.XML, OLD_SYNONYMS.TXT, STOPWORDS.TXT, PROTWORDS.TXT, OPEN-EXCHANGE-RATES.JSON, SYNONYMS.TXT, CURRENCY.XML, MAPPING-ISOLATIN1ACCENT.TXT]
[junit4:junit4]   2> 13329 T2523 oasc.CachingDirectoryFactory.close Releasing directory:/Users/jenkins/jenkins-slave/workspace/Lucene-Solr-trunk-MacOSX/solr/build/solr-core/test/J0/./org.apache.solr.cloud.BasicDistributedZkTest-1359760981066/jetty3
[junit4:junit4]   2> 13331 T2523 oass.SolrIndexSearcher.<init> Opening Searcher@36916760 main
[junit4:junit4]   2> 13332 T2523 oasu.CommitTracker.<init> Hard AutoCommit: disabled
[junit4:junit4]   2> 13332 T2523 oasu.CommitTracker.<init> Soft AutoCommit: disabled
[junit4:junit4]   2> 13332 T2523 oashc.SpellCheckComponent.inform Initializing spell checkers
[junit4:junit4]   2> 13338 T2523 oass.DirectSolrSpellChecker.init init: {name=direct,classname=DirectSolrSpellChecker,field=lowerfilt,minQueryLength=3}
[junit4:junit4]   2> 13383 T2524 oasc.SolrCore.registerSearcher [collection1] Registered new searcher Searcher@36916760 main{StandardDirectoryReader(segments_1:1)}
[junit4:junit4]   2> 13391 T2523 oasc.ZkController.publish publishing core=collection1 state=down
[junit4:junit4]   2> 13392 T2523 oasc.ZkController.publish numShards not found on descriptor - reading it from system property
[junit4:junit4]   2> 13474 T2474 oascc.ZkStateReader.updateClusterState Updating cloud state from ZooKeeper... 
[junit4:junit4]   2> 13476 T2474 oasc.Overseer$ClusterStateUpdater.updateState Update state numShards=2 message={
[junit4:junit4]   2> 	  "operation":"state",
[junit4:junit4]   2> 	  "numShards":"2",
[junit4:junit4]   2> 	  "shard":"shard2",
[junit4:junit4]   2> 	  "roles":null,
[junit4:junit4]   2> 	  "state":"active",
[junit4:junit4]   2> 	  "core":"collection1",
[junit4:junit4]   2> 	  "collection":"collection1",
[junit4:junit4]   2> 	  "node_name":"127.0.0.1:49926_",
[junit4:junit4]   2> 	  "base_url":"http://127.0.0.1:49926"}
[junit4:junit4]   2> 13483 T2474 oasc.Overseer$ClusterStateUpdater.updateState Update state numShards=2 message={
[junit4:junit4]   2> 	  "operation":"state",
[junit4:junit4]   2> 	  "numShards":"2",
[junit4:junit4]   2> 	  "shard":null,
[junit4:junit4]   2> 	  "roles":null,
[junit4:junit4]   2> 	  "state":"down",
[junit4:junit4]   2> 	  "core":"collection1",
[junit4:junit4]   2> 	  "collection":"collection1",
[junit4:junit4]   2> 	  "node_name":"127.0.0.1:49929_",
[junit4:junit4]   2> 	  "base_url":"http://127.0.0.1:49929"}
[junit4:junit4]   2> 13483 T2474 oasc.Overseer$ClusterStateUpdater.updateState Collection already exists with numShards=2
[junit4:junit4]   2> 13483 T2474 oasc.Overseer$ClusterStateUpdater.updateState Assigning new node to shard shard=shard1
[junit4:junit4]   2> 13489 T2492 oascc.ZkStateReader$2.process A cluster state change: WatchedEvent state:SyncConnected type:NodeDataChanged path:/clusterstate.json, has occurred - updating... (live nodes size: 4)
[junit4:junit4]   2> 13489 T2473 oascc.ZkStateReader$2.process A cluster state change: WatchedEvent state:SyncConnected type:NodeDataChanged path:/clusterstate.json, has occurred - updating... (live nodes size: 4)
[junit4:junit4]   2> 13490 T2522 oascc.ZkStateReader$2.process A cluster state change: WatchedEvent state:SyncConnected type:NodeDataChanged path:/clusterstate.json, has occurred - updating... (live nodes size: 4)
[junit4:junit4]   2> 13490 T2507 oascc.ZkStateReader$2.process A cluster state change: WatchedEvent state:SyncConnected type:NodeDataChanged path:/clusterstate.json, has occurred - updating... (live nodes size: 4)
[junit4:junit4]   2> 13490 T2479 oascc.ZkStateReader$2.process A cluster state change: WatchedEvent state:SyncConnected type:NodeDataChanged path:/clusterstate.json, has occurred - updating... (live nodes size: 4)
[junit4:junit4]   2> 14400 T2523 oasc.CoreContainer.registerCore registering core: collection1
[junit4:junit4]   2> 14401 T2523 oasc.ZkController.register Register replica - core:collection1 address:http://127.0.0.1:49929 collection:collection1 shard:shard1
[junit4:junit4]   2> 14406 T2523 oasc.ZkController.register We are http://127.0.0.1:49929/collection1/ and leader is http://127.0.0.1:49923/collection1/
[junit4:junit4]   2> 14406 T2523 oasc.ZkController.register No LogReplay needed for core=collection1 baseURL=http://127.0.0.1:49929
[junit4:junit4]   2> 14406 T2523 oasc.ZkController.checkRecovery Core needs to recover:collection1
[junit4:junit4]   2> 14407 T2523 oasu.DefaultSolrCoreState.doRecovery Running recovery - first canceling any ongoing recovery
[junit4:junit4]   2> ASYNC  NEW_CORE C168 name=collection1 org.apache.solr.core.SolrCore@105afc7 url=http://127.0.0.1:49929/collection1 node=127.0.0.1:49929_ C168_STATE=coll:collection1 core:collection1 props:{shard=null, roles=null, state=down, core=collection1, collection=collection1, node_name=127.0.0.1:49929_, base_url=http://127.0.0.1:49929}
[junit4:junit4]   2> 14407 T2525 C168 P49929 oasc.RecoveryStrategy.run Starting recovery process.  core=collection1 recoveringAfterStartup=true
[junit4:junit4]   2> 14408 T2523 oascc.ZkStateReader.updateClusterState Updating cloud state from ZooKeeper... 
[junit4:junit4]   2> 14409 T2525 C168 P49929 oasc.RecoveryStrategy.doRecovery ###### startupVersions=[]
[junit4:junit4]   2> 14409 T2525 C168 P49929 oasc.ZkController.publish publishing core=collection1 state=recovering
[junit4:junit4]   2> 14409 T2525 C168 P49929 oasc.ZkController.publish numShards not found on descriptor - reading it from system property
[junit4:junit4]   2> 14410 T2451 oass.SolrDispatchFilter.init user.dir=/Users/jenkins/jenkins-slave/workspace/Lucene-Solr-trunk-MacOSX/solr/build/solr-core/test/J0
[junit4:junit4]   2> 14411 T2451 oass.SolrDispatchFilter.init SolrDispatchFilter.init() done
[junit4:junit4]   2> 14411 T2525 C168 P49929 oascsi.HttpClientUtil.createClient Creating new http client, config:maxConnections=128&maxConnectionsPerHost=32&followRedirects=false
[junit4:junit4]   2> 14411 T2451 oascsi.HttpClientUtil.createClient Creating new http client, config:maxConnections=128&maxConnectionsPerHost=32&followRedirects=false
[junit4:junit4]   2> 14641 T2451 oejs.Server.doStart jetty-8.1.8.v20121106
[junit4:junit4]   2> 14645 T2451 oejs.AbstractConnector.doStart Started SelectChannelConnector@127.0.0.1:49933
[junit4:junit4]   2> 14653 T2451 oass.SolrDispatchFilter.init SolrDispatchFilter.init()
[junit4:junit4]   2> 14654 T2451 oasc.SolrResourceLoader.locateSolrHome JNDI not configured for solr (NoInitialContextEx)
[junit4:junit4]   2> 14655 T2451 oasc.SolrResourceLoader.locateSolrHome using system property solr.solr.home: /Users/jenkins/jenkins-slave/workspace/Lucene-Solr-trunk-MacOSX/solr/build/solr-core/test/J0/./org.apache.solr.cloud.BasicDistributedZkTest-jetty4-1359760995474
[junit4:junit4]   2> 14655 T2451 oasc.CoreContainer$Initializer.initialize looking for solr.xml: /Users/jenkins/jenkins-slave/workspace/Lucene-Solr-trunk-MacOSX/solr/build/solr-core/test/J0/./org.apache.solr.cloud.BasicDistributedZkTest-jetty4-1359760995474/solr.xml
[junit4:junit4]   2> 14656 T2451 oasc.CoreContainer.<init> New CoreContainer 1640829613
[junit4:junit4]   2> 14656 T2451 oasc.CoreContainer.load Loading CoreContainer using Solr Home: '/Users/jenkins/jenkins-slave/workspace/Lucene-Solr-trunk-MacOSX/solr/build/solr-core/test/J0/./org.apache.solr.cloud.BasicDistributedZkTest-jetty4-1359760995474/'
[junit4:junit4]   2> 14657 T2451 oasc.SolrResourceLoader.<init> new SolrResourceLoader for directory: '/Users/jenkins/jenkins-slave/workspace/Lucene-Solr-trunk-MacOSX/solr/build/solr-core/test/J0/./org.apache.solr.cloud.BasicDistributedZkTest-jetty4-1359760995474/'
[junit4:junit4]   2> 14691 T2451 oashc.HttpShardHandlerFactory.getParameter Setting socketTimeout to: 60000
[junit4:junit4]   2> 14692 T2451 oashc.HttpShardHandlerFactory.getParameter Setting urlScheme to: http://
[junit4:junit4]   2> 14692 T2451 oashc.HttpShardHandlerFactory.getParameter Setting connTimeout to: 15000
[junit4:junit4]   2> 14693 T2451 oashc.HttpShardHandlerFactory.getParameter Setting maxConnectionsPerHost to: 20
[junit4:junit4]   2> 14693 T2451 oashc.HttpShardHandlerFactory.getParameter Setting corePoolSize to: 0
[junit4:junit4]   2> 14693 T2451 oashc.HttpShardHandlerFactory.getParameter Setting maximumPoolSize to: 2147483647
[junit4:junit4]   2> 14694 T2451 oashc.HttpShardHandlerFactory.getParameter Setting maxThreadIdleTime to: 5
[junit4:junit4]   2> 14694 T2451 oashc.HttpShardHandlerFactory.getParameter Setting sizeOfQueue to: -1
[junit4:junit4]   2> 14695 T2451 oashc.HttpShardHandlerFactory.getParameter Setting fairnessPolicy to: false
[junit4:junit4]   2> 14695 T2451 oascsi.HttpClientUtil.createClient Creating new http client, config:maxConnectionsPerHost=20&maxConnections=10000&socketTimeout=60000&connTimeout=15000&retry=false
[junit4:junit4]   2> 14704 T2451 oasc.CoreContainer.load Registering Log Listener
[junit4:junit4]   2> 14719 T2451 oasc.CoreContainer.initZooKeeper Zookeeper client=127.0.0.1:49916/solr
[junit4:junit4]   2> 14720 T2451 oasc.ZkController.checkChrootPath zkHost includes chroot
[junit4:junit4]   2> 14720 T2451 oaz.ZooKeeper.<init> Initiating client connection, connectString=127.0.0.1:49916 sessionTimeout=60000 watcher=org.apache.solr.common.cloud.ConnectionManager@7368e7f0
[junit4:junit4]   2> 14722 T2535 oaz.ClientCnxn$SendThread.logStartConnect Opening socket connection to server localhost/127.0.0.1:49916. Will not attempt to authenticate using SASL (access denied ("javax.security.auth.AuthPermission" "getLoginConfiguration"))
[junit4:junit4]   2> 14722 T2451 oascc.ConnectionManager.waitForConnected Waiting for client to connect to ZooKeeper
[junit4:junit4]   2> 14732 T2535 oaz.ClientCnxn$SendThread.primeConnection Socket connection established to localhost/127.0.0.1:49916, initiating session
[junit4:junit4]   2> 14732 T2453 oazs.NIOServerCnxnFactory.run Accepted socket connection from /127.0.0.1:49934
[junit4:junit4]   2> 14733 T2453 oazs.ZooKeeperServer.processConnectRequest Client attempting to establish new session at /127.0.0.1:49934
[junit4:junit4]   2> 14734 T2455 oazs.ZooKeeperServer.finishSessionInit Established session 0x13c9811fc54000b with negotiated timeout 20000 for client /127.0.0.1:49934
[junit4:junit4]   2> 14734 T2535 oaz.ClientCnxn$SendThread.onConnected Session establishment complete on server localhost/127.0.0.1:49916, sessionid = 0x13c9811fc54000b, negotiated timeout = 20000
[junit4:junit4]   2> 14735 T2536 oascc.ConnectionManager.process Watcher org.apache.solr.common.cloud.ConnectionManager@7368e7f0 name:ZooKeeperConnection Watcher:127.0.0.1:49916 got event WatchedEvent state:SyncConnected type:None path:null path:null type:None
[junit4:junit4]   2> 14736 T2451 oascc.ConnectionManager.waitForConnected Client is connected to ZooKeeper
[junit4:junit4]   2> 14738 T2456 oazs.PrepRequestProcessor.pRequest2Txn Processed session termination for sessionid: 0x13c9811fc54000b
[junit4:junit4]   2> 14739 T2453 oazs.NIOServerCnxn.closeSock Closed socket connection for client /127.0.0.1:49934 which had sessionid 0x13c9811fc54000b
[junit4:junit4]   2> 14740 T2536 oaz.ClientCnxn$EventThread.run EventThread shut down
[junit4:junit4]   2> 14740 T2451 oaz.ZooKeeper.close Session: 0x13c9811fc54000b closed
[junit4:junit4]   2> 14741 T2451 oascsi.HttpClientUtil.createClient Creating new http client, config:maxConnections=500&maxConnectionsPerHost=16&socketTimeout=60000&connTimeout=15000
[junit4:junit4]   2> 14746 T2451 oaz.ZooKeeper.<init> Initiating client connection, connectString=127.0.0.1:49916/solr sessionTimeout=30000 watcher=org.apache.solr.common.cloud.ConnectionManager@5c635e4e
[junit4:junit4]   2> 14748 T2537 oaz.ClientCnxn$SendThread.logStartConnect Opening socket connection to server localhost/127.0.0.1:49916. Will not attempt to authenticate using SASL (access denied ("javax.security.auth.AuthPermission" "getLoginConfiguration"))
[junit4:junit4]   2> 14748 T2537 oaz.ClientCnxn$SendThread.primeConnection Socket connection established to localhost/127.0.0.1:49916, initiating session
[junit4:junit4]   2> 14749 T2453 oazs.NIOServerCnxnFactory.run Accepted socket connection from /127.0.0.1:49935
[junit4:junit4]   2> 14750 T2453 oazs.ZooKeeperServer.processConnectRequest Client attempting to establish new session at /127.0.0.1:49935
[junit4:junit4]   2> 14751 T2455 oazs.ZooKeeperServer.finishSessionInit Established session 0x13c9811fc54000c with negotiated timeout 20000 for client /127.0.0.1:49935
[junit4:junit4]   2> 14751 T2537 oaz.ClientCnxn$SendThread.onConnected Session establishment complete on server localhost/127.0.0.1:49916, sessionid = 0x13c9811fc54000c, negotiated timeout = 20000
[junit4:junit4]   2> 14750 T2451 oascc.ConnectionManager.waitForConnected Waiting for client to connect to ZooKeeper
[junit4:junit4]   2> 14752 T2538 oascc.ConnectionManager.process Watcher org.apache.solr.common.cloud.ConnectionManager@5c635e4e name:ZooKeeperConnection Watcher:127.0.0.1:49916/solr got event WatchedEvent state:SyncConnected type:None path:null path:null type:None
[junit4:junit4]   2> 14753 T2451 oascc.ConnectionManager.waitForConnected Client is connected to ZooKeeper
[junit4:junit4]   2> 14754 T2456 oazs.PrepRequestProcessor.pRequest Got user-level KeeperException when processing sessionid:0x13c9811fc54000c type:create cxid:0x1 zxid:0xa0 txntype:-1 reqpath:n/a Error Path:/solr/overseer Error:KeeperErrorCode = NodeExists for /solr/overseer
[junit4:junit4]   2> 14755 T2456 oazs.PrepRequestProcessor.pRequest Got user-level KeeperException when processing sessionid:0x13c9811fc54000c type:create cxid:0x2 zxid:0xa1 txntype:-1 reqpath:n/a Error Path:/solr/overseer Error:KeeperErrorCode = NodeExists for /solr/overseer
[junit4:junit4]   2> 14756 T2451 oasc.ZkController.createEphemeralLiveNode Register node as live in ZooKeeper:/live_nodes/127.0.0.1:49933_
[junit4:junit4]   2> 14757 T2456 oazs.PrepRequestProcessor.pRequest Got user-level KeeperException when processing sessionid:0x13c9811fc54000c type:delete cxid:0x4 zxid:0xa2 txntype:-1 reqpath:n/a Error Path:/solr/live_nodes/127.0.0.1:49933_ Error:KeeperErrorCode = NoNode for /solr/live_nodes/127.0.0.1:49933_
[junit4:junit4]   2> 14758 T2451 oascc.SolrZkClient.makePath makePath: /live_nodes/127.0.0.1:49933_
[junit4:junit4]   2> 14761 T2492 oascc.ZkStateReader$2.process A cluster state change: WatchedEvent state:SyncConnected type:NodeChildrenChanged path:/live_nodes, has occurred - updating... (live nodes size: 4)
[junit4:junit4]   2> 14761 T2473 oascc.ZkStateReader$2.process A cluster state change: WatchedEvent state:SyncConnected type:NodeChildrenChanged path:/live_nodes, has occurred - updating... (live nodes size: 4)
[junit4:junit4]   2> 14763 T2522 oascc.ZkStateReader$3.process Updating live nodes... (5)
[junit4:junit4]   2> 14764 T2522 oascc.ZkStateReader$2.process A cluster state change: WatchedEvent state:SyncConnected type:NodeChildrenChanged path:/live_nodes, has occurred - updating... (live nodes size: 5)
[junit4:junit4]   2> 14764 T2507 oascc.ZkStateReader$3.process Updating live nodes... (5)
[junit4:junit4]   2> 14764 T2479 oascc.ZkStateReader$3.process Updating live nodes... (5)
[junit4:junit4]   2> 14764 T2507 oascc.ZkStateReader$2.process A cluster state change: WatchedEvent state:SyncConnected type:NodeChildrenChanged path:/live_nodes, has occurred - updating... (live nodes size: 5)
[junit4:junit4]   2> 14765 T2479 oascc.ZkStateReader$2.process A cluster state change: WatchedEvent state:SyncConnected type:NodeChildrenChanged path:/live_nodes, has occurred - updating... (live nodes size: 5)
[junit4:junit4]   2> 14768 T2473 oascc.ZkStateReader$3.process Updating live nodes... (5)
[junit4:junit4]   2> 14768 T2492 oascc.ZkStateReader$3.process Updating live nodes... (5)
[junit4:junit4]   2> 14774 T2451 oascc.ZkStateReader.createClusterStateWatchersAndUpdate Updating cluster state from ZooKeeper... 
[junit4:junit4]   2> 14782 T2539 oasc.CoreContainer.create Creating SolrCore 'collection1' using instanceDir: /Users/jenkins/jenkins-slave/workspace/Lucene-Solr-trunk-MacOSX/solr/build/solr-core/test/J0/./org.apache.solr.cloud.BasicDistributedZkTest-jetty4-1359760995474/collection1
[junit4:junit4]   2> 14783 T2539 oasc.ZkController.createCollectionZkNode Check for collection zkNode:collection1
[junit4:junit4]   2> 14784 T2539 oasc.ZkController.createCollectionZkNode Collection zkNode exists
[junit4:junit4]   2> 14784 T2539 oasc.ZkController.readConfigName Load collection config from:/collections/collection1
[junit4:junit4]   2> 14786 T2539 oasc.SolrResourceLoader.<init> new SolrResourceLoader for directory: '/Users/jenkins/jenkins-slave/workspace/Lucene-Solr-trunk-MacOSX/solr/build/solr-core/test/J0/./org.apache.solr.cloud.BasicDistributedZkTest-jetty4-1359760995474/collection1/'
[junit4:junit4]   2> 14787 T2539 oasc.SolrResourceLoader.replaceClassLoader Adding 'file:/Users/jenkins/jenkins-slave/workspace/Lucene-Solr-trunk-MacOSX/solr/build/solr-core/test/J0/org.apache.solr.cloud.BasicDistributedZkTest-jetty4-1359760995474/collection1/lib/classes/' to classloader
[junit4:junit4]   2> 14787 T2539 oasc.SolrResourceLoader.replaceClassLoader Adding 'file:/Users/jenkins/jenkins-slave/workspace/Lucene-Solr-trunk-MacOSX/solr/build/solr-core/test/J0/org.apache.solr.cloud.BasicDistributedZkTest-jetty4-1359760995474/collection1/lib/README' to classloader
[junit4:junit4]   2> 14838 T2539 oasc.SolrConfig.<init> Using Lucene MatchVersion: LUCENE_50
[junit4:junit4]   2> 14955 T2539 oasc.SolrConfig.<init> Loaded SolrConfig: solrconfig.xml
[junit4:junit4]   2> 14957 T2539 oass.IndexSchema.readSchema Reading Solr Schema
[junit4:junit4]   2> 14968 T2539 oass.IndexSchema.readSchema Schema name=test
[junit4:junit4]   2> 15012 T2474 oascc.ZkStateReader.updateClusterState Updating cloud state from ZooKeeper... 
[junit4:junit4]   2> 15014 T2474 oasc.Overseer$ClusterStateUpdater.updateState Update state numShards=2 message={
[junit4:junit4]   2> 	  "operation":"state",
[junit4:junit4]   2> 	  "numShards":"2",
[junit4:junit4]   2> 	  "shard":"shard1",
[junit4:junit4]   2> 	  "roles":null,
[junit4:junit4]   2> 	  "state":"recovering",
[junit4:junit4]   2> 	  "core":"collection1",
[junit4:junit4]   2> 	  "collection":"collection1",
[junit4:junit4]   2> 	  "node_name":"127.0.0.1:49929_",
[junit4:junit4]   2> 	  "base_url":"http://127.0.0.1:49929"}
[junit4:junit4]   2> 15032 T2492 oascc.ZkStateReader$2.process A cluster state change: WatchedEvent state:SyncConnected type:NodeDataChanged path:/clusterstate.json, has occurred - updating... (live nodes size: 5)
[junit4:junit4]   2> 15032 T2473 oascc.ZkStateReader$2.process A cluster state change: WatchedEvent state:SyncConnected type:NodeDataChanged path:/clusterstate.json, has occurred - updating... (live nodes size: 5)
[junit4:junit4]   2> 15032 T2538 oascc.ZkStateReader$2.process A cluster state change: WatchedEvent state:SyncConnected type:NodeDataChanged path:/clusterstate.json, has occurred - updating... (live nodes size: 5)
[junit4:junit4]   2> 15033 T2522 oascc.ZkStateReader$2.process A cluster state change: WatchedEvent state:SyncConnected type:NodeDataChanged path:/clusterstate.json, has occurred - updating... (live nodes size: 5)
[junit4:junit4]   2> 15033 T2507 oascc.ZkStateReader$2.process A cluster state change: WatchedEvent state:SyncConnected type:NodeDataChanged path:/clusterstate.json, has occurred - updating... (live nodes size: 5)
[junit4:junit4]   2> 15033 T2479 oascc.ZkStateReader$2.process A cluster state change: WatchedEvent state:SyncConnected type:NodeDataChanged path:/clusterstate.json, has occurred - updating... (live nodes size: 5)
[junit4:junit4]   2> 15733 T2539 oass.OpenExchangeRatesOrgProvider.init Initialized with rates=open-exchange-rates.json, refreshInterval=1440.
[junit4:junit4]   2> 15742 T2539 oass.IndexSchema.readSchema default search field in schema is text
[junit4:junit4]   2> 15746 T2539 oass.IndexSchema.readSchema unique key field: id
[junit4:junit4]   2> 15765 T2539 oass.FileExchangeRateProvider.reload Reloading exchange rates from file currency.xml
[junit4:junit4]   2> 15770 T2539 oass.FileExchangeRateProvider.reload Reloading exchange rates from file currency.xml
[junit4:junit4]   2> 15775 T2539 oass.OpenExchangeRatesOrgProvider.reload Reloading exchange rates from open-exchange-rates.json
[junit4:junit4]   2> 15776 T2539 oass.OpenExchangeRatesOrgProvider.reload Reloading exchange rates from open-exchange-rates.json
[junit4:junit4]   2> 15783 T2539 oasc.SolrCore.<init> [collection1] Opening new SolrCore at /Users/jenkins/jenkins-slave/workspace/Lucene-Solr-trunk-MacOSX/solr/build/solr-core/test/J0/./org.apache.solr.cloud.BasicDistributedZkTest-jetty4-1359760995474/collection1/, dataDir=./org.apache.solr.cloud.BasicDistributedZkTest-1359760981066/jetty4/
[junit4:junit4]   2> 15783 T2539 oasc.JmxMonitoredMap.<init> JMX monitoring is enabled. Adding Solr mbeans to JMX Server: com.sun.jmx.mbeanserver.JmxMBeanServer@455bac23
[junit4:junit4]   2> 15784 T2539 oasc.SolrCore.initDirectoryFactory solr.NRTCachingDirectoryFactory
[junit4:junit4]   2> 15786 T2539 oasc.CachingDirectoryFactory.get return new directory for /Users/jenkins/jenkins-slave/workspace/Lucene-Solr-trunk-MacOSX/solr/build/solr-core/test/J0/./org.apache.solr.cloud.BasicDistributedZkTest-1359760981066/jetty4 forceNew:false
[junit4:junit4]   2> 15786 T2539 oasc.CachingDirectoryFactory.close Releasing directory:/Users/jenkins/jenkins-slave/workspace/Lucene-Solr-trunk-MacOSX/solr/build/solr-core/test/J0/./org.apache.solr.cloud.BasicDistributedZkTest-1359760981066/jetty4
[junit4:junit4]   2> 15787 T2539 oasc.SolrCore.getNewIndexDir New index directory detected: old=null new=./org.apache.solr.cloud.BasicDistributedZkTest-1359760981066/jetty4/index/
[junit4:junit4]   2> 15787 T2539 oasc.SolrCore.initIndex WARNING [collection1] Solr index directory './org.apache.solr.cloud.BasicDistributedZkTest-1359760981066/jetty4/index' doesn't exist. Creating new index...
[junit4:junit4]   2> 15788 T2539 oasc.CachingDirectoryFactory.get return new directory for /Users/jenkins/jenkins-slave/workspace/Lucene-Solr-trunk-MacOSX/solr/build/solr-core/test/J0/./org.apache.solr.cloud.BasicDistributedZkTest-1359760981066/jetty4/index forceNew:false
[junit4:junit4]   2> 15794 T2539 oasc.SolrDeletionPolicy.onCommit SolrDeletionPolicy.onCommit: commits:num=1
[junit4:junit4]   2> 		commit{dir=RateLimitedDirectoryWrapper(NRTCachingDirectory(org.apache.lucene.store.NIOFSDirectory@/Users/jenkins/jenkins-slave/workspace/Lucene-Solr-trunk-MacOSX/solr/build/solr-core/test/J0/org.apache.solr.cloud.BasicDistributedZkTest-1359760981066/jetty4/index lockFactory=org.apache.lucene.store.NativeFSLockFactory@7de8427f; maxCacheMB=48.0 maxMergeSizeMB=4.0)),segFN=segments_1,generation=1,filenames=[segments_1]
[junit4:junit4]   2> 15794 T2539 oasc.SolrDeletionPolicy.updateCommits newest commit = 1[segments_1]
[junit4:junit4]   2> 15795 T2539 oasc.CachingDirectoryFactory.close Releasing directory:/Users/jenkins/jenkins-slave/workspace/Lucene-Solr-trunk-MacOSX/solr/build/solr-core/test/J0/./org.apache.solr.cloud.BasicDistributedZkTest-1359760981066/jetty4/index
[junit4:junit4]   2> 15795 T2539 oasc.SolrCore.initWriters created xml: solr.XMLResponseWriter
[junit4:junit4]   2> 15797 T2539 oasup.UpdateRequestProcessorChain.init inserting DistributedUpdateProcessorFactory into updateRequestProcessorChain "dedupe"
[junit4:junit4]   2> 15798 T2539 oasup.UpdateRequestProcessorChain.init inserting DistributedUpdateProcessorFactory into updateRequestProcessorChain "dedupe-allfields"
[junit4:junit4]   2> 15798 T2539 oasup.UpdateRequestProcessorChain.init inserting DistributedUpdateProcessorFactory into updateRequestProcessorChain "stored_sig"
[junit4:junit4]   2> 15798 T2539 oasup.UpdateRequestProcessorChain.init inserting DistributedUpdateProcessorFactory into updateRequestProcessorChain "uniq-fields"
[junit4:junit4]   2> 15799 T2539 oasup.UpdateRequestProcessorChain.init inserting DistributedUpdateProcessorFactory into updateRequestProcessorChain "distrib-dup-test-chain-implicit"
[junit4:junit4]   2> 15799 T2539 oasc.RequestHandlers.initHandlersFromConfig adding lazy requestHandler: solr.ReplicationHandler
[junit4:junit4]   2> 15800 T2539 oasc.RequestHandlers.initHandlersFromConfig created /replication: solr.ReplicationHandler
[junit4:junit4]   2> 15800 T2539 oasc.RequestHandlers.initHandlersFromConfig created standard: solr.StandardRequestHandler
[junit4:junit4]   2> 15801 T2539 oasc.RequestHandlers.initHandlersFromConfig created /get: solr.RealTimeGetHandler
[junit4:junit4]   2> 15801 T2539 oasc.RequestHandlers.initHandlersFromConfig created dismax: solr.SearchHandler
[junit4:junit4]   2> 15802 T2539 oasc.RequestHandlers.initHandlersFromConfig created mock: org.apache.solr.core.MockQuerySenderListenerReqHandler
[junit4:junit4]   2> 15802 T2539 oasc.RequestHandlers.initHandlersFromConfig created /admin/: org.apache.solr.handler.admin.AdminHandlers
[junit4:junit4]   2> 15803 T2539 oasc.RequestHandlers.initHandlersFromConfig created defaults: solr.StandardRequestHandler
[junit4:junit4]   2> 15803 T2539 oasc.RequestHandlers.initHandlersFromConfig adding lazy requestHandler: solr.StandardRequestHandler
[junit4:junit4]   2> 15804 T2539 oasc.RequestHandlers.initHandlersFromConfig created lazy: solr.StandardRequestHandler
[junit4:junit4]   2> 15804 T2539 oasc.RequestHandlers.initHandlersFromConfig created /update: solr.UpdateRequestHandler
[junit4:junit4]   2> 15805 T2539 oasc.RequestHandlers.initHandlersFromConfig created /terms: org.apache.solr.handler.component.SearchHandler
[junit4:junit4]   2> 15805 T2539 oasc.RequestHandlers.initHandlersFromConfig created spellCheckCompRH: org.apache.solr.handler.component.SearchHandler
[junit4:junit4]   2> 15806 T2539 oasc.RequestHandlers.initHandlersFromConfig created spellCheckCompRH_Direct: org.apache.solr.handler.component.SearchHandler
[junit4:junit4]   2> 15807 T2539 oasc.RequestHandlers.initHandlersFromConfig created spellCheckWithWordbreak: org.apache.solr.handler.component.SearchHandler
[junit4:junit4]   2> 15807 T2539 oasc.RequestHandlers.initHandlersFromConfig created spellCheckWithWordbreak_Direct: org.apache.solr.handler.component.SearchHandler
[junit4:junit4]   2> 15808 T2539 oasc.RequestHandlers.initHandlersFromConfig created spellCheckCompRH1: org.apache.solr.handler.component.SearchHandler
[junit4:junit4]   2> 15808 T2539 oasc.RequestHandlers.initHandlersFromConfig created mltrh: org.apache.solr.handler.component.SearchHandler
[junit4:junit4]   2> 15809 T2539 oasc.RequestHandlers.initHandlersFromConfig created tvrh: org.apache.solr.handler.component.SearchHandler
[junit4:junit4]   2> 15810 T2539 oasc.RequestHandlers.initHandlersFromConfig created /mlt: solr.MoreLikeThisHandler
[junit4:junit4]   2> 15810 T2539 oasc.RequestHandlers.initHandlersFromConfig created /debug/dump: solr.DumpRequestHandler
[junit4:junit4]   2> 15816 T2539 oashl.XMLLoader.init xsltCacheLifetimeSeconds=60
[junit4:junit4]   2> 15820 T2539 oasc.SolrCore.initDeprecatedSupport WARNING solrconfig.xml uses deprecated <admin/gettableFiles>, Please update your config to use the ShowFileRequestHandler.
[junit4:junit4]   2> 15822 T2539 oasc.SolrCore.initDeprecatedSupport WARNING adding ShowFileRequestHandler with hidden files: [SCHEMA.XML, OLD_SYNONYMS.TXT, STOPWORDS.TXT, PROTWORDS.TXT, OPEN-EXCHANGE-RATES.JSON, SYNONYMS.TXT, CURRENCY.XML, MAPPING-ISOLATIN1ACCENT.TXT]
[junit4:junit4]   2> 15825 T2539 oasc.CachingDirectoryFactory.close Releasing directory:/Users/jenkins/jenkins-slave/workspace/Lucene-Solr-trunk-MacOSX/solr/build/solr-core/test/J0/./org.apache.solr.cloud.BasicDistributedZkTest-1359760981066/jetty4
[junit4:junit4]   2> 15826 T2539 oass.SolrIndexSearcher.<init> Opening Searcher@55e5068f main
[junit4:junit4]   2> 15827 T2539 oasu.CommitTracker.<init> Hard AutoCommit: disabled
[junit4:junit4]   2> 15827 T2539 oasu.CommitTracker.<init> Soft AutoCommit: disabled
[junit4:junit4]   2> 15828 T2539 oashc.SpellCheckComponent.inform Initializing spell checkers
[junit4:junit4]   2> 15835 T2539 oass.DirectSolrSpellChecker.init init: {name=direct,classname=DirectSolrSpellChecker,field=lowerfilt,minQueryLength=3}
[junit4:junit4]   2> 15879 T2540 oasc.SolrCore.registerSearcher [collection1] Registered new searcher Searcher@55e5068f main{StandardDirectoryReader(segments_1:1)}
[junit4:junit4]   2> 15885 T1377 oasc.OverseerCollectionProcessor.run WARNING Overseer cannot talk to ZK
[junit4:junit4]   2> 15888 T2539 oasc.ZkController.publish publishing core=collection1 state=down
[junit4:junit4]   2> 15889 T2539 oasc.ZkController.publish numShards not found on descriptor - reading it from system property
[junit4:junit4]   2> 16549 T2474 oascc.ZkStateReader.updateClusterState Updating cloud state from ZooKeeper... 
[junit4:junit4]   2> 16550 T2474 oasc.Overseer$ClusterStateUpdater.updateState Update state numShards=2 message={
[junit4:junit4]   2> 	  "operation":"state",
[junit4:junit4]   2> 	  "numShards":"2",
[junit4:junit4]   2> 	  "shard":null,
[junit4:junit4]   2> 	  "roles":null,
[junit4:junit4]   2> 	  "state":"down",
[junit4:junit4]   2> 	  "core":"collection1",
[junit4:junit4]   2> 	  "collection":"collection1",
[junit4:junit4]   2> 	  "node_name":"127.0.0.1:49933_",
[junit4:junit4]   2> 	  "base_url":"http://127.0.0.1:49933"}
[junit4:junit4]   2> 16551 T2474 oasc.Overseer$ClusterStateUpdater.updateState Collection already exists with numShards=2
[junit4:junit4]   2> 16551 T2474 oasc.Overseer$ClusterStateUpdater.updateState Assigning new node to shard shard=shard2
[junit4:junit4]   2> 16558 T2492 oascc.ZkStateReader$2.process A cluster state change: WatchedEvent state:SyncConnected type:NodeDataChanged path:/clusterstate.json, has occurred - updating... (live nodes size: 5)
[junit4:junit4]   2> 16558 T2473 oascc.ZkStateReader$2.process A cluster state change: WatchedEvent state:SyncConnected type:NodeDataChanged path:/clusterstate.json, has occurred - updating... (live nodes size: 5)
[junit4:junit4]   2> 16559 T2522 oascc.ZkStateReader$2.process A cluster state change: WatchedEvent state:SyncConnected type:NodeDataChanged path:/clusterstate.json, has occurred - updating... (live nodes size: 5)
[junit4:junit4]   2> 16559 T2507 oascc.ZkStateReader$2.process A cluster state change: WatchedEvent state:SyncConnected type:NodeDataChanged path:/clusterstate.json, has occurred - updating... (live nodes size: 5)
[junit4:junit4]   2> 16559 T2479 oascc.ZkStateReader$2.process A cluster state change: WatchedEvent state:SyncConnected type:NodeDataChanged path:/clusterstate.json, has occurred - updating... (live nodes size: 5)
[junit4:junit4]   2> 16560 T2538 oascc.ZkStateReader$2.process A cluster state change: WatchedEvent state:SyncConnected type:NodeDataChanged path:/clusterstate.json, has occurred - updating... (live nodes size: 5)
[junit4:junit4]   2> 16892 T2539 oasc.CoreContainer.registerCore registering core: collection1
[junit4:junit4]   2> 16892 T2539 oasc.ZkController.register Register replica - core:collection1 address:http://127.0.0.1:49933 collection:collection1 shard:shard2
[junit4:junit4]   2> 16896 T2539 oasc.ZkController.register We are http://127.0.0.1:49933/collection1/ and leader is http://127.0.0.1:49926/collection1/
[junit4:junit4]   2> 16897 T2539 oasc.ZkController.register No LogReplay needed for core=collection1 baseURL=http://127.0.0.1:49933
[junit4:junit4]   2> 16897 T2539 oasc.ZkController.checkRecovery Core needs to recover:collection1
[junit4:junit4]   2> 16897 T2539 oasu.DefaultSolrCoreState.doRecovery Running recovery - first canceling any ongoing recovery
[junit4:junit4]   2> ASYNC  NEW_CORE C169 name=collection1 org.apache.solr.core.SolrCore@64f07099 url=http://127.0.0.1:49933/collection1 node=127.0.0.1:49933_ C169_STATE=coll:collection1 core:collection1 props:{shard=null, roles=null, state=down, core=collection1, collection=collection1, node_name=127.0.0.1:49933_, base_url=http://127.0.0.1:49933}
[junit4:junit4]   2> 16898 T2541 C169 P49933 oasc.RecoveryStrategy.run Starting recovery process.  core=collection1 recoveringAfterStartup=true
[junit4:junit4]   2> 16899 T2539 oascc.ZkStateReader.updateClusterState Updating cloud state from ZooKeeper... 
[junit4:junit4]   2> 16900 T2451 oass.SolrDispatchFilter.init user.dir=/Users/jenkins/jenkins-slave/workspace/Lucene-Solr-trunk-MacOSX/solr/build/solr-core/test/J0
[junit4:junit4]   2> 16902 T2451 oass.SolrDispatchFilter.init SolrDispatchFilter.init() done
[junit4:junit4]   2> 16903 T2451 oascsi.HttpClientUtil.createClient Creating new http client, config:maxConnections=128&maxConnectionsPerHost=32&followRedirects=false
[junit4:junit4]   2> 16903 T2541 C169 P49933 oasc.RecoveryStrategy.doRecovery ###### startupVersions=[]
[junit4:junit4]   2> 16903 T2541 C169 P49933 oasc.ZkController.publish publishing core=collection1 state=recovering
[junit4:junit4]   2> 16904 T2541 C169 P49933 oasc.ZkController.publish numShards not found on descriptor - reading it from system property
[junit4:junit4]   2> 16911 T2451 oascc.ZkStateReader.updateClusterState Updating cloud state from ZooKeeper... 
[junit4:junit4]   2> 16913 T2451 oasc.AbstractDistribZkTestBase.waitForRecoveriesToFinish Wait for recoveries to finish - collection: collection1 failOnTimeout:true timeout (sec):230
[junit4:junit4]   2> 16914 T2451 oascc.ZkStateReader.updateClusterState Updating cloud state from ZooKeeper... 
[junit4:junit4]   2> 16915 T2541 C169 P49933 oascsi.HttpClientUtil.createClient Creating new http client, config:maxConnections=128&maxConnectionsPerHost=32&followRedirects=false
[junit4:junit4]   2>  C168_STATE=coll:collection1 core:collection1 props:{shard=shard1, roles=null, state=recovering, core=collection1, collection=collection1, node_name=127.0.0.1:49929_, base_url=http://127.0.0.1:49929}
[junit4:junit4]   2> 17425 T2525 C168 P49929 oasc.RecoveryStrategy.doRecovery Attempting to PeerSync from http://127.0.0.1:49923/collection1/ core=collection1 - recoveringAfterStartup=true
[junit4:junit4]   2> 17426 T2525 C168 P49929 oasu.PeerSync.sync PeerSync: core=collection1 url=http://127.0.0.1:49929 START replicas=[http://127.0.0.1:49923/collection1/] nUpdates=100
[junit4:junit4]   2> 17426 T2525 C168 P49929 oasu.PeerSync.sync WARNING no frame of reference to tell of we've missed updates
[junit4:junit4]   2> 17427 T2525 C168 P49929 oasc.RecoveryStrategy.doRecovery PeerSync Recovery was not successful - trying replication. core=collection1
[junit4:junit4]   2> 17427 T2525 C168 P49929 oasc.RecoveryStrategy.doRecovery Starting Replication Recovery. core=collection1
[junit4:junit4]   2> 17427 T2525 C168 P49929 oasc.RecoveryStrategy.doRecovery Begin buffering updates. core=collection1
[junit4:junit4]   2> 17427 T2525 C168 P49929 oasu.UpdateLog.bufferUpdates Starting to buffer updates. FSUpdateLog{state=ACTIVE, tlog=null}
[junit4:junit4]   2> 17428 T2525 C168 P49929 oasc.RecoveryStrategy.replicate Attempting to replicate from http://127.0.0.1:49923/collection1/. core=collection1
[junit4:junit4]   2> 17428 T2525 C168 P49929 oascsi.HttpClientUtil.createClient Creating new http client, config:maxConnections=128&maxConnectionsPerHost=32&followRedirects=false
[junit4:junit4]   2> ASYNC  NEW_CORE C170 name=collection1 org.apache.solr.core.SolrCore@4e4efbd9 url=http://127.0.0.1:49923/collection1 node=127.0.0.1:49923_ C170_STATE=coll:collection1 core:collection1 props:{shard=shard1, roles=null, state=active, core=collection1, collection=collection1, node_name=127.0.0.1:49923_, base_url=http://127.0.0.1:49923, leader=true}
[junit4:junit4]   2> 17460 T2487 C170 P49923 oasu.DirectUpdateHandler2.commit start commit{,optimize=false,openSearcher=false,waitSearcher=true,expungeDeletes=false,softCommit=false}
[junit4:junit4]   2> 17464 T2487 C170 P49923 oasc.CachingDirectoryFactory.close Releasing directory:/Users/jenkins/jenkins-slave/workspace/Lucene-Solr-trunk-MacOSX/solr/build/solr-core/test/J0/./org.apache.solr.cloud.BasicDistributedZkTest-1359760981066/jetty1
[junit4:junit4]   2> 17465 T2484 C170 P49923 REQ /get {getVersions=100&distrib=false&wt=javabin&qt=/get&version=2} status=0 QTime=0 
[junit4:junit4]   2> 17469 T2487 C170 P49923 oasc.SolrDeletionPolicy.onInit SolrDeletionPolicy.onInit: commits:num=1
[junit4:junit4]   2> 		commit{dir=RateLimitedDirectoryWrapper(NRTCachingDirectory(org.apache.lucene.store.NIOFSDirectory@/Users/jenkins/jenkins-slave/workspace/Lucene-Solr-trunk-MacOSX/solr/build/solr-core/test/J0/org.apache.solr.cloud.BasicDistributedZkTest-1359760981066/jetty1/index lockFactory=org.apache.lucene.store.NativeFSLockFactory@48e6ea3d; maxCacheMB=48.0 maxMergeSizeMB=4.0)),segFN=segments_1,generation=1,filenames=[segments_1]
[junit4:junit4]   2> 17470 T2487 C170 P49923 oasc.SolrDeletionPolicy.updateCommits newest commit = 1[segments_1]
[junit4:junit4]   2> 17474 T2487 C170 P49923 oasc.SolrDeletionPolicy.onCommit SolrDeletionPolicy.onCommit: commits:num=2
[junit4:junit4]   2> 		commit{dir=RateLimitedDirectoryWrapper(NRTCachingDirectory(org.apache.lucene.store.NIOFSDirectory@/Users/jenkins/jenkins-slave/workspace/Lucene-Solr-trunk-MacOSX/solr/build/solr-core/test/J0/org.apache.solr.cloud.BasicDistributedZkTest-1359760981066/jetty1/index lockFactory=org.apache.lucene.store.NativeFSLockFactory@48e6ea3d; maxCacheMB=48.0 maxMergeSizeMB=4.0)),segFN=segments_1,generation=1,filenames=[segments_1]
[junit4:junit4]   2> 		commit{dir=RateLimitedDirectoryWrapper(NRTCachingDirectory(org.apache.lucene.store.NIOFSDirectory@/Users/jenkins/jenkins-slave/workspace/Lucene-Solr-trunk-MacOSX/solr/build/solr-core/test/J0/org.apache.solr.cloud.BasicDistributedZkTest-1359760981066/jetty1/index lockFactory=org.apache.lucene.store.NativeFSLockFactory@48e6ea3d; maxCacheMB=48.0 maxMergeSizeMB=4.0)),segFN=segments_2,generation=2,filenames=[segments_2]
[junit4:junit4]   2> 17476 T2487 C170 P49923 oasc.SolrDeletionPolicy.updateCommits newest commit = 2[segments_2]
[junit4:junit4]   2> 17478 T2487 C170 P49923 oasc.CachingDirectoryFactory.close Releasing directory:/Users/jenkins/jenkins-slave/workspace/Lucene-Solr-trunk-MacOSX/solr/build/solr-core/test/J0/./org.apache.solr.cloud.BasicDistributedZkTest-1359760981066/jetty1
[junit4:junit4]   2> 17479 T2487 C170 P49923 oass.SolrIndexSearcher.<init> Opening Searcher@7ae5954 realtime
[junit4:junit4]   2> 17479 T2487 C170 P49923 oasu.DirectUpdateHandler2.commit end_commit_flush
[junit4:junit4]   2> 17480 T2487 C170 P49923 /update {waitSearcher=true&openSearcher=false&commit=true&wt=javabin&commit_end_point=true&version=2&softCommit=false} {commit=} 0 20
[junit4:junit4]   2> 17484 T2525 C168 P49929 oash.ReplicationHandler.inform Commits will be reserved for  10000
[junit4:junit4]   2> 17484 T2525 C168 P49929 oash.SnapPuller.<init>  No value set for 'pollInterval'. Timer Task not started.
[junit4:junit4]   2> 17489 T2486 C170 P49923 oash.ReplicationHandler.inform Commits will be reserved for  10000
[junit4:junit4]   2> 17490 T2486 C170 P49923 REQ /replication {command=indexversion&qt=/replication&wt=javabin&version=2} status=0 QTime=2 
[junit4:junit4]   2> 17490 T2525 C168 P49929 oash.SnapPuller.fetchLatestIndex Master's generation: 2
[junit4:junit4]   2> 17491 T2525 C168 P49929 oash.SnapPuller.fetchLatestIndex Slave's generation: 1
[junit4:junit4]   2> 17491 T2525 C168 P49929 oash.SnapPuller.fetchLatestIndex Starting replication process
[junit4:junit4]   2> 17493 T2488 C170 P49923 oasc.CachingDirectoryFactory.close Releasing directory:/Users/jenkins/jenkins-slave/workspace/Lucene-Solr-trunk-MacOSX/solr/build/solr-core/test/J0/./org.apache.solr.cloud.BasicDistributedZkTest-1359760981066/jetty1
[junit4:junit4]   2> 17494 T2488 C170 P49923 oasc.CachingDirectoryFactory.close Releasing directory:/Users/jenkins/jenkins-slave/workspace/Lucene-Solr-trunk-MacOSX/solr/build/solr-core/test/J0/./org.apache.solr.cloud.BasicDistributedZkTest-1359760981066/jetty1/index
[junit4:junit4]   2> 17494 T2488 C170 P49923 REQ /replication {command=filelist&qt=/replication&wt=javabin&generation=2&version=2} status=0 QTime=1 
[junit4:junit4]   2> 17494 T2525 C168 P49929 oash.SnapPuller.fetchLatestIndex Number of files in latest index in master: 1
[junit4:junit4]   2> 17495 T2525 C168 P49929 oasc.CachingDirectoryFactory.get return new directory for /Users/jenkins/jenkins-slave/workspace/Lucene-Solr-trunk-MacOSX/solr/build/solr-core/test/J0/./org.apache.solr.cloud.BasicDistributedZkTest-1359760981066/jetty3/index.20130202092318550 forceNew:false
[junit4:junit4]   2> 17496 T2525 C168 P49929 oasc.CachingDirectoryFactory.close Releasing directory:/Users/jenkins/jenkins-slave/workspace/Lucene-Solr-trunk-MacOSX/solr/build/solr-core/test/J0/./org.apache.solr.cloud.BasicDistributedZkTest-1359760981066/jetty3
[junit4:junit4]   2> 17497 T2525 C168 P49929 oash.SnapPuller.fetchLatestIndex Starting download to RateLimitedDirectoryWrapper(NRTCachingDirectory(org.apache.lucene.store.NIOFSDirectory@/Users/jenkins/jenkins-slave/workspace/Lucene-Solr-trunk-MacOSX/solr/build/solr-core/test/J0/org.apache.solr.cloud.BasicDistributedZkTest-1359760981066/jetty3/index.20130202092318550 lockFactory=org.apache.lucene.store.NativeFSLockFactory@5a80b378; maxCacheMB=48.0 maxMergeSizeMB=4.0)) fullCopy=true
[junit4:junit4]   2> 17500 T2483 C170 P49923 REQ /replication {file=segments_2&command=filecontent&checksum=true&wt=filestream&qt=/replication&generation=2} status=0 QTime=0 
[junit4:junit4]   2> 17502 T2525 C168 P49929 oasc.CachingDirectoryFactory.close Releasing directory:/Users/jenkins/jenkins-slave/workspace/Lucene-Solr-trunk-MacOSX/solr/build/solr-core/test/J0/./org.apache.solr.cloud.BasicDistributedZkTest-1359760981066/jetty3/index
[junit4:junit4]   2> 17502 T2525 C168 P49929 oash.SnapPuller.fetchLatestIndex Total time taken for download : 0 secs
[junit4:junit4]   2> 17502 T2525 C168 P49929 oash.SnapPuller.modifyIndexProps New index installed. Updating index properties... index=index.20130202092318550
[junit4:junit4]   2> 17504 T2525 C168 P49929 oasc.CachingDirectoryFactory.close Releasing directory:/Users/jenkins/jenkins-slave/workspace/Lucene-Solr-trunk-MacOSX/solr/build/solr-core/test/J0/./org.apache.solr.cloud.BasicDistributedZkTest-1359760981066/jetty3
[junit4:junit4]   2> 17504 T2525 C168 P49929 oasc.CachingDirectoryFactory.close Releasing directory:/Users/jenkins/jenkins-slave/workspace/Lucene-Solr-trunk-MacOSX/solr/build/solr-core/test/J0/./org.apache.solr.cloud.BasicDistributedZkTest-1359760981066/jetty3
[junit4:junit4]   2> 17505 T2525 C168 P49929 oasc.SolrCore.getNewIndexDir New index directory detected: old=./org.apache.solr.cloud.BasicDistributedZkTest-1359760981066/jetty3/index/ new=./org.apache.solr.cloud.BasicDistributedZkTest-1359760981066/jetty3/index.20130202092318550
[junit4:junit4]   2> 17508 T2525 C168 P49929 oasc.SolrDeletionPolicy.onInit SolrDeletionPolicy.onInit: commits:num=1
[junit4:junit4]   2> 		commit{dir=RateLimitedDirectoryWrapper(NRTCachingDirectory(org.apache.lucene.store.NIOFSDirectory@/Users/jenkins/jenkins-slave/workspace/Lucene-Solr-trunk-MacOSX/solr/build/solr-core/test/J0/org.apache.solr.cloud.BasicDistributedZkTest-1359760981066/jetty3/index.20130202092318550 lockFactory=org.apache.lucene.store.NativeFSLockFactory@5a80b378; maxCacheMB=48.0 maxMergeSizeMB=4.0)),segFN=segments_2,generation=2,filenames=[segments_2]
[junit4:junit4]   2> 17509 T2525 C168 P49929 oasc.SolrDeletionPolicy.updateCommits newest commit = 2[segments_2]
[junit4:junit4]   2> 17510 T2525 C168 P49929 oasc.CachingDirectoryFactory.close Releasing directory:/Users/jenkins/jenkins-slave/workspace/Lucene-Solr-trunk-MacOSX/solr/build/solr-core/test/J0/./org.apache.solr.cloud.BasicDistributedZkTest-1359760981066/jetty3
[junit4:junit4]   2> 17510 T2525 C168 P49929 oasu.DefaultSolrCoreState.newIndexWriter Creating new IndexWriter...
[junit4:junit4]   2> 17510 T2525 C168 P49929 oasu.DefaultSolrCoreState.newIndexWriter Waiting until IndexWriter is unused... core=collection1
[junit4:junit4]   2> 17510 T2525 C168 P49929 oasu.DefaultSolrCoreState.newIndexWriter Rollback old IndexWriter... core=collection1
[junit4:junit4]   2> 17511 T2525 C168 P49929 oasc.CachingDirectoryFactory.close Releasing directory:/Users/jenkins/jenkins-slave/workspace/Lucene-Solr-trunk-MacOSX/solr/build/solr-core/test/J0/./org.apache.solr.cloud.BasicDistributedZkTest-1359760981066/jetty3/index.20130202092318550
[junit4:junit4]   2> 17511 T2525 C168 P49929 oasc.CachingDirectoryFactory.close Releasing directory:/Users/jenkins/jenkins-slave/workspace/Lucene-Solr-trunk-MacOSX/solr/build/solr-core/test/J0/./org.apache.solr.cloud.BasicDistributedZkTest-1359760981066/jetty3
[junit4:junit4]   2> 17513 T2525 C168 P49929 oasc.SolrDeletionPolicy.onInit SolrDeletionPolicy.onInit: commits:num=1
[junit4:junit4]   2> 		commit{dir=RateLimitedDirectoryWrapper(NRTCachingDirectory(org.apache.lucene.store.NIOFSDirectory@/Users/jenkins/jenkins-slave/workspace/Lucene-Solr-trunk-MacOSX/solr/build/solr-core/test/J0/org.apache.solr.cloud.BasicDistributedZkTest-1359760981066/jetty3/index.20130202092318550 lockFactory=org.apache.lucene.store.NativeFSLockFactory@5a80b378; maxCacheMB=48.0 maxMergeSizeMB=4.0)),segFN=segments_2,generation=2,filenames=[segments_2]
[junit4:junit4]   2> 17513 T2525 C168 P49929 oasc.SolrDeletionPolicy.updateCommits newest commit = 2[segments_2]
[junit4:junit4]   2> 17514 T2525 C168 P49929 oasu.DefaultSolrCoreState.newIndexWriter New IndexWriter is ready to be used.
[junit4:junit4]   2> 17514 T2525 C168 P49929 oasc.CachingDirectoryFactory.close Releasing directory:/Users/jenkins/jenkins-slave/workspace/Lucene-Solr-trunk-MacOSX/solr/build/solr-core/test/J0/./org.apache.solr.cloud.BasicDistributedZkTest-1359760981066/jetty3
[junit4:junit4]   2> 17514 T2525 C168 P49929 oass.SolrIndexSearcher.<init> Opening Searcher@5fd5714c main
[junit4:junit4]   2> 17516 T2524 oasc.SolrCore.registerSearcher [collection1] Registered new searcher Searcher@5fd5714c main{StandardDirectoryReader(segments_2:1:nrt)}
[junit4:junit4]   2> 17516 T2524 oasc.CachingDirectoryFactory.close Releasing directory:/Users/jenkins/jenkins-slave/workspace/Lucene-Solr-trunk-MacOSX/solr/build/solr-core/test/J0/./org.apache.solr.cloud.BasicDistributedZkTest-1359760981066/jetty3/index
[junit4:junit4]   2> 17516 T2525 C168 P49929 oasu.DirectUpdateHandler2.commit start commit{,optimize=false,openSearcher=false,waitSearcher=false,expungeDeletes=false,softCommit=false}
[junit4:junit4]   2> 17518 T2525 C168 P49929 oasc.SolrDeletionPolicy.onCommit SolrDeletionPolicy.onCommit: commits:num=2
[junit4:junit4]   2> 		commit{dir=RateLimitedDirectoryWrapper(NRTCachingDirectory(org.apache.lucene.store.NIOFSDirectory@/Users/jenkins/jenkins-slave/workspace/Lucene-Solr-trunk-MacOSX/solr/build/solr-core/test/J0/org.apache.solr.cloud.BasicDistributedZkTest-1359760981066/jetty3/index.20130202092318550 lockFactory=org.apache.lucene.store.NativeFSLockFactory@5a80b378; maxCacheMB=48.0 maxMergeSizeMB=4.0)),segFN=segments_2,generation=2,filenames=[segments_2]
[junit4:junit4]   2> 		commit{dir=RateLimitedDirectoryWrapper(NRTCachingDirectory(org.apache.lucene.store.NIOFSDirectory@/Users/jenkins/jenkins-slave/workspace/Lucene-Solr-trunk-MacOSX/solr/build/solr-core/test/J0/org.apache.solr.cloud.BasicDistributedZkTest-1359760981066/jetty3/index.20130202092318550 lockFactory=org.apache.lucene.store.NativeFSLockFactory@5a80b378; maxCacheMB=48.0 maxMergeSizeMB=4.0)),segFN=segments_3,generation=3,filenames=[segments_3]
[junit4:junit4]   2> 17518 T2525 C168 P49929 oasc.SolrDeletionPolicy.updateCommits newest commit = 3[segments_3]
[junit4:junit4]   2> 17519 T2525 C168 P49929 oasc.CachingDirectoryFactory.close Releasing directory:/Users/jenkins/jenkins-slave/workspace/Lucene-Solr-trunk-MacOSX/solr/build/solr-core/test/J0/./org.apache.solr.cloud.BasicDistributedZkTest-1359760981066/jetty3
[junit4:junit4]   2> 17520 T2525 C168 P49929 oasu.DirectUpdateHandler2.commit end_commit_flush
[junit4:junit4]   2> 17520 T2525 C168 P49929 oasc.CachingDirectoryFactory.close Releasing directory:/Users/jenkins/jenkins-slave/workspace/Lucene-Solr-trunk-MacOSX/solr/build/solr-core/test/J0/./org.apache.solr.cloud.BasicDistributedZkTest-1359760981066/jetty3/index.20130202092318550
[junit4:junit4]   2> 17520 T2525 C168 P49929 oasc.CachingDirectoryFactory.close Releasing directory:/Users/jenkins/jenkins-slave/workspace/Lucene-Solr-trunk-MacOSX/solr/build/solr-core/test/J0/./org.apache.solr.cloud.BasicDistributedZkTest-1359760981066/jetty3/index
[junit4:junit4]   2> 17520 T2525 C168 P49929 oasc.RecoveryStrategy.replay No replay needed. core=collection1
[junit4:junit4]   2> 17520 T2525 C168 P49929 oasc.RecoveryStrategy.doRecovery Replication Recovery was successful - registering as Active. core=collection1
[junit4:junit4]   2> 17521 T2525 C168 P49929 oasc.ZkController.publish publishing core=collection1 state=active
[junit4:junit4]   2> 17521 T2525 C168 P49929 oasc.ZkController.publish numShards not found on descriptor - reading it from system property
[junit4:junit4]   2> 17555 T2525 C168 P49929 oasc.RecoveryStrategy.doRecovery Finished recovery process. core=collection1
[junit4:junit4]   2> 17917 T2451 oascc.ZkStateReader.updateClusterState Updating cloud state from ZooKeeper... 
[junit4:junit4]   2> 18077 T2474 oascc.ZkStateReader.updateClusterState Updating cloud state from ZooKeeper... 
[junit4:junit4]   2> 18078 T2474 oasc.Overseer$ClusterStateUpdater.updateState Update state numShards=2 message={
[junit4:junit4]   2> 	  "operation":"state",
[junit4:junit4]   2> 	  "numShards":"2",
[junit4:junit4]   2> 	  "shard":"shard2",
[junit4:junit4]   2> 	  "roles":null,
[junit4:junit4]   2> 	  "state":"recovering",
[junit4:junit4]   2> 	  "core":"collection1",
[junit4:junit4]   2> 	  "collection":"collection1",
[junit4:junit4]   2> 	  "node_name":"127.0.0.1:49933_",
[junit4:junit4]   2> 	  "base_url":"http://127.0.0.1:49933"}
[junit4:junit4]   2> 18082 T2474 oasc.Overseer$ClusterStateUpdater.updateState Update state numShards=2 message={
[junit4:junit4]   2> 	  "operation":"state",
[junit4:junit4]   2> 	  "numShards":"2",
[junit4:junit4]   2> 	  "shard":"shard1",
[junit4:junit4]   2> 	  "roles":null,
[junit4:junit4]   2> 	  "state":"active",
[junit4:junit4]   2> 	  "core":"collection1",
[junit4:junit4]   2> 	  "collection":"collection1",
[junit4:junit4]   2> 	  "node_name":"127.0.0.1:49929_",
[junit4:junit4]   2> 	  "base_url":"http://127.0.0.1:49929"}
[junit4:junit4]   2> 18088 T2492 oascc.ZkStateReader$2.process A cluster state change: WatchedEvent state:SyncConnected type:NodeDataChanged path:/clusterstate.json, has occurred - updating... (live nodes size: 5)
[junit4:junit4]   2> 18088 T2473 oascc.ZkStateReader$2.process A cluster state change: WatchedEvent state:SyncConnected type:NodeDataChanged path:/clusterstate.json, has occurred - updating... (live nodes size: 5)
[junit4:junit4]   2> 18089 T2522 oascc.ZkStateReader$2.process A cluster state change: WatchedEvent state:SyncConnected type:NodeDataChanged path:/clusterstate.json, has occurred - updating... (live nodes size: 5)
[junit4:junit4]   2> 18089 T2507 oascc.ZkStateReader$2.process A cluster state change: WatchedEvent state:SyncConnected type:NodeDataChanged path:/clusterstate.json, has occurred - updating... (live nodes size: 5)
[junit4:junit4]   2> 18089 T2479 oascc.ZkStateReader$2.process A cluster state change: WatchedEvent state:SyncConnected type:NodeDataChanged path:/clusterstate.json, has occurred - updating... (live nodes size: 5)
[junit4:junit4]   2> 18094 T2538 oascc.ZkStateReader$2.process A cluster state change: WatchedEvent state:SyncConnected type:NodeDataChanged path:/clusterstate.json, has occurred - updating... (live nodes size: 5)
[junit4:junit4]   2> 18921 T2451 oascc.ZkStateReader.updateClusterState Updating cloud state from ZooKeeper... 
[junit4:junit4]   2> 19930 T2451 oascc.ZkStateReader.updateClusterState Updating cloud state from ZooKeeper... 
[junit4:junit4]   2> 20425 T1392 oasc.OverseerCollectionProcessor.run WARNING Overseer cannot talk to ZK
[junit4:junit4]   2>  C169_STATE=coll:collection1 core:collection1 props:{shard=shard2, roles=null, state=recovering, core=collection1, collection=collection1, node_name=127.0.0.1:49933_, base_url=http://127.0.0.1:49933}
[junit4:junit4]   2> 20933 T2541 C169 P49933 oasc.RecoveryStrategy.doRecovery Attempting to PeerSync from http://127.0.0.1:49926/collection1/ core=collection1 - recoveringAfterStartup=true
[junit4:junit4]   2> 20934 T2541 C169 P49933 oasu.PeerSync.sync PeerSync: core=collection1 url=http://127.0.0.1:49933 START replicas=[http://127.0.0.1:49926/collection1/] nUpdates=100
[junit4:junit4]   2> 20934 T2451 oascc.ZkStateReader.updateClusterState Updating cloud state from ZooKeeper... 
[junit4:junit4]   2> 20934 T2541 C169 P49933 oasu.PeerSync.sync WARNING no frame of reference to tell of we've missed updates
[junit4:junit4]   2> 20934 T2541 C169 P49933 oasc.RecoveryStrategy.doRecovery PeerSync Recovery was not successful - trying replication. core=collection1
[junit4:junit4]   2> 20935 T2541 C169 P49933 oasc.RecoveryStrategy.doRecovery Starting Replication Recovery. core=collection1
[junit4:junit4]   2> 20935 T2541 C169 P49933 oasc.RecoveryStrategy.doRecovery Begin buffering updates. core=collection1
[junit4:junit4]   2> 20935 T2541 C169 P49933 oasu.UpdateLog.bufferUpdates Starting to buffer updates. FSUpdateLog{state=ACTIVE, tlog=null}
[junit4:junit4]   2> 20935 T2541 C169 P49933 oasc.RecoveryStrategy.replicate Attempting to replicate from http://127.0.0.1:49926/collection1/. core=collection1
[junit4:junit4]   2> 20935 T2541 C169 P49933 oascsi.HttpClientUtil.createClient Creating new http client, config:maxConnections=128&maxConnectionsPerHost=32&followRedirects=false
[junit4:junit4]   2> ASYNC  NEW_CORE C171 name=collection1 org.apache.solr.core.SolrCore@504f1004 url=http://127.0.0.1:49926/collection1 node=127.0.0.1:49926_ C171_STATE=coll:collection1 core:collection1 props:{shard=shard2, roles=null, state=active, core=collection1, collection=collection1, node_name=127.0.0.1:49926_, base_url=http://127.0.0.1:49926, leader=true}
[junit4:junit4]   2> 20944 T2498 C171 P49926 oasu.DirectUpdateHandler2.commit start commit{,optimize=false,openSearcher=false,waitSearcher=true,expungeDeletes=false,softCommit=false}
[junit4:junit4]   2> 20946 T2499 C171 P49926 REQ /get {getVersions=100&distrib=false&wt=javabin&qt=/get&version=2} status=0 QTime=2 
[junit4:junit4]   2> 20946 T2498 C171 P49926 oasc.CachingDirectoryFactory.close Releasing directory:/Users/jenkins/jenkins-slave/workspace/Lucene-Solr-trunk-MacOSX/solr/build/solr-core/test/J0/./org.apache.solr.cloud.BasicDistributedZkTest-1359760981066/jetty2
[junit4:junit4]   2> 20950 T2498 C171 P49926 oasc.SolrDeletionPolicy.onInit SolrDeletionPolicy.onInit: commits:num=1
[junit4:junit4]   2> 		commit{dir=RateLimitedDirectoryWrapper(NRTCachingDirectory(org.apache.lucene.store.NIOFSDirectory@/Users/jenkins/jenkins-slave/workspace/Lucene-Solr-trunk-MacOSX/solr/build/solr-core/test/J0/org.apache.solr.cloud.BasicDistributedZkTest-1359760981066/jetty2/index lockFactory=org.apache.lucene.store.NativeFSLockFactory@581ada72; maxCacheMB=48.0 maxMergeSizeMB=4.0)),segFN=segments_1,generation=1,filenames=[segments_1]
[junit4:junit4]   2> 20951 T2498 C171 P49926 oasc.SolrDeletionPolicy.updateCommits newest commit = 1[segments_1]
[junit4:junit4]   2> 20953 T2498 C171 P49926 oasc.SolrDeletionPolicy.onCommit SolrDeletionPolicy.onCommit: commits:num=2
[junit4:junit4]   2> 		commit{dir=RateLimitedDirectoryWrapper(NRTCachingDirectory(org.apache.lucene.store.NIOFSDirectory@/Users/jenkins/jenkins-slave/workspace/Lucene-Solr-trunk-MacOSX/solr/build/solr-core/test/J0/org.apache.solr.cloud.BasicDistributedZkTest-1359760981066/jetty2/index lockFactory=org.apache.lucene.store.NativeFSLockFactory@581ada72; maxCacheMB=48.0 maxMergeSizeMB=4.0)),segFN=segments_1,generation=1,filenames=[segments_1]
[junit4:junit4]   2> 		commit{dir=RateLimitedDirectoryWrapper(NRTCachingDirectory(org.apache.lucene.store.NIOFSDirectory@/Users/jenkins/jenkins-slave/workspace/Lucene-Solr-trunk-MacOSX/solr/build/solr-core/test/J0/org.apache.solr.cloud.BasicDistributedZkTest-1359760981066/jetty2/index lockFactory=org.apache.lucene.store.NativeFSLockFactory@581ada72; maxCacheMB=48.0 maxMergeSizeMB=4.0)),segFN=segments_2,generation=2,filenames=[segments_2]
[junit4:junit4]   2> 20954 T2498 C171 P49926 oasc.SolrDeletionPolicy.updateCommits newest commit = 2[segments_2]
[junit4:junit4]   2> 20955 T2498 C171 P49926 oasc.CachingDirectoryFactory.close Releasing directory:/Users/jenkins/jenkins-slave/workspace/Lucene-Solr-trunk-MacOSX/solr/build/solr-core/test/J0/./org.apache.solr.cloud.BasicDistributedZkTest-1359760981066/jetty2
[junit4:junit4]   2> 20955 T2498 C171 P49926 oass.SolrIndexSearcher.<init> Opening Searcher@de7b7b5 realtime
[junit4:junit4]   2> 20956 T2498 C171 P49926 oasu.DirectUpdateHandler2.commit end_commit_flush
[junit4:junit4]   2> 20956 T2498 C171 P49926 /update {waitSearcher=true&openSearcher=false&commit=true&wt=javabin&commit_end_point=true&version=2&softCommit=false} {commit=} 0 12
[junit4:junit4]   2> 20957 T2541 C169 P49933 oash.ReplicationHandler.inform Commits will be reserved for  10000
[junit4:junit4]   2> 20958 T2541 C169 P49933 oash.SnapPuller.<init>  No value set for 'pollInterval'. Timer Task not started.
[junit4:junit4]   2> 20961 T2502 C171 P49926 oash.ReplicationHandler.inform Commits will be reserved for  10000
[junit4:junit4]   2> 20962 T2502 C171 P49926 REQ /replication {command=indexversion&qt=/replication&wt=javabin&version=2} status=0 QTime=2 
[junit4:junit4]   2> 20963 T2541 C169 P49933 oash.SnapPuller.fetchLatestIndex Master's generation: 2
[junit4:junit4]   2> 20963 T2541 C169 P49933 oash.SnapPuller.fetchLatestIndex Slave's generation: 1
[junit4:junit4]   2> 20963 T2541 C169 P49933 oash.SnapPuller.fetchLatestIndex Starting replication process
[junit4:junit4]   2> 20966 T2497 C171 P49926 oasc.CachingDirectoryFactory.close Releasing directory:/Users/jenkins/jenkins-slave/workspace/Lucene-Solr-trunk-MacOSX/solr/build/solr-core/test/J0/./org.apache.solr.cloud.BasicDistributedZkTest-1359760981066/jetty2
[junit4:junit4]   2> 20966 T2497 C171 P49926 oasc.CachingDirectoryFactory.close Releasing directory:/Users/jenkins/jenkins-slave/workspace/Lucene-Solr-trunk-MacOSX/solr/build/solr-core/test/J0/./org.apache.solr.cloud.BasicDistributedZkTest-1359760981066/jetty2/index
[junit4:junit4]   2> 20967 T2497 C171 P49926 REQ /replication {command=filelist&qt=/replication&wt=javabin&generation=2&version=2} status=0 QTime=2 
[junit4:junit4]   2> 20968 T2541 C169 P49933 oash.SnapPuller.fetchLatestIndex Number of files in latest index in master: 1
[junit4:junit4]   2> 20969 T2541 C169 P49933 oasc.CachingDirectoryFactory.get return new directory for /Users/jenkins/jenkins-slave/workspace/Lucene-Solr-trunk-MacOSX/solr/build/solr-core/test/J0/./org.apache.solr.cloud.BasicDistributedZkTest-1359760981066/jetty4/index.20130202092322023 forceNew:false
[junit4:junit4]   2> 20969 T2541 C169 P49933 oasc.CachingDirectoryFactory.close Releasing directory:/Users/jenkins/jenkins-slave/workspace/Lucene-Solr-trunk-MacOSX/solr/build/solr-core/test/J0/./org.apache.solr.cloud.BasicDistributedZkTest-1359760981066/jetty4
[junit4:junit4]   2> 20970 T2541 C169 P49933 oash.SnapPuller.fetchLatestIndex Starting download to RateLimitedDirectoryWrapper(NRTCachingDirectory(org.apache.lucene.store.NIOFSDirectory@/Users/jenkins/jenkins-slave/workspace/Lucene-Solr-trunk-MacOSX/solr/build/solr-core/test/J0/org.apache.solr.cloud.BasicDistributedZkTest-1359760981066/jetty4/index.20130202092322023 lockFactory=org.apache.lucene.store.NativeFSLockFactory@558f15ed; maxCacheMB=48.0 maxMergeSizeMB=4.0)) fullCopy=true
[junit4:junit4]   2> 20973 T2500 C171 P49926 REQ /replication {file=segments_2&command=filecontent&checksum=true&wt=filestream&qt=/replication&generation=2} status=0 QTime=0 
[junit4:junit4]   2> 20975 T2541 C169 P49933 oasc.CachingDirectoryFactory.close Releasing directory:/Users/jenkins/jenkins-slave/workspace/Lucene-Solr-trunk-MacOSX/solr/build/solr-core/test/J0/./org.apache.solr.cloud.BasicDistributedZkTest-1359760981066/jetty4/index
[junit4:junit4]   2> 20976 T2541 C169 P49933 oash.SnapPuller.fetchLatestIndex Total time taken for download : 0 secs
[junit4:junit4]   2> 20976 T2541 C169 P49933 oash.SnapPuller.modifyIndexProps New index installed. Updating index properties... index=index.20130202092322023
[junit4:junit4]   2> 20978 T2541 C169 P49933 oasc.CachingDirectoryFactory.close Releasing directory:/Users/jenkins/jenkins-slave/workspace/Lucene-Solr-trunk-MacOSX/solr/build/solr-core/test/J0/./org.apache.solr.cloud.BasicDistributedZkTest-1359760981066/jetty4
[junit4:junit4]   2> 20978 T2541 C169 P49933 oasc.CachingDirectoryFactory.close Releasing directory:/Users/jenkins/jenkins-slave/workspace/Lucene-Solr-trunk-MacOSX/solr/build/solr-core/test/J0/./org.apache.solr.cloud.BasicDistributedZkTest-1359760981066/jetty4
[junit4:junit4]   2> 20979 T2541 C169 P49933 oasc.SolrCore.getNewIndexDir New index directory detected: old=./org.apache.solr.cloud.BasicDistributedZkTest-1359760981066/jetty4/index/ new=./org.apache.solr.cloud.BasicDistributedZkTest-1359760981066/jetty4/index.20130202092322023
[junit4:junit4]   2> 20982 T2541 C169 P49933 oasc.SolrDeletionPolicy.onInit SolrDeletionPolicy.onInit: commits:num=1
[junit4:junit4]   2> 		commit{dir=RateLimitedDirectoryWrapper(NRTCachingDirectory(org.apache.lucene.store.NIOFSDirectory@/Users/jenkins/jenkins-slave/workspace/Lucene-Solr-trunk-MacOSX/solr/build/solr-core/test/J0/org.apache.solr.cloud.BasicDistributedZkTest-1359760981066/jetty4/index.20130202092322023 lockFactory=org.apache.lucene.store.NativeFSLockFactory@558f15ed; maxCacheMB=48.0 maxMergeSizeMB=4.0)),segFN=segments_2,generation=2,filenames=[segments_2]
[junit4:junit4]   2> 20983 T2541 C169 P49933 oasc.SolrDeletionPolicy.updateCommits newest commit = 2[segments_2]
[junit4:junit4]   2> 20985 T2541 C169 P49933 oasc.CachingDirectoryFactory.close Releasing directory:/Users/jenkins/jenkins-slave/workspace/Lucene-Solr-trunk-MacOSX/solr/build/solr-core/test/J0/./org.apache.solr.cloud.BasicDistributedZkTest-1359760981066/jetty4
[junit4:junit4]   2> 20985 T2541 C169 P49933 oasu.DefaultSolrCoreState.newIndexWriter Creating new IndexWriter...
[junit4:junit4]   2> 20985 T2541 C169 P49933 oasu.DefaultSolrCoreState.newIndexWriter Waiting until IndexWriter is unused... core=collection1
[junit4:junit4]   2> 20986 T2541 C169 P49933 oasu.DefaultSolrCoreState.newIndexWriter Rollback old IndexWriter... core=collection1
[junit4:junit4]   2> 20986 T2541 C169 P49933 oasc.CachingDirectoryFactory.close Releasing directory:/Users/jenkins/jenkins-slave/workspace/Lucene-Solr-trunk-MacOSX/solr/build/solr-core/test/J0/./org.apache.solr.cloud.BasicDistributedZkTest-1359760981066/jetty4/index.20130202092322023
[junit4:junit4]   2> 20987 T2541 C169 P49933 oasc.CachingDirectoryFactory.close Releasing directory:/Users/jenkins/jenkins-slave/workspace/Lucene-Solr-trunk-MacOSX/solr/build/solr-core/test/J0/./org.apache.solr.cloud.BasicDistributedZkTest-1359760981066/jetty4
[junit4:junit4]   2> 20990 T2541 C169 P49933 oasc.SolrDeletionPolicy.onInit SolrDeletionPolicy.onInit: commits:num=1
[junit4:junit4]   2> 		commit{dir=RateLimitedDirectoryWrapper(NRTCachingDirectory(org.apache.lucene.store.NIOFSDirectory@/Users/jenkins/jenkins-slave/workspace/Lucene-Solr-trunk-MacOSX/solr/build/solr-core/test/J0/org.apache.solr.cloud.BasicDistributedZkTest-1359760981066/jetty4/index.20130202092322023 lockFactory=org.apache.lucene.store.NativeFSLockFactory@558f15ed; maxCacheMB=48.0 maxMergeSizeMB=4.0)),segFN=segments_2,generation=2,filenames=[segments_2]
[junit4:junit4]   2> 20993 T2541 C169 P49933 oasc.SolrDeletionPolicy.updateCommits newest commit = 2[segments_2]
[junit4:junit4]   2> 20995 T2541 C169 P49933 oasu.DefaultSolrCoreState.newIndexWriter New IndexWriter is ready to be used.
[junit4:junit4]   2> 20996 T2541 C169 P49933 oasc.CachingDirectoryFactory.close Releasing directory:/Users/jenkins/jenkins-slave/workspace/Lucene-Solr-trunk-MacOSX/solr/build/solr-core/test/J0/./org.apache.solr.cloud.BasicDistributedZkTest-1359760981066/jetty4
[junit4:junit4]   2> 20996 T2541 C169 P49933 oass.SolrIndexSearcher.<init> Opening Searcher@f47cc70 main
[junit4:junit4]   2> 20998 T2540 oasc.SolrCore.registerSearcher [collection1] Registered new searcher Searcher@f47cc70 main{StandardDirectoryReader(segments_2:1:nrt)}
[junit4:junit4]   2> 20999 T2540 oasc.CachingDirectoryFactory.close Releasing directory:/Users/jenkins/jenkins-slave/workspace/Lucene-Solr-trunk-MacOSX/solr/build/solr-core/test/J0/./org.apache.solr.cloud.BasicDistributedZkTest-1359760981066/jetty4/index
[junit4:junit4]   2> 21000 T2541 C169 P49933 oasu.DirectUpdateHandler2.commit start commit{,optimize=false,openSearcher=false,waitSearcher=false,expungeDeletes=false,softCommit=false}
[junit4:junit4]   2> 21002 T2541 C169 P49933 oasc.SolrDeletionPolicy.onCommit SolrDeletionPolicy.onCommit: commits:num=2
[junit4:junit4]   2> 		commit{dir=RateLimitedDirectoryWrapper(NRTCachingDirectory(org.apache.lucene.store.NIOFSDirectory@/Users/jenkins/jenkins-slave/workspace/Lucene-Solr-trunk-MacOSX/solr/build/solr-core/test/J0/org.apache.solr.cloud.BasicDistributedZkTest-1359760981066/jetty4/index.20130202092322023 lockFactory=org.apache.lucene.store.NativeFSLockFactory@558f15ed; maxCacheMB=48.0 maxMergeSizeMB=4.0)),segFN=segments_2,generation=2,filenames=[segments_2]
[junit4:junit4]   2> 		commit{dir=RateLimitedDirectoryWrapper(NRTCachingDirectory(org.apache.lucene.store.NIOFSDirectory@/Users/jenkins/jenkins-slave/workspace/Lucene-Solr-trunk-MacOSX/solr/build/solr-core/test/J0/org.apache.solr.cloud.BasicDistributedZkTest-1359760981066/jetty4/index.20130202092322023 lockFactory=org.apache.lucene.store.NativeFSLockFactory@558f15ed; maxCacheMB=48.0 maxMergeSizeMB=4.0)),segFN=segments_3,generation=3,filenames=[segments_3]
[junit4:junit4]   2> 21002 T2541 C169 P49933 oasc.SolrDeletionPolicy.updateCommits newest commit = 3[segments_3]
[junit4:junit4]   2> 21003 T2541 C169 P49933 oasc.CachingDirectoryFactory.close Releasing directory:/Users/jenkins/jenkins-slave/workspace/Lucene-Solr-trunk-MacOSX/solr/build/solr-core/test/J0/./org.apache.solr.cloud.BasicDistributedZkTest-1359760981066/jetty4
[junit4:junit4]   2> 21004 T2541 C169 P49933 oasu.DirectUpdateHandler2.commit end_commit_flush
[junit4:junit4]   2> 21004 T2541 C169 P49933 oasc.CachingDirectoryFactory.close Releasing directory:/Users/jenkins/jenkins-slave/workspace/Lucene-Solr-trunk-MacOSX/solr/build/solr-core/test/J0/./org.apache.solr.cloud.BasicDistributedZkTest-1359760981066/jetty4/index.20130202092322023
[junit4:junit4]   2> 21005 T2541 C169 P49933 oasc.CachingDirectoryFactory.close Releasing directory:/Users/jenkins/jenkins-slave/workspace/Lucene-Solr-trunk-MacOSX/solr/build/solr-core/test/J0/./org.apache.solr.cloud.BasicDistributedZkTest-1359760981066/jetty4/index
[junit4:junit4]   2> 21005 T2541 C169 P49933 oasc.RecoveryStrategy.replay No replay needed. core=collection1
[junit4:junit4]   2> 21005 T2541 C169 P49933 oasc.RecoveryStrategy.doRecovery Replication Recovery was successful - registering as Active. core=collection1
[junit4:junit4]   2> 21005 T2541 C169 P49933 oasc.ZkController.publish publishing core=collection1 state=active
[junit4:junit4]   2> 21005 T2541 C169 P49933 oasc.ZkController.publish numShards not found on descriptor - reading it from system property
[junit4:junit4]   2> 21007 T2541 C169 P49933 oasc.RecoveryStrategy.doRecovery Finished recovery process. core=collection1
[junit4:junit4]   2> 21106 T2474 oascc.ZkStateReader.updateClusterState Updating cloud state from ZooKeeper... 
[junit4:junit4]   2> 21108 T2474 oasc.Overseer$ClusterStateUpdater.updateState Update state numShards=2 message={
[junit4:junit4]   2> 	  "operation":"state",
[junit4:junit4]   2> 	  "numShards":"2",
[junit4:junit4]   2> 	  "shard":"shard2",
[junit4:junit4]   2> 	  "roles":null,
[junit4:junit4]   2> 	  "state":"active",
[junit4:junit4]   2> 	  "core":"collection1",
[junit4:junit4]   2> 	  "collection":"collection1",
[junit4:junit4]   2> 	  "node_name":"127.0.0.1:49933_",
[junit4:junit4]   2> 	  "base_url":"http://127.0.0.1:49933"}
[junit4:junit4]   2> 21113 T2492 oascc.ZkStateReader$2.process A cluster state change: WatchedEvent state:SyncConnected type:NodeDataChanged path:/clusterstate.json, has occurred - updating... (live nodes size: 5)
[junit4:junit4]   2> 21114 T2473 oascc.ZkStateReader$2.process A cluster state change: WatchedEvent state:SyncConnected type:NodeDataChanged path:/clusterstate.json, has occurred - updating... (live nodes size: 5)
[junit4:junit4]   2> 21114 T2538 oascc.ZkStateReader$2.process A cluster state change: WatchedEvent state:SyncConnected type:NodeDataChanged path:/clusterstate.json, has occurred - updating... (live nodes size: 5)
[junit4:junit4]   2> 21114 T2522 oascc.ZkStateReader$2.process A cluster state change: WatchedEvent state:SyncConnected type:NodeDataChanged path:/clusterstate.json, has occurred - updating... (live nodes size: 5)
[junit4:junit4]   2> 21114 T2507 oascc.ZkStateReader$2.process A cluster state change: WatchedEvent state:SyncConnected type:NodeDataChanged path:/clusterstate.json, has occurred - updating... (live nodes size: 5)
[junit4:junit4]   2> 21115 T2479 oascc.ZkStateReader$2.process A cluster state change: WatchedEvent state:SyncConnected type:NodeDataChanged path:/clusterstate.json, has occurred - updating... (live nodes size: 5)
[junit4:junit4]   2> 21937 T2451 oascc.ZkStateReader.updateClusterState Updating cloud state from ZooKeeper... 
[junit4:junit4]   2> 21939 T2451 oasc.AbstractDistribZkTestBase.waitForRecoveriesToFinish Recoveries finished - collection: collection1
[junit4:junit4]   2> ASYNC  NEW_CORE C172 name=collection1 org.apache.solr.core.SolrCore@5052a70e url=http://127.0.0.1:49919/collection1 node=127.0.0.1:49919_ C172_STATE=coll:control_collection core:collection1 props:{shard=shard1, roles=null, state=active, core=collection1, collection=control_collection, node_name=127.0.0.1:49919_, base_url=http://127.0.0.1:49919, leader=true}
[junit4:junit4]   2> 21950 T2466 C172 P49919 oasc.CachingDirectoryFactory.close Releasing directory:/Users/jenkins/jenkins-slave/workspace/Lucene-Solr-trunk-MacOSX/solr/build/solr-core/test/J0/./org.apache.solr.cloud.BasicDistributedZkTest-1359760981066/control/data
[junit4:junit4]   2> 21955 T2466 C172 P49919 oasc.SolrDeletionPolicy.onInit SolrDeletionPolicy.onInit: commits:num=1
[junit4:junit4]   2> 		commit{dir=RateLimitedDirectoryWrapper(NRTCachingDirectory(org.apache.lucene.store.NIOFSDirectory@/Users/jenkins/jenkins-slave/workspace/Lucene-Solr-trunk-MacOSX/solr/build/solr-core/test/J0/org.apache.solr.cloud.BasicDistributedZkTest-1359760981066/control/data/index lockFactory=org.apache.lucene.store.NativeFSLockFactory@39741482; maxCacheMB=48.0 maxMergeSizeMB=4.0)),segFN=segments_1,generation=1,filenames=[segments_1]
[junit4:junit4]   2> 21956 T2466 C172 P49919 oasc.SolrDeletionPolicy.updateCommits newest commit = 1[segments_1]
[junit4:junit4]   2> 21959 T2466 C172 P49919 oasc.CachingDirectoryFactory.close Releasing directory:/Users/jenkins/jenkins-slave/workspace/Lucene-Solr-trunk-MacOSX/solr/build/solr-core/test/J0/./org.apache.solr.cloud.BasicDistributedZkTest-1359760981066/control/data
[junit4:junit4]   2> 21959 T2466 C172 P49919 oass.SolrIndexSearcher.<init> Opening Searcher@54f0fb5b realtime
[junit4:junit4]   2> 21960 T2466 C172 P49919 /update {wt=javabin&version=2} {deleteByQuery=*:* (-1425812753485922304)} 0 12
[junit4:junit4]   2> 21965 T2488 C170 P49923 oasc.CachingDirectoryFactory.close Releasing directory:/Users/jenkins/jenkins-slave/workspace/Lucene-Solr-trunk-MacOSX/solr/build/solr-core/test/J0/./org.apache.solr.cloud.BasicDistributedZkTest-1359760981066/jetty1
[junit4:junit4]   2> 21990 T2501 C171 P49926 oasc.CachingDirectoryFactory.close Releasing directory:/Users/jenkins/jenkins-slave/workspace/Lucene-Solr-trunk-MacOSX/solr/build/solr-core/test/J0/./org.apache.solr.cloud.BasicDistributedZkTest-1359760981066/jetty2
[junit4:junit4]   2>  C168_STATE=coll:collection1 core:collection1 props:{shard=shard1, roles=null, state=active, core=collection1, collection=collection1, node_name=127.0.0.1:49929_, base_url=http://127.0.0.1:49929}
[junit4:junit4]   2> 22002 T2513 C168 P49929 oasc.CachingDirectoryFactory.close Releasing directory:/Users/jenkins/jenkins-slave/workspace/Lucene-Solr-trunk-MacOSX/solr/build/solr-core/test/J0/./org.apache.solr.cloud.BasicDistributedZkTest-1359760981066/jetty3
[junit4:junit4]   2> 22004 T2513 C168 P49929 /update {update.distrib=FROMLEADER&_version_=-1425812753500602368&update.from=http://127.0.0.1:49923/collection1/&wt=javabin&version=2} {deleteByQuery=*:* (-1425812753500602368)} 0 5
[junit4:junit4]   2>  C169_STATE=coll:collection1 core:collection1 props:{shard=shard2, roles=null, state=active, core=collection1, collection=collection1, node_name=127.0.0.1:49933_, base_url=http://127.0.0.1:49933}
[junit4:junit4]   2> 22008 T2534 C169 P49933 oasc.CachingDirectoryFactory.close Releasing directory:/Users/jenkins/jenkins-slave/workspace/Lucene-Solr-trunk-MacOSX/solr/build/solr-core/test/J0/./org.apache.solr.cloud.BasicDistributedZkTest-1359760981066/jetty4
[junit4:junit4]   2> 22010 T2534 C169 P49933 /update {update.distrib=FROMLEADER&_version_=-1425812753525768192&update.from=http://127.0.0.1:49926/collection1/&wt=javabin&version=2} {deleteByQuery=*:* (-1425812753525768192)} 0 4
[junit4:junit4]   2> 22011 T2501 C171 P49926 /update {update.distrib=TOLEADER&wt=javabin&version=2} {deleteByQuery=*:* (-1425812753525768192)} 0 24
[junit4:junit4]   2> 22012 T2488 C170 P49923 /update {wt=javabin&version=2} {deleteByQuery=*:* (-1425812753500602368)} 0 49
[junit4:junit4]   2> 22022 T2467 C172 P49919 /update {wt=javabin&version=2} {add=[1 (1425812753558274048)]} 0 5
[junit4:junit4]   2> 22042 T2514 C168 P49929 /update {distrib.from=http://127.0.0.1:49923/collection1/&update.distrib=FROMLEADER&wt=javabin&version=2} {add=[1 (1425812753570856960)]} 0 5
[junit4:junit4]   2> 22045 T2483 C170 P49923 /update {distrib.from=http://127.0.0.1:49926/collection1/&update.distrib=TOLEADER&wt=javabin&version=2} {add=[1 (1425812753570856960)]} 0 15
[junit4:junit4]   2> 22047 T2502 C171 P49926 /update {wt=javabin&version=2} {add=[1]} 0 21
[junit4:junit4]   2> 22056 T2468 C172 P49919 /update {wt=javabin&version=2} {add=[2 (1425812753597071360)]} 0 4
[junit4:junit4]   2> 22072 T2530 C169 P49933 /update {distrib.from=http://127.0.0.1:49926/collection1/&update.distrib=FROMLEADER&wt=javabin&version=2} {add=[2 (1425812753603362816)]} 0 4
[junit4:junit4]   2> 22073 T2497 C171 P49926 /update {wt=javabin&version=2} {add=[2 (1425812753603362816)]} 0 13
[junit4:junit4]   2> 22077 T2469 C172 P49919 /update {wt=javabin&version=2} {add=[3 (1425812753619091456)]} 0 1
[junit4:junit4]   2> 22086 T2531 C169 P49933 /update {distrib.from=http://127.0.0.1:49926/collection1/&update.distrib=FROMLEADER&wt=javabin&version=2} {add=[3 (1425812753625382912)]} 0 1
[junit4:junit4]   2> 22087 T2500 C171

[...truncated too long message...]

opertiesRestoreRule$1.evaluate(SystemPropertiesRestoreRule.java:53)
[junit4:junit4]    > 	at org.apache.lucene.util.TestRuleSetupTeardownChained$1.evaluate(TestRuleSetupTeardownChained.java:50)
[junit4:junit4]    > 	at org.apache.lucene.util.TestRuleFieldCacheSanity$1.evaluate(TestRuleFieldCacheSanity.java:51)
[junit4:junit4]    > 	at org.apache.lucene.util.AbstractBeforeAfterRule$1.evaluate(AbstractBeforeAfterRule.java:46)
[junit4:junit4]    > 	at com.carrotsearch.randomizedtesting.rules.SystemPropertiesInvariantRule$1.evaluate(SystemPropertiesInvariantRule.java:55)
[junit4:junit4]    > 	at org.apache.lucene.util.TestRuleThreadAndTestName$1.evaluate(TestRuleThreadAndTestName.java:49)
[junit4:junit4]    > 	at org.apache.lucene.util.TestRuleIgnoreAfterMaxFailures$1.evaluate(TestRuleIgnoreAfterMaxFailures.java:70)
[junit4:junit4]    > 	at org.apache.lucene.util.TestRuleMarkFailure$1.evaluate(TestRuleMarkFailure.java:48)
[junit4:junit4]    > 	at com.carrotsearch.randomizedtesting.rules.StatementAdapter.evaluate(StatementAdapter.java:36)
[junit4:junit4]    > 	at com.carrotsearch.randomizedtesting.ThreadLeakControl$StatementRunner.run(ThreadLeakControl.java:358)
[junit4:junit4]    > 	at com.carrotsearch.randomizedtesting.ThreadLeakControl.forkTimeoutingTask(ThreadLeakControl.java:782)
[junit4:junit4]    > 	at com.carrotsearch.randomizedtesting.ThreadLeakControl$3.evaluate(ThreadLeakControl.java:442)
[junit4:junit4]    > 	at com.carrotsearch.randomizedtesting.RandomizedRunner.runSingleTest(RandomizedRunner.java:746)
[junit4:junit4]    > 	at com.carrotsearch.randomizedtesting.RandomizedRunner$3.evaluate(RandomizedRunner.java:648)
[junit4:junit4]    > 	at com.carrotsearch.randomizedtesting.RandomizedRunner$4.evaluate(RandomizedRunner.java:682)
[junit4:junit4]    > 	at com.carrotsearch.randomizedtesting.RandomizedRunner$5.evaluate(RandomizedRunner.java:693)
[junit4:junit4]    > 	at com.carrotsearch.randomizedtesting.rules.StatementAdapter.evaluate(StatementAdapter.java:36)
[junit4:junit4]    > 	at com.carrotsearch.randomizedtesting.rules.SystemPropertiesRestoreRule$1.evaluate(SystemPropertiesRestoreRule.java:53)
[junit4:junit4]    > 	at org.apache.lucene.util.AbstractBeforeAfterRule$1.evaluate(AbstractBeforeAfterRule.java:46)
[junit4:junit4]    > 	at org.apache.lucene.util.TestRuleStoreClassName$1.evaluate(TestRuleStoreClassName.java:42)
[junit4:junit4]    > 	at com.carrotsearch.randomizedtesting.rules.SystemPropertiesInvariantRule$1.evaluate(SystemPropertiesInvariantRule.java:55)
[junit4:junit4]    > 	at com.carrotsearch.randomizedtesting.rules.NoShadowingOrOverridesOnMethodsRule$1.evaluate(NoShadowingOrOverridesOnMethodsRule.java:39)
[junit4:junit4]    > 	at com.carrotsearch.randomizedtesting.rules.NoShadowingOrOverridesOnMethodsRule$1.evaluate(NoShadowingOrOverridesOnMethodsRule.java:39)
[junit4:junit4]    > 	at com.carrotsearch.randomizedtesting.rules.StatementAdapter.evaluate(StatementAdapter.java:36)
[junit4:junit4]    > 	at org.apache.lucene.util.TestRuleAssertionsRequired$1.evaluate(TestRuleAssertionsRequired.java:43)
[junit4:junit4]    > 	at org.apache.lucene.util.TestRuleMarkFailure$1.evaluate(TestRuleMarkFailure.java:48)
[junit4:junit4]    > 	at org.apache.lucene.util.TestRuleIgnoreAfterMaxFailures$1.evaluate(TestRuleIgnoreAfterMaxFailures.java:70)
[junit4:junit4]    > 	at org.apache.lucene.util.TestRuleIgnoreTestSuites$1.evaluate(TestRuleIgnoreTestSuites.java:55)
[junit4:junit4]    > 	at com.carrotsearch.randomizedtesting.rules.StatementAdapter.evaluate(StatementAdapter.java:36)
[junit4:junit4]    > 	at com.carrotsearch.randomizedtesting.ThreadLeakControl$StatementRunner.run(ThreadLeakControl.java:358)
[junit4:junit4]    > 	at java.lang.Thread.run(Thread.java:722)
[junit4:junit4]   2> 370776 T2451 oas.SolrTestCaseJ4.deleteCore ###deleteCore
[junit4:junit4]   2> NOTE: test params are: codec=Lucene42: {n_f1=PostingsFormat(name=MockRandom), foo_b=Pulsing41(freqCutoff=1 minBlockSize=58 maxBlockSize=183), cat=PostingsFormat(name=Lucene41WithOrds), foo_d=PostingsFormat(name=SimpleText), foo_f=Pulsing41(freqCutoff=1 minBlockSize=58 maxBlockSize=183), n_tl1=PostingsFormat(name=MockRandom), n_d1=PostingsFormat(name=Lucene41WithOrds), rnd_b=PostingsFormat(name=SimpleText), intDefault=PostingsFormat(name=Lucene41WithOrds), n_td1=PostingsFormat(name=MockRandom), timestamp=PostingsFormat(name=Lucene41WithOrds), id=PostingsFormat(name=SimpleText), range_facet_sl=Pulsing41(freqCutoff=1 minBlockSize=58 maxBlockSize=183), range_facet_si=PostingsFormat(name=MockRandom), oddField_s=Pulsing41(freqCutoff=1 minBlockSize=58 maxBlockSize=183), sequence_i=Pulsing41(freqCutoff=1 minBlockSize=58 maxBlockSize=183), name=PostingsFormat(name=SimpleText), foo_i=PostingsFormat(name=MockRandom), regex_dup_B_s=PostingsFormat(name=Lucene41WithOrds), multiDefault=PostingsFormat(name=MockRandom), n_tf1=PostingsFormat(name=Lucene41WithOrds), n_dt1=PostingsFormat(name=MockRandom), genre_s=Pulsing41(freqCutoff=1 minBlockSize=58 maxBlockSize=183), author_t=PostingsFormat(name=MockRandom), n_ti1=PostingsFormat(name=SimpleText), range_facet_l=PostingsFormat(name=Lucene41WithOrds), text=Pulsing41(freqCutoff=1 minBlockSize=58 maxBlockSize=183), _version_=PostingsFormat(name=Lucene41WithOrds), val_i=PostingsFormat(name=SimpleText), SubjectTerms_mfacet=PostingsFormat(name=Lucene41WithOrds), series_t=PostingsFormat(name=MockRandom), a_t=PostingsFormat(name=Lucene41WithOrds), n_tdt1=PostingsFormat(name=Lucene41WithOrds), regex_dup_A_s=Pulsing41(freqCutoff=1 minBlockSize=58 maxBlockSize=183), price=Pulsing41(freqCutoff=1 minBlockSize=58 maxBlockSize=183), other_tl1=PostingsFormat(name=Lucene41WithOrds), n_l1=PostingsFormat(name=Lucene41WithOrds), a_si=PostingsFormat(name=MockRandom), inStock=Pulsing41(freqCutoff=1 minBlockSize=58 maxBlockSize=183)}, sim=DefaultSimilarity, locale=es_HN, timezone=Asia/Yakutsk
[junit4:junit4]   2> NOTE: Mac OS X 10.8.2 x86_64/Oracle Corporation 1.7.0_10 (64-bit)/cpus=2,threads=1,free=118563232,total=329318400
[junit4:junit4]   2> NOTE: All tests run in this JVM: [MBeansHandlerTest, TestLRUCache, XmlUpdateRequestHandlerTest, PrimitiveFieldTypeTest, TestDFRSimilarityFactory, LeaderElectionTest, TestWordDelimiterFilterFactory, TestStressVersions, SolrCoreCheckLockOnStartupTest, CoreAdminHandlerTest, IndexSchemaTest, TestSolrDeletionPolicy1, TestQueryUtils, BadComponentTest, TestFastWriter, TestReversedWildcardFilterFactory, TermsComponentTest, AlternateDirectoryTest, IndexSchemaRuntimeFieldTest, TestQuerySenderListener, TestSolrIndexConfig, QueryEqualityTest, NoCacheHeaderTest, SynonymTokenizerTest, TimeZoneUtilsTest, SystemInfoHandlerTest, DebugComponentTest, TestLMJelinekMercerSimilarityFactory, UUIDFieldTest, TestWriterPerf, FileUtilsTest, SimpleFacetsTest, TestBM25SimilarityFactory, TestSolrJ, CircularListTest, TestSurroundQueryParser, TestSolr4Spatial, TestSolrDeletionPolicy2, TestMultiCoreConfBootstrap, TestSolrXMLSerializer, DOMUtilTest, TestDistributedSearch, DistanceFunctionTest, SoftAutoCommitTest, DefaultValueUpdateProcessorTest, SpellCheckComponentTest, TestValueSourceCache, DirectSolrSpellCheckerTest, SearchHandlerTest, PingRequestHandlerTest, TestSystemIdResolver, TestPerFieldSimilarity, PrimUtilsTest, TestAtomicUpdateErrorCases, TestCollationField, DisMaxRequestHandlerTest, TestMergePolicyConfig, TestFoldingMultitermQuery, TestAnalyzedSuggestions, SyncSliceTest, TestDefaultSimilarityFactory, TestDocumentBuilder, CacheHeaderTest, SolrInfoMBeanTest, LukeRequestHandlerTest, MinimalSchemaTest, EchoParamsTest, TestPostingsSolrHighlighter, TestBinaryField, CoreContainerCoreInitFailuresTest, IndexBasedSpellCheckerTest, ZkNodePropsTest, TestCodecSupport, TestPluginEnable, QueryElevationComponentTest, QueryParsingTest, TestJmxIntegration, TestFastOutputStream, SuggesterTSTTest, SolrPluginUtilsTest, RegexBoostProcessorTest, PolyFieldTest, SchemaVersionSpecificBehaviorTest, TestStressReorder, XsltUpdateRequestHandlerTest, TestQuerySenderNoQuery, SolrIndexConfigTest, TestOmitPositions, ConvertedLegacyTest, TestFunctionQuery, RequestHandlersTest, SuggesterFSTTest, TestBadConfig, TestDistributedGrouping, TestSolrQueryParser, TestSuggestSpellingConverter, TestStressRecovery, TestFuzzyAnalyzedSuggestions, BasicDistributedZk2Test, HardAutoCommitTest, SolrCoreTest, PreAnalyzedFieldTest, TestSearchPerf, OverseerTest, ZkSolrClientTest, BadIndexSchemaTest, ShardRoutingCustomTest, JSONWriterTest, StandardRequestHandlerTest, TestXIncludeConfig, TestReload, TestLFUCache, RecoveryZkTest, TestPartialUpdateDeduplication, CollectionsAPIDistributedZkTest, HighlighterTest, NotRequiredUniqueKeyTest, TestIndexingPerformance, SuggesterWFSTTest, DistributedTermsComponentTest, TestJoin, TestSort, BasicDistributedZkTest]
[junit4:junit4] Completed in 371.17s, 1 test, 1 failure <<< FAILURES!

[...truncated 382 lines...]
BUILD FAILED
/Users/jenkins/jenkins-slave/workspace/Lucene-Solr-trunk-MacOSX/build.xml:346: The following error occurred while executing this line:
/Users/jenkins/jenkins-slave/workspace/Lucene-Solr-trunk-MacOSX/build.xml:39: The following error occurred while executing this line:
/Users/jenkins/jenkins-slave/workspace/Lucene-Solr-trunk-MacOSX/solr/build.xml:178: The following error occurred while executing this line:
/Users/jenkins/jenkins-slave/workspace/Lucene-Solr-trunk-MacOSX/solr/common-build.xml:428: The following error occurred while executing this line:
/Users/jenkins/jenkins-slave/workspace/Lucene-Solr-trunk-MacOSX/lucene/common-build.xml:1176: The following error occurred while executing this line:
/Users/jenkins/jenkins-slave/workspace/Lucene-Solr-trunk-MacOSX/lucene/common-build.xml:841: There were test failures: 249 suites, 1038 tests, 1 failure, 14 ignored (3 assumptions)

Total time: 67 minutes 16 seconds
Build step 'Invoke Ant' marked build as failure
Archiving artifacts
Recording test results
Description set: Java: 64bit/jdk1.7.0 -XX:+UseParallelGC
Email was triggered for: Failure
Sending email for trigger: Failure



Mime
View raw message