lucene-dev mailing list archives

Site index · List index
Message view « Date » · « Thread »
Top « Date » · « Thread »
From Apache Jenkins Server <jenk...@builds.apache.org>
Subject [JENKINS] Lucene-Solr-Tests-4.x-java7 - Build # 982 - Still Failing
Date Tue, 12 Feb 2013 00:35:11 GMT
Build: https://builds.apache.org/job/Lucene-Solr-Tests-4.x-java7/982/

1 tests failed.
FAILED:  org.apache.solr.cloud.SyncSliceTest.testDistribSearch

Error Message:
Test Setup Failure: shard1 should have just been set up to be inconsistent - but it's still consistent. Leader:http://127.0.0.1:30887/collection1skip list:[org.apache.solr.cloud.AbstractFullDistribZkTestBase$CloudJettyRunner@f99b5bcb, org.apache.solr.cloud.AbstractFullDistribZkTestBase$CloudJettyRunner@74e89965]

Stack Trace:
java.lang.AssertionError: Test Setup Failure: shard1 should have just been set up to be inconsistent - but it's still consistent. Leader:http://127.0.0.1:30887/collection1skip list:[org.apache.solr.cloud.AbstractFullDistribZkTestBase$CloudJettyRunner@f99b5bcb, org.apache.solr.cloud.AbstractFullDistribZkTestBase$CloudJettyRunner@74e89965]
	at __randomizedtesting.SeedInfo.seed([4B86B21B105277CA:CA603C03670D17F6]:0)
	at org.junit.Assert.fail(Assert.java:93)
	at org.junit.Assert.assertTrue(Assert.java:43)
	at org.junit.Assert.assertNotNull(Assert.java:526)
	at org.apache.solr.cloud.SyncSliceTest.doTest(SyncSliceTest.java:216)
	at org.apache.solr.BaseDistributedSearchTestCase.testDistribSearch(BaseDistributedSearchTestCase.java:794)
	at sun.reflect.NativeMethodAccessorImpl.invoke0(Native Method)
	at sun.reflect.NativeMethodAccessorImpl.invoke(NativeMethodAccessorImpl.java:57)
	at sun.reflect.DelegatingMethodAccessorImpl.invoke(DelegatingMethodAccessorImpl.java:43)
	at java.lang.reflect.Method.invoke(Method.java:601)
	at com.carrotsearch.randomizedtesting.RandomizedRunner.invoke(RandomizedRunner.java:1559)
	at com.carrotsearch.randomizedtesting.RandomizedRunner.access$600(RandomizedRunner.java:79)
	at com.carrotsearch.randomizedtesting.RandomizedRunner$6.evaluate(RandomizedRunner.java:737)
	at com.carrotsearch.randomizedtesting.RandomizedRunner$7.evaluate(RandomizedRunner.java:773)
	at com.carrotsearch.randomizedtesting.RandomizedRunner$8.evaluate(RandomizedRunner.java:787)
	at com.carrotsearch.randomizedtesting.rules.SystemPropertiesRestoreRule$1.evaluate(SystemPropertiesRestoreRule.java:53)
	at org.apache.lucene.util.TestRuleSetupTeardownChained$1.evaluate(TestRuleSetupTeardownChained.java:50)
	at org.apache.lucene.util.TestRuleFieldCacheSanity$1.evaluate(TestRuleFieldCacheSanity.java:51)
	at org.apache.lucene.util.AbstractBeforeAfterRule$1.evaluate(AbstractBeforeAfterRule.java:46)
	at com.carrotsearch.randomizedtesting.rules.SystemPropertiesInvariantRule$1.evaluate(SystemPropertiesInvariantRule.java:55)
	at org.apache.lucene.util.TestRuleThreadAndTestName$1.evaluate(TestRuleThreadAndTestName.java:49)
	at org.apache.lucene.util.TestRuleIgnoreAfterMaxFailures$1.evaluate(TestRuleIgnoreAfterMaxFailures.java:70)
	at org.apache.lucene.util.TestRuleMarkFailure$1.evaluate(TestRuleMarkFailure.java:48)
	at com.carrotsearch.randomizedtesting.rules.StatementAdapter.evaluate(StatementAdapter.java:36)
	at com.carrotsearch.randomizedtesting.ThreadLeakControl$StatementRunner.run(ThreadLeakControl.java:358)
	at com.carrotsearch.randomizedtesting.ThreadLeakControl.forkTimeoutingTask(ThreadLeakControl.java:782)
	at com.carrotsearch.randomizedtesting.ThreadLeakControl$3.evaluate(ThreadLeakControl.java:442)
	at com.carrotsearch.randomizedtesting.RandomizedRunner.runSingleTest(RandomizedRunner.java:746)
	at com.carrotsearch.randomizedtesting.RandomizedRunner$3.evaluate(RandomizedRunner.java:648)
	at com.carrotsearch.randomizedtesting.RandomizedRunner$4.evaluate(RandomizedRunner.java:682)
	at com.carrotsearch.randomizedtesting.RandomizedRunner$5.evaluate(RandomizedRunner.java:693)
	at com.carrotsearch.randomizedtesting.rules.StatementAdapter.evaluate(StatementAdapter.java:36)
	at com.carrotsearch.randomizedtesting.rules.SystemPropertiesRestoreRule$1.evaluate(SystemPropertiesRestoreRule.java:53)
	at org.apache.lucene.util.AbstractBeforeAfterRule$1.evaluate(AbstractBeforeAfterRule.java:46)
	at org.apache.lucene.util.TestRuleStoreClassName$1.evaluate(TestRuleStoreClassName.java:42)
	at com.carrotsearch.randomizedtesting.rules.SystemPropertiesInvariantRule$1.evaluate(SystemPropertiesInvariantRule.java:55)
	at com.carrotsearch.randomizedtesting.rules.NoShadowingOrOverridesOnMethodsRule$1.evaluate(NoShadowingOrOverridesOnMethodsRule.java:39)
	at com.carrotsearch.randomizedtesting.rules.NoShadowingOrOverridesOnMethodsRule$1.evaluate(NoShadowingOrOverridesOnMethodsRule.java:39)
	at com.carrotsearch.randomizedtesting.rules.StatementAdapter.evaluate(StatementAdapter.java:36)
	at org.apache.lucene.util.TestRuleAssertionsRequired$1.evaluate(TestRuleAssertionsRequired.java:43)
	at org.apache.lucene.util.TestRuleMarkFailure$1.evaluate(TestRuleMarkFailure.java:48)
	at org.apache.lucene.util.TestRuleIgnoreAfterMaxFailures$1.evaluate(TestRuleIgnoreAfterMaxFailures.java:70)
	at org.apache.lucene.util.TestRuleIgnoreTestSuites$1.evaluate(TestRuleIgnoreTestSuites.java:55)
	at com.carrotsearch.randomizedtesting.rules.StatementAdapter.evaluate(StatementAdapter.java:36)
	at com.carrotsearch.randomizedtesting.ThreadLeakControl$StatementRunner.run(ThreadLeakControl.java:358)
	at java.lang.Thread.run(Thread.java:722)




Build Log:
[...truncated 8800 lines...]
[junit4:junit4] Suite: org.apache.solr.cloud.SyncSliceTest
[junit4:junit4]   2> 0 T358 oas.BaseDistributedSearchTestCase.initHostContext Setting hostContext system property: /
[junit4:junit4]   2> 3 T358 oas.SolrTestCaseJ4.setUp ###Starting testDistribSearch
[junit4:junit4]   2> Creating dataDir: /usr/home/hudson/hudson-slave/workspace/Lucene-Solr-Tests-4.x-java7/solr/build/solr-core/test/J0/./solrtest-SyncSliceTest-1360627802691
[junit4:junit4]   2> 4 T358 oasc.ZkTestServer.run STARTING ZK TEST SERVER
[junit4:junit4]   2> 5 T359 oasc.ZkTestServer$ZKServerMain.runFromConfig Starting server
[junit4:junit4]   2> 7 T359 oazs.ZooKeeperServer.setTickTime tickTime set to 1000
[junit4:junit4]   2> 7 T359 oazs.ZooKeeperServer.setMinSessionTimeout minSessionTimeout set to -1
[junit4:junit4]   2> 7 T359 oazs.ZooKeeperServer.setMaxSessionTimeout maxSessionTimeout set to -1
[junit4:junit4]   2> 8 T359 oazs.NIOServerCnxnFactory.configure binding to port 0.0.0.0/0.0.0.0:0
[junit4:junit4]   2> 8 T359 oazsp.FileTxnSnapLog.save Snapshotting: 0x0 to /usr/home/hudson/hudson-slave/workspace/Lucene-Solr-Tests-4.x-java7/solr/build/solr-core/test/J0/./org.apache.solr.cloud.SyncSliceTest-1360627802691/zookeeper/server1/data/version-2/snapshot.0
[junit4:junit4]   2> 106 T358 oasc.ZkTestServer.run start zk server on port:47316
[junit4:junit4]   2> 106 T358 oaz.ZooKeeper.<init> Initiating client connection, connectString=127.0.0.1:47316 sessionTimeout=10000 watcher=org.apache.solr.common.cloud.ConnectionManager@1a1e7a57
[junit4:junit4]   2> 107 T358 oascc.ConnectionManager.waitForConnected Waiting for client to connect to ZooKeeper
[junit4:junit4]   2> 107 T364 oaz.ClientCnxn$SendThread.logStartConnect Opening socket connection to server localhost/127.0.0.1:47316. Will not attempt to authenticate using SASL (access denied ("javax.security.auth.AuthPermission" "getLoginConfiguration"))
[junit4:junit4]   2> 108 T364 oaz.ClientCnxn$SendThread.primeConnection Socket connection established to localhost/127.0.0.1:47316, initiating session
[junit4:junit4]   2> 108 T360 oazs.NIOServerCnxnFactory.run Accepted socket connection from /140.211.11.196:16501
[junit4:junit4]   2> 108 T360 oazs.ZooKeeperServer.processConnectRequest Client attempting to establish new session at /140.211.11.196:16501
[junit4:junit4]   2> 109 T362 oazsp.FileTxnLog.append Creating new log file: log.1
[junit4:junit4]   2> 111 T362 oazs.ZooKeeperServer.finishSessionInit Established session 0x13ccbbca2480000 with negotiated timeout 10000 for client /140.211.11.196:16501
[junit4:junit4]   2> 111 T364 oaz.ClientCnxn$SendThread.onConnected Session establishment complete on server localhost/127.0.0.1:47316, sessionid = 0x13ccbbca2480000, negotiated timeout = 10000
[junit4:junit4]   2> 112 T365 oascc.ConnectionManager.process Watcher org.apache.solr.common.cloud.ConnectionManager@1a1e7a57 name:ZooKeeperConnection Watcher:127.0.0.1:47316 got event WatchedEvent state:SyncConnected type:None path:null path:null type:None
[junit4:junit4]   2> 112 T358 oascc.ConnectionManager.waitForConnected Client is connected to ZooKeeper
[junit4:junit4]   2> 112 T358 oascc.SolrZkClient.makePath makePath: /solr
[junit4:junit4]   2> 116 T363 oazs.PrepRequestProcessor.pRequest2Txn Processed session termination for sessionid: 0x13ccbbca2480000
[junit4:junit4]   2> 124 T365 oaz.ClientCnxn$EventThread.run EventThread shut down
[junit4:junit4]   2> 124 T360 oazs.NIOServerCnxn.closeSock Closed socket connection for client /140.211.11.196:16501 which had sessionid 0x13ccbbca2480000
[junit4:junit4]   2> 124 T358 oaz.ZooKeeper.close Session: 0x13ccbbca2480000 closed
[junit4:junit4]   2> 125 T358 oaz.ZooKeeper.<init> Initiating client connection, connectString=127.0.0.1:47316/solr sessionTimeout=10000 watcher=org.apache.solr.common.cloud.ConnectionManager@598b9ab8
[junit4:junit4]   2> 126 T358 oascc.ConnectionManager.waitForConnected Waiting for client to connect to ZooKeeper
[junit4:junit4]   2> 126 T366 oaz.ClientCnxn$SendThread.logStartConnect Opening socket connection to server localhost/127.0.0.1:47316. Will not attempt to authenticate using SASL (access denied ("javax.security.auth.AuthPermission" "getLoginConfiguration"))
[junit4:junit4]   2> 126 T366 oaz.ClientCnxn$SendThread.primeConnection Socket connection established to localhost/127.0.0.1:47316, initiating session
[junit4:junit4]   2> 126 T360 oazs.NIOServerCnxnFactory.run Accepted socket connection from /140.211.11.196:51927
[junit4:junit4]   2> 127 T360 oazs.ZooKeeperServer.processConnectRequest Client attempting to establish new session at /140.211.11.196:51927
[junit4:junit4]   2> 128 T362 oazs.ZooKeeperServer.finishSessionInit Established session 0x13ccbbca2480001 with negotiated timeout 10000 for client /140.211.11.196:51927
[junit4:junit4]   2> 128 T366 oaz.ClientCnxn$SendThread.onConnected Session establishment complete on server localhost/127.0.0.1:47316, sessionid = 0x13ccbbca2480001, negotiated timeout = 10000
[junit4:junit4]   2> 128 T367 oascc.ConnectionManager.process Watcher org.apache.solr.common.cloud.ConnectionManager@598b9ab8 name:ZooKeeperConnection Watcher:127.0.0.1:47316/solr got event WatchedEvent state:SyncConnected type:None path:null path:null type:None
[junit4:junit4]   2> 129 T358 oascc.ConnectionManager.waitForConnected Client is connected to ZooKeeper
[junit4:junit4]   2> 129 T358 oascc.SolrZkClient.makePath makePath: /collections/collection1
[junit4:junit4]   2> 134 T358 oascc.SolrZkClient.makePath makePath: /collections/collection1/shards
[junit4:junit4]   2> 138 T358 oascc.SolrZkClient.makePath makePath: /collections/control_collection
[junit4:junit4]   2> 146 T358 oascc.SolrZkClient.makePath makePath: /collections/control_collection/shards
[junit4:junit4]   2> 150 T358 oasc.AbstractZkTestCase.putConfig put /usr/home/hudson/hudson-slave/workspace/Lucene-Solr-Tests-4.x-java7/solr/build/solr-core/test-files/solr/collection1/conf/solrconfig.xml to /configs/conf1/solrconfig.xml
[junit4:junit4]   2> 151 T358 oascc.SolrZkClient.makePath makePath: /configs/conf1/solrconfig.xml
[junit4:junit4]   2> 163 T358 oasc.AbstractZkTestCase.putConfig put /usr/home/hudson/hudson-slave/workspace/Lucene-Solr-Tests-4.x-java7/solr/build/solr-core/test-files/solr/collection1/conf/schema.xml to /configs/conf1/schema.xml
[junit4:junit4]   2> 164 T358 oascc.SolrZkClient.makePath makePath: /configs/conf1/schema.xml
[junit4:junit4]   2> 268 T358 oasc.AbstractZkTestCase.putConfig put /usr/home/hudson/hudson-slave/workspace/Lucene-Solr-Tests-4.x-java7/solr/build/solr-core/test-files/solr/collection1/conf/stopwords.txt to /configs/conf1/stopwords.txt
[junit4:junit4]   2> 269 T358 oascc.SolrZkClient.makePath makePath: /configs/conf1/stopwords.txt
[junit4:junit4]   2> 273 T358 oasc.AbstractZkTestCase.putConfig put /usr/home/hudson/hudson-slave/workspace/Lucene-Solr-Tests-4.x-java7/solr/build/solr-core/test-files/solr/collection1/conf/protwords.txt to /configs/conf1/protwords.txt
[junit4:junit4]   2> 273 T358 oascc.SolrZkClient.makePath makePath: /configs/conf1/protwords.txt
[junit4:junit4]   2> 282 T358 oasc.AbstractZkTestCase.putConfig put /usr/home/hudson/hudson-slave/workspace/Lucene-Solr-Tests-4.x-java7/solr/build/solr-core/test-files/solr/collection1/conf/currency.xml to /configs/conf1/currency.xml
[junit4:junit4]   2> 283 T358 oascc.SolrZkClient.makePath makePath: /configs/conf1/currency.xml
[junit4:junit4]   2> 287 T358 oasc.AbstractZkTestCase.putConfig put /usr/home/hudson/hudson-slave/workspace/Lucene-Solr-Tests-4.x-java7/solr/build/solr-core/test-files/solr/collection1/conf/open-exchange-rates.json to /configs/conf1/open-exchange-rates.json
[junit4:junit4]   2> 287 T358 oascc.SolrZkClient.makePath makePath: /configs/conf1/open-exchange-rates.json
[junit4:junit4]   2> 291 T358 oasc.AbstractZkTestCase.putConfig put /usr/home/hudson/hudson-slave/workspace/Lucene-Solr-Tests-4.x-java7/solr/build/solr-core/test-files/solr/collection1/conf/mapping-ISOLatin1Accent.txt to /configs/conf1/mapping-ISOLatin1Accent.txt
[junit4:junit4]   2> 291 T358 oascc.SolrZkClient.makePath makePath: /configs/conf1/mapping-ISOLatin1Accent.txt
[junit4:junit4]   2> 295 T358 oasc.AbstractZkTestCase.putConfig put /usr/home/hudson/hudson-slave/workspace/Lucene-Solr-Tests-4.x-java7/solr/build/solr-core/test-files/solr/collection1/conf/old_synonyms.txt to /configs/conf1/old_synonyms.txt
[junit4:junit4]   2> 296 T358 oascc.SolrZkClient.makePath makePath: /configs/conf1/old_synonyms.txt
[junit4:junit4]   2> 299 T358 oasc.AbstractZkTestCase.putConfig put /usr/home/hudson/hudson-slave/workspace/Lucene-Solr-Tests-4.x-java7/solr/build/solr-core/test-files/solr/collection1/conf/synonyms.txt to /configs/conf1/synonyms.txt
[junit4:junit4]   2> 300 T358 oascc.SolrZkClient.makePath makePath: /configs/conf1/synonyms.txt
[junit4:junit4]   2> 304 T363 oazs.PrepRequestProcessor.pRequest2Txn Processed session termination for sessionid: 0x13ccbbca2480001
[junit4:junit4]   2> 305 T367 oaz.ClientCnxn$EventThread.run EventThread shut down
[junit4:junit4]   2> 305 T360 oazs.NIOServerCnxn.closeSock Closed socket connection for client /140.211.11.196:51927 which had sessionid 0x13ccbbca2480001
[junit4:junit4]   2> 305 T358 oaz.ZooKeeper.close Session: 0x13ccbbca2480001 closed
[junit4:junit4]   2> 430 T358 oejs.Server.doStart jetty-8.1.8.v20121106
[junit4:junit4]   2> 434 T358 oejs.AbstractConnector.doStart Started SocketConnector@127.0.0.1:58841
[junit4:junit4]   2> 434 T358 oass.SolrDispatchFilter.init SolrDispatchFilter.init()
[junit4:junit4]   2> 435 T358 oasc.SolrResourceLoader.locateSolrHome JNDI not configured for solr (NoInitialContextEx)
[junit4:junit4]   2> 435 T358 oasc.SolrResourceLoader.locateSolrHome using system property solr.solr.home: /usr/home/hudson/hudson-slave/workspace/Lucene-Solr-Tests-4.x-java7/solr/build/solr-core/test/J0/./org.apache.solr.cloud.SyncSliceTest-controljetty-1360627802993
[junit4:junit4]   2> 435 T358 oasc.CoreContainer$Initializer.initialize looking for solr.xml: /usr/home/hudson/hudson-slave/workspace/Lucene-Solr-Tests-4.x-java7/solr/build/solr-core/test/J0/./org.apache.solr.cloud.SyncSliceTest-controljetty-1360627802993/solr.xml
[junit4:junit4]   2> 436 T358 oasc.CoreContainer.<init> New CoreContainer 1280617692
[junit4:junit4]   2> 436 T358 oasc.CoreContainer.load Loading CoreContainer using Solr Home: '/usr/home/hudson/hudson-slave/workspace/Lucene-Solr-Tests-4.x-java7/solr/build/solr-core/test/J0/./org.apache.solr.cloud.SyncSliceTest-controljetty-1360627802993/'
[junit4:junit4]   2> 437 T358 oasc.SolrResourceLoader.<init> new SolrResourceLoader for directory: '/usr/home/hudson/hudson-slave/workspace/Lucene-Solr-Tests-4.x-java7/solr/build/solr-core/test/J0/./org.apache.solr.cloud.SyncSliceTest-controljetty-1360627802993/'
[junit4:junit4]   2> 480 T358 oashc.HttpShardHandlerFactory.getParameter Setting socketTimeout to: 60000
[junit4:junit4]   2> 481 T358 oashc.HttpShardHandlerFactory.getParameter Setting urlScheme to: http://
[junit4:junit4]   2> 481 T358 oashc.HttpShardHandlerFactory.getParameter Setting connTimeout to: 15000
[junit4:junit4]   2> 481 T358 oashc.HttpShardHandlerFactory.getParameter Setting maxConnectionsPerHost to: 20
[junit4:junit4]   2> 482 T358 oashc.HttpShardHandlerFactory.getParameter Setting corePoolSize to: 0
[junit4:junit4]   2> 482 T358 oashc.HttpShardHandlerFactory.getParameter Setting maximumPoolSize to: 2147483647
[junit4:junit4]   2> 482 T358 oashc.HttpShardHandlerFactory.getParameter Setting maxThreadIdleTime to: 5
[junit4:junit4]   2> 483 T358 oashc.HttpShardHandlerFactory.getParameter Setting sizeOfQueue to: -1
[junit4:junit4]   2> 483 T358 oashc.HttpShardHandlerFactory.getParameter Setting fairnessPolicy to: false
[junit4:junit4]   2> 483 T358 oascsi.HttpClientUtil.createClient Creating new http client, config:maxConnectionsPerHost=20&maxConnections=10000&socketTimeout=60000&connTimeout=15000&retry=false
[junit4:junit4]   2> 501 T358 oasc.CoreContainer.load Registering Log Listener
[junit4:junit4]   2> 516 T358 oasc.CoreContainer.initZooKeeper Zookeeper client=127.0.0.1:47316/solr
[junit4:junit4]   2> 516 T358 oasc.ZkController.checkChrootPath zkHost includes chroot
[junit4:junit4]   2> 517 T358 oaz.ZooKeeper.<init> Initiating client connection, connectString=127.0.0.1:47316 sessionTimeout=60000 watcher=org.apache.solr.common.cloud.ConnectionManager@783598a7
[junit4:junit4]   2> 518 T358 oascc.ConnectionManager.waitForConnected Waiting for client to connect to ZooKeeper
[junit4:junit4]   2> 518 T377 oaz.ClientCnxn$SendThread.logStartConnect Opening socket connection to server localhost/127.0.0.1:47316. Will not attempt to authenticate using SASL (access denied ("javax.security.auth.AuthPermission" "getLoginConfiguration"))
[junit4:junit4]   2> 519 T377 oaz.ClientCnxn$SendThread.primeConnection Socket connection established to localhost/127.0.0.1:47316, initiating session
[junit4:junit4]   2> 519 T360 oazs.NIOServerCnxnFactory.run Accepted socket connection from /140.211.11.196:32444
[junit4:junit4]   2> 520 T360 oazs.ZooKeeperServer.processConnectRequest Client attempting to establish new session at /140.211.11.196:32444
[junit4:junit4]   2> 521 T362 oazs.ZooKeeperServer.finishSessionInit Established session 0x13ccbbca2480002 with negotiated timeout 20000 for client /140.211.11.196:32444
[junit4:junit4]   2> 521 T377 oaz.ClientCnxn$SendThread.onConnected Session establishment complete on server localhost/127.0.0.1:47316, sessionid = 0x13ccbbca2480002, negotiated timeout = 20000
[junit4:junit4]   2> 522 T378 oascc.ConnectionManager.process Watcher org.apache.solr.common.cloud.ConnectionManager@783598a7 name:ZooKeeperConnection Watcher:127.0.0.1:47316 got event WatchedEvent state:SyncConnected type:None path:null path:null type:None
[junit4:junit4]   2> 522 T358 oascc.ConnectionManager.waitForConnected Client is connected to ZooKeeper
[junit4:junit4]   2> 523 T363 oazs.PrepRequestProcessor.pRequest2Txn Processed session termination for sessionid: 0x13ccbbca2480002
[junit4:junit4]   2> 524 T378 oaz.ClientCnxn$EventThread.run EventThread shut down
[junit4:junit4]   2> 524 T360 oazs.NIOServerCnxn.closeSock Closed socket connection for client /140.211.11.196:32444 which had sessionid 0x13ccbbca2480002
[junit4:junit4]   2> 524 T358 oaz.ZooKeeper.close Session: 0x13ccbbca2480002 closed
[junit4:junit4]   2> 525 T358 oascsi.HttpClientUtil.createClient Creating new http client, config:maxConnections=500&maxConnectionsPerHost=16&socketTimeout=60000&connTimeout=15000
[junit4:junit4]   2> 535 T358 oaz.ZooKeeper.<init> Initiating client connection, connectString=127.0.0.1:47316/solr sessionTimeout=30000 watcher=org.apache.solr.common.cloud.ConnectionManager@7f8388eb
[junit4:junit4]   2> 536 T358 oascc.ConnectionManager.waitForConnected Waiting for client to connect to ZooKeeper
[junit4:junit4]   2> 536 T379 oaz.ClientCnxn$SendThread.logStartConnect Opening socket connection to server localhost/127.0.0.1:47316. Will not attempt to authenticate using SASL (access denied ("javax.security.auth.AuthPermission" "getLoginConfiguration"))
[junit4:junit4]   2> 536 T379 oaz.ClientCnxn$SendThread.primeConnection Socket connection established to localhost/127.0.0.1:47316, initiating session
[junit4:junit4]   2> 537 T360 oazs.NIOServerCnxnFactory.run Accepted socket connection from /140.211.11.196:64700
[junit4:junit4]   2> 537 T360 oazs.ZooKeeperServer.processConnectRequest Client attempting to establish new session at /140.211.11.196:64700
[junit4:junit4]   2> 538 T362 oazs.ZooKeeperServer.finishSessionInit Established session 0x13ccbbca2480003 with negotiated timeout 20000 for client /140.211.11.196:64700
[junit4:junit4]   2> 538 T379 oaz.ClientCnxn$SendThread.onConnected Session establishment complete on server localhost/127.0.0.1:47316, sessionid = 0x13ccbbca2480003, negotiated timeout = 20000
[junit4:junit4]   2> 539 T380 oascc.ConnectionManager.process Watcher org.apache.solr.common.cloud.ConnectionManager@7f8388eb name:ZooKeeperConnection Watcher:127.0.0.1:47316/solr got event WatchedEvent state:SyncConnected type:None path:null path:null type:None
[junit4:junit4]   2> 539 T358 oascc.ConnectionManager.waitForConnected Client is connected to ZooKeeper
[junit4:junit4]   2> 541 T363 oazs.PrepRequestProcessor.pRequest Got user-level KeeperException when processing sessionid:0x13ccbbca2480003 type:create cxid:0x2 zxid:0x1a txntype:-1 reqpath:n/a Error Path:/solr/overseer Error:KeeperErrorCode = NodeExists for /solr/overseer
[junit4:junit4]   2> 550 T358 oascc.SolrZkClient.makePath makePath: /live_nodes
[junit4:junit4]   2> 553 T358 oasc.ZkController.createEphemeralLiveNode Register node as live in ZooKeeper:/live_nodes/127.0.0.1:58841_
[junit4:junit4]   2> 554 T363 oazs.PrepRequestProcessor.pRequest Got user-level KeeperException when processing sessionid:0x13ccbbca2480003 type:delete cxid:0x8 zxid:0x1c txntype:-1 reqpath:n/a Error Path:/solr/live_nodes/127.0.0.1:58841_ Error:KeeperErrorCode = NoNode for /solr/live_nodes/127.0.0.1:58841_
[junit4:junit4]   2> 555 T358 oascc.SolrZkClient.makePath makePath: /live_nodes/127.0.0.1:58841_
[junit4:junit4]   2> 565 T358 oascc.SolrZkClient.makePath makePath: /overseer_elect/election
[junit4:junit4]   2> 579 T363 oazs.PrepRequestProcessor.pRequest Got user-level KeeperException when processing sessionid:0x13ccbbca2480003 type:delete cxid:0x16 zxid:0x21 txntype:-1 reqpath:n/a Error Path:/solr/overseer_elect/leader Error:KeeperErrorCode = NoNode for /solr/overseer_elect/leader
[junit4:junit4]   2> 580 T358 oascc.SolrZkClient.makePath makePath: /overseer_elect/leader
[junit4:junit4]   2> 585 T358 oasc.Overseer.start Overseer (id=89170103677485059-127.0.0.1:58841_-n_0000000000) starting
[junit4:junit4]   2> 586 T363 oazs.PrepRequestProcessor.pRequest Got user-level KeeperException when processing sessionid:0x13ccbbca2480003 type:create cxid:0x1b zxid:0x23 txntype:-1 reqpath:n/a Error Path:/solr/overseer Error:KeeperErrorCode = NodeExists for /solr/overseer
[junit4:junit4]   2> 587 T363 oazs.PrepRequestProcessor.pRequest Got user-level KeeperException when processing sessionid:0x13ccbbca2480003 type:create cxid:0x1c zxid:0x24 txntype:-1 reqpath:n/a Error Path:/solr/overseer Error:KeeperErrorCode = NodeExists for /solr/overseer
[junit4:junit4]   2> 596 T363 oazs.PrepRequestProcessor.pRequest Got user-level KeeperException when processing sessionid:0x13ccbbca2480003 type:create cxid:0x1d zxid:0x25 txntype:-1 reqpath:n/a Error Path:/solr/overseer Error:KeeperErrorCode = NodeExists for /solr/overseer
[junit4:junit4]   2> 597 T363 oazs.PrepRequestProcessor.pRequest Got user-level KeeperException when processing sessionid:0x13ccbbca2480003 type:create cxid:0x1e zxid:0x26 txntype:-1 reqpath:n/a Error Path:/solr/overseer Error:KeeperErrorCode = NodeExists for /solr/overseer
[junit4:junit4]   2> 605 T382 oasc.OverseerCollectionProcessor.run Process current queue of collection creations
[junit4:junit4]   2> 606 T358 oascc.SolrZkClient.makePath makePath: /clusterstate.json
[junit4:junit4]   2> 611 T358 oascc.ZkStateReader.createClusterStateWatchersAndUpdate Updating cluster state from ZooKeeper... 
[junit4:junit4]   2> 613 T381 oasc.Overseer$ClusterStateUpdater.run Starting to work on the main queue
[junit4:junit4]   2> 617 T383 oasc.CoreContainer.create Creating SolrCore 'collection1' using instanceDir: /usr/home/hudson/hudson-slave/workspace/Lucene-Solr-Tests-4.x-java7/solr/build/solr-core/test/J0/./org.apache.solr.cloud.SyncSliceTest-controljetty-1360627802993/collection1
[junit4:junit4]   2> 617 T383 oasc.ZkController.createCollectionZkNode Check for collection zkNode:control_collection
[junit4:junit4]   2> 618 T383 oasc.ZkController.createCollectionZkNode Collection zkNode exists
[junit4:junit4]   2> 618 T383 oasc.ZkController.readConfigName Load collection config from:/collections/control_collection
[junit4:junit4]   2> 620 T383 oasc.SolrResourceLoader.<init> new SolrResourceLoader for directory: '/usr/home/hudson/hudson-slave/workspace/Lucene-Solr-Tests-4.x-java7/solr/build/solr-core/test/J0/./org.apache.solr.cloud.SyncSliceTest-controljetty-1360627802993/collection1/'
[junit4:junit4]   2> 621 T383 oasc.SolrResourceLoader.replaceClassLoader Adding 'file:/usr/home/hudson/hudson-slave/workspace/Lucene-Solr-Tests-4.x-java7/solr/build/solr-core/test/J0/org.apache.solr.cloud.SyncSliceTest-controljetty-1360627802993/collection1/lib/README' to classloader
[junit4:junit4]   2> 621 T383 oasc.SolrResourceLoader.replaceClassLoader Adding 'file:/usr/home/hudson/hudson-slave/workspace/Lucene-Solr-Tests-4.x-java7/solr/build/solr-core/test/J0/org.apache.solr.cloud.SyncSliceTest-controljetty-1360627802993/collection1/lib/classes/' to classloader
[junit4:junit4]   2> 663 T383 oasc.SolrConfig.<init> Using Lucene MatchVersion: LUCENE_42
[junit4:junit4]   2> 717 T383 oasc.SolrConfig.<init> Loaded SolrConfig: solrconfig.xml
[junit4:junit4]   2> 818 T383 oass.IndexSchema.readSchema Reading Solr Schema
[junit4:junit4]   2> 824 T383 oass.IndexSchema.readSchema Schema name=test
[junit4:junit4]   2> 1470 T383 oass.OpenExchangeRatesOrgProvider.init Initialized with rates=open-exchange-rates.json, refreshInterval=1440.
[junit4:junit4]   2> 1482 T383 oass.IndexSchema.readSchema default search field in schema is text
[junit4:junit4]   2> 1487 T383 oass.IndexSchema.readSchema unique key field: id
[junit4:junit4]   2> 1520 T383 oass.FileExchangeRateProvider.reload Reloading exchange rates from file currency.xml
[junit4:junit4]   2> 1525 T383 oass.FileExchangeRateProvider.reload Reloading exchange rates from file currency.xml
[junit4:junit4]   2> 1529 T383 oass.OpenExchangeRatesOrgProvider.reload Reloading exchange rates from open-exchange-rates.json
[junit4:junit4]   2> 1531 T383 oass.OpenExchangeRatesOrgProvider.reload Reloading exchange rates from open-exchange-rates.json
[junit4:junit4]   2> 1533 T383 oasc.SolrCore.<init> [collection1] Opening new SolrCore at /usr/home/hudson/hudson-slave/workspace/Lucene-Solr-Tests-4.x-java7/solr/build/solr-core/test/J0/./org.apache.solr.cloud.SyncSliceTest-controljetty-1360627802993/collection1/, dataDir=./org.apache.solr.cloud.SyncSliceTest-1360627802691/control/data/
[junit4:junit4]   2> 1533 T383 oasc.JmxMonitoredMap.<init> JMX monitoring is enabled. Adding Solr mbeans to JMX Server: com.sun.jmx.mbeanserver.JmxMBeanServer@253725db
[junit4:junit4]   2> 1534 T383 oasc.SolrCore.initDirectoryFactory solr.NRTCachingDirectoryFactory
[junit4:junit4]   2> 1535 T383 oasc.CachingDirectoryFactory.get return new directory for /usr/home/hudson/hudson-slave/workspace/Lucene-Solr-Tests-4.x-java7/solr/build/solr-core/test/J0/./org.apache.solr.cloud.SyncSliceTest-1360627802691/control/data forceNew:false
[junit4:junit4]   2> 1535 T383 oasc.CachingDirectoryFactory.close Releasing directory:/usr/home/hudson/hudson-slave/workspace/Lucene-Solr-Tests-4.x-java7/solr/build/solr-core/test/J0/./org.apache.solr.cloud.SyncSliceTest-1360627802691/control/data
[junit4:junit4]   2> 1535 T383 oasc.SolrCore.getNewIndexDir New index directory detected: old=null new=./org.apache.solr.cloud.SyncSliceTest-1360627802691/control/data/index/
[junit4:junit4]   2> 1536 T383 oasc.SolrCore.initIndex WARNING [collection1] Solr index directory './org.apache.solr.cloud.SyncSliceTest-1360627802691/control/data/index' doesn't exist. Creating new index...
[junit4:junit4]   2> 1537 T383 oasc.CachingDirectoryFactory.get return new directory for /usr/home/hudson/hudson-slave/workspace/Lucene-Solr-Tests-4.x-java7/solr/build/solr-core/test/J0/./org.apache.solr.cloud.SyncSliceTest-1360627802691/control/data/index forceNew:false
[junit4:junit4]   2> 1568 T383 oasc.SolrDeletionPolicy.onCommit SolrDeletionPolicy.onCommit: commits:num=1
[junit4:junit4]   2> 		commit{dir=RateLimitedDirectoryWrapper(NRTCachingDirectory(org.apache.lucene.store.NIOFSDirectory@/usr/home/hudson/hudson-slave/workspace/Lucene-Solr-Tests-4.x-java7/solr/build/solr-core/test/J0/org.apache.solr.cloud.SyncSliceTest-1360627802691/control/data/index lockFactory=org.apache.lucene.store.NativeFSLockFactory@5070dd7c; maxCacheMB=48.0 maxMergeSizeMB=4.0)),segFN=segments_1,generation=1,filenames=[segments_1]
[junit4:junit4]   2> 1569 T383 oasc.SolrDeletionPolicy.updateCommits newest commit = 1[segments_1]
[junit4:junit4]   2> 1569 T383 oasc.CachingDirectoryFactory.close Releasing directory:/usr/home/hudson/hudson-slave/workspace/Lucene-Solr-Tests-4.x-java7/solr/build/solr-core/test/J0/./org.apache.solr.cloud.SyncSliceTest-1360627802691/control/data/index
[junit4:junit4]   2> 1570 T383 oasc.SolrCore.initWriters created xml: solr.XMLResponseWriter
[junit4:junit4]   2> 1571 T383 oasup.UpdateRequestProcessorChain.init inserting DistributedUpdateProcessorFactory into updateRequestProcessorChain "dedupe"
[junit4:junit4]   2> 1572 T383 oasup.UpdateRequestProcessorChain.init inserting DistributedUpdateProcessorFactory into updateRequestProcessorChain "dedupe-allfields"
[junit4:junit4]   2> 1572 T383 oasup.UpdateRequestProcessorChain.init inserting DistributedUpdateProcessorFactory into updateRequestProcessorChain "stored_sig"
[junit4:junit4]   2> 1572 T383 oasup.UpdateRequestProcessorChain.init inserting DistributedUpdateProcessorFactory into updateRequestProcessorChain "uniq-fields"
[junit4:junit4]   2> 1573 T383 oasup.UpdateRequestProcessorChain.init inserting DistributedUpdateProcessorFactory into updateRequestProcessorChain "distrib-dup-test-chain-implicit"
[junit4:junit4]   2> 1573 T383 oasc.RequestHandlers.initHandlersFromConfig adding lazy requestHandler: solr.ReplicationHandler
[junit4:junit4]   2> 1573 T383 oasc.RequestHandlers.initHandlersFromConfig created /replication: solr.ReplicationHandler
[junit4:junit4]   2> 1574 T383 oasc.RequestHandlers.initHandlersFromConfig created standard: solr.StandardRequestHandler
[junit4:junit4]   2> 1574 T383 oasc.RequestHandlers.initHandlersFromConfig created /get: solr.RealTimeGetHandler
[junit4:junit4]   2> 1574 T383 oasc.RequestHandlers.initHandlersFromConfig created dismax: solr.SearchHandler
[junit4:junit4]   2> 1575 T383 oasc.RequestHandlers.initHandlersFromConfig created mock: org.apache.solr.core.MockQuerySenderListenerReqHandler
[junit4:junit4]   2> 1575 T383 oasc.RequestHandlers.initHandlersFromConfig created /admin/: org.apache.solr.handler.admin.AdminHandlers
[junit4:junit4]   2> 1575 T383 oasc.RequestHandlers.initHandlersFromConfig created defaults: solr.StandardRequestHandler
[junit4:junit4]   2> 1576 T383 oasc.RequestHandlers.initHandlersFromConfig adding lazy requestHandler: solr.StandardRequestHandler
[junit4:junit4]   2> 1576 T383 oasc.RequestHandlers.initHandlersFromConfig created lazy: solr.StandardRequestHandler
[junit4:junit4]   2> 1576 T383 oasc.RequestHandlers.initHandlersFromConfig created /update: solr.UpdateRequestHandler
[junit4:junit4]   2> 1576 T383 oasc.RequestHandlers.initHandlersFromConfig created /terms: org.apache.solr.handler.component.SearchHandler
[junit4:junit4]   2> 1577 T383 oasc.RequestHandlers.initHandlersFromConfig created spellCheckCompRH: org.apache.solr.handler.component.SearchHandler
[junit4:junit4]   2> 1577 T383 oasc.RequestHandlers.initHandlersFromConfig created spellCheckCompRH_Direct: org.apache.solr.handler.component.SearchHandler
[junit4:junit4]   2> 1577 T383 oasc.RequestHandlers.initHandlersFromConfig created spellCheckWithWordbreak: org.apache.solr.handler.component.SearchHandler
[junit4:junit4]   2> 1578 T383 oasc.RequestHandlers.initHandlersFromConfig created spellCheckWithWordbreak_Direct: org.apache.solr.handler.component.SearchHandler
[junit4:junit4]   2> 1578 T383 oasc.RequestHandlers.initHandlersFromConfig created spellCheckCompRH1: org.apache.solr.handler.component.SearchHandler
[junit4:junit4]   2> 1578 T383 oasc.RequestHandlers.initHandlersFromConfig created mltrh: org.apache.solr.handler.component.SearchHandler
[junit4:junit4]   2> 1579 T383 oasc.RequestHandlers.initHandlersFromConfig created tvrh: org.apache.solr.handler.component.SearchHandler
[junit4:junit4]   2> 1579 T383 oasc.RequestHandlers.initHandlersFromConfig created /mlt: solr.MoreLikeThisHandler
[junit4:junit4]   2> 1580 T383 oasc.RequestHandlers.initHandlersFromConfig created /debug/dump: solr.DumpRequestHandler
[junit4:junit4]   2> 1588 T383 oashl.XMLLoader.init xsltCacheLifetimeSeconds=60
[junit4:junit4]   2> 1592 T383 oasc.SolrCore.initDeprecatedSupport WARNING solrconfig.xml uses deprecated <admin/gettableFiles>, Please update your config to use the ShowFileRequestHandler.
[junit4:junit4]   2> 1593 T383 oasc.SolrCore.initDeprecatedSupport WARNING adding ShowFileRequestHandler with hidden files: [SCHEMA.XML, OLD_SYNONYMS.TXT, STOPWORDS.TXT, PROTWORDS.TXT, OPEN-EXCHANGE-RATES.JSON, SYNONYMS.TXT, CURRENCY.XML, MAPPING-ISOLATIN1ACCENT.TXT]
[junit4:junit4]   2> 1595 T383 oasc.CachingDirectoryFactory.close Releasing directory:/usr/home/hudson/hudson-slave/workspace/Lucene-Solr-Tests-4.x-java7/solr/build/solr-core/test/J0/./org.apache.solr.cloud.SyncSliceTest-1360627802691/control/data
[junit4:junit4]   2> 1597 T383 oass.SolrIndexSearcher.<init> Opening Searcher@4a99e0e6 main
[junit4:junit4]   2> 1598 T383 oasu.CommitTracker.<init> Hard AutoCommit: disabled
[junit4:junit4]   2> 1598 T383 oasu.CommitTracker.<init> Soft AutoCommit: disabled
[junit4:junit4]   2> 1598 T383 oashc.SpellCheckComponent.inform Initializing spell checkers
[junit4:junit4]   2> 1642 T383 oass.DirectSolrSpellChecker.init init: {name=direct,classname=DirectSolrSpellChecker,field=lowerfilt,minQueryLength=3}
[junit4:junit4]   2> 1722 T384 oasc.SolrCore.registerSearcher [collection1] Registered new searcher Searcher@4a99e0e6 main{StandardDirectoryReader(segments_1:1)}
[junit4:junit4]   2> 1725 T383 oasc.ZkController.publish publishing core=collection1 state=down
[junit4:junit4]   2> 1725 T383 oasc.ZkController.publish numShards not found on descriptor - reading it from system property
[junit4:junit4]   2> 1726 T363 oazs.PrepRequestProcessor.pRequest Got user-level KeeperException when processing sessionid:0x13ccbbca2480003 type:create cxid:0x51 zxid:0x29 txntype:-1 reqpath:n/a Error Path:/solr/overseer/queue Error:KeeperErrorCode = NoNode for /solr/overseer/queue
[junit4:junit4]   2> 2119 T381 oascc.ZkStateReader.updateClusterState Updating cloud state from ZooKeeper... 
[junit4:junit4]   2> 2120 T381 oasc.Overseer$ClusterStateUpdater.updateState Update state numShards=1 message={
[junit4:junit4]   2> 	  "operation":"state",
[junit4:junit4]   2> 	  "numShards":"1",
[junit4:junit4]   2> 	  "shard":null,
[junit4:junit4]   2> 	  "roles":null,
[junit4:junit4]   2> 	  "state":"down",
[junit4:junit4]   2> 	  "core":"collection1",
[junit4:junit4]   2> 	  "collection":"control_collection",
[junit4:junit4]   2> 	  "node_name":"127.0.0.1:58841_",
[junit4:junit4]   2> 	  "base_url":"http://127.0.0.1:58841"}
[junit4:junit4]   2> 2120 T381 oasc.Overseer$ClusterStateUpdater.createCollection Create collection control_collection with numShards 1
[junit4:junit4]   2> 2121 T381 oasc.Overseer$ClusterStateUpdater.updateState Assigning new node to shard shard=shard1
[junit4:junit4]   2> 2121 T363 oazs.PrepRequestProcessor.pRequest Got user-level KeeperException when processing sessionid:0x13ccbbca2480003 type:create cxid:0x59 zxid:0x2c txntype:-1 reqpath:n/a Error Path:/solr/overseer/queue-work Error:KeeperErrorCode = NoNode for /solr/overseer/queue-work
[junit4:junit4]   2> 2146 T380 oascc.ZkStateReader$2.process A cluster state change: WatchedEvent state:SyncConnected type:NodeDataChanged path:/clusterstate.json, has occurred - updating... (live nodes size: 1)
[junit4:junit4]   2> 2740 T383 oasc.CoreContainer.registerCore registering core: collection1
[junit4:junit4]   2> 2740 T383 oasc.ZkController.register Register replica - core:collection1 address:http://127.0.0.1:58841 collection:control_collection shard:shard1
[junit4:junit4]   2> 2741 T383 oascc.SolrZkClient.makePath makePath: /collections/control_collection/leader_elect/shard1/election
[junit4:junit4]   2> 2761 T363 oazs.PrepRequestProcessor.pRequest Got user-level KeeperException when processing sessionid:0x13ccbbca2480003 type:delete cxid:0x73 zxid:0x36 txntype:-1 reqpath:n/a Error Path:/solr/collections/control_collection/leaders Error:KeeperErrorCode = NoNode for /solr/collections/control_collection/leaders
[junit4:junit4]   2> 2762 T383 oasc.ShardLeaderElectionContext.runLeaderProcess Running the leader process.
[junit4:junit4]   2> 2763 T363 oazs.PrepRequestProcessor.pRequest Got user-level KeeperException when processing sessionid:0x13ccbbca2480003 type:create cxid:0x74 zxid:0x37 txntype:-1 reqpath:n/a Error Path:/solr/overseer Error:KeeperErrorCode = NodeExists for /solr/overseer
[junit4:junit4]   2> 2772 T383 oasc.ShardLeaderElectionContext.waitForReplicasToComeUp Enough replicas found to continue.
[junit4:junit4]   2> 2772 T383 oasc.ShardLeaderElectionContext.runLeaderProcess I may be the new leader - try and sync
[junit4:junit4]   2> 2773 T383 oasc.SyncStrategy.sync Sync replicas to http://127.0.0.1:58841/collection1/
[junit4:junit4]   2> 2773 T383 oasc.SyncStrategy.syncReplicas Sync Success - now sync replicas to me
[junit4:junit4]   2> 2773 T383 oasc.SyncStrategy.syncToMe http://127.0.0.1:58841/collection1/ has no replicas
[junit4:junit4]   2> 2773 T383 oasc.ShardLeaderElectionContext.runLeaderProcess I am the new leader: http://127.0.0.1:58841/collection1/
[junit4:junit4]   2> 2774 T383 oascc.SolrZkClient.makePath makePath: /collections/control_collection/leaders/shard1
[junit4:junit4]   2> 2780 T363 oazs.PrepRequestProcessor.pRequest Got user-level KeeperException when processing sessionid:0x13ccbbca2480003 type:create cxid:0x7e zxid:0x3b txntype:-1 reqpath:n/a Error Path:/solr/overseer Error:KeeperErrorCode = NodeExists for /solr/overseer
[junit4:junit4]   2> 3653 T381 oascc.ZkStateReader.updateClusterState Updating cloud state from ZooKeeper... 
[junit4:junit4]   2> 3674 T380 oascc.ZkStateReader$2.process A cluster state change: WatchedEvent state:SyncConnected type:NodeDataChanged path:/clusterstate.json, has occurred - updating... (live nodes size: 1)
[junit4:junit4]   2> 3701 T383 oasc.ZkController.register We are http://127.0.0.1:58841/collection1/ and leader is http://127.0.0.1:58841/collection1/
[junit4:junit4]   2> 3701 T383 oasc.ZkController.register No LogReplay needed for core=collection1 baseURL=http://127.0.0.1:58841
[junit4:junit4]   2> 3701 T383 oasc.ZkController.checkRecovery I am the leader, no recovery necessary
[junit4:junit4]   2> 3701 T383 oasc.ZkController.publish publishing core=collection1 state=active
[junit4:junit4]   2> 3701 T383 oasc.ZkController.publish numShards not found on descriptor - reading it from system property
[junit4:junit4]   2> 3704 T383 oascc.ZkStateReader.updateClusterState Updating cloud state from ZooKeeper... 
[junit4:junit4]   2> 3705 T358 oass.SolrDispatchFilter.init user.dir=/usr/home/hudson/hudson-slave/workspace/Lucene-Solr-Tests-4.x-java7/solr/build/solr-core/test/J0
[junit4:junit4]   2> 3706 T358 oass.SolrDispatchFilter.init SolrDispatchFilter.init() done
[junit4:junit4]   2> 3706 T358 oascsi.HttpClientUtil.createClient Creating new http client, config:maxConnections=128&maxConnectionsPerHost=32&followRedirects=false
[junit4:junit4]   2> 3722 T358 oascsi.HttpClientUtil.createClient Creating new http client, config:
[junit4:junit4]   2> 3733 T358 oaz.ZooKeeper.<init> Initiating client connection, connectString=127.0.0.1:47316/solr sessionTimeout=10000 watcher=org.apache.solr.common.cloud.ConnectionManager@60ec3922
[junit4:junit4]   2> 3734 T358 oascc.ConnectionManager.waitForConnected Waiting for client to connect to ZooKeeper
[junit4:junit4]   2> 3734 T385 oaz.ClientCnxn$SendThread.logStartConnect Opening socket connection to server localhost/127.0.0.1:47316. Will not attempt to authenticate using SASL (access denied ("javax.security.auth.AuthPermission" "getLoginConfiguration"))
[junit4:junit4]   2> 3735 T385 oaz.ClientCnxn$SendThread.primeConnection Socket connection established to localhost/127.0.0.1:47316, initiating session
[junit4:junit4]   2> 3735 T360 oazs.NIOServerCnxnFactory.run Accepted socket connection from /140.211.11.196:45082
[junit4:junit4]   2> 3735 T360 oazs.ZooKeeperServer.processConnectRequest Client attempting to establish new session at /140.211.11.196:45082
[junit4:junit4]   2> 3737 T362 oazs.ZooKeeperServer.finishSessionInit Established session 0x13ccbbca2480004 with negotiated timeout 10000 for client /140.211.11.196:45082
[junit4:junit4]   2> 3737 T385 oaz.ClientCnxn$SendThread.onConnected Session establishment complete on server localhost/127.0.0.1:47316, sessionid = 0x13ccbbca2480004, negotiated timeout = 10000
[junit4:junit4]   2> 3737 T386 oascc.ConnectionManager.process Watcher org.apache.solr.common.cloud.ConnectionManager@60ec3922 name:ZooKeeperConnection Watcher:127.0.0.1:47316/solr got event WatchedEvent state:SyncConnected type:None path:null path:null type:None
[junit4:junit4]   2> 3738 T358 oascc.ConnectionManager.waitForConnected Client is connected to ZooKeeper
[junit4:junit4]   2> 3739 T358 oascc.ZkStateReader.createClusterStateWatchersAndUpdate Updating cluster state from ZooKeeper... 
[junit4:junit4]   2> 3742 T358 oasc.ChaosMonkey.monkeyLog monkey: init - expire sessions:true cause connection loss:true
[junit4:junit4]   2> 3903 T358 oejs.Server.doStart jetty-8.1.8.v20121106
[junit4:junit4]   2> 3906 T358 oejs.AbstractConnector.doStart Started SocketConnector@127.0.0.1:35520
[junit4:junit4]   2> 3907 T358 oass.SolrDispatchFilter.init SolrDispatchFilter.init()
[junit4:junit4]   2> 3907 T358 oasc.SolrResourceLoader.locateSolrHome JNDI not configured for solr (NoInitialContextEx)
[junit4:junit4]   2> 3907 T358 oasc.SolrResourceLoader.locateSolrHome using system property solr.solr.home: /usr/home/hudson/hudson-slave/workspace/Lucene-Solr-Tests-4.x-java7/solr/build/solr-core/test/J0/./org.apache.solr.cloud.SyncSliceTest-jetty1-1360627806429
[junit4:junit4]   2> 3908 T358 oasc.CoreContainer$Initializer.initialize looking for solr.xml: /usr/home/hudson/hudson-slave/workspace/Lucene-Solr-Tests-4.x-java7/solr/build/solr-core/test/J0/./org.apache.solr.cloud.SyncSliceTest-jetty1-1360627806429/solr.xml
[junit4:junit4]   2> 3908 T358 oasc.CoreContainer.<init> New CoreContainer 1795981258
[junit4:junit4]   2> 3909 T358 oasc.CoreContainer.load Loading CoreContainer using Solr Home: '/usr/home/hudson/hudson-slave/workspace/Lucene-Solr-Tests-4.x-java7/solr/build/solr-core/test/J0/./org.apache.solr.cloud.SyncSliceTest-jetty1-1360627806429/'
[junit4:junit4]   2> 3910 T358 oasc.SolrResourceLoader.<init> new SolrResourceLoader for directory: '/usr/home/hudson/hudson-slave/workspace/Lucene-Solr-Tests-4.x-java7/solr/build/solr-core/test/J0/./org.apache.solr.cloud.SyncSliceTest-jetty1-1360627806429/'
[junit4:junit4]   2> 3963 T358 oashc.HttpShardHandlerFactory.getParameter Setting socketTimeout to: 60000
[junit4:junit4]   2> 3964 T358 oashc.HttpShardHandlerFactory.getParameter Setting urlScheme to: http://
[junit4:junit4]   2> 3964 T358 oashc.HttpShardHandlerFactory.getParameter Setting connTimeout to: 15000
[junit4:junit4]   2> 3965 T358 oashc.HttpShardHandlerFactory.getParameter Setting maxConnectionsPerHost to: 20
[junit4:junit4]   2> 3965 T358 oashc.HttpShardHandlerFactory.getParameter Setting corePoolSize to: 0
[junit4:junit4]   2> 3966 T358 oashc.HttpShardHandlerFactory.getParameter Setting maximumPoolSize to: 2147483647
[junit4:junit4]   2> 3966 T358 oashc.HttpShardHandlerFactory.getParameter Setting maxThreadIdleTime to: 5
[junit4:junit4]   2> 3966 T358 oashc.HttpShardHandlerFactory.getParameter Setting sizeOfQueue to: -1
[junit4:junit4]   2> 3967 T358 oashc.HttpShardHandlerFactory.getParameter Setting fairnessPolicy to: false
[junit4:junit4]   2> 3967 T358 oascsi.HttpClientUtil.createClient Creating new http client, config:maxConnectionsPerHost=20&maxConnections=10000&socketTimeout=60000&connTimeout=15000&retry=false
[junit4:junit4]   2> 3986 T358 oasc.CoreContainer.load Registering Log Listener
[junit4:junit4]   2> 4004 T358 oasc.CoreContainer.initZooKeeper Zookeeper client=127.0.0.1:47316/solr
[junit4:junit4]   2> 4004 T358 oasc.ZkController.checkChrootPath zkHost includes chroot
[junit4:junit4]   2> 4005 T358 oaz.ZooKeeper.<init> Initiating client connection, connectString=127.0.0.1:47316 sessionTimeout=60000 watcher=org.apache.solr.common.cloud.ConnectionManager@13f1bd70
[junit4:junit4]   2> 4006 T358 oascc.ConnectionManager.waitForConnected Waiting for client to connect to ZooKeeper
[junit4:junit4]   2> 4006 T396 oaz.ClientCnxn$SendThread.logStartConnect Opening socket connection to server localhost/127.0.0.1:47316. Will not attempt to authenticate using SASL (access denied ("javax.security.auth.AuthPermission" "getLoginConfiguration"))
[junit4:junit4]   2> 4007 T396 oaz.ClientCnxn$SendThread.primeConnection Socket connection established to localhost/127.0.0.1:47316, initiating session
[junit4:junit4]   2> 4007 T360 oazs.NIOServerCnxnFactory.run Accepted socket connection from /140.211.11.196:46749
[junit4:junit4]   2> 4008 T360 oazs.ZooKeeperServer.processConnectRequest Client attempting to establish new session at /140.211.11.196:46749
[junit4:junit4]   2> 4010 T362 oazs.ZooKeeperServer.finishSessionInit Established session 0x13ccbbca2480005 with negotiated timeout 20000 for client /140.211.11.196:46749
[junit4:junit4]   2> 4010 T396 oaz.ClientCnxn$SendThread.onConnected Session establishment complete on server localhost/127.0.0.1:47316, sessionid = 0x13ccbbca2480005, negotiated timeout = 20000
[junit4:junit4]   2> 4010 T397 oascc.ConnectionManager.process Watcher org.apache.solr.common.cloud.ConnectionManager@13f1bd70 name:ZooKeeperConnection Watcher:127.0.0.1:47316 got event WatchedEvent state:SyncConnected type:None path:null path:null type:None
[junit4:junit4]   2> 4010 T358 oascc.ConnectionManager.waitForConnected Client is connected to ZooKeeper
[junit4:junit4]   2> 4012 T363 oazs.PrepRequestProcessor.pRequest2Txn Processed session termination for sessionid: 0x13ccbbca2480005
[junit4:junit4]   2> 4024 T397 oaz.ClientCnxn$EventThread.run EventThread shut down
[junit4:junit4]   2> 4024 T360 oazs.NIOServerCnxn.closeSock Closed socket connection for client /140.211.11.196:46749 which had sessionid 0x13ccbbca2480005
[junit4:junit4]   2> 4024 T358 oaz.ZooKeeper.close Session: 0x13ccbbca2480005 closed
[junit4:junit4]   2> 4024 T358 oascsi.HttpClientUtil.createClient Creating new http client, config:maxConnections=500&maxConnectionsPerHost=16&socketTimeout=60000&connTimeout=15000
[junit4:junit4]   2> 4036 T358 oaz.ZooKeeper.<init> Initiating client connection, connectString=127.0.0.1:47316/solr sessionTimeout=30000 watcher=org.apache.solr.common.cloud.ConnectionManager@aa3144b
[junit4:junit4]   2> 4037 T358 oascc.ConnectionManager.waitForConnected Waiting for client to connect to ZooKeeper
[junit4:junit4]   2> 4037 T398 oaz.ClientCnxn$SendThread.logStartConnect Opening socket connection to server localhost/127.0.0.1:47316. Will not attempt to authenticate using SASL (access denied ("javax.security.auth.AuthPermission" "getLoginConfiguration"))
[junit4:junit4]   2> 4038 T398 oaz.ClientCnxn$SendThread.primeConnection Socket connection established to localhost/127.0.0.1:47316, initiating session
[junit4:junit4]   2> 4038 T360 oazs.NIOServerCnxnFactory.run Accepted socket connection from /140.211.11.196:31170
[junit4:junit4]   2> 4038 T360 oazs.ZooKeeperServer.processConnectRequest Client attempting to establish new session at /140.211.11.196:31170
[junit4:junit4]   2> 4040 T362 oazs.ZooKeeperServer.finishSessionInit Established session 0x13ccbbca2480006 with negotiated timeout 20000 for client /140.211.11.196:31170
[junit4:junit4]   2> 4040 T398 oaz.ClientCnxn$SendThread.onConnected Session establishment complete on server localhost/127.0.0.1:47316, sessionid = 0x13ccbbca2480006, negotiated timeout = 20000
[junit4:junit4]   2> 4040 T399 oascc.ConnectionManager.process Watcher org.apache.solr.common.cloud.ConnectionManager@aa3144b name:ZooKeeperConnection Watcher:127.0.0.1:47316/solr got event WatchedEvent state:SyncConnected type:None path:null path:null type:None
[junit4:junit4]   2> 4040 T358 oascc.ConnectionManager.waitForConnected Client is connected to ZooKeeper
[junit4:junit4]   2> 4042 T363 oazs.PrepRequestProcessor.pRequest Got user-level KeeperException when processing sessionid:0x13ccbbca2480006 type:create cxid:0x1 zxid:0x49 txntype:-1 reqpath:n/a Error Path:/solr/overseer Error:KeeperErrorCode = NodeExists for /solr/overseer
[junit4:junit4]   2> 4043 T363 oazs.PrepRequestProcessor.pRequest Got user-level KeeperException when processing sessionid:0x13ccbbca2480006 type:create cxid:0x2 zxid:0x4a txntype:-1 reqpath:n/a Error Path:/solr/overseer Error:KeeperErrorCode = NodeExists for /solr/overseer
[junit4:junit4]   2> 4051 T358 oascc.ZkStateReader.createClusterStateWatchersAndUpdate Updating cluster state from ZooKeeper... 
[junit4:junit4]   2> 4053 T358 oasc.ZkController.createEphemeralLiveNode Register node as live in ZooKeeper:/live_nodes/127.0.0.1:35520_
[junit4:junit4]   2> 4054 T363 oazs.PrepRequestProcessor.pRequest Got user-level KeeperException when processing sessionid:0x13ccbbca2480006 type:delete cxid:0x9 zxid:0x4b txntype:-1 reqpath:n/a Error Path:/solr/live_nodes/127.0.0.1:35520_ Error:KeeperErrorCode = NoNode for /solr/live_nodes/127.0.0.1:35520_
[junit4:junit4]   2> 4055 T358 oascc.SolrZkClient.makePath makePath: /live_nodes/127.0.0.1:35520_
[junit4:junit4]   2> 4058 T380 oascc.ZkStateReader$2.process A cluster state change: WatchedEvent state:SyncConnected type:NodeChildrenChanged path:/live_nodes, has occurred - updating... (live nodes size: 1)
[junit4:junit4]   2> 4059 T386 oascc.ZkStateReader$3.process Updating live nodes... (2)
[junit4:junit4]   2> 4059 T399 oascc.ZkStateReader$3.process Updating live nodes... (2)
[junit4:junit4]   2> 4061 T380 oascc.ZkStateReader$3.process Updating live nodes... (2)
[junit4:junit4]   2> 4068 T400 oasc.CoreContainer.create Creating SolrCore 'collection1' using instanceDir: /usr/home/hudson/hudson-slave/workspace/Lucene-Solr-Tests-4.x-java7/solr/build/solr-core/test/J0/./org.apache.solr.cloud.SyncSliceTest-jetty1-1360627806429/collection1
[junit4:junit4]   2> 4069 T400 oasc.ZkController.createCollectionZkNode Check for collection zkNode:collection1
[junit4:junit4]   2> 4069 T400 oasc.ZkController.createCollectionZkNode Collection zkNode exists
[junit4:junit4]   2> 4069 T400 oasc.ZkController.readConfigName Load collection config from:/collections/collection1
[junit4:junit4]   2> 4071 T400 oasc.SolrResourceLoader.<init> new SolrResourceLoader for directory: '/usr/home/hudson/hudson-slave/workspace/Lucene-Solr-Tests-4.x-java7/solr/build/solr-core/test/J0/./org.apache.solr.cloud.SyncSliceTest-jetty1-1360627806429/collection1/'
[junit4:junit4]   2> 4072 T400 oasc.SolrResourceLoader.replaceClassLoader Adding 'file:/usr/home/hudson/hudson-slave/workspace/Lucene-Solr-Tests-4.x-java7/solr/build/solr-core/test/J0/org.apache.solr.cloud.SyncSliceTest-jetty1-1360627806429/collection1/lib/classes/' to classloader
[junit4:junit4]   2> 4073 T400 oasc.SolrResourceLoader.replaceClassLoader Adding 'file:/usr/home/hudson/hudson-slave/workspace/Lucene-Solr-Tests-4.x-java7/solr/build/solr-core/test/J0/org.apache.solr.cloud.SyncSliceTest-jetty1-1360627806429/collection1/lib/README' to classloader
[junit4:junit4]   2> 4122 T400 oasc.SolrConfig.<init> Using Lucene MatchVersion: LUCENE_42
[junit4:junit4]   2> 4190 T400 oasc.SolrConfig.<init> Loaded SolrConfig: solrconfig.xml
[junit4:junit4]   2> 4291 T400 oass.IndexSchema.readSchema Reading Solr Schema
[junit4:junit4]   2> 4298 T400 oass.IndexSchema.readSchema Schema name=test
[junit4:junit4]   2> 4729 T400 oass.OpenExchangeRatesOrgProvider.init Initialized with rates=open-exchange-rates.json, refreshInterval=1440.
[junit4:junit4]   2> 4737 T400 oass.IndexSchema.readSchema default search field in schema is text
[junit4:junit4]   2> 4740 T400 oass.IndexSchema.readSchema unique key field: id
[junit4:junit4]   2> 4759 T400 oass.FileExchangeRateProvider.reload Reloading exchange rates from file currency.xml
[junit4:junit4]   2> 4763 T400 oass.FileExchangeRateProvider.reload Reloading exchange rates from file currency.xml
[junit4:junit4]   2> 4767 T400 oass.OpenExchangeRatesOrgProvider.reload Reloading exchange rates from open-exchange-rates.json
[junit4:junit4]   2> 4768 T400 oass.OpenExchangeRatesOrgProvider.reload Reloading exchange rates from open-exchange-rates.json
[junit4:junit4]   2> 4770 T400 oasc.SolrCore.<init> [collection1] Opening new SolrCore at /usr/home/hudson/hudson-slave/workspace/Lucene-Solr-Tests-4.x-java7/solr/build/solr-core/test/J0/./org.apache.solr.cloud.SyncSliceTest-jetty1-1360627806429/collection1/, dataDir=./org.apache.solr.cloud.SyncSliceTest-1360627802691/jetty1/
[junit4:junit4]   2> 4770 T400 oasc.JmxMonitoredMap.<init> JMX monitoring is enabled. Adding Solr mbeans to JMX Server: com.sun.jmx.mbeanserver.JmxMBeanServer@253725db
[junit4:junit4]   2> 4770 T400 oasc.SolrCore.initDirectoryFactory solr.NRTCachingDirectoryFactory
[junit4:junit4]   2> 4771 T400 oasc.CachingDirectoryFactory.get return new directory for /usr/home/hudson/hudson-slave/workspace/Lucene-Solr-Tests-4.x-java7/solr/build/solr-core/test/J0/./org.apache.solr.cloud.SyncSliceTest-1360627802691/jetty1 forceNew:false
[junit4:junit4]   2> 4771 T400 oasc.CachingDirectoryFactory.close Releasing directory:/usr/home/hudson/hudson-slave/workspace/Lucene-Solr-Tests-4.x-java7/solr/build/solr-core/test/J0/./org.apache.solr.cloud.SyncSliceTest-1360627802691/jetty1
[junit4:junit4]   2> 4772 T400 oasc.SolrCore.getNewIndexDir New index directory detected: old=null new=./org.apache.solr.cloud.SyncSliceTest-1360627802691/jetty1/index/
[junit4:junit4]   2> 4772 T400 oasc.SolrCore.initIndex WARNING [collection1] Solr index directory './org.apache.solr.cloud.SyncSliceTest-1360627802691/jetty1/index' doesn't exist. Creating new index...
[junit4:junit4]   2> 4773 T400 oasc.CachingDirectoryFactory.get return new directory for /usr/home/hudson/hudson-slave/workspace/Lucene-Solr-Tests-4.x-java7/solr/build/solr-core/test/J0/./org.apache.solr.cloud.SyncSliceTest-1360627802691/jetty1/index forceNew:false
[junit4:junit4]   2> 4804 T400 oasc.SolrDeletionPolicy.onCommit SolrDeletionPolicy.onCommit: commits:num=1
[junit4:junit4]   2> 		commit{dir=RateLimitedDirectoryWrapper(NRTCachingDirectory(org.apache.lucene.store.NIOFSDirectory@/usr/home/hudson/hudson-slave/workspace/Lucene-Solr-Tests-4.x-java7/solr/build/solr-core/test/J0/org.apache.solr.cloud.SyncSliceTest-1360627802691/jetty1/index lockFactory=org.apache.lucene.store.NativeFSLockFactory@4457313e; maxCacheMB=48.0 maxMergeSizeMB=4.0)),segFN=segments_1,generation=1,filenames=[segments_1]
[junit4:junit4]   2> 4804 T400 oasc.SolrDeletionPolicy.updateCommits newest commit = 1[segments_1]
[junit4:junit4]   2> 4805 T400 oasc.CachingDirectoryFactory.close Releasing directory:/usr/home/hudson/hudson-slave/workspace/Lucene-Solr-Tests-4.x-java7/solr/build/solr-core/test/J0/./org.apache.solr.cloud.SyncSliceTest-1360627802691/jetty1/index
[junit4:junit4]   2> 4805 T400 oasc.SolrCore.initWriters created xml: solr.XMLResponseWriter
[junit4:junit4]   2> 4807 T400 oasup.UpdateRequestProcessorChain.init inserting DistributedUpdateProcessorFactory into updateRequestProcessorChain "dedupe"
[junit4:junit4]   2> 4807 T400 oasup.UpdateRequestProcessorChain.init inserting DistributedUpdateProcessorFactory into updateRequestProcessorChain "dedupe-allfields"
[junit4:junit4]   2> 4808 T400 oasup.UpdateRequestProcessorChain.init inserting DistributedUpdateProcessorFactory into updateRequestProcessorChain "stored_sig"
[junit4:junit4]   2> 4817 T400 oasup.UpdateRequestProcessorChain.init inserting DistributedUpdateProcessorFactory into updateRequestProcessorChain "uniq-fields"
[junit4:junit4]   2> 4818 T400 oasup.UpdateRequestProcessorChain.init inserting DistributedUpdateProcessorFactory into updateRequestProcessorChain "distrib-dup-test-chain-implicit"
[junit4:junit4]   2> 4818 T400 oasc.RequestHandlers.initHandlersFromConfig adding lazy requestHandler: solr.ReplicationHandler
[junit4:junit4]   2> 4818 T400 oasc.RequestHandlers.initHandlersFromConfig created /replication: solr.ReplicationHandler
[junit4:junit4]   2> 4819 T400 oasc.RequestHandlers.initHandlersFromConfig created standard: solr.StandardRequestHandler
[junit4:junit4]   2> 4819 T400 oasc.RequestHandlers.initHandlersFromConfig created /get: solr.RealTimeGetHandler
[junit4:junit4]   2> 4820 T400 oasc.RequestHandlers.initHandlersFromConfig created dismax: solr.SearchHandler
[junit4:junit4]   2> 4820 T400 oasc.RequestHandlers.initHandlersFromConfig created mock: org.apache.solr.core.MockQuerySenderListenerReqHandler
[junit4:junit4]   2> 4821 T400 oasc.RequestHandlers.initHandlersFromConfig created /admin/: org.apache.solr.handler.admin.AdminHandlers
[junit4:junit4]   2> 4821 T400 oasc.RequestHandlers.initHandlersFromConfig created defaults: solr.StandardRequestHandler
[junit4:junit4]   2> 4821 T400 oasc.RequestHandlers.initHandlersFromConfig adding lazy requestHandler: solr.StandardRequestHandler
[junit4:junit4]   2> 4822 T400 oasc.RequestHandlers.initHandlersFromConfig created lazy: solr.StandardRequestHandler
[junit4:junit4]   2> 4822 T400 oasc.RequestHandlers.initHandlersFromConfig created /update: solr.UpdateRequestHandler
[junit4:junit4]   2> 4823 T400 oasc.RequestHandlers.initHandlersFromConfig created /terms: org.apache.solr.handler.component.SearchHandler
[junit4:junit4]   2> 4823 T400 oasc.RequestHandlers.initHandlersFromConfig created spellCheckCompRH: org.apache.solr.handler.component.SearchHandler
[junit4:junit4]   2> 4824 T400 oasc.RequestHandlers.initHandlersFromConfig created spellCheckCompRH_Direct: org.apache.solr.handler.component.SearchHandler
[junit4:junit4]   2> 4824 T400 oasc.RequestHandlers.initHandlersFromConfig created spellCheckWithWordbreak: org.apache.solr.handler.component.SearchHandler
[junit4:junit4]   2> 4825 T400 oasc.RequestHandlers.initHandlersFromConfig created spellCheckWithWordbreak_Direct: org.apache.solr.handler.component.SearchHandler
[junit4:junit4]   2> 4825 T400 oasc.RequestHandlers.initHandlersFromConfig created spellCheckCompRH1: org.apache.solr.handler.component.SearchHandler
[junit4:junit4]   2> 4826 T400 oasc.RequestHandlers.initHandlersFromConfig created mltrh: org.apache.solr.handler.component.SearchHandler
[junit4:junit4]   2> 4827 T400 oasc.RequestHandlers.initHandlersFromConfig created tvrh: org.apache.solr.handler.component.SearchHandler
[junit4:junit4]   2> 4827 T400 oasc.RequestHandlers.initHandlersFromConfig created /mlt: solr.MoreLikeThisHandler
[junit4:junit4]   2> 4828 T400 oasc.RequestHandlers.initHandlersFromConfig created /debug/dump: solr.DumpRequestHandler
[junit4:junit4]   2> 4840 T400 oashl.XMLLoader.init xsltCacheLifetimeSeconds=60
[junit4:junit4]   2> 4844 T400 oasc.SolrCore.initDeprecatedSupport WARNING solrconfig.xml uses deprecated <admin/gettableFiles>, Please update your config to use the ShowFileRequestHandler.
[junit4:junit4]   2> 4846 T400 oasc.SolrCore.initDeprecatedSupport WARNING adding ShowFileRequestHandler with hidden files: [SCHEMA.XML, OLD_SYNONYMS.TXT, STOPWORDS.TXT, PROTWORDS.TXT, OPEN-EXCHANGE-RATES.JSON, SYNONYMS.TXT, CURRENCY.XML, MAPPING-ISOLATIN1ACCENT.TXT]
[junit4:junit4]   2> 4848 T400 oasc.CachingDirectoryFactory.close Releasing directory:/usr/home/hudson/hudson-slave/workspace/Lucene-Solr-Tests-4.x-java7/solr/build/solr-core/test/J0/./org.apache.solr.cloud.SyncSliceTest-1360627802691/jetty1
[junit4:junit4]   2> 4849 T400 oass.SolrIndexSearcher.<init> Opening Searcher@f71d8d7 main
[junit4:junit4]   2> 4850 T400 oasu.CommitTracker.<init> Hard AutoCommit: disabled
[junit4:junit4]   2> 4851 T400 oasu.CommitTracker.<init> Soft AutoCommit: disabled
[junit4:junit4]   2> 4851 T400 oashc.SpellCheckComponent.inform Initializing spell checkers
[junit4:junit4]   2> 4858 T400 oass.DirectSolrSpellChecker.init init: {name=direct,classname=DirectSolrSpellChecker,field=lowerfilt,minQueryLength=3}
[junit4:junit4]   2> 4908 T401 oasc.SolrCore.registerSearcher [collection1] Registered new searcher Searcher@f71d8d7 main{StandardDirectoryReader(segments_1:1)}
[junit4:junit4]   2> 4914 T400 oasc.ZkController.publish publishing core=collection1 state=down
[junit4:junit4]   2> 4915 T400 oasc.ZkController.publish numShards not found on descriptor - reading it from system property
[junit4:junit4]   2> 5188 T381 oascc.ZkStateReader.updateClusterState Updating cloud state from ZooKeeper... 
[junit4:junit4]   2> 5189 T381 oasc.Overseer$ClusterStateUpdater.updateState Update state numShards=1 message={
[junit4:junit4]   2> 	  "operation":"state",
[junit4:junit4]   2> 	  "numShards":"1",
[junit4:junit4]   2> 	  "shard":"shard1",
[junit4:junit4]   2> 	  "roles":null,
[junit4:junit4]   2> 	  "state":"active",
[junit4:junit4]   2> 	  "core":"collection1",
[junit4:junit4]   2> 	  "collection":"control_collection",
[junit4:junit4]   2> 	  "node_name":"127.0.0.1:58841_",
[junit4:junit4]   2> 	  "base_url":"http://127.0.0.1:58841"}
[junit4:junit4]   2> 5195 T381 oasc.Overseer$ClusterStateUpdater.updateState Update state numShards=1 message={
[junit4:junit4]   2> 	  "operation":"state",
[junit4:junit4]   2> 	  "numShards":"1",
[junit4:junit4]   2> 	  "shard":null,
[junit4:junit4]   2> 	  "roles":null,
[junit4:junit4]   2> 	  "state":"down",
[junit4:junit4]   2> 	  "core":"collection1",
[junit4:junit4]   2> 	  "collection":"collection1",
[junit4:junit4]   2> 	  "node_name":"127.0.0.1:35520_",
[junit4:junit4]   2> 	  "base_url":"http://127.0.0.1:35520"}
[junit4:junit4]   2> 5196 T381 oasc.Overseer$ClusterStateUpdater.createCollection Create collection collection1 with numShards 1
[junit4:junit4]   2> 5196 T381 oasc.Overseer$ClusterStateUpdater.updateState Assigning new node to shard shard=shard1
[junit4:junit4]   2> 5213 T386 oascc.ZkStateReader$2.process A cluster state change: WatchedEvent state:SyncConnected type:NodeDataChanged path:/clusterstate.json, has occurred - updating... (live nodes size: 2)
[junit4:junit4]   2> 5213 T399 oascc.ZkStateReader$2.process A cluster state change: WatchedEvent state:SyncConnected type:NodeDataChanged path:/clusterstate.json, has occurred - updating... (live nodes size: 2)
[junit4:junit4]   2> 5213 T380 oascc.ZkStateReader$2.process A cluster state change: WatchedEvent state:SyncConnected type:NodeDataChanged path:/clusterstate.json, has occurred - updating... (live nodes size: 2)
[junit4:junit4]   2> 5918 T400 oasc.CoreContainer.registerCore registering core: collection1
[junit4:junit4]   2> 5918 T400 oasc.ZkController.register Register replica - core:collection1 address:http://127.0.0.1:35520 collection:collection1 shard:shard1
[junit4:junit4]   2> 5919 T400 oascc.SolrZkClient.makePath makePath: /collections/collection1/leader_elect/shard1/election
[junit4:junit4]   2> 5972 T363 oazs.PrepRequestProcessor.pRequest Got user-level KeeperException when processing sessionid:0x13ccbbca2480006 type:delete cxid:0x45 zxid:0x5a txntype:-1 reqpath:n/a Error Path:/solr/collections/collection1/leaders Error:KeeperErrorCode = NoNode for /solr/collections/collection1/leaders
[junit4:junit4]   2> 5973 T400 oasc.ShardLeaderElectionContext.runLeaderProcess Running the leader process.
[junit4:junit4]   2> 5973 T363 oazs.PrepRequestProcessor.pRequest Got user-level KeeperException when processing sessionid:0x13ccbbca2480006 type:create cxid:0x46 zxid:0x5b txntype:-1 reqpath:n/a Error Path:/solr/overseer Error:KeeperErrorCode = NodeExists for /solr/overseer
[junit4:junit4]   2> 5983 T400 oasc.ShardLeaderElectionContext.waitForReplicasToComeUp Enough replicas found to continue.
[junit4:junit4]   2> 5983 T400 oasc.ShardLeaderElectionContext.runLeaderProcess I may be the new leader - try and sync
[junit4:junit4]   2> 5984 T400 oasc.SyncStrategy.sync Sync replicas to http://127.0.0.1:35520/collection1/
[junit4:junit4]   2> 5984 T400 oasc.SyncStrategy.syncReplicas Sync Success - now sync replicas to me
[junit4:junit4]   2> 5984 T400 oasc.SyncStrategy.syncToMe http://127.0.0.1:35520/collection1/ has no replicas
[junit4:junit4]   2> 5984 T400 oasc.ShardLeaderElectionContext.runLeaderProcess I am the new leader: http://127.0.0.1:35520/collection1/
[junit4:junit4]   2> 5985 T400 oascc.SolrZkClient.makePath makePath: /collections/collection1/leaders/shard1
[junit4:junit4]   2> 5991 T363 oazs.PrepRequestProcessor.pRequest Got user-level KeeperException when processing sessionid:0x13ccbbca2480006 type:create cxid:0x50 zxid:0x5f txntype:-1 reqpath:n/a Error Path:/solr/overseer Error:KeeperErrorCode = NodeExists for /solr/overseer
[junit4:junit4]   2> 6729 T381 oascc.ZkStateReader.updateClusterState Updating cloud state from ZooKeeper... 
[junit4:junit4]   2> 6749 T380 oascc.ZkStateReader$2.process A cluster state change: WatchedEvent state:SyncConnected type:NodeDataChanged path:/clusterstate.json, has occurred - updating... (live nodes size: 2)
[junit4:junit4]   2> 6749 T386 oascc.ZkStateReader$2.process A cluster state change: WatchedEvent state:SyncConnected type:NodeDataChanged path:/clusterstate.json, has occurred - updating... (live nodes size: 2)
[junit4:junit4]   2> 6749 T399 oascc.ZkStateReader$2.process A cluster state change: WatchedEvent state:SyncConnected type:NodeDataChanged path:/clusterstate.json, has occurred - updating... (live nodes size: 2)
[junit4:junit4]   2> 6765 T400 oasc.ZkController.register We are http://127.0.0.1:35520/collection1/ and leader is http://127.0.0.1:35520/collection1/
[junit4:junit4]   2> 6765 T400 oasc.ZkController.register No LogReplay needed for core=collection1 baseURL=http://127.0.0.1:35520
[junit4:junit4]   2> 6765 T400 oasc.ZkController.checkRecovery I am the leader, no recovery necessary
[junit4:junit4]   2> 6765 T400 oasc.ZkController.publish publishing core=collection1 state=active
[junit4:junit4]   2> 6765 T400 oasc.ZkController.publish numShards not found on descriptor - reading it from system property
[junit4:junit4]   2> 6767 T400 oascc.ZkStateReader.updateClusterState Updating cloud state from ZooKeeper... 
[junit4:junit4]   2> 6768 T358 oass.SolrDispatchFilter.init user.dir=/usr/home/hudson/hudson-slave/workspace/Lucene-Solr-Tests-4.x-java7/solr/build/solr-core/test/J0
[junit4:junit4]   2> 6768 T358 oass.SolrDispatchFilter.init SolrDispatchFilter.init() done
[junit4:junit4]   2> 6769 T358 oascsi.HttpClientUtil.createClient Creating new http client, config:maxConnections=128&maxConnectionsPerHost=32&followRedirects=false
[junit4:junit4]   2> 6960 T358 oejs.Server.doStart jetty-8.1.8.v20121106
[junit4:junit4]   2> 6963 T358 oejs.AbstractConnector.doStart Started SocketConnector@127.0.0.1:30887
[junit4:junit4]   2> 6964 T358 oass.SolrDispatchFilter.init SolrDispatchFilter.init()
[junit4:junit4]   2> 6964 T358 oasc.SolrResourceLoader.locateSolrHome JNDI not configured for solr (NoInitialContextEx)
[junit4:junit4]   2> 6964 T358 oasc.SolrResourceLoader.locateSolrHome using system property solr.solr.home: /usr/home/hudson/hudson-slave/workspace/Lucene-Solr-Tests-4.x-java7/solr/build/solr-core/test/J0/./org.apache.solr.cloud.SyncSliceTest-jetty2-1360627809472
[junit4:junit4]   2> 6965 T358 oasc.CoreContainer$Initializer.initialize looking for solr.xml: /usr/home/hudson/hudson-slave/workspace/Lucene-Solr-Tests-4.x-java7/solr/build/solr-core/test/J0/./org.apache.solr.cloud.SyncSliceTest-jetty2-1360627809472/solr.xml
[junit4:junit4]   2> 6965 T358 oasc.CoreContainer.<init> New CoreContainer 1208581270
[junit4:junit4]   2> 6966 T358 oasc.CoreContainer.load Loading CoreContainer using Solr Home: '/usr/home/hudson/hudson-slave/workspace/Lucene-Solr-Tests-4.x-java7/solr/build/solr-core/test/J0/./org.apache.solr.cloud.SyncSliceTest-jetty2-1360627809472/'
[junit4:junit4]   2> 6967 T358 oasc.SolrResourceLoader.<init> new SolrResourceLoader for directory: '/usr/home/hudson/hudson-slave/workspace/Lucene-Solr-Tests-4.x-java7/solr/build/solr-core/test/J0/./org.apache.solr.cloud.SyncSliceTest-jetty2-1360627809472/'
[junit4:junit4]   2> 7029 T358 oashc.HttpShardHandlerFactory.getParameter Setting socketTimeout to: 60000
[junit4:junit4]   2> 7029 T358 oashc.HttpShardHandlerFactory.getParameter Setting urlScheme to: http://
[junit4:junit4]   2> 7030 T358 oashc.HttpShardHandlerFactory.getParameter Setting connTimeout to: 15000
[junit4:junit4]   2> 7030 T358 oashc.HttpShardHandlerFactory.getParameter Setting maxConnectionsPerHost to: 20
[junit4:junit4]   2> 7031 T358 oashc.HttpShardHandlerFactory.getParameter Setting corePoolSize to: 0
[junit4:junit4]   2> 7031 T358 oashc.HttpShardHandlerFactory.getParameter Setting maximumPoolSize to: 2147483647
[junit4:junit4]   2> 7031 T358 oashc.HttpShardHandlerFactory.getParameter Setting maxThreadIdleTime to: 5
[junit4:junit4]   2> 7032 T358 oashc.HttpShardHandlerFactory.getParameter Setting sizeOfQueue to: -1
[junit4:junit4]   2> 7032 T358 oashc.HttpShardHandlerFactory.getParameter Setting fairnessPolicy to: false
[junit4:junit4]   2> 7033 T358 oascsi.HttpClientUtil.createClient Creating new http client, config:maxConnectionsPerHost=20&maxConnections=10000&socketTimeout=60000&connTimeout=15000&retry=false
[junit4:junit4]   2> 7058 T358 oasc.CoreContainer.load Registering Log Listener
[junit4:junit4]   2> 7071 T358 oasc.CoreContainer.initZooKeeper Zookeeper client=127.0.0.1:47316/solr
[junit4:junit4]   2> 7072 T358 oasc.ZkController.checkChrootPath zkHost includes chroot
[junit4:junit4]   2> 7072 T358 oaz.ZooKeeper.<init> Initiating client connection, connectString=127.0.0.1:47316 sessionTimeout=60000 watcher=org.apache.solr.common.cloud.ConnectionManager@55795341
[junit4:junit4]   2> 7073 T358 oascc.ConnectionManager.waitForConnected Waiting for client to connect to ZooKeeper
[junit4:junit4]   2> 7073 T411 oaz.ClientCnxn$SendThread.logStartConnect Opening socket connection to server localhost/127.0.0.1:47316. Will not attempt to authenticate using SASL (access denied ("javax.security.auth.AuthPermission" "getLoginConfiguration"))
[junit4:junit4]   2> 7074 T411 oaz.ClientCnxn$SendThread.primeConnection Socket connection established to localhost/127.0.0.1:47316, initiating session
[junit4:junit4]   2> 7074 T360 oazs.NIOServerCnxnFactory.run Accepted socket connection from /140.211.11.196:62903
[junit4:junit4]   2> 7074 T360 oazs.ZooKeeperServer.processConnectRequest Client attempting to establish new session at /140.211.11.196:62903
[junit4:junit4]   2> 7076 T362 oazs.ZooKeeperServer.finishSessionInit Established session 0x13ccbbca2480007 with negotiated timeout 20000 for client /140.211.11.196:62903
[junit4:junit4]   2> 7076 T411 oaz.ClientCnxn$SendThread.onConnected Session establishment complete on server localhost/127.0.0.1:47316, sessionid = 0x13ccbbca2480007, negotiated timeout = 20000
[junit4:junit4]   2> 7076 T412 oascc.ConnectionManager.process Watcher org.apache.solr.common.cloud.ConnectionManager@55795341 name:ZooKeeperConnection Watcher:127.0.0.1:47316 got event WatchedEvent state:SyncConnected type:None path:null path:null type:None
[junit4:junit4]   2> 7076 T358 oascc.ConnectionManager.waitForConnected Client is connected to ZooKeeper
[junit4:junit4]   2> 7077 T363 oazs.PrepRequestProcessor.pRequest2Txn Processed session termination for sessionid: 0x13ccbbca2480007
[junit4:junit4]   2> 7078 T412 oaz.ClientCnxn$EventThread.run EventThread shut down
[junit4:junit4]   2> 7078 T360 oazs.NIOServerCnxn.closeSock Closed socket connection for client /140.211.11.196:62903 which had sessionid 0x13ccbbca2480007
[junit4:junit4]   2> 7078 T358 oaz.ZooKeeper.close Session: 0x13ccbbca2480007 closed
[junit4:junit4]   2> 7079 T358 oascsi.HttpClientUtil.createClient Creating new http client, config:maxConnections=500&maxConnectionsPerHost=16&socketTimeout=60000&connTimeout=15000
[junit4:junit4]   2> 7088 T358 oaz.ZooKeeper.<init> Initiating client connection, connectString=127.0.0.1:47316/solr sessionTimeout=30000 watcher=org.apache.solr.common.cloud.ConnectionManager@65b4962e
[junit4:junit4]   2> 7089 T358 oascc.ConnectionManager.waitForConnected Waiting for client to connect to ZooKeeper
[junit4:junit4]   2> 7089 T413 oaz.ClientCnxn$SendThread.logStartConnect Opening socket connection to server localhost/127.0.0.1:47316. Will not attempt to authenticate using SASL (access denied ("javax.security.auth.AuthPermission" "getLoginConfiguration"))
[junit4:junit4]   2> 7090 T413 oaz.ClientCnxn$SendThread.primeConnection Socket connection established to localhost/127.0.0.1:47316, initiating session
[junit4:junit4]   2> 7090 T360 oazs.NIOServerCnxnFactory.run Accepted socket connection from /140.211.11.196:59894
[junit4:junit4]   2> 7090 T360 oazs.ZooKeeperServer.processConnectRequest Client attempting to establish new session at /140.211.11.196:59894
[junit4:junit4]   2> 7091 T362 oazs.ZooKeeperServer.finishSessionInit Established session 0x13ccbbca2480008 with negotiated timeout 20000 for client /140.211.11.196:59894
[junit4:junit4]   2> 7091 T413 oaz.ClientCnxn$SendThread.onConnected Session establishment complete on server localhost/127.0.0.1:47316, sessionid = 0x13ccbbca2480008, negotiated timeout = 20000
[junit4:junit4]   2> 7091 T414 oascc.ConnectionManager.process Watcher org.apache.solr.common.cloud.ConnectionManager@65b4962e name:ZooKeeperConnection Watcher:127.0.0.1:47316/solr got event WatchedEvent state:SyncConnected type:None path:null path:null type:None
[junit4:junit4]   2> 7092 T358 oascc.ConnectionManager.waitForConnected Client is connected to ZooKeeper
[junit4:junit4]   2> 7092 T363 oazs.PrepRequestProcessor.pRequest Got user-level KeeperException when processing sessionid:0x13ccbbca2480008 type:create cxid:0x1 zxid:0x6c txntype:-1 reqpath:n/a Error Path:/solr/overseer Error:KeeperErrorCode = NodeExists for /solr/overseer
[junit4:junit4]   2> 7094 T363 oazs.PrepRequestProcessor.pRequest Got user-level KeeperException when processing sessionid:0x13ccbbca2480008 type:create cxid:0x2 zxid:0x6d txntype:-1 reqpath:n/a Error Path:/solr/overseer Error:KeeperErrorCode = NodeExists for /solr/overseer
[junit4:junit4]   2> 7102 T358 oascc.ZkStateReader.createClusterStateWatchersAndUpdate Updating cluster state from ZooKeeper... 
[junit4:junit4]   2> 7104 T358 oasc.ZkController.createEphemeralLiveNode Register node as live in ZooKeeper:/live_nodes/127.0.0.1:30887_
[junit4:junit4]   2> 7105 T363 oazs.PrepRequestProcessor.pRequest Got user-level KeeperException when processing sessionid:0x13ccbbca2480008 type:delete cxid:0x9 zxid:0x6e txntype:-1 reqpath:n/a Error Path:/solr/live_nodes/127.0.0.1:30887_ Error:KeeperErrorCode = NoNode for /solr/live_nodes/127.0.0.1:30887_
[junit4:junit4]   2> 7105 T358 oascc.SolrZkClient.makePath makePath: /live_nodes/127.0.0.1:30887_
[junit4:junit4]   2> 7108 T399 oascc.ZkStateReader$2.process A cluster state change: WatchedEvent state:SyncConnected type:NodeChildrenChanged path:/live_nodes, has occurred - updating... (live nodes size: 2)
[junit4:junit4]   2> 7108 T380 oascc.ZkStateReader$2.process A cluster state change: WatchedEvent state:SyncConnected type:NodeChildrenChanged path:/live_nodes, has occurred - updating... (live nodes size: 2)
[junit4:junit4]   2> 7108 T386 oascc.ZkStateReader$2.process A cluster state change: WatchedEvent state:SyncConnected type:NodeChildrenChanged path:/live_nodes, has occurred - updating... (live nodes size: 2)
[junit4:junit4]   2> 7109 T414 oascc.ZkStateReader$3.process Updating live nodes... (3)
[junit4:junit4]   2> 7111 T399 oascc.ZkStateReader$3.process Updating live nodes... (3)
[junit4:junit4]   2> 7111 T380 oascc.ZkStateReader$3.process Updating live nodes... (3)
[junit4:junit4]   2> 7111 T386 oascc.ZkStateReader$3.process Updating live nodes... (3)
[junit4:junit4]   2> 7121 T415 oasc.CoreContainer.create Creating SolrCore 'collection1' using instanceDir: /usr/home/hudson/hudson-slave/workspace/Lucene-Solr-Tests-4.x-java7/solr/build/solr-core/test/J0/./org.apache.solr.cloud.SyncSliceTest-jetty2-1360627809472/collection1
[junit4:junit4]   2> 7121 T415 oasc.ZkController.createCollectionZkNode Check for collection zkNode:collection1
[junit4:junit4]   2> 7122 T415 oasc.ZkController.createCollectionZkNode Collection zkNode exists
[junit4:junit4]   2> 7122 T415 oasc.ZkController.readConfigName Load collection config from:/collections/collection1
[junit4:junit4]   2> 7123 T415 oasc.SolrResourceLoader.<init> new SolrResourceLoader for directory: '/usr/home/hudson/hudson-slave/workspace/Lucene-Solr-Tests-4.x-java7/solr/build/solr-core/test/J0/./org.apache.solr.cloud.SyncSliceTest-jetty2-1360627809472/collection1/'
[junit4:junit4]   2> 7124 T415 oasc.SolrResourceLoader.replaceClassLoader Adding 'file:/usr/home/hudson/hudson-slave/workspace/Lucene-Solr-Tests-4.x-java7/solr/build/solr-core/test/J0/org.apache.solr.cloud.SyncSliceTest-jetty2-1360627809472/collection1/lib/README' to classloader
[junit4:junit4]   2> 7124 T415 oasc.SolrResourceLoader.replaceClassLoader Adding 'file:/usr/home/hudson/hudson-slave/workspace/Lucene-Solr-Tests-4.x-java7/solr/build/solr-core/test/J0/org.apache.solr.cloud.SyncSliceTest-jetty2-1360627809472/collection1/lib/classes/' to classloader
[junit4:junit4]   2> 7163 T415 oasc.SolrConfig.<init> Using Lucene MatchVersion: LUCENE_42
[junit4:junit4]   2> 7213 T415 oasc.SolrConfig.<init> Loaded SolrConfig: solrconfig.xml
[junit4:junit4]   2> 7314 T415 oass.IndexSchema.readSchema Reading Solr Schema
[junit4:junit4]   2> 7319 T415 oass.IndexSchema.readSchema Schema name=test
[junit4:junit4]   2> 7755 T415 oass.OpenExchangeRatesOrgProvider.init Initialized with rates=open-exchange-rates.json, refreshInterval=1440.
[junit4:junit4]   2> 7764 T415 oass.IndexSchema.readSchema default search field in schema is text
[junit4:junit4]   2> 7767 T415 oass.IndexSchema.readSchema unique key field: id
[junit4:junit4]   2> 7782 T415 oass.FileExchangeRateProvider.reload Reloading exchange rates from file currency.xml
[junit4:junit4]   2> 7786 T415 oass.FileExchangeRateProvider.reload Reloading exchange rates from file currency.xml
[junit4:junit4]   2> 7790 T415 oass.OpenExchangeRatesOrgProvider.reload Reloading exchange rates from open-exchange-rates.json
[junit4:junit4]   2> 7791 T415 oass.OpenExchangeRatesOrgProvider.reload Reloading exchange rates from open-exchange-rates.json
[junit4:junit4]   2> 7792 T415 oasc.SolrCore.<init> [collection1] Opening new SolrCore at /usr/home/hudson/hudson-slave/workspace/Lucene-Solr-Tests-4.x-java7/solr/build/solr-core/test/J0/./org.apache.solr.cloud.SyncSliceTest-jetty2-1360627809472/collection1/, dataDir=./org.apache.solr.cloud.SyncSliceTest-1360627802691/jetty2/
[junit4:junit4]   2> 7793 T415 oasc.JmxMonitoredMap.<init> JMX monitoring is enabled. Adding Solr mbeans to JMX Server: com.sun.jmx.mbeanserver.JmxMBeanServer@253725db
[junit4:junit4]   2> 7793 T415 oasc.SolrCore.initDirectoryFactory solr.NRTCachingDirectoryFactory
[junit4:junit4]   2> 7794 T415 oasc.CachingDirectoryFactory.get return new directory for /usr/home/hudson/hudson-slave/workspace/Lucene-Solr-Tests-4.x-java7/solr/build/solr-core/test/J0/./org.apache.solr.cloud.SyncSliceTest-1360627802691/jetty2 forceNew:false
[junit4:junit4]   2> 7794 T415 oasc.CachingDirectoryFactory.close Releasing directory:/usr/home/hudson/hudson-slave/workspace/Lucene-Solr-Tests-4.x-java7/solr/build/solr-core/test/J0/./org.apache.solr.cloud.SyncSliceTest-1360627802691/jetty2
[junit4:junit4]   2> 7794 T415 oasc.SolrCore.getNewIndexDir New index directory detected: old=null new=./org.apache.solr.cloud.SyncSliceTest-1360627802691/jetty2/index/
[junit4:junit4]   2> 7795 T415 oasc.SolrCore.initIndex WARNING [collection1] Solr index directory './org.apache.solr.cloud.SyncSliceTest-1360627802691/jetty2/index' doesn't exist. Creating new index...
[junit4:junit4]   2> 7796 T415 oasc.CachingDirectoryFactory.get return new directory for /usr/home/hudson/hudson-slave/workspace/Lucene-Solr-Tests-4.x-java7/solr/build/solr-core/test/J0/./org.apache.solr.cloud.SyncSliceTest-1360627802691/jetty2/index forceNew:false
[junit4:junit4]   2> 7827 T415 oasc.SolrDeletionPolicy.onCommit SolrDeletionPolicy.onCommit: commits:num=1
[junit4:junit4]   2> 		commit{dir=RateLimitedDirectoryWrapper(NRTCachingDirectory(org.apache.lucene.store.NIOFSDirectory@/usr/home/hudson/hudson-slave/workspace/Lucene-Solr-Tests-4.x-java7/solr/build/solr-core/test/J0/org.apache.solr.cloud.SyncSliceTest-1360627802691/jetty2/index lockFactory=org.apache.lucene.store.NativeFSLockFactory@2c7dc8e3; maxCacheMB=48.0 maxMergeSizeMB=4.0)),segFN=segments_1,generation=1,filenames=[segments_1]
[junit4:junit4]   2> 7827 T415 oasc.SolrDeletionPolicy.updateCommits newest commit = 1[segments_1]
[junit4:junit4]   2> 7828 T415 oasc.CachingDirectoryFactory.close Releasing directory:/usr/home/hudson/hudson-slave/workspace/Lucene-Solr-Tests-4.x-java7/solr/build/solr-core/test/J0/./org.apache.solr.cloud.SyncSliceTest-1360627802691/jetty2/index
[junit4:junit4]   2> 7828 T415 oasc.SolrCore.initWriters created xml: solr.XMLResponseWriter
[junit4:junit4]   2> 7830 T415 oasup.UpdateRequestProcessorChain.init inserting DistributedUpdateProcessorFactory into updateRequestProcessorChain "dedupe"
[junit4:junit4]   2> 7830 T415 oasup.UpdateRequestProcessorChain.init inserting DistributedUpdateProcessorFactory into updateRequestProcessorChain "dedupe-allfields"
[junit4:junit4]   2> 7830 T415 oasup.UpdateRequestProcessorChain.init inserting DistributedUpdateProcessorFactory into updateRequestProcessorChain "stored_sig"
[junit4:junit4]   2> 7830 T415 oasup.UpdateRequestProcessorChain.init inserting DistributedUpdateProcessorFactory into updateRequestProcessorChain "uniq-fields"
[junit4:junit4]   2> 7831 T415 oasup.UpdateRequestProcessorChain.init inserting DistributedUpdateProcessorFactory into updateRequestProcessorChain "distrib-dup-test-chain-implicit"
[junit4:junit4]   2> 7831 T415 oasc.RequestHandlers.initHandlersFromConfig adding lazy requestHandler: solr.ReplicationHandler
[junit4:junit4]   2> 7831 T415 oasc.RequestHandlers.initHandlersFromConfig created /replication: solr.ReplicationHandler
[junit4:junit4]   2> 7832 T415 oasc.RequestHandlers.initHandlersFromConfig created standard: solr.StandardRequestHandler
[junit4:junit4]   2> 7832 T415 oasc.RequestHandlers.initHandlersFromConfig created /get: solr.RealTimeGetHandler
[junit4:junit4]   2> 7833 T415 oasc.RequestHandlers.initHandlersFromConfig created dismax: solr.SearchHandler
[junit4:junit4]   2> 7833 T415 oasc.RequestHandlers.initHandlersFromConfig created mock: org.apache.solr.core.MockQuerySenderListenerReqHandler
[junit4:junit4]   2> 7833 T415 oasc.RequestHandlers.initHandlersFromConfig created /admin/: org.apache.solr.handler.admin.AdminHandlers
[junit4:junit4]   2> 7834 T415 oasc.RequestHandlers.initHandlersFromConfig created defaults: solr.StandardRequestHandler
[junit4:junit4]   2> 7834 T415 oasc.RequestHandlers.initHandlersFromConfig adding lazy requestHandler: solr.StandardRequestHandler
[junit4:junit4]   2> 7834 T415 oasc.RequestHandlers.initHandlersFromConfig created lazy: solr.StandardRequestHandler
[junit4:junit4]   2> 7835 T415 oasc.RequestHandlers.initHandlersFromConfig created /update: solr.UpdateRequestHandler
[junit4:junit4]   2> 7835 T415 oasc.RequestHandlers.initHandlersFromConfig created /terms: org.apache.solr.handler.component.SearchHandler
[junit4:junit4]   2> 7835 T415 oasc.RequestHandlers.initHandlersFromConfig created spellCheckCompRH: org.apache.solr.handler.component.SearchHandler
[junit4:junit4]   2> 7836 T415 oasc.RequestHandlers.initHandlersFromConfig created spellCheckCompRH_Direct: org.apache.solr.handler.component.SearchHandler
[junit4:junit4]   2> 7836 T415 oasc.RequestHandlers.initHandlersFromConfig created spellCheckWithWordbreak: org.apache.solr.handler.component.SearchHandler
[junit4:junit4]   2> 7837 T415 oasc.RequestHandlers.initHandlersFromConfig created spellCheckWithWordbreak_Direct: org.apache.solr.handler.component.SearchHandler
[junit4:junit4]   2> 7837 T415 oasc.RequestHandlers.initHandlersFromConfig created spellCheckCompRH1: org.apache.solr.handler.component.SearchHandler
[junit4:junit4]   2> 7837 T415 oasc.RequestHandlers.initHandlersFromConfig created mltrh: org.apache.solr.handler.component.SearchHandler
[junit4:junit4]   2> 7838 T415 oasc.RequestHandlers.initHandlersFromConfig created tvrh: org.apache.solr.handler.component.SearchHandler
[junit4:junit4]   2> 7838 T415 oasc.RequestHandlers.initHandlersFromConfig created /mlt: solr.MoreLikeThisHandler
[junit4:junit4]   2> 7839 T415 oasc.RequestHandlers.initHandlersFromConfig created /debug/dump: solr.DumpRequestHandler
[junit4:junit4]   2> 7848 T415 oashl.XMLLoader.init xsltCacheLifetimeSeconds=60
[junit4:junit4]   2> 7851 T415 oasc.SolrCore.initDeprecatedSupport WARNING solrconfig.xml uses deprecated <admin/gettableFiles>, Please update your config to use the ShowFileRequestHandler.
[junit4:junit4]   2> 7852 T415 oasc.SolrCore.initDeprecatedSupport WARNING adding ShowFileRequestHandler with hidden files: [SCHEMA.XML, OLD_SYNONYMS.TXT, STOPWORDS.TXT, PROTWORDS.TXT, OPEN-EXCHANGE-RATES.JSON, SYNONYMS.TXT, CURRENCY.XML, MAPPING-ISOLATIN1ACCENT.TXT]
[junit4:junit4]   2> 7854 T415 oasc.CachingDirectoryFactory.close Releasing directory:/usr/home/hudson/hudson-slave/workspace/Lucene-Solr-Tests-4.x-java7/solr/build/solr-core/test/J0/./org.apache.solr.cloud.SyncSliceTest-1360627802691/jetty2
[junit4:junit4]   2> 7855 T415 oass.SolrIndexSearcher.<init> Opening Searcher@5693cfb7 main
[junit4:junit4]   2> 7856 T415 oasu.CommitTracker.<init> Hard AutoCommit: disabled
[junit4:junit4]   2> 7856 T415 oasu.CommitTracker.<init> Soft AutoCommit: disabled
[junit4:junit4]   2> 7856 T415 oashc.SpellCheckComponent.inform Initializing spell checkers
[junit4:junit4]   2> 7862 T415 oass.DirectSolrSpellChecker.init init: {name=direct,classname=DirectSolrSpellChecker,field=lowerfilt,minQueryLength=3}
[junit4:junit4]   2> 7908 T416 oasc.SolrCore.registerSearcher [collection1] Registered new searcher Searcher@5693cfb7 main{StandardDirectoryReader(segments_1:1)}
[junit4:junit4]   2> 7913 T415 oasc.ZkController.publish publishing core=collection1 state=down
[junit4:junit4]   2> 7913 T415 oasc.ZkController.publish numShards not found on descriptor - reading it from system property
[junit4:junit4]   2> 8262 T381 oascc.ZkStateReader.updateClusterState Updating cloud state from ZooKeeper... 
[junit4:junit4]   2> 8263 T381 oasc.Overseer$ClusterStateUpdater.updateState Update state numShards=1 message={
[junit4:junit4]   2> 	  "operation":"state",
[junit4:junit4]   2> 	  "numShards":"1",
[junit4:junit4]   2> 	  "shard":"shard1",
[junit4:junit4]   2> 	  "roles":null,
[junit4:junit4]   2> 	  "state":"active",
[junit4:junit4]   2> 	  "core":"collection1",
[junit4:junit4]   2> 	  "collection":"collection1",
[junit4:junit4]   2> 	  "node_name":"127.0.0.1:35520_",
[junit4:junit4]   2> 	  "base_url":"http://127.0.0.1:35520"}
[junit4:junit4]   2> 8268 T381 oasc.Overseer$ClusterStateUpdater.updateState Update state numShards=1 message={
[junit4:junit4]   2> 	  "operation":"state",
[junit4:junit4]   2> 	  "numShards":"1",
[junit4:junit4]   2> 	  "shard":null,
[junit4:junit4]   2> 	  "roles":null,
[junit4:junit4]   2> 	  "state":"down",
[junit4:junit4]   2> 	  "core":"collection1",
[junit4:junit4]   2> 	  "collection":"collection1",
[junit4:junit4]   2> 	  "node_name":"127.0.0.1:30887_",
[junit4:junit4]   2> 	  "base_url":"http://127.0.0.1:30887"}
[junit4:junit4]   2> 8268 T381 oasc.Overseer$ClusterStateUpdater.updateState Collection already exists with numShards=1
[junit4:junit4]   2> 8268 T381 oasc.Overseer$ClusterStateUpdater.updateState Assigning new node to shard shard=shard1
[junit4:junit4]   2> 8283 T399 oascc.ZkStateReader$2.process A cluster state change: WatchedEvent state:SyncConnected type:NodeDataChanged path:/clusterstate.json, has occurred - updating... (live nodes size: 3)
[junit4:junit4]   2> 8283 T386 oascc.ZkStateReader$2.process A cluster state change: WatchedEvent state:SyncConnected type:NodeDataChanged path:/clusterstate.json, has occurred - updating... (live nodes size: 3)
[junit4:junit4]   2> 8283 T380 oascc.ZkStateReader$2.process A cluster state change: WatchedEvent state:SyncConnected type:NodeDataChanged path:/clusterstate.json, has occurred - updating... (live nodes size: 3)
[junit4:junit4]   2> 8283 T414 oascc.ZkStateReader$2.process A cluster state change: WatchedEvent state:SyncConnected type:NodeDataChanged path:/clusterstate.json, has occurred - updating... (live nodes size: 3)
[junit4:junit4]   2> 8915 T415 oasc.CoreContainer.registerCore registering core: collection1
[junit4:junit4]   2> 8915 T415 oasc.ZkController.register Register replica - core:collection1 address:http://127.0.0.1:30887 collection:collection1 shard:shard1
[junit4:junit4]   2> 8920 T415 oasc.ZkController.register We are http://127.0.0.1:30887/collection1/ and leader is http://127.0.0.1:35520/collection1/
[junit4:junit4]   2> 8920 T415 oasc.ZkController.register No LogReplay needed for core=collection1 baseURL=http://127.0.0.1:30887
[junit4:junit4]   2> 8920 T415 oasc.ZkController.checkRecovery Core needs to recover:collection1
[junit4:junit4]   2> 8920 T415 oasu.DefaultSolrCoreState.doRecovery Running recovery - first canceling any ongoing recovery
[junit4:junit4]   2> ASYNC  NEW_CORE C19 name=collection1 org.apache.solr.core.SolrCore@3b6fd432 url=http://127.0.0.1:30887/collection1 node=127.0.0.1:30887_ C19_STATE=coll:collection1 core:collection1 props:{shard=null, roles=null, state=down, core=collection1, collection=collection1, node_name=127.0.0.1:30887_, base_url=http://127.0.0.1:30887}
[junit4:junit4]   2> 8925 T417 C19 P30887 oasc.RecoveryStrategy.run Starting recovery process.  core=collection1 recoveringAfterStartup=true
[junit4:junit4]   2> 8926 T415 oascc.ZkStateReader.updateClusterState Updating cloud state from ZooKeeper... 
[junit4:junit4]   2> 8926 T417 C19 P30887 oasc.RecoveryStrategy.doRecovery ###### startupVersions=[]
[junit4:junit4]   2> 8927 T417 C19 P30887 oasc.ZkController.publish publishing core=collection1 state=recovering
[junit4:junit4]   2> 8927 T417 C19 P30887 oasc.ZkController.publish numShards not found on descriptor - reading it from system property
[junit4:junit4]   2> 8927 T358 oass.SolrDispatchFilter.init user.dir=/usr/home/hudson/hudson-slave/workspace/Lucene-Solr-Tests-4.x-java7/solr/build/solr-core/test/J0
[junit4:junit4]   2> 8928 T358 oass.SolrDispatchFilter.init SolrDispatchFilter.init() done
[junit4:junit4]   2> 8928 T358 oascsi.HttpClientUtil.createClient Creating new http client, config:maxConnections=128&maxConnectionsPerHost=32&followRedirects=false
[junit4:junit4]   2> 8929 T417 C19 P30887 oascsi.HttpClientUtil.createClient Creating new http client, config:maxConnections=128&maxConnectionsPerHost=32&followRedirects=false
[junit4:junit4]   2> 9142 T358 oejs.Server.doStart jetty-8.1.8.v20121106
[junit4:junit4]   2> 9145 T358 oejs.AbstractConnector.doStart Started SocketConnector@127.0.0.1:41235
[junit4:junit4]   2> 9146 T358 oass.SolrDispatchFilter.init SolrDispatchFilter.init()
[junit4:junit4]   2> 9147 T358 oasc.SolrResourceLoader.locateSolrHome JNDI not configured for solr (NoInitialContextEx)
[junit4:junit4]   2> 9147 T358 oasc.SolrResourceLoader.locateSolrHome using system property solr.solr.home: /usr/home/hudson/hudson-slave/workspace/Lucene-Solr-Tests-4.x-java7/solr/build/solr-core/test/J0/./org.apache.solr.cloud.SyncSliceTest-jetty3-1360627811635
[junit4:junit4]   2> 9148 T358 oasc.CoreContainer$Initializer.initialize looking for solr.xml: /usr/home/hudson/hudson-slave/workspace/Lucene-Solr-Tests-4.x-java7/solr/build/solr-core/test/J0/./org.apache.solr.cloud.SyncSliceTest-jetty3-1360627811635/solr.xml
[junit4:junit4]   2> 9148 T358 oasc.CoreContainer.<init> New CoreContainer 487070633
[junit4:junit4]   2> 9149 T358 oasc.CoreContainer.load Loading CoreContainer using Solr Home: '/usr/home/hudson/hudson-slave/workspace/Lucene-Solr-Tests-4.x-java7/solr/build/solr-core/test/J0/./org.apache.solr.cloud.SyncSliceTest-jetty3-1360627811635/'
[junit4:junit4]   2> 9149 T358 oasc.SolrResourceLoader.<init> new SolrResourceLoader for directory: '/usr/home/hudson/hudson-slave/workspace/Lucene-Solr-Tests-4.x-java7/solr/build/solr-core/test/J0/./org.apache.solr.cloud.SyncSliceTest-jetty3-1360627811635/'
[junit4:junit4]   2> 9220 T358 oashc.HttpShardHandlerFactory.getParameter Setting socketTimeout to: 60000
[junit4:junit4]   2> 9221 T358 oashc.HttpShardHandlerFactory.getParameter Setting urlScheme to: http://
[junit4:junit4]   2> 9221 T358 oashc.HttpShardHandlerFactory.getParameter Setting connTimeout to: 15000
[junit4:junit4]   2> 9221 T358 oashc.HttpShardHandlerFactory.getParameter Setting maxConnectionsPerHost to: 20
[junit4:junit4]   2> 9222 T358 oashc.HttpShardHandlerFactory.getParameter Setting corePoolSize to: 0
[junit4:junit4]   2> 9222 T358 oashc.HttpShardHandlerFactory.getParameter Setting maximumPoolSize to: 2147483647
[junit4:junit4]   2> 9223 T358 oashc.HttpShardHandlerFactory.getParameter Setting maxThreadIdleTime to: 5
[junit4:junit4]   2> 9223 T358 oashc.HttpShardHandlerFactory.getParameter Setting sizeOfQueue to: -1
[junit4:junit4]   2> 9224 T358 oashc.HttpShardHandlerFactory.getParameter Setting fairnessPolicy to: false
[junit4:junit4]   2> 9224 T358 oascsi.HttpClientUtil.createClient Creating new http client, config:maxConnectionsPerHost=20&maxConnections=10000&socketTimeout=60000&connTimeout=15000&retry=false
[junit4:junit4]   2> 9249 T358 oasc.CoreContainer.load Registering Log Listener
[junit4:junit4]   2> 9270 T358 oasc.CoreContainer.initZooKeeper Zookeeper client=127.0.0.1:47316/solr
[junit4:junit4]   2> 9271 T358 oasc.ZkController.checkChrootPath zkHost includes chroot
[junit4:junit4]   2> 9271 T358 oaz.ZooKeeper.<init> Initiating client connection, connectString=127.0.0.1:47316 sessionTimeout=60000 watcher=org.apache.solr.common.cloud.ConnectionManager@541d6944
[junit4:junit4]   2> 9272 T358 oascc.ConnectionManager.waitForConnected Waiting for client to connect to ZooKeeper
[junit4:junit4]   2> 9273 T427 oaz.ClientCnxn$SendThread.logStartConnect Opening socket connection to server localhost/127.0.0.1:47316. Will not attempt to authenticate using SASL (access denied ("javax.security.auth.AuthPermission" "getLoginConfiguration"))
[junit4:junit4]   2> 9274 T427 oaz.ClientCnxn$SendThread.primeConnection Socket connection established to localhost/127.0.0.1:47316, initiating session
[junit4:junit4]   2> 9274 T360 oazs.NIOServerCnxnFactory.run Accepted socket connection from /140.211.11.196:14764
[junit4:junit4]   2> 9274 T360 oazs.ZooKeeperServer.processConnectRequest Client attempting to establish new session at /140.211.11.196:14764
[junit4:junit4]   2> 9277 T362 oazs.ZooKeeperServer.finishSessionInit Established session 0x13ccbbca2480009 with negotiated timeout 20000 for client /140.211.11.196:14764
[junit4:junit4]   2> 9277 T427 oaz.ClientCnxn$SendThread.onConnected Session establishment complete on server localhost/127.0.0.1:47316, sessionid = 0x13ccbbca2480009, negotiated timeout = 20000
[junit4:junit4]   2> 9277 T428 oascc.ConnectionManager.process Watcher org.apache.solr.common.cloud.ConnectionManager@541d6944 name:ZooKeeperConnection Watcher:127.0.0.1:47316 got event WatchedEvent state:SyncConnected type:None path:null path:null type:None
[junit4:junit4]   2> 9277 T358 oascc.ConnectionManager.waitForConnected Client is connected to ZooKeeper
[junit4:junit4]   2> 9279 T363 oazs.PrepRequestProcessor.pRequest2Txn Processed session termination for sessionid: 0x13ccbbca2480009
[junit4:junit4]   2> 9293 T428 oaz.ClientCnxn$EventThread.run EventThread shut down
[junit4:junit4]   2> 9293 T360 oazs.NIOServerCnxn.closeSock Closed socket connection for client /140.211.11.196:14764 which had sessionid 0x13ccbbca2480009
[junit4:junit4]   2> 9293 T358 oaz.ZooKeeper.close Session: 0x13ccbbca2480009 closed
[junit4:junit4]   2> 9294 T358 oascsi.HttpClientUtil.createClient Creating new http client, config:maxConnections=500&maxConnectionsPerHost=16&socketTimeout=60000&connTimeout=15000
[junit4:junit4]   2> 9308 T358 oaz.ZooKeeper.<init> Initiating client connection, connectString=127.0.0.1:47316/solr sessionTimeout=30000 watcher=org.apache.solr.common.cloud.ConnectionManager@386a17f7
[junit4:junit4]   2> 9309 T358 oascc.ConnectionManager.waitForConnected Waiting for client to connect to ZooKeeper
[junit4:junit4]   2> 9309 T429 oaz.ClientCnxn$SendThread.logStartConnect Opening socket connection to server localhost/127.0.0.1:47316. Will not attempt to authenticate using SASL (access denied ("javax.security.auth.AuthPermission" "getLoginConfiguration"))
[junit4:junit4]   2> 9310 T429 oaz.ClientCnxn$SendThread.primeConnection Socket connection established to localhost/127.0.0.1:47316, initiating session
[junit4:junit4]   2> 9310 T360 oazs.NIOServerCnxnFactory.run Accepted socket connection from /140.211.11.196:58204
[junit4:junit4]   2> 9310 T360 oazs.ZooKeeperServer.processConnectRequest Client attempting to establish new session at /140.211.11.196:58204
[junit4:junit4]   2> 9312 T362 oazs.ZooKeeperServer.finishSessionInit Established session 0x13ccbbca248000a with negotiated timeout 20000 for client /140.211.11.196:58204
[junit4:junit4]   2> 9312 T429 oaz.ClientCnxn$SendThread.onConnected Session establishment complete on server localhost/127.0.0.1:47316, sessionid = 0x13ccbbca248000a, negotiated timeout = 20000
[junit4:junit4]   2> 9312 T430 oascc.ConnectionManager.process Watcher org.apache.solr.common.cloud.ConnectionManager@386a17f7 name:ZooKeeperConnection Watcher:127.0.0.1:47316/solr got event WatchedEvent state:SyncConnected type:None path:null path:null type:None
[junit4:junit4]   2> 9313 T358 oascc.ConnectionManager.waitForConnected Client is connected to ZooKeeper
[junit4:junit4]   2> 9314 T363 oazs.PrepRequestProcessor.pRequest Got user-level KeeperException when processing sessionid:0x13ccbbca248000a type:create cxid:0x1 zxid:0x7e txntype:-1 reqpath:n/a Error Path:/solr/overseer Error:KeeperErrorCode = NodeExists for /solr/overseer
[junit4:junit4]   2> 9316 T363 oazs.PrepRequestProcessor.pRequest Got user-level KeeperException when processing sessionid:0x13ccbbca248000a type:create cxid:0x2 zxid:0x7f txntype:-1 reqpath:n/a Error Path:/solr/overseer Error:KeeperErrorCode = NodeExists for /solr/overseer
[junit4:junit4]   2> 9324 T358 oascc.ZkStateReader.createClusterStateWatchersAndUpdate Updating cluster state from ZooKeeper... 
[junit4:junit4]   2> 9327 T358 oasc.ZkController.createEphemeralLiveNode Register node as live in ZooKeeper:/live_nodes/127.0.0.1:41235_
[junit4:junit4]   2> 9328 T363 oazs.PrepRequestProcessor.pRequest Got user-level KeeperException when processing sessionid:0x13ccbbca248000a type:delete cxid:0x9 zxid:0x80 txntype:-1 reqpath:n/a Error Path:/solr/live_nodes/127.0.0.1:41235_ Error:KeeperErrorCode = NoNode for /solr/live_nodes/127.0.0.1:41235_
[junit4:junit4]   2> 9329 T358 oascc.SolrZkClient.makePath makePath: /live_nodes/127.0.0.1:41235_
[junit4:junit4]   2> 9332 T414 oascc.ZkStateReader$2.process A cluster state change: WatchedEvent state:SyncConnected type:NodeChildrenChanged path:/live_nodes, has occurred - updating... (live nodes size: 3)
[junit4:junit4]   2> 9332 T386 oascc.ZkStateReader$2.process A cluster state change: WatchedEvent state:SyncConnected type:NodeChildrenChanged path:/live_nodes, has occurred - updating... (live nodes size: 3)
[junit4:junit4]   2> 9332 T380 oascc.ZkStateReader$2.process A cluster state change: WatchedEvent state:SyncConnected type:NodeChildrenChanged path:/live_nodes, has occurred - updating... (live nodes size: 3)
[junit4:junit4]   2> 9332 T399 oascc.ZkStateReader$2.process A cluster state change: WatchedEvent state:SyncConnected type:NodeChildrenChanged path:/live_nodes, has occurred - updating... (live nodes size: 3)
[junit4:junit4]   2> 9333 T430 oascc.ZkStateReader$3.process Updating live nodes... (4)
[junit4:junit4]   2> 9335 T414 oascc.ZkStateReader$3.process Updating live nodes... (4)
[junit4:junit4]   2> 9335 T386 oascc.ZkStateReader$3.process Updating live nodes... (4)
[junit4:junit4]   2> 9335 T380 oascc.ZkStateReader$3.process Updating live nodes... (4)
[junit4:junit4]   2> 9337 T399 oascc.ZkStateReader$3.process Updating live nodes... (4)
[junit4:junit4]   2> 9342 T431 oasc.CoreContainer.create Creating SolrCore 'collection1' using instanceDir: /usr/home/hudson/hudson-slave/workspace/Lucene-Solr-Tests-4.x-java7/solr/build/solr-core/test/J0/./org.apache.solr.cloud.SyncSliceTest-jetty3-1360627811635/collection1
[junit4:junit4]   2> 9342 T431 oasc.ZkController.createCollectionZkNode Check for collection zkNode:collection1
[junit4:junit4]   2> 9343 T431 oasc.ZkController.createCollectionZkNode Collection zkNode exists
[junit4:junit4]   2> 9343 T431 oasc.ZkController.readConfigName Load collection config from:/collections/collection1
[junit4:junit4]   2> 9345 T431 oasc.SolrResourceLoader.<init> new SolrResourceLoader for directory: '/usr/home/hudson/hudson-slave/workspace/Lucene-Solr-Tests-4.x-java7/solr/build/solr-core/test/J0/./org.apache.solr.cloud.SyncSliceTest-jetty3-1360627811635/collection1/'
[junit4:junit4]   2> 9346 T431 oasc.SolrResourceLoader.replaceClassLoader Adding 'file:/usr/home/hudson/hudson-slave/workspace/Lucene-Solr-Tests-4.x-java7/solr/build/solr-core/test/J0/org.apache.solr.cloud.SyncSliceTest-jetty3-1360627811635/collection1/lib/README' to classloader
[junit4:junit4]   2> 9347 T431 oasc.SolrResourceLoader.replaceClassLoader Adding 'file:/usr/home/hudson/hudson-slave/workspace/Lucene-Solr-Tests-4.x-java7/solr/build/solr-core/test/J0/org.apache.solr.cloud.SyncSliceTest-jetty3-1360627811635/collection1/lib/classes/' to classloader
[junit4:junit4]   2> 9441 T431 oasc.SolrConfig.<init> Using Lucene MatchVersion: LUCENE_42
[junit4:junit4]   2> 9516 T431 oasc.SolrConfig.<init> Loaded SolrConfig: solrconfig.xml
[junit4:junit4]   2> 9617 T431 oass.IndexSchema.readSchema Reading Solr Schema
[junit4:junit4]   2> 9639 T431 oass.IndexSchema.readSchema Schema name=test
[junit4:junit4]   2> 9800 T381 oascc.ZkStateReader.updateClusterState Updating cloud state from ZooKeeper... 
[junit4:junit4]   2> 9801 T381 oasc.Overseer$ClusterStateUpdater.updateState Update state numShards=1 message={
[junit4:junit4]   2> 	  "operation":"state",
[junit4:junit4]   2> 	  "numShards":"1",
[junit4:junit4]   2> 	  "shard":"shard1",
[junit4:junit4]   2> 	  "roles":null,
[junit4:junit4]   2> 	  "state":"recovering",
[junit4:junit4]   2> 	  "core":"collection1",
[junit4:junit4]   2> 	  "collection":"collection1",
[junit4:junit4]   2> 	  "node_name":"127.0.0.1:30887_",
[junit4:junit4]   2> 	  "base_url":"http://127.0.0.1:30887"}
[junit4:junit4]   2> 9816 T414 oascc.ZkStateReader$2.process A cluster state change: WatchedEvent state:SyncConnected type:NodeDataChanged path:/clusterstate.json, has occurred - updating... (live nodes size: 4)
[junit4:junit4]   2> 9816 T399 oascc.ZkStateReader$2.process A cluster state change: WatchedEvent state:SyncConnected type:NodeDataChanged path:/clusterstate.json, has occurred - updating... (live nodes size: 4)
[junit4:junit4]   2> 9816 T380 oascc.ZkStateReader$2.process A cluster state change: WatchedEvent state:SyncConnected type:NodeDataChanged path:/clusterstate.json, has occurred - updating... (live nodes size: 4)
[junit4:junit4]   2> 9816 T386 oascc.ZkStateReader$2.process A cluster state change: WatchedEvent state:SyncConnected type:NodeDataChanged path:/clusterstate.json, has occurred - updating... (live nodes size: 4)
[junit4:junit4]   2> 9816 T430 oascc.ZkStateReader$2.process A cluster state change: WatchedEvent state:SyncConnected type:NodeDataChanged path:/clusterstate.json, has occurred - updating... (live nodes size: 4)
[junit4:junit4]   2> 10356 T431 oass.OpenExchangeRatesOrgProvider.init Initialized with rates=open-exchange-rates.json, refreshInterval=1440.
[junit4:junit4]   2> 10365 T431 oass.IndexSchema.readSchema default search field in schema is text
[junit4:junit4]   2> 10368 T431 oass.IndexSchema.readSchema unique key field: id
[junit4:junit4]   2> 10392 T431 oass.FileExchangeRateProvider.reload Reloading exchange rates from file currency.xml
[junit4:junit4]   2> 10405 T431 oass.FileExchangeRateProvider.reload Reloading exchange rates from file currency.xml
[junit4:junit4]   2> 10409 T431 oass.OpenExchangeRatesOrgProvider.reload Reloading exchange rates from open-exchange-rates.json
[junit4:junit4]   2> 10410 T431 oass.OpenExchangeRatesOrgProvider.reload Reloading exchange rates from open-exchange-rates.json
[junit4:junit4]   2> 10412 T431 oasc.SolrCore.<init> [collection1] Opening new SolrCore at /usr/home/hudson/hudson-slave/workspace/Lucene-Solr-Tests-4.x-java7/solr/build/solr-core/test/J0/./org.apache.solr.cloud.SyncSliceTest-jetty3-1360627811635/collection1/, dataDir=./org.apache.solr.cloud.SyncSliceTest-1360627802691/jetty3/
[junit4:junit4]   2> 10412 T431 oasc.JmxMonitoredMap.<init> JMX monitoring is enabled. Adding Solr mbeans to JMX Server: com.sun.jmx.mbeanserver.JmxMBeanServer@253725db
[junit4:junit4]   2> 10412 T431 oasc.SolrCore.initDirectoryFactory solr.NRTCachingDirectoryFactory
[junit4:junit4]   2> 10413 T431 oasc.CachingDirectoryFactory.get return new directory for /usr/home/hudson/hudson-slave/workspace/Lucene-Solr-Tests-4.x-java7/solr/build/solr-core/test/J0/./org.apache.solr.cloud.SyncSliceTest-1360627802691/jetty3 forceNew:false
[junit4:junit4]   2> 10414 T431 oasc.CachingDirectoryFactory.close Releasing directory:/usr/home/hudson/hudson-slave/workspace/Lucene-Solr-Tests-4.x-java7/solr/build/solr-core/test/J0/./org.apache.solr.cloud.SyncSliceTest-1360627802691/jetty3
[junit4:junit4]   2> 10414 T431 oasc.SolrCore.getNewIndexDir New index directory detected: old=null new=./org.apache.solr.cloud.SyncSliceTest-1360627802691/jetty3/index/
[junit4:junit4]   2> 10414 T431 oasc.SolrCore.initIndex WARNING [collection1] Solr index directory './org.apache.solr.cloud.SyncSliceTest-1360627802691/jetty3/index' doesn't exist. Creating new index...
[junit4:junit4]   2> 10415 T431 oasc.CachingDirectoryFactory.get return new directory for /usr/home/hudson/hudson-slave/workspace/Lucene-Solr-Tests-4.x-java7/solr/build/solr-core/test/J0/./org.apache.solr.cloud.SyncSliceTest-1360627802691/jetty3/index forceNew:false
[junit4:junit4]   2> 10445 T431 oasc.SolrDeletionPolicy.onCommit SolrDeletionPolicy.onCommit: commits:num=1
[junit4:junit4]   2> 		commit{dir=RateLimitedDirectoryWrapper(NRTCachingDirectory(org.apache.lucene.store.NIOFSDirectory@/usr/home/hudson/hudson-slave/workspace/Lucene-Solr-Tests-4.x-java7/solr/build/solr-core/test/J0/org.apache.solr.cloud.SyncSliceTest-1360627802691/jetty3/index lockFactory=org.apache.lucene.store.NativeFSLockFactory@57937910; maxCacheMB=48.0 maxMergeSizeMB=4.0)),segFN=segments_1,generation=1,filenames=[segments_1]
[junit4:junit4]   2> 10446 T431 oasc.SolrDeletionPolicy.updateCommits newest commit = 1[segments_1]
[junit4:junit4]   2> 10446 T431 oasc.CachingDirectoryFactory.close Releasing directory:/usr/home/hudson/hudson-slave/workspace/Lucene-Solr-Tests-4.x-java7/solr/build/solr-core/test/J0/./org.apache.solr.cloud.SyncSliceTest-1360627802691/jetty3/index
[junit4:junit4]   2> 10447 T431 oasc.SolrCore.initWriters created xml: solr.XMLResponseWriter
[junit4:junit4]   2> 10448 T431 oasup.UpdateRequestProcessorChain.init inserting DistributedUpdateProcessorFactory into updateRequestProcessorChain "dedupe"
[junit4:junit4]   2> 10449 T431 oasup.UpdateRequestProcessorChain.init inserting DistributedUpdateProcessorFactory into updateRequestProcessorChain "dedupe-allfields"
[junit4:junit4]   2> 10449 T431 oasup.UpdateRequestProcessorChain.init inserting DistributedUpdateProcessorFactory into updateRequestProcessorChain "stored_sig"
[junit4:junit4]   2> 10449 T431 oasup.UpdateRequestProcessorChain.init inserting DistributedUpdateProcessorFactory into updateRequestProcessorChain "uniq-fields"
[junit4:junit4]   2> 10450 T431 oasup.UpdateRequestProcessorChain.init inserting DistributedUpdateProcessorFactory into updateRequestProcessorChain "distrib-dup-test-chain-implicit"
[junit4:junit4]   2> 10450 T431 oasc.RequestHandlers.initHandlersFromConfig adding lazy requestHandler: solr.ReplicationHandler
[junit4:junit4]   2> 10450 T431 oasc.RequestHandlers.initHandlersFromConfig created /replication: solr.ReplicationHandler
[junit4:junit4]   2> 10450 T431 oasc.RequestHandlers.initHandlersFromConfig created standard: solr.StandardRequestHandler
[junit4:junit4]   2> 10451 T431 oasc.RequestHandlers.initHandlersFromConfig created /get: solr.RealTimeGetHandler
[junit4:junit4]   2> 10451 T431 oasc.RequestHandlers.initHandlersFromConfig created dismax: solr.SearchHandler
[junit4:junit4]   2> 10452 T431 oasc.RequestHandlers.initHandlersFromConfig created mock: org.apache.solr.core.MockQuerySenderListenerReqHandler
[junit4:junit4]   2> 10452 T431 oasc.RequestHandlers.initHandlersFromConfig created /admin/: org.apache.solr.handler.admin.AdminHandlers
[junit4:junit4]   2> 10453 T431 oasc.RequestHandlers.initHandlersFromConfig created defaults: solr.StandardRequestHandler
[junit4:junit4]   2> 10453 T431 oasc.RequestHandlers.initHandlersFromConfig adding lazy requestHandler: solr.StandardRequestHandler
[junit4:junit4]   2> 10453 T431 oasc.RequestHandlers.initHandlersFromConfig created lazy: solr.StandardRequestHandler
[junit4:junit4]   2> 10453 T431 oasc.RequestHandlers.initHandlersFromConfig created /update: solr.UpdateRequestHandler
[junit4:junit4]   2> 10454 T431 oasc.RequestHandlers.initHandlersFromConfig created /terms: org.apache.solr.handler.component.SearchHandler
[junit4:junit4]   2> 10454 T431 oasc.RequestHandlers.initHandlersFromConfig created spellCheckCompRH: org.apache.solr.handler.component.SearchHandler
[junit4:junit4]   2> 10455 T431 oasc.RequestHandlers.initHandlersFromConfig created spellCheckCompRH_Direct: org.apache.solr.handler.component.SearchHandler
[junit4:junit4]   2> 10455 T431 oasc.RequestHandlers.initHandlersFromConfig created spellCheckWithWordbreak: org.apache.solr.handler.component.SearchHandler
[junit4:junit4]   2> 10455 T431 oasc.RequestHandlers.initHandlersFromConfig created spellCheckWithWordbreak_Direct: org.apache.solr.handler.component.SearchHandler
[junit4:junit4]   2> 10456 T431 oasc.RequestHandlers.initHandlersFromConfig created spellCheckCompRH1: org.apache.solr.handler.component.SearchHandler
[junit4:junit4]   2> 10456 T431 oasc.RequestHandlers.initHandlersFromConfig created mltrh: org.apache.solr.handler.component.SearchHandler
[junit4:junit4]   2> 10457 T431 oasc.RequestHandlers.initHandlersFromConfig created tvrh: org.apache.solr.handler.component.SearchHandler
[junit4:junit4]   2> 10457 T431 oasc.RequestHandlers.initHandlersFromConfig created /mlt: solr.MoreLikeThisHandler
[junit4:junit4]   2> 10457 T431 oasc.RequestHandlers.initHandlersFromConfig created /debug/dump: solr.DumpRequestHandler
[junit4:junit4]   2> 10466 T431 oashl.XMLLoader.init xsltCacheLifetimeSeconds=60
[junit4:junit4]   2> 10469 T431 oasc.SolrCore.initDeprecatedSupport WARNING solrconfig.xml uses deprecated <admin/gettableFiles>, Please update your config to use the ShowFileRequestHandler.
[junit4:junit4]   2> 10470 T431 oasc.SolrCore.initDeprecatedSupport WARNING adding ShowFileRequestHandler with hidden files: [SCHEMA.XML, OLD_SYNONYMS.TXT, STOPWORDS.TXT, PROTWORDS.TXT, OPEN-EXCHANGE-RATES.JSON, SYNONYMS.TXT, CURRENCY.XML, MAPPING-ISOLATIN1ACCENT.TXT]
[junit4:junit4]   2> 10472 T431 oasc.CachingDirectoryFactory.close Releasing directory:/usr/home/hudson/hudson-slave/workspace/Lucene-Solr-Tests-4.x-java7/solr/build/solr-core/test/J0/./org.apache.solr.cloud.SyncSliceTest-1360627802691/jetty3
[junit4:junit4]   2> 10473 T431 oass.SolrIndexSearcher.<init> Opening Searcher@4c02779b main
[junit4:junit4]   2> 10474 T431 oasu.CommitTracker.<init> Hard AutoCommit: disabled
[junit4:junit4]   2> 10474 T431 oasu.CommitTracker.<init> Soft AutoCommit: disabled
[junit4:junit4]   2> 10475 T431 oashc.SpellCheckComponent.inform Initializing spell checkers
[junit4:junit4]   2> 10480 T431 oass.DirectSolrSpellChecker.init init: {name=direct,classname=DirectSolrSpellChecker,field=lowerfilt,minQueryLength=3}
[junit4:junit4]   2> 10536 T432 oasc.SolrCore.registerSearcher [collection1] Registered new searcher Searcher@4c02779b main{StandardDirectoryReader(segments_1:1)}
[junit4:junit4]   2> 10540 T431 oasc.ZkController.publish publishing core=collection1 state=down
[junit4:junit4]   2> 10540 T431 oasc.ZkController.publish numShards not found on descriptor - reading it from system property
[junit4:junit4]   2> 11323 T381 oascc.ZkStateReader.updateClusterState Updating cloud state from ZooKeeper... 
[junit4:junit4]   2> 11325 T381 oasc.Overseer$ClusterStateUpdater.updateState Update state numShards=1 message={
[junit4:junit4]   2> 	  "operation":"state",
[junit4:junit4]   2> 	  "numShards":"1",
[junit4:junit4]   2> 	  "shard":null,
[junit4:junit4]   2> 	  "roles":null,
[junit4:junit4]   2> 	  "state":"down",
[junit4:junit4]   2> 	  "core":"collection1",
[junit4:junit4]   2> 	  "collection":"collection1",
[junit4:junit4]   2> 	  "node_name":"127.0.0.1:41235_",
[junit4:junit4]   2> 	  "base_url":"http://127.0.0.1:41235"}
[junit4:junit4]   2> 11325 T381 oasc.Overseer$ClusterStateUpdater.updateState Collection already exists with numShards=1
[junit4:junit4]   2> 11325 T381 oasc.Overseer$ClusterStateUpdater.updateState Assigning new node to shard shard=shard1
[junit4:junit4]   2> 11353 T399 oascc.ZkStateReader$2.process A cluster state change: WatchedEvent state:SyncConnected type:NodeDataChanged path:/clusterstate.json, has occurred - updating... (live nodes size: 4)
[junit4:junit4]   2> 11353 T414 oascc.ZkStateReader$2.process A cluster state change: WatchedEvent state:SyncConnected type:NodeDataChanged path:/clusterstate.json, has occurred - updating... (live nodes size: 4)
[junit4:junit4]   2> 11353 T380 oascc.ZkStateReader$2.process A cluster state change: WatchedEvent state:SyncConnected type:NodeDataChanged path:/clusterstate.json, has occurred - updating... (live nodes size: 4)
[junit4:junit4]   2> 11353 T430 oascc.ZkStateReader$2.process A cluster state change: WatchedEvent state:SyncConnected type:NodeDataChanged path:/clusterstate.json, has occurred - updating... (live nodes size: 4)
[junit4:junit4]   2> 11353 T386 oascc.ZkStateReader$2.process A cluster state change: WatchedEvent state:SyncConnected type:NodeDataChanged path:/clusterstate.json, has occurred - updating... (live nodes size: 4)
[junit4:junit4]   2> 11543 T431 oasc.CoreContainer.registerCore registering core: collection1
[junit4:junit4]   2> 11543 T431 oasc.ZkController.register Register replica - core:collection1 address:http://127.0.0.1:41235 collection:collection1 shard:shard1
[junit4:junit4]   2> 11551 T431 oasc.ZkController.register We are http://127.0.0.1:41235/collection1/ and leader is http://127.0.0.1:35520/collection1/
[junit4:junit4]   2> 11551 T431 oasc.ZkController.register No LogReplay needed for core=collection1 baseURL=http://127.0.0.1:41235
[junit4:junit4]   2> 11551 T431 oasc.ZkController.checkRecovery Core needs to recover:collection1
[junit4:junit4]   2> 11552 T431 oasu.DefaultSolrCoreState.doRecovery Running recovery - first canceling any ongoing recovery
[junit4:junit4]   2> ASYNC  NEW_CORE C20 name=collection1 org.apache.solr.core.SolrCore@b469b35 url=http://127.0.0.1:41235/collection1 node=127.0.0.1:41235_ C20_STATE=coll:collection1 core:collection1 props:{shard=null, roles=null, state=down, core=collection1, collection=collection1, node_name=127.0.0.1:41235_, base_url=http://127.0.0.1:41235}
[junit4:junit4]   2> 11553 T433 C20 P41235 oasc.RecoveryStrategy.run Starting recovery process.  core=collection1 recoveringAfterStartup=true
[junit4:junit4]   2> 11553 T433 C20 P41235 oasc.RecoveryStrategy.doRecovery ###### startupVersions=[]
[junit4:junit4]   2> 11553 T431 oascc.ZkStateReader.updateClusterState Updating cloud state from ZooKeeper... 
[junit4:junit4]   2> 11553 T433 C20 P41235 oasc.ZkController.publish publishing core=collection1 state=recovering
[junit4:junit4]   2> 11554 T433 C20 P41235 oasc.ZkController.publish numShards not found on descriptor - reading it from system property
[junit4:junit4]   2> 11554 T358 oass.SolrDispatchFilter.init user.dir=/usr/home/hudson/hudson-slave/workspace/Lucene-Solr-Tests-4.x-java7/solr/build/solr-core/test/J0
[junit4:junit4]   2> 11555 T358 oass.SolrDispatchFilter.init SolrDispatchFilter.init() done
[junit4:junit4]   2> 11555 T433 C20 P41235 oascsi.HttpClientUtil.createClient Creating new http client, config:maxConnections=128&maxConnectionsPerHost=32&followRedirects=false
[junit4:junit4]   2> 11556 T358 oascsi.HttpClientUtil.createClient Creating new http client, config:maxConnections=128&maxConnectionsPerHost=32&followRedirects=false
[junit4:junit4]   2> 11753 T358 oejs.Server.doStart jetty-8.1.8.v20121106
[junit4:junit4]   2> 11757 T358 oejs.AbstractConnector.doStart Started SocketConnector@127.0.0.1:19009
[junit4:junit4]   2> 11757 T358 oass.SolrDispatchFilter.init SolrDispatchFilter.init()
[junit4:junit4]   2> 11758 T358 oasc.SolrResourceLoader.locateSolrHome JNDI not configured for solr (NoInitialContextEx)
[junit4:junit4]   2> 11758 T358 oasc.SolrResourceLoader.locateSolrHome using system property solr.solr.home: /usr/home/hudson/hudson-slave/workspace/Lucene-Solr-Tests-4.x-java7/solr/build/solr-core/test/J0/./org.apache.solr.cloud.SyncSliceTest-jetty4-1360627814263
[junit4:junit4]   2> 11759 T358 oasc.CoreContainer$Initializer.initialize looking for solr.xml: /usr/home/hudson/hudson-slave/workspace/Lucene-Solr-Tests-4.x-java7/solr/build/solr-core/test/J0/./org.apache.solr.cloud.SyncSliceTest-jetty4-1360627814263/solr.xml
[junit4:junit4]   2> 11759 T358 oasc.CoreContainer.<init> New CoreContainer 508677335
[junit4:junit4]   2> 11760 T358 oasc.CoreContainer.load Loading CoreContainer using Solr Home: '/usr/home/hudson/hudson-slave/workspace/Lucene-Solr-Tests-4.x-java7/solr/build/solr-core/test/J0/./org.apache.solr.cloud.SyncSliceTest-jetty4-1360627814263/'
[junit4:junit4]   2> 11761 T358 oasc.SolrResourceLoader.<init> new SolrResourceLoader for directory: '/usr/home/hudson/hudson-slave/workspace/Lucene-Solr-Tests-4.x-java7/solr/build/solr-core/test/J0/./org.apache.solr.cloud.SyncSliceTest-jetty4-1360627814263/'
[junit4:junit4]   2> 11822 T358 oashc.HttpShardHandlerFactory.getParameter Setting socketTimeout to: 60000
[junit4:junit4]   2> 11823 T358 oashc.HttpShardHandlerFactory.getParameter Setting urlScheme to: http://
[junit4:junit4]   2> 11823 T358 oashc.HttpShardHandlerFactory.getParameter Setting connTimeout to: 15000
[junit4:junit4]   2> 11824 T358 oashc.HttpShardHandlerFactory.getParameter Setting maxConnectionsPerHost to: 20
[junit4:junit4]   2> 11824 T358 oashc.HttpShardHandlerFactory.getParameter Setting corePoolSize to: 0
[junit4:junit4]   2> 11825 T358 oashc.HttpShardHandlerFactory.getParameter Setting maximumPoolSize to: 2147483647
[junit4:junit4]   2> 11825 T358 oashc.HttpShardHandlerFactory.getParameter Setting maxThreadIdleTime to: 5
[junit4:junit4]   2> 11825 T358 oashc.HttpShardHandlerFactory.getParameter Setting sizeOfQueue to: -1
[junit4:junit4]   2> 11826 T358 oashc.HttpShardHandlerFactory.getParameter Setting fairnessPolicy to: false
[junit4:junit4]   2> 11826 T358 oascsi.HttpClientUtil.createClient Creating new http client, config:maxConnectionsPerHost=20&maxConnections=10000&socketTimeout=60000&connTimeout=15000&retry=false
[junit4:junit4]   2> 11850 T358 oasc.CoreContainer.load Registering Log Listener
[junit4:junit4]   2> 11870 T358 oasc.CoreContainer.initZooKeeper Zookeeper client=127.0.0.1:47316/solr
[junit4:junit4]   2> 11870 T358 oasc.ZkController.checkChrootPath zkHost includes chroot
[junit4:junit4]   2> 11871 T358 oaz.ZooKeeper.<init> Initiating client connection, connectString=127.0.0.1:47316 sessionTimeout=60000 watcher=org.apache.solr.common.cloud.ConnectionManager@6c50f1bb
[junit4:junit4]   2> 11872 T358 oascc.ConnectionManager.waitForConnected Waiting for client to connect to ZooKeeper
[junit4:junit4]   2> 11872 T443 oaz.ClientCnxn$SendThread.logStartConnect Opening socket connection to server localhost/127.0.0.1:47316. Will not attempt to authenticate using SASL (access denied ("javax.security.auth.AuthPermission" "getLoginConfiguration"))
[junit4:junit4]   2> 11873 T443 oaz.ClientCnxn$SendThread.primeConnection Socket connection established to localhost/127.0.0.1:47316, initiating session
[junit4:junit4]   2> 11873 T360 oazs.NIOServerCnxnFactory.run Accepted socket connection from /140.211.11.196:30855
[junit4:junit4]   2> 11873 T360 oazs.ZooKeeperServer.processConnectRequest Client attempting to establish new session at /140.211.11.196:30855
[junit4:junit4]   2> 11875 T362 oazs.ZooKeeperServer.finishSessionInit Established session 0x13ccbbca248000b with negotiated timeout 20000 for client /140.211.11.196:30855
[junit4:junit4]   2> 11875 T443 oaz.ClientCnxn$SendThread.onConnected Session establishment complete on server localhost/127.0.0.1:47316, sessionid = 0x13ccbbca248000b, negotiated timeout = 20000
[junit4:junit4]   2> 11876 T444 oascc.ConnectionManager.process Watcher org.apache.solr.common.cloud.ConnectionManager@6c50f1bb name:ZooKeeperConnection Watcher:127.0.0.1:47316 got event WatchedEvent state:SyncConnected type:None path:null path:null type:None
[junit4:junit4]   2> 11876 T358 oascc.ConnectionManager.waitForConnected Client is connected to ZooKeeper
[junit4:junit4]   2> 11877 T363 oazs.PrepRequestProcessor.pRequest2Txn Processed session termination for sessionid: 0x13ccbbca248000b
[junit4:junit4]   2> 11892 T360 oazs.NIOServerCnxn.closeSock Closed socket connection for client /140.211.11.196:30855 which had sessionid 0x13ccbbca248000b
[junit4:junit4]   2> 11892 T444 oaz.ClientCnxn$EventThread.run EventThread shut down
[junit4:junit4]   2> 11892 T358 oaz.ZooKeeper.close Session: 0x13ccbbca248000b closed
[junit4:junit4]   2> 11893 T358 oascsi.HttpClientUtil.createClient Creating new http client, config:maxConnections=500&maxConnectionsPerHost=16&socketTimeout=60000&connTimeout=15000
[junit4:junit4]   2> 11906 T358 oaz.ZooKeeper.<init> Initiating client connection, connectString=127.0.0.1:47316/solr sessionTimeout=30000 watcher=org.apache.solr.common.cloud.ConnectionManager@48e30601
[junit4:junit4]   2> 11907 T358 oascc.ConnectionManager.waitForConnected Waiting for client to connect to ZooKeeper
[junit4:junit4]   2> 11907 T445 oaz.ClientCnxn$SendThread.logStartConnect Opening socket connection to server localhost/127.0.0.1:47316. Will not attempt to authenticate using SASL (access denied ("javax.security.auth.AuthPermission" "getLoginConfiguration"))
[junit4:junit4]   2> 11908 T445 oaz.ClientCnxn$SendThread.primeConnection Socket connection established to localhost/127.0.0.1:47316, initiating session
[junit4:junit4]   2> 11908 T360 oazs.NIOServerCnxnFactory.run Accepted socket connection from /140.211.11.196:51444
[junit4:junit4]   2> 11908 T360 oazs.ZooKeeperServer.processConnectRequest Client attempting to establish new session at /140.211.11.196:51444
[junit4:junit4]   2> 11909 T362 oazs.ZooKeeperServer.finishSessionInit Established session 0x13ccbbca248000c with negotiated timeout 20000 for client /140.211.11.196:51444
[junit4:junit4]   2> 11910 T445 oaz.ClientCnxn$SendThread.onConnected Session establishment complete on server localhost/127.0.0.1:47316, sessionid = 0x13ccbbca248000c, negotiated timeout = 20000
[junit4:junit4]   2> 11910 T446 oascc.ConnectionManager.process Watcher org.apache.solr.common.cloud.ConnectionManager@48e30601 name:ZooKeeperConnection Watcher:127.0.0.1:47316/solr got event WatchedEvent state:SyncConnected type:None path:null path:null type:None
[junit4:junit4]   2> 11910 T358 oascc.ConnectionManager.waitForConnected Client is connected to ZooKeeper
[junit4:junit4]   2> 11911 T363 oazs.PrepRequestProcessor.pRequest Got user-level KeeperException when processing sessionid:0x13ccbbca248000c type:create cxid:0x1 zxid:0x91 txntype:-1 reqpath:n/a Error Path:/solr/overseer Error:KeeperErrorCode = NodeExists for /solr/overseer
[junit4:junit4]   2> 11917 T363 oazs.PrepRequestProcessor.pRequest Got user-level KeeperException when processing sessionid:0x13ccbbca248000c type:create cxid:0x2 zxid:0x92 txntype:-1 reqpath:n/a Error Path:/solr/overseer Error:KeeperErrorCode = NodeExists for /solr/overseer
[junit4:junit4]   2> 11919 T358 oascc.ZkStateReader.createClusterStateWatchersAndUpdate Updating cluster state from ZooKeeper... 
[junit4:junit4]   2> 11922 T358 oasc.ZkController.createEphemeralLiveNode Register node as live in ZooKeeper:/live_nodes/127.0.0.1:19009_
[junit4:junit4]   2> 11922 T363 oazs.PrepRequestProcessor.pRequest Got user-level KeeperException when processing sessionid:0x13ccbbca248000c type:delete cxid:0x9 zxid:0x93 txntype:-1 reqpath:n/a Error Path:/solr/live_nodes/127.0.0.1:19009_ Error:KeeperErrorCode = NoNode for /solr/live_nodes/127.0.0.1:19009_
[junit4:junit4]   2> 11924 T358 oascc.SolrZkClient.makePath makePath: /live_nodes/127.0.0.1:19009_
[junit4:junit4]   2> 11926 T399 oascc.ZkStateReader$2.process A cluster state change: WatchedEvent state:SyncConnected type:NodeChildrenChanged path:/live_nodes, has occurred - updating... (live nodes size: 4)
[junit4:junit4]   2> 11926 T414 oascc.ZkStateReader$2.process A cluster state change: WatchedEvent state:SyncConnected type:NodeChildrenChanged path:/live_nodes, has occurred - updating... (live nodes size: 4)
[junit4:junit4]   2> 11927 T386 oascc.ZkStateReader$2.process A cluster state change: WatchedEvent state:SyncConnected type:NodeChildrenChanged path:/live_nodes, has occurred - updating... (live nodes size: 4)
[junit4:junit4]   2> 11927 T380 oascc.ZkStateReader$2.process A cluster state change: WatchedEvent state:SyncConnected type:NodeChildrenChanged path:/live_nodes, has occurred - updating... (live nodes size: 4)
[junit4:junit4]   2> 11927 T446 oascc.ZkStateReader$3.process Updating live nodes... (5)
[junit4:junit4]   2> 11927 T430 oascc.ZkStateReader$3.process Updating live nodes... (5)
[junit4:junit4]   2> 11927 T430 oascc.ZkStateReader$2.process A cluster state change: WatchedEvent state:SyncConnected type:NodeChildrenChanged path:/live_nodes, has occurred - updating... (live nodes size: 5)
[junit4:junit4]   2> 11929 T399 oascc.ZkStateReader$3.process Updating live nodes... (5)
[junit4:junit4]   2> 11929 T414 oascc.ZkStateReader$3.process Updating live nodes... (5)
[junit4:junit4]   2> 11929 T380 oascc.ZkStateReader$3.process Updating live nodes... (5)
[junit4:junit4]   2> 11929 T386 oascc.ZkStateReader$3.process Updating live nodes... (5)
[junit4:junit4]   2> 11936 T447 oasc.CoreContainer.create Creating SolrCore 'collection1' using instanceDir: /usr/home/hudson/hudson-slave/workspace/Lucene-Solr-Tests-4.x-java7/solr/build/solr-core/test/J0/./org.apache.solr.cloud.SyncSliceTest-jetty4-1360627814263/collection1
[junit4:junit4]   2> 11936 T447 oasc.ZkController.createCollectionZkNode Check for collection zkNode:collection1
[junit4:junit4]   2> 11937 T447 oasc.ZkController.createCollectionZkNode Collection zkNode exists
[junit4:junit4]   2> 11937 T447 oasc.ZkController.readConfigName Load collection config from:/collections/collection1
[junit4:junit4]   2> 11939 T447 oasc.SolrResourceLoader.<init> new SolrResourceLoader for directory: '/usr/home/hudson/hudson-slave/workspace/Lucene-Solr-Tests-4.x-java7/solr/build/solr-core/test/J0/./org.apache.solr.cloud.SyncSliceTest-jetty4-1360627814263/collection1/'
[junit4:junit4]   2> 11940 T447 oasc.SolrResourceLoader.replaceClassLoader Adding 'file:/usr/home/hudson/hudson-slave/workspace/Lucene-Solr-Tests-4.x-java7/solr/build/solr-core/test/J0/org.apache.solr.cloud.SyncSliceTest-jetty4-1360627814263/collection1/lib/README' to classloader
[junit4:junit4]   2> 11940 T447 oasc.SolrResourceLoader.replaceClassLoader Adding 'file:/usr/home/hudson/hudson-slave/workspace/Lucene-Solr-Tests-4.x-java7/solr/build/solr-core/test/J0/org.apache.solr.cloud.SyncSliceTest-jetty4-1360627814263/collection1/lib/classes/' to classloader
[junit4:junit4]   2> 12010 T447 oasc.SolrConfig.<init> Using Lucene MatchVersion: LUCENE_42
[junit4:junit4]   2> 12082 T447 oasc.SolrConfig.<init> Loaded SolrConfig: solrconfig.xml
[junit4:junit4]   2> 12183 T447 oass.IndexSchema.readSchema Reading Solr Schema
[junit4:junit4]   2> 12190 T447 oass.IndexSchema.readSchema Schema name=test
[junit4:junit4]   2>  C19_STATE=coll:collection1 core:collection1 props:{shard=shard1, roles=null, state=recovering, core=collection1, collection=collection1, node_name=127.0.0.1:30887_, base_url=http://127.0.0.1:30887}
[junit4:junit4]   2> 12400 T417 C19 P30887 oasc.RecoveryStrategy.doRecovery Attempting to PeerSync from http://127.0.0.1:35520/collection1/ core=collection1 - recoveringAfterStartup=true
[junit4:junit4]   2> 12411 T417 C19 P30887 oascsi.HttpClientUtil.createClient Creating new http client, config:maxConnectionsPerHost=20&maxConnections=10000&connTimeout=30000&socketTimeout=30000&retry=false
[junit4:junit4]   2> 12433 T417 C19 P30887 oasu.PeerSync.sync PeerSync: core=collection1 url=http://127.0.0.1:30887 START replicas=[http://127.0.0.1:35520/collection1/] nUpdates=100
[junit4:junit4]   2> 12445 T417 C19 P30887 oasu.PeerSync.sync WARNING no frame of reference to tell of we've missed updates
[junit4:junit4]   2> 12445 T417 C19 P30887 oasc.RecoveryStrategy.doRecovery PeerSync Recovery was not successful - trying replication. core=collection1
[junit4:junit4]   2> 12445 T417 C19 P30887 oasc.RecoveryStrategy.doRecovery Starting Replication Recovery. core=collection1
[junit4:junit4]   2> 12446 T417 C19 P30887 oasc.RecoveryStrategy.doRecovery Begin buffering updates. core=collection1
[junit4:junit4]   2> 12446 T417 C19 P30887 oasu.UpdateLog.bufferUpdates Starting to buffer updates. FSUpdateLog{state=ACTIVE, tlog=null}
[junit4:junit4]   2> 12446 T417 C19 P30887 oasc.RecoveryStrategy.replicate Attempting to replicate from http://127.0.0.1:35520/collection1/. core=collection1
[junit4:junit4]   2> 12446 T417 C19 P30887 oascsi.HttpClientUtil.createClient Creating new http client, config:maxConnections=128&maxConnectionsPerHost=32&followRedirects=false
[junit4:junit4]   2> ASYNC  NEW_CORE C21 name=collection1 org.apache.solr.core.SolrCore@5871a46 url=http://127.0.0.1:35520/collection1 node=127.0.0.1:35520_ C21_STATE=coll:collection1 core:collection1 props:{shard=shard1, roles=null, state=active, core=collection1, collection=collection1, node_name=127.0.0.1:35520_, base_url=http://127.0.0.1:35520, leader=true}
[junit4:junit4]   2> 12487 T391 C21 P35520 REQ /get {getVersions=100&distrib=false&wt=javabin&qt=/get&version=2} status=0 QTime=4 
[junit4:junit4]   2> 12500 T392 C21 P35520 oasu.DirectUpdateHandler2.commit start commit{,optimize=false,openSearcher=false,waitSearcher=true,expungeDeletes=false,softCommit=false}
[junit4:junit4]   2> 12501 T392 C21 P35520 oasc.CachingDirectoryFactory.close Releasing directory:/usr/home/hudson/hudson-slave/workspace/Lucene-Solr-Tests-4.x-java7/solr/build/solr-core/test/J0/./org.apache.solr.cloud.SyncSliceTest-1360627802691/jetty1
[junit4:junit4]   2> 12505 T392 C21 P35520 oasc.SolrDeletionPolicy.onInit SolrDeletionPolicy.onInit: commits:num=1
[junit4:junit4]   2> 		commit{dir=RateLimitedDirectoryWrapper(NRTCachingDirectory(org.apache.lucene.store.NIOFSDirectory@/usr/home/hudson/hudson-slave/workspace/Lucene-Solr-Tests-4.x-java7/solr/build/solr-core/test/J0/org.apache.solr.cloud.SyncSliceTest-1360627802691/jetty1/index lockFactory=org.apache.lucene.store.NativeFSLockFactory@4457313e; maxCacheMB=48.0 maxMergeSizeMB=4.0)),segFN=segments_1,generation=1,filenames=[segments_1]
[junit4:junit4]   2> 12505 T392 C21 P35520 oasc.SolrDeletionPolicy.updateCommits newest commit = 1[segments_1]
[junit4:junit4]   2> 12539 T392 C21 P35520 oasc.SolrDeletionPolicy.onCommit SolrDeletionPolicy.onCommit: commits:num=2
[junit4:junit4]   2> 		commit{dir=RateLimitedDirectoryWrapper(NRTCachingDirectory(org.apache.lucene.store.NIOFSDirectory@/usr/home/hudson/hudson-slave/workspace/Lucene-Solr-Tests-4.x-java7/solr/build/solr-core/test/J0/org.apache.solr.cloud.SyncSliceTest-1360627802691/jetty1/index lockFactory=org.apache.lucene.store.NativeFSLockFactory@4457313e; maxCacheMB=48.0 maxMergeSizeMB=4.0)),segFN=segments_1,generation=1,filenames=[segments_1]
[junit4:junit4]   2> 		commit{dir=RateLimitedDirectoryWrapper(NRTCachingDirectory(org.apache.lucene.store.NIOFSDirectory@/usr/home/hudson/hudson-slave/workspace/Lucene-Solr-Tests-4.x-java7/solr/build/solr-core/test/J0/org.apache.solr.cloud.SyncSliceTest-1360627802691/jetty1/index lockFactory=org.apache.lucene.store.NativeFSLockFactory@4457313e; maxCacheMB=48.0 maxMergeSizeMB=4.0)),segFN=segments_2,generation=2,filenames=[segments_2]
[junit4:junit4]   2> 12539 T392 C21 P35520 oasc.SolrDeletionPolicy.updateCommits newest commit = 2[segments_2]
[junit4:junit4]   2> 12540 T392 C21 P35520 oasc.CachingDirectoryFactory.close Releasing directory:/usr/home/hudson/hudson-slave/workspace/Lucene-Solr-Tests-4.x-java7/solr/build/solr-core/test/J0/./org.apache.solr.cloud.SyncSliceTest-1360627802691/jetty1
[junit4:junit4]   2> 12541 T392 C21 P35520 oass.SolrIndexSearcher.<init> Opening Searcher@2c3b6533 realtime
[junit4:junit4]   2> 12541 T392 C21 P35520 oasu.DirectUpdateHandler2.commit end_commit_flush
[junit4:junit4]   2> 12541 T392 C21 P35520 /update {waitSearcher=true&openSearcher=false&commit=true&wt=javabin&commit_end_point=true&version=2&softCommit=false} {commit=} 0 59
[junit4:junit4]   2> 12619 T417 C19 P30887 oash.ReplicationHandler.inform Commits will be reserved for  10000
[junit4:junit4]   2> 12620 T417 C19 P30887 oascsi.HttpClientUtil.createClient Creating new http client, config:connTimeout=5000&socketTimeout=20000&allowCompression=false&maxConnections=10000&maxConnectionsPerHost=10000
[junit4:junit4]   2> 12650 T417 C19 P30887 oash.SnapPuller.<init>  No value set for 'pollInterval'. Timer Task not started.
[junit4:junit4]   2> 12726 T393 C21 P35520 oash.ReplicationHandler.inform Commits will be reserved for  10000
[junit4:junit4]   2> 12726 T393 C21 P35520 REQ /replication {command=indexversion&qt=/replication&wt=javabin&version=2} status=0 QTime=74 
[junit4:junit4]   2> 12728 T417 C19 P30887 oash.SnapPuller.fetchLatestIndex Master's generation: 2
[junit4:junit4]   2> 12728 T417 C19 P30887 oash.SnapPuller.fetchLatestIndex Slave's generation: 1
[junit4:junit4]   2> 12728 T417 C19 P30887 oash.SnapPuller.fetchLatestIndex Starting replication process
[junit4:junit4]   2> 12732 T393 C21 P35520 oasc.CachingDirectoryFactory.close Releasing directory:/usr/home/hudson/hudson-slave/workspace/Lucene-Solr-Tests-4.x-java7/solr/build/solr-core/test/J0/./org.apache.solr.cloud.SyncSliceTest-1360627802691/jetty1
[junit4:junit4]   2> 12733 T393 C21 P35520 oasc.CachingDirectoryFactory.close Releasing directory:/usr/home/hudson/hudson-slave/workspace/Lucene-Solr-Tests-4.x-java7/solr/build/solr-core/test/J0/./org.apache.solr.cloud.SyncSliceTest-1360627802691/jetty1/index
[junit4:junit4]   2> 12733 T393 C21 P35520 REQ /replication {command=filelist&qt=/replication&wt=javabin&generation=2&version=2} status=0 QTime=1 
[junit4:junit4]   2> 12734 T417 C19 P30887 oash.SnapPuller.fetchLatestIndex Number of files in latest index in master: 1
[junit4:junit4]   2> 12735 T417 C19 P30887 oasc.CachingDirectoryFactory.get return new directory for /usr/home/hudson/hudson-slave/workspace/Lucene-Solr-Tests-4.x-java7/solr/build/solr-core/test/J0/./org.apache.solr.cloud.SyncSliceTest-1360627802691/jetty2/index.20130211191015422 forceNew:false
[junit4:junit4]   2> 12736 T417 C19 P30887 oasc.CachingDirectoryFactory.close Releasing directory:/usr/home/hudson/hudson-slave/workspace/Lucene-Solr-Tests-4.x-java7/solr/build/solr-core/test/J0/./org.apache.solr.cloud.SyncSliceTest-1360627802691/jetty2
[junit4:junit4]   2> 12736 T417 C19 P30887 oash.SnapPuller.fetchLatestIndex Starting download to RateLimitedDirectoryWrapper(NRTCachingDirectory(org.apache.lucene.store.NIOFSDirectory@/usr/home/hudson/hudson-slave/workspace/Lucene-Solr-Tests-4.x-java7/solr/build/solr-core/test/J0/org.apache.solr.cloud.SyncSliceTest-1360627802691/jetty2/index.20130211191015422 lockFactory=org.apache.lucene.store.NativeFSLockFactory@93f1d1a; maxCacheMB=48.0 maxMergeSizeMB=4.0)) fullCopy=true
[junit4:junit4]   2> 12748 T393 C21 P35520 REQ /replication {file=segments_2&command=filecontent&checksum=true&wt=filestream&qt=/replication&generation=2} status=0 QTime=4 
[junit4:junit4]   2> 12763 T417 C19 P30887 oasc.CachingDirectoryFactory.close Releasing directory:/usr/home/hudson/hudson-slave/workspace/Lucene-Solr-Tests-4.x-java7/solr/build/solr-core/test/J0/./org.apache.solr.cloud.SyncSliceTest-1360627802691/jetty2/index
[junit4:junit4]   2> 12764 T417 C19 P30887 oash.SnapPuller.fetchLatestIndex Total time taken for download : 0 secs
[junit4:junit4]   2> 12764 T417 C19 P30887 oash.SnapPuller.modifyIndexProps New index installed. Updating index properties... index=index.20130211191015422
[junit4:junit4]   2> 12766 T417 C19 P30887 oasc.CachingDirectoryFactory.close Releasing directory:/usr/home/hudson/hudson-slave/workspace/Lucene-Solr-Tests-4.x-java7/solr/build/solr-core/test/J0/./org.apache.solr.cloud.SyncSliceTest-1360627802691/jetty2
[junit4:junit4]   2> 12767 T417 C19 P30887 oasc.CachingDirectoryFactory.close Releasing directory:/usr/home/hudson/hudson-slave/workspace/Lucene-Solr-Tests-4.x-java7/solr/build/solr-core/test/J0/./org.apache.solr.cloud.SyncSliceTest-1360627802691/jetty2
[junit4:junit4]   2> 12768 T417 C19 P30887 oasc.SolrCore.getNewIndexDir New index directory detected: old=./org.apache.solr.cloud.SyncSliceTest-1360627802691/jetty2/index/ new=./org.apache.solr.cloud.SyncSliceTest-1360627802691/jetty2/index.20130211191015422
[junit4:junit4]   2> 12772 T417 C19 P30887 oasc.SolrDeletionPolicy.onInit SolrDeletionPolicy.onInit: commits:num=1
[junit4:junit4]   2> 		commit{dir=RateLimitedDirectoryWrapper(NRTCachingDirectory(org.apache.lucene.store.NIOFSDirectory@/usr/home/hudson/hudson-slave/workspace/Lucene-Solr-Tests-4.x-java7/solr/build/solr-core/test/J0/org.apache.solr.cloud.SyncSliceTest-1360627802691/jetty2/index.20130211191015422 lockFactory=org.apache.lucene.store.NativeFSLockFactory@93f1d1a; maxCacheMB=48.0 maxMergeSizeMB=4.0)),segFN=segments_2,generation=2,filenames=[segments_2]
[junit4:junit4]   2> 12772 T417 C19 P30887 oasc.SolrDeletionPolicy.updateCommits newest commit = 2[segments_2]
[junit4:junit4]   2> 12774 T417 C19 P30887 oasc.CachingDirectoryFactory.close Releasing directory:/usr/home/hudson/hudson-slave/workspace/Lucene-Solr-Tests-4.x-java7/solr/build/solr-core/test/J0/./org.apache.solr.cloud.SyncSliceTest-1360627802691/jetty2
[junit4:junit4]   2> 12778 T417 C19 P30887 oasu.DefaultSolrCoreState.newIndexWriter Creating new IndexWriter...
[junit4:junit4]   2> 12779 T417 C19 P30887 oasu.DefaultSolrCoreState.newIndexWriter Waiting until IndexWriter is unused... core=collection1
[junit4:junit4]   2> 12779 T417 C19 P30887 oasu.DefaultSolrCoreState.newIndexWriter Rollback old IndexWriter... core=collection1
[junit4:junit4]   2> 12780 T417 C19 P30887 oasc.CachingDirectoryFactory.close Releasing directory:/usr/home/hudson/hudson-slave/workspace/Lucene-Solr-Tests-4.x-java7/solr/build/solr-core/test/J0/./org.apache.solr.cloud.SyncSliceTest-1360627802691/jetty2/index.20130211191015422
[junit4:junit4]   2> 12781 T417 C19 P30887 oasc.CachingDirectoryFactory.close Releasing directory:/usr/home/hudson/hudson-slave/workspace/Lucene-Solr-Tests-4.x-java7/solr/build/solr-core/test/J0/./org.apache.solr.cloud.SyncSliceTest-1360627802691/jetty2
[junit4:junit4]   2> 12785 T417 C19 P30887 oasc.SolrDeletionPolicy.onInit SolrDeletionPolicy.onInit: commits:num=1
[junit4:junit4]   2> 		commit{dir=RateLimitedDirectoryWrapper(NRTCachingDirectory(org.apache.lucene.store.NIOFSDirectory@/usr/home/hudson/hudson-slave/workspace/Lucene-Solr-Tests-4.x-java7/solr/build/solr-core/test/J0/org.apache.solr.cloud.SyncSliceTest-1360627802691/jetty2/index.20130211191015422 lockFactory=org.apache.lucene.store.NativeFSLockFactory@93f1d1a; maxCacheMB=48.0 maxMergeSizeMB=4.0)),segFN=segments_2,generation=2,filenames=[segments_2]
[junit4:junit4]   2> 12785 T417 C19 P30887 oasc.SolrDeletionPolicy.updateCommits newest commit = 2[segments_2]
[junit4:junit4]   2> 12785 T417 C19 P30887 oasu.DefaultSolrCoreState.newIndexWriter New IndexWriter is ready to be used.
[junit4:junit4]   2> 12786 T417 C19 P30887 oasc.CachingDirectoryFactory.close Releasing directory:/usr/home/hudson/hudson-slave/workspace/Lucene-Solr-Tests-4.x-java7/solr/build/solr-core/test/J0/./org.apache.solr.cloud.SyncSliceTest-1360627802691/jetty2
[junit4:junit4]   2> 12786 T417 C19 P30887 oass.SolrIndexSearcher.<init> Opening Searcher@552be604 main
[junit4:junit4]   2> 12788 T416 oasc.SolrCore.registerSearcher [collection1] Registered new searcher Searcher@552be604 main{StandardDirectoryReader(segments_2:1:nrt)}
[junit4:junit4]   2> 12788 T416 oasc.CachingDirectoryFactory.close Releasing directory:/usr/home/hudson/hudson-slave/workspace/Lucene-Solr-Tests-4.x-java7/solr/build/solr-core/test/J0/./org.apache.solr.cloud.SyncSliceTest-1360627802691/jetty2/index
[junit4:junit4]   2> 12788 T417 C19 P30887 oasu.DirectUpdateHandler2.commit start commit{,optimize=false,openSearcher=false,waitSearcher=false,expungeDeletes=false,softCommit=false}
[junit4:junit4]   2> 12792 T417 C19 P30887 oasc.SolrDeletionPolicy.onCommit SolrDeletionPolicy.onCommit: commits:num=2
[junit4:junit4]   2> 		commit{dir=RateLimitedDirectoryWrapper(NRTCachingDirectory(org.apache.lucene.store.NIOFSDirectory@/usr/home/hudson/hudson-slave/workspace/Lucene-Solr-Tests-4.x-java7/solr/build/solr-core/test/J0/org.apache.solr.cloud.SyncSliceTest-1360627802691/jetty2/index.20130211191015422 lockFactory=org.apache.lucene.store.NativeFSLockFactory@93f1d1a; maxCacheMB=48.0 maxMergeSizeMB=4.0)),segFN=segments_2,generation=2,filenames=[segments_2]
[junit4:junit4]   2> 		commit{dir=RateLimitedDirectoryWrapper(NRTCachingDirectory(org.apache.lucene.store.NIOFSDirectory@/usr/home/hudson/hudson-slave/workspace/Lucene-Solr-Tests-4.x-java7/solr/build/solr-core/test/J0/org.apache.solr.cloud.SyncSliceTest-1360627802691/jetty2/index.20130211191015422 lockFactory=org.apache.lucene.store.NativeFSLockFactory@93f1d1a; maxCacheMB=48.0 maxMergeSizeMB=4.0)),segFN=segments_3,generation=3,filenames=[segments_3]
[junit4:junit4]   2> 12792 T417 C19 P30887 oasc.SolrDeletionPolicy.updateCommits newest commit = 3[segments_3]
[junit4:junit4]   2> 12794 T417 C19 P30887 oasc.CachingDirectoryFactory.close Releasing directory:/usr/home/hudson/hudson-slave/workspace/Lucene-Solr-Tests-4.x-java7/solr/build/solr-core/test/J0/./org.apache.solr.cloud.SyncSliceTest-1360627802691/jetty2
[junit4:junit4]   2> 12794 T417 C19 P30887 oasu.DirectUpdateHandler2.commit end_commit_flush
[junit4:junit4]   2> 12794 T417 C19 P30887 oasc.CachingDirectoryFactory.close Releasing directory:/usr/home/hudson/hudson-slave/workspace/Lucene-Solr-Tests-4.x-java7/solr/build/solr-core/test/J0/./org.apache.solr.cloud.SyncSliceTest-1360627802691/jetty2/index.20130211191015422
[junit4:junit4]   2> 12794 T417 C19 P30887 oasc.CachingDirectoryFactory.close Releasing directory:/usr/home/hudson/hudson-slave/workspace/Lucene-Solr-Tests-4.x-java7/solr/build/solr-core/test/J0/./org.apache.solr.cloud.SyncSliceTest-1360627802691/jetty2/index
[junit4:junit4]   2> 12795 T417 C19 P30887 oasc.RecoveryStrategy.replay No replay needed. core=collection1
[junit4:junit4]   2> 12795 T417 C19 P30887 oasc.RecoveryStrategy.doRecovery Replication Recovery was successful - registering as Active. core=collection1
[junit4:junit4]   2> 12795 T417 C19 P30887 oasc.ZkController.publish publishing core=collection1 state=active
[junit4:junit4]   2> 12795 T417 C19 P30887 oasc.ZkController.publish numShards not found on descriptor - reading it from system property
[junit4:junit4]   2> 12797 T417 C19 P30887 oasc.RecoveryStrategy.doRecovery Finished recovery process. core=collection1
[junit4:junit4]   2> 12860 T447 oass.OpenExchangeRatesOrgProvider.init Initialized with rates=open-exchange-rates.json, refreshInterval=1440.
[junit4:junit4]   2> 12871 T447 oass.IndexSchema.readSchema default search field in schema is text
[junit4:junit4]   2> 12875 T447 oass.IndexSchema.readSchema unique key field: id
[junit4:junit4]   2> 12906 T447 oass.FileExchangeRateProvider.reload Reloading exchange rates from file currency.xml
[junit4:junit4]   2> 12909 T381 oascc.ZkStateReader.updateClusterState Updating cloud state from ZooKeeper... 
[junit4:junit4]   2> 12910 T381 oasc.Overseer$ClusterStateUpdater.updateState Update state numShards=1 message={
[junit4:junit4]   2> 	  "operation":"state",
[junit4:junit4]   2> 	  "numShards":"1",
[junit4:junit4]   2> 	  "shard":"shard1",
[junit4:junit4]   2> 	  "roles":null,
[junit4:junit4]   2> 	  "state":"recovering",
[junit4:junit4]   2> 	  "core":"collection1",
[junit4:junit4]   2> 	  "collection":"collection1",
[junit4:junit4]   2> 	  "node_name":"127.0.0.1:41235_",
[junit4:junit4]   2> 	  "base_url":"http://127.0.0.1:41235"}
[junit4:junit4]   2> 12915 T381 oasc.Overseer$ClusterStateUpdater.updateState Update state numShards=1 message={
[junit4:junit4]   2> 	  "operation":"state",
[junit4:junit4]   2> 	  "numShards":"1",
[junit4:junit4]   2> 	  "shard":"shard1",
[junit4:junit4]   2> 	  "roles":null,
[junit4:junit4]   2> 	  "state":"active",
[junit4:junit4]   2> 	  "core":"collection1",
[junit4:junit4]   2> 	  "collection":"collection1",
[junit4:junit4]   2> 	  "node_name":"127.0.0.1:30887_",
[junit4:junit4]   2> 	  "base_url":"http://127.0.0.1:30887"}
[junit4:junit4]   2> 12918 T447 oass.FileExchangeRateProvider.reload Reloading exchange rates from file currency.xml
[junit4:junit4]   2> 12929 T447 oass.OpenExchangeRatesOrgProvider.reload Reloading exchange rates from open-exchange-rates.json
[junit4:junit4]   2> 12935 T446 oascc.ZkStateReader$2.process A cluster state change: WatchedEvent state:SyncConnected type:NodeDataChanged path:/clusterstate.json, has occurred - updating... (live nodes size: 5)
[junit4:junit4]   2> 12935 T399 oascc.ZkStateReader$2.process A cluster state change: WatchedEvent state:SyncConnected type:NodeDataChanged path:/clusterstate.json, has occurred - updating... (live nodes size: 5)
[junit4:junit4]   2> 12935 T380 oascc.ZkStateReader$2.process A cluster state change: WatchedEvent state:SyncConnected type:NodeDataChanged path:/clusterstate.json, has occurred - updating... (live nodes size: 5)
[junit4:junit4]   2> 12935 T386 oascc.ZkStateReader$2.process A cluster state change: WatchedEvent state:SyncConnected type:NodeDataChanged path:/clusterstate.json, has occurred - updating... (live nodes size: 5)
[junit4:junit4]   2> 12935 T430 oascc.ZkStateReader$2.process A cluster state change: WatchedEvent state:SyncConnected type:NodeDataChanged path:/clusterstate.json, has occurred - updating... (live nodes size: 5)
[junit4:junit4]   2> 12935 T414 oascc.ZkStateReader$2.process A cluster state change: WatchedEvent state:SyncConnected type:NodeDataChanged path:/clusterstate.json, has occurred - updating... (live nodes size: 5)
[junit4:junit4]   2> 12936 T447 oass.OpenExchangeRatesOrgProvider.reload Reloading exchange rates from open-exchange-rates.json
[junit4:junit4]   2> 12938 T447 oasc.SolrCore.<init> [collection1] Opening new SolrCore at /usr/home/hudson/hudson-slave/workspace/Lucene-Solr-Tests-4.x-java7/solr/build/solr-core/test/J0/./org.apache.solr.cloud.SyncSliceTest-jetty4-1360627814263/collection1/, dataDir=./org.apache.solr.cloud.SyncSliceTest-1360627802691/jetty4/
[junit4:junit4]   2> 12938 T447 oasc.JmxMonitoredMap.<init> JMX monitoring is enabled. Adding Solr mbeans to JMX Server: com.sun.jmx.mbeanserver.JmxMBeanServer@253725db
[junit4:junit4]   2> 12939 T447 oasc.SolrCore.initDirectoryFactory solr.NRTCachingDirectoryFactory
[junit4:junit4]   2> 12940 T447 oasc.CachingDirectoryFactory.get return new directory for /usr/home/hudson/hudson-slave/workspace/Lucene-Solr-Tests-4.x-java7/solr/build/solr-core/test/J0/./org.apache.solr.cloud.SyncSliceTest-1360627802691/jetty4 forceNew:false
[junit4:junit4]   2> 12940 T447 oasc.CachingDirectoryFactory.close Releasing directory:/usr/home/hudson/hudson-slave/workspace/Lucene-Solr-Tests-4.x-java7/solr/build/solr-core/test/J0/./org.apache.solr.cloud.SyncSliceTest-1360627802691/jetty4
[junit4:junit4]   2> 12940 T447 oasc.SolrCore.getNewIndexDir New index directory detected: old=null new=./org.apache.solr.cloud.SyncSliceTest-1360627802691/jetty4/index/
[junit4:junit4]   2> 12941 T447 oasc.SolrCore.initIndex WARNING [collection1] Solr index directory './org.apache.solr.cloud.SyncSliceTest-1360627802691/jetty4/index' doesn't exist. Creating new index...
[junit4:junit4]   2> 12941 T447 oasc.CachingDirectoryFactory.get return new directory for /usr/home/hudson/hudson-slave/workspace/Lucene-Solr-Tests-4.x-java7/solr/build/solr-core/test/J0/./org.apache.solr.cloud.SyncSliceTest-1360627802691/jetty4/index forceNew:false
[junit4:junit4]   2> 12953 T447 oasc.SolrDeletionPolicy.onCommit SolrDeletionPolicy.onCommit: commits:num=1
[junit4:junit4]   2> 		commit{dir=RateLimitedDirectoryWrapper(NRTCachingDirectory(org.apache.lucene.store.NIOFSDirectory@/usr/home/hudson/hudson-slave/workspace/Lucene-Solr-Tests-4.x-java7/solr/build/solr-core/test/J0/org.apache.solr.cloud.SyncSliceTest-1360627802691/jetty4/index lockFactory=org.apache.lucene.store.NativeFSLockFactory@4ba4c982; maxCacheMB=48.0 maxMergeSizeMB=4.0)),segFN=segments_1,generation=1,filenames=[segments_1]
[junit4:junit4]   2> 12953 T447 oasc.SolrDeletionPolicy.updateCommits newest commit = 1[segments_1]
[junit4:junit4]   2> 12954 T447 oasc.CachingDirectoryFactory.close Releasing directory:/usr/home/hudson/hudson-slave/workspace/Lucene-Solr-Tests-4.x-java7/solr/build/solr-core/test/J0/./org.apache.solr.cloud.SyncSliceTest-1360627802691/jetty4/index
[junit4:junit4]   2> 12954 T447 oasc.SolrCore.initWriters created xml: solr.XMLResponseWriter
[junit4:junit4]   2> 12956 T447 oasup.UpdateRequestProcessorChain.init inserting DistributedUpdateProcessorFactory into updateRequestProcessorChain "dedupe"
[junit4:junit4]   2> 12956 T447 oasup.UpdateRequestProcessorChain.init inserting DistributedUpdateProcessorFactory into updateRequestProcessorChain "dedupe-allfields"
[junit4:junit4]   2> 12956 T447 oasup.UpdateRequestProcessorChain.init inserting DistributedUpdateProcessorFactory into updateRequestProcessorChain "stored_sig"
[junit4:junit4]   2> 12956 T447 oasup.UpdateRequestProcessorChain.init inserting DistributedUpdateProcessorFactory into updateRequestProcessorChain "uniq-fields"
[junit4:junit4]   2> 12957 T447 oasup.UpdateRequestProcessorChain.init inserting DistributedUpdateProcessorFactory into updateRequestProcessorChain "distrib-dup-test-chain-implicit"
[junit4:junit4]   2> 12957 T447 oasc.RequestHandlers.initHandlersFromConfig adding lazy requestHandler: solr.ReplicationHandler
[junit4:junit4]   2> 12957 T447 oasc.RequestHandlers.initHandlersFromConfig created /replication: solr.ReplicationHandler
[junit4:junit4]   2> 12958 T447 oasc.RequestHandlers.initHandlersFromConfig created standard: solr.StandardRequestHandler
[junit4:junit4]   2> 12958 T447 oasc.RequestHandlers.initHandlersFromConfig created /get: solr.RealTimeGetHandler
[junit4:junit4]   2> 12959 T447 oasc.RequestHandlers.initHandlersFromConfig created dismax: solr.SearchHandler
[junit4:junit4]   2> 12959 T447 oasc.RequestHandlers.initHandlersFromConfig created mock: org.apache.solr.core.MockQuerySenderListenerReqHandler
[junit4:junit4]   2> 12959 T447 oasc.RequestHandlers.initHandlersFromConfig created /admin/: org.apache.solr.handler.admin.AdminHandlers
[junit4:junit4]   2> 12960 T447 oasc.RequestHandlers.initHandlersFromConfig created defaults: solr.StandardRequestHandler
[junit4:junit4]   2> 12960 T447 oasc.RequestHandlers.initHandlersFromConfig adding lazy requestHandler: solr.StandardRequestHandler
[junit4:junit4]   2> 12960 T447 oasc.RequestHandlers.initHandlersFromConfig created lazy: solr.StandardRequestHandler
[junit4:junit4]   2> 12961 T447 oasc.RequestHandlers.initHandlersFromConfig created /update: solr.UpdateRequestHandler
[junit4:junit4]   2> 12961 T447 oasc.RequestHandlers.initHandlersFromConfig created /terms: org.apache.solr.handler.component.SearchHandler
[junit4:junit4]   2> 12961 T447 oasc.RequestHandlers.initHandlersFromConfig created spellCheckCompRH: org.apache.solr.handler.component.SearchHandler
[junit4:junit4]   2> 12962 T447 oasc.RequestHandlers.initHandlersFromConfig created spellCheckCompRH_Direct: org.apache.solr.handler.component.SearchHandler
[junit4:junit4]   2> 12962 T447 oasc.RequestHandlers.initHandlersFromConfig created spellCheckWithWordbreak: org.apache.solr.handler.component.SearchHandler
[junit4:junit4]   2> 12963 T447 oasc.RequestHandlers.initHandlersFromConfig created spellCheckWithWordbreak_Direct: org.apache.solr.handler.component.SearchHandler
[junit4:junit4]   2> 12963 T447 oasc.RequestHandlers.initHandlersFromConfig created spellCheckCompRH1: org.apache.solr.handler.component.SearchHandler
[junit4:junit4]   2> 12964 T447 oasc.RequestHandlers.initHandlersFromConfig created mltrh: org.apache.solr.handler.component.SearchHandler
[junit4:junit4]   2> 12964 T447 oasc.RequestHandlers.initHandlersFromConfig created tvrh: org.apache.solr.handler.component.SearchHandler
[junit4:junit4]   2> 12964 T447 oasc.RequestHandlers.initHandlersFromConfig created /mlt: solr.MoreLikeThisHandler
[junit4:junit4]   2> 12965 T447 oasc.RequestHandlers.initHandlersFromConfig created /debug/dump: solr.DumpRequestHandler
[junit4:junit4]   2> 12973 T447 oashl.XMLLoader.init xsltCacheLifetimeSeconds=60
[junit4:junit4]   2> 12977 T447 oasc.SolrCore.initDeprecatedSupport WARNING solrconfig.xml uses deprecated <admin/gettableFiles>, Please update your config to use the ShowFileRequestHandler.
[junit4:junit4]   2> 12978 T447 oasc.SolrCore.initDeprecatedSupport WARNING adding ShowFileRequestHandler with hidden files: [SCHEMA.XML, OLD_SYNONYMS.TXT, STOPWORDS.TXT, PROTWORDS.TXT, OPEN-EXCHANGE-RATES.JSON, SYNONYMS.TXT, CURRENCY.XML, MAPPING-ISOLATIN1ACCENT.TXT]
[junit4:junit4]   2> 12980 T447 oasc.CachingDirectoryFactory.close Releasing directory:/usr/home/hudson/hudson-slave/workspace/Lucene-Solr-Tests-4.x-java7/solr/build/solr-core/test/J0/./org.apache.solr.cloud.SyncSliceTest-1360627802691/jetty4
[junit4:junit4]   2> 12982 T447 oass.SolrIndexSearcher.<init> Opening Searcher@55699cc0 main
[junit4:junit4]   2> 12982 T447 oasu.CommitTracker.<init> Hard AutoCommit: disabled
[junit4:junit4]   2> 12983 T447 oasu.CommitTracker.<init> Soft AutoCommit: disabled
[junit4:junit4]   2> 12983 T447 oashc.SpellCheckComponent.inform Initializing spell checkers
[junit4:junit4]   2> 12998 T447 oass.DirectSolrSpellChecker.init init: {name=direct,classname=DirectSolrSpellChecker,field=lowerfilt,minQueryLength=3}
[junit4:junit4]   2> 13046 T450 oasc.SolrCore.registerSearcher [collection1] Registered new searcher Searcher@55699cc0 main{StandardDirectoryReader(segments_1:1)}
[junit4:junit4]   2> 13050 T447 oasc.ZkController.publish publishing core=collection1 state=down
[junit4:junit4]   2> 13051 T447 oasc.ZkController.publish numShards not found on descriptor - reading it from system property
[junit4:junit4]   2> 14444 T381 oascc.ZkStateReader.updateClusterState Updating cloud state from ZooKeeper... 
[junit4:junit4]   2> 14445 T381 oasc.Overseer$ClusterStateUpdater.updateState Update state numShards=1 message={
[junit4:junit4]   2> 	  "operation":"state",
[junit4:junit4]   2> 	  "numShards":"1",
[junit4:junit4]   2> 	  "shard":null,
[junit4:junit4]   2> 	  "roles":null,
[junit4:junit4]   2> 	  "state":"down",
[junit4:junit4]   2> 	  "core":"collection1",
[junit4:junit4]   2> 	  "collection":"collection1",
[junit4:junit4]   2> 	  "node_name":"127.0.0.1:19009_",
[junit4:junit4]   2> 	  "base_url":"http://127.0.0.1:19009"}
[junit4:junit4]   2> 14445 T381 oasc.Overseer$ClusterStateUpdater.updateState Collection already exists with numShards=1
[junit4:junit4]   2> 14445 T381 oasc.Overseer$ClusterStateUpdater.updateState Assigning new node to shard shard=shard1
[junit4:junit4]   2> 14459 T399 oascc.ZkStateReader$2.process A cluster state change: WatchedEvent state:SyncConnected type:NodeDataChanged path:/clusterstate.json, has occurred - updating... (live nodes size: 5)
[junit4:junit4]   2> 14459 T414 oascc.ZkStateReader$2.process A cluster state change: WatchedEvent state:SyncConnected type:NodeDataChanged path:/clusterstate.json, has occurred - updating... (live nodes size: 5)
[junit4:junit4]   2> 14460 T386 oascc.ZkStateReader$2.process A cluster state change: WatchedEvent state:SyncConnected type:NodeDataChanged path:/clusterstate.json, has occurred - updating... (live nodes size: 5)
[junit4:junit4]   2> 14459 T446 oascc.ZkStateReader$2.process A cluster state change: WatchedEvent state:SyncConnected type:NodeDataChanged path:/clusterstate.json, has occurred - updating... (live nodes size: 5)
[junit4:junit4]   2> 14459 T380 oascc.ZkStateReader$2.process A cluster state change: WatchedEvent state:SyncConnected type:NodeDataChanged path:/clusterstate.json, has occurred - updating... (live nodes size: 5)
[junit4:junit4]   2> 14459 T430 oascc.ZkStateReader$2.process A cluster state change: WatchedEvent state:SyncConnected type:NodeDataChanged path:/clusterstate.json, has occurred - updating... (live nodes size: 5)
[junit4:junit4]   2> 15054 T447 oasc.CoreContainer.registerCore registering core: collection1
[junit4:junit4]   2> 15054 T447 oasc.ZkController.register Register replica - core:collection1 address:http://127.0.0.1:19009 collection:collection1 shard:shard1
[junit4:junit4]   2> 15059 T447 oasc.ZkController.register We are http://127.0.0.1:19009/collection1/ and leader is http://127.0.0.1:35520/collection1/
[junit4:junit4]   2> 15059 T447 oasc.ZkController.register No LogReplay needed for core=collection1 baseURL=http://127.0.0.1:19009
[junit4:junit4]   2> 15059 T447 oasc.ZkController.checkRecovery Core needs to recover:collection1
[junit4:junit4]   2> 15059 T447 oasu.DefaultSolrCoreState.doRecovery Running recovery - first canceling any ongoing recovery
[junit4:junit4]   2> ASYNC  NEW_CORE C22 name=collection1 org.apache.solr.core.SolrCore@5df7cdad url=http://127.0.0.1:19009/collection1 node=127.0.0.1:19009_ C22_STATE=coll:collection1 core:collection1 props:{shard=null, roles=null, state=down, core=collection1, collection=collection1, node_name=127.0.0.1:19009_, base_url=http://127.0.0.1:19009}
[junit4:junit4]   2> 15060 T451 C22 P19009 oasc.RecoveryStrategy.run Starting recovery process.  core=collection1 recoveringAfterStartup=true
[junit4:junit4]   2> 15060 T451 C22 P19009 oasc.RecoveryStrategy.doRecovery ###### startupVersions=[]
[junit4:junit4]   2> 15061 T451 C22 P19009 oasc.ZkController.publish publishing core=collection1 state=recovering
[junit4:junit4]   2> 15061 T447 oascc.ZkStateReader.updateClusterState Updating cloud state from ZooKeeper... 
[junit4:junit4]   2> 15061 T451 C22 P19009 oasc.ZkController.publish numShards not found on descriptor - reading it from system property
[junit4:junit4]   2> 15062 T358 oass.SolrDispatchFilter.init user.dir=/usr/home/hudson/hudson-slave/workspace/Lucene-Solr-Tests-4.x-java7/solr/build/solr-core/test/J0
[junit4:junit4]   2> 15062 T358 oass.SolrDispatchFilter.init SolrDispatchFilter.init() done
[junit4:junit4]   2> 15062 T451 C22 P19009 oascsi.HttpClientUtil.createClient Creating new http client, config:maxConnections=128&maxConnectionsPerHost=32&followRedirects=false
[junit4:junit4]   2> 15063 T358 oascsi.HttpClientUtil.createClient Creating new http client, config:maxConnections=128&maxConnectionsPerHost=32&followRedirects=false
[junit4:junit4]   2> 15078 T358 oascc.ZkStateReader.updateClusterState Updating cloud state from ZooKeeper... 
[junit4:junit4]   2> 15080 T358 oasc.AbstractFullDistribZkTestBase.waitForThingsToLevelOut Wait for recoveries to finish - wait 15 for each attempt
[junit4:junit4]   2> 15080 T358 oasc.AbstractDistribZkTestBase.waitForRecoveriesToFinish Wait for recoveries to finish - collection: collection1 failOnTimeout:true timeout (sec):15
[junit4:junit4]   2> 15081 T358 oascc.ZkStateReader.updateClusterState Updating cloud state from ZooKeeper... 
[junit4:junit4]   2>  C20_STATE=coll:collection1 core:collection1 props:{shard=shard1, roles=null, state=recovering, core=collection1, collection=collection1, node_name=127.0.0.1:41235_, base_url=http://127.0.0.1:41235}
[junit4:junit4]   2> 15581 T433 C20 P41235 oasc.RecoveryStrategy.doRecovery Attempting to PeerSync from http://127.0.0.1:35520/collection1/ core=collection1 - recoveringAfterStartup=true
[junit4:junit4]   2> 15581 T433 C20 P41235 oasu.PeerSync.sync PeerSync: core=collection1 url=http://127.0.0.1:41235 START replicas=[http://127.0.0.1:35520/collection1/] nUpdates=100
[junit4:junit4]   2> 15582 T433 C20 P41235 oasu.PeerSync.sync WARNING no frame of reference to tell of we've missed updates
[junit4:junit4]   2> 15582 T433 C20 P41235 oasc.RecoveryStrategy.doRecovery PeerSync Recovery was not successful - trying replication. core=collection1
[junit4:junit4]   2> 15582 T433 C20 P41235 oasc.RecoveryStrategy.doRecovery Starting Replication Recovery. core=collection1
[junit4:junit4]   2> 15583 T433 C20 P41235 oasc.RecoveryStrategy.doRecovery Begin buffering updates. core=collection1
[junit4:junit4]   2> 15583 T433 C20 P41235 oasu.UpdateLog.bufferUpdates Starting to buffer updates. FSUpdateLog{state=ACTIVE, tlog=null}
[junit4:junit4]   2> 15583 T433 C20 P41235 oasc.RecoveryStrategy.replicate Attempting to replicate from http://127.0.0.1:35520/collection1/. core=collection1
[junit4:junit4]   2> 15584 T433 C20 P41235 oascsi.HttpClientUtil.createClient Creating new http client, config:maxConnections=128&maxConnectionsPerHost=32&followRedirects=false
[junit4:junit4]   2> 15586 T391 C21 P35520 REQ /get {getVersions=100&distrib=false&wt=javabin&qt=/get&version=2} status=0 QTime=0 
[junit4:junit4]   2> 15599 T395 C21 P35520 oasu.DirectUpdateHandler2.commit start commit{,optimize=false,openSearcher=false,waitSearcher=true,expungeDeletes=false,softCommit=false}
[junit4:junit4]   2> 15605 T395 C21 P35520 oasc.SolrDeletionPolicy.onCommit SolrDeletionPolicy.onCommit: commits:num=2
[junit4:junit4]   2> 		commit{dir=RateLimitedDirectoryWrapper(NRTCachingDirectory(org.apache.lucene.store.NIOFSDirectory@/usr/home/hudson/hudson-slave/workspace/Lucene-Solr-Tests-4.x-java7/solr/build/solr-core/test/J0/org.apache.solr.cloud.SyncSliceTest-1360627802691/jetty1/index lockFactory=org.apache.lucene.store.NativeFSLockFactory@4457313e; maxCacheMB=48.0 maxMergeSizeMB=4.0)),segFN=segments_2,generation=2,filenames=[segments_2]
[junit4:junit4]   2> 		commit{dir=RateLimitedDirectoryWrapper(NRTCachingDirectory(org.apache.lucene.store.NIOFSDirectory@/usr/home/hudson/hudson-slave/workspace/Lucene-Solr-Tests-4.x-java7/solr/build/solr-core/test/J0/org.apache.solr.cloud.SyncSliceTest-1360627802691/jetty1/index lockFactory=org.apache.lucene.store.NativeFSLockFactory@4457313e; maxCacheMB=48.0 maxMergeSizeMB=4.0)),segFN=segments_3,generation=3,filenames=[segments_3]
[junit4:junit4]   2> 15605 T395 C21 P35520 oasc.SolrDeletionPolicy.updateCommits newest commit = 3[segments_3]
[junit4:junit4]   2> 15606 T395 C21 P35520 oasc.CachingDirectoryFactory.close Releasing directory:/usr/home/hudson/hudson-slave/workspace/Lucene-Solr-Tests-4.x-java7/solr/build/solr-core/test/J0/./org.apache.solr.cloud.SyncSliceTest-1360627802691/jetty1
[junit4:junit4]   2> 15607 T395 C21 P35520 oasu.DirectUpdateHandler2.commit end_commit_flush
[junit4:junit4]   2> 15607 T395 C21 P35520 /update {waitSearcher=true&openSearcher=false&commit=true&wt=javabin&commit_end_point=true&version=2&softCommit=false} {commit=} 0 8
[junit4:junit4]   2> 15609 T433 C20 P41235 oash.ReplicationHandler.inform Commits will be reserved for  10000
[junit4:junit4]   2> 15609 T433 C20 P41235 oash.SnapPuller.<init>  No value set for 'pollInterval'. Timer Task not started.
[junit4:junit4]   2> 15613 T393 C21 P35520 REQ /replication {command=indexversion&qt=/replication&wt=javabin&version=2} status=0 QTime=0 
[junit4:junit4]   2> 15614 T433 C20 P41235 oash.SnapPuller.fetchLatestIndex Master's generation: 3
[junit4:junit4]   2> 15614 T433 C20 P41235 oash.SnapPuller.fetchLatestIndex Slave's generation: 1
[junit4:junit4]   2> 15615 T433 C20 P41235 oash.SnapPuller.fetchLatestIndex Starting replication process
[junit4:junit4]   2> 15618 T393 C21 P35520 oasc.CachingDirectoryFactory.close Releasing directory:/usr/home/hudson/hudson-slave/workspace/Lucene-Solr-Tests-4.x-java7/solr/build/solr-core/test/J0/./org.apache.solr.cloud.SyncSliceTest-1360627802691/jetty1
[junit4:junit4]   2> 15619 T393 C21 P35520 oasc.CachingDirectoryFactory.close Releasing directory:/usr/home/hudson/hudson-slave/workspace/Lucene-Solr-Tests-4.x-java7/solr/build/solr-core/test/J0/./org.apache.solr.cloud.SyncSliceTest-1360627802691/jetty1/index
[junit4:junit4]   2> 15619 T393 C21 P35520 REQ /replication {command=filelist&qt=/replication&wt=javabin&generation=3&version=2} status=0 QTime=2 
[junit4:junit4]   2> 15620 T433 C20 P41235 oash.SnapPuller.fetchLatestIndex Number of files in latest index in master: 1
[junit4:junit4]   2> 15621 T433 C20 P41235 oasc.CachingDirectoryFactory.get return new directory for /usr/home/hudson/hudson-slave/workspace/Lucene-Solr-Tests-4.x-java7/solr/build/solr-core/test/J0/./org.apache.solr.cloud.SyncSliceTest-1360627802691/jetty3/index.20130211191018307 forceNew:false
[junit4:junit4]   2> 15622 T433 C20 P41235 oasc.CachingDirectoryFactory.close Releasing directory:/usr/home/hudson/hudson-slave/workspace/Lucene-Solr-Tests-4.x-java7/solr/build/solr-core/test/J0/./org.apache.solr.cloud.SyncSliceTest-1360627802691/jetty3
[junit4:junit4]   2> 15623 T433 C20 P41235 oash.SnapPuller.fetchLatestIndex Starting download to RateLimitedDirectoryWrapper(NRTCachingDirectory(org.apache.lucene.store.NIOFSDirectory@/usr/home/hudson/hudson-slave/workspace/Lucene-Solr-Tests-4.x-java7/solr/build/solr-core/test/J0/org.apache.solr.cloud.SyncSliceTest-1360627802691/jetty3/index.20130211191018307 lockFactory=org.apache.lucene.store.NativeFSLockFactory@5ecdc1f7; maxCacheMB=48.0 maxMergeSizeMB=4.0)) fullCopy=true
[junit4:junit4]   2> 15627 T393 C21 P35520 REQ /replication {file=segments_3&command=filecontent&checksum=true&wt=filestream&qt=/replication&generation=3} status=0 QTime=0 
[junit4:junit4]   2> 15629 T433 C20 P41235 oasc.CachingDirectoryFactory.close Releasing directory:/usr/home/hudson/hudson-slave/workspace/Lucene-Solr-Tests-4.x-java7/solr/build/solr-core/test/J0/./org.apache.solr.cloud.SyncSliceTest-1360627802691/jetty3/index
[junit4:junit4]   2> 15629 T433 C20 P41235 oash.SnapPuller.fetchLatestIndex Total time taken for download : 0 secs
[junit4:junit4]   2> 15630 T433 C20 P41235 oash.SnapPuller.modifyIndexProps New index installed. Updating index properties... index=index.20130211191018307
[junit4:junit4]   2> 15631 T433 C20 P41235 oasc.CachingDirectoryFactory.close Releasing directory:/usr/home/hudson/hudson-slave/workspace/Lucene-Solr-Tests-4.x-java7/solr/build/solr-core/test/J0/./org.apache.solr.cloud.SyncSliceTest-1360627802691/jetty3
[junit4:junit4]   2> 15632 T433 C20 P41235 oasc.CachingDirectoryFactory.close Releasing directory:/usr/home/hudson/hudson-slave/workspace/Lucene-Solr-Tests-4.x-java7/solr/build/solr-core/test/J0/./org.apache.solr.cloud.SyncSliceTest-1360627802691/jetty3
[junit4:junit4]   2> 15632 T433 C20 P41235 oasc.SolrCore.getNewIndexDir New index directory detected: old=./org.apache.solr.cloud.SyncSliceTest-1360627802691/jetty3/index/ new=./org.apache.solr.cloud.SyncSliceTest-1360627802691/jetty3/index.20130211191018307
[junit4:junit4]   2> 15636 T433 C20 P41235 oasc.SolrDeletionPolicy.onInit SolrDeletionPolicy.onInit: commits:num=1
[junit4:junit4]   2> 		commit{dir=RateLimitedDirectoryWrapper(NRTCachingDirectory(org.apache.lucene.store.NIOFSDirectory@/usr/home/hudson/hudson-slave/workspace/Lucene-Solr-Tests-4.x-java7/solr/build/solr-core/test/J0/org.apache.solr.cloud.SyncSliceTest-1360627802691/jetty3/index.20130211191018307 lockFactory=org.apache.lucene.store.NativeFSLockFactory@5ecdc1f7; maxCacheMB=48.0 maxMergeSizeMB=4.0)),segFN=segments_3,generation=3,filenames=[segments_3]
[junit4:junit4]   2> 15636 T433 C20 P41235 oasc.SolrDeletionPolicy.updateCommits newest commit = 3[segments_3]
[junit4:junit4]   2> 15637 T433 C20 P41235 oasc.CachingDirectoryFactory.close Releasing directory:/usr/home/hudson/hudson-slave/workspace/Lucene-Solr-Tests-4.x-java7/solr/build/solr-core/test/J0/./org.apache.solr.cloud.SyncSliceTest-1360627802691/jetty3
[junit4:junit4]   2> 15638 T433 C20 P41235 oasu.DefaultSolrCoreState.newIndexWriter Creating new IndexWriter...
[junit4:junit4]   2> 15638 T433 C20 P41235 oasu.DefaultSolrCoreState.newIndexWriter Waiting until IndexWriter is unused... core=collection1
[junit4:junit4]   2> 15638 T433 C20 P41235 oasu.DefaultSolrCoreState.newIndexWriter Rollback old IndexWriter... core=collection1
[junit4:junit4]   2> 15639 T433 C20 P41235 oasc.CachingDirectoryFactory.close Releasing directory:/usr/home/hudson/hudson-slave/workspace/Lucene-Solr-Tests-4.x-java7/solr/build/solr-core/test/J0/./org.apache.solr.cloud.SyncSliceTest-1360627802691/jetty3/index.20130211191018307
[junit4:junit4]   2> 15640 T433 C20 P41235 oasc.CachingDirectoryFactory.close Releasing directory:/usr/home/hudson/hudson-slave/workspace/Lucene-Solr-Tests-4.x-java7/solr/build/solr-core/test/J0/./org.apache.solr.cloud.SyncSliceTest-1360627802691/jetty3
[junit4:junit4]   2> 15643 T433 C20 P41235 oasc.SolrDeletionPolicy.onInit SolrDeletionPolicy.onInit: commits:num=1
[junit4:junit4]   2> 		commit{dir=RateLimitedDirectoryWrapper(NRTCachingDirectory(org.apache.lucene.store.NIOFSDirectory@/usr/home/hudson/hudson-slave/workspace/Lucene-Solr-Tests-4.x-java7/solr/build/solr-core/test/J0/org.apache.solr.cloud.SyncSliceTest-1360627802691/jetty3/index.20130211191018307 lockFactory=org.apache.lucene.store.NativeFSLockFactory@5ecdc1f7; maxCacheMB=48.0 maxMergeSizeMB=4.0)),segFN=segments_3,generation=3,filenames=[segments_3]
[junit4:junit4]   2> 15644 T433 C20 P41235 oasc.SolrDeletionPolicy.updateCommits newest commit = 3[segments_3]
[junit4:junit4]   2> 15644 T433 C20 P41235 oasu.DefaultSolrCoreState.newIndexWriter New IndexWriter is ready to be used.
[junit4:junit4]   2> 15644 T433 C20 P41235 oasc.CachingDirectoryFactory.close Releasing directory:/usr/home/hudson/hudson-slave/workspace/Lucene-Solr-Tests-4.x-java7/solr/build/solr-core/test/J0/./org.apache.solr.cloud.SyncSliceTest-1360627802691/jetty3
[junit4:junit4]   2> 15645 T433 C20 P41235 oass.SolrIndexSearcher.<init> Opening Searcher@377b6d55 main
[junit4:junit4]   2> 15647 T432 oasc.SolrCore.registerSearcher [collection1] Registered new searcher Searcher@377b6d55 main{StandardDirectoryReader(segments_3:1:nrt)}
[junit4:junit4]   2> 15648 T432 oasc.CachingDirectoryFactory.close Releasing directory:/usr/home/hudson/hudson-slave/workspace/Lucene-Solr-Tests-4.x-java7/solr/build/solr-core/test/J0/./org.apache.solr.cloud.SyncSliceTest-1360627802691/jetty3/index
[junit4:junit4]   2> 15648 T433 C20 P41235 oasu.DirectUpdateHandler2.commit start commit{,optimize=false,openSearcher=false,waitSearcher=false,expungeDeletes=false,softCommit=false}
[junit4:junit4]   2> 15651 T433 C20 P41235 oasc.SolrDeletionPolicy.onCommit SolrDeletionPolicy.onCommit: commits:num=2
[junit4:junit4]   2> 		commit{dir=RateLimitedDirectoryWrapper(NRTCachingDirectory(org.apache.lucene.store.NIOFSDirectory@/usr/home/hudson/hudson-slave/workspace/Lucene-Solr-Tests-4.x-java7/solr/build/solr-core/test/J0/org.apache.solr.cloud.SyncSliceTest-1360627802691/jetty3/index.20130211191018307 lockFactory=org.apache.lucene.store.NativeFSLockFactory@5ecdc1f7; maxCacheMB=48.0 maxMergeSizeMB=4.0)),segFN=segments_3,generation=3,filenames=[segments_3]
[junit4:junit4]   2> 		commit{dir=RateLimitedDirectoryWrapper(NRTCachingDirectory(org.apache.lucene.store.NIOFSDirectory@/usr/home/hudson/hudson-slave/workspace/Lucene-Solr-Tests-4.x-java7/solr/build/solr-core/test/J0/org.apache.solr.cloud.SyncSliceTest-1360627802691/jetty3/index.20130211191018307 lockFactory=org.apache.lucene.store.NativeFSLockFactory@5ecdc1f7; maxCacheMB=48.0 maxMergeSizeMB=4.0)),segFN=segments_4,generation=4,filenames=[segments_4]
[junit4:junit4]   2> 15652 T433 C20 P41235 oasc.SolrDeletionPolicy.updateCommits newest commit = 4[segments_4]
[junit4:junit4]   2> 15653 T433 C20 P41235 oasc.CachingDirectoryFactory.close Releasing directory:/usr/home/hudson/hudson-slave/workspace/Lucene-Solr-Tests-4.x-java7/solr/build/solr-core/test/J0/./org.apache.solr.cloud.SyncSliceTest-1360627802691/jetty3
[junit4:junit4]   2> 15653 T433 C20 P41235 oasu.DirectUpdateHandler2.commit end_commit_flush
[junit4:junit4]   2> 15653 T433 C20 P41235 oasc.CachingDirectoryFactory.close Releasing directory:/usr/home/hudson/hudson-slave/workspace/Lucene-Solr-Tests-4.x-java7/solr/build/solr-core/test/J0/./org.apache.solr.cloud.SyncSliceTest-1360627802691/jetty3/index.20130211191018307
[junit4:junit4]   2> 15653 T433 C20 P41235 oasc.CachingDirectoryFactory.close Releasing directory:/usr/home/hudson/hudson-slave/workspace/Lucene-Solr-Tests-4.x-java7/solr/build/solr-core/test/J0/./org.apache.solr.cloud.SyncSliceTest-1360627802691/jetty3/index
[junit4:junit4]   2> 15654 T433 C20 P41235 oasc.RecoveryStrategy.replay No replay needed. core=collection1
[junit4:junit4]   2> 15654 T433 C20 P41235 oasc.RecoveryStrategy.doRecovery Replication Recovery was successful - registering as Active. core=collection1
[junit4:junit4]   2> 15654 T433 C20 P41235 oasc.ZkController.publish publishing core=collection1 state=active
[junit4:junit4]   2> 15654 T433 C20 P41235 oasc.ZkController.publish numShards not found on descriptor - reading it from system property
[junit4:junit4]   2> 15662 T433 C20 P41235 oasc.RecoveryStrategy.doRecovery Finished recovery process. core=collection1
[junit4:junit4]   2> 15967 T381 oascc.ZkStateReader.updateClusterState Updating cloud state from ZooKeeper... 
[junit4:junit4]   2> 15968 T381 oasc.Overseer$ClusterStateUpdater.updateState Update state numShards=1 message={
[junit4:junit4]   2> 	  "operation":"state",
[junit4:junit4]   2> 	  "numShards":"1",
[junit4:junit4]   2> 	  "shard":"shard1",
[junit4:junit4]   2> 	  "roles":null,
[junit4:junit4]   2> 	  "state":"recovering",
[junit4:junit4]   2> 	  "core":"collection1",
[junit4:junit4]   2> 	  "collection":"collection1",
[junit4:junit4]   2> 	  "node_name":"127.0.0.1:19009_",
[junit4:junit4]   2> 	  "base_url":"http://127.0.0.1:19009"}
[junit4:junit4]   2> 15974 T381 oasc.Overseer$ClusterStateUpdater.updateState Update state numShards=1 message={
[junit4:junit4]   2> 	  "operation":"state",
[junit4:junit4]   2> 	  "numShards":"1",
[junit4:junit4]   2> 	  "shard":"shard1",
[junit4:junit4]   2> 	  "roles":null,
[junit4:junit4]   2> 	  "state":"active",
[junit4:junit4]   2> 	  "core":"collection1",
[junit4:junit4]   2> 	  "collection":"collection1",
[junit4:junit4]   2> 	  "node_name":"127.0.0.1:41235_",
[junit4:junit4]   2> 	  "base_url":"http://127.0.0.1:41235"}
[junit4:junit4]   2> 15985 T399 oascc.ZkStateReader$2.process A cluster state change: WatchedEvent state:SyncConnected type:NodeDataChanged path:/clusterstate.json, has occurred - updating... (live nodes size: 5)
[junit4:junit4]   2> 15985 T446 oascc.ZkStateReader$2.process A cluster state change: WatchedEvent state:SyncConnected type:NodeDataChanged path:/clusterstate.json, has occurred - updating... (live nodes size: 5)
[junit4:junit4]   2> 15986 T380 oascc.ZkStateReader$2.process A cluster state change: WatchedEvent state:SyncConnected type:NodeDataChanged path:/clusterstate.json, has occurred - updating... (live nodes size: 5)
[junit4:junit4]   2> 15986 T430 oascc.ZkStateReader$2.process A cluster state change: WatchedEvent state:SyncConnected type:NodeDataChanged path:/clusterstate.json, has occurred - updating... (live nodes size: 5)
[junit4:junit4]   2> 15986 T386 oascc.ZkStateReader$2.process A cluster state change: WatchedEvent state:SyncConnected type:NodeDataChanged path:/clusterstate.json, has occurred - updating... (live nodes size: 5)
[junit4:junit4]   2> 15985 T414 oascc.ZkStateReader$2.process A cluster state change: WatchedEvent state:SyncConnected type:NodeDataChanged path:/clusterstate.json, has occurred - updating... (live nodes size: 5)
[junit4:junit4]   2> 16083 T358 oascc.ZkStateReader.updateClusterState Updating cloud state from ZooKeeper... 
[junit4:junit4]   2> 17087 T358 oascc.ZkStateReader.updateClusterState Updating cloud state from ZooKeeper... 
[junit4:junit4]   2>  C22_STATE=coll:collection1 core:collection1 props:{shard=shard1, roles=null, state=recovering, core=collection1, collection=collection1, node_name=127.0.0.1:19009_, base_url=http://127.0.0.1:19009}
[junit4:junit4]   2> 18081 T451 C22 P19009 oasc.RecoveryStrategy.doRecovery Attempting to PeerSync from http://127.0.0.1:35520/collection1/ core=collection1 - recoveringAfterStartup=true
[junit4:junit4]   2> 18081 T451 C22 P19009 oasu.PeerSync.sync PeerSync: core=collection1 url=http://127.0.0.1:19009 START replicas=[http://127.0.0.1:35520/collection1/] nUpdates=100
[junit4:junit4]   2> 18082 T451 C22 P19009 oasu.PeerSync.sync WARNING no frame of reference to tell of we've missed updates
[junit4:junit4]   2> 18082 T451 C22 P19009 oasc.RecoveryStrategy.doRecovery PeerSync Recovery was not successful - trying replication. core=collection1
[junit4:junit4]   2> 18082 T451 C22 P19009 oasc.RecoveryStrategy.doRecovery Starting Replication Recovery. core=collection1
[junit4:junit4]   2> 18082 T451 C22 P19009 oasc.RecoveryStrategy.doRecovery Begin buffering updates. core=collection1
[junit4:junit4]   2> 18082 T451 C22 P19009 oasu.UpdateLog.bufferUpdates Starting to buffer updates. FSUpdateLog{state=ACTIVE, tlog=null}
[junit4:junit4]   2> 18082 T451 C22 P19009 oasc.RecoveryStrategy.replicate Attempting to replicate from http://127.0.0.1:35520/collection1/. core=collection1
[junit4:junit4]   2> 18083 T451 C22 P19009 oascsi.HttpClientUtil.createClient Creating new http client, config:maxConnections=128&maxConnectionsPerHost=32&followRedirects=false
[junit4:junit4]   2> 18085 T391 C21 P35520 REQ /get {getVersions=100&distrib=false&wt=javabin&qt=/get&version=2} status=0 QTime=0 
[junit4:junit4]   2> 18089 T358 oascc.ZkStateReader.updateClusterState Updating cloud state from ZooKeeper... 
[junit4:junit4]   2> 18096 T389 C21 P35520 oasu.DirectUpdateHandler2.commit start commit{,optimize=false,openSearcher=false,waitSearcher=true,expungeDeletes=false,softCommit=false}
[junit4:junit4]   2> 18125 T389 C21 P35520 oasc.SolrDeletionPolicy.onCommit SolrDeletionPolicy.onCommit: commits:num=3
[junit4:junit4]   2> 		commit{dir=RateLimitedDirectoryWrapper(NRTCachingDirectory(org.apache.lucene.store.NIOFSDirectory@/usr/home/hudson/hudson-slave/workspace/Lucene-Solr-Tests-4.x-java7/solr/build/solr-core/test/J0/org.apache.solr.cloud.SyncSliceTest-1360627802691/jetty1/index lockFactory=org.apache.lucene.store.NativeFSLockFactory@4457313e; maxCacheMB=48.0 maxMergeSizeMB=4.0)),segFN=segments_2,generation=2,filenames=[segments_2]
[junit4:junit4]   2> 		commit{dir=RateLimitedDirectoryWrapper(NRTCachingDirectory(org.apache.lucene.store.NIOFSDirectory@/usr/home/hudson/hudson-slave/workspace/Lucene-Solr-Tests-4.x-java7/solr/build/solr-core/test/J0/org.apache.solr.cloud.SyncSliceTest-1360627802691/jetty1/index lockFactory=org.apache.lucene.store.NativeFSLockFactory@4457313e; maxCacheMB=48.0 maxMergeSizeMB=4.0)),segFN=segments_3,generation=3,filenames=[segments_3]
[junit4:junit4]   2> 		commit{dir=RateLimitedDirectoryWrapper(NRTCachingDirectory(org.apache.lucene.store.NIOFSDirectory@/usr/home/hudson/hudson-slave/workspace/Lucene-Solr-Tests-4.x-java7/solr/build/solr-core/test/J0/org.apache.solr.cloud.SyncSliceTest-1360627802691/jetty1/index lockFactory=org.apache.lucene.store.NativeFSLockFactory@4457313e; maxCacheMB=48.0 maxMergeSizeMB=4.0)),segFN=segments_4,generation=4,filenames=[segments_4]
[junit4:junit4]   2> 18125 T389 C21 P35520 oasc.SolrDeletionPolicy.updateCommits newest commit = 4[segments_4]
[junit4:junit4]   2> 18125 T389 C21 P35520 oasc.CachingDirectoryFactory.close Releasing directory:/usr/home/hudson/hudson-slave/workspace/Lucene-Solr-Tests-4.x-java7/solr/build/solr-core/test/J0/./org.apache.solr.cloud.SyncSliceTest-1360627802691/jetty1
[junit4:junit4]   2> 18126 T389 C21 P35520 oasu.DirectUpdateHandler2.commit end_commit_flush
[junit4:junit4]   2> 18126 T389 C21 P35520 /update {waitSearcher=true&openSearcher=false&commit=true&wt=javabin&commit_end_point=true&version=2&softCommit=false} {commit=} 0 30
[junit4:junit4]   2> 18127 T451 C22 P19009 oash.ReplicationHandler.inform Commits will be reserved for  10000
[junit4:junit4]   2> 18127 T451 C22 P19009 oash.SnapPuller.<init>  No value set for 'pollInterval'. Timer Task not started.
[junit4:junit4]   2> 18129 T393 C21 P35520 REQ /replication {command=indexversion&qt=/replication&wt=javabin&version=2} status=0 QTime=0 
[junit4:junit4]   2> 18130 T451 C22 P19009 oash.SnapPuller.fetchLatestIndex Master's generation: 4
[junit4:junit4]   2> 18130 T451 C22 P19009 oash.SnapPuller.fetchLatestIndex Slave's generation: 1
[junit4:junit4]   2> 18131 T451 C22 P19009 oash.SnapPuller.fetchLatestIndex Starting replication process
[junit4:junit4]   2> 18133 T393 C21 P35520 oasc.CachingDirectoryFactory.close Releasing directory:/usr/home/hudson/hudson-slave/workspace/Lucene-Solr-Tests-4.x-java7/solr/build/solr-core/test/J0/./org.apache.solr.cloud.SyncSliceTest-1360627802691/jetty1
[junit4:junit4]   2> 18134 T393 C21 P35520 oasc.CachingDirectoryFactory.close Releasing directory:/usr/home/hudson/hudson-slave/workspace/Lucene-Solr-Tests-4.x-java7/solr/build/solr-core/test/J0/./org.apache.solr.cloud.SyncSliceTest-1360627802691/jetty1/index
[junit4:junit4]   2> 18134 T393 C21 P35520 REQ /replication {command=filelist&qt=/replication&wt=javabin&generation=4&version=2} status=0 QTime=1 
[junit4:junit4]   2> 18135 T451 C22 P19009 oash.SnapPuller.fetchLatestIndex Number of files in latest index in master: 1
[junit4:junit4]   2> 18136 T451 C22 P19009 oasc.CachingDirectoryFactory.get return new directory for /usr/home/hudson/hudson-slave/workspace/Lucene-Solr-Tests-4.x-java7/solr/build/solr-core/test/J0/./org.apache.solr.cloud.SyncSliceTest-1360627802691/jetty4/index.20130211191020822 forceNew:false
[junit4:junit4]   2> 18137 T451 C22 P19009 oasc.CachingDirectoryFactory.close Releasing directory:/usr/home/hudson/hudson-slave/workspace/Lucene-Solr-Tests-4.x-java7/solr/build/solr-core/test/J0/./org.apache.solr.cloud.SyncSliceTest-1360627802691/jetty4
[junit4:junit4]   2> 18137 T451 C22 P19009 oash.SnapPuller.fetchLatestIndex Starting download to RateLimitedDirectoryWrapper(NRTCachingDirectory(org.apache.lucene.store.NIOFSDirectory@/usr/home/hudson/hudson-slave/workspace/Lucene-Solr-Tests-4.x-java7/solr/build/solr-core/test/J0/org.apache.solr.cloud.SyncSliceTest-1360627802691/jetty4/index.20130211191020822 lockFactory=org.apache.lucene.store.NativeFSLockFactory@62a813e4; maxCacheMB=48.0 maxMergeSizeMB=4.0)) fullCopy=true
[junit4:junit4]   2> 18141 T393 C21 P35520 REQ /replication {file=segments_4&command=filecontent&checksum=true&wt=filestream&qt=/replication&generation=4} status=0 QTime=0 
[junit4:junit4]   2> 18143 T451 C22 P19009 oasc.CachingDirectoryFactory.close Releasing directory:/usr/home/hudson/hudson-slave/workspace/Lucene-Solr-Tests-4.x-java7/solr/build/solr-core/test/J0/./org.apache.solr.cloud.SyncSliceTest-1360627802691/jetty4/index
[junit4:junit4]   2> 18143 T451 C22 P19009 oash.SnapPuller.fetchLatestIndex Total time taken for download : 0 secs
[junit4:junit4]   2> 18144 T451 C22 P19009 oash.SnapPuller.modifyIndexProps New index installed. Updating index properties... index=index.20130211191020822
[junit4:junit4]   2> 18145 T451 C22 P19009 oasc.CachingDirectoryFactory.close Releasing directory:/usr/home/hudson/hudson-slave/workspace/Lucene-Solr-Tests-4.x-java7/solr/build/solr-core/test/J0/./org.apache.solr.cloud.SyncSliceTest-1360627802691/jetty4
[junit4:junit4]   2> 18145 T451 C22 P19009 oasc.CachingDirectoryFactory.close Releasing directory:/usr/home/hudson/hudson-slave/workspace/Lucene-Solr-Tests-4.x-java7/solr/build/solr-core/test/J0/./org.apache.solr.cloud.SyncSliceTest-1360627802691/jetty4
[junit4:junit4]   2> 18145 T451 C22 P19009 oasc.SolrCore.getNewIndexDir New index directory detected: old=./org.apache.solr.cloud.SyncSliceTest-1360627802691/jetty4/index/ new=./org.apache.solr.cloud.SyncSliceTest-1360627802691/jetty4/index.20130211191020822
[junit4:junit4]   2> 18148 T451 C22 P19009 oasc.SolrDeletionPolicy.onInit SolrDeletionPolicy.onInit: commits:num=1
[junit4:junit4]   2> 		commit{dir=RateLimitedDirectoryWrapper(NRTCachingDirectory(org.apache.lucene.store.NIOFSDirectory@/usr/home/hudson/hudson-slave/workspace/Lucene-Solr-Tests-4.x-java7/solr/build/solr-core/test/J0/org.apache.solr.cloud.SyncSliceTest-1360627802691/jetty4/index.20130211191020822 lockFactory=org.apache.lucene.store.NativeFSLockFactory@62a813e4; maxCacheMB=48.0 maxMergeSizeMB=4.0)),segFN=segments_4,generation=4,filenames=[segments_4]
[junit4:junit4]   2> 18148 T451 C22 P19009 oasc.SolrDeletionPolicy.updateCommits newest commit = 4[segments_4]
[junit4:junit4]   2> 18149 T451 C22 P19009 oasc.CachingDirectoryFactory.close Releasing directory:/usr/home/hudson/hudson-slave/workspace/Lucene-Solr-Tests-4.x-java7/solr/build/solr-core/test/J0/./org.apache.solr.cloud.SyncSliceTest-1360627802691/jetty4
[junit4:junit4]   2> 18149 T451 C22 P19009 oasu.DefaultSolrCoreState.newIndexWriter Creating new IndexWriter...
[junit4:junit4]   2> 18149 T451 C22 P19009 oasu.DefaultSolrCoreState.newIndexWriter Waiting until IndexWriter is unused... core=collection1
[junit4:junit4]   2> 18150 T451 C22 P19009 oasu.DefaultSolrCoreState.newIndexWriter Rollback old IndexWriter... core=collection1
[junit4:junit4]   2> 18150 T451 C22 P19009 oasc.CachingDirectoryFactory.close Releasing directory:/usr/home/hudson/hudson-slave/workspace/Lucene-Solr-Tests-4.x-java7/solr/build/solr-core/test/J0/./org.apache.solr.cloud.SyncSliceTest-1360627802691/jetty4/index.20130211191020822
[junit4:junit4]   2> 18151 T451 C22 P19009 oasc.CachingDirectoryFactory.close Releasing directory:/usr/home/hudson/hudson-slave/workspace/Lucene-Solr-Tests-4.x-java7/solr/build/solr-core/test/J0/./org.apache.solr.cloud.SyncSliceTest-1360627802691/jetty4
[junit4:junit4]   2> 18153 T451 C22 P19009 oasc.SolrDeletionPolicy.onInit SolrDeletionPolicy.onInit: commits:num=1
[junit4:junit4]   2> 		commit{dir=RateLimitedDirectoryWrapper(NRTCachingDirectory(org.apache.lucene.store.NIOFSDirectory@/usr/home/hudson/hudson-slave/workspace/Lucene-Solr-Tests-4.x-java7/solr/build/solr-core/test/J0/org.apache.solr.cloud.SyncSliceTest-1360627802691/jetty4/index.20130211191020822 lockFactory=org.apache.lucene.store.NativeFSLockFactory@62a813e4; maxCacheMB=48.0 maxMergeSizeMB=4.0)),segFN=segments_4,generation=4,filenames=[segments_4]
[junit4:junit4]   2> 18153 T451 C22 P19009 oasc.SolrDeletionPolicy.updateCommits newest commit = 4[segments_4]
[junit4:junit4]   2> 18153 T451 C22 P19009 oasu.DefaultSolrCoreState.newIndexWriter New IndexWriter is ready to be used.
[junit4:junit4]   2> 18154 T451 C22 P19009 oasc.CachingDirectoryFactory.close Releasing directory:/usr/home/hudson/hudson-slave/workspace/Lucene-Solr-Tests-4.x-java7/solr/build/solr-core/test/J0/./org.apache.solr.cloud.SyncSliceTest-1360627802691/jetty4
[junit4:junit4]   2> 18154 T451 C22 P19009 oass.SolrIndexSearcher.<init> Opening Searcher@52c5b221 main
[junit4:junit4]   2> 18156 T450 oasc.SolrCore.registerSearcher [collection1] Registered new searcher Searcher@52c5b221 main{StandardDirectoryReader(segments_4:1:nrt)}
[junit4:junit4]   2> 18156 T450 oasc.CachingDirectoryFactory.close Releasing directory:/usr/home/hudson/hudson-slave/workspace/Lucene-Solr-Tests-4.x-java7/solr/build/solr-core/test/J0/./org.apache.solr.cloud.SyncSliceTest-1360627802691/jetty4/index
[junit4:junit4]   2> 18157 T451 C22 P19009 oasu.DirectUpdateHandler2.commit start commit{,optimize=false,openSearcher=false,waitSearcher=false,expungeDeletes=false,softCommit=false}
[junit4:junit4]   2> 18159 T451 C22 P19009 oasc.SolrDeletionPolicy.onCommi

[...truncated too long message...]

it4:junit4]   2> 853494 T358 oasc.CachingDirectoryFactory.close Closing directory when closing factory:/usr/home/hudson/hudson-slave/workspace/Lucene-Solr-Tests-4.x-java7/solr/build/solr-core/test/J0/./org.apache.solr.cloud.SyncSliceTest-1360627802691/jetty4/index
[junit4:junit4]   2> 853495 T358 oasc.CachingDirectoryFactory.closeDirectory Closing directory:/usr/home/hudson/hudson-slave/workspace/Lucene-Solr-Tests-4.x-java7/solr/build/solr-core/test/J0/./org.apache.solr.cloud.SyncSliceTest-1360627802691/jetty4/index
[junit4:junit4]   2> 853495 T358 oasc.CachingDirectoryFactory.close Closing directory when closing factory:/usr/home/hudson/hudson-slave/workspace/Lucene-Solr-Tests-4.x-java7/solr/build/solr-core/test/J0/./org.apache.solr.cloud.SyncSliceTest-1360627802691/jetty4
[junit4:junit4]   2> 853496 T358 oasc.CachingDirectoryFactory.closeDirectory Closing directory:/usr/home/hudson/hudson-slave/workspace/Lucene-Solr-Tests-4.x-java7/solr/build/solr-core/test/J0/./org.apache.solr.cloud.SyncSliceTest-1360627802691/jetty4
[junit4:junit4]   2> 865781 T446 oaz.ClientCnxn$EventThread.run EventThread shut down
[junit4:junit4]   2> 865781 T358 oaz.ZooKeeper.close Session: 0x13ccbbca248000c closed
[junit4:junit4]   2> 865782 T358 oejsh.ContextHandler.doStop stopped o.e.j.s.ServletContextHandler{/,null}
[junit4:junit4]   2> 865998 T358 oas.SolrTestCaseJ4.tearDown ###Ending testDistribSearch
[junit4:junit4]   1> client port:0.0.0.0/0.0.0.0:0
[junit4:junit4]   2> NOTE: reproduce with: ant test  -Dtestcase=SyncSliceTest -Dtests.method=testDistribSearch -Dtests.seed=4B86B21B105277CA -Dtests.multiplier=3 -Dtests.slow=true -Dtests.locale=es_CR -Dtests.timezone=Jamaica -Dtests.file.encoding=ISO-8859-1
[junit4:junit4] FAILURE  866s J0 | SyncSliceTest.testDistribSearch <<<
[junit4:junit4]    > Throwable #1: java.lang.AssertionError: Test Setup Failure: shard1 should have just been set up to be inconsistent - but it's still consistent. Leader:http://127.0.0.1:30887/collection1skip list:[org.apache.solr.cloud.AbstractFullDistribZkTestBase$CloudJettyRunner@f99b5bcb, org.apache.solr.cloud.AbstractFullDistribZkTestBase$CloudJettyRunner@74e89965]
[junit4:junit4]    > 	at __randomizedtesting.SeedInfo.seed([4B86B21B105277CA:CA603C03670D17F6]:0)
[junit4:junit4]    > 	at org.junit.Assert.fail(Assert.java:93)
[junit4:junit4]    > 	at org.junit.Assert.assertTrue(Assert.java:43)
[junit4:junit4]    > 	at org.junit.Assert.assertNotNull(Assert.java:526)
[junit4:junit4]    > 	at org.apache.solr.cloud.SyncSliceTest.doTest(SyncSliceTest.java:216)
[junit4:junit4]    > 	at org.apache.solr.BaseDistributedSearchTestCase.testDistribSearch(BaseDistributedSearchTestCase.java:794)
[junit4:junit4]    > 	at sun.reflect.NativeMethodAccessorImpl.invoke0(Native Method)
[junit4:junit4]    > 	at sun.reflect.NativeMethodAccessorImpl.invoke(NativeMethodAccessorImpl.java:57)
[junit4:junit4]    > 	at sun.reflect.DelegatingMethodAccessorImpl.invoke(DelegatingMethodAccessorImpl.java:43)
[junit4:junit4]    > 	at java.lang.reflect.Method.invoke(Method.java:601)
[junit4:junit4]    > 	at com.carrotsearch.randomizedtesting.RandomizedRunner.invoke(RandomizedRunner.java:1559)
[junit4:junit4]    > 	at com.carrotsearch.randomizedtesting.RandomizedRunner.access$600(RandomizedRunner.java:79)
[junit4:junit4]    > 	at com.carrotsearch.randomizedtesting.RandomizedRunner$6.evaluate(RandomizedRunner.java:737)
[junit4:junit4]    > 	at com.carrotsearch.randomizedtesting.RandomizedRunner$7.evaluate(RandomizedRunner.java:773)
[junit4:junit4]    > 	at com.carrotsearch.randomizedtesting.RandomizedRunner$8.evaluate(RandomizedRunner.java:787)
[junit4:junit4]    > 	at com.carrotsearch.randomizedtesting.rules.SystemPropertiesRestoreRule$1.evaluate(SystemPropertiesRestoreRule.java:53)
[junit4:junit4]    > 	at org.apache.lucene.util.TestRuleSetupTeardownChained$1.evaluate(TestRuleSetupTeardownChained.java:50)
[junit4:junit4]    > 	at org.apache.lucene.util.TestRuleFieldCacheSanity$1.evaluate(TestRuleFieldCacheSanity.java:51)
[junit4:junit4]    > 	at org.apache.lucene.util.AbstractBeforeAfterRule$1.evaluate(AbstractBeforeAfterRule.java:46)
[junit4:junit4]    > 	at com.carrotsearch.randomizedtesting.rules.SystemPropertiesInvariantRule$1.evaluate(SystemPropertiesInvariantRule.java:55)
[junit4:junit4]    > 	at org.apache.lucene.util.TestRuleThreadAndTestName$1.evaluate(TestRuleThreadAndTestName.java:49)
[junit4:junit4]    > 	at org.apache.lucene.util.TestRuleIgnoreAfterMaxFailures$1.evaluate(TestRuleIgnoreAfterMaxFailures.java:70)
[junit4:junit4]    > 	at org.apache.lucene.util.TestRuleMarkFailure$1.evaluate(TestRuleMarkFailure.java:48)
[junit4:junit4]    > 	at com.carrotsearch.randomizedtesting.rules.StatementAdapter.evaluate(StatementAdapter.java:36)
[junit4:junit4]    > 	at com.carrotsearch.randomizedtesting.ThreadLeakControl$StatementRunner.run(ThreadLeakControl.java:358)
[junit4:junit4]    > 	at com.carrotsearch.randomizedtesting.ThreadLeakControl.forkTimeoutingTask(ThreadLeakControl.java:782)
[junit4:junit4]    > 	at com.carrotsearch.randomizedtesting.ThreadLeakControl$3.evaluate(ThreadLeakControl.java:442)
[junit4:junit4]    > 	at com.carrotsearch.randomizedtesting.RandomizedRunner.runSingleTest(RandomizedRunner.java:746)
[junit4:junit4]    > 	at com.carrotsearch.randomizedtesting.RandomizedRunner$3.evaluate(RandomizedRunner.java:648)
[junit4:junit4]    > 	at com.carrotsearch.randomizedtesting.RandomizedRunner$4.evaluate(RandomizedRunner.java:682)
[junit4:junit4]    > 	at com.carrotsearch.randomizedtesting.RandomizedRunner$5.evaluate(RandomizedRunner.java:693)
[junit4:junit4]    > 	at com.carrotsearch.randomizedtesting.rules.StatementAdapter.evaluate(StatementAdapter.java:36)
[junit4:junit4]    > 	at com.carrotsearch.randomizedtesting.rules.SystemPropertiesRestoreRule$1.evaluate(SystemPropertiesRestoreRule.java:53)
[junit4:junit4]    > 	at org.apache.lucene.util.AbstractBeforeAfterRule$1.evaluate(AbstractBeforeAfterRule.java:46)
[junit4:junit4]    > 	at org.apache.lucene.util.TestRuleStoreClassName$1.evaluate(TestRuleStoreClassName.java:42)
[junit4:junit4]    > 	at com.carrotsearch.randomizedtesting.rules.SystemPropertiesInvariantRule$1.evaluate(SystemPropertiesInvariantRule.java:55)
[junit4:junit4]    > 	at com.carrotsearch.randomizedtesting.rules.NoShadowingOrOverridesOnMethodsRule$1.evaluate(NoShadowingOrOverridesOnMethodsRule.java:39)
[junit4:junit4]    > 	at com.carrotsearch.randomizedtesting.rules.NoShadowingOrOverridesOnMethodsRule$1.evaluate(NoShadowingOrOverridesOnMethodsRule.java:39)
[junit4:junit4]    > 	at com.carrotsearch.randomizedtesting.rules.StatementAdapter.evaluate(StatementAdapter.java:36)
[junit4:junit4]    > 	at org.apache.lucene.util.TestRuleAssertionsRequired$1.evaluate(TestRuleAssertionsRequired.java:43)
[junit4:junit4]    > 	at org.apache.lucene.util.TestRuleMarkFailure$1.evaluate(TestRuleMarkFailure.java:48)
[junit4:junit4]    > 	at org.apache.lucene.util.TestRuleIgnoreAfterMaxFailures$1.evaluate(TestRuleIgnoreAfterMaxFailures.java:70)
[junit4:junit4]    > 	at org.apache.lucene.util.TestRuleIgnoreTestSuites$1.evaluate(TestRuleIgnoreTestSuites.java:55)
[junit4:junit4]    > 	at com.carrotsearch.randomizedtesting.rules.StatementAdapter.evaluate(StatementAdapter.java:36)
[junit4:junit4]    > 	at com.carrotsearch.randomizedtesting.ThreadLeakControl$StatementRunner.run(ThreadLeakControl.java:358)
[junit4:junit4]    > 	at java.lang.Thread.run(Thread.java:722)
[junit4:junit4]   2> 866021 T358 oas.SolrTestCaseJ4.deleteCore ###deleteCore
[junit4:junit4]   2> NOTE: test params are: codec=Appending, sim=DefaultSimilarity, locale=es_CR, timezone=Jamaica
[junit4:junit4]   2> NOTE: FreeBSD 9.0-RELEASE amd64/Oracle Corporation 1.7.0_09 (64-bit)/cpus=16,threads=2,free=72016712,total=298844160
[junit4:junit4]   2> NOTE: All tests run in this JVM: [BinaryUpdateRequestHandlerTest, SortByFunctionTest, CSVRequestHandlerTest, CoreAdminHandlerTest, TestJoin, TestLMJelinekMercerSimilarityFactory, TestSolrQueryParser, SimpleFacetsTest, SpellPossibilityIteratorTest, TestAtomicUpdateErrorCases, SimplePostToolTest, SpellCheckCollatorTest, TestQueryTypes, SearchHandlerTest, ShardRoutingCustomTest, TestFastOutputStream, SolrPluginUtilsTest, TestXIncludeConfig, DistanceFunctionTest, TestIndexingPerformance, ScriptEngineTest, TestQuerySenderNoQuery, TestBadConfig, TestBinaryResponseWriter, TestStressVersions, SuggesterFSTTest, TestPartialUpdateDeduplication, TestFuzzyAnalyzedSuggestions, DateMathParserTest, TestConfig, NotRequiredUniqueKeyTest, TestWordDelimiterFilterFactory, TestNumberUtils, TestCoreContainer, TestLMDirichletSimilarityFactory, SyncSliceTest]
[junit4:junit4] Completed on J0 in 866.04s, 1 test, 1 failure <<< FAILURES!

[...truncated 469 lines...]
BUILD FAILED
/usr/home/hudson/hudson-slave/workspace/Lucene-Solr-Tests-4.x-java7/build.xml:381: The following error occurred while executing this line:
/usr/home/hudson/hudson-slave/workspace/Lucene-Solr-Tests-4.x-java7/build.xml:361: The following error occurred while executing this line:
/usr/home/hudson/hudson-slave/workspace/Lucene-Solr-Tests-4.x-java7/build.xml:39: The following error occurred while executing this line:
/usr/home/hudson/hudson-slave/workspace/Lucene-Solr-Tests-4.x-java7/solr/build.xml:183: The following error occurred while executing this line:
/usr/home/hudson/hudson-slave/workspace/Lucene-Solr-Tests-4.x-java7/solr/common-build.xml:447: The following error occurred while executing this line:
/usr/home/hudson/hudson-slave/workspace/Lucene-Solr-Tests-4.x-java7/lucene/common-build.xml:1202: The following error occurred while executing this line:
/usr/home/hudson/hudson-slave/workspace/Lucene-Solr-Tests-4.x-java7/lucene/common-build.xml:865: There were test failures: 251 suites, 1043 tests, 1 failure, 22 ignored (4 assumptions)

Total time: 51 minutes 45 seconds
Build step 'Invoke Ant' marked build as failure
Archiving artifacts
Recording test results
Email was triggered for: Failure
Sending email for trigger: Failure



Mime
View raw message