lucene-dev mailing list archives

Site index · List index
Message view « Date » · « Thread »
Top « Date » · « Thread »
From Apache Jenkins Server <jenk...@builds.apache.org>
Subject [JENKINS] Lucene-Solr-Tests-4.x-java7 - Build # 981 - Still Failing
Date Mon, 11 Feb 2013 15:34:38 GMT
Build: https://builds.apache.org/job/Lucene-Solr-Tests-4.x-java7/981/

1 tests failed.
FAILED:  org.apache.solr.cloud.SyncSliceTest.testDistribSearch

Error Message:
Test Setup Failure: shard1 should have just been set up to be inconsistent - but it's still consistent. Leader:http://127.0.0.1:38453/ge_sm/p/collection1skip list:[org.apache.solr.cloud.AbstractFullDistribZkTestBase$CloudJettyRunner@349cb170, org.apache.solr.cloud.AbstractFullDistribZkTestBase$CloudJettyRunner@4c6a74ad]

Stack Trace:
java.lang.AssertionError: Test Setup Failure: shard1 should have just been set up to be inconsistent - but it's still consistent. Leader:http://127.0.0.1:38453/ge_sm/p/collection1skip list:[org.apache.solr.cloud.AbstractFullDistribZkTestBase$CloudJettyRunner@349cb170, org.apache.solr.cloud.AbstractFullDistribZkTestBase$CloudJettyRunner@4c6a74ad]
	at __randomizedtesting.SeedInfo.seed([A31F98F1A771B2E9:22F916E9D02ED2D5]:0)
	at org.junit.Assert.fail(Assert.java:93)
	at org.junit.Assert.assertTrue(Assert.java:43)
	at org.junit.Assert.assertNotNull(Assert.java:526)
	at org.apache.solr.cloud.SyncSliceTest.doTest(SyncSliceTest.java:216)
	at org.apache.solr.BaseDistributedSearchTestCase.testDistribSearch(BaseDistributedSearchTestCase.java:794)
	at sun.reflect.NativeMethodAccessorImpl.invoke0(Native Method)
	at sun.reflect.NativeMethodAccessorImpl.invoke(NativeMethodAccessorImpl.java:57)
	at sun.reflect.DelegatingMethodAccessorImpl.invoke(DelegatingMethodAccessorImpl.java:43)
	at java.lang.reflect.Method.invoke(Method.java:601)
	at com.carrotsearch.randomizedtesting.RandomizedRunner.invoke(RandomizedRunner.java:1559)
	at com.carrotsearch.randomizedtesting.RandomizedRunner.access$600(RandomizedRunner.java:79)
	at com.carrotsearch.randomizedtesting.RandomizedRunner$6.evaluate(RandomizedRunner.java:737)
	at com.carrotsearch.randomizedtesting.RandomizedRunner$7.evaluate(RandomizedRunner.java:773)
	at com.carrotsearch.randomizedtesting.RandomizedRunner$8.evaluate(RandomizedRunner.java:787)
	at com.carrotsearch.randomizedtesting.rules.SystemPropertiesRestoreRule$1.evaluate(SystemPropertiesRestoreRule.java:53)
	at org.apache.lucene.util.TestRuleSetupTeardownChained$1.evaluate(TestRuleSetupTeardownChained.java:50)
	at org.apache.lucene.util.TestRuleFieldCacheSanity$1.evaluate(TestRuleFieldCacheSanity.java:51)
	at org.apache.lucene.util.AbstractBeforeAfterRule$1.evaluate(AbstractBeforeAfterRule.java:46)
	at com.carrotsearch.randomizedtesting.rules.SystemPropertiesInvariantRule$1.evaluate(SystemPropertiesInvariantRule.java:55)
	at org.apache.lucene.util.TestRuleThreadAndTestName$1.evaluate(TestRuleThreadAndTestName.java:49)
	at org.apache.lucene.util.TestRuleIgnoreAfterMaxFailures$1.evaluate(TestRuleIgnoreAfterMaxFailures.java:70)
	at org.apache.lucene.util.TestRuleMarkFailure$1.evaluate(TestRuleMarkFailure.java:48)
	at com.carrotsearch.randomizedtesting.rules.StatementAdapter.evaluate(StatementAdapter.java:36)
	at com.carrotsearch.randomizedtesting.ThreadLeakControl$StatementRunner.run(ThreadLeakControl.java:358)
	at com.carrotsearch.randomizedtesting.ThreadLeakControl.forkTimeoutingTask(ThreadLeakControl.java:782)
	at com.carrotsearch.randomizedtesting.ThreadLeakControl$3.evaluate(ThreadLeakControl.java:442)
	at com.carrotsearch.randomizedtesting.RandomizedRunner.runSingleTest(RandomizedRunner.java:746)
	at com.carrotsearch.randomizedtesting.RandomizedRunner$3.evaluate(RandomizedRunner.java:648)
	at com.carrotsearch.randomizedtesting.RandomizedRunner$4.evaluate(RandomizedRunner.java:682)
	at com.carrotsearch.randomizedtesting.RandomizedRunner$5.evaluate(RandomizedRunner.java:693)
	at com.carrotsearch.randomizedtesting.rules.StatementAdapter.evaluate(StatementAdapter.java:36)
	at com.carrotsearch.randomizedtesting.rules.SystemPropertiesRestoreRule$1.evaluate(SystemPropertiesRestoreRule.java:53)
	at org.apache.lucene.util.AbstractBeforeAfterRule$1.evaluate(AbstractBeforeAfterRule.java:46)
	at org.apache.lucene.util.TestRuleStoreClassName$1.evaluate(TestRuleStoreClassName.java:42)
	at com.carrotsearch.randomizedtesting.rules.SystemPropertiesInvariantRule$1.evaluate(SystemPropertiesInvariantRule.java:55)
	at com.carrotsearch.randomizedtesting.rules.NoShadowingOrOverridesOnMethodsRule$1.evaluate(NoShadowingOrOverridesOnMethodsRule.java:39)
	at com.carrotsearch.randomizedtesting.rules.NoShadowingOrOverridesOnMethodsRule$1.evaluate(NoShadowingOrOverridesOnMethodsRule.java:39)
	at com.carrotsearch.randomizedtesting.rules.StatementAdapter.evaluate(StatementAdapter.java:36)
	at org.apache.lucene.util.TestRuleAssertionsRequired$1.evaluate(TestRuleAssertionsRequired.java:43)
	at org.apache.lucene.util.TestRuleMarkFailure$1.evaluate(TestRuleMarkFailure.java:48)
	at org.apache.lucene.util.TestRuleIgnoreAfterMaxFailures$1.evaluate(TestRuleIgnoreAfterMaxFailures.java:70)
	at org.apache.lucene.util.TestRuleIgnoreTestSuites$1.evaluate(TestRuleIgnoreTestSuites.java:55)
	at com.carrotsearch.randomizedtesting.rules.StatementAdapter.evaluate(StatementAdapter.java:36)
	at com.carrotsearch.randomizedtesting.ThreadLeakControl$StatementRunner.run(ThreadLeakControl.java:358)
	at java.lang.Thread.run(Thread.java:722)




Build Log:
[...truncated 9099 lines...]
[junit4:junit4] Suite: org.apache.solr.cloud.SyncSliceTest
[junit4:junit4]   2> 0 T770 oas.BaseDistributedSearchTestCase.initHostContext Setting hostContext system property: /ge_sm/p
[junit4:junit4]   2> 5 T770 oas.SolrTestCaseJ4.setUp ###Starting testDistribSearch
[junit4:junit4]   2> Creating dataDir: /usr/home/hudson/hudson-slave/workspace/Lucene-Solr-Tests-4.x-java7/solr/build/solr-core/test/J0/./solrtest-SyncSliceTest-1360595644881
[junit4:junit4]   2> 6 T770 oasc.ZkTestServer.run STARTING ZK TEST SERVER
[junit4:junit4]   2> 7 T771 oasc.ZkTestServer$ZKServerMain.runFromConfig Starting server
[junit4:junit4]   2> 10 T771 oazs.ZooKeeperServer.setTickTime tickTime set to 1000
[junit4:junit4]   2> 10 T771 oazs.ZooKeeperServer.setMinSessionTimeout minSessionTimeout set to -1
[junit4:junit4]   2> 11 T771 oazs.ZooKeeperServer.setMaxSessionTimeout maxSessionTimeout set to -1
[junit4:junit4]   2> 11 T771 oazs.NIOServerCnxnFactory.configure binding to port 0.0.0.0/0.0.0.0:0
[junit4:junit4]   2> 12 T771 oazsp.FileTxnSnapLog.save Snapshotting: 0x0 to /usr/home/hudson/hudson-slave/workspace/Lucene-Solr-Tests-4.x-java7/solr/build/solr-core/test/J0/./org.apache.solr.cloud.SyncSliceTest-1360595644881/zookeeper/server1/data/version-2/snapshot.0
[junit4:junit4]   2> 108 T770 oasc.ZkTestServer.run start zk server on port:38382
[junit4:junit4]   2> 108 T770 oaz.ZooKeeper.<init> Initiating client connection, connectString=127.0.0.1:38382 sessionTimeout=10000 watcher=org.apache.solr.common.cloud.ConnectionManager@3f22ed2e
[junit4:junit4]   2> 109 T770 oascc.ConnectionManager.waitForConnected Waiting for client to connect to ZooKeeper
[junit4:junit4]   2> 109 T776 oaz.ClientCnxn$SendThread.logStartConnect Opening socket connection to server localhost/127.0.0.1:38382. Will not attempt to authenticate using SASL (access denied ("javax.security.auth.AuthPermission" "getLoginConfiguration"))
[junit4:junit4]   2> 110 T776 oaz.ClientCnxn$SendThread.primeConnection Socket connection established to localhost/127.0.0.1:38382, initiating session
[junit4:junit4]   2> 110 T772 oazs.NIOServerCnxnFactory.run Accepted socket connection from /140.211.11.196:38383
[junit4:junit4]   2> 111 T772 oazs.ZooKeeperServer.processConnectRequest Client attempting to establish new session at /140.211.11.196:38383
[junit4:junit4]   2> 111 T774 oazsp.FileTxnLog.append Creating new log file: log.1
[junit4:junit4]   2> 115 T774 oazs.ZooKeeperServer.finishSessionInit Established session 0x13cc9d1f1d80000 with negotiated timeout 10000 for client /140.211.11.196:38383
[junit4:junit4]   2> 115 T776 oaz.ClientCnxn$SendThread.onConnected Session establishment complete on server localhost/127.0.0.1:38382, sessionid = 0x13cc9d1f1d80000, negotiated timeout = 10000
[junit4:junit4]   2> 115 T777 oascc.ConnectionManager.process Watcher org.apache.solr.common.cloud.ConnectionManager@3f22ed2e name:ZooKeeperConnection Watcher:127.0.0.1:38382 got event WatchedEvent state:SyncConnected type:None path:null path:null type:None
[junit4:junit4]   2> 115 T770 oascc.ConnectionManager.waitForConnected Client is connected to ZooKeeper
[junit4:junit4]   2> 116 T770 oascc.SolrZkClient.makePath makePath: /solr
[junit4:junit4]   2> 120 T775 oazs.PrepRequestProcessor.pRequest2Txn Processed session termination for sessionid: 0x13cc9d1f1d80000
[junit4:junit4]   2> 127 T777 oaz.ClientCnxn$EventThread.run EventThread shut down
[junit4:junit4]   2> 127 T772 oazs.NIOServerCnxn.closeSock Closed socket connection for client /140.211.11.196:38383 which had sessionid 0x13cc9d1f1d80000
[junit4:junit4]   2> 127 T770 oaz.ZooKeeper.close Session: 0x13cc9d1f1d80000 closed
[junit4:junit4]   2> 128 T770 oaz.ZooKeeper.<init> Initiating client connection, connectString=127.0.0.1:38382/solr sessionTimeout=10000 watcher=org.apache.solr.common.cloud.ConnectionManager@55024a19
[junit4:junit4]   2> 128 T770 oascc.ConnectionManager.waitForConnected Waiting for client to connect to ZooKeeper
[junit4:junit4]   2> 129 T778 oaz.ClientCnxn$SendThread.logStartConnect Opening socket connection to server localhost/127.0.0.1:38382. Will not attempt to authenticate using SASL (access denied ("javax.security.auth.AuthPermission" "getLoginConfiguration"))
[junit4:junit4]   2> 129 T778 oaz.ClientCnxn$SendThread.primeConnection Socket connection established to localhost/127.0.0.1:38382, initiating session
[junit4:junit4]   2> 129 T772 oazs.NIOServerCnxnFactory.run Accepted socket connection from /140.211.11.196:38384
[junit4:junit4]   2> 130 T772 oazs.ZooKeeperServer.processConnectRequest Client attempting to establish new session at /140.211.11.196:38384
[junit4:junit4]   2> 131 T774 oazs.ZooKeeperServer.finishSessionInit Established session 0x13cc9d1f1d80001 with negotiated timeout 10000 for client /140.211.11.196:38384
[junit4:junit4]   2> 131 T778 oaz.ClientCnxn$SendThread.onConnected Session establishment complete on server localhost/127.0.0.1:38382, sessionid = 0x13cc9d1f1d80001, negotiated timeout = 10000
[junit4:junit4]   2> 131 T779 oascc.ConnectionManager.process Watcher org.apache.solr.common.cloud.ConnectionManager@55024a19 name:ZooKeeperConnection Watcher:127.0.0.1:38382/solr got event WatchedEvent state:SyncConnected type:None path:null path:null type:None
[junit4:junit4]   2> 131 T770 oascc.ConnectionManager.waitForConnected Client is connected to ZooKeeper
[junit4:junit4]   2> 132 T770 oascc.SolrZkClient.makePath makePath: /collections/collection1
[junit4:junit4]   2> 137 T770 oascc.SolrZkClient.makePath makePath: /collections/collection1/shards
[junit4:junit4]   2> 141 T770 oascc.SolrZkClient.makePath makePath: /collections/control_collection
[junit4:junit4]   2> 149 T770 oascc.SolrZkClient.makePath makePath: /collections/control_collection/shards
[junit4:junit4]   2> 153 T770 oasc.AbstractZkTestCase.putConfig put /usr/home/hudson/hudson-slave/workspace/Lucene-Solr-Tests-4.x-java7/solr/build/solr-core/test-files/solr/collection1/conf/solrconfig.xml to /configs/conf1/solrconfig.xml
[junit4:junit4]   2> 154 T770 oascc.SolrZkClient.makePath makePath: /configs/conf1/solrconfig.xml
[junit4:junit4]   2> 167 T770 oasc.AbstractZkTestCase.putConfig put /usr/home/hudson/hudson-slave/workspace/Lucene-Solr-Tests-4.x-java7/solr/build/solr-core/test-files/solr/collection1/conf/schema.xml to /configs/conf1/schema.xml
[junit4:junit4]   2> 168 T770 oascc.SolrZkClient.makePath makePath: /configs/conf1/schema.xml
[junit4:junit4]   2> 274 T770 oasc.AbstractZkTestCase.putConfig put /usr/home/hudson/hudson-slave/workspace/Lucene-Solr-Tests-4.x-java7/solr/build/solr-core/test-files/solr/collection1/conf/stopwords.txt to /configs/conf1/stopwords.txt
[junit4:junit4]   2> 274 T770 oascc.SolrZkClient.makePath makePath: /configs/conf1/stopwords.txt
[junit4:junit4]   2> 279 T770 oasc.AbstractZkTestCase.putConfig put /usr/home/hudson/hudson-slave/workspace/Lucene-Solr-Tests-4.x-java7/solr/build/solr-core/test-files/solr/collection1/conf/protwords.txt to /configs/conf1/protwords.txt
[junit4:junit4]   2> 280 T770 oascc.SolrZkClient.makePath makePath: /configs/conf1/protwords.txt
[junit4:junit4]   2> 285 T770 oasc.AbstractZkTestCase.putConfig put /usr/home/hudson/hudson-slave/workspace/Lucene-Solr-Tests-4.x-java7/solr/build/solr-core/test-files/solr/collection1/conf/currency.xml to /configs/conf1/currency.xml
[junit4:junit4]   2> 285 T770 oascc.SolrZkClient.makePath makePath: /configs/conf1/currency.xml
[junit4:junit4]   2> 290 T770 oasc.AbstractZkTestCase.putConfig put /usr/home/hudson/hudson-slave/workspace/Lucene-Solr-Tests-4.x-java7/solr/build/solr-core/test-files/solr/collection1/conf/open-exchange-rates.json to /configs/conf1/open-exchange-rates.json
[junit4:junit4]   2> 290 T770 oascc.SolrZkClient.makePath makePath: /configs/conf1/open-exchange-rates.json
[junit4:junit4]   2> 295 T770 oasc.AbstractZkTestCase.putConfig put /usr/home/hudson/hudson-slave/workspace/Lucene-Solr-Tests-4.x-java7/solr/build/solr-core/test-files/solr/collection1/conf/mapping-ISOLatin1Accent.txt to /configs/conf1/mapping-ISOLatin1Accent.txt
[junit4:junit4]   2> 296 T770 oascc.SolrZkClient.makePath makePath: /configs/conf1/mapping-ISOLatin1Accent.txt
[junit4:junit4]   2> 300 T770 oasc.AbstractZkTestCase.putConfig put /usr/home/hudson/hudson-slave/workspace/Lucene-Solr-Tests-4.x-java7/solr/build/solr-core/test-files/solr/collection1/conf/old_synonyms.txt to /configs/conf1/old_synonyms.txt
[junit4:junit4]   2> 301 T770 oascc.SolrZkClient.makePath makePath: /configs/conf1/old_synonyms.txt
[junit4:junit4]   2> 305 T770 oasc.AbstractZkTestCase.putConfig put /usr/home/hudson/hudson-slave/workspace/Lucene-Solr-Tests-4.x-java7/solr/build/solr-core/test-files/solr/collection1/conf/synonyms.txt to /configs/conf1/synonyms.txt
[junit4:junit4]   2> 306 T770 oascc.SolrZkClient.makePath makePath: /configs/conf1/synonyms.txt
[junit4:junit4]   2> 310 T775 oazs.PrepRequestProcessor.pRequest2Txn Processed session termination for sessionid: 0x13cc9d1f1d80001
[junit4:junit4]   2> 311 T779 oaz.ClientCnxn$EventThread.run EventThread shut down
[junit4:junit4]   2> 311 T772 oazs.NIOServerCnxn.closeSock Closed socket connection for client /140.211.11.196:38384 which had sessionid 0x13cc9d1f1d80001
[junit4:junit4]   2> 311 T770 oaz.ZooKeeper.close Session: 0x13cc9d1f1d80001 closed
[junit4:junit4]   2> 456 T770 oejs.Server.doStart jetty-8.1.8.v20121106
[junit4:junit4]   2> 460 T770 oejs.AbstractConnector.doStart Started SocketConnector@127.0.0.1:38385
[junit4:junit4]   2> 461 T770 oass.SolrDispatchFilter.init SolrDispatchFilter.init()
[junit4:junit4]   2> 461 T770 oasc.SolrResourceLoader.locateSolrHome JNDI not configured for solr (NoInitialContextEx)
[junit4:junit4]   2> 462 T770 oasc.SolrResourceLoader.locateSolrHome using system property solr.solr.home: /usr/home/hudson/hudson-slave/workspace/Lucene-Solr-Tests-4.x-java7/solr/build/solr-core/test/J0/./org.apache.solr.cloud.SyncSliceTest-controljetty-1360595645187
[junit4:junit4]   2> 462 T770 oasc.CoreContainer$Initializer.initialize looking for solr.xml: /usr/home/hudson/hudson-slave/workspace/Lucene-Solr-Tests-4.x-java7/solr/build/solr-core/test/J0/./org.apache.solr.cloud.SyncSliceTest-controljetty-1360595645187/solr.xml
[junit4:junit4]   2> 462 T770 oasc.CoreContainer.<init> New CoreContainer 2090689836
[junit4:junit4]   2> 463 T770 oasc.CoreContainer.load Loading CoreContainer using Solr Home: '/usr/home/hudson/hudson-slave/workspace/Lucene-Solr-Tests-4.x-java7/solr/build/solr-core/test/J0/./org.apache.solr.cloud.SyncSliceTest-controljetty-1360595645187/'
[junit4:junit4]   2> 463 T770 oasc.SolrResourceLoader.<init> new SolrResourceLoader for directory: '/usr/home/hudson/hudson-slave/workspace/Lucene-Solr-Tests-4.x-java7/solr/build/solr-core/test/J0/./org.apache.solr.cloud.SyncSliceTest-controljetty-1360595645187/'
[junit4:junit4]   2> 515 T770 oashc.HttpShardHandlerFactory.getParameter Setting socketTimeout to: 60000
[junit4:junit4]   2> 515 T770 oashc.HttpShardHandlerFactory.getParameter Setting urlScheme to: http://
[junit4:junit4]   2> 516 T770 oashc.HttpShardHandlerFactory.getParameter Setting connTimeout to: 15000
[junit4:junit4]   2> 516 T770 oashc.HttpShardHandlerFactory.getParameter Setting maxConnectionsPerHost to: 20
[junit4:junit4]   2> 517 T770 oashc.HttpShardHandlerFactory.getParameter Setting corePoolSize to: 0
[junit4:junit4]   2> 517 T770 oashc.HttpShardHandlerFactory.getParameter Setting maximumPoolSize to: 2147483647
[junit4:junit4]   2> 517 T770 oashc.HttpShardHandlerFactory.getParameter Setting maxThreadIdleTime to: 5
[junit4:junit4]   2> 518 T770 oashc.HttpShardHandlerFactory.getParameter Setting sizeOfQueue to: -1
[junit4:junit4]   2> 518 T770 oashc.HttpShardHandlerFactory.getParameter Setting fairnessPolicy to: false
[junit4:junit4]   2> 519 T770 oascsi.HttpClientUtil.createClient Creating new http client, config:maxConnectionsPerHost=20&maxConnections=10000&socketTimeout=60000&connTimeout=15000&retry=false
[junit4:junit4]   2> 539 T770 oasc.CoreContainer.load Registering Log Listener
[junit4:junit4]   2> 556 T770 oasc.CoreContainer.initZooKeeper Zookeeper client=127.0.0.1:38382/solr
[junit4:junit4]   2> 557 T770 oasc.ZkController.checkChrootPath zkHost includes chroot
[junit4:junit4]   2> 557 T770 oaz.ZooKeeper.<init> Initiating client connection, connectString=127.0.0.1:38382 sessionTimeout=60000 watcher=org.apache.solr.common.cloud.ConnectionManager@55697923
[junit4:junit4]   2> 558 T770 oascc.ConnectionManager.waitForConnected Waiting for client to connect to ZooKeeper
[junit4:junit4]   2> 559 T789 oaz.ClientCnxn$SendThread.logStartConnect Opening socket connection to server localhost/127.0.0.1:38382. Will not attempt to authenticate using SASL (access denied ("javax.security.auth.AuthPermission" "getLoginConfiguration"))
[junit4:junit4]   2> 560 T789 oaz.ClientCnxn$SendThread.primeConnection Socket connection established to localhost/127.0.0.1:38382, initiating session
[junit4:junit4]   2> 560 T772 oazs.NIOServerCnxnFactory.run Accepted socket connection from /140.211.11.196:38386
[junit4:junit4]   2> 560 T772 oazs.ZooKeeperServer.processConnectRequest Client attempting to establish new session at /140.211.11.196:38386
[junit4:junit4]   2> 562 T774 oazs.ZooKeeperServer.finishSessionInit Established session 0x13cc9d1f1d80002 with negotiated timeout 20000 for client /140.211.11.196:38386
[junit4:junit4]   2> 562 T789 oaz.ClientCnxn$SendThread.onConnected Session establishment complete on server localhost/127.0.0.1:38382, sessionid = 0x13cc9d1f1d80002, negotiated timeout = 20000
[junit4:junit4]   2> 563 T790 oascc.ConnectionManager.process Watcher org.apache.solr.common.cloud.ConnectionManager@55697923 name:ZooKeeperConnection Watcher:127.0.0.1:38382 got event WatchedEvent state:SyncConnected type:None path:null path:null type:None
[junit4:junit4]   2> 563 T770 oascc.ConnectionManager.waitForConnected Client is connected to ZooKeeper
[junit4:junit4]   2> 565 T775 oazs.PrepRequestProcessor.pRequest2Txn Processed session termination for sessionid: 0x13cc9d1f1d80002
[junit4:junit4]   2> 566 T790 oaz.ClientCnxn$EventThread.run EventThread shut down
[junit4:junit4]   2> 566 T772 oazs.NIOServerCnxn.closeSock Closed socket connection for client /140.211.11.196:38386 which had sessionid 0x13cc9d1f1d80002
[junit4:junit4]   2> 566 T770 oaz.ZooKeeper.close Session: 0x13cc9d1f1d80002 closed
[junit4:junit4]   2> 567 T770 oascsi.HttpClientUtil.createClient Creating new http client, config:maxConnections=500&maxConnectionsPerHost=16&socketTimeout=60000&connTimeout=15000
[junit4:junit4]   2> 581 T770 oaz.ZooKeeper.<init> Initiating client connection, connectString=127.0.0.1:38382/solr sessionTimeout=30000 watcher=org.apache.solr.common.cloud.ConnectionManager@4b75d166
[junit4:junit4]   2> 582 T770 oascc.ConnectionManager.waitForConnected Waiting for client to connect to ZooKeeper
[junit4:junit4]   2> 583 T791 oaz.ClientCnxn$SendThread.logStartConnect Opening socket connection to server localhost/127.0.0.1:38382. Will not attempt to authenticate using SASL (access denied ("javax.security.auth.AuthPermission" "getLoginConfiguration"))
[junit4:junit4]   2> 583 T791 oaz.ClientCnxn$SendThread.primeConnection Socket connection established to localhost/127.0.0.1:38382, initiating session
[junit4:junit4]   2> 583 T772 oazs.NIOServerCnxnFactory.run Accepted socket connection from /140.211.11.196:38387
[junit4:junit4]   2> 584 T772 oazs.ZooKeeperServer.processConnectRequest Client attempting to establish new session at /140.211.11.196:38387
[junit4:junit4]   2> 586 T774 oazs.ZooKeeperServer.finishSessionInit Established session 0x13cc9d1f1d80003 with negotiated timeout 20000 for client /140.211.11.196:38387
[junit4:junit4]   2> 586 T791 oaz.ClientCnxn$SendThread.onConnected Session establishment complete on server localhost/127.0.0.1:38382, sessionid = 0x13cc9d1f1d80003, negotiated timeout = 20000
[junit4:junit4]   2> 586 T792 oascc.ConnectionManager.process Watcher org.apache.solr.common.cloud.ConnectionManager@4b75d166 name:ZooKeeperConnection Watcher:127.0.0.1:38382/solr got event WatchedEvent state:SyncConnected type:None path:null path:null type:None
[junit4:junit4]   2> 586 T770 oascc.ConnectionManager.waitForConnected Client is connected to ZooKeeper
[junit4:junit4]   2> 589 T775 oazs.PrepRequestProcessor.pRequest Got user-level KeeperException when processing sessionid:0x13cc9d1f1d80003 type:create cxid:0x2 zxid:0x1a txntype:-1 reqpath:n/a Error Path:/solr/overseer Error:KeeperErrorCode = NodeExists for /solr/overseer
[junit4:junit4]   2> 598 T770 oascc.SolrZkClient.makePath makePath: /live_nodes
[junit4:junit4]   2> 601 T770 oasc.ZkController.createEphemeralLiveNode Register node as live in ZooKeeper:/live_nodes/127.0.0.1:38385_ge_sm%2Fp
[junit4:junit4]   2> 602 T775 oazs.PrepRequestProcessor.pRequest Got user-level KeeperException when processing sessionid:0x13cc9d1f1d80003 type:delete cxid:0x8 zxid:0x1c txntype:-1 reqpath:n/a Error Path:/solr/live_nodes/127.0.0.1:38385_ge_sm%2Fp Error:KeeperErrorCode = NoNode for /solr/live_nodes/127.0.0.1:38385_ge_sm%2Fp
[junit4:junit4]   2> 603 T770 oascc.SolrZkClient.makePath makePath: /live_nodes/127.0.0.1:38385_ge_sm%2Fp
[junit4:junit4]   2> 613 T770 oascc.SolrZkClient.makePath makePath: /overseer_elect/election
[junit4:junit4]   2> 627 T775 oazs.PrepRequestProcessor.pRequest Got user-level KeeperException when processing sessionid:0x13cc9d1f1d80003 type:delete cxid:0x16 zxid:0x21 txntype:-1 reqpath:n/a Error Path:/solr/overseer_elect/leader Error:KeeperErrorCode = NoNode for /solr/overseer_elect/leader
[junit4:junit4]   2> 628 T770 oascc.SolrZkClient.makePath makePath: /overseer_elect/leader
[junit4:junit4]   2> 632 T770 oasc.Overseer.start Overseer (id=89167996183379971-127.0.0.1:38385_ge_sm%2Fp-n_0000000000) starting
[junit4:junit4]   2> 633 T775 oazs.PrepRequestProcessor.pRequest Got user-level KeeperException when processing sessionid:0x13cc9d1f1d80003 type:create cxid:0x1b zxid:0x23 txntype:-1 reqpath:n/a Error Path:/solr/overseer Error:KeeperErrorCode = NodeExists for /solr/overseer
[junit4:junit4]   2> 639 T775 oazs.PrepRequestProcessor.pRequest Got user-level KeeperException when processing sessionid:0x13cc9d1f1d80003 type:create cxid:0x1c zxid:0x24 txntype:-1 reqpath:n/a Error Path:/solr/overseer Error:KeeperErrorCode = NodeExists for /solr/overseer
[junit4:junit4]   2> 641 T775 oazs.PrepRequestProcessor.pRequest Got user-level KeeperException when processing sessionid:0x13cc9d1f1d80003 type:create cxid:0x1d zxid:0x25 txntype:-1 reqpath:n/a Error Path:/solr/overseer Error:KeeperErrorCode = NodeExists for /solr/overseer
[junit4:junit4]   2> 642 T775 oazs.PrepRequestProcessor.pRequest Got user-level KeeperException when processing sessionid:0x13cc9d1f1d80003 type:create cxid:0x1e zxid:0x26 txntype:-1 reqpath:n/a Error Path:/solr/overseer Error:KeeperErrorCode = NodeExists for /solr/overseer
[junit4:junit4]   2> 652 T794 oasc.OverseerCollectionProcessor.run Process current queue of collection creations
[junit4:junit4]   2> 653 T770 oascc.SolrZkClient.makePath makePath: /clusterstate.json
[junit4:junit4]   2> 664 T770 oascc.ZkStateReader.createClusterStateWatchersAndUpdate Updating cluster state from ZooKeeper... 
[junit4:junit4]   2> 668 T793 oasc.Overseer$ClusterStateUpdater.run Starting to work on the main queue
[junit4:junit4]   2> 673 T795 oasc.CoreContainer.create Creating SolrCore 'collection1' using instanceDir: /usr/home/hudson/hudson-slave/workspace/Lucene-Solr-Tests-4.x-java7/solr/build/solr-core/test/J0/./org.apache.solr.cloud.SyncSliceTest-controljetty-1360595645187/collection1
[junit4:junit4]   2> 673 T795 oasc.ZkController.createCollectionZkNode Check for collection zkNode:control_collection
[junit4:junit4]   2> 674 T795 oasc.ZkController.createCollectionZkNode Collection zkNode exists
[junit4:junit4]   2> 674 T795 oasc.ZkController.readConfigName Load collection config from:/collections/control_collection
[junit4:junit4]   2> 676 T795 oasc.SolrResourceLoader.<init> new SolrResourceLoader for directory: '/usr/home/hudson/hudson-slave/workspace/Lucene-Solr-Tests-4.x-java7/solr/build/solr-core/test/J0/./org.apache.solr.cloud.SyncSliceTest-controljetty-1360595645187/collection1/'
[junit4:junit4]   2> 677 T795 oasc.SolrResourceLoader.replaceClassLoader Adding 'file:/usr/home/hudson/hudson-slave/workspace/Lucene-Solr-Tests-4.x-java7/solr/build/solr-core/test/J0/org.apache.solr.cloud.SyncSliceTest-controljetty-1360595645187/collection1/lib/classes/' to classloader
[junit4:junit4]   2> 678 T795 oasc.SolrResourceLoader.replaceClassLoader Adding 'file:/usr/home/hudson/hudson-slave/workspace/Lucene-Solr-Tests-4.x-java7/solr/build/solr-core/test/J0/org.apache.solr.cloud.SyncSliceTest-controljetty-1360595645187/collection1/lib/README' to classloader
[junit4:junit4]   2> 735 T795 oasc.SolrConfig.<init> Using Lucene MatchVersion: LUCENE_42
[junit4:junit4]   2> 808 T795 oasc.SolrConfig.<init> Loaded SolrConfig: solrconfig.xml
[junit4:junit4]   2> 909 T795 oass.IndexSchema.readSchema Reading Solr Schema
[junit4:junit4]   2> 918 T795 oass.IndexSchema.readSchema Schema name=test
[junit4:junit4]   2> 1571 T795 oass.OpenExchangeRatesOrgProvider.init Initialized with rates=open-exchange-rates.json, refreshInterval=1440.
[junit4:junit4]   2> 1578 T795 oass.IndexSchema.readSchema default search field in schema is text
[junit4:junit4]   2> 1581 T795 oass.IndexSchema.readSchema unique key field: id
[junit4:junit4]   2> 1596 T795 oass.FileExchangeRateProvider.reload Reloading exchange rates from file currency.xml
[junit4:junit4]   2> 1600 T795 oass.FileExchangeRateProvider.reload Reloading exchange rates from file currency.xml
[junit4:junit4]   2> 1604 T795 oass.OpenExchangeRatesOrgProvider.reload Reloading exchange rates from open-exchange-rates.json
[junit4:junit4]   2> 1605 T795 oass.OpenExchangeRatesOrgProvider.reload Reloading exchange rates from open-exchange-rates.json
[junit4:junit4]   2> 1606 T795 oasc.SolrCore.<init> [collection1] Opening new SolrCore at /usr/home/hudson/hudson-slave/workspace/Lucene-Solr-Tests-4.x-java7/solr/build/solr-core/test/J0/./org.apache.solr.cloud.SyncSliceTest-controljetty-1360595645187/collection1/, dataDir=./org.apache.solr.cloud.SyncSliceTest-1360595644881/control/data/
[junit4:junit4]   2> 1606 T795 oasc.JmxMonitoredMap.<init> JMX monitoring is enabled. Adding Solr mbeans to JMX Server: com.sun.jmx.mbeanserver.JmxMBeanServer@4cd1063b
[junit4:junit4]   2> 1607 T795 oasc.SolrCore.initDirectoryFactory solr.NRTCachingDirectoryFactory
[junit4:junit4]   2> 1608 T795 oasc.CachingDirectoryFactory.get return new directory for /usr/home/hudson/hudson-slave/workspace/Lucene-Solr-Tests-4.x-java7/solr/build/solr-core/test/J0/./org.apache.solr.cloud.SyncSliceTest-1360595644881/control/data forceNew:false
[junit4:junit4]   2> 1608 T795 oasc.CachingDirectoryFactory.close Releasing directory:/usr/home/hudson/hudson-slave/workspace/Lucene-Solr-Tests-4.x-java7/solr/build/solr-core/test/J0/./org.apache.solr.cloud.SyncSliceTest-1360595644881/control/data
[junit4:junit4]   2> 1609 T795 oasc.SolrCore.getNewIndexDir New index directory detected: old=null new=./org.apache.solr.cloud.SyncSliceTest-1360595644881/control/data/index/
[junit4:junit4]   2> 1609 T795 oasc.SolrCore.initIndex WARNING [collection1] Solr index directory './org.apache.solr.cloud.SyncSliceTest-1360595644881/control/data/index' doesn't exist. Creating new index...
[junit4:junit4]   2> 1610 T795 oasc.CachingDirectoryFactory.get return new directory for /usr/home/hudson/hudson-slave/workspace/Lucene-Solr-Tests-4.x-java7/solr/build/solr-core/test/J0/./org.apache.solr.cloud.SyncSliceTest-1360595644881/control/data/index forceNew:false
[junit4:junit4]   2> 1615 T795 oasc.SolrDeletionPolicy.onCommit SolrDeletionPolicy.onCommit: commits:num=1
[junit4:junit4]   2> 		commit{dir=RateLimitedDirectoryWrapper(NRTCachingDirectory(org.apache.lucene.store.NIOFSDirectory@/usr/home/hudson/hudson-slave/workspace/Lucene-Solr-Tests-4.x-java7/solr/build/solr-core/test/J0/org.apache.solr.cloud.SyncSliceTest-1360595644881/control/data/index lockFactory=org.apache.lucene.store.NativeFSLockFactory@2041c9fd; maxCacheMB=48.0 maxMergeSizeMB=4.0)),segFN=segments_1,generation=1,filenames=[segments_1]
[junit4:junit4]   2> 1615 T795 oasc.SolrDeletionPolicy.updateCommits newest commit = 1[segments_1]
[junit4:junit4]   2> 1616 T795 oasc.CachingDirectoryFactory.close Releasing directory:/usr/home/hudson/hudson-slave/workspace/Lucene-Solr-Tests-4.x-java7/solr/build/solr-core/test/J0/./org.apache.solr.cloud.SyncSliceTest-1360595644881/control/data/index
[junit4:junit4]   2> 1616 T795 oasc.SolrCore.initWriters created xml: solr.XMLResponseWriter
[junit4:junit4]   2> 1617 T795 oasup.UpdateRequestProcessorChain.init inserting DistributedUpdateProcessorFactory into updateRequestProcessorChain "dedupe"
[junit4:junit4]   2> 1618 T795 oasup.UpdateRequestProcessorChain.init inserting DistributedUpdateProcessorFactory into updateRequestProcessorChain "dedupe-allfields"
[junit4:junit4]   2> 1618 T795 oasup.UpdateRequestProcessorChain.init inserting DistributedUpdateProcessorFactory into updateRequestProcessorChain "stored_sig"
[junit4:junit4]   2> 1618 T795 oasup.UpdateRequestProcessorChain.init inserting DistributedUpdateProcessorFactory into updateRequestProcessorChain "uniq-fields"
[junit4:junit4]   2> 1619 T795 oasup.UpdateRequestProcessorChain.init inserting DistributedUpdateProcessorFactory into updateRequestProcessorChain "distrib-dup-test-chain-implicit"
[junit4:junit4]   2> 1619 T795 oasc.RequestHandlers.initHandlersFromConfig adding lazy requestHandler: solr.ReplicationHandler
[junit4:junit4]   2> 1619 T795 oasc.RequestHandlers.initHandlersFromConfig created /replication: solr.ReplicationHandler
[junit4:junit4]   2> 1620 T795 oasc.RequestHandlers.initHandlersFromConfig created standard: solr.StandardRequestHandler
[junit4:junit4]   2> 1620 T795 oasc.RequestHandlers.initHandlersFromConfig created /get: solr.RealTimeGetHandler
[junit4:junit4]   2> 1620 T795 oasc.RequestHandlers.initHandlersFromConfig created dismax: solr.SearchHandler
[junit4:junit4]   2> 1621 T795 oasc.RequestHandlers.initHandlersFromConfig created mock: org.apache.solr.core.MockQuerySenderListenerReqHandler
[junit4:junit4]   2> 1621 T795 oasc.RequestHandlers.initHandlersFromConfig created /admin/: org.apache.solr.handler.admin.AdminHandlers
[junit4:junit4]   2> 1621 T795 oasc.RequestHandlers.initHandlersFromConfig created defaults: solr.StandardRequestHandler
[junit4:junit4]   2> 1621 T795 oasc.RequestHandlers.initHandlersFromConfig adding lazy requestHandler: solr.StandardRequestHandler
[junit4:junit4]   2> 1622 T795 oasc.RequestHandlers.initHandlersFromConfig created lazy: solr.StandardRequestHandler
[junit4:junit4]   2> 1622 T795 oasc.RequestHandlers.initHandlersFromConfig created /update: solr.UpdateRequestHandler
[junit4:junit4]   2> 1622 T795 oasc.RequestHandlers.initHandlersFromConfig created /terms: org.apache.solr.handler.component.SearchHandler
[junit4:junit4]   2> 1623 T795 oasc.RequestHandlers.initHandlersFromConfig created spellCheckCompRH: org.apache.solr.handler.component.SearchHandler
[junit4:junit4]   2> 1623 T795 oasc.RequestHandlers.initHandlersFromConfig created spellCheckCompRH_Direct: org.apache.solr.handler.component.SearchHandler
[junit4:junit4]   2> 1623 T795 oasc.RequestHandlers.initHandlersFromConfig created spellCheckWithWordbreak: org.apache.solr.handler.component.SearchHandler
[junit4:junit4]   2> 1624 T795 oasc.RequestHandlers.initHandlersFromConfig created spellCheckWithWordbreak_Direct: org.apache.solr.handler.component.SearchHandler
[junit4:junit4]   2> 1624 T795 oasc.RequestHandlers.initHandlersFromConfig created spellCheckCompRH1: org.apache.solr.handler.component.SearchHandler
[junit4:junit4]   2> 1624 T795 oasc.RequestHandlers.initHandlersFromConfig created mltrh: org.apache.solr.handler.component.SearchHandler
[junit4:junit4]   2> 1625 T795 oasc.RequestHandlers.initHandlersFromConfig created tvrh: org.apache.solr.handler.component.SearchHandler
[junit4:junit4]   2> 1625 T795 oasc.RequestHandlers.initHandlersFromConfig created /mlt: solr.MoreLikeThisHandler
[junit4:junit4]   2> 1625 T795 oasc.RequestHandlers.initHandlersFromConfig created /debug/dump: solr.DumpRequestHandler
[junit4:junit4]   2> 1633 T795 oashl.XMLLoader.init xsltCacheLifetimeSeconds=60
[junit4:junit4]   2> 1637 T795 oasc.SolrCore.initDeprecatedSupport WARNING solrconfig.xml uses deprecated <admin/gettableFiles>, Please update your config to use the ShowFileRequestHandler.
[junit4:junit4]   2> 1638 T795 oasc.SolrCore.initDeprecatedSupport WARNING adding ShowFileRequestHandler with hidden files: [SCHEMA.XML, OLD_SYNONYMS.TXT, STOPWORDS.TXT, PROTWORDS.TXT, OPEN-EXCHANGE-RATES.JSON, SYNONYMS.TXT, CURRENCY.XML, MAPPING-ISOLATIN1ACCENT.TXT]
[junit4:junit4]   2> 1640 T795 oasc.CachingDirectoryFactory.close Releasing directory:/usr/home/hudson/hudson-slave/workspace/Lucene-Solr-Tests-4.x-java7/solr/build/solr-core/test/J0/./org.apache.solr.cloud.SyncSliceTest-1360595644881/control/data
[junit4:junit4]   2> 1641 T795 oass.SolrIndexSearcher.<init> Opening Searcher@73f056f8 main
[junit4:junit4]   2> 1641 T795 oasu.CommitTracker.<init> Hard AutoCommit: disabled
[junit4:junit4]   2> 1642 T795 oasu.CommitTracker.<init> Soft AutoCommit: disabled
[junit4:junit4]   2> 1642 T795 oashc.SpellCheckComponent.inform Initializing spell checkers
[junit4:junit4]   2> 1660 T795 oass.DirectSolrSpellChecker.init init: {name=direct,classname=DirectSolrSpellChecker,field=lowerfilt,minQueryLength=3}
[junit4:junit4]   2> 1702 T796 oasc.SolrCore.registerSearcher [collection1] Registered new searcher Searcher@73f056f8 main{StandardDirectoryReader(segments_1:1)}
[junit4:junit4]   2> 1705 T795 oasc.ZkController.publish publishing core=collection1 state=down
[junit4:junit4]   2> 1705 T795 oasc.ZkController.publish numShards not found on descriptor - reading it from system property
[junit4:junit4]   2> 1706 T775 oazs.PrepRequestProcessor.pRequest Got user-level KeeperException when processing sessionid:0x13cc9d1f1d80003 type:create cxid:0x51 zxid:0x29 txntype:-1 reqpath:n/a Error Path:/solr/overseer/queue Error:KeeperErrorCode = NoNode for /solr/overseer/queue
[junit4:junit4]   2> 2174 T793 oascc.ZkStateReader.updateClusterState Updating cloud state from ZooKeeper... 
[junit4:junit4]   2> 2174 T793 oasc.Overseer$ClusterStateUpdater.updateState Update state numShards=1 message={
[junit4:junit4]   2> 	  "operation":"state",
[junit4:junit4]   2> 	  "numShards":"1",
[junit4:junit4]   2> 	  "shard":null,
[junit4:junit4]   2> 	  "roles":null,
[junit4:junit4]   2> 	  "state":"down",
[junit4:junit4]   2> 	  "core":"collection1",
[junit4:junit4]   2> 	  "collection":"control_collection",
[junit4:junit4]   2> 	  "node_name":"127.0.0.1:38385_ge_sm%2Fp",
[junit4:junit4]   2> 	  "base_url":"http://127.0.0.1:38385/ge_sm/p"}
[junit4:junit4]   2> 2175 T793 oasc.Overseer$ClusterStateUpdater.createCollection Create collection control_collection with numShards 1
[junit4:junit4]   2> 2175 T793 oasc.Overseer$ClusterStateUpdater.updateState Assigning new node to shard shard=shard1
[junit4:junit4]   2> 2175 T775 oazs.PrepRequestProcessor.pRequest Got user-level KeeperException when processing sessionid:0x13cc9d1f1d80003 type:create cxid:0x59 zxid:0x2c txntype:-1 reqpath:n/a Error Path:/solr/overseer/queue-work Error:KeeperErrorCode = NoNode for /solr/overseer/queue-work
[junit4:junit4]   2> 2195 T792 oascc.ZkStateReader$2.process A cluster state change: WatchedEvent state:SyncConnected type:NodeDataChanged path:/clusterstate.json, has occurred - updating... (live nodes size: 1)
[junit4:junit4]   2> 2718 T795 oasc.CoreContainer.registerCore registering core: collection1
[junit4:junit4]   2> 2718 T795 oasc.ZkController.register Register replica - core:collection1 address:http://127.0.0.1:38385/ge_sm/p collection:control_collection shard:shard1
[junit4:junit4]   2> 2719 T795 oascc.SolrZkClient.makePath makePath: /collections/control_collection/leader_elect/shard1/election
[junit4:junit4]   2> 2737 T775 oazs.PrepRequestProcessor.pRequest Got user-level KeeperException when processing sessionid:0x13cc9d1f1d80003 type:delete cxid:0x73 zxid:0x36 txntype:-1 reqpath:n/a Error Path:/solr/collections/control_collection/leaders Error:KeeperErrorCode = NoNode for /solr/collections/control_collection/leaders
[junit4:junit4]   2> 2738 T795 oasc.ShardLeaderElectionContext.runLeaderProcess Running the leader process.
[junit4:junit4]   2> 2739 T775 oazs.PrepRequestProcessor.pRequest Got user-level KeeperException when processing sessionid:0x13cc9d1f1d80003 type:create cxid:0x74 zxid:0x37 txntype:-1 reqpath:n/a Error Path:/solr/overseer Error:KeeperErrorCode = NodeExists for /solr/overseer
[junit4:junit4]   2> 2749 T795 oasc.ShardLeaderElectionContext.waitForReplicasToComeUp Enough replicas found to continue.
[junit4:junit4]   2> 2749 T795 oasc.ShardLeaderElectionContext.runLeaderProcess I may be the new leader - try and sync
[junit4:junit4]   2> 2749 T795 oasc.SyncStrategy.sync Sync replicas to http://127.0.0.1:38385/ge_sm/p/collection1/
[junit4:junit4]   2> 2750 T795 oasc.SyncStrategy.syncReplicas Sync Success - now sync replicas to me
[junit4:junit4]   2> 2750 T795 oasc.SyncStrategy.syncToMe http://127.0.0.1:38385/ge_sm/p/collection1/ has no replicas
[junit4:junit4]   2> 2750 T795 oasc.ShardLeaderElectionContext.runLeaderProcess I am the new leader: http://127.0.0.1:38385/ge_sm/p/collection1/
[junit4:junit4]   2> 2750 T795 oascc.SolrZkClient.makePath makePath: /collections/control_collection/leaders/shard1
[junit4:junit4]   2> 2758 T775 oazs.PrepRequestProcessor.pRequest Got user-level KeeperException when processing sessionid:0x13cc9d1f1d80003 type:create cxid:0x7e zxid:0x3b txntype:-1 reqpath:n/a Error Path:/solr/overseer Error:KeeperErrorCode = NodeExists for /solr/overseer
[junit4:junit4]   2> 3701 T793 oascc.ZkStateReader.updateClusterState Updating cloud state from ZooKeeper... 
[junit4:junit4]   2> 3748 T792 oascc.ZkStateReader$2.process A cluster state change: WatchedEvent state:SyncConnected type:NodeDataChanged path:/clusterstate.json, has occurred - updating... (live nodes size: 1)
[junit4:junit4]   2> 3789 T795 oasc.ZkController.register We are http://127.0.0.1:38385/ge_sm/p/collection1/ and leader is http://127.0.0.1:38385/ge_sm/p/collection1/
[junit4:junit4]   2> 3789 T795 oasc.ZkController.register No LogReplay needed for core=collection1 baseURL=http://127.0.0.1:38385/ge_sm/p
[junit4:junit4]   2> 3789 T795 oasc.ZkController.checkRecovery I am the leader, no recovery necessary
[junit4:junit4]   2> 3789 T795 oasc.ZkController.publish publishing core=collection1 state=active
[junit4:junit4]   2> 3790 T795 oasc.ZkController.publish numShards not found on descriptor - reading it from system property
[junit4:junit4]   2> 3792 T795 oascc.ZkStateReader.updateClusterState Updating cloud state from ZooKeeper... 
[junit4:junit4]   2> 3793 T770 oass.SolrDispatchFilter.init user.dir=/usr/home/hudson/hudson-slave/workspace/Lucene-Solr-Tests-4.x-java7/solr/build/solr-core/test/J0
[junit4:junit4]   2> 3794 T770 oass.SolrDispatchFilter.init SolrDispatchFilter.init() done
[junit4:junit4]   2> 3795 T770 oascsi.HttpClientUtil.createClient Creating new http client, config:maxConnections=128&maxConnectionsPerHost=32&followRedirects=false
[junit4:junit4]   2> 3810 T770 oascsi.HttpClientUtil.createClient Creating new http client, config:
[junit4:junit4]   2> 3821 T770 oaz.ZooKeeper.<init> Initiating client connection, connectString=127.0.0.1:38382/solr sessionTimeout=10000 watcher=org.apache.solr.common.cloud.ConnectionManager@1edc13a1
[junit4:junit4]   2> 3822 T770 oascc.ConnectionManager.waitForConnected Waiting for client to connect to ZooKeeper
[junit4:junit4]   2> 3823 T797 oaz.ClientCnxn$SendThread.logStartConnect Opening socket connection to server localhost/127.0.0.1:38382. Will not attempt to authenticate using SASL (access denied ("javax.security.auth.AuthPermission" "getLoginConfiguration"))
[junit4:junit4]   2> 3823 T797 oaz.ClientCnxn$SendThread.primeConnection Socket connection established to localhost/127.0.0.1:38382, initiating session
[junit4:junit4]   2> 3823 T772 oazs.NIOServerCnxnFactory.run Accepted socket connection from /140.211.11.196:38388
[junit4:junit4]   2> 3824 T772 oazs.ZooKeeperServer.processConnectRequest Client attempting to establish new session at /140.211.11.196:38388
[junit4:junit4]   2> 3826 T774 oazs.ZooKeeperServer.finishSessionInit Established session 0x13cc9d1f1d80004 with negotiated timeout 10000 for client /140.211.11.196:38388
[junit4:junit4]   2> 3826 T797 oaz.ClientCnxn$SendThread.onConnected Session establishment complete on server localhost/127.0.0.1:38382, sessionid = 0x13cc9d1f1d80004, negotiated timeout = 10000
[junit4:junit4]   2> 3826 T798 oascc.ConnectionManager.process Watcher org.apache.solr.common.cloud.ConnectionManager@1edc13a1 name:ZooKeeperConnection Watcher:127.0.0.1:38382/solr got event WatchedEvent state:SyncConnected type:None path:null path:null type:None
[junit4:junit4]   2> 3827 T770 oascc.ConnectionManager.waitForConnected Client is connected to ZooKeeper
[junit4:junit4]   2> 3828 T770 oascc.ZkStateReader.createClusterStateWatchersAndUpdate Updating cluster state from ZooKeeper... 
[junit4:junit4]   2> 3831 T770 oasc.ChaosMonkey.monkeyLog monkey: init - expire sessions:true cause connection loss:true
[junit4:junit4]   2> 4001 T770 oejs.Server.doStart jetty-8.1.8.v20121106
[junit4:junit4]   2> 4004 T770 oejs.AbstractConnector.doStart Started SocketConnector@127.0.0.1:38389
[junit4:junit4]   2> 4004 T770 oass.SolrDispatchFilter.init SolrDispatchFilter.init()
[junit4:junit4]   2> 4005 T770 oasc.SolrResourceLoader.locateSolrHome JNDI not configured for solr (NoInitialContextEx)
[junit4:junit4]   2> 4005 T770 oasc.SolrResourceLoader.locateSolrHome using system property solr.solr.home: /usr/home/hudson/hudson-slave/workspace/Lucene-Solr-Tests-4.x-java7/solr/build/solr-core/test/J0/./org.apache.solr.cloud.SyncSliceTest-jetty1-1360595648706
[junit4:junit4]   2> 4006 T770 oasc.CoreContainer$Initializer.initialize looking for solr.xml: /usr/home/hudson/hudson-slave/workspace/Lucene-Solr-Tests-4.x-java7/solr/build/solr-core/test/J0/./org.apache.solr.cloud.SyncSliceTest-jetty1-1360595648706/solr.xml
[junit4:junit4]   2> 4006 T770 oasc.CoreContainer.<init> New CoreContainer 1419500772
[junit4:junit4]   2> 4007 T770 oasc.CoreContainer.load Loading CoreContainer using Solr Home: '/usr/home/hudson/hudson-slave/workspace/Lucene-Solr-Tests-4.x-java7/solr/build/solr-core/test/J0/./org.apache.solr.cloud.SyncSliceTest-jetty1-1360595648706/'
[junit4:junit4]   2> 4007 T770 oasc.SolrResourceLoader.<init> new SolrResourceLoader for directory: '/usr/home/hudson/hudson-slave/workspace/Lucene-Solr-Tests-4.x-java7/solr/build/solr-core/test/J0/./org.apache.solr.cloud.SyncSliceTest-jetty1-1360595648706/'
[junit4:junit4]   2> 4068 T770 oashc.HttpShardHandlerFactory.getParameter Setting socketTimeout to: 60000
[junit4:junit4]   2> 4068 T770 oashc.HttpShardHandlerFactory.getParameter Setting urlScheme to: http://
[junit4:junit4]   2> 4069 T770 oashc.HttpShardHandlerFactory.getParameter Setting connTimeout to: 15000
[junit4:junit4]   2> 4069 T770 oashc.HttpShardHandlerFactory.getParameter Setting maxConnectionsPerHost to: 20
[junit4:junit4]   2> 4070 T770 oashc.HttpShardHandlerFactory.getParameter Setting corePoolSize to: 0
[junit4:junit4]   2> 4070 T770 oashc.HttpShardHandlerFactory.getParameter Setting maximumPoolSize to: 2147483647
[junit4:junit4]   2> 4071 T770 oashc.HttpShardHandlerFactory.getParameter Setting maxThreadIdleTime to: 5
[junit4:junit4]   2> 4071 T770 oashc.HttpShardHandlerFactory.getParameter Setting sizeOfQueue to: -1
[junit4:junit4]   2> 4072 T770 oashc.HttpShardHandlerFactory.getParameter Setting fairnessPolicy to: false
[junit4:junit4]   2> 4072 T770 oascsi.HttpClientUtil.createClient Creating new http client, config:maxConnectionsPerHost=20&maxConnections=10000&socketTimeout=60000&connTimeout=15000&retry=false
[junit4:junit4]   2> 4094 T770 oasc.CoreContainer.load Registering Log Listener
[junit4:junit4]   2> 4114 T770 oasc.CoreContainer.initZooKeeper Zookeeper client=127.0.0.1:38382/solr
[junit4:junit4]   2> 4114 T770 oasc.ZkController.checkChrootPath zkHost includes chroot
[junit4:junit4]   2> 4115 T770 oaz.ZooKeeper.<init> Initiating client connection, connectString=127.0.0.1:38382 sessionTimeout=60000 watcher=org.apache.solr.common.cloud.ConnectionManager@22864d01
[junit4:junit4]   2> 4116 T770 oascc.ConnectionManager.waitForConnected Waiting for client to connect to ZooKeeper
[junit4:junit4]   2> 4116 T808 oaz.ClientCnxn$SendThread.logStartConnect Opening socket connection to server localhost/127.0.0.1:38382. Will not attempt to authenticate using SASL (access denied ("javax.security.auth.AuthPermission" "getLoginConfiguration"))
[junit4:junit4]   2> 4117 T808 oaz.ClientCnxn$SendThread.primeConnection Socket connection established to localhost/127.0.0.1:38382, initiating session
[junit4:junit4]   2> 4117 T772 oazs.NIOServerCnxnFactory.run Accepted socket connection from /140.211.11.196:38390
[junit4:junit4]   2> 4118 T772 oazs.ZooKeeperServer.processConnectRequest Client attempting to establish new session at /140.211.11.196:38390
[junit4:junit4]   2> 4120 T774 oazs.ZooKeeperServer.finishSessionInit Established session 0x13cc9d1f1d80005 with negotiated timeout 20000 for client /140.211.11.196:38390
[junit4:junit4]   2> 4120 T808 oaz.ClientCnxn$SendThread.onConnected Session establishment complete on server localhost/127.0.0.1:38382, sessionid = 0x13cc9d1f1d80005, negotiated timeout = 20000
[junit4:junit4]   2> 4120 T809 oascc.ConnectionManager.process Watcher org.apache.solr.common.cloud.ConnectionManager@22864d01 name:ZooKeeperConnection Watcher:127.0.0.1:38382 got event WatchedEvent state:SyncConnected type:None path:null path:null type:None
[junit4:junit4]   2> 4121 T770 oascc.ConnectionManager.waitForConnected Client is connected to ZooKeeper
[junit4:junit4]   2> 4123 T775 oazs.PrepRequestProcessor.pRequest2Txn Processed session termination for sessionid: 0x13cc9d1f1d80005
[junit4:junit4]   2> 4132 T772 oazs.NIOServerCnxn.closeSock Closed socket connection for client /140.211.11.196:38390 which had sessionid 0x13cc9d1f1d80005
[junit4:junit4]   2> 4132 T809 oaz.ClientCnxn$EventThread.run EventThread shut down
[junit4:junit4]   2> 4132 T770 oaz.ZooKeeper.close Session: 0x13cc9d1f1d80005 closed
[junit4:junit4]   2> 4133 T770 oascsi.HttpClientUtil.createClient Creating new http client, config:maxConnections=500&maxConnectionsPerHost=16&socketTimeout=60000&connTimeout=15000
[junit4:junit4]   2> 4145 T770 oaz.ZooKeeper.<init> Initiating client connection, connectString=127.0.0.1:38382/solr sessionTimeout=30000 watcher=org.apache.solr.common.cloud.ConnectionManager@600d64e9
[junit4:junit4]   2> 4147 T770 oascc.ConnectionManager.waitForConnected Waiting for client to connect to ZooKeeper
[junit4:junit4]   2> 4147 T810 oaz.ClientCnxn$SendThread.logStartConnect Opening socket connection to server localhost/127.0.0.1:38382. Will not attempt to authenticate using SASL (access denied ("javax.security.auth.AuthPermission" "getLoginConfiguration"))
[junit4:junit4]   2> 4148 T810 oaz.ClientCnxn$SendThread.primeConnection Socket connection established to localhost/127.0.0.1:38382, initiating session
[junit4:junit4]   2> 4148 T772 oazs.NIOServerCnxnFactory.run Accepted socket connection from /140.211.11.196:38391
[junit4:junit4]   2> 4149 T772 oazs.ZooKeeperServer.processConnectRequest Client attempting to establish new session at /140.211.11.196:38391
[junit4:junit4]   2> 4150 T774 oazs.ZooKeeperServer.finishSessionInit Established session 0x13cc9d1f1d80006 with negotiated timeout 20000 for client /140.211.11.196:38391
[junit4:junit4]   2> 4150 T810 oaz.ClientCnxn$SendThread.onConnected Session establishment complete on server localhost/127.0.0.1:38382, sessionid = 0x13cc9d1f1d80006, negotiated timeout = 20000
[junit4:junit4]   2> 4150 T811 oascc.ConnectionManager.process Watcher org.apache.solr.common.cloud.ConnectionManager@600d64e9 name:ZooKeeperConnection Watcher:127.0.0.1:38382/solr got event WatchedEvent state:SyncConnected type:None path:null path:null type:None
[junit4:junit4]   2> 4151 T770 oascc.ConnectionManager.waitForConnected Client is connected to ZooKeeper
[junit4:junit4]   2> 4152 T775 oazs.PrepRequestProcessor.pRequest Got user-level KeeperException when processing sessionid:0x13cc9d1f1d80006 type:create cxid:0x1 zxid:0x49 txntype:-1 reqpath:n/a Error Path:/solr/overseer Error:KeeperErrorCode = NodeExists for /solr/overseer
[junit4:junit4]   2> 4154 T775 oazs.PrepRequestProcessor.pRequest Got user-level KeeperException when processing sessionid:0x13cc9d1f1d80006 type:create cxid:0x2 zxid:0x4a txntype:-1 reqpath:n/a Error Path:/solr/overseer Error:KeeperErrorCode = NodeExists for /solr/overseer
[junit4:junit4]   2> 4162 T770 oascc.ZkStateReader.createClusterStateWatchersAndUpdate Updating cluster state from ZooKeeper... 
[junit4:junit4]   2> 4165 T770 oasc.ZkController.createEphemeralLiveNode Register node as live in ZooKeeper:/live_nodes/127.0.0.1:38389_ge_sm%2Fp
[junit4:junit4]   2> 4166 T775 oazs.PrepRequestProcessor.pRequest Got user-level KeeperException when processing sessionid:0x13cc9d1f1d80006 type:delete cxid:0x9 zxid:0x4b txntype:-1 reqpath:n/a Error Path:/solr/live_nodes/127.0.0.1:38389_ge_sm%2Fp Error:KeeperErrorCode = NoNode for /solr/live_nodes/127.0.0.1:38389_ge_sm%2Fp
[junit4:junit4]   2> 4167 T770 oascc.SolrZkClient.makePath makePath: /live_nodes/127.0.0.1:38389_ge_sm%2Fp
[junit4:junit4]   2> 4171 T798 oascc.ZkStateReader$3.process Updating live nodes... (2)
[junit4:junit4]   2> 4172 T792 oascc.ZkStateReader$3.process Updating live nodes... (2)
[junit4:junit4]   2> 4172 T811 oascc.ZkStateReader$3.process Updating live nodes... (2)
[junit4:junit4]   2> 4172 T792 oascc.ZkStateReader$2.process A cluster state change: WatchedEvent state:SyncConnected type:NodeChildrenChanged path:/live_nodes, has occurred - updating... (live nodes size: 2)
[junit4:junit4]   2> 4182 T812 oasc.CoreContainer.create Creating SolrCore 'collection1' using instanceDir: /usr/home/hudson/hudson-slave/workspace/Lucene-Solr-Tests-4.x-java7/solr/build/solr-core/test/J0/./org.apache.solr.cloud.SyncSliceTest-jetty1-1360595648706/collection1
[junit4:junit4]   2> 4182 T812 oasc.ZkController.createCollectionZkNode Check for collection zkNode:collection1
[junit4:junit4]   2> 4183 T812 oasc.ZkController.createCollectionZkNode Collection zkNode exists
[junit4:junit4]   2> 4183 T812 oasc.ZkController.readConfigName Load collection config from:/collections/collection1
[junit4:junit4]   2> 4185 T812 oasc.SolrResourceLoader.<init> new SolrResourceLoader for directory: '/usr/home/hudson/hudson-slave/workspace/Lucene-Solr-Tests-4.x-java7/solr/build/solr-core/test/J0/./org.apache.solr.cloud.SyncSliceTest-jetty1-1360595648706/collection1/'
[junit4:junit4]   2> 4186 T812 oasc.SolrResourceLoader.replaceClassLoader Adding 'file:/usr/home/hudson/hudson-slave/workspace/Lucene-Solr-Tests-4.x-java7/solr/build/solr-core/test/J0/org.apache.solr.cloud.SyncSliceTest-jetty1-1360595648706/collection1/lib/classes/' to classloader
[junit4:junit4]   2> 4187 T812 oasc.SolrResourceLoader.replaceClassLoader Adding 'file:/usr/home/hudson/hudson-slave/workspace/Lucene-Solr-Tests-4.x-java7/solr/build/solr-core/test/J0/org.apache.solr.cloud.SyncSliceTest-jetty1-1360595648706/collection1/lib/README' to classloader
[junit4:junit4]   2> 4244 T812 oasc.SolrConfig.<init> Using Lucene MatchVersion: LUCENE_42
[junit4:junit4]   2> 4317 T812 oasc.SolrConfig.<init> Loaded SolrConfig: solrconfig.xml
[junit4:junit4]   2> 4418 T812 oass.IndexSchema.readSchema Reading Solr Schema
[junit4:junit4]   2> 4427 T812 oass.IndexSchema.readSchema Schema name=test
[junit4:junit4]   2> 5071 T812 oass.OpenExchangeRatesOrgProvider.init Initialized with rates=open-exchange-rates.json, refreshInterval=1440.
[junit4:junit4]   2> 5079 T812 oass.IndexSchema.readSchema default search field in schema is text
[junit4:junit4]   2> 5082 T812 oass.IndexSchema.readSchema unique key field: id
[junit4:junit4]   2> 5097 T812 oass.FileExchangeRateProvider.reload Reloading exchange rates from file currency.xml
[junit4:junit4]   2> 5101 T812 oass.FileExchangeRateProvider.reload Reloading exchange rates from file currency.xml
[junit4:junit4]   2> 5105 T812 oass.OpenExchangeRatesOrgProvider.reload Reloading exchange rates from open-exchange-rates.json
[junit4:junit4]   2> 5106 T812 oass.OpenExchangeRatesOrgProvider.reload Reloading exchange rates from open-exchange-rates.json
[junit4:junit4]   2> 5108 T812 oasc.SolrCore.<init> [collection1] Opening new SolrCore at /usr/home/hudson/hudson-slave/workspace/Lucene-Solr-Tests-4.x-java7/solr/build/solr-core/test/J0/./org.apache.solr.cloud.SyncSliceTest-jetty1-1360595648706/collection1/, dataDir=./org.apache.solr.cloud.SyncSliceTest-1360595644881/jetty1/
[junit4:junit4]   2> 5108 T812 oasc.JmxMonitoredMap.<init> JMX monitoring is enabled. Adding Solr mbeans to JMX Server: com.sun.jmx.mbeanserver.JmxMBeanServer@4cd1063b
[junit4:junit4]   2> 5108 T812 oasc.SolrCore.initDirectoryFactory solr.NRTCachingDirectoryFactory
[junit4:junit4]   2> 5109 T812 oasc.CachingDirectoryFactory.get return new directory for /usr/home/hudson/hudson-slave/workspace/Lucene-Solr-Tests-4.x-java7/solr/build/solr-core/test/J0/./org.apache.solr.cloud.SyncSliceTest-1360595644881/jetty1 forceNew:false
[junit4:junit4]   2> 5110 T812 oasc.CachingDirectoryFactory.close Releasing directory:/usr/home/hudson/hudson-slave/workspace/Lucene-Solr-Tests-4.x-java7/solr/build/solr-core/test/J0/./org.apache.solr.cloud.SyncSliceTest-1360595644881/jetty1
[junit4:junit4]   2> 5110 T812 oasc.SolrCore.getNewIndexDir New index directory detected: old=null new=./org.apache.solr.cloud.SyncSliceTest-1360595644881/jetty1/index/
[junit4:junit4]   2> 5111 T812 oasc.SolrCore.initIndex WARNING [collection1] Solr index directory './org.apache.solr.cloud.SyncSliceTest-1360595644881/jetty1/index' doesn't exist. Creating new index...
[junit4:junit4]   2> 5111 T812 oasc.CachingDirectoryFactory.get return new directory for /usr/home/hudson/hudson-slave/workspace/Lucene-Solr-Tests-4.x-java7/solr/build/solr-core/test/J0/./org.apache.solr.cloud.SyncSliceTest-1360595644881/jetty1/index forceNew:false
[junit4:junit4]   2> 5143 T812 oasc.SolrDeletionPolicy.onCommit SolrDeletionPolicy.onCommit: commits:num=1
[junit4:junit4]   2> 		commit{dir=RateLimitedDirectoryWrapper(NRTCachingDirectory(org.apache.lucene.store.NIOFSDirectory@/usr/home/hudson/hudson-slave/workspace/Lucene-Solr-Tests-4.x-java7/solr/build/solr-core/test/J0/org.apache.solr.cloud.SyncSliceTest-1360595644881/jetty1/index lockFactory=org.apache.lucene.store.NativeFSLockFactory@737630f3; maxCacheMB=48.0 maxMergeSizeMB=4.0)),segFN=segments_1,generation=1,filenames=[segments_1]
[junit4:junit4]   2> 5143 T812 oasc.SolrDeletionPolicy.updateCommits newest commit = 1[segments_1]
[junit4:junit4]   2> 5144 T812 oasc.CachingDirectoryFactory.close Releasing directory:/usr/home/hudson/hudson-slave/workspace/Lucene-Solr-Tests-4.x-java7/solr/build/solr-core/test/J0/./org.apache.solr.cloud.SyncSliceTest-1360595644881/jetty1/index
[junit4:junit4]   2> 5145 T812 oasc.SolrCore.initWriters created xml: solr.XMLResponseWriter
[junit4:junit4]   2> 5147 T812 oasup.UpdateRequestProcessorChain.init inserting DistributedUpdateProcessorFactory into updateRequestProcessorChain "dedupe"
[junit4:junit4]   2> 5147 T812 oasup.UpdateRequestProcessorChain.init inserting DistributedUpdateProcessorFactory into updateRequestProcessorChain "dedupe-allfields"
[junit4:junit4]   2> 5148 T812 oasup.UpdateRequestProcessorChain.init inserting DistributedUpdateProcessorFactory into updateRequestProcessorChain "stored_sig"
[junit4:junit4]   2> 5148 T812 oasup.UpdateRequestProcessorChain.init inserting DistributedUpdateProcessorFactory into updateRequestProcessorChain "uniq-fields"
[junit4:junit4]   2> 5149 T812 oasup.UpdateRequestProcessorChain.init inserting DistributedUpdateProcessorFactory into updateRequestProcessorChain "distrib-dup-test-chain-implicit"
[junit4:junit4]   2> 5149 T812 oasc.RequestHandlers.initHandlersFromConfig adding lazy requestHandler: solr.ReplicationHandler
[junit4:junit4]   2> 5149 T812 oasc.RequestHandlers.initHandlersFromConfig created /replication: solr.ReplicationHandler
[junit4:junit4]   2> 5150 T812 oasc.RequestHandlers.initHandlersFromConfig created standard: solr.StandardRequestHandler
[junit4:junit4]   2> 5151 T812 oasc.RequestHandlers.initHandlersFromConfig created /get: solr.RealTimeGetHandler
[junit4:junit4]   2> 5151 T812 oasc.RequestHandlers.initHandlersFromConfig created dismax: solr.SearchHandler
[junit4:junit4]   2> 5152 T812 oasc.RequestHandlers.initHandlersFromConfig created mock: org.apache.solr.core.MockQuerySenderListenerReqHandler
[junit4:junit4]   2> 5152 T812 oasc.RequestHandlers.initHandlersFromConfig created /admin/: org.apache.solr.handler.admin.AdminHandlers
[junit4:junit4]   2> 5153 T812 oasc.RequestHandlers.initHandlersFromConfig created defaults: solr.StandardRequestHandler
[junit4:junit4]   2> 5153 T812 oasc.RequestHandlers.initHandlersFromConfig adding lazy requestHandler: solr.StandardRequestHandler
[junit4:junit4]   2> 5154 T812 oasc.RequestHandlers.initHandlersFromConfig created lazy: solr.StandardRequestHandler
[junit4:junit4]   2> 5154 T812 oasc.RequestHandlers.initHandlersFromConfig created /update: solr.UpdateRequestHandler
[junit4:junit4]   2> 5155 T812 oasc.RequestHandlers.initHandlersFromConfig created /terms: org.apache.solr.handler.component.SearchHandler
[junit4:junit4]   2> 5155 T812 oasc.RequestHandlers.initHandlersFromConfig created spellCheckCompRH: org.apache.solr.handler.component.SearchHandler
[junit4:junit4]   2> 5156 T812 oasc.RequestHandlers.initHandlersFromConfig created spellCheckCompRH_Direct: org.apache.solr.handler.component.SearchHandler
[junit4:junit4]   2> 5157 T812 oasc.RequestHandlers.initHandlersFromConfig created spellCheckWithWordbreak: org.apache.solr.handler.component.SearchHandler
[junit4:junit4]   2> 5157 T812 oasc.RequestHandlers.initHandlersFromConfig created spellCheckWithWordbreak_Direct: org.apache.solr.handler.component.SearchHandler
[junit4:junit4]   2> 5158 T812 oasc.RequestHandlers.initHandlersFromConfig created spellCheckCompRH1: org.apache.solr.handler.component.SearchHandler
[junit4:junit4]   2> 5158 T812 oasc.RequestHandlers.initHandlersFromConfig created mltrh: org.apache.solr.handler.component.SearchHandler
[junit4:junit4]   2> 5159 T812 oasc.RequestHandlers.initHandlersFromConfig created tvrh: org.apache.solr.handler.component.SearchHandler
[junit4:junit4]   2> 5160 T812 oasc.RequestHandlers.initHandlersFromConfig created /mlt: solr.MoreLikeThisHandler
[junit4:junit4]   2> 5160 T812 oasc.RequestHandlers.initHandlersFromConfig created /debug/dump: solr.DumpRequestHandler
[junit4:junit4]   2> 5173 T812 oashl.XMLLoader.init xsltCacheLifetimeSeconds=60
[junit4:junit4]   2> 5177 T812 oasc.SolrCore.initDeprecatedSupport WARNING solrconfig.xml uses deprecated <admin/gettableFiles>, Please update your config to use the ShowFileRequestHandler.
[junit4:junit4]   2> 5179 T812 oasc.SolrCore.initDeprecatedSupport WARNING adding ShowFileRequestHandler with hidden files: [SCHEMA.XML, OLD_SYNONYMS.TXT, STOPWORDS.TXT, PROTWORDS.TXT, OPEN-EXCHANGE-RATES.JSON, SYNONYMS.TXT, CURRENCY.XML, MAPPING-ISOLATIN1ACCENT.TXT]
[junit4:junit4]   2> 5182 T812 oasc.CachingDirectoryFactory.close Releasing directory:/usr/home/hudson/hudson-slave/workspace/Lucene-Solr-Tests-4.x-java7/solr/build/solr-core/test/J0/./org.apache.solr.cloud.SyncSliceTest-1360595644881/jetty1
[junit4:junit4]   2> 5183 T812 oass.SolrIndexSearcher.<init> Opening Searcher@77ae396a main
[junit4:junit4]   2> 5184 T812 oasu.CommitTracker.<init> Hard AutoCommit: disabled
[junit4:junit4]   2> 5185 T812 oasu.CommitTracker.<init> Soft AutoCommit: disabled
[junit4:junit4]   2> 5185 T812 oashc.SpellCheckComponent.inform Initializing spell checkers
[junit4:junit4]   2> 5193 T812 oass.DirectSolrSpellChecker.init init: {name=direct,classname=DirectSolrSpellChecker,field=lowerfilt,minQueryLength=3}
[junit4:junit4]   2> 5245 T813 oasc.SolrCore.registerSearcher [collection1] Registered new searcher Searcher@77ae396a main{StandardDirectoryReader(segments_1:1)}
[junit4:junit4]   2> 5249 T812 oasc.ZkController.publish publishing core=collection1 state=down
[junit4:junit4]   2> 5249 T812 oasc.ZkController.publish numShards not found on descriptor - reading it from system property
[junit4:junit4]   2> 5263 T793 oascc.ZkStateReader.updateClusterState Updating cloud state from ZooKeeper... 
[junit4:junit4]   2> 5264 T793 oasc.Overseer$ClusterStateUpdater.updateState Update state numShards=1 message={
[junit4:junit4]   2> 	  "operation":"state",
[junit4:junit4]   2> 	  "numShards":"1",
[junit4:junit4]   2> 	  "shard":"shard1",
[junit4:junit4]   2> 	  "roles":null,
[junit4:junit4]   2> 	  "state":"active",
[junit4:junit4]   2> 	  "core":"collection1",
[junit4:junit4]   2> 	  "collection":"control_collection",
[junit4:junit4]   2> 	  "node_name":"127.0.0.1:38385_ge_sm%2Fp",
[junit4:junit4]   2> 	  "base_url":"http://127.0.0.1:38385/ge_sm/p"}
[junit4:junit4]   2> 5268 T793 oasc.Overseer$ClusterStateUpdater.updateState Update state numShards=1 message={
[junit4:junit4]   2> 	  "operation":"state",
[junit4:junit4]   2> 	  "numShards":"1",
[junit4:junit4]   2> 	  "shard":null,
[junit4:junit4]   2> 	  "roles":null,
[junit4:junit4]   2> 	  "state":"down",
[junit4:junit4]   2> 	  "core":"collection1",
[junit4:junit4]   2> 	  "collection":"collection1",
[junit4:junit4]   2> 	  "node_name":"127.0.0.1:38389_ge_sm%2Fp",
[junit4:junit4]   2> 	  "base_url":"http://127.0.0.1:38389/ge_sm/p"}
[junit4:junit4]   2> 5268 T793 oasc.Overseer$ClusterStateUpdater.createCollection Create collection collection1 with numShards 1
[junit4:junit4]   2> 5269 T793 oasc.Overseer$ClusterStateUpdater.updateState Assigning new node to shard shard=shard1
[junit4:junit4]   2> 5280 T811 oascc.ZkStateReader$2.process A cluster state change: WatchedEvent state:SyncConnected type:NodeDataChanged path:/clusterstate.json, has occurred - updating... (live nodes size: 2)
[junit4:junit4]   2> 5280 T798 oascc.ZkStateReader$2.process A cluster state change: WatchedEvent state:SyncConnected type:NodeDataChanged path:/clusterstate.json, has occurred - updating... (live nodes size: 2)
[junit4:junit4]   2> 5280 T792 oascc.ZkStateReader$2.process A cluster state change: WatchedEvent state:SyncConnected type:NodeDataChanged path:/clusterstate.json, has occurred - updating... (live nodes size: 2)
[junit4:junit4]   2> 6252 T812 oasc.CoreContainer.registerCore registering core: collection1
[junit4:junit4]   2> 6252 T812 oasc.ZkController.register Register replica - core:collection1 address:http://127.0.0.1:38389/ge_sm/p collection:collection1 shard:shard1
[junit4:junit4]   2> 6253 T812 oascc.SolrZkClient.makePath makePath: /collections/collection1/leader_elect/shard1/election
[junit4:junit4]   2> 6265 T775 oazs.PrepRequestProcessor.pRequest Got user-level KeeperException when processing sessionid:0x13cc9d1f1d80006 type:delete cxid:0x45 zxid:0x5a txntype:-1 reqpath:n/a Error Path:/solr/collections/collection1/leaders Error:KeeperErrorCode = NoNode for /solr/collections/collection1/leaders
[junit4:junit4]   2> 6266 T812 oasc.ShardLeaderElectionContext.runLeaderProcess Running the leader process.
[junit4:junit4]   2> 6267 T775 oazs.PrepRequestProcessor.pRequest Got user-level KeeperException when processing sessionid:0x13cc9d1f1d80006 type:create cxid:0x46 zxid:0x5b txntype:-1 reqpath:n/a Error Path:/solr/overseer Error:KeeperErrorCode = NodeExists for /solr/overseer
[junit4:junit4]   2> 6271 T812 oasc.ShardLeaderElectionContext.waitForReplicasToComeUp Enough replicas found to continue.
[junit4:junit4]   2> 6271 T812 oasc.ShardLeaderElectionContext.runLeaderProcess I may be the new leader - try and sync
[junit4:junit4]   2> 6271 T812 oasc.SyncStrategy.sync Sync replicas to http://127.0.0.1:38389/ge_sm/p/collection1/
[junit4:junit4]   2> 6272 T812 oasc.SyncStrategy.syncReplicas Sync Success - now sync replicas to me
[junit4:junit4]   2> 6272 T812 oasc.SyncStrategy.syncToMe http://127.0.0.1:38389/ge_sm/p/collection1/ has no replicas
[junit4:junit4]   2> 6272 T812 oasc.ShardLeaderElectionContext.runLeaderProcess I am the new leader: http://127.0.0.1:38389/ge_sm/p/collection1/
[junit4:junit4]   2> 6273 T812 oascc.SolrZkClient.makePath makePath: /collections/collection1/leaders/shard1
[junit4:junit4]   2> 6279 T775 oazs.PrepRequestProcessor.pRequest Got user-level KeeperException when processing sessionid:0x13cc9d1f1d80006 type:create cxid:0x50 zxid:0x5f txntype:-1 reqpath:n/a Error Path:/solr/overseer Error:KeeperErrorCode = NodeExists for /solr/overseer
[junit4:junit4]   2> 6797 T793 oascc.ZkStateReader.updateClusterState Updating cloud state from ZooKeeper... 
[junit4:junit4]   2> 6823 T792 oascc.ZkStateReader$2.process A cluster state change: WatchedEvent state:SyncConnected type:NodeDataChanged path:/clusterstate.json, has occurred - updating... (live nodes size: 2)
[junit4:junit4]   2> 6823 T798 oascc.ZkStateReader$2.process A cluster state change: WatchedEvent state:SyncConnected type:NodeDataChanged path:/clusterstate.json, has occurred - updating... (live nodes size: 2)
[junit4:junit4]   2> 6823 T811 oascc.ZkStateReader$2.process A cluster state change: WatchedEvent state:SyncConnected type:NodeDataChanged path:/clusterstate.json, has occurred - updating... (live nodes size: 2)
[junit4:junit4]   2> 6844 T812 oasc.ZkController.register We are http://127.0.0.1:38389/ge_sm/p/collection1/ and leader is http://127.0.0.1:38389/ge_sm/p/collection1/
[junit4:junit4]   2> 6844 T812 oasc.ZkController.register No LogReplay needed for core=collection1 baseURL=http://127.0.0.1:38389/ge_sm/p
[junit4:junit4]   2> 6844 T812 oasc.ZkController.checkRecovery I am the leader, no recovery necessary
[junit4:junit4]   2> 6845 T812 oasc.ZkController.publish publishing core=collection1 state=active
[junit4:junit4]   2> 6845 T812 oasc.ZkController.publish numShards not found on descriptor - reading it from system property
[junit4:junit4]   2> 6848 T812 oascc.ZkStateReader.updateClusterState Updating cloud state from ZooKeeper... 
[junit4:junit4]   2> 6849 T770 oass.SolrDispatchFilter.init user.dir=/usr/home/hudson/hudson-slave/workspace/Lucene-Solr-Tests-4.x-java7/solr/build/solr-core/test/J0
[junit4:junit4]   2> 6850 T770 oass.SolrDispatchFilter.init SolrDispatchFilter.init() done
[junit4:junit4]   2> 6850 T770 oascsi.HttpClientUtil.createClient Creating new http client, config:maxConnections=128&maxConnectionsPerHost=32&followRedirects=false
[junit4:junit4]   2> 7060 T770 oejs.Server.doStart jetty-8.1.8.v20121106
[junit4:junit4]   2> 7064 T770 oejs.AbstractConnector.doStart Started SocketConnector@127.0.0.1:38453
[junit4:junit4]   2> 7064 T770 oass.SolrDispatchFilter.init SolrDispatchFilter.init()
[junit4:junit4]   2> 7065 T770 oasc.SolrResourceLoader.locateSolrHome JNDI not configured for solr (NoInitialContextEx)
[junit4:junit4]   2> 7065 T770 oasc.SolrResourceLoader.locateSolrHome using system property solr.solr.home: /usr/home/hudson/hudson-slave/workspace/Lucene-Solr-Tests-4.x-java7/solr/build/solr-core/test/J0/./org.apache.solr.cloud.SyncSliceTest-jetty2-1360595651743
[junit4:junit4]   2> 7066 T770 oasc.CoreContainer$Initializer.initialize looking for solr.xml: /usr/home/hudson/hudson-slave/workspace/Lucene-Solr-Tests-4.x-java7/solr/build/solr-core/test/J0/./org.apache.solr.cloud.SyncSliceTest-jetty2-1360595651743/solr.xml
[junit4:junit4]   2> 7066 T770 oasc.CoreContainer.<init> New CoreContainer 1738181626
[junit4:junit4]   2> 7067 T770 oasc.CoreContainer.load Loading CoreContainer using Solr Home: '/usr/home/hudson/hudson-slave/workspace/Lucene-Solr-Tests-4.x-java7/solr/build/solr-core/test/J0/./org.apache.solr.cloud.SyncSliceTest-jetty2-1360595651743/'
[junit4:junit4]   2> 7068 T770 oasc.SolrResourceLoader.<init> new SolrResourceLoader for directory: '/usr/home/hudson/hudson-slave/workspace/Lucene-Solr-Tests-4.x-java7/solr/build/solr-core/test/J0/./org.apache.solr.cloud.SyncSliceTest-jetty2-1360595651743/'
[junit4:junit4]   2> 7135 T770 oashc.HttpShardHandlerFactory.getParameter Setting socketTimeout to: 60000
[junit4:junit4]   2> 7136 T770 oashc.HttpShardHandlerFactory.getParameter Setting urlScheme to: http://
[junit4:junit4]   2> 7137 T770 oashc.HttpShardHandlerFactory.getParameter Setting connTimeout to: 15000
[junit4:junit4]   2> 7137 T770 oashc.HttpShardHandlerFactory.getParameter Setting maxConnectionsPerHost to: 20
[junit4:junit4]   2> 7138 T770 oashc.HttpShardHandlerFactory.getParameter Setting corePoolSize to: 0
[junit4:junit4]   2> 7138 T770 oashc.HttpShardHandlerFactory.getParameter Setting maximumPoolSize to: 2147483647
[junit4:junit4]   2> 7139 T770 oashc.HttpShardHandlerFactory.getParameter Setting maxThreadIdleTime to: 5
[junit4:junit4]   2> 7139 T770 oashc.HttpShardHandlerFactory.getParameter Setting sizeOfQueue to: -1
[junit4:junit4]   2> 7140 T770 oashc.HttpShardHandlerFactory.getParameter Setting fairnessPolicy to: false
[junit4:junit4]   2> 7140 T770 oascsi.HttpClientUtil.createClient Creating new http client, config:maxConnectionsPerHost=20&maxConnections=10000&socketTimeout=60000&connTimeout=15000&retry=false
[junit4:junit4]   2> 7167 T770 oasc.CoreContainer.load Registering Log Listener
[junit4:junit4]   2> 7192 T770 oasc.CoreContainer.initZooKeeper Zookeeper client=127.0.0.1:38382/solr
[junit4:junit4]   2> 7193 T770 oasc.ZkController.checkChrootPath zkHost includes chroot
[junit4:junit4]   2> 7193 T770 oaz.ZooKeeper.<init> Initiating client connection, connectString=127.0.0.1:38382 sessionTimeout=60000 watcher=org.apache.solr.common.cloud.ConnectionManager@69b1f287
[junit4:junit4]   2> 7194 T770 oascc.ConnectionManager.waitForConnected Waiting for client to connect to ZooKeeper
[junit4:junit4]   2> 7195 T823 oaz.ClientCnxn$SendThread.logStartConnect Opening socket connection to server localhost/127.0.0.1:38382. Will not attempt to authenticate using SASL (access denied ("javax.security.auth.AuthPermission" "getLoginConfiguration"))
[junit4:junit4]   2> 7196 T823 oaz.ClientCnxn$SendThread.primeConnection Socket connection established to localhost/127.0.0.1:38382, initiating session
[junit4:junit4]   2> 7196 T772 oazs.NIOServerCnxnFactory.run Accepted socket connection from /140.211.11.196:38461
[junit4:junit4]   2> 7196 T772 oazs.ZooKeeperServer.processConnectRequest Client attempting to establish new session at /140.211.11.196:38461
[junit4:junit4]   2> 7198 T774 oazs.ZooKeeperServer.finishSessionInit Established session 0x13cc9d1f1d80007 with negotiated timeout 20000 for client /140.211.11.196:38461
[junit4:junit4]   2> 7198 T823 oaz.ClientCnxn$SendThread.onConnected Session establishment complete on server localhost/127.0.0.1:38382, sessionid = 0x13cc9d1f1d80007, negotiated timeout = 20000
[junit4:junit4]   2> 7199 T824 oascc.ConnectionManager.process Watcher org.apache.solr.common.cloud.ConnectionManager@69b1f287 name:ZooKeeperConnection Watcher:127.0.0.1:38382 got event WatchedEvent state:SyncConnected type:None path:null path:null type:None
[junit4:junit4]   2> 7199 T770 oascc.ConnectionManager.waitForConnected Client is connected to ZooKeeper
[junit4:junit4]   2> 7202 T775 oazs.PrepRequestProcessor.pRequest2Txn Processed session termination for sessionid: 0x13cc9d1f1d80007
[junit4:junit4]   2> 7209 T824 oaz.ClientCnxn$EventThread.run EventThread shut down
[junit4:junit4]   2> 7209 T772 oazs.NIOServerCnxn.closeSock Closed socket connection for client /140.211.11.196:38461 which had sessionid 0x13cc9d1f1d80007
[junit4:junit4]   2> 7209 T770 oaz.ZooKeeper.close Session: 0x13cc9d1f1d80007 closed
[junit4:junit4]   2> 7210 T770 oascsi.HttpClientUtil.createClient Creating new http client, config:maxConnections=500&maxConnectionsPerHost=16&socketTimeout=60000&connTimeout=15000
[junit4:junit4]   2> 7226 T770 oaz.ZooKeeper.<init> Initiating client connection, connectString=127.0.0.1:38382/solr sessionTimeout=30000 watcher=org.apache.solr.common.cloud.ConnectionManager@7a2d0b77
[junit4:junit4]   2> 7227 T770 oascc.ConnectionManager.waitForConnected Waiting for client to connect to ZooKeeper
[junit4:junit4]   2> 7228 T825 oaz.ClientCnxn$SendThread.logStartConnect Opening socket connection to server localhost/127.0.0.1:38382. Will not attempt to authenticate using SASL (access denied ("javax.security.auth.AuthPermission" "getLoginConfiguration"))
[junit4:junit4]   2> 7228 T825 oaz.ClientCnxn$SendThread.primeConnection Socket connection established to localhost/127.0.0.1:38382, initiating session
[junit4:junit4]   2> 7229 T772 oazs.NIOServerCnxnFactory.run Accepted socket connection from /140.211.11.196:38464
[junit4:junit4]   2> 7229 T772 oazs.ZooKeeperServer.processConnectRequest Client attempting to establish new session at /140.211.11.196:38464
[junit4:junit4]   2> 7231 T774 oazs.ZooKeeperServer.finishSessionInit Established session 0x13cc9d1f1d80008 with negotiated timeout 20000 for client /140.211.11.196:38464
[junit4:junit4]   2> 7231 T825 oaz.ClientCnxn$SendThread.onConnected Session establishment complete on server localhost/127.0.0.1:38382, sessionid = 0x13cc9d1f1d80008, negotiated timeout = 20000
[junit4:junit4]   2> 7231 T826 oascc.ConnectionManager.process Watcher org.apache.solr.common.cloud.ConnectionManager@7a2d0b77 name:ZooKeeperConnection Watcher:127.0.0.1:38382/solr got event WatchedEvent state:SyncConnected type:None path:null path:null type:None
[junit4:junit4]   2> 7232 T770 oascc.ConnectionManager.waitForConnected Client is connected to ZooKeeper
[junit4:junit4]   2> 7233 T775 oazs.PrepRequestProcessor.pRequest Got user-level KeeperException when processing sessionid:0x13cc9d1f1d80008 type:create cxid:0x1 zxid:0x6c txntype:-1 reqpath:n/a Error Path:/solr/overseer Error:KeeperErrorCode = NodeExists for /solr/overseer
[junit4:junit4]   2> 7235 T775 oazs.PrepRequestProcessor.pRequest Got user-level KeeperException when processing sessionid:0x13cc9d1f1d80008 type:create cxid:0x2 zxid:0x6d txntype:-1 reqpath:n/a Error Path:/solr/overseer Error:KeeperErrorCode = NodeExists for /solr/overseer
[junit4:junit4]   2> 7244 T770 oascc.ZkStateReader.createClusterStateWatchersAndUpdate Updating cluster state from ZooKeeper... 
[junit4:junit4]   2> 7247 T770 oasc.ZkController.createEphemeralLiveNode Register node as live in ZooKeeper:/live_nodes/127.0.0.1:38453_ge_sm%2Fp
[junit4:junit4]   2> 7249 T775 oazs.PrepRequestProcessor.pRequest Got user-level KeeperException when processing sessionid:0x13cc9d1f1d80008 type:delete cxid:0x9 zxid:0x6e txntype:-1 reqpath:n/a Error Path:/solr/live_nodes/127.0.0.1:38453_ge_sm%2Fp Error:KeeperErrorCode = NoNode for /solr/live_nodes/127.0.0.1:38453_ge_sm%2Fp
[junit4:junit4]   2> 7250 T770 oascc.SolrZkClient.makePath makePath: /live_nodes/127.0.0.1:38453_ge_sm%2Fp
[junit4:junit4]   2> 7254 T798 oascc.ZkStateReader$2.process A cluster state change: WatchedEvent state:SyncConnected type:NodeChildrenChanged path:/live_nodes, has occurred - updating... (live nodes size: 2)
[junit4:junit4]   2> 7255 T811 oascc.ZkStateReader$3.process Updating live nodes... (3)
[junit4:junit4]   2> 7255 T826 oascc.ZkStateReader$3.process Updating live nodes... (3)
[junit4:junit4]   2> 7256 T811 oascc.ZkStateReader$2.process A cluster state change: WatchedEvent state:SyncConnected type:NodeChildrenChanged path:/live_nodes, has occurred - updating... (live nodes size: 3)
[junit4:junit4]   2> 7256 T792 oascc.ZkStateReader$3.process Updating live nodes... (3)
[junit4:junit4]   2> 7256 T792 oascc.ZkStateReader$2.process A cluster state change: WatchedEvent state:SyncConnected type:NodeChildrenChanged path:/live_nodes, has occurred - updating... (live nodes size: 3)
[junit4:junit4]   2> 7257 T798 oascc.ZkStateReader$3.process Updating live nodes... (3)
[junit4:junit4]   2> 7269 T827 oasc.CoreContainer.create Creating SolrCore 'collection1' using instanceDir: /usr/home/hudson/hudson-slave/workspace/Lucene-Solr-Tests-4.x-java7/solr/build/solr-core/test/J0/./org.apache.solr.cloud.SyncSliceTest-jetty2-1360595651743/collection1
[junit4:junit4]   2> 7270 T827 oasc.ZkController.createCollectionZkNode Check for collection zkNode:collection1
[junit4:junit4]   2> 7271 T827 oasc.ZkController.createCollectionZkNode Collection zkNode exists
[junit4:junit4]   2> 7272 T827 oasc.ZkController.readConfigName Load collection config from:/collections/collection1
[junit4:junit4]   2> 7274 T827 oasc.SolrResourceLoader.<init> new SolrResourceLoader for directory: '/usr/home/hudson/hudson-slave/workspace/Lucene-Solr-Tests-4.x-java7/solr/build/solr-core/test/J0/./org.apache.solr.cloud.SyncSliceTest-jetty2-1360595651743/collection1/'
[junit4:junit4]   2> 7276 T827 oasc.SolrResourceLoader.replaceClassLoader Adding 'file:/usr/home/hudson/hudson-slave/workspace/Lucene-Solr-Tests-4.x-java7/solr/build/solr-core/test/J0/org.apache.solr.cloud.SyncSliceTest-jetty2-1360595651743/collection1/lib/README' to classloader
[junit4:junit4]   2> 7276 T827 oasc.SolrResourceLoader.replaceClassLoader Adding 'file:/usr/home/hudson/hudson-slave/workspace/Lucene-Solr-Tests-4.x-java7/solr/build/solr-core/test/J0/org.apache.solr.cloud.SyncSliceTest-jetty2-1360595651743/collection1/lib/classes/' to classloader
[junit4:junit4]   2> 7346 T827 oasc.SolrConfig.<init> Using Lucene MatchVersion: LUCENE_42
[junit4:junit4]   2> 7450 T827 oasc.SolrConfig.<init> Loaded SolrConfig: solrconfig.xml
[junit4:junit4]   2> 7552 T827 oass.IndexSchema.readSchema Reading Solr Schema
[junit4:junit4]   2> 7562 T827 oass.IndexSchema.readSchema Schema name=test
[junit4:junit4]   2> 8297 T827 oass.OpenExchangeRatesOrgProvider.init Initialized with rates=open-exchange-rates.json, refreshInterval=1440.
[junit4:junit4]   2> 8308 T827 oass.IndexSchema.readSchema default search field in schema is text
[junit4:junit4]   2> 8312 T827 oass.IndexSchema.readSchema unique key field: id
[junit4:junit4]   2> 8335 T827 oass.FileExchangeRateProvider.reload Reloading exchange rates from file currency.xml
[junit4:junit4]   2> 8335 T793 oascc.ZkStateReader.updateClusterState Updating cloud state from ZooKeeper... 
[junit4:junit4]   2> 8337 T793 oasc.Overseer$ClusterStateUpdater.updateState Update state numShards=1 message={
[junit4:junit4]   2> 	  "operation":"state",
[junit4:junit4]   2> 	  "numShards":"1",
[junit4:junit4]   2> 	  "shard":"shard1",
[junit4:junit4]   2> 	  "roles":null,
[junit4:junit4]   2> 	  "state":"active",
[junit4:junit4]   2> 	  "core":"collection1",
[junit4:junit4]   2> 	  "collection":"collection1",
[junit4:junit4]   2> 	  "node_name":"127.0.0.1:38389_ge_sm%2Fp",
[junit4:junit4]   2> 	  "base_url":"http://127.0.0.1:38389/ge_sm/p"}
[junit4:junit4]   2> 8342 T827 oass.FileExchangeRateProvider.reload Reloading exchange rates from file currency.xml
[junit4:junit4]   2> 8348 T827 oass.OpenExchangeRatesOrgProvider.reload Reloading exchange rates from open-exchange-rates.json
[junit4:junit4]   2> 8367 T826 oascc.ZkStateReader$2.process A cluster state change: WatchedEvent state:SyncConnected type:NodeDataChanged path:/clusterstate.json, has occurred - updating... (live nodes size: 3)
[junit4:junit4]   2> 8367 T811 oascc.ZkStateReader$2.process A cluster state change: WatchedEvent state:SyncConnected type:NodeDataChanged path:/clusterstate.json, has occurred - updating... (live nodes size: 3)
[junit4:junit4]   2> 8367 T798 oascc.ZkStateReader$2.process A cluster state change: WatchedEvent state:SyncConnected type:NodeDataChanged path:/clusterstate.json, has occurred - updating... (live nodes size: 3)
[junit4:junit4]   2> 8367 T792 oascc.ZkStateReader$2.process A cluster state change: WatchedEvent state:SyncConnected type:NodeDataChanged path:/clusterstate.json, has occurred - updating... (live nodes size: 3)
[junit4:junit4]   2> 8369 T827 oass.OpenExchangeRatesOrgProvider.reload Reloading exchange rates from open-exchange-rates.json
[junit4:junit4]   2> 8371 T827 oasc.SolrCore.<init> [collection1] Opening new SolrCore at /usr/home/hudson/hudson-slave/workspace/Lucene-Solr-Tests-4.x-java7/solr/build/solr-core/test/J0/./org.apache.solr.cloud.SyncSliceTest-jetty2-1360595651743/collection1/, dataDir=./org.apache.solr.cloud.SyncSliceTest-1360595644881/jetty2/
[junit4:junit4]   2> 8372 T827 oasc.JmxMonitoredMap.<init> JMX monitoring is enabled. Adding Solr mbeans to JMX Server: com.sun.jmx.mbeanserver.JmxMBeanServer@4cd1063b
[junit4:junit4]   2> 8372 T827 oasc.SolrCore.initDirectoryFactory solr.NRTCachingDirectoryFactory
[junit4:junit4]   2> 8373 T827 oasc.CachingDirectoryFactory.get return new directory for /usr/home/hudson/hudson-slave/workspace/Lucene-Solr-Tests-4.x-java7/solr/build/solr-core/test/J0/./org.apache.solr.cloud.SyncSliceTest-1360595644881/jetty2 forceNew:false
[junit4:junit4]   2> 8374 T827 oasc.CachingDirectoryFactory.close Releasing directory:/usr/home/hudson/hudson-slave/workspace/Lucene-Solr-Tests-4.x-java7/solr/build/solr-core/test/J0/./org.apache.solr.cloud.SyncSliceTest-1360595644881/jetty2
[junit4:junit4]   2> 8374 T827 oasc.SolrCore.getNewIndexDir New index directory detected: old=null new=./org.apache.solr.cloud.SyncSliceTest-1360595644881/jetty2/index/
[junit4:junit4]   2> 8375 T827 oasc.SolrCore.initIndex WARNING [collection1] Solr index directory './org.apache.solr.cloud.SyncSliceTest-1360595644881/jetty2/index' doesn't exist. Creating new index...
[junit4:junit4]   2> 8376 T827 oasc.CachingDirectoryFactory.get return new directory for /usr/home/hudson/hudson-slave/workspace/Lucene-Solr-Tests-4.x-java7/solr/build/solr-core/test/J0/./org.apache.solr.cloud.SyncSliceTest-1360595644881/jetty2/index forceNew:false
[junit4:junit4]   2> 8413 T827 oasc.SolrDeletionPolicy.onCommit SolrDeletionPolicy.onCommit: commits:num=1
[junit4:junit4]   2> 		commit{dir=RateLimitedDirectoryWrapper(NRTCachingDirectory(org.apache.lucene.store.NIOFSDirectory@/usr/home/hudson/hudson-slave/workspace/Lucene-Solr-Tests-4.x-java7/solr/build/solr-core/test/J0/org.apache.solr.cloud.SyncSliceTest-1360595644881/jetty2/index lockFactory=org.apache.lucene.store.NativeFSLockFactory@37366cdd; maxCacheMB=48.0 maxMergeSizeMB=4.0)),segFN=segments_1,generation=1,filenames=[segments_1]
[junit4:junit4]   2> 8413 T827 oasc.SolrDeletionPolicy.updateCommits newest commit = 1[segments_1]
[junit4:junit4]   2> 8414 T827 oasc.CachingDirectoryFactory.close Releasing directory:/usr/home/hudson/hudson-slave/workspace/Lucene-Solr-Tests-4.x-java7/solr/build/solr-core/test/J0/./org.apache.solr.cloud.SyncSliceTest-1360595644881/jetty2/index
[junit4:junit4]   2> 8415 T827 oasc.SolrCore.initWriters created xml: solr.XMLResponseWriter
[junit4:junit4]   2> 8417 T827 oasup.UpdateRequestProcessorChain.init inserting DistributedUpdateProcessorFactory into updateRequestProcessorChain "dedupe"
[junit4:junit4]   2> 8417 T827 oasup.UpdateRequestProcessorChain.init inserting DistributedUpdateProcessorFactory into updateRequestProcessorChain "dedupe-allfields"
[junit4:junit4]   2> 8418 T827 oasup.UpdateRequestProcessorChain.init inserting DistributedUpdateProcessorFactory into updateRequestProcessorChain "stored_sig"
[junit4:junit4]   2> 8418 T827 oasup.UpdateRequestProcessorChain.init inserting DistributedUpdateProcessorFactory into updateRequestProcessorChain "uniq-fields"
[junit4:junit4]   2> 8419 T827 oasup.UpdateRequestProcessorChain.init inserting DistributedUpdateProcessorFactory into updateRequestProcessorChain "distrib-dup-test-chain-implicit"
[junit4:junit4]   2> 8419 T827 oasc.RequestHandlers.initHandlersFromConfig adding lazy requestHandler: solr.ReplicationHandler
[junit4:junit4]   2> 8420 T827 oasc.RequestHandlers.initHandlersFromConfig created /replication: solr.ReplicationHandler
[junit4:junit4]   2> 8420 T827 oasc.RequestHandlers.initHandlersFromConfig created standard: solr.StandardRequestHandler
[junit4:junit4]   2> 8421 T827 oasc.RequestHandlers.initHandlersFromConfig created /get: solr.RealTimeGetHandler
[junit4:junit4]   2> 8421 T827 oasc.RequestHandlers.initHandlersFromConfig created dismax: solr.SearchHandler
[junit4:junit4]   2> 8422 T827 oasc.RequestHandlers.initHandlersFromConfig created mock: org.apache.solr.core.MockQuerySenderListenerReqHandler
[junit4:junit4]   2> 8422 T827 oasc.RequestHandlers.initHandlersFromConfig created /admin/: org.apache.solr.handler.admin.AdminHandlers
[junit4:junit4]   2> 8423 T827 oasc.RequestHandlers.initHandlersFromConfig created defaults: solr.StandardRequestHandler
[junit4:junit4]   2> 8423 T827 oasc.RequestHandlers.initHandlersFromConfig adding lazy requestHandler: solr.StandardRequestHandler
[junit4:junit4]   2> 8424 T827 oasc.RequestHandlers.initHandlersFromConfig created lazy: solr.StandardRequestHandler
[junit4:junit4]   2> 8424 T827 oasc.RequestHandlers.initHandlersFromConfig created /update: solr.UpdateRequestHandler
[junit4:junit4]   2> 8425 T827 oasc.RequestHandlers.initHandlersFromConfig created /terms: org.apache.solr.handler.component.SearchHandler
[junit4:junit4]   2> 8425 T827 oasc.RequestHandlers.initHandlersFromConfig created spellCheckCompRH: org.apache.solr.handler.component.SearchHandler
[junit4:junit4]   2> 8426 T827 oasc.RequestHandlers.initHandlersFromConfig created spellCheckCompRH_Direct: org.apache.solr.handler.component.SearchHandler
[junit4:junit4]   2> 8427 T827 oasc.RequestHandlers.initHandlersFromConfig created spellCheckWithWordbreak: org.apache.solr.handler.component.SearchHandler
[junit4:junit4]   2> 8427 T827 oasc.RequestHandlers.initHandlersFromConfig created spellCheckWithWordbreak_Direct: org.apache.solr.handler.component.SearchHandler
[junit4:junit4]   2> 8428 T827 oasc.RequestHandlers.initHandlersFromConfig created spellCheckCompRH1: org.apache.solr.handler.component.SearchHandler
[junit4:junit4]   2> 8428 T827 oasc.RequestHandlers.initHandlersFromConfig created mltrh: org.apache.solr.handler.component.SearchHandler
[junit4:junit4]   2> 8429 T827 oasc.RequestHandlers.initHandlersFromConfig created tvrh: org.apache.solr.handler.component.SearchHandler
[junit4:junit4]   2> 8429 T827 oasc.RequestHandlers.initHandlersFromConfig created /mlt: solr.MoreLikeThisHandler
[junit4:junit4]   2> 8430 T827 oasc.RequestHandlers.initHandlersFromConfig created /debug/dump: solr.DumpRequestHandler
[junit4:junit4]   2> 8443 T827 oashl.XMLLoader.init xsltCacheLifetimeSeconds=60
[junit4:junit4]   2> 8447 T827 oasc.SolrCore.initDeprecatedSupport WARNING solrconfig.xml uses deprecated <admin/gettableFiles>, Please update your config to use the ShowFileRequestHandler.
[junit4:junit4]   2> 8449 T827 oasc.SolrCore.initDeprecatedSupport WARNING adding ShowFileRequestHandler with hidden files: [SCHEMA.XML, OLD_SYNONYMS.TXT, STOPWORDS.TXT, PROTWORDS.TXT, OPEN-EXCHANGE-RATES.JSON, SYNONYMS.TXT, CURRENCY.XML, MAPPING-ISOLATIN1ACCENT.TXT]
[junit4:junit4]   2> 8452 T827 oasc.CachingDirectoryFactory.close Releasing directory:/usr/home/hudson/hudson-slave/workspace/Lucene-Solr-Tests-4.x-java7/solr/build/solr-core/test/J0/./org.apache.solr.cloud.SyncSliceTest-1360595644881/jetty2
[junit4:junit4]   2> 8453 T827 oass.SolrIndexSearcher.<init> Opening Searcher@4abfbc50 main
[junit4:junit4]   2> 8454 T827 oasu.CommitTracker.<init> Hard AutoCommit: disabled
[junit4:junit4]   2> 8455 T827 oasu.CommitTracker.<init> Soft AutoCommit: disabled
[junit4:junit4]   2> 8455 T827 oashc.SpellCheckComponent.inform Initializing spell checkers
[junit4:junit4]   2> 8490 T827 oass.DirectSolrSpellChecker.init init: {name=direct,classname=DirectSolrSpellChecker,field=lowerfilt,minQueryLength=3}
[junit4:junit4]   2> 8827 T828 oasc.SolrCore.registerSearcher [collection1] Registered new searcher Searcher@4abfbc50 main{StandardDirectoryReader(segments_1:1)}
[junit4:junit4]   2> 8834 T827 oasc.ZkController.publish publishing core=collection1 state=down
[junit4:junit4]   2> 8835 T827 oasc.ZkController.publish numShards not found on descriptor - reading it from system property
[junit4:junit4]   2> 9875 T793 oascc.ZkStateReader.updateClusterState Updating cloud state from ZooKeeper... 
[junit4:junit4]   2> 9876 T793 oasc.Overseer$ClusterStateUpdater.updateState Update state numShards=1 message={
[junit4:junit4]   2> 	  "operation":"state",
[junit4:junit4]   2> 	  "numShards":"1",
[junit4:junit4]   2> 	  "shard":null,
[junit4:junit4]   2> 	  "roles":null,
[junit4:junit4]   2> 	  "state":"down",
[junit4:junit4]   2> 	  "core":"collection1",
[junit4:junit4]   2> 	  "collection":"collection1",
[junit4:junit4]   2> 	  "node_name":"127.0.0.1:38453_ge_sm%2Fp",
[junit4:junit4]   2> 	  "base_url":"http://127.0.0.1:38453/ge_sm/p"}
[junit4:junit4]   2> 9876 T793 oasc.Overseer$ClusterStateUpdater.updateState Collection already exists with numShards=1
[junit4:junit4]   2> 9876 T793 oasc.Overseer$ClusterStateUpdater.updateState Assigning new node to shard shard=shard1
[junit4:junit4]   2> 9882 T826 oascc.ZkStateReader$2.process A cluster state change: WatchedEvent state:SyncConnected type:NodeDataChanged path:/clusterstate.json, has occurred - updating... (live nodes size: 3)
[junit4:junit4]   2> 9882 T811 oascc.ZkStateReader$2.process A cluster state change: WatchedEvent state:SyncConnected type:NodeDataChanged path:/clusterstate.json, has occurred - updating... (live nodes size: 3)
[junit4:junit4]   2> 9883 T798 oascc.ZkStateReader$2.process A cluster state change: WatchedEvent state:SyncConnected type:NodeDataChanged path:/clusterstate.json, has occurred - updating... (live nodes size: 3)
[junit4:junit4]   2> 9882 T792 oascc.ZkStateReader$2.process A cluster state change: WatchedEvent state:SyncConnected type:NodeDataChanged path:/clusterstate.json, has occurred - updating... (live nodes size: 3)
[junit4:junit4]   2> 10840 T827 oasc.CoreContainer.registerCore registering core: collection1
[junit4:junit4]   2> 10840 T827 oasc.ZkController.register Register replica - core:collection1 address:http://127.0.0.1:38453/ge_sm/p collection:collection1 shard:shard1
[junit4:junit4]   2> 10847 T827 oasc.ZkController.register We are http://127.0.0.1:38453/ge_sm/p/collection1/ and leader is http://127.0.0.1:38389/ge_sm/p/collection1/
[junit4:junit4]   2> 10848 T827 oasc.ZkController.register No LogReplay needed for core=collection1 baseURL=http://127.0.0.1:38453/ge_sm/p
[junit4:junit4]   2> 10848 T827 oasc.ZkController.checkRecovery Core needs to recover:collection1
[junit4:junit4]   2> 10849 T827 oasu.DefaultSolrCoreState.doRecovery Running recovery - first canceling any ongoing recovery
[junit4:junit4]   2> ASYNC  NEW_CORE C45 name=collection1 org.apache.solr.core.SolrCore@30125293 url=http://127.0.0.1:38453/ge_sm/p/collection1 node=127.0.0.1:38453_ge_sm%2Fp C45_STATE=coll:collection1 core:collection1 props:{shard=null, roles=null, state=down, core=collection1, collection=collection1, node_name=127.0.0.1:38453_ge_sm%2Fp, base_url=http://127.0.0.1:38453/ge_sm/p}
[junit4:junit4]   2> 10860 T829 C45 P38453 oasc.RecoveryStrategy.run Starting recovery process.  core=collection1 recoveringAfterStartup=true
[junit4:junit4]   2> 10861 T829 C45 P38453 oasc.RecoveryStrategy.doRecovery ###### startupVersions=[]
[junit4:junit4]   2> 10861 T827 oascc.ZkStateReader.updateClusterState Updating cloud state from ZooKeeper... 
[junit4:junit4]   2> 10861 T829 C45 P38453 oasc.ZkController.publish publishing core=collection1 state=recovering
[junit4:junit4]   2> 10861 T829 C45 P38453 oasc.ZkController.publish numShards not found on descriptor - reading it from system property
[junit4:junit4]   2> 10862 T770 oass.SolrDispatchFilter.init user.dir=/usr/home/hudson/hudson-slave/workspace/Lucene-Solr-Tests-4.x-java7/solr/build/solr-core/test/J0
[junit4:junit4]   2> 10863 T829 C45 P38453 oascsi.HttpClientUtil.createClient Creating new http client, config:maxConnections=128&maxConnectionsPerHost=32&followRedirects=false
[junit4:junit4]   2> 10863 T770 oass.SolrDispatchFilter.init SolrDispatchFilter.init() done
[junit4:junit4]   2> 10864 T770 oascsi.HttpClientUtil.createClient Creating new http client, config:maxConnections=128&maxConnectionsPerHost=32&followRedirects=false
[junit4:junit4]   2> 11095 T770 oejs.Server.doStart jetty-8.1.8.v20121106
[junit4:junit4]   2> 11098 T770 oejs.AbstractConnector.doStart Started SocketConnector@127.0.0.1:38476
[junit4:junit4]   2> 11099 T770 oass.SolrDispatchFilter.init SolrDispatchFilter.init()
[junit4:junit4]   2> 11100 T770 oasc.SolrResourceLoader.locateSolrHome JNDI not configured for solr (NoInitialContextEx)
[junit4:junit4]   2> 11100 T770 oasc.SolrResourceLoader.locateSolrHome using system property solr.solr.home: /usr/home/hudson/hudson-slave/workspace/Lucene-Solr-Tests-4.x-java7/solr/build/solr-core/test/J0/./org.apache.solr.cloud.SyncSliceTest-jetty3-1360595655763
[junit4:junit4]   2> 11101 T770 oasc.CoreContainer$Initializer.initialize looking for solr.xml: /usr/home/hudson/hudson-slave/workspace/Lucene-Solr-Tests-4.x-java7/solr/build/solr-core/test/J0/./org.apache.solr.cloud.SyncSliceTest-jetty3-1360595655763/solr.xml
[junit4:junit4]   2> 11101 T770 oasc.CoreContainer.<init> New CoreContainer 534099861
[junit4:junit4]   2> 11102 T770 oasc.CoreContainer.load Loading CoreContainer using Solr Home: '/usr/home/hudson/hudson-slave/workspace/Lucene-Solr-Tests-4.x-java7/solr/build/solr-core/test/J0/./org.apache.solr.cloud.SyncSliceTest-jetty3-1360595655763/'
[junit4:junit4]   2> 11102 T770 oasc.SolrResourceLoader.<init> new SolrResourceLoader for directory: '/usr/home/hudson/hudson-slave/workspace/Lucene-Solr-Tests-4.x-java7/solr/build/solr-core/test/J0/./org.apache.solr.cloud.SyncSliceTest-jetty3-1360595655763/'
[junit4:junit4]   2> 11168 T770 oashc.HttpShardHandlerFactory.getParameter Setting socketTimeout to: 60000
[junit4:junit4]   2> 11169 T770 oashc.HttpShardHandlerFactory.getParameter Setting urlScheme to: http://
[junit4:junit4]   2> 11169 T770 oashc.HttpShardHandlerFactory.getParameter Setting connTimeout to: 15000
[junit4:junit4]   2> 11170 T770 oashc.HttpShardHandlerFactory.getParameter Setting maxConnectionsPerHost to: 20
[junit4:junit4]   2> 11170 T770 oashc.HttpShardHandlerFactory.getParameter Setting corePoolSize to: 0
[junit4:junit4]   2> 11171 T770 oashc.HttpShardHandlerFactory.getParameter Setting maximumPoolSize to: 2147483647
[junit4:junit4]   2> 11172 T770 oashc.HttpShardHandlerFactory.getParameter Setting maxThreadIdleTime to: 5
[junit4:junit4]   2> 11172 T770 oashc.HttpShardHandlerFactory.getParameter Setting sizeOfQueue to: -1
[junit4:junit4]   2> 11173 T770 oashc.HttpShardHandlerFactory.getParameter Setting fairnessPolicy to: false
[junit4:junit4]   2> 11173 T770 oascsi.HttpClientUtil.createClient Creating new http client, config:maxConnectionsPerHost=20&maxConnections=10000&socketTimeout=60000&connTimeout=15000&retry=false
[junit4:junit4]   2> 11197 T770 oasc.CoreContainer.load Registering Log Listener
[junit4:junit4]   2> 11221 T770 oasc.CoreContainer.initZooKeeper Zookeeper client=127.0.0.1:38382/solr
[junit4:junit4]   2> 11221 T770 oasc.ZkController.checkChrootPath zkHost includes chroot
[junit4:junit4]   2> 11222 T770 oaz.ZooKeeper.<init> Initiating client connection, connectString=127.0.0.1:38382 sessionTimeout=60000 watcher=org.apache.solr.common.cloud.ConnectionManager@17b8c2d5
[junit4:junit4]   2> 11223 T770 oascc.ConnectionManager.waitForConnected Waiting for client to connect to ZooKeeper
[junit4:junit4]   2> 11224 T839 oaz.ClientCnxn$SendThread.logStartConnect Opening socket connection to server localhost/127.0.0.1:38382. Will not attempt to authenticate using SASL (access denied ("javax.security.auth.AuthPermission" "getLoginConfiguration"))
[junit4:junit4]   2> 11225 T839 oaz.ClientCnxn$SendThread.primeConnection Socket connection established to localhost/127.0.0.1:38382, initiating session
[junit4:junit4]   2> 11225 T772 oazs.NIOServerCnxnFactory.run Accepted socket connection from /140.211.11.196:38477
[junit4:junit4]   2> 11225 T772 oazs.ZooKeeperServer.processConnectRequest Client attempting to establish new session at /140.211.11.196:38477
[junit4:junit4]   2> 11227 T774 oazs.ZooKeeperServer.finishSessionInit Established session 0x13cc9d1f1d80009 with negotiated timeout 20000 for client /140.211.11.196:38477
[junit4:junit4]   2> 11227 T839 oaz.ClientCnxn$SendThread.onConnected Session establishment complete on server localhost/127.0.0.1:38382, sessionid = 0x13cc9d1f1d80009, negotiated timeout = 20000
[junit4:junit4]   2> 11228 T840 oascc.ConnectionManager.process Watcher org.apache.solr.common.cloud.ConnectionManager@17b8c2d5 name:ZooKeeperConnection Watcher:127.0.0.1:38382 got event WatchedEvent state:SyncConnected type:None path:null path:null type:None
[junit4:junit4]   2> 11228 T770 oascc.ConnectionManager.waitForConnected Client is connected to ZooKeeper
[junit4:junit4]   2> 11231 T775 oazs.PrepRequestProcessor.pRequest2Txn Processed session termination for sessionid: 0x13cc9d1f1d80009
[junit4:junit4]   2> 11237 T840 oaz.ClientCnxn$EventThread.run EventThread shut down
[junit4:junit4]   2> 11237 T772 oazs.NIOServerCnxn.closeSock Closed socket connection for client /140.211.11.196:38477 which had sessionid 0x13cc9d1f1d80009
[junit4:junit4]   2> 11237 T770 oaz.ZooKeeper.close Session: 0x13cc9d1f1d80009 closed
[junit4:junit4]   2> 11239 T770 oascsi.HttpClientUtil.createClient Creating new http client, config:maxConnections=500&maxConnectionsPerHost=16&socketTimeout=60000&connTimeout=15000
[junit4:junit4]   2> 11254 T770 oaz.ZooKeeper.<init> Initiating client connection, connectString=127.0.0.1:38382/solr sessionTimeout=30000 watcher=org.apache.solr.common.cloud.ConnectionManager@37b047d3
[junit4:junit4]   2> 11255 T770 oascc.ConnectionManager.waitForConnected Waiting for client to connect to ZooKeeper
[junit4:junit4]   2> 11256 T841 oaz.ClientCnxn$SendThread.logStartConnect Opening socket connection to server localhost/127.0.0.1:38382. Will not attempt to authenticate using SASL (access denied ("javax.security.auth.AuthPermission" "getLoginConfiguration"))
[junit4:junit4]   2> 11257 T841 oaz.ClientCnxn$SendThread.primeConnection Socket connection established to localhost/127.0.0.1:38382, initiating session
[junit4:junit4]   2> 11257 T772 oazs.NIOServerCnxnFactory.run Accepted socket connection from /140.211.11.196:38478
[junit4:junit4]   2> 11258 T772 oazs.ZooKeeperServer.processConnectRequest Client attempting to establish new session at /140.211.11.196:38478
[junit4:junit4]   2> 11259 T774 oazs.ZooKeeperServer.finishSessionInit Established session 0x13cc9d1f1d8000a with negotiated timeout 20000 for client /140.211.11.196:38478
[junit4:junit4]   2> 11259 T841 oaz.ClientCnxn$SendThread.onConnected Session establishment complete on server localhost/127.0.0.1:38382, sessionid = 0x13cc9d1f1d8000a, negotiated timeout = 20000
[junit4:junit4]   2> 11259 T842 oascc.ConnectionManager.process Watcher org.apache.solr.common.cloud.ConnectionManager@37b047d3 name:ZooKeeperConnection Watcher:127.0.0.1:38382/solr got event WatchedEvent state:SyncConnected type:None path:null path:null type:None
[junit4:junit4]   2> 11260 T770 oascc.ConnectionManager.waitForConnected Client is connected to ZooKeeper
[junit4:junit4]   2> 11262 T775 oazs.PrepRequestProcessor.pRequest Got user-level KeeperException when processing sessionid:0x13cc9d1f1d8000a type:create cxid:0x1 zxid:0x7f txntype:-1 reqpath:n/a Error Path:/solr/overseer Error:KeeperErrorCode = NodeExists for /solr/overseer
[junit4:junit4]   2> 11268 T775 oazs.PrepRequestProcessor.pRequest Got user-level KeeperException when processing sessionid:0x13cc9d1f1d8000a type:create cxid:0x2 zxid:0x80 txntype:-1 reqpath:n/a Error Path:/solr/overseer Error:KeeperErrorCode = NodeExists for /solr/overseer
[junit4:junit4]   2> 11271 T770 oascc.ZkStateReader.createClusterStateWatchersAndUpdate Updating cluster state from ZooKeeper... 
[junit4:junit4]   2> 11278 T770 oasc.ZkController.createEphemeralLiveNode Register node as live in ZooKeeper:/live_nodes/127.0.0.1:38476_ge_sm%2Fp
[junit4:junit4]   2> 11279 T775 oazs.PrepRequestProcessor.pRequest Got user-level KeeperException when processing sessionid:0x13cc9d1f1d8000a type:delete cxid:0x9 zxid:0x81 txntype:-1 reqpath:n/a Error Path:/solr/live_nodes/127.0.0.1:38476_ge_sm%2Fp Error:KeeperErrorCode = NoNode for /solr/live_nodes/127.0.0.1:38476_ge_sm%2Fp
[junit4:junit4]   2> 11280 T770 oascc.SolrZkClient.makePath makePath: /live_nodes/127.0.0.1:38476_ge_sm%2Fp
[junit4:junit4]   2> 11284 T826 oascc.ZkStateReader$2.process A cluster state change: WatchedEvent state:SyncConnected type:NodeChildrenChanged path:/live_nodes, has occurred - updating... (live nodes size: 3)
[junit4:junit4]   2> 11285 T798 oascc.ZkStateReader$2.process A cluster state change: WatchedEvent state:SyncConnected type:NodeChildrenChanged path:/live_nodes, has occurred - updating... (live nodes size: 3)
[junit4:junit4]   2> 11285 T811 oascc.ZkStateReader$3.process Updating live nodes... (4)
[junit4:junit4]   2> 11285 T842 oascc.ZkStateReader$3.process Updating live nodes... (4)
[junit4:junit4]   2> 11286 T811 oascc.ZkStateReader$2.process A cluster state change: WatchedEvent state:SyncConnected type:NodeChildrenChanged path:/live_nodes, has occurred - updating... (live nodes size: 4)
[junit4:junit4]   2> 11286 T792 oascc.ZkStateReader$3.process Updating live nodes... (4)
[junit4:junit4]   2> 11286 T792 oascc.ZkStateReader$2.process A cluster state change: WatchedEvent state:SyncConnected type:NodeChildrenChanged path:/live_nodes, has occurred - updating... (live nodes size: 4)
[junit4:junit4]   2> 11289 T826 oascc.ZkStateReader$3.process Updating live nodes... (4)
[junit4:junit4]   2> 11290 T798 oascc.ZkStateReader$3.process Updating live nodes... (4)
[junit4:junit4]   2> 11300 T843 oasc.CoreContainer.create Creating SolrCore 'collection1' using instanceDir: /usr/home/hudson/hudson-slave/workspace/Lucene-Solr-Tests-4.x-java7/solr/build/solr-core/test/J0/./org.apache.solr.cloud.SyncSliceTest-jetty3-1360595655763/collection1
[junit4:junit4]   2> 11301 T843 oasc.ZkController.createCollectionZkNode Check for collection zkNode:collection1
[junit4:junit4]   2> 11302 T843 oasc.ZkController.createCollectionZkNode Collection zkNode exists
[junit4:junit4]   2> 11303 T843 oasc.ZkController.readConfigName Load collection config from:/collections/collection1
[junit4:junit4]   2> 11306 T843 oasc.SolrResourceLoader.<init> new SolrResourceLoader for directory: '/usr/home/hudson/hudson-slave/workspace/Lucene-Solr-Tests-4.x-java7/solr/build/solr-core/test/J0/./org.apache.solr.cloud.SyncSliceTest-jetty3-1360595655763/collection1/'
[junit4:junit4]   2> 11307 T843 oasc.SolrResourceLoader.replaceClassLoader Adding 'file:/usr/home/hudson/hudson-slave/workspace/Lucene-Solr-Tests-4.x-java7/solr/build/solr-core/test/J0/org.apache.solr.cloud.SyncSliceTest-jetty3-1360595655763/collection1/lib/classes/' to classloader
[junit4:junit4]   2> 11308 T843 oasc.SolrResourceLoader.replaceClassLoader Adding 'file:/usr/home/hudson/hudson-slave/workspace/Lucene-Solr-Tests-4.x-java7/solr/build/solr-core/test/J0/org.apache.solr.cloud.SyncSliceTest-jetty3-1360595655763/collection1/lib/README' to classloader
[junit4:junit4]   2> 11381 T843 oasc.SolrConfig.<init> Using Lucene MatchVersion: LUCENE_42
[junit4:junit4]   2> 11392 T793 oascc.ZkStateReader.updateClusterState Updating cloud state from ZooKeeper... 
[junit4:junit4]   2> 11393 T793 oasc.Overseer$ClusterStateUpdater.updateState Update state numShards=1 message={
[junit4:junit4]   2> 	  "operation":"state",
[junit4:junit4]   2> 	  "numShards":"1",
[junit4:junit4]   2> 	  "shard":"shard1",
[junit4:junit4]   2> 	  "roles":null,
[junit4:junit4]   2> 	  "state":"recovering",
[junit4:junit4]   2> 	  "core":"collection1",
[junit4:junit4]   2> 	  "collection":"collection1",
[junit4:junit4]   2> 	  "node_name":"127.0.0.1:38453_ge_sm%2Fp",
[junit4:junit4]   2> 	  "base_url":"http://127.0.0.1:38453/ge_sm/p"}
[junit4:junit4]   2> 11404 T826 oascc.ZkStateReader$2.process A cluster state change: WatchedEvent state:SyncConnected type:NodeDataChanged path:/clusterstate.json, has occurred - updating... (live nodes size: 4)
[junit4:junit4]   2> 11404 T798 oascc.ZkStateReader$2.process A cluster state change: WatchedEvent state:SyncConnected type:NodeDataChanged path:/clusterstate.json, has occurred - updating... (live nodes size: 4)
[junit4:junit4]   2> 11404 T792 oascc.ZkStateReader$2.process A cluster state change: WatchedEvent state:SyncConnected type:NodeDataChanged path:/clusterstate.json, has occurred - updating... (live nodes size: 4)
[junit4:junit4]   2> 11404 T842 oascc.ZkStateReader$2.process A cluster state change: WatchedEvent state:SyncConnected type:NodeDataChanged path:/clusterstate.json, has occurred - updating... (live nodes size: 4)
[junit4:junit4]   2> 11404 T811 oascc.ZkStateReader$2.process A cluster state change: WatchedEvent state:SyncConnected type:NodeDataChanged path:/clusterstate.json, has occurred - updating... (live nodes size: 4)
[junit4:junit4]   2> 11485 T843 oasc.SolrConfig.<init> Loaded SolrConfig: solrconfig.xml
[junit4:junit4]   2> 11587 T843 oass.IndexSchema.readSchema Reading Solr Schema
[junit4:junit4]   2> 11598 T843 oass.IndexSchema.readSchema Schema name=test
[junit4:junit4]   2> 12243 T843 oass.OpenExchangeRatesOrgProvider.init Initialized with rates=open-exchange-rates.json, refreshInterval=1440.
[junit4:junit4]   2> 12253 T843 oass.IndexSchema.readSchema default search field in schema is text
[junit4:junit4]   2> 12257 T843 oass.IndexSchema.readSchema unique key field: id
[junit4:junit4]   2> 12277 T843 oass.FileExchangeRateProvider.reload Reloading exchange rates from file currency.xml
[junit4:junit4]   2> 12283 T843 oass.FileExchangeRateProvider.reload Reloading exchange rates from file currency.xml
[junit4:junit4]   2> 12288 T843 oass.OpenExchangeRatesOrgProvider.reload Reloading exchange rates from open-exchange-rates.json
[junit4:junit4]   2> 12289 T843 oass.OpenExchangeRatesOrgProvider.reload Reloading exchange rates from open-exchange-rates.json
[junit4:junit4]   2> 12291 T843 oasc.SolrCore.<init> [collection1] Opening new SolrCore at /usr/home/hudson/hudson-slave/workspace/Lucene-Solr-Tests-4.x-java7/solr/build/solr-core/test/J0/./org.apache.solr.cloud.SyncSliceTest-jetty3-1360595655763/collection1/, dataDir=./org.apache.solr.cloud.SyncSliceTest-1360595644881/jetty3/
[junit4:junit4]   2> 12291 T843 oasc.JmxMonitoredMap.<init> JMX monitoring is enabled. Adding Solr mbeans to JMX Server: com.sun.jmx.mbeanserver.JmxMBeanServer@4cd1063b
[junit4:junit4]   2> 12292 T843 oasc.SolrCore.initDirectoryFactory solr.NRTCachingDirectoryFactory
[junit4:junit4]   2> 12293 T843 oasc.CachingDirectoryFactory.get return new directory for /usr/home/hudson/hudson-slave/workspace/Lucene-Solr-Tests-4.x-java7/solr/build/solr-core/test/J0/./org.apache.solr.cloud.SyncSliceTest-1360595644881/jetty3 forceNew:false
[junit4:junit4]   2> 12293 T843 oasc.CachingDirectoryFactory.close Releasing directory:/usr/home/hudson/hudson-slave/workspace/Lucene-Solr-Tests-4.x-java7/solr/build/solr-core/test/J0/./org.apache.solr.cloud.SyncSliceTest-1360595644881/jetty3
[junit4:junit4]   2> 12294 T843 oasc.SolrCore.getNewIndexDir New index directory detected: old=null new=./org.apache.solr.cloud.SyncSliceTest-1360595644881/jetty3/index/
[junit4:junit4]   2> 12294 T843 oasc.SolrCore.initIndex WARNING [collection1] Solr index directory './org.apache.solr.cloud.SyncSliceTest-1360595644881/jetty3/index' doesn't exist. Creating new index...
[junit4:junit4]   2> 12295 T843 oasc.CachingDirectoryFactory.get return new directory for /usr/home/hudson/hudson-slave/workspace/Lucene-Solr-Tests-4.x-java7/solr/build/solr-core/test/J0/./org.apache.solr.cloud.SyncSliceTest-1360595644881/jetty3/index forceNew:false
[junit4:junit4]   2> 12301 T843 oasc.SolrDeletionPolicy.onCommit SolrDeletionPolicy.onCommit: commits:num=1
[junit4:junit4]   2> 		commit{dir=RateLimitedDirectoryWrapper(NRTCachingDirectory(org.apache.lucene.store.NIOFSDirectory@/usr/home/hudson/hudson-slave/workspace/Lucene-Solr-Tests-4.x-java7/solr/build/solr-core/test/J0/org.apache.solr.cloud.SyncSliceTest-1360595644881/jetty3/index lockFactory=org.apache.lucene.store.NativeFSLockFactory@81ba9a2; maxCacheMB=48.0 maxMergeSizeMB=4.0)),segFN=segments_1,generation=1,filenames=[segments_1]
[junit4:junit4]   2> 12301 T843 oasc.SolrDeletionPolicy.updateCommits newest commit = 1[segments_1]
[junit4:junit4]   2> 12302 T843 oasc.CachingDirectoryFactory.close Releasing directory:/usr/home/hudson/hudson-slave/workspace/Lucene-Solr-Tests-4.x-java7/solr/build/solr-core/test/J0/./org.apache.solr.cloud.SyncSliceTest-1360595644881/jetty3/index
[junit4:junit4]   2> 12303 T843 oasc.SolrCore.initWriters created xml: solr.XMLResponseWriter
[junit4:junit4]   2> 12305 T843 oasup.UpdateRequestProcessorChain.init inserting DistributedUpdateProcessorFactory into updateRequestProcessorChain "dedupe"
[junit4:junit4]   2> 12305 T843 oasup.UpdateRequestProcessorChain.init inserting DistributedUpdateProcessorFactory into updateRequestProcessorChain "dedupe-allfields"
[junit4:junit4]   2> 12306 T843 oasup.UpdateRequestProcessorChain.init inserting DistributedUpdateProcessorFactory into updateRequestProcessorChain "stored_sig"
[junit4:junit4]   2> 12306 T843 oasup.UpdateRequestProcessorChain.init inserting DistributedUpdateProcessorFactory into updateRequestProcessorChain "uniq-fields"
[junit4:junit4]   2> 12307 T843 oasup.UpdateRequestProcessorChain.init inserting DistributedUpdateProcessorFactory into updateRequestProcessorChain "distrib-dup-test-chain-implicit"
[junit4:junit4]   2> 12307 T843 oasc.RequestHandlers.initHandlersFromConfig adding lazy requestHandler: solr.ReplicationHandler
[junit4:junit4]   2> 12307 T843 oasc.RequestHandlers.initHandlersFromConfig created /replication: solr.ReplicationHandler
[junit4:junit4]   2> 12308 T843 oasc.RequestHandlers.initHandlersFromConfig created standard: solr.StandardRequestHandler
[junit4:junit4]   2> 12308 T843 oasc.RequestHandlers.initHandlersFromConfig created /get: solr.RealTimeGetHandler
[junit4:junit4]   2> 12309 T843 oasc.RequestHandlers.initHandlersFromConfig created dismax: solr.SearchHandler
[junit4:junit4]   2> 12309 T843 oasc.RequestHandlers.initHandlersFromConfig created mock: org.apache.solr.core.MockQuerySenderListenerReqHandler
[junit4:junit4]   2> 12310 T843 oasc.RequestHandlers.initHandlersFromConfig created /admin/: org.apache.solr.handler.admin.AdminHandlers
[junit4:junit4]   2> 12310 T843 oasc.RequestHandlers.initHandlersFromConfig created defaults: solr.StandardRequestHandler
[junit4:junit4]   2> 12311 T843 oasc.RequestHandlers.initHandlersFromConfig adding lazy requestHandler: solr.StandardRequestHandler
[junit4:junit4]   2> 12311 T843 oasc.RequestHandlers.initHandlersFromConfig created lazy: solr.StandardRequestHandler
[junit4:junit4]   2> 12312 T843 oasc.RequestHandlers.initHandlersFromConfig created /update: solr.UpdateRequestHandler
[junit4:junit4]   2> 12312 T843 oasc.RequestHandlers.initHandlersFromConfig created /terms: org.apache.solr.handler.component.SearchHandler
[junit4:junit4]   2> 12313 T843 oasc.RequestHandlers.initHandlersFromConfig created spellCheckCompRH: org.apache.solr.handler.component.SearchHandler
[junit4:junit4]   2> 12313 T843 oasc.RequestHandlers.initHandlersFromConfig created spellCheckCompRH_Direct: org.apache.solr.handler.component.SearchHandler
[junit4:junit4]   2> 12314 T843 oasc.RequestHandlers.initHandlersFromConfig created spellCheckWithWordbreak: org.apache.solr.handler.component.SearchHandler
[junit4:junit4]   2> 12314 T843 oasc.RequestHandlers.initHandlersFromConfig created spellCheckWithWordbreak_Direct: org.apache.solr.handler.component.SearchHandler
[junit4:junit4]   2> 12315 T843 oasc.RequestHandlers.initHandlersFromConfig created spellCheckCompRH1: org.apache.solr.handler.component.SearchHandler
[junit4:junit4]   2> 12315 T843 oasc.RequestHandlers.initHandlersFromConfig created mltrh: org.apache.solr.handler.component.SearchHandler
[junit4:junit4]   2> 12316 T843 oasc.RequestHandlers.initHandlersFromConfig created tvrh: org.apache.solr.handler.component.SearchHandler
[junit4:junit4]   2> 12316 T843 oasc.RequestHandlers.initHandlersFromConfig created /mlt: solr.MoreLikeThisHandler
[junit4:junit4]   2> 12317 T843 oasc.RequestHandlers.initHandlersFromConfig created /debug/dump: solr.DumpRequestHandler
[junit4:junit4]   2> 12329 T843 oashl.XMLLoader.init xsltCacheLifetimeSeconds=60
[junit4:junit4]   2> 12333 T843 oasc.SolrCore.initDeprecatedSupport WARNING solrconfig.xml uses deprecated <admin/gettableFiles>, Please update your config to use the ShowFileRequestHandler.
[junit4:junit4]   2> 12334 T843 oasc.SolrCore.initDeprecatedSupport WARNING adding ShowFileRequestHandler with hidden files: [SCHEMA.XML, OLD_SYNONYMS.TXT, STOPWORDS.TXT, PROTWORDS.TXT, OPEN-EXCHANGE-RATES.JSON, SYNONYMS.TXT, CURRENCY.XML, MAPPING-ISOLATIN1ACCENT.TXT]
[junit4:junit4]   2> 12337 T843 oasc.CachingDirectoryFactory.close Releasing directory:/usr/home/hudson/hudson-slave/workspace/Lucene-Solr-Tests-4.x-java7/solr/build/solr-core/test/J0/./org.apache.solr.cloud.SyncSliceTest-1360595644881/jetty3
[junit4:junit4]   2> 12339 T843 oass.SolrIndexSearcher.<init> Opening Searcher@54736c0f main
[junit4:junit4]   2> 12340 T843 oasu.CommitTracker.<init> Hard AutoCommit: disabled
[junit4:junit4]   2> 12340 T843 oasu.CommitTracker.<init> Soft AutoCommit: disabled
[junit4:junit4]   2> 12341 T843 oashc.SpellCheckComponent.inform Initializing spell checkers
[junit4:junit4]   2> 12357 T843 oass.DirectSolrSpellChecker.init init: {name=direct,classname=DirectSolrSpellChecker,field=lowerfilt,minQueryLength=3}
[junit4:junit4]   2> 12414 T844 oasc.SolrCore.registerSearcher [collection1] Registered new searcher Searcher@54736c0f main{StandardDirectoryReader(segments_1:1)}
[junit4:junit4]   2> 12419 T843 oasc.ZkController.publish publishing core=collection1 state=down
[junit4:junit4]   2> 12419 T843 oasc.ZkController.publish numShards not found on descriptor - reading it from system property
[junit4:junit4]   2> 12914 T793 oascc.ZkStateReader.updateClusterState Updating cloud state from ZooKeeper... 
[junit4:junit4]   2> 12915 T793 oasc.Overseer$ClusterStateUpdater.updateState Update state numShards=1 message={
[junit4:junit4]   2> 	  "operation":"state",
[junit4:junit4]   2> 	  "numShards":"1",
[junit4:junit4]   2> 	  "shard":null,
[junit4:junit4]   2> 	  "roles":null,
[junit4:junit4]   2> 	  "state":"down",
[junit4:junit4]   2> 	  "core":"collection1",
[junit4:junit4]   2> 	  "collection":"collection1",
[junit4:junit4]   2> 	  "node_name":"127.0.0.1:38476_ge_sm%2Fp",
[junit4:junit4]   2> 	  "base_url":"http://127.0.0.1:38476/ge_sm/p"}
[junit4:junit4]   2> 12915 T793 oasc.Overseer$ClusterStateUpdater.updateState Collection already exists with numShards=1
[junit4:junit4]   2> 12915 T793 oasc.Overseer$ClusterStateUpdater.updateState Assigning new node to shard shard=shard1
[junit4:junit4]   2> 12928 T811 oascc.ZkStateReader$2.process A cluster state change: WatchedEvent state:SyncConnected type:NodeDataChanged path:/clusterstate.json, has occurred - updating... (live nodes size: 4)
[junit4:junit4]   2> 12928 T826 oascc.ZkStateReader$2.process A cluster state change: WatchedEvent state:SyncConnected type:NodeDataChanged path:/clusterstate.json, has occurred - updating... (live nodes size: 4)
[junit4:junit4]   2> 12929 T798 oascc.ZkStateReader$2.process A cluster state change: WatchedEvent state:SyncConnected type:NodeDataChanged path:/clusterstate.json, has occurred - updating... (live nodes size: 4)
[junit4:junit4]   2> 12929 T792 oascc.ZkStateReader$2.process A cluster state change: WatchedEvent state:SyncConnected type:NodeDataChanged path:/clusterstate.json, has occurred - updating... (live nodes size: 4)
[junit4:junit4]   2> 12929 T842 oascc.ZkStateReader$2.process A cluster state change: WatchedEvent state:SyncConnected type:NodeDataChanged path:/clusterstate.json, has occurred - updating... (live nodes size: 4)
[junit4:junit4]   2> 13422 T843 oasc.CoreContainer.registerCore registering core: collection1
[junit4:junit4]   2> 13422 T843 oasc.ZkController.register Register replica - core:collection1 address:http://127.0.0.1:38476/ge_sm/p collection:collection1 shard:shard1
[junit4:junit4]   2> 13432 T843 oasc.ZkController.register We are http://127.0.0.1:38476/ge_sm/p/collection1/ and leader is http://127.0.0.1:38389/ge_sm/p/collection1/
[junit4:junit4]   2> 13432 T843 oasc.ZkController.register No LogReplay needed for core=collection1 baseURL=http://127.0.0.1:38476/ge_sm/p
[junit4:junit4]   2> 13432 T843 oasc.ZkController.checkRecovery Core needs to recover:collection1
[junit4:junit4]   2> 13433 T843 oasu.DefaultSolrCoreState.doRecovery Running recovery - first canceling any ongoing recovery
[junit4:junit4]   2> ASYNC  NEW_CORE C46 name=collection1 org.apache.solr.core.SolrCore@7141e8c1 url=http://127.0.0.1:38476/ge_sm/p/collection1 node=127.0.0.1:38476_ge_sm%2Fp C46_STATE=coll:collection1 core:collection1 props:{shard=null, roles=null, state=down, core=collection1, collection=collection1, node_name=127.0.0.1:38476_ge_sm%2Fp, base_url=http://127.0.0.1:38476/ge_sm/p}
[junit4:junit4]   2> 13434 T845 C46 P38476 oasc.RecoveryStrategy.run Starting recovery process.  core=collection1 recoveringAfterStartup=true
[junit4:junit4]   2> 13435 T845 C46 P38476 oasc.RecoveryStrategy.doRecovery ###### startupVersions=[]
[junit4:junit4]   2> 13435 T843 oascc.ZkStateReader.updateClusterState Updating cloud state from ZooKeeper... 
[junit4:junit4]   2> 13435 T845 C46 P38476 oasc.ZkController.publish publishing core=collection1 state=recovering
[junit4:junit4]   2> 13435 T845 C46 P38476 oasc.ZkController.publish numShards not found on descriptor - reading it from system property
[junit4:junit4]   2> 13436 T770 oass.SolrDispatchFilter.init user.dir=/usr/home/hudson/hudson-slave/workspace/Lucene-Solr-Tests-4.x-java7/solr/build/solr-core/test/J0
[junit4:junit4]   2> 13437 T770 oass.SolrDispatchFilter.init SolrDispatchFilter.init() done
[junit4:junit4]   2> 13437 T770 oascsi.HttpClientUtil.createClient Creating new http client, config:maxConnections=128&maxConnectionsPerHost=32&followRedirects=false
[junit4:junit4]   2> 13439 T845 C46 P38476 oascsi.HttpClientUtil.createClient Creating new http client, config:maxConnections=128&maxConnectionsPerHost=32&followRedirects=false
[junit4:junit4]   2> 13625 T770 oejs.Server.doStart jetty-8.1.8.v20121106
[junit4:junit4]   2> 13628 T770 oejs.AbstractConnector.doStart Started SocketConnector@127.0.0.1:38485
[junit4:junit4]   2> 13629 T770 oass.SolrDispatchFilter.init SolrDispatchFilter.init()
[junit4:junit4]   2> 13629 T770 oasc.SolrResourceLoader.locateSolrHome JNDI not configured for solr (NoInitialContextEx)
[junit4:junit4]   2> 13630 T770 oasc.SolrResourceLoader.locateSolrHome using system property solr.solr.home: /usr/home/hudson/hudson-slave/workspace/Lucene-Solr-Tests-4.x-java7/solr/build/solr-core/test/J0/./org.apache.solr.cloud.SyncSliceTest-jetty4-1360595658333
[junit4:junit4]   2> 13630 T770 oasc.CoreContainer$Initializer.initialize looking for solr.xml: /usr/home/hudson/hudson-slave/workspace/Lucene-Solr-Tests-4.x-java7/solr/build/solr-core/test/J0/./org.apache.solr.cloud.SyncSliceTest-jetty4-1360595658333/solr.xml
[junit4:junit4]   2> 13631 T770 oasc.CoreContainer.<init> New CoreContainer 442884869
[junit4:junit4]   2> 13631 T770 oasc.CoreContainer.load Loading CoreContainer using Solr Home: '/usr/home/hudson/hudson-slave/workspace/Lucene-Solr-Tests-4.x-java7/solr/build/solr-core/test/J0/./org.apache.solr.cloud.SyncSliceTest-jetty4-1360595658333/'
[junit4:junit4]   2> 13632 T770 oasc.SolrResourceLoader.<init> new SolrResourceLoader for directory: '/usr/home/hudson/hudson-slave/workspace/Lucene-Solr-Tests-4.x-java7/solr/build/solr-core/test/J0/./org.apache.solr.cloud.SyncSliceTest-jetty4-1360595658333/'
[junit4:junit4]   2> 13691 T770 oashc.HttpShardHandlerFactory.getParameter Setting socketTimeout to: 60000
[junit4:junit4]   2> 13692 T770 oashc.HttpShardHandlerFactory.getParameter Setting urlScheme to: http://
[junit4:junit4]   2> 13692 T770 oashc.HttpShardHandlerFactory.getParameter Setting connTimeout to: 15000
[junit4:junit4]   2> 13693 T770 oashc.HttpShardHandlerFactory.getParameter Setting maxConnectionsPerHost to: 20
[junit4:junit4]   2> 13693 T770 oashc.HttpShardHandlerFactory.getParameter Setting corePoolSize to: 0
[junit4:junit4]   2> 13694 T770 oashc.HttpShardHandlerFactory.getParameter Setting maximumPoolSize to: 2147483647
[junit4:junit4]   2> 13694 T770 oashc.HttpShardHandlerFactory.getParameter Setting maxThreadIdleTime to: 5
[junit4:junit4]   2> 13695 T770 oashc.HttpShardHandlerFactory.getParameter Setting sizeOfQueue to: -1
[junit4:junit4]   2> 13695 T770 oashc.HttpShardHandlerFactory.getParameter Setting fairnessPolicy to: false
[junit4:junit4]   2> 13696 T770 oascsi.HttpClientUtil.createClient Creating new http client, config:maxConnectionsPerHost=20&maxConnections=10000&socketTimeout=60000&connTimeout=15000&retry=false
[junit4:junit4]   2> 13717 T770 oasc.CoreContainer.load Registering Log Listener
[junit4:junit4]   2> 13736 T770 oasc.CoreContainer.initZooKeeper Zookeeper client=127.0.0.1:38382/solr
[junit4:junit4]   2> 13737 T770 oasc.ZkController.checkChrootPath zkHost includes chroot
[junit4:junit4]   2> 13738 T770 oaz.ZooKeeper.<init> Initiating client connection, connectString=127.0.0.1:38382 sessionTimeout=60000 watcher=org.apache.solr.common.cloud.ConnectionManager@18885e57
[junit4:junit4]   2> 13739 T770 oascc.ConnectionManager.waitForConnected Waiting for client to connect to ZooKeeper
[junit4:junit4]   2> 13739 T855 oaz.ClientCnxn$SendThread.logStartConnect Opening socket connection to server localhost/127.0.0.1:38382. Will not attempt to authenticate using SASL (access denied ("javax.security.auth.AuthPermission" "getLoginConfiguration"))
[junit4:junit4]   2> 13740 T855 oaz.ClientCnxn$SendThread.primeConnection Socket connection established to localhost/127.0.0.1:38382, initiating session
[junit4:junit4]   2> 13740 T772 oazs.NIOServerCnxnFactory.run Accepted socket connection from /140.211.11.196:38486
[junit4:junit4]   2> 13741 T772 oazs.ZooKeeperServer.processConnectRequest Client attempting to establish new session at /140.211.11.196:38486
[junit4:junit4]   2> 13748 T774 oazs.ZooKeeperServer.finishSessionInit Established session 0x13cc9d1f1d8000b with negotiated timeout 20000 for client /140.211.11.196:38486
[junit4:junit4]   2> 13748 T855 oaz.ClientCnxn$SendThread.onConnected Session establishment complete on server localhost/127.0.0.1:38382, sessionid = 0x13cc9d1f1d8000b, negotiated timeout = 20000
[junit4:junit4]   2> 13749 T856 oascc.ConnectionManager.process Watcher org.apache.solr.common.cloud.ConnectionManager@18885e57 name:ZooKeeperConnection Watcher:127.0.0.1:38382 got event WatchedEvent state:SyncConnected type:None path:null path:null type:None
[junit4:junit4]   2> 13749 T770 oascc.ConnectionManager.waitForConnected Client is connected to ZooKeeper
[junit4:junit4]   2> 13751 T775 oazs.PrepRequestProcessor.pRequest2Txn Processed session termination for sessionid: 0x13cc9d1f1d8000b
[junit4:junit4]   2> 13752 T856 oaz.ClientCnxn$EventThread.run EventThread shut down
[junit4:junit4]   2> 13752 T772 oazs.NIOServerCnxn.closeSock Closed socket connection for client /140.211.11.196:38486 which had sessionid 0x13cc9d1f1d8000b
[junit4:junit4]   2> 13752 T770 oaz.ZooKeeper.close Session: 0x13cc9d1f1d8000b closed
[junit4:junit4]   2> 13753 T770 oascsi.HttpClientUtil.createClient Creating new http client, config:maxConnections=500&maxConnectionsPerHost=16&socketTimeout=60000&connTimeout=15000
[junit4:junit4]   2> 13764 T770 oaz.ZooKeeper.<init> Initiating client connection, connectString=127.0.0.1:38382/solr sessionTimeout=30000 watcher=org.apache.solr.common.cloud.ConnectionManager@5bdac513
[junit4:junit4]   2> 13765 T770 oascc.ConnectionManager.waitForConnected Waiting for client to connect to ZooKeeper
[junit4:junit4]   2> 13766 T857 oaz.ClientCnxn$SendThread.logStartConnect Opening socket connection to server localhost/127.0.0.1:38382. Will not attempt to authenticate using SASL (access denied ("javax.security.auth.AuthPermission" "getLoginConfiguration"))
[junit4:junit4]   2> 13766 T857 oaz.ClientCnxn$SendThread.primeConnection Socket connection established to localhost/127.0.0.1:38382, initiating session
[junit4:junit4]   2> 13767 T772 oazs.NIOServerCnxnFactory.run Accepted socket connection from /140.211.11.196:38487
[junit4:junit4]   2> 13767 T772 oazs.ZooKeeperServer.processConnectRequest Client attempting to establish new session at /140.211.11.196:38487
[junit4:junit4]   2> 13769 T774 oazs.ZooKeeperServer.finishSessionInit Established session 0x13cc9d1f1d8000c with negotiated timeout 20000 for client /140.211.11.196:38487
[junit4:junit4]   2> 13769 T857 oaz.ClientCnxn$SendThread.onConnected Session establishment complete on server localhost/127.0.0.1:38382, sessionid = 0x13cc9d1f1d8000c, negotiated timeout = 20000
[junit4:junit4]   2> 13769 T858 oascc.ConnectionManager.process Watcher org.apache.solr.common.cloud.ConnectionManager@5bdac513 name:ZooKeeperConnection Watcher:127.0.0.1:38382/solr got event WatchedEvent state:SyncConnected type:None path:null path:null type:None
[junit4:junit4]   2> 13769 T770 oascc.ConnectionManager.waitForConnected Client is connected to ZooKeeper
[junit4:junit4]   2> 13771 T775 oazs.PrepRequestProcessor.pRequest Got user-level KeeperException when processing sessionid:0x13cc9d1f1d8000c type:create cxid:0x1 zxid:0x92 txntype:-1 reqpath:n/a Error Path:/solr/overseer Error:KeeperErrorCode = NodeExists for /solr/overseer
[junit4:junit4]   2> 13772 T775 oazs.PrepRequestProcessor.pRequest Got user-level KeeperException when processing sessionid:0x13cc9d1f1d8000c type:create cxid:0x2 zxid:0x93 txntype:-1 reqpath:n/a Error Path:/solr/overseer Error:KeeperErrorCode = NodeExists for /solr/overseer
[junit4:junit4]   2> 13781 T770 oascc.ZkStateReader.createClusterStateWatchersAndUpdate Updating cluster state from ZooKeeper... 
[junit4:junit4]   2> 13784 T770 oasc.ZkController.createEphemeralLiveNode Register node as live in ZooKeeper:/live_nodes/127.0.0.1:38485_ge_sm%2Fp
[junit4:junit4]   2> 13785 T775 oazs.PrepRequestProcessor.pRequest Got user-level KeeperException when processing sessionid:0x13cc9d1f1d8000c type:delete cxid:0x9 zxid:0x94 txntype:-1 reqpath:n/a Error Path:/solr/live_nodes/127.0.0.1:38485_ge_sm%2Fp Error:KeeperErrorCode = NoNode for /solr/live_nodes/127.0.0.1:38485_ge_sm%2Fp
[junit4:junit4]   2> 13786 T770 oascc.SolrZkClient.makePath makePath: /live_nodes/127.0.0.1:38485_ge_sm%2Fp
[junit4:junit4]   2> 13789 T826 oascc.ZkStateReader$2.process A cluster state change: WatchedEvent state:SyncConnected type:NodeChildrenChanged path:/live_nodes, has occurred - updating... (live nodes size: 4)
[junit4:junit4]   2> 13789 T798 oascc.ZkStateReader$2.process A cluster state change: WatchedEvent state:SyncConnected type:NodeChildrenChanged path:/live_nodes, has occurred - updating... (live nodes size: 4)
[junit4:junit4]   2> 13790 T792 oascc.ZkStateReader$3.process Updating live nodes... (5)
[junit4:junit4]   2> 13790 T842 oascc.ZkStateReader$3.process Updating live nodes... (5)
[junit4:junit4]   2> 13790 T858 oascc.ZkStateReader$3.process Updating live nodes... (5)
[junit4:junit4]   2> 13790 T811 oascc.ZkStateReader$3.process Updating live nodes... (5)
[junit4:junit4]   2> 13790 T792 oascc.ZkStateReader$2.process A cluster state change: WatchedEvent state:SyncConnected type:NodeChildrenChanged path:/live_nodes, has occurred - updating... (live nodes size: 5)
[junit4:junit4]   2> 13790 T842 oascc.ZkStateReader$2.process A cluster state change: WatchedEvent state:SyncConnected type:NodeChildrenChanged path:/live_nodes, has occurred - updating... (live nodes size: 5)
[junit4:junit4]   2> 13791 T811 oascc.ZkStateReader$2.process A cluster state change: WatchedEvent state:SyncConnected type:NodeChildrenChanged path:/live_nodes, has occurred - updating... (live nodes size: 5)
[junit4:junit4]   2> 13792 T826 oascc.ZkStateReader$3.process Updating live nodes... (5)
[junit4:junit4]   2> 13792 T798 oascc.ZkStateReader$3.process Updating live nodes... (5)
[junit4:junit4]   2> 13801 T859 oasc.CoreContainer.create Creating SolrCore 'collection1' using instanceDir: /usr/home/hudson/hudson-slave/workspace/Lucene-Solr-Tests-4.x-java7/solr/build/solr-core/test/J0/./org.apache.solr.cloud.SyncSliceTest-jetty4-1360595658333/collection1
[junit4:junit4]   2> 13801 T859 oasc.ZkController.createCollectionZkNode Check for collection zkNode:collection1
[junit4:junit4]   2> 13802 T859 oasc.ZkController.createCollectionZkNode Collection zkNode exists
[junit4:junit4]   2> 13802 T859 oasc.ZkController.readConfigName Load collection config from:/collections/collection1
[junit4:junit4]   2> 13804 T859 oasc.SolrResourceLoader.<init> new SolrResourceLoader for directory: '/usr/home/hudson/hudson-slave/workspace/Lucene-Solr-Tests-4.x-java7/solr/build/solr-core/test/J0/./org.apache.solr.cloud.SyncSliceTest-jetty4-1360595658333/collection1/'
[junit4:junit4]   2> 13805 T859 oasc.SolrResourceLoader.replaceClassLoader Adding 'file:/usr/home/hudson/hudson-slave/workspace/Lucene-Solr-Tests-4.x-java7/solr/build/solr-core/test/J0/org.apache.solr.cloud.SyncSliceTest-jetty4-1360595658333/collection1/lib/README' to classloader
[junit4:junit4]   2> 13806 T859 oasc.SolrResourceLoader.replaceClassLoader Adding 'file:/usr/home/hudson/hudson-slave/workspace/Lucene-Solr-Tests-4.x-java7/solr/build/solr-core/test/J0/org.apache.solr.cloud.SyncSliceTest-jetty4-1360595658333/collection1/lib/classes/' to classloader
[junit4:junit4]   2> 13863 T859 oasc.SolrConfig.<init> Using Lucene MatchVersion: LUCENE_42
[junit4:junit4]   2> 13936 T859 oasc.SolrConfig.<init> Loaded SolrConfig: solrconfig.xml
[junit4:junit4]   2>  C45_STATE=coll:collection1 core:collection1 props:{shard=shard1, roles=null, state=recovering, core=collection1, collection=collection1, node_name=127.0.0.1:38453_ge_sm%2Fp, base_url=http://127.0.0.1:38453/ge_sm/p}
[junit4:junit4]   2> 13998 T829 C45 P38453 oasc.RecoveryStrategy.doRecovery Attempting to PeerSync from http://127.0.0.1:38389/ge_sm/p/collection1/ core=collection1 - recoveringAfterStartup=true
[junit4:junit4]   2> 14008 T829 C45 P38453 oascsi.HttpClientUtil.createClient Creating new http client, config:maxConnectionsPerHost=20&maxConnections=10000&connTimeout=30000&socketTimeout=30000&retry=false
[junit4:junit4]   2> 14028 T829 C45 P38453 oasu.PeerSync.sync PeerSync: core=collection1 url=http://127.0.0.1:38453/ge_sm/p START replicas=[http://127.0.0.1:38389/ge_sm/p/collection1/] nUpdates=100
[junit4:junit4]   2> 14029 T829 C45 P38453 oasu.PeerSync.sync WARNING no frame of reference to tell of we've missed updates
[junit4:junit4]   2> 14029 T829 C45 P38453 oasc.RecoveryStrategy.doRecovery PeerSync Recovery was not successful - trying replication. core=collection1
[junit4:junit4]   2> 14030 T829 C45 P38453 oasc.RecoveryStrategy.doRecovery Starting Replication Recovery. core=collection1
[junit4:junit4]   2> 14030 T829 C45 P38453 oasc.RecoveryStrategy.doRecovery Begin buffering updates. core=collection1
[junit4:junit4]   2> 14030 T829 C45 P38453 oasu.UpdateLog.bufferUpdates Starting to buffer updates. FSUpdateLog{state=ACTIVE, tlog=null}
[junit4:junit4]   2> 14030 T829 C45 P38453 oasc.RecoveryStrategy.replicate Attempting to replicate from http://127.0.0.1:38389/ge_sm/p/collection1/. core=collection1
[junit4:junit4]   2> 14031 T829 C45 P38453 oascsi.HttpClientUtil.createClient Creating new http client, config:maxConnections=128&maxConnectionsPerHost=32&followRedirects=false
[junit4:junit4]   2> 14037 T859 oass.IndexSchema.readSchema Reading Solr Schema
[junit4:junit4]   2> ASYNC  NEW_CORE C47 name=collection1 org.apache.solr.core.SolrCore@40bf7f63 url=http://127.0.0.1:38389/ge_sm/p/collection1 node=127.0.0.1:38389_ge_sm%2Fp C47_STATE=coll:collection1 core:collection1 props:{shard=shard1, roles=null, state=active, core=collection1, collection=collection1, node_name=127.0.0.1:38389_ge_sm%2Fp, base_url=http://127.0.0.1:38389/ge_sm/p, leader=true}
[junit4:junit4]   2> 14039 T803 C47 P38389 REQ /get {getVersions=100&distrib=false&wt=javabin&qt=/get&version=2} status=0 QTime=1 
[junit4:junit4]   2> 14045 T859 oass.IndexSchema.readSchema Schema name=test
[junit4:junit4]   2> 14053 T804 C47 P38389 oasu.DirectUpdateHandler2.commit start commit{,optimize=false,openSearcher=false,waitSearcher=true,expungeDeletes=false,softCommit=false}
[junit4:junit4]   2> 14054 T804 C47 P38389 oasc.CachingDirectoryFactory.close Releasing directory:/usr/home/hudson/hudson-slave/workspace/Lucene-Solr-Tests-4.x-java7/solr/build/solr-core/test/J0/./org.apache.solr.cloud.SyncSliceTest-1360595644881/jetty1
[junit4:junit4]   2> 14058 T804 C47 P38389 oasc.SolrDeletionPolicy.onInit SolrDeletionPolicy.onInit: commits:num=1
[junit4:junit4]   2> 		commit{dir=RateLimitedDirectoryWrapper(NRTCachingDirectory(org.apache.lucene.store.NIOFSDirectory@/usr/home/hudson/hudson-slave/workspace/Lucene-Solr-Tests-4.x-java7/solr/build/solr-core/test/J0/org.apache.solr.cloud.SyncSliceTest-1360595644881/jetty1/index lockFactory=org.apache.lucene.store.NativeFSLockFactory@737630f3; maxCacheMB=48.0 maxMergeSizeMB=4.0)),segFN=segments_1,generation=1,filenames=[segments_1]
[junit4:junit4]   2> 14059 T804 C47 P38389 oasc.SolrDeletionPolicy.updateCommits newest commit = 1[segments_1]
[junit4:junit4]   2> 14064 T804 C47 P38389 oasc.SolrDeletionPolicy.onCommit SolrDeletionPolicy.onCommit: commits:num=2
[junit4:junit4]   2> 		commit{dir=RateLimitedDirectoryWrapper(NRTCachingDirectory(org.apache.lucene.store.NIOFSDirectory@/usr/home/hudson/hudson-slave/workspace/Lucene-Solr-Tests-4.x-java7/solr/build/solr-core/test/J0/org.apache.solr.cloud.SyncSliceTest-1360595644881/jetty1/index lockFactory=org.apache.lucene.store.NativeFSLockFactory@737630f3; maxCacheMB=48.0 maxMergeSizeMB=4.0)),segFN=segments_1,generation=1,filenames=[segments_1]
[junit4:junit4]   2> 		commit{dir=RateLimitedDirectoryWrapper(NRTCachingDirectory(org.apache.lucene.store.NIOFSDirectory@/usr/home/hudson/hudson-slave/workspace/Lucene-Solr-Tests-4.x-java7/solr/build/solr-core/test/J0/org.apache.solr.cloud.SyncSliceTest-1360595644881/jetty1/index lockFactory=org.apache.lucene.store.NativeFSLockFactory@737630f3; maxCacheMB=48.0 maxMergeSizeMB=4.0)),segFN=segments_2,generation=2,filenames=[segments_2]
[junit4:junit4]   2> 14064 T804 C47 P38389 oasc.SolrDeletionPolicy.updateCommits newest commit = 2[segments_2]
[junit4:junit4]   2> 14066 T804 C47 P38389 oasc.CachingDirectoryFactory.close Releasing directory:/usr/home/hudson/hudson-slave/workspace/Lucene-Solr-Tests-4.x-java7/solr/build/solr-core/test/J0/./org.apache.solr.cloud.SyncSliceTest-1360595644881/jetty1
[junit4:junit4]   2> 14066 T804 C47 P38389 oass.SolrIndexSearcher.<init> Opening Searcher@124de9a2 realtime
[junit4:junit4]   2> 14067 T804 C47 P38389 oasu.DirectUpdateHandler2.commit end_commit_flush
[junit4:junit4]   2> 14067 T804 C47 P38389 /update {waitSearcher=true&openSearcher=false&commit=true&wt=javabin&commit_end_point=true&version=2&softCommit=false} {commit=} 0 20
[junit4:junit4]   2> 14068 T829 C45 P38453 oash.ReplicationHandler.inform Commits will be reserved for  10000
[junit4:junit4]   2> 14069 T829 C45 P38453 oascsi.HttpClientUtil.createClient Creating new http client, config:connTimeout=5000&socketTimeout=20000&allowCompression=false&maxConnections=10000&maxConnectionsPerHost=10000
[junit4:junit4]   2> 14098 T829 C45 P38453 oash.SnapPuller.<init>  No value set for 'pollInterval'. Timer Task not started.
[junit4:junit4]   2> 14101 T805 C47 P38389 oash.ReplicationHandler.inform Commits will be reserved for  10000
[junit4:junit4]   2> 14101 T805 C47 P38389 REQ /replication {command=indexversion&qt=/replication&wt=javabin&version=2} status=0 QTime=1 
[junit4:junit4]   2> 14103 T829 C45 P38453 oash.SnapPuller.fetchLatestIndex Master's generation: 2
[junit4:junit4]   2> 14103 T829 C45 P38453 oash.SnapPuller.fetchLatestIndex Slave's generation: 1
[junit4:junit4]   2> 14103 T829 C45 P38453 oash.SnapPuller.fetchLatestIndex Starting replication process
[junit4:junit4]   2> 14105 T805 C47 P38389 oasc.CachingDirectoryFactory.close Releasing directory:/usr/home/hudson/hudson-slave/workspace/Lucene-Solr-Tests-4.x-java7/solr/build/solr-core/test/J0/./org.apache.solr.cloud.SyncSliceTest-1360595644881/jetty1
[junit4:junit4]   2> 14106 T805 C47 P38389 oasc.CachingDirectoryFactory.close Releasing directory:/usr/home/hudson/hudson-slave/workspace/Lucene-Solr-Tests-4.x-java7/solr/build/solr-core/test/J0/./org.apache.solr.cloud.SyncSliceTest-1360595644881/jetty1/index
[junit4:junit4]   2> 14107 T805 C47 P38389 REQ /replication {command=filelist&qt=/replication&wt=javabin&generation=2&version=2} status=0 QTime=2 
[junit4:junit4]   2> 14108 T829 C45 P38453 oash.SnapPuller.fetchLatestIndex Number of files in latest index in master: 1
[junit4:junit4]   2> 14109 T829 C45 P38453 oasc.CachingDirectoryFactory.get return new directory for /usr/home/hudson/hudson-slave/workspace/Lucene-Solr-Tests-4.x-java7/solr/build/solr-core/test/J0/./org.apache.solr.cloud.SyncSliceTest-1360595644881/jetty2/index.20130211171418983 forceNew:false
[junit4:junit4]   2> 14110 T829 C45 P38453 oasc.CachingDirectoryFactory.close Releasing directory:/usr/home/hudson/hudson-slave/workspace/Lucene-Solr-Tests-4.x-java7/solr/build/solr-core/test/J0/./org.apache.solr.cloud.SyncSliceTest-1360595644881/jetty2
[junit4:junit4]   2> 14111 T829 C45 P38453 oash.SnapPuller.fetchLatestIndex Starting download to RateLimitedDirectoryWrapper(NRTCachingDirectory(org.apache.lucene.store.NIOFSDirectory@/usr/home/hudson/hudson-slave/workspace/Lucene-Solr-Tests-4.x-java7/solr/build/solr-core/test/J0/org.apache.solr.cloud.SyncSliceTest-1360595644881/jetty2/index.20130211171418983 lockFactory=org.apache.lucene.store.NativeFSLockFactory@3a7dc72; maxCacheMB=48.0 maxMergeSizeMB=4.0)) fullCopy=true
[junit4:junit4]   2> 14126 T805 C47 P38389 REQ /replication {file=segments_2&command=filecontent&checksum=true&wt=filestream&qt=/replication&generation=2} status=0 QTime=6 
[junit4:junit4]   2> 14132 T829 C45 P38453 oasc.CachingDirectoryFactory.close Releasing directory:/usr/home/hudson/hudson-slave/workspace/Lucene-Solr-Tests-4.x-java7/solr/build/solr-core/test/J0/./org.apache.solr.cloud.SyncSliceTest-1360595644881/jetty2/index
[junit4:junit4]   2> 14133 T829 C45 P38453 oash.SnapPuller.fetchLatestIndex Total time taken for download : 0 secs
[junit4:junit4]   2> 14133 T829 C45 P38453 oash.SnapPuller.modifyIndexProps New index installed. Updating index properties... index=index.20130211171418983
[junit4:junit4]   2> 14135 T829 C45 P38453 oasc.CachingDirectoryFactory.close Releasing directory:/usr/home/hudson/hudson-slave/workspace/Lucene-Solr-Tests-4.x-java7/solr/build/solr-core/test/J0/./org.apache.solr.cloud.SyncSliceTest-1360595644881/jetty2
[junit4:junit4]   2> 14136 T829 C45 P38453 oasc.CachingDirectoryFactory.close Releasing directory:/usr/home/hudson/hudson-slave/workspace/Lucene-Solr-Tests-4.x-java7/solr/build/solr-core/test/J0/./org.apache.solr.cloud.SyncSliceTest-1360595644881/jetty2
[junit4:junit4]   2> 14136 T829 C45 P38453 oasc.SolrCore.getNewIndexDir New index directory detected: old=./org.apache.solr.cloud.SyncSliceTest-1360595644881/jetty2/index/ new=./org.apache.solr.cloud.SyncSliceTest-1360595644881/jetty2/index.20130211171418983
[junit4:junit4]   2> 14140 T829 C45 P38453 oasc.SolrDeletionPolicy.onInit SolrDeletionPolicy.onInit: commits:num=1
[junit4:junit4]   2> 		commit{dir=RateLimitedDirectoryWrapper(NRTCachingDirectory(org.apache.lucene.store.NIOFSDirectory@/usr/home/hudson/hudson-slave/workspace/Lucene-Solr-Tests-4.x-java7/solr/build/solr-core/test/J0/org.apache.solr.cloud.SyncSliceTest-1360595644881/jetty2/index.20130211171418983 lockFactory=org.apache.lucene.store.NativeFSLockFactory@3a7dc72; maxCacheMB=48.0 maxMergeSizeMB=4.0)),segFN=segments_2,generation=2,filenames=[segments_2]
[junit4:junit4]   2> 14141 T829 C45 P38453 oasc.SolrDeletionPolicy.updateCommits newest commit = 2[segments_2]
[junit4:junit4]   2> 14142 T829 C45 P38453 oasc.CachingDirectoryFactory.close Releasing directory:/usr/home/hudson/hudson-slave/workspace/Lucene-Solr-Tests-4.x-java7/solr/build/solr-core/test/J0/./org.apache.solr.cloud.SyncSliceTest-1360595644881/jetty2
[junit4:junit4]   2> 14147 T829 C45 P38453 oasu.DefaultSolrCoreState.newIndexWriter Creating new IndexWriter...
[junit4:junit4]   2> 14147 T829 C45 P38453 oasu.DefaultSolrCoreState.newIndexWriter Waiting until IndexWriter is unused... core=collection1
[junit4:junit4]   2> 14147 T829 C45 P38453 oasu.DefaultSolrCoreState.newIndexWriter Rollback old IndexWriter... core=collection1
[junit4:junit4]   2> 14148 T829 C45 P38453 oasc.CachingDirectoryFactory.close Releasing directory:/usr/home/hudson/hudson-slave/workspace/Lucene-Solr-Tests-4.x-java7/solr/build/solr-core/test/J0/./org.apache.solr.cloud.SyncSliceTest-1360595644881/jetty2/index.20130211171418983
[junit4:junit4]   2> 14149 T829 C45 P38453 oasc.CachingDirectoryFactory.close Releasing directory:/usr/home/hudson/hudson-slave/workspace/Lucene-Solr-Tests-4.x-java7/solr/build/solr-core/test/J0/./org.apache.solr.cloud.SyncSliceTest-1360595644881/jetty2
[junit4:junit4]   2> 14153 T829 C45 P38453 oasc.SolrDeletionPolicy.onInit SolrDeletionPolicy.onInit: commits:num=1
[junit4:junit4]   2> 		commit{dir=RateLimitedDirectoryWrapper(NRTCachingDirectory(org.apache.lucene.store.NIOFSDirectory@/usr/home/hudson/hudson-slave/workspace/Lucene-Solr-Tests-4.x-java7/solr/build/solr-core/test/J0/org.apache.solr.cloud.SyncSliceTest-1360595644881/jetty2/index.20130211171418983 lockFactory=org.apache.lucene.store.NativeFSLockFactory@3a7dc72; maxCacheMB=48.0 maxMergeSizeMB=4.0)),segFN=segments_2,generation=2,filenames=[segments_2]
[junit4:junit4]   2> 14153 T829 C45 P38453 oasc.SolrDeletionPolicy.updateCommits newest commit = 2[segments_2]
[junit4:junit4]   2> 14154 T829 C45 P38453 oasu.DefaultSolrCoreState.newIndexWriter New IndexWriter is ready to be used.
[junit4:junit4]   2> 14154 T829 C45 P38453 oasc.CachingDirectoryFactory.close Releasing directory:/usr/home/hudson/hudson-slave/workspace/Lucene-Solr-Tests-4.x-java7/solr/build/solr-core/test/J0/./org.apache.solr.cloud.SyncSliceTest-1360595644881/jetty2
[junit4:junit4]   2> 14171 T829 C45 P38453 oass.SolrIndexSearcher.<init> Opening Searcher@61ab3c2c main
[junit4:junit4]   2> 14173 T828 oasc.SolrCore.registerSearcher [collection1] Registered new searcher Searcher@61ab3c2c main{StandardDirectoryReader(segments_2:1:nrt)}
[junit4:junit4]   2> 14174 T828 oasc.CachingDirectoryFactory.close Releasing directory:/usr/home/hudson/hudson-slave/workspace/Lucene-Solr-Tests-4.x-java7/solr/build/solr-core/test/J0/./org.apache.solr.cloud.SyncSliceTest-1360595644881/jetty2/index
[junit4:junit4]   2> 14174 T829 C45 P38453 oasu.DirectUpdateHandler2.commit start commit{,optimize=false,openSearcher=false,waitSearcher=false,expungeDeletes=false,softCommit=false}
[junit4:junit4]   2> 14178 T829 C45 P38453 oasc.SolrDeletionPolicy.onCommit SolrDeletionPolicy.onCommit: commits:num=2
[junit4:junit4]   2> 		commit{dir=RateLimitedDirectoryWrapper(NRTCachingDirectory(org.apache.lucene.store.NIOFSDirectory@/usr/home/hudson/hudson-slave/workspace/Lucene-Solr-Tests-4.x-java7/solr/build/solr-core/test/J0/org.apache.solr.cloud.SyncSliceTest-1360595644881/jetty2/index.20130211171418983 lockFactory=org.apache.lucene.store.NativeFSLockFactory@3a7dc72; maxCacheMB=48.0 maxMergeSizeMB=4.0)),segFN=segments_2,generation=2,filenames=[segments_2]
[junit4:junit4]   2> 		commit{dir=RateLimitedDirectoryWrapper(NRTCachingDirectory(org.apache.lucene.store.NIOFSDirectory@/usr/home/hudson/hudson-slave/workspace/Lucene-Solr-Tests-4.x-java7/solr/build/solr-core/test/J0/org.apache.solr.cloud.SyncSliceTest-1360595644881/jetty2/index.20130211171418983 lockFactory=org.apache.lucene.store.NativeFSLockFactory@3a7dc72; maxCacheMB=48.0 maxMergeSizeMB=4.0)),segFN=segments_3,generation=3,filenames=[segments_3]
[junit4:junit4]   2> 14178 T829 C45 P38453 oasc.SolrDeletionPolicy.updateCommits newest commit = 3[segments_3]
[junit4:junit4]   2> 14180 T829 C45 P38453 oasc.CachingDirectoryFactory.close Releasing directory:/usr/home/hudson/hudson-slave/workspace/Lucene-Solr-Tests-4.x-java7/solr/build/solr-core/test/J0/./org.apache.solr.cloud.SyncSliceTest-1360595644881/jetty2
[junit4:junit4]   2> 14180 T829 C45 P38453 oasu.DirectUpdateHandler2.commit end_commit_flush
[junit4:junit4]   2> 14180 T829 C45 P38453 oasc.CachingDirectoryFactory.close Releasing directory:/usr/home/hudson/hudson-slave/workspace/Lucene-Solr-Tests-4.x-java7/solr/build/solr-core/test/J0/./org.apache.solr.cloud.SyncSliceTest-1360595644881/jetty2/index.20130211171418983
[junit4:junit4]   2> 14181 T829 C45 P38453 oasc.CachingDirectoryFactory.close Releasing directory:/usr/home/hudson/hudson-slave/workspace/Lucene-Solr-Tests-4.x-java7/solr/build/solr-core/test/J0/./org.apache.solr.cloud.SyncSliceTest-1360595644881/jetty2/index
[junit4:junit4]   2> 14181 T829 C45 P38453 oasc.RecoveryStrategy.replay No replay needed. core=collection1
[junit4:junit4]   2> 14181 T829 C45 P38453 oasc.RecoveryStrategy.doRecovery Replication Recovery was successful - registering as Active. core=collection1
[junit4:junit4]   2> 14181 T829 C45 P38453 oasc.ZkController.publish publishing core=collection1 state=active
[junit4:junit4]   2> 14181 T829 C45 P38453 oasc.ZkController.publish numShards not found on descriptor - reading it from system property
[junit4:junit4]   2> 14188 T829 C45 P38453 oasc.RecoveryStrategy.doRecovery Finished recovery process. core=collection1
[junit4:junit4]   2> 14437 T793 oascc.ZkStateReader.updateClusterState Updating cloud state from ZooKeeper... 
[junit4:junit4]   2> 14438 T793 oasc.Overseer$ClusterStateUpdater.updateState Update state numShards=1 message={
[junit4:junit4]   2> 	  "operation":"state",
[junit4:junit4]   2> 	  "numShards":"1",
[junit4:junit4]   2> 	  "shard":"shard1",
[junit4:junit4]   2> 	  "roles":null,
[junit4:junit4]   2> 	  "state":"recovering",
[junit4:junit4]   2> 	  "core":"collection1",
[junit4:junit4]   2> 	  "collection":"collection1",
[junit4:junit4]   2> 	  "node_name":"127.0.0.1:38476_ge_sm%2Fp",
[junit4:junit4]   2> 	  "base_url":"http://127.0.0.1:38476/ge_sm/p"}
[junit4:junit4]   2> 14443 T793 oasc.Overseer$ClusterStateUpdater.updateState Update state numShards=1 message={
[junit4:junit4]   2> 	  "operation":"state",
[junit4:junit4]   2> 	  "numShards":"1",
[junit4:junit4]   2> 	  "shard":"shard1",
[junit4:junit4]   2> 	  "roles":null,
[junit4:junit4]   2> 	  "state":"active",
[junit4:junit4]   2> 	  "core":"collection1",
[junit4:junit4]   2> 	  "collection":"collection1",
[junit4:junit4]   2> 	  "node_name":"127.0.0.1:38453_ge_sm%2Fp",
[junit4:junit4]   2> 	  "base_url":"http://127.0.0.1:38453/ge_sm/p"}
[junit4:junit4]   2> 14455 T826 oascc.ZkStateReader$2.process A cluster state change: WatchedEvent state:SyncConnected type:NodeDataChanged path:/clusterstate.json, has occurred - updating... (live nodes size: 5)
[junit4:junit4]   2> 14456 T792 oascc.ZkStateReader$2.process A cluster state change: WatchedEvent state:SyncConnected type:NodeDataChanged path:/clusterstate.json, has occurred - updating... (live nodes size: 5)
[junit4:junit4]   2> 14456 T798 oascc.ZkStateReader$2.process A cluster state change: WatchedEvent state:SyncConnected type:NodeDataChanged path:/clusterstate.json, has occurred - updating... (live nodes size: 5)
[junit4:junit4]   2> 14456 T842 oascc.ZkStateReader$2.process A cluster state change: WatchedEvent state:SyncConnected type:NodeDataChanged path:/clusterstate.json, has occurred - updating... (live nodes size: 5)
[junit4:junit4]   2> 14455 T858 oascc.ZkStateReader$2.process A cluster state change: WatchedEvent state:SyncConnected type:NodeDataChanged path:/clusterstate.json, has occurred - updating... (live nodes size: 5)
[junit4:junit4]   2> 14455 T811 oascc.ZkStateReader$2.process A cluster state change: WatchedEvent state:SyncConnected type:NodeDataChanged path:/clusterstate.json, has occurred - updating... (live nodes size: 5)
[junit4:junit4]   2> 14728 T859 oass.OpenExchangeRatesOrgProvider.init Initialized with rates=open-exchange-rates.json, refreshInterval=1440.
[junit4:junit4]   2> 14740 T859 oass.IndexSchema.readSchema default search field in schema is text
[junit4:junit4]   2> 14744 T859 oass.IndexSchema.readSchema unique key field: id
[junit4:junit4]   2> 14764 T859 oass.FileExchangeRateProvider.reload Reloading exchange rates from file currency.xml
[junit4:junit4]   2> 14781 T859 oass.FileExchangeRateProvider.reload Reloading exchange rates from file currency.xml
[junit4:junit4]   2> 14786 T859 oass.OpenExchangeRatesOrgProvider.reload Reloading exchange rates from open-exchange-rates.json
[junit4:junit4]   2> 14788 T859 oass.OpenExchangeRatesOrgProvider.reload Reloading exchange rates from open-exchange-rates.json
[junit4:junit4]   2> 14790 T859 oasc.SolrCore.<init> [collection1] Opening new SolrCore at /usr/home/hudson/hudson-slave/workspace/Lucene-Solr-Tests-4.x-java7/solr/build/solr-core/test/J0/./org.apache.solr.cloud.SyncSliceTest-jetty4-1360595658333/collection1/, dataDir=./org.apache.solr.cloud.SyncSliceTest-1360595644881/jetty4/
[junit4:junit4]   2> 14790 T859 oasc.JmxMonitoredMap.<init> JMX monitoring is enabled. Adding Solr mbeans to JMX Server: com.sun.jmx.mbeanserver.JmxMBeanServer@4cd1063b
[junit4:junit4]   2> 14791 T859 oasc.SolrCore.initDirectoryFactory solr.NRTCachingDirectoryFactory
[junit4:junit4]   2> 14792 T859 oasc.CachingDirectoryFactory.get return new directory for /usr/home/hudson/hudson-slave/workspace/Lucene-Solr-Tests-4.x-java7/solr/build/solr-core/test/J0/./org.apache.solr.cloud.SyncSliceTest-1360595644881/jetty4 forceNew:false
[junit4:junit4]   2> 14792 T859 oasc.CachingDirectoryFactory.close Releasing directory:/usr/home/hudson/hudson-slave/workspace/Lucene-Solr-Tests-4.x-java7/solr/build/solr-core/test/J0/./org.apache.solr.cloud.SyncSliceTest-1360595644881/jetty4
[junit4:junit4]   2> 14793 T859 oasc.SolrCore.getNewIndexDir New index directory detected: old=null new=./org.apache.solr.cloud.SyncSliceTest-1360595644881/jetty4/index/
[junit4:junit4]   2> 14793 T859 oasc.SolrCore.initIndex WARNING [collection1] Solr index directory './org.apache.solr.cloud.SyncSliceTest-1360595644881/jetty4/index' doesn't exist. Creating new index...
[junit4:junit4]   2> 14794 T859 oasc.CachingDirectoryFactory.get return new directory for /usr/home/hudson/hudson-slave/workspace/Lucene-Solr-Tests-4.x-java7/solr/build/solr-core/test/J0/./org.apache.solr.cloud.SyncSliceTest-1360595644881/jetty4/index forceNew:false
[junit4:junit4]   2> 14800 T859 oasc.SolrDeletionPolicy.onCommit SolrDeletionPolicy.onCommit: commits:num=1
[junit4:junit4]   2> 		commit{dir=RateLimitedDirectoryWrapper(NRTCachingDirectory(org.apache.lucene.store.NIOFSDirectory@/usr/home/hudson/hudson-slave/workspace/Lucene-Solr-Tests-4.x-java7/solr/build/solr-core/test/J0/org.apache.solr.cloud.SyncSliceTest-1360595644881/jetty4/index lockFactory=org.apache.lucene.store.NativeFSLockFactory@275ed0f9; maxCacheMB=48.0 maxMergeSizeMB=4.0)),segFN=segments_1,generation=1,filenames=[segments_1]
[junit4:junit4]   2> 14801 T859 oasc.SolrDeletionPolicy.updateCommits newest commit = 1[segments_1]
[junit4:junit4]   2> 14802 T859 oasc.CachingDirectoryFactory.close Releasing directory:/usr/home/hudson/hudson-slave/workspace/Lucene-Solr-Tests-4.x-java7/solr/build/solr-core/test/J0/./org.apache.solr.cloud.SyncSliceTest-1360595644881/jetty4/index
[junit4:junit4]   2> 14802 T859 oasc.SolrCore.initWriters created xml: solr.XMLResponseWriter
[junit4:junit4]   2> 14804 T859 oasup.UpdateRequestProcessorChain.init inserting DistributedUpdateProcessorFactory into updateRequestProcessorChain "dedupe"
[junit4:junit4]   2> 14805 T859 oasup.UpdateRequestProcessorChain.init inserting DistributedUpdateProcessorFactory into updateRequestProcessorChain "dedupe-allfields"
[junit4:junit4]   2> 14805 T859 oasup.UpdateRequestProcessorChain.init inserting DistributedUpdateProcessorFactory into updateRequestProcessorChain "stored_sig"
[junit4:junit4]   2> 14805 T859 oasup.UpdateRequestProcessorChain.init inserting DistributedUpdateProcessorFactory into updateRequestProcessorChain "uniq-fields"
[junit4:junit4]   2> 14806 T859 oasup.UpdateRequestProcessorChain.init inserting DistributedUpdateProcessorFactory into updateRequestProcessorChain "distrib-dup-test-chain-implicit"
[junit4:junit4]   2> 14806 T859 oasc.RequestHandlers.initHandlersFromConfig adding lazy requestHandler: solr.ReplicationHandler
[junit4:junit4]   2> 14807 T859 oasc.RequestHandlers.initHandlersFromConfig created /replication: solr.ReplicationHandler
[junit4:junit4]   2> 14807 T859 oasc.RequestHandlers.initHandlersFromConfig created standard: solr.StandardRequestHandler
[junit4:junit4]   2> 14808 T859 oasc.RequestHandlers.initHandlersFromConfig created /get: solr.RealTimeGetHandler
[junit4:junit4]   2> 14809 T859 oasc.RequestHandlers.initHandlersFromConfig created dismax: solr.SearchHandler
[junit4:junit4]   2> 14809 T859 oasc.RequestHandlers.initHandlersFromConfig created mock: org.apache.solr.core.MockQuerySenderListenerReqHandler
[junit4:junit4]   2> 14810 T859 oasc.RequestHandlers.initHandlersFromConfig created /admin/: org.apache.solr.handler.admin.AdminHandlers
[junit4:junit4]   2> 14810 T859 oasc.RequestHandlers.initHandlersFromConfig created defaults: solr.StandardRequestHandler
[junit4:junit4]   2> 14810 T859 oasc.RequestHandlers.initHandlersFromConfig adding lazy requestHandler: solr.StandardRequestHandler
[junit4:junit4]   2> 14811 T859 oasc.RequestHandlers.initHandlersFromConfig created lazy: solr.StandardRequestHandler
[junit4:junit4]   2> 14811 T859 oasc.RequestHandlers.initHandlersFromConfig created /update: solr.UpdateRequestHandler
[junit4:junit4]   2> 14812 T859 oasc.RequestHandlers.initHandlersFromConfig created /terms: org.apache.solr.handler.component.SearchHandler
[junit4:junit4]   2> 14813 T859 oasc.RequestHandlers.initHandlersFromConfig created spellCheckCompRH: org.apache.solr.handler.component.SearchHandler
[junit4:junit4]   2> 14813 T859 oasc.RequestHandlers.initHandlersFromConfig created spellCheckCompRH_Direct: org.apache.solr.handler.component.SearchHandler
[junit4:junit4]   2> 14814 T859 oasc.RequestHandlers.initHandlersFromConfig created spellCheckWithWordbreak: org.apache.solr.handler.component.SearchHandler
[junit4:junit4]   2> 14814 T859 oasc.RequestHandlers.initHandlersFromConfig created spellCheckWithWordbreak_Direct: org.apache.solr.handler.component.SearchHandler
[junit4:junit4]   2> 14815 T859 oasc.RequestHandlers.initHandlersFromConfig created spellCheckCompRH1: org.apache.solr.handler.component.SearchHandler
[junit4:junit4]   2> 14815 T859 oasc.RequestHandlers.initHandlersFromConfig created mltrh: org.apache.solr.handler.component.SearchHandler
[junit4:junit4]   2> 14816 T859 oasc.RequestHandlers.initHandlersFromConfig created tvrh: org.apache.solr.handler.component.SearchHandler
[junit4:junit4]   2> 14817 T859 oasc.RequestHandlers.initHandlersFromConfig created /mlt: solr.MoreLikeThisHandler
[junit4:junit4]   2> 14817 T859 oasc.RequestHandlers.initHandlersFromConfig created /debug/dump: solr.DumpRequestHandler
[junit4:junit4]   2> 14830 T859 oashl.XMLLoader.init xsltCacheLifetimeSeconds=60
[junit4:junit4]   2> 14834 T859 oasc.SolrCore.initDeprecatedSupport WARNING solrconfig.xml uses deprecated <admin/gettableFiles>, Please update your config to use the ShowFileRequestHandler.
[junit4:junit4]   2> 14836 T859 oasc.SolrCore.initDeprecatedSupport WARNING adding ShowFileRequestHandler with hidden files: [SCHEMA.XML, OLD_SYNONYMS.TXT, STOPWORDS.TXT, PROTWORDS.TXT, OPEN-EXCHANGE-RATES.JSON, SYNONYMS.TXT, CURRENCY.XML, MAPPING-ISOLATIN1ACCENT.TXT]
[junit4:junit4]   2> 14839 T859 oasc.CachingDirectoryFactory.close Releasing directory:/usr/home/hudson/hudson-slave/workspace/Lucene-Solr-Tests-4.x-java7/solr/build/solr-core/test/J0/./org.apache.solr.cloud.SyncSliceTest-1360595644881/jetty4
[junit4:junit4]   2> 14840 T859 oass.SolrIndexSearcher.<init> Opening Searcher@422ab6c4 main
[junit4:junit4]   2> 14841 T859 oasu.CommitTracker.<init> Hard AutoCommit: disabled
[junit4:junit4]   2> 14842 T859 oasu.CommitTracker.<init> Soft AutoCommit: disabled
[junit4:junit4]   2> 14842 T859 oashc.SpellCheckComponent.inform Initializing spell checkers
[junit4:junit4]   2> 14849 T859 oass.DirectSolrSpellChecker.init init: {name=direct,classname=DirectSolrSpellChecker,field=lowerfilt,minQueryLength=3}
[junit4:junit4]   2> 14912 T862 oasc.SolrCore.registerSearcher [collection1] Registered new searcher Searcher@422ab6c4 main{StandardDirectoryReader(segments_1:1)}
[junit4:junit4]   2> 14918 T859 oasc.ZkController.publish publishing core=collection1 state=down
[junit4:junit4]   2> 14918 T859 oasc.ZkController.publish numShards not found on descriptor - reading it from system property
[junit4:junit4]   2> 15971 T793 oascc.ZkStateReader.updateClusterState Updating cloud state from ZooKeeper... 
[junit4:junit4]   2> 15972 T793 oasc.Overseer$ClusterStateUpdater.updateState Update state numShards=1 message={
[junit4:junit4]   2> 	  "operation":"state",
[junit4:junit4]   2> 	  "numShards":"1",
[junit4:junit4]   2> 	  "shard":null,
[junit4:junit4]   2> 	  "roles":null,
[junit4:junit4]   2> 	  "state":"down",
[junit4:junit4]   2> 	  "core":"collection1",
[junit4:junit4]   2> 	  "collection":"collection1",
[junit4:junit4]   2> 	  "node_name":"127.0.0.1:38485_ge_sm%2Fp",
[junit4:junit4]   2> 	  "base_url":"http://127.0.0.1:38485/ge_sm/p"}
[junit4:junit4]   2> 15972 T793 oasc.Overseer$ClusterStateUpdater.updateState Collection already exists with numShards=1
[junit4:junit4]   2> 15972 T793 oasc.Overseer$ClusterStateUpdater.updateState Assigning new node to shard shard=shard1
[junit4:junit4]   2> 16011 T826 oascc.ZkStateReader$2.process A cluster state change: WatchedEvent state:SyncConnected type:NodeDataChanged path:/clusterstate.json, has occurred - updating... (live nodes size: 5)
[junit4:junit4]   2> 16011 T858 oascc.ZkStateReader$2.process A cluster state change: WatchedEvent state:SyncConnected type:NodeDataChanged path:/clusterstate.json, has occurred - updating... (live nodes size: 5)
[junit4:junit4]   2> 16011 T798 oascc.ZkStateReader$2.process A cluster state change: WatchedEvent state:SyncConnected type:NodeDataChanged path:/clusterstate.json, has occurred - updating... (live nodes size: 5)
[junit4:junit4]   2> 16011 T792 oascc.ZkStateReader$2.process A cluster state change: WatchedEvent state:SyncConnected type:NodeDataChanged path:/clusterstate.json, has occurred - updating... (live nodes size: 5)
[junit4:junit4]   2> 16011 T842 oascc.ZkStateReader$2.process A cluster state change: WatchedEvent state:SyncConnected type:NodeDataChanged path:/clusterstate.json, has occurred - updating... (live nodes size: 5)
[junit4:junit4]   2> 16011 T811 oascc.ZkStateReader$2.process A cluster state change: WatchedEvent state:SyncConnected type:NodeDataChanged path:/clusterstate.json, has occurred - updating... (live nodes size: 5)
[junit4:junit4]   2> 16922 T859 oasc.CoreContainer.registerCore registering core: collection1
[junit4:junit4]   2> 16922 T859 oasc.ZkController.register Register replica - core:collection1 address:http://127.0.0.1:38485/ge_sm/p collection:collection1 shard:shard1
[junit4:junit4]   2> 16952 T859 oasc.ZkController.register We are http://127.0.0.1:38485/ge_sm/p/collection1/ and leader is http://127.0.0.1:38389/ge_sm/p/collection1/
[junit4:junit4]   2> 16952 T859 oasc.ZkController.register No LogReplay needed for core=collection1 baseURL=http://127.0.0.1:38485/ge_sm/p
[junit4:junit4]   2> 16952 T859 oasc.ZkController.checkRecovery Core needs to recover:collection1
[junit4:junit4]   2> 16952 T859 oasu.DefaultSolrCoreState.doRecovery Running recovery - first canceling any ongoing recovery
[junit4:junit4]   2> ASYNC  NEW_CORE C48 name=collection1 org.apache.solr.core.SolrCore@72d65e81 url=http://127.0.0.1:38485/ge_sm/p/collection1 node=127.0.0.1:38485_ge_sm%2Fp C48_STATE=coll:collection1 core:collection1 props:{shard=null, roles=null, state=down, core=collection1, collection=collection1, node_name=127.0.0.1:38485_ge_sm%2Fp, base_url=http://127.0.0.1:38485/ge_sm/p}
[junit4:junit4]   2> 16954 T863 C48 P38485 oasc.RecoveryStrategy.run Starting recovery process.  core=collection1 recoveringAfterStartup=true
[junit4:junit4]   2> 16954 T863 C48 P38485 oasc.RecoveryStrategy.doRecovery ###### startupVersions=[]
[junit4:junit4]   2> 16955 T859 oascc.ZkStateReader.updateClusterState Updating cloud state from ZooKeeper... 
[junit4:junit4]   2> 16955 T863 C48 P38485 oasc.ZkController.publish publishing core=collection1 state=recovering
[junit4:junit4]   2> 16955 T863 C48 P38485 oasc.ZkController.publish numShards not found on descriptor - reading it from system property
[junit4:junit4]   2> 16956 T770 oass.SolrDispatchFilter.init user.dir=/usr/home/hudson/hudson-slave/workspace/Lucene-Solr-Tests-4.x-java7/solr/build/solr-core/test/J0
[junit4:junit4]   2> 16956 T770 oass.SolrDispatchFilter.init SolrDispatchFilter.init() done
[junit4:junit4]   2> 16957 T770 oascsi.HttpClientUtil.createClient Creating new http client, config:maxConnections=128&maxConnectionsPerHost=32&followRedirects=false
[junit4:junit4]   2> 16959 T863 C48 P38485 oascsi.HttpClientUtil.createClient Creating new http client, config:maxConnections=128&maxConnectionsPerHost=32&followRedirects=false
[junit4:junit4]   2> 16975 T770 oascc.ZkStateReader.updateClusterState Updating cloud state from ZooKeeper... 
[junit4:junit4]   2> 16977 T770 oasc.AbstractFullDistribZkTestBase.waitForThingsToLevelOut Wait for recoveries to finish - wait 15 for each attempt
[junit4:junit4]   2> 16978 T770 oasc.AbstractDistribZkTestBase.waitForRecoveriesToFinish Wait for recoveries to finish - collection: collection1 failOnTimeout:true timeout (sec):15
[junit4:junit4]   2> 16979 T770 oascc.ZkStateReader.updateClusterState Updating cloud state from ZooKeeper... 
[junit4:junit4]   2>  C46_STATE=coll:collection1 core:collection1 props:{shard=shard1, roles=null, state=recovering, core=collection1, collection=collection1, node_name=127.0.0.1:38476_ge_sm%2Fp, base_url=http://127.0.0.1:38476/ge_sm/p}
[junit4:junit4]   2> 17463 T845 C46 P38476 oasc.RecoveryStrategy.doRecovery Attempting to PeerSync from http://127.0.0.1:38389/ge_sm/p/collection1/ core=collection1 - recoveringAfterStartup=true
[junit4:junit4]   2> 17463 T845 C46 P38476 oasu.PeerSync.sync PeerSync: core=collection1 url=http://127.0.0.1:38476/ge_sm/p START replicas=[http://127.0.0.1:38389/ge_sm/p/collection1/] nUpdates=100
[junit4:junit4]   2> 17464 T845 C46 P38476 oasu.PeerSync.sync WARNING no frame of reference to tell of we've missed updates
[junit4:junit4]   2> 17464 T845 C46 P38476 oasc.RecoveryStrategy.doRecovery PeerSync Recovery was not successful - trying replication. core=collection1
[junit4:junit4]   2> 17464 T845 C46 P38476 oasc.RecoveryStrategy.doRecovery Starting Replication Recovery. core=collection1
[junit4:junit4]   2> 17464 T845 C46 P38476 oasc.RecoveryStrategy.doRecovery Begin buffering updates. core=collection1
[junit4:junit4]   2> 17464 T845 C46 P38476 oasu.UpdateLog.bufferUpdates Starting to buffer updates. FSUpdateLog{state=ACTIVE, tlog=null}
[junit4:junit4]   2> 17465 T845 C46 P38476 oasc.RecoveryStrategy.replicate Attempting to replicate from http://127.0.0.1:38389/ge_sm/p/collection1/. core=collection1
[junit4:junit4]   2> 17465 T845 C46 P38476 oascsi.HttpClientUtil.createClient Creating new http client, config:maxConnections=128&maxConnectionsPerHost=32&followRedirects=false
[junit4:junit4]   2> 17467 T803 C47 P38389 REQ /get {getVersions=100&distrib=false&wt=javabin&qt=/get&version=2} status=0 QTime=0 
[junit4:junit4]   2> 17478 T807 C47 P38389 oasu.DirectUpdateHandler2.commit start commit{,optimize=false,openSearcher=false,waitSearcher=true,expungeDeletes=false,softCommit=false}
[junit4:junit4]   2> 17482 T807 C47 P38389 oasc.SolrDeletionPolicy.onCommit SolrDeletionPolicy.onCommit: commits:num=2
[junit4:junit4]   2> 		commit{dir=RateLimitedDirectoryWrapper(NRTCachingDirectory(org.apache.lucene.store.NIOFSDirectory@/usr/home/hudson/hudson-slave/workspace/Lucene-Solr-Tests-4.x-java7/solr/build/solr-core/test/J0/org.apache.solr.cloud.SyncSliceTest-1360595644881/jetty1/index lockFactory=org.apache.lucene.store.NativeFSLockFactory@737630f3; maxCacheMB=48.0 maxMergeSizeMB=4.0)),segFN=segments_2,generation=2,filenames=[segments_2]
[junit4:junit4]   2> 		commit{dir=RateLimitedDirectoryWrapper(NRTCachingDirectory(org.apache.lucene.store.NIOFSDirectory@/usr/home/hudson/hudson-slave/workspace/Lucene-Solr-Tests-4.x-java7/solr/build/solr-core/test/J0/org.apache.solr.cloud.SyncSliceTest-1360595644881/jetty1/index lockFactory=org.apache.lucene.store.NativeFSLockFactory@737630f3; maxCacheMB=48.0 maxMergeSizeMB=4.0)),segFN=segments_3,generation=3,filenames=[segments_3]
[junit4:junit4]   2> 17483 T807 C47 P38389 oasc.SolrDeletionPolicy.updateCommits newest commit = 3[segments_3]
[junit4:junit4]   2> 17484 T807 C47 P38389 oasc.CachingDirectoryFactory.close Releasing directory:/usr/home/hudson/hudson-slave/workspace/Lucene-Solr-Tests-4.x-java7/solr/build/solr-core/test/J0/./org.apache.solr.cloud.SyncSliceTest-1360595644881/jetty1
[junit4:junit4]   2> 17484 T807 C47 P38389 oasu.DirectUpdateHandler2.commit end_commit_flush
[junit4:junit4]   2> 17485 T807 C47 P38389 /update {waitSearcher=true&openSearcher=false&commit=true&wt=javabin&commit_end_point=true&version=2&softCommit=false} {commit=} 0 7
[junit4:junit4]   2> 17486 T845 C46 P38476 oash.ReplicationHandler.inform Commits will be reserved for  10000
[junit4:junit4]   2> 17486 T845 C46 P38476 oash.SnapPuller.<init>  No value set for 'pollInterval'. Timer Task not started.
[junit4:junit4]   2> 17489 T805 C47 P38389 REQ /replication {command=indexversion&qt=/replication&wt=javabin&version=2} status=0 QTime=0 
[junit4:junit4]   2> 17490 T845 C46 P38476 oash.SnapPuller.fetchLatestIndex Master's generation: 3
[junit4:junit4]   2> 17491 T845 C46 P38476 oash.SnapPuller.fetchLatestIndex Slave's generation: 1
[junit4:junit4]   2> 17491 T845 C46 P38476 oash.SnapPuller.fetchLatestIndex Starting replication process
[junit4:junit4]   2> 17493 T805 C47 P38389 oasc.CachingDirectoryFactory.close Releasing directory:/usr/home/hudson/hudson-slave/workspace/Lucene-Solr-Tests-4.x-java7/solr/build/solr-core/test/J0/./org.apache.solr.cloud.SyncSliceTest-1360595644881/jetty1
[junit4:junit4]   2> 17494 T805 C47 P38389 oasc.CachingDirectoryFactory.close Releasing directory:/usr/home/hudson/hudson-slave/workspace/Lucene-Solr-Tests-4.x-java7/solr/build/solr-core/test/J0/./org.apache.solr.cloud.SyncSliceTest-1360595644881/jetty1/index
[junit4:junit4]   2> 17494 T805 C47 P38389 REQ /replication {command=filelist&qt=/replication&wt=javabin&generation=3&version=2} status=0 QTime=1 
[junit4:junit4]   2> 17495 T845 C46 P38476 oash.SnapPuller.fetchLatestIndex Number of files in latest index in master: 1
[junit4:junit4]   2> 17496 T845 C46 P38476 oasc.CachingDirectoryFactory.get return new directory for /usr/home/hudson/hudson-slave/workspace/Lucene-Solr-Tests-4.x-java7/solr/build/solr-core/test/J0/./org.apache.solr.cloud.SyncSliceTest-1360595644881/jetty3/index.20130211171422371 forceNew:false
[junit4:junit4]   2> 17497 T845 C46 P38476 oasc.CachingDirectoryFactory.close Releasing directory:/usr/home/hudson/hudson-slave/workspace/Lucene-Solr-Tests-4.x-java7/solr/build/solr-core/test/J0/./org.apache.solr.cloud.SyncSliceTest-1360595644881/jetty3
[junit4:junit4]   2> 17498 T845 C46 P38476 oash.SnapPuller.fetchLatestIndex Starting download to RateLimitedDirectoryWrapper(NRTCachingDirectory(org.apache.lucene.store.NIOFSDirectory@/usr/home/hudson/hudson-slave/workspace/Lucene-Solr-Tests-4.x-java7/solr/build/solr-core/test/J0/org.apache.solr.cloud.SyncSliceTest-1360595644881/jetty3/index.20130211171422371 lockFactory=org.apache.lucene.store.NativeFSLockFactory@189df49e; maxCacheMB=48.0 maxMergeSizeMB=4.0)) fullCopy=true
[junit4:junit4]   2> 17501 T805 C47 P38389 REQ /replication {file=segments_3&command=filecontent&checksum=true&wt=filestream&qt=/replication&generation=3} status=0 QTime=0 
[junit4:junit4]   2> 17503 T845 C46 P38476 oasc.CachingDirectoryFactory.close Releasing directory:/usr/home/hudson/hudson-slave/workspace/Lucene-Solr-Tests-4.x-java7/solr/build/solr-core/test/J0/./org.apache.solr.cloud.SyncSliceTest-1360595644881/jetty3/index
[junit4:junit4]   2> 17503 T845 C46 P38476 oash.SnapPuller.fetchLatestIndex Total time taken for download : 0 secs
[junit4:junit4]   2> 17504 T845 C46 P38476 oash.SnapPuller.modifyIndexProps New index installed. Updating index properties... index=index.20130211171422371
[junit4:junit4]   2> 17505 T845 C46 P38476 oasc.CachingDirectoryFactory.close Releasing directory:/usr/home/hudson/hudson-slave/workspace/Lucene-Solr-Tests-4.x-java7/solr/build/solr-core/test/J0/./org.apache.solr.cloud.SyncSliceTest-1360595644881/jetty3
[junit4:junit4]   2> 17506 T845 C46 P38476 oasc.CachingDirectoryFactory.close Releasing directory:/usr/home/hudson/hudson-slave/workspace/Lucene-Solr-Tests-4.x-java7/solr/build/solr-core/test/J0/./org.apache.solr.cloud.SyncSliceTest-1360595644881/jetty3
[junit4:junit4]   2> 17506 T845 C46 P38476 oasc.SolrCore.getNewIndexDir New index directory detected: old=./org.apache.solr.cloud.SyncSliceTest-1360595644881/jetty3/index/ new=./org.apache.solr.cloud.SyncSliceTest-1360595644881/jetty3/index.20130211171422371
[junit4:junit4]   2> 17509 T845 C46 P38476 oasc.SolrDeletionPolicy.onInit SolrDeletionPolicy.onInit: commits:num=1
[junit4:junit4]   2> 		commit{dir=RateLimitedDirectoryWrapper(NRTCachingDirectory(org.apache.lucene.store.NIOFSDirectory@/usr/home/hudson/hudson-slave/workspace/Lucene-Solr-Tests-4.x-java7/solr/build/solr-core/test/J0/org.apache.solr.cloud.SyncSliceTest-1360595644881/jetty3/index.20130211171422371 lockFactory=org.apache.lucene.store.NativeFSLockFactory@189df49e; maxCacheMB=48.0 maxMergeSizeMB=4.0)),segFN=segments_3,generation=3,filenames=[segments_3]
[junit4:junit4]   2> 17510 T845 C46 P38476 oasc.SolrDeletionPolicy.updateCommits newest commit = 3[segments_3]
[junit4:junit4]   2> 17511 T845 C46 P38476 oasc.CachingDirectoryFactory.close Releasing directory:/usr/home/hudson/hudson-slave/workspace/Lucene-Solr-Tests-4.x-java7/solr/build/solr-core/test/J0/./org.apache.solr.cloud.SyncSliceTest-1360595644881/jetty3
[junit4:junit4]   2> 17512 T845 C46 P38476 oasu.DefaultSolrCoreState.newIndexWriter Creating new IndexWriter...
[junit4:junit4]   2> 17512 T845 C46 P38476 oasu.DefaultSolrCoreState.newIndexWriter Waiting until IndexWriter is unused... core=collection1
[junit4:junit4]   2> 17512 T845 C46 P38476 oasu.DefaultSolrCoreState.newIndexWriter Rollback old IndexWriter... core=collection1
[junit4:junit4]   2> 17513 T845 C46 P38476 oasc.CachingDirectoryFactory.close Releasing directory:/usr/home/hudson/hudson-slave/workspace/Lucene-Solr-Tests-4.x-java7/solr/build/solr-core/test/J0/./org.apache.solr.cloud.SyncSliceTest-1360595644881/jetty3/index.20130211171422371
[junit4:junit4]   2> 17514 T845 C46 P38476 oasc.CachingDirectoryFactory.close Releasing directory:/usr/home/hudson/hudson-slave/workspace/Lucene-Solr-Tests-4.x-java7/solr/build/solr-core/test/J0/./org.apache.solr.cloud.SyncSliceTest-1360595644881/jetty3
[junit4:junit4]   2> 17517 T845 C46 P38476 oasc.SolrDeletionPolicy.onInit SolrDeletionPolicy.onInit: commits:num=1
[junit4:junit4]   2> 		commit{dir=RateLimitedDirectoryWrapper(NRTCachingDirectory(org.apache.lucene.store.NIOFSDirectory@/usr/home/hudson/hudson-slave/workspace/Lucene-Solr-Tests-4.x-java7/solr/build/solr-core/test/J0/org.apache.solr.cloud.SyncSliceTest-1360595644881/jetty3/index.20130211171422371 lockFactory=org.apache.lucene.store.NativeFSLockFactory@189df49e; maxCacheMB=48.0 maxMergeSizeMB=4.0)),segFN=segments_3,generation=3,filenames=[segments_3]
[junit4:junit4]   2> 17517 T845 C46 P38476 oasc.SolrDeletionPolicy.updateCommits newest commit = 3[segments_3]
[junit4:junit4]   2> 17517 T793 oascc.ZkStateReader.updateClusterState Updating cloud state from ZooKeeper... 
[junit4:junit4]   2> 17518 T845 C46 P38476 oasu.DefaultSolrCoreState.newIndexWriter New IndexWriter is ready to be used.
[junit4:junit4]   2> 17518 T845 C46 P38476 oasc.CachingDirectoryFactory.close Releasing directory:/usr/home/hudson/hudson-slave/workspace/Lucene-Solr-Tests-4.x-java7/solr/build/solr-core/test/J0/./org.apache.solr.cloud.SyncSliceTest-1360595644881/jetty3
[junit4:junit4]   2> 17519 T793 oasc.Overseer$ClusterStateUpdater.updateState Update state numShards=1 message={
[junit4:junit4]   2> 	  "operation":"state",
[junit4:junit4]   2> 	  "numShards":"1",
[junit4:junit4]   2> 	  "shard":"shard1",
[junit4:junit4]   2> 	  "roles":null,
[junit4:junit4]   2> 	  "state":"recovering",
[junit4:junit4]   2> 	  "core":"collection1",
[junit4:junit4]   2> 	  "collection":"collection1",
[junit4:junit4]   2> 	  "node_name":"127.0.0.1:38485_ge_sm%2Fp",
[junit4:junit4]   2> 	  "base_url":"http://127.0.0.1:38485/ge_sm/p"}
[junit4:junit4]   2> 17519 T845 C46 P38476 oass.SolrIndexSearcher.<init> Opening Searcher@416ea3f2 main
[junit4:junit4]   2> 17521 T844 oasc.SolrCore.registerSearcher [collection1] Registered new searcher Searcher@416ea3f2 main{StandardDirectoryReader(segments_3:1:nrt)}
[junit4:junit4]   2> 17521 T844 oasc.CachingDirectoryFactory.close Releasing directory:/usr/home/hudson/hudson-slave/workspace/Lucene-Solr-Tests-4.x-java7/solr/build/solr-core/test/J0/./org.apache.solr.cloud.SyncSliceTest-1360595644881/jetty3/index
[junit4:junit4]   2> 17522 T845 C46 P38476 oasu.DirectUpdateHandler2.commit start commit{,optimize=false,openSearcher=false,waitSearcher=false,expungeDeletes=false,softCommit=false}
[junit4:junit4]   2> 17532 T826 oascc.ZkStateReader$2.process A cluster state change: WatchedEvent state:SyncConnected type:NodeDataChanged path:/clusterstate.json, has occurred - updating... (live nodes size: 5)
[junit4:junit4]   2> 17532 T798 oascc.ZkStateReader$2.process A cluster state change: WatchedEvent state:SyncConnected type:NodeDataChanged path:/clusterstate.json, has occurred - updating... (live nodes size: 5)
[junit4:junit4]   2> 17532 T858 oascc.ZkStateReader$2.process A cluster state change: WatchedEvent state:SyncConnected type:NodeDataChanged path:/clusterstate.json, has occurred - updating... (live nodes size: 5)
[junit4:junit4]   2> 17532 T842 oascc.ZkStateReader$2.process A cluster state change: WatchedEvent state:SyncConnected type:NodeDataChanged path:/clusterstate.json, has occurred - updating... (live nodes size: 5)
[junit4:junit4]   2> 17532 T792 oascc.ZkStateReader$2.process A cluster state change: WatchedEvent state:SyncConnected type:NodeDataChanged path:/clusterstate.json, has occurred - updating... (live nodes size: 5)
[junit4:junit4]   2> 17533 T845 C46 P38476 oasc.SolrDeletionPolicy.onCommit SolrDeletionPolicy.onCommit: commits:num=2
[junit4:junit4]   2> 		commit{dir=RateLimitedDirectoryWrapper(NRTCachingDirectory(org.apache.lucene.store.NIOFSDirectory@/usr/home/hudson/hudson-slave/workspace/Lucene-Solr-Tests-4.x-java7/solr/build/solr-core/test/J0/org.apache.solr.cloud.SyncSliceTest-1360595644881/jetty3/index.20130211171422371 lockFactory=org.apache.lucene.store.NativeFSLockFactory@189df49e; maxCacheMB=48.0 maxMergeSizeMB=4.0)),segFN=segments_3,generation=3,filenames=[segments_3]
[junit4:junit4]   2> 		commit{dir=RateLimitedDirectoryWrapper(NRTCachingDirectory(org.apache.lucene.store.NIOFSDirectory@/usr/home/hudson/hudson-slave/workspace/Lucene-Solr-Tests-4.x-java7/solr/build/solr-core/test/J0/org.apache.solr.cloud.SyncSliceTest-1360595644881/jetty3/index.20130211171422371 lockFactory=org.apache.lucene.store.NativeFSLockFactory@189df49e; maxCacheMB=48.0 maxMergeSizeMB=4.0)),segFN=segments_4,generation=4,filenames=[segments_4]
[junit4:junit4]   2> 17532 T811 oascc.ZkStateReader$2.process A cluster state change: WatchedEvent state:SyncConnected type:NodeDataChanged path:/clusterstate.json, has occurred - updating... (live nodes size: 5)
[junit4:junit4]   2> 17534 T845 C46 P38476 oasc.SolrDeletionPolicy.updateCommits newest commit = 4[segments_4]
[junit4:junit4]   2> 17535 T845 C46 P38476 oasc.CachingDirectoryFactory.close Releasing directory:/usr/home/hudson/hudson-slave/workspace/Lucene-Solr-Tests-4.x-java7/solr/build/solr-core/test/J0/./org.apache.solr.cloud.SyncSliceTest-1360595644881/jetty3
[junit4:junit4]   2> 17535 T845 C46 P38476 oasu.DirectUpdateHandler2.commit end_commit_flush
[junit4:junit4]   2> 17536 T845 C46 P38476 oasc.CachingDirectoryFactory.close Releasing directory:/usr/home/hudson/hudson-slave/workspace/Lucene-Solr-Tests-4.x-java7/solr/build/solr-core/test/J0/./org.apache.solr.cloud.SyncSliceTest-1360595644881/jetty3/index.20130211171422371
[junit4:junit4]   2> 17536 T845 C46 P38476 oasc.CachingDirectoryFactory.close Releasing directory:/usr/home/hudson/hudson-slave/workspace/Lucene-Solr-Tests-4.x-java7/solr/build/solr-core/test/J0/./org.apache.solr.cloud.SyncSliceTest-1360595644881/jetty3/index
[junit4:junit4]   2> 17536 T845 C46 P38476 oasc.RecoveryStrategy.replay No replay needed. core=collection1
[junit4:junit4]   2> 17536 T845 C46 P38476 oasc.RecoveryStrategy.doRecovery Replication Recovery was successful - registering as Active. core=collection1
[junit4:junit4]   2> 17537 T845 C46 P38476 oasc.ZkController.publish publishing core=collection1 state=active
[junit4:junit4]   2> 17537 T845 C46 P38476 oasc.ZkController.publish numShards not found on descriptor - reading it from system property
[junit4:junit4]   2> 17542 T845 C46 P38476 oasc.RecoveryStrategy.doRecovery Finished recovery process. core=collection1
[junit4:junit4]   2> 17981 T770 oascc.ZkStateReader.updateClusterState Updating cloud state from ZooKeeper... 
[junit4:junit4]   2> 18985 T770 oascc.ZkStateReader.updateClusterState Updating cloud state from ZooKeeper... 
[junit4:junit4]   2> 19045 T793 oascc.ZkStateReader.updateClusterState Updating cloud state from ZooKeeper... 
[junit4:junit4]   2> 19046 T793 oasc.Overseer$ClusterStateUpdater.updateState Update state numShards=1 message={
[junit4:junit4]   2> 	  "operation":"state",
[junit4:junit4]   2> 	  "numShards":"1",
[junit4:junit4]   2> 	  "shard":"shard1",
[junit4:junit4]   2> 	  "roles":null,
[junit4:junit4]   2> 	  "state":"active",
[junit4:junit4]   2> 	  "core":"collection1",
[junit4:junit4]   2> 	  "collection":"collection1",
[junit4:junit4]   2> 	  "node_name":"127.0.0.1:38476_ge_sm%2Fp",
[junit4:junit4]   2> 	  "base_url":"http://127.0.0.1:38476/ge_sm/p"}
[junit4:junit4]   2> 19068 T826 oascc.ZkStateReader$2.process A cluster state change: WatchedEvent state:SyncConnected type:NodeDataChanged path:/clusterstate.json, has occurred - updating... (live nodes size: 5)
[junit4:junit4]   2> 19068 T842 oascc.ZkStateReader$2.process A cluster state change: WatchedEvent state:SyncConnected type:NodeDataChanged path:/clusterstate.json, has occurred - updating... (live nodes size: 5)
[junit4:junit4]   2> 19068 T792 oascc.ZkStateReader$2.process A cluster state change: WatchedEvent state:SyncConnected type:NodeDataChanged path:/clusterstate.json, has occurred - updating... (live nodes size: 5)
[junit4:junit4]   2> 19068 T858 oascc.ZkStateReader$2.process A cluster state change: WatchedEvent state:SyncConnected type:NodeDataChanged path:/clusterstate.json, has occurred - updating... (live nodes size: 5)
[junit4:junit4]   2> 19068 T798 oascc.ZkStateReader$2.process A cluster state change: WatchedEvent state:SyncConnected type:NodeDataChanged path:/clusterstate.json, has occurred - updating... (live nodes size: 5)
[junit4:junit4]   2> 19068 T811 oascc.ZkStateReader$2.process A cluster state change: WatchedEvent state:SyncConnected type:NodeDataChanged path:/clusterstate.json, has occurred - updating... (live nodes size: 5)
[junit4:junit4]   2>  C48_STATE=coll:collection1 core:collection1 props:{shard=shard1, roles=null, state=recovering, core=collection1, collection=collection1, node_name=127.0.0.1:38485_ge_sm%2Fp, base_url=http://127.0.0.1:38485/ge_sm/p}
[junit4:junit4]   2> 19978 T863 C48 P38485 oasc.RecoveryStrategy.doRecovery Attempting to PeerSync from http://127.0.0.1:38389/ge_sm/p/collection1/ core=collection1 - recoveringAfterStartup=true
[junit4:junit4]   2> 19978 T863 C48 P38485 oasu.PeerSync.sync PeerSync: core=collection1 url=http://127.0.0.1:38485/ge_sm/p START replicas=[http://127.0.0.1:38389/ge_sm/p/collection1/] nUpdates=100
[junit4:junit4]   2> 19979 T863 C48 P38485 oasu.PeerSync.sync WARNING no frame of reference to tell of we've missed updates
[junit4:junit4]   2> 19979 T863 C48 P38485 oasc.RecoveryStrategy.doRecovery PeerSync Recovery was not successful - trying replication. core=collection1
[junit4:junit4]   2> 19979 T863 C48 P38485 oasc.RecoveryStrategy.doRecovery Starting Replication Recovery. core=collection1
[junit4:junit4]   2> 19979 T863 C48 P38485 oasc.RecoveryStrategy.doRecovery Begin buffering updates. core=collection1
[junit4:junit4]   2> 19979 T863 C48 P38485 oasu.UpdateLog.bufferUpdates Starting to buffer updates. FSUpdateLog{state=ACTIVE, tlog=null}
[junit4:junit4]   2> 19980 T863 C48 P38485 oasc.RecoveryStrategy.replicate Attempting to replicate from http://127.0.0.1:38389/ge_sm/p/collection1/. core=collection1
[junit4:junit4]   2> 19980 T863 C48 P38485 oascsi.HttpClientUtil.createClient Creating new http client, config:maxConnections=128&maxConnectionsPerHost=32&followRedirects=false
[junit4:junit4]   2> 19982 T803 C47 P38389 REQ /get {getVersions=100&distrib=false&wt=javabin&qt=/get&version=2} status=0 QTime=1 
[junit4:junit4]   2> 19987 T770 oascc.ZkStateReader.updateClusterState Updating cloud state from ZooKeeper... 
[junit4:junit4]   2> 19999 T801 C47 P38389 oasu.DirectUpdateHandler2.commit start commit{,optimize=false,openSearcher=false,waitSearcher=true,expungeDeletes=false,softCommit=false}
[junit4:junit4]   2> 20032 T801 C47 P38389 oasc.SolrDeletionPolicy.onCommit SolrDeletionPolicy.onCommit: commits:num=3
[junit4:junit4]   2> 		commit{dir=RateLimitedDirectoryWrapper(NRTCachingDirectory(org.apache.lucene.store.NIOFSDirectory@/usr/home/hudson/hudson-slave/workspace/Lucene-Solr-Tests-4.x-java7/solr/build/solr-core/test/J0/org.apache.solr.cloud.SyncSliceTest-1360595644881/jetty1/index lockFactory=org.apache.lucene.store.NativeFSLockFactory@737630f3; maxCacheMB=48.0 maxMergeSizeMB=4.0)),segFN=segments_2,generation=2,filenames=[segments_2]
[junit4:junit4]   2> 		commit{dir=RateLimitedDirectoryWrapper(NRTCachingDirectory(org.apache.lucene.store.NIOFSDirectory@/usr/home/hudson/hudson-slave/workspace/Lucene-Solr-Tests-4.x-java7/solr/build/solr-core/test/J0/org.apache.solr.cloud.SyncSliceTest-1360595644881/jetty1/index lockFactory=org.apache.lucene.store.NativeFSLockFactory@737630f3; maxCacheMB=48.0 maxMergeSizeMB=4.0)),segFN=segments_3,generation=3,filenames=[segments_3]
[junit4:junit4]   2> 		commit{dir=RateLimitedDirectoryWrapper(NRTCachingDirectory(org.apache.lucene.store.NIOFSDirectory@/usr/home/hudson/hudson-slave/workspace/Lucene-Solr-Tests-4.x-java7/solr/build/solr-core/test/J0/org.apache.solr.cloud.SyncSliceTest-1360595644881/jetty1/index lockFactory=org.apache.lucene.store.NativeFSLockFactory@737630f3; maxCacheMB=48.0 maxMergeSizeMB=4.0)),segFN=segments_4,generation=4,filenames=[segments_4]
[junit4:junit4]   2> 20033 T801 C47 P38389 oasc.SolrDeletionPolicy.updateCommits newest commit = 4[segments_4]
[junit4:junit4]   2> 20034 T801 C47 P38389 oasc.CachingDirectoryFactory.close Releasing directory:/usr/home/hudson/hudson-slave/workspace/Lucene-Solr-Tests-4.x-java7/solr/build/solr-core/test/J0/./org.apache.solr.cloud.SyncSliceTest-1360595644881/jetty1
[junit4:junit4]   2> 20035 T801 C47 P38389 oasu.DirectUpdateHandler2.commit end_commit_flush
[junit4:junit4]   2> 20035 T801 C47 P38389 /update {waitSearcher=true&openSearcher=false&commit=true&wt=javabin&commit_end_point=true&version=2&softCommit=false} {commit=} 0 36
[junit4:junit4]   2> 20036 T863 C48 P38485 oash.ReplicationHandler.inform Commits will be reserved for  10000
[junit4:junit4]   2> 20036 T863 C48 P38485 oash.SnapPuller.<init>  No value set for 'pollInterval'. Timer Task not started.
[junit4:junit4]   2> 20039 T805 C47 P38389 REQ /replication {command=indexversion&qt=/replication&wt=javabin&version=2} status=0 QTime=0 
[junit4:junit4]   2> 20040 T863 C48 P38485 oash.SnapPuller.fetchLatestIndex Master's generation: 4
[junit4:junit4]   2> 20040 T863 C48 P38485 oash.SnapPuller.fetchLatestIndex Slave's generation: 1
[junit4:junit4]   2> 20041 T863 C48 P38485 oash.SnapPuller.fetchLatestIndex Starting replication process
[junit4:junit4]   2> 20043 T805 C47 P38389 oasc.CachingDirectoryFactory.close Releasing directory:/usr/home/hudson/hudson-slave/workspace/Lucene-Solr-Tests-4.x-java7/solr/build/solr-core/test/J0/./org.apache.solr.cloud.SyncSliceTest-1360595644881/jetty1
[junit4:junit4]   2> 20044 T805 C47 P38389 oasc.CachingDirectoryFactory.close Releasing directory:/usr/home/hudson/hudson-slave/workspace/Lucene-Solr-Tests-4.x-java7/solr/build/solr-core/test/J0/./org.apache.solr.cloud.SyncSliceTest-1360595644881/jetty1/index
[junit4:junit4]   2> 20045 T805 C47 P38389 REQ /replication {command=filelist&qt=/replication&wt=javabin&generation=4&version=2} status=0 QTime=2 
[junit4:junit4]   2> 20046 T863 C48 P38485 oash.SnapPuller.fetchLatestIndex Number of files in latest index in master: 1
[junit4:junit4]   2> 20047 T863 C48 P38485 oasc.CachingDirectoryFactory.get return new directory for /usr/home/hudson/hudson-slave/workspace/Lucene-Solr-Tests-4.x-java7/solr/build/solr-core/test/J0/./org.apache.solr.cloud.SyncSliceTest-1360595644881/jetty4/index.20130211171424921 forceNew:false
[junit4:junit4]   2> 20048 T863 C48 P38485 oasc.CachingDirectoryFactory.close Releasing directory:/usr/home/hudson/hudson-slave/workspace/Lucene-Solr-Tests-4.x-java7/solr/build/solr-core/test/J0/./org.apache.solr.cloud.SyncSliceTest-1360595644881/jetty4
[junit4:junit4]   2> 20049 T863 C48 P38485 oash.SnapPuller.fetchLatestIndex Starting download to RateLimitedDirectoryWrapper(NRTCachingDirectory(org.apache.lucene.store.NIOFSDirectory@/usr/home/hudson/hudson-slave/workspace/Lucene-Solr-Tests-4.x-java7/solr/build/solr-core/test/J0/org.apache.solr.cloud.SyncSliceTest-1360595644881/jetty4/index.20130211171424921 lockFactory=org.apache.lucene.store.NativeFSLockFactory@1cabcb55; maxCacheMB=48.0 maxMergeSizeMB=4.0)) fullCopy=true
[junit4:junit4]   2> 20052 T805 C47 P38389 REQ /replication {file=segments_4&command=filecontent&checksum=true&wt=filestream&qt=/replication&generation=4} status=0 QTime=0 
[junit4:junit4]   2> 20054 T863 C48 P38485 oasc.CachingDirectoryFactory.close Releasing directory:/usr/home/hudson/hudson-slave/workspace/Lucene-Solr-Tests-4.x-java7/solr/build/solr-core/test/J0/./org.apache.solr.cloud.SyncSliceTest-1360595644881/jetty4/index
[junit4:junit4]   2> 20054 T863 C48 P38485 oash.SnapPuller.fetchLatestIndex Total time taken for download : 0 secs
[junit4:junit4]   2> 20057 T863 C48 P38485 oash.SnapPuller.modifyIndexProps New index installed. Updating index properties... index=index.20130211171424921
[junit4:junit4]   2> 20059 T863 C48 P38485 oasc.CachingDirectoryFactory.close Releasing directory:/usr/home/hudson/hudson-slave/workspace/Lucene-Solr-Tests-4.x-java7/solr/build/solr-core/test/J0/./org.apache.solr.cloud.SyncSliceTest-1360595644881/jetty4
[junit4:junit4]   2> 20060 T863 C48 P38485 oasc.CachingDirectoryFactory.close Releasing directory:/usr/home/hudson/hudson-slave/workspace/Lucene-Solr-Tests-4.x-java7/solr/build/solr-core/test/J0/./org.apache.solr.cloud.SyncSliceTest-1360595644881/jetty4
[junit4:junit4]   2> 20060 T863 C48 P38485 oasc.SolrCore.getNewIndexDir New index directory detected: old=./org.apache.solr.cloud.SyncSliceTest-1360595644881/jetty4/index/ new=./org.apache.solr.cloud.SyncSliceTest-1360595644881/jetty4/index.20130211171424921
[junit4:junit4]   2> 20064 T863 C48 P38485 oasc.SolrDeletionPolicy.onInit SolrDeletionPolicy.onInit: commits:num=1
[junit4:junit4]   2> 		commit{dir=RateLimitedDirectoryWrapper(NRTCachingDirectory(org.apache.lucene.store.NIOFSDirectory@/usr/home/hudson/hudson-slave/workspace/Lucene-Solr-Tests-4.x-java7/solr/build/solr-co

[...truncated too long message...]

360595644881/jetty4/index
[junit4:junit4]   2> 855043 T770 oasc.CachingDirectoryFactory.closeDirectory Closing directory:/usr/home/hudson/hudson-slave/workspace/Lucene-Solr-Tests-4.x-java7/solr/build/solr-core/test/J0/./org.apache.solr.cloud.SyncSliceTest-1360595644881/jetty4/index
[junit4:junit4]   2> 855044 T770 oasc.CachingDirectoryFactory.close Closing directory when closing factory:/usr/home/hudson/hudson-slave/workspace/Lucene-Solr-Tests-4.x-java7/solr/build/solr-core/test/J0/./org.apache.solr.cloud.SyncSliceTest-1360595644881/jetty4
[junit4:junit4]   2> 855044 T770 oasc.CachingDirectoryFactory.closeDirectory Closing directory:/usr/home/hudson/hudson-slave/workspace/Lucene-Solr-Tests-4.x-java7/solr/build/solr-core/test/J0/./org.apache.solr.cloud.SyncSliceTest-1360595644881/jetty4
[junit4:junit4]   2> 867328 T858 oaz.ClientCnxn$EventThread.run EventThread shut down
[junit4:junit4]   2> 867328 T770 oaz.ZooKeeper.close Session: 0x13cc9d1f1d8000c closed
[junit4:junit4]   2> 867532 T770 oejsh.ContextHandler.doStop stopped o.e.j.s.ServletContextHandler{/ge_sm/p,null}
[junit4:junit4]   2> 867689 T770 oas.SolrTestCaseJ4.tearDown ###Ending testDistribSearch
[junit4:junit4]   1> client port:0.0.0.0/0.0.0.0:0
[junit4:junit4]   2> NOTE: reproduce with: ant test  -Dtestcase=SyncSliceTest -Dtests.method=testDistribSearch -Dtests.seed=A31F98F1A771B2E9 -Dtests.multiplier=3 -Dtests.slow=true -Dtests.locale=en_PH -Dtests.timezone=Etc/GMT-2 -Dtests.file.encoding=US-ASCII
[junit4:junit4] FAILURE  868s J0 | SyncSliceTest.testDistribSearch <<<
[junit4:junit4]    > Throwable #1: java.lang.AssertionError: Test Setup Failure: shard1 should have just been set up to be inconsistent - but it's still consistent. Leader:http://127.0.0.1:38453/ge_sm/p/collection1skip list:[org.apache.solr.cloud.AbstractFullDistribZkTestBase$CloudJettyRunner@349cb170, org.apache.solr.cloud.AbstractFullDistribZkTestBase$CloudJettyRunner@4c6a74ad]
[junit4:junit4]    > 	at __randomizedtesting.SeedInfo.seed([A31F98F1A771B2E9:22F916E9D02ED2D5]:0)
[junit4:junit4]    > 	at org.junit.Assert.fail(Assert.java:93)
[junit4:junit4]    > 	at org.junit.Assert.assertTrue(Assert.java:43)
[junit4:junit4]    > 	at org.junit.Assert.assertNotNull(Assert.java:526)
[junit4:junit4]    > 	at org.apache.solr.cloud.SyncSliceTest.doTest(SyncSliceTest.java:216)
[junit4:junit4]    > 	at org.apache.solr.BaseDistributedSearchTestCase.testDistribSearch(BaseDistributedSearchTestCase.java:794)
[junit4:junit4]    > 	at sun.reflect.NativeMethodAccessorImpl.invoke0(Native Method)
[junit4:junit4]    > 	at sun.reflect.NativeMethodAccessorImpl.invoke(NativeMethodAccessorImpl.java:57)
[junit4:junit4]    > 	at sun.reflect.DelegatingMethodAccessorImpl.invoke(DelegatingMethodAccessorImpl.java:43)
[junit4:junit4]    > 	at java.lang.reflect.Method.invoke(Method.java:601)
[junit4:junit4]    > 	at com.carrotsearch.randomizedtesting.RandomizedRunner.invoke(RandomizedRunner.java:1559)
[junit4:junit4]    > 	at com.carrotsearch.randomizedtesting.RandomizedRunner.access$600(RandomizedRunner.java:79)
[junit4:junit4]    > 	at com.carrotsearch.randomizedtesting.RandomizedRunner$6.evaluate(RandomizedRunner.java:737)
[junit4:junit4]    > 	at com.carrotsearch.randomizedtesting.RandomizedRunner$7.evaluate(RandomizedRunner.java:773)
[junit4:junit4]    > 	at com.carrotsearch.randomizedtesting.RandomizedRunner$8.evaluate(RandomizedRunner.java:787)
[junit4:junit4]    > 	at com.carrotsearch.randomizedtesting.rules.SystemPropertiesRestoreRule$1.evaluate(SystemPropertiesRestoreRule.java:53)
[junit4:junit4]    > 	at org.apache.lucene.util.TestRuleSetupTeardownChained$1.evaluate(TestRuleSetupTeardownChained.java:50)
[junit4:junit4]    > 	at org.apache.lucene.util.TestRuleFieldCacheSanity$1.evaluate(TestRuleFieldCacheSanity.java:51)
[junit4:junit4]    > 	at org.apache.lucene.util.AbstractBeforeAfterRule$1.evaluate(AbstractBeforeAfterRule.java:46)
[junit4:junit4]    > 	at com.carrotsearch.randomizedtesting.rules.SystemPropertiesInvariantRule$1.evaluate(SystemPropertiesInvariantRule.java:55)
[junit4:junit4]    > 	at org.apache.lucene.util.TestRuleThreadAndTestName$1.evaluate(TestRuleThreadAndTestName.java:49)
[junit4:junit4]    > 	at org.apache.lucene.util.TestRuleIgnoreAfterMaxFailures$1.evaluate(TestRuleIgnoreAfterMaxFailures.java:70)
[junit4:junit4]    > 	at org.apache.lucene.util.TestRuleMarkFailure$1.evaluate(TestRuleMarkFailure.java:48)
[junit4:junit4]    > 	at com.carrotsearch.randomizedtesting.rules.StatementAdapter.evaluate(StatementAdapter.java:36)
[junit4:junit4]    > 	at com.carrotsearch.randomizedtesting.ThreadLeakControl$StatementRunner.run(ThreadLeakControl.java:358)
[junit4:junit4]    > 	at com.carrotsearch.randomizedtesting.ThreadLeakControl.forkTimeoutingTask(ThreadLeakControl.java:782)
[junit4:junit4]    > 	at com.carrotsearch.randomizedtesting.ThreadLeakControl$3.evaluate(ThreadLeakControl.java:442)
[junit4:junit4]    > 	at com.carrotsearch.randomizedtesting.RandomizedRunner.runSingleTest(RandomizedRunner.java:746)
[junit4:junit4]    > 	at com.carrotsearch.randomizedtesting.RandomizedRunner$3.evaluate(RandomizedRunner.java:648)
[junit4:junit4]    > 	at com.carrotsearch.randomizedtesting.RandomizedRunner$4.evaluate(RandomizedRunner.java:682)
[junit4:junit4]    > 	at com.carrotsearch.randomizedtesting.RandomizedRunner$5.evaluate(RandomizedRunner.java:693)
[junit4:junit4]    > 	at com.carrotsearch.randomizedtesting.rules.StatementAdapter.evaluate(StatementAdapter.java:36)
[junit4:junit4]    > 	at com.carrotsearch.randomizedtesting.rules.SystemPropertiesRestoreRule$1.evaluate(SystemPropertiesRestoreRule.java:53)
[junit4:junit4]    > 	at org.apache.lucene.util.AbstractBeforeAfterRule$1.evaluate(AbstractBeforeAfterRule.java:46)
[junit4:junit4]    > 	at org.apache.lucene.util.TestRuleStoreClassName$1.evaluate(TestRuleStoreClassName.java:42)
[junit4:junit4]    > 	at com.carrotsearch.randomizedtesting.rules.SystemPropertiesInvariantRule$1.evaluate(SystemPropertiesInvariantRule.java:55)
[junit4:junit4]    > 	at com.carrotsearch.randomizedtesting.rules.NoShadowingOrOverridesOnMethodsRule$1.evaluate(NoShadowingOrOverridesOnMethodsRule.java:39)
[junit4:junit4]    > 	at com.carrotsearch.randomizedtesting.rules.NoShadowingOrOverridesOnMethodsRule$1.evaluate(NoShadowingOrOverridesOnMethodsRule.java:39)
[junit4:junit4]    > 	at com.carrotsearch.randomizedtesting.rules.StatementAdapter.evaluate(StatementAdapter.java:36)
[junit4:junit4]    > 	at org.apache.lucene.util.TestRuleAssertionsRequired$1.evaluate(TestRuleAssertionsRequired.java:43)
[junit4:junit4]    > 	at org.apache.lucene.util.TestRuleMarkFailure$1.evaluate(TestRuleMarkFailure.java:48)
[junit4:junit4]    > 	at org.apache.lucene.util.TestRuleIgnoreAfterMaxFailures$1.evaluate(TestRuleIgnoreAfterMaxFailures.java:70)
[junit4:junit4]    > 	at org.apache.lucene.util.TestRuleIgnoreTestSuites$1.evaluate(TestRuleIgnoreTestSuites.java:55)
[junit4:junit4]    > 	at com.carrotsearch.randomizedtesting.rules.StatementAdapter.evaluate(StatementAdapter.java:36)
[junit4:junit4]    > 	at com.carrotsearch.randomizedtesting.ThreadLeakControl$StatementRunner.run(ThreadLeakControl.java:358)
[junit4:junit4]    > 	at java.lang.Thread.run(Thread.java:722)
[junit4:junit4]   2> 867705 T770 oas.SolrTestCaseJ4.deleteCore ###deleteCore
[junit4:junit4]   2> NOTE: test params are: codec=Asserting, sim=DefaultSimilarity, locale=en_PH, timezone=Etc/GMT-2
[junit4:junit4]   2> NOTE: FreeBSD 9.0-RELEASE amd64/Oracle Corporation 1.7.0_09 (64-bit)/cpus=16,threads=2,free=121494432,total=268435456
[junit4:junit4]   2> NOTE: All tests run in this JVM: [TestRangeQuery, JSONWriterTest, SpellCheckComponentTest, TestSolrIndexConfig, TestExtendedDismaxParser, TestIndexSearcher, SpellCheckCollatorTest, DirectUpdateHandlerOptimizeTest, SuggesterFSTTest, DistributedTermsComponentTest, MinimalSchemaTest, PluginInfoTest, BadComponentTest, SuggesterWFSTTest, TestStressRecovery, CSVRequestHandlerTest, TestBadConfig, DirectSolrConnectionTest, TestSearchPerf, ChaosMonkeyNothingIsSafeTest, TestPartialUpdateDeduplication, DateMathParserTest, TestLMDirichletSimilarityFactory, ResourceLoaderTest, CopyFieldTest, TestWordDelimiterFilterFactory, ShardRoutingCustomTest, MBeansHandlerTest, TestStressReorder, WordBreakSolrSpellCheckerTest, UniqFieldsUpdateProcessorFactoryTest, CoreContainerCoreInitFailuresTest, TestRandomFaceting, TermVectorComponentDistributedTest, AlternateDirectoryTest, UpdateRequestProcessorFactoryTest, TermsComponentTest, FastVectorHighlighterTest, CacheHeaderTest, TestPostingsSolrHighlighter, CurrencyFieldTest, TestNumberUtils, RegexBoostProcessorTest, SyncSliceTest]
[junit4:junit4] Completed on J0 in 867.73s, 1 test, 1 failure <<< FAILURES!

[...truncated 169 lines...]
BUILD FAILED
/usr/home/hudson/hudson-slave/workspace/Lucene-Solr-Tests-4.x-java7/build.xml:381: The following error occurred while executing this line:
/usr/home/hudson/hudson-slave/workspace/Lucene-Solr-Tests-4.x-java7/build.xml:361: The following error occurred while executing this line:
/usr/home/hudson/hudson-slave/workspace/Lucene-Solr-Tests-4.x-java7/build.xml:39: The following error occurred while executing this line:
/usr/home/hudson/hudson-slave/workspace/Lucene-Solr-Tests-4.x-java7/solr/build.xml:183: The following error occurred while executing this line:
/usr/home/hudson/hudson-slave/workspace/Lucene-Solr-Tests-4.x-java7/solr/common-build.xml:447: The following error occurred while executing this line:
/usr/home/hudson/hudson-slave/workspace/Lucene-Solr-Tests-4.x-java7/lucene/common-build.xml:1202: The following error occurred while executing this line:
/usr/home/hudson/hudson-slave/workspace/Lucene-Solr-Tests-4.x-java7/lucene/common-build.xml:865: There were test failures: 251 suites, 1043 tests, 1 failure, 23 ignored (5 assumptions)

Total time: 51 minutes 30 seconds
Build step 'Invoke Ant' marked build as failure
Archiving artifacts
Recording test results
Email was triggered for: Failure
Sending email for trigger: Failure



Mime
View raw message