lucene-dev mailing list archives

Site index · List index
Message view « Date » · « Thread »
Top « Date » · « Thread »
From Policeman Jenkins Server <jenk...@thetaphi.de>
Subject [JENKINS] Lucene-Solr-trunk-MacOSX (64bit/jdk1.7.0) - Build # 173 - Failure!
Date Sat, 02 Feb 2013 14:27:24 GMT
Build: http://jenkins.thetaphi.de/job/Lucene-Solr-trunk-MacOSX/173/
Java: 64bit/jdk1.7.0 -XX:+UseParallelGC

1 tests failed.
REGRESSION:  org.apache.solr.cloud.BasicDistributedZkTest.testDistribSearch

Error Message:
There are still nodes recoverying - waited for 230 seconds

Stack Trace:
java.lang.AssertionError: There are still nodes recoverying - waited for 230 seconds
	at __randomizedtesting.SeedInfo.seed([F6AEDF8B2527516A:7748519352783156]:0)
	at org.junit.Assert.fail(Assert.java:93)
	at org.apache.solr.cloud.AbstractDistribZkTestBase.waitForRecoveriesToFinish(AbstractDistribZkTestBase.java:168)
	at org.apache.solr.cloud.AbstractDistribZkTestBase.waitForRecoveriesToFinish(AbstractDistribZkTestBase.java:126)
	at org.apache.solr.cloud.AbstractDistribZkTestBase.waitForRecoveriesToFinish(AbstractDistribZkTestBase.java:121)
	at org.apache.solr.cloud.BasicDistributedZkTest.testANewCollectionInOneInstance(BasicDistributedZkTest.java:1107)
	at org.apache.solr.cloud.BasicDistributedZkTest.doTest(BasicDistributedZkTest.java:329)
	at org.apache.solr.BaseDistributedSearchTestCase.testDistribSearch(BaseDistributedSearchTestCase.java:794)
	at sun.reflect.NativeMethodAccessorImpl.invoke0(Native Method)
	at sun.reflect.NativeMethodAccessorImpl.invoke(NativeMethodAccessorImpl.java:57)
	at sun.reflect.DelegatingMethodAccessorImpl.invoke(DelegatingMethodAccessorImpl.java:43)
	at java.lang.reflect.Method.invoke(Method.java:601)
	at com.carrotsearch.randomizedtesting.RandomizedRunner.invoke(RandomizedRunner.java:1559)
	at com.carrotsearch.randomizedtesting.RandomizedRunner.access$600(RandomizedRunner.java:79)
	at com.carrotsearch.randomizedtesting.RandomizedRunner$6.evaluate(RandomizedRunner.java:737)
	at com.carrotsearch.randomizedtesting.RandomizedRunner$7.evaluate(RandomizedRunner.java:773)
	at com.carrotsearch.randomizedtesting.RandomizedRunner$8.evaluate(RandomizedRunner.java:787)
	at com.carrotsearch.randomizedtesting.rules.SystemPropertiesRestoreRule$1.evaluate(SystemPropertiesRestoreRule.java:53)
	at org.apache.lucene.util.TestRuleSetupTeardownChained$1.evaluate(TestRuleSetupTeardownChained.java:50)
	at org.apache.lucene.util.TestRuleFieldCacheSanity$1.evaluate(TestRuleFieldCacheSanity.java:51)
	at org.apache.lucene.util.AbstractBeforeAfterRule$1.evaluate(AbstractBeforeAfterRule.java:46)
	at com.carrotsearch.randomizedtesting.rules.SystemPropertiesInvariantRule$1.evaluate(SystemPropertiesInvariantRule.java:55)
	at org.apache.lucene.util.TestRuleThreadAndTestName$1.evaluate(TestRuleThreadAndTestName.java:49)
	at org.apache.lucene.util.TestRuleIgnoreAfterMaxFailures$1.evaluate(TestRuleIgnoreAfterMaxFailures.java:70)
	at org.apache.lucene.util.TestRuleMarkFailure$1.evaluate(TestRuleMarkFailure.java:48)
	at com.carrotsearch.randomizedtesting.rules.StatementAdapter.evaluate(StatementAdapter.java:36)
	at com.carrotsearch.randomizedtesting.ThreadLeakControl$StatementRunner.run(ThreadLeakControl.java:358)
	at com.carrotsearch.randomizedtesting.ThreadLeakControl.forkTimeoutingTask(ThreadLeakControl.java:782)
	at com.carrotsearch.randomizedtesting.ThreadLeakControl$3.evaluate(ThreadLeakControl.java:442)
	at com.carrotsearch.randomizedtesting.RandomizedRunner.runSingleTest(RandomizedRunner.java:746)
	at com.carrotsearch.randomizedtesting.RandomizedRunner$3.evaluate(RandomizedRunner.java:648)
	at com.carrotsearch.randomizedtesting.RandomizedRunner$4.evaluate(RandomizedRunner.java:682)
	at com.carrotsearch.randomizedtesting.RandomizedRunner$5.evaluate(RandomizedRunner.java:693)
	at com.carrotsearch.randomizedtesting.rules.StatementAdapter.evaluate(StatementAdapter.java:36)
	at com.carrotsearch.randomizedtesting.rules.SystemPropertiesRestoreRule$1.evaluate(SystemPropertiesRestoreRule.java:53)
	at org.apache.lucene.util.AbstractBeforeAfterRule$1.evaluate(AbstractBeforeAfterRule.java:46)
	at org.apache.lucene.util.TestRuleStoreClassName$1.evaluate(TestRuleStoreClassName.java:42)
	at com.carrotsearch.randomizedtesting.rules.SystemPropertiesInvariantRule$1.evaluate(SystemPropertiesInvariantRule.java:55)
	at com.carrotsearch.randomizedtesting.rules.NoShadowingOrOverridesOnMethodsRule$1.evaluate(NoShadowingOrOverridesOnMethodsRule.java:39)
	at com.carrotsearch.randomizedtesting.rules.NoShadowingOrOverridesOnMethodsRule$1.evaluate(NoShadowingOrOverridesOnMethodsRule.java:39)
	at com.carrotsearch.randomizedtesting.rules.StatementAdapter.evaluate(StatementAdapter.java:36)
	at org.apache.lucene.util.TestRuleAssertionsRequired$1.evaluate(TestRuleAssertionsRequired.java:43)
	at org.apache.lucene.util.TestRuleMarkFailure$1.evaluate(TestRuleMarkFailure.java:48)
	at org.apache.lucene.util.TestRuleIgnoreAfterMaxFailures$1.evaluate(TestRuleIgnoreAfterMaxFailures.java:70)
	at org.apache.lucene.util.TestRuleIgnoreTestSuites$1.evaluate(TestRuleIgnoreTestSuites.java:55)
	at com.carrotsearch.randomizedtesting.rules.StatementAdapter.evaluate(StatementAdapter.java:36)
	at com.carrotsearch.randomizedtesting.ThreadLeakControl$StatementRunner.run(ThreadLeakControl.java:358)
	at java.lang.Thread.run(Thread.java:722)




Build Log:
[...truncated 9011 lines...]
[junit4:junit4] Suite: org.apache.solr.cloud.BasicDistributedZkTest
[junit4:junit4]   2> 0 T2292 oas.BaseDistributedSearchTestCase.initHostContext Setting hostContext system property: /nb_/
[junit4:junit4]   2> 6 T2292 oas.SolrTestCaseJ4.setUp ###Starting testDistribSearch
[junit4:junit4]   2> Creating dataDir: /Users/jenkins/jenkins-slave/workspace/Lucene-Solr-trunk-MacOSX/solr/build/solr-core/test/J0/./solrtest-BasicDistributedZkTest-1359814230142
[junit4:junit4]   2> 7 T2292 oasc.ZkTestServer.run STARTING ZK TEST SERVER
[junit4:junit4]   2> 8 T2293 oasc.ZkTestServer$ZKServerMain.runFromConfig Starting server
[junit4:junit4]   2> 10 T2293 oazs.ZooKeeperServer.setTickTime tickTime set to 1000
[junit4:junit4]   2> 10 T2293 oazs.ZooKeeperServer.setMinSessionTimeout minSessionTimeout set to -1
[junit4:junit4]   2> 10 T2293 oazs.ZooKeeperServer.setMaxSessionTimeout maxSessionTimeout set to -1
[junit4:junit4]   2> 11 T2293 oazs.NIOServerCnxnFactory.configure binding to port 0.0.0.0/0.0.0.0:0
[junit4:junit4]   2> 12 T2293 oazsp.FileTxnSnapLog.save Snapshotting: 0x0 to /Users/jenkins/jenkins-slave/workspace/Lucene-Solr-trunk-MacOSX/solr/build/solr-core/test/J0/./org.apache.solr.cloud.BasicDistributedZkTest-1359814230142/zookeeper/server1/data/version-2/snapshot.0
[junit4:junit4]   2> 109 T2292 oasc.ZkTestServer.run start zk server on port:49814
[junit4:junit4]   2> 110 T2292 oaz.ZooKeeper.<init> Initiating client connection, connectString=127.0.0.1:49814 sessionTimeout=10000 watcher=org.apache.solr.common.cloud.ConnectionManager@7b3ecb44
[junit4:junit4]   2> 111 T2292 oascc.ConnectionManager.waitForConnected Waiting for client to connect to ZooKeeper
[junit4:junit4]   2> 111 T2298 oaz.ClientCnxn$SendThread.logStartConnect Opening socket connection to server localhost/127.0.0.1:49814. Will not attempt to authenticate using SASL (access denied ("javax.security.auth.AuthPermission" "getLoginConfiguration"))
[junit4:junit4]   2> 112 T2298 oaz.ClientCnxn$SendThread.primeConnection Socket connection established to localhost/127.0.0.1:49814, initiating session
[junit4:junit4]   2> 113 T2294 oazs.NIOServerCnxnFactory.run Accepted socket connection from /127.0.0.1:49815
[junit4:junit4]   2> 113 T2294 oazs.ZooKeeperServer.processConnectRequest Client attempting to establish new session at /127.0.0.1:49815
[junit4:junit4]   2> 114 T2296 oazsp.FileTxnLog.append Creating new log file: log.1
[junit4:junit4]   2> 117 T2296 oazs.ZooKeeperServer.finishSessionInit Established session 0x13c9b3e80840000 with negotiated timeout 10000 for client /127.0.0.1:49815
[junit4:junit4]   2> 117 T2298 oaz.ClientCnxn$SendThread.onConnected Session establishment complete on server localhost/127.0.0.1:49814, sessionid = 0x13c9b3e80840000, negotiated timeout = 10000
[junit4:junit4]   2> 118 T2299 oascc.ConnectionManager.process Watcher org.apache.solr.common.cloud.ConnectionManager@7b3ecb44 name:ZooKeeperConnection Watcher:127.0.0.1:49814 got event WatchedEvent state:SyncConnected type:None path:null path:null type:None
[junit4:junit4]   2> 118 T2292 oascc.ConnectionManager.waitForConnected Client is connected to ZooKeeper
[junit4:junit4]   2> 118 T2292 oascc.SolrZkClient.makePath makePath: /solr
[junit4:junit4]   2> 124 T2297 oazs.PrepRequestProcessor.pRequest2Txn Processed session termination for sessionid: 0x13c9b3e80840000
[junit4:junit4]   2> 125 T2299 oaz.ClientCnxn$EventThread.run EventThread shut down
[junit4:junit4]   2> 125 T2292 oaz.ZooKeeper.close Session: 0x13c9b3e80840000 closed
[junit4:junit4]   2> 126 T2294 oazs.NIOServerCnxn.closeSock Closed socket connection for client /127.0.0.1:49815 which had sessionid 0x13c9b3e80840000
[junit4:junit4]   2> 126 T2292 oaz.ZooKeeper.<init> Initiating client connection, connectString=127.0.0.1:49814/solr sessionTimeout=10000 watcher=org.apache.solr.common.cloud.ConnectionManager@7ed2720c
[junit4:junit4]   2> 128 T2292 oascc.ConnectionManager.waitForConnected Waiting for client to connect to ZooKeeper
[junit4:junit4]   2> 128 T2300 oaz.ClientCnxn$SendThread.logStartConnect Opening socket connection to server localhost/127.0.0.1:49814. Will not attempt to authenticate using SASL (access denied ("javax.security.auth.AuthPermission" "getLoginConfiguration"))
[junit4:junit4]   2> 130 T2300 oaz.ClientCnxn$SendThread.primeConnection Socket connection established to localhost/127.0.0.1:49814, initiating session
[junit4:junit4]   2> 130 T2294 oazs.NIOServerCnxnFactory.run Accepted socket connection from /127.0.0.1:49816
[junit4:junit4]   2> 131 T2294 oazs.ZooKeeperServer.processConnectRequest Client attempting to establish new session at /127.0.0.1:49816
[junit4:junit4]   2> 134 T2296 oazs.ZooKeeperServer.finishSessionInit Established session 0x13c9b3e80840001 with negotiated timeout 10000 for client /127.0.0.1:49816
[junit4:junit4]   2> 134 T2300 oaz.ClientCnxn$SendThread.onConnected Session establishment complete on server localhost/127.0.0.1:49814, sessionid = 0x13c9b3e80840001, negotiated timeout = 10000
[junit4:junit4]   2> 135 T2301 oascc.ConnectionManager.process Watcher org.apache.solr.common.cloud.ConnectionManager@7ed2720c name:ZooKeeperConnection Watcher:127.0.0.1:49814/solr got event WatchedEvent state:SyncConnected type:None path:null path:null type:None
[junit4:junit4]   2> 135 T2292 oascc.ConnectionManager.waitForConnected Client is connected to ZooKeeper
[junit4:junit4]   2> 136 T2292 oascc.SolrZkClient.makePath makePath: /collections/collection1
[junit4:junit4]   2> 143 T2292 oascc.SolrZkClient.makePath makePath: /collections/collection1/shards
[junit4:junit4]   2> 148 T2292 oascc.SolrZkClient.makePath makePath: /collections/control_collection
[junit4:junit4]   2> 153 T2292 oascc.SolrZkClient.makePath makePath: /collections/control_collection/shards
[junit4:junit4]   2> 158 T2292 oasc.AbstractZkTestCase.putConfig put /Users/jenkins/jenkins-slave/workspace/Lucene-Solr-trunk-MacOSX/solr/build/solr-core/test-files/solr/collection1/conf/solrconfig.xml to /configs/conf1/solrconfig.xml
[junit4:junit4]   2> 159 T2292 oascc.SolrZkClient.makePath makePath: /configs/conf1/solrconfig.xml
[junit4:junit4]   2> 167 T2292 oasc.AbstractZkTestCase.putConfig put /Users/jenkins/jenkins-slave/workspace/Lucene-Solr-trunk-MacOSX/solr/build/solr-core/test-files/solr/collection1/conf/schema.xml to /configs/conf1/schema.xml
[junit4:junit4]   2> 168 T2292 oascc.SolrZkClient.makePath makePath: /configs/conf1/schema.xml
[junit4:junit4]   2> 174 T2292 oasc.AbstractZkTestCase.putConfig put /Users/jenkins/jenkins-slave/workspace/Lucene-Solr-trunk-MacOSX/solr/build/solr-core/test-files/solr/collection1/conf/stopwords.txt to /configs/conf1/stopwords.txt
[junit4:junit4]   2> 175 T2292 oascc.SolrZkClient.makePath makePath: /configs/conf1/stopwords.txt
[junit4:junit4]   2> 180 T2292 oasc.AbstractZkTestCase.putConfig put /Users/jenkins/jenkins-slave/workspace/Lucene-Solr-trunk-MacOSX/solr/build/solr-core/test-files/solr/collection1/conf/protwords.txt to /configs/conf1/protwords.txt
[junit4:junit4]   2> 181 T2292 oascc.SolrZkClient.makePath makePath: /configs/conf1/protwords.txt
[junit4:junit4]   2> 187 T2292 oasc.AbstractZkTestCase.putConfig put /Users/jenkins/jenkins-slave/workspace/Lucene-Solr-trunk-MacOSX/solr/build/solr-core/test-files/solr/collection1/conf/currency.xml to /configs/conf1/currency.xml
[junit4:junit4]   2> 187 T2292 oascc.SolrZkClient.makePath makePath: /configs/conf1/currency.xml
[junit4:junit4]   2> 193 T2292 oasc.AbstractZkTestCase.putConfig put /Users/jenkins/jenkins-slave/workspace/Lucene-Solr-trunk-MacOSX/solr/build/solr-core/test-files/solr/collection1/conf/open-exchange-rates.json to /configs/conf1/open-exchange-rates.json
[junit4:junit4]   2> 193 T2292 oascc.SolrZkClient.makePath makePath: /configs/conf1/open-exchange-rates.json
[junit4:junit4]   2> 199 T2292 oasc.AbstractZkTestCase.putConfig put /Users/jenkins/jenkins-slave/workspace/Lucene-Solr-trunk-MacOSX/solr/build/solr-core/test-files/solr/collection1/conf/mapping-ISOLatin1Accent.txt to /configs/conf1/mapping-ISOLatin1Accent.txt
[junit4:junit4]   2> 200 T2292 oascc.SolrZkClient.makePath makePath: /configs/conf1/mapping-ISOLatin1Accent.txt
[junit4:junit4]   2> 206 T2292 oasc.AbstractZkTestCase.putConfig put /Users/jenkins/jenkins-slave/workspace/Lucene-Solr-trunk-MacOSX/solr/build/solr-core/test-files/solr/collection1/conf/old_synonyms.txt to /configs/conf1/old_synonyms.txt
[junit4:junit4]   2> 206 T2292 oascc.SolrZkClient.makePath makePath: /configs/conf1/old_synonyms.txt
[junit4:junit4]   2> 212 T2292 oasc.AbstractZkTestCase.putConfig put /Users/jenkins/jenkins-slave/workspace/Lucene-Solr-trunk-MacOSX/solr/build/solr-core/test-files/solr/collection1/conf/synonyms.txt to /configs/conf1/synonyms.txt
[junit4:junit4]   2> 213 T2292 oascc.SolrZkClient.makePath makePath: /configs/conf1/synonyms.txt
[junit4:junit4]   2> 218 T2297 oazs.PrepRequestProcessor.pRequest2Txn Processed session termination for sessionid: 0x13c9b3e80840001
[junit4:junit4]   2> 219 T2294 oazs.NIOServerCnxn.closeSock Closed socket connection for client /127.0.0.1:49816 which had sessionid 0x13c9b3e80840001
[junit4:junit4]   2> 219 T2292 oaz.ZooKeeper.close Session: 0x13c9b3e80840001 closed
[junit4:junit4]   2> 220 T2301 oaz.ClientCnxn$EventThread.run EventThread shut down
[junit4:junit4]   2> 388 T2292 oejs.Server.doStart jetty-8.1.8.v20121106
[junit4:junit4]   2> 394 T2292 oejs.AbstractConnector.doStart Started SelectChannelConnector@127.0.0.1:49817
[junit4:junit4]   2> 395 T2292 oass.SolrDispatchFilter.init SolrDispatchFilter.init()
[junit4:junit4]   2> 395 T2292 oasc.SolrResourceLoader.locateSolrHome JNDI not configured for solr (NoInitialContextEx)
[junit4:junit4]   2> 395 T2292 oasc.SolrResourceLoader.locateSolrHome using system property solr.solr.home: /Users/jenkins/jenkins-slave/workspace/Lucene-Solr-trunk-MacOSX/solr/build/solr-core/test/J0/./org.apache.solr.cloud.BasicDistributedZkTest-controljetty-1359814230355
[junit4:junit4]   2> 396 T2292 oasc.CoreContainer$Initializer.initialize looking for solr.xml: /Users/jenkins/jenkins-slave/workspace/Lucene-Solr-trunk-MacOSX/solr/build/solr-core/test/J0/./org.apache.solr.cloud.BasicDistributedZkTest-controljetty-1359814230355/solr.xml
[junit4:junit4]   2> 396 T2292 oasc.CoreContainer.<init> New CoreContainer 1267816432
[junit4:junit4]   2> 396 T2292 oasc.CoreContainer.load Loading CoreContainer using Solr Home: '/Users/jenkins/jenkins-slave/workspace/Lucene-Solr-trunk-MacOSX/solr/build/solr-core/test/J0/./org.apache.solr.cloud.BasicDistributedZkTest-controljetty-1359814230355/'
[junit4:junit4]   2> 397 T2292 oasc.SolrResourceLoader.<init> new SolrResourceLoader for directory: '/Users/jenkins/jenkins-slave/workspace/Lucene-Solr-trunk-MacOSX/solr/build/solr-core/test/J0/./org.apache.solr.cloud.BasicDistributedZkTest-controljetty-1359814230355/'
[junit4:junit4]   2> 424 T2292 oashc.HttpShardHandlerFactory.getParameter Setting socketTimeout to: 60000
[junit4:junit4]   2> 425 T2292 oashc.HttpShardHandlerFactory.getParameter Setting urlScheme to: http://
[junit4:junit4]   2> 425 T2292 oashc.HttpShardHandlerFactory.getParameter Setting connTimeout to: 15000
[junit4:junit4]   2> 426 T2292 oashc.HttpShardHandlerFactory.getParameter Setting maxConnectionsPerHost to: 20
[junit4:junit4]   2> 427 T2292 oashc.HttpShardHandlerFactory.getParameter Setting corePoolSize to: 0
[junit4:junit4]   2> 428 T2292 oashc.HttpShardHandlerFactory.getParameter Setting maximumPoolSize to: 2147483647
[junit4:junit4]   2> 429 T2292 oashc.HttpShardHandlerFactory.getParameter Setting maxThreadIdleTime to: 5
[junit4:junit4]   2> 429 T2292 oashc.HttpShardHandlerFactory.getParameter Setting sizeOfQueue to: -1
[junit4:junit4]   2> 430 T2292 oashc.HttpShardHandlerFactory.getParameter Setting fairnessPolicy to: false
[junit4:junit4]   2> 431 T2292 oascsi.HttpClientUtil.createClient Creating new http client, config:maxConnectionsPerHost=20&maxConnections=10000&socketTimeout=60000&connTimeout=15000&retry=false
[junit4:junit4]   2> 443 T2292 oasc.CoreContainer.load Registering Log Listener
[junit4:junit4]   2> 461 T2292 oasc.CoreContainer.initZooKeeper Zookeeper client=127.0.0.1:49814/solr
[junit4:junit4]   2> 462 T2292 oasc.ZkController.checkChrootPath zkHost includes chroot
[junit4:junit4]   2> 462 T2292 oaz.ZooKeeper.<init> Initiating client connection, connectString=127.0.0.1:49814 sessionTimeout=60000 watcher=org.apache.solr.common.cloud.ConnectionManager@7ccfb37e
[junit4:junit4]   2> 463 T2292 oascc.ConnectionManager.waitForConnected Waiting for client to connect to ZooKeeper
[junit4:junit4]   2> 464 T2311 oaz.ClientCnxn$SendThread.logStartConnect Opening socket connection to server localhost/127.0.0.1:49814. Will not attempt to authenticate using SASL (access denied ("javax.security.auth.AuthPermission" "getLoginConfiguration"))
[junit4:junit4]   2> 465 T2311 oaz.ClientCnxn$SendThread.primeConnection Socket connection established to localhost/127.0.0.1:49814, initiating session
[junit4:junit4]   2> 465 T2294 oazs.NIOServerCnxnFactory.run Accepted socket connection from /127.0.0.1:49818
[junit4:junit4]   2> 466 T2294 oazs.ZooKeeperServer.processConnectRequest Client attempting to establish new session at /127.0.0.1:49818
[junit4:junit4]   2> 467 T2296 oazs.ZooKeeperServer.finishSessionInit Established session 0x13c9b3e80840002 with negotiated timeout 20000 for client /127.0.0.1:49818
[junit4:junit4]   2> 467 T2311 oaz.ClientCnxn$SendThread.onConnected Session establishment complete on server localhost/127.0.0.1:49814, sessionid = 0x13c9b3e80840002, negotiated timeout = 20000
[junit4:junit4]   2> 468 T2312 oascc.ConnectionManager.process Watcher org.apache.solr.common.cloud.ConnectionManager@7ccfb37e name:ZooKeeperConnection Watcher:127.0.0.1:49814 got event WatchedEvent state:SyncConnected type:None path:null path:null type:None
[junit4:junit4]   2> 468 T2292 oascc.ConnectionManager.waitForConnected Client is connected to ZooKeeper
[junit4:junit4]   2> 471 T2297 oazs.PrepRequestProcessor.pRequest2Txn Processed session termination for sessionid: 0x13c9b3e80840002
[junit4:junit4]   2> 472 T2294 oazs.NIOServerCnxn.closeSock Closed socket connection for client /127.0.0.1:49818 which had sessionid 0x13c9b3e80840002
[junit4:junit4]   2> 472 T2292 oaz.ZooKeeper.close Session: 0x13c9b3e80840002 closed
[junit4:junit4]   2> 473 T2312 oaz.ClientCnxn$EventThread.run EventThread shut down
[junit4:junit4]   2> 473 T2292 oascsi.HttpClientUtil.createClient Creating new http client, config:maxConnections=500&maxConnectionsPerHost=16&socketTimeout=60000&connTimeout=15000
[junit4:junit4]   2> 479 T2292 oaz.ZooKeeper.<init> Initiating client connection, connectString=127.0.0.1:49814/solr sessionTimeout=30000 watcher=org.apache.solr.common.cloud.ConnectionManager@24b1c68b
[junit4:junit4]   2> 480 T2292 oascc.ConnectionManager.waitForConnected Waiting for client to connect to ZooKeeper
[junit4:junit4]   2> 481 T2313 oaz.ClientCnxn$SendThread.logStartConnect Opening socket connection to server localhost/127.0.0.1:49814. Will not attempt to authenticate using SASL (access denied ("javax.security.auth.AuthPermission" "getLoginConfiguration"))
[junit4:junit4]   2> 481 T2313 oaz.ClientCnxn$SendThread.primeConnection Socket connection established to localhost/127.0.0.1:49814, initiating session
[junit4:junit4]   2> 482 T2294 oazs.NIOServerCnxnFactory.run Accepted socket connection from /127.0.0.1:49819
[junit4:junit4]   2> 482 T2294 oazs.ZooKeeperServer.processConnectRequest Client attempting to establish new session at /127.0.0.1:49819
[junit4:junit4]   2> 484 T2296 oazs.ZooKeeperServer.finishSessionInit Established session 0x13c9b3e80840003 with negotiated timeout 20000 for client /127.0.0.1:49819
[junit4:junit4]   2> 484 T2313 oaz.ClientCnxn$SendThread.onConnected Session establishment complete on server localhost/127.0.0.1:49814, sessionid = 0x13c9b3e80840003, negotiated timeout = 20000
[junit4:junit4]   2> 484 T2314 oascc.ConnectionManager.process Watcher org.apache.solr.common.cloud.ConnectionManager@24b1c68b name:ZooKeeperConnection Watcher:127.0.0.1:49814/solr got event WatchedEvent state:SyncConnected type:None path:null path:null type:None
[junit4:junit4]   2> 485 T2292 oascc.ConnectionManager.waitForConnected Client is connected to ZooKeeper
[junit4:junit4]   2> 488 T2297 oazs.PrepRequestProcessor.pRequest Got user-level KeeperException when processing sessionid:0x13c9b3e80840003 type:create cxid:0x2 zxid:0x1a txntype:-1 reqpath:n/a Error Path:/solr/overseer Error:KeeperErrorCode = NodeExists for /solr/overseer
[junit4:junit4]   2> 490 T2292 oascc.SolrZkClient.makePath makePath: /live_nodes
[junit4:junit4]   2> 494 T2292 oasc.ZkController.createEphemeralLiveNode Register node as live in ZooKeeper:/live_nodes/127.0.0.1:49817_nb_
[junit4:junit4]   2> 495 T2297 oazs.PrepRequestProcessor.pRequest Got user-level KeeperException when processing sessionid:0x13c9b3e80840003 type:delete cxid:0x7 zxid:0x1c txntype:-1 reqpath:n/a Error Path:/solr/live_nodes/127.0.0.1:49817_nb_ Error:KeeperErrorCode = NoNode for /solr/live_nodes/127.0.0.1:49817_nb_
[junit4:junit4]   2> 496 T2292 oascc.SolrZkClient.makePath makePath: /live_nodes/127.0.0.1:49817_nb_
[junit4:junit4]   2> 503 T2292 oascc.SolrZkClient.makePath makePath: /overseer_elect/election
[junit4:junit4]   2> 513 T2297 oazs.PrepRequestProcessor.pRequest Got user-level KeeperException when processing sessionid:0x13c9b3e80840003 type:delete cxid:0x15 zxid:0x21 txntype:-1 reqpath:n/a Error Path:/solr/overseer_elect/leader Error:KeeperErrorCode = NoNode for /solr/overseer_elect/leader
[junit4:junit4]   2> 514 T2292 oascc.SolrZkClient.makePath makePath: /overseer_elect/leader
[junit4:junit4]   2> 519 T2292 oasc.Overseer.start Overseer (id=89116785386979331-127.0.0.1:49817_nb_-n_0000000000) starting
[junit4:junit4]   2> 520 T2297 oazs.PrepRequestProcessor.pRequest Got user-level KeeperException when processing sessionid:0x13c9b3e80840003 type:create cxid:0x1a zxid:0x23 txntype:-1 reqpath:n/a Error Path:/solr/overseer Error:KeeperErrorCode = NodeExists for /solr/overseer
[junit4:junit4]   2> 522 T2297 oazs.PrepRequestProcessor.pRequest Got user-level KeeperException when processing sessionid:0x13c9b3e80840003 type:create cxid:0x1b zxid:0x24 txntype:-1 reqpath:n/a Error Path:/solr/overseer Error:KeeperErrorCode = NodeExists for /solr/overseer
[junit4:junit4]   2> 524 T2297 oazs.PrepRequestProcessor.pRequest Got user-level KeeperException when processing sessionid:0x13c9b3e80840003 type:create cxid:0x1c zxid:0x25 txntype:-1 reqpath:n/a Error Path:/solr/overseer Error:KeeperErrorCode = NodeExists for /solr/overseer
[junit4:junit4]   2> 525 T2297 oazs.PrepRequestProcessor.pRequest Got user-level KeeperException when processing sessionid:0x13c9b3e80840003 type:create cxid:0x1d zxid:0x26 txntype:-1 reqpath:n/a Error Path:/solr/overseer Error:KeeperErrorCode = NodeExists for /solr/overseer
[junit4:junit4]   2> 527 T2316 oasc.OverseerCollectionProcessor.run Process current queue of collection creations
[junit4:junit4]   2> 528 T2292 oascc.SolrZkClient.makePath makePath: /clusterstate.json
[junit4:junit4]   2> 533 T2292 oascc.ZkStateReader.createClusterStateWatchersAndUpdate Updating cluster state from ZooKeeper... 
[junit4:junit4]   2> 537 T2315 oasc.Overseer$ClusterStateUpdater.run Starting to work on the main queue
[junit4:junit4]   2> 542 T2317 oasc.CoreContainer.create Creating SolrCore 'collection1' using instanceDir: /Users/jenkins/jenkins-slave/workspace/Lucene-Solr-trunk-MacOSX/solr/build/solr-core/test/J0/./org.apache.solr.cloud.BasicDistributedZkTest-controljetty-1359814230355/collection1
[junit4:junit4]   2> 543 T2317 oasc.ZkController.createCollectionZkNode Check for collection zkNode:control_collection
[junit4:junit4]   2> 544 T2317 oasc.ZkController.createCollectionZkNode Collection zkNode exists
[junit4:junit4]   2> 544 T2317 oasc.ZkController.readConfigName Load collection config from:/collections/control_collection
[junit4:junit4]   2> 547 T2317 oasc.SolrResourceLoader.<init> new SolrResourceLoader for directory: '/Users/jenkins/jenkins-slave/workspace/Lucene-Solr-trunk-MacOSX/solr/build/solr-core/test/J0/./org.apache.solr.cloud.BasicDistributedZkTest-controljetty-1359814230355/collection1/'
[junit4:junit4]   2> 549 T2317 oasc.SolrResourceLoader.replaceClassLoader Adding 'file:/Users/jenkins/jenkins-slave/workspace/Lucene-Solr-trunk-MacOSX/solr/build/solr-core/test/J0/org.apache.solr.cloud.BasicDistributedZkTest-controljetty-1359814230355/collection1/lib/classes/' to classloader
[junit4:junit4]   2> 550 T2317 oasc.SolrResourceLoader.replaceClassLoader Adding 'file:/Users/jenkins/jenkins-slave/workspace/Lucene-Solr-trunk-MacOSX/solr/build/solr-core/test/J0/org.apache.solr.cloud.BasicDistributedZkTest-controljetty-1359814230355/collection1/lib/README' to classloader
[junit4:junit4]   2> 600 T2317 oasc.SolrConfig.<init> Using Lucene MatchVersion: LUCENE_50
[junit4:junit4]   2> 669 T2317 oasc.SolrConfig.<init> Loaded SolrConfig: solrconfig.xml
[junit4:junit4]   2> 671 T2317 oass.IndexSchema.readSchema Reading Solr Schema
[junit4:junit4]   2> 682 T2317 oass.IndexSchema.readSchema Schema name=test
[junit4:junit4]   2> 1224 T2317 oass.OpenExchangeRatesOrgProvider.init Initialized with rates=open-exchange-rates.json, refreshInterval=1440.
[junit4:junit4]   2> 1233 T2317 oass.IndexSchema.readSchema default search field in schema is text
[junit4:junit4]   2> 1237 T2317 oass.IndexSchema.readSchema unique key field: id
[junit4:junit4]   2> 1264 T2317 oass.FileExchangeRateProvider.reload Reloading exchange rates from file currency.xml
[junit4:junit4]   2> 1270 T2317 oass.FileExchangeRateProvider.reload Reloading exchange rates from file currency.xml
[junit4:junit4]   2> 1275 T2317 oass.OpenExchangeRatesOrgProvider.reload Reloading exchange rates from open-exchange-rates.json
[junit4:junit4]   2> 1277 T2317 oass.OpenExchangeRatesOrgProvider.reload Reloading exchange rates from open-exchange-rates.json
[junit4:junit4]   2> 1280 T2317 oasc.SolrCore.<init> [collection1] Opening new SolrCore at /Users/jenkins/jenkins-slave/workspace/Lucene-Solr-trunk-MacOSX/solr/build/solr-core/test/J0/./org.apache.solr.cloud.BasicDistributedZkTest-controljetty-1359814230355/collection1/, dataDir=./org.apache.solr.cloud.BasicDistributedZkTest-1359814230142/control/data/
[junit4:junit4]   2> 1280 T2317 oasc.JmxMonitoredMap.<init> JMX monitoring is enabled. Adding Solr mbeans to JMX Server: com.sun.jmx.mbeanserver.JmxMBeanServer@48265f7f
[junit4:junit4]   2> 1281 T2317 oasc.SolrCore.initDirectoryFactory solr.StandardDirectoryFactory
[junit4:junit4]   2> 1299 T2317 oasc.CachingDirectoryFactory.get return new directory for /Users/jenkins/jenkins-slave/workspace/Lucene-Solr-trunk-MacOSX/solr/build/solr-core/test/J0/./org.apache.solr.cloud.BasicDistributedZkTest-1359814230142/control/data forceNew:false
[junit4:junit4]   2> 1299 T2317 oasc.CachingDirectoryFactory.close Releasing directory:/Users/jenkins/jenkins-slave/workspace/Lucene-Solr-trunk-MacOSX/solr/build/solr-core/test/J0/./org.apache.solr.cloud.BasicDistributedZkTest-1359814230142/control/data
[junit4:junit4]   2> 1300 T2317 oasc.SolrCore.getNewIndexDir New index directory detected: old=null new=./org.apache.solr.cloud.BasicDistributedZkTest-1359814230142/control/data/index/
[junit4:junit4]   2> 1300 T2317 oasc.SolrCore.initIndex WARNING [collection1] Solr index directory './org.apache.solr.cloud.BasicDistributedZkTest-1359814230142/control/data/index' doesn't exist. Creating new index...
[junit4:junit4]   2> 1301 T2317 oasc.CachingDirectoryFactory.get return new directory for /Users/jenkins/jenkins-slave/workspace/Lucene-Solr-trunk-MacOSX/solr/build/solr-core/test/J0/./org.apache.solr.cloud.BasicDistributedZkTest-1359814230142/control/data/index forceNew:false
[junit4:junit4]   2> 1305 T2317 oasc.SolrDeletionPolicy.onCommit SolrDeletionPolicy.onCommit: commits:num=1
[junit4:junit4]   2> 		commit{dir=RateLimitedDirectoryWrapper(org.apache.lucene.store.NIOFSDirectory@/Users/jenkins/jenkins-slave/workspace/Lucene-Solr-trunk-MacOSX/solr/build/solr-core/test/J0/org.apache.solr.cloud.BasicDistributedZkTest-1359814230142/control/data/index lockFactory=org.apache.lucene.store.NativeFSLockFactory@302996cc),segFN=segments_1,generation=1,filenames=[segments_1]
[junit4:junit4]   2> 1306 T2317 oasc.SolrDeletionPolicy.updateCommits newest commit = 1[segments_1]
[junit4:junit4]   2> 1306 T2317 oasc.CachingDirectoryFactory.close Releasing directory:/Users/jenkins/jenkins-slave/workspace/Lucene-Solr-trunk-MacOSX/solr/build/solr-core/test/J0/./org.apache.solr.cloud.BasicDistributedZkTest-1359814230142/control/data/index
[junit4:junit4]   2> 1307 T2317 oasc.SolrCore.initWriters created xml: solr.XMLResponseWriter
[junit4:junit4]   2> 1309 T2317 oasup.UpdateRequestProcessorChain.init inserting DistributedUpdateProcessorFactory into updateRequestProcessorChain "dedupe"
[junit4:junit4]   2> 1309 T2317 oasup.UpdateRequestProcessorChain.init inserting DistributedUpdateProcessorFactory into updateRequestProcessorChain "dedupe-allfields"
[junit4:junit4]   2> 1310 T2317 oasup.UpdateRequestProcessorChain.init inserting DistributedUpdateProcessorFactory into updateRequestProcessorChain "stored_sig"
[junit4:junit4]   2> 1311 T2317 oasup.UpdateRequestProcessorChain.init inserting DistributedUpdateProcessorFactory into updateRequestProcessorChain "uniq-fields"
[junit4:junit4]   2> 1312 T2317 oasup.UpdateRequestProcessorChain.init inserting DistributedUpdateProcessorFactory into updateRequestProcessorChain "distrib-dup-test-chain-implicit"
[junit4:junit4]   2> 1312 T2317 oasc.RequestHandlers.initHandlersFromConfig adding lazy requestHandler: solr.ReplicationHandler
[junit4:junit4]   2> 1312 T2317 oasc.RequestHandlers.initHandlersFromConfig created /replication: solr.ReplicationHandler
[junit4:junit4]   2> 1313 T2317 oasc.RequestHandlers.initHandlersFromConfig created standard: solr.StandardRequestHandler
[junit4:junit4]   2> 1313 T2317 oasc.RequestHandlers.initHandlersFromConfig created /get: solr.RealTimeGetHandler
[junit4:junit4]   2> 1314 T2317 oasc.RequestHandlers.initHandlersFromConfig created dismax: solr.SearchHandler
[junit4:junit4]   2> 1314 T2317 oasc.RequestHandlers.initHandlersFromConfig created mock: org.apache.solr.core.MockQuerySenderListenerReqHandler
[junit4:junit4]   2> 1315 T2317 oasc.RequestHandlers.initHandlersFromConfig created /admin/: org.apache.solr.handler.admin.AdminHandlers
[junit4:junit4]   2> 1315 T2317 oasc.RequestHandlers.initHandlersFromConfig created defaults: solr.StandardRequestHandler
[junit4:junit4]   2> 1320 T2317 oasc.RequestHandlers.initHandlersFromConfig adding lazy requestHandler: solr.StandardRequestHandler
[junit4:junit4]   2> 1320 T2317 oasc.RequestHandlers.initHandlersFromConfig created lazy: solr.StandardRequestHandler
[junit4:junit4]   2> 1321 T2317 oasc.RequestHandlers.initHandlersFromConfig created /update: solr.UpdateRequestHandler
[junit4:junit4]   2> 1321 T2317 oasc.RequestHandlers.initHandlersFromConfig created /terms: org.apache.solr.handler.component.SearchHandler
[junit4:junit4]   2> 1321 T2317 oasc.RequestHandlers.initHandlersFromConfig created spellCheckCompRH: org.apache.solr.handler.component.SearchHandler
[junit4:junit4]   2> 1322 T2317 oasc.RequestHandlers.initHandlersFromConfig created spellCheckCompRH_Direct: org.apache.solr.handler.component.SearchHandler
[junit4:junit4]   2> 1322 T2317 oasc.RequestHandlers.initHandlersFromConfig created spellCheckWithWordbreak: org.apache.solr.handler.component.SearchHandler
[junit4:junit4]   2> 1323 T2317 oasc.RequestHandlers.initHandlersFromConfig created spellCheckWithWordbreak_Direct: org.apache.solr.handler.component.SearchHandler
[junit4:junit4]   2> 1323 T2317 oasc.RequestHandlers.initHandlersFromConfig created spellCheckCompRH1: org.apache.solr.handler.component.SearchHandler
[junit4:junit4]   2> 1323 T2317 oasc.RequestHandlers.initHandlersFromConfig created mltrh: org.apache.solr.handler.component.SearchHandler
[junit4:junit4]   2> 1324 T2317 oasc.RequestHandlers.initHandlersFromConfig created tvrh: org.apache.solr.handler.component.SearchHandler
[junit4:junit4]   2> 1324 T2317 oasc.RequestHandlers.initHandlersFromConfig created /mlt: solr.MoreLikeThisHandler
[junit4:junit4]   2> 1325 T2317 oasc.RequestHandlers.initHandlersFromConfig created /debug/dump: solr.DumpRequestHandler
[junit4:junit4]   2> 1336 T2317 oashl.XMLLoader.init xsltCacheLifetimeSeconds=60
[junit4:junit4]   2> 1341 T2317 oasc.SolrCore.initDeprecatedSupport WARNING solrconfig.xml uses deprecated <admin/gettableFiles>, Please update your config to use the ShowFileRequestHandler.
[junit4:junit4]   2> 1342 T2317 oasc.SolrCore.initDeprecatedSupport WARNING adding ShowFileRequestHandler with hidden files: [SCHEMA.XML, OLD_SYNONYMS.TXT, STOPWORDS.TXT, PROTWORDS.TXT, OPEN-EXCHANGE-RATES.JSON, SYNONYMS.TXT, CURRENCY.XML, MAPPING-ISOLATIN1ACCENT.TXT]
[junit4:junit4]   2> 1345 T2317 oasc.CachingDirectoryFactory.close Releasing directory:/Users/jenkins/jenkins-slave/workspace/Lucene-Solr-trunk-MacOSX/solr/build/solr-core/test/J0/./org.apache.solr.cloud.BasicDistributedZkTest-1359814230142/control/data
[junit4:junit4]   2> 1346 T2317 oass.SolrIndexSearcher.<init> Opening Searcher@69c8b6ed main
[junit4:junit4]   2> 1347 T2317 oasu.CommitTracker.<init> Hard AutoCommit: disabled
[junit4:junit4]   2> 1347 T2317 oasu.CommitTracker.<init> Soft AutoCommit: disabled
[junit4:junit4]   2> 1348 T2317 oashc.SpellCheckComponent.inform Initializing spell checkers
[junit4:junit4]   2> 1354 T2317 oass.DirectSolrSpellChecker.init init: {name=direct,classname=DirectSolrSpellChecker,field=lowerfilt,minQueryLength=3}
[junit4:junit4]   2> 1384 T2318 oasc.SolrCore.registerSearcher [collection1] Registered new searcher Searcher@69c8b6ed main{StandardDirectoryReader(segments_1:1)}
[junit4:junit4]   2> 1389 T2317 oasc.ZkController.publish publishing core=collection1 state=down
[junit4:junit4]   2> 1389 T2317 oasc.ZkController.publish numShards not found on descriptor - reading it from system property
[junit4:junit4]   2> 1390 T2297 oazs.PrepRequestProcessor.pRequest Got user-level KeeperException when processing sessionid:0x13c9b3e80840003 type:create cxid:0x50 zxid:0x29 txntype:-1 reqpath:n/a Error Path:/solr/overseer/queue Error:KeeperErrorCode = NoNode for /solr/overseer/queue
[junit4:junit4]   2> 2047 T2315 oascc.ZkStateReader.updateClusterState Updating cloud state from ZooKeeper... 
[junit4:junit4]   2> 2048 T2315 oasc.Overseer$ClusterStateUpdater.updateState Update state numShards=1 message={
[junit4:junit4]   2> 	  "operation":"state",
[junit4:junit4]   2> 	  "numShards":"1",
[junit4:junit4]   2> 	  "shard":null,
[junit4:junit4]   2> 	  "roles":null,
[junit4:junit4]   2> 	  "state":"down",
[junit4:junit4]   2> 	  "core":"collection1",
[junit4:junit4]   2> 	  "collection":"control_collection",
[junit4:junit4]   2> 	  "node_name":"127.0.0.1:49817_nb_",
[junit4:junit4]   2> 	  "base_url":"http://127.0.0.1:49817/nb_"}
[junit4:junit4]   2> 2049 T2315 oasc.Overseer$ClusterStateUpdater.createCollection Create collection control_collection with numShards 1
[junit4:junit4]   2> 2049 T2315 oasc.Overseer$ClusterStateUpdater.updateState Assigning new node to shard shard=shard1
[junit4:junit4]   2> 2050 T2297 oazs.PrepRequestProcessor.pRequest Got user-level KeeperException when processing sessionid:0x13c9b3e80840003 type:create cxid:0x58 zxid:0x2c txntype:-1 reqpath:n/a Error Path:/solr/overseer/queue-work Error:KeeperErrorCode = NoNode for /solr/overseer/queue-work
[junit4:junit4]   2> 2063 T2314 oascc.ZkStateReader$2.process A cluster state change: WatchedEvent state:SyncConnected type:NodeDataChanged path:/clusterstate.json, has occurred - updating... (live nodes size: 1)
[junit4:junit4]   2> 2395 T2317 oasc.CoreContainer.registerCore registering core: collection1
[junit4:junit4]   2> 2396 T2317 oasc.ZkController.register Register replica - core:collection1 address:http://127.0.0.1:49817/nb_ collection:control_collection shard:shard1
[junit4:junit4]   2> 2398 T2317 oascc.SolrZkClient.makePath makePath: /collections/control_collection/leader_elect/shard1/election
[junit4:junit4]   2> 2412 T2297 oazs.PrepRequestProcessor.pRequest Got user-level KeeperException when processing sessionid:0x13c9b3e80840003 type:delete cxid:0x72 zxid:0x36 txntype:-1 reqpath:n/a Error Path:/solr/collections/control_collection/leaders Error:KeeperErrorCode = NoNode for /solr/collections/control_collection/leaders
[junit4:junit4]   2> 2413 T2317 oasc.ShardLeaderElectionContext.runLeaderProcess Running the leader process.
[junit4:junit4]   2> 2414 T2297 oazs.PrepRequestProcessor.pRequest Got user-level KeeperException when processing sessionid:0x13c9b3e80840003 type:create cxid:0x73 zxid:0x37 txntype:-1 reqpath:n/a Error Path:/solr/overseer Error:KeeperErrorCode = NodeExists for /solr/overseer
[junit4:junit4]   2> 2418 T2317 oasc.ShardLeaderElectionContext.waitForReplicasToComeUp Enough replicas found to continue.
[junit4:junit4]   2> 2418 T2317 oasc.ShardLeaderElectionContext.runLeaderProcess I may be the new leader - try and sync
[junit4:junit4]   2> 2419 T2317 oasc.SyncStrategy.sync Sync replicas to http://127.0.0.1:49817/nb_/collection1/
[junit4:junit4]   2> 2419 T2317 oasc.SyncStrategy.syncReplicas Sync Success - now sync replicas to me
[junit4:junit4]   2> 2419 T2317 oasc.SyncStrategy.syncToMe http://127.0.0.1:49817/nb_/collection1/ has no replicas
[junit4:junit4]   2> 2420 T2317 oasc.ShardLeaderElectionContext.runLeaderProcess I am the new leader: http://127.0.0.1:49817/nb_/collection1/
[junit4:junit4]   2> 2420 T2317 oascc.SolrZkClient.makePath makePath: /collections/control_collection/leaders/shard1
[junit4:junit4]   2> 2432 T2297 oazs.PrepRequestProcessor.pRequest Got user-level KeeperException when processing sessionid:0x13c9b3e80840003 type:create cxid:0x7d zxid:0x3b txntype:-1 reqpath:n/a Error Path:/solr/overseer Error:KeeperErrorCode = NodeExists for /solr/overseer
[junit4:junit4]   2> 3574 T2315 oascc.ZkStateReader.updateClusterState Updating cloud state from ZooKeeper... 
[junit4:junit4]   2> 3589 T2314 oascc.ZkStateReader$2.process A cluster state change: WatchedEvent state:SyncConnected type:NodeDataChanged path:/clusterstate.json, has occurred - updating... (live nodes size: 1)
[junit4:junit4]   2> 3634 T2317 oasc.ZkController.register We are http://127.0.0.1:49817/nb_/collection1/ and leader is http://127.0.0.1:49817/nb_/collection1/
[junit4:junit4]   2> 3634 T2317 oasc.ZkController.register No LogReplay needed for core=collection1 baseURL=http://127.0.0.1:49817/nb_
[junit4:junit4]   2> 3635 T2317 oasc.ZkController.checkRecovery I am the leader, no recovery necessary
[junit4:junit4]   2> 3635 T2317 oasc.ZkController.publish publishing core=collection1 state=active
[junit4:junit4]   2> 3635 T2317 oasc.ZkController.publish numShards not found on descriptor - reading it from system property
[junit4:junit4]   2> 3638 T2317 oascc.ZkStateReader.updateClusterState Updating cloud state from ZooKeeper... 
[junit4:junit4]   2> 3641 T2292 oass.SolrDispatchFilter.init user.dir=/Users/jenkins/jenkins-slave/workspace/Lucene-Solr-trunk-MacOSX/solr/build/solr-core/test/J0
[junit4:junit4]   2> 3641 T2292 oass.SolrDispatchFilter.init SolrDispatchFilter.init() done
[junit4:junit4]   2> 3642 T2292 oascsi.HttpClientUtil.createClient Creating new http client, config:maxConnections=128&maxConnectionsPerHost=32&followRedirects=false
[junit4:junit4]   2> 3647 T2292 oascsi.HttpClientUtil.createClient Creating new http client, config:
[junit4:junit4]   2> 3650 T2292 oaz.ZooKeeper.<init> Initiating client connection, connectString=127.0.0.1:49814/solr sessionTimeout=10000 watcher=org.apache.solr.common.cloud.ConnectionManager@1e6bee32
[junit4:junit4]   2> 3652 T2292 oascc.ConnectionManager.waitForConnected Waiting for client to connect to ZooKeeper
[junit4:junit4]   2> 3653 T2319 oaz.ClientCnxn$SendThread.logStartConnect Opening socket connection to server localhost/127.0.0.1:49814. Will not attempt to authenticate using SASL (access denied ("javax.security.auth.AuthPermission" "getLoginConfiguration"))
[junit4:junit4]   2> 3654 T2319 oaz.ClientCnxn$SendThread.primeConnection Socket connection established to localhost/127.0.0.1:49814, initiating session
[junit4:junit4]   2> 3654 T2294 oazs.NIOServerCnxnFactory.run Accepted socket connection from /127.0.0.1:49820
[junit4:junit4]   2> 3655 T2294 oazs.ZooKeeperServer.processConnectRequest Client attempting to establish new session at /127.0.0.1:49820
[junit4:junit4]   2> 3656 T2296 oazs.ZooKeeperServer.finishSessionInit Established session 0x13c9b3e80840004 with negotiated timeout 10000 for client /127.0.0.1:49820
[junit4:junit4]   2> 3656 T2319 oaz.ClientCnxn$SendThread.onConnected Session establishment complete on server localhost/127.0.0.1:49814, sessionid = 0x13c9b3e80840004, negotiated timeout = 10000
[junit4:junit4]   2> 3657 T2320 oascc.ConnectionManager.process Watcher org.apache.solr.common.cloud.ConnectionManager@1e6bee32 name:ZooKeeperConnection Watcher:127.0.0.1:49814/solr got event WatchedEvent state:SyncConnected type:None path:null path:null type:None
[junit4:junit4]   2> 3657 T2292 oascc.ConnectionManager.waitForConnected Client is connected to ZooKeeper
[junit4:junit4]   2> 3660 T2292 oascc.ZkStateReader.createClusterStateWatchersAndUpdate Updating cluster state from ZooKeeper... 
[junit4:junit4]   2> 3664 T2292 oasc.ChaosMonkey.monkeyLog monkey: init - expire sessions:true cause connection loss:true
[junit4:junit4]   2> 3846 T2292 oejs.Server.doStart jetty-8.1.8.v20121106
[junit4:junit4]   2> 3851 T2292 oejs.AbstractConnector.doStart Started SelectChannelConnector@127.0.0.1:49821
[junit4:junit4]   2> 3852 T2292 oass.SolrDispatchFilter.init SolrDispatchFilter.init()
[junit4:junit4]   2> 3852 T2292 oasc.SolrResourceLoader.locateSolrHome JNDI not configured for solr (NoInitialContextEx)
[junit4:junit4]   2> 3853 T2292 oasc.SolrResourceLoader.locateSolrHome using system property solr.solr.home: /Users/jenkins/jenkins-slave/workspace/Lucene-Solr-trunk-MacOSX/solr/build/solr-core/test/J0/./org.apache.solr.cloud.BasicDistributedZkTest-jetty1-1359814233800
[junit4:junit4]   2> 3853 T2292 oasc.CoreContainer$Initializer.initialize looking for solr.xml: /Users/jenkins/jenkins-slave/workspace/Lucene-Solr-trunk-MacOSX/solr/build/solr-core/test/J0/./org.apache.solr.cloud.BasicDistributedZkTest-jetty1-1359814233800/solr.xml
[junit4:junit4]   2> 3854 T2292 oasc.CoreContainer.<init> New CoreContainer 1451135264
[junit4:junit4]   2> 3855 T2292 oasc.CoreContainer.load Loading CoreContainer using Solr Home: '/Users/jenkins/jenkins-slave/workspace/Lucene-Solr-trunk-MacOSX/solr/build/solr-core/test/J0/./org.apache.solr.cloud.BasicDistributedZkTest-jetty1-1359814233800/'
[junit4:junit4]   2> 3855 T2292 oasc.SolrResourceLoader.<init> new SolrResourceLoader for directory: '/Users/jenkins/jenkins-slave/workspace/Lucene-Solr-trunk-MacOSX/solr/build/solr-core/test/J0/./org.apache.solr.cloud.BasicDistributedZkTest-jetty1-1359814233800/'
[junit4:junit4]   2> 3899 T2292 oashc.HttpShardHandlerFactory.getParameter Setting socketTimeout to: 60000
[junit4:junit4]   2> 3900 T2292 oashc.HttpShardHandlerFactory.getParameter Setting urlScheme to: http://
[junit4:junit4]   2> 3901 T2292 oashc.HttpShardHandlerFactory.getParameter Setting connTimeout to: 15000
[junit4:junit4]   2> 3901 T2292 oashc.HttpShardHandlerFactory.getParameter Setting maxConnectionsPerHost to: 20
[junit4:junit4]   2> 3902 T2292 oashc.HttpShardHandlerFactory.getParameter Setting corePoolSize to: 0
[junit4:junit4]   2> 3902 T2292 oashc.HttpShardHandlerFactory.getParameter Setting maximumPoolSize to: 2147483647
[junit4:junit4]   2> 3902 T2292 oashc.HttpShardHandlerFactory.getParameter Setting maxThreadIdleTime to: 5
[junit4:junit4]   2> 3903 T2292 oashc.HttpShardHandlerFactory.getParameter Setting sizeOfQueue to: -1
[junit4:junit4]   2> 3903 T2292 oashc.HttpShardHandlerFactory.getParameter Setting fairnessPolicy to: false
[junit4:junit4]   2> 3904 T2292 oascsi.HttpClientUtil.createClient Creating new http client, config:maxConnectionsPerHost=20&maxConnections=10000&socketTimeout=60000&connTimeout=15000&retry=false
[junit4:junit4]   2> 3916 T2292 oasc.CoreContainer.load Registering Log Listener
[junit4:junit4]   2> 3936 T2292 oasc.CoreContainer.initZooKeeper Zookeeper client=127.0.0.1:49814/solr
[junit4:junit4]   2> 3937 T2292 oasc.ZkController.checkChrootPath zkHost includes chroot
[junit4:junit4]   2> 3938 T2292 oaz.ZooKeeper.<init> Initiating client connection, connectString=127.0.0.1:49814 sessionTimeout=60000 watcher=org.apache.solr.common.cloud.ConnectionManager@3d6b3845
[junit4:junit4]   2> 3939 T2292 oascc.ConnectionManager.waitForConnected Waiting for client to connect to ZooKeeper
[junit4:junit4]   2> 3940 T2330 oaz.ClientCnxn$SendThread.logStartConnect Opening socket connection to server localhost/127.0.0.1:49814. Will not attempt to authenticate using SASL (access denied ("javax.security.auth.AuthPermission" "getLoginConfiguration"))
[junit4:junit4]   2> 3941 T2330 oaz.ClientCnxn$SendThread.primeConnection Socket connection established to localhost/127.0.0.1:49814, initiating session
[junit4:junit4]   2> 3941 T2294 oazs.NIOServerCnxnFactory.run Accepted socket connection from /127.0.0.1:49822
[junit4:junit4]   2> 3942 T2294 oazs.ZooKeeperServer.processConnectRequest Client attempting to establish new session at /127.0.0.1:49822
[junit4:junit4]   2> 4211 T2330 oaz.ClientCnxn$SendThread.onConnected Session establishment complete on server localhost/127.0.0.1:49814, sessionid = 0x13c9b3e80840005, negotiated timeout = 20000
[junit4:junit4]   2> 4211 T2296 oazs.ZooKeeperServer.finishSessionInit Established session 0x13c9b3e80840005 with negotiated timeout 20000 for client /127.0.0.1:49822
[junit4:junit4]   2> 4212 T2331 oascc.ConnectionManager.process Watcher org.apache.solr.common.cloud.ConnectionManager@3d6b3845 name:ZooKeeperConnection Watcher:127.0.0.1:49814 got event WatchedEvent state:SyncConnected type:None path:null path:null type:None
[junit4:junit4]   2> 4212 T2292 oascc.ConnectionManager.waitForConnected Client is connected to ZooKeeper
[junit4:junit4]   2> 4215 T2297 oazs.PrepRequestProcessor.pRequest2Txn Processed session termination for sessionid: 0x13c9b3e80840005
[junit4:junit4]   2> 4217 T2294 oazs.NIOServerCnxn.closeSock Closed socket connection for client /127.0.0.1:49822 which had sessionid 0x13c9b3e80840005
[junit4:junit4]   2> 4217 T2331 oaz.ClientCnxn$EventThread.run EventThread shut down
[junit4:junit4]   2> 4217 T2292 oaz.ZooKeeper.close Session: 0x13c9b3e80840005 closed
[junit4:junit4]   2> 4218 T2292 oascsi.HttpClientUtil.createClient Creating new http client, config:maxConnections=500&maxConnectionsPerHost=16&socketTimeout=60000&connTimeout=15000
[junit4:junit4]   2> 4222 T2292 oaz.ZooKeeper.<init> Initiating client connection, connectString=127.0.0.1:49814/solr sessionTimeout=30000 watcher=org.apache.solr.common.cloud.ConnectionManager@56b21322
[junit4:junit4]   2> 4224 T2292 oascc.ConnectionManager.waitForConnected Waiting for client to connect to ZooKeeper
[junit4:junit4]   2> 4224 T2332 oaz.ClientCnxn$SendThread.logStartConnect Opening socket connection to server localhost/127.0.0.1:49814. Will not attempt to authenticate using SASL (access denied ("javax.security.auth.AuthPermission" "getLoginConfiguration"))
[junit4:junit4]   2> 4225 T2332 oaz.ClientCnxn$SendThread.primeConnection Socket connection established to localhost/127.0.0.1:49814, initiating session
[junit4:junit4]   2> 4226 T2294 oazs.NIOServerCnxnFactory.run Accepted socket connection from /127.0.0.1:49823
[junit4:junit4]   2> 4227 T2294 oazs.ZooKeeperServer.processConnectRequest Client attempting to establish new session at /127.0.0.1:49823
[junit4:junit4]   2> 4228 T2296 oazs.ZooKeeperServer.finishSessionInit Established session 0x13c9b3e80840006 with negotiated timeout 20000 for client /127.0.0.1:49823
[junit4:junit4]   2> 4229 T2332 oaz.ClientCnxn$SendThread.onConnected Session establishment complete on server localhost/127.0.0.1:49814, sessionid = 0x13c9b3e80840006, negotiated timeout = 20000
[junit4:junit4]   2> 4229 T2333 oascc.ConnectionManager.process Watcher org.apache.solr.common.cloud.ConnectionManager@56b21322 name:ZooKeeperConnection Watcher:127.0.0.1:49814/solr got event WatchedEvent state:SyncConnected type:None path:null path:null type:None
[junit4:junit4]   2> 4230 T2292 oascc.ConnectionManager.waitForConnected Client is connected to ZooKeeper
[junit4:junit4]   2> 4232 T2297 oazs.PrepRequestProcessor.pRequest Got user-level KeeperException when processing sessionid:0x13c9b3e80840006 type:create cxid:0x1 zxid:0x49 txntype:-1 reqpath:n/a Error Path:/solr/overseer Error:KeeperErrorCode = NodeExists for /solr/overseer
[junit4:junit4]   2> 4234 T2297 oazs.PrepRequestProcessor.pRequest Got user-level KeeperException when processing sessionid:0x13c9b3e80840006 type:create cxid:0x2 zxid:0x4a txntype:-1 reqpath:n/a Error Path:/solr/overseer Error:KeeperErrorCode = NodeExists for /solr/overseer
[junit4:junit4]   2> 4236 T2292 oasc.ZkController.createEphemeralLiveNode Register node as live in ZooKeeper:/live_nodes/127.0.0.1:49821_nb_
[junit4:junit4]   2> 4237 T2297 oazs.PrepRequestProcessor.pRequest Got user-level KeeperException when processing sessionid:0x13c9b3e80840006 type:delete cxid:0x4 zxid:0x4b txntype:-1 reqpath:n/a Error Path:/solr/live_nodes/127.0.0.1:49821_nb_ Error:KeeperErrorCode = NoNode for /solr/live_nodes/127.0.0.1:49821_nb_
[junit4:junit4]   2> 4239 T2292 oascc.SolrZkClient.makePath makePath: /live_nodes/127.0.0.1:49821_nb_
[junit4:junit4]   2> 4244 T2314 oascc.ZkStateReader$3.process Updating live nodes... (2)
[junit4:junit4]   2> 4244 T2320 oascc.ZkStateReader$3.process Updating live nodes... (2)
[junit4:junit4]   2> 4244 T2314 oascc.ZkStateReader$2.process A cluster state change: WatchedEvent state:SyncConnected type:NodeChildrenChanged path:/live_nodes, has occurred - updating... (live nodes size: 2)
[junit4:junit4]   2> 4253 T2292 oascc.ZkStateReader.createClusterStateWatchersAndUpdate Updating cluster state from ZooKeeper... 
[junit4:junit4]   2> 4265 T2334 oasc.CoreContainer.create Creating SolrCore 'collection1' using instanceDir: /Users/jenkins/jenkins-slave/workspace/Lucene-Solr-trunk-MacOSX/solr/build/solr-core/test/J0/./org.apache.solr.cloud.BasicDistributedZkTest-jetty1-1359814233800/collection1
[junit4:junit4]   2> 4265 T2334 oasc.ZkController.createCollectionZkNode Check for collection zkNode:collection1
[junit4:junit4]   2> 4266 T2334 oasc.ZkController.createCollectionZkNode Collection zkNode exists
[junit4:junit4]   2> 4267 T2334 oasc.ZkController.readConfigName Load collection config from:/collections/collection1
[junit4:junit4]   2> 4270 T2334 oasc.SolrResourceLoader.<init> new SolrResourceLoader for directory: '/Users/jenkins/jenkins-slave/workspace/Lucene-Solr-trunk-MacOSX/solr/build/solr-core/test/J0/./org.apache.solr.cloud.BasicDistributedZkTest-jetty1-1359814233800/collection1/'
[junit4:junit4]   2> 4271 T2334 oasc.SolrResourceLoader.replaceClassLoader Adding 'file:/Users/jenkins/jenkins-slave/workspace/Lucene-Solr-trunk-MacOSX/solr/build/solr-core/test/J0/org.apache.solr.cloud.BasicDistributedZkTest-jetty1-1359814233800/collection1/lib/classes/' to classloader
[junit4:junit4]   2> 4272 T2334 oasc.SolrResourceLoader.replaceClassLoader Adding 'file:/Users/jenkins/jenkins-slave/workspace/Lucene-Solr-trunk-MacOSX/solr/build/solr-core/test/J0/org.apache.solr.cloud.BasicDistributedZkTest-jetty1-1359814233800/collection1/lib/README' to classloader
[junit4:junit4]   2> 4323 T2334 oasc.SolrConfig.<init> Using Lucene MatchVersion: LUCENE_50
[junit4:junit4]   2> 4395 T2334 oasc.SolrConfig.<init> Loaded SolrConfig: solrconfig.xml
[junit4:junit4]   2> 4397 T2334 oass.IndexSchema.readSchema Reading Solr Schema
[junit4:junit4]   2> 4402 T2334 oass.IndexSchema.readSchema Schema name=test
[junit4:junit4]   2> 4942 T2334 oass.OpenExchangeRatesOrgProvider.init Initialized with rates=open-exchange-rates.json, refreshInterval=1440.
[junit4:junit4]   2> 4952 T2334 oass.IndexSchema.readSchema default search field in schema is text
[junit4:junit4]   2> 4956 T2334 oass.IndexSchema.readSchema unique key field: id
[junit4:junit4]   2> 4982 T2334 oass.FileExchangeRateProvider.reload Reloading exchange rates from file currency.xml
[junit4:junit4]   2> 4988 T2334 oass.FileExchangeRateProvider.reload Reloading exchange rates from file currency.xml
[junit4:junit4]   2> 4994 T2334 oass.OpenExchangeRatesOrgProvider.reload Reloading exchange rates from open-exchange-rates.json
[junit4:junit4]   2> 4997 T2334 oass.OpenExchangeRatesOrgProvider.reload Reloading exchange rates from open-exchange-rates.json
[junit4:junit4]   2> 5000 T2334 oasc.SolrCore.<init> [collection1] Opening new SolrCore at /Users/jenkins/jenkins-slave/workspace/Lucene-Solr-trunk-MacOSX/solr/build/solr-core/test/J0/./org.apache.solr.cloud.BasicDistributedZkTest-jetty1-1359814233800/collection1/, dataDir=./org.apache.solr.cloud.BasicDistributedZkTest-1359814230142/jetty1/
[junit4:junit4]   2> 5000 T2334 oasc.JmxMonitoredMap.<init> JMX monitoring is enabled. Adding Solr mbeans to JMX Server: com.sun.jmx.mbeanserver.JmxMBeanServer@48265f7f
[junit4:junit4]   2> 5001 T2334 oasc.SolrCore.initDirectoryFactory solr.StandardDirectoryFactory
[junit4:junit4]   2> 5002 T2334 oasc.CachingDirectoryFactory.get return new directory for /Users/jenkins/jenkins-slave/workspace/Lucene-Solr-trunk-MacOSX/solr/build/solr-core/test/J0/./org.apache.solr.cloud.BasicDistributedZkTest-1359814230142/jetty1 forceNew:false
[junit4:junit4]   2> 5002 T2334 oasc.CachingDirectoryFactory.close Releasing directory:/Users/jenkins/jenkins-slave/workspace/Lucene-Solr-trunk-MacOSX/solr/build/solr-core/test/J0/./org.apache.solr.cloud.BasicDistributedZkTest-1359814230142/jetty1
[junit4:junit4]   2> 5003 T2334 oasc.SolrCore.getNewIndexDir New index directory detected: old=null new=./org.apache.solr.cloud.BasicDistributedZkTest-1359814230142/jetty1/index/
[junit4:junit4]   2> 5003 T2334 oasc.SolrCore.initIndex WARNING [collection1] Solr index directory './org.apache.solr.cloud.BasicDistributedZkTest-1359814230142/jetty1/index' doesn't exist. Creating new index...
[junit4:junit4]   2> 5004 T2334 oasc.CachingDirectoryFactory.get return new directory for /Users/jenkins/jenkins-slave/workspace/Lucene-Solr-trunk-MacOSX/solr/build/solr-core/test/J0/./org.apache.solr.cloud.BasicDistributedZkTest-1359814230142/jetty1/index forceNew:false
[junit4:junit4]   2> 5008 T2334 oasc.SolrDeletionPolicy.onCommit SolrDeletionPolicy.onCommit: commits:num=1
[junit4:junit4]   2> 		commit{dir=RateLimitedDirectoryWrapper(org.apache.lucene.store.NIOFSDirectory@/Users/jenkins/jenkins-slave/workspace/Lucene-Solr-trunk-MacOSX/solr/build/solr-core/test/J0/org.apache.solr.cloud.BasicDistributedZkTest-1359814230142/jetty1/index lockFactory=org.apache.lucene.store.NativeFSLockFactory@5d32660b),segFN=segments_1,generation=1,filenames=[segments_1]
[junit4:junit4]   2> 5008 T2334 oasc.SolrDeletionPolicy.updateCommits newest commit = 1[segments_1]
[junit4:junit4]   2> 5009 T2334 oasc.CachingDirectoryFactory.close Releasing directory:/Users/jenkins/jenkins-slave/workspace/Lucene-Solr-trunk-MacOSX/solr/build/solr-core/test/J0/./org.apache.solr.cloud.BasicDistributedZkTest-1359814230142/jetty1/index
[junit4:junit4]   2> 5009 T2334 oasc.SolrCore.initWriters created xml: solr.XMLResponseWriter
[junit4:junit4]   2> 5013 T2334 oasup.UpdateRequestProcessorChain.init inserting DistributedUpdateProcessorFactory into updateRequestProcessorChain "dedupe"
[junit4:junit4]   2> 5013 T2334 oasup.UpdateRequestProcessorChain.init inserting DistributedUpdateProcessorFactory into updateRequestProcessorChain "dedupe-allfields"
[junit4:junit4]   2> 5014 T2334 oasup.UpdateRequestProcessorChain.init inserting DistributedUpdateProcessorFactory into updateRequestProcessorChain "stored_sig"
[junit4:junit4]   2> 5014 T2334 oasup.UpdateRequestProcessorChain.init inserting DistributedUpdateProcessorFactory into updateRequestProcessorChain "uniq-fields"
[junit4:junit4]   2> 5016 T2334 oasup.UpdateRequestProcessorChain.init inserting DistributedUpdateProcessorFactory into updateRequestProcessorChain "distrib-dup-test-chain-implicit"
[junit4:junit4]   2> 5017 T2334 oasc.RequestHandlers.initHandlersFromConfig adding lazy requestHandler: solr.ReplicationHandler
[junit4:junit4]   2> 5017 T2334 oasc.RequestHandlers.initHandlersFromConfig created /replication: solr.ReplicationHandler
[junit4:junit4]   2> 5018 T2334 oasc.RequestHandlers.initHandlersFromConfig created standard: solr.StandardRequestHandler
[junit4:junit4]   2> 5019 T2334 oasc.RequestHandlers.initHandlersFromConfig created /get: solr.RealTimeGetHandler
[junit4:junit4]   2> 5021 T2334 oasc.RequestHandlers.initHandlersFromConfig created dismax: solr.SearchHandler
[junit4:junit4]   2> 5022 T2334 oasc.RequestHandlers.initHandlersFromConfig created mock: org.apache.solr.core.MockQuerySenderListenerReqHandler
[junit4:junit4]   2> 5023 T2334 oasc.RequestHandlers.initHandlersFromConfig created /admin/: org.apache.solr.handler.admin.AdminHandlers
[junit4:junit4]   2> 5023 T2334 oasc.RequestHandlers.initHandlersFromConfig created defaults: solr.StandardRequestHandler
[junit4:junit4]   2> 5024 T2334 oasc.RequestHandlers.initHandlersFromConfig adding lazy requestHandler: solr.StandardRequestHandler
[junit4:junit4]   2> 5024 T2334 oasc.RequestHandlers.initHandlersFromConfig created lazy: solr.StandardRequestHandler
[junit4:junit4]   2> 5025 T2334 oasc.RequestHandlers.initHandlersFromConfig created /update: solr.UpdateRequestHandler
[junit4:junit4]   2> 5026 T2334 oasc.RequestHandlers.initHandlersFromConfig created /terms: org.apache.solr.handler.component.SearchHandler
[junit4:junit4]   2> 5026 T2334 oasc.RequestHandlers.initHandlersFromConfig created spellCheckCompRH: org.apache.solr.handler.component.SearchHandler
[junit4:junit4]   2> 5027 T2334 oasc.RequestHandlers.initHandlersFromConfig created spellCheckCompRH_Direct: org.apache.solr.handler.component.SearchHandler
[junit4:junit4]   2> 5028 T2334 oasc.RequestHandlers.initHandlersFromConfig created spellCheckWithWordbreak: org.apache.solr.handler.component.SearchHandler
[junit4:junit4]   2> 5029 T2334 oasc.RequestHandlers.initHandlersFromConfig created spellCheckWithWordbreak_Direct: org.apache.solr.handler.component.SearchHandler
[junit4:junit4]   2> 5030 T2334 oasc.RequestHandlers.initHandlersFromConfig created spellCheckCompRH1: org.apache.solr.handler.component.SearchHandler
[junit4:junit4]   2> 5030 T2334 oasc.RequestHandlers.initHandlersFromConfig created mltrh: org.apache.solr.handler.component.SearchHandler
[junit4:junit4]   2> 5031 T2334 oasc.RequestHandlers.initHandlersFromConfig created tvrh: org.apache.solr.handler.component.SearchHandler
[junit4:junit4]   2> 5032 T2334 oasc.RequestHandlers.initHandlersFromConfig created /mlt: solr.MoreLikeThisHandler
[junit4:junit4]   2> 5033 T2334 oasc.RequestHandlers.initHandlersFromConfig created /debug/dump: solr.DumpRequestHandler
[junit4:junit4]   2> 5041 T2334 oashl.XMLLoader.init xsltCacheLifetimeSeconds=60
[junit4:junit4]   2> 5044 T2334 oasc.SolrCore.initDeprecatedSupport WARNING solrconfig.xml uses deprecated <admin/gettableFiles>, Please update your config to use the ShowFileRequestHandler.
[junit4:junit4]   2> 5046 T2334 oasc.SolrCore.initDeprecatedSupport WARNING adding ShowFileRequestHandler with hidden files: [SCHEMA.XML, OLD_SYNONYMS.TXT, STOPWORDS.TXT, PROTWORDS.TXT, OPEN-EXCHANGE-RATES.JSON, SYNONYMS.TXT, CURRENCY.XML, MAPPING-ISOLATIN1ACCENT.TXT]
[junit4:junit4]   2> 5049 T2334 oasc.CachingDirectoryFactory.close Releasing directory:/Users/jenkins/jenkins-slave/workspace/Lucene-Solr-trunk-MacOSX/solr/build/solr-core/test/J0/./org.apache.solr.cloud.BasicDistributedZkTest-1359814230142/jetty1
[junit4:junit4]   2> 5050 T2334 oass.SolrIndexSearcher.<init> Opening Searcher@61855429 main
[junit4:junit4]   2> 5052 T2334 oasu.CommitTracker.<init> Hard AutoCommit: disabled
[junit4:junit4]   2> 5052 T2334 oasu.CommitTracker.<init> Soft AutoCommit: disabled
[junit4:junit4]   2> 5053 T2334 oashc.SpellCheckComponent.inform Initializing spell checkers
[junit4:junit4]   2> 5059 T2334 oass.DirectSolrSpellChecker.init init: {name=direct,classname=DirectSolrSpellChecker,field=lowerfilt,minQueryLength=3}
[junit4:junit4]   2> 5093 T2335 oasc.SolrCore.registerSearcher [collection1] Registered new searcher Searcher@61855429 main{StandardDirectoryReader(segments_1:1)}
[junit4:junit4]   2> 5102 T2334 oasc.ZkController.publish publishing core=collection1 state=down
[junit4:junit4]   2> 5103 T2315 oascc.ZkStateReader.updateClusterState Updating cloud state from ZooKeeper... 
[junit4:junit4]   2> 5103 T2334 oasc.ZkController.publish numShards not found on descriptor - reading it from system property
[junit4:junit4]   2> 5105 T2315 oasc.Overseer$ClusterStateUpdater.updateState Update state numShards=1 message={
[junit4:junit4]   2> 	  "operation":"state",
[junit4:junit4]   2> 	  "numShards":"1",
[junit4:junit4]   2> 	  "shard":"shard1",
[junit4:junit4]   2> 	  "roles":null,
[junit4:junit4]   2> 	  "state":"active",
[junit4:junit4]   2> 	  "core":"collection1",
[junit4:junit4]   2> 	  "collection":"control_collection",
[junit4:junit4]   2> 	  "node_name":"127.0.0.1:49817_nb_",
[junit4:junit4]   2> 	  "base_url":"http://127.0.0.1:49817/nb_"}
[junit4:junit4]   2> 5114 T2315 oasc.Overseer$ClusterStateUpdater.updateState Update state numShards=2 message={
[junit4:junit4]   2> 	  "operation":"state",
[junit4:junit4]   2> 	  "numShards":"2",
[junit4:junit4]   2> 	  "shard":null,
[junit4:junit4]   2> 	  "roles":null,
[junit4:junit4]   2> 	  "state":"down",
[junit4:junit4]   2> 	  "core":"collection1",
[junit4:junit4]   2> 	  "collection":"collection1",
[junit4:junit4]   2> 	  "node_name":"127.0.0.1:49821_nb_",
[junit4:junit4]   2> 	  "base_url":"http://127.0.0.1:49821/nb_"}
[junit4:junit4]   2> 5114 T2315 oasc.Overseer$ClusterStateUpdater.createCollection Create collection collection1 with numShards 2
[junit4:junit4]   2> 5114 T2315 oasc.Overseer$ClusterStateUpdater.updateState Assigning new node to shard shard=shard1
[junit4:junit4]   2> 5123 T2320 oascc.ZkStateReader$2.process A cluster state change: WatchedEvent state:SyncConnected type:NodeDataChanged path:/clusterstate.json, has occurred - updating... (live nodes size: 2)
[junit4:junit4]   2> 5123 T2333 oascc.ZkStateReader$2.process A cluster state change: WatchedEvent state:SyncConnected type:NodeDataChanged path:/clusterstate.json, has occurred - updating... (live nodes size: 2)
[junit4:junit4]   2> 5123 T2314 oascc.ZkStateReader$2.process A cluster state change: WatchedEvent state:SyncConnected type:NodeDataChanged path:/clusterstate.json, has occurred - updating... (live nodes size: 2)
[junit4:junit4]   2> 6107 T2334 oasc.CoreContainer.registerCore registering core: collection1
[junit4:junit4]   2> 6108 T2334 oasc.ZkController.register Register replica - core:collection1 address:http://127.0.0.1:49821/nb_ collection:collection1 shard:shard1
[junit4:junit4]   2> 6112 T2334 oascc.SolrZkClient.makePath makePath: /collections/collection1/leader_elect/shard1/election
[junit4:junit4]   2> 6146 T2297 oazs.PrepRequestProcessor.pRequest Got user-level KeeperException when processing sessionid:0x13c9b3e80840006 type:delete cxid:0x43 zxid:0x5a txntype:-1 reqpath:n/a Error Path:/solr/collections/collection1/leaders Error:KeeperErrorCode = NoNode for /solr/collections/collection1/leaders
[junit4:junit4]   2> 6148 T2334 oasc.ShardLeaderElectionContext.runLeaderProcess Running the leader process.
[junit4:junit4]   2> 6151 T2297 oazs.PrepRequestProcessor.pRequest Got user-level KeeperException when processing sessionid:0x13c9b3e80840006 type:create cxid:0x44 zxid:0x5b txntype:-1 reqpath:n/a Error Path:/solr/overseer Error:KeeperErrorCode = NodeExists for /solr/overseer
[junit4:junit4]   2> 6160 T2334 oasc.ShardLeaderElectionContext.waitForReplicasToComeUp Enough replicas found to continue.
[junit4:junit4]   2> 6161 T2334 oasc.ShardLeaderElectionContext.runLeaderProcess I may be the new leader - try and sync
[junit4:junit4]   2> 6161 T2334 oasc.SyncStrategy.sync Sync replicas to http://127.0.0.1:49821/nb_/collection1/
[junit4:junit4]   2> 6162 T2334 oasc.SyncStrategy.syncReplicas Sync Success - now sync replicas to me
[junit4:junit4]   2> 6163 T2334 oasc.SyncStrategy.syncToMe http://127.0.0.1:49821/nb_/collection1/ has no replicas
[junit4:junit4]   2> 6164 T2334 oasc.ShardLeaderElectionContext.runLeaderProcess I am the new leader: http://127.0.0.1:49821/nb_/collection1/
[junit4:junit4]   2> 6165 T2334 oascc.SolrZkClient.makePath makePath: /collections/collection1/leaders/shard1
[junit4:junit4]   2> 6185 T2297 oazs.PrepRequestProcessor.pRequest Got user-level KeeperException when processing sessionid:0x13c9b3e80840006 type:create cxid:0x4e zxid:0x5f txntype:-1 reqpath:n/a Error Path:/solr/overseer Error:KeeperErrorCode = NodeExists for /solr/overseer
[junit4:junit4]   2> 6639 T2315 oascc.ZkStateReader.updateClusterState Updating cloud state from ZooKeeper... 
[junit4:junit4]   2> 6653 T2320 oascc.ZkStateReader$2.process A cluster state change: WatchedEvent state:SyncConnected type:NodeDataChanged path:/clusterstate.json, has occurred - updating... (live nodes size: 2)
[junit4:junit4]   2> 6653 T2314 oascc.ZkStateReader$2.process A cluster state change: WatchedEvent state:SyncConnected type:NodeDataChanged path:/clusterstate.json, has occurred - updating... (live nodes size: 2)
[junit4:junit4]   2> 6653 T2333 oascc.ZkStateReader$2.process A cluster state change: WatchedEvent state:SyncConnected type:NodeDataChanged path:/clusterstate.json, has occurred - updating... (live nodes size: 2)
[junit4:junit4]   2> 6673 T2334 oasc.ZkController.register We are http://127.0.0.1:49821/nb_/collection1/ and leader is http://127.0.0.1:49821/nb_/collection1/
[junit4:junit4]   2> 6674 T2334 oasc.ZkController.register No LogReplay needed for core=collection1 baseURL=http://127.0.0.1:49821/nb_
[junit4:junit4]   2> 6674 T2334 oasc.ZkController.checkRecovery I am the leader, no recovery necessary
[junit4:junit4]   2> 6674 T2334 oasc.ZkController.publish publishing core=collection1 state=active
[junit4:junit4]   2> 6674 T2334 oasc.ZkController.publish numShards not found on descriptor - reading it from system property
[junit4:junit4]   2> 6677 T2334 oascc.ZkStateReader.updateClusterState Updating cloud state from ZooKeeper... 
[junit4:junit4]   2> 6679 T2292 oass.SolrDispatchFilter.init user.dir=/Users/jenkins/jenkins-slave/workspace/Lucene-Solr-trunk-MacOSX/solr/build/solr-core/test/J0
[junit4:junit4]   2> 6680 T2292 oass.SolrDispatchFilter.init SolrDispatchFilter.init() done
[junit4:junit4]   2> 6681 T2292 oascsi.HttpClientUtil.createClient Creating new http client, config:maxConnections=128&maxConnectionsPerHost=32&followRedirects=false
[junit4:junit4]   2> 6852 T2292 oejs.Server.doStart jetty-8.1.8.v20121106
[junit4:junit4]   2> 6856 T2292 oejs.AbstractConnector.doStart Started SelectChannelConnector@127.0.0.1:49824
[junit4:junit4]   2> 6858 T2292 oass.SolrDispatchFilter.init SolrDispatchFilter.init()
[junit4:junit4]   2> 6859 T2292 oasc.SolrResourceLoader.locateSolrHome JNDI not configured for solr (NoInitialContextEx)
[junit4:junit4]   2> 6860 T2292 oasc.SolrResourceLoader.locateSolrHome using system property solr.solr.home: /Users/jenkins/jenkins-slave/workspace/Lucene-Solr-trunk-MacOSX/solr/build/solr-core/test/J0/./org.apache.solr.cloud.BasicDistributedZkTest-jetty2-1359814236822
[junit4:junit4]   2> 6861 T2292 oasc.CoreContainer$Initializer.initialize looking for solr.xml: /Users/jenkins/jenkins-slave/workspace/Lucene-Solr-trunk-MacOSX/solr/build/solr-core/test/J0/./org.apache.solr.cloud.BasicDistributedZkTest-jetty2-1359814236822/solr.xml
[junit4:junit4]   2> 6862 T2292 oasc.CoreContainer.<init> New CoreContainer 1998173801
[junit4:junit4]   2> 6863 T2292 oasc.CoreContainer.load Loading CoreContainer using Solr Home: '/Users/jenkins/jenkins-slave/workspace/Lucene-Solr-trunk-MacOSX/solr/build/solr-core/test/J0/./org.apache.solr.cloud.BasicDistributedZkTest-jetty2-1359814236822/'
[junit4:junit4]   2> 6864 T2292 oasc.SolrResourceLoader.<init> new SolrResourceLoader for directory: '/Users/jenkins/jenkins-slave/workspace/Lucene-Solr-trunk-MacOSX/solr/build/solr-core/test/J0/./org.apache.solr.cloud.BasicDistributedZkTest-jetty2-1359814236822/'
[junit4:junit4]   2> 6938 T2292 oashc.HttpShardHandlerFactory.getParameter Setting socketTimeout to: 60000
[junit4:junit4]   2> 6939 T2292 oashc.HttpShardHandlerFactory.getParameter Setting urlScheme to: http://
[junit4:junit4]   2> 6940 T2292 oashc.HttpShardHandlerFactory.getParameter Setting connTimeout to: 15000
[junit4:junit4]   2> 6941 T2292 oashc.HttpShardHandlerFactory.getParameter Setting maxConnectionsPerHost to: 20
[junit4:junit4]   2> 6942 T2292 oashc.HttpShardHandlerFactory.getParameter Setting corePoolSize to: 0
[junit4:junit4]   2> 6943 T2292 oashc.HttpShardHandlerFactory.getParameter Setting maximumPoolSize to: 2147483647
[junit4:junit4]   2> 6944 T2292 oashc.HttpShardHandlerFactory.getParameter Setting maxThreadIdleTime to: 5
[junit4:junit4]   2> 6945 T2292 oashc.HttpShardHandlerFactory.getParameter Setting sizeOfQueue to: -1
[junit4:junit4]   2> 6946 T2292 oashc.HttpShardHandlerFactory.getParameter Setting fairnessPolicy to: false
[junit4:junit4]   2> 6948 T2292 oascsi.HttpClientUtil.createClient Creating new http client, config:maxConnectionsPerHost=20&maxConnections=10000&socketTimeout=60000&connTimeout=15000&retry=false
[junit4:junit4]   2> 6970 T2292 oasc.CoreContainer.load Registering Log Listener
[junit4:junit4]   2> 7003 T2292 oasc.CoreContainer.initZooKeeper Zookeeper client=127.0.0.1:49814/solr
[junit4:junit4]   2> 7004 T2292 oasc.ZkController.checkChrootPath zkHost includes chroot
[junit4:junit4]   2> 7004 T2292 oaz.ZooKeeper.<init> Initiating client connection, connectString=127.0.0.1:49814 sessionTimeout=60000 watcher=org.apache.solr.common.cloud.ConnectionManager@1dab84fc
[junit4:junit4]   2> 7005 T2292 oascc.ConnectionManager.waitForConnected Waiting for client to connect to ZooKeeper
[junit4:junit4]   2> 7006 T2345 oaz.ClientCnxn$SendThread.logStartConnect Opening socket connection to server localhost/127.0.0.1:49814. Will not attempt to authenticate using SASL (access denied ("javax.security.auth.AuthPermission" "getLoginConfiguration"))
[junit4:junit4]   2> 7006 T2345 oaz.ClientCnxn$SendThread.primeConnection Socket connection established to localhost/127.0.0.1:49814, initiating session
[junit4:junit4]   2> 7007 T2294 oazs.NIOServerCnxnFactory.run Accepted socket connection from /127.0.0.1:49825
[junit4:junit4]   2> 7007 T2294 oazs.ZooKeeperServer.processConnectRequest Client attempting to establish new session at /127.0.0.1:49825
[junit4:junit4]   2> 7009 T2296 oazs.ZooKeeperServer.finishSessionInit Established session 0x13c9b3e80840007 with negotiated timeout 20000 for client /127.0.0.1:49825
[junit4:junit4]   2> 7009 T2345 oaz.ClientCnxn$SendThread.onConnected Session establishment complete on server localhost/127.0.0.1:49814, sessionid = 0x13c9b3e80840007, negotiated timeout = 20000
[junit4:junit4]   2> 7009 T2346 oascc.ConnectionManager.process Watcher org.apache.solr.common.cloud.ConnectionManager@1dab84fc name:ZooKeeperConnection Watcher:127.0.0.1:49814 got event WatchedEvent state:SyncConnected type:None path:null path:null type:None
[junit4:junit4]   2> 7010 T2292 oascc.ConnectionManager.waitForConnected Client is connected to ZooKeeper
[junit4:junit4]   2> 7013 T2297 oazs.PrepRequestProcessor.pRequest2Txn Processed session termination for sessionid: 0x13c9b3e80840007
[junit4:junit4]   2> 7016 T2294 oazs.NIOServerCnxn.closeSock Closed socket connection for client /127.0.0.1:49825 which had sessionid 0x13c9b3e80840007
[junit4:junit4]   2> 7017 T2346 oaz.ClientCnxn$EventThread.run EventThread shut down
[junit4:junit4]   2> 7016 T2292 oaz.ZooKeeper.close Session: 0x13c9b3e80840007 closed
[junit4:junit4]   2> 7018 T2292 oascsi.HttpClientUtil.createClient Creating new http client, config:maxConnections=500&maxConnectionsPerHost=16&socketTimeout=60000&connTimeout=15000
[junit4:junit4]   2> 7024 T2292 oaz.ZooKeeper.<init> Initiating client connection, connectString=127.0.0.1:49814/solr sessionTimeout=30000 watcher=org.apache.solr.common.cloud.ConnectionManager@95a0edc
[junit4:junit4]   2> 7025 T2292 oascc.ConnectionManager.waitForConnected Waiting for client to connect to ZooKeeper
[junit4:junit4]   2> 7026 T2347 oaz.ClientCnxn$SendThread.logStartConnect Opening socket connection to server localhost/127.0.0.1:49814. Will not attempt to authenticate using SASL (access denied ("javax.security.auth.AuthPermission" "getLoginConfiguration"))
[junit4:junit4]   2> 7026 T2347 oaz.ClientCnxn$SendThread.primeConnection Socket connection established to localhost/127.0.0.1:49814, initiating session
[junit4:junit4]   2> 7027 T2294 oazs.NIOServerCnxnFactory.run Accepted socket connection from /127.0.0.1:49826
[junit4:junit4]   2> 7028 T2294 oazs.ZooKeeperServer.processConnectRequest Client attempting to establish new session at /127.0.0.1:49826
[junit4:junit4]   2> 7030 T2296 oazs.ZooKeeperServer.finishSessionInit Established session 0x13c9b3e80840008 with negotiated timeout 20000 for client /127.0.0.1:49826
[junit4:junit4]   2> 7030 T2347 oaz.ClientCnxn$SendThread.onConnected Session establishment complete on server localhost/127.0.0.1:49814, sessionid = 0x13c9b3e80840008, negotiated timeout = 20000
[junit4:junit4]   2> 7030 T2348 oascc.ConnectionManager.process Watcher org.apache.solr.common.cloud.ConnectionManager@95a0edc name:ZooKeeperConnection Watcher:127.0.0.1:49814/solr got event WatchedEvent state:SyncConnected type:None path:null path:null type:None
[junit4:junit4]   2> 7031 T2292 oascc.ConnectionManager.waitForConnected Client is connected to ZooKeeper
[junit4:junit4]   2> 7033 T2297 oazs.PrepRequestProcessor.pRequest Got user-level KeeperException when processing sessionid:0x13c9b3e80840008 type:create cxid:0x1 zxid:0x6c txntype:-1 reqpath:n/a Error Path:/solr/overseer Error:KeeperErrorCode = NodeExists for /solr/overseer
[junit4:junit4]   2> 7035 T2297 oazs.PrepRequestProcessor.pRequest Got user-level KeeperException when processing sessionid:0x13c9b3e80840008 type:create cxid:0x2 zxid:0x6d txntype:-1 reqpath:n/a Error Path:/solr/overseer Error:KeeperErrorCode = NodeExists for /solr/overseer
[junit4:junit4]   2> 7037 T2292 oasc.ZkController.createEphemeralLiveNode Register node as live in ZooKeeper:/live_nodes/127.0.0.1:49824_nb_
[junit4:junit4]   2> 7038 T2297 oazs.PrepRequestProcessor.pRequest Got user-level KeeperException when processing sessionid:0x13c9b3e80840008 type:delete cxid:0x4 zxid:0x6e txntype:-1 reqpath:n/a Error Path:/solr/live_nodes/127.0.0.1:49824_nb_ Error:KeeperErrorCode = NoNode for /solr/live_nodes/127.0.0.1:49824_nb_
[junit4:junit4]   2> 7039 T2292 oascc.SolrZkClient.makePath makePath: /live_nodes/127.0.0.1:49824_nb_
[junit4:junit4]   2> 7044 T2320 oascc.ZkStateReader$3.process Updating live nodes... (3)
[junit4:junit4]   2> 7045 T2320 oascc.ZkStateReader$2.process A cluster state change: WatchedEvent state:SyncConnected type:NodeChildrenChanged path:/live_nodes, has occurred - updating... (live nodes size: 3)
[junit4:junit4]   2> 7045 T2314 oascc.ZkStateReader$3.process Updating live nodes... (3)
[junit4:junit4]   2> 7045 T2314 oascc.ZkStateReader$2.process A cluster state change: WatchedEvent state:SyncConnected type:NodeChildrenChanged path:/live_nodes, has occurred - updating... (live nodes size: 3)
[junit4:junit4]   2> 7045 T2333 oascc.ZkStateReader$3.process Updating live nodes... (3)
[junit4:junit4]   2> 7046 T2333 oascc.ZkStateReader$2.process A cluster state change: WatchedEvent state:SyncConnected type:NodeChildrenChanged path:/live_nodes, has occurred - updating... (live nodes size: 3)
[junit4:junit4]   2> 7053 T2292 oascc.ZkStateReader.createClusterStateWatchersAndUpdate Updating cluster state from ZooKeeper... 
[junit4:junit4]   2> 7063 T2349 oasc.CoreContainer.create Creating SolrCore 'collection1' using instanceDir: /Users/jenkins/jenkins-slave/workspace/Lucene-Solr-trunk-MacOSX/solr/build/solr-core/test/J0/./org.apache.solr.cloud.BasicDistributedZkTest-jetty2-1359814236822/collection1
[junit4:junit4]   2> 7063 T2349 oasc.ZkController.createCollectionZkNode Check for collection zkNode:collection1
[junit4:junit4]   2> 7065 T2349 oasc.ZkController.createCollectionZkNode Collection zkNode exists
[junit4:junit4]   2> 7065 T2349 oasc.ZkController.readConfigName Load collection config from:/collections/collection1
[junit4:junit4]   2> 7067 T2349 oasc.SolrResourceLoader.<init> new SolrResourceLoader for directory: '/Users/jenkins/jenkins-slave/workspace/Lucene-Solr-trunk-MacOSX/solr/build/solr-core/test/J0/./org.apache.solr.cloud.BasicDistributedZkTest-jetty2-1359814236822/collection1/'
[junit4:junit4]   2> 7068 T2349 oasc.SolrResourceLoader.replaceClassLoader Adding 'file:/Users/jenkins/jenkins-slave/workspace/Lucene-Solr-trunk-MacOSX/solr/build/solr-core/test/J0/org.apache.solr.cloud.BasicDistributedZkTest-jetty2-1359814236822/collection1/lib/classes/' to classloader
[junit4:junit4]   2> 7069 T2349 oasc.SolrResourceLoader.replaceClassLoader Adding 'file:/Users/jenkins/jenkins-slave/workspace/Lucene-Solr-trunk-MacOSX/solr/build/solr-core/test/J0/org.apache.solr.cloud.BasicDistributedZkTest-jetty2-1359814236822/collection1/lib/README' to classloader
[junit4:junit4]   2> 7122 T2349 oasc.SolrConfig.<init> Using Lucene MatchVersion: LUCENE_50
[junit4:junit4]   2> 7201 T2349 oasc.SolrConfig.<init> Loaded SolrConfig: solrconfig.xml
[junit4:junit4]   2> 7202 T2349 oass.IndexSchema.readSchema Reading Solr Schema
[junit4:junit4]   2> 7208 T2349 oass.IndexSchema.readSchema Schema name=test
[junit4:junit4]   2> 7737 T2349 oass.OpenExchangeRatesOrgProvider.init Initialized with rates=open-exchange-rates.json, refreshInterval=1440.
[junit4:junit4]   2> 7743 T2349 oass.IndexSchema.readSchema default search field in schema is text
[junit4:junit4]   2> 7746 T2349 oass.IndexSchema.readSchema unique key field: id
[junit4:junit4]   2> 7769 T2349 oass.FileExchangeRateProvider.reload Reloading exchange rates from file currency.xml
[junit4:junit4]   2> 7774 T2349 oass.FileExchangeRateProvider.reload Reloading exchange rates from file currency.xml
[junit4:junit4]   2> 7779 T2349 oass.OpenExchangeRatesOrgProvider.reload Reloading exchange rates from open-exchange-rates.json
[junit4:junit4]   2> 7781 T2349 oass.OpenExchangeRatesOrgProvider.reload Reloading exchange rates from open-exchange-rates.json
[junit4:junit4]   2> 7783 T2349 oasc.SolrCore.<init> [collection1] Opening new SolrCore at /Users/jenkins/jenkins-slave/workspace/Lucene-Solr-trunk-MacOSX/solr/build/solr-core/test/J0/./org.apache.solr.cloud.BasicDistributedZkTest-jetty2-1359814236822/collection1/, dataDir=./org.apache.solr.cloud.BasicDistributedZkTest-1359814230142/jetty2/
[junit4:junit4]   2> 7783 T2349 oasc.JmxMonitoredMap.<init> JMX monitoring is enabled. Adding Solr mbeans to JMX Server: com.sun.jmx.mbeanserver.JmxMBeanServer@48265f7f
[junit4:junit4]   2> 7784 T2349 oasc.SolrCore.initDirectoryFactory solr.StandardDirectoryFactory
[junit4:junit4]   2> 7785 T2349 oasc.CachingDirectoryFactory.get return new directory for /Users/jenkins/jenkins-slave/workspace/Lucene-Solr-trunk-MacOSX/solr/build/solr-core/test/J0/./org.apache.solr.cloud.BasicDistributedZkTest-1359814230142/jetty2 forceNew:false
[junit4:junit4]   2> 7785 T2349 oasc.CachingDirectoryFactory.close Releasing directory:/Users/jenkins/jenkins-slave/workspace/Lucene-Solr-trunk-MacOSX/solr/build/solr-core/test/J0/./org.apache.solr.cloud.BasicDistributedZkTest-1359814230142/jetty2
[junit4:junit4]   2> 7785 T2349 oasc.SolrCore.getNewIndexDir New index directory detected: old=null new=./org.apache.solr.cloud.BasicDistributedZkTest-1359814230142/jetty2/index/
[junit4:junit4]   2> 7786 T2349 oasc.SolrCore.initIndex WARNING [collection1] Solr index directory './org.apache.solr.cloud.BasicDistributedZkTest-1359814230142/jetty2/index' doesn't exist. Creating new index...
[junit4:junit4]   2> 7786 T2349 oasc.CachingDirectoryFactory.get return new directory for /Users/jenkins/jenkins-slave/workspace/Lucene-Solr-trunk-MacOSX/solr/build/solr-core/test/J0/./org.apache.solr.cloud.BasicDistributedZkTest-1359814230142/jetty2/index forceNew:false
[junit4:junit4]   2> 7790 T2349 oasc.SolrDeletionPolicy.onCommit SolrDeletionPolicy.onCommit: commits:num=1
[junit4:junit4]   2> 		commit{dir=RateLimitedDirectoryWrapper(org.apache.lucene.store.NIOFSDirectory@/Users/jenkins/jenkins-slave/workspace/Lucene-Solr-trunk-MacOSX/solr/build/solr-core/test/J0/org.apache.solr.cloud.BasicDistributedZkTest-1359814230142/jetty2/index lockFactory=org.apache.lucene.store.NativeFSLockFactory@77fc892a),segFN=segments_1,generation=1,filenames=[segments_1]
[junit4:junit4]   2> 7791 T2349 oasc.SolrDeletionPolicy.updateCommits newest commit = 1[segments_1]
[junit4:junit4]   2> 7791 T2349 oasc.CachingDirectoryFactory.close Releasing directory:/Users/jenkins/jenkins-slave/workspace/Lucene-Solr-trunk-MacOSX/solr/build/solr-core/test/J0/./org.apache.solr.cloud.BasicDistributedZkTest-1359814230142/jetty2/index
[junit4:junit4]   2> 7792 T2349 oasc.SolrCore.initWriters created xml: solr.XMLResponseWriter
[junit4:junit4]   2> 7794 T2349 oasup.UpdateRequestProcessorChain.init inserting DistributedUpdateProcessorFactory into updateRequestProcessorChain "dedupe"
[junit4:junit4]   2> 7794 T2349 oasup.UpdateRequestProcessorChain.init inserting DistributedUpdateProcessorFactory into updateRequestProcessorChain "dedupe-allfields"
[junit4:junit4]   2> 7795 T2349 oasup.UpdateRequestProcessorChain.init inserting DistributedUpdateProcessorFactory into updateRequestProcessorChain "stored_sig"
[junit4:junit4]   2> 7795 T2349 oasup.UpdateRequestProcessorChain.init inserting DistributedUpdateProcessorFactory into updateRequestProcessorChain "uniq-fields"
[junit4:junit4]   2> 7796 T2349 oasup.UpdateRequestProcessorChain.init inserting DistributedUpdateProcessorFactory into updateRequestProcessorChain "distrib-dup-test-chain-implicit"
[junit4:junit4]   2> 7796 T2349 oasc.RequestHandlers.initHandlersFromConfig adding lazy requestHandler: solr.ReplicationHandler
[junit4:junit4]   2> 7797 T2349 oasc.RequestHandlers.initHandlersFromConfig created /replication: solr.ReplicationHandler
[junit4:junit4]   2> 7797 T2349 oasc.RequestHandlers.initHandlersFromConfig created standard: solr.StandardRequestHandler
[junit4:junit4]   2> 7798 T2349 oasc.RequestHandlers.initHandlersFromConfig created /get: solr.RealTimeGetHandler
[junit4:junit4]   2> 7798 T2349 oasc.RequestHandlers.initHandlersFromConfig created dismax: solr.SearchHandler
[junit4:junit4]   2> 7799 T2349 oasc.RequestHandlers.initHandlersFromConfig created mock: org.apache.solr.core.MockQuerySenderListenerReqHandler
[junit4:junit4]   2> 7799 T2349 oasc.RequestHandlers.initHandlersFromConfig created /admin/: org.apache.solr.handler.admin.AdminHandlers
[junit4:junit4]   2> 7800 T2349 oasc.RequestHandlers.initHandlersFromConfig created defaults: solr.StandardRequestHandler
[junit4:junit4]   2> 7800 T2349 oasc.RequestHandlers.initHandlersFromConfig adding lazy requestHandler: solr.StandardRequestHandler
[junit4:junit4]   2> 7801 T2349 oasc.RequestHandlers.initHandlersFromConfig created lazy: solr.StandardRequestHandler
[junit4:junit4]   2> 7801 T2349 oasc.RequestHandlers.initHandlersFromConfig created /update: solr.UpdateRequestHandler
[junit4:junit4]   2> 7802 T2349 oasc.RequestHandlers.initHandlersFromConfig created /terms: org.apache.solr.handler.component.SearchHandler
[junit4:junit4]   2> 7803 T2349 oasc.RequestHandlers.initHandlersFromConfig created spellCheckCompRH: org.apache.solr.handler.component.SearchHandler
[junit4:junit4]   2> 7803 T2349 oasc.RequestHandlers.initHandlersFromConfig created spellCheckCompRH_Direct: org.apache.solr.handler.component.SearchHandler
[junit4:junit4]   2> 7804 T2349 oasc.RequestHandlers.initHandlersFromConfig created spellCheckWithWordbreak: org.apache.solr.handler.component.SearchHandler
[junit4:junit4]   2> 7804 T2349 oasc.RequestHandlers.initHandlersFromConfig created spellCheckWithWordbreak_Direct: org.apache.solr.handler.component.SearchHandler
[junit4:junit4]   2> 7805 T2349 oasc.RequestHandlers.initHandlersFromConfig created spellCheckCompRH1: org.apache.solr.handler.component.SearchHandler
[junit4:junit4]   2> 7806 T2349 oasc.RequestHandlers.initHandlersFromConfig created mltrh: org.apache.solr.handler.component.SearchHandler
[junit4:junit4]   2> 7807 T2349 oasc.RequestHandlers.initHandlersFromConfig created tvrh: org.apache.solr.handler.component.SearchHandler
[junit4:junit4]   2> 7808 T2349 oasc.RequestHandlers.initHandlersFromConfig created /mlt: solr.MoreLikeThisHandler
[junit4:junit4]   2> 7808 T2349 oasc.RequestHandlers.initHandlersFromConfig created /debug/dump: solr.DumpRequestHandler
[junit4:junit4]   2> 7814 T2349 oashl.XMLLoader.init xsltCacheLifetimeSeconds=60
[junit4:junit4]   2> 7817 T2349 oasc.SolrCore.initDeprecatedSupport WARNING solrconfig.xml uses deprecated <admin/gettableFiles>, Please update your config to use the ShowFileRequestHandler.
[junit4:junit4]   2> 7819 T2349 oasc.SolrCore.initDeprecatedSupport WARNING adding ShowFileRequestHandler with hidden files: [SCHEMA.XML, OLD_SYNONYMS.TXT, STOPWORDS.TXT, PROTWORDS.TXT, OPEN-EXCHANGE-RATES.JSON, SYNONYMS.TXT, CURRENCY.XML, MAPPING-ISOLATIN1ACCENT.TXT]
[junit4:junit4]   2> 7821 T2349 oasc.CachingDirectoryFactory.close Releasing directory:/Users/jenkins/jenkins-slave/workspace/Lucene-Solr-trunk-MacOSX/solr/build/solr-core/test/J0/./org.apache.solr.cloud.BasicDistributedZkTest-1359814230142/jetty2
[junit4:junit4]   2> 7823 T2349 oass.SolrIndexSearcher.<init> Opening Searcher@4e065653 main
[junit4:junit4]   2> 7824 T2349 oasu.CommitTracker.<init> Hard AutoCommit: disabled
[junit4:junit4]   2> 7824 T2349 oasu.CommitTracker.<init> Soft AutoCommit: disabled
[junit4:junit4]   2> 7825 T2349 oashc.SpellCheckComponent.inform Initializing spell checkers
[junit4:junit4]   2> 7830 T2349 oass.DirectSolrSpellChecker.init init: {name=direct,classname=DirectSolrSpellChecker,field=lowerfilt,minQueryLength=3}
[junit4:junit4]   2> 7861 T2350 oasc.SolrCore.registerSearcher [collection1] Registered new searcher Searcher@4e065653 main{StandardDirectoryReader(segments_1:1)}
[junit4:junit4]   2> 7867 T2349 oasc.ZkController.publish publishing core=collection1 state=down
[junit4:junit4]   2> 7867 T2349 oasc.ZkController.publish numShards not found on descriptor - reading it from system property
[junit4:junit4]   2> 8166 T2315 oascc.ZkStateReader.updateClusterState Updating cloud state from ZooKeeper... 
[junit4:junit4]   2> 8168 T2315 oasc.Overseer$ClusterStateUpdater.updateState Update state numShards=2 message={
[junit4:junit4]   2> 	  "operation":"state",
[junit4:junit4]   2> 	  "numShards":"2",
[junit4:junit4]   2> 	  "shard":"shard1",
[junit4:junit4]   2> 	  "roles":null,
[junit4:junit4]   2> 	  "state":"active",
[junit4:junit4]   2> 	  "core":"collection1",
[junit4:junit4]   2> 	  "collection":"collection1",
[junit4:junit4]   2> 	  "node_name":"127.0.0.1:49821_nb_",
[junit4:junit4]   2> 	  "base_url":"http://127.0.0.1:49821/nb_"}
[junit4:junit4]   2> 8174 T2315 oasc.Overseer$ClusterStateUpdater.updateState Update state numShards=2 message={
[junit4:junit4]   2> 	  "operation":"state",
[junit4:junit4]   2> 	  "numShards":"2",
[junit4:junit4]   2> 	  "shard":null,
[junit4:junit4]   2> 	  "roles":null,
[junit4:junit4]   2> 	  "state":"down",
[junit4:junit4]   2> 	  "core":"collection1",
[junit4:junit4]   2> 	  "collection":"collection1",
[junit4:junit4]   2> 	  "node_name":"127.0.0.1:49824_nb_",
[junit4:junit4]   2> 	  "base_url":"http://127.0.0.1:49824/nb_"}
[junit4:junit4]   2> 8174 T2315 oasc.Overseer$ClusterStateUpdater.updateState Collection already exists with numShards=2
[junit4:junit4]   2> 8174 T2315 oasc.Overseer$ClusterStateUpdater.updateState Assigning new node to shard shard=shard2
[junit4:junit4]   2> 8184 T2348 oascc.ZkStateReader$2.process A cluster state change: WatchedEvent state:SyncConnected type:NodeDataChanged path:/clusterstate.json, has occurred - updating... (live nodes size: 3)
[junit4:junit4]   2> 8185 T2320 oascc.ZkStateReader$2.process A cluster state change: WatchedEvent state:SyncConnected type:NodeDataChanged path:/clusterstate.json, has occurred - updating... (live nodes size: 3)
[junit4:junit4]   2> 8185 T2333 oascc.ZkStateReader$2.process A cluster state change: WatchedEvent state:SyncConnected type:NodeDataChanged path:/clusterstate.json, has occurred - updating... (live nodes size: 3)
[junit4:junit4]   2> 8185 T2314 oascc.ZkStateReader$2.process A cluster state change: WatchedEvent state:SyncConnected type:NodeDataChanged path:/clusterstate.json, has occurred - updating... (live nodes size: 3)
[junit4:junit4]   2> 8871 T2349 oasc.CoreContainer.registerCore registering core: collection1
[junit4:junit4]   2> 8871 T2349 oasc.ZkController.register Register replica - core:collection1 address:http://127.0.0.1:49824/nb_ collection:collection1 shard:shard2
[junit4:junit4]   2> 8873 T2349 oascc.SolrZkClient.makePath makePath: /collections/collection1/leader_elect/shard2/election
[junit4:junit4]   2> 8886 T2297 oazs.PrepRequestProcessor.pRequest Got user-level KeeperException when processing sessionid:0x13c9b3e80840008 type:delete cxid:0x42 zxid:0x7c txntype:-1 reqpath:n/a Error Path:/solr/collections/collection1/leaders/shard2 Error:KeeperErrorCode = NoNode for /solr/collections/collection1/leaders/shard2
[junit4:junit4]   2> 8887 T2349 oasc.ShardLeaderElectionContext.runLeaderProcess Running the leader process.
[junit4:junit4]   2> 8888 T2297 oazs.PrepRequestProcessor.pRequest Got user-level KeeperException when processing sessionid:0x13c9b3e80840008 type:create cxid:0x43 zxid:0x7d txntype:-1 reqpath:n/a Error Path:/solr/overseer Error:KeeperErrorCode = NodeExists for /solr/overseer
[junit4:junit4]   2> 8891 T2349 oasc.ShardLeaderElectionContext.waitForReplicasToComeUp Enough replicas found to continue.
[junit4:junit4]   2> 8892 T2349 oasc.ShardLeaderElectionContext.runLeaderProcess I may be the new leader - try and sync
[junit4:junit4]   2> 8892 T2349 oasc.SyncStrategy.sync Sync replicas to http://127.0.0.1:49824/nb_/collection1/
[junit4:junit4]   2> 8892 T2349 oasc.SyncStrategy.syncReplicas Sync Success - now sync replicas to me
[junit4:junit4]   2> 8892 T2349 oasc.SyncStrategy.syncToMe http://127.0.0.1:49824/nb_/collection1/ has no replicas
[junit4:junit4]   2> 8893 T2349 oasc.ShardLeaderElectionContext.runLeaderProcess I am the new leader: http://127.0.0.1:49824/nb_/collection1/
[junit4:junit4]   2> 8893 T2349 oascc.SolrZkClient.makePath makePath: /collections/collection1/leaders/shard2
[junit4:junit4]   2> 8900 T2297 oazs.PrepRequestProcessor.pRequest Got user-level KeeperException when processing sessionid:0x13c9b3e80840008 type:create cxid:0x4c zxid:0x80 txntype:-1 reqpath:n/a Error Path:/solr/overseer Error:KeeperErrorCode = NodeExists for /solr/overseer
[junit4:junit4]   2> 9698 T2315 oascc.ZkStateReader.updateClusterState Updating cloud state from ZooKeeper... 
[junit4:junit4]   2> 9715 T2320 oascc.ZkStateReader$2.process A cluster state change: WatchedEvent state:SyncConnected type:NodeDataChanged path:/clusterstate.json, has occurred - updating... (live nodes size: 3)
[junit4:junit4]   2> 9715 T2333 oascc.ZkStateReader$2.process A cluster state change: WatchedEvent state:SyncConnected type:NodeDataChanged path:/clusterstate.json, has occurred - updating... (live nodes size: 3)
[junit4:junit4]   2> 9716 T2314 oascc.ZkStateReader$2.process A cluster state change: WatchedEvent state:SyncConnected type:NodeDataChanged path:/clusterstate.json, has occurred - updating... (live nodes size: 3)
[junit4:junit4]   2> 9715 T2348 oascc.ZkStateReader$2.process A cluster state change: WatchedEvent state:SyncConnected type:NodeDataChanged path:/clusterstate.json, has occurred - updating... (live nodes size: 3)
[junit4:junit4]   2> 9724 T2349 oasc.ZkController.register We are http://127.0.0.1:49824/nb_/collection1/ and leader is http://127.0.0.1:49824/nb_/collection1/
[junit4:junit4]   2> 9725 T2349 oasc.ZkController.register No LogReplay needed for core=collection1 baseURL=http://127.0.0.1:49824/nb_
[junit4:junit4]   2> 9725 T2349 oasc.ZkController.checkRecovery I am the leader, no recovery necessary
[junit4:junit4]   2> 9725 T2349 oasc.ZkController.publish publishing core=collection1 state=active
[junit4:junit4]   2> 9725 T2349 oasc.ZkController.publish numShards not found on descriptor - reading it from system property
[junit4:junit4]   2> 9728 T2349 oascc.ZkStateReader.updateClusterState Updating cloud state from ZooKeeper... 
[junit4:junit4]   2> 9730 T2292 oass.SolrDispatchFilter.init user.dir=/Users/jenkins/jenkins-slave/workspace/Lucene-Solr-trunk-MacOSX/solr/build/solr-core/test/J0
[junit4:junit4]   2> 9730 T2292 oass.SolrDispatchFilter.init SolrDispatchFilter.init() done
[junit4:junit4]   2> 9731 T2292 oascsi.HttpClientUtil.createClient Creating new http client, config:maxConnections=128&maxConnectionsPerHost=32&followRedirects=false
[junit4:junit4]   2> 9884 T2292 oejs.Server.doStart jetty-8.1.8.v20121106
[junit4:junit4]   2> 9887 T2292 oejs.AbstractConnector.doStart Started SelectChannelConnector@127.0.0.1:49827
[junit4:junit4]   2> 9888 T2292 oass.SolrDispatchFilter.init SolrDispatchFilter.init()
[junit4:junit4]   2> 9888 T2292 oasc.SolrResourceLoader.locateSolrHome JNDI not configured for solr (NoInitialContextEx)
[junit4:junit4]   2> 9889 T2292 oasc.SolrResourceLoader.locateSolrHome using system property solr.solr.home: /Users/jenkins/jenkins-slave/workspace/Lucene-Solr-trunk-MacOSX/solr/build/solr-core/test/J0/./org.apache.solr.cloud.BasicDistributedZkTest-jetty3-1359814239870
[junit4:junit4]   2> 9889 T2292 oasc.CoreContainer$Initializer.initialize looking for solr.xml: /Users/jenkins/jenkins-slave/workspace/Lucene-Solr-trunk-MacOSX/solr/build/solr-core/test/J0/./org.apache.solr.cloud.BasicDistributedZkTest-jetty3-1359814239870/solr.xml
[junit4:junit4]   2> 9889 T2292 oasc.CoreContainer.<init> New CoreContainer 1339624951
[junit4:junit4]   2> 9890 T2292 oasc.CoreContainer.load Loading CoreContainer using Solr Home: '/Users/jenkins/jenkins-slave/workspace/Lucene-Solr-trunk-MacOSX/solr/build/solr-core/test/J0/./org.apache.solr.cloud.BasicDistributedZkTest-jetty3-1359814239870/'
[junit4:junit4]   2> 9890 T2292 oasc.SolrResourceLoader.<init> new SolrResourceLoader for directory: '/Users/jenkins/jenkins-slave/workspace/Lucene-Solr-trunk-MacOSX/solr/build/solr-core/test/J0/./org.apache.solr.cloud.BasicDistributedZkTest-jetty3-1359814239870/'
[junit4:junit4]   2> 9921 T2292 oashc.HttpShardHandlerFactory.getParameter Setting socketTimeout to: 60000
[junit4:junit4]   2> 9922 T2292 oashc.HttpShardHandlerFactory.getParameter Setting urlScheme to: http://
[junit4:junit4]   2> 9922 T2292 oashc.HttpShardHandlerFactory.getParameter Setting connTimeout to: 15000
[junit4:junit4]   2> 9923 T2292 oashc.HttpShardHandlerFactory.getParameter Setting maxConnectionsPerHost to: 20
[junit4:junit4]   2> 9923 T2292 oashc.HttpShardHandlerFactory.getParameter Setting corePoolSize to: 0
[junit4:junit4]   2> 9924 T2292 oashc.HttpShardHandlerFactory.getParameter Setting maximumPoolSize to: 2147483647
[junit4:junit4]   2> 9924 T2292 oashc.HttpShardHandlerFactory.getParameter Setting maxThreadIdleTime to: 5
[junit4:junit4]   2> 9925 T2292 oashc.HttpShardHandlerFactory.getParameter Setting sizeOfQueue to: -1
[junit4:junit4]   2> 9925 T2292 oashc.HttpShardHandlerFactory.getParameter Setting fairnessPolicy to: false
[junit4:junit4]   2> 9926 T2292 oascsi.HttpClientUtil.createClient Creating new http client, config:maxConnectionsPerHost=20&maxConnections=10000&socketTimeout=60000&connTimeout=15000&retry=false
[junit4:junit4]   2> 9937 T2292 oasc.CoreContainer.load Registering Log Listener
[junit4:junit4]   2> 9954 T2292 oasc.CoreContainer.initZooKeeper Zookeeper client=127.0.0.1:49814/solr
[junit4:junit4]   2> 9955 T2292 oasc.ZkController.checkChrootPath zkHost includes chroot
[junit4:junit4]   2> 9956 T2292 oaz.ZooKeeper.<init> Initiating client connection, connectString=127.0.0.1:49814 sessionTimeout=60000 watcher=org.apache.solr.common.cloud.ConnectionManager@29b70051
[junit4:junit4]   2> 9957 T2292 oascc.ConnectionManager.waitForConnected Waiting for client to connect to ZooKeeper
[junit4:junit4]   2> 9957 T2360 oaz.ClientCnxn$SendThread.logStartConnect Opening socket connection to server localhost/127.0.0.1:49814. Will not attempt to authenticate using SASL (access denied ("javax.security.auth.AuthPermission" "getLoginConfiguration"))
[junit4:junit4]   2> 9958 T2360 oaz.ClientCnxn$SendThread.primeConnection Socket connection established to localhost/127.0.0.1:49814, initiating session
[junit4:junit4]   2> 9958 T2294 oazs.NIOServerCnxnFactory.run Accepted socket connection from /127.0.0.1:49828
[junit4:junit4]   2> 9959 T2294 oazs.ZooKeeperServer.processConnectRequest Client attempting to establish new session at /127.0.0.1:49828
[junit4:junit4]   2> 9960 T2296 oazs.ZooKeeperServer.finishSessionInit Established session 0x13c9b3e80840009 with negotiated timeout 20000 for client /127.0.0.1:49828
[junit4:junit4]   2> 9961 T2360 oaz.ClientCnxn$SendThread.onConnected Session establishment complete on server localhost/127.0.0.1:49814, sessionid = 0x13c9b3e80840009, negotiated timeout = 20000
[junit4:junit4]   2> 9961 T2361 oascc.ConnectionManager.process Watcher org.apache.solr.common.cloud.ConnectionManager@29b70051 name:ZooKeeperConnection Watcher:127.0.0.1:49814 got event WatchedEvent state:SyncConnected type:None path:null path:null type:None
[junit4:junit4]   2> 9962 T2292 oascc.ConnectionManager.waitForConnected Client is connected to ZooKeeper
[junit4:junit4]   2> 9964 T2297 oazs.PrepRequestProcessor.pRequest2Txn Processed session termination for sessionid: 0x13c9b3e80840009
[junit4:junit4]   2> 9965 T2294 oazs.NIOServerCnxn.closeSock Closed socket connection for client /127.0.0.1:49828 which had sessionid 0x13c9b3e80840009
[junit4:junit4]   2> 9965 T2292 oaz.ZooKeeper.close Session: 0x13c9b3e80840009 closed
[junit4:junit4]   2> 9965 T2361 oaz.ClientCnxn$EventThread.run EventThread shut down
[junit4:junit4]   2> 9966 T2292 oascsi.HttpClientUtil.createClient Creating new http client, config:maxConnections=500&maxConnectionsPerHost=16&socketTimeout=60000&connTimeout=15000
[junit4:junit4]   2> 9972 T2292 oaz.ZooKeeper.<init> Initiating client connection, connectString=127.0.0.1:49814/solr sessionTimeout=30000 watcher=org.apache.solr.common.cloud.ConnectionManager@7830bf90
[junit4:junit4]   2> 9973 T2292 oascc.ConnectionManager.waitForConnected Waiting for client to connect to ZooKeeper
[junit4:junit4]   2> 9974 T2362 oaz.ClientCnxn$SendThread.logStartConnect Opening socket connection to server localhost/127.0.0.1:49814. Will not attempt to authenticate using SASL (access denied ("javax.security.auth.AuthPermission" "getLoginConfiguration"))
[junit4:junit4]   2> 9975 T2362 oaz.ClientCnxn$SendThread.primeConnection Socket connection established to localhost/127.0.0.1:49814, initiating session
[junit4:junit4]   2> 9975 T2294 oazs.NIOServerCnxnFactory.run Accepted socket connection from /127.0.0.1:49829
[junit4:junit4]   2> 9975 T2294 oazs.ZooKeeperServer.processConnectRequest Client attempting to establish new session at /127.0.0.1:49829
[junit4:junit4]   2> 9977 T2296 oazs.ZooKeeperServer.finishSessionInit Established session 0x13c9b3e8084000a with negotiated timeout 20000 for client /127.0.0.1:49829
[junit4:junit4]   2> 9977 T2362 oaz.ClientCnxn$SendThread.onConnected Session establishment complete on server localhost/127.0.0.1:49814, sessionid = 0x13c9b3e8084000a, negotiated timeout = 20000
[junit4:junit4]   2> 9978 T2363 oascc.ConnectionManager.process Watcher org.apache.solr.common.cloud.ConnectionManager@7830bf90 name:ZooKeeperConnection Watcher:127.0.0.1:49814/solr got event WatchedEvent state:SyncConnected type:None path:null path:null type:None
[junit4:junit4]   2> 9978 T2292 oascc.ConnectionManager.waitForConnected Client is connected to ZooKeeper
[junit4:junit4]   2> 9980 T2297 oazs.PrepRequestProcessor.pRequest Got user-level KeeperException when processing sessionid:0x13c9b3e8084000a type:create cxid:0x1 zxid:0x8d txntype:-1 reqpath:n/a Error Path:/solr/overseer Error:KeeperErrorCode = NodeExists for /solr/overseer
[junit4:junit4]   2> 9981 T2297 oazs.PrepRequestProcessor.pRequest Got user-level KeeperException when processing sessionid:0x13c9b3e8084000a type:create cxid:0x2 zxid:0x8e txntype:-1 reqpath:n/a Error Path:/solr/overseer Error:KeeperErrorCode = NodeExists for /solr/overseer
[junit4:junit4]   2> 9983 T2292 oasc.ZkController.createEphemeralLiveNode Register node as live in ZooKeeper:/live_nodes/127.0.0.1:49827_nb_
[junit4:junit4]   2> 9985 T2297 oazs.PrepRequestProcessor.pRequest Got user-level KeeperException when processing sessionid:0x13c9b3e8084000a type:delete cxid:0x4 zxid:0x8f txntype:-1 reqpath:n/a Error Path:/solr/live_nodes/127.0.0.1:49827_nb_ Error:KeeperErrorCode = NoNode for /solr/live_nodes/127.0.0.1:49827_nb_
[junit4:junit4]   2> 9986 T2292 oascc.SolrZkClient.makePath makePath: /live_nodes/127.0.0.1:49827_nb_
[junit4:junit4]   2> 9992 T2333 oascc.ZkStateReader$3.process Updating live nodes... (4)
[junit4:junit4]   2> 9993 T2333 oascc.ZkStateReader$2.process A cluster state change: WatchedEvent state:SyncConnected type:NodeChildrenChanged path:/live_nodes, has occurred - updating... (live nodes size: 4)
[junit4:junit4]   2> 9993 T2348 oascc.ZkStateReader$3.process Updating live nodes... (4)
[junit4:junit4]   2> 9993 T2348 oascc.ZkStateReader$2.process A cluster state change: WatchedEvent state:SyncConnected type:NodeChildrenChanged path:/live_nodes, has occurred - updating... (live nodes size: 4)
[junit4:junit4]   2> 9994 T2320 oascc.ZkStateReader$3.process Updating live nodes... (4)
[junit4:junit4]   2> 9995 T2320 oascc.ZkStateReader$2.process A cluster state change: WatchedEvent state:SyncConnected type:NodeChildrenChanged path:/live_nodes, has occurred - updating... (live nodes size: 4)
[junit4:junit4]   2> 9995 T2314 oascc.ZkStateReader$3.process Updating live nodes... (4)
[junit4:junit4]   2> 9996 T2314 oascc.ZkStateReader$2.process A cluster state change: WatchedEvent state:SyncConnected type:NodeChildrenChanged path:/live_nodes, has occurred - updating... (live nodes size: 4)
[junit4:junit4]   2> 10002 T2292 oascc.ZkStateReader.createClusterStateWatchersAndUpdate Updating cluster state from ZooKeeper... 
[junit4:junit4]   2> 10009 T2364 oasc.CoreContainer.create Creating SolrCore 'collection1' using instanceDir: /Users/jenkins/jenkins-slave/workspace/Lucene-Solr-trunk-MacOSX/solr/build/solr-core/test/J0/./org.apache.solr.cloud.BasicDistributedZkTest-jetty3-1359814239870/collection1
[junit4:junit4]   2> 10010 T2364 oasc.ZkController.createCollectionZkNode Check for collection zkNode:collection1
[junit4:junit4]   2> 10011 T2364 oasc.ZkController.createCollectionZkNode Collection zkNode exists
[junit4:junit4]   2> 10011 T2364 oasc.ZkController.readConfigName Load collection config from:/collections/collection1
[junit4:junit4]   2> 10014 T2364 oasc.SolrResourceLoader.<init> new SolrResourceLoader for directory: '/Users/jenkins/jenkins-slave/workspace/Lucene-Solr-trunk-MacOSX/solr/build/solr-core/test/J0/./org.apache.solr.cloud.BasicDistributedZkTest-jetty3-1359814239870/collection1/'
[junit4:junit4]   2> 10016 T2364 oasc.SolrResourceLoader.replaceClassLoader Adding 'file:/Users/jenkins/jenkins-slave/workspace/Lucene-Solr-trunk-MacOSX/solr/build/solr-core/test/J0/org.apache.solr.cloud.BasicDistributedZkTest-jetty3-1359814239870/collection1/lib/classes/' to classloader
[junit4:junit4]   2> 10018 T2364 oasc.SolrResourceLoader.replaceClassLoader Adding 'file:/Users/jenkins/jenkins-slave/workspace/Lucene-Solr-trunk-MacOSX/solr/build/solr-core/test/J0/org.apache.solr.cloud.BasicDistributedZkTest-jetty3-1359814239870/collection1/lib/README' to classloader
[junit4:junit4]   2> 10088 T2364 oasc.SolrConfig.<init> Using Lucene MatchVersion: LUCENE_50
[junit4:junit4]   2> 10152 T2364 oasc.SolrConfig.<init> Loaded SolrConfig: solrconfig.xml
[junit4:junit4]   2> 10154 T2364 oass.IndexSchema.readSchema Reading Solr Schema
[junit4:junit4]   2> 10159 T2364 oass.IndexSchema.readSchema Schema name=test
[junit4:junit4]   2> 10713 T2364 oass.OpenExchangeRatesOrgProvider.init Initialized with rates=open-exchange-rates.json, refreshInterval=1440.
[junit4:junit4]   2> 10721 T2364 oass.IndexSchema.readSchema default search field in schema is text
[junit4:junit4]   2> 10726 T2364 oass.IndexSchema.readSchema unique key field: id
[junit4:junit4]   2> 10749 T2364 oass.FileExchangeRateProvider.reload Reloading exchange rates from file currency.xml
[junit4:junit4]   2> 10755 T2364 oass.FileExchangeRateProvider.reload Reloading exchange rates from file currency.xml
[junit4:junit4]   2> 10762 T2364 oass.OpenExchangeRatesOrgProvider.reload Reloading exchange rates from open-exchange-rates.json
[junit4:junit4]   2> 10765 T2364 oass.OpenExchangeRatesOrgProvider.reload Reloading exchange rates from open-exchange-rates.json
[junit4:junit4]   2> 10767 T2364 oasc.SolrCore.<init> [collection1] Opening new SolrCore at /Users/jenkins/jenkins-slave/workspace/Lucene-Solr-trunk-MacOSX/solr/build/solr-core/test/J0/./org.apache.solr.cloud.BasicDistributedZkTest-jetty3-1359814239870/collection1/, dataDir=./org.apache.solr.cloud.BasicDistributedZkTest-1359814230142/jetty3/
[junit4:junit4]   2> 10768 T2364 oasc.JmxMonitoredMap.<init> JMX monitoring is enabled. Adding Solr mbeans to JMX Server: com.sun.jmx.mbeanserver.JmxMBeanServer@48265f7f
[junit4:junit4]   2> 10768 T2364 oasc.SolrCore.initDirectoryFactory solr.StandardDirectoryFactory
[junit4:junit4]   2> 10769 T2364 oasc.CachingDirectoryFactory.get return new directory for /Users/jenkins/jenkins-slave/workspace/Lucene-Solr-trunk-MacOSX/solr/build/solr-core/test/J0/./org.apache.solr.cloud.BasicDistributedZkTest-1359814230142/jetty3 forceNew:false
[junit4:junit4]   2> 10770 T2364 oasc.CachingDirectoryFactory.close Releasing directory:/Users/jenkins/jenkins-slave/workspace/Lucene-Solr-trunk-MacOSX/solr/build/solr-core/test/J0/./org.apache.solr.cloud.BasicDistributedZkTest-1359814230142/jetty3
[junit4:junit4]   2> 10770 T2364 oasc.SolrCore.getNewIndexDir New index directory detected: old=null new=./org.apache.solr.cloud.BasicDistributedZkTest-1359814230142/jetty3/index/
[junit4:junit4]   2> 10771 T2364 oasc.SolrCore.initIndex WARNING [collection1] Solr index directory './org.apache.solr.cloud.BasicDistributedZkTest-1359814230142/jetty3/index' doesn't exist. Creating new index...
[junit4:junit4]   2> 10772 T2364 oasc.CachingDirectoryFactory.get return new directory for /Users/jenkins/jenkins-slave/workspace/Lucene-Solr-trunk-MacOSX/solr/build/solr-core/test/J0/./org.apache.solr.cloud.BasicDistributedZkTest-1359814230142/jetty3/index forceNew:false
[junit4:junit4]   2> 10776 T2364 oasc.SolrDeletionPolicy.onCommit SolrDeletionPolicy.onCommit: commits:num=1
[junit4:junit4]   2> 		commit{dir=RateLimitedDirectoryWrapper(org.apache.lucene.store.NIOFSDirectory@/Users/jenkins/jenkins-slave/workspace/Lucene-Solr-trunk-MacOSX/solr/build/solr-core/test/J0/org.apache.solr.cloud.BasicDistributedZkTest-1359814230142/jetty3/index lockFactory=org.apache.lucene.store.NativeFSLockFactory@22442b88),segFN=segments_1,generation=1,filenames=[segments_1]
[junit4:junit4]   2> 10777 T2364 oasc.SolrDeletionPolicy.updateCommits newest commit = 1[segments_1]
[junit4:junit4]   2> 10777 T2364 oasc.CachingDirectoryFactory.close Releasing directory:/Users/jenkins/jenkins-slave/workspace/Lucene-Solr-trunk-MacOSX/solr/build/solr-core/test/J0/./org.apache.solr.cloud.BasicDistributedZkTest-1359814230142/jetty3/index
[junit4:junit4]   2> 10778 T2364 oasc.SolrCore.initWriters created xml: solr.XMLResponseWriter
[junit4:junit4]   2> 10781 T2364 oasup.UpdateRequestProcessorChain.init inserting DistributedUpdateProcessorFactory into updateRequestProcessorChain "dedupe"
[junit4:junit4]   2> 10781 T2364 oasup.UpdateRequestProcessorChain.init inserting DistributedUpdateProcessorFactory into updateRequestProcessorChain "dedupe-allfields"
[junit4:junit4]   2> 10781 T2364 oasup.UpdateRequestProcessorChain.init inserting DistributedUpdateProcessorFactory into updateRequestProcessorChain "stored_sig"
[junit4:junit4]   2> 10782 T2364 oasup.UpdateRequestProcessorChain.init inserting DistributedUpdateProcessorFactory into updateRequestProcessorChain "uniq-fields"
[junit4:junit4]   2> 10783 T2364 oasup.UpdateRequestProcessorChain.init inserting DistributedUpdateProcessorFactory into updateRequestProcessorChain "distrib-dup-test-chain-implicit"
[junit4:junit4]   2> 10783 T2364 oasc.RequestHandlers.initHandlersFromConfig adding lazy requestHandler: solr.ReplicationHandler
[junit4:junit4]   2> 10784 T2364 oasc.RequestHandlers.initHandlersFromConfig created /replication: solr.ReplicationHandler
[junit4:junit4]   2> 10784 T2364 oasc.RequestHandlers.initHandlersFromConfig created standard: solr.StandardRequestHandler
[junit4:junit4]   2> 10785 T2364 oasc.RequestHandlers.initHandlersFromConfig created /get: solr.RealTimeGetHandler
[junit4:junit4]   2> 10786 T2364 oasc.RequestHandlers.initHandlersFromConfig created dismax: solr.SearchHandler
[junit4:junit4]   2> 10786 T2364 oasc.RequestHandlers.initHandlersFromConfig created mock: org.apache.solr.core.MockQuerySenderListenerReqHandler
[junit4:junit4]   2> 10787 T2364 oasc.RequestHandlers.initHandlersFromConfig created /admin/: org.apache.solr.handler.admin.AdminHandlers
[junit4:junit4]   2> 10788 T2364 oasc.RequestHandlers.initHandlersFromConfig created defaults: solr.StandardRequestHandler
[junit4:junit4]   2> 10788 T2364 oasc.RequestHandlers.initHandlersFromConfig adding lazy requestHandler: solr.StandardRequestHandler
[junit4:junit4]   2> 10789 T2364 oasc.RequestHandlers.initHandlersFromConfig created lazy: solr.StandardRequestHandler
[junit4:junit4]   2> 10789 T2364 oasc.RequestHandlers.initHandlersFromConfig created /update: solr.UpdateRequestHandler
[junit4:junit4]   2> 10790 T2364 oasc.RequestHandlers.initHandlersFromConfig created /terms: org.apache.solr.handler.component.SearchHandler
[junit4:junit4]   2> 10791 T2364 oasc.RequestHandlers.initHandlersFromConfig created spellCheckCompRH: org.apache.solr.handler.component.SearchHandler
[junit4:junit4]   2> 10791 T2364 oasc.RequestHandlers.initHandlersFromConfig created spellCheckCompRH_Direct: org.apache.solr.handler.component.SearchHandler
[junit4:junit4]   2> 10792 T2364 oasc.RequestHandlers.initHandlersFromConfig created spellCheckWithWordbreak: org.apache.solr.handler.component.SearchHandler
[junit4:junit4]   2> 10793 T2364 oasc.RequestHandlers.initHandlersFromConfig created spellCheckWithWordbreak_Direct: org.apache.solr.handler.component.SearchHandler
[junit4:junit4]   2> 10793 T2364 oasc.RequestHandlers.initHandlersFromConfig created spellCheckCompRH1: org.apache.solr.handler.component.SearchHandler
[junit4:junit4]   2> 10794 T2364 oasc.RequestHandlers.initHandlersFromConfig created mltrh: org.apache.solr.handler.component.SearchHandler
[junit4:junit4]   2> 10795 T2364 oasc.RequestHandlers.initHandlersFromConfig created tvrh: org.apache.solr.handler.component.SearchHandler
[junit4:junit4]   2> 10796 T2364 oasc.RequestHandlers.initHandlersFromConfig created /mlt: solr.MoreLikeThisHandler
[junit4:junit4]   2> 10798 T2364 oasc.RequestHandlers.initHandlersFromConfig created /debug/dump: solr.DumpRequestHandler
[junit4:junit4]   2> 10804 T2364 oashl.XMLLoader.init xsltCacheLifetimeSeconds=60
[junit4:junit4]   2> 10808 T2364 oasc.SolrCore.initDeprecatedSupport WARNING solrconfig.xml uses deprecated <admin/gettableFiles>, Please update your config to use the ShowFileRequestHandler.
[junit4:junit4]   2> 10810 T2364 oasc.SolrCore.initDeprecatedSupport WARNING adding ShowFileRequestHandler with hidden files: [SCHEMA.XML, OLD_SYNONYMS.TXT, STOPWORDS.TXT, PROTWORDS.TXT, OPEN-EXCHANGE-RATES.JSON, SYNONYMS.TXT, CURRENCY.XML, MAPPING-ISOLATIN1ACCENT.TXT]
[junit4:junit4]   2> 10813 T2364 oasc.CachingDirectoryFactory.close Releasing directory:/Users/jenkins/jenkins-slave/workspace/Lucene-Solr-trunk-MacOSX/solr/build/solr-core/test/J0/./org.apache.solr.cloud.BasicDistributedZkTest-1359814230142/jetty3
[junit4:junit4]   2> 10816 T2364 oass.SolrIndexSearcher.<init> Opening Searcher@73c7526 main
[junit4:junit4]   2> 10817 T2364 oasu.CommitTracker.<init> Hard AutoCommit: disabled
[junit4:junit4]   2> 10818 T2364 oasu.CommitTracker.<init> Soft AutoCommit: disabled
[junit4:junit4]   2> 10818 T2364 oashc.SpellCheckComponent.inform Initializing spell checkers
[junit4:junit4]   2> 10825 T2364 oass.DirectSolrSpellChecker.init init: {name=direct,classname=DirectSolrSpellChecker,field=lowerfilt,minQueryLength=3}
[junit4:junit4]   2> 10859 T2365 oasc.SolrCore.registerSearcher [collection1] Registered new searcher Searcher@73c7526 main{StandardDirectoryReader(segments_1:1)}
[junit4:junit4]   2> 10866 T2364 oasc.ZkController.publish publishing core=collection1 state=down
[junit4:junit4]   2> 10866 T2364 oasc.ZkController.publish numShards not found on descriptor - reading it from system property
[junit4:junit4]   2> 11237 T2315 oascc.ZkStateReader.updateClusterState Updating cloud state from ZooKeeper... 
[junit4:junit4]   2> 11238 T2315 oasc.Overseer$ClusterStateUpdater.updateState Update state numShards=2 message={
[junit4:junit4]   2> 	  "operation":"state",
[junit4:junit4]   2> 	  "numShards":"2",
[junit4:junit4]   2> 	  "shard":"shard2",
[junit4:junit4]   2> 	  "roles":null,
[junit4:junit4]   2> 	  "state":"active",
[junit4:junit4]   2> 	  "core":"collection1",
[junit4:junit4]   2> 	  "collection":"collection1",
[junit4:junit4]   2> 	  "node_name":"127.0.0.1:49824_nb_",
[junit4:junit4]   2> 	  "base_url":"http://127.0.0.1:49824/nb_"}
[junit4:junit4]   2> 11244 T2315 oasc.Overseer$ClusterStateUpdater.updateState Update state numShards=2 message={
[junit4:junit4]   2> 	  "operation":"state",
[junit4:junit4]   2> 	  "numShards":"2",
[junit4:junit4]   2> 	  "shard":null,
[junit4:junit4]   2> 	  "roles":null,
[junit4:junit4]   2> 	  "state":"down",
[junit4:junit4]   2> 	  "core":"collection1",
[junit4:junit4]   2> 	  "collection":"collection1",
[junit4:junit4]   2> 	  "node_name":"127.0.0.1:49827_nb_",
[junit4:junit4]   2> 	  "base_url":"http://127.0.0.1:49827/nb_"}
[junit4:junit4]   2> 11245 T2315 oasc.Overseer$ClusterStateUpdater.updateState Collection already exists with numShards=2
[junit4:junit4]   2> 11245 T2315 oasc.Overseer$ClusterStateUpdater.updateState Assigning new node to shard shard=shard1
[junit4:junit4]   2> 11251 T2348 oascc.ZkStateReader$2.process A cluster state change: WatchedEvent state:SyncConnected type:NodeDataChanged path:/clusterstate.json, has occurred - updating... (live nodes size: 4)
[junit4:junit4]   2> 11252 T2314 oascc.ZkStateReader$2.process A cluster state change: WatchedEvent state:SyncConnected type:NodeDataChanged path:/clusterstate.json, has occurred - updating... (live nodes size: 4)
[junit4:junit4]   2> 11252 T2363 oascc.ZkStateReader$2.process A cluster state change: WatchedEvent state:SyncConnected type:NodeDataChanged path:/clusterstate.json, has occurred - updating... (live nodes size: 4)
[junit4:junit4]   2> 11253 T2320 oascc.ZkStateReader$2.process A cluster state change: WatchedEvent state:SyncConnected type:NodeDataChanged path:/clusterstate.json, has occurred - updating... (live nodes size: 4)
[junit4:junit4]   2> 11255 T2333 oascc.ZkStateReader$2.process A cluster state change: WatchedEvent state:SyncConnected type:NodeDataChanged path:/clusterstate.json, has occurred - updating... (live nodes size: 4)
[junit4:junit4]   2> 11870 T2364 oasc.CoreContainer.registerCore registering core: collection1
[junit4:junit4]   2> 11871 T2364 oasc.ZkController.register Register replica - core:collection1 address:http://127.0.0.1:49827/nb_ collection:collection1 shard:shard1
[junit4:junit4]   2> 11877 T2364 oasc.ZkController.register We are http://127.0.0.1:49827/nb_/collection1/ and leader is http://127.0.0.1:49821/nb_/collection1/
[junit4:junit4]   2> 11878 T2364 oasc.ZkController.register No LogReplay needed for core=collection1 baseURL=http://127.0.0.1:49827/nb_
[junit4:junit4]   2> 11878 T2364 oasc.ZkController.checkRecovery Core needs to recover:collection1
[junit4:junit4]   2> 11878 T2364 oasu.DefaultSolrCoreState.doRecovery Running recovery - first canceling any ongoing recovery
[junit4:junit4]   2> ASYNC  NEW_CORE C152 name=collection1 org.apache.solr.core.SolrCore@39433ec5 url=http://127.0.0.1:49827/nb_/collection1 node=127.0.0.1:49827_nb_ C152_STATE=coll:collection1 core:collection1 props:{shard=null, roles=null, state=down, core=collection1, collection=collection1, node_name=127.0.0.1:49827_nb_, base_url=http://127.0.0.1:49827/nb_}
[junit4:junit4]   2> 11879 T2366 C152 P49827 oasc.RecoveryStrategy.run Starting recovery process.  core=collection1 recoveringAfterStartup=true
[junit4:junit4]   2> 11880 T2366 C152 P49827 oasc.RecoveryStrategy.doRecovery ###### startupVersions=[]
[junit4:junit4]   2> 11880 T2366 C152 P49827 oasc.ZkController.publish publishing core=collection1 state=recovering
[junit4:junit4]   2> 11880 T2364 oascc.ZkStateReader.updateClusterState Updating cloud state from ZooKeeper... 
[junit4:junit4]   2> 11881 T2366 C152 P49827 oasc.ZkController.publish numShards not found on descriptor - reading it from system property
[junit4:junit4]   2> 11883 T2366 C152 P49827 oascsi.HttpClientUtil.createClient Creating new http client, config:maxConnections=128&maxConnectionsPerHost=32&followRedirects=false
[junit4:junit4]   2> 11883 T2292 oass.SolrDispatchFilter.init user.dir=/Users/jenkins/jenkins-slave/workspace/Lucene-Solr-trunk-MacOSX/solr/build/solr-core/test/J0
[junit4:junit4]   2> 11883 T2292 oass.SolrDispatchFilter.init SolrDispatchFilter.init() done
[junit4:junit4]   2> 11884 T2292 oascsi.HttpClientUtil.createClient Creating new http client, config:maxConnections=128&maxConnectionsPerHost=32&followRedirects=false
[junit4:junit4]   2> 12053 T2292 oejs.Server.doStart jetty-8.1.8.v20121106
[junit4:junit4]   2> 12057 T2292 oejs.AbstractConnector.doStart Started SelectChannelConnector@127.0.0.1:49831
[junit4:junit4]   2> 12059 T2292 oass.SolrDispatchFilter.init SolrDispatchFilter.init()
[junit4:junit4]   2> 12060 T2292 oasc.SolrResourceLoader.locateSolrHome JNDI not configured for solr (NoInitialContextEx)
[junit4:junit4]   2> 12060 T2292 oasc.SolrResourceLoader.locateSolrHome using system property solr.solr.home: /Users/jenkins/jenkins-slave/workspace/Lucene-Solr-trunk-MacOSX/solr/build/solr-core/test/J0/./org.apache.solr.cloud.BasicDistributedZkTest-jetty4-1359814242024
[junit4:junit4]   2> 12061 T2292 oasc.CoreContainer$Initializer.initialize looking for solr.xml: /Users/jenkins/jenkins-slave/workspace/Lucene-Solr-trunk-MacOSX/solr/build/solr-core/test/J0/./org.apache.solr.cloud.BasicDistributedZkTest-jetty4-1359814242024/solr.xml
[junit4:junit4]   2> 12061 T2292 oasc.CoreContainer.<init> New CoreContainer 406126944
[junit4:junit4]   2> 12062 T2292 oasc.CoreContainer.load Loading CoreContainer using Solr Home: '/Users/jenkins/jenkins-slave/workspace/Lucene-Solr-trunk-MacOSX/solr/build/solr-core/test/J0/./org.apache.solr.cloud.BasicDistributedZkTest-jetty4-1359814242024/'
[junit4:junit4]   2> 12062 T2292 oasc.SolrResourceLoader.<init> new SolrResourceLoader for directory: '/Users/jenkins/jenkins-slave/workspace/Lucene-Solr-trunk-MacOSX/solr/build/solr-core/test/J0/./org.apache.solr.cloud.BasicDistributedZkTest-jetty4-1359814242024/'
[junit4:junit4]   2> 12096 T2292 oashc.HttpShardHandlerFactory.getParameter Setting socketTimeout to: 60000
[junit4:junit4]   2> 12096 T2292 oashc.HttpShardHandlerFactory.getParameter Setting urlScheme to: http://
[junit4:junit4]   2> 12097 T2292 oashc.HttpShardHandlerFactory.getParameter Setting connTimeout to: 15000
[junit4:junit4]   2> 12097 T2292 oashc.HttpShardHandlerFactory.getParameter Setting maxConnectionsPerHost to: 20
[junit4:junit4]   2> 12098 T2292 oashc.HttpShardHandlerFactory.getParameter Setting corePoolSize to: 0
[junit4:junit4]   2> 12098 T2292 oashc.HttpShardHandlerFactory.getParameter Setting maximumPoolSize to: 2147483647
[junit4:junit4]   2> 12099 T2292 oashc.HttpShardHandlerFactory.getParameter Setting maxThreadIdleTime to: 5
[junit4:junit4]   2> 12099 T2292 oashc.HttpShardHandlerFactory.getParameter Setting sizeOfQueue to: -1
[junit4:junit4]   2> 12100 T2292 oashc.HttpShardHandlerFactory.getParameter Setting fairnessPolicy to: false
[junit4:junit4]   2> 12100 T2292 oascsi.HttpClientUtil.createClient Creating new http client, config:maxConnectionsPerHost=20&maxConnections=10000&socketTimeout=60000&connTimeout=15000&retry=false
[junit4:junit4]   2> 12112 T2292 oasc.CoreContainer.load Registering Log Listener
[junit4:junit4]   2> 12129 T2292 oasc.CoreContainer.initZooKeeper Zookeeper client=127.0.0.1:49814/solr
[junit4:junit4]   2> 12130 T2292 oasc.ZkController.checkChrootPath zkHost includes chroot
[junit4:junit4]   2> 12131 T2292 oaz.ZooKeeper.<init> Initiating client connection, connectString=127.0.0.1:49814 sessionTimeout=60000 watcher=org.apache.solr.common.cloud.ConnectionManager@6b8e2c08
[junit4:junit4]   2> 12132 T2292 oascc.ConnectionManager.waitForConnected Waiting for client to connect to ZooKeeper
[junit4:junit4]   2> 12132 T2376 oaz.ClientCnxn$SendThread.logStartConnect Opening socket connection to server localhost/127.0.0.1:49814. Will not attempt to authenticate using SASL (access denied ("javax.security.auth.AuthPermission" "getLoginConfiguration"))
[junit4:junit4]   2> 12133 T2376 oaz.ClientCnxn$SendThread.primeConnection Socket connection established to localhost/127.0.0.1:49814, initiating session
[junit4:junit4]   2> 12134 T2294 oazs.NIOServerCnxnFactory.run Accepted socket connection from /127.0.0.1:49832
[junit4:junit4]   2> 12134 T2294 oazs.ZooKeeperServer.processConnectRequest Client attempting to establish new session at /127.0.0.1:49832
[junit4:junit4]   2> 12135 T2296 oazs.ZooKeeperServer.finishSessionInit Established session 0x13c9b3e8084000b with negotiated timeout 20000 for client /127.0.0.1:49832
[junit4:junit4]   2> 12135 T2376 oaz.ClientCnxn$SendThread.onConnected Session establishment complete on server localhost/127.0.0.1:49814, sessionid = 0x13c9b3e8084000b, negotiated timeout = 20000
[junit4:junit4]   2> 12136 T2377 oascc.ConnectionManager.process Watcher org.apache.solr.common.cloud.ConnectionManager@6b8e2c08 name:ZooKeeperConnection Watcher:127.0.0.1:49814 got event WatchedEvent state:SyncConnected type:None path:null path:null type:None
[junit4:junit4]   2> 12136 T2292 oascc.ConnectionManager.waitForConnected Client is connected to ZooKeeper
[junit4:junit4]   2> 12139 T2297 oazs.PrepRequestProcessor.pRequest2Txn Processed session termination for sessionid: 0x13c9b3e8084000b
[junit4:junit4]   2> 12140 T2294 oazs.NIOServerCnxn.closeSock Closed socket connection for client /127.0.0.1:49832 which had sessionid 0x13c9b3e8084000b
[junit4:junit4]   2> 12140 T2292 oaz.ZooKeeper.close Session: 0x13c9b3e8084000b closed
[junit4:junit4]   2> 12140 T2377 oaz.ClientCnxn$EventThread.run EventThread shut down
[junit4:junit4]   2> 12141 T2292 oascsi.HttpClientUtil.createClient Creating new http client, config:maxConnections=500&maxConnectionsPerHost=16&socketTimeout=60000&connTimeout=15000
[junit4:junit4]   2> 12146 T2292 oaz.ZooKeeper.<init> Initiating client connection, connectString=127.0.0.1:49814/solr sessionTimeout=30000 watcher=org.apache.solr.common.cloud.ConnectionManager@792095b8
[junit4:junit4]   2> 12148 T2292 oascc.ConnectionManager.waitForConnected Waiting for client to connect to ZooKeeper
[junit4:junit4]   2> 12148 T2378 oaz.ClientCnxn$SendThread.logStartConnect Opening socket connection to server localhost/127.0.0.1:49814. Will not attempt to authenticate using SASL (access denied ("javax.security.auth.AuthPermission" "getLoginConfiguration"))
[junit4:junit4]   2> 12149 T2378 oaz.ClientCnxn$SendThread.primeConnection Socket connection established to localhost/127.0.0.1:49814, initiating session
[junit4:junit4]   2> 12149 T2294 oazs.NIOServerCnxnFactory.run Accepted socket connection from /127.0.0.1:49833
[junit4:junit4]   2> 12150 T2294 oazs.ZooKeeperServer.processConnectRequest Client attempting to establish new session at /127.0.0.1:49833
[junit4:junit4]   2> 12151 T2296 oazs.ZooKeeperServer.finishSessionInit Established session 0x13c9b3e8084000c with negotiated timeout 20000 for client /127.0.0.1:49833
[junit4:junit4]   2> 12151 T2378 oaz.ClientCnxn$SendThread.onConnected Session establishment complete on server localhost/127.0.0.1:49814, sessionid = 0x13c9b3e8084000c, negotiated timeout = 20000
[junit4:junit4]   2> 12152 T2379 oascc.ConnectionManager.process Watcher org.apache.solr.common.cloud.ConnectionManager@792095b8 name:ZooKeeperConnection Watcher:127.0.0.1:49814/solr got event WatchedEvent state:SyncConnected type:None path:null path:null type:None
[junit4:junit4]   2> 12152 T2292 oascc.ConnectionManager.waitForConnected Client is connected to ZooKeeper
[junit4:junit4]   2> 12154 T2297 oazs.PrepRequestProcessor.pRequest Got user-level KeeperException when processing sessionid:0x13c9b3e8084000c type:create cxid:0x1 zxid:0x9f txntype:-1 reqpath:n/a Error Path:/solr/overseer Error:KeeperErrorCode = NodeExists for /solr/overseer
[junit4:junit4]   2> 12156 T2297 oazs.PrepRequestProcessor.pRequest Got user-level KeeperException when processing sessionid:0x13c9b3e8084000c type:create cxid:0x2 zxid:0xa0 txntype:-1 reqpath:n/a Error Path:/solr/overseer Error:KeeperErrorCode = NodeExists for /solr/overseer
[junit4:junit4]   2> 12158 T2292 oasc.ZkController.createEphemeralLiveNode Register node as live in ZooKeeper:/live_nodes/127.0.0.1:49831_nb_
[junit4:junit4]   2> 12159 T2297 oazs.PrepRequestProcessor.pRequest Got user-level KeeperException when processing sessionid:0x13c9b3e8084000c type:delete cxid:0x4 zxid:0xa1 txntype:-1 reqpath:n/a Error Path:/solr/live_nodes/127.0.0.1:49831_nb_ Error:KeeperErrorCode = NoNode for /solr/live_nodes/127.0.0.1:49831_nb_
[junit4:junit4]   2> 12160 T2292 oascc.SolrZkClient.makePath makePath: /live_nodes/127.0.0.1:49831_nb_
[junit4:junit4]   2> 12166 T2348 oascc.ZkStateReader$3.process Updating live nodes... (5)
[junit4:junit4]   2> 12166 T2314 oascc.ZkStateReader$3.process Updating live nodes... (5)
[junit4:junit4]   2> 12166 T2363 oascc.ZkStateReader$3.process Updating live nodes... (5)
[junit4:junit4]   2> 12166 T2363 oascc.ZkStateReader$2.process A cluster state change: WatchedEvent state:SyncConnected type:NodeChildrenChanged path:/live_nodes, has occurred - updating... (live nodes size: 5)
[junit4:junit4]   2> 12166 T2348 oascc.ZkStateReader$2.process A cluster state change: WatchedEvent state:SyncConnected type:NodeChildrenChanged path:/live_nodes, has occurred - updating... (live nodes size: 5)
[junit4:junit4]   2> 12166 T2314 oascc.ZkStateReader$2.process A cluster state change: WatchedEvent state:SyncConnected type:NodeChildrenChanged path:/live_nodes, has occurred - updating... (live nodes size: 5)
[junit4:junit4]   2> 12167 T2333 oascc.ZkStateReader$3.process Updating live nodes... (5)
[junit4:junit4]   2> 12168 T2320 oascc.ZkStateReader$3.process Updating live nodes... (5)
[junit4:junit4]   2> 12168 T2320 oascc.ZkStateReader$2.process A cluster state change: WatchedEvent state:SyncConnected type:NodeChildrenChanged path:/live_nodes, has occurred - updating... (live nodes size: 5)
[junit4:junit4]   2> 12168 T2333 oascc.ZkStateReader$2.process A cluster state change: WatchedEvent state:SyncConnected type:NodeChildrenChanged path:/live_nodes, has occurred - updating... (live nodes size: 5)
[junit4:junit4]   2> 12177 T2292 oascc.ZkStateReader.createClusterStateWatchersAndUpdate Updating cluster state from ZooKeeper... 
[junit4:junit4]   2> 12186 T2380 oasc.CoreContainer.create Creating SolrCore 'collection1' using instanceDir: /Users/jenkins/jenkins-slave/workspace/Lucene-Solr-trunk-MacOSX/solr/build/solr-core/test/J0/./org.apache.solr.cloud.BasicDistributedZkTest-jetty4-1359814242024/collection1
[junit4:junit4]   2> 12186 T2380 oasc.ZkController.createCollectionZkNode Check for collection zkNode:collection1
[junit4:junit4]   2> 12187 T2380 oasc.ZkController.createCollectionZkNode Collection zkNode exists
[junit4:junit4]   2> 12188 T2380 oasc.ZkController.readConfigName Load collection config from:/collections/collection1
[junit4:junit4]   2> 12190 T2380 oasc.SolrResourceLoader.<init> new SolrResourceLoader for directory: '/Users/jenkins/jenkins-slave/workspace/Lucene-Solr-trunk-MacOSX/solr/build/solr-core/test/J0/./org.apache.solr.cloud.BasicDistributedZkTest-jetty4-1359814242024/collection1/'
[junit4:junit4]   2> 12191 T2380 oasc.SolrResourceLoader.replaceClassLoader Adding 'file:/Users/jenkins/jenkins-slave/workspace/Lucene-Solr-trunk-MacOSX/solr/build/solr-core/test/J0/org.apache.solr.cloud.BasicDistributedZkTest-jetty4-1359814242024/collection1/lib/classes/' to classloader
[junit4:junit4]   2> 12191 T2380 oasc.SolrResourceLoader.replaceClassLoader Adding 'file:/Users/jenkins/jenkins-slave/workspace/Lucene-Solr-trunk-MacOSX/solr/build/solr-core/test/J0/org.apache.solr.cloud.BasicDistributedZkTest-jetty4-1359814242024/collection1/lib/README' to classloader
[junit4:junit4]   2> 12234 T2380 oasc.SolrConfig.<init> Using Lucene MatchVersion: LUCENE_50
[junit4:junit4]   2> 12299 T2380 oasc.SolrConfig.<init> Loaded SolrConfig: solrconfig.xml
[junit4:junit4]   2> 12301 T2380 oass.IndexSchema.readSchema Reading Solr Schema
[junit4:junit4]   2> 12306 T2380 oass.IndexSchema.readSchema Schema name=test
[junit4:junit4]   2> 12765 T2315 oascc.ZkStateReader.updateClusterState Updating cloud state from ZooKeeper... 
[junit4:junit4]   2> 12767 T2315 oasc.Overseer$ClusterStateUpdater.updateState Update state numShards=2 message={
[junit4:junit4]   2> 	  "operation":"state",
[junit4:junit4]   2> 	  "numShards":"2",
[junit4:junit4]   2> 	  "shard":"shard1",
[junit4:junit4]   2> 	  "roles":null,
[junit4:junit4]   2> 	  "state":"recovering",
[junit4:junit4]   2> 	  "core":"collection1",
[junit4:junit4]   2> 	  "collection":"collection1",
[junit4:junit4]   2> 	  "node_name":"127.0.0.1:49827_nb_",
[junit4:junit4]   2> 	  "base_url":"http://127.0.0.1:49827/nb_"}
[junit4:junit4]   2> 12773 T2314 oascc.ZkStateReader$2.process A cluster state change: WatchedEvent state:SyncConnected type:NodeDataChanged path:/clusterstate.json, has occurred - updating... (live nodes size: 5)
[junit4:junit4]   2> 12773 T2379 oascc.ZkStateReader$2.process A cluster state change: WatchedEvent state:SyncConnected type:NodeDataChanged path:/clusterstate.json, has occurred - updating... (live nodes size: 5)
[junit4:junit4]   2> 12773 T2333 oascc.ZkStateReader$2.process A cluster state change: WatchedEvent state:SyncConnected type:NodeDataChanged path:/clusterstate.json, has occurred - updating... (live nodes size: 5)
[junit4:junit4]   2> 12774 T2348 oascc.ZkStateReader$2.process A cluster state change: WatchedEvent state:SyncConnected type:NodeDataChanged path:/clusterstate.json, has occurred - updating... (live nodes size: 5)
[junit4:junit4]   2> 12774 T2320 oascc.ZkStateReader$2.process A cluster state change: WatchedEvent state:SyncConnected type:NodeDataChanged path:/clusterstate.json, has occurred - updating... (live nodes size: 5)
[junit4:junit4]   2> 12773 T2363 oascc.ZkStateReader$2.process A cluster state change: WatchedEvent state:SyncConnected type:NodeDataChanged path:/clusterstate.json, has occurred - updating... (live nodes size: 5)
[junit4:junit4]   2> 12837 T2380 oass.OpenExchangeRatesOrgProvider.init Initialized with rates=open-exchange-rates.json, refreshInterval=1440.
[junit4:junit4]   2> 12846 T2380 oass.IndexSchema.readSchema default search field in schema is text
[junit4:junit4]   2> 12849 T2380 oass.IndexSchema.readSchema unique key field: id
[junit4:junit4]   2> 12876 T2380 oass.FileExchangeRateProvider.reload Reloading exchange rates from file currency.xml
[junit4:junit4]   2> 12883 T2380 oass.FileExchangeRateProvider.reload Reloading exchange rates from file currency.xml
[junit4:junit4]   2> 12889 T2380 oass.OpenExchangeRatesOrgProvider.reload Reloading exchange rates from open-exchange-rates.json
[junit4:junit4]   2> 12891 T2380 oass.OpenExchangeRatesOrgProvider.reload Reloading exchange rates from open-exchange-rates.json
[junit4:junit4]   2> 12895 T2380 oasc.SolrCore.<init> [collection1] Opening new SolrCore at /Users/jenkins/jenkins-slave/workspace/Lucene-Solr-trunk-MacOSX/solr/build/solr-core/test/J0/./org.apache.solr.cloud.BasicDistributedZkTest-jetty4-1359814242024/collection1/, dataDir=./org.apache.solr.cloud.BasicDistributedZkTest-1359814230142/jetty4/
[junit4:junit4]   2> 12895 T2380 oasc.JmxMonitoredMap.<init> JMX monitoring is enabled. Adding Solr mbeans to JMX Server: com.sun.jmx.mbeanserver.JmxMBeanServer@48265f7f
[junit4:junit4]   2> 12896 T2380 oasc.SolrCore.initDirectoryFactory solr.StandardDirectoryFactory
[junit4:junit4]   2> 12897 T2380 oasc.CachingDirectoryFactory.get return new directory for /Users/jenkins/jenkins-slave/workspace/Lucene-Solr-trunk-MacOSX/solr/build/solr-core/test/J0/./org.apache.solr.cloud.BasicDistributedZkTest-1359814230142/jetty4 forceNew:false
[junit4:junit4]   2> 12897 T2380 oasc.CachingDirectoryFactory.close Releasing directory:/Users/jenkins/jenkins-slave/workspace/Lucene-Solr-trunk-MacOSX/solr/build/solr-core/test/J0/./org.apache.solr.cloud.BasicDistributedZkTest-1359814230142/jetty4
[junit4:junit4]   2> 12897 T2380 oasc.SolrCore.getNewIndexDir New index directory detected: old=null new=./org.apache.solr.cloud.BasicDistributedZkTest-1359814230142/jetty4/index/
[junit4:junit4]   2> 12898 T2380 oasc.SolrCore.initIndex WARNING [collection1] Solr index directory './org.apache.solr.cloud.BasicDistributedZkTest-1359814230142/jetty4/index' doesn't exist. Creating new index...
[junit4:junit4]   2> 12898 T2380 oasc.CachingDirectoryFactory.get return new directory for /Users/jenkins/jenkins-slave/workspace/Lucene-Solr-trunk-MacOSX/solr/build/solr-core/test/J0/./org.apache.solr.cloud.BasicDistributedZkTest-1359814230142/jetty4/index forceNew:false
[junit4:junit4]   2> 12902 T2380 oasc.SolrDeletionPolicy.onCommit SolrDeletionPolicy.onCommit: commits:num=1
[junit4:junit4]   2> 		commit{dir=RateLimitedDirectoryWrapper(org.apache.lucene.store.NIOFSDirectory@/Users/jenkins/jenkins-slave/workspace/Lucene-Solr-trunk-MacOSX/solr/build/solr-core/test/J0/org.apache.solr.cloud.BasicDistributedZkTest-1359814230142/jetty4/index lockFactory=org.apache.lucene.store.NativeFSLockFactory@2bdbdf1e),segFN=segments_1,generation=1,filenames=[segments_1]
[junit4:junit4]   2> 12903 T2380 oasc.SolrDeletionPolicy.updateCommits newest commit = 1[segments_1]
[junit4:junit4]   2> 12903 T2380 oasc.CachingDirectoryFactory.close Releasing directory:/Users/jenkins/jenkins-slave/workspace/Lucene-Solr-trunk-MacOSX/solr/build/solr-core/test/J0/./org.apache.solr.cloud.BasicDistributedZkTest-1359814230142/jetty4/index
[junit4:junit4]   2> 12904 T2380 oasc.SolrCore.initWriters created xml: solr.XMLResponseWriter
[junit4:junit4]   2> 12906 T2380 oasup.UpdateRequestProcessorChain.init inserting DistributedUpdateProcessorFactory into updateRequestProcessorChain "dedupe"
[junit4:junit4]   2> 12906 T2380 oasup.UpdateRequestProcessorChain.init inserting DistributedUpdateProcessorFactory into updateRequestProcessorChain "dedupe-allfields"
[junit4:junit4]   2> 12907 T2380 oasup.UpdateRequestProcessorChain.init inserting DistributedUpdateProcessorFactory into updateRequestProcessorChain "stored_sig"
[junit4:junit4]   2> 12907 T2380 oasup.UpdateRequestProcessorChain.init inserting DistributedUpdateProcessorFactory into updateRequestProcessorChain "uniq-fields"
[junit4:junit4]   2> 12908 T2380 oasup.UpdateRequestProcessorChain.init inserting DistributedUpdateProcessorFactory into updateRequestProcessorChain "distrib-dup-test-chain-implicit"
[junit4:junit4]   2> 12908 T2380 oasc.RequestHandlers.initHandlersFromConfig adding lazy requestHandler: solr.ReplicationHandler
[junit4:junit4]   2> 12909 T2380 oasc.RequestHandlers.initHandlersFromConfig created /replication: solr.ReplicationHandler
[junit4:junit4]   2> 12910 T2380 oasc.RequestHandlers.initHandlersFromConfig created standard: solr.StandardRequestHandler
[junit4:junit4]   2> 12910 T2380 oasc.RequestHandlers.initHandlersFromConfig created /get: solr.RealTimeGetHandler
[junit4:junit4]   2> 12911 T2380 oasc.RequestHandlers.initHandlersFromConfig created dismax: solr.SearchHandler
[junit4:junit4]   2> 12912 T2380 oasc.RequestHandlers.initHandlersFromConfig created mock: org.apache.solr.core.MockQuerySenderListenerReqHandler
[junit4:junit4]   2> 12912 T2380 oasc.RequestHandlers.initHandlersFromConfig created /admin/: org.apache.solr.handler.admin.AdminHandlers
[junit4:junit4]   2> 12913 T2380 oasc.RequestHandlers.initHandlersFromConfig created defaults: solr.StandardRequestHandler
[junit4:junit4]   2> 12913 T2380 oasc.RequestHandlers.initHandlersFromConfig adding lazy requestHandler: solr.StandardRequestHandler
[junit4:junit4]   2> 12913 T2380 oasc.RequestHandlers.initHandlersFromConfig created lazy: solr.StandardRequestHandler
[junit4:junit4]   2> 12914 T2380 oasc.RequestHandlers.initHandlersFromConfig created /update: solr.UpdateRequestHandler
[junit4:junit4]   2> 12915 T2380 oasc.RequestHandlers.initHandlersFromConfig created /terms: org.apache.solr.handler.component.SearchHandler
[junit4:junit4]   2> 12916 T2380 oasc.RequestHandlers.initHandlersFromConfig created spellCheckCompRH: org.apache.solr.handler.component.SearchHandler
[junit4:junit4]   2> 12916 T2380 oasc.RequestHandlers.initHandlersFromConfig created spellCheckCompRH_Direct: org.apache.solr.handler.component.SearchHandler
[junit4:junit4]   2> 12917 T2380 oasc.RequestHandlers.initHandlersFromConfig created spellCheckWithWordbreak: org.apache.solr.handler.component.SearchHandler
[junit4:junit4]   2> 12918 T2380 oasc.RequestHandlers.initHandlersFromConfig created spellCheckWithWordbreak_Direct: org.apache.solr.handler.component.SearchHandler
[junit4:junit4]   2> 12918 T2380 oasc.RequestHandlers.initHandlersFromConfig created spellCheckCompRH1: org.apache.solr.handler.component.SearchHandler
[junit4:junit4]   2> 12919 T2380 oasc.RequestHandlers.initHandlersFromConfig created mltrh: org.apache.solr.handler.component.SearchHandler
[junit4:junit4]   2> 12919 T2380 oasc.RequestHandlers.initHandlersFromConfig created tvrh: org.apache.solr.handler.component.SearchHandler
[junit4:junit4]   2> 12920 T2380 oasc.RequestHandlers.initHandlersFromConfig created /mlt: solr.MoreLikeThisHandler
[junit4:junit4]   2> 12921 T2380 oasc.RequestHandlers.initHandlersFromConfig created /debug/dump: solr.DumpRequestHandler
[junit4:junit4]   2> 12927 T2380 oashl.XMLLoader.init xsltCacheLifetimeSeconds=60
[junit4:junit4]   2> 12930 T2380 oasc.SolrCore.initDeprecatedSupport WARNING solrconfig.xml uses deprecated <admin/gettableFiles>, Please update your config to use the ShowFileRequestHandler.
[junit4:junit4]   2> 12932 T2380 oasc.SolrCore.initDeprecatedSupport WARNING adding ShowFileRequestHandler with hidden files: [SCHEMA.XML, OLD_SYNONYMS.TXT, STOPWORDS.TXT, PROTWORDS.TXT, OPEN-EXCHANGE-RATES.JSON, SYNONYMS.TXT, CURRENCY.XML, MAPPING-ISOLATIN1ACCENT.TXT]
[junit4:junit4]   2> 12934 T2380 oasc.CachingDirectoryFactory.close Releasing directory:/Users/jenkins/jenkins-slave/workspace/Lucene-Solr-trunk-MacOSX/solr/build/solr-core/test/J0/./org.apache.solr.cloud.BasicDistributedZkTest-1359814230142/jetty4
[junit4:junit4]   2> 12936 T2380 oass.SolrIndexSearcher.<init> Opening Searcher@2072f174 main
[junit4:junit4]   2> 12937 T2380 oasu.CommitTracker.<init> Hard AutoCommit: disabled
[junit4:junit4]   2> 12937 T2380 oasu.CommitTracker.<init> Soft AutoCommit: disabled
[junit4:junit4]   2> 12937 T2380 oashc.SpellCheckComponent.inform Initializing spell checkers
[junit4:junit4]   2> 12943 T2380 oass.DirectSolrSpellChecker.init init: {name=direct,classname=DirectSolrSpellChecker,field=lowerfilt,minQueryLength=3}
[junit4:junit4]   2> 12972 T2381 oasc.SolrCore.registerSearcher [collection1] Registered new searcher Searcher@2072f174 main{StandardDirectoryReader(segments_1:1)}
[junit4:junit4]   2> 12983 T2380 oasc.ZkController.publish publishing core=collection1 state=down
[junit4:junit4]   2> 12983 T2380 oasc.ZkController.publish numShards not found on descriptor - reading it from system property
[junit4:junit4]   2> 14294 T2315 oascc.ZkStateReader.updateClusterState Updating cloud state from ZooKeeper... 
[junit4:junit4]   2> 14296 T2315 oasc.Overseer$ClusterStateUpdater.updateState Update state numShards=2 message={
[junit4:junit4]   2> 	  "operation":"state",
[junit4:junit4]   2> 	  "numShards":"2",
[junit4:junit4]   2> 	  "shard":null,
[junit4:junit4]   2> 	  "roles":null,
[junit4:junit4]   2> 	  "state":"down",
[junit4:junit4]   2> 	  "core":"collection1",
[junit4:junit4]   2> 	  "collection":"collection1",
[junit4:junit4]   2> 	  "node_name":"127.0.0.1:49831_nb_",
[junit4:junit4]   2> 	  "base_url":"http://127.0.0.1:49831/nb_"}
[junit4:junit4]   2> 14296 T2315 oasc.Overseer$ClusterStateUpdater.updateState Collection already exists with numShards=2
[junit4:junit4]   2> 14296 T2315 oasc.Overseer$ClusterStateUpdater.updateState Assigning new node to shard shard=shard2
[junit4:junit4]   2> 14303 T2363 oascc.ZkStateReader$2.process A cluster state change: WatchedEvent state:SyncConnected type:NodeDataChanged path:/clusterstate.json, has occurred - updating... (live nodes size: 5)
[junit4:junit4]   2> 14303 T2379 oascc.ZkStateReader$2.process A cluster state change: WatchedEvent state:SyncConnected type:NodeDataChanged path:/clusterstate.json, has occurred - updating... (live nodes size: 5)
[junit4:junit4]   2> 14304 T2348 oascc.ZkStateReader$2.process A cluster state change: WatchedEvent state:SyncConnected type:NodeDataChanged path:/clusterstate.json, has occurred - updating... (live nodes size: 5)
[junit4:junit4]   2> 14304 T2314 oascc.ZkStateReader$2.process A cluster state change: WatchedEvent state:SyncConnected type:NodeDataChanged path:/clusterstate.json, has occurred - updating... (live nodes size: 5)
[junit4:junit4]   2> 14304 T2320 oascc.ZkStateReader$2.process A cluster state change: WatchedEvent state:SyncConnected type:NodeDataChanged path:/clusterstate.json, has occurred - updating... (live nodes size: 5)
[junit4:junit4]   2> 14304 T2333 oascc.ZkStateReader$2.process A cluster state change: WatchedEvent state:SyncConnected type:NodeDataChanged path:/clusterstate.json, has occurred - updating... (live nodes size: 5)
[junit4:junit4]   2>  C152_STATE=coll:collection1 core:collection1 props:{shard=shard1, roles=null, state=recovering, core=collection1, collection=collection1, node_name=127.0.0.1:49827_nb_, base_url=http://127.0.0.1:49827/nb_}
[junit4:junit4]   2> 14899 T2366 C152 P49827 oasc.RecoveryStrategy.doRecovery Attempting to PeerSync from http://127.0.0.1:49821/nb_/collection1/ core=collection1 - recoveringAfterStartup=true
[junit4:junit4]   2> 14900 T2366 C152 P49827 oasu.PeerSync.sync PeerSync: core=collection1 url=http://127.0.0.1:49827/nb_ START replicas=[http://127.0.0.1:49821/nb_/collection1/] nUpdates=100
[junit4:junit4]   2> 14901 T2366 C152 P49827 oasu.PeerSync.sync WARNING no frame of reference to tell of we've missed updates
[junit4:junit4]   2> 14902 T2366 C152 P49827 oasc.RecoveryStrategy.doRecovery PeerSync Recovery was not successful - trying replication. core=collection1
[junit4:junit4]   2> 14902 T2366 C152 P49827 oasc.RecoveryStrategy.doRecovery Starting Replication Recovery. core=collection1
[junit4:junit4]   2> 14902 T2366 C152 P49827 oasc.RecoveryStrategy.doRecovery Begin buffering updates. core=collection1
[junit4:junit4]   2> 14903 T2366 C152 P49827 oasu.UpdateLog.bufferUpdates Starting to buffer updates. FSUpdateLog{state=ACTIVE, tlog=null}
[junit4:junit4]   2> 14907 T2366 C152 P49827 oasc.RecoveryStrategy.replicate Attempting to replicate from http://127.0.0.1:49821/nb_/collection1/. core=collection1
[junit4:junit4]   2> 14908 T2366 C152 P49827 oascsi.HttpClientUtil.createClient Creating new http client, config:maxConnections=128&maxConnectionsPerHost=32&followRedirects=false
[junit4:junit4]   2> ASYNC  NEW_CORE C153 name=collection1 org.apache.solr.core.SolrCore@60215e7f url=http://127.0.0.1:49821/nb_/collection1 node=127.0.0.1:49821_nb_ C153_STATE=coll:collection1 core:collection1 props:{shard=shard1, roles=null, state=active, core=collection1, collection=collection1, node_name=127.0.0.1:49821_nb_, base_url=http://127.0.0.1:49821/nb_, leader=true}
[junit4:junit4]   2> 14912 T2326 C153 P49821 REQ /get {getVersions=100&distrib=false&wt=javabin&qt=/get&version=2} status=0 QTime=1 
[junit4:junit4]   2> 14920 T2324 C153 P49821 oasu.DirectUpdateHandler2.commit start commit{,optimize=false,openSearcher=false,waitSearcher=true,expungeDeletes=false,softCommit=false}
[junit4:junit4]   2> 14922 T2324 C153 P49821 oasc.CachingDirectoryFactory.close Releasing directory:/Users/jenkins/jenkins-slave/workspace/Lucene-Solr-trunk-MacOSX/solr/build/solr-core/test/J0/./org.apache.solr.cloud.BasicDistributedZkTest-1359814230142/jetty1
[junit4:junit4]   2> 14928 T2324 C153 P49821 oasc.SolrDeletionPolicy.onInit SolrDeletionPolicy.onInit: commits:num=1
[junit4:junit4]   2> 		commit{dir=RateLimitedDirectoryWrapper(org.apache.lucene.store.NIOFSDirectory@/Users/jenkins/jenkins-slave/workspace/Lucene-Solr-trunk-MacOSX/solr/build/solr-core/test/J0/org.apache.solr.cloud.BasicDistributedZkTest-1359814230142/jetty1/index lockFactory=org.apache.lucene.store.NativeFSLockFactory@5d32660b),segFN=segments_1,generation=1,filenames=[segments_1]
[junit4:junit4]   2> 14929 T2324 C153 P49821 oasc.SolrDeletionPolicy.updateCommits newest commit = 1[segments_1]
[junit4:junit4]   2> 14931 T2324 C153 P49821 oasc.SolrDeletionPolicy.onCommit SolrDeletionPolicy.onCommit: commits:num=2
[junit4:junit4]   2> 		commit{dir=RateLimitedDirectoryWrapper(org.apache.lucene.store.NIOFSDirectory@/Users/jenkins/jenkins-slave/workspace/Lucene-Solr-trunk-MacOSX/solr/build/solr-core/test/J0/org.apache.solr.cloud.BasicDistributedZkTest-1359814230142/jetty1/index lockFactory=org.apache.lucene.store.NativeFSLockFactory@5d32660b),segFN=segments_1,generation=1,filenames=[segments_1]
[junit4:junit4]   2> 		commit{dir=RateLimitedDirectoryWrapper(org.apache.lucene.store.NIOFSDirectory@/Users/jenkins/jenkins-slave/workspace/Lucene-Solr-trunk-MacOSX/solr/build/solr-core/test/J0/org.apache.solr.cloud.BasicDistributedZkTest-1359814230142/jetty1/index lockFactory=org.apache.lucene.store.NativeFSLockFactory@5d32660b),segFN=segments_2,generation=2,filenames=[segments_2]
[junit4:junit4]   2> 14932 T2324 C153 P49821 oasc.SolrDeletionPolicy.updateCommits newest commit = 2[segments_2]
[junit4:junit4]   2> 14933 T2324 C153 P49821 oasc.CachingDirectoryFactory.close Releasing directory:/Users/jenkins/jenkins-slave/workspace/Lucene-Solr-trunk-MacOSX/solr/build/solr-core/test/J0/./org.apache.solr.cloud.BasicDistributedZkTest-1359814230142/jetty1
[junit4:junit4]   2> 14933 T2324 C153 P49821 oass.SolrIndexSearcher.<init> Opening Searcher@5848dd8b realtime
[junit4:junit4]   2> 14934 T2324 C153 P49821 oasu.DirectUpdateHandler2.commit end_commit_flush
[junit4:junit4]   2> 14934 T2324 C153 P49821 /update {waitSearcher=true&openSearcher=false&commit=true&wt=javabin&commit_end_point=true&version=2&softCommit=false} {commit=} 0 14
[junit4:junit4]   2> 14936 T2366 C152 P49827 oash.ReplicationHandler.inform Commits will be reserved for  10000
[junit4:junit4]   2> 14936 T2366 C152 P49827 oash.SnapPuller.<init>  No value set for 'pollInterval'. Timer Task not started.
[junit4:junit4]   2> 14940 T2327 C153 P49821 oash.ReplicationHandler.inform Commits will be reserved for  10000
[junit4:junit4]   2> 14940 T2327 C153 P49821 REQ /replication {command=indexversion&qt=/replication&wt=javabin&version=2} status=0 QTime=1 
[junit4:junit4]   2> 14941 T2366 C152 P49827 oash.SnapPuller.fetchLatestIndex Master's generation: 2
[junit4:junit4]   2> 14941 T2366 C152 P49827 oash.SnapPuller.fetchLatestIndex Slave's generation: 1
[junit4:junit4]   2> 14942 T2366 C152 P49827 oash.SnapPuller.fetchLatestIndex Starting replication process
[junit4:junit4]   2> 14944 T2328 C153 P49821 oasc.CachingDirectoryFactory.close Releasing directory:/Users/jenkins/jenkins-slave/workspace/Lucene-Solr-trunk-MacOSX/solr/build/solr-core/test/J0/./org.apache.solr.cloud.BasicDistributedZkTest-1359814230142/jetty1
[junit4:junit4]   2> 14945 T2328 C153 P49821 oasc.CachingDirectoryFactory.close Releasing directory:/Users/jenkins/jenkins-slave/workspace/Lucene-Solr-trunk-MacOSX/solr/build/solr-core/test/J0/./org.apache.solr.cloud.BasicDistributedZkTest-1359814230142/jetty1/index
[junit4:junit4]   2> 14945 T2328 C153 P49821 REQ /replication {command=filelist&qt=/replication&wt=javabin&generation=2&version=2} status=0 QTime=1 
[junit4:junit4]   2> 14946 T2366 C152 P49827 oash.SnapPuller.fetchLatestIndex Number of files in latest index in master: 1
[junit4:junit4]   2> 14948 T2366 C152 P49827 oasc.CachingDirectoryFactory.get return new directory for /Users/jenkins/jenkins-slave/workspace/Lucene-Solr-trunk-MacOSX/solr/build/solr-core/test/J0/./org.apache.solr.cloud.BasicDistributedZkTest-1359814230142/jetty3/index.20130202071045082 forceNew:false
[junit4:junit4]   2> 14948 T2366 C152 P49827 oasc.CachingDirectoryFactory.close Releasing directory:/Users/jenkins/jenkins-slave/workspace/Lucene-Solr-trunk-MacOSX/solr/build/solr-core/test/J0/./org.apache.solr.cloud.BasicDistributedZkTest-1359814230142/jetty3
[junit4:junit4]   2> 14949 T2366 C152 P49827 oash.SnapPuller.fetchLatestIndex Starting download to RateLimitedDirectoryWrapper(org.apache.lucene.store.NIOFSDirectory@/Users/jenkins/jenkins-slave/workspace/Lucene-Solr-trunk-MacOSX/solr/build/solr-core/test/J0/org.apache.solr.cloud.BasicDistributedZkTest-1359814230142/jetty3/index.20130202071045082 lockFactory=org.apache.lucene.store.NativeFSLockFactory@23c4709) fullCopy=true
[junit4:junit4]   2> 14955 T2326 C153 P49821 REQ /replication {file=segments_2&command=filecontent&checksum=true&wt=filestream&qt=/replication&generation=2} status=0 QTime=1 
[junit4:junit4]   2> 14957 T2366 C152 P49827 oasc.CachingDirectoryFactory.close Releasing directory:/Users/jenkins/jenkins-slave/workspace/Lucene-Solr-trunk-MacOSX/solr/build/solr-core/test/J0/./org.apache.solr.cloud.BasicDistributedZkTest-1359814230142/jetty3/index
[junit4:junit4]   2> 14957 T2366 C152 P49827 oash.SnapPuller.fetchLatestIndex Total time taken for download : 0 secs
[junit4:junit4]   2> 14958 T2366 C152 P49827 oash.SnapPuller.modifyIndexProps New index installed. Updating index properties... index=index.20130202071045082
[junit4:junit4]   2> 14959 T2366 C152 P49827 oasc.CachingDirectoryFactory.close Releasing directory:/Users/jenkins/jenkins-slave/workspace/Lucene-Solr-trunk-MacOSX/solr/build/solr-core/test/J0/./org.apache.solr.cloud.BasicDistributedZkTest-1359814230142/jetty3
[junit4:junit4]   2> 14960 T2366 C152 P49827 oasc.CachingDirectoryFactory.close Releasing directory:/Users/jenkins/jenkins-slave/workspace/Lucene-Solr-trunk-MacOSX/solr/build/solr-core/test/J0/./org.apache.solr.cloud.BasicDistributedZkTest-1359814230142/jetty3
[junit4:junit4]   2> 14961 T2366 C152 P49827 oasc.SolrCore.getNewIndexDir New index directory detected: old=./org.apache.solr.cloud.BasicDistributedZkTest-1359814230142/jetty3/index/ new=./org.apache.solr.cloud.BasicDistributedZkTest-1359814230142/jetty3/index.20130202071045082
[junit4:junit4]   2> 14964 T2366 C152 P49827 oasc.SolrDeletionPolicy.onInit SolrDeletionPolicy.onInit: commits:num=1
[junit4:junit4]   2> 		commit{dir=RateLimitedDirectoryWrapper(org.apache.lucene.store.NIOFSDirectory@/Users/jenkins/jenkins-slave/workspace/Lucene-Solr-trunk-MacOSX/solr/build/solr-core/test/J0/org.apache.solr.cloud.BasicDistributedZkTest-1359814230142/jetty3/index.20130202071045082 lockFactory=org.apache.lucene.store.NativeFSLockFactory@23c4709),segFN=segments_2,generation=2,filenames=[segments_2]
[junit4:junit4]   2> 14964 T2366 C152 P49827 oasc.SolrDeletionPolicy.updateCommits newest commit = 2[segments_2]
[junit4:junit4]   2> 14966 T2366 C152 P49827 oasc.CachingDirectoryFactory.close Releasing directory:/Users/jenkins/jenkins-slave/workspace/Lucene-Solr-trunk-MacOSX/solr/build/solr-core/test/J0/./org.apache.solr.cloud.BasicDistributedZkTest-1359814230142/jetty3
[junit4:junit4]   2> 14966 T2366 C152 P49827 oasu.DefaultSolrCoreState.newIndexWriter Creating new IndexWriter...
[junit4:junit4]   2> 14966 T2366 C152 P49827 oasu.DefaultSolrCoreState.newIndexWriter Waiting until IndexWriter is unused... core=collection1
[junit4:junit4]   2> 14967 T2366 C152 P49827 oasu.DefaultSolrCoreState.newIndexWriter Rollback old IndexWriter... core=collection1
[junit4:junit4]   2> 14968 T2366 C152 P49827 oasc.CachingDirectoryFactory.close Releasing directory:/Users/jenkins/jenkins-slave/workspace/Lucene-Solr-trunk-MacOSX/solr/build/solr-core/test/J0/./org.apache.solr.cloud.BasicDistributedZkTest-1359814230142/jetty3/index.20130202071045082
[junit4:junit4]   2> 14968 T2366 C152 P49827 oasc.CachingDirectoryFactory.close Releasing directory:/Users/jenkins/jenkins-slave/workspace/Lucene-Solr-trunk-MacOSX/solr/build/solr-core/test/J0/./org.apache.solr.cloud.BasicDistributedZkTest-1359814230142/jetty3
[junit4:junit4]   2> 14971 T2366 C152 P49827 oasc.SolrDeletionPolicy.onInit SolrDeletionPolicy.onInit: commits:num=1
[junit4:junit4]   2> 		commit{dir=RateLimitedDirectoryWrapper(org.apache.lucene.store.NIOFSDirectory@/Users/jenkins/jenkins-slave/workspace/Lucene-Solr-trunk-MacOSX/solr/build/solr-core/test/J0/org.apache.solr.cloud.BasicDistributedZkTest-1359814230142/jetty3/index.20130202071045082 lockFactory=org.apache.lucene.store.NativeFSLockFactory@23c4709),segFN=segments_2,generation=2,filenames=[segments_2]
[junit4:junit4]   2> 14971 T2366 C152 P49827 oasc.SolrDeletionPolicy.updateCommits newest commit = 2[segments_2]
[junit4:junit4]   2> 14972 T2366 C152 P49827 oasu.DefaultSolrCoreState.newIndexWriter New IndexWriter is ready to be used.
[junit4:junit4]   2> 14972 T2366 C152 P49827 oasc.CachingDirectoryFactory.close Releasing directory:/Users/jenkins/jenkins-slave/workspace/Lucene-Solr-trunk-MacOSX/solr/build/solr-core/test/J0/./org.apache.solr.cloud.BasicDistributedZkTest-1359814230142/jetty3
[junit4:junit4]   2> 14973 T2366 C152 P49827 oass.SolrIndexSearcher.<init> Opening Searcher@374d6596 main
[junit4:junit4]   2> 14975 T2365 oasc.SolrCore.registerSearcher [collection1] Registered new searcher Searcher@374d6596 main{StandardDirectoryReader(segments_2:1:nrt)}
[junit4:junit4]   2> 14975 T2365 oasc.CachingDirectoryFactory.close Releasing directory:/Users/jenkins/jenkins-slave/workspace/Lucene-Solr-trunk-MacOSX/solr/build/solr-core/test/J0/./org.apache.solr.cloud.BasicDistributedZkTest-1359814230142/jetty3/index
[junit4:junit4]   2> 14976 T2366 C152 P49827 oasu.DirectUpdateHandler2.commit start commit{,optimize=false,openSearcher=false,waitSearcher=false,expungeDeletes=false,softCommit=false}
[junit4:junit4]   2> 14978 T2366 C152 P49827 oasc.SolrDeletionPolicy.onCommit SolrDeletionPolicy.onCommit: commits:num=2
[junit4:junit4]   2> 		commit{dir=RateLimitedDirectoryWrapper(org.apache.lucene.store.NIOFSDirectory@/Users/jenkins/jenkins-slave/workspace/Lucene-Solr-trunk-MacOSX/solr/build/solr-core/test/J0/org.apache.solr.cloud.BasicDistributedZkTest-1359814230142/jetty3/index.20130202071045082 lockFactory=org.apache.lucene.store.NativeFSLockFactory@23c4709),segFN=segments_2,generation=2,filenames=[segments_2]
[junit4:junit4]   2> 		commit{dir=RateLimitedDirectoryWrapper(org.apache.lucene.store.NIOFSDirectory@/Users/jenkins/jenkins-slave/workspace/Lucene-Solr-trunk-MacOSX/solr/build/solr-core/test/J0/org.apache.solr.cloud.BasicDistributedZkTest-1359814230142/jetty3/index.20130202071045082 lockFactory=org.apache.lucene.store.NativeFSLockFactory@23c4709),segFN=segments_3,generation=3,filenames=[segments_3]
[junit4:junit4]   2> 14978 T2366 C152 P49827 oasc.SolrDeletionPolicy.updateCommits newest commit = 3[segments_3]
[junit4:junit4]   2> 14979 T2366 C152 P49827 oasc.CachingDirectoryFactory.close Releasing directory:/Users/jenkins/jenkins-slave/workspace/Lucene-Solr-trunk-MacOSX/solr/build/solr-core/test/J0/./org.apache.solr.cloud.BasicDistributedZkTest-1359814230142/jetty3
[junit4:junit4]   2> 14979 T2366 C152 P49827 oasu.DirectUpdateHandler2.commit end_commit_flush
[junit4:junit4]   2> 14979 T2366 C152 P49827 oasc.CachingDirectoryFactory.close Releasing directory:/Users/jenkins/jenkins-slave/workspace/Lucene-Solr-trunk-MacOSX/solr/build/solr-core/test/J0/./org.apache.solr.cloud.BasicDistributedZkTest-1359814230142/jetty3/index.20130202071045082
[junit4:junit4]   2> 14979 T2366 C152 P49827 oasc.CachingDirectoryFactory.close Releasing directory:/Users/jenkins/jenkins-slave/workspace/Lucene-Solr-trunk-MacOSX/solr/build/solr-core/test/J0/./org.apache.solr.cloud.BasicDistributedZkTest-1359814230142/jetty3/index
[junit4:junit4]   2> 14980 T2366 C152 P49827 oasc.RecoveryStrategy.replay No replay needed. core=collection1
[junit4:junit4]   2> 14980 T2366 C152 P49827 oasc.RecoveryStrategy.doRecovery Replication Recovery was successful - registering as Active. core=collection1
[junit4:junit4]   2> 14980 T2366 C152 P49827 oasc.ZkController.publish publishing core=collection1 state=active
[junit4:junit4]   2> 14980 T2366 C152 P49827 oasc.ZkController.publish numShards not found on descriptor - reading it from system property
[junit4:junit4]   2> 14985 T2366 C152 P49827 oasc.RecoveryStrategy.doRecovery Finished recovery process. core=collection1
[junit4:junit4]   2> 14996 T2380 oasc.CoreContainer.registerCore registering core: collection1
[junit4:junit4]   2> 14996 T2380 oasc.ZkController.register Register replica - core:collection1 address:http://127.0.0.1:49831/nb_ collection:collection1 shard:shard2
[junit4:junit4]   2> 15003 T2380 oasc.ZkController.register We are http://127.0.0.1:49831/nb_/collection1/ and leader is http://127.0.0.1:49824/nb_/collection1/
[junit4:junit4]   2> 15003 T2380 oasc.ZkController.register No LogReplay needed for core=collection1 baseURL=http://127.0.0.1:49831/nb_
[junit4:junit4]   2> 15003 T2380 oasc.ZkController.checkRecovery Core needs to recover:collection1
[junit4:junit4]   2> 15004 T2380 oasu.DefaultSolrCoreState.doRecovery Running recovery - first canceling any ongoing recovery
[junit4:junit4]   2> ASYNC  NEW_CORE C154 name=collection1 org.apache.solr.core.SolrCore@1fd3dde7 url=http://127.0.0.1:49831/nb_/collection1 node=127.0.0.1:49831_nb_ C154_STATE=coll:collection1 core:collection1 props:{shard=null, roles=null, state=down, core=collection1, collection=collection1, node_name=127.0.0.1:49831_nb_, base_url=http://127.0.0.1:49831/nb_}
[junit4:junit4]   2> 15005 T2384 C154 P49831 oasc.RecoveryStrategy.run Starting recovery process.  core=collection1 recoveringAfterStartup=true
[junit4:junit4]   2> 15005 T2384 C154 P49831 oasc.RecoveryStrategy.doRecovery ###### startupVersions=[]
[junit4:junit4]   2> 15006 T2380 oascc.ZkStateReader.updateClusterState Updating cloud state from ZooKeeper... 
[junit4:junit4]   2> 15006 T2384 C154 P49831 oasc.ZkController.publish publishing core=collection1 state=recovering
[junit4:junit4]   2> 15006 T2384 C154 P49831 oasc.ZkController.publish numShards not found on descriptor - reading it from system property
[junit4:junit4]   2> 15007 T2292 oass.SolrDispatchFilter.init user.dir=/Users/jenkins/jenkins-slave/workspace/Lucene-Solr-trunk-MacOSX/solr/build/solr-core/test/J0
[junit4:junit4]   2> 15009 T2384 C154 P49831 oascsi.HttpClientUtil.createClient Creating new http client, config:maxConnections=128&maxConnectionsPerHost=32&followRedirects=false
[junit4:junit4]   2> 15009 T2292 oass.SolrDispatchFilter.init SolrDispatchFilter.init() done
[junit4:junit4]   2> 15010 T2292 oascsi.HttpClientUtil.createClient Creating new http client, config:maxConnections=128&maxConnectionsPerHost=32&followRedirects=false
[junit4:junit4]   2> 15020 T2292 oascc.ZkStateReader.updateClusterState Updating cloud state from ZooKeeper... 
[junit4:junit4]   2> 15022 T2292 oasc.AbstractDistribZkTestBase.waitForRecoveriesToFinish Wait for recoveries to finish - collection: collection1 failOnTimeout:true timeout (sec):230
[junit4:junit4]   2> 15024 T2292 oascc.ZkStateReader.updateClusterState Updating cloud state from ZooKeeper... 
[junit4:junit4]   2> 15815 T2315 oascc.ZkStateReader.updateClusterState Updating cloud state from ZooKeeper... 
[junit4:junit4]   2> 15817 T2315 oasc.Overseer$ClusterStateUpdater.updateState Update state numShards=2 message={
[junit4:junit4]   2> 	  "operation":"state",
[junit4:junit4]   2> 	  "numShards":"2",
[junit4:junit4]   2> 	  "shard":"shard1",
[junit4:junit4]   2> 	  "roles":null,
[junit4:junit4]   2> 	  "state":"active",
[junit4:junit4]   2> 	  "core":"collection1",
[junit4:junit4]   2> 	  "collection":"collection1",
[junit4:junit4]   2> 	  "node_name":"127.0.0.1:49827_nb_",
[junit4:junit4]   2> 	  "base_url":"http://127.0.0.1:49827/nb_"}
[junit4:junit4]   2> 15824 T2315 oasc.Overseer$ClusterStateUpdater.updateState Update state numShards=2 message={
[junit4:junit4]   2> 	  "operation":"state",
[junit4:junit4]   2> 	  "numShards":"2",
[junit4:junit4]   2> 	  "shard":"shard2",
[junit4:junit4]   2> 	  "roles":null,
[junit4:junit4]   2> 	  "state":"recovering",
[junit4:junit4]   2> 	  "core":"collection1",
[junit4:junit4]   2> 	  "collection":"collection1",
[junit4:junit4]   2> 	  "node_name":"127.0.0.1:49831_nb_",
[junit4:junit4]   2> 	  "base_url":"http://127.0.0.1:49831/nb_"}
[junit4:junit4]   2> 15837 T2363 oascc.ZkStateReader$2.process A cluster state change: WatchedEvent state:SyncConnected type:NodeDataChanged path:/clusterstate.json, has occurred - updating... (live nodes size: 5)
[junit4:junit4]   2> 15838 T2314 oascc.ZkStateReader$2.process A cluster state change: WatchedEvent state:SyncConnected type:NodeDataChanged path:/clusterstate.json, has occurred - updating... (live nodes size: 5)
[junit4:junit4]   2> 15839 T2348 oascc.ZkStateReader$2.process A cluster state change: WatchedEvent state:SyncConnected type:NodeDataChanged path:/clusterstate.json, has occurred - updating... (live nodes size: 5)
[junit4:junit4]   2> 15839 T2379 oascc.ZkStateReader$2.process A cluster state change: WatchedEvent state:SyncConnected type:NodeDataChanged path:/clusterstate.json, has occurred - updating... (live nodes size: 5)
[junit4:junit4]   2> 15839 T2333 oascc.ZkStateReader$2.process A cluster state change: WatchedEvent state:SyncConnected type:NodeDataChanged path:/clusterstate.json, has occurred - updating... (live nodes size: 5)
[junit4:junit4]   2> 15839 T2320 oascc.ZkStateReader$2.process A cluster state change: WatchedEvent state:SyncConnected type:NodeDataChanged path:/clusterstate.json, has occurred - updating... (live nodes size: 5)
[junit4:junit4]   2> 16028 T2292 oascc.ZkStateReader.updateClusterState Updating cloud state from ZooKeeper... 
[junit4:junit4]   2> 17032 T2292 oascc.ZkStateReader.updateClusterState Updating cloud state from ZooKeeper... 
[junit4:junit4]   2>  C154_STATE=coll:collection1 core:collection1 props:{shard=shard2, roles=null, state=recovering, core=collection1, collection=collection1, node_name=127.0.0.1:49831_nb_, base_url=http://127.0.0.1:49831/nb_}
[junit4:junit4]   2> 18021 T2384 C154 P49831 oasc.RecoveryStrategy.doRecovery Attempting to PeerSync from http://127.0.0.1:49824/nb_/collection1/ core=collection1 - recoveringAfterStartup=true
[junit4:junit4]   2> 18022 T2384 C154 P49831 oasu.PeerSync.sync PeerSync: core=collection1 url=http://127.0.0.1:49831/nb_ START replicas=[http://127.0.0.1:49824/nb_/collection1/] nUpdates=100
[junit4:junit4]   2> 18022 T2384 C154 P49831 oasu.PeerSync.sync WARNING no frame of reference to tell of we've missed updates
[junit4:junit4]   2> 18023 T2384 C154 P49831 oasc.RecoveryStrategy.doRecovery PeerSync Recovery was not successful - trying replication. core=collection1
[junit4:junit4]   2> 18023 T2384 C154 P49831 oasc.RecoveryStrategy.doRecovery Starting Replication Recovery. core=collection1
[junit4:junit4]   2> 18023 T2384 C154 P49831 oasc.RecoveryStrategy.doRecovery Begin buffering updates. core=collection1
[junit4:junit4]   2> 18023 T2384 C154 P49831 oasu.UpdateLog.bufferUpdates Starting to buffer updates. FSUpdateLog{state=ACTIVE, tlog=null}
[junit4:junit4]   2> 18024 T2384 C154 P49831 oasc.RecoveryStrategy.replicate Attempting to replicate from http://127.0.0.1:49824/nb_/collection1/. core=collection1
[junit4:junit4]   2> 18024 T2384 C154 P49831 oascsi.HttpClientUtil.createClient Creating new http client, config:maxConnections=128&maxConnectionsPerHost=32&followRedirects=false
[junit4:junit4]   2> ASYNC  NEW_CORE C155 name=collection1 org.apache.solr.core.SolrCore@4e70713e url=http://127.0.0.1:49824/nb_/collection1 node=127.0.0.1:49824_nb_ C155_STATE=coll:collection1 core:collection1 props:{shard=shard2, roles=null, state=active, core=collection1, collection=collection1, node_name=127.0.0.1:49824_nb_, base_url=http://127.0.0.1:49824/nb_, leader=true}
[junit4:junit4]   2> 18032 T2341 C155 P49824 REQ /get {getVersions=100&distrib=false&wt=javabin&qt=/get&version=2} status=0 QTime=1 
[junit4:junit4]   2> 18035 T2344 C155 P49824 oasu.DirectUpdateHandler2.commit start commit{,optimize=false,openSearcher=false,waitSearcher=true,expungeDeletes=false,softCommit=false}
[junit4:junit4]   2> 18035 T2292 oascc.ZkStateReader.updateClusterState Updating cloud state from ZooKeeper... 
[junit4:junit4]   2> 18037 T2344 C155 P49824 oasc.CachingDirectoryFactory.close Releasing directory:/Users/jenkins/jenkins-slave/workspace/Lucene-Solr-trunk-MacOSX/solr/build/solr-core/test/J0/./org.apache.solr.cloud.BasicDistributedZkTest-1359814230142/jetty2
[junit4:junit4]   2> 18040 T2344 C155 P49824 oasc.SolrDeletionPolicy.onInit SolrDeletionPolicy.onInit: commits:num=1
[junit4:junit4]   2> 		commit{dir=RateLimitedDirectoryWrapper(org.apache.lucene.store.NIOFSDirectory@/Users/jenkins/jenkins-slave/workspace/Lucene-Solr-trunk-MacOSX/solr/build/solr-core/test/J0/org.apache.solr.cloud.BasicDistributedZkTest-1359814230142/jetty2/index lockFactory=org.apache.lucene.store.NativeFSLockFactory@77fc892a),segFN=segments_1,generation=1,filenames=[segments_1]
[junit4:junit4]   2> 18041 T2344 C155 P49824 oasc.SolrDeletionPolicy.updateCommits newest commit = 1[segments_1]
[junit4:junit4]   2> 18043 T2344 C155 P49824 oasc.SolrDeletionPolicy.onCommit SolrDeletionPolicy.onCommit: commits:num=2
[junit4:junit4]   2> 		commit{dir=RateLimitedDirectoryWrapper(org.apache.lucene.store.NIOFSDirectory@/Users/jenkins/jenkins-slave/workspace/Lucene-Solr-trunk-MacOSX/solr/build/solr-core/test/J0/org.apache.solr.cloud.BasicDistributedZkTest-1359814230142/jetty2/index lockFactory=org.apache.lucene.store.NativeFSLockFactory@77fc892a),segFN=segments_1,generation=1,filenames=[segments_1]
[junit4:junit4]   2> 		commit{dir=RateLimitedDirectoryWrapper(org.apache.lucene.store.NIOFSDirectory@/Users/jenkins/jenkins-slave/workspace/Lucene-Solr-trunk-MacOSX/solr/build/solr-core/test/J0/org.apache.solr.cloud.BasicDistributedZkTest-1359814230142/jetty2/index lockFactory=org.apache.lucene.store.NativeFSLockFactory@77fc892a),segFN=segments_2,generation=2,filenames=[segments_2]
[junit4:junit4]   2> 18043 T2344 C155 P49824 oasc.SolrDeletionPolicy.updateCommits newest commit = 2[segments_2]
[junit4:junit4]   2> 18044 T2344 C155 P49824 oasc.CachingDirectoryFactory.close Releasing directory:/Users/jenkins/jenkins-slave/workspace/Lucene-Solr-trunk-MacOSX/solr/build/solr-core/test/J0/./org.apache.solr.cloud.BasicDistributedZkTest-1359814230142/jetty2
[junit4:junit4]   2> 18045 T2344 C155 P49824 oass.SolrIndexSearcher.<init> Opening Searcher@3a361498 realtime
[junit4:junit4]   2> 18045 T2344 C155 P49824 oasu.DirectUpdateHandler2.commit end_commit_flush
[junit4:junit4]   2> 18046 T2344 C155 P49824 /update {waitSearcher=true&openSearcher=false&commit=true&wt=javabin&commit_end_point=true&version=2&softCommit=false} {commit=} 0 11
[junit4:junit4]   2> 18047 T2384 C154 P49831 oash.ReplicationHandler.inform Commits will be reserved for  10000
[junit4:junit4]   2> 18047 T2384 C154 P49831 oash.SnapPuller.<init>  No value set for 'pollInterval'. Timer Task not started.
[junit4:junit4]   2> 18050 T2342 C155 P49824 oash.ReplicationHandler.inform Commits will be reserved for  10000
[junit4:junit4]   2> 18050 T2342 C155 P49824 REQ /replication {command=indexversion&qt=/replication&wt=javabin&version=2} status=0 QTime=1 
[junit4:junit4]   2> 18051 T2384 C154 P49831 oash.SnapPuller.fetchLatestIndex Master's generation: 2
[junit4:junit4]   2> 18051 T2384 C154 P49831 oash.SnapPuller.fetchLatestIndex Slave's generation: 1
[junit4:junit4]   2> 18052 T2384 C154 P49831 oash.SnapPuller.fetchLatestIndex Starting replication process
[junit4:junit4]   2> 18054 T2343 C155 P49824 oasc.CachingDirectoryFactory.close Releasing directory:/Users/jenkins/jenkins-slave/workspace/Lucene-Solr-trunk-MacOSX/solr/build/solr-core/test/J0/./org.apache.solr.cloud.BasicDistributedZkTest-1359814230142/jetty2
[junit4:junit4]   2> 18055 T2343 C155 P49824 oasc.CachingDirectoryFactory.close Releasing directory:/Users/jenkins/jenkins-slave/workspace/Lucene-Solr-trunk-MacOSX/solr/build/solr-core/test/J0/./org.apache.solr.cloud.BasicDistributedZkTest-1359814230142/jetty2/index
[junit4:junit4]   2> 18055 T2343 C155 P49824 REQ /replication {command=filelist&qt=/replication&wt=javabin&generation=2&version=2} status=0 QTime=1 
[junit4:junit4]   2> 18056 T2384 C154 P49831 oash.SnapPuller.fetchLatestIndex Number of files in latest index in master: 1
[junit4:junit4]   2> 18057 T2384 C154 P49831 oasc.CachingDirectoryFactory.get return new directory for /Users/jenkins/jenkins-slave/workspace/Lucene-Solr-trunk-MacOSX/solr/build/solr-core/test/J0/./org.apache.solr.cloud.BasicDistributedZkTest-1359814230142/jetty4/index.20130202071048191 forceNew:false
[junit4:junit4]   2> 18058 T2384 C154 P49831 oasc.CachingDirectoryFactory.close Releasing directory:/Users/jenkins/jenkins-slave/workspace/Lucene-Solr-trunk-MacOSX/solr/build/solr-core/test/J0/./org.apache.solr.cloud.BasicDistributedZkTest-1359814230142/jetty4
[junit4:junit4]   2> 18058 T2384 C154 P49831 oash.SnapPuller.fetchLatestIndex Starting download to RateLimitedDirectoryWrapper(org.apache.lucene.store.NIOFSDirectory@/Users/jenkins/jenkins-slave/workspace/Lucene-Solr-trunk-MacOSX/solr/build/solr-core/test/J0/org.apache.solr.cloud.BasicDistributedZkTest-1359814230142/jetty4/index.20130202071048191 lockFactory=org.apache.lucene.store.NativeFSLockFactory@4bde45f2) fullCopy=true
[junit4:junit4]   2> 18062 T2339 C155 P49824 REQ /replication {file=segments_2&command=filecontent&checksum=true&wt=filestream&qt=/replication&generation=2} status=0 QTime=0 
[junit4:junit4]   2> 18064 T2384 C154 P49831 oasc.CachingDirectoryFactory.close Releasing directory:/Users/jenkins/jenkins-slave/workspace/Lucene-Solr-trunk-MacOSX/solr/build/solr-core/test/J0/./org.apache.solr.cloud.BasicDistributedZkTest-1359814230142/jetty4/index
[junit4:junit4]   2> 18064 T2384 C154 P49831 oash.SnapPuller.fetchLatestIndex Total time taken for download : 0 secs
[junit4:junit4]   2> 18075 T2384 C154 P49831 oash.SnapPuller.modifyIndexProps New index installed. Updating index properties... index=index.20130202071048191
[junit4:junit4]   2> 18076 T2384 C154 P49831 oasc.CachingDirectoryFactory.close Releasing directory:/Users/jenkins/jenkins-slave/workspace/Lucene-Solr-trunk-MacOSX/solr/build/solr-core/test/J0/./org.apache.solr.cloud.BasicDistributedZkTest-1359814230142/jetty4
[junit4:junit4]   2> 18077 T2384 C154 P49831 oasc.CachingDirectoryFactory.close Releasing directory:/Users/jenkins/jenkins-slave/workspace/Lucene-Solr-trunk-MacOSX/solr/build/solr-core/test/J0/./org.apache.solr.cloud.BasicDistributedZkTest-1359814230142/jetty4
[junit4:junit4]   2> 18077 T2384 C154 P49831 oasc.SolrCore.getNewIndexDir New index directory detected: old=./org.apache.solr.cloud.BasicDistributedZkTest-1359814230142/jetty4/index/ new=./org.apache.solr.cloud.BasicDistributedZkTest-1359814230142/jetty4/index.20130202071048191
[junit4:junit4]   2> 18078 T2384 C154 P49831 oasc.SolrDeletionPolicy.onInit SolrDeletionPolicy.onInit: commits:num=1
[junit4:junit4]   2> 		commit{dir=RateLimitedDirectoryWrapper(org.apache.lucene.store.NIOFSDirectory@/Users/jenkins/jenkins-slave/workspace/Lucene-Solr-trunk-MacOSX/solr/build/solr-core/test/J0/org.apache.solr.cloud.BasicDistributedZkTest-1359814230142/jetty4/index.20130202071048191 lockFactory=org.apache.lucene.store.NativeFSLockFactory@4bde45f2),segFN=segments_2,generation=2,filenames=[segments_2]
[junit4:junit4]   2> 18079 T2384 C154 P49831 oasc.SolrDeletionPolicy.updateCommits newest commit = 2[segments_2]
[junit4:junit4]   2> 18081 T2384 C154 P49831 oasc.CachingDirectoryFactory.close Releasing directory:/Users/jenkins/jenkins-slave/workspace/Lucene-Solr-trunk-MacOSX/solr/build/solr-core/test/J0/./org.apache.solr.cloud.BasicDistributedZkTest-1359814230142/jetty4
[junit4:junit4]   2> 18081 T2384 C154 P49831 oasu.DefaultSolrCoreState.newIndexWriter Creating new IndexWriter...
[junit4:junit4]   2> 18081 T2384 C154 P49831 oasu.DefaultSolrCoreState.newIndexWriter Waiting until IndexWriter is unused... core=collection1
[junit4:junit4]   2> 18081 T2384 C154 P49831 oasu.DefaultSolrCoreState.newIndexWriter Rollback old IndexWriter... core=collection1
[junit4:junit4]   2> 18082 T2384 C154 P49831 oasc.CachingDirectoryFactory.close Releasing directory:/Users/jenkins/jenkins-slave/workspace/Lucene-Solr-trunk-MacOSX/solr/build/solr-core/test/J0/./org.apache.solr.cloud.BasicDistributedZkTest-1359814230142/jetty4/index.20130202071048191
[junit4:junit4]   2> 18083 T2384 C154 P49831 oasc.CachingDirectoryFactory.close Releasing directory:/Users/jenkins/jenkins-slave/workspace/Lucene-Solr-trunk-MacOSX/solr/build/solr-core/test/J0/./org.apache.solr.cloud.BasicDistributedZkTest-1359814230142/jetty4
[junit4:junit4]   2> 18086 T2384 C154 P49831 oasc.SolrDeletionPolicy.onInit SolrDeletionPolicy.onInit: commits:num=1
[junit4:junit4]   2> 		commit{dir=RateLimitedDirectoryWrapper(org.apache.lucene.store.NIOFSDirectory@/Users/jenkins/jenkins-slave/workspace/Lucene-Solr-trunk-MacOSX/solr/build/solr-core/test/J0/org.apache.solr.cloud.BasicDistributedZkTest-1359814230142/jetty4/index.20130202071048191 lockFactory=org.apache.lucene.store.NativeFSLockFactory@4bde45f2),segFN=segments_2,generation=2,filenames=[segments_2]
[junit4:junit4]   2> 18086 T2384 C154 P49831 oasc.SolrDeletionPolicy.updateCommits newest commit = 2[segments_2]
[junit4:junit4]   2> 18086 T2384 C154 P49831 oasu.DefaultSolrCoreState.newIndexWriter New IndexWriter is ready to be used.
[junit4:junit4]   2> 18087 T2384 C154 P49831 oasc.CachingDirectoryFactory.close Releasing directory:/Users/jenkins/jenkins-slave/workspace/Lucene-Solr-trunk-MacOSX/solr/build/solr-core/test/J0/./org.apache.solr.cloud.BasicDistributedZkTest-1359814230142/jetty4
[junit4:junit4]   2> 18087 T2384 C154 P49831 oass.SolrIndexSearcher.<init> Opening Searcher@397f6875 main
[junit4:junit4]   2> 18089 T2381 oasc.SolrCore.registerSearcher [collection1] Registered new searcher Searcher@397f6875 main{StandardDirectoryReader(segments_2:1:nrt)}
[junit4:junit4]   2> 18089 T2381 oasc.CachingDirectoryFactory.close Releasing directory:/Users/jenkins/jenkins-slave/workspace/Lucene-Solr-trunk-MacOSX/solr/build/solr-core/test/J0/./org.apache.solr.cloud.BasicDistributedZkTest-1359814230142/jetty4/index
[junit4:junit4]   2> 18089 T2384 C154 P49831 oasu.DirectUpdateHandler2.commit start commit{,optimize=false,openSearcher=false,waitSearcher=false,expungeDeletes=false,softCommit=false}
[junit4:junit4]   2> 18091 T2384 C154 P49831 oasc.SolrDeletionPolicy.onCommit SolrDeletionPolicy.onCommit: commits:num=2
[junit4:junit4]   2> 		commit{dir=RateLimitedDirectoryWrapper(org.apache.lucene.store.NIOFSDirectory@/Users/jenkins/jenkins-slave/workspace/Lucene-Solr-trunk-MacOSX/solr/build/solr-core/test/J0/org.apache.solr.cloud.BasicDistributedZkTest-1359814230142/jetty4/index.20130202071048191 lockFactory=org.apache.lucene.store.NativeFSLockFactory@4bde45f2),segFN=segments_2,generation=2,filenames=[segments_2]
[junit4:junit4]   2> 		commit{dir=RateLimitedDirectoryWrapper(org.apache.lucene.store.NIOFSDirectory@/Users/jenkins/jenkins-slave/workspace/Lucene-Solr-trunk-MacOSX/solr/build/solr-core/test/J0/org.apache.solr.cloud.BasicDistributedZkTest-1359814230142/jetty4/index.20130202071048191 lockFactory=org.apache.lucene.store.NativeFSLockFactory@4bde45f2),segFN=segments_3,generation=3,filenames=[segments_3]
[junit4:junit4]   2> 18092 T2384 C154 P49831 oasc.SolrDeletionPolicy.updateCommits newest commit = 3[segments_3]
[junit4:junit4]   2> 18092 T2384 C154 P49831 oasc.CachingDirectoryFactory.close Releasing directory:/Users/jenkins/jenkins-slave/workspace/Lucene-Solr-trunk-MacOSX/solr/build/solr-core/test/J0/./org.apache.solr.cloud.BasicDistributedZkTest-1359814230142/jetty4
[junit4:junit4]   2> 18093 T2384 C154 P49831 oasu.DirectUpdateHandler2.commit end_commit_flush
[junit4:junit4]   2> 18093 T2384 C154 P49831 oasc.CachingDirectoryFactory.close Releasing directory:/Users/jenkins/jenkins-slave/workspace/Lucene-Solr-trunk-MacOSX/solr/build/solr-core/test/J0/./org.apache.solr.cloud.BasicDistributedZkTest-1359814230142/jetty4/index.20130202071048191
[junit4:junit4]   2> 18093 T2384 C154 P49831 oasc.CachingDirectoryFactory.close Releasing directory:/Users/jenkins/jenkins-slave/workspace/Lucene-Solr-trunk-MacOSX/solr/build/solr-core/test/J0/./org.apache.solr.cloud.BasicDistributedZkTest-1359814230142/jetty4/index
[junit4:junit4]   2> 18093 T2384 C154 P49831 oasc.RecoveryStrategy.replay No replay needed. core=collection1
[junit4:junit4]   2> 18094 T2384 C154 P49831 oasc.RecoveryStrategy.doRecovery Replication Recovery was successful - registering as Active. core=collection1
[junit4:junit4]   2> 18094 T2384 C154 P49831 oasc.ZkController.publish publishing core=collection1 state=active
[junit4:junit4]   2> 18094 T2384 C154 P49831 oasc.ZkController.publish numShards not found on descriptor - reading it from system property
[junit4:junit4]   2> 18096 T2384 C154 P49831 oasc.RecoveryStrategy.doRecovery Finished recovery process. core=collection1
[junit4:junit4]   2> 18864 T2315 oascc.ZkStateReader.updateClusterState Updating cloud state from ZooKeeper... 
[junit4:junit4]   2> 18865 T2315 oasc.Overseer$ClusterStateUpdater.updateState Update state numShards=2 message={
[junit4:junit4]   2> 	  "operation":"state",
[junit4:junit4]   2> 	  "numShards":"2",
[junit4:junit4]   2> 	  "shard":"shard2",
[junit4:junit4]   2> 	  "roles":null,
[junit4:junit4]   2> 	  "state":"active",
[junit4:junit4]   2> 	  "core":"collection1",
[junit4:junit4]   2> 	  "collection":"collection1",
[junit4:junit4]   2> 	  "node_name":"127.0.0.1:49831_nb_",
[junit4:junit4]   2> 	  "base_url":"http://127.0.0.1:49831/nb_"}
[junit4:junit4]   2> 18874 T2363 oascc.ZkStateReader$2.process A cluster state change: WatchedEvent state:SyncConnected type:NodeDataChanged path:/clusterstate.json, has occurred - updating... (live nodes size: 5)
[junit4:junit4]   2> 18876 T2348 oascc.ZkStateReader$2.process A cluster state change: WatchedEvent state:SyncConnected type:NodeDataChanged path:/clusterstate.json, has occurred - updating... (live nodes size: 5)
[junit4:junit4]   2> 18876 T2314 oascc.ZkStateReader$2.process A cluster state change: WatchedEvent state:SyncConnected type:NodeDataChanged path:/clusterstate.json, has occurred - updating... (live nodes size: 5)
[junit4:junit4]   2> 18876 T2320 oascc.ZkStateReader$2.process A cluster state change: WatchedEvent state:SyncConnected type:NodeDataChanged path:/clusterstate.json, has occurred - updating... (live nodes size: 5)
[junit4:junit4]   2> 18876 T2379 oascc.ZkStateReader$2.process A cluster state change: WatchedEvent state:SyncConnected type:NodeDataChanged path:/clusterstate.json, has occurred - updating... (live nodes size: 5)
[junit4:junit4]   2> 18876 T2333 oascc.ZkStateReader$2.process A cluster state change: WatchedEvent state:SyncConnected type:NodeDataChanged path:/clusterstate.json, has occurred - updating... (live nodes size: 5)
[junit4:junit4]   2> 19041 T2292 oascc.ZkStateReader.updateClusterState Updating cloud state from ZooKeeper... 
[junit4:junit4]   2> 19043 T2292 oasc.AbstractDistribZkTestBase.waitForRecoveriesToFinish Recoveries finished - collection: collection1
[junit4:junit4]   2> ASYNC  NEW_CORE C156 name=collection1 org.apache.solr.core.SolrCore@33152a31 url=http://127.0.0.1:49817/nb_/collection1 node=127.0.0.1:49817_nb_ C156_STATE=coll:control_collection core:collection1 props:{shard=shard1, roles=null, state=active, core=collection1, collection=control_collection, node_name=127.0.0.1:49817_nb_, base_url=http://127.0.0.1:49817/nb_, leader=true}
[junit4:junit4]   2> 19054 T2308 C156 P49817 oasc.CachingDirectoryFactory.close Releasing directory:/Users/jenkins/jenkins-slave/workspace/Lucene-Solr-trunk-MacOSX/solr/build/solr-core/test/J0/./org.apache.solr.cloud.BasicDistributedZkTest-1359814230142/control/data
[junit4:junit4]   2> 19056 T2308 C156 P49817 oasc.SolrDeletionPolicy.onInit SolrDeletionPolicy.onInit: commits:num=1
[junit4:junit4]   2> 		commit{dir=RateLimitedDirectoryWrapper(org.apache.lucene.store.NIOFSDirectory@/Users/jenkins/jenkins-slave/workspace/Lucene-Solr-trunk-MacOSX/solr/build/solr-core/test/J0/org.apache.solr.cloud.BasicDistributedZkTest-1359814230142/control/data/index lockFactory=org.apache.lucene.store.NativeFSLockFactory@302996cc),segFN=segments_1,generation=1,filenames=[segments_1]
[junit4:junit4]   2> 19057 T2308 C156 P49817 oasc.SolrDeletionPolicy.updateCommits newest commit = 1[segments_1]
[junit4:junit4]   2> 19058 T2308 C156 P49817 oasc.CachingDirectoryFactory.close Releasing directory:/Users/jenkins/jenkins-slave/workspace/Lucene-Solr-trunk-MacOSX/solr/build/solr-core/test/J0/./org.apache.solr.cloud.BasicDistributedZkTest-1359814230142/control/data
[junit4:junit4]   2> 19058 T2308 C156 P49817 oass.SolrIndexSearcher.<init> Opening Searcher@4ca65f7a realtime
[junit4:junit4]   2> 19058 T2308 C156 P49817 /update {wt=javabin&version=2} {deleteByQuery=*:* (-1425868586156556288)} 0 6
[junit4:junit4]   2> 19062 T2328 C153 P49821 oasc.CachingDirectoryFactory.close Releasing directory:/Users/jenkins/jenkins-slave/workspace/Lucene-Solr-trunk-MacOSX/solr/build/solr-core/test/J0/./org.apache.solr.cloud.BasicDistributedZkTest-1359814230142/jetty1
[junit4:junit4]   2> 19069 T2340 C155 P49824 oasc.CachingDirectoryFactory.close Releasing directory:/Users/jenkins/jenkins-slave/workspace/Lucene-Solr-trunk-MacOSX/solr/build/solr-core/test/J0/./org.apache.solr.cloud.BasicDistributedZkTest-1359814230142/jetty2
[junit4:junit4]   2>  C152_STATE=coll:collection1 core:collection1 props:{shard=shard1, roles=null, state=active, core=collection1, collection=collection1, node_name=127.0.0.1:49827_nb_, base_url=http://127.0.0.1:49827/nb_}
[junit4:junit4]   2> 19075 T2356 C152 P49827 oasc.CachingDirectoryFactory.close Releasing directory:/Users/jenkins/jenkins-slave/workspace/Lucene-Solr-trunk-MacOSX/solr/build/solr-core/test/J0/./org.apache.solr.cloud.BasicDistributedZkTest-1359814230142/jetty3
[junit4:junit4]   2> 19076 T2356 C152 P49827 /update {update.distrib=FROMLEADER&_version_=-1425868586164944896&update.from=http://127.0.0.1:49821/nb_/collection1/&wt=javabin&version=2} {deleteByQuery=*:* (-1425868586164944896)} 0 3
[junit4:junit4]   2>  C154_STATE=coll:collection1 core:collection1 props:{shard=shard2, roles=null, state=active, core=collection1, collection=collection1, node_name=127.0.0.1:49831_nb_, base_url=http://127.0.0.1:49831/nb_}
[junit4:junit4]   2> 19079 T2375 C154 P49831 oasc.CachingDirectoryFactory.close Releasing directory:/Users/jenkins/jenkins-slave/workspace/Lucene-Solr-trunk-MacOSX/solr/build/solr-core/test/J0/./org.apache.solr.cloud.BasicDistributedZkTest-1359814230142/jetty4
[junit4:junit4]   2> 19080 T2375 C154 P49831 /update {update.distrib=FROMLEADER&_version_=-1425868586171236352&update.from=http://127.0.0.1:49824/nb_/collection1/&wt=javabin&version=2} {deleteByQuery=*:* (-1425868586171236352)} 0 3
[junit4:junit4]   2> 19081 T2340 C155 P49824 /update {update.distrib=TOLEADER&wt=javabin&version=2} {deleteByQuery=*:* (-1425868586171236352)} 0 14
[junit4:junit4]   2> 19082 T2328 C153 P49821 /update {wt=javabin&version=2} {deleteByQuery=*:* (-1425868586164944896)} 0 21
[junit4:junit4]   2> 19089 T2309 C156 P49817 /update {wt=javabin&version=2} {add=[1 (1425868586191159296)]} 0 4
[junit4:junit4]   2> 19108 T2357 C152 P49827 /update {distrib.from=http://127.0.0.1:49821/nb_/collection1/&update.distrib=FROMLEADER&wt=javabin&version=2} {add=[1 (1425868586200596480)]} 0 4
[junit4:junit4]   2> 19109 T2326 C153 P49821 /update {distrib.from=http://127.0.0.1:49824/nb_/collection1/&update.distrib=TOLEADER&wt=javabin&version=2} {add=[1 (1425868586200596480)]} 0 14
[junit4:junit4]   2> 19110 T2342 C155 P49824 /update {wt=javabin&version=2} {add=[1]} 0 18
[junit4:junit4]   2> 19115 T2310 C156 P49817 /update {wt=javabin&version=2} {add=[2 (1425868586219470848)]} 0 1
[junit4:junit4]   2> 19131 T2370 C154 P49831 /update {distrib.from=http://127.0.0.1:49824/nb_/collection1/&update.distrib=FROMLEADER&wt=javabin&version=2} {add=[2 (1425868586226810880)]} 0 4
[junit4:junit4]   2> 19132 T2343 C155 P49824 /update {distrib.from=http://127.0.0.1:49821/nb_/collection1/&update.distrib=TOLEADER&wt=javabin&version=2} {add=[2 (1425868586226810880)]} 0 12
[junit4:junit4]   2> 19133 T2329 C153 P49821 /update {wt=javabin&version=2} {add=[2]} 0 15
[junit4:junit4]   2> 19138 T2305 C156 P49817 /update {wt=javabin&version=2} {add=[3 (1425868586244636672)]} 0 2
[junit4:junit4]   2> 19150 T2371 C154 P49831 /update {distrib.from=http://127.0.0.1:49824/nb_/collection1/&update.distrib=FROMLEADER&wt=javabin&version=2} {add=[3 (1425868586253025280)]} 0 2
[junit4:junit4]   2> 19151 T2339 C155 P49824 /update {distrib.from=http://127.0.0.1:49821/nb_/collection1/&update.distrib=TOLEADER&wt=javabin&version=2} {add=[3 (1425868586253025280)]} 0 7
[junit4:junit4]   2> 19152 T2324 C153 P49821 /update {wt=javabin&version=2} {add=[3]} 0 10
[junit4:junit4]   2> 19157 T2306 C156 P49817 /update {wt=javabin&version=2} {add=[4 (1425868586263511040)]} 0 2
[junit4:junit4]   2> 19170 T2358 C152 P49827 /update {distrib.from=http://127.0.0.1:49821/nb_/collection1/&update.distrib=FROMLEADER&wt=javabin&version=2} {add=[4 (1425868586273996800)]} 0 1
[junit4:junit4]   2> 19172 T2325 C153 P49821 /update {distrib.from=http://127.0.0.1:49824/nb_/collection1/&update.distrib=TOLEADER&wt=javabin&version=2} {add=[4 (1425868586273996800)]} 0 8
[junit4:junit4]   2> 19173 T2341 C155 P49824 /update {wt=javabin&version=2} {add=[4]} 0 13
[junit4:junit4]   2> 19177 T2307 C156 P49817 /update {wt=javabin&version=2} {add=[5 (1425868586285531136)]} 0 1
[junit4:junit4]   2> 19189 T2372 C154 P49831 /update {distrib.from=http://127.0.0.1:49824/nb_/collection1/&update.distrib=FROMLEADER&wt=javabin&version=2} {add=[5 (1425868586292871168)]} 0 2
[junit4:junit4]   2> 19190 T2344 C155 P49824 /update {distrib.from=http://127.0.0.1:49821/nb_/collection1/&update.distrib=TOLEADER&wt=javabin&version=2} {add=[5 (1425868586292871168)]} 0 7
[junit4:junit4]   2> 19191 T2327 C153 P49821 /update {wt=javabin&version=2} {add=[5]} 0 11
[junit4:junit4]   2> 19196 T2308 C156 P49817 /update {wt=javabin&version=2} {add=[6 (1425868586304405504)]} 0 2
[junit4:junit4]   2> 19205 T2373 C154 P49831 /update {distrib.from=http://127.0.0.1:49824/nb_/collection1/&update.distrib=FROMLEADER&wt=javabin&version=2} {add=[6 (1425868586309648384)]} 0 1
[junit4:junit4]   2> 19206 T2340 C155 P49824 /update {wt=javabin&version=2} {add=[6 (1425868586309648384)]} 0 7
[junit4:junit4]   2> 19216 T2309 C156 P49817 /update {wt=javabin&version=2} {add=[7 (1425868586326425600)]} 0 2
[junit4:junit4]   2> 19231 T2374 C154 P49831 /update {distrib.from=http://127.0.0.1:49824/nb_/collection1/&update.distrib=FROMLEADER&wt=javabin&version=2} {add=[7 (1425868586335862784)]} 0 2
[junit4:junit4]   2> 19232 T2342 C155 P49824 /update {distrib.from=http://127.0.0.1

[...truncated too long message...]

ting.RandomizedRunner.invoke(RandomizedRunner.java:1559)
[junit4:junit4]    > 	at com.carrotsearch.randomizedtesting.RandomizedRunner.access$600(RandomizedRunner.java:79)
[junit4:junit4]    > 	at com.carrotsearch.randomizedtesting.RandomizedRunner$6.evaluate(RandomizedRunner.java:737)
[junit4:junit4]    > 	at com.carrotsearch.randomizedtesting.RandomizedRunner$7.evaluate(RandomizedRunner.java:773)
[junit4:junit4]    > 	at com.carrotsearch.randomizedtesting.RandomizedRunner$8.evaluate(RandomizedRunner.java:787)
[junit4:junit4]    > 	at com.carrotsearch.randomizedtesting.rules.SystemPropertiesRestoreRule$1.evaluate(SystemPropertiesRestoreRule.java:53)
[junit4:junit4]    > 	at org.apache.lucene.util.TestRuleSetupTeardownChained$1.evaluate(TestRuleSetupTeardownChained.java:50)
[junit4:junit4]    > 	at org.apache.lucene.util.TestRuleFieldCacheSanity$1.evaluate(TestRuleFieldCacheSanity.java:51)
[junit4:junit4]    > 	at org.apache.lucene.util.AbstractBeforeAfterRule$1.evaluate(AbstractBeforeAfterRule.java:46)
[junit4:junit4]    > 	at com.carrotsearch.randomizedtesting.rules.SystemPropertiesInvariantRule$1.evaluate(SystemPropertiesInvariantRule.java:55)
[junit4:junit4]    > 	at org.apache.lucene.util.TestRuleThreadAndTestName$1.evaluate(TestRuleThreadAndTestName.java:49)
[junit4:junit4]    > 	at org.apache.lucene.util.TestRuleIgnoreAfterMaxFailures$1.evaluate(TestRuleIgnoreAfterMaxFailures.java:70)
[junit4:junit4]    > 	at org.apache.lucene.util.TestRuleMarkFailure$1.evaluate(TestRuleMarkFailure.java:48)
[junit4:junit4]    > 	at com.carrotsearch.randomizedtesting.rules.StatementAdapter.evaluate(StatementAdapter.java:36)
[junit4:junit4]    > 	at com.carrotsearch.randomizedtesting.ThreadLeakControl$StatementRunner.run(ThreadLeakControl.java:358)
[junit4:junit4]    > 	at com.carrotsearch.randomizedtesting.ThreadLeakControl.forkTimeoutingTask(ThreadLeakControl.java:782)
[junit4:junit4]    > 	at com.carrotsearch.randomizedtesting.ThreadLeakControl$3.evaluate(ThreadLeakControl.java:442)
[junit4:junit4]    > 	at com.carrotsearch.randomizedtesting.RandomizedRunner.runSingleTest(RandomizedRunner.java:746)
[junit4:junit4]    > 	at com.carrotsearch.randomizedtesting.RandomizedRunner$3.evaluate(RandomizedRunner.java:648)
[junit4:junit4]    > 	at com.carrotsearch.randomizedtesting.RandomizedRunner$4.evaluate(RandomizedRunner.java:682)
[junit4:junit4]    > 	at com.carrotsearch.randomizedtesting.RandomizedRunner$5.evaluate(RandomizedRunner.java:693)
[junit4:junit4]    > 	at com.carrotsearch.randomizedtesting.rules.StatementAdapter.evaluate(StatementAdapter.java:36)
[junit4:junit4]    > 	at com.carrotsearch.randomizedtesting.rules.SystemPropertiesRestoreRule$1.evaluate(SystemPropertiesRestoreRule.java:53)
[junit4:junit4]    > 	at org.apache.lucene.util.AbstractBeforeAfterRule$1.evaluate(AbstractBeforeAfterRule.java:46)
[junit4:junit4]    > 	at org.apache.lucene.util.TestRuleStoreClassName$1.evaluate(TestRuleStoreClassName.java:42)
[junit4:junit4]    > 	at com.carrotsearch.randomizedtesting.rules.SystemPropertiesInvariantRule$1.evaluate(SystemPropertiesInvariantRule.java:55)
[junit4:junit4]    > 	at com.carrotsearch.randomizedtesting.rules.NoShadowingOrOverridesOnMethodsRule$1.evaluate(NoShadowingOrOverridesOnMethodsRule.java:39)
[junit4:junit4]    > 	at com.carrotsearch.randomizedtesting.rules.NoShadowingOrOverridesOnMethodsRule$1.evaluate(NoShadowingOrOverridesOnMethodsRule.java:39)
[junit4:junit4]    > 	at com.carrotsearch.randomizedtesting.rules.StatementAdapter.evaluate(StatementAdapter.java:36)
[junit4:junit4]    > 	at org.apache.lucene.util.TestRuleAssertionsRequired$1.evaluate(TestRuleAssertionsRequired.java:43)
[junit4:junit4]    > 	at org.apache.lucene.util.TestRuleMarkFailure$1.evaluate(TestRuleMarkFailure.java:48)
[junit4:junit4]    > 	at org.apache.lucene.util.TestRuleIgnoreAfterMaxFailures$1.evaluate(TestRuleIgnoreAfterMaxFailures.java:70)
[junit4:junit4]    > 	at org.apache.lucene.util.TestRuleIgnoreTestSuites$1.evaluate(TestRuleIgnoreTestSuites.java:55)
[junit4:junit4]    > 	at com.carrotsearch.randomizedtesting.rules.StatementAdapter.evaluate(StatementAdapter.java:36)
[junit4:junit4]    > 	at com.carrotsearch.randomizedtesting.ThreadLeakControl$StatementRunner.run(ThreadLeakControl.java:358)
[junit4:junit4]    > 	at java.lang.Thread.run(Thread.java:722)
[junit4:junit4]   2> 288859 T2292 oas.SolrTestCaseJ4.deleteCore ###deleteCore
[junit4:junit4]   2> NOTE: test params are: codec=Lucene42: {n_f1=Pulsing41(freqCutoff=17 minBlockSize=26 maxBlockSize=94), foo_b=Lucene41(blocksize=128), foo_d=PostingsFormat(name=Lucene41WithOrds), foo_f=Lucene41(blocksize=128), n_tl1=Pulsing41(freqCutoff=17 minBlockSize=26 maxBlockSize=94), n_d1=Pulsing41(freqCutoff=8 minBlockSize=26 maxBlockSize=94), rnd_b=PostingsFormat(name=Lucene41WithOrds), intDefault=Pulsing41(freqCutoff=8 minBlockSize=26 maxBlockSize=94), n_td1=Pulsing41(freqCutoff=17 minBlockSize=26 maxBlockSize=94), timestamp=Pulsing41(freqCutoff=8 minBlockSize=26 maxBlockSize=94), id=PostingsFormat(name=Lucene41WithOrds), range_facet_sl=Lucene41(blocksize=128), range_facet_si=Pulsing41(freqCutoff=17 minBlockSize=26 maxBlockSize=94), oddField_s=Lucene41(blocksize=128), foo_i=Pulsing41(freqCutoff=17 minBlockSize=26 maxBlockSize=94), multiDefault=Pulsing41(freqCutoff=17 minBlockSize=26 maxBlockSize=94), n_tf1=Pulsing41(freqCutoff=8 minBlockSize=26 maxBlockSize=94), n_dt1=Pulsing41(freqCutoff=17 minBlockSize=26 maxBlockSize=94), n_ti1=PostingsFormat(name=Lucene41WithOrds), range_facet_l=Pulsing41(freqCutoff=8 minBlockSize=26 maxBlockSize=94), text=Lucene41(blocksize=128), _version_=Pulsing41(freqCutoff=8 minBlockSize=26 maxBlockSize=94), val_i=PostingsFormat(name=Lucene41WithOrds), SubjectTerms_mfacet=Pulsing41(freqCutoff=8 minBlockSize=26 maxBlockSize=94), a_t=Pulsing41(freqCutoff=8 minBlockSize=26 maxBlockSize=94), n_tdt1=Pulsing41(freqCutoff=8 minBlockSize=26 maxBlockSize=94), other_tl1=Pulsing41(freqCutoff=8 minBlockSize=26 maxBlockSize=94), n_l1=Pulsing41(freqCutoff=8 minBlockSize=26 maxBlockSize=94), a_si=Pulsing41(freqCutoff=17 minBlockSize=26 maxBlockSize=94)}, sim=DefaultSimilarity, locale=ar_YE, timezone=America/Phoenix
[junit4:junit4]   2> NOTE: Mac OS X 10.8.2 x86_64/Oracle Corporation 1.7.0_10 (64-bit)/cpus=2,threads=1,free=165778360,total=312606720
[junit4:junit4]   2> NOTE: All tests run in this JVM: [LeaderElectionTest, AutoCommitTest, ScriptEngineTest, SuggesterFSTTest, SolrInfoMBeanTest, NumericFieldsTest, DocumentAnalysisRequestHandlerTest, QueryParsingTest, TestReversedWildcardFilterFactory, TestRTGBase, ConvertedLegacyTest, TestComponentsName, UpdateParamsTest, SolrCoreCheckLockOnStartupTest, TestElisionMultitermQuery, DirectSolrConnectionTest, TestXIncludeConfig, TestSurroundQueryParser, SOLR749Test, TestAtomicUpdateErrorCases, LukeRequestHandlerTest, TestFunctionQuery, SyncSliceTest, TestFoldingMultitermQuery, TestUpdate, CSVRequestHandlerTest, CoreAdminHandlerTest, TestCharFilters, TestRangeQuery, QueryElevationComponentTest, ShowFileRequestHandlerTest, DateMathParserTest, ZkControllerTest, LoggingHandlerTest, TestDocumentBuilder, TestReplicationHandler, TestCoreContainer, HighlighterTest, PrimitiveFieldTypeTest, TermVectorComponentDistributedTest, TestUtils, TestNumberUtils, TestWordDelimiterFilterFactory, TestExtendedDismaxParser, DistanceFunctionTest, SpatialFilterTest, TestRealTimeGet, TestSearchPerf, TestJoin, CopyFieldTest, SpellCheckComponentTest, TestFastWriter, EchoParamsTest, TestWriterPerf, NotRequiredUniqueKeyTest, OverseerCollectionProcessorTest, UpdateRequestProcessorFactoryTest, HighlighterConfigTest, TestMultiCoreConfBootstrap, TestRandomFaceting, XmlUpdateRequestHandlerTest, TestSolrXMLSerializer, TestPseudoReturnFields, TestStressReorder, TestLRUCache, TestDefaultSimilarityFactory, IndexSchemaTest, DOMUtilTest, TestSolrQueryParser, QueryEqualityTest, TestTrie, BasicDistributedZk2Test, TestFastLRUCache, PluginInfoTest, PeerSyncTest, TestFiltering, IndexBasedSpellCheckerTest, IndexReaderFactoryTest, DefaultValueUpdateProcessorTest, SolrCmdDistributorTest, StatsComponentTest, UUIDFieldTest, TestCSVResponseWriter, ExternalFileFieldSortTest, TestZkChroot, TestSystemIdResolver, PingRequestHandlerTest, OpenExchangeRatesOrgProviderTest, SampleTest, SuggesterWFSTTest, BadComponentTest, DirectUpdateHandlerOptimizeTest, DirectUpdateHandlerTest, TestBinaryResponseWriter, DistributedTermsComponentTest, DistributedQueryElevationComponentTest, FullSolrCloudDistribCmdsTest, SoftAutoCommitTest, ShardRoutingTest, TestBadConfig, PolyFieldTest, TermVectorComponentTest, AnalysisAfterCoreReloadTest, TestSolrCoreProperties, DebugComponentTest, BasicFunctionalityTest, CurrencyFieldTest, DirectSolrSpellCheckerTest, BasicDistributedZkTest]
[junit4:junit4] Completed in 289.07s, 1 test, 1 failure <<< FAILURES!

[...truncated 425 lines...]
BUILD FAILED
/Users/jenkins/jenkins-slave/workspace/Lucene-Solr-trunk-MacOSX/build.xml:346: The following error occurred while executing this line:
/Users/jenkins/jenkins-slave/workspace/Lucene-Solr-trunk-MacOSX/build.xml:39: The following error occurred while executing this line:
/Users/jenkins/jenkins-slave/workspace/Lucene-Solr-trunk-MacOSX/solr/build.xml:178: The following error occurred while executing this line:
/Users/jenkins/jenkins-slave/workspace/Lucene-Solr-trunk-MacOSX/solr/common-build.xml:428: The following error occurred while executing this line:
/Users/jenkins/jenkins-slave/workspace/Lucene-Solr-trunk-MacOSX/lucene/common-build.xml:1176: The following error occurred while executing this line:
/Users/jenkins/jenkins-slave/workspace/Lucene-Solr-trunk-MacOSX/lucene/common-build.xml:841: There were test failures: 249 suites, 1038 tests, 1 failure, 14 ignored (3 assumptions)

Total time: 59 minutes 20 seconds
Build step 'Invoke Ant' marked build as failure
Archiving artifacts
Recording test results
Description set: Java: 64bit/jdk1.7.0 -XX:+UseParallelGC
Email was triggered for: Failure
Sending email for trigger: Failure



Mime
View raw message