lucene-dev mailing list archives

Site index · List index
Message view « Date » · « Thread »
Top « Date » · « Thread »
From Apache Jenkins Server <jenk...@builds.apache.org>
Subject [JENKINS] Lucene-Solr-Tests-4.x-java7 - Build # 952 - Still Failing
Date Fri, 01 Feb 2013 00:12:06 GMT
Build: https://builds.apache.org/job/Lucene-Solr-Tests-4.x-java7/952/

1 tests failed.
REGRESSION:  org.apache.solr.cloud.SyncSliceTest.testDistribSearch

Error Message:
shard1 should have just been set up to be inconsistent - but it's still consistent

Stack Trace:
java.lang.AssertionError: shard1 should have just been set up to be inconsistent - but it's still consistent
	at __randomizedtesting.SeedInfo.seed([1EEACA81EB3674E9:9F0C44999C6914D5]:0)
	at org.junit.Assert.fail(Assert.java:93)
	at org.junit.Assert.assertTrue(Assert.java:43)
	at org.junit.Assert.assertNotNull(Assert.java:526)
	at org.apache.solr.cloud.SyncSliceTest.doTest(SyncSliceTest.java:214)
	at org.apache.solr.BaseDistributedSearchTestCase.testDistribSearch(BaseDistributedSearchTestCase.java:794)
	at sun.reflect.NativeMethodAccessorImpl.invoke0(Native Method)
	at sun.reflect.NativeMethodAccessorImpl.invoke(NativeMethodAccessorImpl.java:57)
	at sun.reflect.DelegatingMethodAccessorImpl.invoke(DelegatingMethodAccessorImpl.java:43)
	at java.lang.reflect.Method.invoke(Method.java:601)
	at com.carrotsearch.randomizedtesting.RandomizedRunner.invoke(RandomizedRunner.java:1559)
	at com.carrotsearch.randomizedtesting.RandomizedRunner.access$600(RandomizedRunner.java:79)
	at com.carrotsearch.randomizedtesting.RandomizedRunner$6.evaluate(RandomizedRunner.java:737)
	at com.carrotsearch.randomizedtesting.RandomizedRunner$7.evaluate(RandomizedRunner.java:773)
	at com.carrotsearch.randomizedtesting.RandomizedRunner$8.evaluate(RandomizedRunner.java:787)
	at com.carrotsearch.randomizedtesting.rules.SystemPropertiesRestoreRule$1.evaluate(SystemPropertiesRestoreRule.java:53)
	at org.apache.lucene.util.TestRuleSetupTeardownChained$1.evaluate(TestRuleSetupTeardownChained.java:50)
	at org.apache.lucene.util.TestRuleFieldCacheSanity$1.evaluate(TestRuleFieldCacheSanity.java:51)
	at org.apache.lucene.util.AbstractBeforeAfterRule$1.evaluate(AbstractBeforeAfterRule.java:46)
	at com.carrotsearch.randomizedtesting.rules.SystemPropertiesInvariantRule$1.evaluate(SystemPropertiesInvariantRule.java:55)
	at org.apache.lucene.util.TestRuleThreadAndTestName$1.evaluate(TestRuleThreadAndTestName.java:49)
	at org.apache.lucene.util.TestRuleIgnoreAfterMaxFailures$1.evaluate(TestRuleIgnoreAfterMaxFailures.java:70)
	at org.apache.lucene.util.TestRuleMarkFailure$1.evaluate(TestRuleMarkFailure.java:48)
	at com.carrotsearch.randomizedtesting.rules.StatementAdapter.evaluate(StatementAdapter.java:36)
	at com.carrotsearch.randomizedtesting.ThreadLeakControl$StatementRunner.run(ThreadLeakControl.java:358)
	at com.carrotsearch.randomizedtesting.ThreadLeakControl.forkTimeoutingTask(ThreadLeakControl.java:782)
	at com.carrotsearch.randomizedtesting.ThreadLeakControl$3.evaluate(ThreadLeakControl.java:442)
	at com.carrotsearch.randomizedtesting.RandomizedRunner.runSingleTest(RandomizedRunner.java:746)
	at com.carrotsearch.randomizedtesting.RandomizedRunner$3.evaluate(RandomizedRunner.java:648)
	at com.carrotsearch.randomizedtesting.RandomizedRunner$4.evaluate(RandomizedRunner.java:682)
	at com.carrotsearch.randomizedtesting.RandomizedRunner$5.evaluate(RandomizedRunner.java:693)
	at com.carrotsearch.randomizedtesting.rules.StatementAdapter.evaluate(StatementAdapter.java:36)
	at com.carrotsearch.randomizedtesting.rules.SystemPropertiesRestoreRule$1.evaluate(SystemPropertiesRestoreRule.java:53)
	at org.apache.lucene.util.AbstractBeforeAfterRule$1.evaluate(AbstractBeforeAfterRule.java:46)
	at org.apache.lucene.util.TestRuleStoreClassName$1.evaluate(TestRuleStoreClassName.java:42)
	at com.carrotsearch.randomizedtesting.rules.SystemPropertiesInvariantRule$1.evaluate(SystemPropertiesInvariantRule.java:55)
	at com.carrotsearch.randomizedtesting.rules.NoShadowingOrOverridesOnMethodsRule$1.evaluate(NoShadowingOrOverridesOnMethodsRule.java:39)
	at com.carrotsearch.randomizedtesting.rules.NoShadowingOrOverridesOnMethodsRule$1.evaluate(NoShadowingOrOverridesOnMethodsRule.java:39)
	at com.carrotsearch.randomizedtesting.rules.StatementAdapter.evaluate(StatementAdapter.java:36)
	at org.apache.lucene.util.TestRuleAssertionsRequired$1.evaluate(TestRuleAssertionsRequired.java:43)
	at org.apache.lucene.util.TestRuleMarkFailure$1.evaluate(TestRuleMarkFailure.java:48)
	at org.apache.lucene.util.TestRuleIgnoreAfterMaxFailures$1.evaluate(TestRuleIgnoreAfterMaxFailures.java:70)
	at org.apache.lucene.util.TestRuleIgnoreTestSuites$1.evaluate(TestRuleIgnoreTestSuites.java:55)
	at com.carrotsearch.randomizedtesting.rules.StatementAdapter.evaluate(StatementAdapter.java:36)
	at com.carrotsearch.randomizedtesting.ThreadLeakControl$StatementRunner.run(ThreadLeakControl.java:358)
	at java.lang.Thread.run(Thread.java:722)




Build Log:
[...truncated 8646 lines...]
[junit4:junit4] Suite: org.apache.solr.cloud.SyncSliceTest
[junit4:junit4]   2> 0 T17 oas.BaseDistributedSearchTestCase.initHostContext Setting hostContext system property: /
[junit4:junit4]   2> 8 T17 oas.SolrTestCaseJ4.setUp ###Starting testDistribSearch
[junit4:junit4]   2> Creating dataDir: /usr/home/hudson/hudson-slave/workspace/Lucene-Solr-Tests-4.x-java7/solr/build/solr-core/test/J0/./solrtest-SyncSliceTest-1359676558801
[junit4:junit4]   2> 15 T17 oasc.ZkTestServer.run STARTING ZK TEST SERVER
[junit4:junit4]   2> 21 T18 oasc.ZkTestServer$ZKServerMain.runFromConfig Starting server
[junit4:junit4]   2> 89 T18 oaz.Environment.logEnv Server environment:zookeeper.version=3.4.5-1392090, built on 09/30/2012 17:52 GMT
[junit4:junit4]   2> 89 T18 oaz.Environment.logEnv Server environment:host.name=lucene.zones.apache.org
[junit4:junit4]   2> 90 T18 oaz.Environment.logEnv Server environment:java.version=1.7.0_09
[junit4:junit4]   2> 90 T18 oaz.Environment.logEnv Server environment:java.vendor=Oracle Corporation
[junit4:junit4]   2> 90 T18 oaz.Environment.logEnv Server environment:java.home=/usr/local/openjdk7/jre
[junit4:junit4]   2> 91 T18 oaz.Environment.logEnv Server environment:java.class.path=/usr/home/hudson/hudson-slave/workspace/Lucene-Solr-Tests-4.x-java7/solr/build/solr-core/classes/test:/usr/home/hudson/hudson-slave/workspace/Lucene-Solr-Tests-4.x-java7/solr/build/solr-test-framework/classes/java:/usr/home/hudson/hudson-slave/workspace/Lucene-Solr-Tests-4.x-java7/solr/build/solr-core/test-files:/usr/home/hudson/hudson-slave/workspace/Lucene-Solr-Tests-4.x-java7/lucene/build/test-framework/classes/java:/usr/home/hudson/hudson-slave/workspace/Lucene-Solr-Tests-4.x-java7/lucene/build/codecs/classes/java:/usr/home/hudson/hudson-slave/workspace/Lucene-Solr-Tests-4.x-java7/solr/build/solr-solrj/classes/java:/usr/home/hudson/hudson-slave/workspace/Lucene-Solr-Tests-4.x-java7/solr/build/solr-core/classes/java:/usr/home/hudson/hudson-slave/workspace/Lucene-Solr-Tests-4.x-java7/lucene/build/analysis/common/lucene-analyzers-common-4.2-SNAPSHOT.jar:/usr/home/hudson/hudson-slave/workspace/Lucene-Solr-Tests-4.x-java7/lucene/build/analysis/kuromoji/lucene-analyzers-kuromoji-4.2-SNAPSHOT.jar:/usr/home/hudson/hudson-slave/workspace/Lucene-Solr-Tests-4.x-java7/lucene/build/analysis/phonetic/lucene-analyzers-phonetic-4.2-SNAPSHOT.jar:/usr/home/hudson/hudson-slave/workspace/Lucene-Solr-Tests-4.x-java7/lucene/build/highlighter/lucene-highlighter-4.2-SNAPSHOT.jar:/usr/home/hudson/hudson-slave/workspace/Lucene-Solr-Tests-4.x-java7/lucene/build/memory/lucene-memory-4.2-SNAPSHOT.jar:/usr/home/hudson/hudson-slave/workspace/Lucene-Solr-Tests-4.x-java7/lucene/build/misc/lucene-misc-4.2-SNAPSHOT.jar:/usr/home/hudson/hudson-slave/workspace/Lucene-Solr-Tests-4.x-java7/lucene/build/spatial/lucene-spatial-4.2-SNAPSHOT.jar:/usr/home/hudson/hudson-slave/workspace/Lucene-Solr-Tests-4.x-java7/lucene/build/suggest/lucene-suggest-4.2-SNAPSHOT.jar:/usr/home/hudson/hudson-slave/workspace/Lucene-Solr-Tests-4.x-java7/lucene/build/grouping/lucene-grouping-4.2-SNAPSHOT.jar:/usr/home/hudson/hudson-slave/workspace/Lucene-Solr-Tests-4.x-java7/lucene/build/queries/lucene-queries-4.2-SNAPSHOT.jar:/usr/home/hudson/hudson-slave/workspace/Lucene-Solr-Tests-4.x-java7/lucene/build/queryparser/lucene-queryparser-4.2-SNAPSHOT.jar:/usr/home/hudson/hudson-slave/workspace/Lucene-Solr-Tests-4.x-java7/solr/core/lib/cglib-nodep-2.2.jar:/usr/home/hudson/hudson-slave/workspace/Lucene-Solr-Tests-4.x-java7/solr/core/lib/commons-cli-1.2.jar:/usr/home/hudson/hudson-slave/workspace/Lucene-Solr-Tests-4.x-java7/solr/core/lib/commons-codec-1.7.jar:/usr/home/hudson/hudson-slave/workspace/Lucene-Solr-Tests-4.x-java7/solr/core/lib/commons-fileupload-1.2.1.jar:/usr/home/hudson/hudson-slave/workspace/Lucene-Solr-Tests-4.x-java7/solr/core/lib/commons-lang-2.6.jar:/usr/home/hudson/hudson-slave/workspace/Lucene-Solr-Tests-4.x-java7/solr/core/lib/easymock-3.0.jar:/usr/home/hudson/hudson-slave/workspace/Lucene-Solr-Tests-4.x-java7/solr/core/lib/guava-13.0.1.jar:/usr/home/hudson/hudson-slave/workspace/Lucene-Solr-Tests-4.x-java7/solr/core/lib/javax.servlet-api-3.0.1.jar:/usr/home/hudson/hudson-slave/workspace/Lucene-Solr-Tests-4.x-java7/solr/core/lib/objenesis-1.2.jar:/usr/home/hudson/hudson-slave/workspace/Lucene-Solr-Tests-4.x-java7/solr/core/lib/spatial4j-0.3.jar:/usr/home/hudson/hudson-slave/workspace/Lucene-Solr-Tests-4.x-java7/solr/solrj/lib/commons-io-2.1.jar:/usr/home/hudson/hudson-slave/workspace/Lucene-Solr-Tests-4.x-java7/solr/solrj/lib/httpclient-4.1.3.jar:/usr/home/hudson/hudson-slave/workspace/Lucene-Solr-Tests-4.x-java7/solr/solrj/lib/httpcore-4.1.4.jar:/usr/home/hudson/hudson-slave/workspace/Lucene-Solr-Tests-4.x-java7/solr/solrj/lib/httpmime-4.1.3.jar:/usr/home/hudson/hudson-slave/workspace/Lucene-Solr-Tests-4.x-java7/solr/solrj/lib/jcl-over-slf4j-1.6.4.jar:/usr/home/hudson/hudson-slave/workspace/Lucene-Solr-Tests-4.x-java7/solr/solrj/lib/slf4j-api-1.6.4.jar:/usr/home/hudson/hudson-slave/workspace/Lucene-Solr-Tests-4.x-java7/solr/solrj/lib/slf4j-jdk14-1.6.4.jar:/usr/home/hudson/hudson-slave/workspace/Lucene-Solr-Tests-4.x-java7/solr/solrj/lib/wstx-asl-3.2.7.jar:/usr/home/hudson/hudson-slave/workspace/Lucene-Solr-Tests-4.x-java7/solr/solrj/lib/zookeeper-3.4.5.jar:/usr/home/hudson/hudson-slave/workspace/Lucene-Solr-Tests-4.x-java7/solr/example/lib/jetty-continuation-8.1.8.v20121106.jar:/usr/home/hudson/hudson-slave/workspace/Lucene-Solr-Tests-4.x-java7/solr/example/lib/jetty-deploy-8.1.8.v20121106.jar:/usr/home/hudson/hudson-slave/workspace/Lucene-Solr-Tests-4.x-java7/solr/example/lib/jetty-http-8.1.8.v20121106.jar:/usr/home/hudson/hudson-slave/workspace/Lucene-Solr-Tests-4.x-java7/solr/example/lib/jetty-io-8.1.8.v20121106.jar:/usr/home/hudson/hudson-slave/workspace/Lucene-Solr-Tests-4.x-java7/solr/example/lib/jetty-jmx-8.1.8.v20121106.jar:/usr/home/hudson/hudson-slave/workspace/Lucene-Solr-Tests-4.x-java7/solr/example/lib/jetty-security-8.1.8.v20121106.jar:/usr/home/hudson/hudson-slave/workspace/Lucene-Solr-Tests-4.x-java7/solr/example/lib/jetty-server-8.1.8.v20121106.jar:/usr/home/hudson/hudson-slave/workspace/Lucene-Solr-Tests-4.x-java7/solr/example/lib/jetty-servlet-8.1.8.v20121106.jar:/usr/home/hudson/hudson-slave/workspace/Lucene-Solr-Tests-4.x-java7/solr/example/lib/jetty-util-8.1.8.v20121106.jar:/usr/home/hudson/hudson-slave/workspace/Lucene-Solr-Tests-4.x-java7/solr/example/lib/jetty-webapp-8.1.8.v20121106.jar:/usr/home/hudson/hudson-slave/workspace/Lucene-Solr-Tests-4.x-java7/solr/example/lib/jetty-xml-8.1.8.v20121106.jar:/usr/home/hudson/hudson-slave/workspace/Lucene-Solr-Tests-4.x-java7/solr/example/lib/servlet-api-3.0.jar:/usr/home/hudson/hudson-slave/workspace/Lucene-Solr-Tests-4.x-java7/solr/example/example-DIH/solr/db/lib/derby-10.9.1.0.jar:/usr/home/hudson/hudson-slave/workspace/Lucene-Solr-Tests-4.x-java7/solr/example/example-DIH/solr/db/lib/hsqldb-1.8.0.10.jar:/usr/home/hudson/hudson-slave/workspace/Lucene-Solr-Tests-4.x-java7/lucene/build/core/classes/java:/usr/home/hudson/hudson-slave/workspace/Lucene-Solr-Tests-4.x-java7/lucene/test-framework/lib/junit-4.10.jar:/usr/home/hudson/hudson-slave/workspace/Lucene-Solr-Tests-4.x-java7/lucene/test-framework/lib/randomizedtesting-runner-2.0.8.jar:/home/hudson/hudson-slave/tools/hudson.tasks.Ant_AntInstallation/ant-1.8.2/lib/ant-launcher.jar:/home/hudson/.ant/lib/ivy-2.2.0.jar:/home/hudson/hudson-slave/tools/hudson.tasks.Ant_AntInstallation/ant-1.8.2/lib/ant-commons-logging.jar:/home/hudson/hudson-slave/tools/hudson.tasks.Ant_AntInstallation/ant-1.8.2/lib/ant-apache-regexp.jar:/home/hudson/hudson-slave/tools/hudson.tasks.Ant_AntInstallation/ant-1.8.2/lib/ant-apache-oro.jar:/home/hudson/hudson-slave/tools/hudson.tasks.Ant_AntInstallation/ant-1.8.2/lib/ant-swing.jar:/home/hudson/hudson-slave/tools/hudson.tasks.Ant_AntInstallation/ant-1.8.2/lib/ant-jdepend.jar:/home/hudson/hudson-slave/tools/hudson.tasks.Ant_AntInstallation/ant-1.8.2/lib/ant-apache-xalan2.jar:/home/hudson/hudson-slave/tools/hudson.tasks.Ant_AntInstallation/ant-1.8.2/lib/ant-apache-bsf.jar:/home/hudson/hudson-slave/tools/hudson.tasks.Ant_AntInstallation/ant-1.8.2/lib/ant-junit4.jar:/home/hudson/hudson-slave/tools/hudson.tasks.Ant_AntInstallation/ant-1.8.2/lib/ant-commons-net.jar:/home/hudson/hudson-slave/tools/hudson.tasks.Ant_AntInstallation/ant-1.8.2/lib/ant-antlr.jar:/home/hudson/hudson-slave/tools/hudson.tasks.Ant_AntInstallation/ant-1.8.2/lib/ant-junit.jar:/home/hudson/hudson-slave/tools/hudson.tasks.Ant_AntInstallation/ant-1.8.2/lib/ant-jmf.jar:/home/hudson/hudson-slave/tools/hudson.tasks.Ant_AntInstallation/ant-1.8.2/lib/ant-netrexx.jar:/home/hudson/hudson-slave/tools/hudson.tasks.Ant_AntInstallation/ant-1.8.2/lib/ant-apache-log4j.jar:/home/hudson/hudson-slave/tools/hudson.tasks.Ant_AntInstallation/ant-1.8.2/lib/ant-apache-resolver.jar:/home/hudson/hudson-slave/tools/hudson.tasks.Ant_AntInstallation/ant-1.8.2/lib/ant.jar:/home/hudson/hudson-slave/tools/hudson.tasks.Ant_AntInstallation/ant-1.8.2/lib/ant-jsch.jar:/home/hudson/hudson-slave/tools/hudson.tasks.Ant_AntInstallation/ant-1.8.2/lib/ant-testutil.jar:/home/hudson/hudson-slave/tools/hudson.tasks.Ant_AntInstallation/ant-1.8.2/lib/ant-apache-bcel.jar:/home/hudson/hudson-slave/tools/hudson.tasks.Ant_AntInstallation/ant-1.8.2/lib/ant-jai.jar:/home/hudson/hudson-slave/tools/hudson.tasks.Ant_AntInstallation/ant-1.8.2/lib/ant-javamail.jar:/usr/local/openjdk7/lib/tools.jar:/home/hudson/.ivy2/cache/com.carrotsearch.randomizedtesting/junit4-ant/jars/junit4-ant-2.0.8.jar
[junit4:junit4]   2> 92 T18 oaz.Environment.logEnv Server environment:java.library.path=/usr/local/openjdk7/jre/lib/amd64/server:/usr/local/openjdk7/jre/lib/amd64:/usr/local/openjdk7/jre/../lib/amd64:/usr/local/openjdk6/jre/lib/amd64/server:/usr/local/openjdk6/jre/lib/amd64:/usr/local/openjdk6/jre/../lib/amd64:/usr/java/packages/lib/amd64:/lib:/usr/lib:/usr/local/lib
[junit4:junit4]   2> 92 T18 oaz.Environment.logEnv Server environment:java.io.tmpdir=.
[junit4:junit4]   2> 93 T18 oaz.Environment.logEnv Server environment:java.compiler=<NA>
[junit4:junit4]   2> 93 T18 oaz.Environment.logEnv Server environment:os.name=FreeBSD
[junit4:junit4]   2> 93 T18 oaz.Environment.logEnv Server environment:os.arch=amd64
[junit4:junit4]   2> 93 T18 oaz.Environment.logEnv Server environment:os.version=9.0-RELEASE
[junit4:junit4]   2> 94 T18 oaz.Environment.logEnv Server environment:user.name=hudson
[junit4:junit4]   2> 94 T18 oaz.Environment.logEnv Server environment:user.home=/home/hudson
[junit4:junit4]   2> 94 T18 oaz.Environment.logEnv Server environment:user.dir=/usr/home/hudson/hudson-slave/workspace/Lucene-Solr-Tests-4.x-java7/solr/build/solr-core/test/J0
[junit4:junit4]   2> 133 T18 oazs.ZooKeeperServer.setTickTime tickTime set to 1000
[junit4:junit4]   2> 134 T18 oazs.ZooKeeperServer.setMinSessionTimeout minSessionTimeout set to -1
[junit4:junit4]   2> 134 T18 oazs.ZooKeeperServer.setMaxSessionTimeout maxSessionTimeout set to -1
[junit4:junit4]   2> 141 T18 oazs.NIOServerCnxnFactory.configure binding to port 0.0.0.0/0.0.0.0:0
[junit4:junit4]   2> 220 T18 oazsp.FileTxnSnapLog.save Snapshotting: 0x0 to /usr/home/hudson/hudson-slave/workspace/Lucene-Solr-Tests-4.x-java7/solr/build/solr-core/test/J0/./org.apache.solr.cloud.SyncSliceTest-1359676558800/zookeeper/server1/data/version-2/snapshot.0
[junit4:junit4]   2> 222 T17 oasc.ZkTestServer.run start zk server on port:18121
[junit4:junit4]   2> 332 T17 oaz.Environment.logEnv Client environment:zookeeper.version=3.4.5-1392090, built on 09/30/2012 17:52 GMT
[junit4:junit4]   2> 333 T17 oaz.Environment.logEnv Client environment:host.name=lucene.zones.apache.org
[junit4:junit4]   2> 334 T17 oaz.Environment.logEnv Client environment:java.version=1.7.0_09
[junit4:junit4]   2> 334 T17 oaz.Environment.logEnv Client environment:java.vendor=Oracle Corporation
[junit4:junit4]   2> 335 T17 oaz.Environment.logEnv Client environment:java.home=/usr/local/openjdk7/jre
[junit4:junit4]   2> 336 T17 oaz.Environment.logEnv Client environment:java.class.path=/usr/home/hudson/hudson-slave/workspace/Lucene-Solr-Tests-4.x-java7/solr/build/solr-core/classes/test:/usr/home/hudson/hudson-slave/workspace/Lucene-Solr-Tests-4.x-java7/solr/build/solr-test-framework/classes/java:/usr/home/hudson/hudson-slave/workspace/Lucene-Solr-Tests-4.x-java7/solr/build/solr-core/test-files:/usr/home/hudson/hudson-slave/workspace/Lucene-Solr-Tests-4.x-java7/lucene/build/test-framework/classes/java:/usr/home/hudson/hudson-slave/workspace/Lucene-Solr-Tests-4.x-java7/lucene/build/codecs/classes/java:/usr/home/hudson/hudson-slave/workspace/Lucene-Solr-Tests-4.x-java7/solr/build/solr-solrj/classes/java:/usr/home/hudson/hudson-slave/workspace/Lucene-Solr-Tests-4.x-java7/solr/build/solr-core/classes/java:/usr/home/hudson/hudson-slave/workspace/Lucene-Solr-Tests-4.x-java7/lucene/build/analysis/common/lucene-analyzers-common-4.2-SNAPSHOT.jar:/usr/home/hudson/hudson-slave/workspace/Lucene-Solr-Tests-4.x-java7/lucene/build/analysis/kuromoji/lucene-analyzers-kuromoji-4.2-SNAPSHOT.jar:/usr/home/hudson/hudson-slave/workspace/Lucene-Solr-Tests-4.x-java7/lucene/build/analysis/phonetic/lucene-analyzers-phonetic-4.2-SNAPSHOT.jar:/usr/home/hudson/hudson-slave/workspace/Lucene-Solr-Tests-4.x-java7/lucene/build/highlighter/lucene-highlighter-4.2-SNAPSHOT.jar:/usr/home/hudson/hudson-slave/workspace/Lucene-Solr-Tests-4.x-java7/lucene/build/memory/lucene-memory-4.2-SNAPSHOT.jar:/usr/home/hudson/hudson-slave/workspace/Lucene-Solr-Tests-4.x-java7/lucene/build/misc/lucene-misc-4.2-SNAPSHOT.jar:/usr/home/hudson/hudson-slave/workspace/Lucene-Solr-Tests-4.x-java7/lucene/build/spatial/lucene-spatial-4.2-SNAPSHOT.jar:/usr/home/hudson/hudson-slave/workspace/Lucene-Solr-Tests-4.x-java7/lucene/build/suggest/lucene-suggest-4.2-SNAPSHOT.jar:/usr/home/hudson/hudson-slave/workspace/Lucene-Solr-Tests-4.x-java7/lucene/build/grouping/lucene-grouping-4.2-SNAPSHOT.jar:/usr/home/hudson/hudson-slave/workspace/Lucene-Solr-Tests-4.x-java7/lucene/build/queries/lucene-queries-4.2-SNAPSHOT.jar:/usr/home/hudson/hudson-slave/workspace/Lucene-Solr-Tests-4.x-java7/lucene/build/queryparser/lucene-queryparser-4.2-SNAPSHOT.jar:/usr/home/hudson/hudson-slave/workspace/Lucene-Solr-Tests-4.x-java7/solr/core/lib/cglib-nodep-2.2.jar:/usr/home/hudson/hudson-slave/workspace/Lucene-Solr-Tests-4.x-java7/solr/core/lib/commons-cli-1.2.jar:/usr/home/hudson/hudson-slave/workspace/Lucene-Solr-Tests-4.x-java7/solr/core/lib/commons-codec-1.7.jar:/usr/home/hudson/hudson-slave/workspace/Lucene-Solr-Tests-4.x-java7/solr/core/lib/commons-fileupload-1.2.1.jar:/usr/home/hudson/hudson-slave/workspace/Lucene-Solr-Tests-4.x-java7/solr/core/lib/commons-lang-2.6.jar:/usr/home/hudson/hudson-slave/workspace/Lucene-Solr-Tests-4.x-java7/solr/core/lib/easymock-3.0.jar:/usr/home/hudson/hudson-slave/workspace/Lucene-Solr-Tests-4.x-java7/solr/core/lib/guava-13.0.1.jar:/usr/home/hudson/hudson-slave/workspace/Lucene-Solr-Tests-4.x-java7/solr/core/lib/javax.servlet-api-3.0.1.jar:/usr/home/hudson/hudson-slave/workspace/Lucene-Solr-Tests-4.x-java7/solr/core/lib/objenesis-1.2.jar:/usr/home/hudson/hudson-slave/workspace/Lucene-Solr-Tests-4.x-java7/solr/core/lib/spatial4j-0.3.jar:/usr/home/hudson/hudson-slave/workspace/Lucene-Solr-Tests-4.x-java7/solr/solrj/lib/commons-io-2.1.jar:/usr/home/hudson/hudson-slave/workspace/Lucene-Solr-Tests-4.x-java7/solr/solrj/lib/httpclient-4.1.3.jar:/usr/home/hudson/hudson-slave/workspace/Lucene-Solr-Tests-4.x-java7/solr/solrj/lib/httpcore-4.1.4.jar:/usr/home/hudson/hudson-slave/workspace/Lucene-Solr-Tests-4.x-java7/solr/solrj/lib/httpmime-4.1.3.jar:/usr/home/hudson/hudson-slave/workspace/Lucene-Solr-Tests-4.x-java7/solr/solrj/lib/jcl-over-slf4j-1.6.4.jar:/usr/home/hudson/hudson-slave/workspace/Lucene-Solr-Tests-4.x-java7/solr/solrj/lib/slf4j-api-1.6.4.jar:/usr/home/hudson/hudson-slave/workspace/Lucene-Solr-Tests-4.x-java7/solr/solrj/lib/slf4j-jdk14-1.6.4.jar:/usr/home/hudson/hudson-slave/workspace/Lucene-Solr-Tests-4.x-java7/solr/solrj/lib/wstx-asl-3.2.7.jar:/usr/home/hudson/hudson-slave/workspace/Lucene-Solr-Tests-4.x-java7/solr/solrj/lib/zookeeper-3.4.5.jar:/usr/home/hudson/hudson-slave/workspace/Lucene-Solr-Tests-4.x-java7/solr/example/lib/jetty-continuation-8.1.8.v20121106.jar:/usr/home/hudson/hudson-slave/workspace/Lucene-Solr-Tests-4.x-java7/solr/example/lib/jetty-deploy-8.1.8.v20121106.jar:/usr/home/hudson/hudson-slave/workspace/Lucene-Solr-Tests-4.x-java7/solr/example/lib/jetty-http-8.1.8.v20121106.jar:/usr/home/hudson/hudson-slave/workspace/Lucene-Solr-Tests-4.x-java7/solr/example/lib/jetty-io-8.1.8.v20121106.jar:/usr/home/hudson/hudson-slave/workspace/Lucene-Solr-Tests-4.x-java7/solr/example/lib/jetty-jmx-8.1.8.v20121106.jar:/usr/home/hudson/hudson-slave/workspace/Lucene-Solr-Tests-4.x-java7/solr/example/lib/jetty-security-8.1.8.v20121106.jar:/usr/home/hudson/hudson-slave/workspace/Lucene-Solr-Tests-4.x-java7/solr/example/lib/jetty-server-8.1.8.v20121106.jar:/usr/home/hudson/hudson-slave/workspace/Lucene-Solr-Tests-4.x-java7/solr/example/lib/jetty-servlet-8.1.8.v20121106.jar:/usr/home/hudson/hudson-slave/workspace/Lucene-Solr-Tests-4.x-java7/solr/example/lib/jetty-util-8.1.8.v20121106.jar:/usr/home/hudson/hudson-slave/workspace/Lucene-Solr-Tests-4.x-java7/solr/example/lib/jetty-webapp-8.1.8.v20121106.jar:/usr/home/hudson/hudson-slave/workspace/Lucene-Solr-Tests-4.x-java7/solr/example/lib/jetty-xml-8.1.8.v20121106.jar:/usr/home/hudson/hudson-slave/workspace/Lucene-Solr-Tests-4.x-java7/solr/example/lib/servlet-api-3.0.jar:/usr/home/hudson/hudson-slave/workspace/Lucene-Solr-Tests-4.x-java7/solr/example/example-DIH/solr/db/lib/derby-10.9.1.0.jar:/usr/home/hudson/hudson-slave/workspace/Lucene-Solr-Tests-4.x-java7/solr/example/example-DIH/solr/db/lib/hsqldb-1.8.0.10.jar:/usr/home/hudson/hudson-slave/workspace/Lucene-Solr-Tests-4.x-java7/lucene/build/core/classes/java:/usr/home/hudson/hudson-slave/workspace/Lucene-Solr-Tests-4.x-java7/lucene/test-framework/lib/junit-4.10.jar:/usr/home/hudson/hudson-slave/workspace/Lucene-Solr-Tests-4.x-java7/lucene/test-framework/lib/randomizedtesting-runner-2.0.8.jar:/home/hudson/hudson-slave/tools/hudson.tasks.Ant_AntInstallation/ant-1.8.2/lib/ant-launcher.jar:/home/hudson/.ant/lib/ivy-2.2.0.jar:/home/hudson/hudson-slave/tools/hudson.tasks.Ant_AntInstallation/ant-1.8.2/lib/ant-commons-logging.jar:/home/hudson/hudson-slave/tools/hudson.tasks.Ant_AntInstallation/ant-1.8.2/lib/ant-apache-regexp.jar:/home/hudson/hudson-slave/tools/hudson.tasks.Ant_AntInstallation/ant-1.8.2/lib/ant-apache-oro.jar:/home/hudson/hudson-slave/tools/hudson.tasks.Ant_AntInstallation/ant-1.8.2/lib/ant-swing.jar:/home/hudson/hudson-slave/tools/hudson.tasks.Ant_AntInstallation/ant-1.8.2/lib/ant-jdepend.jar:/home/hudson/hudson-slave/tools/hudson.tasks.Ant_AntInstallation/ant-1.8.2/lib/ant-apache-xalan2.jar:/home/hudson/hudson-slave/tools/hudson.tasks.Ant_AntInstallation/ant-1.8.2/lib/ant-apache-bsf.jar:/home/hudson/hudson-slave/tools/hudson.tasks.Ant_AntInstallation/ant-1.8.2/lib/ant-junit4.jar:/home/hudson/hudson-slave/tools/hudson.tasks.Ant_AntInstallation/ant-1.8.2/lib/ant-commons-net.jar:/home/hudson/hudson-slave/tools/hudson.tasks.Ant_AntInstallation/ant-1.8.2/lib/ant-antlr.jar:/home/hudson/hudson-slave/tools/hudson.tasks.Ant_AntInstallation/ant-1.8.2/lib/ant-junit.jar:/home/hudson/hudson-slave/tools/hudson.tasks.Ant_AntInstallation/ant-1.8.2/lib/ant-jmf.jar:/home/hudson/hudson-slave/tools/hudson.tasks.Ant_AntInstallation/ant-1.8.2/lib/ant-netrexx.jar:/home/hudson/hudson-slave/tools/hudson.tasks.Ant_AntInstallation/ant-1.8.2/lib/ant-apache-log4j.jar:/home/hudson/hudson-slave/tools/hudson.tasks.Ant_AntInstallation/ant-1.8.2/lib/ant-apache-resolver.jar:/home/hudson/hudson-slave/tools/hudson.tasks.Ant_AntInstallation/ant-1.8.2/lib/ant.jar:/home/hudson/hudson-slave/tools/hudson.tasks.Ant_AntInstallation/ant-1.8.2/lib/ant-jsch.jar:/home/hudson/hudson-slave/tools/hudson.tasks.Ant_AntInstallation/ant-1.8.2/lib/ant-testutil.jar:/home/hudson/hudson-slave/tools/hudson.tasks.Ant_AntInstallation/ant-1.8.2/lib/ant-apache-bcel.jar:/home/hudson/hudson-slave/tools/hudson.tasks.Ant_AntInstallation/ant-1.8.2/lib/ant-jai.jar:/home/hudson/hudson-slave/tools/hudson.tasks.Ant_AntInstallation/ant-1.8.2/lib/ant-javamail.jar:/usr/local/openjdk7/lib/tools.jar:/home/hudson/.ivy2/cache/com.carrotsearch.randomizedtesting/junit4-ant/jars/junit4-ant-2.0.8.jar
[junit4:junit4]   2> 338 T17 oaz.Environment.logEnv Client environment:java.library.path=/usr/local/openjdk7/jre/lib/amd64/server:/usr/local/openjdk7/jre/lib/amd64:/usr/local/openjdk7/jre/../lib/amd64:/usr/local/openjdk6/jre/lib/amd64/server:/usr/local/openjdk6/jre/lib/amd64:/usr/local/openjdk6/jre/../lib/amd64:/usr/java/packages/lib/amd64:/lib:/usr/lib:/usr/local/lib
[junit4:junit4]   2> 339 T17 oaz.Environment.logEnv Client environment:java.io.tmpdir=.
[junit4:junit4]   2> 340 T17 oaz.Environment.logEnv Client environment:java.compiler=<NA>
[junit4:junit4]   2> 340 T17 oaz.Environment.logEnv Client environment:os.name=FreeBSD
[junit4:junit4]   2> 341 T17 oaz.Environment.logEnv Client environment:os.arch=amd64
[junit4:junit4]   2> 342 T17 oaz.Environment.logEnv Client environment:os.version=9.0-RELEASE
[junit4:junit4]   2> 342 T17 oaz.Environment.logEnv Client environment:user.name=hudson
[junit4:junit4]   2> 343 T17 oaz.Environment.logEnv Client environment:user.home=/home/hudson
[junit4:junit4]   2> 344 T17 oaz.Environment.logEnv Client environment:user.dir=/usr/home/hudson/hudson-slave/workspace/Lucene-Solr-Tests-4.x-java7/solr/build/solr-core/test/J0
[junit4:junit4]   2> 350 T17 oaz.ZooKeeper.<init> Initiating client connection, connectString=127.0.0.1:18121 sessionTimeout=10000 watcher=org.apache.solr.common.cloud.ConnectionManager@75ca13e7
[junit4:junit4]   2> 438 T17 oascc.ConnectionManager.waitForConnected Waiting for client to connect to ZooKeeper
[junit4:junit4]   2> 448 T23 oaz.ClientCnxn$SendThread.logStartConnect Opening socket connection to server localhost/127.0.0.1:18121. Will not attempt to authenticate using SASL (access denied ("javax.security.auth.AuthPermission" "getLoginConfiguration"))
[junit4:junit4]   2> 450 T23 oaz.ClientCnxn$SendThread.primeConnection Socket connection established to localhost/127.0.0.1:18121, initiating session
[junit4:junit4]   2> 451 T19 oazs.NIOServerCnxnFactory.run Accepted socket connection from /140.211.11.196:32691
[junit4:junit4]   2> 502 T19 oazs.ZooKeeperServer.processConnectRequest Client attempting to establish new session at /140.211.11.196:32691
[junit4:junit4]   2> 522 T21 oazsp.FileTxnLog.append Creating new log file: log.1
[junit4:junit4]   2> 552 T21 oazs.ZooKeeperServer.finishSessionInit Established session 0x13c9309ced10000 with negotiated timeout 10000 for client /140.211.11.196:32691
[junit4:junit4]   2> 552 T23 oaz.ClientCnxn$SendThread.onConnected Session establishment complete on server localhost/127.0.0.1:18121, sessionid = 0x13c9309ced10000, negotiated timeout = 10000
[junit4:junit4]   2> 562 T24 oascc.ConnectionManager.process Watcher org.apache.solr.common.cloud.ConnectionManager@75ca13e7 name:ZooKeeperConnection Watcher:127.0.0.1:18121 got event WatchedEvent state:SyncConnected type:None path:null path:null type:None
[junit4:junit4]   2> 563 T17 oascc.ConnectionManager.waitForConnected Client is connected to ZooKeeper
[junit4:junit4]   2> 567 T17 oascc.SolrZkClient.makePath makePath: /solr
[junit4:junit4]   2> 660 T22 oazs.PrepRequestProcessor.pRequest2Txn Processed session termination for sessionid: 0x13c9309ced10000
[junit4:junit4]   2> 661 T24 oaz.ClientCnxn$EventThread.run EventThread shut down
[junit4:junit4]   2> 661 T17 oaz.ZooKeeper.close Session: 0x13c9309ced10000 closed
[junit4:junit4]   2> 663 T19 oazs.NIOServerCnxn.closeSock Closed socket connection for client /140.211.11.196:32691 which had sessionid 0x13c9309ced10000
[junit4:junit4]   2> 663 T17 oaz.ZooKeeper.<init> Initiating client connection, connectString=127.0.0.1:18121/solr sessionTimeout=10000 watcher=org.apache.solr.common.cloud.ConnectionManager@1591b57
[junit4:junit4]   2> 664 T17 oascc.ConnectionManager.waitForConnected Waiting for client to connect to ZooKeeper
[junit4:junit4]   2> 665 T25 oaz.ClientCnxn$SendThread.logStartConnect Opening socket connection to server localhost/127.0.0.1:18121. Will not attempt to authenticate using SASL (access denied ("javax.security.auth.AuthPermission" "getLoginConfiguration"))
[junit4:junit4]   2> 665 T25 oaz.ClientCnxn$SendThread.primeConnection Socket connection established to localhost/127.0.0.1:18121, initiating session
[junit4:junit4]   2> 666 T19 oazs.NIOServerCnxnFactory.run Accepted socket connection from /140.211.11.196:37746
[junit4:junit4]   2> 667 T19 oazs.ZooKeeperServer.processConnectRequest Client attempting to establish new session at /140.211.11.196:37746
[junit4:junit4]   2> 669 T21 oazs.ZooKeeperServer.finishSessionInit Established session 0x13c9309ced10001 with negotiated timeout 10000 for client /140.211.11.196:37746
[junit4:junit4]   2> 669 T25 oaz.ClientCnxn$SendThread.onConnected Session establishment complete on server localhost/127.0.0.1:18121, sessionid = 0x13c9309ced10001, negotiated timeout = 10000
[junit4:junit4]   2> 669 T26 oascc.ConnectionManager.process Watcher org.apache.solr.common.cloud.ConnectionManager@1591b57 name:ZooKeeperConnection Watcher:127.0.0.1:18121/solr got event WatchedEvent state:SyncConnected type:None path:null path:null type:None
[junit4:junit4]   2> 670 T17 oascc.ConnectionManager.waitForConnected Client is connected to ZooKeeper
[junit4:junit4]   2> 689 T17 oascc.SolrZkClient.makePath makePath: /collections/collection1
[junit4:junit4]   2> 696 T17 oascc.SolrZkClient.makePath makePath: /collections/collection1/shards
[junit4:junit4]   2> 701 T17 oascc.SolrZkClient.makePath makePath: /collections/control_collection
[junit4:junit4]   2> 705 T17 oascc.SolrZkClient.makePath makePath: /collections/control_collection/shards
[junit4:junit4]   2> 711 T17 oasc.AbstractZkTestCase.putConfig put /usr/home/hudson/hudson-slave/workspace/Lucene-Solr-Tests-4.x-java7/solr/build/solr-core/test-files/solr/collection1/conf/solrconfig.xml to /configs/conf1/solrconfig.xml
[junit4:junit4]   2> 746 T17 oascc.SolrZkClient.makePath makePath: /configs/conf1/solrconfig.xml
[junit4:junit4]   2> 761 T17 oasc.AbstractZkTestCase.putConfig put /usr/home/hudson/hudson-slave/workspace/Lucene-Solr-Tests-4.x-java7/solr/build/solr-core/test-files/solr/collection1/conf/schema.xml to /configs/conf1/schema.xml
[junit4:junit4]   2> 763 T17 oascc.SolrZkClient.makePath makePath: /configs/conf1/schema.xml
[junit4:junit4]   2> 870 T17 oasc.AbstractZkTestCase.putConfig put /usr/home/hudson/hudson-slave/workspace/Lucene-Solr-Tests-4.x-java7/solr/build/solr-core/test-files/solr/collection1/conf/stopwords.txt to /configs/conf1/stopwords.txt
[junit4:junit4]   2> 871 T17 oascc.SolrZkClient.makePath makePath: /configs/conf1/stopwords.txt
[junit4:junit4]   2> 877 T17 oasc.AbstractZkTestCase.putConfig put /usr/home/hudson/hudson-slave/workspace/Lucene-Solr-Tests-4.x-java7/solr/build/solr-core/test-files/solr/collection1/conf/protwords.txt to /configs/conf1/protwords.txt
[junit4:junit4]   2> 878 T17 oascc.SolrZkClient.makePath makePath: /configs/conf1/protwords.txt
[junit4:junit4]   2> 884 T17 oasc.AbstractZkTestCase.putConfig put /usr/home/hudson/hudson-slave/workspace/Lucene-Solr-Tests-4.x-java7/solr/build/solr-core/test-files/solr/collection1/conf/currency.xml to /configs/conf1/currency.xml
[junit4:junit4]   2> 885 T17 oascc.SolrZkClient.makePath makePath: /configs/conf1/currency.xml
[junit4:junit4]   2> 891 T17 oasc.AbstractZkTestCase.putConfig put /usr/home/hudson/hudson-slave/workspace/Lucene-Solr-Tests-4.x-java7/solr/build/solr-core/test-files/solr/collection1/conf/open-exchange-rates.json to /configs/conf1/open-exchange-rates.json
[junit4:junit4]   2> 892 T17 oascc.SolrZkClient.makePath makePath: /configs/conf1/open-exchange-rates.json
[junit4:junit4]   2> 897 T17 oasc.AbstractZkTestCase.putConfig put /usr/home/hudson/hudson-slave/workspace/Lucene-Solr-Tests-4.x-java7/solr/build/solr-core/test-files/solr/collection1/conf/mapping-ISOLatin1Accent.txt to /configs/conf1/mapping-ISOLatin1Accent.txt
[junit4:junit4]   2> 899 T17 oascc.SolrZkClient.makePath makePath: /configs/conf1/mapping-ISOLatin1Accent.txt
[junit4:junit4]   2> 905 T17 oasc.AbstractZkTestCase.putConfig put /usr/home/hudson/hudson-slave/workspace/Lucene-Solr-Tests-4.x-java7/solr/build/solr-core/test-files/solr/collection1/conf/old_synonyms.txt to /configs/conf1/old_synonyms.txt
[junit4:junit4]   2> 906 T17 oascc.SolrZkClient.makePath makePath: /configs/conf1/old_synonyms.txt
[junit4:junit4]   2> 911 T17 oasc.AbstractZkTestCase.putConfig put /usr/home/hudson/hudson-slave/workspace/Lucene-Solr-Tests-4.x-java7/solr/build/solr-core/test-files/solr/collection1/conf/synonyms.txt to /configs/conf1/synonyms.txt
[junit4:junit4]   2> 912 T17 oascc.SolrZkClient.makePath makePath: /configs/conf1/synonyms.txt
[junit4:junit4]   2> 918 T22 oazs.PrepRequestProcessor.pRequest2Txn Processed session termination for sessionid: 0x13c9309ced10001
[junit4:junit4]   2> 919 T26 oaz.ClientCnxn$EventThread.run EventThread shut down
[junit4:junit4]   2> 919 T19 oazs.NIOServerCnxn.closeSock Closed socket connection for client /140.211.11.196:37746 which had sessionid 0x13c9309ced10001
[junit4:junit4]   2> 919 T17 oaz.ZooKeeper.close Session: 0x13c9309ced10001 closed
[junit4:junit4]   2> 1734 T17 oejs.Server.doStart jetty-8.1.8.v20121106
[junit4:junit4]   2> 1968 T17 oejs.AbstractConnector.doStart Started SocketConnector@127.0.0.1:31192
[junit4:junit4]   2> 2005 T17 oass.SolrDispatchFilter.init SolrDispatchFilter.init()
[junit4:junit4]   2> 2006 T17 oasc.SolrResourceLoader.locateSolrHome JNDI not configured for solr (NoInitialContextEx)
[junit4:junit4]   2> 2007 T17 oasc.SolrResourceLoader.locateSolrHome using system property solr.solr.home: /usr/home/hudson/hudson-slave/workspace/Lucene-Solr-Tests-4.x-java7/solr/build/solr-core/test/J0/./org.apache.solr.cloud.SyncSliceTest-controljetty-1359676559713
[junit4:junit4]   2> 2007 T17 oasc.CoreContainer$Initializer.initialize looking for solr.xml: /usr/home/hudson/hudson-slave/workspace/Lucene-Solr-Tests-4.x-java7/solr/build/solr-core/test/J0/./org.apache.solr.cloud.SyncSliceTest-controljetty-1359676559713/solr.xml
[junit4:junit4]   2> 2008 T17 oasc.CoreContainer.<init> New CoreContainer 383357732
[junit4:junit4]   2> 2009 T17 oasc.CoreContainer.load Loading CoreContainer using Solr Home: '/usr/home/hudson/hudson-slave/workspace/Lucene-Solr-Tests-4.x-java7/solr/build/solr-core/test/J0/./org.apache.solr.cloud.SyncSliceTest-controljetty-1359676559713/'
[junit4:junit4]   2> 2009 T17 oasc.SolrResourceLoader.<init> new SolrResourceLoader for directory: '/usr/home/hudson/hudson-slave/workspace/Lucene-Solr-Tests-4.x-java7/solr/build/solr-core/test/J0/./org.apache.solr.cloud.SyncSliceTest-controljetty-1359676559713/'
[junit4:junit4]   2> 2064 T17 oashc.HttpShardHandlerFactory.getParameter Setting socketTimeout to: 60000
[junit4:junit4]   2> 2064 T17 oashc.HttpShardHandlerFactory.getParameter Setting urlScheme to: http://
[junit4:junit4]   2> 2065 T17 oashc.HttpShardHandlerFactory.getParameter Setting connTimeout to: 15000
[junit4:junit4]   2> 2065 T17 oashc.HttpShardHandlerFactory.getParameter Setting maxConnectionsPerHost to: 20
[junit4:junit4]   2> 2066 T17 oashc.HttpShardHandlerFactory.getParameter Setting corePoolSize to: 0
[junit4:junit4]   2> 2066 T17 oashc.HttpShardHandlerFactory.getParameter Setting maximumPoolSize to: 2147483647
[junit4:junit4]   2> 2067 T17 oashc.HttpShardHandlerFactory.getParameter Setting maxThreadIdleTime to: 5
[junit4:junit4]   2> 2067 T17 oashc.HttpShardHandlerFactory.getParameter Setting sizeOfQueue to: -1
[junit4:junit4]   2> 2068 T17 oashc.HttpShardHandlerFactory.getParameter Setting fairnessPolicy to: false
[junit4:junit4]   2> 2099 T17 oascsi.HttpClientUtil.createClient Creating new http client, config:maxConnectionsPerHost=20&maxConnections=10000&socketTimeout=60000&connTimeout=15000&retry=false
[junit4:junit4]   2> 2537 T17 oasc.CoreContainer.load Registering Log Listener
[junit4:junit4]   2> 2557 T17 oasc.CoreContainer.initZooKeeper Zookeeper client=127.0.0.1:18121/solr
[junit4:junit4]   2> 2580 T17 oasc.ZkController.checkChrootPath zkHost includes chroot
[junit4:junit4]   2> 2581 T17 oaz.ZooKeeper.<init> Initiating client connection, connectString=127.0.0.1:18121 sessionTimeout=60000 watcher=org.apache.solr.common.cloud.ConnectionManager@3418f857
[junit4:junit4]   2> 2582 T17 oascc.ConnectionManager.waitForConnected Waiting for client to connect to ZooKeeper
[junit4:junit4]   2> 2583 T37 oaz.ClientCnxn$SendThread.logStartConnect Opening socket connection to server localhost/127.0.0.1:18121. Will not attempt to authenticate using SASL (access denied ("javax.security.auth.AuthPermission" "getLoginConfiguration"))
[junit4:junit4]   2> 2584 T37 oaz.ClientCnxn$SendThread.primeConnection Socket connection established to localhost/127.0.0.1:18121, initiating session
[junit4:junit4]   2> 2585 T19 oazs.NIOServerCnxnFactory.run Accepted socket connection from /140.211.11.196:34661
[junit4:junit4]   2> 2586 T19 oazs.ZooKeeperServer.processConnectRequest Client attempting to establish new session at /140.211.11.196:34661
[junit4:junit4]   2> 2588 T21 oazs.ZooKeeperServer.finishSessionInit Established session 0x13c9309ced10002 with negotiated timeout 20000 for client /140.211.11.196:34661
[junit4:junit4]   2> 2588 T37 oaz.ClientCnxn$SendThread.onConnected Session establishment complete on server localhost/127.0.0.1:18121, sessionid = 0x13c9309ced10002, negotiated timeout = 20000
[junit4:junit4]   2> 2798 T38 oascc.ConnectionManager.process Watcher org.apache.solr.common.cloud.ConnectionManager@3418f857 name:ZooKeeperConnection Watcher:127.0.0.1:18121 got event WatchedEvent state:SyncConnected type:None path:null path:null type:None
[junit4:junit4]   2> 2798 T17 oascc.ConnectionManager.waitForConnected Client is connected to ZooKeeper
[junit4:junit4]   2> 2801 T22 oazs.PrepRequestProcessor.pRequest2Txn Processed session termination for sessionid: 0x13c9309ced10002
[junit4:junit4]   2> 2802 T38 oaz.ClientCnxn$EventThread.run EventThread shut down
[junit4:junit4]   2> 2802 T19 oazs.NIOServerCnxn.closeSock Closed socket connection for client /140.211.11.196:34661 which had sessionid 0x13c9309ced10002
[junit4:junit4]   2> 2802 T17 oaz.ZooKeeper.close Session: 0x13c9309ced10002 closed
[junit4:junit4]   2> 2807 T17 oascsi.HttpClientUtil.createClient Creating new http client, config:maxConnections=500&maxConnectionsPerHost=16&socketTimeout=60000&connTimeout=15000
[junit4:junit4]   2> 2820 T17 oaz.ZooKeeper.<init> Initiating client connection, connectString=127.0.0.1:18121/solr sessionTimeout=30000 watcher=org.apache.solr.common.cloud.ConnectionManager@48e53f2
[junit4:junit4]   2> 2821 T17 oascc.ConnectionManager.waitForConnected Waiting for client to connect to ZooKeeper
[junit4:junit4]   2> 2822 T39 oaz.ClientCnxn$SendThread.logStartConnect Opening socket connection to server localhost/127.0.0.1:18121. Will not attempt to authenticate using SASL (access denied ("javax.security.auth.AuthPermission" "getLoginConfiguration"))
[junit4:junit4]   2> 2823 T39 oaz.ClientCnxn$SendThread.primeConnection Socket connection established to localhost/127.0.0.1:18121, initiating session
[junit4:junit4]   2> 2823 T19 oazs.NIOServerCnxnFactory.run Accepted socket connection from /140.211.11.196:52509
[junit4:junit4]   2> 2824 T19 oazs.ZooKeeperServer.processConnectRequest Client attempting to establish new session at /140.211.11.196:52509
[junit4:junit4]   2> 2826 T21 oazs.ZooKeeperServer.finishSessionInit Established session 0x13c9309ced10003 with negotiated timeout 20000 for client /140.211.11.196:52509
[junit4:junit4]   2> 2826 T39 oaz.ClientCnxn$SendThread.onConnected Session establishment complete on server localhost/127.0.0.1:18121, sessionid = 0x13c9309ced10003, negotiated timeout = 20000
[junit4:junit4]   2> 2827 T40 oascc.ConnectionManager.process Watcher org.apache.solr.common.cloud.ConnectionManager@48e53f2 name:ZooKeeperConnection Watcher:127.0.0.1:18121/solr got event WatchedEvent state:SyncConnected type:None path:null path:null type:None
[junit4:junit4]   2> 2827 T17 oascc.ConnectionManager.waitForConnected Client is connected to ZooKeeper
[junit4:junit4]   2> 2844 T22 oazs.PrepRequestProcessor.pRequest Got user-level KeeperException when processing sessionid:0x13c9309ced10003 type:create cxid:0x2 zxid:0x1a txntype:-1 reqpath:n/a Error Path:/solr/overseer Error:KeeperErrorCode = NodeExists for /solr/overseer
[junit4:junit4]   2> 2854 T17 oascc.SolrZkClient.makePath makePath: /live_nodes
[junit4:junit4]   2> 2858 T17 oasc.ZkController.createEphemeralLiveNode Register node as live in ZooKeeper:/live_nodes/127.0.0.1:31192_
[junit4:junit4]   2> 2863 T22 oazs.PrepRequestProcessor.pRequest Got user-level KeeperException when processing sessionid:0x13c9309ced10003 type:delete cxid:0x7 zxid:0x1c txntype:-1 reqpath:n/a Error Path:/solr/live_nodes/127.0.0.1:31192_ Error:KeeperErrorCode = NoNode for /solr/live_nodes/127.0.0.1:31192_
[junit4:junit4]   2> 2864 T17 oascc.SolrZkClient.makePath makePath: /live_nodes/127.0.0.1:31192_
[junit4:junit4]   2> 2871 T17 oascc.SolrZkClient.makePath makePath: /overseer_elect/election
[junit4:junit4]   2> 2928 T22 oazs.PrepRequestProcessor.pRequest Got user-level KeeperException when processing sessionid:0x13c9309ced10003 type:delete cxid:0x15 zxid:0x21 txntype:-1 reqpath:n/a Error Path:/solr/overseer_elect/leader Error:KeeperErrorCode = NoNode for /solr/overseer_elect/leader
[junit4:junit4]   2> 2930 T17 oascc.SolrZkClient.makePath makePath: /overseer_elect/leader
[junit4:junit4]   2> 2937 T17 oasc.Overseer.start Overseer (id=89107762974359555-127.0.0.1:31192_-n_0000000000) starting
[junit4:junit4]   2> 2938 T22 oazs.PrepRequestProcessor.pRequest Got user-level KeeperException when processing sessionid:0x13c9309ced10003 type:create cxid:0x1a zxid:0x23 txntype:-1 reqpath:n/a Error Path:/solr/overseer Error:KeeperErrorCode = NodeExists for /solr/overseer
[junit4:junit4]   2> 2959 T22 oazs.PrepRequestProcessor.pRequest Got user-level KeeperException when processing sessionid:0x13c9309ced10003 type:create cxid:0x1b zxid:0x24 txntype:-1 reqpath:n/a Error Path:/solr/overseer Error:KeeperErrorCode = NodeExists for /solr/overseer
[junit4:junit4]   2> 2961 T22 oazs.PrepRequestProcessor.pRequest Got user-level KeeperException when processing sessionid:0x13c9309ced10003 type:create cxid:0x1c zxid:0x25 txntype:-1 reqpath:n/a Error Path:/solr/overseer Error:KeeperErrorCode = NodeExists for /solr/overseer
[junit4:junit4]   2> 2971 T22 oazs.PrepRequestProcessor.pRequest Got user-level KeeperException when processing sessionid:0x13c9309ced10003 type:create cxid:0x1d zxid:0x26 txntype:-1 reqpath:n/a Error Path:/solr/overseer Error:KeeperErrorCode = NodeExists for /solr/overseer
[junit4:junit4]   2> 2973 T42 oasc.OverseerCollectionProcessor.run Process current queue of collection creations
[junit4:junit4]   2> 2974 T17 oascc.SolrZkClient.makePath makePath: /clusterstate.json
[junit4:junit4]   2> 2979 T17 oascc.ZkStateReader.createClusterStateWatchersAndUpdate Updating cluster state from ZooKeeper... 
[junit4:junit4]   2> 2998 T41 oasc.Overseer$ClusterStateUpdater.run Starting to work on the main queue
[junit4:junit4]   2> 3044 T43 oasc.CoreContainer.create Creating SolrCore 'collection1' using instanceDir: /usr/home/hudson/hudson-slave/workspace/Lucene-Solr-Tests-4.x-java7/solr/build/solr-core/test/J0/./org.apache.solr.cloud.SyncSliceTest-controljetty-1359676559713/collection1
[junit4:junit4]   2> 3045 T43 oasc.ZkController.createCollectionZkNode Check for collection zkNode:control_collection
[junit4:junit4]   2> 3046 T43 oasc.ZkController.createCollectionZkNode Collection zkNode exists
[junit4:junit4]   2> 3047 T43 oasc.ZkController.readConfigName Load collection config from:/collections/control_collection
[junit4:junit4]   2> 3050 T43 oasc.SolrResourceLoader.<init> new SolrResourceLoader for directory: '/usr/home/hudson/hudson-slave/workspace/Lucene-Solr-Tests-4.x-java7/solr/build/solr-core/test/J0/./org.apache.solr.cloud.SyncSliceTest-controljetty-1359676559713/collection1/'
[junit4:junit4]   2> 3052 T43 oasc.SolrResourceLoader.replaceClassLoader Adding 'file:/usr/home/hudson/hudson-slave/workspace/Lucene-Solr-Tests-4.x-java7/solr/build/solr-core/test/J0/org.apache.solr.cloud.SyncSliceTest-controljetty-1359676559713/collection1/lib/README' to classloader
[junit4:junit4]   2> 3054 T43 oasc.SolrResourceLoader.replaceClassLoader Adding 'file:/usr/home/hudson/hudson-slave/workspace/Lucene-Solr-Tests-4.x-java7/solr/build/solr-core/test/J0/org.apache.solr.cloud.SyncSliceTest-controljetty-1359676559713/collection1/lib/classes/' to classloader
[junit4:junit4]   2> 3314 T43 oasc.SolrConfig.<init> Using Lucene MatchVersion: LUCENE_42
[junit4:junit4]   2> 3425 T43 oasc.SolrConfig.<init> Loaded SolrConfig: solrconfig.xml
[junit4:junit4]   2> 3527 T43 oass.IndexSchema.readSchema Reading Solr Schema
[junit4:junit4]   2> 3585 T43 oass.IndexSchema.readSchema Schema name=test
[junit4:junit4]   2> 4268 T43 oass.OpenExchangeRatesOrgProvider.init Initialized with rates=open-exchange-rates.json, refreshInterval=1440.
[junit4:junit4]   2> 4282 T43 oass.IndexSchema.readSchema default search field in schema is text
[junit4:junit4]   2> 4285 T43 oass.IndexSchema.readSchema unique key field: id
[junit4:junit4]   2> 4315 T43 oass.FileExchangeRateProvider.reload Reloading exchange rates from file currency.xml
[junit4:junit4]   2> 4321 T43 oass.FileExchangeRateProvider.reload Reloading exchange rates from file currency.xml
[junit4:junit4]   2> 4326 T43 oass.OpenExchangeRatesOrgProvider.reload Reloading exchange rates from open-exchange-rates.json
[junit4:junit4]   2> 4330 T43 oass.OpenExchangeRatesOrgProvider.reload Reloading exchange rates from open-exchange-rates.json
[junit4:junit4]   2> 4334 T43 oasc.SolrCore.<init> [collection1] Opening new SolrCore at /usr/home/hudson/hudson-slave/workspace/Lucene-Solr-Tests-4.x-java7/solr/build/solr-core/test/J0/./org.apache.solr.cloud.SyncSliceTest-controljetty-1359676559713/collection1/, dataDir=./org.apache.solr.cloud.SyncSliceTest-1359676558800/control/data/
[junit4:junit4]   2> 4338 T43 oasc.JmxMonitoredMap.<init> JMX monitoring is enabled. Adding Solr mbeans to JMX Server: com.sun.jmx.mbeanserver.JmxMBeanServer@6478c466
[junit4:junit4]   2> 4339 T43 oasc.SolrCore.initDirectoryFactory solr.NRTCachingDirectoryFactory
[junit4:junit4]   2> 4368 T43 oasc.CachingDirectoryFactory.get return new directory for /usr/home/hudson/hudson-slave/workspace/Lucene-Solr-Tests-4.x-java7/solr/build/solr-core/test/J0/./org.apache.solr.cloud.SyncSliceTest-1359676558800/control/data forceNew:false
[junit4:junit4]   2> 4369 T43 oasc.CachingDirectoryFactory.close Releasing directory:/usr/home/hudson/hudson-slave/workspace/Lucene-Solr-Tests-4.x-java7/solr/build/solr-core/test/J0/./org.apache.solr.cloud.SyncSliceTest-1359676558800/control/data
[junit4:junit4]   2> 4369 T43 oasc.SolrCore.getNewIndexDir New index directory detected: old=null new=./org.apache.solr.cloud.SyncSliceTest-1359676558800/control/data/index/
[junit4:junit4]   2> 4370 T43 oasc.SolrCore.initIndex WARNING [collection1] Solr index directory './org.apache.solr.cloud.SyncSliceTest-1359676558800/control/data/index' doesn't exist. Creating new index...
[junit4:junit4]   2> 4371 T43 oasc.CachingDirectoryFactory.get return new directory for /usr/home/hudson/hudson-slave/workspace/Lucene-Solr-Tests-4.x-java7/solr/build/solr-core/test/J0/./org.apache.solr.cloud.SyncSliceTest-1359676558800/control/data/index forceNew:false
[junit4:junit4]   2> 4412 T43 oasc.SolrDeletionPolicy.onCommit SolrDeletionPolicy.onCommit: commits:num=1
[junit4:junit4]   2> 		commit{dir=RateLimitedDirectoryWrapper(NRTCachingDirectory(org.apache.lucene.store.NIOFSDirectory@/usr/home/hudson/hudson-slave/workspace/Lucene-Solr-Tests-4.x-java7/solr/build/solr-core/test/J0/org.apache.solr.cloud.SyncSliceTest-1359676558800/control/data/index lockFactory=org.apache.lucene.store.NativeFSLockFactory@161a8d36; maxCacheMB=48.0 maxMergeSizeMB=4.0)),segFN=segments_1,generation=1,filenames=[segments_1]
[junit4:junit4]   2> 4413 T43 oasc.SolrDeletionPolicy.updateCommits newest commit = 1[segments_1]
[junit4:junit4]   2> 4414 T43 oasc.CachingDirectoryFactory.close Releasing directory:/usr/home/hudson/hudson-slave/workspace/Lucene-Solr-Tests-4.x-java7/solr/build/solr-core/test/J0/./org.apache.solr.cloud.SyncSliceTest-1359676558800/control/data/index
[junit4:junit4]   2> 4414 T43 oasc.SolrCore.initWriters created xml: solr.XMLResponseWriter
[junit4:junit4]   2> 4417 T43 oasup.UpdateRequestProcessorChain.init inserting DistributedUpdateProcessorFactory into updateRequestProcessorChain "dedupe"
[junit4:junit4]   2> 4417 T43 oasup.UpdateRequestProcessorChain.init inserting DistributedUpdateProcessorFactory into updateRequestProcessorChain "dedupe-allfields"
[junit4:junit4]   2> 4418 T43 oasup.UpdateRequestProcessorChain.init inserting DistributedUpdateProcessorFactory into updateRequestProcessorChain "stored_sig"
[junit4:junit4]   2> 4418 T43 oasup.UpdateRequestProcessorChain.init inserting DistributedUpdateProcessorFactory into updateRequestProcessorChain "uniq-fields"
[junit4:junit4]   2> 4419 T43 oasup.UpdateRequestProcessorChain.init inserting DistributedUpdateProcessorFactory into updateRequestProcessorChain "distrib-dup-test-chain-implicit"
[junit4:junit4]   2> 4420 T43 oasc.RequestHandlers.initHandlersFromConfig adding lazy requestHandler: solr.ReplicationHandler
[junit4:junit4]   2> 4420 T43 oasc.RequestHandlers.initHandlersFromConfig created /replication: solr.ReplicationHandler
[junit4:junit4]   2> 4421 T43 oasc.RequestHandlers.initHandlersFromConfig created standard: solr.StandardRequestHandler
[junit4:junit4]   2> 4422 T43 oasc.RequestHandlers.initHandlersFromConfig created /get: solr.RealTimeGetHandler
[junit4:junit4]   2> 4423 T43 oasc.RequestHandlers.initHandlersFromConfig created dismax: solr.SearchHandler
[junit4:junit4]   2> 4423 T43 oasc.RequestHandlers.initHandlersFromConfig created mock: org.apache.solr.core.MockQuerySenderListenerReqHandler
[junit4:junit4]   2> 4424 T43 oasc.RequestHandlers.initHandlersFromConfig created /admin/: org.apache.solr.handler.admin.AdminHandlers
[junit4:junit4]   2> 4425 T43 oasc.RequestHandlers.initHandlersFromConfig created defaults: solr.StandardRequestHandler
[junit4:junit4]   2> 4425 T43 oasc.RequestHandlers.initHandlersFromConfig adding lazy requestHandler: solr.StandardRequestHandler
[junit4:junit4]   2> 4426 T43 oasc.RequestHandlers.initHandlersFromConfig created lazy: solr.StandardRequestHandler
[junit4:junit4]   2> 4426 T43 oasc.RequestHandlers.initHandlersFromConfig created /update: solr.UpdateRequestHandler
[junit4:junit4]   2> 4427 T43 oasc.RequestHandlers.initHandlersFromConfig created /terms: org.apache.solr.handler.component.SearchHandler
[junit4:junit4]   2> 4428 T43 oasc.RequestHandlers.initHandlersFromConfig created spellCheckCompRH: org.apache.solr.handler.component.SearchHandler
[junit4:junit4]   2> 4429 T43 oasc.RequestHandlers.initHandlersFromConfig created spellCheckCompRH_Direct: org.apache.solr.handler.component.SearchHandler
[junit4:junit4]   2> 4429 T43 oasc.RequestHandlers.initHandlersFromConfig created spellCheckWithWordbreak: org.apache.solr.handler.component.SearchHandler
[junit4:junit4]   2> 4430 T43 oasc.RequestHandlers.initHandlersFromConfig created spellCheckWithWordbreak_Direct: org.apache.solr.handler.component.SearchHandler
[junit4:junit4]   2> 4431 T43 oasc.RequestHandlers.initHandlersFromConfig created spellCheckCompRH1: org.apache.solr.handler.component.SearchHandler
[junit4:junit4]   2> 4432 T43 oasc.RequestHandlers.initHandlersFromConfig created mltrh: org.apache.solr.handler.component.SearchHandler
[junit4:junit4]   2> 4433 T43 oasc.RequestHandlers.initHandlersFromConfig created tvrh: org.apache.solr.handler.component.SearchHandler
[junit4:junit4]   2> 4433 T43 oasc.RequestHandlers.initHandlersFromConfig created /mlt: solr.MoreLikeThisHandler
[junit4:junit4]   2> 4434 T43 oasc.RequestHandlers.initHandlersFromConfig created /debug/dump: solr.DumpRequestHandler
[junit4:junit4]   2> 4445 T43 oashl.XMLLoader.init xsltCacheLifetimeSeconds=60
[junit4:junit4]   2> 4449 T43 oasc.SolrCore.initDeprecatedSupport WARNING solrconfig.xml uses deprecated <admin/gettableFiles>, Please update your config to use the ShowFileRequestHandler.
[junit4:junit4]   2> 4450 T43 oasc.SolrCore.initDeprecatedSupport WARNING adding ShowFileRequestHandler with hidden files: [SCHEMA.XML, OLD_SYNONYMS.TXT, STOPWORDS.TXT, PROTWORDS.TXT, OPEN-EXCHANGE-RATES.JSON, SYNONYMS.TXT, CURRENCY.XML, MAPPING-ISOLATIN1ACCENT.TXT]
[junit4:junit4]   2> 4453 T43 oasc.CachingDirectoryFactory.close Releasing directory:/usr/home/hudson/hudson-slave/workspace/Lucene-Solr-Tests-4.x-java7/solr/build/solr-core/test/J0/./org.apache.solr.cloud.SyncSliceTest-1359676558800/control/data
[junit4:junit4]   2> 4455 T43 oass.SolrIndexSearcher.<init> Opening Searcher@2e7170a7 main
[junit4:junit4]   2> 4475 T43 oasu.CommitTracker.<init> Hard AutoCommit: disabled
[junit4:junit4]   2> 4475 T43 oasu.CommitTracker.<init> Soft AutoCommit: disabled
[junit4:junit4]   2> 4476 T43 oashc.SpellCheckComponent.inform Initializing spell checkers
[junit4:junit4]   2> 4494 T43 oass.DirectSolrSpellChecker.init init: {name=direct,classname=DirectSolrSpellChecker,field=lowerfilt,minQueryLength=3}
[junit4:junit4]   2> 4559 T44 oasc.SolrCore.registerSearcher [collection1] Registered new searcher Searcher@2e7170a7 main{StandardDirectoryReader(segments_1:1)}
[junit4:junit4]   2> 4577 T43 oasc.ZkController.publish publishing core=collection1 state=down
[junit4:junit4]   2> 4577 T43 oasc.ZkController.publish numShards not found on descriptor - reading it from system property
[junit4:junit4]   2> 4579 T22 oazs.PrepRequestProcessor.pRequest Got user-level KeeperException when processing sessionid:0x13c9309ced10003 type:create cxid:0x53 zxid:0x29 txntype:-1 reqpath:n/a Error Path:/solr/overseer/queue Error:KeeperErrorCode = NoNode for /solr/overseer/queue
[junit4:junit4]   2> 6013 T41 oascc.ZkStateReader.updateClusterState Updating cloud state from ZooKeeper... 
[junit4:junit4]   2> 6015 T41 oasc.Overseer$ClusterStateUpdater.updateState Update state numShards=1 message={
[junit4:junit4]   2> 	  "operation":"state",
[junit4:junit4]   2> 	  "numShards":"1",
[junit4:junit4]   2> 	  "shard":null,
[junit4:junit4]   2> 	  "roles":null,
[junit4:junit4]   2> 	  "state":"down",
[junit4:junit4]   2> 	  "core":"collection1",
[junit4:junit4]   2> 	  "collection":"control_collection",
[junit4:junit4]   2> 	  "node_name":"127.0.0.1:31192_",
[junit4:junit4]   2> 	  "base_url":"http://127.0.0.1:31192"}
[junit4:junit4]   2> 6015 T41 oasc.Overseer$ClusterStateUpdater.createCollection Create collection control_collection with numShards 1
[junit4:junit4]   2> 6056 T41 oasc.Overseer$ClusterStateUpdater.updateState Assigning new node to shard shard=shard1
[junit4:junit4]   2> 6057 T22 oazs.PrepRequestProcessor.pRequest Got user-level KeeperException when processing sessionid:0x13c9309ced10003 type:create cxid:0x5b zxid:0x2c txntype:-1 reqpath:n/a Error Path:/solr/overseer/queue-work Error:KeeperErrorCode = NoNode for /solr/overseer/queue-work
[junit4:junit4]   2> 6097 T40 oascc.ZkStateReader$2.process A cluster state change: WatchedEvent state:SyncConnected type:NodeDataChanged path:/clusterstate.json, has occurred - updating... (live nodes size: 1)
[junit4:junit4]   2> 6591 T43 oasc.CoreContainer.registerCore registering core: collection1
[junit4:junit4]   2> 6591 T43 oasc.ZkController.register Register replica - core:collection1 address:http://127.0.0.1:31192 collection:control_collection shard:shard1
[junit4:junit4]   2> 6606 T43 oascsi.HttpClientUtil.createClient Creating new http client, config:maxConnections=10000&maxConnectionsPerHost=20&connTimeout=30000&socketTimeout=30000&retry=false
[junit4:junit4]   2> 6624 T43 oascc.SolrZkClient.makePath makePath: /collections/control_collection/leader_elect/shard1/election
[junit4:junit4]   2> 6648 T22 oazs.PrepRequestProcessor.pRequest Got user-level KeeperException when processing sessionid:0x13c9309ced10003 type:delete cxid:0x75 zxid:0x36 txntype:-1 reqpath:n/a Error Path:/solr/collections/control_collection/leaders Error:KeeperErrorCode = NoNode for /solr/collections/control_collection/leaders
[junit4:junit4]   2> 6650 T43 oasc.ShardLeaderElectionContext.runLeaderProcess Running the leader process.
[junit4:junit4]   2> 6650 T22 oazs.PrepRequestProcessor.pRequest Got user-level KeeperException when processing sessionid:0x13c9309ced10003 type:create cxid:0x76 zxid:0x37 txntype:-1 reqpath:n/a Error Path:/solr/overseer Error:KeeperErrorCode = NodeExists for /solr/overseer
[junit4:junit4]   2> 6661 T43 oasc.ShardLeaderElectionContext.waitForReplicasToComeUp Enough replicas found to continue.
[junit4:junit4]   2> 6662 T43 oasc.ShardLeaderElectionContext.runLeaderProcess I may be the new leader - try and sync
[junit4:junit4]   2> 6667 T43 oasc.SyncStrategy.sync Sync replicas to http://127.0.0.1:31192/collection1/
[junit4:junit4]   2> 6668 T43 oasc.SyncStrategy.syncReplicas Sync Success - now sync replicas to me
[junit4:junit4]   2> 6668 T43 oasc.SyncStrategy.syncToMe http://127.0.0.1:31192/collection1/ has no replicas
[junit4:junit4]   2> 6668 T43 oasc.ShardLeaderElectionContext.runLeaderProcess I am the new leader: http://127.0.0.1:31192/collection1/
[junit4:junit4]   2> 6669 T43 oascc.SolrZkClient.makePath makePath: /collections/control_collection/leaders/shard1
[junit4:junit4]   2> 6675 T22 oazs.PrepRequestProcessor.pRequest Got user-level KeeperException when processing sessionid:0x13c9309ced10003 type:create cxid:0x80 zxid:0x3b txntype:-1 reqpath:n/a Error Path:/solr/overseer Error:KeeperErrorCode = NodeExists for /solr/overseer
[junit4:junit4]   2> 7605 T41 oascc.ZkStateReader.updateClusterState Updating cloud state from ZooKeeper... 
[junit4:junit4]   2> 7628 T40 oascc.ZkStateReader$2.process A cluster state change: WatchedEvent state:SyncConnected type:NodeDataChanged path:/clusterstate.json, has occurred - updating... (live nodes size: 1)
[junit4:junit4]   2> 7654 T43 oasc.ZkController.register We are http://127.0.0.1:31192/collection1/ and leader is http://127.0.0.1:31192/collection1/
[junit4:junit4]   2> 7659 T43 oasc.ZkController.register No LogReplay needed for core=collection1 baseURL=http://127.0.0.1:31192
[junit4:junit4]   2> 7659 T43 oasc.ZkController.checkRecovery I am the leader, no recovery necessary
[junit4:junit4]   2> 7660 T43 oasc.ZkController.publish publishing core=collection1 state=active
[junit4:junit4]   2> 7660 T43 oasc.ZkController.publish numShards not found on descriptor - reading it from system property
[junit4:junit4]   2> 7663 T43 oascc.ZkStateReader.updateClusterState Updating cloud state from ZooKeeper... 
[junit4:junit4]   2> 7665 T17 oass.SolrDispatchFilter.init user.dir=/usr/home/hudson/hudson-slave/workspace/Lucene-Solr-Tests-4.x-java7/solr/build/solr-core/test/J0
[junit4:junit4]   2> 7666 T17 oass.SolrDispatchFilter.init SolrDispatchFilter.init() done
[junit4:junit4]   2> 7746 T17 oascsi.HttpClientUtil.createClient Creating new http client, config:maxConnections=128&maxConnectionsPerHost=32&followRedirects=false
[junit4:junit4]   2> 7774 T17 oascsi.HttpClientUtil.createClient Creating new http client, config:
[junit4:junit4]   2> 7794 T17 oaz.ZooKeeper.<init> Initiating client connection, connectString=127.0.0.1:18121/solr sessionTimeout=10000 watcher=org.apache.solr.common.cloud.ConnectionManager@32a9805a
[junit4:junit4]   2> 7796 T17 oascc.ConnectionManager.waitForConnected Waiting for client to connect to ZooKeeper
[junit4:junit4]   2> 7796 T45 oaz.ClientCnxn$SendThread.logStartConnect Opening socket connection to server localhost/127.0.0.1:18121. Will not attempt to authenticate using SASL (access denied ("javax.security.auth.AuthPermission" "getLoginConfiguration"))
[junit4:junit4]   2> 7797 T45 oaz.ClientCnxn$SendThread.primeConnection Socket connection established to localhost/127.0.0.1:18121, initiating session
[junit4:junit4]   2> 7797 T19 oazs.NIOServerCnxnFactory.run Accepted socket connection from /140.211.11.196:30275
[junit4:junit4]   2> 7798 T19 oazs.ZooKeeperServer.processConnectRequest Client attempting to establish new session at /140.211.11.196:30275
[junit4:junit4]   2> 7799 T21 oazs.ZooKeeperServer.finishSessionInit Established session 0x13c9309ced10004 with negotiated timeout 10000 for client /140.211.11.196:30275
[junit4:junit4]   2> 7799 T45 oaz.ClientCnxn$SendThread.onConnected Session establishment complete on server localhost/127.0.0.1:18121, sessionid = 0x13c9309ced10004, negotiated timeout = 10000
[junit4:junit4]   2> 7800 T46 oascc.ConnectionManager.process Watcher org.apache.solr.common.cloud.ConnectionManager@32a9805a name:ZooKeeperConnection Watcher:127.0.0.1:18121/solr got event WatchedEvent state:SyncConnected type:None path:null path:null type:None
[junit4:junit4]   2> 7801 T17 oascc.ConnectionManager.waitForConnected Client is connected to ZooKeeper
[junit4:junit4]   2> 7802 T17 oascc.ZkStateReader.createClusterStateWatchersAndUpdate Updating cluster state from ZooKeeper... 
[junit4:junit4]   2> 7808 T17 oasc.ChaosMonkey.monkeyLog monkey: init - expire sessions:true cause connection loss:true
[junit4:junit4]   2> 7996 T17 oejs.Server.doStart jetty-8.1.8.v20121106
[junit4:junit4]   2> 8000 T17 oejs.AbstractConnector.doStart Started SocketConnector@127.0.0.1:22765
[junit4:junit4]   2> 8001 T17 oass.SolrDispatchFilter.init SolrDispatchFilter.init()
[junit4:junit4]   2> 8002 T17 oasc.SolrResourceLoader.locateSolrHome JNDI not configured for solr (NoInitialContextEx)
[junit4:junit4]   2> 8002 T17 oasc.SolrResourceLoader.locateSolrHome using system property solr.solr.home: /usr/home/hudson/hudson-slave/workspace/Lucene-Solr-Tests-4.x-java7/solr/build/solr-core/test/J0/./org.apache.solr.cloud.SyncSliceTest-jetty1-1359676566600
[junit4:junit4]   2> 8003 T17 oasc.CoreContainer$Initializer.initialize looking for solr.xml: /usr/home/hudson/hudson-slave/workspace/Lucene-Solr-Tests-4.x-java7/solr/build/solr-core/test/J0/./org.apache.solr.cloud.SyncSliceTest-jetty1-1359676566600/solr.xml
[junit4:junit4]   2> 8004 T17 oasc.CoreContainer.<init> New CoreContainer 1054305253
[junit4:junit4]   2> 8005 T17 oasc.CoreContainer.load Loading CoreContainer using Solr Home: '/usr/home/hudson/hudson-slave/workspace/Lucene-Solr-Tests-4.x-java7/solr/build/solr-core/test/J0/./org.apache.solr.cloud.SyncSliceTest-jetty1-1359676566600/'
[junit4:junit4]   2> 8005 T17 oasc.SolrResourceLoader.<init> new SolrResourceLoader for directory: '/usr/home/hudson/hudson-slave/workspace/Lucene-Solr-Tests-4.x-java7/solr/build/solr-core/test/J0/./org.apache.solr.cloud.SyncSliceTest-jetty1-1359676566600/'
[junit4:junit4]   2> 8084 T17 oashc.HttpShardHandlerFactory.getParameter Setting socketTimeout to: 60000
[junit4:junit4]   2> 8085 T17 oashc.HttpShardHandlerFactory.getParameter Setting urlScheme to: http://
[junit4:junit4]   2> 8086 T17 oashc.HttpShardHandlerFactory.getParameter Setting connTimeout to: 15000
[junit4:junit4]   2> 8087 T17 oashc.HttpShardHandlerFactory.getParameter Setting maxConnectionsPerHost to: 20
[junit4:junit4]   2> 8088 T17 oashc.HttpShardHandlerFactory.getParameter Setting corePoolSize to: 0
[junit4:junit4]   2> 8089 T17 oashc.HttpShardHandlerFactory.getParameter Setting maximumPoolSize to: 2147483647
[junit4:junit4]   2> 8089 T17 oashc.HttpShardHandlerFactory.getParameter Setting maxThreadIdleTime to: 5
[junit4:junit4]   2> 8090 T17 oashc.HttpShardHandlerFactory.getParameter Setting sizeOfQueue to: -1
[junit4:junit4]   2> 8091 T17 oashc.HttpShardHandlerFactory.getParameter Setting fairnessPolicy to: false
[junit4:junit4]   2> 8091 T17 oascsi.HttpClientUtil.createClient Creating new http client, config:maxConnectionsPerHost=20&maxConnections=10000&socketTimeout=60000&connTimeout=15000&retry=false
[junit4:junit4]   2> 8118 T17 oasc.CoreContainer.load Registering Log Listener
[junit4:junit4]   2> 8144 T17 oasc.CoreContainer.initZooKeeper Zookeeper client=127.0.0.1:18121/solr
[junit4:junit4]   2> 8145 T17 oasc.ZkController.checkChrootPath zkHost includes chroot
[junit4:junit4]   2> 8145 T17 oaz.ZooKeeper.<init> Initiating client connection, connectString=127.0.0.1:18121 sessionTimeout=60000 watcher=org.apache.solr.common.cloud.ConnectionManager@561d3e05
[junit4:junit4]   2> 8147 T17 oascc.ConnectionManager.waitForConnected Waiting for client to connect to ZooKeeper
[junit4:junit4]   2> 8147 T56 oaz.ClientCnxn$SendThread.logStartConnect Opening socket connection to server localhost/127.0.0.1:18121. Will not attempt to authenticate using SASL (access denied ("javax.security.auth.AuthPermission" "getLoginConfiguration"))
[junit4:junit4]   2> 8148 T56 oaz.ClientCnxn$SendThread.primeConnection Socket connection established to localhost/127.0.0.1:18121, initiating session
[junit4:junit4]   2> 8149 T19 oazs.NIOServerCnxnFactory.run Accepted socket connection from /140.211.11.196:47595
[junit4:junit4]   2> 8150 T19 oazs.ZooKeeperServer.processConnectRequest Client attempting to establish new session at /140.211.11.196:47595
[junit4:junit4]   2> 8152 T21 oazs.ZooKeeperServer.finishSessionInit Established session 0x13c9309ced10005 with negotiated timeout 20000 for client /140.211.11.196:47595
[junit4:junit4]   2> 8152 T56 oaz.ClientCnxn$SendThread.onConnected Session establishment complete on server localhost/127.0.0.1:18121, sessionid = 0x13c9309ced10005, negotiated timeout = 20000
[junit4:junit4]   2> 8153 T57 oascc.ConnectionManager.process Watcher org.apache.solr.common.cloud.ConnectionManager@561d3e05 name:ZooKeeperConnection Watcher:127.0.0.1:18121 got event WatchedEvent state:SyncConnected type:None path:null path:null type:None
[junit4:junit4]   2> 8153 T17 oascc.ConnectionManager.waitForConnected Client is connected to ZooKeeper
[junit4:junit4]   2> 8155 T22 oazs.PrepRequestProcessor.pRequest2Txn Processed session termination for sessionid: 0x13c9309ced10005
[junit4:junit4]   2> 8168 T57 oaz.ClientCnxn$EventThread.run EventThread shut down
[junit4:junit4]   2> 8168 T17 oaz.ZooKeeper.close Session: 0x13c9309ced10005 closed
[junit4:junit4]   2> 8168 T19 oazs.NIOServerCnxn.closeSock Closed socket connection for client /140.211.11.196:47595 which had sessionid 0x13c9309ced10005
[junit4:junit4]   2> 8169 T17 oascsi.HttpClientUtil.createClient Creating new http client, config:maxConnections=500&maxConnectionsPerHost=16&socketTimeout=60000&connTimeout=15000
[junit4:junit4]   2> 8179 T17 oaz.ZooKeeper.<init> Initiating client connection, connectString=127.0.0.1:18121/solr sessionTimeout=30000 watcher=org.apache.solr.common.cloud.ConnectionManager@4af52df4
[junit4:junit4]   2> 8180 T17 oascc.ConnectionManager.waitForConnected Waiting for client to connect to ZooKeeper
[junit4:junit4]   2> 8180 T58 oaz.ClientCnxn$SendThread.logStartConnect Opening socket connection to server localhost/127.0.0.1:18121. Will not attempt to authenticate using SASL (access denied ("javax.security.auth.AuthPermission" "getLoginConfiguration"))
[junit4:junit4]   2> 8180 T58 oaz.ClientCnxn$SendThread.primeConnection Socket connection established to localhost/127.0.0.1:18121, initiating session
[junit4:junit4]   2> 8181 T19 oazs.NIOServerCnxnFactory.run Accepted socket connection from /140.211.11.196:42017
[junit4:junit4]   2> 8182 T19 oazs.ZooKeeperServer.processConnectRequest Client attempting to establish new session at /140.211.11.196:42017
[junit4:junit4]   2> 8183 T21 oazs.ZooKeeperServer.finishSessionInit Established session 0x13c9309ced10006 with negotiated timeout 20000 for client /140.211.11.196:42017
[junit4:junit4]   2> 8184 T58 oaz.ClientCnxn$SendThread.onConnected Session establishment complete on server localhost/127.0.0.1:18121, sessionid = 0x13c9309ced10006, negotiated timeout = 20000
[junit4:junit4]   2> 8184 T59 oascc.ConnectionManager.process Watcher org.apache.solr.common.cloud.ConnectionManager@4af52df4 name:ZooKeeperConnection Watcher:127.0.0.1:18121/solr got event WatchedEvent state:SyncConnected type:None path:null path:null type:None
[junit4:junit4]   2> 8185 T17 oascc.ConnectionManager.waitForConnected Client is connected to ZooKeeper
[junit4:junit4]   2> 8186 T22 oazs.PrepRequestProcessor.pRequest Got user-level KeeperException when processing sessionid:0x13c9309ced10006 type:create cxid:0x1 zxid:0x49 txntype:-1 reqpath:n/a Error Path:/solr/overseer Error:KeeperErrorCode = NodeExists for /solr/overseer
[junit4:junit4]   2> 8188 T22 oazs.PrepRequestProcessor.pRequest Got user-level KeeperException when processing sessionid:0x13c9309ced10006 type:create cxid:0x2 zxid:0x4a txntype:-1 reqpath:n/a Error Path:/solr/overseer Error:KeeperErrorCode = NodeExists for /solr/overseer
[junit4:junit4]   2> 8190 T17 oasc.ZkController.createEphemeralLiveNode Register node as live in ZooKeeper:/live_nodes/127.0.0.1:22765_
[junit4:junit4]   2> 8191 T22 oazs.PrepRequestProcessor.pRequest Got user-level KeeperException when processing sessionid:0x13c9309ced10006 type:delete cxid:0x4 zxid:0x4b txntype:-1 reqpath:n/a Error Path:/solr/live_nodes/127.0.0.1:22765_ Error:KeeperErrorCode = NoNode for /solr/live_nodes/127.0.0.1:22765_
[junit4:junit4]   2> 8192 T17 oascc.SolrZkClient.makePath makePath: /live_nodes/127.0.0.1:22765_
[junit4:junit4]   2> 8197 T46 oascc.ZkStateReader$3.process Updating live nodes... (2)
[junit4:junit4]   2> 8197 T40 oascc.ZkStateReader$3.process Updating live nodes... (2)
[junit4:junit4]   2> 8197 T40 oascc.ZkStateReader$2.process A cluster state change: WatchedEvent state:SyncConnected type:NodeChildrenChanged path:/live_nodes, has occurred - updating... (live nodes size: 2)
[junit4:junit4]   2> 8206 T17 oascc.ZkStateReader.createClusterStateWatchersAndUpdate Updating cluster state from ZooKeeper... 
[junit4:junit4]   2> 8216 T60 oasc.CoreContainer.create Creating SolrCore 'collection1' using instanceDir: /usr/home/hudson/hudson-slave/workspace/Lucene-Solr-Tests-4.x-java7/solr/build/solr-core/test/J0/./org.apache.solr.cloud.SyncSliceTest-jetty1-1359676566600/collection1
[junit4:junit4]   2> 8216 T60 oasc.ZkController.createCollectionZkNode Check for collection zkNode:collection1
[junit4:junit4]   2> 8217 T60 oasc.ZkController.createCollectionZkNode Collection zkNode exists
[junit4:junit4]   2> 8218 T60 oasc.ZkController.readConfigName Load collection config from:/collections/collection1
[junit4:junit4]   2> 8219 T60 oasc.SolrResourceLoader.<init> new SolrResourceLoader for directory: '/usr/home/hudson/hudson-slave/workspace/Lucene-Solr-Tests-4.x-java7/solr/build/solr-core/test/J0/./org.apache.solr.cloud.SyncSliceTest-jetty1-1359676566600/collection1/'
[junit4:junit4]   2> 8221 T60 oasc.SolrResourceLoader.replaceClassLoader Adding 'file:/usr/home/hudson/hudson-slave/workspace/Lucene-Solr-Tests-4.x-java7/solr/build/solr-core/test/J0/org.apache.solr.cloud.SyncSliceTest-jetty1-1359676566600/collection1/lib/classes/' to classloader
[junit4:junit4]   2> 8221 T60 oasc.SolrResourceLoader.replaceClassLoader Adding 'file:/usr/home/hudson/hudson-slave/workspace/Lucene-Solr-Tests-4.x-java7/solr/build/solr-core/test/J0/org.apache.solr.cloud.SyncSliceTest-jetty1-1359676566600/collection1/lib/README' to classloader
[junit4:junit4]   2> 8277 T60 oasc.SolrConfig.<init> Using Lucene MatchVersion: LUCENE_42
[junit4:junit4]   2> 8338 T60 oasc.SolrConfig.<init> Loaded SolrConfig: solrconfig.xml
[junit4:junit4]   2> 8440 T60 oass.IndexSchema.readSchema Reading Solr Schema
[junit4:junit4]   2> 8471 T60 oass.IndexSchema.readSchema Schema name=test
[junit4:junit4]   2> 8995 T60 oass.OpenExchangeRatesOrgProvider.init Initialized with rates=open-exchange-rates.json, refreshInterval=1440.
[junit4:junit4]   2> 9008 T60 oass.IndexSchema.readSchema default search field in schema is text
[junit4:junit4]   2> 9011 T60 oass.IndexSchema.readSchema unique key field: id
[junit4:junit4]   2> 9047 T60 oass.FileExchangeRateProvider.reload Reloading exchange rates from file currency.xml
[junit4:junit4]   2> 9053 T60 oass.FileExchangeRateProvider.reload Reloading exchange rates from file currency.xml
[junit4:junit4]   2> 9058 T60 oass.OpenExchangeRatesOrgProvider.reload Reloading exchange rates from open-exchange-rates.json
[junit4:junit4]   2> 9062 T60 oass.OpenExchangeRatesOrgProvider.reload Reloading exchange rates from open-exchange-rates.json
[junit4:junit4]   2> 9065 T60 oasc.SolrCore.<init> [collection1] Opening new SolrCore at /usr/home/hudson/hudson-slave/workspace/Lucene-Solr-Tests-4.x-java7/solr/build/solr-core/test/J0/./org.apache.solr.cloud.SyncSliceTest-jetty1-1359676566600/collection1/, dataDir=./org.apache.solr.cloud.SyncSliceTest-1359676558800/jetty1/
[junit4:junit4]   2> 9065 T60 oasc.JmxMonitoredMap.<init> JMX monitoring is enabled. Adding Solr mbeans to JMX Server: com.sun.jmx.mbeanserver.JmxMBeanServer@6478c466
[junit4:junit4]   2> 9067 T60 oasc.SolrCore.initDirectoryFactory solr.NRTCachingDirectoryFactory
[junit4:junit4]   2> 9068 T60 oasc.CachingDirectoryFactory.get return new directory for /usr/home/hudson/hudson-slave/workspace/Lucene-Solr-Tests-4.x-java7/solr/build/solr-core/test/J0/./org.apache.solr.cloud.SyncSliceTest-1359676558800/jetty1 forceNew:false
[junit4:junit4]   2> 9068 T60 oasc.CachingDirectoryFactory.close Releasing directory:/usr/home/hudson/hudson-slave/workspace/Lucene-Solr-Tests-4.x-java7/solr/build/solr-core/test/J0/./org.apache.solr.cloud.SyncSliceTest-1359676558800/jetty1
[junit4:junit4]   2> 9069 T60 oasc.SolrCore.getNewIndexDir New index directory detected: old=null new=./org.apache.solr.cloud.SyncSliceTest-1359676558800/jetty1/index/
[junit4:junit4]   2> 9069 T60 oasc.SolrCore.initIndex WARNING [collection1] Solr index directory './org.apache.solr.cloud.SyncSliceTest-1359676558800/jetty1/index' doesn't exist. Creating new index...
[junit4:junit4]   2> 9070 T60 oasc.CachingDirectoryFactory.get return new directory for /usr/home/hudson/hudson-slave/workspace/Lucene-Solr-Tests-4.x-java7/solr/build/solr-core/test/J0/./org.apache.solr.cloud.SyncSliceTest-1359676558800/jetty1/index forceNew:false
[junit4:junit4]   2> 9145 T41 oascc.ZkStateReader.updateClusterState Updating cloud state from ZooKeeper... 
[junit4:junit4]   2> 9146 T41 oasc.Overseer$ClusterStateUpdater.updateState Update state numShards=1 message={
[junit4:junit4]   2> 	  "operation":"state",
[junit4:junit4]   2> 	  "numShards":"1",
[junit4:junit4]   2> 	  "shard":"shard1",
[junit4:junit4]   2> 	  "roles":null,
[junit4:junit4]   2> 	  "state":"active",
[junit4:junit4]   2> 	  "core":"collection1",
[junit4:junit4]   2> 	  "collection":"control_collection",
[junit4:junit4]   2> 	  "node_name":"127.0.0.1:31192_",
[junit4:junit4]   2> 	  "base_url":"http://127.0.0.1:31192"}
[junit4:junit4]   2> 9174 T60 oasc.SolrDeletionPolicy.onCommit SolrDeletionPolicy.onCommit: commits:num=1
[junit4:junit4]   2> 		commit{dir=RateLimitedDirectoryWrapper(NRTCachingDirectory(org.apache.lucene.store.NIOFSDirectory@/usr/home/hudson/hudson-slave/workspace/Lucene-Solr-Tests-4.x-java7/solr/build/solr-core/test/J0/org.apache.solr.cloud.SyncSliceTest-1359676558800/jetty1/index lockFactory=org.apache.lucene.store.NativeFSLockFactory@32ffe6b5; maxCacheMB=48.0 maxMergeSizeMB=4.0)),segFN=segments_1,generation=1,filenames=[segments_1]
[junit4:junit4]   2> 9175 T60 oasc.SolrDeletionPolicy.updateCommits newest commit = 1[segments_1]
[junit4:junit4]   2> 9177 T60 oasc.CachingDirectoryFactory.close Releasing directory:/usr/home/hudson/hudson-slave/workspace/Lucene-Solr-Tests-4.x-java7/solr/build/solr-core/test/J0/./org.apache.solr.cloud.SyncSliceTest-1359676558800/jetty1/index
[junit4:junit4]   2> 9177 T60 oasc.SolrCore.initWriters created xml: solr.XMLResponseWriter
[junit4:junit4]   2> 9180 T60 oasup.UpdateRequestProcessorChain.init inserting DistributedUpdateProcessorFactory into updateRequestProcessorChain "dedupe"
[junit4:junit4]   2> 9181 T60 oasup.UpdateRequestProcessorChain.init inserting DistributedUpdateProcessorFactory into updateRequestProcessorChain "dedupe-allfields"
[junit4:junit4]   2> 9181 T60 oasup.UpdateRequestProcessorChain.init inserting DistributedUpdateProcessorFactory into updateRequestProcessorChain "stored_sig"
[junit4:junit4]   2> 9181 T60 oasup.UpdateRequestProcessorChain.init inserting DistributedUpdateProcessorFactory into updateRequestProcessorChain "uniq-fields"
[junit4:junit4]   2> 9182 T60 oasup.UpdateRequestProcessorChain.init inserting DistributedUpdateProcessorFactory into updateRequestProcessorChain "distrib-dup-test-chain-implicit"
[junit4:junit4]   2> 9183 T60 oasc.RequestHandlers.initHandlersFromConfig adding lazy requestHandler: solr.ReplicationHandler
[junit4:junit4]   2> 9183 T60 oasc.RequestHandlers.initHandlersFromConfig created /replication: solr.ReplicationHandler
[junit4:junit4]   2> 9184 T60 oasc.RequestHandlers.initHandlersFromConfig created standard: solr.StandardRequestHandler
[junit4:junit4]   2> 9185 T59 oascc.ZkStateReader$2.process A cluster state change: WatchedEvent state:SyncConnected type:NodeDataChanged path:/clusterstate.json, has occurred - updating... (live nodes size: 2)
[junit4:junit4]   2> 9185 T40 oascc.ZkStateReader$2.process A cluster state change: WatchedEvent state:SyncConnected type:NodeDataChanged path:/clusterstate.json, has occurred - updating... (live nodes size: 2)
[junit4:junit4]   2> 9186 T60 oasc.RequestHandlers.initHandlersFromConfig created /get: solr.RealTimeGetHandler
[junit4:junit4]   2> 9186 T46 oascc.ZkStateReader$2.process A cluster state change: WatchedEvent state:SyncConnected type:NodeDataChanged path:/clusterstate.json, has occurred - updating... (live nodes size: 2)
[junit4:junit4]   2> 9187 T60 oasc.RequestHandlers.initHandlersFromConfig created dismax: solr.SearchHandler
[junit4:junit4]   2> 9188 T60 oasc.RequestHandlers.initHandlersFromConfig created mock: org.apache.solr.core.MockQuerySenderListenerReqHandler
[junit4:junit4]   2> 9189 T60 oasc.RequestHandlers.initHandlersFromConfig created /admin/: org.apache.solr.handler.admin.AdminHandlers
[junit4:junit4]   2> 9190 T60 oasc.RequestHandlers.initHandlersFromConfig created defaults: solr.StandardRequestHandler
[junit4:junit4]   2> 9190 T60 oasc.RequestHandlers.initHandlersFromConfig adding lazy requestHandler: solr.StandardRequestHandler
[junit4:junit4]   2> 9191 T60 oasc.RequestHandlers.initHandlersFromConfig created lazy: solr.StandardRequestHandler
[junit4:junit4]   2> 9192 T60 oasc.RequestHandlers.initHandlersFromConfig created /update: solr.UpdateRequestHandler
[junit4:junit4]   2> 9193 T60 oasc.RequestHandlers.initHandlersFromConfig created /terms: org.apache.solr.handler.component.SearchHandler
[junit4:junit4]   2> 9194 T60 oasc.RequestHandlers.initHandlersFromConfig created spellCheckCompRH: org.apache.solr.handler.component.SearchHandler
[junit4:junit4]   2> 9195 T60 oasc.RequestHandlers.initHandlersFromConfig created spellCheckCompRH_Direct: org.apache.solr.handler.component.SearchHandler
[junit4:junit4]   2> 9196 T60 oasc.RequestHandlers.initHandlersFromConfig created spellCheckWithWordbreak: org.apache.solr.handler.component.SearchHandler
[junit4:junit4]   2> 9197 T60 oasc.RequestHandlers.initHandlersFromConfig created spellCheckWithWordbreak_Direct: org.apache.solr.handler.component.SearchHandler
[junit4:junit4]   2> 9198 T60 oasc.RequestHandlers.initHandlersFromConfig created spellCheckCompRH1: org.apache.solr.handler.component.SearchHandler
[junit4:junit4]   2> 9199 T60 oasc.RequestHandlers.initHandlersFromConfig created mltrh: org.apache.solr.handler.component.SearchHandler
[junit4:junit4]   2> 9200 T60 oasc.RequestHandlers.initHandlersFromConfig created tvrh: org.apache.solr.handler.component.SearchHandler
[junit4:junit4]   2> 9201 T60 oasc.RequestHandlers.initHandlersFromConfig created /mlt: solr.MoreLikeThisHandler
[junit4:junit4]   2> 9202 T60 oasc.RequestHandlers.initHandlersFromConfig created /debug/dump: solr.DumpRequestHandler
[junit4:junit4]   2> 9211 T60 oashl.XMLLoader.init xsltCacheLifetimeSeconds=60
[junit4:junit4]   2> 9216 T60 oasc.SolrCore.initDeprecatedSupport WARNING solrconfig.xml uses deprecated <admin/gettableFiles>, Please update your config to use the ShowFileRequestHandler.
[junit4:junit4]   2> 9218 T60 oasc.SolrCore.initDeprecatedSupport WARNING adding ShowFileRequestHandler with hidden files: [SCHEMA.XML, OLD_SYNONYMS.TXT, STOPWORDS.TXT, PROTWORDS.TXT, OPEN-EXCHANGE-RATES.JSON, SYNONYMS.TXT, CURRENCY.XML, MAPPING-ISOLATIN1ACCENT.TXT]
[junit4:junit4]   2> 9221 T60 oasc.CachingDirectoryFactory.close Releasing directory:/usr/home/hudson/hudson-slave/workspace/Lucene-Solr-Tests-4.x-java7/solr/build/solr-core/test/J0/./org.apache.solr.cloud.SyncSliceTest-1359676558800/jetty1
[junit4:junit4]   2> 9223 T60 oass.SolrIndexSearcher.<init> Opening Searcher@9943753 main
[junit4:junit4]   2> 9224 T60 oasu.CommitTracker.<init> Hard AutoCommit: disabled
[junit4:junit4]   2> 9225 T60 oasu.CommitTracker.<init> Soft AutoCommit: disabled
[junit4:junit4]   2> 9226 T60 oashc.SpellCheckComponent.inform Initializing spell checkers
[junit4:junit4]   2> 9233 T60 oass.DirectSolrSpellChecker.init init: {name=direct,classname=DirectSolrSpellChecker,field=lowerfilt,minQueryLength=3}
[junit4:junit4]   2> 9297 T61 oasc.SolrCore.registerSearcher [collection1] Registered new searcher Searcher@9943753 main{StandardDirectoryReader(segments_1:1)}
[junit4:junit4]   2> 9310 T60 oasc.ZkController.publish publishing core=collection1 state=down
[junit4:junit4]   2> 9310 T60 oasc.ZkController.publish numShards not found on descriptor - reading it from system property
[junit4:junit4]   2> 10694 T41 oascc.ZkStateReader.updateClusterState Updating cloud state from ZooKeeper... 
[junit4:junit4]   2> 10696 T41 oasc.Overseer$ClusterStateUpdater.updateState Update state numShards=1 message={
[junit4:junit4]   2> 	  "operation":"state",
[junit4:junit4]   2> 	  "numShards":"1",
[junit4:junit4]   2> 	  "shard":null,
[junit4:junit4]   2> 	  "roles":null,
[junit4:junit4]   2> 	  "state":"down",
[junit4:junit4]   2> 	  "core":"collection1",
[junit4:junit4]   2> 	  "collection":"collection1",
[junit4:junit4]   2> 	  "node_name":"127.0.0.1:22765_",
[junit4:junit4]   2> 	  "base_url":"http://127.0.0.1:22765"}
[junit4:junit4]   2> 10696 T41 oasc.Overseer$ClusterStateUpdater.createCollection Create collection collection1 with numShards 1
[junit4:junit4]   2> 10696 T41 oasc.Overseer$ClusterStateUpdater.updateState Assigning new node to shard shard=shard1
[junit4:junit4]   2> 10746 T40 oascc.ZkStateReader$2.process A cluster state change: WatchedEvent state:SyncConnected type:NodeDataChanged path:/clusterstate.json, has occurred - updating... (live nodes size: 2)
[junit4:junit4]   2> 10746 T59 oascc.ZkStateReader$2.process A cluster state change: WatchedEvent state:SyncConnected type:NodeDataChanged path:/clusterstate.json, has occurred - updating... (live nodes size: 2)
[junit4:junit4]   2> 10746 T46 oascc.ZkStateReader$2.process A cluster state change: WatchedEvent state:SyncConnected type:NodeDataChanged path:/clusterstate.json, has occurred - updating... (live nodes size: 2)
[junit4:junit4]   2> 11315 T60 oasc.CoreContainer.registerCore registering core: collection1
[junit4:junit4]   2> 11315 T60 oasc.ZkController.register Register replica - core:collection1 address:http://127.0.0.1:22765 collection:collection1 shard:shard1
[junit4:junit4]   2> 11317 T60 oascc.SolrZkClient.makePath makePath: /collections/collection1/leader_elect/shard1/election
[junit4:junit4]   2> 11354 T22 oazs.PrepRequestProcessor.pRequest Got user-level KeeperException when processing sessionid:0x13c9309ced10006 type:delete cxid:0x45 zxid:0x5b txntype:-1 reqpath:n/a Error Path:/solr/collections/collection1/leaders Error:KeeperErrorCode = NoNode for /solr/collections/collection1/leaders
[junit4:junit4]   2> 11363 T60 oasc.ShardLeaderElectionContext.runLeaderProcess Running the leader process.
[junit4:junit4]   2> 11364 T22 oazs.PrepRequestProcessor.pRequest Got user-level KeeperException when processing sessionid:0x13c9309ced10006 type:create cxid:0x46 zxid:0x5c txntype:-1 reqpath:n/a Error Path:/solr/overseer Error:KeeperErrorCode = NodeExists for /solr/overseer
[junit4:junit4]   2> 11367 T60 oasc.ShardLeaderElectionContext.waitForReplicasToComeUp Enough replicas found to continue.
[junit4:junit4]   2> 11367 T60 oasc.ShardLeaderElectionContext.runLeaderProcess I may be the new leader - try and sync
[junit4:junit4]   2> 11368 T60 oasc.SyncStrategy.sync Sync replicas to http://127.0.0.1:22765/collection1/
[junit4:junit4]   2> 11368 T60 oasc.SyncStrategy.syncReplicas Sync Success - now sync replicas to me
[junit4:junit4]   2> 11368 T60 oasc.SyncStrategy.syncToMe http://127.0.0.1:22765/collection1/ has no replicas
[junit4:junit4]   2> 11369 T60 oasc.ShardLeaderElectionContext.runLeaderProcess I am the new leader: http://127.0.0.1:22765/collection1/
[junit4:junit4]   2> 11369 T60 oascc.SolrZkClient.makePath makePath: /collections/collection1/leaders/shard1
[junit4:junit4]   2> 11375 T22 oazs.PrepRequestProcessor.pRequest Got user-level KeeperException when processing sessionid:0x13c9309ced10006 type:create cxid:0x50 zxid:0x60 txntype:-1 reqpath:n/a Error Path:/solr/overseer Error:KeeperErrorCode = NodeExists for /solr/overseer
[junit4:junit4]   2> 12255 T41 oascc.ZkStateReader.updateClusterState Updating cloud state from ZooKeeper... 
[junit4:junit4]   2> 12302 T40 oascc.ZkStateReader$2.process A cluster state change: WatchedEvent state:SyncConnected type:NodeDataChanged path:/clusterstate.json, has occurred - updating... (live nodes size: 2)
[junit4:junit4]   2> 12302 T59 oascc.ZkStateReader$2.process A cluster state change: WatchedEvent state:SyncConnected type:NodeDataChanged path:/clusterstate.json, has occurred - updating... (live nodes size: 2)
[junit4:junit4]   2> 12302 T46 oascc.ZkStateReader$2.process A cluster state change: WatchedEvent state:SyncConnected type:NodeDataChanged path:/clusterstate.json, has occurred - updating... (live nodes size: 2)
[junit4:junit4]   2> 12347 T60 oasc.ZkController.register We are http://127.0.0.1:22765/collection1/ and leader is http://127.0.0.1:22765/collection1/
[junit4:junit4]   2> 12347 T60 oasc.ZkController.register No LogReplay needed for core=collection1 baseURL=http://127.0.0.1:22765
[junit4:junit4]   2> 12348 T60 oasc.ZkController.checkRecovery I am the leader, no recovery necessary
[junit4:junit4]   2> 12348 T60 oasc.ZkController.publish publishing core=collection1 state=active
[junit4:junit4]   2> 12348 T60 oasc.ZkController.publish numShards not found on descriptor - reading it from system property
[junit4:junit4]   2> 12352 T60 oascc.ZkStateReader.updateClusterState Updating cloud state from ZooKeeper... 
[junit4:junit4]   2> 12354 T17 oass.SolrDispatchFilter.init user.dir=/usr/home/hudson/hudson-slave/workspace/Lucene-Solr-Tests-4.x-java7/solr/build/solr-core/test/J0
[junit4:junit4]   2> 12354 T17 oass.SolrDispatchFilter.init SolrDispatchFilter.init() done
[junit4:junit4]   2> 12355 T17 oascsi.HttpClientUtil.createClient Creating new http client, config:maxConnections=128&maxConnectionsPerHost=32&followRedirects=false
[junit4:junit4]   2> 12571 T17 oejs.Server.doStart jetty-8.1.8.v20121106
[junit4:junit4]   2> 12574 T17 oejs.AbstractConnector.doStart Started SocketConnector@127.0.0.1:59403
[junit4:junit4]   2> 12575 T17 oass.SolrDispatchFilter.init SolrDispatchFilter.init()
[junit4:junit4]   2> 12576 T17 oasc.SolrResourceLoader.locateSolrHome JNDI not configured for solr (NoInitialContextEx)
[junit4:junit4]   2> 12577 T17 oasc.SolrResourceLoader.locateSolrHome using system property solr.solr.home: /usr/home/hudson/hudson-slave/workspace/Lucene-Solr-Tests-4.x-java7/solr/build/solr-core/test/J0/./org.apache.solr.cloud.SyncSliceTest-jetty2-1359676571168
[junit4:junit4]   2> 12577 T17 oasc.CoreContainer$Initializer.initialize looking for solr.xml: /usr/home/hudson/hudson-slave/workspace/Lucene-Solr-Tests-4.x-java7/solr/build/solr-core/test/J0/./org.apache.solr.cloud.SyncSliceTest-jetty2-1359676571168/solr.xml
[junit4:junit4]   2> 12578 T17 oasc.CoreContainer.<init> New CoreContainer 1584189756
[junit4:junit4]   2> 12579 T17 oasc.CoreContainer.load Loading CoreContainer using Solr Home: '/usr/home/hudson/hudson-slave/workspace/Lucene-Solr-Tests-4.x-java7/solr/build/solr-core/test/J0/./org.apache.solr.cloud.SyncSliceTest-jetty2-1359676571168/'
[junit4:junit4]   2> 12580 T17 oasc.SolrResourceLoader.<init> new SolrResourceLoader for directory: '/usr/home/hudson/hudson-slave/workspace/Lucene-Solr-Tests-4.x-java7/solr/build/solr-core/test/J0/./org.apache.solr.cloud.SyncSliceTest-jetty2-1359676571168/'
[junit4:junit4]   2> 12650 T17 oashc.HttpShardHandlerFactory.getParameter Setting socketTimeout to: 60000
[junit4:junit4]   2> 12651 T17 oashc.HttpShardHandlerFactory.getParameter Setting urlScheme to: http://
[junit4:junit4]   2> 12651 T17 oashc.HttpShardHandlerFactory.getParameter Setting connTimeout to: 15000
[junit4:junit4]   2> 12652 T17 oashc.HttpShardHandlerFactory.getParameter Setting maxConnectionsPerHost to: 20
[junit4:junit4]   2> 12653 T17 oashc.HttpShardHandlerFactory.getParameter Setting corePoolSize to: 0
[junit4:junit4]   2> 12653 T17 oashc.HttpShardHandlerFactory.getParameter Setting maximumPoolSize to: 2147483647
[junit4:junit4]   2> 12654 T17 oashc.HttpShardHandlerFactory.getParameter Setting maxThreadIdleTime to: 5
[junit4:junit4]   2> 12654 T17 oashc.HttpShardHandlerFactory.getParameter Setting sizeOfQueue to: -1
[junit4:junit4]   2> 12655 T17 oashc.HttpShardHandlerFactory.getParameter Setting fairnessPolicy to: false
[junit4:junit4]   2> 12656 T17 oascsi.HttpClientUtil.createClient Creating new http client, config:maxConnectionsPerHost=20&maxConnections=10000&socketTimeout=60000&connTimeout=15000&retry=false
[junit4:junit4]   2> 12682 T17 oasc.CoreContainer.load Registering Log Listener
[junit4:junit4]   2> 12707 T17 oasc.CoreContainer.initZooKeeper Zookeeper client=127.0.0.1:18121/solr
[junit4:junit4]   2> 12708 T17 oasc.ZkController.checkChrootPath zkHost includes chroot
[junit4:junit4]   2> 12708 T17 oaz.ZooKeeper.<init> Initiating client connection, connectString=127.0.0.1:18121 sessionTimeout=60000 watcher=org.apache.solr.common.cloud.ConnectionManager@5e243737
[junit4:junit4]   2> 12710 T17 oascc.ConnectionManager.waitForConnected Waiting for client to connect to ZooKeeper
[junit4:junit4]   2> 12710 T71 oaz.ClientCnxn$SendThread.logStartConnect Opening socket connection to server localhost/127.0.0.1:18121. Will not attempt to authenticate using SASL (access denied ("javax.security.auth.AuthPermission" "getLoginConfiguration"))
[junit4:junit4]   2> 12711 T71 oaz.ClientCnxn$SendThread.primeConnection Socket connection established to localhost/127.0.0.1:18121, initiating session
[junit4:junit4]   2> 12712 T19 oazs.NIOServerCnxnFactory.run Accepted socket connection from /140.211.11.196:17024
[junit4:junit4]   2> 12712 T19 oazs.ZooKeeperServer.processConnectRequest Client attempting to establish new session at /140.211.11.196:17024
[junit4:junit4]   2> 12714 T21 oazs.ZooKeeperServer.finishSessionInit Established session 0x13c9309ced10007 with negotiated timeout 20000 for client /140.211.11.196:17024
[junit4:junit4]   2> 12714 T71 oaz.ClientCnxn$SendThread.onConnected Session establishment complete on server localhost/127.0.0.1:18121, sessionid = 0x13c9309ced10007, negotiated timeout = 20000
[junit4:junit4]   2> 12715 T72 oascc.ConnectionManager.process Watcher org.apache.solr.common.cloud.ConnectionManager@5e243737 name:ZooKeeperConnection Watcher:127.0.0.1:18121 got event WatchedEvent state:SyncConnected type:None path:null path:null type:None
[junit4:junit4]   2> 12716 T17 oascc.ConnectionManager.waitForConnected Client is connected to ZooKeeper
[junit4:junit4]   2> 12718 T22 oazs.PrepRequestProcessor.pRequest2Txn Processed session termination for sessionid: 0x13c9309ced10007
[junit4:junit4]   2> 12719 T72 oaz.ClientCnxn$EventThread.run EventThread shut down
[junit4:junit4]   2> 12719 T19 oazs.NIOServerCnxn.closeSock Closed socket connection for client /140.211.11.196:17024 which had sessionid 0x13c9309ced10007
[junit4:junit4]   2> 12719 T17 oaz.ZooKeeper.close Session: 0x13c9309ced10007 closed
[junit4:junit4]   2> 12720 T17 oascsi.HttpClientUtil.createClient Creating new http client, config:maxConnections=500&maxConnectionsPerHost=16&socketTimeout=60000&connTimeout=15000
[junit4:junit4]   2> 12734 T17 oaz.ZooKeeper.<init> Initiating client connection, connectString=127.0.0.1:18121/solr sessionTimeout=30000 watcher=org.apache.solr.common.cloud.ConnectionManager@41a9fd8e
[junit4:junit4]   2> 12735 T17 oascc.ConnectionManager.waitForConnected Waiting for client to connect to ZooKeeper
[junit4:junit4]   2> 12736 T73 oaz.ClientCnxn$SendThread.logStartConnect Opening socket connection to server localhost/127.0.0.1:18121. Will not attempt to authenticate using SASL (access denied ("javax.security.auth.AuthPermission" "getLoginConfiguration"))
[junit4:junit4]   2> 12737 T73 oaz.ClientCnxn$SendThread.primeConnection Socket connection established to localhost/127.0.0.1:18121, initiating session
[junit4:junit4]   2> 12737 T19 oazs.NIOServerCnxnFactory.run Accepted socket connection from /140.211.11.196:42254
[junit4:junit4]   2> 12737 T19 oazs.ZooKeeperServer.processConnectRequest Client attempting to establish new session at /140.211.11.196:42254
[junit4:junit4]   2> 12739 T21 oazs.ZooKeeperServer.finishSessionInit Established session 0x13c9309ced10008 with negotiated timeout 20000 for client /140.211.11.196:42254
[junit4:junit4]   2> 12739 T73 oaz.ClientCnxn$SendThread.onConnected Session establishment complete on server localhost/127.0.0.1:18121, sessionid = 0x13c9309ced10008, negotiated timeout = 20000
[junit4:junit4]   2> 12740 T74 oascc.ConnectionManager.process Watcher org.apache.solr.common.cloud.ConnectionManager@41a9fd8e name:ZooKeeperConnection Watcher:127.0.0.1:18121/solr got event WatchedEvent state:SyncConnected type:None path:null path:null type:None
[junit4:junit4]   2> 12740 T17 oascc.ConnectionManager.waitForConnected Client is connected to ZooKeeper
[junit4:junit4]   2> 12741 T22 oazs.PrepRequestProcessor.pRequest Got user-level KeeperException when processing sessionid:0x13c9309ced10008 type:create cxid:0x1 zxid:0x6d txntype:-1 reqpath:n/a Error Path:/solr/overseer Error:KeeperErrorCode = NodeExists for /solr/overseer
[junit4:junit4]   2> 12743 T22 oazs.PrepRequestProcessor.pRequest Got user-level KeeperException when processing sessionid:0x13c9309ced10008 type:create cxid:0x2 zxid:0x6e txntype:-1 reqpath:n/a Error Path:/solr/overseer Error:KeeperErrorCode = NodeExists for /solr/overseer
[junit4:junit4]   2> 12745 T17 oasc.ZkController.createEphemeralLiveNode Register node as live in ZooKeeper:/live_nodes/127.0.0.1:59403_
[junit4:junit4]   2> 12746 T22 oazs.PrepRequestProcessor.pRequest Got user-level KeeperException when processing sessionid:0x13c9309ced10008 type:delete cxid:0x4 zxid:0x6f txntype:-1 reqpath:n/a Error Path:/solr/live_nodes/127.0.0.1:59403_ Error:KeeperErrorCode = NoNode for /solr/live_nodes/127.0.0.1:59403_
[junit4:junit4]   2> 12754 T17 oascc.SolrZkClient.makePath makePath: /live_nodes/127.0.0.1:59403_
[junit4:junit4]   2> 12757 T59 oascc.ZkStateReader$2.process A cluster state change: WatchedEvent state:SyncConnected type:NodeChildrenChanged path:/live_nodes, has occurred - updating... (live nodes size: 2)
[junit4:junit4]   2> 12758 T40 oascc.ZkStateReader$3.process Updating live nodes... (3)
[junit4:junit4]   2> 12758 T46 oascc.ZkStateReader$3.process Updating live nodes... (3)
[junit4:junit4]   2> 12759 T40 oascc.ZkStateReader$2.process A cluster state change: WatchedEvent state:SyncConnected type:NodeChildrenChanged path:/live_nodes, has occurred - updating... (live nodes size: 3)
[junit4:junit4]   2> 12759 T46 oascc.ZkStateReader$2.process A cluster state change: WatchedEvent state:SyncConnected type:NodeChildrenChanged path:/live_nodes, has occurred - updating... (live nodes size: 3)
[junit4:junit4]   2> 12760 T59 oascc.ZkStateReader$3.process Updating live nodes... (3)
[junit4:junit4]   2> 12765 T17 oascc.ZkStateReader.createClusterStateWatchersAndUpdate Updating cluster state from ZooKeeper... 
[junit4:junit4]   2> 12775 T75 oasc.CoreContainer.create Creating SolrCore 'collection1' using instanceDir: /usr/home/hudson/hudson-slave/workspace/Lucene-Solr-Tests-4.x-java7/solr/build/solr-core/test/J0/./org.apache.solr.cloud.SyncSliceTest-jetty2-1359676571168/collection1
[junit4:junit4]   2> 12775 T75 oasc.ZkController.createCollectionZkNode Check for collection zkNode:collection1
[junit4:junit4]   2> 12776 T75 oasc.ZkController.createCollectionZkNode Collection zkNode exists
[junit4:junit4]   2> 12776 T75 oasc.ZkController.readConfigName Load collection config from:/collections/collection1
[junit4:junit4]   2> 12778 T75 oasc.SolrResourceLoader.<init> new SolrResourceLoader for directory: '/usr/home/hudson/hudson-slave/workspace/Lucene-Solr-Tests-4.x-java7/solr/build/solr-core/test/J0/./org.apache.solr.cloud.SyncSliceTest-jetty2-1359676571168/collection1/'
[junit4:junit4]   2> 12780 T75 oasc.SolrResourceLoader.replaceClassLoader Adding 'file:/usr/home/hudson/hudson-slave/workspace/Lucene-Solr-Tests-4.x-java7/solr/build/solr-core/test/J0/org.apache.solr.cloud.SyncSliceTest-jetty2-1359676571168/collection1/lib/README' to classloader
[junit4:junit4]   2> 12780 T75 oasc.SolrResourceLoader.replaceClassLoader Adding 'file:/usr/home/hudson/hudson-slave/workspace/Lucene-Solr-Tests-4.x-java7/solr/build/solr-core/test/J0/org.apache.solr.cloud.SyncSliceTest-jetty2-1359676571168/collection1/lib/classes/' to classloader
[junit4:junit4]   2> 12828 T75 oasc.SolrConfig.<init> Using Lucene MatchVersion: LUCENE_42
[junit4:junit4]   2> 12890 T75 oasc.SolrConfig.<init> Loaded SolrConfig: solrconfig.xml
[junit4:junit4]   2> 12991 T75 oass.IndexSchema.readSchema Reading Solr Schema
[junit4:junit4]   2> 13010 T75 oass.IndexSchema.readSchema Schema name=test
[junit4:junit4]   2> 13545 T75 oass.OpenExchangeRatesOrgProvider.init Initialized with rates=open-exchange-rates.json, refreshInterval=1440.
[junit4:junit4]   2> 13558 T75 oass.IndexSchema.readSchema default search field in schema is text
[junit4:junit4]   2> 13561 T75 oass.IndexSchema.readSchema unique key field: id
[junit4:junit4]   2> 13591 T75 oass.FileExchangeRateProvider.reload Reloading exchange rates from file currency.xml
[junit4:junit4]   2> 13597 T75 oass.FileExchangeRateProvider.reload Reloading exchange rates from file currency.xml
[junit4:junit4]   2> 13602 T75 oass.OpenExchangeRatesOrgProvider.reload Reloading exchange rates from open-exchange-rates.json
[junit4:junit4]   2> 13605 T75 oass.OpenExchangeRatesOrgProvider.reload Reloading exchange rates from open-exchange-rates.json
[junit4:junit4]   2> 13608 T75 oasc.SolrCore.<init> [collection1] Opening new SolrCore at /usr/home/hudson/hudson-slave/workspace/Lucene-Solr-Tests-4.x-java7/solr/build/solr-core/test/J0/./org.apache.solr.cloud.SyncSliceTest-jetty2-1359676571168/collection1/, dataDir=./org.apache.solr.cloud.SyncSliceTest-1359676558800/jetty2/
[junit4:junit4]   2> 13609 T75 oasc.JmxMonitoredMap.<init> JMX monitoring is enabled. Adding Solr mbeans to JMX Server: com.sun.jmx.mbeanserver.JmxMBeanServer@6478c466
[junit4:junit4]   2> 13610 T75 oasc.SolrCore.initDirectoryFactory solr.NRTCachingDirectoryFactory
[junit4:junit4]   2> 13611 T75 oasc.CachingDirectoryFactory.get return new directory for /usr/home/hudson/hudson-slave/workspace/Lucene-Solr-Tests-4.x-java7/solr/build/solr-core/test/J0/./org.apache.solr.cloud.SyncSliceTest-1359676558800/jetty2 forceNew:false
[junit4:junit4]   2> 13612 T75 oasc.CachingDirectoryFactory.close Releasing directory:/usr/home/hudson/hudson-slave/workspace/Lucene-Solr-Tests-4.x-java7/solr/build/solr-core/test/J0/./org.apache.solr.cloud.SyncSliceTest-1359676558800/jetty2
[junit4:junit4]   2> 13612 T75 oasc.SolrCore.getNewIndexDir New index directory detected: old=null new=./org.apache.solr.cloud.SyncSliceTest-1359676558800/jetty2/index/
[junit4:junit4]   2> 13613 T75 oasc.SolrCore.initIndex WARNING [collection1] Solr index directory './org.apache.solr.cloud.SyncSliceTest-1359676558800/jetty2/index' doesn't exist. Creating new index...
[junit4:junit4]   2> 13614 T75 oasc.CachingDirectoryFactory.get return new directory for /usr/home/hudson/hudson-slave/workspace/Lucene-Solr-Tests-4.x-java7/solr/build/solr-core/test/J0/./org.apache.solr.cloud.SyncSliceTest-1359676558800/jetty2/index forceNew:false
[junit4:junit4]   2> 13666 T75 oasc.SolrDeletionPolicy.onCommit SolrDeletionPolicy.onCommit: commits:num=1
[junit4:junit4]   2> 		commit{dir=RateLimitedDirectoryWrapper(NRTCachingDirectory(org.apache.lucene.store.NIOFSDirectory@/usr/home/hudson/hudson-slave/workspace/Lucene-Solr-Tests-4.x-java7/solr/build/solr-core/test/J0/org.apache.solr.cloud.SyncSliceTest-1359676558800/jetty2/index lockFactory=org.apache.lucene.store.NativeFSLockFactory@44e8518c; maxCacheMB=48.0 maxMergeSizeMB=4.0)),segFN=segments_1,generation=1,filenames=[segments_1]
[junit4:junit4]   2> 13666 T75 oasc.SolrDeletionPolicy.updateCommits newest commit = 1[segments_1]
[junit4:junit4]   2> 13667 T75 oasc.CachingDirectoryFactory.close Releasing directory:/usr/home/hudson/hudson-slave/workspace/Lucene-Solr-Tests-4.x-java7/solr/build/solr-core/test/J0/./org.apache.solr.cloud.SyncSliceTest-1359676558800/jetty2/index
[junit4:junit4]   2> 13668 T75 oasc.SolrCore.initWriters created xml: solr.XMLResponseWriter
[junit4:junit4]   2> 13671 T75 oasup.UpdateRequestProcessorChain.init inserting DistributedUpdateProcessorFactory into updateRequestProcessorChain "dedupe"
[junit4:junit4]   2> 13671 T75 oasup.UpdateRequestProcessorChain.init inserting DistributedUpdateProcessorFactory into updateRequestProcessorChain "dedupe-allfields"
[junit4:junit4]   2> 13671 T75 oasup.UpdateRequestProcessorChain.init inserting DistributedUpdateProcessorFactory into updateRequestProcessorChain "stored_sig"
[junit4:junit4]   2> 13672 T75 oasup.UpdateRequestProcessorChain.init inserting DistributedUpdateProcessorFactory into updateRequestProcessorChain "uniq-fields"
[junit4:junit4]   2> 13673 T75 oasup.UpdateRequestProcessorChain.init inserting DistributedUpdateProcessorFactory into updateRequestProcessorChain "distrib-dup-test-chain-implicit"
[junit4:junit4]   2> 13673 T75 oasc.RequestHandlers.initHandlersFromConfig adding lazy requestHandler: solr.ReplicationHandler
[junit4:junit4]   2> 13674 T75 oasc.RequestHandlers.initHandlersFromConfig created /replication: solr.ReplicationHandler
[junit4:junit4]   2> 13675 T75 oasc.RequestHandlers.initHandlersFromConfig created standard: solr.StandardRequestHandler
[junit4:junit4]   2> 13676 T75 oasc.RequestHandlers.initHandlersFromConfig created /get: solr.RealTimeGetHandler
[junit4:junit4]   2> 13677 T75 oasc.RequestHandlers.initHandlersFromConfig created dismax: solr.SearchHandler
[junit4:junit4]   2> 13677 T75 oasc.RequestHandlers.initHandlersFromConfig created mock: org.apache.solr.core.MockQuerySenderListenerReqHandler
[junit4:junit4]   2> 13678 T75 oasc.RequestHandlers.initHandlersFromConfig created /admin/: org.apache.solr.handler.admin.AdminHandlers
[junit4:junit4]   2> 13679 T75 oasc.RequestHandlers.initHandlersFromConfig created defaults: solr.StandardRequestHandler
[junit4:junit4]   2> 13679 T75 oasc.RequestHandlers.initHandlersFromConfig adding lazy requestHandler: solr.StandardRequestHandler
[junit4:junit4]   2> 13680 T75 oasc.RequestHandlers.initHandlersFromConfig created lazy: solr.StandardRequestHandler
[junit4:junit4]   2> 13681 T75 oasc.RequestHandlers.initHandlersFromConfig created /update: solr.UpdateRequestHandler
[junit4:junit4]   2> 13682 T75 oasc.RequestHandlers.initHandlersFromConfig created /terms: org.apache.solr.handler.component.SearchHandler
[junit4:junit4]   2> 13683 T75 oasc.RequestHandlers.initHandlersFromConfig created spellCheckCompRH: org.apache.solr.handler.component.SearchHandler
[junit4:junit4]   2> 13683 T75 oasc.RequestHandlers.initHandlersFromConfig created spellCheckCompRH_Direct: org.apache.solr.handler.component.SearchHandler
[junit4:junit4]   2> 13684 T75 oasc.RequestHandlers.initHandlersFromConfig created spellCheckWithWordbreak: org.apache.solr.handler.component.SearchHandler
[junit4:junit4]   2> 13685 T75 oasc.RequestHandlers.initHandlersFromConfig created spellCheckWithWordbreak_Direct: org.apache.solr.handler.component.SearchHandler
[junit4:junit4]   2> 13686 T75 oasc.RequestHandlers.initHandlersFromConfig created spellCheckCompRH1: org.apache.solr.handler.component.SearchHandler
[junit4:junit4]   2> 13687 T75 oasc.RequestHandlers.initHandlersFromConfig created mltrh: org.apache.solr.handler.component.SearchHandler
[junit4:junit4]   2> 13688 T75 oasc.RequestHandlers.initHandlersFromConfig created tvrh: org.apache.solr.handler.component.SearchHandler
[junit4:junit4]   2> 13689 T75 oasc.RequestHandlers.initHandlersFromConfig created /mlt: solr.MoreLikeThisHandler
[junit4:junit4]   2> 13690 T75 oasc.RequestHandlers.initHandlersFromConfig created /debug/dump: solr.DumpRequestHandler
[junit4:junit4]   2> 13699 T75 oashl.XMLLoader.init xsltCacheLifetimeSeconds=60
[junit4:junit4]   2> 13703 T75 oasc.SolrCore.initDeprecatedSupport WARNING solrconfig.xml uses deprecated <admin/gettableFiles>, Please update your config to use the ShowFileRequestHandler.
[junit4:junit4]   2> 13705 T75 oasc.SolrCore.initDeprecatedSupport WARNING adding ShowFileRequestHandler with hidden files: [SCHEMA.XML, OLD_SYNONYMS.TXT, STOPWORDS.TXT, PROTWORDS.TXT, OPEN-EXCHANGE-RATES.JSON, SYNONYMS.TXT, CURRENCY.XML, MAPPING-ISOLATIN1ACCENT.TXT]
[junit4:junit4]   2> 13708 T75 oasc.CachingDirectoryFactory.close Releasing directory:/usr/home/hudson/hudson-slave/workspace/Lucene-Solr-Tests-4.x-java7/solr/build/solr-core/test/J0/./org.apache.solr.cloud.SyncSliceTest-1359676558800/jetty2
[junit4:junit4]   2> 13709 T75 oass.SolrIndexSearcher.<init> Opening Searcher@4371c2d5 main
[junit4:junit4]   2> 13711 T75 oasu.CommitTracker.<init> Hard AutoCommit: disabled
[junit4:junit4]   2> 13711 T75 oasu.CommitTracker.<init> Soft AutoCommit: disabled
[junit4:junit4]   2> 13712 T75 oashc.SpellCheckComponent.inform Initializing spell checkers
[junit4:junit4]   2> 13730 T75 oass.DirectSolrSpellChecker.init init: {name=direct,classname=DirectSolrSpellChecker,field=lowerfilt,minQueryLength=3}
[junit4:junit4]   2> 13802 T76 oasc.SolrCore.registerSearcher [collection1] Registered new searcher Searcher@4371c2d5 main{StandardDirectoryReader(segments_1:1)}
[junit4:junit4]   2> 13813 T41 oascc.ZkStateReader.updateClusterState Updating cloud state from ZooKeeper... 
[junit4:junit4]   2> 13814 T41 oasc.Overseer$ClusterStateUpdater.updateState Update state numShards=1 message={
[junit4:junit4]   2> 	  "operation":"state",
[junit4:junit4]   2> 	  "numShards":"1",
[junit4:junit4]   2> 	  "shard":"shard1",
[junit4:junit4]   2> 	  "roles":null,
[junit4:junit4]   2> 	  "state":"active",
[junit4:junit4]   2> 	  "core":"collection1",
[junit4:junit4]   2> 	  "collection":"collection1",
[junit4:junit4]   2> 	  "node_name":"127.0.0.1:22765_",
[junit4:junit4]   2> 	  "base_url":"http://127.0.0.1:22765"}
[junit4:junit4]   2> 13825 T75 oasc.ZkController.publish publishing core=collection1 state=down
[junit4:junit4]   2> 13825 T75 oasc.ZkController.publish numShards not found on descriptor - reading it from system property
[junit4:junit4]   2> 13833 T74 oascc.ZkStateReader$2.process A cluster state change: WatchedEvent state:SyncConnected type:NodeDataChanged path:/clusterstate.json, has occurred - updating... (live nodes size: 3)
[junit4:junit4]   2> 13833 T59 oascc.ZkStateReader$2.process A cluster state change: WatchedEvent state:SyncConnected type:NodeDataChanged path:/clusterstate.json, has occurred - updating... (live nodes size: 3)
[junit4:junit4]   2> 13833 T46 oascc.ZkStateReader$2.process A cluster state change: WatchedEvent state:SyncConnected type:NodeDataChanged path:/clusterstate.json, has occurred - updating... (live nodes size: 3)
[junit4:junit4]   2> 13833 T40 oascc.ZkStateReader$2.process A cluster state change: WatchedEvent state:SyncConnected type:NodeDataChanged path:/clusterstate.json, has occurred - updating... (live nodes size: 3)
[junit4:junit4]   2> 15352 T41 oascc.ZkStateReader.updateClusterState Updating cloud state from ZooKeeper... 
[junit4:junit4]   2> 15354 T41 oasc.Overseer$ClusterStateUpdater.updateState Update state numShards=1 message={
[junit4:junit4]   2> 	  "operation":"state",
[junit4:junit4]   2> 	  "numShards":"1",
[junit4:junit4]   2> 	  "shard":null,
[junit4:junit4]   2> 	  "roles":null,
[junit4:junit4]   2> 	  "state":"down",
[junit4:junit4]   2> 	  "core":"collection1",
[junit4:junit4]   2> 	  "collection":"collection1",
[junit4:junit4]   2> 	  "node_name":"127.0.0.1:59403_",
[junit4:junit4]   2> 	  "base_url":"http://127.0.0.1:59403"}
[junit4:junit4]   2> 15354 T41 oasc.Overseer$ClusterStateUpdater.updateState Collection already exists with numShards=1
[junit4:junit4]   2> 15354 T41 oasc.Overseer$ClusterStateUpdater.updateState Assigning new node to shard shard=shard1
[junit4:junit4]   2> 15371 T59 oascc.ZkStateReader$2.process A cluster state change: WatchedEvent state:SyncConnected type:NodeDataChanged path:/clusterstate.json, has occurred - updating... (live nodes size: 3)
[junit4:junit4]   2> 15371 T74 oascc.ZkStateReader$2.process A cluster state change: WatchedEvent state:SyncConnected type:NodeDataChanged path:/clusterstate.json, has occurred - updating... (live nodes size: 3)
[junit4:junit4]   2> 15371 T40 oascc.ZkStateReader$2.process A cluster state change: WatchedEvent state:SyncConnected type:NodeDataChanged path:/clusterstate.json, has occurred - updating... (live nodes size: 3)
[junit4:junit4]   2> 15371 T46 oascc.ZkStateReader$2.process A cluster state change: WatchedEvent state:SyncConnected type:NodeDataChanged path:/clusterstate.json, has occurred - updating... (live nodes size: 3)
[junit4:junit4]   2> 15836 T75 oasc.CoreContainer.registerCore registering core: collection1
[junit4:junit4]   2> 15836 T75 oasc.ZkController.register Register replica - core:collection1 address:http://127.0.0.1:59403 collection:collection1 shard:shard1
[junit4:junit4]   2> 15841 T75 oasc.ZkController.register We are http://127.0.0.1:59403/collection1/ and leader is http://127.0.0.1:22765/collection1/
[junit4:junit4]   2> 15842 T75 oasc.ZkController.register No LogReplay needed for core=collection1 baseURL=http://127.0.0.1:59403
[junit4:junit4]   2> 15842 T75 oasc.ZkController.checkRecovery Core needs to recover:collection1
[junit4:junit4]   2> 15842 T75 oasu.DefaultSolrCoreState.doRecovery Running recovery - first canceling any ongoing recovery
[junit4:junit4]   2> ASYNC  NEW_CORE C1 name=collection1 org.apache.solr.core.SolrCore@1b32deb7 url=http://127.0.0.1:59403/collection1 node=127.0.0.1:59403_ C1_STATE=coll:collection1 core:collection1 props:{shard=null, roles=null, state=down, core=collection1, collection=collection1, node_name=127.0.0.1:59403_, base_url=http://127.0.0.1:59403}
[junit4:junit4]   2> 15849 T77 C1 P59403 oasc.RecoveryStrategy.run Starting recovery process.  core=collection1 recoveringAfterStartup=true
[junit4:junit4]   2> 15849 T75 oascc.ZkStateReader.updateClusterState Updating cloud state from ZooKeeper... 
[junit4:junit4]   2> 15849 T77 C1 P59403 oasc.RecoveryStrategy.doRecovery ###### startupVersions=[]
[junit4:junit4]   2> 15850 T77 C1 P59403 oasc.ZkController.publish publishing core=collection1 state=recovering
[junit4:junit4]   2> 15850 T77 C1 P59403 oasc.ZkController.publish numShards not found on descriptor - reading it from system property
[junit4:junit4]   2> 15850 T17 oass.SolrDispatchFilter.init user.dir=/usr/home/hudson/hudson-slave/workspace/Lucene-Solr-Tests-4.x-java7/solr/build/solr-core/test/J0
[junit4:junit4]   2> 15851 T17 oass.SolrDispatchFilter.init SolrDispatchFilter.init() done
[junit4:junit4]   2> 15851 T17 oascsi.HttpClientUtil.createClient Creating new http client, config:maxConnections=128&maxConnectionsPerHost=32&followRedirects=false
[junit4:junit4]   2> 15861 T77 C1 P59403 oascsi.HttpClientUtil.createClient Creating new http client, config:maxConnections=128&maxConnectionsPerHost=32&followRedirects=false
[junit4:junit4]   2> 16010 T17 oejs.Server.doStart jetty-8.1.8.v20121106
[junit4:junit4]   2> 16013 T17 oejs.AbstractConnector.doStart Started SocketConnector@127.0.0.1:48209
[junit4:junit4]   2> 16014 T17 oass.SolrDispatchFilter.init SolrDispatchFilter.init()
[junit4:junit4]   2> 16014 T17 oasc.SolrResourceLoader.locateSolrHome JNDI not configured for solr (NoInitialContextEx)
[junit4:junit4]   2> 16014 T17 oasc.SolrResourceLoader.locateSolrHome using system property solr.solr.home: /usr/home/hudson/hudson-slave/workspace/Lucene-Solr-Tests-4.x-java7/solr/build/solr-core/test/J0/./org.apache.solr.cloud.SyncSliceTest-jetty3-1359676574658
[junit4:junit4]   2> 16015 T17 oasc.CoreContainer$Initializer.initialize looking for solr.xml: /usr/home/hudson/hudson-slave/workspace/Lucene-Solr-Tests-4.x-java7/solr/build/solr-core/test/J0/./org.apache.solr.cloud.SyncSliceTest-jetty3-1359676574658/solr.xml
[junit4:junit4]   2> 16015 T17 oasc.CoreContainer.<init> New CoreContainer 638545826
[junit4:junit4]   2> 16016 T17 oasc.CoreContainer.load Loading CoreContainer using Solr Home: '/usr/home/hudson/hudson-slave/workspace/Lucene-Solr-Tests-4.x-java7/solr/build/solr-core/test/J0/./org.apache.solr.cloud.SyncSliceTest-jetty3-1359676574658/'
[junit4:junit4]   2> 16016 T17 oasc.SolrResourceLoader.<init> new SolrResourceLoader for directory: '/usr/home/hudson/hudson-slave/workspace/Lucene-Solr-Tests-4.x-java7/solr/build/solr-core/test/J0/./org.apache.solr.cloud.SyncSliceTest-jetty3-1359676574658/'
[junit4:junit4]   2> 16066 T17 oashc.HttpShardHandlerFactory.getParameter Setting socketTimeout to: 60000
[junit4:junit4]   2> 16067 T17 oashc.HttpShardHandlerFactory.getParameter Setting urlScheme to: http://
[junit4:junit4]   2> 16067 T17 oashc.HttpShardHandlerFactory.getParameter Setting connTimeout to: 15000
[junit4:junit4]   2> 16068 T17 oashc.HttpShardHandlerFactory.getParameter Setting maxConnectionsPerHost to: 20
[junit4:junit4]   2> 16068 T17 oashc.HttpShardHandlerFactory.getParameter Setting corePoolSize to: 0
[junit4:junit4]   2> 16069 T17 oashc.HttpShardHandlerFactory.getParameter Setting maximumPoolSize to: 2147483647
[junit4:junit4]   2> 16069 T17 oashc.HttpShardHandlerFactory.getParameter Setting maxThreadIdleTime to: 5
[junit4:junit4]   2> 16069 T17 oashc.HttpShardHandlerFactory.getParameter Setting sizeOfQueue to: -1
[junit4:junit4]   2> 16070 T17 oashc.HttpShardHandlerFactory.getParameter Setting fairnessPolicy to: false
[junit4:junit4]   2> 16070 T17 oascsi.HttpClientUtil.createClient Creating new http client, config:maxConnectionsPerHost=20&maxConnections=10000&socketTimeout=60000&connTimeout=15000&retry=false
[junit4:junit4]   2> 16089 T17 oasc.CoreContainer.load Registering Log Listener
[junit4:junit4]   2> 16107 T17 oasc.CoreContainer.initZooKeeper Zookeeper client=127.0.0.1:18121/solr
[junit4:junit4]   2> 16108 T17 oasc.ZkController.checkChrootPath zkHost includes chroot
[junit4:junit4]   2> 16108 T17 oaz.ZooKeeper.<init> Initiating client connection, connectString=127.0.0.1:18121 sessionTimeout=60000 watcher=org.apache.solr.common.cloud.ConnectionManager@2591e0c9
[junit4:junit4]   2> 16110 T17 oascc.ConnectionManager.waitForConnected Waiting for client to connect to ZooKeeper
[junit4:junit4]   2> 16110 T87 oaz.ClientCnxn$SendThread.logStartConnect Opening socket connection to server localhost/127.0.0.1:18121. Will not attempt to authenticate using SASL (access denied ("javax.security.auth.AuthPermission" "getLoginConfiguration"))
[junit4:junit4]   2> 16111 T87 oaz.ClientCnxn$SendThread.primeConnection Socket connection established to localhost/127.0.0.1:18121, initiating session
[junit4:junit4]   2> 16112 T19 oazs.NIOServerCnxnFactory.run Accepted socket connection from /140.211.11.196:15792
[junit4:junit4]   2> 16112 T19 oazs.ZooKeeperServer.processConnectRequest Client attempting to establish new session at /140.211.11.196:15792
[junit4:junit4]   2> 16116 T21 oazs.ZooKeeperServer.finishSessionInit Established session 0x13c9309ced10009 with negotiated timeout 20000 for client /140.211.11.196:15792
[junit4:junit4]   2> 16116 T87 oaz.ClientCnxn$SendThread.onConnected Session establishment complete on server localhost/127.0.0.1:18121, sessionid = 0x13c9309ced10009, negotiated timeout = 20000
[junit4:junit4]   2> 16117 T88 oascc.ConnectionManager.process Watcher org.apache.solr.common.cloud.ConnectionManager@2591e0c9 name:ZooKeeperConnection Watcher:127.0.0.1:18121 got event WatchedEvent state:SyncConnected type:None path:null path:null type:None
[junit4:junit4]   2> 16117 T17 oascc.ConnectionManager.waitForConnected Client is connected to ZooKeeper
[junit4:junit4]   2> 16119 T22 oazs.PrepRequestProcessor.pRequest2Txn Processed session termination for sessionid: 0x13c9309ced10009
[junit4:junit4]   2> 16120 T88 oaz.ClientCnxn$EventThread.run EventThread shut down
[junit4:junit4]   2> 16120 T19 oazs.NIOServerCnxn.closeSock Closed socket connection for client /140.211.11.196:15792 which had sessionid 0x13c9309ced10009
[junit4:junit4]   2> 16120 T17 oaz.ZooKeeper.close Session: 0x13c9309ced10009 closed
[junit4:junit4]   2> 16121 T17 oascsi.HttpClientUtil.createClient Creating new http client, config:maxConnections=500&maxConnectionsPerHost=16&socketTimeout=60000&connTimeout=15000
[junit4:junit4]   2> 16131 T17 oaz.ZooKeeper.<init> Initiating client connection, connectString=127.0.0.1:18121/solr sessionTimeout=30000 watcher=org.apache.solr.common.cloud.ConnectionManager@72a79a66
[junit4:junit4]   2> 16132 T17 oascc.ConnectionManager.waitForConnected Waiting for client to connect to ZooKeeper
[junit4:junit4]   2> 16132 T89 oaz.ClientCnxn$SendThread.logStartConnect Opening socket connection to server localhost/127.0.0.1:18121. Will not attempt to authenticate using SASL (access denied ("javax.security.auth.AuthPermission" "getLoginConfiguration"))
[junit4:junit4]   2> 16133 T89 oaz.ClientCnxn$SendThread.primeConnection Socket connection established to localhost/127.0.0.1:18121, initiating session
[junit4:junit4]   2> 16133 T19 oazs.NIOServerCnxnFactory.run Accepted socket connection from /140.211.11.196:12403
[junit4:junit4]   2> 16134 T19 oazs.ZooKeeperServer.processConnectRequest Client attempting to establish new session at /140.211.11.196:12403
[junit4:junit4]   2> 16135 T21 oazs.ZooKeeperServer.finishSessionInit Established session 0x13c9309ced1000a with negotiated timeout 20000 for client /140.211.11.196:12403
[junit4:junit4]   2> 16135 T89 oaz.ClientCnxn$SendThread.onConnected Session establishment complete on server localhost/127.0.0.1:18121, sessionid = 0x13c9309ced1000a, negotiated timeout = 20000
[junit4:junit4]   2> 16136 T90 oascc.ConnectionManager.process Watcher org.apache.solr.common.cloud.ConnectionManager@72a79a66 name:ZooKeeperConnection Watcher:127.0.0.1:18121/solr got event WatchedEvent state:SyncConnected type:None path:null path:null type:None
[junit4:junit4]   2> 16136 T17 oascc.ConnectionManager.waitForConnected Client is connected to ZooKeeper
[junit4:junit4]   2> 16138 T22 oazs.PrepRequestProcessor.pRequest Got user-level KeeperException when processing sessionid:0x13c9309ced1000a type:create cxid:0x1 zxid:0x80 txntype:-1 reqpath:n/a Error Path:/solr/overseer Error:KeeperErrorCode = NodeExists for /solr/overseer
[junit4:junit4]   2> 16139 T22 oazs.PrepRequestProcessor.pRequest Got user-level KeeperException when processing sessionid:0x13c9309ced1000a type:create cxid:0x2 zxid:0x81 txntype:-1 reqpath:n/a Error Path:/solr/overseer Error:KeeperErrorCode = NodeExists for /solr/overseer
[junit4:junit4]   2> 16146 T17 oasc.ZkController.createEphemeralLiveNode Register node as live in ZooKeeper:/live_nodes/127.0.0.1:48209_
[junit4:junit4]   2> 16147 T22 oazs.PrepRequestProcessor.pRequest Got user-level KeeperException when processing sessionid:0x13c9309ced1000a type:delete cxid:0x4 zxid:0x82 txntype:-1 reqpath:n/a Error Path:/solr/live_nodes/127.0.0.1:48209_ Error:KeeperErrorCode = NoNode for /solr/live_nodes/127.0.0.1:48209_
[junit4:junit4]   2> 16148 T17 oascc.SolrZkClient.makePath makePath: /live_nodes/127.0.0.1:48209_
[junit4:junit4]   2> 16151 T59 oascc.ZkStateReader$2.process A cluster state change: WatchedEvent state:SyncConnected type:NodeChildrenChanged path:/live_nodes, has occurred - updating... (live nodes size: 3)
[junit4:junit4]   2> 16152 T74 oascc.ZkStateReader$3.process Updating live nodes... (4)
[junit4:junit4]   2> 16152 T46 oascc.ZkStateReader$3.process Updating live nodes... (4)
[junit4:junit4]   2> 16152 T74 oascc.ZkStateReader$2.process A cluster state change: WatchedEvent state:SyncConnected type:NodeChildrenChanged path:/live_nodes, has occurred - updating... (live nodes size: 4)
[junit4:junit4]   2> 16153 T46 oascc.ZkStateReader$2.process A cluster state change: WatchedEvent state:SyncConnected type:NodeChildrenChanged path:/live_nodes, has occurred - updating... (live nodes size: 4)
[junit4:junit4]   2> 16153 T40 oascc.ZkStateReader$3.process Updating live nodes... (4)
[junit4:junit4]   2> 16153 T40 oascc.ZkStateReader$2.process A cluster state change: WatchedEvent state:SyncConnected type:NodeChildrenChanged path:/live_nodes, has occurred - updating... (live nodes size: 4)
[junit4:junit4]   2> 16156 T59 oascc.ZkStateReader$3.process Updating live nodes... (4)
[junit4:junit4]   2> 16158 T17 oascc.ZkStateReader.createClusterStateWatchersAndUpdate Updating cluster state from ZooKeeper... 
[junit4:junit4]   2> 16165 T91 oasc.CoreContainer.create Creating SolrCore 'collection1' using instanceDir: /usr/home/hudson/hudson-slave/workspace/Lucene-Solr-Tests-4.x-java7/solr/build/solr-core/test/J0/./org.apache.solr.cloud.SyncSliceTest-jetty3-1359676574658/collection1
[junit4:junit4]   2> 16166 T91 oasc.ZkController.createCollectionZkNode Check for collection zkNode:collection1
[junit4:junit4]   2> 16166 T91 oasc.ZkController.createCollectionZkNode Collection zkNode exists
[junit4:junit4]   2> 16167 T91 oasc.ZkController.readConfigName Load collection config from:/collections/collection1
[junit4:junit4]   2> 16168 T91 oasc.SolrResourceLoader.<init> new SolrResourceLoader for directory: '/usr/home/hudson/hudson-slave/workspace/Lucene-Solr-Tests-4.x-java7/solr/build/solr-core/test/J0/./org.apache.solr.cloud.SyncSliceTest-jetty3-1359676574658/collection1/'
[junit4:junit4]   2> 16170 T91 oasc.SolrResourceLoader.replaceClassLoader Adding 'file:/usr/home/hudson/hudson-slave/workspace/Lucene-Solr-Tests-4.x-java7/solr/build/solr-core/test/J0/org.apache.solr.cloud.SyncSliceTest-jetty3-1359676574658/collection1/lib/classes/' to classloader
[junit4:junit4]   2> 16170 T91 oasc.SolrResourceLoader.replaceClassLoader Adding 'file:/usr/home/hudson/hudson-slave/workspace/Lucene-Solr-Tests-4.x-java7/solr/build/solr-core/test/J0/org.apache.solr.cloud.SyncSliceTest-jetty3-1359676574658/collection1/lib/README' to classloader
[junit4:junit4]   2> 16260 T91 oasc.SolrConfig.<init> Using Lucene MatchVersion: LUCENE_42
[junit4:junit4]   2> 16350 T91 oasc.SolrConfig.<init> Loaded SolrConfig: solrconfig.xml
[junit4:junit4]   2> 16452 T91 oass.IndexSchema.readSchema Reading Solr Schema
[junit4:junit4]   2> 16493 T91 oass.IndexSchema.readSchema Schema name=test
[junit4:junit4]   2> 16878 T41 oascc.ZkStateReader.updateClusterState Updating cloud state from ZooKeeper... 
[junit4:junit4]   2> 16880 T41 oasc.Overseer$ClusterStateUpdater.updateState Update state numShards=1 message={
[junit4:junit4]   2> 	  "operation":"state",
[junit4:junit4]   2> 	  "numShards":"1",
[junit4:junit4]   2> 	  "shard":"shard1",
[junit4:junit4]   2> 	  "roles":null,
[junit4:junit4]   2> 	  "state":"recovering",
[junit4:junit4]   2> 	  "core":"collection1",
[junit4:junit4]   2> 	  "collection":"collection1",
[junit4:junit4]   2> 	  "node_name":"127.0.0.1:59403_",
[junit4:junit4]   2> 	  "base_url":"http://127.0.0.1:59403"}
[junit4:junit4]   2> 16907 T59 oascc.ZkStateReader$2.process A cluster state change: WatchedEvent state:SyncConnected type:NodeDataChanged path:/clusterstate.json, has occurred - updating... (live nodes size: 4)
[junit4:junit4]   2> 16907 T90 oascc.ZkStateReader$2.process A cluster state change: WatchedEvent state:SyncConnected type:NodeDataChanged path:/clusterstate.json, has occurred - updating... (live nodes size: 4)
[junit4:junit4]   2> 16907 T46 oascc.ZkStateReader$2.process A cluster state change: WatchedEvent state:SyncConnected type:NodeDataChanged path:/clusterstate.json, has occurred - updating... (live nodes size: 4)
[junit4:junit4]   2> 16907 T40 oascc.ZkStateReader$2.process A cluster state change: WatchedEvent state:SyncConnected type:NodeDataChanged path:/clusterstate.json, has occurred - updating... (live nodes size: 4)
[junit4:junit4]   2> 16907 T74 oascc.ZkStateReader$2.process A cluster state change: WatchedEvent state:SyncConnected type:NodeDataChanged path:/clusterstate.json, has occurred - updating... (live nodes size: 4)
[junit4:junit4]   2> 17212 T91 oass.OpenExchangeRatesOrgProvider.init Initialized with rates=open-exchange-rates.json, refreshInterval=1440.
[junit4:junit4]   2> 17232 T91 oass.IndexSchema.readSchema default search field in schema is text
[junit4:junit4]   2> 17237 T91 oass.IndexSchema.readSchema unique key field: id
[junit4:junit4]   2> 17275 T91 oass.FileExchangeRateProvider.reload Reloading exchange rates from file currency.xml
[junit4:junit4]   2> 17289 T91 oass.FileExchangeRateProvider.reload Reloading exchange rates from file currency.xml
[junit4:junit4]   2> 17294 T91 oass.OpenExchangeRatesOrgProvider.reload Reloading exchange rates from open-exchange-rates.json
[junit4:junit4]   2> 17296 T91 oass.OpenExchangeRatesOrgProvider.reload Reloading exchange rates from open-exchange-rates.json
[junit4:junit4]   2> 17298 T91 oasc.SolrCore.<init> [collection1] Opening new SolrCore at /usr/home/hudson/hudson-slave/workspace/Lucene-Solr-Tests-4.x-java7/solr/build/solr-core/test/J0/./org.apache.solr.cloud.SyncSliceTest-jetty3-1359676574658/collection1/, dataDir=./org.apache.solr.cloud.SyncSliceTest-1359676558800/jetty3/
[junit4:junit4]   2> 17299 T91 oasc.JmxMonitoredMap.<init> JMX monitoring is enabled. Adding Solr mbeans to JMX Server: com.sun.jmx.mbeanserver.JmxMBeanServer@6478c466
[junit4:junit4]   2> 17299 T91 oasc.SolrCore.initDirectoryFactory solr.NRTCachingDirectoryFactory
[junit4:junit4]   2> 17300 T91 oasc.CachingDirectoryFactory.get return new directory for /usr/home/hudson/hudson-slave/workspace/Lucene-Solr-Tests-4.x-java7/solr/build/solr-core/test/J0/./org.apache.solr.cloud.SyncSliceTest-1359676558800/jetty3 forceNew:false
[junit4:junit4]   2> 17301 T91 oasc.CachingDirectoryFactory.close Releasing directory:/usr/home/hudson/hudson-slave/workspace/Lucene-Solr-Tests-4.x-java7/solr/build/solr-core/test/J0/./org.apache.solr.cloud.SyncSliceTest-1359676558800/jetty3
[junit4:junit4]   2> 17301 T91 oasc.SolrCore.getNewIndexDir New index directory detected: old=null new=./org.apache.solr.cloud.SyncSliceTest-1359676558800/jetty3/index/
[junit4:junit4]   2> 17302 T91 oasc.SolrCore.initIndex WARNING [collection1] Solr index directory './org.apache.solr.cloud.SyncSliceTest-1359676558800/jetty3/index' doesn't exist. Creating new index...
[junit4:junit4]   2> 17303 T91 oasc.CachingDirectoryFactory.get return new directory for /usr/home/hudson/hudson-slave/workspace/Lucene-Solr-Tests-4.x-java7/solr/build/solr-core/test/J0/./org.apache.solr.cloud.SyncSliceTest-1359676558800/jetty3/index forceNew:false
[junit4:junit4]   2> 17308 T91 oasc.SolrDeletionPolicy.onCommit SolrDeletionPolicy.onCommit: commits:num=1
[junit4:junit4]   2> 		commit{dir=RateLimitedDirectoryWrapper(NRTCachingDirectory(org.apache.lucene.store.NIOFSDirectory@/usr/home/hudson/hudson-slave/workspace/Lucene-Solr-Tests-4.x-java7/solr/build/solr-core/test/J0/org.apache.solr.cloud.SyncSliceTest-1359676558800/jetty3/index lockFactory=org.apache.lucene.store.NativeFSLockFactory@37203df2; maxCacheMB=48.0 maxMergeSizeMB=4.0)),segFN=segments_1,generation=1,filenames=[segments_1]
[junit4:junit4]   2> 17309 T91 oasc.SolrDeletionPolicy.updateCommits newest commit = 1[segments_1]
[junit4:junit4]   2> 17310 T91 oasc.CachingDirectoryFactory.close Releasing directory:/usr/home/hudson/hudson-slave/workspace/Lucene-Solr-Tests-4.x-java7/solr/build/solr-core/test/J0/./org.apache.solr.cloud.SyncSliceTest-1359676558800/jetty3/index
[junit4:junit4]   2> 17310 T91 oasc.SolrCore.initWriters created xml: solr.XMLResponseWriter
[junit4:junit4]   2> 17313 T91 oasup.UpdateRequestProcessorChain.init inserting DistributedUpdateProcessorFactory into updateRequestProcessorChain "dedupe"
[junit4:junit4]   2> 17313 T91 oasup.UpdateRequestProcessorChain.init inserting DistributedUpdateProcessorFactory into updateRequestProcessorChain "dedupe-allfields"
[junit4:junit4]   2> 17313 T91 oasup.UpdateRequestProcessorChain.init inserting DistributedUpdateProcessorFactory into updateRequestProcessorChain "stored_sig"
[junit4:junit4]   2> 17314 T91 oasup.UpdateRequestProcessorChain.init inserting DistributedUpdateProcessorFactory into updateRequestProcessorChain "uniq-fields"
[junit4:junit4]   2> 17314 T91 oasup.UpdateRequestProcessorChain.init inserting DistributedUpdateProcessorFactory into updateRequestProcessorChain "distrib-dup-test-chain-implicit"
[junit4:junit4]   2> 17315 T91 oasc.RequestHandlers.initHandlersFromConfig adding lazy requestHandler: solr.ReplicationHandler
[junit4:junit4]   2> 17315 T91 oasc.RequestHandlers.initHandlersFromConfig created /replication: solr.ReplicationHandler
[junit4:junit4]   2> 17316 T91 oasc.RequestHandlers.initHandlersFromConfig created standard: solr.StandardRequestHandler
[junit4:junit4]   2> 17317 T91 oasc.RequestHandlers.initHandlersFromConfig created /get: solr.RealTimeGetHandler
[junit4:junit4]   2> 17318 T91 oasc.RequestHandlers.initHandlersFromConfig created dismax: solr.SearchHandler
[junit4:junit4]   2> 17319 T91 oasc.RequestHandlers.initHandlersFromConfig created mock: org.apache.solr.core.MockQuerySenderListenerReqHandler
[junit4:junit4]   2> 17319 T91 oasc.RequestHandlers.initHandlersFromConfig created /admin/: org.apache.solr.handler.admin.AdminHandlers
[junit4:junit4]   2> 17320 T91 oasc.RequestHandlers.initHandlersFromConfig created defaults: solr.StandardRequestHandler
[junit4:junit4]   2> 17320 T91 oasc.RequestHandlers.initHandlersFromConfig adding lazy requestHandler: solr.StandardRequestHandler
[junit4:junit4]   2> 17321 T91 oasc.RequestHandlers.initHandlersFromConfig created lazy: solr.StandardRequestHandler
[junit4:junit4]   2> 17322 T91 oasc.RequestHandlers.initHandlersFromConfig created /update: solr.UpdateRequestHandler
[junit4:junit4]   2> 17323 T91 oasc.RequestHandlers.initHandlersFromConfig created /terms: org.apache.solr.handler.component.SearchHandler
[junit4:junit4]   2> 17324 T91 oasc.RequestHandlers.initHandlersFromConfig created spellCheckCompRH: org.apache.solr.handler.component.SearchHandler
[junit4:junit4]   2> 17324 T91 oasc.RequestHandlers.initHandlersFromConfig created spellCheckCompRH_Direct: org.apache.solr.handler.component.SearchHandler
[junit4:junit4]   2> 17325 T91 oasc.RequestHandlers.initHandlersFromConfig created spellCheckWithWordbreak: org.apache.solr.handler.component.SearchHandler
[junit4:junit4]   2> 17326 T91 oasc.RequestHandlers.initHandlersFromConfig created spellCheckWithWordbreak_Direct: org.apache.solr.handler.component.SearchHandler
[junit4:junit4]   2> 17327 T91 oasc.RequestHandlers.initHandlersFromConfig created spellCheckCompRH1: org.apache.solr.handler.component.SearchHandler
[junit4:junit4]   2> 17328 T91 oasc.RequestHandlers.initHandlersFromConfig created mltrh: org.apache.solr.handler.component.SearchHandler
[junit4:junit4]   2> 17329 T91 oasc.RequestHandlers.initHandlersFromConfig created tvrh: org.apache.solr.handler.component.SearchHandler
[junit4:junit4]   2> 17330 T91 oasc.RequestHandlers.initHandlersFromConfig created /mlt: solr.MoreLikeThisHandler
[junit4:junit4]   2> 17331 T91 oasc.RequestHandlers.initHandlersFromConfig created /debug/dump: solr.DumpRequestHandler
[junit4:junit4]   2> 17340 T91 oashl.XMLLoader.init xsltCacheLifetimeSeconds=60
[junit4:junit4]   2> 17344 T91 oasc.SolrCore.initDeprecatedSupport WARNING solrconfig.xml uses deprecated <admin/gettableFiles>, Please update your config to use the ShowFileRequestHandler.
[junit4:junit4]   2> 17346 T91 oasc.SolrCore.initDeprecatedSupport WARNING adding ShowFileRequestHandler with hidden files: [SCHEMA.XML, OLD_SYNONYMS.TXT, STOPWORDS.TXT, PROTWORDS.TXT, OPEN-EXCHANGE-RATES.JSON, SYNONYMS.TXT, CURRENCY.XML, MAPPING-ISOLATIN1ACCENT.TXT]
[junit4:junit4]   2> 17348 T91 oasc.CachingDirectoryFactory.close Releasing directory:/usr/home/hudson/hudson-slave/workspace/Lucene-Solr-Tests-4.x-java7/solr/build/solr-core/test/J0/./org.apache.solr.cloud.SyncSliceTest-1359676558800/jetty3
[junit4:junit4]   2> 17350 T91 oass.SolrIndexSearcher.<init> Opening Searcher@13603899 main
[junit4:junit4]   2> 17351 T91 oasu.CommitTracker.<init> Hard AutoCommit: disabled
[junit4:junit4]   2> 17351 T91 oasu.CommitTracker.<init> Soft AutoCommit: disabled
[junit4:junit4]   2> 17352 T91 oashc.SpellCheckComponent.inform Initializing spell checkers
[junit4:junit4]   2> 17358 T91 oass.DirectSolrSpellChecker.init init: {name=direct,classname=DirectSolrSpellChecker,field=lowerfilt,minQueryLength=3}
[junit4:junit4]   2> 17410 T92 oasc.SolrCore.registerSearcher [collection1] Registered new searcher Searcher@13603899 main{StandardDirectoryReader(segments_1:1)}
[junit4:junit4]   2> 17421 T91 oasc.ZkController.publish publishing core=collection1 state=down
[junit4:junit4]   2> 17422 T91 oasc.ZkController.publish numShards not found on descriptor - reading it from system property
[junit4:junit4]   2> 18416 T41 oascc.ZkStateReader.updateClusterState Updating cloud state from ZooKeeper... 
[junit4:junit4]   2> 18417 T41 oasc.Overseer$ClusterStateUpdater.updateState Update state numShards=1 message={
[junit4:junit4]   2> 	  "operation":"state",
[junit4:junit4]   2> 	  "numShards":"1",
[junit4:junit4]   2> 	  "shard":null,
[junit4:junit4]   2> 	  "roles":null,
[junit4:junit4]   2> 	  "state":"down",
[junit4:junit4]   2> 	  "core":"collection1",
[junit4:junit4]   2> 	  "collection":"collection1",
[junit4:junit4]   2> 	  "node_name":"127.0.0.1:48209_",
[junit4:junit4]   2> 	  "base_url":"http://127.0.0.1:48209"}
[junit4:junit4]   2> 18418 T41 oasc.Overseer$ClusterStateUpdater.updateState Collection already exists with numShards=1
[junit4:junit4]   2> 18418 T41 oasc.Overseer$ClusterStateUpdater.updateState Assigning new node to shard shard=shard1
[junit4:junit4]   2> 18472 T59 oascc.ZkStateReader$2.process A cluster state change: WatchedEvent state:SyncConnected type:NodeDataChanged path:/clusterstate.json, has occurred - updating... (live nodes size: 4)
[junit4:junit4]   2> 18472 T46 oascc.ZkStateReader$2.process A cluster state change: WatchedEvent state:SyncConnected type:NodeDataChanged path:/clusterstate.json, has occurred - updating... (live nodes size: 4)
[junit4:junit4]   2> 18472 T74 oascc.ZkStateReader$2.process A cluster state change: WatchedEvent state:SyncConnected type:NodeDataChanged path:/clusterstate.json, has occurred - updating... (live nodes size: 4)
[junit4:junit4]   2> 18472 T40 oascc.ZkStateReader$2.process A cluster state change: WatchedEvent state:SyncConnected type:NodeDataChanged path:/clusterstate.json, has occurred - updating... (live nodes size: 4)
[junit4:junit4]   2> 18472 T90 oascc.ZkStateReader$2.process A cluster state change: WatchedEvent state:SyncConnected type:NodeDataChanged path:/clusterstate.json, has occurred - updating... (live nodes size: 4)
[junit4:junit4]   2>  C1_STATE=coll:collection1 core:collection1 props:{shard=shard1, roles=null, state=recovering, core=collection1, collection=collection1, node_name=127.0.0.1:59403_, base_url=http://127.0.0.1:59403}
[junit4:junit4]   2> 19261 T77 C1 P59403 oasc.RecoveryStrategy.doRecovery Attempting to PeerSync from http://127.0.0.1:22765/collection1/ core=collection1 - recoveringAfterStartup=true
[junit4:junit4]   2> 19271 T77 C1 P59403 oascsi.HttpClientUtil.createClient Creating new http client, config:maxConnectionsPerHost=20&maxConnections=10000&connTimeout=30000&socketTimeout=30000&retry=false
[junit4:junit4]   2> 19300 T77 C1 P59403 oasu.PeerSync.sync PeerSync: core=collection1 url=http://127.0.0.1:59403 START replicas=[http://127.0.0.1:22765/collection1/] nUpdates=100
[junit4:junit4]   2> 19311 T77 C1 P59403 oasu.PeerSync.sync WARNING no frame of reference to tell of we've missed updates
[junit4:junit4]   2> 19312 T77 C1 P59403 oasc.RecoveryStrategy.doRecovery PeerSync Recovery was not successful - trying replication. core=collection1
[junit4:junit4]   2> 19313 T77 C1 P59403 oasc.RecoveryStrategy.doRecovery Starting Replication Recovery. core=collection1
[junit4:junit4]   2> 19313 T77 C1 P59403 oasc.RecoveryStrategy.doRecovery Begin buffering updates. core=collection1
[junit4:junit4]   2> 19313 T77 C1 P59403 oasu.UpdateLog.bufferUpdates Starting to buffer updates. FSUpdateLog{state=ACTIVE, tlog=null}
[junit4:junit4]   2> 19314 T77 C1 P59403 oasc.RecoveryStrategy.replicate Attempting to replicate from http://127.0.0.1:22765/collection1/. core=collection1
[junit4:junit4]   2> 19314 T77 C1 P59403 oascsi.HttpClientUtil.createClient Creating new http client, config:maxConnections=128&maxConnectionsPerHost=32&followRedirects=false
[junit4:junit4]   2> ASYNC  NEW_CORE C2 name=collection1 org.apache.solr.core.SolrCore@34aad3ab url=http://127.0.0.1:22765/collection1 node=127.0.0.1:22765_ C2_STATE=coll:collection1 core:collection1 props:{shard=shard1, roles=null, state=active, core=collection1, collection=collection1, node_name=127.0.0.1:22765_, base_url=http://127.0.0.1:22765, leader=true}
[junit4:junit4]   2> 19382 T51 C2 P22765 REQ /get {getVersions=100&distrib=false&wt=javabin&qt=/get&version=2} status=0 QTime=10 
[junit4:junit4]   2> 19403 T50 C2 P22765 oasu.DirectUpdateHandler2.commit start commit{,optimize=false,openSearcher=false,waitSearcher=true,expungeDeletes=false,softCommit=false}
[junit4:junit4]   2> 19404 T50 C2 P22765 oasc.CachingDirectoryFactory.close Releasing directory:/usr/home/hudson/hudson-slave/workspace/Lucene-Solr-Tests-4.x-java7/solr/build/solr-core/test/J0/./org.apache.solr.cloud.SyncSliceTest-1359676558800/jetty1
[junit4:junit4]   2> 19409 T50 C2 P22765 oasc.SolrDeletionPolicy.onInit SolrDeletionPolicy.onInit: commits:num=1
[junit4:junit4]   2> 		commit{dir=RateLimitedDirectoryWrapper(NRTCachingDirectory(org.apache.lucene.store.NIOFSDirectory@/usr/home/hudson/hudson-slave/workspace/Lucene-Solr-Tests-4.x-java7/solr/build/solr-core/test/J0/org.apache.solr.cloud.SyncSliceTest-1359676558800/jetty1/index lockFactory=org.apache.lucene.store.NativeFSLockFactory@32ffe6b5; maxCacheMB=48.0 maxMergeSizeMB=4.0)),segFN=segments_1,generation=1,filenames=[segments_1]
[junit4:junit4]   2> 19410 T50 C2 P22765 oasc.SolrDeletionPolicy.updateCommits newest commit = 1[segments_1]
[junit4:junit4]   2> 19415 T50 C2 P22765 oasc.SolrDeletionPolicy.onCommit SolrDeletionPolicy.onCommit: commits:num=2
[junit4:junit4]   2> 		commit{dir=RateLimitedDirectoryWrapper(NRTCachingDirectory(org.apache.lucene.store.NIOFSDirectory@/usr/home/hudson/hudson-slave/workspace/Lucene-Solr-Tests-4.x-java7/solr/build/solr-core/test/J0/org.apache.solr.cloud.SyncSliceTest-1359676558800/jetty1/index lockFactory=org.apache.lucene.store.NativeFSLockFactory@32ffe6b5; maxCacheMB=48.0 maxMergeSizeMB=4.0)),segFN=segments_1,generation=1,filenames=[segments_1]
[junit4:junit4]   2> 		commit{dir=RateLimitedDirectoryWrapper(NRTCachingDirectory(org.apache.lucene.store.NIOFSDirectory@/usr/home/hudson/hudson-slave/workspace/Lucene-Solr-Tests-4.x-java7/solr/build/solr-core/test/J0/org.apache.solr.cloud.SyncSliceTest-1359676558800/jetty1/index lockFactory=org.apache.lucene.store.NativeFSLockFactory@32ffe6b5; maxCacheMB=48.0 maxMergeSizeMB=4.0)),segFN=segments_2,generation=2,filenames=[segments_2]
[junit4:junit4]   2> 19416 T50 C2 P22765 oasc.SolrDeletionPolicy.updateCommits newest commit = 2[segments_2]
[junit4:junit4]   2> 19418 T50 C2 P22765 oasc.CachingDirectoryFactory.close Releasing directory:/usr/home/hudson/hudson-slave/workspace/Lucene-Solr-Tests-4.x-java7/solr/build/solr-core/test/J0/./org.apache.solr.cloud.SyncSliceTest-1359676558800/jetty1
[junit4:junit4]   2> 19418 T50 C2 P22765 oass.SolrIndexSearcher.<init> Opening Searcher@1ed408f0 realtime
[junit4:junit4]   2> 19419 T50 C2 P22765 oasu.DirectUpdateHandler2.commit end_commit_flush
[junit4:junit4]   2> 19420 T50 C2 P22765 /update {waitSearcher=true&openSearcher=false&commit=true&wt=javabin&commit_end_point=true&version=2&softCommit=false} {commit=} 0 48
[junit4:junit4]   2> 19426 T91 oasc.CoreContainer.registerCore registering core: collection1
[junit4:junit4]   2> 19426 T91 oasc.ZkController.register Register replica - core:collection1 address:http://127.0.0.1:48209 collection:collection1 shard:shard1
[junit4:junit4]   2> 19432 T91 oasc.ZkController.register We are http://127.0.0.1:48209/collection1/ and leader is http://127.0.0.1:22765/collection1/
[junit4:junit4]   2> 19433 T91 oasc.ZkController.register No LogReplay needed for core=collection1 baseURL=http://127.0.0.1:48209
[junit4:junit4]   2> 19433 T91 oasc.ZkController.checkRecovery Core needs to recover:collection1
[junit4:junit4]   2> 19433 T91 oasu.DefaultSolrCoreState.doRecovery Running recovery - first canceling any ongoing recovery
[junit4:junit4]   2> ASYNC  NEW_CORE C3 name=collection1 org.apache.solr.core.SolrCore@2473cfe2 url=http://127.0.0.1:48209/collection1 node=127.0.0.1:48209_ C3_STATE=coll:collection1 core:collection1 props:{shard=null, roles=null, state=down, core=collection1, collection=collection1, node_name=127.0.0.1:48209_, base_url=http://127.0.0.1:48209}
[junit4:junit4]   2> 19434 T94 C3 P48209 oasc.RecoveryStrategy.run Starting recovery process.  core=collection1 recoveringAfterStartup=true
[junit4:junit4]   2> 19435 T94 C3 P48209 oasc.RecoveryStrategy.doRecovery ###### startupVersions=[]
[junit4:junit4]   2> 19435 T91 oascc.ZkStateReader.updateClusterState Updating cloud state from ZooKeeper... 
[junit4:junit4]   2> 19435 T94 C3 P48209 oasc.ZkController.publish publishing core=collection1 state=recovering
[junit4:junit4]   2> 19436 T94 C3 P48209 oasc.ZkController.publish numShards not found on descriptor - reading it from system property
[junit4:junit4]   2> 19437 T17 oass.SolrDispatchFilter.init user.dir=/usr/home/hudson/hudson-slave/workspace/Lucene-Solr-Tests-4.x-java7/solr/build/solr-core/test/J0
[junit4:junit4]   2> 19438 T17 oass.SolrDispatchFilter.init SolrDispatchFilter.init() done
[junit4:junit4]   2> 19439 T94 C3 P48209 oascsi.HttpClientUtil.createClient Creating new http client, config:maxConnections=128&maxConnectionsPerHost=32&followRedirects=false
[junit4:junit4]   2> 19439 T17 oascsi.HttpClientUtil.createClient Creating new http client, config:maxConnections=128&maxConnectionsPerHost=32&followRedirects=false
[junit4:junit4]   2> 19504 T77 C1 P59403 oash.ReplicationHandler.inform Commits will be reserved for  10000
[junit4:junit4]   2> 19504 T77 C1 P59403 oascsi.HttpClientUtil.createClient Creating new http client, config:connTimeout=5000&socketTimeout=20000&allowCompression=false&maxConnections=10000&maxConnectionsPerHost=10000
[junit4:junit4]   2> 19535 T77 C1 P59403 oash.SnapPuller.<init>  No value set for 'pollInterval'. Timer Task not started.
[junit4:junit4]   2> 19631 T53 C2 P22765 oash.ReplicationHandler.inform Commits will be reserved for  10000
[junit4:junit4]   2> 19633 T53 C2 P22765 REQ /replication {command=indexversion&qt=/replication&wt=javabin&version=2} status=0 QTime=95 
[junit4:junit4]   2> 19635 T77 C1 P59403 oash.SnapPuller.fetchLatestIndex Master's generation: 2
[junit4:junit4]   2> 19636 T77 C1 P59403 oash.SnapPuller.fetchLatestIndex Slave's generation: 1
[junit4:junit4]   2> 19636 T77 C1 P59403 oash.SnapPuller.fetchLatestIndex Starting replication process
[junit4:junit4]   2> 19641 T53 C2 P22765 oasc.CachingDirectoryFactory.close Releasing directory:/usr/home/hudson/hudson-slave/workspace/Lucene-Solr-Tests-4.x-java7/solr/build/solr-core/test/J0/./org.apache.solr.cloud.SyncSliceTest-1359676558800/jetty1
[junit4:junit4]   2> 19643 T53 C2 P22765 oasc.CachingDirectoryFactory.close Releasing directory:/usr/home/hudson/hudson-slave/workspace/Lucene-Solr-Tests-4.x-java7/solr/build/solr-core/test/J0/./org.apache.solr.cloud.SyncSliceTest-1359676558800/jetty1/index
[junit4:junit4]   2> 19643 T53 C2 P22765 REQ /replication {command=filelist&qt=/replication&wt=javabin&generation=2&version=2} status=0 QTime=3 
[junit4:junit4]   2> 19645 T77 C1 P59403 oash.SnapPuller.fetchLatestIndex Number of files in latest index in master: 1
[junit4:junit4]   2> 19648 T77 C1 P59403 oasc.CachingDirectoryFactory.get return new directory for /usr/home/hudson/hudson-slave/workspace/Lucene-Solr-Tests-4.x-java7/solr/build/solr-core/test/J0/./org.apache.solr.cloud.SyncSliceTest-1359676558800/jetty2/index.20130131205618438 forceNew:false
[junit4:junit4]   2> 19649 T77 C1 P59403 oasc.CachingDirectoryFactory.close Releasing directory:/usr/home/hudson/hudson-slave/workspace/Lucene-Solr-Tests-4.x-java7/solr/build/solr-core/test/J0/./org.apache.solr.cloud.SyncSliceTest-1359676558800/jetty2
[junit4:junit4]   2> 19650 T77 C1 P59403 oash.SnapPuller.fetchLatestIndex Starting download to RateLimitedDirectoryWrapper(NRTCachingDirectory(org.apache.lucene.store.NIOFSDirectory@/usr/home/hudson/hudson-slave/workspace/Lucene-Solr-Tests-4.x-java7/solr/build/solr-core/test/J0/org.apache.solr.cloud.SyncSliceTest-1359676558800/jetty2/index.20130131205618438 lockFactory=org.apache.lucene.store.NativeFSLockFactory@7a147237; maxCacheMB=48.0 maxMergeSizeMB=4.0)) fullCopy=true
[junit4:junit4]   2> 19668 T53 C2 P22765 REQ /replication {file=segments_2&command=filecontent&checksum=true&wt=filestream&qt=/replication&generation=2} status=0 QTime=8 
[junit4:junit4]   2> 19686 T77 C1 P59403 oasc.CachingDirectoryFactory.close Releasing directory:/usr/home/hudson/hudson-slave/workspace/Lucene-Solr-Tests-4.x-java7/solr/build/solr-core/test/J0/./org.apache.solr.cloud.SyncSliceTest-1359676558800/jetty2/index
[junit4:junit4]   2> 19687 T77 C1 P59403 oash.SnapPuller.fetchLatestIndex Total time taken for download : 0 secs
[junit4:junit4]   2> 19695 T77 C1 P59403 oash.SnapPuller.modifyIndexProps New index installed. Updating index properties... index=index.20130131205618438
[junit4:junit4]   2> 19702 T77 C1 P59403 oasc.CachingDirectoryFactory.close Releasing directory:/usr/home/hudson/hudson-slave/workspace/Lucene-Solr-Tests-4.x-java7/solr/build/solr-core/test/J0/./org.apache.solr.cloud.SyncSliceTest-1359676558800/jetty2
[junit4:junit4]   2> 19703 T77 C1 P59403 oasc.CachingDirectoryFactory.close Releasing directory:/usr/home/hudson/hudson-slave/workspace/Lucene-Solr-Tests-4.x-java7/solr/build/solr-core/test/J0/./org.apache.solr.cloud.SyncSliceTest-1359676558800/jetty2
[junit4:junit4]   2> 19704 T77 C1 P59403 oasc.SolrCore.getNewIndexDir New index directory detected: old=./org.apache.solr.cloud.SyncSliceTest-1359676558800/jetty2/index/ new=./org.apache.solr.cloud.SyncSliceTest-1359676558800/jetty2/index.20130131205618438
[junit4:junit4]   2> 19708 T17 oejs.Server.doStart jetty-8.1.8.v20121106
[junit4:junit4]   2> 19711 T77 C1 P59403 oasc.SolrDeletionPolicy.onInit SolrDeletionPolicy.onInit: commits:num=1
[junit4:junit4]   2> 		commit{dir=RateLimitedDirectoryWrapper(NRTCachingDirectory(org.apache.lucene.store.NIOFSDirectory@/usr/home/hudson/hudson-slave/workspace/Lucene-Solr-Tests-4.x-java7/solr/build/solr-core/test/J0/org.apache.solr.cloud.SyncSliceTest-1359676558800/jetty2/index.20130131205618438 lockFactory=org.apache.lucene.store.NativeFSLockFactory@7a147237; maxCacheMB=48.0 maxMergeSizeMB=4.0)),segFN=segments_2,generation=2,filenames=[segments_2]
[junit4:junit4]   2> 19711 T17 oejs.AbstractConnector.doStart Started SocketConnector@127.0.0.1:11837
[junit4:junit4]   2> 19712 T77 C1 P59403 oasc.SolrDeletionPolicy.updateCommits newest commit = 2[segments_2]
[junit4:junit4]   2> 19713 T17 oass.SolrDispatchFilter.init SolrDispatchFilter.init()
[junit4:junit4]   2> 19713 T17 oasc.SolrResourceLoader.locateSolrHome JNDI not configured for solr (NoInitialContextEx)
[junit4:junit4]   2> 19714 T17 oasc.SolrResourceLoader.locateSolrHome using system property solr.solr.home: /usr/home/hudson/hudson-slave/workspace/Lucene-Solr-Tests-4.x-java7/solr/build/solr-core/test/J0/./org.apache.solr.cloud.SyncSliceTest-jetty4-1359676578263
[junit4:junit4]   2> 19714 T17 oasc.CoreContainer$Initializer.initialize looking for solr.xml: /usr/home/hudson/hudson-slave/workspace/Lucene-Solr-Tests-4.x-java7/solr/build/solr-core/test/J0/./org.apache.solr.cloud.SyncSliceTest-jetty4-1359676578263/solr.xml
[junit4:junit4]   2> 19715 T77 C1 P59403 oasc.CachingDirectoryFactory.close Releasing directory:/usr/home/hudson/hudson-slave/workspace/Lucene-Solr-Tests-4.x-java7/solr/build/solr-core/test/J0/./org.apache.solr.cloud.SyncSliceTest-1359676558800/jetty2
[junit4:junit4]   2> 19715 T17 oasc.CoreContainer.<init> New CoreContainer 1227163290
[junit4:junit4]   2> 19716 T17 oasc.CoreContainer.load Loading CoreContainer using Solr Home: '/usr/home/hudson/hudson-slave/workspace/Lucene-Solr-Tests-4.x-java7/solr/build/solr-core/test/J0/./org.apache.solr.cloud.SyncSliceTest-jetty4-1359676578263/'
[junit4:junit4]   2> 19717 T17 oasc.SolrResourceLoader.<init> new SolrResourceLoader for directory: '/usr/home/hudson/hudson-slave/workspace/Lucene-Solr-Tests-4.x-java7/solr/build/solr-core/test/J0/./org.apache.solr.cloud.SyncSliceTest-jetty4-1359676578263/'
[junit4:junit4]   2> 19723 T77 C1 P59403 oasu.DefaultSolrCoreState.newIndexWriter Creating new IndexWriter...
[junit4:junit4]   2> 19723 T77 C1 P59403 oasu.DefaultSolrCoreState.newIndexWriter Waiting until IndexWriter is unused... core=collection1
[junit4:junit4]   2> 19724 T77 C1 P59403 oasu.DefaultSolrCoreState.newIndexWriter Rollback old IndexWriter... core=collection1
[junit4:junit4]   2> 19726 T77 C1 P59403 oasc.CachingDirectoryFactory.close Releasing directory:/usr/home/hudson/hudson-slave/workspace/Lucene-Solr-Tests-4.x-java7/solr/build/solr-core/test/J0/./org.apache.solr.cloud.SyncSliceTest-1359676558800/jetty2/index.20130131205618438
[junit4:junit4]   2> 19727 T77 C1 P59403 oasc.CachingDirectoryFactory.close Releasing directory:/usr/home/hudson/hudson-slave/workspace/Lucene-Solr-Tests-4.x-java7/solr/build/solr-core/test/J0/./org.apache.solr.cloud.SyncSliceTest-1359676558800/jetty2
[junit4:junit4]   2> 19734 T77 C1 P59403 oasc.SolrDeletionPolicy.onInit SolrDeletionPolicy.onInit: commits:num=1
[junit4:junit4]   2> 		commit{dir=RateLimitedDirectoryWrapper(NRTCachingDirectory(org.apache.lucene.store.NIOFSDirectory@/usr/home/hudson/hudson-slave/workspace/Lucene-Solr-Tests-4.x-java7/solr/build/solr-core/test/J0/org.apache.solr.cloud.SyncSliceTest-1359676558800/jetty2/index.20130131205618438 lockFactory=org.apache.lucene.store.NativeFSLockFactory@7a147237; maxCacheMB=48.0 maxMergeSizeMB=4.0)),segFN=segments_2,generation=2,filenames=[segments_2]
[junit4:junit4]   2> 19735 T77 C1 P59403 oasc.SolrDeletionPolicy.updateCommits newest commit = 2[segments_2]
[junit4:junit4]   2> 19735 T77 C1 P59403 oasu.DefaultSolrCoreState.newIndexWriter New IndexWriter is ready to be used.
[junit4:junit4]   2> 19737 T77 C1 P59403 oasc.CachingDirectoryFactory.close Releasing directory:/usr/home/hudson/hudson-slave/workspace/Lucene-Solr-Tests-4.x-java7/solr/build/solr-core/test/J0/./org.apache.solr.cloud.SyncSliceTest-1359676558800/jetty2
[junit4:junit4]   2> 19738 T77 C1 P59403 oass.SolrIndexSearcher.<init> Opening Searcher@7bc0910d main
[junit4:junit4]   2> 19743 T76 oasc.SolrCore.registerSearcher [collection1] Registered new searcher Searcher@7bc0910d main{StandardDirectoryReader(segments_2:1:nrt)}
[junit4:junit4]   2> 19744 T76 oasc.CachingDirectoryFactory.close Releasing directory:/usr/home/hudson/hudson-slave/workspace/Lucene-Solr-Tests-4.x-java7/solr/build/solr-core/test/J0/./org.apache.solr.cloud.SyncSliceTest-1359676558800/jetty2/index
[junit4:junit4]   2> 19745 T77 C1 P59403 oasu.DirectUpdateHandler2.commit start commit{,optimize=false,openSearcher=false,waitSearcher=false,expungeDeletes=false,softCommit=false}
[junit4:junit4]   2> 19750 T77 C1 P59403 oasc.SolrDeletionPolicy.onCommit SolrDeletionPolicy.onCommit: commits:num=2
[junit4:junit4]   2> 		commit{dir=RateLimitedDirectoryWrapper(NRTCachingDirectory(org.apache.lucene.store.NIOFSDirectory@/usr/home/hudson/hudson-slave/workspace/Lucene-Solr-Tests-4.x-java7/solr/build/solr-core/test/J0/org.apache.solr.cloud.SyncSliceTest-1359676558800/jetty2/index.20130131205618438 lockFactory=org.apache.lucene.store.NativeFSLockFactory@7a147237; maxCacheMB=48.0 maxMergeSizeMB=4.0)),segFN=segments_2,generation=2,filenames=[segments_2]
[junit4:junit4]   2> 		commit{dir=RateLimitedDirectoryWrapper(NRTCachingDirectory(org.apache.lucene.store.NIOFSDirectory@/usr/home/hudson/hudson-slave/workspace/Lucene-Solr-Tests-4.x-java7/solr/build/solr-core/test/J0/org.apache.solr.cloud.SyncSliceTest-1359676558800/jetty2/index.20130131205618438 lockFactory=org.apache.lucene.store.NativeFSLockFactory@7a147237; maxCacheMB=48.0 maxMergeSizeMB=4.0)),segFN=segments_3,generation=3,filenames=[segments_3]
[junit4:junit4]   2> 19751 T77 C1 P59403 oasc.SolrDeletionPolicy.updateCommits newest commit = 3[segments_3]
[junit4:junit4]   2> 19754 T77 C1 P59403 oasc.CachingDirectoryFactory.close Releasing directory:/usr/home/hudson/hudson-slave/workspace/Lucene-Solr-Tests-4.x-java7/solr/build/solr-core/test/J0/./org.apache.solr.cloud.SyncSliceTest-1359676558800/jetty2
[junit4:junit4]   2> 19755 T77 C1 P59403 oasu.DirectUpdateHandler2.commit end_commit_flush
[junit4:junit4]   2> 19755 T77 C1 P59403 oasc.CachingDirectoryFactory.close Releasing directory:/usr/home/hudson/hudson-slave/workspace/Lucene-Solr-Tests-4.x-java7/solr/build/solr-core/test/J0/./org.apache.solr.cloud.SyncSliceTest-1359676558800/jetty2/index.20130131205618438
[junit4:junit4]   2> 19756 T77 C1 P59403 oasc.CachingDirectoryFactory.close Releasing directory:/usr/home/hudson/hudson-slave/workspace/Lucene-Solr-Tests-4.x-java7/solr/build/solr-core/test/J0/./org.apache.solr.cloud.SyncSliceTest-1359676558800/jetty2/index
[junit4:junit4]   2> 19756 T77 C1 P59403 oasc.RecoveryStrategy.replay No replay needed. core=collection1
[junit4:junit4]   2> 19757 T77 C1 P59403 oasc.RecoveryStrategy.doRecovery Replication Recovery was successful - registering as Active. core=collection1
[junit4:junit4]   2> 19758 T77 C1 P59403 oasc.ZkController.publish publishing core=collection1 state=active
[junit4:junit4]   2> 19758 T77 C1 P59403 oasc.ZkController.publish numShards not found on descriptor - reading it from system property
[junit4:junit4]   2> 19761 T77 C1 P59403 oasc.RecoveryStrategy.doRecovery Finished recovery process. core=collection1
[junit4:junit4]   2> 19786 T17 oashc.HttpShardHandlerFactory.getParameter Setting socketTimeout to: 60000
[junit4:junit4]   2> 19787 T17 oashc.HttpShardHandlerFactory.getParameter Setting urlScheme to: http://
[junit4:junit4]   2> 19787 T17 oashc.HttpShardHandlerFactory.getParameter Setting connTimeout to: 15000
[junit4:junit4]   2> 19788 T17 oashc.HttpShardHandlerFactory.getParameter Setting maxConnectionsPerHost to: 20
[junit4:junit4]   2> 19788 T17 oashc.HttpShardHandlerFactory.getParameter Setting corePoolSize to: 0
[junit4:junit4]   2> 19789 T17 oashc.HttpShardHandlerFactory.getParameter Setting maximumPoolSize to: 2147483647
[junit4:junit4]   2> 19790 T17 oashc.HttpShardHandlerFactory.getParameter Setting maxThreadIdleTime to: 5
[junit4:junit4]   2> 19790 T17 oashc.HttpShardHandlerFactory.getParameter Setting sizeOfQueue to: -1
[junit4:junit4]   2> 19791 T17 oashc.HttpShardHandlerFactory.getParameter Setting fairnessPolicy to: false
[junit4:junit4]   2> 19792 T17 oascsi.HttpClientUtil.createClient Creating new http client, config:maxConnectionsPerHost=20&maxConnections=10000&socketTimeout=60000&connTimeout=15000&retry=false
[junit4:junit4]   2> 19818 T17 oasc.CoreContainer.load Registering Log Listener
[junit4:junit4]   2> 19841 T17 oasc.CoreContainer.initZooKeeper Zookeeper client=127.0.0.1:18121/solr
[junit4:junit4]   2> 19842 T17 oasc.ZkController.checkChrootPath zkHost includes chroot
[junit4:junit4]   2> 19843 T17 oaz.ZooKeeper.<init> Initiating client connection, connectString=127.0.0.1:18121 sessionTimeout=60000 watcher=org.apache.solr.common.cloud.ConnectionManager@1883962
[junit4:junit4]   2> 19844 T17 oascc.ConnectionManager.waitForConnected Waiting for client to connect to ZooKeeper
[junit4:junit4]   2> 19845 T105 oaz.ClientCnxn$SendThread.logStartConnect Opening socket connection to server localhost/127.0.0.1:18121. Will not attempt to authenticate using SASL (access denied ("javax.security.auth.AuthPermission" "getLoginConfiguration"))
[junit4:junit4]   2> 19846 T105 oaz.ClientCnxn$SendThread.primeConnection Socket connection established to localhost/127.0.0.1:18121, initiating session
[junit4:junit4]   2> 19846 T19 oazs.NIOServerCnxnFactory.run Accepted socket connection from /140.211.11.196:58559
[junit4:junit4]   2> 19847 T19 oazs.ZooKeeperServer.processConnectRequest Client attempting to establish new session at /140.211.11.196:58559
[junit4:junit4]   2> 19849 T21 oazs.ZooKeeperServer.finishSessionInit Established session 0x13c9309ced1000b with negotiated timeout 20000 for client /140.211.11.196:58559
[junit4:junit4]   2> 19849 T105 oaz.ClientCnxn$SendThread.onConnected Session establishment complete on server localhost/127.0.0.1:18121, sessionid = 0x13c9309ced1000b, negotiated timeout = 20000
[junit4:junit4]   2> 19850 T106 oascc.ConnectionManager.process Watcher org.apache.solr.common.cloud.ConnectionManager@1883962 name:ZooKeeperConnection Watcher:127.0.0.1:18121 got event WatchedEvent state:SyncConnected type:None path:null path:null type:None
[junit4:junit4]   2> 19850 T17 oascc.ConnectionManager.waitForConnected Client is connected to ZooKeeper
[junit4:junit4]   2> 19852 T22 oazs.PrepRequestProcessor.pRequest2Txn Processed session termination for sessionid: 0x13c9309ced1000b
[junit4:junit4]   2> 19854 T106 oaz.ClientCnxn$EventThread.run EventThread shut down
[junit4:junit4]   2> 19854 T17 oaz.ZooKeeper.close Session: 0x13c9309ced1000b closed
[junit4:junit4]   2> 19854 T19 oazs.NIOServerCnxn.closeSock Closed socket connection for client /140.211.11.196:58559 which had sessionid 0x13c9309ced1000b
[junit4:junit4]   2> 19855 T17 oascsi.HttpClientUtil.createClient Creating new http client, config:maxConnections=500&maxConnectionsPerHost=16&socketTimeout=60000&connTimeout=15000
[junit4:junit4]   2> 19869 T17 oaz.ZooKeeper.<init> Initiating client connection, connectString=127.0.0.1:18121/solr sessionTimeout=30000 watcher=org.apache.solr.common.cloud.ConnectionManager@20bf0de1
[junit4:junit4]   2> 19871 T17 oascc.ConnectionManager.waitForConnected Waiting for client to connect to ZooKeeper
[junit4:junit4]   2> 19871 T107 oaz.ClientCnxn$SendThread.logStartConnect Opening socket connection to server localhost/127.0.0.1:18121. Will not attempt to authenticate using SASL (access denied ("javax.security.auth.AuthPermission" "getLoginConfiguration"))
[junit4:junit4]   2> 19872 T107 oaz.ClientCnxn$SendThread.primeConnection Socket connection established to localhost/127.0.0.1:18121, initiating session
[junit4:junit4]   2> 19872 T19 oazs.NIOServerCnxnFactory.run Accepted socket connection from /140.211.11.196:12824
[junit4:junit4]   2> 19873 T19 oazs.ZooKeeperServer.processConnectRequest Client attempting to establish new session at /140.211.11.196:12824
[junit4:junit4]   2> 19875 T21 oazs.ZooKeeperServer.finishSessionInit Established session 0x13c9309ced1000c with negotiated timeout 20000 for client /140.211.11.196:12824
[junit4:junit4]   2> 19875 T107 oaz.ClientCnxn$SendThread.onConnected Session establishment complete on server localhost/127.0.0.1:18121, sessionid = 0x13c9309ced1000c, negotiated timeout = 20000
[junit4:junit4]   2> 19876 T108 oascc.ConnectionManager.process Watcher org.apache.solr.common.cloud.ConnectionManager@20bf0de1 name:ZooKeeperConnection Watcher:127.0.0.1:18121/solr got event WatchedEvent state:SyncConnected type:None path:null path:null type:None
[junit4:junit4]   2> 19876 T17 oascc.ConnectionManager.waitForConnected Client is connected to ZooKeeper
[junit4:junit4]   2> 19878 T22 oazs.PrepRequestProcessor.pRequest Got user-level KeeperException when processing sessionid:0x13c9309ced1000c type:create cxid:0x1 zxid:0x94 txntype:-1 reqpath:n/a Error Path:/solr/overseer Error:KeeperErrorCode = NodeExists for /solr/overseer
[junit4:junit4]   2> 19880 T22 oazs.PrepRequestProcessor.pRequest Got user-level KeeperException when processing sessionid:0x13c9309ced1000c type:create cxid:0x2 zxid:0x95 txntype:-1 reqpath:n/a Error Path:/solr/overseer Error:KeeperErrorCode = NodeExists for /solr/overseer
[junit4:junit4]   2> 19882 T17 oasc.ZkController.createEphemeralLiveNode Register node as live in ZooKeeper:/live_nodes/127.0.0.1:11837_
[junit4:junit4]   2> 19883 T22 oazs.PrepRequestProcessor.pRequest Got user-level KeeperException when processing sessionid:0x13c9309ced1000c type:delete cxid:0x4 zxid:0x96 txntype:-1 reqpath:n/a Error Path:/solr/live_nodes/127.0.0.1:11837_ Error:KeeperErrorCode = NoNode for /solr/live_nodes/127.0.0.1:11837_
[junit4:junit4]   2> 19889 T17 oascc.SolrZkClient.makePath makePath: /live_nodes/127.0.0.1:11837_
[junit4:junit4]   2> 19893 T59 oascc.ZkStateReader$2.process A cluster state change: WatchedEvent state:SyncConnected type:NodeChildrenChanged path:/live_nodes, has occurred - updating... (live nodes size: 4)
[junit4:junit4]   2> 19894 T90 oascc.ZkStateReader$3.process Updating live nodes... (5)
[junit4:junit4]   2> 19894 T46 oascc.ZkStateReader$3.process Updating live nodes... (5)
[junit4:junit4]   2> 19894 T74 oascc.ZkStateReader$3.process Updating live nodes... (5)
[junit4:junit4]   2> 19895 T90 oascc.ZkStateReader$2.process A cluster state change: WatchedEvent state:SyncConnected type:NodeChildrenChanged path:/live_nodes, has occurred - updating... (live nodes size: 5)
[junit4:junit4]   2> 19895 T40 oascc.ZkStateReader$3.process Updating live nodes... (5)
[junit4:junit4]   2> 19895 T46 oascc.ZkStateReader$2.process A cluster state change: WatchedEvent state:SyncConnected type:NodeChildrenChanged path:/live_nodes, has occurred - updating... (live nodes size: 5)
[junit4:junit4]   2> 19895 T74 oascc.ZkStateReader$2.process A cluster state change: WatchedEvent state:SyncConnected type:NodeChildrenChanged path:/live_nodes, has occurred - updating... (live nodes size: 5)
[junit4:junit4]   2> 19896 T40 oascc.ZkStateReader$2.process A cluster state change: WatchedEvent state:SyncConnected type:NodeChildrenChanged path:/live_nodes, has occurred - updating... (live nodes size: 5)
[junit4:junit4]   2> 19898 T59 oascc.ZkStateReader$3.process Updating live nodes... (5)
[junit4:junit4]   2> 19910 T17 oascc.ZkStateReader.createClusterStateWatchersAndUpdate Updating cluster state from ZooKeeper... 
[junit4:junit4]   2> 19921 T109 oasc.CoreContainer.create Creating SolrCore 'collection1' using instanceDir: /usr/home/hudson/hudson-slave/workspace/Lucene-Solr-Tests-4.x-java7/solr/build/solr-core/test/J0/./org.apache.solr.cloud.SyncSliceTest-jetty4-1359676578263/collection1
[junit4:junit4]   2> 19921 T109 oasc.ZkController.createCollectionZkNode Check for collection zkNode:collection1
[junit4:junit4]   2> 19922 T109 oasc.ZkController.createCollectionZkNode Collection zkNode exists
[junit4:junit4]   2> 19923 T109 oasc.ZkController.readConfigName Load collection config from:/collections/collection1
[junit4:junit4]   2> 19926 T109 oasc.SolrResourceLoader.<init> new SolrResourceLoader for directory: '/usr/home/hudson/hudson-slave/workspace/Lucene-Solr-Tests-4.x-java7/solr/build/solr-core/test/J0/./org.apache.solr.cloud.SyncSliceTest-jetty4-1359676578263/collection1/'
[junit4:junit4]   2> 19927 T109 oasc.SolrResourceLoader.replaceClassLoader Adding 'file:/usr/home/hudson/hudson-slave/workspace/Lucene-Solr-Tests-4.x-java7/solr/build/solr-core/test/J0/org.apache.solr.cloud.SyncSliceTest-jetty4-1359676578263/collection1/lib/README' to classloader
[junit4:junit4]   2> 19928 T109 oasc.SolrResourceLoader.replaceClassLoader Adding 'file:/usr/home/hudson/hudson-slave/workspace/Lucene-Solr-Tests-4.x-java7/solr/build/solr-core/test/J0/org.apache.solr.cloud.SyncSliceTest-jetty4-1359676578263/collection1/lib/classes/' to classloader
[junit4:junit4]   2> 19981 T41 oascc.ZkStateReader.updateClusterState Updating cloud state from ZooKeeper... 
[junit4:junit4]   2> 19983 T41 oasc.Overseer$ClusterStateUpdater.updateState Update state numShards=1 message={
[junit4:junit4]   2> 	  "operation":"state",
[junit4:junit4]   2> 	  "numShards":"1",
[junit4:junit4]   2> 	  "shard":"shard1",
[junit4:junit4]   2> 	  "roles":null,
[junit4:junit4]   2> 	  "state":"recovering",
[junit4:junit4]   2> 	  "core":"collection1",
[junit4:junit4]   2> 	  "collection":"collection1",
[junit4:junit4]   2> 	  "node_name":"127.0.0.1:48209_",
[junit4:junit4]   2> 	  "base_url":"http://127.0.0.1:48209"}
[junit4:junit4]   2> 19991 T41 oasc.Overseer$ClusterStateUpdater.updateState Update state numShards=1 message={
[junit4:junit4]   2> 	  "operation":"state",
[junit4:junit4]   2> 	  "numShards":"1",
[junit4:junit4]   2> 	  "shard":"shard1",
[junit4:junit4]   2> 	  "roles":null,
[junit4:junit4]   2> 	  "state":"active",
[junit4:junit4]   2> 	  "core":"collection1",
[junit4:junit4]   2> 	  "collection":"collection1",
[junit4:junit4]   2> 	  "node_name":"127.0.0.1:59403_",
[junit4:junit4]   2> 	  "base_url":"http://127.0.0.1:59403"}
[junit4:junit4]   2> 19999 T108 oascc.ZkStateReader$2.process A cluster state change: WatchedEvent state:SyncConnected type:NodeDataChanged path:/clusterstate.json, has occurred - updating... (live nodes size: 5)
[junit4:junit4]   2> 19999 T40 oascc.ZkStateReader$2.process A cluster state change: WatchedEvent state:SyncConnected type:NodeDataChanged path:/clusterstate.json, has occurred - updating... (live nodes size: 5)
[junit4:junit4]   2> 19999 T74 oascc.ZkStateReader$2.process A cluster state change: WatchedEvent state:SyncConnected type:NodeDataChanged path:/clusterstate.json, has occurred - updating... (live nodes size: 5)
[junit4:junit4]   2> 19999 T90 oascc.ZkStateReader$2.process A cluster state change: WatchedEvent state:SyncConnected type:NodeDataChanged path:/clusterstate.json, has occurred - updating... (live nodes size: 5)
[junit4:junit4]   2> 19999 T46 oascc.ZkStateReader$2.process A cluster state change: WatchedEvent state:SyncConnected type:NodeDataChanged path:/clusterstate.json, has occurred - updating... (live nodes size: 5)
[junit4:junit4]   2> 19999 T59 oascc.ZkStateReader$2.process A cluster state change: WatchedEvent state:SyncConnected type:NodeDataChanged path:/clusterstate.json, has occurred - updating... (live nodes size: 5)
[junit4:junit4]   2> 20019 T109 oasc.SolrConfig.<init> Using Lucene MatchVersion: LUCENE_42
[junit4:junit4]   2> 20125 T109 oasc.SolrConfig.<init> Loaded SolrConfig: solrconfig.xml
[junit4:junit4]   2> 20227 T109 oass.IndexSchema.readSchema Reading Solr Schema
[junit4:junit4]   2> 20252 T109 oass.IndexSchema.readSchema Schema name=test
[junit4:junit4]   2> 20971 T109 oass.OpenExchangeRatesOrgProvider.init Initialized with rates=open-exchange-rates.json, refreshInterval=1440.
[junit4:junit4]   2> 20987 T109 oass.IndexSchema.readSchema default search field in schema is text
[junit4:junit4]   2> 20991 T109 oass.IndexSchema.readSchema unique key field: id
[junit4:junit4]   2> 21025 T109 oass.FileExchangeRateProvider.reload Reloading exchange rates from file currency.xml
[junit4:junit4]   2> 21031 T109 oass.FileExchangeRateProvider.reload Reloading exchange rates from file currency.xml
[junit4:junit4]   2> 21037 T109 oass.OpenExchangeRatesOrgProvider.reload Reloading exchange rates from open-exchange-rates.json
[junit4:junit4]   2> 21040 T109 oass.OpenExchangeRatesOrgProvider.reload Reloading exchange rates from open-exchange-rates.json
[junit4:junit4]   2> 21044 T109 oasc.SolrCore.<init> [collection1] Opening new SolrCore at /usr/home/hudson/hudson-slave/workspace/Lucene-Solr-Tests-4.x-java7/solr/build/solr-core/test/J0/./org.apache.solr.cloud.SyncSliceTest-jetty4-1359676578263/collection1/, dataDir=./org.apache.solr.cloud.SyncSliceTest-1359676558800/jetty4/
[junit4:junit4]   2> 21044 T109 oasc.JmxMonitoredMap.<init> JMX monitoring is enabled. Adding Solr mbeans to JMX Server: com.sun.jmx.mbeanserver.JmxMBeanServer@6478c466
[junit4:junit4]   2> 21045 T109 oasc.SolrCore.initDirectoryFactory solr.NRTCachingDirectoryFactory
[junit4:junit4]   2> 21046 T109 oasc.CachingDirectoryFactory.get return new directory for /usr/home/hudson/hudson-slave/workspace/Lucene-Solr-Tests-4.x-java7/solr/build/solr-core/test/J0/./org.apache.solr.cloud.SyncSliceTest-1359676558800/jetty4 forceNew:false
[junit4:junit4]   2> 21047 T109 oasc.CachingDirectoryFactory.close Releasing directory:/usr/home/hudson/hudson-slave/workspace/Lucene-Solr-Tests-4.x-java7/solr/build/solr-core/test/J0/./org.apache.solr.cloud.SyncSliceTest-1359676558800/jetty4
[junit4:junit4]   2> 21047 T109 oasc.SolrCore.getNewIndexDir New index directory detected: old=null new=./org.apache.solr.cloud.SyncSliceTest-1359676558800/jetty4/index/
[junit4:junit4]   2> 21048 T109 oasc.SolrCore.initIndex WARNING [collection1] Solr index directory './org.apache.solr.cloud.SyncSliceTest-1359676558800/jetty4/index' doesn't exist. Creating new index...
[junit4:junit4]   2> 21049 T109 oasc.CachingDirectoryFactory.get return new directory for /usr/home/hudson/hudson-slave/workspace/Lucene-Solr-Tests-4.x-java7/solr/build/solr-core/test/J0/./org.apache.solr.cloud.SyncSliceTest-1359676558800/jetty4/index forceNew:false
[junit4:junit4]   2> 21055 T109 oasc.SolrDeletionPolicy.onCommit SolrDeletionPolicy.onCommit: commits:num=1
[junit4:junit4]   2> 		commit{dir=RateLimitedDirectoryWrapper(NRTCachingDirectory(org.apache.lucene.store.NIOFSDirectory@/usr/home/hudson/hudson-slave/workspace/Lucene-Solr-Tests-4.x-java7/solr/build/solr-core/test/J0/org.apache.solr.cloud.SyncSliceTest-1359676558800/jetty4/index lockFactory=org.apache.lucene.store.NativeFSLockFactory@2dedf6a9; maxCacheMB=48.0 maxMergeSizeMB=4.0)),segFN=segments_1,generation=1,filenames=[segments_1]
[junit4:junit4]   2> 21055 T109 oasc.SolrDeletionPolicy.updateCommits newest commit = 1[segments_1]
[junit4:junit4]   2> 21057 T109 oasc.CachingDirectoryFactory.close Releasing directory:/usr/home/hudson/hudson-slave/workspace/Lucene-Solr-Tests-4.x-java7/solr/build/solr-core/test/J0/./org.apache.solr.cloud.SyncSliceTest-1359676558800/jetty4/index
[junit4:junit4]   2> 21057 T109 oasc.SolrCore.initWriters created xml: solr.XMLResponseWriter
[junit4:junit4]   2> 21061 T109 oasup.UpdateRequestProcessorChain.init inserting DistributedUpdateProcessorFactory into updateRequestProcessorChain "dedupe"
[junit4:junit4]   2> 21061 T109 oasup.UpdateRequestProcessorChain.init inserting DistributedUpdateProcessorFactory into updateRequestProcessorChain "dedupe-allfields"
[junit4:junit4]   2> 21062 T109 oasup.UpdateRequestProcessorChain.init inserting DistributedUpdateProcessorFactory into updateRequestProcessorChain "stored_sig"
[junit4:junit4]   2> 21062 T109 oasup.UpdateRequestProcessorChain.init inserting DistributedUpdateProcessorFactory into updateRequestProcessorChain "uniq-fields"
[junit4:junit4]   2> 21063 T109 oasup.UpdateRequestProcessorChain.init inserting DistributedUpdateProcessorFactory into updateRequestProcessorChain "distrib-dup-test-chain-implicit"
[junit4:junit4]   2> 21064 T109 oasc.RequestHandlers.initHandlersFromConfig adding lazy requestHandler: solr.ReplicationHandler
[junit4:junit4]   2> 21064 T109 oasc.RequestHandlers.initHandlersFromConfig created /replication: solr.ReplicationHandler
[junit4:junit4]   2> 21066 T109 oasc.RequestHandlers.initHandlersFromConfig created standard: solr.StandardRequestHandler
[junit4:junit4]   2> 21067 T109 oasc.RequestHandlers.initHandlersFromConfig created /get: solr.RealTimeGetHandler
[junit4:junit4]   2> 21068 T109 oasc.RequestHandlers.initHandlersFromConfig created dismax: solr.SearchHandler
[junit4:junit4]   2> 21069 T109 oasc.RequestHandlers.initHandlersFromConfig created mock: org.apache.solr.core.MockQuerySenderListenerReqHandler
[junit4:junit4]   2> 21069 T109 oasc.RequestHandlers.initHandlersFromConfig created /admin/: org.apache.solr.handler.admin.AdminHandlers
[junit4:junit4]   2> 21070 T109 oasc.RequestHandlers.initHandlersFromConfig created defaults: solr.StandardRequestHandler
[junit4:junit4]   2> 21071 T109 oasc.RequestHandlers.initHandlersFromConfig adding lazy requestHandler: solr.StandardRequestHandler
[junit4:junit4]   2> 21071 T109 oasc.RequestHandlers.initHandlersFromConfig created lazy: solr.StandardRequestHandler
[junit4:junit4]   2> 21072 T109 oasc.RequestHandlers.initHandlersFromConfig created /update: solr.UpdateRequestHandler
[junit4:junit4]   2> 21073 T109 oasc.RequestHandlers.initHandlersFromConfig created /terms: org.apache.solr.handler.component.SearchHandler
[junit4:junit4]   2> 21074 T109 oasc.RequestHandlers.initHandlersFromConfig created spellCheckCompRH: org.apache.solr.handler.component.SearchHandler
[junit4:junit4]   2> 21075 T109 oasc.RequestHandlers.initHandlersFromConfig created spellCheckCompRH_Direct: org.apache.solr.handler.component.SearchHandler
[junit4:junit4]   2> 21076 T109 oasc.RequestHandlers.initHandlersFromConfig created spellCheckWithWordbreak: org.apache.solr.handler.component.SearchHandler
[junit4:junit4]   2> 21077 T109 oasc.RequestHandlers.initHandlersFromConfig created spellCheckWithWordbreak_Direct: org.apache.solr.handler.component.SearchHandler
[junit4:junit4]   2> 21078 T109 oasc.RequestHandlers.initHandlersFromConfig created spellCheckCompRH1: org.apache.solr.handler.component.SearchHandler
[junit4:junit4]   2> 21079 T109 oasc.RequestHandlers.initHandlersFromConfig created mltrh: org.apache.solr.handler.component.SearchHandler
[junit4:junit4]   2> 21080 T109 oasc.RequestHandlers.initHandlersFromConfig created tvrh: org.apache.solr.handler.component.SearchHandler
[junit4:junit4]   2> 21081 T109 oasc.RequestHandlers.initHandlersFromConfig created /mlt: solr.MoreLikeThisHandler
[junit4:junit4]   2> 21082 T109 oasc.RequestHandlers.initHandlersFromConfig created /debug/dump: solr.DumpRequestHandler
[junit4:junit4]   2> 21095 T109 oashl.XMLLoader.init xsltCacheLifetimeSeconds=60
[junit4:junit4]   2> 21099 T109 oasc.SolrCore.initDeprecatedSupport WARNING solrconfig.xml uses deprecated <admin/gettableFiles>, Please update your config to use the ShowFileRequestHandler.
[junit4:junit4]   2> 21101 T109 oasc.SolrCore.initDeprecatedSupport WARNING adding ShowFileRequestHandler with hidden files: [SCHEMA.XML, OLD_SYNONYMS.TXT, STOPWORDS.TXT, PROTWORDS.TXT, OPEN-EXCHANGE-RATES.JSON, SYNONYMS.TXT, CURRENCY.XML, MAPPING-ISOLATIN1ACCENT.TXT]
[junit4:junit4]   2> 21104 T109 oasc.CachingDirectoryFactory.close Releasing directory:/usr/home/hudson/hudson-slave/workspace/Lucene-Solr-Tests-4.x-java7/solr/build/solr-core/test/J0/./org.apache.solr.cloud.SyncSliceTest-1359676558800/jetty4
[junit4:junit4]   2> 21106 T109 oass.SolrIndexSearcher.<init> Opening Searcher@11bbf66b main
[junit4:junit4]   2> 21108 T109 oasu.CommitTracker.<init> Hard AutoCommit: disabled
[junit4:junit4]   2> 21109 T109 oasu.CommitTracker.<init> Soft AutoCommit: disabled
[junit4:junit4]   2> 21110 T109 oashc.SpellCheckComponent.inform Initializing spell checkers
[junit4:junit4]   2> 21126 T109 oass.DirectSolrSpellChecker.init init: {name=direct,classname=DirectSolrSpellChecker,field=lowerfilt,minQueryLength=3}
[junit4:junit4]   2> 21186 T110 oasc.SolrCore.registerSearcher [collection1] Registered new searcher Searcher@11bbf66b main{StandardDirectoryReader(segments_1:1)}
[junit4:junit4]   2> 21197 T109 oasc.ZkController.publish publishing core=collection1 state=down
[junit4:junit4]   2> 21198 T109 oasc.ZkController.publish numShards not found on descriptor - reading it from system property
[junit4:junit4]   2> 21511 T41 oascc.ZkStateReader.updateClusterState Updating cloud state from ZooKeeper... 
[junit4:junit4]   2> 21512 T41 oasc.Overseer$ClusterStateUpdater.updateState Update state numShards=1 message={
[junit4:junit4]   2> 	  "operation":"state",
[junit4:junit4]   2> 	  "numShards":"1",
[junit4:junit4]   2> 	  "shard":null,
[junit4:junit4]   2> 	  "roles":null,
[junit4:junit4]   2> 	  "state":"down",
[junit4:junit4]   2> 	  "core":"collection1",
[junit4:junit4]   2> 	  "collection":"collection1",
[junit4:junit4]   2> 	  "node_name":"127.0.0.1:11837_",
[junit4:junit4]   2> 	  "base_url":"http://127.0.0.1:11837"}
[junit4:junit4]   2> 21513 T41 oasc.Overseer$ClusterStateUpdater.updateState Collection already exists with numShards=1
[junit4:junit4]   2> 21513 T41 oasc.Overseer$ClusterStateUpdater.updateState Assigning new node to shard shard=shard1
[junit4:junit4]   2> 21526 T108 oascc.ZkStateReader$2.process A cluster state change: WatchedEvent state:SyncConnected type:NodeDataChanged path:/clusterstate.json, has occurred - updating... (live nodes size: 5)
[junit4:junit4]   2> 21526 T46 oascc.ZkStateReader$2.process A cluster state change: WatchedEvent state:SyncConnected type:NodeDataChanged path:/clusterstate.json, has occurred - updating... (live nodes size: 5)
[junit4:junit4]   2> 21527 T40 oascc.ZkStateReader$2.process A cluster state change: WatchedEvent state:SyncConnected type:NodeDataChanged path:/clusterstate.json, has occurred - updating... (live nodes size: 5)
[junit4:junit4]   2> 21527 T74 oascc.ZkStateReader$2.process A cluster state change: WatchedEvent state:SyncConnected type:NodeDataChanged path:/clusterstate.json, has occurred - updating... (live nodes size: 5)
[junit4:junit4]   2> 21526 T90 oascc.ZkStateReader$2.process A cluster state change: WatchedEvent state:SyncConnected type:NodeDataChanged path:/clusterstate.json, has occurred - updating... (live nodes size: 5)
[junit4:junit4]   2> 21526 T59 oascc.ZkStateReader$2.process A cluster state change: WatchedEvent state:SyncConnected type:NodeDataChanged path:/clusterstate.json, has occurred - updating... (live nodes size: 5)
[junit4:junit4]   2> 22201 T109 oasc.CoreContainer.registerCore registering core: collection1
[junit4:junit4]   2> 22201 T109 oasc.ZkController.register Register replica - core:collection1 address:http://127.0.0.1:11837 collection:collection1 shard:shard1
[junit4:junit4]   2> 22208 T109 oasc.ZkController.register We are http://127.0.0.1:11837/collection1/ and leader is http://127.0.0.1:22765/collection1/
[junit4:junit4]   2> 22208 T109 oasc.ZkController.register No LogReplay needed for core=collection1 baseURL=http://127.0.0.1:11837
[junit4:junit4]   2> 22208 T109 oasc.ZkController.checkRecovery Core needs to recover:collection1
[junit4:junit4]   2> 22209 T109 oasu.DefaultSolrCoreState.doRecovery Running recovery - first canceling any ongoing recovery
[junit4:junit4]   2> ASYNC  NEW_CORE C4 name=collection1 org.apache.solr.core.SolrCore@5b419ae0 url=http://127.0.0.1:11837/collection1 node=127.0.0.1:11837_ C4_STATE=coll:collection1 core:collection1 props:{shard=null, roles=null, state=down, core=collection1, collection=collection1, node_name=127.0.0.1:11837_, base_url=http://127.0.0.1:11837}
[junit4:junit4]   2> 22209 T111 C4 P11837 oasc.RecoveryStrategy.run Starting recovery process.  core=collection1 recoveringAfterStartup=true
[junit4:junit4]   2> 22210 T111 C4 P11837 oasc.RecoveryStrategy.doRecovery ###### startupVersions=[]
[junit4:junit4]   2> 22210 T109 oascc.ZkStateReader.updateClusterState Updating cloud state from ZooKeeper... 
[junit4:junit4]   2> 22211 T111 C4 P11837 oasc.ZkController.publish publishing core=collection1 state=recovering
[junit4:junit4]   2> 22211 T111 C4 P11837 oasc.ZkController.publish numShards not found on descriptor - reading it from system property
[junit4:junit4]   2> 22212 T17 oass.SolrDispatchFilter.init user.dir=/usr/home/hudson/hudson-slave/workspace/Lucene-Solr-Tests-4.x-java7/solr/build/solr-core/test/J0
[junit4:junit4]   2> 22213 T17 oass.SolrDispatchFilter.init SolrDispatchFilter.init() done
[junit4:junit4]   2> 22214 T17 oascsi.HttpClientUtil.createClient Creating new http client, config:maxConnections=128&maxConnectionsPerHost=32&followRedirects=false
[junit4:junit4]   2> 22216 T111 C4 P11837 oascsi.HttpClientUtil.createClient Creating new http client, config:maxConnections=128&maxConnectionsPerHost=32&followRedirects=false
[junit4:junit4]   2> 22236 T17 oascc.ZkStateReader.updateClusterState Updating cloud state from ZooKeeper... 
[junit4:junit4]   2> 22240 T17 oasc.AbstractFullDistribZkTestBase.waitForThingsToLevelOut Wait for recoveries to finish - wait 15 for each attempt
[junit4:junit4]   2> 22240 T17 oasc.AbstractDistribZkTestBase.waitForRecoveriesToFinish Wait for recoveries to finish - collection: collection1 failOnTimeout:true timeout (sec):15
[junit4:junit4]   2> 22241 T17 oascc.ZkStateReader.updateClusterState Updating cloud state from ZooKeeper... 
[junit4:junit4]   2>  C3_STATE=coll:collection1 core:collection1 props:{shard=shard1, roles=null, state=recovering, core=collection1, collection=collection1, node_name=127.0.0.1:48209_, base_url=http://127.0.0.1:48209}
[junit4:junit4]   2> 22477 T94 C3 P48209 oasc.RecoveryStrategy.doRecovery Attempting to PeerSync from http://127.0.0.1:22765/collection1/ core=collection1 - recoveringAfterStartup=true
[junit4:junit4]   2> 22477 T94 C3 P48209 oasu.PeerSync.sync PeerSync: core=collection1 url=http://127.0.0.1:48209 START replicas=[http://127.0.0.1:22765/collection1/] nUpdates=100
[junit4:junit4]   2> 22478 T94 C3 P48209 oasu.PeerSync.sync WARNING no frame of reference to tell of we've missed updates
[junit4:junit4]   2> 22479 T94 C3 P48209 oasc.RecoveryStrategy.doRecovery PeerSync Recovery was not successful - trying replication. core=collection1
[junit4:junit4]   2> 22479 T94 C3 P48209 oasc.RecoveryStrategy.doRecovery Starting Replication Recovery. core=collection1
[junit4:junit4]   2> 22480 T94 C3 P48209 oasc.RecoveryStrategy.doRecovery Begin buffering updates. core=collection1
[junit4:junit4]   2> 22480 T94 C3 P48209 oasu.UpdateLog.bufferUpdates Starting to buffer updates. FSUpdateLog{state=ACTIVE, tlog=null}
[junit4:junit4]   2> 22480 T94 C3 P48209 oasc.RecoveryStrategy.replicate Attempting to replicate from http://127.0.0.1:22765/collection1/. core=collection1
[junit4:junit4]   2> 22481 T94 C3 P48209 oascsi.HttpClientUtil.createClient Creating new http client, config:maxConnections=128&maxConnectionsPerHost=32&followRedirects=false
[junit4:junit4]   2> 22482 T51 C2 P22765 REQ /get {getVersions=100&distrib=false&wt=javabin&qt=/get&version=2} status=0 QTime=0 
[junit4:junit4]   2> 22496 T55 C2 P22765 oasu.DirectUpdateHandler2.commit start commit{,optimize=false,openSearcher=false,waitSearcher=true,expungeDeletes=false,softCommit=false}
[junit4:junit4]   2> 22508 T55 C2 P22765 oasc.SolrDeletionPolicy.onCommit SolrDeletionPolicy.onCommit: commits:num=2
[junit4:junit4]   2> 		commit{dir=RateLimitedDirectoryWrapper(NRTCachingDirectory(org.apache.lucene.store.NIOFSDirectory@/usr/home/hudson/hudson-slave/workspace/Lucene-Solr-Tests-4.x-java7/solr/build/solr-core/test/J0/org.apache.solr.cloud.SyncSliceTest-1359676558800/jetty1/index lockFactory=org.apache.lucene.store.NativeFSLockFactory@32ffe6b5; maxCacheMB=48.0 maxMergeSizeMB=4.0)),segFN=segments_2,generation=2,filenames=[segments_2]
[junit4:junit4]   2> 		commit{dir=RateLimitedDirectoryWrapper(NRTCachingDirectory(org.apache.lucene.store.NIOFSDirectory@/usr/home/hudson/hudson-slave/workspace/Lucene-Solr-Tests-4.x-java7/solr/build/solr-core/test/J0/org.apache.solr.cloud.SyncSliceTest-1359676558800/jetty1/index lockFactory=org.apache.lucene.store.NativeFSLockFactory@32ffe6b5; maxCacheMB=48.0 maxMergeSizeMB=4.0)),segFN=segments_3,generation=3,filenames=[segments_3]
[junit4:junit4]   2> 22509 T55 C2 P22765 oasc.SolrDeletionPolicy.updateCommits newest commit = 3[segments_3]
[junit4:junit4]   2> 22510 T55 C2 P22765 oasc.CachingDirectoryFactory.close Releasing directory:/usr/home/hudson/hudson-slave/workspace/Lucene-Solr-Tests-4.x-java7/solr/build/solr-core/test/J0/./org.apache.solr.cloud.SyncSliceTest-1359676558800/jetty1
[junit4:junit4]   2> 22511 T55 C2 P22765 oasu.DirectUpdateHandler2.commit end_commit_flush
[junit4:junit4]   2> 22511 T55 C2 P22765 /update {waitSearcher=true&openSearcher=false&commit=true&wt=javabin&commit_end_point=true&version=2&softCommit=false} {commit=} 0 15
[junit4:junit4]   2> 22513 T94 C3 P48209 oash.ReplicationHandler.inform Commits will be reserved for  10000
[junit4:junit4]   2> 22513 T94 C3 P48209 oash.SnapPuller.<init>  No value set for 'pollInterval'. Timer Task not started.
[junit4:junit4]   2> 22517 T53 C2 P22765 REQ /replication {command=indexversion&qt=/replication&wt=javabin&version=2} status=0 QTime=0 
[junit4:junit4]   2> 22518 T94 C3 P48209 oash.SnapPuller.fetchLatestIndex Master's generation: 3
[junit4:junit4]   2> 22519 T94 C3 P48209 oash.SnapPuller.fetchLatestIndex Slave's generation: 1
[junit4:junit4]   2> 22519 T94 C3 P48209 oash.SnapPuller.fetchLatestIndex Starting replication process
[junit4:junit4]   2> 22523 T53 C2 P22765 oasc.CachingDirectoryFactory.close Releasing directory:/usr/home/hudson/hudson-slave/workspace/Lucene-Solr-Tests-4.x-java7/solr/build/solr-core/test/J0/./org.apache.solr.cloud.SyncSliceTest-1359676558800/jetty1
[junit4:junit4]   2> 22525 T53 C2 P22765 oasc.CachingDirectoryFactory.close Releasing directory:/usr/home/hudson/hudson-slave/workspace/Lucene-Solr-Tests-4.x-java7/solr/build/solr-core/test/J0/./org.apache.solr.cloud.SyncSliceTest-1359676558800/jetty1/index
[junit4:junit4]   2> 22525 T53 C2 P22765 REQ /replication {command=filelist&qt=/replication&wt=javabin&generation=3&version=2} status=0 QTime=2 
[junit4:junit4]   2> 22527 T94 C3 P48209 oash.SnapPuller.fetchLatestIndex Number of files in latest index in master: 1
[junit4:junit4]   2> 22529 T94 C3 P48209 oasc.CachingDirectoryFactory.get return new directory for /usr/home/hudson/hudson-slave/workspace/Lucene-Solr-Tests-4.x-java7/solr/build/solr-core/test/J0/./org.apache.solr.cloud.SyncSliceTest-1359676558800/jetty3/index.20130131205621320 forceNew:false
[junit4:junit4]   2> 22529 T94 C3 P48209 oasc.CachingDirectoryFactory.close Releasing directory:/usr/home/hudson/hudson-slave/workspace/Lucene-Solr-Tests-4.x-java7/solr/build/solr-core/test/J0/./org.apache.solr.cloud.SyncSliceTest-1359676558800/jetty3
[junit4:junit4]   2> 22530 T94 C3 P48209 oash.SnapPuller.fetchLatestIndex Starting download to RateLimitedDirectoryWrapper(NRTCachingDirectory(org.apache.lucene.store.NIOFSDirectory@/usr/home/hudson/hudson-slave/workspace/Lucene-Solr-Tests-4.x-java7/solr/build/solr-core/test/J0/org.apache.solr.cloud.SyncSliceTest-1359676558800/jetty3/index.20130131205621320 lockFactory=org.apache.lucene.store.NativeFSLockFactory@315a11d2; maxCacheMB=48.0 maxMergeSizeMB=4.0)) fullCopy=true
[junit4:junit4]   2> 22535 T53 C2 P22765 REQ /replication {file=segments_3&command=filecontent&checksum=true&wt=filestream&qt=/replication&generation=3} status=0 QTime=1 
[junit4:junit4]   2> 22537 T94 C3 P48209 oasc.CachingDirectoryFactory.close Releasing directory:/usr/home/hudson/hudson-slave/workspace/Lucene-Solr-Tests-4.x-java7/solr/build/solr-core/test/J0/./org.apache.solr.cloud.SyncSliceTest-1359676558800/jetty3/index
[junit4:junit4]   2> 22537 T94 C3 P48209 oash.SnapPuller.fetchLatestIndex Total time taken for download : 0 secs
[junit4:junit4]   2> 22538 T94 C3 P48209 oash.SnapPuller.modifyIndexProps New index installed. Updating index properties... index=index.20130131205621320
[junit4:junit4]   2> 22539 T94 C3 P48209 oasc.CachingDirectoryFactory.close Releasing directory:/usr/home/hudson/hudson-slave/workspace/Lucene-Solr-Tests-4.x-java7/solr/build/solr-core/test/J0/./org.apache.solr.cloud.SyncSliceTest-1359676558800/jetty3
[junit4:junit4]   2> 22540 T94 C3 P48209 oasc.CachingDirectoryFactory.close Releasing directory:/usr/home/hudson/hudson-slave/workspace/Lucene-Solr-Tests-4.x-java7/solr/build/solr-core/test/J0/./org.apache.solr.cloud.SyncSliceTest-1359676558800/jetty3
[junit4:junit4]   2> 22541 T94 C3 P48209 oasc.SolrCore.getNewIndexDir New index directory detected: old=./org.apache.solr.cloud.SyncSliceTest-1359676558800/jetty3/index/ new=./org.apache.solr.cl

[...truncated too long message...]

ing old index files RateLimitedDirectoryWrapper(NRTCachingDirectory(org.apache.lucene.store.NIOFSDirectory@/usr/home/hudson/hudson-slave/workspace/Lucene-Solr-Tests-4.x-java7/solr/build/solr-core/test/J0/org.apache.solr.cloud.SyncSliceTest-1359676558800/jetty4/index lockFactory=org.apache.lucene.store.NativeFSLockFactory@2dedf6a9; maxCacheMB=48.0 maxMergeSizeMB=4.0))
[junit4:junit4]   2> 150824 T17 oasc.CachingDirectoryFactory.closeDirectory Closing directory:/usr/home/hudson/hudson-slave/workspace/Lucene-Solr-Tests-4.x-java7/solr/build/solr-core/test/J0/./org.apache.solr.cloud.SyncSliceTest-1359676558800/jetty4/index.20130131205624079
[junit4:junit4]   2> 150824 T17 oash.SnapPuller$2.postClose removing old index directory RateLimitedDirectoryWrapper(NRTCachingDirectory(org.apache.lucene.store.NIOFSDirectory@/usr/home/hudson/hudson-slave/workspace/Lucene-Solr-Tests-4.x-java7/solr/build/solr-core/test/J0/org.apache.solr.cloud.SyncSliceTest-1359676558800/jetty4/index lockFactory=org.apache.lucene.store.NativeFSLockFactory@2dedf6a9; maxCacheMB=48.0 maxMergeSizeMB=4.0))
[junit4:junit4]   2> 150826 T17 oasc.CachingDirectoryFactory.close Closing directory when closing factory:/usr/home/hudson/hudson-slave/workspace/Lucene-Solr-Tests-4.x-java7/solr/build/solr-core/test/J0/./org.apache.solr.cloud.SyncSliceTest-1359676558800/jetty4
[junit4:junit4]   2> 150826 T17 oasc.CachingDirectoryFactory.closeDirectory Closing directory:/usr/home/hudson/hudson-slave/workspace/Lucene-Solr-Tests-4.x-java7/solr/build/solr-core/test/J0/./org.apache.solr.cloud.SyncSliceTest-1359676558800/jetty4
[junit4:junit4]   2> 150827 T17 oasc.CachingDirectoryFactory.close Closing directory when closing factory:/usr/home/hudson/hudson-slave/workspace/Lucene-Solr-Tests-4.x-java7/solr/build/solr-core/test/J0/./org.apache.solr.cloud.SyncSliceTest-1359676558800/jetty4/index
[junit4:junit4]   2> 150827 T17 oasc.CachingDirectoryFactory.closeDirectory Closing directory:/usr/home/hudson/hudson-slave/workspace/Lucene-Solr-Tests-4.x-java7/solr/build/solr-core/test/J0/./org.apache.solr.cloud.SyncSliceTest-1359676558800/jetty4/index
[junit4:junit4]   2> 150929 T108 oaz.ClientCnxn$EventThread.run EventThread shut down
[junit4:junit4]   2> 150929 T17 oaz.ZooKeeper.close Session: 0x13c9309ced1000c closed
[junit4:junit4]   2> 150931 T17 oejsh.ContextHandler.doStop stopped o.e.j.s.ServletContextHandler{/,null}
[junit4:junit4]   2> 151143 T17 oas.SolrTestCaseJ4.tearDown ###Ending testDistribSearch
[junit4:junit4]   1> client port:0.0.0.0/0.0.0.0:0
[junit4:junit4]   2> NOTE: reproduce with: ant test  -Dtestcase=SyncSliceTest -Dtests.method=testDistribSearch -Dtests.seed=1EEACA81EB3674E9 -Dtests.multiplier=3 -Dtests.slow=true -Dtests.locale=es_EC -Dtests.timezone=America/Argentina/Jujuy -Dtests.file.encoding=US-ASCII
[junit4:junit4] FAILURE  151s J0 | SyncSliceTest.testDistribSearch <<<
[junit4:junit4]    > Throwable #1: java.lang.AssertionError: shard1 should have just been set up to be inconsistent - but it's still consistent
[junit4:junit4]    > 	at __randomizedtesting.SeedInfo.seed([1EEACA81EB3674E9:9F0C44999C6914D5]:0)
[junit4:junit4]    > 	at org.junit.Assert.fail(Assert.java:93)
[junit4:junit4]    > 	at org.junit.Assert.assertTrue(Assert.java:43)
[junit4:junit4]    > 	at org.junit.Assert.assertNotNull(Assert.java:526)
[junit4:junit4]    > 	at org.apache.solr.cloud.SyncSliceTest.doTest(SyncSliceTest.java:214)
[junit4:junit4]    > 	at org.apache.solr.BaseDistributedSearchTestCase.testDistribSearch(BaseDistributedSearchTestCase.java:794)
[junit4:junit4]    > 	at sun.reflect.NativeMethodAccessorImpl.invoke0(Native Method)
[junit4:junit4]    > 	at sun.reflect.NativeMethodAccessorImpl.invoke(NativeMethodAccessorImpl.java:57)
[junit4:junit4]    > 	at sun.reflect.DelegatingMethodAccessorImpl.invoke(DelegatingMethodAccessorImpl.java:43)
[junit4:junit4]    > 	at java.lang.reflect.Method.invoke(Method.java:601)
[junit4:junit4]    > 	at com.carrotsearch.randomizedtesting.RandomizedRunner.invoke(RandomizedRunner.java:1559)
[junit4:junit4]    > 	at com.carrotsearch.randomizedtesting.RandomizedRunner.access$600(RandomizedRunner.java:79)
[junit4:junit4]    > 	at com.carrotsearch.randomizedtesting.RandomizedRunner$6.evaluate(RandomizedRunner.java:737)
[junit4:junit4]    > 	at com.carrotsearch.randomizedtesting.RandomizedRunner$7.evaluate(RandomizedRunner.java:773)
[junit4:junit4]    > 	at com.carrotsearch.randomizedtesting.RandomizedRunner$8.evaluate(RandomizedRunner.java:787)
[junit4:junit4]    > 	at com.carrotsearch.randomizedtesting.rules.SystemPropertiesRestoreRule$1.evaluate(SystemPropertiesRestoreRule.java:53)
[junit4:junit4]    > 	at org.apache.lucene.util.TestRuleSetupTeardownChained$1.evaluate(TestRuleSetupTeardownChained.java:50)
[junit4:junit4]    > 	at org.apache.lucene.util.TestRuleFieldCacheSanity$1.evaluate(TestRuleFieldCacheSanity.java:51)
[junit4:junit4]    > 	at org.apache.lucene.util.AbstractBeforeAfterRule$1.evaluate(AbstractBeforeAfterRule.java:46)
[junit4:junit4]    > 	at com.carrotsearch.randomizedtesting.rules.SystemPropertiesInvariantRule$1.evaluate(SystemPropertiesInvariantRule.java:55)
[junit4:junit4]    > 	at org.apache.lucene.util.TestRuleThreadAndTestName$1.evaluate(TestRuleThreadAndTestName.java:49)
[junit4:junit4]    > 	at org.apache.lucene.util.TestRuleIgnoreAfterMaxFailures$1.evaluate(TestRuleIgnoreAfterMaxFailures.java:70)
[junit4:junit4]    > 	at org.apache.lucene.util.TestRuleMarkFailure$1.evaluate(TestRuleMarkFailure.java:48)
[junit4:junit4]    > 	at com.carrotsearch.randomizedtesting.rules.StatementAdapter.evaluate(StatementAdapter.java:36)
[junit4:junit4]    > 	at com.carrotsearch.randomizedtesting.ThreadLeakControl$StatementRunner.run(ThreadLeakControl.java:358)
[junit4:junit4]    > 	at com.carrotsearch.randomizedtesting.ThreadLeakControl.forkTimeoutingTask(ThreadLeakControl.java:782)
[junit4:junit4]    > 	at com.carrotsearch.randomizedtesting.ThreadLeakControl$3.evaluate(ThreadLeakControl.java:442)
[junit4:junit4]    > 	at com.carrotsearch.randomizedtesting.RandomizedRunner.runSingleTest(RandomizedRunner.java:746)
[junit4:junit4]    > 	at com.carrotsearch.randomizedtesting.RandomizedRunner$3.evaluate(RandomizedRunner.java:648)
[junit4:junit4]    > 	at com.carrotsearch.randomizedtesting.RandomizedRunner$4.evaluate(RandomizedRunner.java:682)
[junit4:junit4]    > 	at com.carrotsearch.randomizedtesting.RandomizedRunner$5.evaluate(RandomizedRunner.java:693)
[junit4:junit4]    > 	at com.carrotsearch.randomizedtesting.rules.StatementAdapter.evaluate(StatementAdapter.java:36)
[junit4:junit4]    > 	at com.carrotsearch.randomizedtesting.rules.SystemPropertiesRestoreRule$1.evaluate(SystemPropertiesRestoreRule.java:53)
[junit4:junit4]    > 	at org.apache.lucene.util.AbstractBeforeAfterRule$1.evaluate(AbstractBeforeAfterRule.java:46)
[junit4:junit4]    > 	at org.apache.lucene.util.TestRuleStoreClassName$1.evaluate(TestRuleStoreClassName.java:42)
[junit4:junit4]    > 	at com.carrotsearch.randomizedtesting.rules.SystemPropertiesInvariantRule$1.evaluate(SystemPropertiesInvariantRule.java:55)
[junit4:junit4]    > 	at com.carrotsearch.randomizedtesting.rules.NoShadowingOrOverridesOnMethodsRule$1.evaluate(NoShadowingOrOverridesOnMethodsRule.java:39)
[junit4:junit4]    > 	at com.carrotsearch.randomizedtesting.rules.NoShadowingOrOverridesOnMethodsRule$1.evaluate(NoShadowingOrOverridesOnMethodsRule.java:39)
[junit4:junit4]    > 	at com.carrotsearch.randomizedtesting.rules.StatementAdapter.evaluate(StatementAdapter.java:36)
[junit4:junit4]    > 	at org.apache.lucene.util.TestRuleAssertionsRequired$1.evaluate(TestRuleAssertionsRequired.java:43)
[junit4:junit4]    > 	at org.apache.lucene.util.TestRuleMarkFailure$1.evaluate(TestRuleMarkFailure.java:48)
[junit4:junit4]    > 	at org.apache.lucene.util.TestRuleIgnoreAfterMaxFailures$1.evaluate(TestRuleIgnoreAfterMaxFailures.java:70)
[junit4:junit4]    > 	at org.apache.lucene.util.TestRuleIgnoreTestSuites$1.evaluate(TestRuleIgnoreTestSuites.java:55)
[junit4:junit4]    > 	at com.carrotsearch.randomizedtesting.rules.StatementAdapter.evaluate(StatementAdapter.java:36)
[junit4:junit4]    > 	at com.carrotsearch.randomizedtesting.ThreadLeakControl$StatementRunner.run(ThreadLeakControl.java:358)
[junit4:junit4]    > 	at java.lang.Thread.run(Thread.java:722)
[junit4:junit4]   2> 151294 T17 oas.SolrTestCaseJ4.deleteCore ###deleteCore
[junit4:junit4]   2> NOTE: test params are: codec=Asserting, sim=DefaultSimilarity, locale=es_EC, timezone=America/Argentina/Jujuy
[junit4:junit4]   2> NOTE: FreeBSD 9.0-RELEASE amd64/Oracle Corporation 1.7.0_09 (64-bit)/cpus=16,threads=2,free=98533560,total=176160768
[junit4:junit4]   2> NOTE: All tests run in this JVM: [TestPseudoReturnFields, UpdateRequestProcessorFactoryTest, SyncSliceTest]
[junit4:junit4] Completed on J0 in 151.35s, 1 test, 1 failure <<< FAILURES!

[...truncated 651 lines...]
BUILD FAILED
/usr/home/hudson/hudson-slave/workspace/Lucene-Solr-Tests-4.x-java7/build.xml:346: The following error occurred while executing this line:
/usr/home/hudson/hudson-slave/workspace/Lucene-Solr-Tests-4.x-java7/build.xml:39: The following error occurred while executing this line:
/usr/home/hudson/hudson-slave/workspace/Lucene-Solr-Tests-4.x-java7/solr/build.xml:178: The following error occurred while executing this line:
/usr/home/hudson/hudson-slave/workspace/Lucene-Solr-Tests-4.x-java7/solr/common-build.xml:428: The following error occurred while executing this line:
/usr/home/hudson/hudson-slave/workspace/Lucene-Solr-Tests-4.x-java7/lucene/common-build.xml:1176: The following error occurred while executing this line:
/usr/home/hudson/hudson-slave/workspace/Lucene-Solr-Tests-4.x-java7/lucene/common-build.xml:841: There were test failures: 249 suites, 1040 tests, 1 failure, 23 ignored (5 assumptions)

Total time: 35 minutes 30 seconds
Build step 'Invoke Ant' marked build as failure
Archiving artifacts
Recording test results
Email was triggered for: Failure
Sending email for trigger: Failure



Mime
View raw message