lucene-dev mailing list archives

Site index · List index
Message view « Date » · « Thread »
Top « Date » · « Thread »
From Apache Jenkins Server <jenk...@builds.apache.org>
Subject [JENKINS] Lucene-Solr-Tests-4.x-java7 - Build # 980 - Failure
Date Mon, 11 Feb 2013 05:23:31 GMT
Build: https://builds.apache.org/job/Lucene-Solr-Tests-4.x-java7/980/

1 tests failed.
REGRESSION:  org.apache.solr.cloud.SyncSliceTest.testDistribSearch

Error Message:
Test Setup Failure: shard1 should have just been set up to be inconsistent - but it's still consistent. Leader:http://127.0.0.1:60791/collection1skip list:[org.apache.solr.cloud.AbstractFullDistribZkTestBase$CloudJettyRunner@22431db5, org.apache.solr.cloud.AbstractFullDistribZkTestBase$CloudJettyRunner@bc298db3]

Stack Trace:
java.lang.AssertionError: Test Setup Failure: shard1 should have just been set up to be inconsistent - but it's still consistent. Leader:http://127.0.0.1:60791/collection1skip list:[org.apache.solr.cloud.AbstractFullDistribZkTestBase$CloudJettyRunner@22431db5, org.apache.solr.cloud.AbstractFullDistribZkTestBase$CloudJettyRunner@bc298db3]
	at __randomizedtesting.SeedInfo.seed([34565BB195141A89:B5B0D5A9E24B7AB5]:0)
	at org.junit.Assert.fail(Assert.java:93)
	at org.junit.Assert.assertTrue(Assert.java:43)
	at org.junit.Assert.assertNotNull(Assert.java:526)
	at org.apache.solr.cloud.SyncSliceTest.doTest(SyncSliceTest.java:216)
	at org.apache.solr.BaseDistributedSearchTestCase.testDistribSearch(BaseDistributedSearchTestCase.java:794)
	at sun.reflect.NativeMethodAccessorImpl.invoke0(Native Method)
	at sun.reflect.NativeMethodAccessorImpl.invoke(NativeMethodAccessorImpl.java:57)
	at sun.reflect.DelegatingMethodAccessorImpl.invoke(DelegatingMethodAccessorImpl.java:43)
	at java.lang.reflect.Method.invoke(Method.java:601)
	at com.carrotsearch.randomizedtesting.RandomizedRunner.invoke(RandomizedRunner.java:1559)
	at com.carrotsearch.randomizedtesting.RandomizedRunner.access$600(RandomizedRunner.java:79)
	at com.carrotsearch.randomizedtesting.RandomizedRunner$6.evaluate(RandomizedRunner.java:737)
	at com.carrotsearch.randomizedtesting.RandomizedRunner$7.evaluate(RandomizedRunner.java:773)
	at com.carrotsearch.randomizedtesting.RandomizedRunner$8.evaluate(RandomizedRunner.java:787)
	at com.carrotsearch.randomizedtesting.rules.SystemPropertiesRestoreRule$1.evaluate(SystemPropertiesRestoreRule.java:53)
	at org.apache.lucene.util.TestRuleSetupTeardownChained$1.evaluate(TestRuleSetupTeardownChained.java:50)
	at org.apache.lucene.util.TestRuleFieldCacheSanity$1.evaluate(TestRuleFieldCacheSanity.java:51)
	at org.apache.lucene.util.AbstractBeforeAfterRule$1.evaluate(AbstractBeforeAfterRule.java:46)
	at com.carrotsearch.randomizedtesting.rules.SystemPropertiesInvariantRule$1.evaluate(SystemPropertiesInvariantRule.java:55)
	at org.apache.lucene.util.TestRuleThreadAndTestName$1.evaluate(TestRuleThreadAndTestName.java:49)
	at org.apache.lucene.util.TestRuleIgnoreAfterMaxFailures$1.evaluate(TestRuleIgnoreAfterMaxFailures.java:70)
	at org.apache.lucene.util.TestRuleMarkFailure$1.evaluate(TestRuleMarkFailure.java:48)
	at com.carrotsearch.randomizedtesting.rules.StatementAdapter.evaluate(StatementAdapter.java:36)
	at com.carrotsearch.randomizedtesting.ThreadLeakControl$StatementRunner.run(ThreadLeakControl.java:358)
	at com.carrotsearch.randomizedtesting.ThreadLeakControl.forkTimeoutingTask(ThreadLeakControl.java:782)
	at com.carrotsearch.randomizedtesting.ThreadLeakControl$3.evaluate(ThreadLeakControl.java:442)
	at com.carrotsearch.randomizedtesting.RandomizedRunner.runSingleTest(RandomizedRunner.java:746)
	at com.carrotsearch.randomizedtesting.RandomizedRunner$3.evaluate(RandomizedRunner.java:648)
	at com.carrotsearch.randomizedtesting.RandomizedRunner$4.evaluate(RandomizedRunner.java:682)
	at com.carrotsearch.randomizedtesting.RandomizedRunner$5.evaluate(RandomizedRunner.java:693)
	at com.carrotsearch.randomizedtesting.rules.StatementAdapter.evaluate(StatementAdapter.java:36)
	at com.carrotsearch.randomizedtesting.rules.SystemPropertiesRestoreRule$1.evaluate(SystemPropertiesRestoreRule.java:53)
	at org.apache.lucene.util.AbstractBeforeAfterRule$1.evaluate(AbstractBeforeAfterRule.java:46)
	at org.apache.lucene.util.TestRuleStoreClassName$1.evaluate(TestRuleStoreClassName.java:42)
	at com.carrotsearch.randomizedtesting.rules.SystemPropertiesInvariantRule$1.evaluate(SystemPropertiesInvariantRule.java:55)
	at com.carrotsearch.randomizedtesting.rules.NoShadowingOrOverridesOnMethodsRule$1.evaluate(NoShadowingOrOverridesOnMethodsRule.java:39)
	at com.carrotsearch.randomizedtesting.rules.NoShadowingOrOverridesOnMethodsRule$1.evaluate(NoShadowingOrOverridesOnMethodsRule.java:39)
	at com.carrotsearch.randomizedtesting.rules.StatementAdapter.evaluate(StatementAdapter.java:36)
	at org.apache.lucene.util.TestRuleAssertionsRequired$1.evaluate(TestRuleAssertionsRequired.java:43)
	at org.apache.lucene.util.TestRuleMarkFailure$1.evaluate(TestRuleMarkFailure.java:48)
	at org.apache.lucene.util.TestRuleIgnoreAfterMaxFailures$1.evaluate(TestRuleIgnoreAfterMaxFailures.java:70)
	at org.apache.lucene.util.TestRuleIgnoreTestSuites$1.evaluate(TestRuleIgnoreTestSuites.java:55)
	at com.carrotsearch.randomizedtesting.rules.StatementAdapter.evaluate(StatementAdapter.java:36)
	at com.carrotsearch.randomizedtesting.ThreadLeakControl$StatementRunner.run(ThreadLeakControl.java:358)
	at java.lang.Thread.run(Thread.java:722)




Build Log:
[...truncated 9013 lines...]
[junit4:junit4] Suite: org.apache.solr.cloud.SyncSliceTest
[junit4:junit4]   2> 0 T453 oas.BaseDistributedSearchTestCase.initHostContext Setting hostContext system property: /
[junit4:junit4]   2> 7 T453 oas.SolrTestCaseJ4.setUp ###Starting testDistribSearch
[junit4:junit4]   2> Creating dataDir: /usr/home/hudson/hudson-slave/workspace/Lucene-Solr-Tests-4.x-java7/solr/build/solr-core/test/J0/./solrtest-SyncSliceTest-1360558825756
[junit4:junit4]   2> 16 T453 oasc.ZkTestServer.run STARTING ZK TEST SERVER
[junit4:junit4]   2> 23 T454 oasc.ZkTestServer$ZKServerMain.runFromConfig Starting server
[junit4:junit4]   2> 112 T454 oaz.Environment.logEnv Server environment:zookeeper.version=3.4.5-1392090, built on 09/30/2012 17:52 GMT
[junit4:junit4]   2> 112 T454 oaz.Environment.logEnv Server environment:host.name=lucene.zones.apache.org
[junit4:junit4]   2> 112 T454 oaz.Environment.logEnv Server environment:java.version=1.7.0_09
[junit4:junit4]   2> 112 T454 oaz.Environment.logEnv Server environment:java.vendor=Oracle Corporation
[junit4:junit4]   2> 112 T454 oaz.Environment.logEnv Server environment:java.home=/usr/local/openjdk7/jre
[junit4:junit4]   2> 112 T454 oaz.Environment.logEnv Server environment:java.class.path=/usr/home/hudson/hudson-slave/workspace/Lucene-Solr-Tests-4.x-java7/solr/build/solr-core/classes/test:/usr/home/hudson/hudson-slave/workspace/Lucene-Solr-Tests-4.x-java7/solr/build/solr-test-framework/classes/java:/usr/home/hudson/hudson-slave/workspace/Lucene-Solr-Tests-4.x-java7/solr/build/solr-core/test-files:/usr/home/hudson/hudson-slave/workspace/Lucene-Solr-Tests-4.x-java7/lucene/build/test-framework/classes/java:/usr/home/hudson/hudson-slave/workspace/Lucene-Solr-Tests-4.x-java7/lucene/build/codecs/classes/java:/usr/home/hudson/hudson-slave/workspace/Lucene-Solr-Tests-4.x-java7/solr/build/solr-solrj/classes/java:/usr/home/hudson/hudson-slave/workspace/Lucene-Solr-Tests-4.x-java7/solr/build/solr-core/classes/java:/usr/home/hudson/hudson-slave/workspace/Lucene-Solr-Tests-4.x-java7/lucene/build/analysis/common/lucene-analyzers-common-4.2-SNAPSHOT.jar:/usr/home/hudson/hudson-slave/workspace/Lucene-Solr-Tests-4.x-java7/lucene/build/analysis/kuromoji/lucene-analyzers-kuromoji-4.2-SNAPSHOT.jar:/usr/home/hudson/hudson-slave/workspace/Lucene-Solr-Tests-4.x-java7/lucene/build/analysis/phonetic/lucene-analyzers-phonetic-4.2-SNAPSHOT.jar:/usr/home/hudson/hudson-slave/workspace/Lucene-Solr-Tests-4.x-java7/lucene/build/highlighter/lucene-highlighter-4.2-SNAPSHOT.jar:/usr/home/hudson/hudson-slave/workspace/Lucene-Solr-Tests-4.x-java7/lucene/build/memory/lucene-memory-4.2-SNAPSHOT.jar:/usr/home/hudson/hudson-slave/workspace/Lucene-Solr-Tests-4.x-java7/lucene/build/misc/lucene-misc-4.2-SNAPSHOT.jar:/usr/home/hudson/hudson-slave/workspace/Lucene-Solr-Tests-4.x-java7/lucene/build/spatial/lucene-spatial-4.2-SNAPSHOT.jar:/usr/home/hudson/hudson-slave/workspace/Lucene-Solr-Tests-4.x-java7/lucene/build/suggest/lucene-suggest-4.2-SNAPSHOT.jar:/usr/home/hudson/hudson-slave/workspace/Lucene-Solr-Tests-4.x-java7/lucene/build/grouping/lucene-grouping-4.2-SNAPSHOT.jar:/usr/home/hudson/hudson-slave/workspace/Lucene-Solr-Tests-4.x-java7/lucene/build/queries/lucene-queries-4.2-SNAPSHOT.jar:/usr/home/hudson/hudson-slave/workspace/Lucene-Solr-Tests-4.x-java7/lucene/build/queryparser/lucene-queryparser-4.2-SNAPSHOT.jar:/usr/home/hudson/hudson-slave/workspace/Lucene-Solr-Tests-4.x-java7/solr/core/lib/cglib-nodep-2.2.jar:/usr/home/hudson/hudson-slave/workspace/Lucene-Solr-Tests-4.x-java7/solr/core/lib/commons-cli-1.2.jar:/usr/home/hudson/hudson-slave/workspace/Lucene-Solr-Tests-4.x-java7/solr/core/lib/commons-codec-1.7.jar:/usr/home/hudson/hudson-slave/workspace/Lucene-Solr-Tests-4.x-java7/solr/core/lib/commons-fileupload-1.2.1.jar:/usr/home/hudson/hudson-slave/workspace/Lucene-Solr-Tests-4.x-java7/solr/core/lib/commons-lang-2.6.jar:/usr/home/hudson/hudson-slave/workspace/Lucene-Solr-Tests-4.x-java7/solr/core/lib/easymock-3.0.jar:/usr/home/hudson/hudson-slave/workspace/Lucene-Solr-Tests-4.x-java7/solr/core/lib/guava-13.0.1.jar:/usr/home/hudson/hudson-slave/workspace/Lucene-Solr-Tests-4.x-java7/solr/core/lib/javax.servlet-api-3.0.1.jar:/usr/home/hudson/hudson-slave/workspace/Lucene-Solr-Tests-4.x-java7/solr/core/lib/objenesis-1.2.jar:/usr/home/hudson/hudson-slave/workspace/Lucene-Solr-Tests-4.x-java7/solr/core/lib/spatial4j-0.3.jar:/usr/home/hudson/hudson-slave/workspace/Lucene-Solr-Tests-4.x-java7/solr/solrj/lib/commons-io-2.1.jar:/usr/home/hudson/hudson-slave/workspace/Lucene-Solr-Tests-4.x-java7/solr/solrj/lib/httpclient-4.1.3.jar:/usr/home/hudson/hudson-slave/workspace/Lucene-Solr-Tests-4.x-java7/solr/solrj/lib/httpcore-4.1.4.jar:/usr/home/hudson/hudson-slave/workspace/Lucene-Solr-Tests-4.x-java7/solr/solrj/lib/httpmime-4.1.3.jar:/usr/home/hudson/hudson-slave/workspace/Lucene-Solr-Tests-4.x-java7/solr/solrj/lib/jcl-over-slf4j-1.6.4.jar:/usr/home/hudson/hudson-slave/workspace/Lucene-Solr-Tests-4.x-java7/solr/solrj/lib/slf4j-api-1.6.4.jar:/usr/home/hudson/hudson-slave/workspace/Lucene-Solr-Tests-4.x-java7/solr/solrj/lib/slf4j-jdk14-1.6.4.jar:/usr/home/hudson/hudson-slave/workspace/Lucene-Solr-Tests-4.x-java7/solr/solrj/lib/wstx-asl-3.2.7.jar:/usr/home/hudson/hudson-slave/workspace/Lucene-Solr-Tests-4.x-java7/solr/solrj/lib/zookeeper-3.4.5.jar:/usr/home/hudson/hudson-slave/workspace/Lucene-Solr-Tests-4.x-java7/solr/example/lib/jetty-continuation-8.1.8.v20121106.jar:/usr/home/hudson/hudson-slave/workspace/Lucene-Solr-Tests-4.x-java7/solr/example/lib/jetty-deploy-8.1.8.v20121106.jar:/usr/home/hudson/hudson-slave/workspace/Lucene-Solr-Tests-4.x-java7/solr/example/lib/jetty-http-8.1.8.v20121106.jar:/usr/home/hudson/hudson-slave/workspace/Lucene-Solr-Tests-4.x-java7/solr/example/lib/jetty-io-8.1.8.v20121106.jar:/usr/home/hudson/hudson-slave/workspace/Lucene-Solr-Tests-4.x-java7/solr/example/lib/jetty-jmx-8.1.8.v20121106.jar:/usr/home/hudson/hudson-slave/workspace/Lucene-Solr-Tests-4.x-java7/solr/example/lib/jetty-security-8.1.8.v20121106.jar:/usr/home/hudson/hudson-slave/workspace/Lucene-Solr-Tests-4.x-java7/solr/example/lib/jetty-server-8.1.8.v20121106.jar:/usr/home/hudson/hudson-slave/workspace/Lucene-Solr-Tests-4.x-java7/solr/example/lib/jetty-servlet-8.1.8.v20121106.jar:/usr/home/hudson/hudson-slave/workspace/Lucene-Solr-Tests-4.x-java7/solr/example/lib/jetty-util-8.1.8.v20121106.jar:/usr/home/hudson/hudson-slave/workspace/Lucene-Solr-Tests-4.x-java7/solr/example/lib/jetty-webapp-8.1.8.v20121106.jar:/usr/home/hudson/hudson-slave/workspace/Lucene-Solr-Tests-4.x-java7/solr/example/lib/jetty-xml-8.1.8.v20121106.jar:/usr/home/hudson/hudson-slave/workspace/Lucene-Solr-Tests-4.x-java7/solr/example/lib/servlet-api-3.0.jar:/usr/home/hudson/hudson-slave/workspace/Lucene-Solr-Tests-4.x-java7/solr/example/example-DIH/solr/db/lib/derby-10.9.1.0.jar:/usr/home/hudson/hudson-slave/workspace/Lucene-Solr-Tests-4.x-java7/solr/example/example-DIH/solr/db/lib/hsqldb-1.8.0.10.jar:/usr/home/hudson/hudson-slave/workspace/Lucene-Solr-Tests-4.x-java7/lucene/build/core/classes/java:/usr/home/hudson/hudson-slave/workspace/Lucene-Solr-Tests-4.x-java7/lucene/test-framework/lib/junit-4.10.jar:/usr/home/hudson/hudson-slave/workspace/Lucene-Solr-Tests-4.x-java7/lucene/test-framework/lib/randomizedtesting-runner-2.0.8.jar:/home/hudson/hudson-slave/tools/hudson.tasks.Ant_AntInstallation/ant-1.8.2/lib/ant-launcher.jar:/home/hudson/.ant/lib/ivy-2.2.0.jar:/home/hudson/hudson-slave/tools/hudson.tasks.Ant_AntInstallation/ant-1.8.2/lib/ant-commons-logging.jar:/home/hudson/hudson-slave/tools/hudson.tasks.Ant_AntInstallation/ant-1.8.2/lib/ant-apache-regexp.jar:/home/hudson/hudson-slave/tools/hudson.tasks.Ant_AntInstallation/ant-1.8.2/lib/ant-apache-oro.jar:/home/hudson/hudson-slave/tools/hudson.tasks.Ant_AntInstallation/ant-1.8.2/lib/ant-swing.jar:/home/hudson/hudson-slave/tools/hudson.tasks.Ant_AntInstallation/ant-1.8.2/lib/ant-jdepend.jar:/home/hudson/hudson-slave/tools/hudson.tasks.Ant_AntInstallation/ant-1.8.2/lib/ant-apache-xalan2.jar:/home/hudson/hudson-slave/tools/hudson.tasks.Ant_AntInstallation/ant-1.8.2/lib/ant-apache-bsf.jar:/home/hudson/hudson-slave/tools/hudson.tasks.Ant_AntInstallation/ant-1.8.2/lib/ant-junit4.jar:/home/hudson/hudson-slave/tools/hudson.tasks.Ant_AntInstallation/ant-1.8.2/lib/ant-commons-net.jar:/home/hudson/hudson-slave/tools/hudson.tasks.Ant_AntInstallation/ant-1.8.2/lib/ant-antlr.jar:/home/hudson/hudson-slave/tools/hudson.tasks.Ant_AntInstallation/ant-1.8.2/lib/ant-junit.jar:/home/hudson/hudson-slave/tools/hudson.tasks.Ant_AntInstallation/ant-1.8.2/lib/ant-jmf.jar:/home/hudson/hudson-slave/tools/hudson.tasks.Ant_AntInstallation/ant-1.8.2/lib/ant-netrexx.jar:/home/hudson/hudson-slave/tools/hudson.tasks.Ant_AntInstallation/ant-1.8.2/lib/ant-apache-log4j.jar:/home/hudson/hudson-slave/tools/hudson.tasks.Ant_AntInstallation/ant-1.8.2/lib/ant-apache-resolver.jar:/home/hudson/hudson-slave/tools/hudson.tasks.Ant_AntInstallation/ant-1.8.2/lib/ant.jar:/home/hudson/hudson-slave/tools/hudson.tasks.Ant_AntInstallation/ant-1.8.2/lib/ant-jsch.jar:/home/hudson/hudson-slave/tools/hudson.tasks.Ant_AntInstallation/ant-1.8.2/lib/ant-testutil.jar:/home/hudson/hudson-slave/tools/hudson.tasks.Ant_AntInstallation/ant-1.8.2/lib/ant-apache-bcel.jar:/home/hudson/hudson-slave/tools/hudson.tasks.Ant_AntInstallation/ant-1.8.2/lib/ant-jai.jar:/home/hudson/hudson-slave/tools/hudson.tasks.Ant_AntInstallation/ant-1.8.2/lib/ant-javamail.jar:/usr/local/openjdk7/lib/tools.jar:/home/hudson/.ivy2/cache/com.carrotsearch.randomizedtesting/junit4-ant/jars/junit4-ant-2.0.8.jar
[junit4:junit4]   2> 114 T454 oaz.Environment.logEnv Server environment:java.library.path=/usr/local/openjdk7/jre/lib/amd64/server:/usr/local/openjdk7/jre/lib/amd64:/usr/local/openjdk7/jre/../lib/amd64:/usr/local/openjdk6/jre/lib/amd64/server:/usr/local/openjdk6/jre/lib/amd64:/usr/local/openjdk6/jre/../lib/amd64:/usr/java/packages/lib/amd64:/lib:/usr/lib:/usr/local/lib
[junit4:junit4]   2> 114 T454 oaz.Environment.logEnv Server environment:java.io.tmpdir=.
[junit4:junit4]   2> 114 T454 oaz.Environment.logEnv Server environment:java.compiler=<NA>
[junit4:junit4]   2> 115 T454 oaz.Environment.logEnv Server environment:os.name=FreeBSD
[junit4:junit4]   2> 115 T454 oaz.Environment.logEnv Server environment:os.arch=amd64
[junit4:junit4]   2> 115 T454 oaz.Environment.logEnv Server environment:os.version=9.0-RELEASE
[junit4:junit4]   2> 115 T454 oaz.Environment.logEnv Server environment:user.name=hudson
[junit4:junit4]   2> 115 T454 oaz.Environment.logEnv Server environment:user.home=/home/hudson
[junit4:junit4]   2> 115 T454 oaz.Environment.logEnv Server environment:user.dir=/usr/home/hudson/hudson-slave/workspace/Lucene-Solr-Tests-4.x-java7/solr/build/solr-core/test/J0
[junit4:junit4]   2> 167 T454 oazs.ZooKeeperServer.setTickTime tickTime set to 1000
[junit4:junit4]   2> 167 T454 oazs.ZooKeeperServer.setMinSessionTimeout minSessionTimeout set to -1
[junit4:junit4]   2> 167 T454 oazs.ZooKeeperServer.setMaxSessionTimeout maxSessionTimeout set to -1
[junit4:junit4]   2> 174 T454 oazs.NIOServerCnxnFactory.configure binding to port 0.0.0.0/0.0.0.0:0
[junit4:junit4]   2> 225 T453 oasc.ZkTestServer.run start zk server on port:60763
[junit4:junit4]   2> 270 T454 oazsp.FileTxnSnapLog.save Snapshotting: 0x0 to /usr/home/hudson/hudson-slave/workspace/Lucene-Solr-Tests-4.x-java7/solr/build/solr-core/test/J0/./org.apache.solr.cloud.SyncSliceTest-1360558825755/zookeeper/server1/data/version-2/snapshot.0
[junit4:junit4]   2> 321 T453 oaz.Environment.logEnv Client environment:zookeeper.version=3.4.5-1392090, built on 09/30/2012 17:52 GMT
[junit4:junit4]   2> 322 T453 oaz.Environment.logEnv Client environment:host.name=lucene.zones.apache.org
[junit4:junit4]   2> 322 T453 oaz.Environment.logEnv Client environment:java.version=1.7.0_09
[junit4:junit4]   2> 323 T453 oaz.Environment.logEnv Client environment:java.vendor=Oracle Corporation
[junit4:junit4]   2> 323 T453 oaz.Environment.logEnv Client environment:java.home=/usr/local/openjdk7/jre
[junit4:junit4]   2> 323 T453 oaz.Environment.logEnv Client environment:java.class.path=/usr/home/hudson/hudson-slave/workspace/Lucene-Solr-Tests-4.x-java7/solr/build/solr-core/classes/test:/usr/home/hudson/hudson-slave/workspace/Lucene-Solr-Tests-4.x-java7/solr/build/solr-test-framework/classes/java:/usr/home/hudson/hudson-slave/workspace/Lucene-Solr-Tests-4.x-java7/solr/build/solr-core/test-files:/usr/home/hudson/hudson-slave/workspace/Lucene-Solr-Tests-4.x-java7/lucene/build/test-framework/classes/java:/usr/home/hudson/hudson-slave/workspace/Lucene-Solr-Tests-4.x-java7/lucene/build/codecs/classes/java:/usr/home/hudson/hudson-slave/workspace/Lucene-Solr-Tests-4.x-java7/solr/build/solr-solrj/classes/java:/usr/home/hudson/hudson-slave/workspace/Lucene-Solr-Tests-4.x-java7/solr/build/solr-core/classes/java:/usr/home/hudson/hudson-slave/workspace/Lucene-Solr-Tests-4.x-java7/lucene/build/analysis/common/lucene-analyzers-common-4.2-SNAPSHOT.jar:/usr/home/hudson/hudson-slave/workspace/Lucene-Solr-Tests-4.x-java7/lucene/build/analysis/kuromoji/lucene-analyzers-kuromoji-4.2-SNAPSHOT.jar:/usr/home/hudson/hudson-slave/workspace/Lucene-Solr-Tests-4.x-java7/lucene/build/analysis/phonetic/lucene-analyzers-phonetic-4.2-SNAPSHOT.jar:/usr/home/hudson/hudson-slave/workspace/Lucene-Solr-Tests-4.x-java7/lucene/build/highlighter/lucene-highlighter-4.2-SNAPSHOT.jar:/usr/home/hudson/hudson-slave/workspace/Lucene-Solr-Tests-4.x-java7/lucene/build/memory/lucene-memory-4.2-SNAPSHOT.jar:/usr/home/hudson/hudson-slave/workspace/Lucene-Solr-Tests-4.x-java7/lucene/build/misc/lucene-misc-4.2-SNAPSHOT.jar:/usr/home/hudson/hudson-slave/workspace/Lucene-Solr-Tests-4.x-java7/lucene/build/spatial/lucene-spatial-4.2-SNAPSHOT.jar:/usr/home/hudson/hudson-slave/workspace/Lucene-Solr-Tests-4.x-java7/lucene/build/suggest/lucene-suggest-4.2-SNAPSHOT.jar:/usr/home/hudson/hudson-slave/workspace/Lucene-Solr-Tests-4.x-java7/lucene/build/grouping/lucene-grouping-4.2-SNAPSHOT.jar:/usr/home/hudson/hudson-slave/workspace/Lucene-Solr-Tests-4.x-java7/lucene/build/queries/lucene-queries-4.2-SNAPSHOT.jar:/usr/home/hudson/hudson-slave/workspace/Lucene-Solr-Tests-4.x-java7/lucene/build/queryparser/lucene-queryparser-4.2-SNAPSHOT.jar:/usr/home/hudson/hudson-slave/workspace/Lucene-Solr-Tests-4.x-java7/solr/core/lib/cglib-nodep-2.2.jar:/usr/home/hudson/hudson-slave/workspace/Lucene-Solr-Tests-4.x-java7/solr/core/lib/commons-cli-1.2.jar:/usr/home/hudson/hudson-slave/workspace/Lucene-Solr-Tests-4.x-java7/solr/core/lib/commons-codec-1.7.jar:/usr/home/hudson/hudson-slave/workspace/Lucene-Solr-Tests-4.x-java7/solr/core/lib/commons-fileupload-1.2.1.jar:/usr/home/hudson/hudson-slave/workspace/Lucene-Solr-Tests-4.x-java7/solr/core/lib/commons-lang-2.6.jar:/usr/home/hudson/hudson-slave/workspace/Lucene-Solr-Tests-4.x-java7/solr/core/lib/easymock-3.0.jar:/usr/home/hudson/hudson-slave/workspace/Lucene-Solr-Tests-4.x-java7/solr/core/lib/guava-13.0.1.jar:/usr/home/hudson/hudson-slave/workspace/Lucene-Solr-Tests-4.x-java7/solr/core/lib/javax.servlet-api-3.0.1.jar:/usr/home/hudson/hudson-slave/workspace/Lucene-Solr-Tests-4.x-java7/solr/core/lib/objenesis-1.2.jar:/usr/home/hudson/hudson-slave/workspace/Lucene-Solr-Tests-4.x-java7/solr/core/lib/spatial4j-0.3.jar:/usr/home/hudson/hudson-slave/workspace/Lucene-Solr-Tests-4.x-java7/solr/solrj/lib/commons-io-2.1.jar:/usr/home/hudson/hudson-slave/workspace/Lucene-Solr-Tests-4.x-java7/solr/solrj/lib/httpclient-4.1.3.jar:/usr/home/hudson/hudson-slave/workspace/Lucene-Solr-Tests-4.x-java7/solr/solrj/lib/httpcore-4.1.4.jar:/usr/home/hudson/hudson-slave/workspace/Lucene-Solr-Tests-4.x-java7/solr/solrj/lib/httpmime-4.1.3.jar:/usr/home/hudson/hudson-slave/workspace/Lucene-Solr-Tests-4.x-java7/solr/solrj/lib/jcl-over-slf4j-1.6.4.jar:/usr/home/hudson/hudson-slave/workspace/Lucene-Solr-Tests-4.x-java7/solr/solrj/lib/slf4j-api-1.6.4.jar:/usr/home/hudson/hudson-slave/workspace/Lucene-Solr-Tests-4.x-java7/solr/solrj/lib/slf4j-jdk14-1.6.4.jar:/usr/home/hudson/hudson-slave/workspace/Lucene-Solr-Tests-4.x-java7/solr/solrj/lib/wstx-asl-3.2.7.jar:/usr/home/hudson/hudson-slave/workspace/Lucene-Solr-Tests-4.x-java7/solr/solrj/lib/zookeeper-3.4.5.jar:/usr/home/hudson/hudson-slave/workspace/Lucene-Solr-Tests-4.x-java7/solr/example/lib/jetty-continuation-8.1.8.v20121106.jar:/usr/home/hudson/hudson-slave/workspace/Lucene-Solr-Tests-4.x-java7/solr/example/lib/jetty-deploy-8.1.8.v20121106.jar:/usr/home/hudson/hudson-slave/workspace/Lucene-Solr-Tests-4.x-java7/solr/example/lib/jetty-http-8.1.8.v20121106.jar:/usr/home/hudson/hudson-slave/workspace/Lucene-Solr-Tests-4.x-java7/solr/example/lib/jetty-io-8.1.8.v20121106.jar:/usr/home/hudson/hudson-slave/workspace/Lucene-Solr-Tests-4.x-java7/solr/example/lib/jetty-jmx-8.1.8.v20121106.jar:/usr/home/hudson/hudson-slave/workspace/Lucene-Solr-Tests-4.x-java7/solr/example/lib/jetty-security-8.1.8.v20121106.jar:/usr/home/hudson/hudson-slave/workspace/Lucene-Solr-Tests-4.x-java7/solr/example/lib/jetty-server-8.1.8.v20121106.jar:/usr/home/hudson/hudson-slave/workspace/Lucene-Solr-Tests-4.x-java7/solr/example/lib/jetty-servlet-8.1.8.v20121106.jar:/usr/home/hudson/hudson-slave/workspace/Lucene-Solr-Tests-4.x-java7/solr/example/lib/jetty-util-8.1.8.v20121106.jar:/usr/home/hudson/hudson-slave/workspace/Lucene-Solr-Tests-4.x-java7/solr/example/lib/jetty-webapp-8.1.8.v20121106.jar:/usr/home/hudson/hudson-slave/workspace/Lucene-Solr-Tests-4.x-java7/solr/example/lib/jetty-xml-8.1.8.v20121106.jar:/usr/home/hudson/hudson-slave/workspace/Lucene-Solr-Tests-4.x-java7/solr/example/lib/servlet-api-3.0.jar:/usr/home/hudson/hudson-slave/workspace/Lucene-Solr-Tests-4.x-java7/solr/example/example-DIH/solr/db/lib/derby-10.9.1.0.jar:/usr/home/hudson/hudson-slave/workspace/Lucene-Solr-Tests-4.x-java7/solr/example/example-DIH/solr/db/lib/hsqldb-1.8.0.10.jar:/usr/home/hudson/hudson-slave/workspace/Lucene-Solr-Tests-4.x-java7/lucene/build/core/classes/java:/usr/home/hudson/hudson-slave/workspace/Lucene-Solr-Tests-4.x-java7/lucene/test-framework/lib/junit-4.10.jar:/usr/home/hudson/hudson-slave/workspace/Lucene-Solr-Tests-4.x-java7/lucene/test-framework/lib/randomizedtesting-runner-2.0.8.jar:/home/hudson/hudson-slave/tools/hudson.tasks.Ant_AntInstallation/ant-1.8.2/lib/ant-launcher.jar:/home/hudson/.ant/lib/ivy-2.2.0.jar:/home/hudson/hudson-slave/tools/hudson.tasks.Ant_AntInstallation/ant-1.8.2/lib/ant-commons-logging.jar:/home/hudson/hudson-slave/tools/hudson.tasks.Ant_AntInstallation/ant-1.8.2/lib/ant-apache-regexp.jar:/home/hudson/hudson-slave/tools/hudson.tasks.Ant_AntInstallation/ant-1.8.2/lib/ant-apache-oro.jar:/home/hudson/hudson-slave/tools/hudson.tasks.Ant_AntInstallation/ant-1.8.2/lib/ant-swing.jar:/home/hudson/hudson-slave/tools/hudson.tasks.Ant_AntInstallation/ant-1.8.2/lib/ant-jdepend.jar:/home/hudson/hudson-slave/tools/hudson.tasks.Ant_AntInstallation/ant-1.8.2/lib/ant-apache-xalan2.jar:/home/hudson/hudson-slave/tools/hudson.tasks.Ant_AntInstallation/ant-1.8.2/lib/ant-apache-bsf.jar:/home/hudson/hudson-slave/tools/hudson.tasks.Ant_AntInstallation/ant-1.8.2/lib/ant-junit4.jar:/home/hudson/hudson-slave/tools/hudson.tasks.Ant_AntInstallation/ant-1.8.2/lib/ant-commons-net.jar:/home/hudson/hudson-slave/tools/hudson.tasks.Ant_AntInstallation/ant-1.8.2/lib/ant-antlr.jar:/home/hudson/hudson-slave/tools/hudson.tasks.Ant_AntInstallation/ant-1.8.2/lib/ant-junit.jar:/home/hudson/hudson-slave/tools/hudson.tasks.Ant_AntInstallation/ant-1.8.2/lib/ant-jmf.jar:/home/hudson/hudson-slave/tools/hudson.tasks.Ant_AntInstallation/ant-1.8.2/lib/ant-netrexx.jar:/home/hudson/hudson-slave/tools/hudson.tasks.Ant_AntInstallation/ant-1.8.2/lib/ant-apache-log4j.jar:/home/hudson/hudson-slave/tools/hudson.tasks.Ant_AntInstallation/ant-1.8.2/lib/ant-apache-resolver.jar:/home/hudson/hudson-slave/tools/hudson.tasks.Ant_AntInstallation/ant-1.8.2/lib/ant.jar:/home/hudson/hudson-slave/tools/hudson.tasks.Ant_AntInstallation/ant-1.8.2/lib/ant-jsch.jar:/home/hudson/hudson-slave/tools/hudson.tasks.Ant_AntInstallation/ant-1.8.2/lib/ant-testutil.jar:/home/hudson/hudson-slave/tools/hudson.tasks.Ant_AntInstallation/ant-1.8.2/lib/ant-apache-bcel.jar:/home/hudson/hudson-slave/tools/hudson.tasks.Ant_AntInstallation/ant-1.8.2/lib/ant-jai.jar:/home/hudson/hudson-slave/tools/hudson.tasks.Ant_AntInstallation/ant-1.8.2/lib/ant-javamail.jar:/usr/local/openjdk7/lib/tools.jar:/home/hudson/.ivy2/cache/com.carrotsearch.randomizedtesting/junit4-ant/jars/junit4-ant-2.0.8.jar
[junit4:junit4]   2> 325 T453 oaz.Environment.logEnv Client environment:java.library.path=/usr/local/openjdk7/jre/lib/amd64/server:/usr/local/openjdk7/jre/lib/amd64:/usr/local/openjdk7/jre/../lib/amd64:/usr/local/openjdk6/jre/lib/amd64/server:/usr/local/openjdk6/jre/lib/amd64:/usr/local/openjdk6/jre/../lib/amd64:/usr/java/packages/lib/amd64:/lib:/usr/lib:/usr/local/lib
[junit4:junit4]   2> 326 T453 oaz.Environment.logEnv Client environment:java.io.tmpdir=.
[junit4:junit4]   2> 326 T453 oaz.Environment.logEnv Client environment:java.compiler=<NA>
[junit4:junit4]   2> 326 T453 oaz.Environment.logEnv Client environment:os.name=FreeBSD
[junit4:junit4]   2> 327 T453 oaz.Environment.logEnv Client environment:os.arch=amd64
[junit4:junit4]   2> 327 T453 oaz.Environment.logEnv Client environment:os.version=9.0-RELEASE
[junit4:junit4]   2> 328 T453 oaz.Environment.logEnv Client environment:user.name=hudson
[junit4:junit4]   2> 328 T453 oaz.Environment.logEnv Client environment:user.home=/home/hudson
[junit4:junit4]   2> 328 T453 oaz.Environment.logEnv Client environment:user.dir=/usr/home/hudson/hudson-slave/workspace/Lucene-Solr-Tests-4.x-java7/solr/build/solr-core/test/J0
[junit4:junit4]   2> 334 T453 oaz.ZooKeeper.<init> Initiating client connection, connectString=127.0.0.1:60763 sessionTimeout=10000 watcher=org.apache.solr.common.cloud.ConnectionManager@6611e305
[junit4:junit4]   2> 417 T453 oascc.ConnectionManager.waitForConnected Waiting for client to connect to ZooKeeper
[junit4:junit4]   2> 433 T458 oaz.ClientCnxn$SendThread.logStartConnect Opening socket connection to server localhost/127.0.0.1:60763. Will not attempt to authenticate using SASL (access denied ("javax.security.auth.AuthPermission" "getLoginConfiguration"))
[junit4:junit4]   2> 435 T458 oaz.ClientCnxn$SendThread.primeConnection Socket connection established to localhost/127.0.0.1:60763, initiating session
[junit4:junit4]   2> 436 T455 oazs.NIOServerCnxnFactory.run Accepted socket connection from /140.211.11.196:60764
[junit4:junit4]   2> 467 T455 oazs.ZooKeeperServer.processConnectRequest Client attempting to establish new session at /140.211.11.196:60764
[junit4:junit4]   2> 483 T457 oazsp.FileTxnLog.append Creating new log file: log.1
[junit4:junit4]   2> 524 T457 oazs.ZooKeeperServer.finishSessionInit Established session 0x13cc7a0224d0000 with negotiated timeout 10000 for client /140.211.11.196:60764
[junit4:junit4]   2> 524 T458 oaz.ClientCnxn$SendThread.onConnected Session establishment complete on server localhost/127.0.0.1:60763, sessionid = 0x13cc7a0224d0000, negotiated timeout = 10000
[junit4:junit4]   2> 532 T460 oascc.ConnectionManager.process Watcher org.apache.solr.common.cloud.ConnectionManager@6611e305 name:ZooKeeperConnection Watcher:127.0.0.1:60763 got event WatchedEvent state:SyncConnected type:None path:null path:null type:None
[junit4:junit4]   2> 533 T453 oascc.ConnectionManager.waitForConnected Client is connected to ZooKeeper
[junit4:junit4]   2> 537 T453 oascc.SolrZkClient.makePath makePath: /solr
[junit4:junit4]   2> 623 T459 oazs.PrepRequestProcessor.pRequest2Txn Processed session termination for sessionid: 0x13cc7a0224d0000
[junit4:junit4]   2> 625 T460 oaz.ClientCnxn$EventThread.run EventThread shut down
[junit4:junit4]   2> 625 T453 oaz.ZooKeeper.close Session: 0x13cc7a0224d0000 closed
[junit4:junit4]   2> 626 T453 oaz.ZooKeeper.<init> Initiating client connection, connectString=127.0.0.1:60763/solr sessionTimeout=10000 watcher=org.apache.solr.common.cloud.ConnectionManager@4af0d2ae
[junit4:junit4]   2> 626 T455 oazs.NIOServerCnxn.closeSock Closed socket connection for client /140.211.11.196:60764 which had sessionid 0x13cc7a0224d0000
[junit4:junit4]   2> 627 T453 oascc.ConnectionManager.waitForConnected Waiting for client to connect to ZooKeeper
[junit4:junit4]   2> 627 T461 oaz.ClientCnxn$SendThread.logStartConnect Opening socket connection to server localhost/127.0.0.1:60763. Will not attempt to authenticate using SASL (access denied ("javax.security.auth.AuthPermission" "getLoginConfiguration"))
[junit4:junit4]   2> 628 T461 oaz.ClientCnxn$SendThread.primeConnection Socket connection established to localhost/127.0.0.1:60763, initiating session
[junit4:junit4]   2> 628 T455 oazs.NIOServerCnxnFactory.run Accepted socket connection from /140.211.11.196:60766
[junit4:junit4]   2> 629 T455 oazs.ZooKeeperServer.processConnectRequest Client attempting to establish new session at /140.211.11.196:60766
[junit4:junit4]   2> 636 T457 oazs.ZooKeeperServer.finishSessionInit Established session 0x13cc7a0224d0001 with negotiated timeout 10000 for client /140.211.11.196:60766
[junit4:junit4]   2> 637 T461 oaz.ClientCnxn$SendThread.onConnected Session establishment complete on server localhost/127.0.0.1:60763, sessionid = 0x13cc7a0224d0001, negotiated timeout = 10000
[junit4:junit4]   2> 637 T462 oascc.ConnectionManager.process Watcher org.apache.solr.common.cloud.ConnectionManager@4af0d2ae name:ZooKeeperConnection Watcher:127.0.0.1:60763/solr got event WatchedEvent state:SyncConnected type:None path:null path:null type:None
[junit4:junit4]   2> 637 T453 oascc.ConnectionManager.waitForConnected Client is connected to ZooKeeper
[junit4:junit4]   2> 643 T453 oascc.SolrZkClient.makePath makePath: /collections/collection1
[junit4:junit4]   2> 650 T453 oascc.SolrZkClient.makePath makePath: /collections/collection1/shards
[junit4:junit4]   2> 655 T453 oascc.SolrZkClient.makePath makePath: /collections/control_collection
[junit4:junit4]   2> 659 T453 oascc.SolrZkClient.makePath makePath: /collections/control_collection/shards
[junit4:junit4]   2> 665 T453 oasc.AbstractZkTestCase.putConfig put /usr/home/hudson/hudson-slave/workspace/Lucene-Solr-Tests-4.x-java7/solr/build/solr-core/test-files/solr/collection1/conf/solrconfig.xml to /configs/conf1/solrconfig.xml
[junit4:junit4]   2> 668 T453 oascc.SolrZkClient.makePath makePath: /configs/conf1/solrconfig.xml
[junit4:junit4]   2> 679 T453 oasc.AbstractZkTestCase.putConfig put /usr/home/hudson/hudson-slave/workspace/Lucene-Solr-Tests-4.x-java7/solr/build/solr-core/test-files/solr/collection1/conf/schema.xml to /configs/conf1/schema.xml
[junit4:junit4]   2> 682 T453 oascc.SolrZkClient.makePath makePath: /configs/conf1/schema.xml
[junit4:junit4]   2> 789 T453 oasc.AbstractZkTestCase.putConfig put /usr/home/hudson/hudson-slave/workspace/Lucene-Solr-Tests-4.x-java7/solr/build/solr-core/test-files/solr/collection1/conf/stopwords.txt to /configs/conf1/stopwords.txt
[junit4:junit4]   2> 790 T453 oascc.SolrZkClient.makePath makePath: /configs/conf1/stopwords.txt
[junit4:junit4]   2> 801 T453 oasc.AbstractZkTestCase.putConfig put /usr/home/hudson/hudson-slave/workspace/Lucene-Solr-Tests-4.x-java7/solr/build/solr-core/test-files/solr/collection1/conf/protwords.txt to /configs/conf1/protwords.txt
[junit4:junit4]   2> 802 T453 oascc.SolrZkClient.makePath makePath: /configs/conf1/protwords.txt
[junit4:junit4]   2> 815 T453 oasc.AbstractZkTestCase.putConfig put /usr/home/hudson/hudson-slave/workspace/Lucene-Solr-Tests-4.x-java7/solr/build/solr-core/test-files/solr/collection1/conf/currency.xml to /configs/conf1/currency.xml
[junit4:junit4]   2> 816 T453 oascc.SolrZkClient.makePath makePath: /configs/conf1/currency.xml
[junit4:junit4]   2> 823 T453 oasc.AbstractZkTestCase.putConfig put /usr/home/hudson/hudson-slave/workspace/Lucene-Solr-Tests-4.x-java7/solr/build/solr-core/test-files/solr/collection1/conf/open-exchange-rates.json to /configs/conf1/open-exchange-rates.json
[junit4:junit4]   2> 824 T453 oascc.SolrZkClient.makePath makePath: /configs/conf1/open-exchange-rates.json
[junit4:junit4]   2> 830 T453 oasc.AbstractZkTestCase.putConfig put /usr/home/hudson/hudson-slave/workspace/Lucene-Solr-Tests-4.x-java7/solr/build/solr-core/test-files/solr/collection1/conf/mapping-ISOLatin1Accent.txt to /configs/conf1/mapping-ISOLatin1Accent.txt
[junit4:junit4]   2> 831 T453 oascc.SolrZkClient.makePath makePath: /configs/conf1/mapping-ISOLatin1Accent.txt
[junit4:junit4]   2> 839 T453 oasc.AbstractZkTestCase.putConfig put /usr/home/hudson/hudson-slave/workspace/Lucene-Solr-Tests-4.x-java7/solr/build/solr-core/test-files/solr/collection1/conf/old_synonyms.txt to /configs/conf1/old_synonyms.txt
[junit4:junit4]   2> 840 T453 oascc.SolrZkClient.makePath makePath: /configs/conf1/old_synonyms.txt
[junit4:junit4]   2> 850 T453 oasc.AbstractZkTestCase.putConfig put /usr/home/hudson/hudson-slave/workspace/Lucene-Solr-Tests-4.x-java7/solr/build/solr-core/test-files/solr/collection1/conf/synonyms.txt to /configs/conf1/synonyms.txt
[junit4:junit4]   2> 851 T453 oascc.SolrZkClient.makePath makePath: /configs/conf1/synonyms.txt
[junit4:junit4]   2> 858 T459 oazs.PrepRequestProcessor.pRequest2Txn Processed session termination for sessionid: 0x13cc7a0224d0001
[junit4:junit4]   2> 867 T462 oaz.ClientCnxn$EventThread.run EventThread shut down
[junit4:junit4]   2> 867 T453 oaz.ZooKeeper.close Session: 0x13cc7a0224d0001 closed
[junit4:junit4]   2> 867 T455 oazs.NIOServerCnxn.closeSock Closed socket connection for client /140.211.11.196:60766 which had sessionid 0x13cc7a0224d0001
[junit4:junit4]   2> 1045 T453 oejs.Server.doStart jetty-8.1.8.v20121106
[junit4:junit4]   2> 1049 T453 oejs.AbstractConnector.doStart Started SocketConnector@127.0.0.1:60769
[junit4:junit4]   2> 1050 T453 oass.SolrDispatchFilter.init SolrDispatchFilter.init()
[junit4:junit4]   2> 1050 T453 oasc.SolrResourceLoader.locateSolrHome JNDI not configured for solr (NoInitialContextEx)
[junit4:junit4]   2> 1051 T453 oasc.SolrResourceLoader.locateSolrHome using system property solr.solr.home: /usr/home/hudson/hudson-slave/workspace/Lucene-Solr-Tests-4.x-java7/solr/build/solr-core/test/J0/./org.apache.solr.cloud.SyncSliceTest-controljetty-1360558826616
[junit4:junit4]   2> 1051 T453 oasc.CoreContainer$Initializer.initialize looking for solr.xml: /usr/home/hudson/hudson-slave/workspace/Lucene-Solr-Tests-4.x-java7/solr/build/solr-core/test/J0/./org.apache.solr.cloud.SyncSliceTest-controljetty-1360558826616/solr.xml
[junit4:junit4]   2> 1052 T453 oasc.CoreContainer.<init> New CoreContainer 173008540
[junit4:junit4]   2> 1053 T453 oasc.CoreContainer.load Loading CoreContainer using Solr Home: '/usr/home/hudson/hudson-slave/workspace/Lucene-Solr-Tests-4.x-java7/solr/build/solr-core/test/J0/./org.apache.solr.cloud.SyncSliceTest-controljetty-1360558826616/'
[junit4:junit4]   2> 1053 T453 oasc.SolrResourceLoader.<init> new SolrResourceLoader for directory: '/usr/home/hudson/hudson-slave/workspace/Lucene-Solr-Tests-4.x-java7/solr/build/solr-core/test/J0/./org.apache.solr.cloud.SyncSliceTest-controljetty-1360558826616/'
[junit4:junit4]   2> 1115 T453 oashc.HttpShardHandlerFactory.getParameter Setting socketTimeout to: 60000
[junit4:junit4]   2> 1115 T453 oashc.HttpShardHandlerFactory.getParameter Setting urlScheme to: http://
[junit4:junit4]   2> 1116 T453 oashc.HttpShardHandlerFactory.getParameter Setting connTimeout to: 15000
[junit4:junit4]   2> 1116 T453 oashc.HttpShardHandlerFactory.getParameter Setting maxConnectionsPerHost to: 20
[junit4:junit4]   2> 1116 T453 oashc.HttpShardHandlerFactory.getParameter Setting corePoolSize to: 0
[junit4:junit4]   2> 1117 T453 oashc.HttpShardHandlerFactory.getParameter Setting maximumPoolSize to: 2147483647
[junit4:junit4]   2> 1117 T453 oashc.HttpShardHandlerFactory.getParameter Setting maxThreadIdleTime to: 5
[junit4:junit4]   2> 1118 T453 oashc.HttpShardHandlerFactory.getParameter Setting sizeOfQueue to: -1
[junit4:junit4]   2> 1118 T453 oashc.HttpShardHandlerFactory.getParameter Setting fairnessPolicy to: false
[junit4:junit4]   2> 1119 T453 oascsi.HttpClientUtil.createClient Creating new http client, config:maxConnectionsPerHost=20&maxConnections=10000&socketTimeout=60000&connTimeout=15000&retry=false
[junit4:junit4]   2> 1141 T453 oasc.CoreContainer.load Registering Log Listener
[junit4:junit4]   2> 1163 T453 oasc.CoreContainer.initZooKeeper Zookeeper client=127.0.0.1:60763/solr
[junit4:junit4]   2> 1187 T453 oasc.ZkController.checkChrootPath zkHost includes chroot
[junit4:junit4]   2> 1188 T453 oaz.ZooKeeper.<init> Initiating client connection, connectString=127.0.0.1:60763 sessionTimeout=60000 watcher=org.apache.solr.common.cloud.ConnectionManager@4fd3bd34
[junit4:junit4]   2> 1189 T453 oascc.ConnectionManager.waitForConnected Waiting for client to connect to ZooKeeper
[junit4:junit4]   2> 1189 T472 oaz.ClientCnxn$SendThread.logStartConnect Opening socket connection to server localhost/127.0.0.1:60763. Will not attempt to authenticate using SASL (access denied ("javax.security.auth.AuthPermission" "getLoginConfiguration"))
[junit4:junit4]   2> 1190 T472 oaz.ClientCnxn$SendThread.primeConnection Socket connection established to localhost/127.0.0.1:60763, initiating session
[junit4:junit4]   2> 1190 T455 oazs.NIOServerCnxnFactory.run Accepted socket connection from /140.211.11.196:60770
[junit4:junit4]   2> 1191 T455 oazs.ZooKeeperServer.processConnectRequest Client attempting to establish new session at /140.211.11.196:60770
[junit4:junit4]   2> 1193 T457 oazs.ZooKeeperServer.finishSessionInit Established session 0x13cc7a0224d0002 with negotiated timeout 20000 for client /140.211.11.196:60770
[junit4:junit4]   2> 1193 T472 oaz.ClientCnxn$SendThread.onConnected Session establishment complete on server localhost/127.0.0.1:60763, sessionid = 0x13cc7a0224d0002, negotiated timeout = 20000
[junit4:junit4]   2> 1193 T473 oascc.ConnectionManager.process Watcher org.apache.solr.common.cloud.ConnectionManager@4fd3bd34 name:ZooKeeperConnection Watcher:127.0.0.1:60763 got event WatchedEvent state:SyncConnected type:None path:null path:null type:None
[junit4:junit4]   2> 1193 T453 oascc.ConnectionManager.waitForConnected Client is connected to ZooKeeper
[junit4:junit4]   2> 1195 T459 oazs.PrepRequestProcessor.pRequest2Txn Processed session termination for sessionid: 0x13cc7a0224d0002
[junit4:junit4]   2> 1205 T473 oaz.ClientCnxn$EventThread.run EventThread shut down
[junit4:junit4]   2> 1205 T455 oazs.NIOServerCnxn.closeSock Closed socket connection for client /140.211.11.196:60770 which had sessionid 0x13cc7a0224d0002
[junit4:junit4]   2> 1205 T453 oaz.ZooKeeper.close Session: 0x13cc7a0224d0002 closed
[junit4:junit4]   2> 1206 T453 oascsi.HttpClientUtil.createClient Creating new http client, config:maxConnections=500&maxConnectionsPerHost=16&socketTimeout=60000&connTimeout=15000
[junit4:junit4]   2> 1221 T453 oaz.ZooKeeper.<init> Initiating client connection, connectString=127.0.0.1:60763/solr sessionTimeout=30000 watcher=org.apache.solr.common.cloud.ConnectionManager@4fe715e4
[junit4:junit4]   2> 1222 T453 oascc.ConnectionManager.waitForConnected Waiting for client to connect to ZooKeeper
[junit4:junit4]   2> 1223 T474 oaz.ClientCnxn$SendThread.logStartConnect Opening socket connection to server localhost/127.0.0.1:60763. Will not attempt to authenticate using SASL (access denied ("javax.security.auth.AuthPermission" "getLoginConfiguration"))
[junit4:junit4]   2> 1223 T474 oaz.ClientCnxn$SendThread.primeConnection Socket connection established to localhost/127.0.0.1:60763, initiating session
[junit4:junit4]   2> 1223 T455 oazs.NIOServerCnxnFactory.run Accepted socket connection from /140.211.11.196:60771
[junit4:junit4]   2> 1224 T455 oazs.ZooKeeperServer.processConnectRequest Client attempting to establish new session at /140.211.11.196:60771
[junit4:junit4]   2> 1225 T457 oazs.ZooKeeperServer.finishSessionInit Established session 0x13cc7a0224d0003 with negotiated timeout 20000 for client /140.211.11.196:60771
[junit4:junit4]   2> 1225 T474 oaz.ClientCnxn$SendThread.onConnected Session establishment complete on server localhost/127.0.0.1:60763, sessionid = 0x13cc7a0224d0003, negotiated timeout = 20000
[junit4:junit4]   2> 1226 T475 oascc.ConnectionManager.process Watcher org.apache.solr.common.cloud.ConnectionManager@4fe715e4 name:ZooKeeperConnection Watcher:127.0.0.1:60763/solr got event WatchedEvent state:SyncConnected type:None path:null path:null type:None
[junit4:junit4]   2> 1226 T453 oascc.ConnectionManager.waitForConnected Client is connected to ZooKeeper
[junit4:junit4]   2> 1247 T459 oazs.PrepRequestProcessor.pRequest Got user-level KeeperException when processing sessionid:0x13cc7a0224d0003 type:create cxid:0x2 zxid:0x1a txntype:-1 reqpath:n/a Error Path:/solr/overseer Error:KeeperErrorCode = NodeExists for /solr/overseer
[junit4:junit4]   2> 1259 T453 oascc.SolrZkClient.makePath makePath: /live_nodes
[junit4:junit4]   2> 1263 T453 oasc.ZkController.createEphemeralLiveNode Register node as live in ZooKeeper:/live_nodes/127.0.0.1:60769_
[junit4:junit4]   2> 1269 T459 oazs.PrepRequestProcessor.pRequest Got user-level KeeperException when processing sessionid:0x13cc7a0224d0003 type:delete cxid:0x8 zxid:0x1c txntype:-1 reqpath:n/a Error Path:/solr/live_nodes/127.0.0.1:60769_ Error:KeeperErrorCode = NoNode for /solr/live_nodes/127.0.0.1:60769_
[junit4:junit4]   2> 1271 T453 oascc.SolrZkClient.makePath makePath: /live_nodes/127.0.0.1:60769_
[junit4:junit4]   2> 1277 T453 oascc.SolrZkClient.makePath makePath: /overseer_elect/election
[junit4:junit4]   2> 1308 T459 oazs.PrepRequestProcessor.pRequest Got user-level KeeperException when processing sessionid:0x13cc7a0224d0003 type:delete cxid:0x16 zxid:0x21 txntype:-1 reqpath:n/a Error Path:/solr/overseer_elect/leader Error:KeeperErrorCode = NoNode for /solr/overseer_elect/leader
[junit4:junit4]   2> 1309 T453 oascc.SolrZkClient.makePath makePath: /overseer_elect/leader
[junit4:junit4]   2> 1314 T453 oasc.Overseer.start Overseer (id=89165583224733699-127.0.0.1:60769_-n_0000000000) starting
[junit4:junit4]   2> 1315 T459 oazs.PrepRequestProcessor.pRequest Got user-level KeeperException when processing sessionid:0x13cc7a0224d0003 type:create cxid:0x1b zxid:0x23 txntype:-1 reqpath:n/a Error Path:/solr/overseer Error:KeeperErrorCode = NodeExists for /solr/overseer
[junit4:junit4]   2> 1339 T459 oazs.PrepRequestProcessor.pRequest Got user-level KeeperException when processing sessionid:0x13cc7a0224d0003 type:create cxid:0x1c zxid:0x24 txntype:-1 reqpath:n/a Error Path:/solr/overseer Error:KeeperErrorCode = NodeExists for /solr/overseer
[junit4:junit4]   2> 1341 T459 oazs.PrepRequestProcessor.pRequest Got user-level KeeperException when processing sessionid:0x13cc7a0224d0003 type:create cxid:0x1d zxid:0x25 txntype:-1 reqpath:n/a Error Path:/solr/overseer Error:KeeperErrorCode = NodeExists for /solr/overseer
[junit4:junit4]   2> 1352 T459 oazs.PrepRequestProcessor.pRequest Got user-level KeeperException when processing sessionid:0x13cc7a0224d0003 type:create cxid:0x1e zxid:0x26 txntype:-1 reqpath:n/a Error Path:/solr/overseer Error:KeeperErrorCode = NodeExists for /solr/overseer
[junit4:junit4]   2> 1353 T477 oasc.OverseerCollectionProcessor.run Process current queue of collection creations
[junit4:junit4]   2> 1354 T453 oascc.SolrZkClient.makePath makePath: /clusterstate.json
[junit4:junit4]   2> 1358 T453 oascc.ZkStateReader.createClusterStateWatchersAndUpdate Updating cluster state from ZooKeeper... 
[junit4:junit4]   2> 1383 T476 oasc.Overseer$ClusterStateUpdater.run Starting to work on the main queue
[junit4:junit4]   2> 1395 T478 oasc.CoreContainer.create Creating SolrCore 'collection1' using instanceDir: /usr/home/hudson/hudson-slave/workspace/Lucene-Solr-Tests-4.x-java7/solr/build/solr-core/test/J0/./org.apache.solr.cloud.SyncSliceTest-controljetty-1360558826616/collection1
[junit4:junit4]   2> 1395 T478 oasc.ZkController.createCollectionZkNode Check for collection zkNode:control_collection
[junit4:junit4]   2> 1396 T478 oasc.ZkController.createCollectionZkNode Collection zkNode exists
[junit4:junit4]   2> 1396 T478 oasc.ZkController.readConfigName Load collection config from:/collections/control_collection
[junit4:junit4]   2> 1399 T478 oasc.SolrResourceLoader.<init> new SolrResourceLoader for directory: '/usr/home/hudson/hudson-slave/workspace/Lucene-Solr-Tests-4.x-java7/solr/build/solr-core/test/J0/./org.apache.solr.cloud.SyncSliceTest-controljetty-1360558826616/collection1/'
[junit4:junit4]   2> 1400 T478 oasc.SolrResourceLoader.replaceClassLoader Adding 'file:/usr/home/hudson/hudson-slave/workspace/Lucene-Solr-Tests-4.x-java7/solr/build/solr-core/test/J0/org.apache.solr.cloud.SyncSliceTest-controljetty-1360558826616/collection1/lib/README' to classloader
[junit4:junit4]   2> 1400 T478 oasc.SolrResourceLoader.replaceClassLoader Adding 'file:/usr/home/hudson/hudson-slave/workspace/Lucene-Solr-Tests-4.x-java7/solr/build/solr-core/test/J0/org.apache.solr.cloud.SyncSliceTest-controljetty-1360558826616/collection1/lib/classes/' to classloader
[junit4:junit4]   2> 1486 T478 oasc.SolrConfig.<init> Using Lucene MatchVersion: LUCENE_42
[junit4:junit4]   2> 1576 T478 oasc.SolrConfig.<init> Loaded SolrConfig: solrconfig.xml
[junit4:junit4]   2> 1678 T478 oass.IndexSchema.readSchema Reading Solr Schema
[junit4:junit4]   2> 1685 T478 oass.IndexSchema.readSchema Schema name=test
[junit4:junit4]   2> 2410 T478 oass.OpenExchangeRatesOrgProvider.init Initialized with rates=open-exchange-rates.json, refreshInterval=1440.
[junit4:junit4]   2> 2423 T478 oass.IndexSchema.readSchema default search field in schema is text
[junit4:junit4]   2> 2428 T478 oass.IndexSchema.readSchema unique key field: id
[junit4:junit4]   2> 2453 T478 oass.FileExchangeRateProvider.reload Reloading exchange rates from file currency.xml
[junit4:junit4]   2> 2460 T478 oass.FileExchangeRateProvider.reload Reloading exchange rates from file currency.xml
[junit4:junit4]   2> 2466 T478 oass.OpenExchangeRatesOrgProvider.reload Reloading exchange rates from open-exchange-rates.json
[junit4:junit4]   2> 2468 T478 oass.OpenExchangeRatesOrgProvider.reload Reloading exchange rates from open-exchange-rates.json
[junit4:junit4]   2> 2470 T478 oasc.SolrCore.<init> [collection1] Opening new SolrCore at /usr/home/hudson/hudson-slave/workspace/Lucene-Solr-Tests-4.x-java7/solr/build/solr-core/test/J0/./org.apache.solr.cloud.SyncSliceTest-controljetty-1360558826616/collection1/, dataDir=./org.apache.solr.cloud.SyncSliceTest-1360558825755/control/data/
[junit4:junit4]   2> 2470 T478 oasc.JmxMonitoredMap.<init> JMX monitoring is enabled. Adding Solr mbeans to JMX Server: com.sun.jmx.mbeanserver.JmxMBeanServer@283a30f3
[junit4:junit4]   2> 2470 T478 oasc.SolrCore.initDirectoryFactory solr.NRTCachingDirectoryFactory
[junit4:junit4]   2> 2472 T478 oasc.CachingDirectoryFactory.get return new directory for /usr/home/hudson/hudson-slave/workspace/Lucene-Solr-Tests-4.x-java7/solr/build/solr-core/test/J0/./org.apache.solr.cloud.SyncSliceTest-1360558825755/control/data forceNew:false
[junit4:junit4]   2> 2472 T478 oasc.CachingDirectoryFactory.close Releasing directory:/usr/home/hudson/hudson-slave/workspace/Lucene-Solr-Tests-4.x-java7/solr/build/solr-core/test/J0/./org.apache.solr.cloud.SyncSliceTest-1360558825755/control/data
[junit4:junit4]   2> 2473 T478 oasc.SolrCore.getNewIndexDir New index directory detected: old=null new=./org.apache.solr.cloud.SyncSliceTest-1360558825755/control/data/index/
[junit4:junit4]   2> 2474 T478 oasc.SolrCore.initIndex WARNING [collection1] Solr index directory './org.apache.solr.cloud.SyncSliceTest-1360558825755/control/data/index' doesn't exist. Creating new index...
[junit4:junit4]   2> 2475 T478 oasc.CachingDirectoryFactory.get return new directory for /usr/home/hudson/hudson-slave/workspace/Lucene-Solr-Tests-4.x-java7/solr/build/solr-core/test/J0/./org.apache.solr.cloud.SyncSliceTest-1360558825755/control/data/index forceNew:false
[junit4:junit4]   2> 2492 T478 oasc.SolrDeletionPolicy.onCommit SolrDeletionPolicy.onCommit: commits:num=1
[junit4:junit4]   2> 		commit{dir=RateLimitedDirectoryWrapper(NRTCachingDirectory(org.apache.lucene.store.NIOFSDirectory@/usr/home/hudson/hudson-slave/workspace/Lucene-Solr-Tests-4.x-java7/solr/build/solr-core/test/J0/org.apache.solr.cloud.SyncSliceTest-1360558825755/control/data/index lockFactory=org.apache.lucene.store.NativeFSLockFactory@527f53a5; maxCacheMB=48.0 maxMergeSizeMB=4.0)),segFN=segments_1,generation=1,filenames=[segments_1]
[junit4:junit4]   2> 2492 T478 oasc.SolrDeletionPolicy.updateCommits newest commit = 1[segments_1]
[junit4:junit4]   2> 2493 T478 oasc.CachingDirectoryFactory.close Releasing directory:/usr/home/hudson/hudson-slave/workspace/Lucene-Solr-Tests-4.x-java7/solr/build/solr-core/test/J0/./org.apache.solr.cloud.SyncSliceTest-1360558825755/control/data/index
[junit4:junit4]   2> 2493 T478 oasc.SolrCore.initWriters created xml: solr.XMLResponseWriter
[junit4:junit4]   2> 2496 T478 oasup.UpdateRequestProcessorChain.init inserting DistributedUpdateProcessorFactory into updateRequestProcessorChain "dedupe"
[junit4:junit4]   2> 2496 T478 oasup.UpdateRequestProcessorChain.init inserting DistributedUpdateProcessorFactory into updateRequestProcessorChain "dedupe-allfields"
[junit4:junit4]   2> 2497 T478 oasup.UpdateRequestProcessorChain.init inserting DistributedUpdateProcessorFactory into updateRequestProcessorChain "stored_sig"
[junit4:junit4]   2> 2497 T478 oasup.UpdateRequestProcessorChain.init inserting DistributedUpdateProcessorFactory into updateRequestProcessorChain "uniq-fields"
[junit4:junit4]   2> 2498 T478 oasup.UpdateRequestProcessorChain.init inserting DistributedUpdateProcessorFactory into updateRequestProcessorChain "distrib-dup-test-chain-implicit"
[junit4:junit4]   2> 2498 T478 oasc.RequestHandlers.initHandlersFromConfig adding lazy requestHandler: solr.ReplicationHandler
[junit4:junit4]   2> 2498 T478 oasc.RequestHandlers.initHandlersFromConfig created /replication: solr.ReplicationHandler
[junit4:junit4]   2> 2499 T478 oasc.RequestHandlers.initHandlersFromConfig created standard: solr.StandardRequestHandler
[junit4:junit4]   2> 2499 T478 oasc.RequestHandlers.initHandlersFromConfig created /get: solr.RealTimeGetHandler
[junit4:junit4]   2> 2500 T478 oasc.RequestHandlers.initHandlersFromConfig created dismax: solr.SearchHandler
[junit4:junit4]   2> 2501 T478 oasc.RequestHandlers.initHandlersFromConfig created mock: org.apache.solr.core.MockQuerySenderListenerReqHandler
[junit4:junit4]   2> 2501 T478 oasc.RequestHandlers.initHandlersFromConfig created /admin/: org.apache.solr.handler.admin.AdminHandlers
[junit4:junit4]   2> 2502 T478 oasc.RequestHandlers.initHandlersFromConfig created defaults: solr.StandardRequestHandler
[junit4:junit4]   2> 2502 T478 oasc.RequestHandlers.initHandlersFromConfig adding lazy requestHandler: solr.StandardRequestHandler
[junit4:junit4]   2> 2502 T478 oasc.RequestHandlers.initHandlersFromConfig created lazy: solr.StandardRequestHandler
[junit4:junit4]   2> 2503 T478 oasc.RequestHandlers.initHandlersFromConfig created /update: solr.UpdateRequestHandler
[junit4:junit4]   2> 2503 T478 oasc.RequestHandlers.initHandlersFromConfig created /terms: org.apache.solr.handler.component.SearchHandler
[junit4:junit4]   2> 2504 T478 oasc.RequestHandlers.initHandlersFromConfig created spellCheckCompRH: org.apache.solr.handler.component.SearchHandler
[junit4:junit4]   2> 2504 T478 oasc.RequestHandlers.initHandlersFromConfig created spellCheckCompRH_Direct: org.apache.solr.handler.component.SearchHandler
[junit4:junit4]   2> 2505 T478 oasc.RequestHandlers.initHandlersFromConfig created spellCheckWithWordbreak: org.apache.solr.handler.component.SearchHandler
[junit4:junit4]   2> 2505 T478 oasc.RequestHandlers.initHandlersFromConfig created spellCheckWithWordbreak_Direct: org.apache.solr.handler.component.SearchHandler
[junit4:junit4]   2> 2506 T478 oasc.RequestHandlers.initHandlersFromConfig created spellCheckCompRH1: org.apache.solr.handler.component.SearchHandler
[junit4:junit4]   2> 2506 T478 oasc.RequestHandlers.initHandlersFromConfig created mltrh: org.apache.solr.handler.component.SearchHandler
[junit4:junit4]   2> 2507 T478 oasc.RequestHandlers.initHandlersFromConfig created tvrh: org.apache.solr.handler.component.SearchHandler
[junit4:junit4]   2> 2508 T478 oasc.RequestHandlers.initHandlersFromConfig created /mlt: solr.MoreLikeThisHandler
[junit4:junit4]   2> 2508 T478 oasc.RequestHandlers.initHandlersFromConfig created /debug/dump: solr.DumpRequestHandler
[junit4:junit4]   2> 2521 T478 oashl.XMLLoader.init xsltCacheLifetimeSeconds=60
[junit4:junit4]   2> 2526 T478 oasc.SolrCore.initDeprecatedSupport WARNING solrconfig.xml uses deprecated <admin/gettableFiles>, Please update your config to use the ShowFileRequestHandler.
[junit4:junit4]   2> 2528 T478 oasc.SolrCore.initDeprecatedSupport WARNING adding ShowFileRequestHandler with hidden files: [SCHEMA.XML, OLD_SYNONYMS.TXT, STOPWORDS.TXT, PROTWORDS.TXT, OPEN-EXCHANGE-RATES.JSON, SYNONYMS.TXT, CURRENCY.XML, MAPPING-ISOLATIN1ACCENT.TXT]
[junit4:junit4]   2> 2531 T478 oasc.CachingDirectoryFactory.close Releasing directory:/usr/home/hudson/hudson-slave/workspace/Lucene-Solr-Tests-4.x-java7/solr/build/solr-core/test/J0/./org.apache.solr.cloud.SyncSliceTest-1360558825755/control/data
[junit4:junit4]   2> 2532 T478 oass.SolrIndexSearcher.<init> Opening Searcher@20ed5787 main
[junit4:junit4]   2> 2534 T478 oasu.CommitTracker.<init> Hard AutoCommit: disabled
[junit4:junit4]   2> 2534 T478 oasu.CommitTracker.<init> Soft AutoCommit: disabled
[junit4:junit4]   2> 2534 T478 oashc.SpellCheckComponent.inform Initializing spell checkers
[junit4:junit4]   2> 2542 T478 oass.DirectSolrSpellChecker.init init: {name=direct,classname=DirectSolrSpellChecker,field=lowerfilt,minQueryLength=3}
[junit4:junit4]   2> 2582 T479 oasc.SolrCore.registerSearcher [collection1] Registered new searcher Searcher@20ed5787 main{StandardDirectoryReader(segments_1:1)}
[junit4:junit4]   2> 2588 T478 oasc.ZkController.publish publishing core=collection1 state=down
[junit4:junit4]   2> 2588 T478 oasc.ZkController.publish numShards not found on descriptor - reading it from system property
[junit4:junit4]   2> 2589 T459 oazs.PrepRequestProcessor.pRequest Got user-level KeeperException when processing sessionid:0x13cc7a0224d0003 type:create cxid:0x51 zxid:0x29 txntype:-1 reqpath:n/a Error Path:/solr/overseer/queue Error:KeeperErrorCode = NoNode for /solr/overseer/queue
[junit4:junit4]   2> 2893 T476 oascc.ZkStateReader.updateClusterState Updating cloud state from ZooKeeper... 
[junit4:junit4]   2> 2894 T476 oasc.Overseer$ClusterStateUpdater.updateState Update state numShards=1 message={
[junit4:junit4]   2> 	  "operation":"state",
[junit4:junit4]   2> 	  "numShards":"1",
[junit4:junit4]   2> 	  "shard":null,
[junit4:junit4]   2> 	  "roles":null,
[junit4:junit4]   2> 	  "state":"down",
[junit4:junit4]   2> 	  "core":"collection1",
[junit4:junit4]   2> 	  "collection":"control_collection",
[junit4:junit4]   2> 	  "node_name":"127.0.0.1:60769_",
[junit4:junit4]   2> 	  "base_url":"http://127.0.0.1:60769"}
[junit4:junit4]   2> 2895 T476 oasc.Overseer$ClusterStateUpdater.createCollection Create collection control_collection with numShards 1
[junit4:junit4]   2> 2930 T476 oasc.Overseer$ClusterStateUpdater.updateState Assigning new node to shard shard=shard1
[junit4:junit4]   2> 2931 T459 oazs.PrepRequestProcessor.pRequest Got user-level KeeperException when processing sessionid:0x13cc7a0224d0003 type:create cxid:0x59 zxid:0x2c txntype:-1 reqpath:n/a Error Path:/solr/overseer/queue-work Error:KeeperErrorCode = NoNode for /solr/overseer/queue-work
[junit4:junit4]   2> 2967 T475 oascc.ZkStateReader$2.process A cluster state change: WatchedEvent state:SyncConnected type:NodeDataChanged path:/clusterstate.json, has occurred - updating... (live nodes size: 1)
[junit4:junit4]   2> 3595 T478 oasc.CoreContainer.registerCore registering core: collection1
[junit4:junit4]   2> 3595 T478 oasc.ZkController.register Register replica - core:collection1 address:http://127.0.0.1:60769 collection:control_collection shard:shard1
[junit4:junit4]   2> 3606 T478 oascsi.HttpClientUtil.createClient Creating new http client, config:maxConnections=10000&maxConnectionsPerHost=20&connTimeout=30000&socketTimeout=30000&retry=false
[junit4:junit4]   2> 3625 T478 oascc.SolrZkClient.makePath makePath: /collections/control_collection/leader_elect/shard1/election
[junit4:junit4]   2> 3697 T459 oazs.PrepRequestProcessor.pRequest Got user-level KeeperException when processing sessionid:0x13cc7a0224d0003 type:delete cxid:0x73 zxid:0x36 txntype:-1 reqpath:n/a Error Path:/solr/collections/control_collection/leaders Error:KeeperErrorCode = NoNode for /solr/collections/control_collection/leaders
[junit4:junit4]   2> 3719 T478 oasc.ShardLeaderElectionContext.runLeaderProcess Running the leader process.
[junit4:junit4]   2> 3720 T459 oazs.PrepRequestProcessor.pRequest Got user-level KeeperException when processing sessionid:0x13cc7a0224d0003 type:create cxid:0x74 zxid:0x37 txntype:-1 reqpath:n/a Error Path:/solr/overseer Error:KeeperErrorCode = NodeExists for /solr/overseer
[junit4:junit4]   2> 3724 T478 oasc.ShardLeaderElectionContext.waitForReplicasToComeUp Enough replicas found to continue.
[junit4:junit4]   2> 3724 T478 oasc.ShardLeaderElectionContext.runLeaderProcess I may be the new leader - try and sync
[junit4:junit4]   2> 3725 T478 oasc.SyncStrategy.sync Sync replicas to http://127.0.0.1:60769/collection1/
[junit4:junit4]   2> 3725 T478 oasc.SyncStrategy.syncReplicas Sync Success - now sync replicas to me
[junit4:junit4]   2> 3725 T478 oasc.SyncStrategy.syncToMe http://127.0.0.1:60769/collection1/ has no replicas
[junit4:junit4]   2> 3726 T478 oasc.ShardLeaderElectionContext.runLeaderProcess I am the new leader: http://127.0.0.1:60769/collection1/
[junit4:junit4]   2> 3726 T478 oascc.SolrZkClient.makePath makePath: /collections/control_collection/leaders/shard1
[junit4:junit4]   2> 3762 T459 oazs.PrepRequestProcessor.pRequest Got user-level KeeperException when processing sessionid:0x13cc7a0224d0003 type:create cxid:0x7e zxid:0x3b txntype:-1 reqpath:n/a Error Path:/solr/overseer Error:KeeperErrorCode = NodeExists for /solr/overseer
[junit4:junit4]   2> 4475 T476 oascc.ZkStateReader.updateClusterState Updating cloud state from ZooKeeper... 
[junit4:junit4]   2> 4499 T475 oascc.ZkStateReader$2.process A cluster state change: WatchedEvent state:SyncConnected type:NodeDataChanged path:/clusterstate.json, has occurred - updating... (live nodes size: 1)
[junit4:junit4]   2> 4541 T478 oasc.ZkController.register We are http://127.0.0.1:60769/collection1/ and leader is http://127.0.0.1:60769/collection1/
[junit4:junit4]   2> 4541 T478 oasc.ZkController.register No LogReplay needed for core=collection1 baseURL=http://127.0.0.1:60769
[junit4:junit4]   2> 4541 T478 oasc.ZkController.checkRecovery I am the leader, no recovery necessary
[junit4:junit4]   2> 4542 T478 oasc.ZkController.publish publishing core=collection1 state=active
[junit4:junit4]   2> 4542 T478 oasc.ZkController.publish numShards not found on descriptor - reading it from system property
[junit4:junit4]   2> 4544 T478 oascc.ZkStateReader.updateClusterState Updating cloud state from ZooKeeper... 
[junit4:junit4]   2> 4545 T453 oass.SolrDispatchFilter.init user.dir=/usr/home/hudson/hudson-slave/workspace/Lucene-Solr-Tests-4.x-java7/solr/build/solr-core/test/J0
[junit4:junit4]   2> 4546 T453 oass.SolrDispatchFilter.init SolrDispatchFilter.init() done
[junit4:junit4]   2> 4547 T453 oascsi.HttpClientUtil.createClient Creating new http client, config:maxConnections=128&maxConnectionsPerHost=32&followRedirects=false
[junit4:junit4]   2> 4559 T453 oascsi.HttpClientUtil.createClient Creating new http client, config:
[junit4:junit4]   2> 4575 T453 oaz.ZooKeeper.<init> Initiating client connection, connectString=127.0.0.1:60763/solr sessionTimeout=10000 watcher=org.apache.solr.common.cloud.ConnectionManager@787ce7d9
[junit4:junit4]   2> 4576 T453 oascc.ConnectionManager.waitForConnected Waiting for client to connect to ZooKeeper
[junit4:junit4]   2> 4577 T480 oaz.ClientCnxn$SendThread.logStartConnect Opening socket connection to server localhost/127.0.0.1:60763. Will not attempt to authenticate using SASL (access denied ("javax.security.auth.AuthPermission" "getLoginConfiguration"))
[junit4:junit4]   2> 4577 T480 oaz.ClientCnxn$SendThread.primeConnection Socket connection established to localhost/127.0.0.1:60763, initiating session
[junit4:junit4]   2> 4577 T455 oazs.NIOServerCnxnFactory.run Accepted socket connection from /140.211.11.196:60778
[junit4:junit4]   2> 4578 T455 oazs.ZooKeeperServer.processConnectRequest Client attempting to establish new session at /140.211.11.196:60778
[junit4:junit4]   2> 4579 T457 oazs.ZooKeeperServer.finishSessionInit Established session 0x13cc7a0224d0004 with negotiated timeout 10000 for client /140.211.11.196:60778
[junit4:junit4]   2> 4579 T480 oaz.ClientCnxn$SendThread.onConnected Session establishment complete on server localhost/127.0.0.1:60763, sessionid = 0x13cc7a0224d0004, negotiated timeout = 10000
[junit4:junit4]   2> 4580 T481 oascc.ConnectionManager.process Watcher org.apache.solr.common.cloud.ConnectionManager@787ce7d9 name:ZooKeeperConnection Watcher:127.0.0.1:60763/solr got event WatchedEvent state:SyncConnected type:None path:null path:null type:None
[junit4:junit4]   2> 4580 T453 oascc.ConnectionManager.waitForConnected Client is connected to ZooKeeper
[junit4:junit4]   2> 4581 T453 oascc.ZkStateReader.createClusterStateWatchersAndUpdate Updating cluster state from ZooKeeper... 
[junit4:junit4]   2> 4586 T453 oasc.ChaosMonkey.monkeyLog monkey: init - expire sessions:true cause connection loss:true
[junit4:junit4]   2> 4771 T453 oejs.Server.doStart jetty-8.1.8.v20121106
[junit4:junit4]   2> 4774 T453 oejs.AbstractConnector.doStart Started SocketConnector@127.0.0.1:60779
[junit4:junit4]   2> 4774 T453 oass.SolrDispatchFilter.init SolrDispatchFilter.init()
[junit4:junit4]   2> 4775 T453 oasc.SolrResourceLoader.locateSolrHome JNDI not configured for solr (NoInitialContextEx)
[junit4:junit4]   2> 4775 T453 oasc.SolrResourceLoader.locateSolrHome using system property solr.solr.home: /usr/home/hudson/hudson-slave/workspace/Lucene-Solr-Tests-4.x-java7/solr/build/solr-core/test/J0/./org.apache.solr.cloud.SyncSliceTest-jetty1-1360558830334
[junit4:junit4]   2> 4776 T453 oasc.CoreContainer$Initializer.initialize looking for solr.xml: /usr/home/hudson/hudson-slave/workspace/Lucene-Solr-Tests-4.x-java7/solr/build/solr-core/test/J0/./org.apache.solr.cloud.SyncSliceTest-jetty1-1360558830334/solr.xml
[junit4:junit4]   2> 4776 T453 oasc.CoreContainer.<init> New CoreContainer 118930630
[junit4:junit4]   2> 4777 T453 oasc.CoreContainer.load Loading CoreContainer using Solr Home: '/usr/home/hudson/hudson-slave/workspace/Lucene-Solr-Tests-4.x-java7/solr/build/solr-core/test/J0/./org.apache.solr.cloud.SyncSliceTest-jetty1-1360558830334/'
[junit4:junit4]   2> 4777 T453 oasc.SolrResourceLoader.<init> new SolrResourceLoader for directory: '/usr/home/hudson/hudson-slave/workspace/Lucene-Solr-Tests-4.x-java7/solr/build/solr-core/test/J0/./org.apache.solr.cloud.SyncSliceTest-jetty1-1360558830334/'
[junit4:junit4]   2> 4838 T453 oashc.HttpShardHandlerFactory.getParameter Setting socketTimeout to: 60000
[junit4:junit4]   2> 4839 T453 oashc.HttpShardHandlerFactory.getParameter Setting urlScheme to: http://
[junit4:junit4]   2> 4839 T453 oashc.HttpShardHandlerFactory.getParameter Setting connTimeout to: 15000
[junit4:junit4]   2> 4840 T453 oashc.HttpShardHandlerFactory.getParameter Setting maxConnectionsPerHost to: 20
[junit4:junit4]   2> 4840 T453 oashc.HttpShardHandlerFactory.getParameter Setting corePoolSize to: 0
[junit4:junit4]   2> 4841 T453 oashc.HttpShardHandlerFactory.getParameter Setting maximumPoolSize to: 2147483647
[junit4:junit4]   2> 4841 T453 oashc.HttpShardHandlerFactory.getParameter Setting maxThreadIdleTime to: 5
[junit4:junit4]   2> 4842 T453 oashc.HttpShardHandlerFactory.getParameter Setting sizeOfQueue to: -1
[junit4:junit4]   2> 4842 T453 oashc.HttpShardHandlerFactory.getParameter Setting fairnessPolicy to: false
[junit4:junit4]   2> 4843 T453 oascsi.HttpClientUtil.createClient Creating new http client, config:maxConnectionsPerHost=20&maxConnections=10000&socketTimeout=60000&connTimeout=15000&retry=false
[junit4:junit4]   2> 4864 T453 oasc.CoreContainer.load Registering Log Listener
[junit4:junit4]   2> 4885 T453 oasc.CoreContainer.initZooKeeper Zookeeper client=127.0.0.1:60763/solr
[junit4:junit4]   2> 4885 T453 oasc.ZkController.checkChrootPath zkHost includes chroot
[junit4:junit4]   2> 4886 T453 oaz.ZooKeeper.<init> Initiating client connection, connectString=127.0.0.1:60763 sessionTimeout=60000 watcher=org.apache.solr.common.cloud.ConnectionManager@1166c784
[junit4:junit4]   2> 4887 T453 oascc.ConnectionManager.waitForConnected Waiting for client to connect to ZooKeeper
[junit4:junit4]   2> 4887 T491 oaz.ClientCnxn$SendThread.logStartConnect Opening socket connection to server localhost/127.0.0.1:60763. Will not attempt to authenticate using SASL (access denied ("javax.security.auth.AuthPermission" "getLoginConfiguration"))
[junit4:junit4]   2> 4888 T491 oaz.ClientCnxn$SendThread.primeConnection Socket connection established to localhost/127.0.0.1:60763, initiating session
[junit4:junit4]   2> 4888 T455 oazs.NIOServerCnxnFactory.run Accepted socket connection from /140.211.11.196:60780
[junit4:junit4]   2> 4889 T455 oazs.ZooKeeperServer.processConnectRequest Client attempting to establish new session at /140.211.11.196:60780
[junit4:junit4]   2> 4891 T457 oazs.ZooKeeperServer.finishSessionInit Established session 0x13cc7a0224d0005 with negotiated timeout 20000 for client /140.211.11.196:60780
[junit4:junit4]   2> 4891 T491 oaz.ClientCnxn$SendThread.onConnected Session establishment complete on server localhost/127.0.0.1:60763, sessionid = 0x13cc7a0224d0005, negotiated timeout = 20000
[junit4:junit4]   2> 4891 T492 oascc.ConnectionManager.process Watcher org.apache.solr.common.cloud.ConnectionManager@1166c784 name:ZooKeeperConnection Watcher:127.0.0.1:60763 got event WatchedEvent state:SyncConnected type:None path:null path:null type:None
[junit4:junit4]   2> 4892 T453 oascc.ConnectionManager.waitForConnected Client is connected to ZooKeeper
[junit4:junit4]   2> 4893 T459 oazs.PrepRequestProcessor.pRequest2Txn Processed session termination for sessionid: 0x13cc7a0224d0005
[junit4:junit4]   2> 4903 T492 oaz.ClientCnxn$EventThread.run EventThread shut down
[junit4:junit4]   2> 4903 T455 oazs.NIOServerCnxn.closeSock Closed socket connection for client /140.211.11.196:60780 which had sessionid 0x13cc7a0224d0005
[junit4:junit4]   2> 4903 T453 oaz.ZooKeeper.close Session: 0x13cc7a0224d0005 closed
[junit4:junit4]   2> 4904 T453 oascsi.HttpClientUtil.createClient Creating new http client, config:maxConnections=500&maxConnectionsPerHost=16&socketTimeout=60000&connTimeout=15000
[junit4:junit4]   2> 4916 T453 oaz.ZooKeeper.<init> Initiating client connection, connectString=127.0.0.1:60763/solr sessionTimeout=30000 watcher=org.apache.solr.common.cloud.ConnectionManager@5b41161
[junit4:junit4]   2> 4917 T453 oascc.ConnectionManager.waitForConnected Waiting for client to connect to ZooKeeper
[junit4:junit4]   2> 4917 T493 oaz.ClientCnxn$SendThread.logStartConnect Opening socket connection to server localhost/127.0.0.1:60763. Will not attempt to authenticate using SASL (access denied ("javax.security.auth.AuthPermission" "getLoginConfiguration"))
[junit4:junit4]   2> 4918 T493 oaz.ClientCnxn$SendThread.primeConnection Socket connection established to localhost/127.0.0.1:60763, initiating session
[junit4:junit4]   2> 4918 T455 oazs.NIOServerCnxnFactory.run Accepted socket connection from /140.211.11.196:60781
[junit4:junit4]   2> 4918 T455 oazs.ZooKeeperServer.processConnectRequest Client attempting to establish new session at /140.211.11.196:60781
[junit4:junit4]   2> 4920 T457 oazs.ZooKeeperServer.finishSessionInit Established session 0x13cc7a0224d0006 with negotiated timeout 20000 for client /140.211.11.196:60781
[junit4:junit4]   2> 4920 T493 oaz.ClientCnxn$SendThread.onConnected Session establishment complete on server localhost/127.0.0.1:60763, sessionid = 0x13cc7a0224d0006, negotiated timeout = 20000
[junit4:junit4]   2> 4920 T494 oascc.ConnectionManager.process Watcher org.apache.solr.common.cloud.ConnectionManager@5b41161 name:ZooKeeperConnection Watcher:127.0.0.1:60763/solr got event WatchedEvent state:SyncConnected type:None path:null path:null type:None
[junit4:junit4]   2> 4921 T453 oascc.ConnectionManager.waitForConnected Client is connected to ZooKeeper
[junit4:junit4]   2> 4922 T459 oazs.PrepRequestProcessor.pRequest Got user-level KeeperException when processing sessionid:0x13cc7a0224d0006 type:create cxid:0x1 zxid:0x49 txntype:-1 reqpath:n/a Error Path:/solr/overseer Error:KeeperErrorCode = NodeExists for /solr/overseer
[junit4:junit4]   2> 4924 T459 oazs.PrepRequestProcessor.pRequest Got user-level KeeperException when processing sessionid:0x13cc7a0224d0006 type:create cxid:0x2 zxid:0x4a txntype:-1 reqpath:n/a Error Path:/solr/overseer Error:KeeperErrorCode = NodeExists for /solr/overseer
[junit4:junit4]   2> 4932 T453 oascc.ZkStateReader.createClusterStateWatchersAndUpdate Updating cluster state from ZooKeeper... 
[junit4:junit4]   2> 4936 T453 oasc.ZkController.createEphemeralLiveNode Register node as live in ZooKeeper:/live_nodes/127.0.0.1:60779_
[junit4:junit4]   2> 4937 T459 oazs.PrepRequestProcessor.pRequest Got user-level KeeperException when processing sessionid:0x13cc7a0224d0006 type:delete cxid:0x9 zxid:0x4b txntype:-1 reqpath:n/a Error Path:/solr/live_nodes/127.0.0.1:60779_ Error:KeeperErrorCode = NoNode for /solr/live_nodes/127.0.0.1:60779_
[junit4:junit4]   2> 4938 T453 oascc.SolrZkClient.makePath makePath: /live_nodes/127.0.0.1:60779_
[junit4:junit4]   2> 4943 T481 oascc.ZkStateReader$3.process Updating live nodes... (2)
[junit4:junit4]   2> 4943 T494 oascc.ZkStateReader$3.process Updating live nodes... (2)
[junit4:junit4]   2> 4943 T475 oascc.ZkStateReader$3.process Updating live nodes... (2)
[junit4:junit4]   2> 4943 T475 oascc.ZkStateReader$2.process A cluster state change: WatchedEvent state:SyncConnected type:NodeChildrenChanged path:/live_nodes, has occurred - updating... (live nodes size: 2)
[junit4:junit4]   2> 4957 T495 oasc.CoreContainer.create Creating SolrCore 'collection1' using instanceDir: /usr/home/hudson/hudson-slave/workspace/Lucene-Solr-Tests-4.x-java7/solr/build/solr-core/test/J0/./org.apache.solr.cloud.SyncSliceTest-jetty1-1360558830334/collection1
[junit4:junit4]   2> 4958 T495 oasc.ZkController.createCollectionZkNode Check for collection zkNode:collection1
[junit4:junit4]   2> 4958 T495 oasc.ZkController.createCollectionZkNode Collection zkNode exists
[junit4:junit4]   2> 4959 T495 oasc.ZkController.readConfigName Load collection config from:/collections/collection1
[junit4:junit4]   2> 4961 T495 oasc.SolrResourceLoader.<init> new SolrResourceLoader for directory: '/usr/home/hudson/hudson-slave/workspace/Lucene-Solr-Tests-4.x-java7/solr/build/solr-core/test/J0/./org.apache.solr.cloud.SyncSliceTest-jetty1-1360558830334/collection1/'
[junit4:junit4]   2> 4962 T495 oasc.SolrResourceLoader.replaceClassLoader Adding 'file:/usr/home/hudson/hudson-slave/workspace/Lucene-Solr-Tests-4.x-java7/solr/build/solr-core/test/J0/org.apache.solr.cloud.SyncSliceTest-jetty1-1360558830334/collection1/lib/README' to classloader
[junit4:junit4]   2> 4962 T495 oasc.SolrResourceLoader.replaceClassLoader Adding 'file:/usr/home/hudson/hudson-slave/workspace/Lucene-Solr-Tests-4.x-java7/solr/build/solr-core/test/J0/org.apache.solr.cloud.SyncSliceTest-jetty1-1360558830334/collection1/lib/classes/' to classloader
[junit4:junit4]   2> 5021 T495 oasc.SolrConfig.<init> Using Lucene MatchVersion: LUCENE_42
[junit4:junit4]   2> 5095 T495 oasc.SolrConfig.<init> Loaded SolrConfig: solrconfig.xml
[junit4:junit4]   2> 5196 T495 oass.IndexSchema.readSchema Reading Solr Schema
[junit4:junit4]   2> 5208 T495 oass.IndexSchema.readSchema Schema name=test
[junit4:junit4]   2> 6014 T476 oascc.ZkStateReader.updateClusterState Updating cloud state from ZooKeeper... 
[junit4:junit4]   2> 6015 T476 oasc.Overseer$ClusterStateUpdater.updateState Update state numShards=1 message={
[junit4:junit4]   2> 	  "operation":"state",
[junit4:junit4]   2> 	  "numShards":"1",
[junit4:junit4]   2> 	  "shard":"shard1",
[junit4:junit4]   2> 	  "roles":null,
[junit4:junit4]   2> 	  "state":"active",
[junit4:junit4]   2> 	  "core":"collection1",
[junit4:junit4]   2> 	  "collection":"control_collection",
[junit4:junit4]   2> 	  "node_name":"127.0.0.1:60769_",
[junit4:junit4]   2> 	  "base_url":"http://127.0.0.1:60769"}
[junit4:junit4]   2> 6022 T481 oascc.ZkStateReader$2.process A cluster state change: WatchedEvent state:SyncConnected type:NodeDataChanged path:/clusterstate.json, has occurred - updating... (live nodes size: 2)
[junit4:junit4]   2> 6022 T494 oascc.ZkStateReader$2.process A cluster state change: WatchedEvent state:SyncConnected type:NodeDataChanged path:/clusterstate.json, has occurred - updating... (live nodes size: 2)
[junit4:junit4]   2> 6022 T475 oascc.ZkStateReader$2.process A cluster state change: WatchedEvent state:SyncConnected type:NodeDataChanged path:/clusterstate.json, has occurred - updating... (live nodes size: 2)
[junit4:junit4]   2> 6207 T495 oass.OpenExchangeRatesOrgProvider.init Initialized with rates=open-exchange-rates.json, refreshInterval=1440.
[junit4:junit4]   2> 6216 T495 oass.IndexSchema.readSchema default search field in schema is text
[junit4:junit4]   2> 6219 T495 oass.IndexSchema.readSchema unique key field: id
[junit4:junit4]   2> 6236 T495 oass.FileExchangeRateProvider.reload Reloading exchange rates from file currency.xml
[junit4:junit4]   2> 6240 T495 oass.FileExchangeRateProvider.reload Reloading exchange rates from file currency.xml
[junit4:junit4]   2> 6244 T495 oass.OpenExchangeRatesOrgProvider.reload Reloading exchange rates from open-exchange-rates.json
[junit4:junit4]   2> 6245 T495 oass.OpenExchangeRatesOrgProvider.reload Reloading exchange rates from open-exchange-rates.json
[junit4:junit4]   2> 6247 T495 oasc.SolrCore.<init> [collection1] Opening new SolrCore at /usr/home/hudson/hudson-slave/workspace/Lucene-Solr-Tests-4.x-java7/solr/build/solr-core/test/J0/./org.apache.solr.cloud.SyncSliceTest-jetty1-1360558830334/collection1/, dataDir=./org.apache.solr.cloud.SyncSliceTest-1360558825755/jetty1/
[junit4:junit4]   2> 6247 T495 oasc.JmxMonitoredMap.<init> JMX monitoring is enabled. Adding Solr mbeans to JMX Server: com.sun.jmx.mbeanserver.JmxMBeanServer@283a30f3
[junit4:junit4]   2> 6247 T495 oasc.SolrCore.initDirectoryFactory solr.NRTCachingDirectoryFactory
[junit4:junit4]   2> 6248 T495 oasc.CachingDirectoryFactory.get return new directory for /usr/home/hudson/hudson-slave/workspace/Lucene-Solr-Tests-4.x-java7/solr/build/solr-core/test/J0/./org.apache.solr.cloud.SyncSliceTest-1360558825755/jetty1 forceNew:false
[junit4:junit4]   2> 6249 T495 oasc.CachingDirectoryFactory.close Releasing directory:/usr/home/hudson/hudson-slave/workspace/Lucene-Solr-Tests-4.x-java7/solr/build/solr-core/test/J0/./org.apache.solr.cloud.SyncSliceTest-1360558825755/jetty1
[junit4:junit4]   2> 6249 T495 oasc.SolrCore.getNewIndexDir New index directory detected: old=null new=./org.apache.solr.cloud.SyncSliceTest-1360558825755/jetty1/index/
[junit4:junit4]   2> 6249 T495 oasc.SolrCore.initIndex WARNING [collection1] Solr index directory './org.apache.solr.cloud.SyncSliceTest-1360558825755/jetty1/index' doesn't exist. Creating new index...
[junit4:junit4]   2> 6250 T495 oasc.CachingDirectoryFactory.get return new directory for /usr/home/hudson/hudson-slave/workspace/Lucene-Solr-Tests-4.x-java7/solr/build/solr-core/test/J0/./org.apache.solr.cloud.SyncSliceTest-1360558825755/jetty1/index forceNew:false
[junit4:junit4]   2> 6254 T495 oasc.SolrDeletionPolicy.onCommit SolrDeletionPolicy.onCommit: commits:num=1
[junit4:junit4]   2> 		commit{dir=RateLimitedDirectoryWrapper(NRTCachingDirectory(org.apache.lucene.store.NIOFSDirectory@/usr/home/hudson/hudson-slave/workspace/Lucene-Solr-Tests-4.x-java7/solr/build/solr-core/test/J0/org.apache.solr.cloud.SyncSliceTest-1360558825755/jetty1/index lockFactory=org.apache.lucene.store.NativeFSLockFactory@5e5fffaa; maxCacheMB=48.0 maxMergeSizeMB=4.0)),segFN=segments_1,generation=1,filenames=[segments_1]
[junit4:junit4]   2> 6254 T495 oasc.SolrDeletionPolicy.updateCommits newest commit = 1[segments_1]
[junit4:junit4]   2> 6255 T495 oasc.CachingDirectoryFactory.close Releasing directory:/usr/home/hudson/hudson-slave/workspace/Lucene-Solr-Tests-4.x-java7/solr/build/solr-core/test/J0/./org.apache.solr.cloud.SyncSliceTest-1360558825755/jetty1/index
[junit4:junit4]   2> 6255 T495 oasc.SolrCore.initWriters created xml: solr.XMLResponseWriter
[junit4:junit4]   2> 6257 T495 oasup.UpdateRequestProcessorChain.init inserting DistributedUpdateProcessorFactory into updateRequestProcessorChain "dedupe"
[junit4:junit4]   2> 6257 T495 oasup.UpdateRequestProcessorChain.init inserting DistributedUpdateProcessorFactory into updateRequestProcessorChain "dedupe-allfields"
[junit4:junit4]   2> 6258 T495 oasup.UpdateRequestProcessorChain.init inserting DistributedUpdateProcessorFactory into updateRequestProcessorChain "stored_sig"
[junit4:junit4]   2> 6258 T495 oasup.UpdateRequestProcessorChain.init inserting DistributedUpdateProcessorFactory into updateRequestProcessorChain "uniq-fields"
[junit4:junit4]   2> 6258 T495 oasup.UpdateRequestProcessorChain.init inserting DistributedUpdateProcessorFactory into updateRequestProcessorChain "distrib-dup-test-chain-implicit"
[junit4:junit4]   2> 6258 T495 oasc.RequestHandlers.initHandlersFromConfig adding lazy requestHandler: solr.ReplicationHandler
[junit4:junit4]   2> 6259 T495 oasc.RequestHandlers.initHandlersFromConfig created /replication: solr.ReplicationHandler
[junit4:junit4]   2> 6259 T495 oasc.RequestHandlers.initHandlersFromConfig created standard: solr.StandardRequestHandler
[junit4:junit4]   2> 6260 T495 oasc.RequestHandlers.initHandlersFromConfig created /get: solr.RealTimeGetHandler
[junit4:junit4]   2> 6260 T495 oasc.RequestHandlers.initHandlersFromConfig created dismax: solr.SearchHandler
[junit4:junit4]   2> 6261 T495 oasc.RequestHandlers.initHandlersFromConfig created mock: org.apache.solr.core.MockQuerySenderListenerReqHandler
[junit4:junit4]   2> 6261 T495 oasc.RequestHandlers.initHandlersFromConfig created /admin/: org.apache.solr.handler.admin.AdminHandlers
[junit4:junit4]   2> 6261 T495 oasc.RequestHandlers.initHandlersFromConfig created defaults: solr.StandardRequestHandler
[junit4:junit4]   2> 6262 T495 oasc.RequestHandlers.initHandlersFromConfig adding lazy requestHandler: solr.StandardRequestHandler
[junit4:junit4]   2> 6262 T495 oasc.RequestHandlers.initHandlersFromConfig created lazy: solr.StandardRequestHandler
[junit4:junit4]   2> 6262 T495 oasc.RequestHandlers.initHandlersFromConfig created /update: solr.UpdateRequestHandler
[junit4:junit4]   2> 6263 T495 oasc.RequestHandlers.initHandlersFromConfig created /terms: org.apache.solr.handler.component.SearchHandler
[junit4:junit4]   2> 6263 T495 oasc.RequestHandlers.initHandlersFromConfig created spellCheckCompRH: org.apache.solr.handler.component.SearchHandler
[junit4:junit4]   2> 6264 T495 oasc.RequestHandlers.initHandlersFromConfig created spellCheckCompRH_Direct: org.apache.solr.handler.component.SearchHandler
[junit4:junit4]   2> 6264 T495 oasc.RequestHandlers.initHandlersFromConfig created spellCheckWithWordbreak: org.apache.solr.handler.component.SearchHandler
[junit4:junit4]   2> 6265 T495 oasc.RequestHandlers.initHandlersFromConfig created spellCheckWithWordbreak_Direct: org.apache.solr.handler.component.SearchHandler
[junit4:junit4]   2> 6265 T495 oasc.RequestHandlers.initHandlersFromConfig created spellCheckCompRH1: org.apache.solr.handler.component.SearchHandler
[junit4:junit4]   2> 6266 T495 oasc.RequestHandlers.initHandlersFromConfig created mltrh: org.apache.solr.handler.component.SearchHandler
[junit4:junit4]   2> 6266 T495 oasc.RequestHandlers.initHandlersFromConfig created tvrh: org.apache.solr.handler.component.SearchHandler
[junit4:junit4]   2> 6267 T495 oasc.RequestHandlers.initHandlersFromConfig created /mlt: solr.MoreLikeThisHandler
[junit4:junit4]   2> 6267 T495 oasc.RequestHandlers.initHandlersFromConfig created /debug/dump: solr.DumpRequestHandler
[junit4:junit4]   2> 6276 T495 oashl.XMLLoader.init xsltCacheLifetimeSeconds=60
[junit4:junit4]   2> 6279 T495 oasc.SolrCore.initDeprecatedSupport WARNING solrconfig.xml uses deprecated <admin/gettableFiles>, Please update your config to use the ShowFileRequestHandler.
[junit4:junit4]   2> 6281 T495 oasc.SolrCore.initDeprecatedSupport WARNING adding ShowFileRequestHandler with hidden files: [SCHEMA.XML, OLD_SYNONYMS.TXT, STOPWORDS.TXT, PROTWORDS.TXT, OPEN-EXCHANGE-RATES.JSON, SYNONYMS.TXT, CURRENCY.XML, MAPPING-ISOLATIN1ACCENT.TXT]
[junit4:junit4]   2> 6283 T495 oasc.CachingDirectoryFactory.close Releasing directory:/usr/home/hudson/hudson-slave/workspace/Lucene-Solr-Tests-4.x-java7/solr/build/solr-core/test/J0/./org.apache.solr.cloud.SyncSliceTest-1360558825755/jetty1
[junit4:junit4]   2> 6284 T495 oass.SolrIndexSearcher.<init> Opening Searcher@66746531 main
[junit4:junit4]   2> 6285 T495 oasu.CommitTracker.<init> Hard AutoCommit: disabled
[junit4:junit4]   2> 6285 T495 oasu.CommitTracker.<init> Soft AutoCommit: disabled
[junit4:junit4]   2> 6286 T495 oashc.SpellCheckComponent.inform Initializing spell checkers
[junit4:junit4]   2> 6291 T495 oass.DirectSolrSpellChecker.init init: {name=direct,classname=DirectSolrSpellChecker,field=lowerfilt,minQueryLength=3}
[junit4:junit4]   2> 6340 T496 oasc.SolrCore.registerSearcher [collection1] Registered new searcher Searcher@66746531 main{StandardDirectoryReader(segments_1:1)}
[junit4:junit4]   2> 6348 T495 oasc.ZkController.publish publishing core=collection1 state=down
[junit4:junit4]   2> 6348 T495 oasc.ZkController.publish numShards not found on descriptor - reading it from system property
[junit4:junit4]   2> 7529 T476 oascc.ZkStateReader.updateClusterState Updating cloud state from ZooKeeper... 
[junit4:junit4]   2> 7530 T476 oasc.Overseer$ClusterStateUpdater.updateState Update state numShards=1 message={
[junit4:junit4]   2> 	  "operation":"state",
[junit4:junit4]   2> 	  "numShards":"1",
[junit4:junit4]   2> 	  "shard":null,
[junit4:junit4]   2> 	  "roles":null,
[junit4:junit4]   2> 	  "state":"down",
[junit4:junit4]   2> 	  "core":"collection1",
[junit4:junit4]   2> 	  "collection":"collection1",
[junit4:junit4]   2> 	  "node_name":"127.0.0.1:60779_",
[junit4:junit4]   2> 	  "base_url":"http://127.0.0.1:60779"}
[junit4:junit4]   2> 7530 T476 oasc.Overseer$ClusterStateUpdater.createCollection Create collection collection1 with numShards 1
[junit4:junit4]   2> 7530 T476 oasc.Overseer$ClusterStateUpdater.updateState Assigning new node to shard shard=shard1
[junit4:junit4]   2> 7537 T475 oascc.ZkStateReader$2.process A cluster state change: WatchedEvent state:SyncConnected type:NodeDataChanged path:/clusterstate.json, has occurred - updating... (live nodes size: 2)
[junit4:junit4]   2> 7537 T494 oascc.ZkStateReader$2.process A cluster state change: WatchedEvent state:SyncConnected type:NodeDataChanged path:/clusterstate.json, has occurred - updating... (live nodes size: 2)
[junit4:junit4]   2> 7537 T481 oascc.ZkStateReader$2.process A cluster state change: WatchedEvent state:SyncConnected type:NodeDataChanged path:/clusterstate.json, has occurred - updating... (live nodes size: 2)
[junit4:junit4]   2> 8352 T495 oasc.CoreContainer.registerCore registering core: collection1
[junit4:junit4]   2> 8352 T495 oasc.ZkController.register Register replica - core:collection1 address:http://127.0.0.1:60779 collection:collection1 shard:shard1
[junit4:junit4]   2> 8353 T495 oascc.SolrZkClient.makePath makePath: /collections/collection1/leader_elect/shard1/election
[junit4:junit4]   2> 8376 T459 oazs.PrepRequestProcessor.pRequest Got user-level KeeperException when processing sessionid:0x13cc7a0224d0006 type:delete cxid:0x47 zxid:0x5b txntype:-1 reqpath:n/a Error Path:/solr/collections/collection1/leaders Error:KeeperErrorCode = NoNode for /solr/collections/collection1/leaders
[junit4:junit4]   2> 8377 T495 oasc.ShardLeaderElectionContext.runLeaderProcess Running the leader process.
[junit4:junit4]   2> 8378 T459 oazs.PrepRequestProcessor.pRequest Got user-level KeeperException when processing sessionid:0x13cc7a0224d0006 type:create cxid:0x48 zxid:0x5c txntype:-1 reqpath:n/a Error Path:/solr/overseer Error:KeeperErrorCode = NodeExists for /solr/overseer
[junit4:junit4]   2> 8380 T495 oasc.ShardLeaderElectionContext.waitForReplicasToComeUp Enough replicas found to continue.
[junit4:junit4]   2> 8381 T495 oasc.ShardLeaderElectionContext.runLeaderProcess I may be the new leader - try and sync
[junit4:junit4]   2> 8381 T495 oasc.SyncStrategy.sync Sync replicas to http://127.0.0.1:60779/collection1/
[junit4:junit4]   2> 8381 T495 oasc.SyncStrategy.syncReplicas Sync Success - now sync replicas to me
[junit4:junit4]   2> 8381 T495 oasc.SyncStrategy.syncToMe http://127.0.0.1:60779/collection1/ has no replicas
[junit4:junit4]   2> 8382 T495 oasc.ShardLeaderElectionContext.runLeaderProcess I am the new leader: http://127.0.0.1:60779/collection1/
[junit4:junit4]   2> 8382 T495 oascc.SolrZkClient.makePath makePath: /collections/collection1/leaders/shard1
[junit4:junit4]   2> 8388 T459 oazs.PrepRequestProcessor.pRequest Got user-level KeeperException when processing sessionid:0x13cc7a0224d0006 type:create cxid:0x52 zxid:0x60 txntype:-1 reqpath:n/a Error Path:/solr/overseer Error:KeeperErrorCode = NodeExists for /solr/overseer
[junit4:junit4]   2> 9045 T476 oascc.ZkStateReader.updateClusterState Updating cloud state from ZooKeeper... 
[junit4:junit4]   2> 9063 T481 oascc.ZkStateReader$2.process A cluster state change: WatchedEvent state:SyncConnected type:NodeDataChanged path:/clusterstate.json, has occurred - updating... (live nodes size: 2)
[junit4:junit4]   2> 9063 T475 oascc.ZkStateReader$2.process A cluster state change: WatchedEvent state:SyncConnected type:NodeDataChanged path:/clusterstate.json, has occurred - updating... (live nodes size: 2)
[junit4:junit4]   2> 9063 T494 oascc.ZkStateReader$2.process A cluster state change: WatchedEvent state:SyncConnected type:NodeDataChanged path:/clusterstate.json, has occurred - updating... (live nodes size: 2)
[junit4:junit4]   2> 9105 T495 oasc.ZkController.register We are http://127.0.0.1:60779/collection1/ and leader is http://127.0.0.1:60779/collection1/
[junit4:junit4]   2> 9105 T495 oasc.ZkController.register No LogReplay needed for core=collection1 baseURL=http://127.0.0.1:60779
[junit4:junit4]   2> 9105 T495 oasc.ZkController.checkRecovery I am the leader, no recovery necessary
[junit4:junit4]   2> 9105 T495 oasc.ZkController.publish publishing core=collection1 state=active
[junit4:junit4]   2> 9106 T495 oasc.ZkController.publish numShards not found on descriptor - reading it from system property
[junit4:junit4]   2> 9108 T495 oascc.ZkStateReader.updateClusterState Updating cloud state from ZooKeeper... 
[junit4:junit4]   2> 9109 T453 oass.SolrDispatchFilter.init user.dir=/usr/home/hudson/hudson-slave/workspace/Lucene-Solr-Tests-4.x-java7/solr/build/solr-core/test/J0
[junit4:junit4]   2> 9110 T453 oass.SolrDispatchFilter.init SolrDispatchFilter.init() done
[junit4:junit4]   2> 9110 T453 oascsi.HttpClientUtil.createClient Creating new http client, config:maxConnections=128&maxConnectionsPerHost=32&followRedirects=false
[junit4:junit4]   2> 9303 T453 oejs.Server.doStart jetty-8.1.8.v20121106
[junit4:junit4]   2> 9307 T453 oejs.AbstractConnector.doStart Started SocketConnector@127.0.0.1:60791
[junit4:junit4]   2> 9307 T453 oass.SolrDispatchFilter.init SolrDispatchFilter.init()
[junit4:junit4]   2> 9308 T453 oasc.SolrResourceLoader.locateSolrHome JNDI not configured for solr (NoInitialContextEx)
[junit4:junit4]   2> 9308 T453 oasc.SolrResourceLoader.locateSolrHome using system property solr.solr.home: /usr/home/hudson/hudson-slave/workspace/Lucene-Solr-Tests-4.x-java7/solr/build/solr-core/test/J0/./org.apache.solr.cloud.SyncSliceTest-jetty2-1360558834875
[junit4:junit4]   2> 9309 T453 oasc.CoreContainer$Initializer.initialize looking for solr.xml: /usr/home/hudson/hudson-slave/workspace/Lucene-Solr-Tests-4.x-java7/solr/build/solr-core/test/J0/./org.apache.solr.cloud.SyncSliceTest-jetty2-1360558834875/solr.xml
[junit4:junit4]   2> 9309 T453 oasc.CoreContainer.<init> New CoreContainer 252887865
[junit4:junit4]   2> 9310 T453 oasc.CoreContainer.load Loading CoreContainer using Solr Home: '/usr/home/hudson/hudson-slave/workspace/Lucene-Solr-Tests-4.x-java7/solr/build/solr-core/test/J0/./org.apache.solr.cloud.SyncSliceTest-jetty2-1360558834875/'
[junit4:junit4]   2> 9310 T453 oasc.SolrResourceLoader.<init> new SolrResourceLoader for directory: '/usr/home/hudson/hudson-slave/workspace/Lucene-Solr-Tests-4.x-java7/solr/build/solr-core/test/J0/./org.apache.solr.cloud.SyncSliceTest-jetty2-1360558834875/'
[junit4:junit4]   2> 9371 T453 oashc.HttpShardHandlerFactory.getParameter Setting socketTimeout to: 60000
[junit4:junit4]   2> 9372 T453 oashc.HttpShardHandlerFactory.getParameter Setting urlScheme to: http://
[junit4:junit4]   2> 9372 T453 oashc.HttpShardHandlerFactory.getParameter Setting connTimeout to: 15000
[junit4:junit4]   2> 9372 T453 oashc.HttpShardHandlerFactory.getParameter Setting maxConnectionsPerHost to: 20
[junit4:junit4]   2> 9373 T453 oashc.HttpShardHandlerFactory.getParameter Setting corePoolSize to: 0
[junit4:junit4]   2> 9373 T453 oashc.HttpShardHandlerFactory.getParameter Setting maximumPoolSize to: 2147483647
[junit4:junit4]   2> 9374 T453 oashc.HttpShardHandlerFactory.getParameter Setting maxThreadIdleTime to: 5
[junit4:junit4]   2> 9374 T453 oashc.HttpShardHandlerFactory.getParameter Setting sizeOfQueue to: -1
[junit4:junit4]   2> 9375 T453 oashc.HttpShardHandlerFactory.getParameter Setting fairnessPolicy to: false
[junit4:junit4]   2> 9375 T453 oascsi.HttpClientUtil.createClient Creating new http client, config:maxConnectionsPerHost=20&maxConnections=10000&socketTimeout=60000&connTimeout=15000&retry=false
[junit4:junit4]   2> 9399 T453 oasc.CoreContainer.load Registering Log Listener
[junit4:junit4]   2> 9429 T453 oasc.CoreContainer.initZooKeeper Zookeeper client=127.0.0.1:60763/solr
[junit4:junit4]   2> 9429 T453 oasc.ZkController.checkChrootPath zkHost includes chroot
[junit4:junit4]   2> 9430 T453 oaz.ZooKeeper.<init> Initiating client connection, connectString=127.0.0.1:60763 sessionTimeout=60000 watcher=org.apache.solr.common.cloud.ConnectionManager@700a2462
[junit4:junit4]   2> 9431 T453 oascc.ConnectionManager.waitForConnected Waiting for client to connect to ZooKeeper
[junit4:junit4]   2> 9431 T506 oaz.ClientCnxn$SendThread.logStartConnect Opening socket connection to server localhost/127.0.0.1:60763. Will not attempt to authenticate using SASL (access denied ("javax.security.auth.AuthPermission" "getLoginConfiguration"))
[junit4:junit4]   2> 9432 T506 oaz.ClientCnxn$SendThread.primeConnection Socket connection established to localhost/127.0.0.1:60763, initiating session
[junit4:junit4]   2> 9432 T455 oazs.NIOServerCnxnFactory.run Accepted socket connection from /140.211.11.196:60792
[junit4:junit4]   2> 9433 T455 oazs.ZooKeeperServer.processConnectRequest Client attempting to establish new session at /140.211.11.196:60792
[junit4:junit4]   2> 9439 T457 oazs.ZooKeeperServer.finishSessionInit Established session 0x13cc7a0224d0007 with negotiated timeout 20000 for client /140.211.11.196:60792
[junit4:junit4]   2> 9439 T506 oaz.ClientCnxn$SendThread.onConnected Session establishment complete on server localhost/127.0.0.1:60763, sessionid = 0x13cc7a0224d0007, negotiated timeout = 20000
[junit4:junit4]   2> 9439 T507 oascc.ConnectionManager.process Watcher org.apache.solr.common.cloud.ConnectionManager@700a2462 name:ZooKeeperConnection Watcher:127.0.0.1:60763 got event WatchedEvent state:SyncConnected type:None path:null path:null type:None
[junit4:junit4]   2> 9440 T453 oascc.ConnectionManager.waitForConnected Client is connected to ZooKeeper
[junit4:junit4]   2> 9441 T459 oazs.PrepRequestProcessor.pRequest2Txn Processed session termination for sessionid: 0x13cc7a0224d0007
[junit4:junit4]   2> 9442 T507 oaz.ClientCnxn$EventThread.run EventThread shut down
[junit4:junit4]   2> 9442 T455 oazs.NIOServerCnxn.closeSock Closed socket connection for client /140.211.11.196:60792 which had sessionid 0x13cc7a0224d0007
[junit4:junit4]   2> 9442 T453 oaz.ZooKeeper.close Session: 0x13cc7a0224d0007 closed
[junit4:junit4]   2> 9443 T453 oascsi.HttpClientUtil.createClient Creating new http client, config:maxConnections=500&maxConnectionsPerHost=16&socketTimeout=60000&connTimeout=15000
[junit4:junit4]   2> 9457 T453 oaz.ZooKeeper.<init> Initiating client connection, connectString=127.0.0.1:60763/solr sessionTimeout=30000 watcher=org.apache.solr.common.cloud.ConnectionManager@7b4b8eac
[junit4:junit4]   2> 9458 T453 oascc.ConnectionManager.waitForConnected Waiting for client to connect to ZooKeeper
[junit4:junit4]   2> 9458 T508 oaz.ClientCnxn$SendThread.logStartConnect Opening socket connection to server localhost/127.0.0.1:60763. Will not attempt to authenticate using SASL (access denied ("javax.security.auth.AuthPermission" "getLoginConfiguration"))
[junit4:junit4]   2> 9459 T508 oaz.ClientCnxn$SendThread.primeConnection Socket connection established to localhost/127.0.0.1:60763, initiating session
[junit4:junit4]   2> 9459 T455 oazs.NIOServerCnxnFactory.run Accepted socket connection from /140.211.11.196:60793
[junit4:junit4]   2> 9459 T455 oazs.ZooKeeperServer.processConnectRequest Client attempting to establish new session at /140.211.11.196:60793
[junit4:junit4]   2> 9461 T457 oazs.ZooKeeperServer.finishSessionInit Established session 0x13cc7a0224d0008 with negotiated timeout 20000 for client /140.211.11.196:60793
[junit4:junit4]   2> 9461 T508 oaz.ClientCnxn$SendThread.onConnected Session establishment complete on server localhost/127.0.0.1:60763, sessionid = 0x13cc7a0224d0008, negotiated timeout = 20000
[junit4:junit4]   2> 9461 T509 oascc.ConnectionManager.process Watcher org.apache.solr.common.cloud.ConnectionManager@7b4b8eac name:ZooKeeperConnection Watcher:127.0.0.1:60763/solr got event WatchedEvent state:SyncConnected type:None path:null path:null type:None
[junit4:junit4]   2> 9461 T453 oascc.ConnectionManager.waitForConnected Client is connected to ZooKeeper
[junit4:junit4]   2> 9462 T459 oazs.PrepRequestProcessor.pRequest Got user-level KeeperException when processing sessionid:0x13cc7a0224d0008 type:create cxid:0x1 zxid:0x6d txntype:-1 reqpath:n/a Error Path:/solr/overseer Error:KeeperErrorCode = NodeExists for /solr/overseer
[junit4:junit4]   2> 9464 T459 oazs.PrepRequestProcessor.pRequest Got user-level KeeperException when processing sessionid:0x13cc7a0224d0008 type:create cxid:0x2 zxid:0x6e txntype:-1 reqpath:n/a Error Path:/solr/overseer Error:KeeperErrorCode = NodeExists for /solr/overseer
[junit4:junit4]   2> 9466 T453 oascc.ZkStateReader.createClusterStateWatchersAndUpdate Updating cluster state from ZooKeeper... 
[junit4:junit4]   2> 9470 T453 oasc.ZkController.createEphemeralLiveNode Register node as live in ZooKeeper:/live_nodes/127.0.0.1:60791_
[junit4:junit4]   2> 9470 T459 oazs.PrepRequestProcessor.pRequest Got user-level KeeperException when processing sessionid:0x13cc7a0224d0008 type:delete cxid:0x9 zxid:0x6f txntype:-1 reqpath:n/a Error Path:/solr/live_nodes/127.0.0.1:60791_ Error:KeeperErrorCode = NoNode for /solr/live_nodes/127.0.0.1:60791_
[junit4:junit4]   2> 9471 T453 oascc.SolrZkClient.makePath makePath: /live_nodes/127.0.0.1:60791_
[junit4:junit4]   2> 9475 T494 oascc.ZkStateReader$2.process A cluster state change: WatchedEvent state:SyncConnected type:NodeChildrenChanged path:/live_nodes, has occurred - updating... (live nodes size: 2)
[junit4:junit4]   2> 9476 T481 oascc.ZkStateReader$3.process Updating live nodes... (3)
[junit4:junit4]   2> 9476 T475 oascc.ZkStateReader$3.process Updating live nodes... (3)
[junit4:junit4]   2> 9476 T509 oascc.ZkStateReader$3.process Updating live nodes... (3)
[junit4:junit4]   2> 9476 T481 oascc.ZkStateReader$2.process A cluster state change: WatchedEvent state:SyncConnected type:NodeChildrenChanged path:/live_nodes, has occurred - updating... (live nodes size: 3)
[junit4:junit4]   2> 9476 T475 oascc.ZkStateReader$2.process A cluster state change: WatchedEvent state:SyncConnected type:NodeChildrenChanged path:/live_nodes, has occurred - updating... (live nodes size: 3)
[junit4:junit4]   2> 9477 T494 oascc.ZkStateReader$3.process Updating live nodes... (3)
[junit4:junit4]   2> 9486 T510 oasc.CoreContainer.create Creating SolrCore 'collection1' using instanceDir: /usr/home/hudson/hudson-slave/workspace/Lucene-Solr-Tests-4.x-java7/solr/build/solr-core/test/J0/./org.apache.solr.cloud.SyncSliceTest-jetty2-1360558834875/collection1
[junit4:junit4]   2> 9486 T510 oasc.ZkController.createCollectionZkNode Check for collection zkNode:collection1
[junit4:junit4]   2> 9487 T510 oasc.ZkController.createCollectionZkNode Collection zkNode exists
[junit4:junit4]   2> 9487 T510 oasc.ZkController.readConfigName Load collection config from:/collections/collection1
[junit4:junit4]   2> 9489 T510 oasc.SolrResourceLoader.<init> new SolrResourceLoader for directory: '/usr/home/hudson/hudson-slave/workspace/Lucene-Solr-Tests-4.x-java7/solr/build/solr-core/test/J0/./org.apache.solr.cloud.SyncSliceTest-jetty2-1360558834875/collection1/'
[junit4:junit4]   2> 9491 T510 oasc.SolrResourceLoader.replaceClassLoader Adding 'file:/usr/home/hudson/hudson-slave/workspace/Lucene-Solr-Tests-4.x-java7/solr/build/solr-core/test/J0/org.apache.solr.cloud.SyncSliceTest-jetty2-1360558834875/collection1/lib/README' to classloader
[junit4:junit4]   2> 9491 T510 oasc.SolrResourceLoader.replaceClassLoader Adding 'file:/usr/home/hudson/hudson-slave/workspace/Lucene-Solr-Tests-4.x-java7/solr/build/solr-core/test/J0/org.apache.solr.cloud.SyncSliceTest-jetty2-1360558834875/collection1/lib/classes/' to classloader
[junit4:junit4]   2> 9560 T510 oasc.SolrConfig.<init> Using Lucene MatchVersion: LUCENE_42
[junit4:junit4]   2> 9634 T510 oasc.SolrConfig.<init> Loaded SolrConfig: solrconfig.xml
[junit4:junit4]   2> 9735 T510 oass.IndexSchema.readSchema Reading Solr Schema
[junit4:junit4]   2> 9742 T510 oass.IndexSchema.readSchema Schema name=test
[junit4:junit4]   2> 10423 T510 oass.OpenExchangeRatesOrgProvider.init Initialized with rates=open-exchange-rates.json, refreshInterval=1440.
[junit4:junit4]   2> 10436 T510 oass.IndexSchema.readSchema default search field in schema is text
[junit4:junit4]   2> 10440 T510 oass.IndexSchema.readSchema unique key field: id
[junit4:junit4]   2> 10463 T510 oass.FileExchangeRateProvider.reload Reloading exchange rates from file currency.xml
[junit4:junit4]   2> 10468 T510 oass.FileExchangeRateProvider.reload Reloading exchange rates from file currency.xml
[junit4:junit4]   2> 10474 T510 oass.OpenExchangeRatesOrgProvider.reload Reloading exchange rates from open-exchange-rates.json
[junit4:junit4]   2> 10476 T510 oass.OpenExchangeRatesOrgProvider.reload Reloading exchange rates from open-exchange-rates.json
[junit4:junit4]   2> 10477 T510 oasc.SolrCore.<init> [collection1] Opening new SolrCore at /usr/home/hudson/hudson-slave/workspace/Lucene-Solr-Tests-4.x-java7/solr/build/solr-core/test/J0/./org.apache.solr.cloud.SyncSliceTest-jetty2-1360558834875/collection1/, dataDir=./org.apache.solr.cloud.SyncSliceTest-1360558825755/jetty2/
[junit4:junit4]   2> 10478 T510 oasc.JmxMonitoredMap.<init> JMX monitoring is enabled. Adding Solr mbeans to JMX Server: com.sun.jmx.mbeanserver.JmxMBeanServer@283a30f3
[junit4:junit4]   2> 10478 T510 oasc.SolrCore.initDirectoryFactory solr.NRTCachingDirectoryFactory
[junit4:junit4]   2> 10479 T510 oasc.CachingDirectoryFactory.get return new directory for /usr/home/hudson/hudson-slave/workspace/Lucene-Solr-Tests-4.x-java7/solr/build/solr-core/test/J0/./org.apache.solr.cloud.SyncSliceTest-1360558825755/jetty2 forceNew:false
[junit4:junit4]   2> 10480 T510 oasc.CachingDirectoryFactory.close Releasing directory:/usr/home/hudson/hudson-slave/workspace/Lucene-Solr-Tests-4.x-java7/solr/build/solr-core/test/J0/./org.apache.solr.cloud.SyncSliceTest-1360558825755/jetty2
[junit4:junit4]   2> 10480 T510 oasc.SolrCore.getNewIndexDir New index directory detected: old=null new=./org.apache.solr.cloud.SyncSliceTest-1360558825755/jetty2/index/
[junit4:junit4]   2> 10481 T510 oasc.SolrCore.initIndex WARNING [collection1] Solr index directory './org.apache.solr.cloud.SyncSliceTest-1360558825755/jetty2/index' doesn't exist. Creating new index...
[junit4:junit4]   2> 10482 T510 oasc.CachingDirectoryFactory.get return new directory for /usr/home/hudson/hudson-slave/workspace/Lucene-Solr-Tests-4.x-java7/solr/build/solr-core/test/J0/./org.apache.solr.cloud.SyncSliceTest-1360558825755/jetty2/index forceNew:false
[junit4:junit4]   2> 10515 T510 oasc.SolrDeletionPolicy.onCommit SolrDeletionPolicy.onCommit: commits:num=1
[junit4:junit4]   2> 		commit{dir=RateLimitedDirectoryWrapper(NRTCachingDirectory(org.apache.lucene.store.NIOFSDirectory@/usr/home/hudson/hudson-slave/workspace/Lucene-Solr-Tests-4.x-java7/solr/build/solr-core/test/J0/org.apache.solr.cloud.SyncSliceTest-1360558825755/jetty2/index lockFactory=org.apache.lucene.store.NativeFSLockFactory@4293e735; maxCacheMB=48.0 maxMergeSizeMB=4.0)),segFN=segments_1,generation=1,filenames=[segments_1]
[junit4:junit4]   2> 10515 T510 oasc.SolrDeletionPolicy.updateCommits newest commit = 1[segments_1]
[junit4:junit4]   2> 10516 T510 oasc.CachingDirectoryFactory.close Releasing directory:/usr/home/hudson/hudson-slave/workspace/Lucene-Solr-Tests-4.x-java7/solr/build/solr-core/test/J0/./org.apache.solr.cloud.SyncSliceTest-1360558825755/jetty2/index
[junit4:junit4]   2> 10516 T510 oasc.SolrCore.initWriters created xml: solr.XMLResponseWriter
[junit4:junit4]   2> 10519 T510 oasup.UpdateRequestProcessorChain.init inserting DistributedUpdateProcessorFactory into updateRequestProcessorChain "dedupe"
[junit4:junit4]   2> 10519 T510 oasup.UpdateRequestProcessorChain.init inserting DistributedUpdateProcessorFactory into updateRequestProcessorChain "dedupe-allfields"
[junit4:junit4]   2> 10520 T510 oasup.UpdateRequestProcessorChain.init inserting DistributedUpdateProcessorFactory into updateRequestProcessorChain "stored_sig"
[junit4:junit4]   2> 10520 T510 oasup.UpdateRequestProcessorChain.init inserting DistributedUpdateProcessorFactory into updateRequestProcessorChain "uniq-fields"
[junit4:junit4]   2> 10521 T510 oasup.UpdateRequestProcessorChain.init inserting DistributedUpdateProcessorFactory into updateRequestProcessorChain "distrib-dup-test-chain-implicit"
[junit4:junit4]   2> 10521 T510 oasc.RequestHandlers.initHandlersFromConfig adding lazy requestHandler: solr.ReplicationHandler
[junit4:junit4]   2> 10521 T510 oasc.RequestHandlers.initHandlersFromConfig created /replication: solr.ReplicationHandler
[junit4:junit4]   2> 10522 T510 oasc.RequestHandlers.initHandlersFromConfig created standard: solr.StandardRequestHandler
[junit4:junit4]   2> 10523 T510 oasc.RequestHandlers.initHandlersFromConfig created /get: solr.RealTimeGetHandler
[junit4:junit4]   2> 10524 T510 oasc.RequestHandlers.initHandlersFromConfig created dismax: solr.SearchHandler
[junit4:junit4]   2> 10524 T510 oasc.RequestHandlers.initHandlersFromConfig created mock: org.apache.solr.core.MockQuerySenderListenerReqHandler
[junit4:junit4]   2> 10525 T510 oasc.RequestHandlers.initHandlersFromConfig created /admin/: org.apache.solr.handler.admin.AdminHandlers
[junit4:junit4]   2> 10525 T510 oasc.RequestHandlers.initHandlersFromConfig created defaults: solr.StandardRequestHandler
[junit4:junit4]   2> 10526 T510 oasc.RequestHandlers.initHandlersFromConfig adding lazy requestHandler: solr.StandardRequestHandler
[junit4:junit4]   2> 10526 T510 oasc.RequestHandlers.initHandlersFromConfig created lazy: solr.StandardRequestHandler
[junit4:junit4]   2> 10527 T510 oasc.RequestHandlers.initHandlersFromConfig created /update: solr.UpdateRequestHandler
[junit4:junit4]   2> 10527 T510 oasc.RequestHandlers.initHandlersFromConfig created /terms: org.apache.solr.handler.component.SearchHandler
[junit4:junit4]   2> 10528 T510 oasc.RequestHandlers.initHandlersFromConfig created spellCheckCompRH: org.apache.solr.handler.component.SearchHandler
[junit4:junit4]   2> 10529 T510 oasc.RequestHandlers.initHandlersFromConfig created spellCheckCompRH_Direct: org.apache.solr.handler.component.SearchHandler
[junit4:junit4]   2> 10529 T510 oasc.RequestHandlers.initHandlersFromConfig created spellCheckWithWordbreak: org.apache.solr.handler.component.SearchHandler
[junit4:junit4]   2> 10530 T510 oasc.RequestHandlers.initHandlersFromConfig created spellCheckWithWordbreak_Direct: org.apache.solr.handler.component.SearchHandler
[junit4:junit4]   2> 10531 T510 oasc.RequestHandlers.initHandlersFromConfig created spellCheckCompRH1: org.apache.solr.handler.component.SearchHandler
[junit4:junit4]   2> 10532 T510 oasc.RequestHandlers.initHandlersFromConfig created mltrh: org.apache.solr.handler.component.SearchHandler
[junit4:junit4]   2> 10532 T510 oasc.RequestHandlers.initHandlersFromConfig created tvrh: org.apache.solr.handler.component.SearchHandler
[junit4:junit4]   2> 10533 T510 oasc.RequestHandlers.initHandlersFromConfig created /mlt: solr.MoreLikeThisHandler
[junit4:junit4]   2> 10534 T510 oasc.RequestHandlers.initHandlersFromConfig created /debug/dump: solr.DumpRequestHandler
[junit4:junit4]   2> 10547 T510 oashl.XMLLoader.init xsltCacheLifetimeSeconds=60
[junit4:junit4]   2> 10552 T510 oasc.SolrCore.initDeprecatedSupport WARNING solrconfig.xml uses deprecated <admin/gettableFiles>, Please update your config to use the ShowFileRequestHandler.
[junit4:junit4]   2> 10553 T510 oasc.SolrCore.initDeprecatedSupport WARNING adding ShowFileRequestHandler with hidden files: [SCHEMA.XML, OLD_SYNONYMS.TXT, STOPWORDS.TXT, PROTWORDS.TXT, OPEN-EXCHANGE-RATES.JSON, SYNONYMS.TXT, CURRENCY.XML, MAPPING-ISOLATIN1ACCENT.TXT]
[junit4:junit4]   2> 10556 T510 oasc.CachingDirectoryFactory.close Releasing directory:/usr/home/hudson/hudson-slave/workspace/Lucene-Solr-Tests-4.x-java7/solr/build/solr-core/test/J0/./org.apache.solr.cloud.SyncSliceTest-1360558825755/jetty2
[junit4:junit4]   2> 10558 T510 oass.SolrIndexSearcher.<init> Opening Searcher@143bc8f8 main
[junit4:junit4]   2> 10559 T510 oasu.CommitTracker.<init> Hard AutoCommit: disabled
[junit4:junit4]   2> 10560 T510 oasu.CommitTracker.<init> Soft AutoCommit: disabled
[junit4:junit4]   2> 10560 T510 oashc.SpellCheckComponent.inform Initializing spell checkers
[junit4:junit4]   2> 10577 T510 oass.DirectSolrSpellChecker.init init: {name=direct,classname=DirectSolrSpellChecker,field=lowerfilt,minQueryLength=3}
[junit4:junit4]   2> 10583 T476 oascc.ZkStateReader.updateClusterState Updating cloud state from ZooKeeper... 
[junit4:junit4]   2> 10584 T476 oasc.Overseer$ClusterStateUpdater.updateState Update state numShards=1 message={
[junit4:junit4]   2> 	  "operation":"state",
[junit4:junit4]   2> 	  "numShards":"1",
[junit4:junit4]   2> 	  "shard":"shard1",
[junit4:junit4]   2> 	  "roles":null,
[junit4:junit4]   2> 	  "state":"active",
[junit4:junit4]   2> 	  "core":"collection1",
[junit4:junit4]   2> 	  "collection":"collection1",
[junit4:junit4]   2> 	  "node_name":"127.0.0.1:60779_",
[junit4:junit4]   2> 	  "base_url":"http://127.0.0.1:60779"}
[junit4:junit4]   2> 10601 T475 oascc.ZkStateReader$2.process A cluster state change: WatchedEvent state:SyncConnected type:NodeDataChanged path:/clusterstate.json, has occurred - updating... (live nodes size: 3)
[junit4:junit4]   2> 10601 T481 oascc.ZkStateReader$2.process A cluster state change: WatchedEvent state:SyncConnected type:NodeDataChanged path:/clusterstate.json, has occurred - updating... (live nodes size: 3)
[junit4:junit4]   2> 10601 T509 oascc.ZkStateReader$2.process A cluster state change: WatchedEvent state:SyncConnected type:NodeDataChanged path:/clusterstate.json, has occurred - updating... (live nodes size: 3)
[junit4:junit4]   2> 10601 T494 oascc.ZkStateReader$2.process A cluster state change: WatchedEvent state:SyncConnected type:NodeDataChanged path:/clusterstate.json, has occurred - updating... (live nodes size: 3)
[junit4:junit4]   2> 10638 T511 oasc.SolrCore.registerSearcher [collection1] Registered new searcher Searcher@143bc8f8 main{StandardDirectoryReader(segments_1:1)}
[junit4:junit4]   2> 10645 T510 oasc.ZkController.publish publishing core=collection1 state=down
[junit4:junit4]   2> 10645 T510 oasc.ZkController.publish numShards not found on descriptor - reading it from system property
[junit4:junit4]   2> 12114 T476 oascc.ZkStateReader.updateClusterState Updating cloud state from ZooKeeper... 
[junit4:junit4]   2> 12115 T476 oasc.Overseer$ClusterStateUpdater.updateState Update state numShards=1 message={
[junit4:junit4]   2> 	  "operation":"state",
[junit4:junit4]   2> 	  "numShards":"1",
[junit4:junit4]   2> 	  "shard":null,
[junit4:junit4]   2> 	  "roles":null,
[junit4:junit4]   2> 	  "state":"down",
[junit4:junit4]   2> 	  "core":"collection1",
[junit4:junit4]   2> 	  "collection":"collection1",
[junit4:junit4]   2> 	  "node_name":"127.0.0.1:60791_",
[junit4:junit4]   2> 	  "base_url":"http://127.0.0.1:60791"}
[junit4:junit4]   2> 12115 T476 oasc.Overseer$ClusterStateUpdater.updateState Collection already exists with numShards=1
[junit4:junit4]   2> 12115 T476 oasc.Overseer$ClusterStateUpdater.updateState Assigning new node to shard shard=shard1
[junit4:junit4]   2> 12137 T475 oascc.ZkStateReader$2.process A cluster state change: WatchedEvent state:SyncConnected type:NodeDataChanged path:/clusterstate.json, has occurred - updating... (live nodes size: 3)
[junit4:junit4]   2> 12137 T509 oascc.ZkStateReader$2.process A cluster state change: WatchedEvent state:SyncConnected type:NodeDataChanged path:/clusterstate.json, has occurred - updating... (live nodes size: 3)
[junit4:junit4]   2> 12137 T481 oascc.ZkStateReader$2.process A cluster state change: WatchedEvent state:SyncConnected type:NodeDataChanged path:/clusterstate.json, has occurred - updating... (live nodes size: 3)
[junit4:junit4]   2> 12137 T494 oascc.ZkStateReader$2.process A cluster state change: WatchedEvent state:SyncConnected type:NodeDataChanged path:/clusterstate.json, has occurred - updating... (live nodes size: 3)
[junit4:junit4]   2> 12649 T510 oasc.CoreContainer.registerCore registering core: collection1
[junit4:junit4]   2> 12649 T510 oasc.ZkController.register Register replica - core:collection1 address:http://127.0.0.1:60791 collection:collection1 shard:shard1
[junit4:junit4]   2> 12657 T510 oasc.ZkController.register We are http://127.0.0.1:60791/collection1/ and leader is http://127.0.0.1:60779/collection1/
[junit4:junit4]   2> 12657 T510 oasc.ZkController.register No LogReplay needed for core=collection1 baseURL=http://127.0.0.1:60791
[junit4:junit4]   2> 12657 T510 oasc.ZkController.checkRecovery Core needs to recover:collection1
[junit4:junit4]   2> 12658 T510 oasu.DefaultSolrCoreState.doRecovery Running recovery - first canceling any ongoing recovery
[junit4:junit4]   2> ASYNC  NEW_CORE C37 name=collection1 org.apache.solr.core.SolrCore@21b535ed url=http://127.0.0.1:60791/collection1 node=127.0.0.1:60791_ C37_STATE=coll:collection1 core:collection1 props:{shard=null, roles=null, state=down, core=collection1, collection=collection1, node_name=127.0.0.1:60791_, base_url=http://127.0.0.1:60791}
[junit4:junit4]   2> 12665 T512 C37 P60791 oasc.RecoveryStrategy.run Starting recovery process.  core=collection1 recoveringAfterStartup=true
[junit4:junit4]   2> 12666 T512 C37 P60791 oasc.RecoveryStrategy.doRecovery ###### startupVersions=[]
[junit4:junit4]   2> 12666 T510 oascc.ZkStateReader.updateClusterState Updating cloud state from ZooKeeper... 
[junit4:junit4]   2> 12666 T512 C37 P60791 oasc.ZkController.publish publishing core=collection1 state=recovering
[junit4:junit4]   2> 12666 T512 C37 P60791 oasc.ZkController.publish numShards not found on descriptor - reading it from system property
[junit4:junit4]   2> 12667 T453 oass.SolrDispatchFilter.init user.dir=/usr/home/hudson/hudson-slave/workspace/Lucene-Solr-Tests-4.x-java7/solr/build/solr-core/test/J0
[junit4:junit4]   2> 12668 T453 oass.SolrDispatchFilter.init SolrDispatchFilter.init() done
[junit4:junit4]   2> 12668 T453 oascsi.HttpClientUtil.createClient Creating new http client, config:maxConnections=128&maxConnectionsPerHost=32&followRedirects=false
[junit4:junit4]   2> 12668 T512 C37 P60791 oascsi.HttpClientUtil.createClient Creating new http client, config:maxConnections=128&maxConnectionsPerHost=32&followRedirects=false
[junit4:junit4]   2> 12865 T453 oejs.Server.doStart jetty-8.1.8.v20121106
[junit4:junit4]   2> 12868 T453 oejs.AbstractConnector.doStart Started SocketConnector@127.0.0.1:60801
[junit4:junit4]   2> 12868 T453 oass.SolrDispatchFilter.init SolrDispatchFilter.init()
[junit4:junit4]   2> 12869 T453 oasc.SolrResourceLoader.locateSolrHome JNDI not configured for solr (NoInitialContextEx)
[junit4:junit4]   2> 12869 T453 oasc.SolrResourceLoader.locateSolrHome using system property solr.solr.home: /usr/home/hudson/hudson-slave/workspace/Lucene-Solr-Tests-4.x-java7/solr/build/solr-core/test/J0/./org.apache.solr.cloud.SyncSliceTest-jetty3-1360558838440
[junit4:junit4]   2> 12870 T453 oasc.CoreContainer$Initializer.initialize looking for solr.xml: /usr/home/hudson/hudson-slave/workspace/Lucene-Solr-Tests-4.x-java7/solr/build/solr-core/test/J0/./org.apache.solr.cloud.SyncSliceTest-jetty3-1360558838440/solr.xml
[junit4:junit4]   2> 12870 T453 oasc.CoreContainer.<init> New CoreContainer 947338253
[junit4:junit4]   2> 12871 T453 oasc.CoreContainer.load Loading CoreContainer using Solr Home: '/usr/home/hudson/hudson-slave/workspace/Lucene-Solr-Tests-4.x-java7/solr/build/solr-core/test/J0/./org.apache.solr.cloud.SyncSliceTest-jetty3-1360558838440/'
[junit4:junit4]   2> 12871 T453 oasc.SolrResourceLoader.<init> new SolrResourceLoader for directory: '/usr/home/hudson/hudson-slave/workspace/Lucene-Solr-Tests-4.x-java7/solr/build/solr-core/test/J0/./org.apache.solr.cloud.SyncSliceTest-jetty3-1360558838440/'
[junit4:junit4]   2> 12932 T453 oashc.HttpShardHandlerFactory.getParameter Setting socketTimeout to: 60000
[junit4:junit4]   2> 12932 T453 oashc.HttpShardHandlerFactory.getParameter Setting urlScheme to: http://
[junit4:junit4]   2> 12933 T453 oashc.HttpShardHandlerFactory.getParameter Setting connTimeout to: 15000
[junit4:junit4]   2> 12933 T453 oashc.HttpShardHandlerFactory.getParameter Setting maxConnectionsPerHost to: 20
[junit4:junit4]   2> 12934 T453 oashc.HttpShardHandlerFactory.getParameter Setting corePoolSize to: 0
[junit4:junit4]   2> 12934 T453 oashc.HttpShardHandlerFactory.getParameter Setting maximumPoolSize to: 2147483647
[junit4:junit4]   2> 12934 T453 oashc.HttpShardHandlerFactory.getParameter Setting maxThreadIdleTime to: 5
[junit4:junit4]   2> 12935 T453 oashc.HttpShardHandlerFactory.getParameter Setting sizeOfQueue to: -1
[junit4:junit4]   2> 12935 T453 oashc.HttpShardHandlerFactory.getParameter Setting fairnessPolicy to: false
[junit4:junit4]   2> 12936 T453 oascsi.HttpClientUtil.createClient Creating new http client, config:maxConnectionsPerHost=20&maxConnections=10000&socketTimeout=60000&connTimeout=15000&retry=false
[junit4:junit4]   2> 12957 T453 oasc.CoreContainer.load Registering Log Listener
[junit4:junit4]   2> 12977 T453 oasc.CoreContainer.initZooKeeper Zookeeper client=127.0.0.1:60763/solr
[junit4:junit4]   2> 12978 T453 oasc.ZkController.checkChrootPath zkHost includes chroot
[junit4:junit4]   2> 12978 T453 oaz.ZooKeeper.<init> Initiating client connection, connectString=127.0.0.1:60763 sessionTimeout=60000 watcher=org.apache.solr.common.cloud.ConnectionManager@2365914f
[junit4:junit4]   2> 12979 T453 oascc.ConnectionManager.waitForConnected Waiting for client to connect to ZooKeeper
[junit4:junit4]   2> 12980 T522 oaz.ClientCnxn$SendThread.logStartConnect Opening socket connection to server localhost/127.0.0.1:60763. Will not attempt to authenticate using SASL (access denied ("javax.security.auth.AuthPermission" "getLoginConfiguration"))
[junit4:junit4]   2> 12981 T522 oaz.ClientCnxn$SendThread.primeConnection Socket connection established to localhost/127.0.0.1:60763, initiating session
[junit4:junit4]   2> 12981 T455 oazs.NIOServerCnxnFactory.run Accepted socket connection from /140.211.11.196:60802
[junit4:junit4]   2> 12982 T455 oazs.ZooKeeperServer.processConnectRequest Client attempting to establish new session at /140.211.11.196:60802
[junit4:junit4]   2> 12984 T457 oazs.ZooKeeperServer.finishSessionInit Established session 0x13cc7a0224d0009 with negotiated timeout 20000 for client /140.211.11.196:60802
[junit4:junit4]   2> 12984 T522 oaz.ClientCnxn$SendThread.onConnected Session establishment complete on server localhost/127.0.0.1:60763, sessionid = 0x13cc7a0224d0009, negotiated timeout = 20000
[junit4:junit4]   2> 12985 T523 oascc.ConnectionManager.process Watcher org.apache.solr.common.cloud.ConnectionManager@2365914f name:ZooKeeperConnection Watcher:127.0.0.1:60763 got event WatchedEvent state:SyncConnected type:None path:null path:null type:None
[junit4:junit4]   2> 12985 T453 oascc.ConnectionManager.waitForConnected Client is connected to ZooKeeper
[junit4:junit4]   2> 12987 T459 oazs.PrepRequestProcessor.pRequest2Txn Processed session termination for sessionid: 0x13cc7a0224d0009
[junit4:junit4]   2> 12999 T523 oaz.ClientCnxn$EventThread.run EventThread shut down
[junit4:junit4]   2> 12999 T455 oazs.NIOServerCnxn.closeSock Closed socket connection for client /140.211.11.196:60802 which had sessionid 0x13cc7a0224d0009
[junit4:junit4]   2> 12999 T453 oaz.ZooKeeper.close Session: 0x13cc7a0224d0009 closed
[junit4:junit4]   2> 13000 T453 oascsi.HttpClientUtil.createClient Creating new http client, config:maxConnections=500&maxConnectionsPerHost=16&socketTimeout=60000&connTimeout=15000
[junit4:junit4]   2> 13011 T453 oaz.ZooKeeper.<init> Initiating client connection, connectString=127.0.0.1:60763/solr sessionTimeout=30000 watcher=org.apache.solr.common.cloud.ConnectionManager@4dd44f78
[junit4:junit4]   2> 13012 T453 oascc.ConnectionManager.waitForConnected Waiting for client to connect to ZooKeeper
[junit4:junit4]   2> 13013 T524 oaz.ClientCnxn$SendThread.logStartConnect Opening socket connection to server localhost/127.0.0.1:60763. Will not attempt to authenticate using SASL (access denied ("javax.security.auth.AuthPermission" "getLoginConfiguration"))
[junit4:junit4]   2> 13013 T524 oaz.ClientCnxn$SendThread.primeConnection Socket connection established to localhost/127.0.0.1:60763, initiating session
[junit4:junit4]   2> 13013 T455 oazs.NIOServerCnxnFactory.run Accepted socket connection from /140.211.11.196:60803
[junit4:junit4]   2> 13014 T455 oazs.ZooKeeperServer.processConnectRequest Client attempting to establish new session at /140.211.11.196:60803
[junit4:junit4]   2> 13015 T457 oazs.ZooKeeperServer.finishSessionInit Established session 0x13cc7a0224d000a with negotiated timeout 20000 for client /140.211.11.196:60803
[junit4:junit4]   2> 13015 T524 oaz.ClientCnxn$SendThread.onConnected Session establishment complete on server localhost/127.0.0.1:60763, sessionid = 0x13cc7a0224d000a, negotiated timeout = 20000
[junit4:junit4]   2> 13016 T525 oascc.ConnectionManager.process Watcher org.apache.solr.common.cloud.ConnectionManager@4dd44f78 name:ZooKeeperConnection Watcher:127.0.0.1:60763/solr got event WatchedEvent state:SyncConnected type:None path:null path:null type:None
[junit4:junit4]   2> 13016 T453 oascc.ConnectionManager.waitForConnected Client is connected to ZooKeeper
[junit4:junit4]   2> 13017 T459 oazs.PrepRequestProcessor.pRequest Got user-level KeeperException when processing sessionid:0x13cc7a0224d000a type:create cxid:0x1 zxid:0x80 txntype:-1 reqpath:n/a Error Path:/solr/overseer Error:KeeperErrorCode = NodeExists for /solr/overseer
[junit4:junit4]   2> 13019 T459 oazs.PrepRequestProcessor.pRequest Got user-level KeeperException when processing sessionid:0x13cc7a0224d000a type:create cxid:0x2 zxid:0x81 txntype:-1 reqpath:n/a Error Path:/solr/overseer Error:KeeperErrorCode = NodeExists for /solr/overseer
[junit4:junit4]   2> 13028 T453 oascc.ZkStateReader.createClusterStateWatchersAndUpdate Updating cluster state from ZooKeeper... 
[junit4:junit4]   2> 13031 T453 oasc.ZkController.createEphemeralLiveNode Register node as live in ZooKeeper:/live_nodes/127.0.0.1:60801_
[junit4:junit4]   2> 13032 T459 oazs.PrepRequestProcessor.pRequest Got user-level KeeperException when processing sessionid:0x13cc7a0224d000a type:delete cxid:0x9 zxid:0x82 txntype:-1 reqpath:n/a Error Path:/solr/live_nodes/127.0.0.1:60801_ Error:KeeperErrorCode = NoNode for /solr/live_nodes/127.0.0.1:60801_
[junit4:junit4]   2> 13033 T453 oascc.SolrZkClient.makePath makePath: /live_nodes/127.0.0.1:60801_
[junit4:junit4]   2> 13036 T494 oascc.ZkStateReader$2.process A cluster state change: WatchedEvent state:SyncConnected type:NodeChildrenChanged path:/live_nodes, has occurred - updating... (live nodes size: 3)
[junit4:junit4]   2> 13037 T475 oascc.ZkStateReader$3.process Updating live nodes... (4)
[junit4:junit4]   2> 13037 T481 oascc.ZkStateReader$3.process Updating live nodes... (4)
[junit4:junit4]   2> 13037 T475 oascc.ZkStateReader$2.process A cluster state change: WatchedEvent state:SyncConnected type:NodeChildrenChanged path:/live_nodes, has occurred - updating... (live nodes size: 4)
[junit4:junit4]   2> 13037 T509 oascc.ZkStateReader$3.process Updating live nodes... (4)
[junit4:junit4]   2> 13038 T509 oascc.ZkStateReader$2.process A cluster state change: WatchedEvent state:SyncConnected type:NodeChildrenChanged path:/live_nodes, has occurred - updating... (live nodes size: 4)
[junit4:junit4]   2> 13038 T525 oascc.ZkStateReader$3.process Updating live nodes... (4)
[junit4:junit4]   2> 13038 T481 oascc.ZkStateReader$2.process A cluster state change: WatchedEvent state:SyncConnected type:NodeChildrenChanged path:/live_nodes, has occurred - updating... (live nodes size: 4)
[junit4:junit4]   2> 13039 T494 oascc.ZkStateReader$3.process Updating live nodes... (4)
[junit4:junit4]   2> 13048 T526 oasc.CoreContainer.create Creating SolrCore 'collection1' using instanceDir: /usr/home/hudson/hudson-slave/workspace/Lucene-Solr-Tests-4.x-java7/solr/build/solr-core/test/J0/./org.apache.solr.cloud.SyncSliceTest-jetty3-1360558838440/collection1
[junit4:junit4]   2> 13048 T526 oasc.ZkController.createCollectionZkNode Check for collection zkNode:collection1
[junit4:junit4]   2> 13049 T526 oasc.ZkController.createCollectionZkNode Collection zkNode exists
[junit4:junit4]   2> 13050 T526 oasc.ZkController.readConfigName Load collection config from:/collections/collection1
[junit4:junit4]   2> 13051 T526 oasc.SolrResourceLoader.<init> new SolrResourceLoader for directory: '/usr/home/hudson/hudson-slave/workspace/Lucene-Solr-Tests-4.x-java7/solr/build/solr-core/test/J0/./org.apache.solr.cloud.SyncSliceTest-jetty3-1360558838440/collection1/'
[junit4:junit4]   2> 13053 T526 oasc.SolrResourceLoader.replaceClassLoader Adding 'file:/usr/home/hudson/hudson-slave/workspace/Lucene-Solr-Tests-4.x-java7/solr/build/solr-core/test/J0/org.apache.solr.cloud.SyncSliceTest-jetty3-1360558838440/collection1/lib/classes/' to classloader
[junit4:junit4]   2> 13053 T526 oasc.SolrResourceLoader.replaceClassLoader Adding 'file:/usr/home/hudson/hudson-slave/workspace/Lucene-Solr-Tests-4.x-java7/solr/build/solr-core/test/J0/org.apache.solr.cloud.SyncSliceTest-jetty3-1360558838440/collection1/lib/README' to classloader
[junit4:junit4]   2> 13123 T526 oasc.SolrConfig.<init> Using Lucene MatchVersion: LUCENE_42
[junit4:junit4]   2> 13198 T526 oasc.SolrConfig.<init> Loaded SolrConfig: solrconfig.xml
[junit4:junit4]   2> 13299 T526 oass.IndexSchema.readSchema Reading Solr Schema
[junit4:junit4]   2> 13307 T526 oass.IndexSchema.readSchema Schema name=test
[junit4:junit4]   2> 13645 T476 oascc.ZkStateReader.updateClusterState Updating cloud state from ZooKeeper... 
[junit4:junit4]   2> 13646 T476 oasc.Overseer$ClusterStateUpdater.updateState Update state numShards=1 message={
[junit4:junit4]   2> 	  "operation":"state",
[junit4:junit4]   2> 	  "numShards":"1",
[junit4:junit4]   2> 	  "shard":"shard1",
[junit4:junit4]   2> 	  "roles":null,
[junit4:junit4]   2> 	  "state":"recovering",
[junit4:junit4]   2> 	  "core":"collection1",
[junit4:junit4]   2> 	  "collection":"collection1",
[junit4:junit4]   2> 	  "node_name":"127.0.0.1:60791_",
[junit4:junit4]   2> 	  "base_url":"http://127.0.0.1:60791"}
[junit4:junit4]   2> 13680 T475 oascc.ZkStateReader$2.process A cluster state change: WatchedEvent state:SyncConnected type:NodeDataChanged path:/clusterstate.json, has occurred - updating... (live nodes size: 4)
[junit4:junit4]   2> 13681 T525 oascc.ZkStateReader$2.process A cluster state change: WatchedEvent state:SyncConnected type:NodeDataChanged path:/clusterstate.json, has occurred - updating... (live nodes size: 4)
[junit4:junit4]   2> 13681 T509 oascc.ZkStateReader$2.process A cluster state change: WatchedEvent state:SyncConnected type:NodeDataChanged path:/clusterstate.json, has occurred - updating... (live nodes size: 4)
[junit4:junit4]   2> 13680 T481 oascc.ZkStateReader$2.process A cluster state change: WatchedEvent state:SyncConnected type:NodeDataChanged path:/clusterstate.json, has occurred - updating... (live nodes size: 4)
[junit4:junit4]   2> 13680 T494 oascc.ZkStateReader$2.process A cluster state change: WatchedEvent state:SyncConnected type:NodeDataChanged path:/clusterstate.json, has occurred - updating... (live nodes size: 4)
[junit4:junit4]   2> 13994 T526 oass.OpenExchangeRatesOrgProvider.init Initialized with rates=open-exchange-rates.json, refreshInterval=1440.
[junit4:junit4]   2> 14005 T526 oass.IndexSchema.readSchema default search field in schema is text
[junit4:junit4]   2> 14009 T526 oass.IndexSchema.readSchema unique key field: id
[junit4:junit4]   2> 14031 T526 oass.FileExchangeRateProvider.reload Reloading exchange rates from file currency.xml
[junit4:junit4]   2> 14037 T526 oass.FileExchangeRateProvider.reload Reloading exchange rates from file currency.xml
[junit4:junit4]   2> 14043 T526 oass.OpenExchangeRatesOrgProvider.reload Reloading exchange rates from open-exchange-rates.json
[junit4:junit4]   2> 14044 T526 oass.OpenExchangeRatesOrgProvider.reload Reloading exchange rates from open-exchange-rates.json
[junit4:junit4]   2> 14046 T526 oasc.SolrCore.<init> [collection1] Opening new SolrCore at /usr/home/hudson/hudson-slave/workspace/Lucene-Solr-Tests-4.x-java7/solr/build/solr-core/test/J0/./org.apache.solr.cloud.SyncSliceTest-jetty3-1360558838440/collection1/, dataDir=./org.apache.solr.cloud.SyncSliceTest-1360558825755/jetty3/
[junit4:junit4]   2> 14047 T526 oasc.JmxMonitoredMap.<init> JMX monitoring is enabled. Adding Solr mbeans to JMX Server: com.sun.jmx.mbeanserver.JmxMBeanServer@283a30f3
[junit4:junit4]   2> 14047 T526 oasc.SolrCore.initDirectoryFactory solr.NRTCachingDirectoryFactory
[junit4:junit4]   2> 14048 T526 oasc.CachingDirectoryFactory.get return new directory for /usr/home/hudson/hudson-slave/workspace/Lucene-Solr-Tests-4.x-java7/solr/build/solr-core/test/J0/./org.apache.solr.cloud.SyncSliceTest-1360558825755/jetty3 forceNew:false
[junit4:junit4]   2> 14049 T526 oasc.CachingDirectoryFactory.close Releasing directory:/usr/home/hudson/hudson-slave/workspace/Lucene-Solr-Tests-4.x-java7/solr/build/solr-core/test/J0/./org.apache.solr.cloud.SyncSliceTest-1360558825755/jetty3
[junit4:junit4]   2> 14049 T526 oasc.SolrCore.getNewIndexDir New index directory detected: old=null new=./org.apache.solr.cloud.SyncSliceTest-1360558825755/jetty3/index/
[junit4:junit4]   2> 14050 T526 oasc.SolrCore.initIndex WARNING [collection1] Solr index directory './org.apache.solr.cloud.SyncSliceTest-1360558825755/jetty3/index' doesn't exist. Creating new index...
[junit4:junit4]   2> 14051 T526 oasc.CachingDirectoryFactory.get return new directory for /usr/home/hudson/hudson-slave/workspace/Lucene-Solr-Tests-4.x-java7/solr/build/solr-core/test/J0/./org.apache.solr.cloud.SyncSliceTest-1360558825755/jetty3/index forceNew:false
[junit4:junit4]   2> 14058 T526 oasc.SolrDeletionPolicy.onCommit SolrDeletionPolicy.onCommit: commits:num=1
[junit4:junit4]   2> 		commit{dir=RateLimitedDirectoryWrapper(NRTCachingDirectory(org.apache.lucene.store.NIOFSDirectory@/usr/home/hudson/hudson-slave/workspace/Lucene-Solr-Tests-4.x-java7/solr/build/solr-core/test/J0/org.apache.solr.cloud.SyncSliceTest-1360558825755/jetty3/index lockFactory=org.apache.lucene.store.NativeFSLockFactory@7548a5cd; maxCacheMB=48.0 maxMergeSizeMB=4.0)),segFN=segments_1,generation=1,filenames=[segments_1]
[junit4:junit4]   2> 14059 T526 oasc.SolrDeletionPolicy.updateCommits newest commit = 1[segments_1]
[junit4:junit4]   2> 14060 T526 oasc.CachingDirectoryFactory.close Releasing directory:/usr/home/hudson/hudson-slave/workspace/Lucene-Solr-Tests-4.x-java7/solr/build/solr-core/test/J0/./org.apache.solr.cloud.SyncSliceTest-1360558825755/jetty3/index
[junit4:junit4]   2> 14060 T526 oasc.SolrCore.initWriters created xml: solr.XMLResponseWriter
[junit4:junit4]   2> 14063 T526 oasup.UpdateRequestProcessorChain.init inserting DistributedUpdateProcessorFactory into updateRequestProcessorChain "dedupe"
[junit4:junit4]   2> 14063 T526 oasup.UpdateRequestProcessorChain.init inserting DistributedUpdateProcessorFactory into updateRequestProcessorChain "dedupe-allfields"
[junit4:junit4]   2> 14063 T526 oasup.UpdateRequestProcessorChain.init inserting DistributedUpdateProcessorFactory into updateRequestProcessorChain "stored_sig"
[junit4:junit4]   2> 14064 T526 oasup.UpdateRequestProcessorChain.init inserting DistributedUpdateProcessorFactory into updateRequestProcessorChain "uniq-fields"
[junit4:junit4]   2> 14064 T526 oasup.UpdateRequestProcessorChain.init inserting DistributedUpdateProcessorFactory into updateRequestProcessorChain "distrib-dup-test-chain-implicit"
[junit4:junit4]   2> 14065 T526 oasc.RequestHandlers.initHandlersFromConfig adding lazy requestHandler: solr.ReplicationHandler
[junit4:junit4]   2> 14065 T526 oasc.RequestHandlers.initHandlersFromConfig created /replication: solr.ReplicationHandler
[junit4:junit4]   2> 14066 T526 oasc.RequestHandlers.initHandlersFromConfig created standard: solr.StandardRequestHandler
[junit4:junit4]   2> 14066 T526 oasc.RequestHandlers.initHandlersFromConfig created /get: solr.RealTimeGetHandler
[junit4:junit4]   2> 14067 T526 oasc.RequestHandlers.initHandlersFromConfig created dismax: solr.SearchHandler
[junit4:junit4]   2> 14068 T526 oasc.RequestHandlers.initHandlersFromConfig created mock: org.apache.solr.core.MockQuerySenderListenerReqHandler
[junit4:junit4]   2> 14068 T526 oasc.RequestHandlers.initHandlersFromConfig created /admin/: org.apache.solr.handler.admin.AdminHandlers
[junit4:junit4]   2> 14069 T526 oasc.RequestHandlers.initHandlersFromConfig created defaults: solr.StandardRequestHandler
[junit4:junit4]   2> 14069 T526 oasc.RequestHandlers.initHandlersFromConfig adding lazy requestHandler: solr.StandardRequestHandler
[junit4:junit4]   2> 14070 T526 oasc.RequestHandlers.initHandlersFromConfig created lazy: solr.StandardRequestHandler
[junit4:junit4]   2> 14071 T526 oasc.RequestHandlers.initHandlersFromConfig created /update: solr.UpdateRequestHandler
[junit4:junit4]   2> 14071 T526 oasc.RequestHandlers.initHandlersFromConfig created /terms: org.apache.solr.handler.component.SearchHandler
[junit4:junit4]   2> 14072 T526 oasc.RequestHandlers.initHandlersFromConfig created spellCheckCompRH: org.apache.solr.handler.component.SearchHandler
[junit4:junit4]   2> 14073 T526 oasc.RequestHandlers.initHandlersFromConfig created spellCheckCompRH_Direct: org.apache.solr.handler.component.SearchHandler
[junit4:junit4]   2> 14073 T526 oasc.RequestHandlers.initHandlersFromConfig created spellCheckWithWordbreak: org.apache.solr.handler.component.SearchHandler
[junit4:junit4]   2> 14074 T526 oasc.RequestHandlers.initHandlersFromConfig created spellCheckWithWordbreak_Direct: org.apache.solr.handler.component.SearchHandler
[junit4:junit4]   2> 14075 T526 oasc.RequestHandlers.initHandlersFromConfig created spellCheckCompRH1: org.apache.solr.handler.component.SearchHandler
[junit4:junit4]   2> 14075 T526 oasc.RequestHandlers.initHandlersFromConfig created mltrh: org.apache.solr.handler.component.SearchHandler
[junit4:junit4]   2> 14076 T526 oasc.RequestHandlers.initHandlersFromConfig created tvrh: org.apache.solr.handler.component.SearchHandler
[junit4:junit4]   2> 14077 T526 oasc.RequestHandlers.initHandlersFromConfig created /mlt: solr.MoreLikeThisHandler
[junit4:junit4]   2> 14077 T526 oasc.RequestHandlers.initHandlersFromConfig created /debug/dump: solr.DumpRequestHandler
[junit4:junit4]   2> 14090 T526 oashl.XMLLoader.init xsltCacheLifetimeSeconds=60
[junit4:junit4]   2> 14095 T526 oasc.SolrCore.initDeprecatedSupport WARNING solrconfig.xml uses deprecated <admin/gettableFiles>, Please update your config to use the ShowFileRequestHandler.
[junit4:junit4]   2> 14096 T526 oasc.SolrCore.initDeprecatedSupport WARNING adding ShowFileRequestHandler with hidden files: [SCHEMA.XML, OLD_SYNONYMS.TXT, STOPWORDS.TXT, PROTWORDS.TXT, OPEN-EXCHANGE-RATES.JSON, SYNONYMS.TXT, CURRENCY.XML, MAPPING-ISOLATIN1ACCENT.TXT]
[junit4:junit4]   2> 14099 T526 oasc.CachingDirectoryFactory.close Releasing directory:/usr/home/hudson/hudson-slave/workspace/Lucene-Solr-Tests-4.x-java7/solr/build/solr-core/test/J0/./org.apache.solr.cloud.SyncSliceTest-1360558825755/jetty3
[junit4:junit4]   2> 14101 T526 oass.SolrIndexSearcher.<init> Opening Searcher@1173d053 main
[junit4:junit4]   2> 14102 T526 oasu.CommitTracker.<init> Hard AutoCommit: disabled
[junit4:junit4]   2> 14102 T526 oasu.CommitTracker.<init> Soft AutoCommit: disabled
[junit4:junit4]   2> 14103 T526 oashc.SpellCheckComponent.inform Initializing spell checkers
[junit4:junit4]   2> 14111 T526 oass.DirectSolrSpellChecker.init init: {name=direct,classname=DirectSolrSpellChecker,field=lowerfilt,minQueryLength=3}
[junit4:junit4]   2> 14176 T527 oasc.SolrCore.registerSearcher [collection1] Registered new searcher Searcher@1173d053 main{StandardDirectoryReader(segments_1:1)}
[junit4:junit4]   2> 14184 T526 oasc.ZkController.publish publishing core=collection1 state=down
[junit4:junit4]   2> 14184 T526 oasc.ZkController.publish numShards not found on descriptor - reading it from system property
[junit4:junit4]   2> 15189 T476 oascc.ZkStateReader.updateClusterState Updating cloud state from ZooKeeper... 
[junit4:junit4]   2> 15190 T476 oasc.Overseer$ClusterStateUpdater.updateState Update state numShards=1 message={
[junit4:junit4]   2> 	  "operation":"state",
[junit4:junit4]   2> 	  "numShards":"1",
[junit4:junit4]   2> 	  "shard":null,
[junit4:junit4]   2> 	  "roles":null,
[junit4:junit4]   2> 	  "state":"down",
[junit4:junit4]   2> 	  "core":"collection1",
[junit4:junit4]   2> 	  "collection":"collection1",
[junit4:junit4]   2> 	  "node_name":"127.0.0.1:60801_",
[junit4:junit4]   2> 	  "base_url":"http://127.0.0.1:60801"}
[junit4:junit4]   2> 15190 T476 oasc.Overseer$ClusterStateUpdater.updateState Collection already exists with numShards=1
[junit4:junit4]   2> 15190 T476 oasc.Overseer$ClusterStateUpdater.updateState Assigning new node to shard shard=shard1
[junit4:junit4]   2> 15206 T475 oascc.ZkStateReader$2.process A cluster state change: WatchedEvent state:SyncConnected type:NodeDataChanged path:/clusterstate.json, has occurred - updating... (live nodes size: 4)
[junit4:junit4]   2> 15207 T494 oascc.ZkStateReader$2.process A cluster state change: WatchedEvent state:SyncConnected type:NodeDataChanged path:/clusterstate.json, has occurred - updating... (live nodes size: 4)
[junit4:junit4]   2> 15207 T509 oascc.ZkStateReader$2.process A cluster state change: WatchedEvent state:SyncConnected type:NodeDataChanged path:/clusterstate.json, has occurred - updating... (live nodes size: 4)
[junit4:junit4]   2> 15207 T525 oascc.ZkStateReader$2.process A cluster state change: WatchedEvent state:SyncConnected type:NodeDataChanged path:/clusterstate.json, has occurred - updating... (live nodes size: 4)
[junit4:junit4]   2> 15207 T481 oascc.ZkStateReader$2.process A cluster state change: WatchedEvent state:SyncConnected type:NodeDataChanged path:/clusterstate.json, has occurred - updating... (live nodes size: 4)
[junit4:junit4]   2>  C37_STATE=coll:collection1 core:collection1 props:{shard=shard1, roles=null, state=recovering, core=collection1, collection=collection1, node_name=127.0.0.1:60791_, base_url=http://127.0.0.1:60791}
[junit4:junit4]   2> 15703 T512 C37 P60791 oasc.RecoveryStrategy.doRecovery Attempting to PeerSync from http://127.0.0.1:60779/collection1/ core=collection1 - recoveringAfterStartup=true
[junit4:junit4]   2> 15713 T512 C37 P60791 oascsi.HttpClientUtil.createClient Creating new http client, config:maxConnectionsPerHost=20&maxConnections=10000&connTimeout=30000&socketTimeout=30000&retry=false
[junit4:junit4]   2> 15735 T512 C37 P60791 oasu.PeerSync.sync PeerSync: core=collection1 url=http://127.0.0.1:60791 START replicas=[http://127.0.0.1:60779/collection1/] nUpdates=100
[junit4:junit4]   2> 15736 T512 C37 P60791 oasu.PeerSync.sync WARNING no frame of reference to tell of we've missed updates
[junit4:junit4]   2> 15737 T512 C37 P60791 oasc.RecoveryStrategy.doRecovery PeerSync Recovery was not successful - trying replication. core=collection1
[junit4:junit4]   2> 15737 T512 C37 P60791 oasc.RecoveryStrategy.doRecovery Starting Replication Recovery. core=collection1
[junit4:junit4]   2> 15737 T512 C37 P60791 oasc.RecoveryStrategy.doRecovery Begin buffering updates. core=collection1
[junit4:junit4]   2> 15738 T512 C37 P60791 oasu.UpdateLog.bufferUpdates Starting to buffer updates. FSUpdateLog{state=ACTIVE, tlog=null}
[junit4:junit4]   2> 15738 T512 C37 P60791 oasc.RecoveryStrategy.replicate Attempting to replicate from http://127.0.0.1:60779/collection1/. core=collection1
[junit4:junit4]   2> 15738 T512 C37 P60791 oascsi.HttpClientUtil.createClient Creating new http client, config:maxConnections=128&maxConnectionsPerHost=32&followRedirects=false
[junit4:junit4]   2> ASYNC  NEW_CORE C38 name=collection1 org.apache.solr.core.SolrCore@2d25fe5e url=http://127.0.0.1:60779/collection1 node=127.0.0.1:60779_ C38_STATE=coll:collection1 core:collection1 props:{shard=shard1, roles=null, state=active, core=collection1, collection=collection1, node_name=127.0.0.1:60779_, base_url=http://127.0.0.1:60779, leader=true}
[junit4:junit4]   2> 15748 T485 C38 P60779 REQ /get {getVersions=100&distrib=false&wt=javabin&qt=/get&version=2} status=0 QTime=0 
[junit4:junit4]   2> 15751 T486 C38 P60779 oasu.DirectUpdateHandler2.commit start commit{,optimize=false,openSearcher=false,waitSearcher=true,expungeDeletes=false,softCommit=false}
[junit4:junit4]   2> 15752 T486 C38 P60779 oasc.CachingDirectoryFactory.close Releasing directory:/usr/home/hudson/hudson-slave/workspace/Lucene-Solr-Tests-4.x-java7/solr/build/solr-core/test/J0/./org.apache.solr.cloud.SyncSliceTest-1360558825755/jetty1
[junit4:junit4]   2> 15757 T486 C38 P60779 oasc.SolrDeletionPolicy.onInit SolrDeletionPolicy.onInit: commits:num=1
[junit4:junit4]   2> 		commit{dir=RateLimitedDirectoryWrapper(NRTCachingDirectory(org.apache.lucene.store.NIOFSDirectory@/usr/home/hudson/hudson-slave/workspace/Lucene-Solr-Tests-4.x-java7/solr/build/solr-core/test/J0/org.apache.solr.cloud.SyncSliceTest-1360558825755/jetty1/index lockFactory=org.apache.lucene.store.NativeFSLockFactory@5e5fffaa; maxCacheMB=48.0 maxMergeSizeMB=4.0)),segFN=segments_1,generation=1,filenames=[segments_1]
[junit4:junit4]   2> 15757 T486 C38 P60779 oasc.SolrDeletionPolicy.updateCommits newest commit = 1[segments_1]
[junit4:junit4]   2> 15761 T486 C38 P60779 oasc.SolrDeletionPolicy.onCommit SolrDeletionPolicy.onCommit: commits:num=2
[junit4:junit4]   2> 		commit{dir=RateLimitedDirectoryWrapper(NRTCachingDirectory(org.apache.lucene.store.NIOFSDirectory@/usr/home/hudson/hudson-slave/workspace/Lucene-Solr-Tests-4.x-java7/solr/build/solr-core/test/J0/org.apache.solr.cloud.SyncSliceTest-1360558825755/jetty1/index lockFactory=org.apache.lucene.store.NativeFSLockFactory@5e5fffaa; maxCacheMB=48.0 maxMergeSizeMB=4.0)),segFN=segments_1,generation=1,filenames=[segments_1]
[junit4:junit4]   2> 		commit{dir=RateLimitedDirectoryWrapper(NRTCachingDirectory(org.apache.lucene.store.NIOFSDirectory@/usr/home/hudson/hudson-slave/workspace/Lucene-Solr-Tests-4.x-java7/solr/build/solr-core/test/J0/org.apache.solr.cloud.SyncSliceTest-1360558825755/jetty1/index lockFactory=org.apache.lucene.store.NativeFSLockFactory@5e5fffaa; maxCacheMB=48.0 maxMergeSizeMB=4.0)),segFN=segments_2,generation=2,filenames=[segments_2]
[junit4:junit4]   2> 15762 T486 C38 P60779 oasc.SolrDeletionPolicy.updateCommits newest commit = 2[segments_2]
[junit4:junit4]   2> 15763 T486 C38 P60779 oasc.CachingDirectoryFactory.close Releasing directory:/usr/home/hudson/hudson-slave/workspace/Lucene-Solr-Tests-4.x-java7/solr/build/solr-core/test/J0/./org.apache.solr.cloud.SyncSliceTest-1360558825755/jetty1
[junit4:junit4]   2> 15763 T486 C38 P60779 oass.SolrIndexSearcher.<init> Opening Searcher@745498bb realtime
[junit4:junit4]   2> 15764 T486 C38 P60779 oasu.DirectUpdateHandler2.commit end_commit_flush
[junit4:junit4]   2> 15764 T486 C38 P60779 /update {waitSearcher=true&openSearcher=false&commit=true&wt=javabin&commit_end_point=true&version=2&softCommit=false} {commit=} 0 13
[junit4:junit4]   2> 15824 T512 C37 P60791 oash.ReplicationHandler.inform Commits will be reserved for  10000
[junit4:junit4]   2> 15824 T512 C37 P60791 oascsi.HttpClientUtil.createClient Creating new http client, config:connTimeout=5000&socketTimeout=20000&allowCompression=false&maxConnections=10000&maxConnectionsPerHost=10000
[junit4:junit4]   2> 15850 T512 C37 P60791 oash.SnapPuller.<init>  No value set for 'pollInterval'. Timer Task not started.
[junit4:junit4]   2> 15852 T487 C38 P60779 oash.ReplicationHandler.inform Commits will be reserved for  10000
[junit4:junit4]   2> 15853 T487 C38 P60779 REQ /replication {command=indexversion&qt=/replication&wt=javabin&version=2} status=0 QTime=2 
[junit4:junit4]   2> 15854 T512 C37 P60791 oash.SnapPuller.fetchLatestIndex Master's generation: 2
[junit4:junit4]   2> 15854 T512 C37 P60791 oash.SnapPuller.fetchLatestIndex Slave's generation: 1
[junit4:junit4]   2> 15854 T512 C37 P60791 oash.SnapPuller.fetchLatestIndex Starting replication process
[junit4:junit4]   2> 15857 T487 C38 P60779 oasc.CachingDirectoryFactory.close Releasing directory:/usr/home/hudson/hudson-slave/workspace/Lucene-Solr-Tests-4.x-java7/solr/build/solr-core/test/J0/./org.apache.solr.cloud.SyncSliceTest-1360558825755/jetty1
[junit4:junit4]   2> 15858 T487 C38 P60779 oasc.CachingDirectoryFactory.close Releasing directory:/usr/home/hudson/hudson-slave/workspace/Lucene-Solr-Tests-4.x-java7/solr/build/solr-core/test/J0/./org.apache.solr.cloud.SyncSliceTest-1360558825755/jetty1/index
[junit4:junit4]   2> 15859 T487 C38 P60779 REQ /replication {command=filelist&qt=/replication&wt=javabin&generation=2&version=2} status=0 QTime=2 
[junit4:junit4]   2> 15860 T512 C37 P60791 oash.SnapPuller.fetchLatestIndex Number of files in latest index in master: 1
[junit4:junit4]   2> 15861 T512 C37 P60791 oasc.CachingDirectoryFactory.get return new directory for /usr/home/hudson/hudson-slave/workspace/Lucene-Solr-Tests-4.x-java7/solr/build/solr-core/test/J0/./org.apache.solr.cloud.SyncSliceTest-1360558825755/jetty2/index.20130211060041608 forceNew:false
[junit4:junit4]   2> 15861 T512 C37 P60791 oasc.CachingDirectoryFactory.close Releasing directory:/usr/home/hudson/hudson-slave/workspace/Lucene-Solr-Tests-4.x-java7/solr/build/solr-core/test/J0/./org.apache.solr.cloud.SyncSliceTest-1360558825755/jetty2
[junit4:junit4]   2> 15862 T512 C37 P60791 oash.SnapPuller.fetchLatestIndex Starting download to RateLimitedDirectoryWrapper(NRTCachingDirectory(org.apache.lucene.store.NIOFSDirectory@/usr/home/hudson/hudson-slave/workspace/Lucene-Solr-Tests-4.x-java7/solr/build/solr-core/test/J0/org.apache.solr.cloud.SyncSliceTest-1360558825755/jetty2/index.20130211060041608 lockFactory=org.apache.lucene.store.NativeFSLockFactory@54e60dbb; maxCacheMB=48.0 maxMergeSizeMB=4.0)) fullCopy=true
[junit4:junit4]   2> 15876 T487 C38 P60779 REQ /replication {file=segments_2&command=filecontent&checksum=true&wt=filestream&qt=/replication&generation=2} status=0 QTime=5 
[junit4:junit4]   2> 15889 T512 C37 P60791 oasc.CachingDirectoryFactory.close Releasing directory:/usr/home/hudson/hudson-slave/workspace/Lucene-Solr-Tests-4.x-java7/solr/build/solr-core/test/J0/./org.apache.solr.cloud.SyncSliceTest-1360558825755/jetty2/index
[junit4:junit4]   2> 15889 T512 C37 P60791 oash.SnapPuller.fetchLatestIndex Total time taken for download : 0 secs
[junit4:junit4]   2> 15890 T512 C37 P60791 oash.SnapPuller.modifyIndexProps New index installed. Updating index properties... index=index.20130211060041608
[junit4:junit4]   2> 15892 T512 C37 P60791 oasc.CachingDirectoryFactory.close Releasing directory:/usr/home/hudson/hudson-slave/workspace/Lucene-Solr-Tests-4.x-java7/solr/build/solr-core/test/J0/./org.apache.solr.cloud.SyncSliceTest-1360558825755/jetty2
[junit4:junit4]   2> 15893 T512 C37 P60791 oasc.CachingDirectoryFactory.close Releasing directory:/usr/home/hudson/hudson-slave/workspace/Lucene-Solr-Tests-4.x-java7/solr/build/solr-core/test/J0/./org.apache.solr.cloud.SyncSliceTest-1360558825755/jetty2
[junit4:junit4]   2> 15893 T512 C37 P60791 oasc.SolrCore.getNewIndexDir New index directory detected: old=./org.apache.solr.cloud.SyncSliceTest-1360558825755/jetty2/index/ new=./org.apache.solr.cloud.SyncSliceTest-1360558825755/jetty2/index.20130211060041608
[junit4:junit4]   2> 15896 T512 C37 P60791 oasc.SolrDeletionPolicy.onInit SolrDeletionPolicy.onInit: commits:num=1
[junit4:junit4]   2> 		commit{dir=RateLimitedDirectoryWrapper(NRTCachingDirectory(org.apache.lucene.store.NIOFSDirectory@/usr/home/hudson/hudson-slave/workspace/Lucene-Solr-Tests-4.x-java7/solr/build/solr-core/test/J0/org.apache.solr.cloud.SyncSliceTest-1360558825755/jetty2/index.20130211060041608 lockFactory=org.apache.lucene.store.NativeFSLockFactory@54e60dbb; maxCacheMB=48.0 maxMergeSizeMB=4.0)),segFN=segments_2,generation=2,filenames=[segments_2]
[junit4:junit4]   2> 15897 T512 C37 P60791 oasc.SolrDeletionPolicy.updateCommits newest commit = 2[segments_2]
[junit4:junit4]   2> 15899 T512 C37 P60791 oasc.CachingDirectoryFactory.close Releasing directory:/usr/home/hudson/hudson-slave/workspace/Lucene-Solr-Tests-4.x-java7/solr/build/solr-core/test/J0/./org.apache.solr.cloud.SyncSliceTest-1360558825755/jetty2
[junit4:junit4]   2> 15903 T512 C37 P60791 oasu.DefaultSolrCoreState.newIndexWriter Creating new IndexWriter...
[junit4:junit4]   2> 15904 T512 C37 P60791 oasu.DefaultSolrCoreState.newIndexWriter Waiting until IndexWriter is unused... core=collection1
[junit4:junit4]   2> 15904 T512 C37 P60791 oasu.DefaultSolrCoreState.newIndexWriter Rollback old IndexWriter... core=collection1
[junit4:junit4]   2> 15905 T512 C37 P60791 oasc.CachingDirectoryFactory.close Releasing directory:/usr/home/hudson/hudson-slave/workspace/Lucene-Solr-Tests-4.x-java7/solr/build/solr-core/test/J0/./org.apache.solr.cloud.SyncSliceTest-1360558825755/jetty2/index.20130211060041608
[junit4:junit4]   2> 15906 T512 C37 P60791 oasc.CachingDirectoryFactory.close Releasing directory:/usr/home/hudson/hudson-slave/workspace/Lucene-Solr-Tests-4.x-java7/solr/build/solr-core/test/J0/./org.apache.solr.cloud.SyncSliceTest-1360558825755/jetty2
[junit4:junit4]   2> 15909 T512 C37 P60791 oasc.SolrDeletionPolicy.onInit SolrDeletionPolicy.onInit: commits:num=1
[junit4:junit4]   2> 		commit{dir=RateLimitedDirectoryWrapper(NRTCachingDirectory(org.apache.lucene.store.NIOFSDirectory@/usr/home/hudson/hudson-slave/workspace/Lucene-Solr-Tests-4.x-java7/solr/build/solr-core/test/J0/org.apache.solr.cloud.SyncSliceTest-1360558825755/jetty2/index.20130211060041608 lockFactory=org.apache.lucene.store.NativeFSLockFactory@54e60dbb; maxCacheMB=48.0 maxMergeSizeMB=4.0)),segFN=segments_2,generation=2,filenames=[segments_2]
[junit4:junit4]   2> 15909 T512 C37 P60791 oasc.SolrDeletionPolicy.updateCommits newest commit = 2[segments_2]
[junit4:junit4]   2> 15910 T512 C37 P60791 oasu.DefaultSolrCoreState.newIndexWriter New IndexWriter is ready to be used.
[junit4:junit4]   2> 15910 T512 C37 P60791 oasc.CachingDirectoryFactory.close Releasing directory:/usr/home/hudson/hudson-slave/workspace/Lucene-Solr-Tests-4.x-java7/solr/build/solr-core/test/J0/./org.apache.solr.cloud.SyncSliceTest-1360558825755/jetty2
[junit4:junit4]   2> 15911 T512 C37 P60791 oass.SolrIndexSearcher.<init> Opening Searcher@40dafa2f main
[junit4:junit4]   2> 15913 T511 oasc.SolrCore.registerSearcher [collection1] Registered new searcher Searcher@40dafa2f main{StandardDirectoryReader(segments_2:1:nrt)}
[junit4:junit4]   2> 15913 T511 oasc.CachingDirectoryFactory.close Releasing directory:/usr/home/hudson/hudson-slave/workspace/Lucene-Solr-Tests-4.x-java7/solr/build/solr-core/test/J0/./org.apache.solr.cloud.SyncSliceTest-1360558825755/jetty2/index
[junit4:junit4]   2> 15913 T512 C37 P60791 oasu.DirectUpdateHandler2.commit start commit{,optimize=false,openSearcher=false,waitSearcher=false,expungeDeletes=false,softCommit=false}
[junit4:junit4]   2> 15917 T512 C37 P60791 oasc.SolrDeletionPolicy.onCommit SolrDeletionPolicy.onCommit: commits:num=2
[junit4:junit4]   2> 		commit{dir=RateLimitedDirectoryWrapper(NRTCachingDirectory(org.apache.lucene.store.NIOFSDirectory@/usr/home/hudson/hudson-slave/workspace/Lucene-Solr-Tests-4.x-java7/solr/build/solr-core/test/J0/org.apache.solr.cloud.SyncSliceTest-1360558825755/jetty2/index.20130211060041608 lockFactory=org.apache.lucene.store.NativeFSLockFactory@54e60dbb; maxCacheMB=48.0 maxMergeSizeMB=4.0)),segFN=segments_2,generation=2,filenames=[segments_2]
[junit4:junit4]   2> 		commit{dir=RateLimitedDirectoryWrapper(NRTCachingDirectory(org.apache.lucene.store.NIOFSDirectory@/usr/home/hudson/hudson-slave/workspace/Lucene-Solr-Tests-4.x-java7/solr/build/solr-core/test/J0/org.apache.solr.cloud.SyncSliceTest-1360558825755/jetty2/index.20130211060041608 lockFactory=org.apache.lucene.store.NativeFSLockFactory@54e60dbb; maxCacheMB=48.0 maxMergeSizeMB=4.0)),segFN=segments_3,generation=3,filenames=[segments_3]
[junit4:junit4]   2> 15917 T512 C37 P60791 oasc.SolrDeletionPolicy.updateCommits newest commit = 3[segments_3]
[junit4:junit4]   2> 15918 T512 C37 P60791 oasc.CachingDirectoryFactory.close Releasing directory:/usr/home/hudson/hudson-slave/workspace/Lucene-Solr-Tests-4.x-java7/solr/build/solr-core/test/J0/./org.apache.solr.cloud.SyncSliceTest-1360558825755/jetty2
[junit4:junit4]   2> 15918 T512 C37 P60791 oasu.DirectUpdateHandler2.commit end_commit_flush
[junit4:junit4]   2> 15919 T512 C37 P60791 oasc.CachingDirectoryFactory.close Releasing directory:/usr/home/hudson/hudson-slave/workspace/Lucene-Solr-Tests-4.x-java7/solr/build/solr-core/test/J0/./org.apache.solr.cloud.SyncSliceTest-1360558825755/jetty2/index.20130211060041608
[junit4:junit4]   2> 15919 T512 C37 P60791 oasc.CachingDirectoryFactory.close Releasing directory:/usr/home/hudson/hudson-slave/workspace/Lucene-Solr-Tests-4.x-java7/solr/build/solr-core/test/J0/./org.apache.solr.cloud.SyncSliceTest-1360558825755/jetty2/index
[junit4:junit4]   2> 15919 T512 C37 P60791 oasc.RecoveryStrategy.replay No replay needed. core=collection1
[junit4:junit4]   2> 15919 T512 C37 P60791 oasc.RecoveryStrategy.doRecovery Replication Recovery was successful - registering as Active. core=collection1
[junit4:junit4]   2> 15920 T512 C37 P60791 oasc.ZkController.publish publishing core=collection1 state=active
[junit4:junit4]   2> 15920 T512 C37 P60791 oasc.ZkController.publish numShards not found on descriptor - reading it from system property
[junit4:junit4]   2> 15926 T512 C37 P60791 oasc.RecoveryStrategy.doRecovery Finished recovery process. core=collection1
[junit4:junit4]   2> 16188 T526 oasc.CoreContainer.registerCore registering core: collection1
[junit4:junit4]   2> 16188 T526 oasc.ZkController.register Register replica - core:collection1 address:http://127.0.0.1:60801 collection:collection1 shard:shard1
[junit4:junit4]   2> 16193 T526 oasc.ZkController.register We are http://127.0.0.1:60801/collection1/ and leader is http://127.0.0.1:60779/collection1/
[junit4:junit4]   2> 16193 T526 oasc.ZkController.register No LogReplay needed for core=collection1 baseURL=http://127.0.0.1:60801
[junit4:junit4]   2> 16193 T526 oasc.ZkController.checkRecovery Core needs to recover:collection1
[junit4:junit4]   2> 16194 T526 oasu.DefaultSolrCoreState.doRecovery Running recovery - first canceling any ongoing recovery
[junit4:junit4]   2> ASYNC  NEW_CORE C39 name=collection1 org.apache.solr.core.SolrCore@2d59b35d url=http://127.0.0.1:60801/collection1 node=127.0.0.1:60801_ C39_STATE=coll:collection1 core:collection1 props:{shard=null, roles=null, state=down, core=collection1, collection=collection1, node_name=127.0.0.1:60801_, base_url=http://127.0.0.1:60801}
[junit4:junit4]   2> 16194 T530 C39 P60801 oasc.RecoveryStrategy.run Starting recovery process.  core=collection1 recoveringAfterStartup=true
[junit4:junit4]   2> 16195 T530 C39 P60801 oasc.RecoveryStrategy.doRecovery ###### startupVersions=[]
[junit4:junit4]   2> 16195 T530 C39 P60801 oasc.ZkController.publish publishing core=collection1 state=recovering
[junit4:junit4]   2> 16195 T526 oascc.ZkStateReader.updateClusterState Updating cloud state from ZooKeeper... 
[junit4:junit4]   2> 16195 T530 C39 P60801 oasc.ZkController.publish numShards not found on descriptor - reading it from system property
[junit4:junit4]   2> 16197 T453 oass.SolrDispatchFilter.init user.dir=/usr/home/hudson/hudson-slave/workspace/Lucene-Solr-Tests-4.x-java7/solr/build/solr-core/test/J0
[junit4:junit4]   2> 16197 T453 oass.SolrDispatchFilter.init SolrDispatchFilter.init() done
[junit4:junit4]   2> 16198 T453 oascsi.HttpClientUtil.createClient Creating new http client, config:maxConnections=128&maxConnectionsPerHost=32&followRedirects=false
[junit4:junit4]   2> 16225 T530 C39 P60801 oascsi.HttpClientUtil.createClient Creating new http client, config:maxConnections=128&maxConnectionsPerHost=32&followRedirects=false
[junit4:junit4]   2> 16386 T453 oejs.Server.doStart jetty-8.1.8.v20121106
[junit4:junit4]   2> 16390 T453 oejs.AbstractConnector.doStart Started SocketConnector@127.0.0.1:60814
[junit4:junit4]   2> 16390 T453 oass.SolrDispatchFilter.init SolrDispatchFilter.init()
[junit4:junit4]   2> 16391 T453 oasc.SolrResourceLoader.locateSolrHome JNDI not configured for solr (NoInitialContextEx)
[junit4:junit4]   2> 16391 T453 oasc.SolrResourceLoader.locateSolrHome using system property solr.solr.home: /usr/home/hudson/hudson-slave/workspace/Lucene-Solr-Tests-4.x-java7/solr/build/solr-core/test/J0/./org.apache.solr.cloud.SyncSliceTest-jetty4-1360558841961
[junit4:junit4]   2> 16392 T453 oasc.CoreContainer$Initializer.initialize looking for solr.xml: /usr/home/hudson/hudson-slave/workspace/Lucene-Solr-Tests-4.x-java7/solr/build/solr-core/test/J0/./org.apache.solr.cloud.SyncSliceTest-jetty4-1360558841961/solr.xml
[junit4:junit4]   2> 16392 T453 oasc.CoreContainer.<init> New CoreContainer 1334120936
[junit4:junit4]   2> 16393 T453 oasc.CoreContainer.load Loading CoreContainer using Solr Home: '/usr/home/hudson/hudson-slave/workspace/Lucene-Solr-Tests-4.x-java7/solr/build/solr-core/test/J0/./org.apache.solr.cloud.SyncSliceTest-jetty4-1360558841961/'
[junit4:junit4]   2> 16393 T453 oasc.SolrResourceLoader.<init> new SolrResourceLoader for directory: '/usr/home/hudson/hudson-slave/workspace/Lucene-Solr-Tests-4.x-java7/solr/build/solr-core/test/J0/./org.apache.solr.cloud.SyncSliceTest-jetty4-1360558841961/'
[junit4:junit4]   2> 16455 T453 oashc.HttpShardHandlerFactory.getParameter Setting socketTimeout to: 60000
[junit4:junit4]   2> 16456 T453 oashc.HttpShardHandlerFactory.getParameter Setting urlScheme to: http://
[junit4:junit4]   2> 16456 T453 oashc.HttpShardHandlerFactory.getParameter Setting connTimeout to: 15000
[junit4:junit4]   2> 16456 T453 oashc.HttpShardHandlerFactory.getParameter Setting maxConnectionsPerHost to: 20
[junit4:junit4]   2> 16457 T453 oashc.HttpShardHandlerFactory.getParameter Setting corePoolSize to: 0
[junit4:junit4]   2> 16457 T453 oashc.HttpShardHandlerFactory.getParameter Setting maximumPoolSize to: 2147483647
[junit4:junit4]   2> 16458 T453 oashc.HttpShardHandlerFactory.getParameter Setting maxThreadIdleTime to: 5
[junit4:junit4]   2> 16458 T453 oashc.HttpShardHandlerFactory.getParameter Setting sizeOfQueue to: -1
[junit4:junit4]   2> 16459 T453 oashc.HttpShardHandlerFactory.getParameter Setting fairnessPolicy to: false
[junit4:junit4]   2> 16459 T453 oascsi.HttpClientUtil.createClient Creating new http client, config:maxConnectionsPerHost=20&maxConnections=10000&socketTimeout=60000&connTimeout=15000&retry=false
[junit4:junit4]   2> 16481 T453 oasc.CoreContainer.load Registering Log Listener
[junit4:junit4]   2> 16501 T453 oasc.CoreContainer.initZooKeeper Zookeeper client=127.0.0.1:60763/solr
[junit4:junit4]   2> 16502 T453 oasc.ZkController.checkChrootPath zkHost includes chroot
[junit4:junit4]   2> 16502 T453 oaz.ZooKeeper.<init> Initiating client connection, connectString=127.0.0.1:60763 sessionTimeout=60000 watcher=org.apache.solr.common.cloud.ConnectionManager@325ececf
[junit4:junit4]   2> 16503 T453 oascc.ConnectionManager.waitForConnected Waiting for client to connect to ZooKeeper
[junit4:junit4]   2> 16504 T540 oaz.ClientCnxn$SendThread.logStartConnect Opening socket connection to server localhost/127.0.0.1:60763. Will not attempt to authenticate using SASL (access denied ("javax.security.auth.AuthPermission" "getLoginConfiguration"))
[junit4:junit4]   2> 16504 T540 oaz.ClientCnxn$SendThread.primeConnection Socket connection established to localhost/127.0.0.1:60763, initiating session
[junit4:junit4]   2> 16505 T455 oazs.NIOServerCnxnFactory.run Accepted socket connection from /140.211.11.196:60815
[junit4:junit4]   2> 16505 T455 oazs.ZooKeeperServer.processConnectRequest Client attempting to establish new session at /140.211.11.196:60815
[junit4:junit4]   2> 16507 T457 oazs.ZooKeeperServer.finishSessionInit Established session 0x13cc7a0224d000b with negotiated timeout 20000 for client /140.211.11.196:60815
[junit4:junit4]   2> 16507 T540 oaz.ClientCnxn$SendThread.onConnected Session establishment complete on server localhost/127.0.0.1:60763, sessionid = 0x13cc7a0224d000b, negotiated timeout = 20000
[junit4:junit4]   2> 16508 T541 oascc.ConnectionManager.process Watcher org.apache.solr.common.cloud.ConnectionManager@325ececf name:ZooKeeperConnection Watcher:127.0.0.1:60763 got event WatchedEvent state:SyncConnected type:None path:null path:null type:None
[junit4:junit4]   2> 16508 T453 oascc.ConnectionManager.waitForConnected Client is connected to ZooKeeper
[junit4:junit4]   2> 16510 T459 oazs.PrepRequestProcessor.pRequest2Txn Processed session termination for sessionid: 0x13cc7a0224d000b
[junit4:junit4]   2> 16522 T541 oaz.ClientCnxn$EventThread.run EventThread shut down
[junit4:junit4]   2> 16522 T455 oazs.NIOServerCnxn.closeSock Closed socket connection for client /140.211.11.196:60815 which had sessionid 0x13cc7a0224d000b
[junit4:junit4]   2> 16522 T453 oaz.ZooKeeper.close Session: 0x13cc7a0224d000b closed
[junit4:junit4]   2> 16523 T453 oascsi.HttpClientUtil.createClient Creating new http client, config:maxConnections=500&maxConnectionsPerHost=16&socketTimeout=60000&connTimeout=15000
[junit4:junit4]   2> 16534 T453 oaz.ZooKeeper.<init> Initiating client connection, connectString=127.0.0.1:60763/solr sessionTimeout=30000 watcher=org.apache.solr.common.cloud.ConnectionManager@faf74ba
[junit4:junit4]   2> 16535 T453 oascc.ConnectionManager.waitForConnected Waiting for client to connect to ZooKeeper
[junit4:junit4]   2> 16535 T542 oaz.ClientCnxn$SendThread.logStartConnect Opening socket connection to server localhost/127.0.0.1:60763. Will not attempt to authenticate using SASL (access denied ("javax.security.auth.AuthPermission" "getLoginConfiguration"))
[junit4:junit4]   2> 16536 T542 oaz.ClientCnxn$SendThread.primeConnection Socket connection established to localhost/127.0.0.1:60763, initiating session
[junit4:junit4]   2> 16536 T455 oazs.NIOServerCnxnFactory.run Accepted socket connection from /140.211.11.196:60816
[junit4:junit4]   2> 16536 T455 oazs.ZooKeeperServer.processConnectRequest Client attempting to establish new session at /140.211.11.196:60816
[junit4:junit4]   2> 16542 T457 oazs.ZooKeeperServer.finishSessionInit Established session 0x13cc7a0224d000c with negotiated timeout 20000 for client /140.211.11.196:60816
[junit4:junit4]   2> 16542 T542 oaz.ClientCnxn$SendThread.onConnected Session establishment complete on server localhost/127.0.0.1:60763, sessionid = 0x13cc7a0224d000c, negotiated timeout = 20000
[junit4:junit4]   2> 16543 T543 oascc.ConnectionManager.process Watcher org.apache.solr.common.cloud.ConnectionManager@faf74ba name:ZooKeeperConnection Watcher:127.0.0.1:60763/solr got event WatchedEvent state:SyncConnected type:None path:null path:null type:None
[junit4:junit4]   2> 16543 T453 oascc.ConnectionManager.waitForConnected Client is connected to ZooKeeper
[junit4:junit4]   2> 16544 T459 oazs.PrepRequestProcessor.pRequest Got user-level KeeperException when processing sessionid:0x13cc7a0224d000c type:create cxid:0x1 zxid:0x94 txntype:-1 reqpath:n/a Error Path:/solr/overseer Error:KeeperErrorCode = NodeExists for /solr/overseer
[junit4:junit4]   2> 16551 T459 oazs.PrepRequestProcessor.pRequest Got user-level KeeperException when processing sessionid:0x13cc7a0224d000c type:create cxid:0x2 zxid:0x95 txntype:-1 reqpath:n/a Error Path:/solr/overseer Error:KeeperErrorCode = NodeExists for /solr/overseer
[junit4:junit4]   2> 16560 T453 oascc.ZkStateReader.createClusterStateWatchersAndUpdate Updating cluster state from ZooKeeper... 
[junit4:junit4]   2> 16563 T453 oasc.ZkController.createEphemeralLiveNode Register node as live in ZooKeeper:/live_nodes/127.0.0.1:60814_
[junit4:junit4]   2> 16564 T459 oazs.PrepRequestProcessor.pRequest Got user-level KeeperException when processing sessionid:0x13cc7a0224d000c type:delete cxid:0x9 zxid:0x96 txntype:-1 reqpath:n/a Error Path:/solr/live_nodes/127.0.0.1:60814_ Error:KeeperErrorCode = NoNode for /solr/live_nodes/127.0.0.1:60814_
[junit4:junit4]   2> 16569 T453 oascc.SolrZkClient.makePath makePath: /live_nodes/127.0.0.1:60814_
[junit4:junit4]   2> 16577 T494 oascc.ZkStateReader$2.process A cluster state change: WatchedEvent state:SyncConnected type:NodeChildrenChanged path:/live_nodes, has occurred - updating... (live nodes size: 4)
[junit4:junit4]   2> 16578 T481 oascc.ZkStateReader$3.process Updating live nodes... (5)
[junit4:junit4]   2> 16578 T543 oascc.ZkStateReader$3.process Updating live nodes... (5)
[junit4:junit4]   2> 16579 T475 oascc.ZkStateReader$3.process Updating live nodes... (5)
[junit4:junit4]   2> 16579 T481 oascc.ZkStateReader$2.process A cluster state change: WatchedEvent state:SyncConnected type:NodeChildrenChanged path:/live_nodes, has occurred - updating... (live nodes size: 5)
[junit4:junit4]   2> 16579 T509 oascc.ZkStateReader$3.process Updating live nodes... (5)
[junit4:junit4]   2> 16579 T525 oascc.ZkStateReader$3.process Updating live nodes... (5)
[junit4:junit4]   2> 16579 T475 oascc.ZkStateReader$2.process A cluster state change: WatchedEvent state:SyncConnected type:NodeChildrenChanged path:/live_nodes, has occurred - updating... (live nodes size: 5)
[junit4:junit4]   2> 16579 T509 oascc.ZkStateReader$2.process A cluster state change: WatchedEvent state:SyncConnected type:NodeChildrenChanged path:/live_nodes, has occurred - updating... (live nodes size: 5)
[junit4:junit4]   2> 16579 T525 oascc.ZkStateReader$2.process A cluster state change: WatchedEvent state:SyncConnected type:NodeChildrenChanged path:/live_nodes, has occurred - updating... (live nodes size: 5)
[junit4:junit4]   2> 16580 T494 oascc.ZkStateReader$3.process Updating live nodes... (5)
[junit4:junit4]   2> 16590 T544 oasc.CoreContainer.create Creating SolrCore 'collection1' using instanceDir: /usr/home/hudson/hudson-slave/workspace/Lucene-Solr-Tests-4.x-java7/solr/build/solr-core/test/J0/./org.apache.solr.cloud.SyncSliceTest-jetty4-1360558841961/collection1
[junit4:junit4]   2> 16590 T544 oasc.ZkController.createCollectionZkNode Check for collection zkNode:collection1
[junit4:junit4]   2> 16591 T544 oasc.ZkController.createCollectionZkNode Collection zkNode exists
[junit4:junit4]   2> 16591 T544 oasc.ZkController.readConfigName Load collection config from:/collections/collection1
[junit4:junit4]   2> 16593 T544 oasc.SolrResourceLoader.<init> new SolrResourceLoader for directory: '/usr/home/hudson/hudson-slave/workspace/Lucene-Solr-Tests-4.x-java7/solr/build/solr-core/test/J0/./org.apache.solr.cloud.SyncSliceTest-jetty4-1360558841961/collection1/'
[junit4:junit4]   2> 16594 T544 oasc.SolrResourceLoader.replaceClassLoader Adding 'file:/usr/home/hudson/hudson-slave/workspace/Lucene-Solr-Tests-4.x-java7/solr/build/solr-core/test/J0/org.apache.solr.cloud.SyncSliceTest-jetty4-1360558841961/collection1/lib/README' to classloader
[junit4:junit4]   2> 16595 T544 oasc.SolrResourceLoader.replaceClassLoader Adding 'file:/usr/home/hudson/hudson-slave/workspace/Lucene-Solr-Tests-4.x-java7/solr/build/solr-core/test/J0/org.apache.solr.cloud.SyncSliceTest-jetty4-1360558841961/collection1/lib/classes/' to classloader
[junit4:junit4]   2> 16666 T544 oasc.SolrConfig.<init> Using Lucene MatchVersion: LUCENE_42
[junit4:junit4]   2> 16715 T476 oascc.ZkStateReader.updateClusterState Updating cloud state from ZooKeeper... 
[junit4:junit4]   2> 16716 T476 oasc.Overseer$ClusterStateUpdater.updateState Update state numShards=1 message={
[junit4:junit4]   2> 	  "operation":"state",
[junit4:junit4]   2> 	  "numShards":"1",
[junit4:junit4]   2> 	  "shard":"shard1",
[junit4:junit4]   2> 	  "roles":null,
[junit4:junit4]   2> 	  "state":"active",
[junit4:junit4]   2> 	  "core":"collection1",
[junit4:junit4]   2> 	  "collection":"collection1",
[junit4:junit4]   2> 	  "node_name":"127.0.0.1:60791_",
[junit4:junit4]   2> 	  "base_url":"http://127.0.0.1:60791"}
[junit4:junit4]   2> 16723 T476 oasc.Overseer$ClusterStateUpdater.updateState Update state numShards=1 message={
[junit4:junit4]   2> 	  "operation":"state",
[junit4:junit4]   2> 	  "numShards":"1",
[junit4:junit4]   2> 	  "shard":"shard1",
[junit4:junit4]   2> 	  "roles":null,
[junit4:junit4]   2> 	  "state":"recovering",
[junit4:junit4]   2> 	  "core":"collection1",
[junit4:junit4]   2> 	  "collection":"collection1",
[junit4:junit4]   2> 	  "node_name":"127.0.0.1:60801_",
[junit4:junit4]   2> 	  "base_url":"http://127.0.0.1:60801"}
[junit4:junit4]   2> 16733 T475 oascc.ZkStateReader$2.process A cluster state change: WatchedEvent state:SyncConnected type:NodeDataChanged path:/clusterstate.json, has occurred - updating... (live nodes size: 5)
[junit4:junit4]   2> 16733 T494 oascc.ZkStateReader$2.process A cluster state change: WatchedEvent state:SyncConnected type:NodeDataChanged path:/clusterstate.json, has occurred - updating... (live nodes size: 5)
[junit4:junit4]   2> 16733 T481 oascc.ZkStateReader$2.process A cluster state change: WatchedEvent state:SyncConnected type:NodeDataChanged path:/clusterstate.json, has occurred - updating... (live nodes size: 5)
[junit4:junit4]   2> 16733 T543 oascc.ZkStateReader$2.process A cluster state change: WatchedEvent state:SyncConnected type:NodeDataChanged path:/clusterstate.json, has occurred - updating... (live nodes size: 5)
[junit4:junit4]   2> 16734 T509 oascc.ZkStateReader$2.process A cluster state change: WatchedEvent state:SyncConnected type:NodeDataChanged path:/clusterstate.json, has occurred - updating... (live nodes size: 5)
[junit4:junit4]   2> 16734 T525 oascc.ZkStateReader$2.process A cluster state change: WatchedEvent state:SyncConnected type:NodeDataChanged path:/clusterstate.json, has occurred - updating... (live nodes size: 5)
[junit4:junit4]   2> 16745 T544 oasc.SolrConfig.<init> Loaded SolrConfig: solrconfig.xml
[junit4:junit4]   2> 16846 T544 oass.IndexSchema.readSchema Reading Solr Schema
[junit4:junit4]   2> 16853 T544 oass.IndexSchema.readSchema Schema name=test
[junit4:junit4]   2> 17555 T544 oass.OpenExchangeRatesOrgProvider.init Initialized with rates=open-exchange-rates.json, refreshInterval=1440.
[junit4:junit4]   2> 17566 T544 oass.IndexSchema.readSchema default search field in schema is text
[junit4:junit4]   2> 17569 T544 oass.IndexSchema.readSchema unique key field: id
[junit4:junit4]   2> 17591 T544 oass.FileExchangeRateProvider.reload Reloading exchange rates from file currency.xml
[junit4:junit4]   2> 17596 T544 oass.FileExchangeRateProvider.reload Reloading exchange rates from file currency.xml
[junit4:junit4]   2> 17601 T544 oass.OpenExchangeRatesOrgProvider.reload Reloading exchange rates from open-exchange-rates.json
[junit4:junit4]   2> 17603 T544 oass.OpenExchangeRatesOrgProvider.reload Reloading exchange rates from open-exchange-rates.json
[junit4:junit4]   2> 17605 T544 oasc.SolrCore.<init> [collection1] Opening new SolrCore at /usr/home/hudson/hudson-slave/workspace/Lucene-Solr-Tests-4.x-java7/solr/build/solr-core/test/J0/./org.apache.solr.cloud.SyncSliceTest-jetty4-1360558841961/collection1/, dataDir=./org.apache.solr.cloud.SyncSliceTest-1360558825755/jetty4/
[junit4:junit4]   2> 17605 T544 oasc.JmxMonitoredMap.<init> JMX monitoring is enabled. Adding Solr mbeans to JMX Server: com.sun.jmx.mbeanserver.JmxMBeanServer@283a30f3
[junit4:junit4]   2> 17606 T544 oasc.SolrCore.initDirectoryFactory solr.NRTCachingDirectoryFactory
[junit4:junit4]   2> 17607 T544 oasc.CachingDirectoryFactory.get return new directory for /usr/home/hudson/hudson-slave/workspace/Lucene-Solr-Tests-4.x-java7/solr/build/solr-core/test/J0/./org.apache.solr.cloud.SyncSliceTest-1360558825755/jetty4 forceNew:false
[junit4:junit4]   2> 17607 T544 oasc.CachingDirectoryFactory.close Releasing directory:/usr/home/hudson/hudson-slave/workspace/Lucene-Solr-Tests-4.x-java7/solr/build/solr-core/test/J0/./org.apache.solr.cloud.SyncSliceTest-1360558825755/jetty4
[junit4:junit4]   2> 17608 T544 oasc.SolrCore.getNewIndexDir New index directory detected: old=null new=./org.apache.solr.cloud.SyncSliceTest-1360558825755/jetty4/index/
[junit4:junit4]   2> 17608 T544 oasc.SolrCore.initIndex WARNING [collection1] Solr index directory './org.apache.solr.cloud.SyncSliceTest-1360558825755/jetty4/index' doesn't exist. Creating new index...
[junit4:junit4]   2> 17609 T544 oasc.CachingDirectoryFactory.get return new directory for /usr/home/hudson/hudson-slave/workspace/Lucene-Solr-Tests-4.x-java7/solr/build/solr-core/test/J0/./org.apache.solr.cloud.SyncSliceTest-1360558825755/jetty4/index forceNew:false
[junit4:junit4]   2> 17624 T544 oasc.SolrDeletionPolicy.onCommit SolrDeletionPolicy.onCommit: commits:num=1
[junit4:junit4]   2> 		commit{dir=RateLimitedDirectoryWrapper(NRTCachingDirectory(org.apache.lucene.store.NIOFSDirectory@/usr/home/hudson/hudson-slave/workspace/Lucene-Solr-Tests-4.x-java7/solr/build/solr-core/test/J0/org.apache.solr.cloud.SyncSliceTest-1360558825755/jetty4/index lockFactory=org.apache.lucene.store.NativeFSLockFactory@4bcbfa20; maxCacheMB=48.0 maxMergeSizeMB=4.0)),segFN=segments_1,generation=1,filenames=[segments_1]
[junit4:junit4]   2> 17624 T544 oasc.SolrDeletionPolicy.updateCommits newest commit = 1[segments_1]
[junit4:junit4]   2> 17625 T544 oasc.CachingDirectoryFactory.close Releasing directory:/usr/home/hudson/hudson-slave/workspace/Lucene-Solr-Tests-4.x-java7/solr/build/solr-core/test/J0/./org.apache.solr.cloud.SyncSliceTest-1360558825755/jetty4/index
[junit4:junit4]   2> 17626 T544 oasc.SolrCore.initWriters created xml: solr.XMLResponseWriter
[junit4:junit4]   2> 17628 T544 oasup.UpdateRequestProcessorChain.init inserting DistributedUpdateProcessorFactory into updateRequestProcessorChain "dedupe"
[junit4:junit4]   2> 17628 T544 oasup.UpdateRequestProcessorChain.init inserting DistributedUpdateProcessorFactory into updateRequestProcessorChain "dedupe-allfields"
[junit4:junit4]   2> 17629 T544 oasup.UpdateRequestProcessorChain.init inserting DistributedUpdateProcessorFactory into updateRequestProcessorChain "stored_sig"
[junit4:junit4]   2> 17629 T544 oasup.UpdateRequestProcessorChain.init inserting DistributedUpdateProcessorFactory into updateRequestProcessorChain "uniq-fields"
[junit4:junit4]   2> 17630 T544 oasup.UpdateRequestProcessorChain.init inserting DistributedUpdateProcessorFactory into updateRequestProcessorChain "distrib-dup-test-chain-implicit"
[junit4:junit4]   2> 17630 T544 oasc.RequestHandlers.initHandlersFromConfig adding lazy requestHandler: solr.ReplicationHandler
[junit4:junit4]   2> 17630 T544 oasc.RequestHandlers.initHandlersFromConfig created /replication: solr.ReplicationHandler
[junit4:junit4]   2> 17631 T544 oasc.RequestHandlers.initHandlersFromConfig created standard: solr.StandardRequestHandler
[junit4:junit4]   2> 17632 T544 oasc.RequestHandlers.initHandlersFromConfig created /get: solr.RealTimeGetHandler
[junit4:junit4]   2> 17632 T544 oasc.RequestHandlers.initHandlersFromConfig created dismax: solr.SearchHandler
[junit4:junit4]   2> 17633 T544 oasc.RequestHandlers.initHandlersFromConfig created mock: org.apache.solr.core.MockQuerySenderListenerReqHandler
[junit4:junit4]   2> 17633 T544 oasc.RequestHandlers.initHandlersFromConfig created /admin/: org.apache.solr.handler.admin.AdminHandlers
[junit4:junit4]   2> 17634 T544 oasc.RequestHandlers.initHandlersFromConfig created defaults: solr.StandardRequestHandler
[junit4:junit4]   2> 17634 T544 oasc.RequestHandlers.initHandlersFromConfig adding lazy requestHandler: solr.StandardRequestHandler
[junit4:junit4]   2> 17635 T544 oasc.RequestHandlers.initHandlersFromConfig created lazy: solr.StandardRequestHandler
[junit4:junit4]   2> 17635 T544 oasc.RequestHandlers.initHandlersFromConfig created /update: solr.UpdateRequestHandler
[junit4:junit4]   2> 17636 T544 oasc.RequestHandlers.initHandlersFromConfig created /terms: org.apache.solr.handler.component.SearchHandler
[junit4:junit4]   2> 17636 T544 oasc.RequestHandlers.initHandlersFromConfig created spellCheckCompRH: org.apache.solr.handler.component.SearchHandler
[junit4:junit4]   2> 17637 T544 oasc.RequestHandlers.initHandlersFromConfig created spellCheckCompRH_Direct: org.apache.solr.handler.component.SearchHandler
[junit4:junit4]   2> 17638 T544 oasc.RequestHandlers.initHandlersFromConfig created spellCheckWithWordbreak: org.apache.solr.handler.component.SearchHandler
[junit4:junit4]   2> 17638 T544 oasc.RequestHandlers.initHandlersFromConfig created spellCheckWithWordbreak_Direct: org.apache.solr.handler.component.SearchHandler
[junit4:junit4]   2> 17639 T544 oasc.RequestHandlers.initHandlersFromConfig created spellCheckCompRH1: org.apache.solr.handler.component.SearchHandler
[junit4:junit4]   2> 17640 T544 oasc.RequestHandlers.initHandlersFromConfig created mltrh: org.apache.solr.handler.component.SearchHandler
[junit4:junit4]   2> 17640 T544 oasc.RequestHandlers.initHandlersFromConfig created tvrh: org.apache.solr.handler.component.SearchHandler
[junit4:junit4]   2> 17641 T544 oasc.RequestHandlers.initHandlersFromConfig created /mlt: solr.MoreLikeThisHandler
[junit4:junit4]   2> 17641 T544 oasc.RequestHandlers.initHandlersFromConfig created /debug/dump: solr.DumpRequestHandler
[junit4:junit4]   2> 17653 T544 oashl.XMLLoader.init xsltCacheLifetimeSeconds=60
[junit4:junit4]   2> 17658 T544 oasc.SolrCore.initDeprecatedSupport WARNING solrconfig.xml uses deprecated <admin/gettableFiles>, Please update your config to use the ShowFileRequestHandler.
[junit4:junit4]   2> 17659 T544 oasc.SolrCore.initDeprecatedSupport WARNING adding ShowFileRequestHandler with hidden files: [SCHEMA.XML, OLD_SYNONYMS.TXT, STOPWORDS.TXT, PROTWORDS.TXT, OPEN-EXCHANGE-RATES.JSON, SYNONYMS.TXT, CURRENCY.XML, MAPPING-ISOLATIN1ACCENT.TXT]
[junit4:junit4]   2> 17662 T544 oasc.CachingDirectoryFactory.close Releasing directory:/usr/home/hudson/hudson-slave/workspace/Lucene-Solr-Tests-4.x-java7/solr/build/solr-core/test/J0/./org.apache.solr.cloud.SyncSliceTest-1360558825755/jetty4
[junit4:junit4]   2> 17664 T544 oass.SolrIndexSearcher.<init> Opening Searcher@58e42770 main
[junit4:junit4]   2> 17665 T544 oasu.CommitTracker.<init> Hard AutoCommit: disabled
[junit4:junit4]   2> 17665 T544 oasu.CommitTracker.<init> Soft AutoCommit: disabled
[junit4:junit4]   2> 17666 T544 oashc.SpellCheckComponent.inform Initializing spell checkers
[junit4:junit4]   2> 17673 T544 oass.DirectSolrSpellChecker.init init: {name=direct,classname=DirectSolrSpellChecker,field=lowerfilt,minQueryLength=3}
[junit4:junit4]   2> 17731 T545 oasc.SolrCore.registerSearcher [collection1] Registered new searcher Searcher@58e42770 main{StandardDirectoryReader(segments_1:1)}
[junit4:junit4]   2> 17737 T544 oasc.ZkController.publish publishing core=collection1 state=down
[junit4:junit4]   2> 17738 T544 oasc.ZkController.publish numShards not found on descriptor - reading it from system property
[junit4:junit4]   2> 18244 T476 oascc.ZkStateReader.updateClusterState Updating cloud state from ZooKeeper... 
[junit4:junit4]   2> 18245 T476 oasc.Overseer$ClusterStateUpdater.updateState Update state numShards=1 message={
[junit4:junit4]   2> 	  "operation":"state",
[junit4:junit4]   2> 	  "numShards":"1",
[junit4:junit4]   2> 	  "shard":null,
[junit4:junit4]   2> 	  "roles":null,
[junit4:junit4]   2> 	  "state":"down",
[junit4:junit4]   2> 	  "core":"collection1",
[junit4:junit4]   2> 	  "collection":"collection1",
[junit4:junit4]   2> 	  "node_name":"127.0.0.1:60814_",
[junit4:junit4]   2> 	  "base_url":"http://127.0.0.1:60814"}
[junit4:junit4]   2> 18245 T476 oasc.Overseer$ClusterStateUpdater.updateState Collection already exists with numShards=1
[junit4:junit4]   2> 18245 T476 oasc.Overseer$ClusterStateUpdater.updateState Assigning new node to shard shard=shard1
[junit4:junit4]   2> 18258 T475 oascc.ZkStateReader$2.process A cluster state change: WatchedEvent state:SyncConnected type:NodeDataChanged path:/clusterstate.json, has occurred - updating... (live nodes size: 5)
[junit4:junit4]   2> 18259 T525 oascc.ZkStateReader$2.process A cluster state change: WatchedEvent state:SyncConnected type:NodeDataChanged path:/clusterstate.json, has occurred - updating... (live nodes size: 5)
[junit4:junit4]   2> 18259 T481 oascc.ZkStateReader$2.process A cluster state change: WatchedEvent state:SyncConnected type:NodeDataChanged path:/clusterstate.json, has occurred - updating... (live nodes size: 5)
[junit4:junit4]   2> 18259 T509 oascc.ZkStateReader$2.process A cluster state change: WatchedEvent state:SyncConnected type:NodeDataChanged path:/clusterstate.json, has occurred - updating... (live nodes size: 5)
[junit4:junit4]   2> 18259 T543 oascc.ZkStateReader$2.process A cluster state change: WatchedEvent state:SyncConnected type:NodeDataChanged path:/clusterstate.json, has occurred - updating... (live nodes size: 5)
[junit4:junit4]   2> 18258 T494 oascc.ZkStateReader$2.process A cluster state change: WatchedEvent state:SyncConnected type:NodeDataChanged path:/clusterstate.json, has occurred - updating... (live nodes size: 5)
[junit4:junit4]   2> 18741 T544 oasc.CoreContainer.registerCore registering core: collection1
[junit4:junit4]   2> 18741 T544 oasc.ZkController.register Register replica - core:collection1 address:http://127.0.0.1:60814 collection:collection1 shard:shard1
[junit4:junit4]   2> 18746 T544 oasc.ZkController.register We are http://127.0.0.1:60814/collection1/ and leader is http://127.0.0.1:60779/collection1/
[junit4:junit4]   2> 18746 T544 oasc.ZkController.register No LogReplay needed for core=collection1 baseURL=http://127.0.0.1:60814
[junit4:junit4]   2> 18747 T544 oasc.ZkController.checkRecovery Core needs to recover:collection1
[junit4:junit4]   2> 18747 T544 oasu.DefaultSolrCoreState.doRecovery Running recovery - first canceling any ongoing recovery
[junit4:junit4]   2> ASYNC  NEW_CORE C40 name=collection1 org.apache.solr.core.SolrCore@287bd50c url=http://127.0.0.1:60814/collection1 node=127.0.0.1:60814_ C40_STATE=coll:collection1 core:collection1 props:{shard=null, roles=null, state=down, core=collection1, collection=collection1, node_name=127.0.0.1:60814_, base_url=http://127.0.0.1:60814}
[junit4:junit4]   2> 18748 T546 C40 P60814 oasc.RecoveryStrategy.run Starting recovery process.  core=collection1 recoveringAfterStartup=true
[junit4:junit4]   2> 18748 T544 oascc.ZkStateReader.updateClusterState Updating cloud state from ZooKeeper... 
[junit4:junit4]   2> 18749 T546 C40 P60814 oasc.RecoveryStrategy.doRecovery ###### startupVersions=[]
[junit4:junit4]   2> 18749 T546 C40 P60814 oasc.ZkController.publish publishing core=collection1 state=recovering
[junit4:junit4]   2> 18749 T546 C40 P60814 oasc.ZkController.publish numShards not found on descriptor - reading it from system property
[junit4:junit4]   2> 18750 T453 oass.SolrDispatchFilter.init user.dir=/usr/home/hudson/hudson-slave/workspace/Lucene-Solr-Tests-4.x-java7/solr/build/solr-core/test/J0
[junit4:junit4]   2> 18750 T453 oass.SolrDispatchFilter.init SolrDispatchFilter.init() done
[junit4:junit4]   2> 18751 T453 oascsi.HttpClientUtil.createClient Creating new http client, config:maxConnections=128&maxConnectionsPerHost=32&followRedirects=false
[junit4:junit4]   2> 18752 T546 C40 P60814 oascsi.HttpClientUtil.createClient Creating new http client, config:maxConnections=128&maxConnectionsPerHost=32&followRedirects=false
[junit4:junit4]   2> 18770 T453 oascc.ZkStateReader.updateClusterState Updating cloud state from ZooKeeper... 
[junit4:junit4]   2> 18772 T453 oasc.AbstractFullDistribZkTestBase.waitForThingsToLevelOut Wait for recoveries to finish - wait 15 for each attempt
[junit4:junit4]   2> 18772 T453 oasc.AbstractDistribZkTestBase.waitForRecoveriesToFinish Wait for recoveries to finish - collection: collection1 failOnTimeout:true timeout (sec):15
[junit4:junit4]   2> 18773 T453 oascc.ZkStateReader.updateClusterState Updating cloud state from ZooKeeper... 
[junit4:junit4]   2>  C39_STATE=coll:collection1 core:collection1 props:{shard=shard1, roles=null, state=recovering, core=collection1, collection=collection1, node_name=127.0.0.1:60801_, base_url=http://127.0.0.1:60801}
[junit4:junit4]   2> 19239 T530 C39 P60801 oasc.RecoveryStrategy.doRecovery Attempting to PeerSync from http://127.0.0.1:60779/collection1/ core=collection1 - recoveringAfterStartup=true
[junit4:junit4]   2> 19239 T530 C39 P60801 oasu.PeerSync.sync PeerSync: core=collection1 url=http://127.0.0.1:60801 START replicas=[http://127.0.0.1:60779/collection1/] nUpdates=100
[junit4:junit4]   2> 19240 T530 C39 P60801 oasu.PeerSync.sync WARNING no frame of reference to tell of we've missed updates
[junit4:junit4]   2> 19240 T530 C39 P60801 oasc.RecoveryStrategy.doRecovery PeerSync Recovery was not successful - trying replication. core=collection1
[junit4:junit4]   2> 19240 T530 C39 P60801 oasc.RecoveryStrategy.doRecovery Starting Replication Recovery. core=collection1
[junit4:junit4]   2> 19241 T530 C39 P60801 oasc.RecoveryStrategy.doRecovery Begin buffering updates. core=collection1
[junit4:junit4]   2> 19241 T530 C39 P60801 oasu.UpdateLog.bufferUpdates Starting to buffer updates. FSUpdateLog{state=ACTIVE, tlog=null}
[junit4:junit4]   2> 19241 T530 C39 P60801 oasc.RecoveryStrategy.replicate Attempting to replicate from http://127.0.0.1:60779/collection1/. core=collection1
[junit4:junit4]   2> 19241 T530 C39 P60801 oascsi.HttpClientUtil.createClient Creating new http client, config:maxConnections=128&maxConnectionsPerHost=32&followRedirects=false
[junit4:junit4]   2> 19243 T485 C38 P60779 REQ /get {getVersions=100&distrib=false&wt=javabin&qt=/get&version=2} status=0 QTime=0 
[junit4:junit4]   2> 19254 T490 C38 P60779 oasu.DirectUpdateHandler2.commit start commit{,optimize=false,openSearcher=false,waitSearcher=true,expungeDeletes=false,softCommit=false}
[junit4:junit4]   2> 19259 T490 C38 P60779 oasc.SolrDeletionPolicy.onCommit SolrDeletionPolicy.onCommit: commits:num=2
[junit4:junit4]   2> 		commit{dir=RateLimitedDirectoryWrapper(NRTCachingDirectory(org.apache.lucene.store.NIOFSDirectory@/usr/home/hudson/hudson-slave/workspace/Lucene-Solr-Tests-4.x-java7/solr/build/solr-core/test/J0/org.apache.solr.cloud.SyncSliceTest-1360558825755/jetty1/index lockFactory=org.apache.lucene.store.NativeFSLockFactory@5e5fffaa; maxCacheMB=48.0 maxMergeSizeMB=4.0)),segFN=segments_2,generation=2,filenames=[segments_2]
[junit4:junit4]   2> 		commit{dir=RateLimitedDirectoryWrapper(NRTCachingDirectory(org.apache.lucene.store.NIOFSDirectory@/usr/home/hudson/hudson-slave/workspace/Lucene-Solr-Tests-4.x-java7/solr/build/solr-core/test/J0/org.apache.solr.cloud.SyncSliceTest-1360558825755/jetty1/index lockFactory=org.apache.lucene.store.NativeFSLockFactory@5e5fffaa; maxCacheMB=48.0 maxMergeSizeMB=4.0)),segFN=segments_3,generation=3,filenames=[segments_3]
[junit4:junit4]   2> 19259 T490 C38 P60779 oasc.SolrDeletionPolicy.updateCommits newest commit = 3[segments_3]
[junit4:junit4]   2> 19260 T490 C38 P60779 oasc.CachingDirectoryFactory.close Releasing directory:/usr/home/hudson/hudson-slave/workspace/Lucene-Solr-Tests-4.x-java7/solr/build/solr-core/test/J0/./org.apache.solr.cloud.SyncSliceTest-1360558825755/jetty1
[junit4:junit4]   2> 19260 T490 C38 P60779 oasu.DirectUpdateHandler2.commit end_commit_flush
[junit4:junit4]   2> 19261 T490 C38 P60779 /update {waitSearcher=true&openSearcher=false&commit=true&wt=javabin&commit_end_point=true&version=2&softCommit=false} {commit=} 0 7
[junit4:junit4]   2> 19262 T530 C39 P60801 oash.ReplicationHandler.inform Commits will be reserved for  10000
[junit4:junit4]   2> 19262 T530 C39 P60801 oash.SnapPuller.<init>  No value set for 'pollInterval'. Timer Task not started.
[junit4:junit4]   2> 19265 T487 C38 P60779 REQ /replication {command=indexversion&qt=/replication&wt=javabin&version=2} status=0 QTime=0 
[junit4:junit4]   2> 19266 T530 C39 P60801 oash.SnapPuller.fetchLatestIndex Master's generation: 3
[junit4:junit4]   2> 19267 T530 C39 P60801 oash.SnapPuller.fetchLatestIndex Slave's generation: 1
[junit4:junit4]   2> 19267 T530 C39 P60801 oash.SnapPuller.fetchLatestIndex Starting replication process
[junit4:junit4]   2> 19269 T487 C38 P60779 oasc.CachingDirectoryFactory.close Releasing directory:/usr/home/hudson/hudson-slave/workspace/Lucene-Solr-Tests-4.x-java7/solr/build/solr-core/test/J0/./org.apache.solr.cloud.SyncSliceTest-1360558825755/jetty1
[junit4:junit4]   2> 19270 T487 C38 P60779 oasc.CachingDirectoryFactory.close Releasing directory:/usr/home/hudson/hudson-slave/workspace/Lucene-Solr-Tests-4.x-java7/solr/build/solr-core/test/J0/./org.apache.solr.cloud.SyncSliceTest-1360558825755/jetty1/index
[junit4:junit4]   2> 19270 T487 C38 P60779 REQ /replication {command=filelist&qt=/replication&wt=javabin&generation=3&version=2} status=0 QTime=1 
[junit4:junit4]   2> 19271 T530 C39 P60801 oash.SnapPuller.fetchLatestIndex Number of files in latest index in master: 1
[junit4:junit4]   2> 19273 T530 C39 P60801 oasc.CachingDirectoryFactory.get return new directory for /usr/home/hudson/hudson-slave/workspace/Lucene-Solr-Tests-4.x-java7/solr/build/solr-core/test/J0/./org.apache.solr.cloud.SyncSliceTest-1360558825755/jetty3/index.20130211060045020 forceNew:false
[junit4:junit4]   2> 19273 T530 C39 P60801 oasc.CachingDirectoryFactory.close Releasing directory:/usr/home/hudson/hudson-slave/workspace/Lucene-Solr-Tests-4.x-java7/solr/build/solr-core/test/J0/./org.apache.solr.cloud.SyncSliceTest-1360558825755/jetty3
[junit4:junit4]   2> 19275 T530 C39 P60801 oash.SnapPuller.fetchLatestIndex Starting download to Ra

[...truncated too long message...]

ectory(org.apache.lucene.store.NIOFSDirectory@/usr/home/hudson/hudson-slave/workspace/Lucene-Solr-Tests-4.x-java7/solr/build/solr-core/test/J0/org.apache.solr.cloud.SyncSliceTest-1360558825755/jetty4/index lockFactory=org.apache.lucene.store.NativeFSLockFactory@4bcbfa20; maxCacheMB=48.0 maxMergeSizeMB=4.0))
[junit4:junit4]   2> 857139 T453 oasc.CachingDirectoryFactory.close Closing directory when closing factory:/usr/home/hudson/hudson-slave/workspace/Lucene-Solr-Tests-4.x-java7/solr/build/solr-core/test/J0/./org.apache.solr.cloud.SyncSliceTest-1360558825755/jetty4/index
[junit4:junit4]   2> 857139 T453 oasc.CachingDirectoryFactory.closeDirectory Closing directory:/usr/home/hudson/hudson-slave/workspace/Lucene-Solr-Tests-4.x-java7/solr/build/solr-core/test/J0/./org.apache.solr.cloud.SyncSliceTest-1360558825755/jetty4/index
[junit4:junit4]   2> 857139 T453 oasc.CachingDirectoryFactory.close Closing directory when closing factory:/usr/home/hudson/hudson-slave/workspace/Lucene-Solr-Tests-4.x-java7/solr/build/solr-core/test/J0/./org.apache.solr.cloud.SyncSliceTest-1360558825755/jetty4
[junit4:junit4]   2> 857140 T453 oasc.CachingDirectoryFactory.closeDirectory Closing directory:/usr/home/hudson/hudson-slave/workspace/Lucene-Solr-Tests-4.x-java7/solr/build/solr-core/test/J0/./org.apache.solr.cloud.SyncSliceTest-1360558825755/jetty4
[junit4:junit4]   2> 869425 T543 oaz.ClientCnxn$EventThread.run EventThread shut down
[junit4:junit4]   2> 869425 T453 oaz.ZooKeeper.close Session: 0x13cc7a0224d000c closed
[junit4:junit4]   2> 869427 T453 oejsh.ContextHandler.doStop stopped o.e.j.s.ServletContextHandler{/,null}
[junit4:junit4]   2> 869632 T453 oas.SolrTestCaseJ4.tearDown ###Ending testDistribSearch
[junit4:junit4]   1> client port:0.0.0.0/0.0.0.0:0
[junit4:junit4]   2> NOTE: reproduce with: ant test  -Dtestcase=SyncSliceTest -Dtests.method=testDistribSearch -Dtests.seed=34565BB195141A89 -Dtests.multiplier=3 -Dtests.slow=true -Dtests.locale=sr__#Latn -Dtests.timezone=Europe/Belgrade -Dtests.file.encoding=ISO-8859-1
[junit4:junit4] FAILURE  870s J0 | SyncSliceTest.testDistribSearch <<<
[junit4:junit4]    > Throwable #1: java.lang.AssertionError: Test Setup Failure: shard1 should have just been set up to be inconsistent - but it's still consistent. Leader:http://127.0.0.1:60791/collection1skip list:[org.apache.solr.cloud.AbstractFullDistribZkTestBase$CloudJettyRunner@22431db5, org.apache.solr.cloud.AbstractFullDistribZkTestBase$CloudJettyRunner@bc298db3]
[junit4:junit4]    > 	at __randomizedtesting.SeedInfo.seed([34565BB195141A89:B5B0D5A9E24B7AB5]:0)
[junit4:junit4]    > 	at org.junit.Assert.fail(Assert.java:93)
[junit4:junit4]    > 	at org.junit.Assert.assertTrue(Assert.java:43)
[junit4:junit4]    > 	at org.junit.Assert.assertNotNull(Assert.java:526)
[junit4:junit4]    > 	at org.apache.solr.cloud.SyncSliceTest.doTest(SyncSliceTest.java:216)
[junit4:junit4]    > 	at org.apache.solr.BaseDistributedSearchTestCase.testDistribSearch(BaseDistributedSearchTestCase.java:794)
[junit4:junit4]    > 	at sun.reflect.NativeMethodAccessorImpl.invoke0(Native Method)
[junit4:junit4]    > 	at sun.reflect.NativeMethodAccessorImpl.invoke(NativeMethodAccessorImpl.java:57)
[junit4:junit4]    > 	at sun.reflect.DelegatingMethodAccessorImpl.invoke(DelegatingMethodAccessorImpl.java:43)
[junit4:junit4]    > 	at java.lang.reflect.Method.invoke(Method.java:601)
[junit4:junit4]    > 	at com.carrotsearch.randomizedtesting.RandomizedRunner.invoke(RandomizedRunner.java:1559)
[junit4:junit4]    > 	at com.carrotsearch.randomizedtesting.RandomizedRunner.access$600(RandomizedRunner.java:79)
[junit4:junit4]    > 	at com.carrotsearch.randomizedtesting.RandomizedRunner$6.evaluate(RandomizedRunner.java:737)
[junit4:junit4]    > 	at com.carrotsearch.randomizedtesting.RandomizedRunner$7.evaluate(RandomizedRunner.java:773)
[junit4:junit4]    > 	at com.carrotsearch.randomizedtesting.RandomizedRunner$8.evaluate(RandomizedRunner.java:787)
[junit4:junit4]    > 	at com.carrotsearch.randomizedtesting.rules.SystemPropertiesRestoreRule$1.evaluate(SystemPropertiesRestoreRule.java:53)
[junit4:junit4]    > 	at org.apache.lucene.util.TestRuleSetupTeardownChained$1.evaluate(TestRuleSetupTeardownChained.java:50)
[junit4:junit4]    > 	at org.apache.lucene.util.TestRuleFieldCacheSanity$1.evaluate(TestRuleFieldCacheSanity.java:51)
[junit4:junit4]    > 	at org.apache.lucene.util.AbstractBeforeAfterRule$1.evaluate(AbstractBeforeAfterRule.java:46)
[junit4:junit4]    > 	at com.carrotsearch.randomizedtesting.rules.SystemPropertiesInvariantRule$1.evaluate(SystemPropertiesInvariantRule.java:55)
[junit4:junit4]    > 	at org.apache.lucene.util.TestRuleThreadAndTestName$1.evaluate(TestRuleThreadAndTestName.java:49)
[junit4:junit4]    > 	at org.apache.lucene.util.TestRuleIgnoreAfterMaxFailures$1.evaluate(TestRuleIgnoreAfterMaxFailures.java:70)
[junit4:junit4]    > 	at org.apache.lucene.util.TestRuleMarkFailure$1.evaluate(TestRuleMarkFailure.java:48)
[junit4:junit4]    > 	at com.carrotsearch.randomizedtesting.rules.StatementAdapter.evaluate(StatementAdapter.java:36)
[junit4:junit4]    > 	at com.carrotsearch.randomizedtesting.ThreadLeakControl$StatementRunner.run(ThreadLeakControl.java:358)
[junit4:junit4]    > 	at com.carrotsearch.randomizedtesting.ThreadLeakControl.forkTimeoutingTask(ThreadLeakControl.java:782)
[junit4:junit4]    > 	at com.carrotsearch.randomizedtesting.ThreadLeakControl$3.evaluate(ThreadLeakControl.java:442)
[junit4:junit4]    > 	at com.carrotsearch.randomizedtesting.RandomizedRunner.runSingleTest(RandomizedRunner.java:746)
[junit4:junit4]    > 	at com.carrotsearch.randomizedtesting.RandomizedRunner$3.evaluate(RandomizedRunner.java:648)
[junit4:junit4]    > 	at com.carrotsearch.randomizedtesting.RandomizedRunner$4.evaluate(RandomizedRunner.java:682)
[junit4:junit4]    > 	at com.carrotsearch.randomizedtesting.RandomizedRunner$5.evaluate(RandomizedRunner.java:693)
[junit4:junit4]    > 	at com.carrotsearch.randomizedtesting.rules.StatementAdapter.evaluate(StatementAdapter.java:36)
[junit4:junit4]    > 	at com.carrotsearch.randomizedtesting.rules.SystemPropertiesRestoreRule$1.evaluate(SystemPropertiesRestoreRule.java:53)
[junit4:junit4]    > 	at org.apache.lucene.util.AbstractBeforeAfterRule$1.evaluate(AbstractBeforeAfterRule.java:46)
[junit4:junit4]    > 	at org.apache.lucene.util.TestRuleStoreClassName$1.evaluate(TestRuleStoreClassName.java:42)
[junit4:junit4]    > 	at com.carrotsearch.randomizedtesting.rules.SystemPropertiesInvariantRule$1.evaluate(SystemPropertiesInvariantRule.java:55)
[junit4:junit4]    > 	at com.carrotsearch.randomizedtesting.rules.NoShadowingOrOverridesOnMethodsRule$1.evaluate(NoShadowingOrOverridesOnMethodsRule.java:39)
[junit4:junit4]    > 	at com.carrotsearch.randomizedtesting.rules.NoShadowingOrOverridesOnMethodsRule$1.evaluate(NoShadowingOrOverridesOnMethodsRule.java:39)
[junit4:junit4]    > 	at com.carrotsearch.randomizedtesting.rules.StatementAdapter.evaluate(StatementAdapter.java:36)
[junit4:junit4]    > 	at org.apache.lucene.util.TestRuleAssertionsRequired$1.evaluate(TestRuleAssertionsRequired.java:43)
[junit4:junit4]    > 	at org.apache.lucene.util.TestRuleMarkFailure$1.evaluate(TestRuleMarkFailure.java:48)
[junit4:junit4]    > 	at org.apache.lucene.util.TestRuleIgnoreAfterMaxFailures$1.evaluate(TestRuleIgnoreAfterMaxFailures.java:70)
[junit4:junit4]    > 	at org.apache.lucene.util.TestRuleIgnoreTestSuites$1.evaluate(TestRuleIgnoreTestSuites.java:55)
[junit4:junit4]    > 	at com.carrotsearch.randomizedtesting.rules.StatementAdapter.evaluate(StatementAdapter.java:36)
[junit4:junit4]    > 	at com.carrotsearch.randomizedtesting.ThreadLeakControl$StatementRunner.run(ThreadLeakControl.java:358)
[junit4:junit4]    > 	at java.lang.Thread.run(Thread.java:722)
[junit4:junit4]   2> 869783 T453 oas.SolrTestCaseJ4.deleteCore ###deleteCore
[junit4:junit4]   2> NOTE: test params are: codec=Lucene3x, sim=DefaultSimilarity, locale=sr__#Latn, timezone=Europe/Belgrade
[junit4:junit4]   2> NOTE: FreeBSD 9.0-RELEASE amd64/Oracle Corporation 1.7.0_09 (64-bit)/cpus=16,threads=2,free=32078392,total=104857600
[junit4:junit4]   2> NOTE: All tests run in this JVM: [TestNumberUtils, UpdateRequestProcessorFactoryTest, BadComponentTest, DateFieldTest, QueryElevationComponentTest, NotRequiredUniqueKeyTest, SuggesterWFSTTest, SolrRequestParserTest, CoreAdminHandlerTest, TestWordDelimiterFilterFactory, CoreContainerCoreInitFailuresTest, DistributedSpellCheckComponentTest, TestRangeQuery, TestGroupingSearch, SpellCheckCollatorTest, PluginInfoTest, AlternateDirectoryTest, SolrCmdDistributorTest, DistributedTermsComponentTest, SyncSliceTest]
[junit4:junit4] Completed on J0 in 869.84s, 1 test, 1 failure <<< FAILURES!

[...truncated 244 lines...]
BUILD FAILED
/usr/home/hudson/hudson-slave/workspace/Lucene-Solr-Tests-4.x-java7/build.xml:381: The following error occurred while executing this line:
/usr/home/hudson/hudson-slave/workspace/Lucene-Solr-Tests-4.x-java7/build.xml:361: The following error occurred while executing this line:
/usr/home/hudson/hudson-slave/workspace/Lucene-Solr-Tests-4.x-java7/build.xml:39: The following error occurred while executing this line:
/usr/home/hudson/hudson-slave/workspace/Lucene-Solr-Tests-4.x-java7/solr/build.xml:183: The following error occurred while executing this line:
/usr/home/hudson/hudson-slave/workspace/Lucene-Solr-Tests-4.x-java7/solr/common-build.xml:447: The following error occurred while executing this line:
/usr/home/hudson/hudson-slave/workspace/Lucene-Solr-Tests-4.x-java7/lucene/common-build.xml:1202: The following error occurred while executing this line:
/usr/home/hudson/hudson-slave/workspace/Lucene-Solr-Tests-4.x-java7/lucene/common-build.xml:865: There were test failures: 251 suites, 1043 tests, 1 failure, 22 ignored (4 assumptions)

Total time: 49 minutes 42 seconds
Build step 'Invoke Ant' marked build as failure
Archiving artifacts
Recording test results
Email was triggered for: Failure
Sending email for trigger: Failure



Mime
View raw message