lucene-dev mailing list archives

Site index · List index
Message view « Date » · « Thread »
Top « Date » · « Thread »
From Apache Jenkins Server <jenk...@builds.apache.org>
Subject [JENKINS] Lucene-Solr-Tests-4.x-java7 - Build # 986 - Failure
Date Wed, 13 Feb 2013 14:07:45 GMT
Build: https://builds.apache.org/job/Lucene-Solr-Tests-4.x-java7/986/

1 tests failed.
REGRESSION:  org.apache.solr.cloud.BasicDistributedZkTest.testDistribSearch

Error Message:
There are still nodes recoverying - waited for 230 seconds

Stack Trace:
java.lang.AssertionError: There are still nodes recoverying - waited for 230 seconds
	at __randomizedtesting.SeedInfo.seed([F9CF60B1F4A1D4D7:7829EEA983FEB4EB]:0)
	at org.junit.Assert.fail(Assert.java:93)
	at org.apache.solr.cloud.AbstractDistribZkTestBase.waitForRecoveriesToFinish(AbstractDistribZkTestBase.java:168)
	at org.apache.solr.cloud.AbstractDistribZkTestBase.waitForRecoveriesToFinish(AbstractDistribZkTestBase.java:126)
	at org.apache.solr.cloud.AbstractDistribZkTestBase.waitForRecoveriesToFinish(AbstractDistribZkTestBase.java:121)
	at org.apache.solr.cloud.BasicDistributedZkTest.testCoreUnloadAndLeaders(BasicDistributedZkTest.java:599)
	at org.apache.solr.cloud.BasicDistributedZkTest.doTest(BasicDistributedZkTest.java:337)
	at org.apache.solr.BaseDistributedSearchTestCase.testDistribSearch(BaseDistributedSearchTestCase.java:794)
	at sun.reflect.NativeMethodAccessorImpl.invoke0(Native Method)
	at sun.reflect.NativeMethodAccessorImpl.invoke(NativeMethodAccessorImpl.java:57)
	at sun.reflect.DelegatingMethodAccessorImpl.invoke(DelegatingMethodAccessorImpl.java:43)
	at java.lang.reflect.Method.invoke(Method.java:601)
	at com.carrotsearch.randomizedtesting.RandomizedRunner.invoke(RandomizedRunner.java:1559)
	at com.carrotsearch.randomizedtesting.RandomizedRunner.access$600(RandomizedRunner.java:79)
	at com.carrotsearch.randomizedtesting.RandomizedRunner$6.evaluate(RandomizedRunner.java:737)
	at com.carrotsearch.randomizedtesting.RandomizedRunner$7.evaluate(RandomizedRunner.java:773)
	at com.carrotsearch.randomizedtesting.RandomizedRunner$8.evaluate(RandomizedRunner.java:787)
	at com.carrotsearch.randomizedtesting.rules.SystemPropertiesRestoreRule$1.evaluate(SystemPropertiesRestoreRule.java:53)
	at org.apache.lucene.util.TestRuleSetupTeardownChained$1.evaluate(TestRuleSetupTeardownChained.java:50)
	at org.apache.lucene.util.TestRuleFieldCacheSanity$1.evaluate(TestRuleFieldCacheSanity.java:51)
	at org.apache.lucene.util.AbstractBeforeAfterRule$1.evaluate(AbstractBeforeAfterRule.java:46)
	at com.carrotsearch.randomizedtesting.rules.SystemPropertiesInvariantRule$1.evaluate(SystemPropertiesInvariantRule.java:55)
	at org.apache.lucene.util.TestRuleThreadAndTestName$1.evaluate(TestRuleThreadAndTestName.java:49)
	at org.apache.lucene.util.TestRuleIgnoreAfterMaxFailures$1.evaluate(TestRuleIgnoreAfterMaxFailures.java:70)
	at org.apache.lucene.util.TestRuleMarkFailure$1.evaluate(TestRuleMarkFailure.java:48)
	at com.carrotsearch.randomizedtesting.rules.StatementAdapter.evaluate(StatementAdapter.java:36)
	at com.carrotsearch.randomizedtesting.ThreadLeakControl$StatementRunner.run(ThreadLeakControl.java:358)
	at com.carrotsearch.randomizedtesting.ThreadLeakControl.forkTimeoutingTask(ThreadLeakControl.java:782)
	at com.carrotsearch.randomizedtesting.ThreadLeakControl$3.evaluate(ThreadLeakControl.java:442)
	at com.carrotsearch.randomizedtesting.RandomizedRunner.runSingleTest(RandomizedRunner.java:746)
	at com.carrotsearch.randomizedtesting.RandomizedRunner$3.evaluate(RandomizedRunner.java:648)
	at com.carrotsearch.randomizedtesting.RandomizedRunner$4.evaluate(RandomizedRunner.java:682)
	at com.carrotsearch.randomizedtesting.RandomizedRunner$5.evaluate(RandomizedRunner.java:693)
	at com.carrotsearch.randomizedtesting.rules.StatementAdapter.evaluate(StatementAdapter.java:36)
	at com.carrotsearch.randomizedtesting.rules.SystemPropertiesRestoreRule$1.evaluate(SystemPropertiesRestoreRule.java:53)
	at org.apache.lucene.util.AbstractBeforeAfterRule$1.evaluate(AbstractBeforeAfterRule.java:46)
	at org.apache.lucene.util.TestRuleStoreClassName$1.evaluate(TestRuleStoreClassName.java:42)
	at com.carrotsearch.randomizedtesting.rules.SystemPropertiesInvariantRule$1.evaluate(SystemPropertiesInvariantRule.java:55)
	at com.carrotsearch.randomizedtesting.rules.NoShadowingOrOverridesOnMethodsRule$1.evaluate(NoShadowingOrOverridesOnMethodsRule.java:39)
	at com.carrotsearch.randomizedtesting.rules.NoShadowingOrOverridesOnMethodsRule$1.evaluate(NoShadowingOrOverridesOnMethodsRule.java:39)
	at com.carrotsearch.randomizedtesting.rules.StatementAdapter.evaluate(StatementAdapter.java:36)
	at org.apache.lucene.util.TestRuleAssertionsRequired$1.evaluate(TestRuleAssertionsRequired.java:43)
	at org.apache.lucene.util.TestRuleMarkFailure$1.evaluate(TestRuleMarkFailure.java:48)
	at org.apache.lucene.util.TestRuleIgnoreAfterMaxFailures$1.evaluate(TestRuleIgnoreAfterMaxFailures.java:70)
	at org.apache.lucene.util.TestRuleIgnoreTestSuites$1.evaluate(TestRuleIgnoreTestSuites.java:55)
	at com.carrotsearch.randomizedtesting.rules.StatementAdapter.evaluate(StatementAdapter.java:36)
	at com.carrotsearch.randomizedtesting.ThreadLeakControl$StatementRunner.run(ThreadLeakControl.java:358)
	at java.lang.Thread.run(Thread.java:722)




Build Log:
[...truncated 9264 lines...]
[junit4:junit4] Suite: org.apache.solr.cloud.BasicDistributedZkTest
[junit4:junit4]   2> 0 T1246 oas.BaseDistributedSearchTestCase.initHostContext Setting hostContext system property: /jc/
[junit4:junit4]   2> 7 T1246 oas.SolrTestCaseJ4.setUp ###Starting testDistribSearch
[junit4:junit4]   2> Creating dataDir: /usr/home/hudson/hudson-slave/workspace/Lucene-Solr-Tests-4.x-java7/solr/build/solr-core/test/J0/./solrtest-BasicDistributedZkTest-1360760602292
[junit4:junit4]   2> 8 T1246 oasc.ZkTestServer.run STARTING ZK TEST SERVER
[junit4:junit4]   2> 9 T1247 oasc.ZkTestServer$ZKServerMain.runFromConfig Starting server
[junit4:junit4]   2> 12 T1247 oazs.ZooKeeperServer.setTickTime tickTime set to 1000
[junit4:junit4]   2> 12 T1247 oazs.ZooKeeperServer.setMinSessionTimeout minSessionTimeout set to -1
[junit4:junit4]   2> 12 T1247 oazs.ZooKeeperServer.setMaxSessionTimeout maxSessionTimeout set to -1
[junit4:junit4]   2> 13 T1247 oazs.NIOServerCnxnFactory.configure binding to port 0.0.0.0/0.0.0.0:0
[junit4:junit4]   2> 14 T1247 oazsp.FileTxnSnapLog.save Snapshotting: 0x0 to /usr/home/hudson/hudson-slave/workspace/Lucene-Solr-Tests-4.x-java7/solr/build/solr-core/test/J0/./org.apache.solr.cloud.BasicDistributedZkTest-1360760602291/zookeeper/server1/data/version-2/snapshot.0
[junit4:junit4]   2> 109 T1246 oasc.ZkTestServer.run start zk server on port:29321
[junit4:junit4]   2> 109 T1246 oaz.ZooKeeper.<init> Initiating client connection, connectString=127.0.0.1:29321 sessionTimeout=10000 watcher=org.apache.solr.common.cloud.ConnectionManager@7356e52
[junit4:junit4]   2> 110 T1246 oascc.ConnectionManager.waitForConnected Waiting for client to connect to ZooKeeper
[junit4:junit4]   2> 111 T1252 oaz.ClientCnxn$SendThread.logStartConnect Opening socket connection to server localhost/127.0.0.1:29321. Will not attempt to authenticate using SASL (access denied ("javax.security.auth.AuthPermission" "getLoginConfiguration"))
[junit4:junit4]   2> 111 T1252 oaz.ClientCnxn$SendThread.primeConnection Socket connection established to localhost/127.0.0.1:29321, initiating session
[junit4:junit4]   2> 112 T1248 oazs.NIOServerCnxnFactory.run Accepted socket connection from /140.211.11.196:29322
[junit4:junit4]   2> 113 T1248 oazs.ZooKeeperServer.processConnectRequest Client attempting to establish new session at /140.211.11.196:29322
[junit4:junit4]   2> 113 T1250 oazsp.FileTxnLog.append Creating new log file: log.1
[junit4:junit4]   2> 116 T1250 oazs.ZooKeeperServer.finishSessionInit Established session 0x13cd3a6febb0000 with negotiated timeout 10000 for client /140.211.11.196:29322
[junit4:junit4]   2> 116 T1252 oaz.ClientCnxn$SendThread.onConnected Session establishment complete on server localhost/127.0.0.1:29321, sessionid = 0x13cd3a6febb0000, negotiated timeout = 10000
[junit4:junit4]   2> 117 T1253 oascc.ConnectionManager.process Watcher org.apache.solr.common.cloud.ConnectionManager@7356e52 name:ZooKeeperConnection Watcher:127.0.0.1:29321 got event WatchedEvent state:SyncConnected type:None path:null path:null type:None
[junit4:junit4]   2> 117 T1246 oascc.ConnectionManager.waitForConnected Client is connected to ZooKeeper
[junit4:junit4]   2> 117 T1246 oascc.SolrZkClient.makePath makePath: /solr
[junit4:junit4]   2> 121 T1251 oazs.PrepRequestProcessor.pRequest2Txn Processed session termination for sessionid: 0x13cd3a6febb0000
[junit4:junit4]   2> 130 T1253 oaz.ClientCnxn$EventThread.run EventThread shut down
[junit4:junit4]   2> 131 T1248 oazs.NIOServerCnxn.closeSock Closed socket connection for client /140.211.11.196:29322 which had sessionid 0x13cd3a6febb0000
[junit4:junit4]   2> 130 T1246 oaz.ZooKeeper.close Session: 0x13cd3a6febb0000 closed
[junit4:junit4]   2> 132 T1246 oaz.ZooKeeper.<init> Initiating client connection, connectString=127.0.0.1:29321/solr sessionTimeout=10000 watcher=org.apache.solr.common.cloud.ConnectionManager@5bf4ef34
[junit4:junit4]   2> 132 T1246 oascc.ConnectionManager.waitForConnected Waiting for client to connect to ZooKeeper
[junit4:junit4]   2> 133 T1254 oaz.ClientCnxn$SendThread.logStartConnect Opening socket connection to server localhost/127.0.0.1:29321. Will not attempt to authenticate using SASL (access denied ("javax.security.auth.AuthPermission" "getLoginConfiguration"))
[junit4:junit4]   2> 133 T1254 oaz.ClientCnxn$SendThread.primeConnection Socket connection established to localhost/127.0.0.1:29321, initiating session
[junit4:junit4]   2> 134 T1248 oazs.NIOServerCnxnFactory.run Accepted socket connection from /140.211.11.196:29323
[junit4:junit4]   2> 134 T1248 oazs.ZooKeeperServer.processConnectRequest Client attempting to establish new session at /140.211.11.196:29323
[junit4:junit4]   2> 135 T1250 oazs.ZooKeeperServer.finishSessionInit Established session 0x13cd3a6febb0001 with negotiated timeout 10000 for client /140.211.11.196:29323
[junit4:junit4]   2> 135 T1254 oaz.ClientCnxn$SendThread.onConnected Session establishment complete on server localhost/127.0.0.1:29321, sessionid = 0x13cd3a6febb0001, negotiated timeout = 10000
[junit4:junit4]   2> 136 T1255 oascc.ConnectionManager.process Watcher org.apache.solr.common.cloud.ConnectionManager@5bf4ef34 name:ZooKeeperConnection Watcher:127.0.0.1:29321/solr got event WatchedEvent state:SyncConnected type:None path:null path:null type:None
[junit4:junit4]   2> 136 T1246 oascc.ConnectionManager.waitForConnected Client is connected to ZooKeeper
[junit4:junit4]   2> 136 T1246 oascc.SolrZkClient.makePath makePath: /collections/collection1
[junit4:junit4]   2> 141 T1246 oascc.SolrZkClient.makePath makePath: /collections/collection1/shards
[junit4:junit4]   2> 150 T1246 oascc.SolrZkClient.makePath makePath: /collections/control_collection
[junit4:junit4]   2> 153 T1246 oascc.SolrZkClient.makePath makePath: /collections/control_collection/shards
[junit4:junit4]   2> 157 T1246 oasc.AbstractZkTestCase.putConfig put /usr/home/hudson/hudson-slave/workspace/Lucene-Solr-Tests-4.x-java7/solr/build/solr-core/test-files/solr/collection1/conf/solrconfig.xml to /configs/conf1/solrconfig.xml
[junit4:junit4]   2> 158 T1246 oascc.SolrZkClient.makePath makePath: /configs/conf1/solrconfig.xml
[junit4:junit4]   2> 176 T1246 oasc.AbstractZkTestCase.putConfig put /usr/home/hudson/hudson-slave/workspace/Lucene-Solr-Tests-4.x-java7/solr/build/solr-core/test-files/solr/collection1/conf/schema.xml to /configs/conf1/schema.xml
[junit4:junit4]   2> 178 T1246 oascc.SolrZkClient.makePath makePath: /configs/conf1/schema.xml
[junit4:junit4]   2> 283 T1246 oasc.AbstractZkTestCase.putConfig put /usr/home/hudson/hudson-slave/workspace/Lucene-Solr-Tests-4.x-java7/solr/build/solr-core/test-files/solr/collection1/conf/stopwords.txt to /configs/conf1/stopwords.txt
[junit4:junit4]   2> 283 T1246 oascc.SolrZkClient.makePath makePath: /configs/conf1/stopwords.txt
[junit4:junit4]   2> 287 T1246 oasc.AbstractZkTestCase.putConfig put /usr/home/hudson/hudson-slave/workspace/Lucene-Solr-Tests-4.x-java7/solr/build/solr-core/test-files/solr/collection1/conf/protwords.txt to /configs/conf1/protwords.txt
[junit4:junit4]   2> 287 T1246 oascc.SolrZkClient.makePath makePath: /configs/conf1/protwords.txt
[junit4:junit4]   2> 296 T1246 oasc.AbstractZkTestCase.putConfig put /usr/home/hudson/hudson-slave/workspace/Lucene-Solr-Tests-4.x-java7/solr/build/solr-core/test-files/solr/collection1/conf/currency.xml to /configs/conf1/currency.xml
[junit4:junit4]   2> 296 T1246 oascc.SolrZkClient.makePath makePath: /configs/conf1/currency.xml
[junit4:junit4]   2> 300 T1246 oasc.AbstractZkTestCase.putConfig put /usr/home/hudson/hudson-slave/workspace/Lucene-Solr-Tests-4.x-java7/solr/build/solr-core/test-files/solr/collection1/conf/open-exchange-rates.json to /configs/conf1/open-exchange-rates.json
[junit4:junit4]   2> 300 T1246 oascc.SolrZkClient.makePath makePath: /configs/conf1/open-exchange-rates.json
[junit4:junit4]   2> 304 T1246 oasc.AbstractZkTestCase.putConfig put /usr/home/hudson/hudson-slave/workspace/Lucene-Solr-Tests-4.x-java7/solr/build/solr-core/test-files/solr/collection1/conf/mapping-ISOLatin1Accent.txt to /configs/conf1/mapping-ISOLatin1Accent.txt
[junit4:junit4]   2> 305 T1246 oascc.SolrZkClient.makePath makePath: /configs/conf1/mapping-ISOLatin1Accent.txt
[junit4:junit4]   2> 308 T1246 oasc.AbstractZkTestCase.putConfig put /usr/home/hudson/hudson-slave/workspace/Lucene-Solr-Tests-4.x-java7/solr/build/solr-core/test-files/solr/collection1/conf/old_synonyms.txt to /configs/conf1/old_synonyms.txt
[junit4:junit4]   2> 309 T1246 oascc.SolrZkClient.makePath makePath: /configs/conf1/old_synonyms.txt
[junit4:junit4]   2> 312 T1246 oasc.AbstractZkTestCase.putConfig put /usr/home/hudson/hudson-slave/workspace/Lucene-Solr-Tests-4.x-java7/solr/build/solr-core/test-files/solr/collection1/conf/synonyms.txt to /configs/conf1/synonyms.txt
[junit4:junit4]   2> 312 T1246 oascc.SolrZkClient.makePath makePath: /configs/conf1/synonyms.txt
[junit4:junit4]   2> 316 T1251 oazs.PrepRequestProcessor.pRequest2Txn Processed session termination for sessionid: 0x13cd3a6febb0001
[junit4:junit4]   2> 322 T1255 oaz.ClientCnxn$EventThread.run EventThread shut down
[junit4:junit4]   2> 323 T1248 oazs.NIOServerCnxn.closeSock Closed socket connection for client /140.211.11.196:29323 which had sessionid 0x13cd3a6febb0001
[junit4:junit4]   2> 322 T1246 oaz.ZooKeeper.close Session: 0x13cd3a6febb0001 closed
[junit4:junit4]   2> 440 T1246 oejs.Server.doStart jetty-8.1.8.v20121106
[junit4:junit4]   2> 445 T1246 oejs.AbstractConnector.doStart Started SocketConnector@127.0.0.1:29324
[junit4:junit4]   2> 445 T1246 oass.SolrDispatchFilter.init SolrDispatchFilter.init()
[junit4:junit4]   2> 445 T1246 oasc.SolrResourceLoader.locateSolrHome JNDI not configured for solr (NoInitialContextEx)
[junit4:junit4]   2> 446 T1246 oasc.SolrResourceLoader.locateSolrHome using system property solr.solr.home: /usr/home/hudson/hudson-slave/workspace/Lucene-Solr-Tests-4.x-java7/solr/build/solr-core/test/J0/./org.apache.solr.cloud.BasicDistributedZkTest-controljetty-1360760602608
[junit4:junit4]   2> 446 T1246 oasc.CoreContainer$Initializer.initialize looking for solr.xml: /usr/home/hudson/hudson-slave/workspace/Lucene-Solr-Tests-4.x-java7/solr/build/solr-core/test/J0/./org.apache.solr.cloud.BasicDistributedZkTest-controljetty-1360760602608/solr.xml
[junit4:junit4]   2> 446 T1246 oasc.CoreContainer.<init> New CoreContainer 1689360813
[junit4:junit4]   2> 447 T1246 oasc.CoreContainer.load Loading CoreContainer using Solr Home: '/usr/home/hudson/hudson-slave/workspace/Lucene-Solr-Tests-4.x-java7/solr/build/solr-core/test/J0/./org.apache.solr.cloud.BasicDistributedZkTest-controljetty-1360760602608/'
[junit4:junit4]   2> 447 T1246 oasc.SolrResourceLoader.<init> new SolrResourceLoader for directory: '/usr/home/hudson/hudson-slave/workspace/Lucene-Solr-Tests-4.x-java7/solr/build/solr-core/test/J0/./org.apache.solr.cloud.BasicDistributedZkTest-controljetty-1360760602608/'
[junit4:junit4]   2> 486 T1246 oashc.HttpShardHandlerFactory.getParameter Setting socketTimeout to: 60000
[junit4:junit4]   2> 487 T1246 oashc.HttpShardHandlerFactory.getParameter Setting urlScheme to: http://
[junit4:junit4]   2> 487 T1246 oashc.HttpShardHandlerFactory.getParameter Setting connTimeout to: 15000
[junit4:junit4]   2> 487 T1246 oashc.HttpShardHandlerFactory.getParameter Setting maxConnectionsPerHost to: 20
[junit4:junit4]   2> 487 T1246 oashc.HttpShardHandlerFactory.getParameter Setting corePoolSize to: 0
[junit4:junit4]   2> 488 T1246 oashc.HttpShardHandlerFactory.getParameter Setting maximumPoolSize to: 2147483647
[junit4:junit4]   2> 488 T1246 oashc.HttpShardHandlerFactory.getParameter Setting maxThreadIdleTime to: 5
[junit4:junit4]   2> 488 T1246 oashc.HttpShardHandlerFactory.getParameter Setting sizeOfQueue to: -1
[junit4:junit4]   2> 489 T1246 oashc.HttpShardHandlerFactory.getParameter Setting fairnessPolicy to: false
[junit4:junit4]   2> 489 T1246 oascsi.HttpClientUtil.createClient Creating new http client, config:maxConnectionsPerHost=20&maxConnections=10000&socketTimeout=60000&connTimeout=15000&retry=false
[junit4:junit4]   2> 503 T1246 oasc.CoreContainer.load Registering Log Listener
[junit4:junit4]   2> 516 T1246 oasc.CoreContainer.initZooKeeper Zookeeper client=127.0.0.1:29321/solr
[junit4:junit4]   2> 517 T1246 oasc.ZkController.checkChrootPath zkHost includes chroot
[junit4:junit4]   2> 517 T1246 oaz.ZooKeeper.<init> Initiating client connection, connectString=127.0.0.1:29321 sessionTimeout=60000 watcher=org.apache.solr.common.cloud.ConnectionManager@ee29253
[junit4:junit4]   2> 518 T1246 oascc.ConnectionManager.waitForConnected Waiting for client to connect to ZooKeeper
[junit4:junit4]   2> 519 T1265 oaz.ClientCnxn$SendThread.logStartConnect Opening socket connection to server localhost/127.0.0.1:29321. Will not attempt to authenticate using SASL (access denied ("javax.security.auth.AuthPermission" "getLoginConfiguration"))
[junit4:junit4]   2> 519 T1265 oaz.ClientCnxn$SendThread.primeConnection Socket connection established to localhost/127.0.0.1:29321, initiating session
[junit4:junit4]   2> 519 T1248 oazs.NIOServerCnxnFactory.run Accepted socket connection from /140.211.11.196:29325
[junit4:junit4]   2> 520 T1248 oazs.ZooKeeperServer.processConnectRequest Client attempting to establish new session at /140.211.11.196:29325
[junit4:junit4]   2> 526 T1250 oazs.ZooKeeperServer.finishSessionInit Established session 0x13cd3a6febb0002 with negotiated timeout 20000 for client /140.211.11.196:29325
[junit4:junit4]   2> 526 T1265 oaz.ClientCnxn$SendThread.onConnected Session establishment complete on server localhost/127.0.0.1:29321, sessionid = 0x13cd3a6febb0002, negotiated timeout = 20000
[junit4:junit4]   2> 527 T1266 oascc.ConnectionManager.process Watcher org.apache.solr.common.cloud.ConnectionManager@ee29253 name:ZooKeeperConnection Watcher:127.0.0.1:29321 got event WatchedEvent state:SyncConnected type:None path:null path:null type:None
[junit4:junit4]   2> 527 T1246 oascc.ConnectionManager.waitForConnected Client is connected to ZooKeeper
[junit4:junit4]   2> 528 T1251 oazs.PrepRequestProcessor.pRequest2Txn Processed session termination for sessionid: 0x13cd3a6febb0002
[junit4:junit4]   2> 536 T1266 oaz.ClientCnxn$EventThread.run EventThread shut down
[junit4:junit4]   2> 536 T1248 oazs.NIOServerCnxn.closeSock Closed socket connection for client /140.211.11.196:29325 which had sessionid 0x13cd3a6febb0002
[junit4:junit4]   2> 536 T1246 oaz.ZooKeeper.close Session: 0x13cd3a6febb0002 closed
[junit4:junit4]   2> 536 T1246 oascsi.HttpClientUtil.createClient Creating new http client, config:maxConnections=500&maxConnectionsPerHost=16&socketTimeout=60000&connTimeout=15000
[junit4:junit4]   2> 544 T1246 oaz.ZooKeeper.<init> Initiating client connection, connectString=127.0.0.1:29321/solr sessionTimeout=30000 watcher=org.apache.solr.common.cloud.ConnectionManager@7eb9eb95
[junit4:junit4]   2> 545 T1246 oascc.ConnectionManager.waitForConnected Waiting for client to connect to ZooKeeper
[junit4:junit4]   2> 545 T1267 oaz.ClientCnxn$SendThread.logStartConnect Opening socket connection to server localhost/127.0.0.1:29321. Will not attempt to authenticate using SASL (access denied ("javax.security.auth.AuthPermission" "getLoginConfiguration"))
[junit4:junit4]   2> 546 T1267 oaz.ClientCnxn$SendThread.primeConnection Socket connection established to localhost/127.0.0.1:29321, initiating session
[junit4:junit4]   2> 546 T1248 oazs.NIOServerCnxnFactory.run Accepted socket connection from /140.211.11.196:29326
[junit4:junit4]   2> 546 T1248 oazs.ZooKeeperServer.processConnectRequest Client attempting to establish new session at /140.211.11.196:29326
[junit4:junit4]   2> 547 T1250 oazs.ZooKeeperServer.finishSessionInit Established session 0x13cd3a6febb0003 with negotiated timeout 20000 for client /140.211.11.196:29326
[junit4:junit4]   2> 547 T1267 oaz.ClientCnxn$SendThread.onConnected Session establishment complete on server localhost/127.0.0.1:29321, sessionid = 0x13cd3a6febb0003, negotiated timeout = 20000
[junit4:junit4]   2> 547 T1268 oascc.ConnectionManager.process Watcher org.apache.solr.common.cloud.ConnectionManager@7eb9eb95 name:ZooKeeperConnection Watcher:127.0.0.1:29321/solr got event WatchedEvent state:SyncConnected type:None path:null path:null type:None
[junit4:junit4]   2> 548 T1246 oascc.ConnectionManager.waitForConnected Client is connected to ZooKeeper
[junit4:junit4]   2> 550 T1251 oazs.PrepRequestProcessor.pRequest Got user-level KeeperException when processing sessionid:0x13cd3a6febb0003 type:create cxid:0x2 zxid:0x1a txntype:-1 reqpath:n/a Error Path:/solr/overseer Error:KeeperErrorCode = NodeExists for /solr/overseer
[junit4:junit4]   2> 558 T1246 oascc.SolrZkClient.makePath makePath: /live_nodes
[junit4:junit4]   2> 561 T1246 oasc.ZkController.createEphemeralLiveNode Register node as live in ZooKeeper:/live_nodes/127.0.0.1:29324_jc
[junit4:junit4]   2> 561 T1251 oazs.PrepRequestProcessor.pRequest Got user-level KeeperException when processing sessionid:0x13cd3a6febb0003 type:delete cxid:0x8 zxid:0x1c txntype:-1 reqpath:n/a Error Path:/solr/live_nodes/127.0.0.1:29324_jc Error:KeeperErrorCode = NoNode for /solr/live_nodes/127.0.0.1:29324_jc
[junit4:junit4]   2> 562 T1246 oascc.SolrZkClient.makePath makePath: /live_nodes/127.0.0.1:29324_jc
[junit4:junit4]   2> 572 T1246 oascc.SolrZkClient.makePath makePath: /overseer_elect/election
[junit4:junit4]   2> 584 T1251 oazs.PrepRequestProcessor.pRequest Got user-level KeeperException when processing sessionid:0x13cd3a6febb0003 type:delete cxid:0x16 zxid:0x21 txntype:-1 reqpath:n/a Error Path:/solr/overseer_elect/leader Error:KeeperErrorCode = NoNode for /solr/overseer_elect/leader
[junit4:junit4]   2> 585 T1246 oascc.SolrZkClient.makePath makePath: /overseer_elect/leader
[junit4:junit4]   2> 596 T1246 oasc.Overseer.start Overseer (id=89178806832267267-127.0.0.1:29324_jc-n_0000000000) starting
[junit4:junit4]   2> 597 T1251 oazs.PrepRequestProcessor.pRequest Got user-level KeeperException when processing sessionid:0x13cd3a6febb0003 type:create cxid:0x1b zxid:0x23 txntype:-1 reqpath:n/a Error Path:/solr/overseer Error:KeeperErrorCode = NodeExists for /solr/overseer
[junit4:junit4]   2> 598 T1251 oazs.PrepRequestProcessor.pRequest Got user-level KeeperException when processing sessionid:0x13cd3a6febb0003 type:create cxid:0x1c zxid:0x24 txntype:-1 reqpath:n/a Error Path:/solr/overseer Error:KeeperErrorCode = NodeExists for /solr/overseer
[junit4:junit4]   2> 599 T1251 oazs.PrepRequestProcessor.pRequest Got user-level KeeperException when processing sessionid:0x13cd3a6febb0003 type:create cxid:0x1d zxid:0x25 txntype:-1 reqpath:n/a Error Path:/solr/overseer Error:KeeperErrorCode = NodeExists for /solr/overseer
[junit4:junit4]   2> 608 T1251 oazs.PrepRequestProcessor.pRequest Got user-level KeeperException when processing sessionid:0x13cd3a6febb0003 type:create cxid:0x1e zxid:0x26 txntype:-1 reqpath:n/a Error Path:/solr/overseer Error:KeeperErrorCode = NodeExists for /solr/overseer
[junit4:junit4]   2> 609 T1270 oasc.OverseerCollectionProcessor.run Process current queue of collection creations
[junit4:junit4]   2> 610 T1246 oascc.SolrZkClient.makePath makePath: /clusterstate.json
[junit4:junit4]   2> 613 T1246 oascc.ZkStateReader.createClusterStateWatchersAndUpdate Updating cluster state from ZooKeeper... 
[junit4:junit4]   2> 615 T1269 oasc.Overseer$ClusterStateUpdater.run Starting to work on the main queue
[junit4:junit4]   2> 618 T1271 oasc.CoreContainer.create Creating SolrCore 'collection1' using instanceDir: /usr/home/hudson/hudson-slave/workspace/Lucene-Solr-Tests-4.x-java7/solr/build/solr-core/test/J0/./org.apache.solr.cloud.BasicDistributedZkTest-controljetty-1360760602608/collection1
[junit4:junit4]   2> 619 T1271 oasc.ZkController.createCollectionZkNode Check for collection zkNode:control_collection
[junit4:junit4]   2> 619 T1271 oasc.ZkController.createCollectionZkNode Collection zkNode exists
[junit4:junit4]   2> 620 T1271 oasc.ZkController.readConfigName Load collection config from:/collections/control_collection
[junit4:junit4]   2> 621 T1271 oasc.SolrResourceLoader.<init> new SolrResourceLoader for directory: '/usr/home/hudson/hudson-slave/workspace/Lucene-Solr-Tests-4.x-java7/solr/build/solr-core/test/J0/./org.apache.solr.cloud.BasicDistributedZkTest-controljetty-1360760602608/collection1/'
[junit4:junit4]   2> 622 T1271 oasc.SolrResourceLoader.replaceClassLoader Adding 'file:/usr/home/hudson/hudson-slave/workspace/Lucene-Solr-Tests-4.x-java7/solr/build/solr-core/test/J0/org.apache.solr.cloud.BasicDistributedZkTest-controljetty-1360760602608/collection1/lib/README' to classloader
[junit4:junit4]   2> 623 T1271 oasc.SolrResourceLoader.replaceClassLoader Adding 'file:/usr/home/hudson/hudson-slave/workspace/Lucene-Solr-Tests-4.x-java7/solr/build/solr-core/test/J0/org.apache.solr.cloud.BasicDistributedZkTest-controljetty-1360760602608/collection1/lib/classes/' to classloader
[junit4:junit4]   2> 679 T1271 oasc.SolrConfig.<init> Using Lucene MatchVersion: LUCENE_42
[junit4:junit4]   2> 751 T1271 oasc.SolrConfig.<init> Loaded SolrConfig: solrconfig.xml
[junit4:junit4]   2> 852 T1271 oass.IndexSchema.readSchema Reading Solr Schema
[junit4:junit4]   2> 861 T1271 oass.IndexSchema.readSchema Schema name=test
[junit4:junit4]   2> 1372 T1271 oass.OpenExchangeRatesOrgProvider.init Initialized with rates=open-exchange-rates.json, refreshInterval=1440.
[junit4:junit4]   2> 1385 T1271 oass.IndexSchema.readSchema default search field in schema is text
[junit4:junit4]   2> 1389 T1271 oass.IndexSchema.readSchema unique key field: id
[junit4:junit4]   2> 1406 T1271 oass.FileExchangeRateProvider.reload Reloading exchange rates from file currency.xml
[junit4:junit4]   2> 1411 T1271 oass.FileExchangeRateProvider.reload Reloading exchange rates from file currency.xml
[junit4:junit4]   2> 1416 T1271 oass.OpenExchangeRatesOrgProvider.reload Reloading exchange rates from open-exchange-rates.json
[junit4:junit4]   2> 1418 T1271 oass.OpenExchangeRatesOrgProvider.reload Reloading exchange rates from open-exchange-rates.json
[junit4:junit4]   2> 1420 T1271 oasc.SolrCore.<init> [collection1] Opening new SolrCore at /usr/home/hudson/hudson-slave/workspace/Lucene-Solr-Tests-4.x-java7/solr/build/solr-core/test/J0/./org.apache.solr.cloud.BasicDistributedZkTest-controljetty-1360760602608/collection1/, dataDir=./org.apache.solr.cloud.BasicDistributedZkTest-1360760602291/control/data/
[junit4:junit4]   2> 1420 T1271 oasc.JmxMonitoredMap.<init> JMX monitoring is enabled. Adding Solr mbeans to JMX Server: com.sun.jmx.mbeanserver.JmxMBeanServer@79613135
[junit4:junit4]   2> 1420 T1271 oasc.SolrCore.initDirectoryFactory solr.NRTCachingDirectoryFactory
[junit4:junit4]   2> 1422 T1271 oasc.CachingDirectoryFactory.get return new directory for /usr/home/hudson/hudson-slave/workspace/Lucene-Solr-Tests-4.x-java7/solr/build/solr-core/test/J0/./org.apache.solr.cloud.BasicDistributedZkTest-1360760602291/control/data forceNew:false
[junit4:junit4]   2> 1422 T1271 oasc.CachingDirectoryFactory.close Releasing directory:/usr/home/hudson/hudson-slave/workspace/Lucene-Solr-Tests-4.x-java7/solr/build/solr-core/test/J0/./org.apache.solr.cloud.BasicDistributedZkTest-1360760602291/control/data
[junit4:junit4]   2> 1423 T1271 oasc.SolrCore.getNewIndexDir New index directory detected: old=null new=./org.apache.solr.cloud.BasicDistributedZkTest-1360760602291/control/data/index/
[junit4:junit4]   2> 1423 T1271 oasc.SolrCore.initIndex WARNING [collection1] Solr index directory './org.apache.solr.cloud.BasicDistributedZkTest-1360760602291/control/data/index' doesn't exist. Creating new index...
[junit4:junit4]   2> 1425 T1271 oasc.CachingDirectoryFactory.get return new directory for /usr/home/hudson/hudson-slave/workspace/Lucene-Solr-Tests-4.x-java7/solr/build/solr-core/test/J0/./org.apache.solr.cloud.BasicDistributedZkTest-1360760602291/control/data/index forceNew:false
[junit4:junit4]   2> 1432 T1271 oasc.SolrDeletionPolicy.onCommit SolrDeletionPolicy.onCommit: commits:num=1
[junit4:junit4]   2> 		commit{dir=RateLimitedDirectoryWrapper(NRTCachingDirectory(org.apache.lucene.store.NIOFSDirectory@/usr/home/hudson/hudson-slave/workspace/Lucene-Solr-Tests-4.x-java7/solr/build/solr-core/test/J0/org.apache.solr.cloud.BasicDistributedZkTest-1360760602291/control/data/index lockFactory=org.apache.lucene.store.NativeFSLockFactory@a88975b; maxCacheMB=48.0 maxMergeSizeMB=4.0)),segFN=segments_1,generation=1,filenames=[segments_1]
[junit4:junit4]   2> 1432 T1271 oasc.SolrDeletionPolicy.updateCommits newest commit = 1[segments_1]
[junit4:junit4]   2> 1433 T1271 oasc.CachingDirectoryFactory.close Releasing directory:/usr/home/hudson/hudson-slave/workspace/Lucene-Solr-Tests-4.x-java7/solr/build/solr-core/test/J0/./org.apache.solr.cloud.BasicDistributedZkTest-1360760602291/control/data/index
[junit4:junit4]   2> 1434 T1271 oasc.SolrCore.initWriters created xml: solr.XMLResponseWriter
[junit4:junit4]   2> 1436 T1271 oasup.UpdateRequestProcessorChain.init inserting DistributedUpdateProcessorFactory into updateRequestProcessorChain "dedupe"
[junit4:junit4]   2> 1436 T1271 oasup.UpdateRequestProcessorChain.init inserting DistributedUpdateProcessorFactory into updateRequestProcessorChain "dedupe-allfields"
[junit4:junit4]   2> 1436 T1271 oasup.UpdateRequestProcessorChain.init inserting DistributedUpdateProcessorFactory into updateRequestProcessorChain "stored_sig"
[junit4:junit4]   2> 1437 T1271 oasup.UpdateRequestProcessorChain.init inserting DistributedUpdateProcessorFactory into updateRequestProcessorChain "uniq-fields"
[junit4:junit4]   2> 1437 T1271 oasup.UpdateRequestProcessorChain.init inserting DistributedUpdateProcessorFactory into updateRequestProcessorChain "distrib-dup-test-chain-implicit"
[junit4:junit4]   2> 1438 T1271 oasc.RequestHandlers.initHandlersFromConfig adding lazy requestHandler: solr.ReplicationHandler
[junit4:junit4]   2> 1438 T1271 oasc.RequestHandlers.initHandlersFromConfig created /replication: solr.ReplicationHandler
[junit4:junit4]   2> 1439 T1271 oasc.RequestHandlers.initHandlersFromConfig created standard: solr.StandardRequestHandler
[junit4:junit4]   2> 1439 T1271 oasc.RequestHandlers.initHandlersFromConfig created /get: solr.RealTimeGetHandler
[junit4:junit4]   2> 1440 T1271 oasc.RequestHandlers.initHandlersFromConfig created dismax: solr.SearchHandler
[junit4:junit4]   2> 1440 T1271 oasc.RequestHandlers.initHandlersFromConfig created mock: org.apache.solr.core.MockQuerySenderListenerReqHandler
[junit4:junit4]   2> 1440 T1271 oasc.RequestHandlers.initHandlersFromConfig created /admin/: org.apache.solr.handler.admin.AdminHandlers
[junit4:junit4]   2> 1441 T1271 oasc.RequestHandlers.initHandlersFromConfig created defaults: solr.StandardRequestHandler
[junit4:junit4]   2> 1441 T1271 oasc.RequestHandlers.initHandlersFromConfig adding lazy requestHandler: solr.StandardRequestHandler
[junit4:junit4]   2> 1441 T1271 oasc.RequestHandlers.initHandlersFromConfig created lazy: solr.StandardRequestHandler
[junit4:junit4]   2> 1442 T1271 oasc.RequestHandlers.initHandlersFromConfig created /update: solr.UpdateRequestHandler
[junit4:junit4]   2> 1442 T1271 oasc.RequestHandlers.initHandlersFromConfig created /terms: org.apache.solr.handler.component.SearchHandler
[junit4:junit4]   2> 1443 T1271 oasc.RequestHandlers.initHandlersFromConfig created spellCheckCompRH: org.apache.solr.handler.component.SearchHandler
[junit4:junit4]   2> 1443 T1271 oasc.RequestHandlers.initHandlersFromConfig created spellCheckCompRH_Direct: org.apache.solr.handler.component.SearchHandler
[junit4:junit4]   2> 1444 T1271 oasc.RequestHandlers.initHandlersFromConfig created spellCheckWithWordbreak: org.apache.solr.handler.component.SearchHandler
[junit4:junit4]   2> 1444 T1271 oasc.RequestHandlers.initHandlersFromConfig created spellCheckWithWordbreak_Direct: org.apache.solr.handler.component.SearchHandler
[junit4:junit4]   2> 1445 T1271 oasc.RequestHandlers.initHandlersFromConfig created spellCheckCompRH1: org.apache.solr.handler.component.SearchHandler
[junit4:junit4]   2> 1445 T1271 oasc.RequestHandlers.initHandlersFromConfig created mltrh: org.apache.solr.handler.component.SearchHandler
[junit4:junit4]   2> 1446 T1271 oasc.RequestHandlers.initHandlersFromConfig created tvrh: org.apache.solr.handler.component.SearchHandler
[junit4:junit4]   2> 1446 T1271 oasc.RequestHandlers.initHandlersFromConfig created /mlt: solr.MoreLikeThisHandler
[junit4:junit4]   2> 1447 T1271 oasc.RequestHandlers.initHandlersFromConfig created /debug/dump: solr.DumpRequestHandler
[junit4:junit4]   2> 1468 T1271 oashl.XMLLoader.init xsltCacheLifetimeSeconds=60
[junit4:junit4]   2> 1473 T1271 oasc.SolrCore.initDeprecatedSupport WARNING solrconfig.xml uses deprecated <admin/gettableFiles>, Please update your config to use the ShowFileRequestHandler.
[junit4:junit4]   2> 1475 T1271 oasc.SolrCore.initDeprecatedSupport WARNING adding ShowFileRequestHandler with hidden files: [SCHEMA.XML, OLD_SYNONYMS.TXT, STOPWORDS.TXT, PROTWORDS.TXT, OPEN-EXCHANGE-RATES.JSON, SYNONYMS.TXT, CURRENCY.XML, MAPPING-ISOLATIN1ACCENT.TXT]
[junit4:junit4]   2> 1478 T1271 oasc.CachingDirectoryFactory.close Releasing directory:/usr/home/hudson/hudson-slave/workspace/Lucene-Solr-Tests-4.x-java7/solr/build/solr-core/test/J0/./org.apache.solr.cloud.BasicDistributedZkTest-1360760602291/control/data
[junit4:junit4]   2> 1479 T1271 oass.SolrIndexSearcher.<init> Opening Searcher@1e5b1bea main
[junit4:junit4]   2> 1481 T1271 oasu.CommitTracker.<init> Hard AutoCommit: disabled
[junit4:junit4]   2> 1481 T1271 oasu.CommitTracker.<init> Soft AutoCommit: disabled
[junit4:junit4]   2> 1481 T1271 oashc.SpellCheckComponent.inform Initializing spell checkers
[junit4:junit4]   2> 1490 T1271 oass.DirectSolrSpellChecker.init init: {name=direct,classname=DirectSolrSpellChecker,field=lowerfilt,minQueryLength=3}
[junit4:junit4]   2> 1547 T1272 oasc.SolrCore.registerSearcher [collection1] Registered new searcher Searcher@1e5b1bea main{StandardDirectoryReader(segments_1:1)}
[junit4:junit4]   2> 1553 T1271 oasc.ZkController.publish publishing core=collection1 state=down
[junit4:junit4]   2> 1553 T1271 oasc.ZkController.publish numShards not found on descriptor - reading it from system property
[junit4:junit4]   2> 1554 T1251 oazs.PrepRequestProcessor.pRequest Got user-level KeeperException when processing sessionid:0x13cd3a6febb0003 type:create cxid:0x51 zxid:0x29 txntype:-1 reqpath:n/a Error Path:/solr/overseer/queue Error:KeeperErrorCode = NoNode for /solr/overseer/queue
[junit4:junit4]   2> 2119 T1269 oascc.ZkStateReader.updateClusterState Updating cloud state from ZooKeeper... 
[junit4:junit4]   2> 2120 T1269 oasc.Overseer$ClusterStateUpdater.updateState Update state numShards=1 message={
[junit4:junit4]   2> 	  "operation":"state",
[junit4:junit4]   2> 	  "numShards":"1",
[junit4:junit4]   2> 	  "shard":null,
[junit4:junit4]   2> 	  "roles":null,
[junit4:junit4]   2> 	  "state":"down",
[junit4:junit4]   2> 	  "core":"collection1",
[junit4:junit4]   2> 	  "collection":"control_collection",
[junit4:junit4]   2> 	  "node_name":"127.0.0.1:29324_jc",
[junit4:junit4]   2> 	  "base_url":"http://127.0.0.1:29324/jc"}
[junit4:junit4]   2> 2120 T1269 oasc.Overseer$ClusterStateUpdater.createCollection Create collection control_collection with numShards 1
[junit4:junit4]   2> 2120 T1269 oasc.Overseer$ClusterStateUpdater.updateState Assigning new node to shard shard=shard1
[junit4:junit4]   2> 2121 T1251 oazs.PrepRequestProcessor.pRequest Got user-level KeeperException when processing sessionid:0x13cd3a6febb0003 type:create cxid:0x59 zxid:0x2c txntype:-1 reqpath:n/a Error Path:/solr/overseer/queue-work Error:KeeperErrorCode = NoNode for /solr/overseer/queue-work
[junit4:junit4]   2> 2138 T1268 oascc.ZkStateReader$2.process A cluster state change: WatchedEvent state:SyncConnected type:NodeDataChanged path:/clusterstate.json, has occurred - updating... (live nodes size: 1)
[junit4:junit4]   2> 2567 T1271 oasc.CoreContainer.registerCore registering core: collection1
[junit4:junit4]   2> 2567 T1271 oasc.ZkController.register Register replica - core:collection1 address:http://127.0.0.1:29324/jc collection:control_collection shard:shard1
[junit4:junit4]   2> 2578 T1271 oascc.SolrZkClient.makePath makePath: /collections/control_collection/leader_elect/shard1/election
[junit4:junit4]   2> 2597 T1251 oazs.PrepRequestProcessor.pRequest Got user-level KeeperException when processing sessionid:0x13cd3a6febb0003 type:delete cxid:0x73 zxid:0x36 txntype:-1 reqpath:n/a Error Path:/solr/collections/control_collection/leaders Error:KeeperErrorCode = NoNode for /solr/collections/control_collection/leaders
[junit4:junit4]   2> 2599 T1271 oasc.ShardLeaderElectionContext.runLeaderProcess Running the leader process.
[junit4:junit4]   2> 2601 T1251 oazs.PrepRequestProcessor.pRequest Got user-level KeeperException when processing sessionid:0x13cd3a6febb0003 type:create cxid:0x74 zxid:0x37 txntype:-1 reqpath:n/a Error Path:/solr/overseer Error:KeeperErrorCode = NodeExists for /solr/overseer
[junit4:junit4]   2> 2611 T1271 oasc.ShardLeaderElectionContext.waitForReplicasToComeUp Enough replicas found to continue.
[junit4:junit4]   2> 2612 T1271 oasc.ShardLeaderElectionContext.runLeaderProcess I may be the new leader - try and sync
[junit4:junit4]   2> 2612 T1271 oasc.SyncStrategy.sync Sync replicas to http://127.0.0.1:29324/jc/collection1/
[junit4:junit4]   2> 2612 T1271 oasc.SyncStrategy.syncReplicas Sync Success - now sync replicas to me
[junit4:junit4]   2> 2613 T1271 oasc.SyncStrategy.syncToMe http://127.0.0.1:29324/jc/collection1/ has no replicas
[junit4:junit4]   2> 2613 T1271 oasc.ShardLeaderElectionContext.runLeaderProcess I am the new leader: http://127.0.0.1:29324/jc/collection1/
[junit4:junit4]   2> 2613 T1271 oascc.SolrZkClient.makePath makePath: /collections/control_collection/leaders/shard1
[junit4:junit4]   2> 2620 T1251 oazs.PrepRequestProcessor.pRequest Got user-level KeeperException when processing sessionid:0x13cd3a6febb0003 type:create cxid:0x7e zxid:0x3b txntype:-1 reqpath:n/a Error Path:/solr/overseer Error:KeeperErrorCode = NodeExists for /solr/overseer
[junit4:junit4]   2> 3644 T1269 oascc.ZkStateReader.updateClusterState Updating cloud state from ZooKeeper... 
[junit4:junit4]   2> 3679 T1268 oascc.ZkStateReader$2.process A cluster state change: WatchedEvent state:SyncConnected type:NodeDataChanged path:/clusterstate.json, has occurred - updating... (live nodes size: 1)
[junit4:junit4]   2> 3694 T1271 oasc.ZkController.register We are http://127.0.0.1:29324/jc/collection1/ and leader is http://127.0.0.1:29324/jc/collection1/
[junit4:junit4]   2> 3694 T1271 oasc.ZkController.register No LogReplay needed for core=collection1 baseURL=http://127.0.0.1:29324/jc
[junit4:junit4]   2> 3694 T1271 oasc.ZkController.checkRecovery I am the leader, no recovery necessary
[junit4:junit4]   2> 3694 T1271 oasc.ZkController.publish publishing core=collection1 state=active
[junit4:junit4]   2> 3695 T1271 oasc.ZkController.publish numShards not found on descriptor - reading it from system property
[junit4:junit4]   2> 3697 T1271 oascc.ZkStateReader.updateClusterState Updating cloud state from ZooKeeper... 
[junit4:junit4]   2> 3699 T1246 oass.SolrDispatchFilter.init user.dir=/usr/home/hudson/hudson-slave/workspace/Lucene-Solr-Tests-4.x-java7/solr/build/solr-core/test/J0
[junit4:junit4]   2> 3700 T1246 oass.SolrDispatchFilter.init SolrDispatchFilter.init() done
[junit4:junit4]   2> 3701 T1246 oascsi.HttpClientUtil.createClient Creating new http client, config:maxConnections=128&maxConnectionsPerHost=32&followRedirects=false
[junit4:junit4]   2> 3716 T1246 oascsi.HttpClientUtil.createClient Creating new http client, config:
[junit4:junit4]   2> 3727 T1246 oaz.ZooKeeper.<init> Initiating client connection, connectString=127.0.0.1:29321/solr sessionTimeout=10000 watcher=org.apache.solr.common.cloud.ConnectionManager@23be0492
[junit4:junit4]   2> 3729 T1246 oascc.ConnectionManager.waitForConnected Waiting for client to connect to ZooKeeper
[junit4:junit4]   2> 3729 T1273 oaz.ClientCnxn$SendThread.logStartConnect Opening socket connection to server localhost/127.0.0.1:29321. Will not attempt to authenticate using SASL (access denied ("javax.security.auth.AuthPermission" "getLoginConfiguration"))
[junit4:junit4]   2> 3729 T1273 oaz.ClientCnxn$SendThread.primeConnection Socket connection established to localhost/127.0.0.1:29321, initiating session
[junit4:junit4]   2> 3730 T1248 oazs.NIOServerCnxnFactory.run Accepted socket connection from /140.211.11.196:29334
[junit4:junit4]   2> 3730 T1248 oazs.ZooKeeperServer.processConnectRequest Client attempting to establish new session at /140.211.11.196:29334
[junit4:junit4]   2> 3732 T1250 oazs.ZooKeeperServer.finishSessionInit Established session 0x13cd3a6febb0004 with negotiated timeout 10000 for client /140.211.11.196:29334
[junit4:junit4]   2> 3732 T1273 oaz.ClientCnxn$SendThread.onConnected Session establishment complete on server localhost/127.0.0.1:29321, sessionid = 0x13cd3a6febb0004, negotiated timeout = 10000
[junit4:junit4]   2> 3732 T1274 oascc.ConnectionManager.process Watcher org.apache.solr.common.cloud.ConnectionManager@23be0492 name:ZooKeeperConnection Watcher:127.0.0.1:29321/solr got event WatchedEvent state:SyncConnected type:None path:null path:null type:None
[junit4:junit4]   2> 3732 T1246 oascc.ConnectionManager.waitForConnected Client is connected to ZooKeeper
[junit4:junit4]   2> 3734 T1246 oascc.ZkStateReader.createClusterStateWatchersAndUpdate Updating cluster state from ZooKeeper... 
[junit4:junit4]   2> 3736 T1246 oasc.ChaosMonkey.monkeyLog monkey: init - expire sessions:true cause connection loss:true
[junit4:junit4]   2> 3907 T1246 oejs.Server.doStart jetty-8.1.8.v20121106
[junit4:junit4]   2> 3910 T1246 oejs.AbstractConnector.doStart Started SocketConnector@127.0.0.1:29335
[junit4:junit4]   2> 3911 T1246 oass.SolrDispatchFilter.init SolrDispatchFilter.init()
[junit4:junit4]   2> 3911 T1246 oasc.SolrResourceLoader.locateSolrHome JNDI not configured for solr (NoInitialContextEx)
[junit4:junit4]   2> 3912 T1246 oasc.SolrResourceLoader.locateSolrHome using system property solr.solr.home: /usr/home/hudson/hudson-slave/workspace/Lucene-Solr-Tests-4.x-java7/solr/build/solr-core/test/J0/./org.apache.solr.cloud.BasicDistributedZkTest-jetty1-1360760606021
[junit4:junit4]   2> 3912 T1246 oasc.CoreContainer$Initializer.initialize looking for solr.xml: /usr/home/hudson/hudson-slave/workspace/Lucene-Solr-Tests-4.x-java7/solr/build/solr-core/test/J0/./org.apache.solr.cloud.BasicDistributedZkTest-jetty1-1360760606021/solr.xml
[junit4:junit4]   2> 3912 T1246 oasc.CoreContainer.<init> New CoreContainer 1015411738
[junit4:junit4]   2> 3913 T1246 oasc.CoreContainer.load Loading CoreContainer using Solr Home: '/usr/home/hudson/hudson-slave/workspace/Lucene-Solr-Tests-4.x-java7/solr/build/solr-core/test/J0/./org.apache.solr.cloud.BasicDistributedZkTest-jetty1-1360760606021/'
[junit4:junit4]   2> 3914 T1246 oasc.SolrResourceLoader.<init> new SolrResourceLoader for directory: '/usr/home/hudson/hudson-slave/workspace/Lucene-Solr-Tests-4.x-java7/solr/build/solr-core/test/J0/./org.apache.solr.cloud.BasicDistributedZkTest-jetty1-1360760606021/'
[junit4:junit4]   2> 3973 T1246 oashc.HttpShardHandlerFactory.getParameter Setting socketTimeout to: 60000
[junit4:junit4]   2> 3974 T1246 oashc.HttpShardHandlerFactory.getParameter Setting urlScheme to: http://
[junit4:junit4]   2> 3974 T1246 oashc.HttpShardHandlerFactory.getParameter Setting connTimeout to: 15000
[junit4:junit4]   2> 3975 T1246 oashc.HttpShardHandlerFactory.getParameter Setting maxConnectionsPerHost to: 20
[junit4:junit4]   2> 3975 T1246 oashc.HttpShardHandlerFactory.getParameter Setting corePoolSize to: 0
[junit4:junit4]   2> 3976 T1246 oashc.HttpShardHandlerFactory.getParameter Setting maximumPoolSize to: 2147483647
[junit4:junit4]   2> 3976 T1246 oashc.HttpShardHandlerFactory.getParameter Setting maxThreadIdleTime to: 5
[junit4:junit4]   2> 3977 T1246 oashc.HttpShardHandlerFactory.getParameter Setting sizeOfQueue to: -1
[junit4:junit4]   2> 3977 T1246 oashc.HttpShardHandlerFactory.getParameter Setting fairnessPolicy to: false
[junit4:junit4]   2> 3978 T1246 oascsi.HttpClientUtil.createClient Creating new http client, config:maxConnectionsPerHost=20&maxConnections=10000&socketTimeout=60000&connTimeout=15000&retry=false
[junit4:junit4]   2> 3999 T1246 oasc.CoreContainer.load Registering Log Listener
[junit4:junit4]   2> 4018 T1246 oasc.CoreContainer.initZooKeeper Zookeeper client=127.0.0.1:29321/solr
[junit4:junit4]   2> 4019 T1246 oasc.ZkController.checkChrootPath zkHost includes chroot
[junit4:junit4]   2> 4020 T1246 oaz.ZooKeeper.<init> Initiating client connection, connectString=127.0.0.1:29321 sessionTimeout=60000 watcher=org.apache.solr.common.cloud.ConnectionManager@51ef1636
[junit4:junit4]   2> 4021 T1246 oascc.ConnectionManager.waitForConnected Waiting for client to connect to ZooKeeper
[junit4:junit4]   2> 4021 T1284 oaz.ClientCnxn$SendThread.logStartConnect Opening socket connection to server localhost/127.0.0.1:29321. Will not attempt to authenticate using SASL (access denied ("javax.security.auth.AuthPermission" "getLoginConfiguration"))
[junit4:junit4]   2> 4022 T1284 oaz.ClientCnxn$SendThread.primeConnection Socket connection established to localhost/127.0.0.1:29321, initiating session
[junit4:junit4]   2> 4022 T1248 oazs.NIOServerCnxnFactory.run Accepted socket connection from /140.211.11.196:29336
[junit4:junit4]   2> 4023 T1248 oazs.ZooKeeperServer.processConnectRequest Client attempting to establish new session at /140.211.11.196:29336
[junit4:junit4]   2> 4025 T1250 oazs.ZooKeeperServer.finishSessionInit Established session 0x13cd3a6febb0005 with negotiated timeout 20000 for client /140.211.11.196:29336
[junit4:junit4]   2> 4025 T1284 oaz.ClientCnxn$SendThread.onConnected Session establishment complete on server localhost/127.0.0.1:29321, sessionid = 0x13cd3a6febb0005, negotiated timeout = 20000
[junit4:junit4]   2> 4025 T1285 oascc.ConnectionManager.process Watcher org.apache.solr.common.cloud.ConnectionManager@51ef1636 name:ZooKeeperConnection Watcher:127.0.0.1:29321 got event WatchedEvent state:SyncConnected type:None path:null path:null type:None
[junit4:junit4]   2> 4025 T1246 oascc.ConnectionManager.waitForConnected Client is connected to ZooKeeper
[junit4:junit4]   2> 4027 T1251 oazs.PrepRequestProcessor.pRequest2Txn Processed session termination for sessionid: 0x13cd3a6febb0005
[junit4:junit4]   2> 4034 T1285 oaz.ClientCnxn$EventThread.run EventThread shut down
[junit4:junit4]   2> 4034 T1248 oazs.NIOServerCnxn.closeSock Closed socket connection for client /140.211.11.196:29336 which had sessionid 0x13cd3a6febb0005
[junit4:junit4]   2> 4034 T1246 oaz.ZooKeeper.close Session: 0x13cd3a6febb0005 closed
[junit4:junit4]   2> 4035 T1246 oascsi.HttpClientUtil.createClient Creating new http client, config:maxConnections=500&maxConnectionsPerHost=16&socketTimeout=60000&connTimeout=15000
[junit4:junit4]   2> 4046 T1246 oaz.ZooKeeper.<init> Initiating client connection, connectString=127.0.0.1:29321/solr sessionTimeout=30000 watcher=org.apache.solr.common.cloud.ConnectionManager@384c9c8a
[junit4:junit4]   2> 4047 T1246 oascc.ConnectionManager.waitForConnected Waiting for client to connect to ZooKeeper
[junit4:junit4]   2> 4048 T1286 oaz.ClientCnxn$SendThread.logStartConnect Opening socket connection to server localhost/127.0.0.1:29321. Will not attempt to authenticate using SASL (access denied ("javax.security.auth.AuthPermission" "getLoginConfiguration"))
[junit4:junit4]   2> 4048 T1286 oaz.ClientCnxn$SendThread.primeConnection Socket connection established to localhost/127.0.0.1:29321, initiating session
[junit4:junit4]   2> 4048 T1248 oazs.NIOServerCnxnFactory.run Accepted socket connection from /140.211.11.196:29337
[junit4:junit4]   2> 4049 T1248 oazs.ZooKeeperServer.processConnectRequest Client attempting to establish new session at /140.211.11.196:29337
[junit4:junit4]   2> 4051 T1250 oazs.ZooKeeperServer.finishSessionInit Established session 0x13cd3a6febb0006 with negotiated timeout 20000 for client /140.211.11.196:29337
[junit4:junit4]   2> 4051 T1286 oaz.ClientCnxn$SendThread.onConnected Session establishment complete on server localhost/127.0.0.1:29321, sessionid = 0x13cd3a6febb0006, negotiated timeout = 20000
[junit4:junit4]   2> 4052 T1287 oascc.ConnectionManager.process Watcher org.apache.solr.common.cloud.ConnectionManager@384c9c8a name:ZooKeeperConnection Watcher:127.0.0.1:29321/solr got event WatchedEvent state:SyncConnected type:None path:null path:null type:None
[junit4:junit4]   2> 4052 T1246 oascc.ConnectionManager.waitForConnected Client is connected to ZooKeeper
[junit4:junit4]   2> 4054 T1251 oazs.PrepRequestProcessor.pRequest Got user-level KeeperException when processing sessionid:0x13cd3a6febb0006 type:create cxid:0x1 zxid:0x49 txntype:-1 reqpath:n/a Error Path:/solr/overseer Error:KeeperErrorCode = NodeExists for /solr/overseer
[junit4:junit4]   2> 4056 T1251 oazs.PrepRequestProcessor.pRequest Got user-level KeeperException when processing sessionid:0x13cd3a6febb0006 type:create cxid:0x2 zxid:0x4a txntype:-1 reqpath:n/a Error Path:/solr/overseer Error:KeeperErrorCode = NodeExists for /solr/overseer
[junit4:junit4]   2> 4058 T1246 oascc.ZkStateReader.createClusterStateWatchersAndUpdate Updating cluster state from ZooKeeper... 
[junit4:junit4]   2> 4061 T1246 oasc.ZkController.createEphemeralLiveNode Register node as live in ZooKeeper:/live_nodes/127.0.0.1:29335_jc
[junit4:junit4]   2> 4062 T1251 oazs.PrepRequestProcessor.pRequest Got user-level KeeperException when processing sessionid:0x13cd3a6febb0006 type:delete cxid:0x9 zxid:0x4b txntype:-1 reqpath:n/a Error Path:/solr/live_nodes/127.0.0.1:29335_jc Error:KeeperErrorCode = NoNode for /solr/live_nodes/127.0.0.1:29335_jc
[junit4:junit4]   2> 4063 T1246 oascc.SolrZkClient.makePath makePath: /live_nodes/127.0.0.1:29335_jc
[junit4:junit4]   2> 4067 T1287 oascc.ZkStateReader$3.process Updating live nodes... (2)
[junit4:junit4]   2> 4067 T1268 oascc.ZkStateReader$3.process Updating live nodes... (2)
[junit4:junit4]   2> 4067 T1274 oascc.ZkStateReader$3.process Updating live nodes... (2)
[junit4:junit4]   2> 4067 T1268 oascc.ZkStateReader$2.process A cluster state change: WatchedEvent state:SyncConnected type:NodeChildrenChanged path:/live_nodes, has occurred - updating... (live nodes size: 2)
[junit4:junit4]   2> 4078 T1288 oasc.CoreContainer.create Creating SolrCore 'collection1' using instanceDir: /usr/home/hudson/hudson-slave/workspace/Lucene-Solr-Tests-4.x-java7/solr/build/solr-core/test/J0/./org.apache.solr.cloud.BasicDistributedZkTest-jetty1-1360760606021/collection1
[junit4:junit4]   2> 4078 T1288 oasc.ZkController.createCollectionZkNode Check for collection zkNode:collection1
[junit4:junit4]   2> 4079 T1288 oasc.ZkController.createCollectionZkNode Collection zkNode exists
[junit4:junit4]   2> 4079 T1288 oasc.ZkController.readConfigName Load collection config from:/collections/collection1
[junit4:junit4]   2> 4081 T1288 oasc.SolrResourceLoader.<init> new SolrResourceLoader for directory: '/usr/home/hudson/hudson-slave/workspace/Lucene-Solr-Tests-4.x-java7/solr/build/solr-core/test/J0/./org.apache.solr.cloud.BasicDistributedZkTest-jetty1-1360760606021/collection1/'
[junit4:junit4]   2> 4082 T1288 oasc.SolrResourceLoader.replaceClassLoader Adding 'file:/usr/home/hudson/hudson-slave/workspace/Lucene-Solr-Tests-4.x-java7/solr/build/solr-core/test/J0/org.apache.solr.cloud.BasicDistributedZkTest-jetty1-1360760606021/collection1/lib/classes/' to classloader
[junit4:junit4]   2> 4082 T1288 oasc.SolrResourceLoader.replaceClassLoader Adding 'file:/usr/home/hudson/hudson-slave/workspace/Lucene-Solr-Tests-4.x-java7/solr/build/solr-core/test/J0/org.apache.solr.cloud.BasicDistributedZkTest-jetty1-1360760606021/collection1/lib/README' to classloader
[junit4:junit4]   2> 4139 T1288 oasc.SolrConfig.<init> Using Lucene MatchVersion: LUCENE_42
[junit4:junit4]   2> 4213 T1288 oasc.SolrConfig.<init> Loaded SolrConfig: solrconfig.xml
[junit4:junit4]   2> 4314 T1288 oass.IndexSchema.readSchema Reading Solr Schema
[junit4:junit4]   2> 4323 T1288 oass.IndexSchema.readSchema Schema name=test
[junit4:junit4]   2> 4978 T1288 oass.OpenExchangeRatesOrgProvider.init Initialized with rates=open-exchange-rates.json, refreshInterval=1440.
[junit4:junit4]   2> 4991 T1288 oass.IndexSchema.readSchema default search field in schema is text
[junit4:junit4]   2> 4996 T1288 oass.IndexSchema.readSchema unique key field: id
[junit4:junit4]   2> 5013 T1288 oass.FileExchangeRateProvider.reload Reloading exchange rates from file currency.xml
[junit4:junit4]   2> 5018 T1288 oass.FileExchangeRateProvider.reload Reloading exchange rates from file currency.xml
[junit4:junit4]   2> 5022 T1288 oass.OpenExchangeRatesOrgProvider.reload Reloading exchange rates from open-exchange-rates.json
[junit4:junit4]   2> 5024 T1288 oass.OpenExchangeRatesOrgProvider.reload Reloading exchange rates from open-exchange-rates.json
[junit4:junit4]   2> 5025 T1288 oasc.SolrCore.<init> [collection1] Opening new SolrCore at /usr/home/hudson/hudson-slave/workspace/Lucene-Solr-Tests-4.x-java7/solr/build/solr-core/test/J0/./org.apache.solr.cloud.BasicDistributedZkTest-jetty1-1360760606021/collection1/, dataDir=./org.apache.solr.cloud.BasicDistributedZkTest-1360760602291/jetty1/
[junit4:junit4]   2> 5025 T1288 oasc.JmxMonitoredMap.<init> JMX monitoring is enabled. Adding Solr mbeans to JMX Server: com.sun.jmx.mbeanserver.JmxMBeanServer@79613135
[junit4:junit4]   2> 5026 T1288 oasc.SolrCore.initDirectoryFactory solr.NRTCachingDirectoryFactory
[junit4:junit4]   2> 5027 T1288 oasc.CachingDirectoryFactory.get return new directory for /usr/home/hudson/hudson-slave/workspace/Lucene-Solr-Tests-4.x-java7/solr/build/solr-core/test/J0/./org.apache.solr.cloud.BasicDistributedZkTest-1360760602291/jetty1 forceNew:false
[junit4:junit4]   2> 5027 T1288 oasc.CachingDirectoryFactory.close Releasing directory:/usr/home/hudson/hudson-slave/workspace/Lucene-Solr-Tests-4.x-java7/solr/build/solr-core/test/J0/./org.apache.solr.cloud.BasicDistributedZkTest-1360760602291/jetty1
[junit4:junit4]   2> 5028 T1288 oasc.SolrCore.getNewIndexDir New index directory detected: old=null new=./org.apache.solr.cloud.BasicDistributedZkTest-1360760602291/jetty1/index/
[junit4:junit4]   2> 5028 T1288 oasc.SolrCore.initIndex WARNING [collection1] Solr index directory './org.apache.solr.cloud.BasicDistributedZkTest-1360760602291/jetty1/index' doesn't exist. Creating new index...
[junit4:junit4]   2> 5030 T1288 oasc.CachingDirectoryFactory.get return new directory for /usr/home/hudson/hudson-slave/workspace/Lucene-Solr-Tests-4.x-java7/solr/build/solr-core/test/J0/./org.apache.solr.cloud.BasicDistributedZkTest-1360760602291/jetty1/index forceNew:false
[junit4:junit4]   2> 5036 T1288 oasc.SolrDeletionPolicy.onCommit SolrDeletionPolicy.onCommit: commits:num=1
[junit4:junit4]   2> 		commit{dir=RateLimitedDirectoryWrapper(NRTCachingDirectory(org.apache.lucene.store.NIOFSDirectory@/usr/home/hudson/hudson-slave/workspace/Lucene-Solr-Tests-4.x-java7/solr/build/solr-core/test/J0/org.apache.solr.cloud.BasicDistributedZkTest-1360760602291/jetty1/index lockFactory=org.apache.lucene.store.NativeFSLockFactory@6b12cd20; maxCacheMB=48.0 maxMergeSizeMB=4.0)),segFN=segments_1,generation=1,filenames=[segments_1]
[junit4:junit4]   2> 5036 T1288 oasc.SolrDeletionPolicy.updateCommits newest commit = 1[segments_1]
[junit4:junit4]   2> 5037 T1288 oasc.CachingDirectoryFactory.close Releasing directory:/usr/home/hudson/hudson-slave/workspace/Lucene-Solr-Tests-4.x-java7/solr/build/solr-core/test/J0/./org.apache.solr.cloud.BasicDistributedZkTest-1360760602291/jetty1/index
[junit4:junit4]   2> 5038 T1288 oasc.SolrCore.initWriters created xml: solr.XMLResponseWriter
[junit4:junit4]   2> 5040 T1288 oasup.UpdateRequestProcessorChain.init inserting DistributedUpdateProcessorFactory into updateRequestProcessorChain "dedupe"
[junit4:junit4]   2> 5040 T1288 oasup.UpdateRequestProcessorChain.init inserting DistributedUpdateProcessorFactory into updateRequestProcessorChain "dedupe-allfields"
[junit4:junit4]   2> 5041 T1288 oasup.UpdateRequestProcessorChain.init inserting DistributedUpdateProcessorFactory into updateRequestProcessorChain "stored_sig"
[junit4:junit4]   2> 5041 T1288 oasup.UpdateRequestProcessorChain.init inserting DistributedUpdateProcessorFactory into updateRequestProcessorChain "uniq-fields"
[junit4:junit4]   2> 5042 T1288 oasup.UpdateRequestProcessorChain.init inserting DistributedUpdateProcessorFactory into updateRequestProcessorChain "distrib-dup-test-chain-implicit"
[junit4:junit4]   2> 5042 T1288 oasc.RequestHandlers.initHandlersFromConfig adding lazy requestHandler: solr.ReplicationHandler
[junit4:junit4]   2> 5042 T1288 oasc.RequestHandlers.initHandlersFromConfig created /replication: solr.ReplicationHandler
[junit4:junit4]   2> 5043 T1288 oasc.RequestHandlers.initHandlersFromConfig created standard: solr.StandardRequestHandler
[junit4:junit4]   2> 5043 T1288 oasc.RequestHandlers.initHandlersFromConfig created /get: solr.RealTimeGetHandler
[junit4:junit4]   2> 5044 T1288 oasc.RequestHandlers.initHandlersFromConfig created dismax: solr.SearchHandler
[junit4:junit4]   2> 5045 T1288 oasc.RequestHandlers.initHandlersFromConfig created mock: org.apache.solr.core.MockQuerySenderListenerReqHandler
[junit4:junit4]   2> 5045 T1288 oasc.RequestHandlers.initHandlersFromConfig created /admin/: org.apache.solr.handler.admin.AdminHandlers
[junit4:junit4]   2> 5046 T1288 oasc.RequestHandlers.initHandlersFromConfig created defaults: solr.StandardRequestHandler
[junit4:junit4]   2> 5046 T1288 oasc.RequestHandlers.initHandlersFromConfig adding lazy requestHandler: solr.StandardRequestHandler
[junit4:junit4]   2> 5046 T1288 oasc.RequestHandlers.initHandlersFromConfig created lazy: solr.StandardRequestHandler
[junit4:junit4]   2> 5047 T1288 oasc.RequestHandlers.initHandlersFromConfig created /update: solr.UpdateRequestHandler
[junit4:junit4]   2> 5047 T1288 oasc.RequestHandlers.initHandlersFromConfig created /terms: org.apache.solr.handler.component.SearchHandler
[junit4:junit4]   2> 5048 T1288 oasc.RequestHandlers.initHandlersFromConfig created spellCheckCompRH: org.apache.solr.handler.component.SearchHandler
[junit4:junit4]   2> 5048 T1288 oasc.RequestHandlers.initHandlersFromConfig created spellCheckCompRH_Direct: org.apache.solr.handler.component.SearchHandler
[junit4:junit4]   2> 5049 T1288 oasc.RequestHandlers.initHandlersFromConfig created spellCheckWithWordbreak: org.apache.solr.handler.component.SearchHandler
[junit4:junit4]   2> 5050 T1288 oasc.RequestHandlers.initHandlersFromConfig created spellCheckWithWordbreak_Direct: org.apache.solr.handler.component.SearchHandler
[junit4:junit4]   2> 5050 T1288 oasc.RequestHandlers.initHandlersFromConfig created spellCheckCompRH1: org.apache.solr.handler.component.SearchHandler
[junit4:junit4]   2> 5051 T1288 oasc.RequestHandlers.initHandlersFromConfig created mltrh: org.apache.solr.handler.component.SearchHandler
[junit4:junit4]   2> 5051 T1288 oasc.RequestHandlers.initHandlersFromConfig created tvrh: org.apache.solr.handler.component.SearchHandler
[junit4:junit4]   2> 5052 T1288 oasc.RequestHandlers.initHandlersFromConfig created /mlt: solr.MoreLikeThisHandler
[junit4:junit4]   2> 5052 T1288 oasc.RequestHandlers.initHandlersFromConfig created /debug/dump: solr.DumpRequestHandler
[junit4:junit4]   2> 5065 T1288 oashl.XMLLoader.init xsltCacheLifetimeSeconds=60
[junit4:junit4]   2> 5070 T1288 oasc.SolrCore.initDeprecatedSupport WARNING solrconfig.xml uses deprecated <admin/gettableFiles>, Please update your config to use the ShowFileRequestHandler.
[junit4:junit4]   2> 5071 T1288 oasc.SolrCore.initDeprecatedSupport WARNING adding ShowFileRequestHandler with hidden files: [SCHEMA.XML, OLD_SYNONYMS.TXT, STOPWORDS.TXT, PROTWORDS.TXT, OPEN-EXCHANGE-RATES.JSON, SYNONYMS.TXT, CURRENCY.XML, MAPPING-ISOLATIN1ACCENT.TXT]
[junit4:junit4]   2> 5074 T1288 oasc.CachingDirectoryFactory.close Releasing directory:/usr/home/hudson/hudson-slave/workspace/Lucene-Solr-Tests-4.x-java7/solr/build/solr-core/test/J0/./org.apache.solr.cloud.BasicDistributedZkTest-1360760602291/jetty1
[junit4:junit4]   2> 5076 T1288 oass.SolrIndexSearcher.<init> Opening Searcher@7db1b132 main
[junit4:junit4]   2> 5077 T1288 oasu.CommitTracker.<init> Hard AutoCommit: disabled
[junit4:junit4]   2> 5077 T1288 oasu.CommitTracker.<init> Soft AutoCommit: disabled
[junit4:junit4]   2> 5077 T1288 oashc.SpellCheckComponent.inform Initializing spell checkers
[junit4:junit4]   2> 5085 T1288 oass.DirectSolrSpellChecker.init init: {name=direct,classname=DirectSolrSpellChecker,field=lowerfilt,minQueryLength=3}
[junit4:junit4]   2> 5159 T1289 oasc.SolrCore.registerSearcher [collection1] Registered new searcher Searcher@7db1b132 main{StandardDirectoryReader(segments_1:1)}
[junit4:junit4]   2> 5165 T1288 oasc.ZkController.publish publishing core=collection1 state=down
[junit4:junit4]   2> 5166 T1288 oasc.ZkController.publish numShards not found on descriptor - reading it from system property
[junit4:junit4]   2> 5194 T1269 oascc.ZkStateReader.updateClusterState Updating cloud state from ZooKeeper... 
[junit4:junit4]   2> 5195 T1269 oasc.Overseer$ClusterStateUpdater.updateState Update state numShards=1 message={
[junit4:junit4]   2> 	  "operation":"state",
[junit4:junit4]   2> 	  "numShards":"1",
[junit4:junit4]   2> 	  "shard":"shard1",
[junit4:junit4]   2> 	  "roles":null,
[junit4:junit4]   2> 	  "state":"active",
[junit4:junit4]   2> 	  "core":"collection1",
[junit4:junit4]   2> 	  "collection":"control_collection",
[junit4:junit4]   2> 	  "node_name":"127.0.0.1:29324_jc",
[junit4:junit4]   2> 	  "base_url":"http://127.0.0.1:29324/jc"}
[junit4:junit4]   2> 5199 T1269 oasc.Overseer$ClusterStateUpdater.updateState Update state numShards=2 message={
[junit4:junit4]   2> 	  "operation":"state",
[junit4:junit4]   2> 	  "numShards":"2",
[junit4:junit4]   2> 	  "shard":null,
[junit4:junit4]   2> 	  "roles":null,
[junit4:junit4]   2> 	  "state":"down",
[junit4:junit4]   2> 	  "core":"collection1",
[junit4:junit4]   2> 	  "collection":"collection1",
[junit4:junit4]   2> 	  "node_name":"127.0.0.1:29335_jc",
[junit4:junit4]   2> 	  "base_url":"http://127.0.0.1:29335/jc"}
[junit4:junit4]   2> 5200 T1269 oasc.Overseer$ClusterStateUpdater.createCollection Create collection collection1 with numShards 2
[junit4:junit4]   2> 5200 T1269 oasc.Overseer$ClusterStateUpdater.updateState Assigning new node to shard shard=shard1
[junit4:junit4]   2> 5212 T1268 oascc.ZkStateReader$2.process A cluster state change: WatchedEvent state:SyncConnected type:NodeDataChanged path:/clusterstate.json, has occurred - updating... (live nodes size: 2)
[junit4:junit4]   2> 5212 T1287 oascc.ZkStateReader$2.process A cluster state change: WatchedEvent state:SyncConnected type:NodeDataChanged path:/clusterstate.json, has occurred - updating... (live nodes size: 2)
[junit4:junit4]   2> 5212 T1274 oascc.ZkStateReader$2.process A cluster state change: WatchedEvent state:SyncConnected type:NodeDataChanged path:/clusterstate.json, has occurred - updating... (live nodes size: 2)
[junit4:junit4]   2> 6169 T1288 oasc.CoreContainer.registerCore registering core: collection1
[junit4:junit4]   2> 6169 T1288 oasc.ZkController.register Register replica - core:collection1 address:http://127.0.0.1:29335/jc collection:collection1 shard:shard1
[junit4:junit4]   2> 6170 T1288 oascc.SolrZkClient.makePath makePath: /collections/collection1/leader_elect/shard1/election
[junit4:junit4]   2> 6192 T1251 oazs.PrepRequestProcessor.pRequest Got user-level KeeperException when processing sessionid:0x13cd3a6febb0006 type:delete cxid:0x45 zxid:0x5a txntype:-1 reqpath:n/a Error Path:/solr/collections/collection1/leaders Error:KeeperErrorCode = NoNode for /solr/collections/collection1/leaders
[junit4:junit4]   2> 6193 T1288 oasc.ShardLeaderElectionContext.runLeaderProcess Running the leader process.
[junit4:junit4]   2> 6194 T1251 oazs.PrepRequestProcessor.pRequest Got user-level KeeperException when processing sessionid:0x13cd3a6febb0006 type:create cxid:0x46 zxid:0x5b txntype:-1 reqpath:n/a Error Path:/solr/overseer Error:KeeperErrorCode = NodeExists for /solr/overseer
[junit4:junit4]   2> 6196 T1288 oasc.ShardLeaderElectionContext.waitForReplicasToComeUp Enough replicas found to continue.
[junit4:junit4]   2> 6196 T1288 oasc.ShardLeaderElectionContext.runLeaderProcess I may be the new leader - try and sync
[junit4:junit4]   2> 6196 T1288 oasc.SyncStrategy.sync Sync replicas to http://127.0.0.1:29335/jc/collection1/
[junit4:junit4]   2> 6197 T1288 oasc.SyncStrategy.syncReplicas Sync Success - now sync replicas to me
[junit4:junit4]   2> 6197 T1288 oasc.SyncStrategy.syncToMe http://127.0.0.1:29335/jc/collection1/ has no replicas
[junit4:junit4]   2> 6197 T1288 oasc.ShardLeaderElectionContext.runLeaderProcess I am the new leader: http://127.0.0.1:29335/jc/collection1/
[junit4:junit4]   2> 6197 T1288 oascc.SolrZkClient.makePath makePath: /collections/collection1/leaders/shard1
[junit4:junit4]   2> 6202 T1251 oazs.PrepRequestProcessor.pRequest Got user-level KeeperException when processing sessionid:0x13cd3a6febb0006 type:create cxid:0x50 zxid:0x5f txntype:-1 reqpath:n/a Error Path:/solr/overseer Error:KeeperErrorCode = NodeExists for /solr/overseer
[junit4:junit4]   2> 6729 T1269 oascc.ZkStateReader.updateClusterState Updating cloud state from ZooKeeper... 
[junit4:junit4]   2> 6749 T1268 oascc.ZkStateReader$2.process A cluster state change: WatchedEvent state:SyncConnected type:NodeDataChanged path:/clusterstate.json, has occurred - updating... (live nodes size: 2)
[junit4:junit4]   2> 6749 T1287 oascc.ZkStateReader$2.process A cluster state change: WatchedEvent state:SyncConnected type:NodeDataChanged path:/clusterstate.json, has occurred - updating... (live nodes size: 2)
[junit4:junit4]   2> 6749 T1274 oascc.ZkStateReader$2.process A cluster state change: WatchedEvent state:SyncConnected type:NodeDataChanged path:/clusterstate.json, has occurred - updating... (live nodes size: 2)
[junit4:junit4]   2> 6765 T1288 oasc.ZkController.register We are http://127.0.0.1:29335/jc/collection1/ and leader is http://127.0.0.1:29335/jc/collection1/
[junit4:junit4]   2> 6765 T1288 oasc.ZkController.register No LogReplay needed for core=collection1 baseURL=http://127.0.0.1:29335/jc
[junit4:junit4]   2> 6765 T1288 oasc.ZkController.checkRecovery I am the leader, no recovery necessary
[junit4:junit4]   2> 6765 T1288 oasc.ZkController.publish publishing core=collection1 state=active
[junit4:junit4]   2> 6766 T1288 oasc.ZkController.publish numShards not found on descriptor - reading it from system property
[junit4:junit4]   2> 6769 T1288 oascc.ZkStateReader.updateClusterState Updating cloud state from ZooKeeper... 
[junit4:junit4]   2> 6770 T1246 oass.SolrDispatchFilter.init user.dir=/usr/home/hudson/hudson-slave/workspace/Lucene-Solr-Tests-4.x-java7/solr/build/solr-core/test/J0
[junit4:junit4]   2> 6771 T1246 oass.SolrDispatchFilter.init SolrDispatchFilter.init() done
[junit4:junit4]   2> 6771 T1246 oascsi.HttpClientUtil.createClient Creating new http client, config:maxConnections=128&maxConnectionsPerHost=32&followRedirects=false
[junit4:junit4]   2> 6959 T1246 oejs.Server.doStart jetty-8.1.8.v20121106
[junit4:junit4]   2> 6963 T1246 oejs.AbstractConnector.doStart Started SocketConnector@127.0.0.1:29341
[junit4:junit4]   2> 6965 T1246 oass.SolrDispatchFilter.init SolrDispatchFilter.init()
[junit4:junit4]   2> 6965 T1246 oasc.SolrResourceLoader.locateSolrHome JNDI not configured for solr (NoInitialContextEx)
[junit4:junit4]   2> 6966 T1246 oasc.SolrResourceLoader.locateSolrHome using system property solr.solr.home: /usr/home/hudson/hudson-slave/workspace/Lucene-Solr-Tests-4.x-java7/solr/build/solr-core/test/J0/./org.apache.solr.cloud.BasicDistributedZkTest-jetty2-1360760609071
[junit4:junit4]   2> 6966 T1246 oasc.CoreContainer$Initializer.initialize looking for solr.xml: /usr/home/hudson/hudson-slave/workspace/Lucene-Solr-Tests-4.x-java7/solr/build/solr-core/test/J0/./org.apache.solr.cloud.BasicDistributedZkTest-jetty2-1360760609071/solr.xml
[junit4:junit4]   2> 6967 T1246 oasc.CoreContainer.<init> New CoreContainer 68402077
[junit4:junit4]   2> 6968 T1246 oasc.CoreContainer.load Loading CoreContainer using Solr Home: '/usr/home/hudson/hudson-slave/workspace/Lucene-Solr-Tests-4.x-java7/solr/build/solr-core/test/J0/./org.apache.solr.cloud.BasicDistributedZkTest-jetty2-1360760609071/'
[junit4:junit4]   2> 6968 T1246 oasc.SolrResourceLoader.<init> new SolrResourceLoader for directory: '/usr/home/hudson/hudson-slave/workspace/Lucene-Solr-Tests-4.x-java7/solr/build/solr-core/test/J0/./org.apache.solr.cloud.BasicDistributedZkTest-jetty2-1360760609071/'
[junit4:junit4]   2> 7032 T1246 oashc.HttpShardHandlerFactory.getParameter Setting socketTimeout to: 60000
[junit4:junit4]   2> 7033 T1246 oashc.HttpShardHandlerFactory.getParameter Setting urlScheme to: http://
[junit4:junit4]   2> 7033 T1246 oashc.HttpShardHandlerFactory.getParameter Setting connTimeout to: 15000
[junit4:junit4]   2> 7034 T1246 oashc.HttpShardHandlerFactory.getParameter Setting maxConnectionsPerHost to: 20
[junit4:junit4]   2> 7035 T1246 oashc.HttpShardHandlerFactory.getParameter Setting corePoolSize to: 0
[junit4:junit4]   2> 7035 T1246 oashc.HttpShardHandlerFactory.getParameter Setting maximumPoolSize to: 2147483647
[junit4:junit4]   2> 7036 T1246 oashc.HttpShardHandlerFactory.getParameter Setting maxThreadIdleTime to: 5
[junit4:junit4]   2> 7037 T1246 oashc.HttpShardHandlerFactory.getParameter Setting sizeOfQueue to: -1
[junit4:junit4]   2> 7038 T1246 oashc.HttpShardHandlerFactory.getParameter Setting fairnessPolicy to: false
[junit4:junit4]   2> 7038 T1246 oascsi.HttpClientUtil.createClient Creating new http client, config:maxConnectionsPerHost=20&maxConnections=10000&socketTimeout=60000&connTimeout=15000&retry=false
[junit4:junit4]   2> 7074 T1246 oasc.CoreContainer.load Registering Log Listener
[junit4:junit4]   2> 7104 T1246 oasc.CoreContainer.initZooKeeper Zookeeper client=127.0.0.1:29321/solr
[junit4:junit4]   2> 7104 T1246 oasc.ZkController.checkChrootPath zkHost includes chroot
[junit4:junit4]   2> 7105 T1246 oaz.ZooKeeper.<init> Initiating client connection, connectString=127.0.0.1:29321 sessionTimeout=60000 watcher=org.apache.solr.common.cloud.ConnectionManager@76865b58
[junit4:junit4]   2> 7106 T1246 oascc.ConnectionManager.waitForConnected Waiting for client to connect to ZooKeeper
[junit4:junit4]   2> 7106 T1299 oaz.ClientCnxn$SendThread.logStartConnect Opening socket connection to server localhost/127.0.0.1:29321. Will not attempt to authenticate using SASL (access denied ("javax.security.auth.AuthPermission" "getLoginConfiguration"))
[junit4:junit4]   2> 7107 T1299 oaz.ClientCnxn$SendThread.primeConnection Socket connection established to localhost/127.0.0.1:29321, initiating session
[junit4:junit4]   2> 7108 T1248 oazs.NIOServerCnxnFactory.run Accepted socket connection from /140.211.11.196:29342
[junit4:junit4]   2> 7108 T1248 oazs.ZooKeeperServer.processConnectRequest Client attempting to establish new session at /140.211.11.196:29342
[junit4:junit4]   2> 7110 T1250 oazs.ZooKeeperServer.finishSessionInit Established session 0x13cd3a6febb0007 with negotiated timeout 20000 for client /140.211.11.196:29342
[junit4:junit4]   2> 7110 T1299 oaz.ClientCnxn$SendThread.onConnected Session establishment complete on server localhost/127.0.0.1:29321, sessionid = 0x13cd3a6febb0007, negotiated timeout = 20000
[junit4:junit4]   2> 7110 T1300 oascc.ConnectionManager.process Watcher org.apache.solr.common.cloud.ConnectionManager@76865b58 name:ZooKeeperConnection Watcher:127.0.0.1:29321 got event WatchedEvent state:SyncConnected type:None path:null path:null type:None
[junit4:junit4]   2> 7110 T1246 oascc.ConnectionManager.waitForConnected Client is connected to ZooKeeper
[junit4:junit4]   2> 7112 T1251 oazs.PrepRequestProcessor.pRequest2Txn Processed session termination for sessionid: 0x13cd3a6febb0007
[junit4:junit4]   2> 7113 T1300 oaz.ClientCnxn$EventThread.run EventThread shut down
[junit4:junit4]   2> 7113 T1248 oazs.NIOServerCnxn.closeSock Closed socket connection for client /140.211.11.196:29342 which had sessionid 0x13cd3a6febb0007
[junit4:junit4]   2> 7113 T1246 oaz.ZooKeeper.close Session: 0x13cd3a6febb0007 closed
[junit4:junit4]   2> 7114 T1246 oascsi.HttpClientUtil.createClient Creating new http client, config:maxConnections=500&maxConnectionsPerHost=16&socketTimeout=60000&connTimeout=15000
[junit4:junit4]   2> 7127 T1246 oaz.ZooKeeper.<init> Initiating client connection, connectString=127.0.0.1:29321/solr sessionTimeout=30000 watcher=org.apache.solr.common.cloud.ConnectionManager@7ff9eb82
[junit4:junit4]   2> 7128 T1246 oascc.ConnectionManager.waitForConnected Waiting for client to connect to ZooKeeper
[junit4:junit4]   2> 7129 T1301 oaz.ClientCnxn$SendThread.logStartConnect Opening socket connection to server localhost/127.0.0.1:29321. Will not attempt to authenticate using SASL (access denied ("javax.security.auth.AuthPermission" "getLoginConfiguration"))
[junit4:junit4]   2> 7129 T1301 oaz.ClientCnxn$SendThread.primeConnection Socket connection established to localhost/127.0.0.1:29321, initiating session
[junit4:junit4]   2> 7129 T1248 oazs.NIOServerCnxnFactory.run Accepted socket connection from /140.211.11.196:29343
[junit4:junit4]   2> 7130 T1248 oazs.ZooKeeperServer.processConnectRequest Client attempting to establish new session at /140.211.11.196:29343
[junit4:junit4]   2> 7131 T1250 oazs.ZooKeeperServer.finishSessionInit Established session 0x13cd3a6febb0008 with negotiated timeout 20000 for client /140.211.11.196:29343
[junit4:junit4]   2> 7131 T1301 oaz.ClientCnxn$SendThread.onConnected Session establishment complete on server localhost/127.0.0.1:29321, sessionid = 0x13cd3a6febb0008, negotiated timeout = 20000
[junit4:junit4]   2> 7132 T1302 oascc.ConnectionManager.process Watcher org.apache.solr.common.cloud.ConnectionManager@7ff9eb82 name:ZooKeeperConnection Watcher:127.0.0.1:29321/solr got event WatchedEvent state:SyncConnected type:None path:null path:null type:None
[junit4:junit4]   2> 7132 T1246 oascc.ConnectionManager.waitForConnected Client is connected to ZooKeeper
[junit4:junit4]   2> 7133 T1251 oazs.PrepRequestProcessor.pRequest Got user-level KeeperException when processing sessionid:0x13cd3a6febb0008 type:create cxid:0x1 zxid:0x6c txntype:-1 reqpath:n/a Error Path:/solr/overseer Error:KeeperErrorCode = NodeExists for /solr/overseer
[junit4:junit4]   2> 7135 T1251 oazs.PrepRequestProcessor.pRequest Got user-level KeeperException when processing sessionid:0x13cd3a6febb0008 type:create cxid:0x2 zxid:0x6d txntype:-1 reqpath:n/a Error Path:/solr/overseer Error:KeeperErrorCode = NodeExists for /solr/overseer
[junit4:junit4]   2> 7144 T1246 oascc.ZkStateReader.createClusterStateWatchersAndUpdate Updating cluster state from ZooKeeper... 
[junit4:junit4]   2> 7146 T1246 oasc.ZkController.createEphemeralLiveNode Register node as live in ZooKeeper:/live_nodes/127.0.0.1:29341_jc
[junit4:junit4]   2> 7147 T1251 oazs.PrepRequestProcessor.pRequest Got user-level KeeperException when processing sessionid:0x13cd3a6febb0008 type:delete cxid:0x9 zxid:0x6e txntype:-1 reqpath:n/a Error Path:/solr/live_nodes/127.0.0.1:29341_jc Error:KeeperErrorCode = NoNode for /solr/live_nodes/127.0.0.1:29341_jc
[junit4:junit4]   2> 7148 T1246 oascc.SolrZkClient.makePath makePath: /live_nodes/127.0.0.1:29341_jc
[junit4:junit4]   2> 7152 T1274 oascc.ZkStateReader$3.process Updating live nodes... (3)
[junit4:junit4]   2> 7152 T1287 oascc.ZkStateReader$3.process Updating live nodes... (3)
[junit4:junit4]   2> 7153 T1268 oascc.ZkStateReader$3.process Updating live nodes... (3)
[junit4:junit4]   2> 7153 T1287 oascc.ZkStateReader$2.process A cluster state change: WatchedEvent state:SyncConnected type:NodeChildrenChanged path:/live_nodes, has occurred - updating... (live nodes size: 3)
[junit4:junit4]   2> 7153 T1268 oascc.ZkStateReader$2.process A cluster state change: WatchedEvent state:SyncConnected type:NodeChildrenChanged path:/live_nodes, has occurred - updating... (live nodes size: 3)
[junit4:junit4]   2> 7152 T1302 oascc.ZkStateReader$3.process Updating live nodes... (3)
[junit4:junit4]   2> 7153 T1274 oascc.ZkStateReader$2.process A cluster state change: WatchedEvent state:SyncConnected type:NodeChildrenChanged path:/live_nodes, has occurred - updating... (live nodes size: 3)
[junit4:junit4]   2> 7163 T1303 oasc.CoreContainer.create Creating SolrCore 'collection1' using instanceDir: /usr/home/hudson/hudson-slave/workspace/Lucene-Solr-Tests-4.x-java7/solr/build/solr-core/test/J0/./org.apache.solr.cloud.BasicDistributedZkTest-jetty2-1360760609071/collection1
[junit4:junit4]   2> 7163 T1303 oasc.ZkController.createCollectionZkNode Check for collection zkNode:collection1
[junit4:junit4]   2> 7164 T1303 oasc.ZkController.createCollectionZkNode Collection zkNode exists
[junit4:junit4]   2> 7164 T1303 oasc.ZkController.readConfigName Load collection config from:/collections/collection1
[junit4:junit4]   2> 7166 T1303 oasc.SolrResourceLoader.<init> new SolrResourceLoader for directory: '/usr/home/hudson/hudson-slave/workspace/Lucene-Solr-Tests-4.x-java7/solr/build/solr-core/test/J0/./org.apache.solr.cloud.BasicDistributedZkTest-jetty2-1360760609071/collection1/'
[junit4:junit4]   2> 7167 T1303 oasc.SolrResourceLoader.replaceClassLoader Adding 'file:/usr/home/hudson/hudson-slave/workspace/Lucene-Solr-Tests-4.x-java7/solr/build/solr-core/test/J0/org.apache.solr.cloud.BasicDistributedZkTest-jetty2-1360760609071/collection1/lib/classes/' to classloader
[junit4:junit4]   2> 7167 T1303 oasc.SolrResourceLoader.replaceClassLoader Adding 'file:/usr/home/hudson/hudson-slave/workspace/Lucene-Solr-Tests-4.x-java7/solr/build/solr-core/test/J0/org.apache.solr.cloud.BasicDistributedZkTest-jetty2-1360760609071/collection1/lib/README' to classloader
[junit4:junit4]   2> 7224 T1303 oasc.SolrConfig.<init> Using Lucene MatchVersion: LUCENE_42
[junit4:junit4]   2> 7298 T1303 oasc.SolrConfig.<init> Loaded SolrConfig: solrconfig.xml
[junit4:junit4]   2> 7399 T1303 oass.IndexSchema.readSchema Reading Solr Schema
[junit4:junit4]   2> 7408 T1303 oass.IndexSchema.readSchema Schema name=test
[junit4:junit4]   2> 8074 T1303 oass.OpenExchangeRatesOrgProvider.init Initialized with rates=open-exchange-rates.json, refreshInterval=1440.
[junit4:junit4]   2> 8088 T1303 oass.IndexSchema.readSchema default search field in schema is text
[junit4:junit4]   2> 8092 T1303 oass.IndexSchema.readSchema unique key field: id
[junit4:junit4]   2> 8110 T1303 oass.FileExchangeRateProvider.reload Reloading exchange rates from file currency.xml
[junit4:junit4]   2> 8116 T1303 oass.FileExchangeRateProvider.reload Reloading exchange rates from file currency.xml
[junit4:junit4]   2> 8121 T1303 oass.OpenExchangeRatesOrgProvider.reload Reloading exchange rates from open-exchange-rates.json
[junit4:junit4]   2> 8123 T1303 oass.OpenExchangeRatesOrgProvider.reload Reloading exchange rates from open-exchange-rates.json
[junit4:junit4]   2> 8125 T1303 oasc.SolrCore.<init> [collection1] Opening new SolrCore at /usr/home/hudson/hudson-slave/workspace/Lucene-Solr-Tests-4.x-java7/solr/build/solr-core/test/J0/./org.apache.solr.cloud.BasicDistributedZkTest-jetty2-1360760609071/collection1/, dataDir=./org.apache.solr.cloud.BasicDistributedZkTest-1360760602291/jetty2/
[junit4:junit4]   2> 8125 T1303 oasc.JmxMonitoredMap.<init> JMX monitoring is enabled. Adding Solr mbeans to JMX Server: com.sun.jmx.mbeanserver.JmxMBeanServer@79613135
[junit4:junit4]   2> 8126 T1303 oasc.SolrCore.initDirectoryFactory solr.NRTCachingDirectoryFactory
[junit4:junit4]   2> 8127 T1303 oasc.CachingDirectoryFactory.get return new directory for /usr/home/hudson/hudson-slave/workspace/Lucene-Solr-Tests-4.x-java7/solr/build/solr-core/test/J0/./org.apache.solr.cloud.BasicDistributedZkTest-1360760602291/jetty2 forceNew:false
[junit4:junit4]   2> 8127 T1303 oasc.CachingDirectoryFactory.close Releasing directory:/usr/home/hudson/hudson-slave/workspace/Lucene-Solr-Tests-4.x-java7/solr/build/solr-core/test/J0/./org.apache.solr.cloud.BasicDistributedZkTest-1360760602291/jetty2
[junit4:junit4]   2> 8128 T1303 oasc.SolrCore.getNewIndexDir New index directory detected: old=null new=./org.apache.solr.cloud.BasicDistributedZkTest-1360760602291/jetty2/index/
[junit4:junit4]   2> 8128 T1303 oasc.SolrCore.initIndex WARNING [collection1] Solr index directory './org.apache.solr.cloud.BasicDistributedZkTest-1360760602291/jetty2/index' doesn't exist. Creating new index...
[junit4:junit4]   2> 8130 T1303 oasc.CachingDirectoryFactory.get return new directory for /usr/home/hudson/hudson-slave/workspace/Lucene-Solr-Tests-4.x-java7/solr/build/solr-core/test/J0/./org.apache.solr.cloud.BasicDistributedZkTest-1360760602291/jetty2/index forceNew:false
[junit4:junit4]   2> 8136 T1303 oasc.SolrDeletionPolicy.onCommit SolrDeletionPolicy.onCommit: commits:num=1
[junit4:junit4]   2> 		commit{dir=RateLimitedDirectoryWrapper(NRTCachingDirectory(org.apache.lucene.store.NIOFSDirectory@/usr/home/hudson/hudson-slave/workspace/Lucene-Solr-Tests-4.x-java7/solr/build/solr-core/test/J0/org.apache.solr.cloud.BasicDistributedZkTest-1360760602291/jetty2/index lockFactory=org.apache.lucene.store.NativeFSLockFactory@31b2300e; maxCacheMB=48.0 maxMergeSizeMB=4.0)),segFN=segments_1,generation=1,filenames=[segments_1]
[junit4:junit4]   2> 8137 T1303 oasc.SolrDeletionPolicy.updateCommits newest commit = 1[segments_1]
[junit4:junit4]   2> 8138 T1303 oasc.CachingDirectoryFactory.close Releasing directory:/usr/home/hudson/hudson-slave/workspace/Lucene-Solr-Tests-4.x-java7/solr/build/solr-core/test/J0/./org.apache.solr.cloud.BasicDistributedZkTest-1360760602291/jetty2/index
[junit4:junit4]   2> 8138 T1303 oasc.SolrCore.initWriters created xml: solr.XMLResponseWriter
[junit4:junit4]   2> 8140 T1303 oasup.UpdateRequestProcessorChain.init inserting DistributedUpdateProcessorFactory into updateRequestProcessorChain "dedupe"
[junit4:junit4]   2> 8141 T1303 oasup.UpdateRequestProcessorChain.init inserting DistributedUpdateProcessorFactory into updateRequestProcessorChain "dedupe-allfields"
[junit4:junit4]   2> 8141 T1303 oasup.UpdateRequestProcessorChain.init inserting DistributedUpdateProcessorFactory into updateRequestProcessorChain "stored_sig"
[junit4:junit4]   2> 8141 T1303 oasup.UpdateRequestProcessorChain.init inserting DistributedUpdateProcessorFactory into updateRequestProcessorChain "uniq-fields"
[junit4:junit4]   2> 8142 T1303 oasup.UpdateRequestProcessorChain.init inserting DistributedUpdateProcessorFactory into updateRequestProcessorChain "distrib-dup-test-chain-implicit"
[junit4:junit4]   2> 8143 T1303 oasc.RequestHandlers.initHandlersFromConfig adding lazy requestHandler: solr.ReplicationHandler
[junit4:junit4]   2> 8143 T1303 oasc.RequestHandlers.initHandlersFromConfig created /replication: solr.ReplicationHandler
[junit4:junit4]   2> 8144 T1303 oasc.RequestHandlers.initHandlersFromConfig created standard: solr.StandardRequestHandler
[junit4:junit4]   2> 8144 T1303 oasc.RequestHandlers.initHandlersFromConfig created /get: solr.RealTimeGetHandler
[junit4:junit4]   2> 8145 T1303 oasc.RequestHandlers.initHandlersFromConfig created dismax: solr.SearchHandler
[junit4:junit4]   2> 8146 T1303 oasc.RequestHandlers.initHandlersFromConfig created mock: org.apache.solr.core.MockQuerySenderListenerReqHandler
[junit4:junit4]   2> 8146 T1303 oasc.RequestHandlers.initHandlersFromConfig created /admin/: org.apache.solr.handler.admin.AdminHandlers
[junit4:junit4]   2> 8147 T1303 oasc.RequestHandlers.initHandlersFromConfig created defaults: solr.StandardRequestHandler
[junit4:junit4]   2> 8147 T1303 oasc.RequestHandlers.initHandlersFromConfig adding lazy requestHandler: solr.StandardRequestHandler
[junit4:junit4]   2> 8148 T1303 oasc.RequestHandlers.initHandlersFromConfig created lazy: solr.StandardRequestHandler
[junit4:junit4]   2> 8148 T1303 oasc.RequestHandlers.initHandlersFromConfig created /update: solr.UpdateRequestHandler
[junit4:junit4]   2> 8149 T1303 oasc.RequestHandlers.initHandlersFromConfig created /terms: org.apache.solr.handler.component.SearchHandler
[junit4:junit4]   2> 8149 T1303 oasc.RequestHandlers.initHandlersFromConfig created spellCheckCompRH: org.apache.solr.handler.component.SearchHandler
[junit4:junit4]   2> 8150 T1303 oasc.RequestHandlers.initHandlersFromConfig created spellCheckCompRH_Direct: org.apache.solr.handler.component.SearchHandler
[junit4:junit4]   2> 8150 T1303 oasc.RequestHandlers.initHandlersFromConfig created spellCheckWithWordbreak: org.apache.solr.handler.component.SearchHandler
[junit4:junit4]   2> 8151 T1303 oasc.RequestHandlers.initHandlersFromConfig created spellCheckWithWordbreak_Direct: org.apache.solr.handler.component.SearchHandler
[junit4:junit4]   2> 8152 T1303 oasc.RequestHandlers.initHandlersFromConfig created spellCheckCompRH1: org.apache.solr.handler.component.SearchHandler
[junit4:junit4]   2> 8152 T1303 oasc.RequestHandlers.initHandlersFromConfig created mltrh: org.apache.solr.handler.component.SearchHandler
[junit4:junit4]   2> 8153 T1303 oasc.RequestHandlers.initHandlersFromConfig created tvrh: org.apache.solr.handler.component.SearchHandler
[junit4:junit4]   2> 8154 T1303 oasc.RequestHandlers.initHandlersFromConfig created /mlt: solr.MoreLikeThisHandler
[junit4:junit4]   2> 8154 T1303 oasc.RequestHandlers.initHandlersFromConfig created /debug/dump: solr.DumpRequestHandler
[junit4:junit4]   2> 8168 T1303 oashl.XMLLoader.init xsltCacheLifetimeSeconds=60
[junit4:junit4]   2> 8173 T1303 oasc.SolrCore.initDeprecatedSupport WARNING solrconfig.xml uses deprecated <admin/gettableFiles>, Please update your config to use the ShowFileRequestHandler.
[junit4:junit4]   2> 8174 T1303 oasc.SolrCore.initDeprecatedSupport WARNING adding ShowFileRequestHandler with hidden files: [SCHEMA.XML, OLD_SYNONYMS.TXT, STOPWORDS.TXT, PROTWORDS.TXT, OPEN-EXCHANGE-RATES.JSON, SYNONYMS.TXT, CURRENCY.XML, MAPPING-ISOLATIN1ACCENT.TXT]
[junit4:junit4]   2> 8177 T1303 oasc.CachingDirectoryFactory.close Releasing directory:/usr/home/hudson/hudson-slave/workspace/Lucene-Solr-Tests-4.x-java7/solr/build/solr-core/test/J0/./org.apache.solr.cloud.BasicDistributedZkTest-1360760602291/jetty2
[junit4:junit4]   2> 8179 T1303 oass.SolrIndexSearcher.<init> Opening Searcher@29092278 main
[junit4:junit4]   2> 8180 T1303 oasu.CommitTracker.<init> Hard AutoCommit: disabled
[junit4:junit4]   2> 8180 T1303 oasu.CommitTracker.<init> Soft AutoCommit: disabled
[junit4:junit4]   2> 8181 T1303 oashc.SpellCheckComponent.inform Initializing spell checkers
[junit4:junit4]   2> 8189 T1303 oass.DirectSolrSpellChecker.init init: {name=direct,classname=DirectSolrSpellChecker,field=lowerfilt,minQueryLength=3}
[junit4:junit4]   2> 8237 T1304 oasc.SolrCore.registerSearcher [collection1] Registered new searcher Searcher@29092278 main{StandardDirectoryReader(segments_1:1)}
[junit4:junit4]   2> 8243 T1303 oasc.ZkController.publish publishing core=collection1 state=down
[junit4:junit4]   2> 8243 T1303 oasc.ZkController.publish numShards not found on descriptor - reading it from system property
[junit4:junit4]   2> 8264 T1269 oascc.ZkStateReader.updateClusterState Updating cloud state from ZooKeeper... 
[junit4:junit4]   2> 8265 T1269 oasc.Overseer$ClusterStateUpdater.updateState Update state numShards=2 message={
[junit4:junit4]   2> 	  "operation":"state",
[junit4:junit4]   2> 	  "numShards":"2",
[junit4:junit4]   2> 	  "shard":"shard1",
[junit4:junit4]   2> 	  "roles":null,
[junit4:junit4]   2> 	  "state":"active",
[junit4:junit4]   2> 	  "core":"collection1",
[junit4:junit4]   2> 	  "collection":"collection1",
[junit4:junit4]   2> 	  "node_name":"127.0.0.1:29335_jc",
[junit4:junit4]   2> 	  "base_url":"http://127.0.0.1:29335/jc"}
[junit4:junit4]   2> 8272 T1269 oasc.Overseer$ClusterStateUpdater.updateState Update state numShards=2 message={
[junit4:junit4]   2> 	  "operation":"state",
[junit4:junit4]   2> 	  "numShards":"2",
[junit4:junit4]   2> 	  "shard":null,
[junit4:junit4]   2> 	  "roles":null,
[junit4:junit4]   2> 	  "state":"down",
[junit4:junit4]   2> 	  "core":"collection1",
[junit4:junit4]   2> 	  "collection":"collection1",
[junit4:junit4]   2> 	  "node_name":"127.0.0.1:29341_jc",
[junit4:junit4]   2> 	  "base_url":"http://127.0.0.1:29341/jc"}
[junit4:junit4]   2> 8273 T1269 oasc.Overseer$ClusterStateUpdater.updateState Collection already exists with numShards=2
[junit4:junit4]   2> 8273 T1269 oasc.Overseer$ClusterStateUpdater.updateState Assigning new node to shard shard=shard2
[junit4:junit4]   2> 8286 T1302 oascc.ZkStateReader$2.process A cluster state change: WatchedEvent state:SyncConnected type:NodeDataChanged path:/clusterstate.json, has occurred - updating... (live nodes size: 3)
[junit4:junit4]   2> 8286 T1268 oascc.ZkStateReader$2.process A cluster state change: WatchedEvent state:SyncConnected type:NodeDataChanged path:/clusterstate.json, has occurred - updating... (live nodes size: 3)
[junit4:junit4]   2> 8286 T1287 oascc.ZkStateReader$2.process A cluster state change: WatchedEvent state:SyncConnected type:NodeDataChanged path:/clusterstate.json, has occurred - updating... (live nodes size: 3)
[junit4:junit4]   2> 8286 T1274 oascc.ZkStateReader$2.process A cluster state change: WatchedEvent state:SyncConnected type:NodeDataChanged path:/clusterstate.json, has occurred - updating... (live nodes size: 3)
[junit4:junit4]   2> 9246 T1303 oasc.CoreContainer.registerCore registering core: collection1
[junit4:junit4]   2> 9246 T1303 oasc.ZkController.register Register replica - core:collection1 address:http://127.0.0.1:29341/jc collection:collection1 shard:shard2
[junit4:junit4]   2> 9247 T1303 oascc.SolrZkClient.makePath makePath: /collections/collection1/leader_elect/shard2/election
[junit4:junit4]   2> 9264 T1251 oazs.PrepRequestProcessor.pRequest Got user-level KeeperException when processing sessionid:0x13cd3a6febb0008 type:delete cxid:0x44 zxid:0x7c txntype:-1 reqpath:n/a Error Path:/solr/collections/collection1/leaders/shard2 Error:KeeperErrorCode = NoNode for /solr/collections/collection1/leaders/shard2
[junit4:junit4]   2> 9265 T1303 oasc.ShardLeaderElectionContext.runLeaderProcess Running the leader process.
[junit4:junit4]   2> 9265 T1251 oazs.PrepRequestProcessor.pRequest Got user-level KeeperException when processing sessionid:0x13cd3a6febb0008 type:create cxid:0x45 zxid:0x7d txntype:-1 reqpath:n/a Error Path:/solr/overseer Error:KeeperErrorCode = NodeExists for /solr/overseer
[junit4:junit4]   2> 9276 T1303 oasc.ShardLeaderElectionContext.waitForReplicasToComeUp Enough replicas found to continue.
[junit4:junit4]   2> 9277 T1303 oasc.ShardLeaderElectionContext.runLeaderProcess I may be the new leader - try and sync
[junit4:junit4]   2> 9277 T1303 oasc.SyncStrategy.sync Sync replicas to http://127.0.0.1:29341/jc/collection1/
[junit4:junit4]   2> 9277 T1303 oasc.SyncStrategy.syncReplicas Sync Success - now sync replicas to me
[junit4:junit4]   2> 9277 T1303 oasc.SyncStrategy.syncToMe http://127.0.0.1:29341/jc/collection1/ has no replicas
[junit4:junit4]   2> 9278 T1303 oasc.ShardLeaderElectionContext.runLeaderProcess I am the new leader: http://127.0.0.1:29341/jc/collection1/
[junit4:junit4]   2> 9278 T1303 oascc.SolrZkClient.makePath makePath: /collections/collection1/leaders/shard2
[junit4:junit4]   2> 9282 T1251 oazs.PrepRequestProcessor.pRequest Got user-level KeeperException when processing sessionid:0x13cd3a6febb0008 type:create cxid:0x4e zxid:0x80 txntype:-1 reqpath:n/a Error Path:/solr/overseer Error:KeeperErrorCode = NodeExists for /solr/overseer
[junit4:junit4]   2> 9798 T1269 oascc.ZkStateReader.updateClusterState Updating cloud state from ZooKeeper... 
[junit4:junit4]   2> 9861 T1268 oascc.ZkStateReader$2.process A cluster state change: WatchedEvent state:SyncConnected type:NodeDataChanged path:/clusterstate.json, has occurred - updating... (live nodes size: 3)
[junit4:junit4]   2> 9861 T1274 oascc.ZkStateReader$2.process A cluster state change: WatchedEvent state:SyncConnected type:NodeDataChanged path:/clusterstate.json, has occurred - updating... (live nodes size: 3)
[junit4:junit4]   2> 9861 T1302 oascc.ZkStateReader$2.process A cluster state change: WatchedEvent state:SyncConnected type:NodeDataChanged path:/clusterstate.json, has occurred - updating... (live nodes size: 3)
[junit4:junit4]   2> 9861 T1287 oascc.ZkStateReader$2.process A cluster state change: WatchedEvent state:SyncConnected type:NodeDataChanged path:/clusterstate.json, has occurred - updating... (live nodes size: 3)
[junit4:junit4]   2> 9905 T1303 oasc.ZkController.register We are http://127.0.0.1:29341/jc/collection1/ and leader is http://127.0.0.1:29341/jc/collection1/
[junit4:junit4]   2> 9905 T1303 oasc.ZkController.register No LogReplay needed for core=collection1 baseURL=http://127.0.0.1:29341/jc
[junit4:junit4]   2> 9905 T1303 oasc.ZkController.checkRecovery I am the leader, no recovery necessary
[junit4:junit4]   2> 9905 T1303 oasc.ZkController.publish publishing core=collection1 state=active
[junit4:junit4]   2> 9906 T1303 oasc.ZkController.publish numShards not found on descriptor - reading it from system property
[junit4:junit4]   2> 9907 T1303 oascc.ZkStateReader.updateClusterState Updating cloud state from ZooKeeper... 
[junit4:junit4]   2> 9908 T1246 oass.SolrDispatchFilter.init user.dir=/usr/home/hudson/hudson-slave/workspace/Lucene-Solr-Tests-4.x-java7/solr/build/solr-core/test/J0
[junit4:junit4]   2> 9909 T1246 oass.SolrDispatchFilter.init SolrDispatchFilter.init() done
[junit4:junit4]   2> 9910 T1246 oascsi.HttpClientUtil.createClient Creating new http client, config:maxConnections=128&maxConnectionsPerHost=32&followRedirects=false
[junit4:junit4]   2> 10095 T1246 oejs.Server.doStart jetty-8.1.8.v20121106
[junit4:junit4]   2> 10099 T1246 oejs.AbstractConnector.doStart Started SocketConnector@127.0.0.1:29346
[junit4:junit4]   2> 10100 T1246 oass.SolrDispatchFilter.init SolrDispatchFilter.init()
[junit4:junit4]   2> 10100 T1246 oasc.SolrResourceLoader.locateSolrHome JNDI not configured for solr (NoInitialContextEx)
[junit4:junit4]   2> 10101 T1246 oasc.SolrResourceLoader.locateSolrHome using system property solr.solr.home: /usr/home/hudson/hudson-slave/workspace/Lucene-Solr-Tests-4.x-java7/solr/build/solr-core/test/J0/./org.apache.solr.cloud.BasicDistributedZkTest-jetty3-1360760612209
[junit4:junit4]   2> 10101 T1246 oasc.CoreContainer$Initializer.initialize looking for solr.xml: /usr/home/hudson/hudson-slave/workspace/Lucene-Solr-Tests-4.x-java7/solr/build/solr-core/test/J0/./org.apache.solr.cloud.BasicDistributedZkTest-jetty3-1360760612209/solr.xml
[junit4:junit4]   2> 10102 T1246 oasc.CoreContainer.<init> New CoreContainer 1811625927
[junit4:junit4]   2> 10102 T1246 oasc.CoreContainer.load Loading CoreContainer using Solr Home: '/usr/home/hudson/hudson-slave/workspace/Lucene-Solr-Tests-4.x-java7/solr/build/solr-core/test/J0/./org.apache.solr.cloud.BasicDistributedZkTest-jetty3-1360760612209/'
[junit4:junit4]   2> 10103 T1246 oasc.SolrResourceLoader.<init> new SolrResourceLoader for directory: '/usr/home/hudson/hudson-slave/workspace/Lucene-Solr-Tests-4.x-java7/solr/build/solr-core/test/J0/./org.apache.solr.cloud.BasicDistributedZkTest-jetty3-1360760612209/'
[junit4:junit4]   2> 10163 T1246 oashc.HttpShardHandlerFactory.getParameter Setting socketTimeout to: 60000
[junit4:junit4]   2> 10163 T1246 oashc.HttpShardHandlerFactory.getParameter Setting urlScheme to: http://
[junit4:junit4]   2> 10164 T1246 oashc.HttpShardHandlerFactory.getParameter Setting connTimeout to: 15000
[junit4:junit4]   2> 10164 T1246 oashc.HttpShardHandlerFactory.getParameter Setting maxConnectionsPerHost to: 20
[junit4:junit4]   2> 10164 T1246 oashc.HttpShardHandlerFactory.getParameter Setting corePoolSize to: 0
[junit4:junit4]   2> 10165 T1246 oashc.HttpShardHandlerFactory.getParameter Setting maximumPoolSize to: 2147483647
[junit4:junit4]   2> 10165 T1246 oashc.HttpShardHandlerFactory.getParameter Setting maxThreadIdleTime to: 5
[junit4:junit4]   2> 10166 T1246 oashc.HttpShardHandlerFactory.getParameter Setting sizeOfQueue to: -1
[junit4:junit4]   2> 10166 T1246 oashc.HttpShardHandlerFactory.getParameter Setting fairnessPolicy to: false
[junit4:junit4]   2> 10167 T1246 oascsi.HttpClientUtil.createClient Creating new http client, config:maxConnectionsPerHost=20&maxConnections=10000&socketTimeout=60000&connTimeout=15000&retry=false
[junit4:junit4]   2> 10188 T1246 oasc.CoreContainer.load Registering Log Listener
[junit4:junit4]   2> 10208 T1246 oasc.CoreContainer.initZooKeeper Zookeeper client=127.0.0.1:29321/solr
[junit4:junit4]   2> 10208 T1246 oasc.ZkController.checkChrootPath zkHost includes chroot
[junit4:junit4]   2> 10209 T1246 oaz.ZooKeeper.<init> Initiating client connection, connectString=127.0.0.1:29321 sessionTimeout=60000 watcher=org.apache.solr.common.cloud.ConnectionManager@5d9108b0
[junit4:junit4]   2> 10210 T1246 oascc.ConnectionManager.waitForConnected Waiting for client to connect to ZooKeeper
[junit4:junit4]   2> 10210 T1314 oaz.ClientCnxn$SendThread.logStartConnect Opening socket connection to server localhost/127.0.0.1:29321. Will not attempt to authenticate using SASL (access denied ("javax.security.auth.AuthPermission" "getLoginConfiguration"))
[junit4:junit4]   2> 10211 T1314 oaz.ClientCnxn$SendThread.primeConnection Socket connection established to localhost/127.0.0.1:29321, initiating session
[junit4:junit4]   2> 10211 T1248 oazs.NIOServerCnxnFactory.run Accepted socket connection from /140.211.11.196:29347
[junit4:junit4]   2> 10212 T1248 oazs.ZooKeeperServer.processConnectRequest Client attempting to establish new session at /140.211.11.196:29347
[junit4:junit4]   2> 10216 T1250 oazs.ZooKeeperServer.finishSessionInit Established session 0x13cd3a6febb0009 with negotiated timeout 20000 for client /140.211.11.196:29347
[junit4:junit4]   2> 10216 T1314 oaz.ClientCnxn$SendThread.onConnected Session establishment complete on server localhost/127.0.0.1:29321, sessionid = 0x13cd3a6febb0009, negotiated timeout = 20000
[junit4:junit4]   2> 10216 T1315 oascc.ConnectionManager.process Watcher org.apache.solr.common.cloud.ConnectionManager@5d9108b0 name:ZooKeeperConnection Watcher:127.0.0.1:29321 got event WatchedEvent state:SyncConnected type:None path:null path:null type:None
[junit4:junit4]   2> 10216 T1246 oascc.ConnectionManager.waitForConnected Client is connected to ZooKeeper
[junit4:junit4]   2> 10218 T1251 oazs.PrepRequestProcessor.pRequest2Txn Processed session termination for sessionid: 0x13cd3a6febb0009
[junit4:junit4]   2> 10219 T1315 oaz.ClientCnxn$EventThread.run EventThread shut down
[junit4:junit4]   2> 10219 T1248 oazs.NIOServerCnxn.closeSock Closed socket connection for client /140.211.11.196:29347 which had sessionid 0x13cd3a6febb0009
[junit4:junit4]   2> 10219 T1246 oaz.ZooKeeper.close Session: 0x13cd3a6febb0009 closed
[junit4:junit4]   2> 10220 T1246 oascsi.HttpClientUtil.createClient Creating new http client, config:maxConnections=500&maxConnectionsPerHost=16&socketTimeout=60000&connTimeout=15000
[junit4:junit4]   2> 10231 T1246 oaz.ZooKeeper.<init> Initiating client connection, connectString=127.0.0.1:29321/solr sessionTimeout=30000 watcher=org.apache.solr.common.cloud.ConnectionManager@19f456c0
[junit4:junit4]   2> 10231 T1246 oascc.ConnectionManager.waitForConnected Waiting for client to connect to ZooKeeper
[junit4:junit4]   2> 10232 T1316 oaz.ClientCnxn$SendThread.logStartConnect Opening socket connection to server localhost/127.0.0.1:29321. Will not attempt to authenticate using SASL (access denied ("javax.security.auth.AuthPermission" "getLoginConfiguration"))
[junit4:junit4]   2> 10232 T1316 oaz.ClientCnxn$SendThread.primeConnection Socket connection established to localhost/127.0.0.1:29321, initiating session
[junit4:junit4]   2> 10233 T1248 oazs.NIOServerCnxnFactory.run Accepted socket connection from /140.211.11.196:29348
[junit4:junit4]   2> 10233 T1248 oazs.ZooKeeperServer.processConnectRequest Client attempting to establish new session at /140.211.11.196:29348
[junit4:junit4]   2> 10234 T1250 oazs.ZooKeeperServer.finishSessionInit Established session 0x13cd3a6febb000a with negotiated timeout 20000 for client /140.211.11.196:29348
[junit4:junit4]   2> 10234 T1316 oaz.ClientCnxn$SendThread.onConnected Session establishment complete on server localhost/127.0.0.1:29321, sessionid = 0x13cd3a6febb000a, negotiated timeout = 20000
[junit4:junit4]   2> 10234 T1317 oascc.ConnectionManager.process Watcher org.apache.solr.common.cloud.ConnectionManager@19f456c0 name:ZooKeeperConnection Watcher:127.0.0.1:29321/solr got event WatchedEvent state:SyncConnected type:None path:null path:null type:None
[junit4:junit4]   2> 10235 T1246 oascc.ConnectionManager.waitForConnected Client is connected to ZooKeeper
[junit4:junit4]   2> 10236 T1251 oazs.PrepRequestProcessor.pRequest Got user-level KeeperException when processing sessionid:0x13cd3a6febb000a type:create cxid:0x1 zxid:0x8d txntype:-1 reqpath:n/a Error Path:/solr/overseer Error:KeeperErrorCode = NodeExists for /solr/overseer
[junit4:junit4]   2> 10237 T1251 oazs.PrepRequestProcessor.pRequest Got user-level KeeperException when processing sessionid:0x13cd3a6febb000a type:create cxid:0x2 zxid:0x8e txntype:-1 reqpath:n/a Error Path:/solr/overseer Error:KeeperErrorCode = NodeExists for /solr/overseer
[junit4:junit4]   2> 10246 T1246 oascc.ZkStateReader.createClusterStateWatchersAndUpdate Updating cluster state from ZooKeeper... 
[junit4:junit4]   2> 10248 T1246 oasc.ZkController.createEphemeralLiveNode Register node as live in ZooKeeper:/live_nodes/127.0.0.1:29346_jc
[junit4:junit4]   2> 10249 T1251 oazs.PrepRequestProcessor.pRequest Got user-level KeeperException when processing sessionid:0x13cd3a6febb000a type:delete cxid:0x9 zxid:0x8f txntype:-1 reqpath:n/a Error Path:/solr/live_nodes/127.0.0.1:29346_jc Error:KeeperErrorCode = NoNode for /solr/live_nodes/127.0.0.1:29346_jc
[junit4:junit4]   2> 10250 T1246 oascc.SolrZkClient.makePath makePath: /live_nodes/127.0.0.1:29346_jc
[junit4:junit4]   2> 10254 T1268 oascc.ZkStateReader$3.process Updating live nodes... (4)
[junit4:junit4]   2> 10254 T1302 oascc.ZkStateReader$3.process Updating live nodes... (4)
[junit4:junit4]   2> 10254 T1274 oascc.ZkStateReader$3.process Updating live nodes... (4)
[junit4:junit4]   2> 10254 T1302 oascc.ZkStateReader$2.process A cluster state change: WatchedEvent state:SyncConnected type:NodeChildrenChanged path:/live_nodes, has occurred - updating... (live nodes size: 4)
[junit4:junit4]   2> 10254 T1274 oascc.ZkStateReader$2.process A cluster state change: WatchedEvent state:SyncConnected type:NodeChildrenChanged path:/live_nodes, has occurred - updating... (live nodes size: 4)
[junit4:junit4]   2> 10254 T1268 oascc.ZkStateReader$2.process A cluster state change: WatchedEvent state:SyncConnected type:NodeChildrenChanged path:/live_nodes, has occurred - updating... (live nodes size: 4)
[junit4:junit4]   2> 10254 T1287 oascc.ZkStateReader$3.process Updating live nodes... (4)
[junit4:junit4]   2> 10254 T1317 oascc.ZkStateReader$3.process Updating live nodes... (4)
[junit4:junit4]   2> 10255 T1287 oascc.ZkStateReader$2.process A cluster state change: WatchedEvent state:SyncConnected type:NodeChildrenChanged path:/live_nodes, has occurred - updating... (live nodes size: 4)
[junit4:junit4]   2> 10267 T1318 oasc.CoreContainer.create Creating SolrCore 'collection1' using instanceDir: /usr/home/hudson/hudson-slave/workspace/Lucene-Solr-Tests-4.x-java7/solr/build/solr-core/test/J0/./org.apache.solr.cloud.BasicDistributedZkTest-jetty3-1360760612209/collection1
[junit4:junit4]   2> 10268 T1318 oasc.ZkController.createCollectionZkNode Check for collection zkNode:collection1
[junit4:junit4]   2> 10268 T1318 oasc.ZkController.createCollectionZkNode Collection zkNode exists
[junit4:junit4]   2> 10269 T1318 oasc.ZkController.readConfigName Load collection config from:/collections/collection1
[junit4:junit4]   2> 10270 T1318 oasc.SolrResourceLoader.<init> new SolrResourceLoader for directory: '/usr/home/hudson/hudson-slave/workspace/Lucene-Solr-Tests-4.x-java7/solr/build/solr-core/test/J0/./org.apache.solr.cloud.BasicDistributedZkTest-jetty3-1360760612209/collection1/'
[junit4:junit4]   2> 10271 T1318 oasc.SolrResourceLoader.replaceClassLoader Adding 'file:/usr/home/hudson/hudson-slave/workspace/Lucene-Solr-Tests-4.x-java7/solr/build/solr-core/test/J0/org.apache.solr.cloud.BasicDistributedZkTest-jetty3-1360760612209/collection1/lib/README' to classloader
[junit4:junit4]   2> 10272 T1318 oasc.SolrResourceLoader.replaceClassLoader Adding 'file:/usr/home/hudson/hudson-slave/workspace/Lucene-Solr-Tests-4.x-java7/solr/build/solr-core/test/J0/org.apache.solr.cloud.BasicDistributedZkTest-jetty3-1360760612209/collection1/lib/classes/' to classloader
[junit4:junit4]   2> 10328 T1318 oasc.SolrConfig.<init> Using Lucene MatchVersion: LUCENE_42
[junit4:junit4]   2> 10401 T1318 oasc.SolrConfig.<init> Loaded SolrConfig: solrconfig.xml
[junit4:junit4]   2> 10502 T1318 oass.IndexSchema.readSchema Reading Solr Schema
[junit4:junit4]   2> 10511 T1318 oass.IndexSchema.readSchema Schema name=test
[junit4:junit4]   2> 11143 T1318 oass.OpenExchangeRatesOrgProvider.init Initialized with rates=open-exchange-rates.json, refreshInterval=1440.
[junit4:junit4]   2> 11155 T1318 oass.IndexSchema.readSchema default search field in schema is text
[junit4:junit4]   2> 11159 T1318 oass.IndexSchema.readSchema unique key field: id
[junit4:junit4]   2> 11176 T1318 oass.FileExchangeRateProvider.reload Reloading exchange rates from file currency.xml
[junit4:junit4]   2> 11181 T1318 oass.FileExchangeRateProvider.reload Reloading exchange rates from file currency.xml
[junit4:junit4]   2> 11186 T1318 oass.OpenExchangeRatesOrgProvider.reload Reloading exchange rates from open-exchange-rates.json
[junit4:junit4]   2> 11187 T1318 oass.OpenExchangeRatesOrgProvider.reload Reloading exchange rates from open-exchange-rates.json
[junit4:junit4]   2> 11189 T1318 oasc.SolrCore.<init> [collection1] Opening new SolrCore at /usr/home/hudson/hudson-slave/workspace/Lucene-Solr-Tests-4.x-java7/solr/build/solr-core/test/J0/./org.apache.solr.cloud.BasicDistributedZkTest-jetty3-1360760612209/collection1/, dataDir=./org.apache.solr.cloud.BasicDistributedZkTest-1360760602291/jetty3/
[junit4:junit4]   2> 11189 T1318 oasc.JmxMonitoredMap.<init> JMX monitoring is enabled. Adding Solr mbeans to JMX Server: com.sun.jmx.mbeanserver.JmxMBeanServer@79613135
[junit4:junit4]   2> 11189 T1318 oasc.SolrCore.initDirectoryFactory solr.NRTCachingDirectoryFactory
[junit4:junit4]   2> 11190 T1318 oasc.CachingDirectoryFactory.get return new directory for /usr/home/hudson/hudson-slave/workspace/Lucene-Solr-Tests-4.x-java7/solr/build/solr-core/test/J0/./org.apache.solr.cloud.BasicDistributedZkTest-1360760602291/jetty3 forceNew:false
[junit4:junit4]   2> 11191 T1318 oasc.CachingDirectoryFactory.close Releasing directory:/usr/home/hudson/hudson-slave/workspace/Lucene-Solr-Tests-4.x-java7/solr/build/solr-core/test/J0/./org.apache.solr.cloud.BasicDistributedZkTest-1360760602291/jetty3
[junit4:junit4]   2> 11191 T1318 oasc.SolrCore.getNewIndexDir New index directory detected: old=null new=./org.apache.solr.cloud.BasicDistributedZkTest-1360760602291/jetty3/index/
[junit4:junit4]   2> 11192 T1318 oasc.SolrCore.initIndex WARNING [collection1] Solr index directory './org.apache.solr.cloud.BasicDistributedZkTest-1360760602291/jetty3/index' doesn't exist. Creating new index...
[junit4:junit4]   2> 11193 T1318 oasc.CachingDirectoryFactory.get return new directory for /usr/home/hudson/hudson-slave/workspace/Lucene-Solr-Tests-4.x-java7/solr/build/solr-core/test/J0/./org.apache.solr.cloud.BasicDistributedZkTest-1360760602291/jetty3/index forceNew:false
[junit4:junit4]   2> 11199 T1318 oasc.SolrDeletionPolicy.onCommit SolrDeletionPolicy.onCommit: commits:num=1
[junit4:junit4]   2> 		commit{dir=RateLimitedDirectoryWrapper(NRTCachingDirectory(org.apache.lucene.store.NIOFSDirectory@/usr/home/hudson/hudson-slave/workspace/Lucene-Solr-Tests-4.x-java7/solr/build/solr-core/test/J0/org.apache.solr.cloud.BasicDistributedZkTest-1360760602291/jetty3/index lockFactory=org.apache.lucene.store.NativeFSLockFactory@31f90ad4; maxCacheMB=48.0 maxMergeSizeMB=4.0)),segFN=segments_1,generation=1,filenames=[segments_1]
[junit4:junit4]   2> 11200 T1318 oasc.SolrDeletionPolicy.updateCommits newest commit = 1[segments_1]
[junit4:junit4]   2> 11201 T1318 oasc.CachingDirectoryFactory.close Releasing directory:/usr/home/hudson/hudson-slave/workspace/Lucene-Solr-Tests-4.x-java7/solr/build/solr-core/test/J0/./org.apache.solr.cloud.BasicDistributedZkTest-1360760602291/jetty3/index
[junit4:junit4]   2> 11201 T1318 oasc.SolrCore.initWriters created xml: solr.XMLResponseWriter
[junit4:junit4]   2> 11203 T1318 oasup.UpdateRequestProcessorChain.init inserting DistributedUpdateProcessorFactory into updateRequestProcessorChain "dedupe"
[junit4:junit4]   2> 11204 T1318 oasup.UpdateRequestProcessorChain.init inserting DistributedUpdateProcessorFactory into updateRequestProcessorChain "dedupe-allfields"
[junit4:junit4]   2> 11204 T1318 oasup.UpdateRequestProcessorChain.init inserting DistributedUpdateProcessorFactory into updateRequestProcessorChain "stored_sig"
[junit4:junit4]   2> 11204 T1318 oasup.UpdateRequestProcessorChain.init inserting DistributedUpdateProcessorFactory into updateRequestProcessorChain "uniq-fields"
[junit4:junit4]   2> 11205 T1318 oasup.UpdateRequestProcessorChain.init inserting DistributedUpdateProcessorFactory into updateRequestProcessorChain "distrib-dup-test-chain-implicit"
[junit4:junit4]   2> 11205 T1318 oasc.RequestHandlers.initHandlersFromConfig adding lazy requestHandler: solr.ReplicationHandler
[junit4:junit4]   2> 11206 T1318 oasc.RequestHandlers.initHandlersFromConfig created /replication: solr.ReplicationHandler
[junit4:junit4]   2> 11206 T1318 oasc.RequestHandlers.initHandlersFromConfig created standard: solr.StandardRequestHandler
[junit4:junit4]   2> 11207 T1318 oasc.RequestHandlers.initHandlersFromConfig created /get: solr.RealTimeGetHandler
[junit4:junit4]   2> 11207 T1318 oasc.RequestHandlers.initHandlersFromConfig created dismax: solr.SearchHandler
[junit4:junit4]   2> 11208 T1318 oasc.RequestHandlers.initHandlersFromConfig created mock: org.apache.solr.core.MockQuerySenderListenerReqHandler
[junit4:junit4]   2> 11209 T1318 oasc.RequestHandlers.initHandlersFromConfig created /admin/: org.apache.solr.handler.admin.AdminHandlers
[junit4:junit4]   2> 11209 T1318 oasc.RequestHandlers.initHandlersFromConfig created defaults: solr.StandardRequestHandler
[junit4:junit4]   2> 11209 T1318 oasc.RequestHandlers.initHandlersFromConfig adding lazy requestHandler: solr.StandardRequestHandler
[junit4:junit4]   2> 11210 T1318 oasc.RequestHandlers.initHandlersFromConfig created lazy: solr.StandardRequestHandler
[junit4:junit4]   2> 11210 T1318 oasc.RequestHandlers.initHandlersFromConfig created /update: solr.UpdateRequestHandler
[junit4:junit4]   2> 11211 T1318 oasc.RequestHandlers.initHandlersFromConfig created /terms: org.apache.solr.handler.component.SearchHandler
[junit4:junit4]   2> 11211 T1318 oasc.RequestHandlers.initHandlersFromConfig created spellCheckCompRH: org.apache.solr.handler.component.SearchHandler
[junit4:junit4]   2> 11212 T1318 oasc.RequestHandlers.initHandlersFromConfig created spellCheckCompRH_Direct: org.apache.solr.handler.component.SearchHandler
[junit4:junit4]   2> 11212 T1318 oasc.RequestHandlers.initHandlersFromConfig created spellCheckWithWordbreak: org.apache.solr.handler.component.SearchHandler
[junit4:junit4]   2> 11213 T1318 oasc.RequestHandlers.initHandlersFromConfig created spellCheckWithWordbreak_Direct: org.apache.solr.handler.component.SearchHandler
[junit4:junit4]   2> 11214 T1318 oasc.RequestHandlers.initHandlersFromConfig created spellCheckCompRH1: org.apache.solr.handler.component.SearchHandler
[junit4:junit4]   2> 11214 T1318 oasc.RequestHandlers.initHandlersFromConfig created mltrh: org.apache.solr.handler.component.SearchHandler
[junit4:junit4]   2> 11215 T1318 oasc.RequestHandlers.initHandlersFromConfig created tvrh: org.apache.solr.handler.component.SearchHandler
[junit4:junit4]   2> 11215 T1318 oasc.RequestHandlers.initHandlersFromConfig created /mlt: solr.MoreLikeThisHandler
[junit4:junit4]   2> 11216 T1318 oasc.RequestHandlers.initHandlersFromConfig created /debug/dump: solr.DumpRequestHandler
[junit4:junit4]   2> 11228 T1318 oashl.XMLLoader.init xsltCacheLifetimeSeconds=60
[junit4:junit4]   2> 11233 T1318 oasc.SolrCore.initDeprecatedSupport WARNING solrconfig.xml uses deprecated <admin/gettableFiles>, Please update your config to use the ShowFileRequestHandler.
[junit4:junit4]   2> 11235 T1318 oasc.SolrCore.initDeprecatedSupport WARNING adding ShowFileRequestHandler with hidden files: [SCHEMA.XML, OLD_SYNONYMS.TXT, STOPWORDS.TXT, PROTWORDS.TXT, OPEN-EXCHANGE-RATES.JSON, SYNONYMS.TXT, CURRENCY.XML, MAPPING-ISOLATIN1ACCENT.TXT]
[junit4:junit4]   2> 11237 T1318 oasc.CachingDirectoryFactory.close Releasing directory:/usr/home/hudson/hudson-slave/workspace/Lucene-Solr-Tests-4.x-java7/solr/build/solr-core/test/J0/./org.apache.solr.cloud.BasicDistributedZkTest-1360760602291/jetty3
[junit4:junit4]   2> 11239 T1318 oass.SolrIndexSearcher.<init> Opening Searcher@5748dd5b main
[junit4:junit4]   2> 11240 T1318 oasu.CommitTracker.<init> Hard AutoCommit: disabled
[junit4:junit4]   2> 11240 T1318 oasu.CommitTracker.<init> Soft AutoCommit: disabled
[junit4:junit4]   2> 11241 T1318 oashc.SpellCheckComponent.inform Initializing spell checkers
[junit4:junit4]   2> 11248 T1318 oass.DirectSolrSpellChecker.init init: {name=direct,classname=DirectSolrSpellChecker,field=lowerfilt,minQueryLength=3}
[junit4:junit4]   2> 11306 T1319 oasc.SolrCore.registerSearcher [collection1] Registered new searcher Searcher@5748dd5b main{StandardDirectoryReader(segments_1:1)}
[junit4:junit4]   2> 11312 T1318 oasc.ZkController.publish publishing core=collection1 state=down
[junit4:junit4]   2> 11312 T1318 oasc.ZkController.publish numShards not found on descriptor - reading it from system property
[junit4:junit4]   2> 11399 T1269 oascc.ZkStateReader.updateClusterState Updating cloud state from ZooKeeper... 
[junit4:junit4]   2> 11399 T1269 oasc.Overseer$ClusterStateUpdater.updateState Update state numShards=2 message={
[junit4:junit4]   2> 	  "operation":"state",
[junit4:junit4]   2> 	  "numShards":"2",
[junit4:junit4]   2> 	  "shard":"shard2",
[junit4:junit4]   2> 	  "roles":null,
[junit4:junit4]   2> 	  "state":"active",
[junit4:junit4]   2> 	  "core":"collection1",
[junit4:junit4]   2> 	  "collection":"collection1",
[junit4:junit4]   2> 	  "node_name":"127.0.0.1:29341_jc",
[junit4:junit4]   2> 	  "base_url":"http://127.0.0.1:29341/jc"}
[junit4:junit4]   2> 11404 T1269 oasc.Overseer$ClusterStateUpdater.updateState Update state numShards=2 message={
[junit4:junit4]   2> 	  "operation":"state",
[junit4:junit4]   2> 	  "numShards":"2",
[junit4:junit4]   2> 	  "shard":null,
[junit4:junit4]   2> 	  "roles":null,
[junit4:junit4]   2> 	  "state":"down",
[junit4:junit4]   2> 	  "core":"collection1",
[junit4:junit4]   2> 	  "collection":"collection1",
[junit4:junit4]   2> 	  "node_name":"127.0.0.1:29346_jc",
[junit4:junit4]   2> 	  "base_url":"http://127.0.0.1:29346/jc"}
[junit4:junit4]   2> 11404 T1269 oasc.Overseer$ClusterStateUpdater.updateState Collection already exists with numShards=2
[junit4:junit4]   2> 11404 T1269 oasc.Overseer$ClusterStateUpdater.updateState Assigning new node to shard shard=shard1
[junit4:junit4]   2> 11416 T1268 oascc.ZkStateReader$2.process A cluster state change: WatchedEvent state:SyncConnected type:NodeDataChanged path:/clusterstate.json, has occurred - updating... (live nodes size: 4)
[junit4:junit4]   2> 11416 T1317 oascc.ZkStateReader$2.process A cluster state change: WatchedEvent state:SyncConnected type:NodeDataChanged path:/clusterstate.json, has occurred - updating... (live nodes size: 4)
[junit4:junit4]   2> 11416 T1274 oascc.ZkStateReader$2.process A cluster state change: WatchedEvent state:SyncConnected type:NodeDataChanged path:/clusterstate.json, has occurred - updating... (live nodes size: 4)
[junit4:junit4]   2> 11416 T1302 oascc.ZkStateReader$2.process A cluster state change: WatchedEvent state:SyncConnected type:NodeDataChanged path:/clusterstate.json, has occurred - updating... (live nodes size: 4)
[junit4:junit4]   2> 11416 T1287 oascc.ZkStateReader$2.process A cluster state change: WatchedEvent state:SyncConnected type:NodeDataChanged path:/clusterstate.json, has occurred - updating... (live nodes size: 4)
[junit4:junit4]   2> 12314 T1318 oasc.CoreContainer.registerCore registering core: collection1
[junit4:junit4]   2> 12314 T1318 oasc.ZkController.register Register replica - core:collection1 address:http://127.0.0.1:29346/jc collection:collection1 shard:shard1
[junit4:junit4]   2> 12318 T1318 oasc.ZkController.register We are http://127.0.0.1:29346/jc/collection1/ and leader is http://127.0.0.1:29335/jc/collection1/
[junit4:junit4]   2> 12318 T1318 oasc.ZkController.register No LogReplay needed for core=collection1 baseURL=http://127.0.0.1:29346/jc
[junit4:junit4]   2> 12319 T1318 oasc.ZkController.checkRecovery Core needs to recover:collection1
[junit4:junit4]   2> 12319 T1318 oasu.DefaultSolrCoreState.doRecovery Running recovery - first canceling any ongoing recovery
[junit4:junit4]   2> ASYNC  NEW_CORE C35 name=collection1 org.apache.solr.core.SolrCore@4d7fce36 url=http://127.0.0.1:29346/jc/collection1 node=127.0.0.1:29346_jc C35_STATE=coll:collection1 core:collection1 props:{shard=null, roles=null, state=down, core=collection1, collection=collection1, node_name=127.0.0.1:29346_jc, base_url=http://127.0.0.1:29346/jc}
[junit4:junit4]   2> 12320 T1320 C35 P29346 oasc.RecoveryStrategy.run Starting recovery process.  core=collection1 recoveringAfterStartup=true
[junit4:junit4]   2> 12321 T1318 oascc.ZkStateReader.updateClusterState Updating cloud state from ZooKeeper... 
[junit4:junit4]   2> 12321 T1320 C35 P29346 oasc.RecoveryStrategy.doRecovery ###### startupVersions=[]
[junit4:junit4]   2> 12321 T1320 C35 P29346 oasc.ZkController.publish publishing core=collection1 state=recovering
[junit4:junit4]   2> 12321 T1320 C35 P29346 oasc.ZkController.publish numShards not found on descriptor - reading it from system property
[junit4:junit4]   2> 12322 T1246 oass.SolrDispatchFilter.init user.dir=/usr/home/hudson/hudson-slave/workspace/Lucene-Solr-Tests-4.x-java7/solr/build/solr-core/test/J0
[junit4:junit4]   2> 12323 T1246 oass.SolrDispatchFilter.init SolrDispatchFilter.init() done
[junit4:junit4]   2> 12323 T1320 C35 P29346 oascsi.HttpClientUtil.createClient Creating new http client, config:maxConnections=128&maxConnectionsPerHost=32&followRedirects=false
[junit4:junit4]   2> 12323 T1246 oascsi.HttpClientUtil.createClient Creating new http client, config:maxConnections=128&maxConnectionsPerHost=32&followRedirects=false
[junit4:junit4]   2> 12516 T1246 oejs.Server.doStart jetty-8.1.8.v20121106
[junit4:junit4]   2> 12519 T1246 oejs.AbstractConnector.doStart Started SocketConnector@127.0.0.1:29350
[junit4:junit4]   2> 12519 T1246 oass.SolrDispatchFilter.init SolrDispatchFilter.init()
[junit4:junit4]   2> 12520 T1246 oasc.SolrResourceLoader.locateSolrHome JNDI not configured for solr (NoInitialContextEx)
[junit4:junit4]   2> 12520 T1246 oasc.SolrResourceLoader.locateSolrHome using system property solr.solr.home: /usr/home/hudson/hudson-slave/workspace/Lucene-Solr-Tests-4.x-java7/solr/build/solr-core/test/J0/./org.apache.solr.cloud.BasicDistributedZkTest-jetty4-1360760614629
[junit4:junit4]   2> 12521 T1246 oasc.CoreContainer$Initializer.initialize looking for solr.xml: /usr/home/hudson/hudson-slave/workspace/Lucene-Solr-Tests-4.x-java7/solr/build/solr-core/test/J0/./org.apache.solr.cloud.BasicDistributedZkTest-jetty4-1360760614629/solr.xml
[junit4:junit4]   2> 12521 T1246 oasc.CoreContainer.<init> New CoreContainer 1923747448
[junit4:junit4]   2> 12522 T1246 oasc.CoreContainer.load Loading CoreContainer using Solr Home: '/usr/home/hudson/hudson-slave/workspace/Lucene-Solr-Tests-4.x-java7/solr/build/solr-core/test/J0/./org.apache.solr.cloud.BasicDistributedZkTest-jetty4-1360760614629/'
[junit4:junit4]   2> 12522 T1246 oasc.SolrResourceLoader.<init> new SolrResourceLoader for directory: '/usr/home/hudson/hudson-slave/workspace/Lucene-Solr-Tests-4.x-java7/solr/build/solr-core/test/J0/./org.apache.solr.cloud.BasicDistributedZkTest-jetty4-1360760614629/'
[junit4:junit4]   2> 12582 T1246 oashc.HttpShardHandlerFactory.getParameter Setting socketTimeout to: 60000
[junit4:junit4]   2> 12583 T1246 oashc.HttpShardHandlerFactory.getParameter Setting urlScheme to: http://
[junit4:junit4]   2> 12583 T1246 oashc.HttpShardHandlerFactory.getParameter Setting connTimeout to: 15000
[junit4:junit4]   2> 12584 T1246 oashc.HttpShardHandlerFactory.getParameter Setting maxConnectionsPerHost to: 20
[junit4:junit4]   2> 12584 T1246 oashc.HttpShardHandlerFactory.getParameter Setting corePoolSize to: 0
[junit4:junit4]   2> 12584 T1246 oashc.HttpShardHandlerFactory.getParameter Setting maximumPoolSize to: 2147483647
[junit4:junit4]   2> 12585 T1246 oashc.HttpShardHandlerFactory.getParameter Setting maxThreadIdleTime to: 5
[junit4:junit4]   2> 12585 T1246 oashc.HttpShardHandlerFactory.getParameter Setting sizeOfQueue to: -1
[junit4:junit4]   2> 12586 T1246 oashc.HttpShardHandlerFactory.getParameter Setting fairnessPolicy to: false
[junit4:junit4]   2> 12586 T1246 oascsi.HttpClientUtil.createClient Creating new http client, config:maxConnectionsPerHost=20&maxConnections=10000&socketTimeout=60000&connTimeout=15000&retry=false
[junit4:junit4]   2> 12660 T1246 oasc.CoreContainer.load Registering Log Listener
[junit4:junit4]   2> 12679 T1246 oasc.CoreContainer.initZooKeeper Zookeeper client=127.0.0.1:29321/solr
[junit4:junit4]   2> 12680 T1246 oasc.ZkController.checkChrootPath zkHost includes chroot
[junit4:junit4]   2> 12680 T1246 oaz.ZooKeeper.<init> Initiating client connection, connectString=127.0.0.1:29321 sessionTimeout=60000 watcher=org.apache.solr.common.cloud.ConnectionManager@6c270e9f
[junit4:junit4]   2> 12681 T1246 oascc.ConnectionManager.waitForConnected Waiting for client to connect to ZooKeeper
[junit4:junit4]   2> 12682 T1330 oaz.ClientCnxn$SendThread.logStartConnect Opening socket connection to server localhost/127.0.0.1:29321. Will not attempt to authenticate using SASL (access denied ("javax.security.auth.AuthPermission" "getLoginConfiguration"))
[junit4:junit4]   2> 12683 T1330 oaz.ClientCnxn$SendThread.primeConnection Socket connection established to localhost/127.0.0.1:29321, initiating session
[junit4:junit4]   2> 12683 T1248 oazs.NIOServerCnxnFactory.run Accepted socket connection from /140.211.11.196:29351
[junit4:junit4]   2> 12684 T1248 oazs.ZooKeeperServer.processConnectRequest Client attempting to establish new session at /140.211.11.196:29351
[junit4:junit4]   2> 12686 T1250 oazs.ZooKeeperServer.finishSessionInit Established session 0x13cd3a6febb000b with negotiated timeout 20000 for client /140.211.11.196:29351
[junit4:junit4]   2> 12686 T1330 oaz.ClientCnxn$SendThread.onConnected Session establishment complete on server localhost/127.0.0.1:29321, sessionid = 0x13cd3a6febb000b, negotiated timeout = 20000
[junit4:junit4]   2> 12686 T1331 oascc.ConnectionManager.process Watcher org.apache.solr.common.cloud.ConnectionManager@6c270e9f name:ZooKeeperConnection Watcher:127.0.0.1:29321 got event WatchedEvent state:SyncConnected type:None path:null path:null type:None
[junit4:junit4]   2> 12686 T1246 oascc.ConnectionManager.waitForConnected Client is connected to ZooKeeper
[junit4:junit4]   2> 12688 T1251 oazs.PrepRequestProcessor.pRequest2Txn Processed session termination for sessionid: 0x13cd3a6febb000b
[junit4:junit4]   2> 12703 T1331 oaz.ClientCnxn$EventThread.run EventThread shut down
[junit4:junit4]   2> 12703 T1248 oazs.NIOServerCnxn.closeSock Closed socket connection for client /140.211.11.196:29351 which had sessionid 0x13cd3a6febb000b
[junit4:junit4]   2> 12703 T1246 oaz.ZooKeeper.close Session: 0x13cd3a6febb000b closed
[junit4:junit4]   2> 12704 T1246 oascsi.HttpClientUtil.createClient Creating new http client, config:maxConnections=500&maxConnectionsPerHost=16&socketTimeout=60000&connTimeout=15000
[junit4:junit4]   2> 12715 T1246 oaz.ZooKeeper.<init> Initiating client connection, connectString=127.0.0.1:29321/solr sessionTimeout=30000 watcher=org.apache.solr.common.cloud.ConnectionManager@ece2091
[junit4:junit4]   2> 12716 T1246 oascc.ConnectionManager.waitForConnected Waiting for client to connect to ZooKeeper
[junit4:junit4]   2> 12716 T1332 oaz.ClientCnxn$SendThread.logStartConnect Opening socket connection to server localhost/127.0.0.1:29321. Will not attempt to authenticate using SASL (access denied ("javax.security.auth.AuthPermission" "getLoginConfiguration"))
[junit4:junit4]   2> 12717 T1332 oaz.ClientCnxn$SendThread.primeConnection Socket connection established to localhost/127.0.0.1:29321, initiating session
[junit4:junit4]   2> 12717 T1248 oazs.NIOServerCnxnFactory.run Accepted socket connection from /140.211.11.196:29352
[junit4:junit4]   2> 12718 T1248 oazs.ZooKeeperServer.processConnectRequest Client attempting to establish new session at /140.211.11.196:29352
[junit4:junit4]   2> 12719 T1250 oazs.ZooKeeperServer.finishSessionInit Established session 0x13cd3a6febb000c with negotiated timeout 20000 for client /140.211.11.196:29352
[junit4:junit4]   2> 12719 T1332 oaz.ClientCnxn$SendThread.onConnected Session establishment complete on server localhost/127.0.0.1:29321, sessionid = 0x13cd3a6febb000c, negotiated timeout = 20000
[junit4:junit4]   2> 12719 T1333 oascc.ConnectionManager.process Watcher org.apache.solr.common.cloud.ConnectionManager@ece2091 name:ZooKeeperConnection Watcher:127.0.0.1:29321/solr got event WatchedEvent state:SyncConnected type:None path:null path:null type:None
[junit4:junit4]   2> 12719 T1246 oascc.ConnectionManager.waitForConnected Client is connected to ZooKeeper
[junit4:junit4]   2> 12721 T1251 oazs.PrepRequestProcessor.pRequest Got user-level KeeperException when processing sessionid:0x13cd3a6febb000c type:create cxid:0x1 zxid:0x9f txntype:-1 reqpath:n/a Error Path:/solr/overseer Error:KeeperErrorCode = NodeExists for /solr/overseer
[junit4:junit4]   2> 12722 T1251 oazs.PrepRequestProcessor.pRequest Got user-level KeeperException when processing sessionid:0x13cd3a6febb000c type:create cxid:0x2 zxid:0xa0 txntype:-1 reqpath:n/a Error Path:/solr/overseer Error:KeeperErrorCode = NodeExists for /solr/overseer
[junit4:junit4]   2> 12731 T1246 oascc.ZkStateReader.createClusterStateWatchersAndUpdate Updating cluster state from ZooKeeper... 
[junit4:junit4]   2> 12733 T1246 oasc.ZkController.createEphemeralLiveNode Register node as live in ZooKeeper:/live_nodes/127.0.0.1:29350_jc
[junit4:junit4]   2> 12734 T1251 oazs.PrepRequestProcessor.pRequest Got user-level KeeperException when processing sessionid:0x13cd3a6febb000c type:delete cxid:0x9 zxid:0xa1 txntype:-1 reqpath:n/a Error Path:/solr/live_nodes/127.0.0.1:29350_jc Error:KeeperErrorCode = NoNode for /solr/live_nodes/127.0.0.1:29350_jc
[junit4:junit4]   2> 12735 T1246 oascc.SolrZkClient.makePath makePath: /live_nodes/127.0.0.1:29350_jc
[junit4:junit4]   2> 12738 T1333 oascc.ZkStateReader$3.process Updating live nodes... (5)
[junit4:junit4]   2> 12739 T1274 oascc.ZkStateReader$3.process Updating live nodes... (5)
[junit4:junit4]   2> 12739 T1302 oascc.ZkStateReader$3.process Updating live nodes... (5)
[junit4:junit4]   2> 12739 T1287 oascc.ZkStateReader$3.process Updating live nodes... (5)
[junit4:junit4]   2> 12739 T1317 oascc.ZkStateReader$3.process Updating live nodes... (5)
[junit4:junit4]   2> 12739 T1268 oascc.ZkStateReader$3.process Updating live nodes... (5)
[junit4:junit4]   2> 12739 T1287 oascc.ZkStateReader$2.process A cluster state change: WatchedEvent state:SyncConnected type:NodeChildrenChanged path:/live_nodes, has occurred - updating... (live nodes size: 5)
[junit4:junit4]   2> 12739 T1302 oascc.ZkStateReader$2.process A cluster state change: WatchedEvent state:SyncConnected type:NodeChildrenChanged path:/live_nodes, has occurred - updating... (live nodes size: 5)
[junit4:junit4]   2> 12739 T1317 oascc.ZkStateReader$2.process A cluster state change: WatchedEvent state:SyncConnected type:NodeChildrenChanged path:/live_nodes, has occurred - updating... (live nodes size: 5)
[junit4:junit4]   2> 12739 T1274 oascc.ZkStateReader$2.process A cluster state change: WatchedEvent state:SyncConnected type:NodeChildrenChanged path:/live_nodes, has occurred - updating... (live nodes size: 5)
[junit4:junit4]   2> 12739 T1268 oascc.ZkStateReader$2.process A cluster state change: WatchedEvent state:SyncConnected type:NodeChildrenChanged path:/live_nodes, has occurred - updating... (live nodes size: 5)
[junit4:junit4]   2> 12748 T1334 oasc.CoreContainer.create Creating SolrCore 'collection1' using instanceDir: /usr/home/hudson/hudson-slave/workspace/Lucene-Solr-Tests-4.x-java7/solr/build/solr-core/test/J0/./org.apache.solr.cloud.BasicDistributedZkTest-jetty4-1360760614629/collection1
[junit4:junit4]   2> 12748 T1334 oasc.ZkController.createCollectionZkNode Check for collection zkNode:collection1
[junit4:junit4]   2> 12749 T1334 oasc.ZkController.createCollectionZkNode Collection zkNode exists
[junit4:junit4]   2> 12749 T1334 oasc.ZkController.readConfigName Load collection config from:/collections/collection1
[junit4:junit4]   2> 12751 T1334 oasc.SolrResourceLoader.<init> new SolrResourceLoader for directory: '/usr/home/hudson/hudson-slave/workspace/Lucene-Solr-Tests-4.x-java7/solr/build/solr-core/test/J0/./org.apache.solr.cloud.BasicDistributedZkTest-jetty4-1360760614629/collection1/'
[junit4:junit4]   2> 12752 T1334 oasc.SolrResourceLoader.replaceClassLoader Adding 'file:/usr/home/hudson/hudson-slave/workspace/Lucene-Solr-Tests-4.x-java7/solr/build/solr-core/test/J0/org.apache.solr.cloud.BasicDistributedZkTest-jetty4-1360760614629/collection1/lib/README' to classloader
[junit4:junit4]   2> 12753 T1334 oasc.SolrResourceLoader.replaceClassLoader Adding 'file:/usr/home/hudson/hudson-slave/workspace/Lucene-Solr-Tests-4.x-java7/solr/build/solr-core/test/J0/org.apache.solr.cloud.BasicDistributedZkTest-jetty4-1360760614629/collection1/lib/classes/' to classloader
[junit4:junit4]   2> 12813 T1334 oasc.SolrConfig.<init> Using Lucene MatchVersion: LUCENE_42
[junit4:junit4]   2> 12887 T1334 oasc.SolrConfig.<init> Loaded SolrConfig: solrconfig.xml
[junit4:junit4]   2> 12932 T1269 oascc.ZkStateReader.updateClusterState Updating cloud state from ZooKeeper... 
[junit4:junit4]   2> 12932 T1269 oasc.Overseer$ClusterStateUpdater.updateState Update state numShards=2 message={
[junit4:junit4]   2> 	  "operation":"state",
[junit4:junit4]   2> 	  "numShards":"2",
[junit4:junit4]   2> 	  "shard":"shard1",
[junit4:junit4]   2> 	  "roles":null,
[junit4:junit4]   2> 	  "state":"recovering",
[junit4:junit4]   2> 	  "core":"collection1",
[junit4:junit4]   2> 	  "collection":"collection1",
[junit4:junit4]   2> 	  "node_name":"127.0.0.1:29346_jc",
[junit4:junit4]   2> 	  "base_url":"http://127.0.0.1:29346/jc"}
[junit4:junit4]   2> 12947 T1268 oascc.ZkStateReader$2.process A cluster state change: WatchedEvent state:SyncConnected type:NodeDataChanged path:/clusterstate.json, has occurred - updating... (live nodes size: 5)
[junit4:junit4]   2> 12947 T1287 oascc.ZkStateReader$2.process A cluster state change: WatchedEvent state:SyncConnected type:NodeDataChanged path:/clusterstate.json, has occurred - updating... (live nodes size: 5)
[junit4:junit4]   2> 12947 T1302 oascc.ZkStateReader$2.process A cluster state change: WatchedEvent state:SyncConnected type:NodeDataChanged path:/clusterstate.json, has occurred - updating... (live nodes size: 5)
[junit4:junit4]   2> 12947 T1274 oascc.ZkStateReader$2.process A cluster state change: WatchedEvent state:SyncConnected type:NodeDataChanged path:/clusterstate.json, has occurred - updating... (live nodes size: 5)
[junit4:junit4]   2> 12947 T1317 oascc.ZkStateReader$2.process A cluster state change: WatchedEvent state:SyncConnected type:NodeDataChanged path:/clusterstate.json, has occurred - updating... (live nodes size: 5)
[junit4:junit4]   2> 12988 T1334 oass.IndexSchema.readSchema Reading Solr Schema
[junit4:junit4]   2> 12988 T1333 oascc.ZkStateReader$2.process A cluster state change: WatchedEvent state:SyncConnected type:NodeDataChanged path:/clusterstate.json, has occurred - updating... (live nodes size: 5)
[junit4:junit4]   2> 12997 T1334 oass.IndexSchema.readSchema Schema name=test
[junit4:junit4]   2> 13632 T1334 oass.OpenExchangeRatesOrgProvider.init Initialized with rates=open-exchange-rates.json, refreshInterval=1440.
[junit4:junit4]   2> 13644 T1334 oass.IndexSchema.readSchema default search field in schema is text
[junit4:junit4]   2> 13648 T1334 oass.IndexSchema.readSchema unique key field: id
[junit4:junit4]   2> 13665 T1334 oass.FileExchangeRateProvider.reload Reloading exchange rates from file currency.xml
[junit4:junit4]   2> 13671 T1334 oass.FileExchangeRateProvider.reload Reloading exchange rates from file currency.xml
[junit4:junit4]   2> 13676 T1334 oass.OpenExchangeRatesOrgProvider.reload Reloading exchange rates from open-exchange-rates.json
[junit4:junit4]   2> 13677 T1334 oass.OpenExchangeRatesOrgProvider.reload Reloading exchange rates from open-exchange-rates.json
[junit4:junit4]   2> 13678 T1334 oasc.SolrCore.<init> [collection1] Opening new SolrCore at /usr/home/hudson/hudson-slave/workspace/Lucene-Solr-Tests-4.x-java7/solr/build/solr-core/test/J0/./org.apache.solr.cloud.BasicDistributedZkTest-jetty4-1360760614629/collection1/, dataDir=./org.apache.solr.cloud.BasicDistributedZkTest-1360760602291/jetty4/
[junit4:junit4]   2> 13679 T1334 oasc.JmxMonitoredMap.<init> JMX monitoring is enabled. Adding Solr mbeans to JMX Server: com.sun.jmx.mbeanserver.JmxMBeanServer@79613135
[junit4:junit4]   2> 13679 T1334 oasc.SolrCore.initDirectoryFactory solr.NRTCachingDirectoryFactory
[junit4:junit4]   2> 13680 T1334 oasc.CachingDirectoryFactory.get return new directory for /usr/home/hudson/hudson-slave/workspace/Lucene-Solr-Tests-4.x-java7/solr/build/solr-core/test/J0/./org.apache.solr.cloud.BasicDistributedZkTest-1360760602291/jetty4 forceNew:false
[junit4:junit4]   2> 13681 T1334 oasc.CachingDirectoryFactory.close Releasing directory:/usr/home/hudson/hudson-slave/workspace/Lucene-Solr-Tests-4.x-java7/solr/build/solr-core/test/J0/./org.apache.solr.cloud.BasicDistributedZkTest-1360760602291/jetty4
[junit4:junit4]   2> 13681 T1334 oasc.SolrCore.getNewIndexDir New index directory detected: old=null new=./org.apache.solr.cloud.BasicDistributedZkTest-1360760602291/jetty4/index/
[junit4:junit4]   2> 13682 T1334 oasc.SolrCore.initIndex WARNING [collection1] Solr index directory './org.apache.solr.cloud.BasicDistributedZkTest-1360760602291/jetty4/index' doesn't exist. Creating new index...
[junit4:junit4]   2> 13683 T1334 oasc.CachingDirectoryFactory.get return new directory for /usr/home/hudson/hudson-slave/workspace/Lucene-Solr-Tests-4.x-java7/solr/build/solr-core/test/J0/./org.apache.solr.cloud.BasicDistributedZkTest-1360760602291/jetty4/index forceNew:false
[junit4:junit4]   2> 13690 T1334 oasc.SolrDeletionPolicy.onCommit SolrDeletionPolicy.onCommit: commits:num=1
[junit4:junit4]   2> 		commit{dir=RateLimitedDirectoryWrapper(NRTCachingDirectory(org.apache.lucene.store.NIOFSDirectory@/usr/home/hudson/hudson-slave/workspace/Lucene-Solr-Tests-4.x-java7/solr/build/solr-core/test/J0/org.apache.solr.cloud.BasicDistributedZkTest-1360760602291/jetty4/index lockFactory=org.apache.lucene.store.NativeFSLockFactory@43777480; maxCacheMB=48.0 maxMergeSizeMB=4.0)),segFN=segments_1,generation=1,filenames=[segments_1]
[junit4:junit4]   2> 13690 T1334 oasc.SolrDeletionPolicy.updateCommits newest commit = 1[segments_1]
[junit4:junit4]   2> 13691 T1334 oasc.CachingDirectoryFactory.close Releasing directory:/usr/home/hudson/hudson-slave/workspace/Lucene-Solr-Tests-4.x-java7/solr/build/solr-core/test/J0/./org.apache.solr.cloud.BasicDistributedZkTest-1360760602291/jetty4/index
[junit4:junit4]   2> 13692 T1334 oasc.SolrCore.initWriters created xml: solr.XMLResponseWriter
[junit4:junit4]   2> 13694 T1334 oasup.UpdateRequestProcessorChain.init inserting DistributedUpdateProcessorFactory into updateRequestProcessorChain "dedupe"
[junit4:junit4]   2> 13694 T1334 oasup.UpdateRequestProcessorChain.init inserting DistributedUpdateProcessorFactory into updateRequestProcessorChain "dedupe-allfields"
[junit4:junit4]   2> 13695 T1334 oasup.UpdateRequestProcessorChain.init inserting DistributedUpdateProcessorFactory into updateRequestProcessorChain "stored_sig"
[junit4:junit4]   2> 13695 T1334 oasup.UpdateRequestProcessorChain.init inserting DistributedUpdateProcessorFactory into updateRequestProcessorChain "uniq-fields"
[junit4:junit4]   2> 13696 T1334 oasup.UpdateRequestProcessorChain.init inserting DistributedUpdateProcessorFactory into updateRequestProcessorChain "distrib-dup-test-chain-implicit"
[junit4:junit4]   2> 13696 T1334 oasc.RequestHandlers.initHandlersFromConfig adding lazy requestHandler: solr.ReplicationHandler
[junit4:junit4]   2> 13697 T1334 oasc.RequestHandlers.initHandlersFromConfig created /replication: solr.ReplicationHandler
[junit4:junit4]   2> 13697 T1334 oasc.RequestHandlers.initHandlersFromConfig created standard: solr.StandardRequestHandler
[junit4:junit4]   2> 13698 T1334 oasc.RequestHandlers.initHandlersFromConfig created /get: solr.RealTimeGetHandler
[junit4:junit4]   2> 13698 T1334 oasc.RequestHandlers.initHandlersFromConfig created dismax: solr.SearchHandler
[junit4:junit4]   2> 13699 T1334 oasc.RequestHandlers.initHandlersFromConfig created mock: org.apache.solr.core.MockQuerySenderListenerReqHandler
[junit4:junit4]   2> 13699 T1334 oasc.RequestHandlers.initHandlersFromConfig created /admin/: org.apache.solr.handler.admin.AdminHandlers
[junit4:junit4]   2> 13700 T1334 oasc.RequestHandlers.initHandlersFromConfig created defaults: solr.StandardRequestHandler
[junit4:junit4]   2> 13700 T1334 oasc.RequestHandlers.initHandlersFromConfig adding lazy requestHandler: solr.StandardRequestHandler
[junit4:junit4]   2> 13701 T1334 oasc.RequestHandlers.initHandlersFromConfig created lazy: solr.StandardRequestHandler
[junit4:junit4]   2> 13701 T1334 oasc.RequestHandlers.initHandlersFromConfig created /update: solr.UpdateRequestHandler
[junit4:junit4]   2> 13702 T1334 oasc.RequestHandlers.initHandlersFromConfig created /terms: org.apache.solr.handler.component.SearchHandler
[junit4:junit4]   2> 13702 T1334 oasc.RequestHandlers.initHandlersFromConfig created spellCheckCompRH: org.apache.solr.handler.component.SearchHandler
[junit4:junit4]   2> 13703 T1334 oasc.RequestHandlers.initHandlersFromConfig created spellCheckCompRH_Direct: org.apache.solr.handler.component.SearchHandler
[junit4:junit4]   2> 13703 T1334 oasc.RequestHandlers.initHandlersFromConfig created spellCheckWithWordbreak: org.apache.solr.handler.component.SearchHandler
[junit4:junit4]   2> 13704 T1334 oasc.RequestHandlers.initHandlersFromConfig created spellCheckWithWordbreak_Direct: org.apache.solr.handler.component.SearchHandler
[junit4:junit4]   2> 13705 T1334 oasc.RequestHandlers.initHandlersFromConfig created spellCheckCompRH1: org.apache.solr.handler.component.SearchHandler
[junit4:junit4]   2> 13705 T1334 oasc.RequestHandlers.initHandlersFromConfig created mltrh: org.apache.solr.handler.component.SearchHandler
[junit4:junit4]   2> 13706 T1334 oasc.RequestHandlers.initHandlersFromConfig created tvrh: org.apache.solr.handler.component.SearchHandler
[junit4:junit4]   2> 13706 T1334 oasc.RequestHandlers.initHandlersFromConfig created /mlt: solr.MoreLikeThisHandler
[junit4:junit4]   2> 13707 T1334 oasc.RequestHandlers.initHandlersFromConfig created /debug/dump: solr.DumpRequestHandler
[junit4:junit4]   2> 13720 T1334 oashl.XMLLoader.init xsltCacheLifetimeSeconds=60
[junit4:junit4]   2> 13724 T1334 oasc.SolrCore.initDeprecatedSupport WARNING solrconfig.xml uses deprecated <admin/gettableFiles>, Please update your config to use the ShowFileRequestHandler.
[junit4:junit4]   2> 13725 T1334 oasc.SolrCore.initDeprecatedSupport WARNING adding ShowFileRequestHandler with hidden files: [SCHEMA.XML, OLD_SYNONYMS.TXT, STOPWORDS.TXT, PROTWORDS.TXT, OPEN-EXCHANGE-RATES.JSON, SYNONYMS.TXT, CURRENCY.XML, MAPPING-ISOLATIN1ACCENT.TXT]
[junit4:junit4]   2> 13728 T1334 oasc.CachingDirectoryFactory.close Releasing directory:/usr/home/hudson/hudson-slave/workspace/Lucene-Solr-Tests-4.x-java7/solr/build/solr-core/test/J0/./org.apache.solr.cloud.BasicDistributedZkTest-1360760602291/jetty4
[junit4:junit4]   2> 13730 T1334 oass.SolrIndexSearcher.<init> Opening Searcher@11568f93 main
[junit4:junit4]   2> 13731 T1334 oasu.CommitTracker.<init> Hard AutoCommit: disabled
[junit4:junit4]   2> 13731 T1334 oasu.CommitTracker.<init> Soft AutoCommit: disabled
[junit4:junit4]   2> 13732 T1334 oashc.SpellCheckComponent.inform Initializing spell checkers
[junit4:junit4]   2> 13739 T1334 oass.DirectSolrSpellChecker.init init: {name=direct,classname=DirectSolrSpellChecker,field=lowerfilt,minQueryLength=3}
[junit4:junit4]   2> 13789 T1335 oasc.SolrCore.registerSearcher [collection1] Registered new searcher Searcher@11568f93 main{StandardDirectoryReader(segments_1:1)}
[junit4:junit4]   2> 13795 T1334 oasc.ZkController.publish publishing core=collection1 state=down
[junit4:junit4]   2> 13795 T1334 oasc.ZkController.publish numShards not found on descriptor - reading it from system property
[junit4:junit4]   2> 14453 T1269 oascc.ZkStateReader.updateClusterState Updating cloud state from ZooKeeper... 
[junit4:junit4]   2> 14453 T1269 oasc.Overseer$ClusterStateUpdater.updateState Update state numShards=2 message={
[junit4:junit4]   2> 	  "operation":"state",
[junit4:junit4]   2> 	  "numShards":"2",
[junit4:junit4]   2> 	  "shard":null,
[junit4:junit4]   2> 	  "roles":null,
[junit4:junit4]   2> 	  "state":"down",
[junit4:junit4]   2> 	  "core":"collection1",
[junit4:junit4]   2> 	  "collection":"collection1",
[junit4:junit4]   2> 	  "node_name":"127.0.0.1:29350_jc",
[junit4:junit4]   2> 	  "base_url":"http://127.0.0.1:29350/jc"}
[junit4:junit4]   2> 14454 T1269 oasc.Overseer$ClusterStateUpdater.updateState Collection already exists with numShards=2
[junit4:junit4]   2> 14454 T1269 oasc.Overseer$ClusterStateUpdater.updateState Assigning new node to shard shard=shard2
[junit4:junit4]   2> 14472 T1333 oascc.ZkStateReader$2.process A cluster state change: WatchedEvent state:SyncConnected type:NodeDataChanged path:/clusterstate.json, has occurred - updating... (live nodes size: 5)
[junit4:junit4]   2> 14472 T1302 oascc.ZkStateReader$2.process A cluster state change: WatchedEvent state:SyncConnected type:NodeDataChanged path:/clusterstate.json, has occurred - updating... (live nodes size: 5)
[junit4:junit4]   2> 14472 T1274 oascc.ZkStateReader$2.process A cluster state change: WatchedEvent state:SyncConnected type:NodeDataChanged path:/clusterstate.json, has occurred - updating... (live nodes size: 5)
[junit4:junit4]   2> 14472 T1317 oascc.ZkStateReader$2.process A cluster state change: WatchedEvent state:SyncConnected type:NodeDataChanged path:/clusterstate.json, has occurred - updating... (live nodes size: 5)
[junit4:junit4]   2> 14472 T1287 oascc.ZkStateReader$2.process A cluster state change: WatchedEvent state:SyncConnected type:NodeDataChanged path:/clusterstate.json, has occurred - updating... (live nodes size: 5)
[junit4:junit4]   2> 14472 T1268 oascc.ZkStateReader$2.process A cluster state change: WatchedEvent state:SyncConnected type:NodeDataChanged path:/clusterstate.json, has occurred - updating... (live nodes size: 5)
[junit4:junit4]   2> 14798 T1334 oasc.CoreContainer.registerCore registering core: collection1
[junit4:junit4]   2> 14798 T1334 oasc.ZkController.register Register replica - core:collection1 address:http://127.0.0.1:29350/jc collection:collection1 shard:shard2
[junit4:junit4]   2> 14803 T1334 oasc.ZkController.register We are http://127.0.0.1:29350/jc/collection1/ and leader is http://127.0.0.1:29341/jc/collection1/
[junit4:junit4]   2> 14803 T1334 oasc.ZkController.register No LogReplay needed for core=collection1 baseURL=http://127.0.0.1:29350/jc
[junit4:junit4]   2> 14803 T1334 oasc.ZkController.checkRecovery Core needs to recover:collection1
[junit4:junit4]   2> 14803 T1334 oasu.DefaultSolrCoreState.doRecovery Running recovery - first canceling any ongoing recovery
[junit4:junit4]   2> ASYNC  NEW_CORE C36 name=collection1 org.apache.solr.core.SolrCore@4e6cdf2c url=http://127.0.0.1:29350/jc/collection1 node=127.0.0.1:29350_jc C36_STATE=coll:collection1 core:collection1 props:{shard=null, roles=null, state=down, core=collection1, collection=collection1, node_name=127.0.0.1:29350_jc, base_url=http://127.0.0.1:29350/jc}
[junit4:junit4]   2> 14804 T1336 C36 P29350 oasc.RecoveryStrategy.run Starting recovery process.  core=collection1 recoveringAfterStartup=true
[junit4:junit4]   2> 14805 T1336 C36 P29350 oasc.RecoveryStrategy.doRecovery ###### startupVersions=[]
[junit4:junit4]   2> 14805 T1334 oascc.ZkStateReader.updateClusterState Updating cloud state from ZooKeeper... 
[junit4:junit4]   2> 14805 T1336 C36 P29350 oasc.ZkController.publish publishing core=collection1 state=recovering
[junit4:junit4]   2> 14805 T1336 C36 P29350 oasc.ZkController.publish numShards not found on descriptor - reading it from system property
[junit4:junit4]   2> 14806 T1246 oass.SolrDispatchFilter.init user.dir=/usr/home/hudson/hudson-slave/workspace/Lucene-Solr-Tests-4.x-java7/solr/build/solr-core/test/J0
[junit4:junit4]   2> 14807 T1336 C36 P29350 oascsi.HttpClientUtil.createClient Creating new http client, config:maxConnections=128&maxConnectionsPerHost=32&followRedirects=false
[junit4:junit4]   2> 14807 T1246 oass.SolrDispatchFilter.init SolrDispatchFilter.init() done
[junit4:junit4]   2> 14808 T1246 oascsi.HttpClientUtil.createClient Creating new http client, config:maxConnections=128&maxConnectionsPerHost=32&followRedirects=false
[junit4:junit4]   2> 14830 T1246 oascc.ZkStateReader.updateClusterState Updating cloud state from ZooKeeper... 
[junit4:junit4]   2> 14832 T1246 oasc.AbstractDistribZkTestBase.waitForRecoveriesToFinish Wait for recoveries to finish - collection: collection1 failOnTimeout:true timeout (sec):230
[junit4:junit4]   2> 14833 T1246 oascc.ZkStateReader.updateClusterState Updating cloud state from ZooKeeper... 
[junit4:junit4]   2>  C35_STATE=coll:collection1 core:collection1 props:{shard=shard1, roles=null, state=recovering, core=collection1, collection=collection1, node_name=127.0.0.1:29346_jc, base_url=http://127.0.0.1:29346/jc}
[junit4:junit4]   2> 15349 T1320 C35 P29346 oasc.RecoveryStrategy.doRecovery Attempting to PeerSync from http://127.0.0.1:29335/jc/collection1/ core=collection1 - recoveringAfterStartup=true
[junit4:junit4]   2> 15349 T1320 C35 P29346 oasu.PeerSync.sync PeerSync: core=collection1 url=http://127.0.0.1:29346/jc START replicas=[http://127.0.0.1:29335/jc/collection1/] nUpdates=100
[junit4:junit4]   2> 15349 T1320 C35 P29346 oasu.PeerSync.sync WARNING no frame of reference to tell of we've missed updates
[junit4:junit4]   2> 15350 T1320 C35 P29346 oasc.RecoveryStrategy.doRecovery PeerSync Recovery was not successful - trying replication. core=collection1
[junit4:junit4]   2> 15350 T1320 C35 P29346 oasc.RecoveryStrategy.doRecovery Starting Replication Recovery. core=collection1
[junit4:junit4]   2> 15350 T1320 C35 P29346 oasc.RecoveryStrategy.doRecovery Begin buffering updates. core=collection1
[junit4:junit4]   2> 15351 T1320 C35 P29346 oasu.UpdateLog.bufferUpdates Starting to buffer updates. FSUpdateLog{state=ACTIVE, tlog=null}
[junit4:junit4]   2> 15351 T1320 C35 P29346 oasc.RecoveryStrategy.replicate Attempting to replicate from http://127.0.0.1:29335/jc/collection1/. core=collection1
[junit4:junit4]   2> 15351 T1320 C35 P29346 oascsi.HttpClientUtil.createClient Creating new http client, config:maxConnections=128&maxConnectionsPerHost=32&followRedirects=false
[junit4:junit4]   2> ASYNC  NEW_CORE C37 name=collection1 org.apache.solr.core.SolrCore@3ceab45a url=http://127.0.0.1:29335/jc/collection1 node=127.0.0.1:29335_jc C37_STATE=coll:collection1 core:collection1 props:{shard=shard1, roles=null, state=active, core=collection1, collection=collection1, node_name=127.0.0.1:29335_jc, base_url=http://127.0.0.1:29335/jc, leader=true}
[junit4:junit4]   2> 15362 T1278 C37 P29335 REQ /get {getVersions=100&distrib=false&wt=javabin&qt=/get&version=2} status=0 QTime=1 
[junit4:junit4]   2> 15365 T1279 C37 P29335 oasu.DirectUpdateHandler2.commit start commit{,optimize=false,openSearcher=false,waitSearcher=true,expungeDeletes=false,softCommit=false}
[junit4:junit4]   2> 15366 T1279 C37 P29335 oasc.CachingDirectoryFactory.close Releasing directory:/usr/home/hudson/hudson-slave/workspace/Lucene-Solr-Tests-4.x-java7/solr/build/solr-core/test/J0/./org.apache.solr.cloud.BasicDistributedZkTest-1360760602291/jetty1
[junit4:junit4]   2> 15370 T1279 C37 P29335 oasc.SolrDeletionPolicy.onInit SolrDeletionPolicy.onInit: commits:num=1
[junit4:junit4]   2> 		commit{dir=RateLimitedDirectoryWrapper(NRTCachingDirectory(org.apache.lucene.store.NIOFSDirectory@/usr/home/hudson/hudson-slave/workspace/Lucene-Solr-Tests-4.x-java7/solr/build/solr-core/test/J0/org.apache.solr.cloud.BasicDistributedZkTest-1360760602291/jetty1/index lockFactory=org.apache.lucene.store.NativeFSLockFactory@6b12cd20; maxCacheMB=48.0 maxMergeSizeMB=4.0)),segFN=segments_1,generation=1,filenames=[segments_1]
[junit4:junit4]   2> 15371 T1279 C37 P29335 oasc.SolrDeletionPolicy.updateCommits newest commit = 1[segments_1]
[junit4:junit4]   2> 15375 T1279 C37 P29335 oasc.SolrDeletionPolicy.onCommit SolrDeletionPolicy.onCommit: commits:num=2
[junit4:junit4]   2> 		commit{dir=RateLimitedDirectoryWrapper(NRTCachingDirectory(org.apache.lucene.store.NIOFSDirectory@/usr/home/hudson/hudson-slave/workspace/Lucene-Solr-Tests-4.x-java7/solr/build/solr-core/test/J0/org.apache.solr.cloud.BasicDistributedZkTest-1360760602291/jetty1/index lockFactory=org.apache.lucene.store.NativeFSLockFactory@6b12cd20; maxCacheMB=48.0 maxMergeSizeMB=4.0)),segFN=segments_1,generation=1,filenames=[segments_1]
[junit4:junit4]   2> 		commit{dir=RateLimitedDirectoryWrapper(NRTCachingDirectory(org.apache.lucene.store.NIOFSDirectory@/usr/home/hudson/hudson-slave/workspace/Lucene-Solr-Tests-4.x-java7/solr/build/solr-core/test/J0/org.apache.solr.cloud.BasicDistributedZkTest-1360760602291/jetty1/index lockFactory=org.apache.lucene.store.NativeFSLockFactory@6b12cd20; maxCacheMB=48.0 maxMergeSizeMB=4.0)),segFN=segments_2,generation=2,filenames=[segments_2]
[junit4:junit4]   2> 15375 T1279 C37 P29335 oasc.SolrDeletionPolicy.updateCommits newest commit = 2[segments_2]
[junit4:junit4]   2> 15376 T1279 C37 P29335 oasc.CachingDirectoryFactory.close Releasing directory:/usr/home/hudson/hudson-slave/workspace/Lucene-Solr-Tests-4.x-java7/solr/build/solr-core/test/J0/./org.apache.solr.cloud.BasicDistributedZkTest-1360760602291/jetty1
[junit4:junit4]   2> 15377 T1279 C37 P29335 oass.SolrIndexSearcher.<init> Opening Searcher@3356d511 realtime
[junit4:junit4]   2> 15377 T1279 C37 P29335 oasu.DirectUpdateHandler2.commit end_commit_flush
[junit4:junit4]   2> 15377 T1279 C37 P29335 /update {waitSearcher=true&openSearcher=false&commit=true&wt=javabin&commit_end_point=true&version=2&softCommit=false} {commit=} 0 13
[junit4:junit4]   2> 15378 T1320 C35 P29346 oash.ReplicationHandler.inform Commits will be reserved for  10000
[junit4:junit4]   2> 15379 T1320 C35 P29346 oash.SnapPuller.<init>  No value set for 'pollInterval'. Timer Task not started.
[junit4:junit4]   2> 15381 T1280 C37 P29335 oash.ReplicationHandler.inform Commits will be reserved for  10000
[junit4:junit4]   2> 15381 T1280 C37 P29335 REQ /replication {command=indexversion&qt=/replication&wt=javabin&version=2} status=0 QTime=1 
[junit4:junit4]   2> 15382 T1320 C35 P29346 oash.SnapPuller.fetchLatestIndex Master's generation: 2
[junit4:junit4]   2> 15382 T1320 C35 P29346 oash.SnapPuller.fetchLatestIndex Slave's generation: 1
[junit4:junit4]   2> 15382 T1320 C35 P29346 oash.SnapPuller.fetchLatestIndex Starting replication process
[junit4:junit4]   2> 15385 T1280 C37 P29335 oasc.CachingDirectoryFactory.close Releasing directory:/usr/home/hudson/hudson-slave/workspace/Lucene-Solr-Tests-4.x-java7/solr/build/solr-core/test/J0/./org.apache.solr.cloud.BasicDistributedZkTest-1360760602291/jetty1
[junit4:junit4]   2> 15386 T1280 C37 P29335 oasc.CachingDirectoryFactory.close Releasing directory:/usr/home/hudson/hudson-slave/workspace/Lucene-Solr-Tests-4.x-java7/solr/build/solr-core/test/J0/./org.apache.solr.cloud.BasicDistributedZkTest-1360760602291/jetty1/index
[junit4:junit4]   2> 15386 T1280 C37 P29335 REQ /replication {command=filelist&qt=/replication&wt=javabin&generation=2&version=2} status=0 QTime=1 
[junit4:junit4]   2> 15387 T1320 C35 P29346 oash.SnapPuller.fetchLatestIndex Number of files in latest index in master: 1
[junit4:junit4]   2> 15388 T1320 C35 P29346 oasc.CachingDirectoryFactory.get return new directory for /usr/home/hudson/hudson-slave/workspace/Lucene-Solr-Tests-4.x-java7/solr/build/solr-core/test/J0/./org.apache.solr.cloud.BasicDistributedZkTest-1360760602291/jetty3/index.20130213220337671 forceNew:false
[junit4:junit4]   2> 15389 T1320 C35 P29346 oasc.CachingDirectoryFactory.close Releasing directory:/usr/home/hudson/hudson-slave/workspace/Lucene-Solr-Tests-4.x-java7/solr/build/solr-core/test/J0/./org.apache.solr.cloud.BasicDistributedZkTest-1360760602291/jetty3
[junit4:junit4]   2> 15390 T1320 C35 P29346 oash.SnapPuller.fetchLatestIndex Starting download to RateLimitedDirectoryWrapper(NRTCachingDirectory(org.apache.lucene.store.NIOFSDirectory@/usr/home/hudson/hudson-slave/workspace/Lucene-Solr-Tests-4.x-java7/solr/build/solr-core/test/J0/org.apache.solr.cloud.BasicDistributedZkTest-1360760602291/jetty3/index.20130213220337671 lockFactory=org.apache.lucene.store.NativeFSLockFactory@16ab54d3; maxCacheMB=48.0 maxMergeSizeMB=4.0)) fullCopy=true
[junit4:junit4]   2> 15393 T1280 C37 P29335 REQ /replication {file=segments_2&command=filecontent&checksum=true&wt=filestream&qt=/replication&generation=2} status=0 QTime=0 
[junit4:junit4]   2> 15395 T1320 C35 P29346 oasc.CachingDirectoryFactory.close Releasing directory:/usr/home/hudson/hudson-slave/workspace/Lucene-Solr-Tests-4.x-java7/solr/build/solr-core/test/J0/./org.apache.solr.cloud.BasicDistributedZkTest-1360760602291/jetty3/index
[junit4:junit4]   2> 15396 T1320 C35 P29346 oash.SnapPuller.fetchLatestIndex Total time taken for download : 0 secs
[junit4:junit4]   2> 15397 T1320 C35 P29346 oash.SnapPuller.modifyIndexProps New index installed. Updating index properties... index=index.20130213220337671
[junit4:junit4]   2> 15398 T1320 C35 P29346 oasc.CachingDirectoryFactory.close Releasing directory:/usr/home/hudson/hudson-slave/workspace/Lucene-Solr-Tests-4.x-java7/solr/build/solr-core/test/J0/./org.apache.solr.cloud.BasicDistributedZkTest-1360760602291/jetty3
[junit4:junit4]   2> 15398 T1320 C35 P29346 oasc.CachingDirectoryFactory.close Releasing directory:/usr/home/hudson/hudson-slave/workspace/Lucene-Solr-Tests-4.x-java7/solr/build/solr-core/test/J0/./org.apache.solr.cloud.BasicDistributedZkTest-1360760602291/jetty3
[junit4:junit4]   2> 15399 T1320 C35 P29346 oasc.SolrCore.getNewIndexDir New index directory detected: old=./org.apache.solr.cloud.BasicDistributedZkTest-1360760602291/jetty3/index/ new=./org.apache.solr.cloud.BasicDistributedZkTest-1360760602291/jetty3/index.20130213220337671
[junit4:junit4]   2> 15402 T1320 C35 P29346 oasc.SolrDeletionPolicy.onInit SolrDeletionPolicy.onInit: commits:num=1
[junit4:junit4]   2> 		commit{dir=RateLimitedDirectoryWrapper(NRTCachingDirectory(org.apache.lucene.store.NIOFSDirectory@/usr/home/hudson/hudson-slave/workspace/Lucene-Solr-Tests-4.x-java7/solr/build/solr-core/test/J0/org.apache.solr.cloud.BasicDistributedZkTest-1360760602291/jetty3/index.20130213220337671 lockFactory=org.apache.lucene.store.NativeFSLockFactory@16ab54d3; maxCacheMB=48.0 maxMergeSizeMB=4.0)),segFN=segments_2,generation=2,filenames=[segments_2]
[junit4:junit4]   2> 15402 T1320 C35 P29346 oasc.SolrDeletionPolicy.updateCommits newest commit = 2[segments_2]
[junit4:junit4]   2> 15404 T1320 C35 P29346 oasc.CachingDirectoryFactory.close Releasing directory:/usr/home/hudson/hudson-slave/workspace/Lucene-Solr-Tests-4.x-java7/solr/build/solr-core/test/J0/./org.apache.solr.cloud.BasicDistributedZkTest-1360760602291/jetty3
[junit4:junit4]   2> 15404 T1320 C35 P29346 oasu.DefaultSolrCoreState.newIndexWriter Creating new IndexWriter...
[junit4:junit4]   2> 15404 T1320 C35 P29346 oasu.DefaultSolrCoreState.newIndexWriter Waiting until IndexWriter is unused... core=collection1
[junit4:junit4]   2> 15404 T1320 C35 P29346 oasu.DefaultSolrCoreState.newIndexWriter Rollback old IndexWriter... core=collection1
[junit4:junit4]   2> 15405 T1320 C35 P29346 oasc.CachingDirectoryFactory.close Releasing directory:/usr/home/hudson/hudson-slave/workspace/Lucene-Solr-Tests-4.x-java7/solr/build/solr-core/test/J0/./org.apache.solr.cloud.BasicDistributedZkTest-1360760602291/jetty3/index.20130213220337671
[junit4:junit4]   2> 15406 T1320 C35 P29346 oasc.CachingDirectoryFactory.close Releasing directory:/usr/home/hudson/hudson-slave/workspace/Lucene-Solr-Tests-4.x-java7/solr/build/solr-core/test/J0/./org.apache.solr.cloud.BasicDistributedZkTest-1360760602291/jetty3
[junit4:junit4]   2> 15409 T1320 C35 P29346 oasc.SolrDeletionPolicy.onInit SolrDeletionPolicy.onInit: commits:num=1
[junit4:junit4]   2> 		commit{dir=RateLimitedDirectoryWrapper(NRTCachingDirectory(org.apache.lucene.store.NIOFSDirectory@/usr/home/hudson/hudson-slave/workspace/Lucene-Solr-Tests-4.x-java7/solr/build/solr-core/test/J0/org.apache.solr.cloud.BasicDistributedZkTest-1360760602291/jetty3/index.20130213220337671 lockFactory=org.apache.lucene.store.NativeFSLockFactory@16ab54d3; maxCacheMB=48.0 maxMergeSizeMB=4.0)),segFN=segments_2,generation=2,filenames=[segments_2]
[junit4:junit4]   2> 15409 T1320 C35 P29346 oasc.SolrDeletionPolicy.updateCommits newest commit = 2[segments_2]
[junit4:junit4]   2> 15410 T1320 C35 P29346 oasu.DefaultSolrCoreState.newIndexWriter New IndexWriter is ready to be used.
[junit4:junit4]   2> 15410 T1320 C35 P29346 oasc.CachingDirectoryFactory.close Releasing directory:/usr/home/hudson/hudson-slave/workspace/Lucene-Solr-Tests-4.x-java7/solr/build/solr-core/test/J0/./org.apache.solr.cloud.BasicDistributedZkTest-1360760602291/jetty3
[junit4:junit4]   2> 15410 T1320 C35 P29346 oass.SolrIndexSearcher.<init> Opening Searcher@511abb4c main
[junit4:junit4]   2> 15412 T1319 oasc.SolrCore.registerSearcher [collection1] Registered new searcher Searcher@511abb4c main{StandardDirectoryReader(segments_2:1:nrt)}
[junit4:junit4]   2> 15413 T1319 oasc.CachingDirectoryFactory.close Releasing directory:/usr/home/hudson/hudson-slave/workspace/Lucene-Solr-Tests-4.x-java7/solr/build/solr-core/test/J0/./org.apache.solr.cloud.BasicDistributedZkTest-1360760602291/jetty3/index
[junit4:junit4]   2> 15413 T1320 C35 P29346 oasu.DirectUpdateHandler2.commit start commit{,optimize=false,openSearcher=false,waitSearcher=false,expungeDeletes=false,softCommit=false}
[junit4:junit4]   2> 15416 T1320 C35 P29346 oasc.SolrDeletionPolicy.onCommit SolrDeletionPolicy.onCommit: commits:num=2
[junit4:junit4]   2> 		commit{dir=RateLimitedDirectoryWrapper(NRTCachingDirectory(org.apache.lucene.store.NIOFSDirectory@/usr/home/hudson/hudson-slave/workspace/Lucene-Solr-Tests-4.x-java7/solr/build/solr-core/test/J0/org.apache.solr.cloud.BasicDistributedZkTest-1360760602291/jetty3/index.20130213220337671 lockFactory=org.apache.lucene.store.NativeFSLockFactory@16ab54d3; maxCacheMB=48.0 maxMergeSizeMB=4.0)),segFN=segments_2,generation=2,filenames=[segments_2]
[junit4:junit4]   2> 		commit{dir=RateLimitedDirectoryWrapper(NRTCachingDirectory(org.apache.lucene.store.NIOFSDirectory@/usr/home/hudson/hudson-slave/workspace/Lucene-Solr-Tests-4.x-java7/solr/build/solr-core/test/J0/org.apache.solr.cloud.BasicDistributedZkTest-1360760602291/jetty3/index.20130213220337671 lockFactory=org.apache.lucene.store.NativeFSLockFactory@16ab54d3; maxCacheMB=48.0 maxMergeSizeMB=4.0)),segFN=segments_3,generation=3,filenames=[segments_3]
[junit4:junit4]   2> 15416 T1320 C35 P29346 oasc.SolrDeletionPolicy.updateCommits newest commit = 3[segments_3]
[junit4:junit4]   2> 15417 T1320 C35 P29346 oasc.CachingDirectoryFactory.close Releasing directory:/usr/home/hudson/hudson-slave/workspace/Lucene-Solr-Tests-4.x-java7/solr/build/solr-core/test/J0/./org.apache.solr.cloud.BasicDistributedZkTest-1360760602291/jetty3
[junit4:junit4]   2> 15418 T1320 C35 P29346 oasu.DirectUpdateHandler2.commit end_commit_flush
[junit4:junit4]   2> 15418 T1320 C35 P29346 oasc.CachingDirectoryFactory.close Releasing directory:/usr/home/hudson/hudson-slave/workspace/Lucene-Solr-Tests-4.x-java7/solr/build/solr-core/test/J0/./org.apache.solr.cloud.BasicDistributedZkTest-1360760602291/jetty3/index.20130213220337671
[junit4:junit4]   2> 15418 T1320 C35 P29346 oasc.CachingDirectoryFactory.close Releasing directory:/usr/home/hudson/hudson-slave/workspace/Lucene-Solr-Tests-4.x-java7/solr/build/solr-core/test/J0/./org.apache.solr.cloud.BasicDistributedZkTest-1360760602291/jetty3/index
[junit4:junit4]   2> 15418 T1320 C35 P29346 oasc.RecoveryStrategy.replay No replay needed. core=collection1
[junit4:junit4]   2> 15418 T1320 C35 P29346 oasc.RecoveryStrategy.doRecovery Replication Recovery was successful - registering as Active. core=collection1
[junit4:junit4]   2> 15419 T1320 C35 P29346 oasc.ZkController.publish publishing core=collection1 state=active
[junit4:junit4]   2> 15419 T1320 C35 P29346 oasc.ZkController.publish numShards not found on descriptor - reading it from system property
[junit4:junit4]   2> 15426 T1320 C35 P29346 oasc.RecoveryStrategy.doRecovery Finished recovery process. core=collection1
[junit4:junit4]   2> 15835 T1246 oascc.ZkStateReader.updateClusterState Updating cloud state from ZooKeeper... 
[junit4:junit4]   2> 15978 T1269 oascc.ZkStateReader.updateClusterState Updating cloud state from ZooKeeper... 
[junit4:junit4]   2> 15978 T1269 oasc.Overseer$ClusterStateUpdater.updateState Update state numShards=2 message={
[junit4:junit4]   2> 	  "operation":"state",
[junit4:junit4]   2> 	  "numShards":"2",
[junit4:junit4]   2> 	  "shard":"shard2",
[junit4:junit4]   2> 	  "roles":null,
[junit4:junit4]   2> 	  "state":"recovering",
[junit4:junit4]   2> 	  "core":"collection1",
[junit4:junit4]   2> 	  "collection":"collection1",
[junit4:junit4]   2> 	  "node_name":"127.0.0.1:29350_jc",
[junit4:junit4]   2> 	  "base_url":"http://127.0.0.1:29350/jc"}
[junit4:junit4]   2> 15983 T1269 oasc.Overseer$ClusterStateUpdater.updateState Update state numShards=2 message={
[junit4:junit4]   2> 	  "operation":"state",
[junit4:junit4]   2> 	  "numShards":"2",
[junit4:junit4]   2> 	  "shard":"shard1",
[junit4:junit4]   2> 	  "roles":null,
[junit4:junit4]   2> 	  "state":"active",
[junit4:junit4]   2> 	  "core":"collection1",
[junit4:junit4]   2> 	  "collection":"collection1",
[junit4:junit4]   2> 	  "node_name":"127.0.0.1:29346_jc",
[junit4:junit4]   2> 	  "base_url":"http://127.0.0.1:29346/jc"}
[junit4:junit4]   2> 16005 T1268 oascc.ZkStateReader$2.process A cluster state change: WatchedEvent state:SyncConnected type:NodeDataChanged path:/clusterstate.json, has occurred - updating... (live nodes size: 5)
[junit4:junit4]   2> 16005 T1333 oascc.ZkStateReader$2.process A cluster state change: WatchedEvent state:SyncConnected type:NodeDataChanged path:/clusterstate.json, has occurred - updating... (live nodes size: 5)
[junit4:junit4]   2> 16005 T1302 oascc.ZkStateReader$2.process A cluster state change: WatchedEvent state:SyncConnected type:NodeDataChanged path:/clusterstate.json, has occurred - updating... (live nodes size: 5)
[junit4:junit4]   2> 16005 T1317 oascc.ZkStateReader$2.process A cluster state change: WatchedEvent state:SyncConnected type:NodeDataChanged path:/clusterstate.json, has occurred - updating... (live nodes size: 5)
[junit4:junit4]   2> 16005 T1274 oascc.ZkStateReader$2.process A cluster state change: WatchedEvent state:SyncConnected type:NodeDataChanged path:/clusterstate.json, has occurred - updating... (live nodes size: 5)
[junit4:junit4]   2> 16005 T1287 oascc.ZkStateReader$2.process A cluster state change: WatchedEvent state:SyncConnected type:NodeDataChanged path:/clusterstate.json, has occurred - updating... (live nodes size: 5)
[junit4:junit4]   2> 16838 T1246 oascc.ZkStateReader.updateClusterState Updating cloud state from ZooKeeper... 
[junit4:junit4]   2> 17841 T1246 oascc.ZkStateReader.updateClusterState Updating cloud state from ZooKeeper... 
[junit4:junit4]   2>  C36_STATE=coll:collection1 core:collection1 props:{shard=shard2, roles=null, state=recovering, core=collection1, collection=collection1, node_name=127.0.0.1:29350_jc, base_url=http://127.0.0.1:29350/jc}
[junit4:junit4]   2> 18834 T1336 C36 P29350 oasc.RecoveryStrategy.doRecovery Attempting to PeerSync from http://127.0.0.1:29341/jc/collection1/ core=collection1 - recoveringAfterStartup=true
[junit4:junit4]   2> 18834 T1336 C36 P29350 oasu.PeerSync.sync PeerSync: core=collection1 url=http://127.0.0.1:29350/jc START replicas=[http://127.0.0.1:29341/jc/collection1/] nUpdates=100
[junit4:junit4]   2> 18835 T1336 C36 P29350 oasu.PeerSync.sync WARNING no frame of reference to tell of we've missed updates
[junit4:junit4]   2> 18835 T1336 C36 P29350 oasc.RecoveryStrategy.doRecovery PeerSync Recovery was not successful - trying replication. core=collection1
[junit4:junit4]   2> 18835 T1336 C36 P29350 oasc.RecoveryStrategy.doRecovery Starting Replication Recovery. core=collection1
[junit4:junit4]   2> 18835 T1336 C36 P29350 oasc.RecoveryStrategy.doRecovery Begin buffering updates. core=collection1
[junit4:junit4]   2> 18835 T1336 C36 P29350 oasu.UpdateLog.bufferUpdates Starting to buffer updates. FSUpdateLog{state=ACTIVE, tlog=null}
[junit4:junit4]   2> 18836 T1336 C36 P29350 oasc.RecoveryStrategy.replicate Attempting to replicate from http://127.0.0.1:29341/jc/collection1/. core=collection1
[junit4:junit4]   2> 18836 T1336 C36 P29350 oascsi.HttpClientUtil.createClient Creating new http client, config:maxConnections=128&maxConnectionsPerHost=32&followRedirects=false
[junit4:junit4]   2> 18844 T1246 oascc.ZkStateReader.updateClusterState Updating cloud state from ZooKeeper... 
[junit4:junit4]   2> ASYNC  NEW_CORE C38 name=collection1 org.apache.solr.core.SolrCore@472f1af0 url=http://127.0.0.1:29341/jc/collection1 node=127.0.0.1:29341_jc C38_STATE=coll:collection1 core:collection1 props:{shard=shard2, roles=null, state=active, core=collection1, collection=collection1, node_name=127.0.0.1:29341_jc, base_url=http://127.0.0.1:29341/jc, leader=true}
[junit4:junit4]   2> 18847 T1293 C38 P29341 REQ /get {getVersions=100&distrib=false&wt=javabin&qt=/get&version=2} status=0 QTime=0 
[junit4:junit4]   2> 18857 T1294 C38 P29341 oasu.DirectUpdateHandler2.commit start commit{,optimize=false,openSearcher=false,waitSearcher=true,expungeDeletes=false,softCommit=false}
[junit4:junit4]   2> 18859 T1294 C38 P29341 oasc.CachingDirectoryFactory.close Releasing directory:/usr/home/hudson/hudson-slave/workspace/Lucene-Solr-Tests-4.x-java7/solr/build/solr-core/test/J0/./org.apache.solr.cloud.BasicDistributedZkTest-1360760602291/jetty2
[junit4:junit4]   2> 18863 T1294 C38 P29341 oasc.SolrDeletionPolicy.onInit SolrDeletionPolicy.onInit: commits:num=1
[junit4:junit4]   2> 		commit{dir=RateLimitedDirectoryWrapper(NRTCachingDirectory(org.apache.lucene.store.NIOFSDirectory@/usr/home/hudson/hudson-slave/workspace/Lucene-Solr-Tests-4.x-java7/solr/build/solr-core/test/J0/org.apache.solr.cloud.BasicDistributedZkTest-1360760602291/jetty2/index lockFactory=org.apache.lucene.store.NativeFSLockFactory@31b2300e; maxCacheMB=48.0 maxMergeSizeMB=4.0)),segFN=segments_1,generation=1,filenames=[segments_1]
[junit4:junit4]   2> 18864 T1294 C38 P29341 oasc.SolrDeletionPolicy.updateCommits newest commit = 1[segments_1]
[junit4:junit4]   2> 18868 T1294 C38 P29341 oasc.SolrDeletionPolicy.onCommit SolrDeletionPolicy.onCommit: commits:num=2
[junit4:junit4]   2> 		commit{dir=RateLimitedDirectoryWrapper(NRTCachingDirectory(org.apache.lucene.store.NIOFSDirectory@/usr/home/hudson/hudson-slave/workspace/Lucene-Solr-Tests-4.x-java7/solr/build/solr-core/test/J0/org.apache.solr.cloud.BasicDistributedZkTest-1360760602291/jetty2/index lockFactory=org.apache.lucene.store.NativeFSLockFactory@31b2300e; maxCacheMB=48.0 maxMergeSizeMB=4.0)),segFN=segments_1,generation=1,filenames=[segments_1]
[junit4:junit4]   2> 		commit{dir=RateLimitedDirectoryWrapper(NRTCachingDirectory(org.apache.lucene.store.NIOFSDirectory@/usr/home/hudson/hudson-slave/workspace/Lucene-Solr-Tests-4.x-java7/solr/build/solr-core/test/J0/org.apache.solr.cloud.BasicDistributedZkTest-1360760602291/jetty2/index lockFactory=org.apache.lucene.store.NativeFSLockFactory@31b2300e; maxCacheMB=48.0 maxMergeSizeMB=4.0)),segFN=segments_2,generation=2,filenames=[segments_2]
[junit4:junit4]   2> 18868 T1294 C38 P29341 oasc.SolrDeletionPolicy.updateCommits newest commit = 2[segments_2]
[junit4:junit4]   2> 18870 T1294 C38 P29341 oasc.CachingDirectoryFactory.close Releasing directory:/usr/home/hudson/hudson-slave/workspace/Lucene-Solr-Tests-4.x-java7/solr/build/solr-core/test/J0/./org.apache.solr.cloud.BasicDistributedZkTest-1360760602291/jetty2
[junit4:junit4]   2> 18871 T1294 C38 P29341 oass.SolrIndexSearcher.<init> Opening Searcher@1646daba realtime
[junit4:junit4]   2> 18871 T1294 C38 P29341 oasu.DirectUpdateHandler2.commit end_commit_flush
[junit4:junit4]   2> 18872 T1294 C38 P29341 /update {waitSearcher=true&openSearcher=false&commit=true&wt=javabin&commit_end_point=true&version=2&softCommit=false} {commit=} 0 15
[junit4:junit4]   2> 18873 T1336 C36 P29350 oash.ReplicationHandler.inform Commits will be reserved for  10000
[junit4:junit4]   2> 18873 T1336 C36 P29350 oash.SnapPuller.<init>  No value set for 'pollInterval'. Timer Task not started.
[junit4:junit4]   2> 18876 T1295 C38 P29341 oash.ReplicationHandler.inform Commits will be reserved for  10000
[junit4:junit4]   2> 18876 T1295 C38 P29341 REQ /replication {command=indexversion&qt=/replication&wt=javabin&version=2} status=0 QTime=1 
[junit4:junit4]   2> 18877 T1336 C36 P29350 oash.SnapPuller.fetchLatestIndex Master's generation: 2
[junit4:junit4]   2> 18877 T1336 C36 P29350 oash.SnapPuller.fetchLatestIndex Slave's generation: 1
[junit4:junit4]   2> 18877 T1336 C36 P29350 oash.SnapPuller.fetchLatestIndex Starting replication process
[junit4:junit4]   2> 18880 T1295 C38 P29341 oasc.CachingDirectoryFactory.close Releasing directory:/usr/home/hudson/hudson-slave/workspace/Lucene-Solr-Tests-4.x-java7/solr/build/solr-core/test/J0/./org.apache.solr.cloud.BasicDistributedZkTest-1360760602291/jetty2
[junit4:junit4]   2> 18881 T1295 C38 P29341 oasc.CachingDirectoryFactory.close Releasing directory:/usr/home/hudson/hudson-slave/workspace/Lucene-Solr-Tests-4.x-java7/solr/build/solr-core/test/J0/./org.apache.solr.cloud.BasicDistributedZkTest-1360760602291/jetty2/index
[junit4:junit4]   2> 18882 T1295 C38 P29341 REQ /replication {command=filelist&qt=/replication&wt=javabin&generation=2&version=2} status=0 QTime=1 
[junit4:junit4]   2> 18882 T1336 C36 P29350 oash.SnapPuller.fetchLatestIndex Number of files in latest index in master: 1
[junit4:junit4]   2> 18883 T1336 C36 P29350 oasc.CachingDirectoryFactory.get return new directory for /usr/home/hudson/hudson-slave/workspace/Lucene-Solr-Tests-4.x-java7/solr/build/solr-core/test/J0/./org.apache.solr.cloud.BasicDistributedZkTest-1360760602291/jetty4/index.20130213220341167 forceNew:false
[junit4:junit4]   2> 18884 T1336 C36 P29350 oasc.CachingDirectoryFactory.close Releasing directory:/usr/home/hudson/hudson-slave/workspace/Lucene-Solr-Tests-4.x-java7/solr/build/solr-core/test/J0/./org.apache.solr.cloud.BasicDistributedZkTest-1360760602291/jetty4
[junit4:junit4]   2> 18885 T1336 C36 P29350 oash.SnapPuller.fetchLatestIndex Starting download to RateLimitedDirectoryWrapper(NRTCachingDirectory(org.apache.lucene.store.NIOFSDirectory@/usr/home/hudson/hudson-slave/workspace/Lucene-Solr-Tests-4.x-java7/solr/build/solr-core/test/J0/org.apache.solr.cloud.BasicDistributedZkTest-1360760602291/jetty4/index.20130213220341167 lockFactory=org.apache.lucene.store.NativeFSLockFactory@78b51cd2; maxCacheMB=48.0 maxMergeSizeMB=4.0)) fullCopy=true
[junit4:junit4]   2> 18889 T1295 C38 P29341 REQ /replication {file=segments_2&command=filecontent&checksum=true&wt=filestream&qt=/replication&generation=2} status=0 QTime=0 
[junit4:junit4]   2> 18892 T1336 C36 P29350 oasc.CachingDirectoryFactory.close Releasing directory:/usr/home/hudson/hudson-slave/workspace/Lucene-Solr-Tests-4.x-java7/solr/build/solr-core/test/J0/./org.apache.solr.cloud.BasicDistributedZkTest-1360760602291/jetty4/index
[junit4:junit4]   2> 18892 T1336 C36 P29350 oash.SnapPuller.fetchLatestIndex Total time taken for download : 0 secs
[junit4:junit4]   2> 18892 T1336 C36 P29350 oash.SnapPuller.modifyIndexProps New index installed. Updating index properties... index=index.20130213220341167
[junit4:junit4]   2> 18893 T1336 C36 P29350 oasc.CachingDirectoryFactory.close Releasing directory:/usr/home/hudson/hudson-slave/workspace/Lucene-Solr-Tests-4.x-java7/solr/build/solr-core/test/J0/./org.apache.solr.cloud.BasicDistributedZkTest-1360760602291/jetty4
[junit4:junit4]   2> 18894 T1336 C36 P29350 oasc.CachingDirectoryFactory.close Releasing directory:/usr/home/hudson/hudson-slave/workspace/Lucene-Solr-Tests-4.x-java7/solr/build/solr-core/test/J0/./org.apache.solr.cloud.BasicDistributedZkTest-1360760602291/jetty4
[junit4:junit4]   2> 18894 T1336 C36 P29350 oasc.SolrCore.getNewIndexDir New index directory detected: old=./org.apache.solr.cloud.BasicDistributedZkTest-1360760602291/jetty4/index/ new=./org.apache.solr.cloud.BasicDistributedZkTest-1360760602291/jetty4/index.20130213220341167
[junit4:junit4]   2> 18898 T1336 C36 P29350 oasc.SolrDeletionPolicy.onInit SolrDeletionPolicy.onInit: commits:num=1
[junit4:junit4]   2> 		commit{dir=RateLimitedDirectoryWrapper(NRTCachingDirectory(org.apache.lucene.store.NIOFSDirectory@/usr/home/hudson/hudson-slave/workspace/Lucene-Solr-Tests-4.x-java7/solr/build/solr-core/test/J0/org.apache.solr.cloud.BasicDistributedZkTest-1360760602291/jetty4/index.20130213220341167 lockFactory=org.apache.lucene.store.NativeFSLockFactory@78b51cd2; maxCacheMB=48.0 maxMergeSizeMB=4.0)),segFN=segments_2,generation=2,filenames=[segments_2]
[junit4:junit4]   2> 18898 T1336 C36 P29350 oasc.SolrDeletionPolicy.updateCommits newest commit = 2[segments_2]
[junit4:junit4]   2> 18900 T1336 C36 P29350 oasc.CachingDirectoryFactory.close Releasing directory:/usr/home/hudson/hudson-slave/workspace/Lucene-Solr-Tests-4.x-java7/solr/build/solr-core/test/J0/./org.apache.solr.cloud.BasicDistributedZkTest-1360760602291/jetty4
[junit4:junit4]   2> 18900 T1336 C36 P29350 oasu.DefaultSolrCoreState.newIndexWriter Creating new IndexWriter...
[junit4:junit4]   2> 18900 T1336 C36 P29350 oasu.DefaultSolrCoreState.newIndexWriter Waiting until IndexWriter is unused... core=collection1
[junit4:junit4]   2> 18900 T1336 C36 P29350 oasu.DefaultSolrCoreState.newIndexWriter Rollback old IndexWriter... core=collection1
[junit4:junit4]   2> 18901 T1336 C36 P29350 oasc.CachingDirectoryFactory.close Releasing directory:/usr/home/hudson/hudson-slave/workspace/Lucene-Solr-Tests-4.x-java7/solr/build/solr-core/test/J0/./org.apache.solr.cloud.BasicDistributedZkTest-1360760602291/jetty4/index.20130213220341167
[junit4:junit4]   2> 18902 T1336 C36 P29350 oasc.CachingDirectoryFactory.close Releasing directory:/usr/home/hudson/hudson-slave/workspace/Lucene-Solr-Tests-4.x-java7/solr/build/solr-core/test/J0/./org.apache.solr.cloud.BasicDistributedZkTest-1360760602291/jetty4
[junit4:junit4]   2> 18905 T1336 C36 P29350 oasc.SolrDeletionPolicy.onInit SolrDeletionPolicy.onInit: commits:num=1
[junit4:junit4]   2> 		commit{dir=RateLimitedDirectoryWrapper(NRTCachingDirectory(org.apache.lucene.store.NIOFSDirectory@/usr/home/hudson/hudson-slave/workspace/Lucene-Solr-Tests-4.x-java7/solr/build/solr-core/test/J0/org.apache.solr.cloud.BasicDistributedZkTest-1360760602291/jetty4/index.20130213220341167 lockFactory=org.apache.lucene.store.NativeFSLockFactory@78b51cd2; maxCacheMB=48.0 maxMergeSizeMB=4.0)),segFN=segments_2,generation=2,filenames=[segments_2]
[junit4:junit4]   2> 18906 T1336 C36 P29350 oasc.SolrDeletionPolicy.updateCommits newest commit = 2[segments_2]
[junit4:junit4]   2> 18906 T1336 C36 P29350 oasu.DefaultSolrCoreState.newIndexWriter New IndexWriter is ready to be used.
[junit4:junit4]   2> 18906 T1336 C36 P29350 oasc.CachingDirectoryFactory.close Releasing directory:/usr/home/hudson/hudson-slave/workspace/Lucene-Solr-Tests-4.x-java7/solr/build/solr-core/test/J0/./org.apache.solr.cloud.BasicDistributedZkTest-1360760602291/jetty4
[junit4:junit4]   2> 18907 T1336 C36 P29350 oass.SolrIndexSearcher.<init> Opening Searcher@5013da56 main
[junit4:junit4]   2> 18908 T1335 oasc.SolrCore.registerSearcher [collection1] Registered new searcher Searcher@5013da56 main{StandardDirectoryReader(segments_2:1:nrt)}
[junit4:junit4]   2> 18909 T1335 oasc.CachingDirectoryFactory.close Releasing directory:/usr/home/hudson/hudson-slave/workspace/Lucene-Solr-Tests-4.x-java7/solr/build/solr-core/test/J0/./org.apache.solr.cloud.BasicDistributedZkTest-1360760602291/jetty4/index
[junit4:junit4]   2> 18909 T1336 C36 P29350 oasu.DirectUpdateHandler2.commit start commit{,optimize=false,openSearcher=false,waitSearcher=false,expungeDeletes=false,softCommit=false}
[junit4:junit4]   2> 18912 T1336 C36 P29350 oasc.SolrDeletionPolicy.onCommit SolrDeletionPolicy.onCommit: commits:num=2
[junit4:junit4]   2> 		commit{dir=RateLimitedDirectoryWrapper(NRTCachingDirectory(org.apache.lucene.store.NIOFSDirectory@/usr/home/hudson/hudson-slave/workspace/Lucene-Solr-Tests-4.x-java7/solr/build/solr-core/test/J0/org.apache.solr.cloud.BasicDistributedZkTest-1360760602291/jetty4/index.20130213220341167 lockFactory=org.apache.lucene.store.NativeFSLockFactory@78b51cd2; maxCacheMB=48.0 maxMergeSizeMB=4.0)),segFN=segments_2,generation=2,filenames=[segments_2]
[junit4:junit4]   2> 		commit{dir=RateLimitedDirectoryWrapper(NRTCachingDirectory(org.apache.lucene.store.NIOFSDirectory@/usr/home/hudson/hudson-slave/workspace/Lucene-Solr-Tests-4.x-java7/solr/build/solr-core/test/J0/org.apache.solr.cloud.BasicDistributedZkTest-1360760602291/jetty4/index.20130213220341167 lockFactory=org.apache.lucene.store.NativeFSLockFactory@78b51cd2; maxCacheMB=48.0 maxMergeSizeMB=4.0)),segFN=segments_3,generation=3,filenames=[segments_3]
[junit4:junit4]   2> 18913 T1336 C36 P29350 oasc.SolrDeletionPolicy.updateCommits newest commit = 3[segments_3]
[junit4:junit4]   2> 18914 T1336 C36 P29350 oasc.CachingDirectoryFactory.close Releasing directory:/usr/home/hudson/hudson-slave/workspace/Lucene-Solr-Tests-4.x-java7/solr/build/solr-core/test/J0/./org.apache.solr.cloud.BasicDistributedZkTest-1360760602291/jetty4
[junit4:junit4]   2> 18914 T1336 C36 P29350 oasu.DirectUpdateHandler2.commit end_commit_flush
[junit4:junit4]   2> 18914 T1336 C36 P29350 oasc.CachingDirectoryFactory.close Releasing directory:/usr/home/hudson/hudson-slave/workspace/Lucene-Solr-Tests-4.x-java7/solr/build/solr-core/test/J0/./org.apache.solr.cloud.BasicDistributedZkTest-1360760602291/jetty4/index.20130213220341167
[junit4:junit4]   2> 18915 T1336 C36 P29350 oasc.CachingDirectoryFactory.close Releasing directory:/usr/home/hudson/hudson-slave/workspace/Lucene-Solr-Tests-4.x-java7/solr/build/solr-core/test/J0/./org.apache.solr.cloud.BasicDistributedZkTest-1360760602291/jetty4/index
[junit4:junit4]   2> 18915 T1336 C36 P29350 oasc.RecoveryStrategy.replay No replay needed. core=collection1
[junit4:junit4]   2> 18915 T1336 C36 P29350 oasc.RecoveryStrategy.doRecovery Replication Recovery was successful - registering as Active. core=collection1
[junit4:junit4]   2> 18915 T1336 C36 P29350 oasc.ZkController.publish publishing core=collection1 state=active
[junit4:junit4]   2> 18915 T1336 C36 P29350 oasc.ZkController.publish numShards not found on descriptor - reading it from system property
[junit4:junit4]   2> 18923 T1336 C36 P29350 oasc.RecoveryStrategy.doRecovery Finished recovery process. core=collection1
[junit4:junit4]   2> 19016 T1269 oascc.ZkStateReader.updateClusterState Updating cloud state from ZooKeeper... 
[junit4:junit4]   2> 19017 T1269 oasc.Overseer$ClusterStateUpdater.updateState Update state numShards=2 message={
[junit4:junit4]   2> 	  "operation":"state",
[junit4:junit4]   2> 	  "numShards":"2",
[junit4:junit4]   2> 	  "shard":"shard2",
[junit4:junit4]   2> 	  "roles":null,
[junit4:junit4]   2> 	  "state":"active",
[junit4:junit4]   2> 	  "core":"collection1",
[junit4:junit4]   2> 	  "collection":"collection1",
[junit4:junit4]   2> 	  "node_name":"127.0.0.1:29350_jc",
[junit4:junit4]   2> 	  "base_url":"http://127.0.0.1:29350/jc"}
[junit4:junit4]   2> 19031 T1268 oascc.ZkStateReader$2.process A cluster state change: WatchedEvent state:SyncConnected type:NodeDataChanged path:/clusterstate.json, has occurred - updating... (live nodes size: 5)
[junit4:junit4]   2> 19031 T1274 oascc.ZkStateReader$2.process A cluster state change: WatchedEvent state:SyncConnected type:NodeDataChanged path:/clusterstate.json, has occurred - updating... (live nodes size: 5)
[junit4:junit4]   2> 19031 T1302 oascc.ZkStateReader$2.process A cluster state change: WatchedEvent state:SyncConnected type:NodeDataChanged path:/clusterstate.json, has occurred - updating... (live nodes size: 5)
[junit4:junit4]   2> 19031 T1317 oascc.ZkStateReader$2.process A cluster state change: WatchedEvent state:SyncConnected type:NodeDataChanged path:/clusterstate.json, has occurred - updating... (live nodes size: 5)
[junit4:junit4]   2> 19031 T1287 oascc.ZkStateReader$2.process A cluster state change: WatchedEvent state:SyncConnected type:NodeDataChanged path:/clusterstate.json, has occurred - updating... (live nodes size: 5)
[junit4:junit4]   2> 19031 T1333 oascc.ZkStateReader$2.process A cluster state change: WatchedEvent state:SyncConnected type:NodeDataChanged path:/clusterstate.json, has occurred - updating... (live nodes size: 5)
[junit4:junit4]   2> 19847 T1246 oascc.ZkStateReader.updateClusterState Updating cloud state from ZooKeeper... 
[junit4:junit4]   2> 19849 T1246 oasc.AbstractDistribZkTestBase.waitForRecoveriesToFinish Recoveries finished - collection: collection1
[junit4:junit4]   2> ASYNC  NEW_CORE C39 name=collection1 org.apache.solr.core.SolrCore@15eb6f1b url=http://127.0.0.1:29324/jc/collection1 node=127.0.0.1:29324_jc C39_STATE=coll:control_collection core:collection1 props:{shard=shard1, roles=null, state=active, core=collection1, collection=control_collection, node_name=127.0.0.1:29324_jc, base_url=http://127.0.0.1:29324/jc, leader=true}
[junit4:junit4]   2> 19863 T1258 C39 P29324 oasc.CachingDirectoryFactory.close Releasing directory:/usr/home/hudson/hudson-slave/workspace/Lucene-Solr-Tests-4.x-java7/solr/build/solr-core/test/J0/./org.apache.solr.cloud.BasicDistributedZkTest-1360760602291/control/data
[junit4:junit4]   2> 19868 T1258 C39 P29324 oasc.SolrDeletionPolicy.onInit SolrDeletionPolicy.onInit: commits:num=1
[junit4:junit4]   2> 		commit{dir=RateLimitedDirectoryWrapper(NRTCachingDirectory(org.apache.lucene.store.NIOFSDirectory@/usr/home/hudson/hudson-slave/workspace/Lucene-Solr-Tests-4.x-java7/solr/build/solr-core/test/J0/org.apache.solr.cloud.BasicDistributedZkTest-1360760602291/control/data/index lockFactory=org.apache.lucene.store.NativeFSLockFactory@a88975b; maxCacheMB=48.0 maxMergeSizeMB=4.0)),segFN=segments_1,generation=1,filenames=[segments_1]
[junit4:junit4]   2> 19868 T1258 C39 P29324 oasc.SolrDeletionPolicy.updateCommits newest commit = 1[segments_1]
[junit4:junit4]   2> 19870 T1258 C39 P29324 oasc.CachingDirectoryFactory.close Releasing directory:/usr/home/hudson/hudson-slave/workspace/Lucene-Solr-Tests-4.x-java7/solr/build/solr-core/test/J0/./org.apache.solr.cloud.BasicDistributedZkTest-1360760602291/control/data
[junit4:junit4]   2> 19871 T1258 C39 P29324 oass.SolrIndexSearcher.<init> Opening Searcher@95314fb realtime
[junit4:junit4]   2> 19871 T1258 C39 P29324 /update {wt=javabin&version=2} {deleteByQuery=*:* (-1426860930127364096)} 0 10
[junit4:junit4]   2> 19876 T1296 C38 P29341 oasc.CachingDirectoryFactory.close Releasing directory:/usr/home/hudson/hudson-slave/workspace/Lucene-Solr-Tests-4.x-java7/solr/build/solr-core/test/J0/./org.apache.solr.cloud.BasicDistributedZkTest-1360760602291/jetty2
[junit4:junit4]   2> 19882 T1281 C37 P29335 oasc.CachingDirectoryFactory.close Releasing directory:/usr/home/hudson/hudson-slave/workspace/Lucene-Solr-Tests-4.x-java7/solr/build/solr-core/test/J0/./org.apache.solr.cloud.BasicDistributedZkTest-1360760602291/jetty1
[junit4:junit4]   2>  C36_STATE=coll:collection1 core:collection1 props:{shard=shard2, roles=null, state=active, core=collection1, collection=collection1, node_name=127.0.0.1:29350_jc, base_url=http://127.0.0.1:29350/jc}
[junit4:junit4]   2> 19891 T1323 C36 P29350 oasc.CachingDirectoryFactory.close Releasing directory:/usr/home/hudson/hudson-slave/workspace/Lucene-Solr-Tests-4.x-java7/solr/build/solr-core/test/J0/./org.apache.solr.cloud.BasicDistributedZkTest-1360760602291/jetty4
[junit4:junit4]   2> 19892 T1323 C36 P29350 /update {update.distrib=FROMLEADER&_version_=-1426860930139947008&update.from=http://127.0.0.1:29341/jc/collection1/&wt=javabin&version=2} {deleteByQuery=*:* (-1426860930139947008)} 0 4
[junit4:junit4]   2>  C35_STATE=coll:collection1 core:collection1 props:{shard=shard1, roles=null, state=active, core=collection1, collection=collection1, node_name=127.0.0.1:29346_jc, base_url=http://127.0.0.1:29346/jc}
[junit4:junit4]   2> 19895 T1307 C35 P29346 oasc.CachingDirectoryFactory.close Releasing directory:/usr/home/hudson/hudson-slave/workspace/Lucene-Solr-Tests-4.x-java7/solr/build/solr-core/test/J0/./org.apache.solr.cloud.BasicDistributedZkTest-1360760602291/jetty3
[junit4:junit4]   2> 19897 T1307 C35 P29346 /update {update.distrib=FROMLEADER&_version_=-1426860930146238464&update.from=http://127.0.0.1:29335/jc/collection1/&wt=javabin&version=2} {deleteByQuery=*:* (-1426860930146238464)} 0 4
[junit4:junit4]   2> 19898 T1281 C37 P29335 /update {update.distrib=TOLEADER&wt=javabin&version=2} {deleteByQuery=*:* (-1426860930146238464)} 0 18
[junit4:junit4]   2> 19899 T1296 C38 P29341 /update {wt=javabin&version=2} {deleteByQuery=*:* (-1426860930139947008)} 0 25
[junit4:junit4]   2> 19910 T1258 C39 P29324 /update {wt=javabin&version=2} {add=[1 (1426860930174550016)]} 0 4
[junit4:junit4]   2> 19929 T1307 C35 P29346 /update {distrib.from=http://127.0.0.1:29335/jc/collection1/&update.distrib=FROMLEADER&wt=javabin&version=2} {add=[1 (1426860930190278656)]} 0 3
[junit4:junit4]   2> 19930 T1281 C37 P29335 /update {distrib.from=http://127.0.0.1:29341/jc/collection1/&update.distrib=TOLEADER&wt=javabin&version=2} {add=[1 (1426860930190278656)]} 0 9
[junit4:junit4]   2> 19931 T1296 C38 P29341 /update {wt=javabin&version=2} {add=[1]} 0 18
[junit4:junit4]   2> 19936 T1258 C39 P29324 /update {wt=javabin&version=2} {add=[2 (1426860930203910144)]} 0 2
[junit4:junit4]   2> 19947 T1323 C36 P29350 /update {distrib.from=http://127.0.0.1:29341/jc/collection1/&update.distrib=FROMLEADER&wt=javabin&version=2} {add=[2 (1426860930209153024)]} 0 2
[junit4:junit4]   2> 19948 T1296 C38 P29341 /update {wt=javabin&version=2} {add=[2 (1426860930209153024)]} 0 9
[junit4:junit4]   2> 19953 T1258 C39 P29324 /update {wt=javabin&version=2} {add=[3 (1426860930221735936)]} 0 2
[junit4:junit4]   2> 19962 T1323 C36 P29350 /update {distrib.from=http://127.0.0.1:29341/jc/collection1/&update.distrib=FROMLEADER&wt=javabin&version=2} {add=[3 (1426860930226978816)]} 0 2
[junit4:junit4]   2> 19963 T1296 C38 P29341 /update {wt=javabin&version=2} {add=[3 (1426860930226978816)]} 0 7
[junit4:junit4]   2> 19968 T1258 C39 P29324 /update {wt=javabin&version=2

[...truncated too long message...]

> 	at org.apache.solr.cloud.AbstractDistribZkTestBase.waitForRecoveriesToFinish(AbstractDistribZkTestBase.java:126)
[junit4:junit4]    > 	at org.apache.solr.cloud.AbstractDistribZkTestBase.waitForRecoveriesToFinish(AbstractDistribZkTestBase.java:121)
[junit4:junit4]    > 	at org.apache.solr.cloud.BasicDistributedZkTest.testCoreUnloadAndLeaders(BasicDistributedZkTest.java:599)
[junit4:junit4]    > 	at org.apache.solr.cloud.BasicDistributedZkTest.doTest(BasicDistributedZkTest.java:337)
[junit4:junit4]    > 	at org.apache.solr.BaseDistributedSearchTestCase.testDistribSearch(BaseDistributedSearchTestCase.java:794)
[junit4:junit4]    > 	at sun.reflect.NativeMethodAccessorImpl.invoke0(Native Method)
[junit4:junit4]    > 	at sun.reflect.NativeMethodAccessorImpl.invoke(NativeMethodAccessorImpl.java:57)
[junit4:junit4]    > 	at sun.reflect.DelegatingMethodAccessorImpl.invoke(DelegatingMethodAccessorImpl.java:43)
[junit4:junit4]    > 	at java.lang.reflect.Method.invoke(Method.java:601)
[junit4:junit4]    > 	at com.carrotsearch.randomizedtesting.RandomizedRunner.invoke(RandomizedRunner.java:1559)
[junit4:junit4]    > 	at com.carrotsearch.randomizedtesting.RandomizedRunner.access$600(RandomizedRunner.java:79)
[junit4:junit4]    > 	at com.carrotsearch.randomizedtesting.RandomizedRunner$6.evaluate(RandomizedRunner.java:737)
[junit4:junit4]    > 	at com.carrotsearch.randomizedtesting.RandomizedRunner$7.evaluate(RandomizedRunner.java:773)
[junit4:junit4]    > 	at com.carrotsearch.randomizedtesting.RandomizedRunner$8.evaluate(RandomizedRunner.java:787)
[junit4:junit4]    > 	at com.carrotsearch.randomizedtesting.rules.SystemPropertiesRestoreRule$1.evaluate(SystemPropertiesRestoreRule.java:53)
[junit4:junit4]    > 	at org.apache.lucene.util.TestRuleSetupTeardownChained$1.evaluate(TestRuleSetupTeardownChained.java:50)
[junit4:junit4]    > 	at org.apache.lucene.util.TestRuleFieldCacheSanity$1.evaluate(TestRuleFieldCacheSanity.java:51)
[junit4:junit4]    > 	at org.apache.lucene.util.AbstractBeforeAfterRule$1.evaluate(AbstractBeforeAfterRule.java:46)
[junit4:junit4]    > 	at com.carrotsearch.randomizedtesting.rules.SystemPropertiesInvariantRule$1.evaluate(SystemPropertiesInvariantRule.java:55)
[junit4:junit4]    > 	at org.apache.lucene.util.TestRuleThreadAndTestName$1.evaluate(TestRuleThreadAndTestName.java:49)
[junit4:junit4]    > 	at org.apache.lucene.util.TestRuleIgnoreAfterMaxFailures$1.evaluate(TestRuleIgnoreAfterMaxFailures.java:70)
[junit4:junit4]    > 	at org.apache.lucene.util.TestRuleMarkFailure$1.evaluate(TestRuleMarkFailure.java:48)
[junit4:junit4]    > 	at com.carrotsearch.randomizedtesting.rules.StatementAdapter.evaluate(StatementAdapter.java:36)
[junit4:junit4]    > 	at com.carrotsearch.randomizedtesting.ThreadLeakControl$StatementRunner.run(ThreadLeakControl.java:358)
[junit4:junit4]    > 	at com.carrotsearch.randomizedtesting.ThreadLeakControl.forkTimeoutingTask(ThreadLeakControl.java:782)
[junit4:junit4]    > 	at com.carrotsearch.randomizedtesting.ThreadLeakControl$3.evaluate(ThreadLeakControl.java:442)
[junit4:junit4]    > 	at com.carrotsearch.randomizedtesting.RandomizedRunner.runSingleTest(RandomizedRunner.java:746)
[junit4:junit4]    > 	at com.carrotsearch.randomizedtesting.RandomizedRunner$3.evaluate(RandomizedRunner.java:648)
[junit4:junit4]    > 	at com.carrotsearch.randomizedtesting.RandomizedRunner$4.evaluate(RandomizedRunner.java:682)
[junit4:junit4]    > 	at com.carrotsearch.randomizedtesting.RandomizedRunner$5.evaluate(RandomizedRunner.java:693)
[junit4:junit4]    > 	at com.carrotsearch.randomizedtesting.rules.StatementAdapter.evaluate(StatementAdapter.java:36)
[junit4:junit4]    > 	at com.carrotsearch.randomizedtesting.rules.SystemPropertiesRestoreRule$1.evaluate(SystemPropertiesRestoreRule.java:53)
[junit4:junit4]    > 	at org.apache.lucene.util.AbstractBeforeAfterRule$1.evaluate(AbstractBeforeAfterRule.java:46)
[junit4:junit4]    > 	at org.apache.lucene.util.TestRuleStoreClassName$1.evaluate(TestRuleStoreClassName.java:42)
[junit4:junit4]    > 	at com.carrotsearch.randomizedtesting.rules.SystemPropertiesInvariantRule$1.evaluate(SystemPropertiesInvariantRule.java:55)
[junit4:junit4]    > 	at com.carrotsearch.randomizedtesting.rules.NoShadowingOrOverridesOnMethodsRule$1.evaluate(NoShadowingOrOverridesOnMethodsRule.java:39)
[junit4:junit4]    > 	at com.carrotsearch.randomizedtesting.rules.NoShadowingOrOverridesOnMethodsRule$1.evaluate(NoShadowingOrOverridesOnMethodsRule.java:39)
[junit4:junit4]    > 	at com.carrotsearch.randomizedtesting.rules.StatementAdapter.evaluate(StatementAdapter.java:36)
[junit4:junit4]    > 	at org.apache.lucene.util.TestRuleAssertionsRequired$1.evaluate(TestRuleAssertionsRequired.java:43)
[junit4:junit4]    > 	at org.apache.lucene.util.TestRuleMarkFailure$1.evaluate(TestRuleMarkFailure.java:48)
[junit4:junit4]    > 	at org.apache.lucene.util.TestRuleIgnoreAfterMaxFailures$1.evaluate(TestRuleIgnoreAfterMaxFailures.java:70)
[junit4:junit4]    > 	at org.apache.lucene.util.TestRuleIgnoreTestSuites$1.evaluate(TestRuleIgnoreTestSuites.java:55)
[junit4:junit4]    > 	at com.carrotsearch.randomizedtesting.rules.StatementAdapter.evaluate(StatementAdapter.java:36)
[junit4:junit4]    > 	at com.carrotsearch.randomizedtesting.ThreadLeakControl$StatementRunner.run(ThreadLeakControl.java:358)
[junit4:junit4]    > 	at java.lang.Thread.run(Thread.java:722)
[junit4:junit4]   2> 3798897 T1246 oas.SolrTestCaseJ4.deleteCore ###deleteCore
[junit4:junit4]   2> NOTE: test params are: codec=Lucene42: {n_f1=PostingsFormat(name=Lucene41WithOrds), foo_b=Lucene41(blocksize=128), cat=MockVariableIntBlock(baseBlockSize=55), foo_d=MockFixedIntBlock(blockSize=135), foo_f=Lucene41(blocksize=128), n_tl1=PostingsFormat(name=Lucene41WithOrds), n_d1=MockVariableIntBlock(baseBlockSize=55), rnd_b=MockFixedIntBlock(blockSize=135), intDefault=MockVariableIntBlock(baseBlockSize=55), n_td1=PostingsFormat(name=Lucene41WithOrds), timestamp=MockVariableIntBlock(baseBlockSize=55), id=MockFixedIntBlock(blockSize=135), range_facet_sl=Lucene41(blocksize=128), range_facet_si=PostingsFormat(name=Lucene41WithOrds), oddField_s=Lucene41(blocksize=128), sequence_i=Lucene41(blocksize=128), name=MockFixedIntBlock(blockSize=135), foo_i=PostingsFormat(name=Lucene41WithOrds), regex_dup_B_s=MockVariableIntBlock(baseBlockSize=55), multiDefault=PostingsFormat(name=Lucene41WithOrds), n_tf1=MockVariableIntBlock(baseBlockSize=55), n_dt1=PostingsFormat(name=Lucene41WithOrds), genre_s=Lucene41(blocksize=128), author_t=PostingsFormat(name=Lucene41WithOrds), n_ti1=MockFixedIntBlock(blockSize=135), range_facet_l=MockVariableIntBlock(baseBlockSize=55), text=Lucene41(blocksize=128), _version_=MockVariableIntBlock(baseBlockSize=55), val_i=MockFixedIntBlock(blockSize=135), SubjectTerms_mfacet=MockVariableIntBlock(baseBlockSize=55), series_t=PostingsFormat(name=Lucene41WithOrds), a_t=MockVariableIntBlock(baseBlockSize=55), n_tdt1=MockVariableIntBlock(baseBlockSize=55), regex_dup_A_s=Lucene41(blocksize=128), price=Lucene41(blocksize=128), other_tl1=MockVariableIntBlock(baseBlockSize=55), n_l1=MockVariableIntBlock(baseBlockSize=55), a_si=PostingsFormat(name=Lucene41WithOrds), inStock=Lucene41(blocksize=128)}, docValues:{}, sim=RandomSimilarityProvider(queryNorm=false,coord=no): {}, locale=fr_CH, timezone=JST
[junit4:junit4]   2> NOTE: FreeBSD 9.0-RELEASE amd64/Oracle Corporation 1.7.0_09 (64-bit)/cpus=16,threads=1,free=281438328,total=454033408
[junit4:junit4]   2> NOTE: All tests run in this JVM: [AlternateDirectoryTest, FastVectorHighlighterTest, TestPHPSerializedResponseWriter, ScriptEngineTest, TestQuerySenderNoQuery, FieldAnalysisRequestHandlerTest, TestElisionMultitermQuery, LeaderElectionIntegrationTest, SolrCmdDistributorTest, CurrencyFieldTest, TestJmxMonitoredMap, SearchHandlerTest, TestIndexingPerformance, JsonLoaderTest, TestDefaultSimilarityFactory, TestLuceneMatchVersion, ResourceLoaderTest, SortByFunctionTest, UniqFieldsUpdateProcessorFactoryTest, TestBinaryResponseWriter, IndexBasedSpellCheckerTest, SolrPluginUtilsTest, RequestHandlersTest, LoggingHandlerTest, DateMathParserTest, TestLMJelinekMercerSimilarityFactory, ShardRoutingCustomTest, TestRandomFaceting, TestWordDelimiterFilterFactory, DistanceFunctionTest, BinaryUpdateRequestHandlerTest, SOLR749Test, SuggesterWFSTTest, BadComponentTest, TestCoreContainer, PluginInfoTest, TestJoin, CircularListTest, SyncSliceTest, TestConfig, SystemInfoHandlerTest, TestFastWriter, TestStressVersions, CoreContainerCoreInitFailuresTest, DirectUpdateHandlerOptimizeTest, TestStressReorder, ClusterStateUpdateTest, TestGroupingSearch, TestLFUCache, BasicDistributedZkTest]
[junit4:junit4] Completed on J0 in 3799.48s, 1 test, 1 failure <<< FAILURES!

[...truncated 46 lines...]
BUILD FAILED
/usr/home/hudson/hudson-slave/workspace/Lucene-Solr-Tests-4.x-java7/build.xml:381: The following error occurred while executing this line:
/usr/home/hudson/hudson-slave/workspace/Lucene-Solr-Tests-4.x-java7/build.xml:361: The following error occurred while executing this line:
/usr/home/hudson/hudson-slave/workspace/Lucene-Solr-Tests-4.x-java7/build.xml:39: The following error occurred while executing this line:
/usr/home/hudson/hudson-slave/workspace/Lucene-Solr-Tests-4.x-java7/solr/build.xml:183: The following error occurred while executing this line:
/usr/home/hudson/hudson-slave/workspace/Lucene-Solr-Tests-4.x-java7/solr/common-build.xml:447: The following error occurred while executing this line:
/usr/home/hudson/hudson-slave/workspace/Lucene-Solr-Tests-4.x-java7/lucene/common-build.xml:1202: The following error occurred while executing this line:
/usr/home/hudson/hudson-slave/workspace/Lucene-Solr-Tests-4.x-java7/lucene/common-build.xml:865: There were test failures: 251 suites, 1043 tests, 1 failure, 23 ignored (5 assumptions)

Total time: 99 minutes 1 second
Build step 'Invoke Ant' marked build as failure
Archiving artifacts
Recording test results
Email was triggered for: Failure
Sending email for trigger: Failure



Mime
View raw message