lucene-dev mailing list archives

Site index · List index
Message view « Date » · « Thread »
Top « Date » · « Thread »
From Policeman Jenkins Server <jenk...@thetaphi.de>
Subject [JENKINS] Lucene-Solr-trunk-MacOSX (64bit/jdk1.7.0) - Build # 175 - Failure!
Date Sun, 03 Feb 2013 00:39:36 GMT
Build: http://jenkins.thetaphi.de/job/Lucene-Solr-trunk-MacOSX/175/
Java: 64bit/jdk1.7.0 -XX:+UseG1GC

1 tests failed.
REGRESSION:  org.apache.solr.cloud.BasicDistributedZkTest.testDistribSearch

Error Message:
There are still nodes recoverying - waited for 230 seconds

Stack Trace:
java.lang.AssertionError: There are still nodes recoverying - waited for 230 seconds
	at __randomizedtesting.SeedInfo.seed([8D2A8B084726E47C:CCC051030798440]:0)
	at org.junit.Assert.fail(Assert.java:93)
	at org.apache.solr.cloud.AbstractDistribZkTestBase.waitForRecoveriesToFinish(AbstractDistribZkTestBase.java:168)
	at org.apache.solr.cloud.AbstractDistribZkTestBase.waitForRecoveriesToFinish(AbstractDistribZkTestBase.java:126)
	at org.apache.solr.cloud.AbstractDistribZkTestBase.waitForRecoveriesToFinish(AbstractDistribZkTestBase.java:121)
	at org.apache.solr.cloud.BasicDistributedZkTest.testCoreUnloadAndLeaders(BasicDistributedZkTest.java:586)
	at org.apache.solr.cloud.BasicDistributedZkTest.doTest(BasicDistributedZkTest.java:337)
	at org.apache.solr.BaseDistributedSearchTestCase.testDistribSearch(BaseDistributedSearchTestCase.java:794)
	at sun.reflect.NativeMethodAccessorImpl.invoke0(Native Method)
	at sun.reflect.NativeMethodAccessorImpl.invoke(NativeMethodAccessorImpl.java:57)
	at sun.reflect.DelegatingMethodAccessorImpl.invoke(DelegatingMethodAccessorImpl.java:43)
	at java.lang.reflect.Method.invoke(Method.java:601)
	at com.carrotsearch.randomizedtesting.RandomizedRunner.invoke(RandomizedRunner.java:1559)
	at com.carrotsearch.randomizedtesting.RandomizedRunner.access$600(RandomizedRunner.java:79)
	at com.carrotsearch.randomizedtesting.RandomizedRunner$6.evaluate(RandomizedRunner.java:737)
	at com.carrotsearch.randomizedtesting.RandomizedRunner$7.evaluate(RandomizedRunner.java:773)
	at com.carrotsearch.randomizedtesting.RandomizedRunner$8.evaluate(RandomizedRunner.java:787)
	at com.carrotsearch.randomizedtesting.rules.SystemPropertiesRestoreRule$1.evaluate(SystemPropertiesRestoreRule.java:53)
	at org.apache.lucene.util.TestRuleSetupTeardownChained$1.evaluate(TestRuleSetupTeardownChained.java:50)
	at org.apache.lucene.util.TestRuleFieldCacheSanity$1.evaluate(TestRuleFieldCacheSanity.java:51)
	at org.apache.lucene.util.AbstractBeforeAfterRule$1.evaluate(AbstractBeforeAfterRule.java:46)
	at com.carrotsearch.randomizedtesting.rules.SystemPropertiesInvariantRule$1.evaluate(SystemPropertiesInvariantRule.java:55)
	at org.apache.lucene.util.TestRuleThreadAndTestName$1.evaluate(TestRuleThreadAndTestName.java:49)
	at org.apache.lucene.util.TestRuleIgnoreAfterMaxFailures$1.evaluate(TestRuleIgnoreAfterMaxFailures.java:70)
	at org.apache.lucene.util.TestRuleMarkFailure$1.evaluate(TestRuleMarkFailure.java:48)
	at com.carrotsearch.randomizedtesting.rules.StatementAdapter.evaluate(StatementAdapter.java:36)
	at com.carrotsearch.randomizedtesting.ThreadLeakControl$StatementRunner.run(ThreadLeakControl.java:358)
	at com.carrotsearch.randomizedtesting.ThreadLeakControl.forkTimeoutingTask(ThreadLeakControl.java:782)
	at com.carrotsearch.randomizedtesting.ThreadLeakControl$3.evaluate(ThreadLeakControl.java:442)
	at com.carrotsearch.randomizedtesting.RandomizedRunner.runSingleTest(RandomizedRunner.java:746)
	at com.carrotsearch.randomizedtesting.RandomizedRunner$3.evaluate(RandomizedRunner.java:648)
	at com.carrotsearch.randomizedtesting.RandomizedRunner$4.evaluate(RandomizedRunner.java:682)
	at com.carrotsearch.randomizedtesting.RandomizedRunner$5.evaluate(RandomizedRunner.java:693)
	at com.carrotsearch.randomizedtesting.rules.StatementAdapter.evaluate(StatementAdapter.java:36)
	at com.carrotsearch.randomizedtesting.rules.SystemPropertiesRestoreRule$1.evaluate(SystemPropertiesRestoreRule.java:53)
	at org.apache.lucene.util.AbstractBeforeAfterRule$1.evaluate(AbstractBeforeAfterRule.java:46)
	at org.apache.lucene.util.TestRuleStoreClassName$1.evaluate(TestRuleStoreClassName.java:42)
	at com.carrotsearch.randomizedtesting.rules.SystemPropertiesInvariantRule$1.evaluate(SystemPropertiesInvariantRule.java:55)
	at com.carrotsearch.randomizedtesting.rules.NoShadowingOrOverridesOnMethodsRule$1.evaluate(NoShadowingOrOverridesOnMethodsRule.java:39)
	at com.carrotsearch.randomizedtesting.rules.NoShadowingOrOverridesOnMethodsRule$1.evaluate(NoShadowingOrOverridesOnMethodsRule.java:39)
	at com.carrotsearch.randomizedtesting.rules.StatementAdapter.evaluate(StatementAdapter.java:36)
	at org.apache.lucene.util.TestRuleAssertionsRequired$1.evaluate(TestRuleAssertionsRequired.java:43)
	at org.apache.lucene.util.TestRuleMarkFailure$1.evaluate(TestRuleMarkFailure.java:48)
	at org.apache.lucene.util.TestRuleIgnoreAfterMaxFailures$1.evaluate(TestRuleIgnoreAfterMaxFailures.java:70)
	at org.apache.lucene.util.TestRuleIgnoreTestSuites$1.evaluate(TestRuleIgnoreTestSuites.java:55)
	at com.carrotsearch.randomizedtesting.rules.StatementAdapter.evaluate(StatementAdapter.java:36)
	at com.carrotsearch.randomizedtesting.ThreadLeakControl$StatementRunner.run(ThreadLeakControl.java:358)
	at java.lang.Thread.run(Thread.java:722)




Build Log:
[...truncated 9049 lines...]
[junit4:junit4] Suite: org.apache.solr.cloud.BasicDistributedZkTest
[junit4:junit4]   2> 0 T2338 oas.BaseDistributedSearchTestCase.initHostContext Setting hostContext system property: /
[junit4:junit4]   2> 7 T2338 oas.SolrTestCaseJ4.setUp ###Starting testDistribSearch
[junit4:junit4]   2> Creating dataDir: /Users/jenkins/jenkins-slave/workspace/Lucene-Solr-trunk-MacOSX/solr/build/solr-core/test/J0/./solrtest-BasicDistributedZkTest-1359850910099
[junit4:junit4]   2> 8 T2338 oasc.ZkTestServer.run STARTING ZK TEST SERVER
[junit4:junit4]   2> 9 T2339 oasc.ZkTestServer$ZKServerMain.runFromConfig Starting server
[junit4:junit4]   2> 11 T2339 oazs.ZooKeeperServer.setTickTime tickTime set to 1000
[junit4:junit4]   2> 11 T2339 oazs.ZooKeeperServer.setMinSessionTimeout minSessionTimeout set to -1
[junit4:junit4]   2> 11 T2339 oazs.ZooKeeperServer.setMaxSessionTimeout maxSessionTimeout set to -1
[junit4:junit4]   2> 12 T2339 oazs.NIOServerCnxnFactory.configure binding to port 0.0.0.0/0.0.0.0:0
[junit4:junit4]   2> 13 T2339 oazsp.FileTxnSnapLog.save Snapshotting: 0x0 to /Users/jenkins/jenkins-slave/workspace/Lucene-Solr-trunk-MacOSX/solr/build/solr-core/test/J0/./org.apache.solr.cloud.BasicDistributedZkTest-1359850910098/zookeeper/server1/data/version-2/snapshot.0
[junit4:junit4]   2> 110 T2338 oasc.ZkTestServer.run start zk server on port:49784
[junit4:junit4]   2> 111 T2338 oaz.ZooKeeper.<init> Initiating client connection, connectString=127.0.0.1:49784 sessionTimeout=10000 watcher=org.apache.solr.common.cloud.ConnectionManager@3a20ac49
[junit4:junit4]   2> 112 T2338 oascc.ConnectionManager.waitForConnected Waiting for client to connect to ZooKeeper
[junit4:junit4]   2> 113 T2344 oaz.ClientCnxn$SendThread.logStartConnect Opening socket connection to server localhost/127.0.0.1:49784. Will not attempt to authenticate using SASL (access denied ("javax.security.auth.AuthPermission" "getLoginConfiguration"))
[junit4:junit4]   2> 114 T2344 oaz.ClientCnxn$SendThread.primeConnection Socket connection established to localhost/127.0.0.1:49784, initiating session
[junit4:junit4]   2> 115 T2340 oazs.NIOServerCnxnFactory.run Accepted socket connection from /127.0.0.1:49785
[junit4:junit4]   2> 116 T2340 oazs.ZooKeeperServer.processConnectRequest Client attempting to establish new session at /127.0.0.1:49785
[junit4:junit4]   2> 116 T2342 oazsp.FileTxnLog.append Creating new log file: log.1
[junit4:junit4]   2> 119 T2342 oazs.ZooKeeperServer.finishSessionInit Established session 0x13c9d6e31990000 with negotiated timeout 10000 for client /127.0.0.1:49785
[junit4:junit4]   2> 119 T2344 oaz.ClientCnxn$SendThread.onConnected Session establishment complete on server localhost/127.0.0.1:49784, sessionid = 0x13c9d6e31990000, negotiated timeout = 10000
[junit4:junit4]   2> 120 T2345 oascc.ConnectionManager.process Watcher org.apache.solr.common.cloud.ConnectionManager@3a20ac49 name:ZooKeeperConnection Watcher:127.0.0.1:49784 got event WatchedEvent state:SyncConnected type:None path:null path:null type:None
[junit4:junit4]   2> 121 T2338 oascc.ConnectionManager.waitForConnected Client is connected to ZooKeeper
[junit4:junit4]   2> 121 T2338 oascc.SolrZkClient.makePath makePath: /solr
[junit4:junit4]   2> 126 T2343 oazs.PrepRequestProcessor.pRequest2Txn Processed session termination for sessionid: 0x13c9d6e31990000
[junit4:junit4]   2> 128 T2340 oazs.NIOServerCnxn.closeSock Closed socket connection for client /127.0.0.1:49785 which had sessionid 0x13c9d6e31990000
[junit4:junit4]   2> 129 T2345 oaz.ClientCnxn$EventThread.run EventThread shut down
[junit4:junit4]   2> 129 T2338 oaz.ZooKeeper.close Session: 0x13c9d6e31990000 closed
[junit4:junit4]   2> 130 T2338 oaz.ZooKeeper.<init> Initiating client connection, connectString=127.0.0.1:49784/solr sessionTimeout=10000 watcher=org.apache.solr.common.cloud.ConnectionManager@3f5661f8
[junit4:junit4]   2> 132 T2338 oascc.ConnectionManager.waitForConnected Waiting for client to connect to ZooKeeper
[junit4:junit4]   2> 133 T2346 oaz.ClientCnxn$SendThread.logStartConnect Opening socket connection to server localhost/127.0.0.1:49784. Will not attempt to authenticate using SASL (access denied ("javax.security.auth.AuthPermission" "getLoginConfiguration"))
[junit4:junit4]   2> 134 T2346 oaz.ClientCnxn$SendThread.primeConnection Socket connection established to localhost/127.0.0.1:49784, initiating session
[junit4:junit4]   2> 134 T2340 oazs.NIOServerCnxnFactory.run Accepted socket connection from /127.0.0.1:49786
[junit4:junit4]   2> 135 T2340 oazs.ZooKeeperServer.processConnectRequest Client attempting to establish new session at /127.0.0.1:49786
[junit4:junit4]   2> 136 T2342 oazs.ZooKeeperServer.finishSessionInit Established session 0x13c9d6e31990001 with negotiated timeout 10000 for client /127.0.0.1:49786
[junit4:junit4]   2> 136 T2346 oaz.ClientCnxn$SendThread.onConnected Session establishment complete on server localhost/127.0.0.1:49784, sessionid = 0x13c9d6e31990001, negotiated timeout = 10000
[junit4:junit4]   2> 137 T2347 oascc.ConnectionManager.process Watcher org.apache.solr.common.cloud.ConnectionManager@3f5661f8 name:ZooKeeperConnection Watcher:127.0.0.1:49784/solr got event WatchedEvent state:SyncConnected type:None path:null path:null type:None
[junit4:junit4]   2> 138 T2338 oascc.ConnectionManager.waitForConnected Client is connected to ZooKeeper
[junit4:junit4]   2> 138 T2338 oascc.SolrZkClient.makePath makePath: /collections/collection1
[junit4:junit4]   2> 145 T2338 oascc.SolrZkClient.makePath makePath: /collections/collection1/shards
[junit4:junit4]   2> 151 T2338 oascc.SolrZkClient.makePath makePath: /collections/control_collection
[junit4:junit4]   2> 156 T2338 oascc.SolrZkClient.makePath makePath: /collections/control_collection/shards
[junit4:junit4]   2> 162 T2338 oasc.AbstractZkTestCase.putConfig put /Users/jenkins/jenkins-slave/workspace/Lucene-Solr-trunk-MacOSX/solr/build/solr-core/test-files/solr/collection1/conf/solrconfig.xml to /configs/conf1/solrconfig.xml
[junit4:junit4]   2> 163 T2338 oascc.SolrZkClient.makePath makePath: /configs/conf1/solrconfig.xml
[junit4:junit4]   2> 170 T2338 oasc.AbstractZkTestCase.putConfig put /Users/jenkins/jenkins-slave/workspace/Lucene-Solr-trunk-MacOSX/solr/build/solr-core/test-files/solr/collection1/conf/schema.xml to /configs/conf1/schema.xml
[junit4:junit4]   2> 172 T2338 oascc.SolrZkClient.makePath makePath: /configs/conf1/schema.xml
[junit4:junit4]   2> 178 T2338 oasc.AbstractZkTestCase.putConfig put /Users/jenkins/jenkins-slave/workspace/Lucene-Solr-trunk-MacOSX/solr/build/solr-core/test-files/solr/collection1/conf/stopwords.txt to /configs/conf1/stopwords.txt
[junit4:junit4]   2> 178 T2338 oascc.SolrZkClient.makePath makePath: /configs/conf1/stopwords.txt
[junit4:junit4]   2> 184 T2338 oasc.AbstractZkTestCase.putConfig put /Users/jenkins/jenkins-slave/workspace/Lucene-Solr-trunk-MacOSX/solr/build/solr-core/test-files/solr/collection1/conf/protwords.txt to /configs/conf1/protwords.txt
[junit4:junit4]   2> 185 T2338 oascc.SolrZkClient.makePath makePath: /configs/conf1/protwords.txt
[junit4:junit4]   2> 189 T2338 oasc.AbstractZkTestCase.putConfig put /Users/jenkins/jenkins-slave/workspace/Lucene-Solr-trunk-MacOSX/solr/build/solr-core/test-files/solr/collection1/conf/currency.xml to /configs/conf1/currency.xml
[junit4:junit4]   2> 190 T2338 oascc.SolrZkClient.makePath makePath: /configs/conf1/currency.xml
[junit4:junit4]   2> 195 T2338 oasc.AbstractZkTestCase.putConfig put /Users/jenkins/jenkins-slave/workspace/Lucene-Solr-trunk-MacOSX/solr/build/solr-core/test-files/solr/collection1/conf/open-exchange-rates.json to /configs/conf1/open-exchange-rates.json
[junit4:junit4]   2> 196 T2338 oascc.SolrZkClient.makePath makePath: /configs/conf1/open-exchange-rates.json
[junit4:junit4]   2> 201 T2338 oasc.AbstractZkTestCase.putConfig put /Users/jenkins/jenkins-slave/workspace/Lucene-Solr-trunk-MacOSX/solr/build/solr-core/test-files/solr/collection1/conf/mapping-ISOLatin1Accent.txt to /configs/conf1/mapping-ISOLatin1Accent.txt
[junit4:junit4]   2> 202 T2338 oascc.SolrZkClient.makePath makePath: /configs/conf1/mapping-ISOLatin1Accent.txt
[junit4:junit4]   2> 208 T2338 oasc.AbstractZkTestCase.putConfig put /Users/jenkins/jenkins-slave/workspace/Lucene-Solr-trunk-MacOSX/solr/build/solr-core/test-files/solr/collection1/conf/old_synonyms.txt to /configs/conf1/old_synonyms.txt
[junit4:junit4]   2> 209 T2338 oascc.SolrZkClient.makePath makePath: /configs/conf1/old_synonyms.txt
[junit4:junit4]   2> 214 T2338 oasc.AbstractZkTestCase.putConfig put /Users/jenkins/jenkins-slave/workspace/Lucene-Solr-trunk-MacOSX/solr/build/solr-core/test-files/solr/collection1/conf/synonyms.txt to /configs/conf1/synonyms.txt
[junit4:junit4]   2> 215 T2338 oascc.SolrZkClient.makePath makePath: /configs/conf1/synonyms.txt
[junit4:junit4]   2> 220 T2343 oazs.PrepRequestProcessor.pRequest2Txn Processed session termination for sessionid: 0x13c9d6e31990001
[junit4:junit4]   2> 221 T2340 oazs.NIOServerCnxn.closeSock Closed socket connection for client /127.0.0.1:49786 which had sessionid 0x13c9d6e31990001
[junit4:junit4]   2> 222 T2347 oaz.ClientCnxn$EventThread.run EventThread shut down
[junit4:junit4]   2> 222 T2338 oaz.ZooKeeper.close Session: 0x13c9d6e31990001 closed
[junit4:junit4]   2> 412 T2338 oejs.Server.doStart jetty-8.1.8.v20121106
[junit4:junit4]   2> 420 T2338 oejs.AbstractConnector.doStart Started SelectChannelConnector@127.0.0.1:49787
[junit4:junit4]   2> 421 T2338 oass.SolrDispatchFilter.init SolrDispatchFilter.init()
[junit4:junit4]   2> 421 T2338 oasc.SolrResourceLoader.locateSolrHome JNDI not configured for solr (NoInitialContextEx)
[junit4:junit4]   2> 422 T2338 oasc.SolrResourceLoader.locateSolrHome using system property solr.solr.home: /Users/jenkins/jenkins-slave/workspace/Lucene-Solr-trunk-MacOSX/solr/build/solr-core/test/J0/./org.apache.solr.cloud.BasicDistributedZkTest-controljetty-1359850910314
[junit4:junit4]   2> 423 T2338 oasc.CoreContainer$Initializer.initialize looking for solr.xml: /Users/jenkins/jenkins-slave/workspace/Lucene-Solr-trunk-MacOSX/solr/build/solr-core/test/J0/./org.apache.solr.cloud.BasicDistributedZkTest-controljetty-1359850910314/solr.xml
[junit4:junit4]   2> 423 T2338 oasc.CoreContainer.<init> New CoreContainer 408319598
[junit4:junit4]   2> 424 T2338 oasc.CoreContainer.load Loading CoreContainer using Solr Home: '/Users/jenkins/jenkins-slave/workspace/Lucene-Solr-trunk-MacOSX/solr/build/solr-core/test/J0/./org.apache.solr.cloud.BasicDistributedZkTest-controljetty-1359850910314/'
[junit4:junit4]   2> 425 T2338 oasc.SolrResourceLoader.<init> new SolrResourceLoader for directory: '/Users/jenkins/jenkins-slave/workspace/Lucene-Solr-trunk-MacOSX/solr/build/solr-core/test/J0/./org.apache.solr.cloud.BasicDistributedZkTest-controljetty-1359850910314/'
[junit4:junit4]   2> 463 T2338 oashc.HttpShardHandlerFactory.getParameter Setting socketTimeout to: 60000
[junit4:junit4]   2> 464 T2338 oashc.HttpShardHandlerFactory.getParameter Setting urlScheme to: http://
[junit4:junit4]   2> 464 T2338 oashc.HttpShardHandlerFactory.getParameter Setting connTimeout to: 15000
[junit4:junit4]   2> 465 T2338 oashc.HttpShardHandlerFactory.getParameter Setting maxConnectionsPerHost to: 20
[junit4:junit4]   2> 466 T2338 oashc.HttpShardHandlerFactory.getParameter Setting corePoolSize to: 0
[junit4:junit4]   2> 467 T2338 oashc.HttpShardHandlerFactory.getParameter Setting maximumPoolSize to: 2147483647
[junit4:junit4]   2> 468 T2338 oashc.HttpShardHandlerFactory.getParameter Setting maxThreadIdleTime to: 5
[junit4:junit4]   2> 469 T2338 oashc.HttpShardHandlerFactory.getParameter Setting sizeOfQueue to: -1
[junit4:junit4]   2> 470 T2338 oashc.HttpShardHandlerFactory.getParameter Setting fairnessPolicy to: false
[junit4:junit4]   2> 471 T2338 oascsi.HttpClientUtil.createClient Creating new http client, config:maxConnectionsPerHost=20&maxConnections=10000&socketTimeout=60000&connTimeout=15000&retry=false
[junit4:junit4]   2> 482 T2338 oasc.CoreContainer.load Registering Log Listener
[junit4:junit4]   2> 496 T2338 oasc.CoreContainer.initZooKeeper Zookeeper client=127.0.0.1:49784/solr
[junit4:junit4]   2> 496 T2338 oasc.ZkController.checkChrootPath zkHost includes chroot
[junit4:junit4]   2> 497 T2338 oaz.ZooKeeper.<init> Initiating client connection, connectString=127.0.0.1:49784 sessionTimeout=60000 watcher=org.apache.solr.common.cloud.ConnectionManager@2647c1e6
[junit4:junit4]   2> 498 T2338 oascc.ConnectionManager.waitForConnected Waiting for client to connect to ZooKeeper
[junit4:junit4]   2> 498 T2357 oaz.ClientCnxn$SendThread.logStartConnect Opening socket connection to server localhost/127.0.0.1:49784. Will not attempt to authenticate using SASL (access denied ("javax.security.auth.AuthPermission" "getLoginConfiguration"))
[junit4:junit4]   2> 499 T2357 oaz.ClientCnxn$SendThread.primeConnection Socket connection established to localhost/127.0.0.1:49784, initiating session
[junit4:junit4]   2> 499 T2340 oazs.NIOServerCnxnFactory.run Accepted socket connection from /127.0.0.1:49788
[junit4:junit4]   2> 499 T2340 oazs.ZooKeeperServer.processConnectRequest Client attempting to establish new session at /127.0.0.1:49788
[junit4:junit4]   2> 501 T2342 oazs.ZooKeeperServer.finishSessionInit Established session 0x13c9d6e31990002 with negotiated timeout 20000 for client /127.0.0.1:49788
[junit4:junit4]   2> 501 T2357 oaz.ClientCnxn$SendThread.onConnected Session establishment complete on server localhost/127.0.0.1:49784, sessionid = 0x13c9d6e31990002, negotiated timeout = 20000
[junit4:junit4]   2> 501 T2358 oascc.ConnectionManager.process Watcher org.apache.solr.common.cloud.ConnectionManager@2647c1e6 name:ZooKeeperConnection Watcher:127.0.0.1:49784 got event WatchedEvent state:SyncConnected type:None path:null path:null type:None
[junit4:junit4]   2> 501 T2338 oascc.ConnectionManager.waitForConnected Client is connected to ZooKeeper
[junit4:junit4]   2> 503 T2343 oazs.PrepRequestProcessor.pRequest2Txn Processed session termination for sessionid: 0x13c9d6e31990002
[junit4:junit4]   2> 504 T2340 oazs.NIOServerCnxn.closeSock Closed socket connection for client /127.0.0.1:49788 which had sessionid 0x13c9d6e31990002
[junit4:junit4]   2> 504 T2338 oaz.ZooKeeper.close Session: 0x13c9d6e31990002 closed
[junit4:junit4]   2> 504 T2358 oaz.ClientCnxn$EventThread.run EventThread shut down
[junit4:junit4]   2> 505 T2338 oascsi.HttpClientUtil.createClient Creating new http client, config:maxConnections=500&maxConnectionsPerHost=16&socketTimeout=60000&connTimeout=15000
[junit4:junit4]   2> 510 T2338 oaz.ZooKeeper.<init> Initiating client connection, connectString=127.0.0.1:49784/solr sessionTimeout=30000 watcher=org.apache.solr.common.cloud.ConnectionManager@473d7809
[junit4:junit4]   2> 511 T2338 oascc.ConnectionManager.waitForConnected Waiting for client to connect to ZooKeeper
[junit4:junit4]   2> 512 T2359 oaz.ClientCnxn$SendThread.logStartConnect Opening socket connection to server localhost/127.0.0.1:49784. Will not attempt to authenticate using SASL (access denied ("javax.security.auth.AuthPermission" "getLoginConfiguration"))
[junit4:junit4]   2> 512 T2359 oaz.ClientCnxn$SendThread.primeConnection Socket connection established to localhost/127.0.0.1:49784, initiating session
[junit4:junit4]   2> 513 T2340 oazs.NIOServerCnxnFactory.run Accepted socket connection from /127.0.0.1:49789
[junit4:junit4]   2> 513 T2340 oazs.ZooKeeperServer.processConnectRequest Client attempting to establish new session at /127.0.0.1:49789
[junit4:junit4]   2> 514 T2342 oazs.ZooKeeperServer.finishSessionInit Established session 0x13c9d6e31990003 with negotiated timeout 20000 for client /127.0.0.1:49789
[junit4:junit4]   2> 514 T2359 oaz.ClientCnxn$SendThread.onConnected Session establishment complete on server localhost/127.0.0.1:49784, sessionid = 0x13c9d6e31990003, negotiated timeout = 20000
[junit4:junit4]   2> 515 T2360 oascc.ConnectionManager.process Watcher org.apache.solr.common.cloud.ConnectionManager@473d7809 name:ZooKeeperConnection Watcher:127.0.0.1:49784/solr got event WatchedEvent state:SyncConnected type:None path:null path:null type:None
[junit4:junit4]   2> 515 T2338 oascc.ConnectionManager.waitForConnected Client is connected to ZooKeeper
[junit4:junit4]   2> 518 T2343 oazs.PrepRequestProcessor.pRequest Got user-level KeeperException when processing sessionid:0x13c9d6e31990003 type:create cxid:0x2 zxid:0x1a txntype:-1 reqpath:n/a Error Path:/solr/overseer Error:KeeperErrorCode = NodeExists for /solr/overseer
[junit4:junit4]   2> 520 T2338 oascc.SolrZkClient.makePath makePath: /live_nodes
[junit4:junit4]   2> 525 T2338 oasc.ZkController.createEphemeralLiveNode Register node as live in ZooKeeper:/live_nodes/127.0.0.1:49787_
[junit4:junit4]   2> 526 T2343 oazs.PrepRequestProcessor.pRequest Got user-level KeeperException when processing sessionid:0x13c9d6e31990003 type:delete cxid:0x7 zxid:0x1c txntype:-1 reqpath:n/a Error Path:/solr/live_nodes/127.0.0.1:49787_ Error:KeeperErrorCode = NoNode for /solr/live_nodes/127.0.0.1:49787_
[junit4:junit4]   2> 527 T2338 oascc.SolrZkClient.makePath makePath: /live_nodes/127.0.0.1:49787_
[junit4:junit4]   2> 534 T2338 oascc.SolrZkClient.makePath makePath: /overseer_elect/election
[junit4:junit4]   2> 545 T2343 oazs.PrepRequestProcessor.pRequest Got user-level KeeperException when processing sessionid:0x13c9d6e31990003 type:delete cxid:0x15 zxid:0x21 txntype:-1 reqpath:n/a Error Path:/solr/overseer_elect/leader Error:KeeperErrorCode = NoNode for /solr/overseer_elect/leader
[junit4:junit4]   2> 547 T2338 oascc.SolrZkClient.makePath makePath: /overseer_elect/leader
[junit4:junit4]   2> 552 T2338 oasc.Overseer.start Overseer (id=89119189244641283-127.0.0.1:49787_-n_0000000000) starting
[junit4:junit4]   2> 554 T2343 oazs.PrepRequestProcessor.pRequest Got user-level KeeperException when processing sessionid:0x13c9d6e31990003 type:create cxid:0x1a zxid:0x23 txntype:-1 reqpath:n/a Error Path:/solr/overseer Error:KeeperErrorCode = NodeExists for /solr/overseer
[junit4:junit4]   2> 556 T2343 oazs.PrepRequestProcessor.pRequest Got user-level KeeperException when processing sessionid:0x13c9d6e31990003 type:create cxid:0x1b zxid:0x24 txntype:-1 reqpath:n/a Error Path:/solr/overseer Error:KeeperErrorCode = NodeExists for /solr/overseer
[junit4:junit4]   2> 558 T2343 oazs.PrepRequestProcessor.pRequest Got user-level KeeperException when processing sessionid:0x13c9d6e31990003 type:create cxid:0x1c zxid:0x25 txntype:-1 reqpath:n/a Error Path:/solr/overseer Error:KeeperErrorCode = NodeExists for /solr/overseer
[junit4:junit4]   2> 560 T2343 oazs.PrepRequestProcessor.pRequest Got user-level KeeperException when processing sessionid:0x13c9d6e31990003 type:create cxid:0x1d zxid:0x26 txntype:-1 reqpath:n/a Error Path:/solr/overseer Error:KeeperErrorCode = NodeExists for /solr/overseer
[junit4:junit4]   2> 562 T2362 oasc.OverseerCollectionProcessor.run Process current queue of collection creations
[junit4:junit4]   2> 563 T2338 oascc.SolrZkClient.makePath makePath: /clusterstate.json
[junit4:junit4]   2> 569 T2338 oascc.ZkStateReader.createClusterStateWatchersAndUpdate Updating cluster state from ZooKeeper... 
[junit4:junit4]   2> 574 T2361 oasc.Overseer$ClusterStateUpdater.run Starting to work on the main queue
[junit4:junit4]   2> 580 T2363 oasc.CoreContainer.create Creating SolrCore 'collection1' using instanceDir: /Users/jenkins/jenkins-slave/workspace/Lucene-Solr-trunk-MacOSX/solr/build/solr-core/test/J0/./org.apache.solr.cloud.BasicDistributedZkTest-controljetty-1359850910314/collection1
[junit4:junit4]   2> 581 T2363 oasc.ZkController.createCollectionZkNode Check for collection zkNode:control_collection
[junit4:junit4]   2> 582 T2363 oasc.ZkController.createCollectionZkNode Collection zkNode exists
[junit4:junit4]   2> 582 T2363 oasc.ZkController.readConfigName Load collection config from:/collections/control_collection
[junit4:junit4]   2> 585 T2363 oasc.SolrResourceLoader.<init> new SolrResourceLoader for directory: '/Users/jenkins/jenkins-slave/workspace/Lucene-Solr-trunk-MacOSX/solr/build/solr-core/test/J0/./org.apache.solr.cloud.BasicDistributedZkTest-controljetty-1359850910314/collection1/'
[junit4:junit4]   2> 586 T2363 oasc.SolrResourceLoader.replaceClassLoader Adding 'file:/Users/jenkins/jenkins-slave/workspace/Lucene-Solr-trunk-MacOSX/solr/build/solr-core/test/J0/org.apache.solr.cloud.BasicDistributedZkTest-controljetty-1359850910314/collection1/lib/classes/' to classloader
[junit4:junit4]   2> 586 T2363 oasc.SolrResourceLoader.replaceClassLoader Adding 'file:/Users/jenkins/jenkins-slave/workspace/Lucene-Solr-trunk-MacOSX/solr/build/solr-core/test/J0/org.apache.solr.cloud.BasicDistributedZkTest-controljetty-1359850910314/collection1/lib/README' to classloader
[junit4:junit4]   2> 643 T2363 oasc.SolrConfig.<init> Using Lucene MatchVersion: LUCENE_50
[junit4:junit4]   2> 715 T2363 oasc.SolrConfig.<init> Loaded SolrConfig: solrconfig.xml
[junit4:junit4]   2> 717 T2363 oass.IndexSchema.readSchema Reading Solr Schema
[junit4:junit4]   2> 724 T2363 oass.IndexSchema.readSchema Schema name=test
[junit4:junit4]   2> 1375 T2363 oass.OpenExchangeRatesOrgProvider.init Initialized with rates=open-exchange-rates.json, refreshInterval=1440.
[junit4:junit4]   2> 1384 T2363 oass.IndexSchema.readSchema default search field in schema is text
[junit4:junit4]   2> 1387 T2363 oass.IndexSchema.readSchema unique key field: id
[junit4:junit4]   2> 1409 T2363 oass.FileExchangeRateProvider.reload Reloading exchange rates from file currency.xml
[junit4:junit4]   2> 1414 T2363 oass.FileExchangeRateProvider.reload Reloading exchange rates from file currency.xml
[junit4:junit4]   2> 1420 T2363 oass.OpenExchangeRatesOrgProvider.reload Reloading exchange rates from open-exchange-rates.json
[junit4:junit4]   2> 1422 T2363 oass.OpenExchangeRatesOrgProvider.reload Reloading exchange rates from open-exchange-rates.json
[junit4:junit4]   2> 1424 T2363 oasc.SolrCore.<init> [collection1] Opening new SolrCore at /Users/jenkins/jenkins-slave/workspace/Lucene-Solr-trunk-MacOSX/solr/build/solr-core/test/J0/./org.apache.solr.cloud.BasicDistributedZkTest-controljetty-1359850910314/collection1/, dataDir=./org.apache.solr.cloud.BasicDistributedZkTest-1359850910098/control/data/
[junit4:junit4]   2> 1424 T2363 oasc.JmxMonitoredMap.<init> JMX monitoring is enabled. Adding Solr mbeans to JMX Server: com.sun.jmx.mbeanserver.JmxMBeanServer@3f80cfa7
[junit4:junit4]   2> 1425 T2363 oasc.SolrCore.initDirectoryFactory solr.NRTCachingDirectoryFactory
[junit4:junit4]   2> 1426 T2363 oasc.CachingDirectoryFactory.get return new directory for /Users/jenkins/jenkins-slave/workspace/Lucene-Solr-trunk-MacOSX/solr/build/solr-core/test/J0/./org.apache.solr.cloud.BasicDistributedZkTest-1359850910098/control/data forceNew:false
[junit4:junit4]   2> 1426 T2363 oasc.CachingDirectoryFactory.close Releasing directory:/Users/jenkins/jenkins-slave/workspace/Lucene-Solr-trunk-MacOSX/solr/build/solr-core/test/J0/./org.apache.solr.cloud.BasicDistributedZkTest-1359850910098/control/data
[junit4:junit4]   2> 1427 T2363 oasc.SolrCore.getNewIndexDir New index directory detected: old=null new=./org.apache.solr.cloud.BasicDistributedZkTest-1359850910098/control/data/index/
[junit4:junit4]   2> 1427 T2363 oasc.SolrCore.initIndex WARNING [collection1] Solr index directory './org.apache.solr.cloud.BasicDistributedZkTest-1359850910098/control/data/index' doesn't exist. Creating new index...
[junit4:junit4]   2> 1428 T2363 oasc.CachingDirectoryFactory.get return new directory for /Users/jenkins/jenkins-slave/workspace/Lucene-Solr-trunk-MacOSX/solr/build/solr-core/test/J0/./org.apache.solr.cloud.BasicDistributedZkTest-1359850910098/control/data/index forceNew:false
[junit4:junit4]   2> 1433 T2363 oasc.SolrDeletionPolicy.onCommit SolrDeletionPolicy.onCommit: commits:num=1
[junit4:junit4]   2> 		commit{dir=RateLimitedDirectoryWrapper(NRTCachingDirectory(org.apache.lucene.store.NIOFSDirectory@/Users/jenkins/jenkins-slave/workspace/Lucene-Solr-trunk-MacOSX/solr/build/solr-core/test/J0/org.apache.solr.cloud.BasicDistributedZkTest-1359850910098/control/data/index lockFactory=org.apache.lucene.store.NativeFSLockFactory@3c8c03ae; maxCacheMB=48.0 maxMergeSizeMB=4.0)),segFN=segments_1,generation=1,filenames=[segments_1]
[junit4:junit4]   2> 1434 T2363 oasc.SolrDeletionPolicy.updateCommits newest commit = 1[segments_1]
[junit4:junit4]   2> 1435 T2363 oasc.CachingDirectoryFactory.close Releasing directory:/Users/jenkins/jenkins-slave/workspace/Lucene-Solr-trunk-MacOSX/solr/build/solr-core/test/J0/./org.apache.solr.cloud.BasicDistributedZkTest-1359850910098/control/data/index
[junit4:junit4]   2> 1435 T2363 oasc.SolrCore.initWriters created xml: solr.XMLResponseWriter
[junit4:junit4]   2> 1437 T2363 oasup.UpdateRequestProcessorChain.init inserting DistributedUpdateProcessorFactory into updateRequestProcessorChain "dedupe"
[junit4:junit4]   2> 1438 T2363 oasup.UpdateRequestProcessorChain.init inserting DistributedUpdateProcessorFactory into updateRequestProcessorChain "dedupe-allfields"
[junit4:junit4]   2> 1438 T2363 oasup.UpdateRequestProcessorChain.init inserting DistributedUpdateProcessorFactory into updateRequestProcessorChain "stored_sig"
[junit4:junit4]   2> 1438 T2363 oasup.UpdateRequestProcessorChain.init inserting DistributedUpdateProcessorFactory into updateRequestProcessorChain "uniq-fields"
[junit4:junit4]   2> 1439 T2363 oasup.UpdateRequestProcessorChain.init inserting DistributedUpdateProcessorFactory into updateRequestProcessorChain "distrib-dup-test-chain-implicit"
[junit4:junit4]   2> 1440 T2363 oasc.RequestHandlers.initHandlersFromConfig adding lazy requestHandler: solr.ReplicationHandler
[junit4:junit4]   2> 1440 T2363 oasc.RequestHandlers.initHandlersFromConfig created /replication: solr.ReplicationHandler
[junit4:junit4]   2> 1441 T2363 oasc.RequestHandlers.initHandlersFromConfig created standard: solr.StandardRequestHandler
[junit4:junit4]   2> 1441 T2363 oasc.RequestHandlers.initHandlersFromConfig created /get: solr.RealTimeGetHandler
[junit4:junit4]   2> 1442 T2363 oasc.RequestHandlers.initHandlersFromConfig created dismax: solr.SearchHandler
[junit4:junit4]   2> 1442 T2363 oasc.RequestHandlers.initHandlersFromConfig created mock: org.apache.solr.core.MockQuerySenderListenerReqHandler
[junit4:junit4]   2> 1443 T2363 oasc.RequestHandlers.initHandlersFromConfig created /admin/: org.apache.solr.handler.admin.AdminHandlers
[junit4:junit4]   2> 1443 T2363 oasc.RequestHandlers.initHandlersFromConfig created defaults: solr.StandardRequestHandler
[junit4:junit4]   2> 1444 T2363 oasc.RequestHandlers.initHandlersFromConfig adding lazy requestHandler: solr.StandardRequestHandler
[junit4:junit4]   2> 1444 T2363 oasc.RequestHandlers.initHandlersFromConfig created lazy: solr.StandardRequestHandler
[junit4:junit4]   2> 1444 T2363 oasc.RequestHandlers.initHandlersFromConfig created /update: solr.UpdateRequestHandler
[junit4:junit4]   2> 1445 T2363 oasc.RequestHandlers.initHandlersFromConfig created /terms: org.apache.solr.handler.component.SearchHandler
[junit4:junit4]   2> 1446 T2363 oasc.RequestHandlers.initHandlersFromConfig created spellCheckCompRH: org.apache.solr.handler.component.SearchHandler
[junit4:junit4]   2> 1446 T2363 oasc.RequestHandlers.initHandlersFromConfig created spellCheckCompRH_Direct: org.apache.solr.handler.component.SearchHandler
[junit4:junit4]   2> 1447 T2363 oasc.RequestHandlers.initHandlersFromConfig created spellCheckWithWordbreak: org.apache.solr.handler.component.SearchHandler
[junit4:junit4]   2> 1447 T2363 oasc.RequestHandlers.initHandlersFromConfig created spellCheckWithWordbreak_Direct: org.apache.solr.handler.component.SearchHandler
[junit4:junit4]   2> 1448 T2363 oasc.RequestHandlers.initHandlersFromConfig created spellCheckCompRH1: org.apache.solr.handler.component.SearchHandler
[junit4:junit4]   2> 1448 T2363 oasc.RequestHandlers.initHandlersFromConfig created mltrh: org.apache.solr.handler.component.SearchHandler
[junit4:junit4]   2> 1449 T2363 oasc.RequestHandlers.initHandlersFromConfig created tvrh: org.apache.solr.handler.component.SearchHandler
[junit4:junit4]   2> 1449 T2363 oasc.RequestHandlers.initHandlersFromConfig created /mlt: solr.MoreLikeThisHandler
[junit4:junit4]   2> 1450 T2363 oasc.RequestHandlers.initHandlersFromConfig created /debug/dump: solr.DumpRequestHandler
[junit4:junit4]   2> 1457 T2363 oashl.XMLLoader.init xsltCacheLifetimeSeconds=60
[junit4:junit4]   2> 1461 T2363 oasc.SolrCore.initDeprecatedSupport WARNING solrconfig.xml uses deprecated <admin/gettableFiles>, Please update your config to use the ShowFileRequestHandler.
[junit4:junit4]   2> 1462 T2363 oasc.SolrCore.initDeprecatedSupport WARNING adding ShowFileRequestHandler with hidden files: [SCHEMA.XML, OLD_SYNONYMS.TXT, STOPWORDS.TXT, PROTWORDS.TXT, OPEN-EXCHANGE-RATES.JSON, SYNONYMS.TXT, CURRENCY.XML, MAPPING-ISOLATIN1ACCENT.TXT]
[junit4:junit4]   2> 1465 T2363 oasc.CachingDirectoryFactory.close Releasing directory:/Users/jenkins/jenkins-slave/workspace/Lucene-Solr-trunk-MacOSX/solr/build/solr-core/test/J0/./org.apache.solr.cloud.BasicDistributedZkTest-1359850910098/control/data
[junit4:junit4]   2> 1466 T2363 oass.SolrIndexSearcher.<init> Opening Searcher@30d7acc0 main
[junit4:junit4]   2> 1467 T2363 oasu.CommitTracker.<init> Hard AutoCommit: disabled
[junit4:junit4]   2> 1468 T2363 oasu.CommitTracker.<init> Soft AutoCommit: disabled
[junit4:junit4]   2> 1468 T2363 oashc.SpellCheckComponent.inform Initializing spell checkers
[junit4:junit4]   2> 1473 T2363 oass.DirectSolrSpellChecker.init init: {name=direct,classname=DirectSolrSpellChecker,field=lowerfilt,minQueryLength=3}
[junit4:junit4]   2> 1504 T2364 oasc.SolrCore.registerSearcher [collection1] Registered new searcher Searcher@30d7acc0 main{StandardDirectoryReader(segments_1:1)}
[junit4:junit4]   2> 1509 T2363 oasc.ZkController.publish publishing core=collection1 state=down
[junit4:junit4]   2> 1509 T2363 oasc.ZkController.publish numShards not found on descriptor - reading it from system property
[junit4:junit4]   2> 1510 T2343 oazs.PrepRequestProcessor.pRequest Got user-level KeeperException when processing sessionid:0x13c9d6e31990003 type:create cxid:0x50 zxid:0x29 txntype:-1 reqpath:n/a Error Path:/solr/overseer/queue Error:KeeperErrorCode = NoNode for /solr/overseer/queue
[junit4:junit4]   2> 2082 T2361 oascc.ZkStateReader.updateClusterState Updating cloud state from ZooKeeper... 
[junit4:junit4]   2> 2083 T2361 oasc.Overseer$ClusterStateUpdater.updateState Update state numShards=1 message={
[junit4:junit4]   2> 	  "operation":"state",
[junit4:junit4]   2> 	  "numShards":"1",
[junit4:junit4]   2> 	  "shard":null,
[junit4:junit4]   2> 	  "roles":null,
[junit4:junit4]   2> 	  "state":"down",
[junit4:junit4]   2> 	  "core":"collection1",
[junit4:junit4]   2> 	  "collection":"control_collection",
[junit4:junit4]   2> 	  "node_name":"127.0.0.1:49787_",
[junit4:junit4]   2> 	  "base_url":"http://127.0.0.1:49787"}
[junit4:junit4]   2> 2083 T2361 oasc.Overseer$ClusterStateUpdater.createCollection Create collection control_collection with numShards 1
[junit4:junit4]   2> 2083 T2361 oasc.Overseer$ClusterStateUpdater.updateState Assigning new node to shard shard=shard1
[junit4:junit4]   2> 2084 T2343 oazs.PrepRequestProcessor.pRequest Got user-level KeeperException when processing sessionid:0x13c9d6e31990003 type:create cxid:0x58 zxid:0x2c txntype:-1 reqpath:n/a Error Path:/solr/overseer/queue-work Error:KeeperErrorCode = NoNode for /solr/overseer/queue-work
[junit4:junit4]   2> 2092 T2360 oascc.ZkStateReader$2.process A cluster state change: WatchedEvent state:SyncConnected type:NodeDataChanged path:/clusterstate.json, has occurred - updating... (live nodes size: 1)
[junit4:junit4]   2> 2515 T2363 oasc.CoreContainer.registerCore registering core: collection1
[junit4:junit4]   2> 2516 T2363 oasc.ZkController.register Register replica - core:collection1 address:http://127.0.0.1:49787 collection:control_collection shard:shard1
[junit4:junit4]   2> 2517 T2363 oascc.SolrZkClient.makePath makePath: /collections/control_collection/leader_elect/shard1/election
[junit4:junit4]   2> 2535 T2343 oazs.PrepRequestProcessor.pRequest Got user-level KeeperException when processing sessionid:0x13c9d6e31990003 type:delete cxid:0x72 zxid:0x36 txntype:-1 reqpath:n/a Error Path:/solr/collections/control_collection/leaders Error:KeeperErrorCode = NoNode for /solr/collections/control_collection/leaders
[junit4:junit4]   2> 2536 T2363 oasc.ShardLeaderElectionContext.runLeaderProcess Running the leader process.
[junit4:junit4]   2> 2537 T2343 oazs.PrepRequestProcessor.pRequest Got user-level KeeperException when processing sessionid:0x13c9d6e31990003 type:create cxid:0x73 zxid:0x37 txntype:-1 reqpath:n/a Error Path:/solr/overseer Error:KeeperErrorCode = NodeExists for /solr/overseer
[junit4:junit4]   2> 2540 T2363 oasc.ShardLeaderElectionContext.waitForReplicasToComeUp Enough replicas found to continue.
[junit4:junit4]   2> 2540 T2363 oasc.ShardLeaderElectionContext.runLeaderProcess I may be the new leader - try and sync
[junit4:junit4]   2> 2540 T2363 oasc.SyncStrategy.sync Sync replicas to http://127.0.0.1:49787/collection1/
[junit4:junit4]   2> 2541 T2363 oasc.SyncStrategy.syncReplicas Sync Success - now sync replicas to me
[junit4:junit4]   2> 2541 T2363 oasc.SyncStrategy.syncToMe http://127.0.0.1:49787/collection1/ has no replicas
[junit4:junit4]   2> 2541 T2363 oasc.ShardLeaderElectionContext.runLeaderProcess I am the new leader: http://127.0.0.1:49787/collection1/
[junit4:junit4]   2> 2541 T2363 oascc.SolrZkClient.makePath makePath: /collections/control_collection/leaders/shard1
[junit4:junit4]   2> 2549 T2343 oazs.PrepRequestProcessor.pRequest Got user-level KeeperException when processing sessionid:0x13c9d6e31990003 type:create cxid:0x7d zxid:0x3b txntype:-1 reqpath:n/a Error Path:/solr/overseer Error:KeeperErrorCode = NodeExists for /solr/overseer
[junit4:junit4]   2> 3599 T2361 oascc.ZkStateReader.updateClusterState Updating cloud state from ZooKeeper... 
[junit4:junit4]   2> 3610 T2360 oascc.ZkStateReader$2.process A cluster state change: WatchedEvent state:SyncConnected type:NodeDataChanged path:/clusterstate.json, has occurred - updating... (live nodes size: 1)
[junit4:junit4]   2> 3629 T2363 oasc.ZkController.register We are http://127.0.0.1:49787/collection1/ and leader is http://127.0.0.1:49787/collection1/
[junit4:junit4]   2> 3630 T2363 oasc.ZkController.register No LogReplay needed for core=collection1 baseURL=http://127.0.0.1:49787
[junit4:junit4]   2> 3630 T2363 oasc.ZkController.checkRecovery I am the leader, no recovery necessary
[junit4:junit4]   2> 3630 T2363 oasc.ZkController.publish publishing core=collection1 state=active
[junit4:junit4]   2> 3630 T2363 oasc.ZkController.publish numShards not found on descriptor - reading it from system property
[junit4:junit4]   2> 3632 T2363 oascc.ZkStateReader.updateClusterState Updating cloud state from ZooKeeper... 
[junit4:junit4]   2> 3634 T2338 oass.SolrDispatchFilter.init user.dir=/Users/jenkins/jenkins-slave/workspace/Lucene-Solr-trunk-MacOSX/solr/build/solr-core/test/J0
[junit4:junit4]   2> 3634 T2338 oass.SolrDispatchFilter.init SolrDispatchFilter.init() done
[junit4:junit4]   2> 3635 T2338 oascsi.HttpClientUtil.createClient Creating new http client, config:maxConnections=128&maxConnectionsPerHost=32&followRedirects=false
[junit4:junit4]   2> 3642 T2338 oascsi.HttpClientUtil.createClient Creating new http client, config:
[junit4:junit4]   2> 3648 T2338 oaz.ZooKeeper.<init> Initiating client connection, connectString=127.0.0.1:49784/solr sessionTimeout=10000 watcher=org.apache.solr.common.cloud.ConnectionManager@b728b4b
[junit4:junit4]   2> 3649 T2338 oascc.ConnectionManager.waitForConnected Waiting for client to connect to ZooKeeper
[junit4:junit4]   2> 3650 T2365 oaz.ClientCnxn$SendThread.logStartConnect Opening socket connection to server localhost/127.0.0.1:49784. Will not attempt to authenticate using SASL (access denied ("javax.security.auth.AuthPermission" "getLoginConfiguration"))
[junit4:junit4]   2> 3650 T2365 oaz.ClientCnxn$SendThread.primeConnection Socket connection established to localhost/127.0.0.1:49784, initiating session
[junit4:junit4]   2> 3651 T2340 oazs.NIOServerCnxnFactory.run Accepted socket connection from /127.0.0.1:49790
[junit4:junit4]   2> 3651 T2340 oazs.ZooKeeperServer.processConnectRequest Client attempting to establish new session at /127.0.0.1:49790
[junit4:junit4]   2> 3652 T2342 oazs.ZooKeeperServer.finishSessionInit Established session 0x13c9d6e31990004 with negotiated timeout 10000 for client /127.0.0.1:49790
[junit4:junit4]   2> 3652 T2365 oaz.ClientCnxn$SendThread.onConnected Session establishment complete on server localhost/127.0.0.1:49784, sessionid = 0x13c9d6e31990004, negotiated timeout = 10000
[junit4:junit4]   2> 3653 T2366 oascc.ConnectionManager.process Watcher org.apache.solr.common.cloud.ConnectionManager@b728b4b name:ZooKeeperConnection Watcher:127.0.0.1:49784/solr got event WatchedEvent state:SyncConnected type:None path:null path:null type:None
[junit4:junit4]   2> 3653 T2338 oascc.ConnectionManager.waitForConnected Client is connected to ZooKeeper
[junit4:junit4]   2> 3654 T2338 oascc.ZkStateReader.createClusterStateWatchersAndUpdate Updating cluster state from ZooKeeper... 
[junit4:junit4]   2> 3657 T2338 oasc.ChaosMonkey.monkeyLog monkey: init - expire sessions:true cause connection loss:true
[junit4:junit4]   2> 3832 T2338 oejs.Server.doStart jetty-8.1.8.v20121106
[junit4:junit4]   2> 3836 T2338 oejs.AbstractConnector.doStart Started SelectChannelConnector@127.0.0.1:49791
[junit4:junit4]   2> 3837 T2338 oass.SolrDispatchFilter.init SolrDispatchFilter.init()
[junit4:junit4]   2> 3838 T2338 oasc.SolrResourceLoader.locateSolrHome JNDI not configured for solr (NoInitialContextEx)
[junit4:junit4]   2> 3839 T2338 oasc.SolrResourceLoader.locateSolrHome using system property solr.solr.home: /Users/jenkins/jenkins-slave/workspace/Lucene-Solr-trunk-MacOSX/solr/build/solr-core/test/J0/./org.apache.solr.cloud.BasicDistributedZkTest-jetty1-1359850913749
[junit4:junit4]   2> 3839 T2338 oasc.CoreContainer$Initializer.initialize looking for solr.xml: /Users/jenkins/jenkins-slave/workspace/Lucene-Solr-trunk-MacOSX/solr/build/solr-core/test/J0/./org.apache.solr.cloud.BasicDistributedZkTest-jetty1-1359850913749/solr.xml
[junit4:junit4]   2> 3840 T2338 oasc.CoreContainer.<init> New CoreContainer 1183670505
[junit4:junit4]   2> 3840 T2338 oasc.CoreContainer.load Loading CoreContainer using Solr Home: '/Users/jenkins/jenkins-slave/workspace/Lucene-Solr-trunk-MacOSX/solr/build/solr-core/test/J0/./org.apache.solr.cloud.BasicDistributedZkTest-jetty1-1359850913749/'
[junit4:junit4]   2> 3841 T2338 oasc.SolrResourceLoader.<init> new SolrResourceLoader for directory: '/Users/jenkins/jenkins-slave/workspace/Lucene-Solr-trunk-MacOSX/solr/build/solr-core/test/J0/./org.apache.solr.cloud.BasicDistributedZkTest-jetty1-1359850913749/'
[junit4:junit4]   2> 3877 T2338 oashc.HttpShardHandlerFactory.getParameter Setting socketTimeout to: 60000
[junit4:junit4]   2> 3878 T2338 oashc.HttpShardHandlerFactory.getParameter Setting urlScheme to: http://
[junit4:junit4]   2> 3878 T2338 oashc.HttpShardHandlerFactory.getParameter Setting connTimeout to: 15000
[junit4:junit4]   2> 3879 T2338 oashc.HttpShardHandlerFactory.getParameter Setting maxConnectionsPerHost to: 20
[junit4:junit4]   2> 3879 T2338 oashc.HttpShardHandlerFactory.getParameter Setting corePoolSize to: 0
[junit4:junit4]   2> 3880 T2338 oashc.HttpShardHandlerFactory.getParameter Setting maximumPoolSize to: 2147483647
[junit4:junit4]   2> 3880 T2338 oashc.HttpShardHandlerFactory.getParameter Setting maxThreadIdleTime to: 5
[junit4:junit4]   2> 3881 T2338 oashc.HttpShardHandlerFactory.getParameter Setting sizeOfQueue to: -1
[junit4:junit4]   2> 3881 T2338 oashc.HttpShardHandlerFactory.getParameter Setting fairnessPolicy to: false
[junit4:junit4]   2> 3882 T2338 oascsi.HttpClientUtil.createClient Creating new http client, config:maxConnectionsPerHost=20&maxConnections=10000&socketTimeout=60000&connTimeout=15000&retry=false
[junit4:junit4]   2> 3895 T2338 oasc.CoreContainer.load Registering Log Listener
[junit4:junit4]   2> 3913 T2338 oasc.CoreContainer.initZooKeeper Zookeeper client=127.0.0.1:49784/solr
[junit4:junit4]   2> 3914 T2338 oasc.ZkController.checkChrootPath zkHost includes chroot
[junit4:junit4]   2> 3915 T2338 oaz.ZooKeeper.<init> Initiating client connection, connectString=127.0.0.1:49784 sessionTimeout=60000 watcher=org.apache.solr.common.cloud.ConnectionManager@7ae5a2ac
[junit4:junit4]   2> 3916 T2338 oascc.ConnectionManager.waitForConnected Waiting for client to connect to ZooKeeper
[junit4:junit4]   2> 3917 T2376 oaz.ClientCnxn$SendThread.logStartConnect Opening socket connection to server localhost/127.0.0.1:49784. Will not attempt to authenticate using SASL (access denied ("javax.security.auth.AuthPermission" "getLoginConfiguration"))
[junit4:junit4]   2> 3917 T2376 oaz.ClientCnxn$SendThread.primeConnection Socket connection established to localhost/127.0.0.1:49784, initiating session
[junit4:junit4]   2> 3918 T2340 oazs.NIOServerCnxnFactory.run Accepted socket connection from /127.0.0.1:49792
[junit4:junit4]   2> 3918 T2340 oazs.ZooKeeperServer.processConnectRequest Client attempting to establish new session at /127.0.0.1:49792
[junit4:junit4]   2> 4082 T2342 oazs.ZooKeeperServer.finishSessionInit Established session 0x13c9d6e31990005 with negotiated timeout 20000 for client /127.0.0.1:49792
[junit4:junit4]   2> 4082 T2376 oaz.ClientCnxn$SendThread.onConnected Session establishment complete on server localhost/127.0.0.1:49784, sessionid = 0x13c9d6e31990005, negotiated timeout = 20000
[junit4:junit4]   2> 4083 T2377 oascc.ConnectionManager.process Watcher org.apache.solr.common.cloud.ConnectionManager@7ae5a2ac name:ZooKeeperConnection Watcher:127.0.0.1:49784 got event WatchedEvent state:SyncConnected type:None path:null path:null type:None
[junit4:junit4]   2> 4083 T2338 oascc.ConnectionManager.waitForConnected Client is connected to ZooKeeper
[junit4:junit4]   2> 4085 T2343 oazs.PrepRequestProcessor.pRequest2Txn Processed session termination for sessionid: 0x13c9d6e31990005
[junit4:junit4]   2> 4086 T2340 oazs.NIOServerCnxn.closeSock Closed socket connection for client /127.0.0.1:49792 which had sessionid 0x13c9d6e31990005
[junit4:junit4]   2> 4086 T2338 oaz.ZooKeeper.close Session: 0x13c9d6e31990005 closed
[junit4:junit4]   2> 4087 T2377 oaz.ClientCnxn$EventThread.run EventThread shut down
[junit4:junit4]   2> 4087 T2338 oascsi.HttpClientUtil.createClient Creating new http client, config:maxConnections=500&maxConnectionsPerHost=16&socketTimeout=60000&connTimeout=15000
[junit4:junit4]   2> 4094 T2338 oaz.ZooKeeper.<init> Initiating client connection, connectString=127.0.0.1:49784/solr sessionTimeout=30000 watcher=org.apache.solr.common.cloud.ConnectionManager@11a0956e
[junit4:junit4]   2> 4095 T2338 oascc.ConnectionManager.waitForConnected Waiting for client to connect to ZooKeeper
[junit4:junit4]   2> 4096 T2378 oaz.ClientCnxn$SendThread.logStartConnect Opening socket connection to server localhost/127.0.0.1:49784. Will not attempt to authenticate using SASL (access denied ("javax.security.auth.AuthPermission" "getLoginConfiguration"))
[junit4:junit4]   2> 4096 T2378 oaz.ClientCnxn$SendThread.primeConnection Socket connection established to localhost/127.0.0.1:49784, initiating session
[junit4:junit4]   2> 4097 T2340 oazs.NIOServerCnxnFactory.run Accepted socket connection from /127.0.0.1:49793
[junit4:junit4]   2> 4097 T2340 oazs.ZooKeeperServer.processConnectRequest Client attempting to establish new session at /127.0.0.1:49793
[junit4:junit4]   2> 4099 T2342 oazs.ZooKeeperServer.finishSessionInit Established session 0x13c9d6e31990006 with negotiated timeout 20000 for client /127.0.0.1:49793
[junit4:junit4]   2> 4099 T2378 oaz.ClientCnxn$SendThread.onConnected Session establishment complete on server localhost/127.0.0.1:49784, sessionid = 0x13c9d6e31990006, negotiated timeout = 20000
[junit4:junit4]   2> 4099 T2379 oascc.ConnectionManager.process Watcher org.apache.solr.common.cloud.ConnectionManager@11a0956e name:ZooKeeperConnection Watcher:127.0.0.1:49784/solr got event WatchedEvent state:SyncConnected type:None path:null path:null type:None
[junit4:junit4]   2> 4100 T2338 oascc.ConnectionManager.waitForConnected Client is connected to ZooKeeper
[junit4:junit4]   2> 4101 T2343 oazs.PrepRequestProcessor.pRequest Got user-level KeeperException when processing sessionid:0x13c9d6e31990006 type:create cxid:0x1 zxid:0x49 txntype:-1 reqpath:n/a Error Path:/solr/overseer Error:KeeperErrorCode = NodeExists for /solr/overseer
[junit4:junit4]   2> 4102 T2343 oazs.PrepRequestProcessor.pRequest Got user-level KeeperException when processing sessionid:0x13c9d6e31990006 type:create cxid:0x2 zxid:0x4a txntype:-1 reqpath:n/a Error Path:/solr/overseer Error:KeeperErrorCode = NodeExists for /solr/overseer
[junit4:junit4]   2> 4104 T2338 oasc.ZkController.createEphemeralLiveNode Register node as live in ZooKeeper:/live_nodes/127.0.0.1:49791_
[junit4:junit4]   2> 4105 T2343 oazs.PrepRequestProcessor.pRequest Got user-level KeeperException when processing sessionid:0x13c9d6e31990006 type:delete cxid:0x4 zxid:0x4b txntype:-1 reqpath:n/a Error Path:/solr/live_nodes/127.0.0.1:49791_ Error:KeeperErrorCode = NoNode for /solr/live_nodes/127.0.0.1:49791_
[junit4:junit4]   2> 4106 T2338 oascc.SolrZkClient.makePath makePath: /live_nodes/127.0.0.1:49791_
[junit4:junit4]   2> 4111 T2360 oascc.ZkStateReader$3.process Updating live nodes... (2)
[junit4:junit4]   2> 4111 T2366 oascc.ZkStateReader$3.process Updating live nodes... (2)
[junit4:junit4]   2> 4112 T2360 oascc.ZkStateReader$2.process A cluster state change: WatchedEvent state:SyncConnected type:NodeChildrenChanged path:/live_nodes, has occurred - updating... (live nodes size: 2)
[junit4:junit4]   2> 4117 T2338 oascc.ZkStateReader.createClusterStateWatchersAndUpdate Updating cluster state from ZooKeeper... 
[junit4:junit4]   2> 4125 T2380 oasc.CoreContainer.create Creating SolrCore 'collection1' using instanceDir: /Users/jenkins/jenkins-slave/workspace/Lucene-Solr-trunk-MacOSX/solr/build/solr-core/test/J0/./org.apache.solr.cloud.BasicDistributedZkTest-jetty1-1359850913749/collection1
[junit4:junit4]   2> 4126 T2380 oasc.ZkController.createCollectionZkNode Check for collection zkNode:collection1
[junit4:junit4]   2> 4127 T2380 oasc.ZkController.createCollectionZkNode Collection zkNode exists
[junit4:junit4]   2> 4127 T2380 oasc.ZkController.readConfigName Load collection config from:/collections/collection1
[junit4:junit4]   2> 4129 T2380 oasc.SolrResourceLoader.<init> new SolrResourceLoader for directory: '/Users/jenkins/jenkins-slave/workspace/Lucene-Solr-trunk-MacOSX/solr/build/solr-core/test/J0/./org.apache.solr.cloud.BasicDistributedZkTest-jetty1-1359850913749/collection1/'
[junit4:junit4]   2> 4130 T2380 oasc.SolrResourceLoader.replaceClassLoader Adding 'file:/Users/jenkins/jenkins-slave/workspace/Lucene-Solr-trunk-MacOSX/solr/build/solr-core/test/J0/org.apache.solr.cloud.BasicDistributedZkTest-jetty1-1359850913749/collection1/lib/classes/' to classloader
[junit4:junit4]   2> 4131 T2380 oasc.SolrResourceLoader.replaceClassLoader Adding 'file:/Users/jenkins/jenkins-slave/workspace/Lucene-Solr-trunk-MacOSX/solr/build/solr-core/test/J0/org.apache.solr.cloud.BasicDistributedZkTest-jetty1-1359850913749/collection1/lib/README' to classloader
[junit4:junit4]   2> 4182 T2380 oasc.SolrConfig.<init> Using Lucene MatchVersion: LUCENE_50
[junit4:junit4]   2> 4263 T2380 oasc.SolrConfig.<init> Loaded SolrConfig: solrconfig.xml
[junit4:junit4]   2> 4264 T2380 oass.IndexSchema.readSchema Reading Solr Schema
[junit4:junit4]   2> 4270 T2380 oass.IndexSchema.readSchema Schema name=test
[junit4:junit4]   2> 4890 T2380 oass.OpenExchangeRatesOrgProvider.init Initialized with rates=open-exchange-rates.json, refreshInterval=1440.
[junit4:junit4]   2> 4900 T2380 oass.IndexSchema.readSchema default search field in schema is text
[junit4:junit4]   2> 4903 T2380 oass.IndexSchema.readSchema unique key field: id
[junit4:junit4]   2> 4924 T2380 oass.FileExchangeRateProvider.reload Reloading exchange rates from file currency.xml
[junit4:junit4]   2> 4929 T2380 oass.FileExchangeRateProvider.reload Reloading exchange rates from file currency.xml
[junit4:junit4]   2> 4934 T2380 oass.OpenExchangeRatesOrgProvider.reload Reloading exchange rates from open-exchange-rates.json
[junit4:junit4]   2> 4936 T2380 oass.OpenExchangeRatesOrgProvider.reload Reloading exchange rates from open-exchange-rates.json
[junit4:junit4]   2> 4938 T2380 oasc.SolrCore.<init> [collection1] Opening new SolrCore at /Users/jenkins/jenkins-slave/workspace/Lucene-Solr-trunk-MacOSX/solr/build/solr-core/test/J0/./org.apache.solr.cloud.BasicDistributedZkTest-jetty1-1359850913749/collection1/, dataDir=./org.apache.solr.cloud.BasicDistributedZkTest-1359850910098/jetty1/
[junit4:junit4]   2> 4939 T2380 oasc.JmxMonitoredMap.<init> JMX monitoring is enabled. Adding Solr mbeans to JMX Server: com.sun.jmx.mbeanserver.JmxMBeanServer@3f80cfa7
[junit4:junit4]   2> 4939 T2380 oasc.SolrCore.initDirectoryFactory solr.NRTCachingDirectoryFactory
[junit4:junit4]   2> 4940 T2380 oasc.CachingDirectoryFactory.get return new directory for /Users/jenkins/jenkins-slave/workspace/Lucene-Solr-trunk-MacOSX/solr/build/solr-core/test/J0/./org.apache.solr.cloud.BasicDistributedZkTest-1359850910098/jetty1 forceNew:false
[junit4:junit4]   2> 4941 T2380 oasc.CachingDirectoryFactory.close Releasing directory:/Users/jenkins/jenkins-slave/workspace/Lucene-Solr-trunk-MacOSX/solr/build/solr-core/test/J0/./org.apache.solr.cloud.BasicDistributedZkTest-1359850910098/jetty1
[junit4:junit4]   2> 4941 T2380 oasc.SolrCore.getNewIndexDir New index directory detected: old=null new=./org.apache.solr.cloud.BasicDistributedZkTest-1359850910098/jetty1/index/
[junit4:junit4]   2> 4941 T2380 oasc.SolrCore.initIndex WARNING [collection1] Solr index directory './org.apache.solr.cloud.BasicDistributedZkTest-1359850910098/jetty1/index' doesn't exist. Creating new index...
[junit4:junit4]   2> 4942 T2380 oasc.CachingDirectoryFactory.get return new directory for /Users/jenkins/jenkins-slave/workspace/Lucene-Solr-trunk-MacOSX/solr/build/solr-core/test/J0/./org.apache.solr.cloud.BasicDistributedZkTest-1359850910098/jetty1/index forceNew:false
[junit4:junit4]   2> 4947 T2380 oasc.SolrDeletionPolicy.onCommit SolrDeletionPolicy.onCommit: commits:num=1
[junit4:junit4]   2> 		commit{dir=RateLimitedDirectoryWrapper(NRTCachingDirectory(org.apache.lucene.store.NIOFSDirectory@/Users/jenkins/jenkins-slave/workspace/Lucene-Solr-trunk-MacOSX/solr/build/solr-core/test/J0/org.apache.solr.cloud.BasicDistributedZkTest-1359850910098/jetty1/index lockFactory=org.apache.lucene.store.NativeFSLockFactory@259bff1e; maxCacheMB=48.0 maxMergeSizeMB=4.0)),segFN=segments_1,generation=1,filenames=[segments_1]
[junit4:junit4]   2> 4947 T2380 oasc.SolrDeletionPolicy.updateCommits newest commit = 1[segments_1]
[junit4:junit4]   2> 4948 T2380 oasc.CachingDirectoryFactory.close Releasing directory:/Users/jenkins/jenkins-slave/workspace/Lucene-Solr-trunk-MacOSX/solr/build/solr-core/test/J0/./org.apache.solr.cloud.BasicDistributedZkTest-1359850910098/jetty1/index
[junit4:junit4]   2> 4948 T2380 oasc.SolrCore.initWriters created xml: solr.XMLResponseWriter
[junit4:junit4]   2> 4950 T2380 oasup.UpdateRequestProcessorChain.init inserting DistributedUpdateProcessorFactory into updateRequestProcessorChain "dedupe"
[junit4:junit4]   2> 4951 T2380 oasup.UpdateRequestProcessorChain.init inserting DistributedUpdateProcessorFactory into updateRequestProcessorChain "dedupe-allfields"
[junit4:junit4]   2> 4951 T2380 oasup.UpdateRequestProcessorChain.init inserting DistributedUpdateProcessorFactory into updateRequestProcessorChain "stored_sig"
[junit4:junit4]   2> 4952 T2380 oasup.UpdateRequestProcessorChain.init inserting DistributedUpdateProcessorFactory into updateRequestProcessorChain "uniq-fields"
[junit4:junit4]   2> 4952 T2380 oasup.UpdateRequestProcessorChain.init inserting DistributedUpdateProcessorFactory into updateRequestProcessorChain "distrib-dup-test-chain-implicit"
[junit4:junit4]   2> 4953 T2380 oasc.RequestHandlers.initHandlersFromConfig adding lazy requestHandler: solr.ReplicationHandler
[junit4:junit4]   2> 4953 T2380 oasc.RequestHandlers.initHandlersFromConfig created /replication: solr.ReplicationHandler
[junit4:junit4]   2> 4954 T2380 oasc.RequestHandlers.initHandlersFromConfig created standard: solr.StandardRequestHandler
[junit4:junit4]   2> 4954 T2380 oasc.RequestHandlers.initHandlersFromConfig created /get: solr.RealTimeGetHandler
[junit4:junit4]   2> 4955 T2380 oasc.RequestHandlers.initHandlersFromConfig created dismax: solr.SearchHandler
[junit4:junit4]   2> 4956 T2380 oasc.RequestHandlers.initHandlersFromConfig created mock: org.apache.solr.core.MockQuerySenderListenerReqHandler
[junit4:junit4]   2> 4956 T2380 oasc.RequestHandlers.initHandlersFromConfig created /admin/: org.apache.solr.handler.admin.AdminHandlers
[junit4:junit4]   2> 4957 T2380 oasc.RequestHandlers.initHandlersFromConfig created defaults: solr.StandardRequestHandler
[junit4:junit4]   2> 4957 T2380 oasc.RequestHandlers.initHandlersFromConfig adding lazy requestHandler: solr.StandardRequestHandler
[junit4:junit4]   2> 4957 T2380 oasc.RequestHandlers.initHandlersFromConfig created lazy: solr.StandardRequestHandler
[junit4:junit4]   2> 4958 T2380 oasc.RequestHandlers.initHandlersFromConfig created /update: solr.UpdateRequestHandler
[junit4:junit4]   2> 4959 T2380 oasc.RequestHandlers.initHandlersFromConfig created /terms: org.apache.solr.handler.component.SearchHandler
[junit4:junit4]   2> 4959 T2380 oasc.RequestHandlers.initHandlersFromConfig created spellCheckCompRH: org.apache.solr.handler.component.SearchHandler
[junit4:junit4]   2> 4960 T2380 oasc.RequestHandlers.initHandlersFromConfig created spellCheckCompRH_Direct: org.apache.solr.handler.component.SearchHandler
[junit4:junit4]   2> 4960 T2380 oasc.RequestHandlers.initHandlersFromConfig created spellCheckWithWordbreak: org.apache.solr.handler.component.SearchHandler
[junit4:junit4]   2> 4962 T2380 oasc.RequestHandlers.initHandlersFromConfig created spellCheckWithWordbreak_Direct: org.apache.solr.handler.component.SearchHandler
[junit4:junit4]   2> 4962 T2380 oasc.RequestHandlers.initHandlersFromConfig created spellCheckCompRH1: org.apache.solr.handler.component.SearchHandler
[junit4:junit4]   2> 4963 T2380 oasc.RequestHandlers.initHandlersFromConfig created mltrh: org.apache.solr.handler.component.SearchHandler
[junit4:junit4]   2> 4964 T2380 oasc.RequestHandlers.initHandlersFromConfig created tvrh: org.apache.solr.handler.component.SearchHandler
[junit4:junit4]   2> 4964 T2380 oasc.RequestHandlers.initHandlersFromConfig created /mlt: solr.MoreLikeThisHandler
[junit4:junit4]   2> 4965 T2380 oasc.RequestHandlers.initHandlersFromConfig created /debug/dump: solr.DumpRequestHandler
[junit4:junit4]   2> 4971 T2380 oashl.XMLLoader.init xsltCacheLifetimeSeconds=60
[junit4:junit4]   2> 4974 T2380 oasc.SolrCore.initDeprecatedSupport WARNING solrconfig.xml uses deprecated <admin/gettableFiles>, Please update your config to use the ShowFileRequestHandler.
[junit4:junit4]   2> 4976 T2380 oasc.SolrCore.initDeprecatedSupport WARNING adding ShowFileRequestHandler with hidden files: [SCHEMA.XML, OLD_SYNONYMS.TXT, STOPWORDS.TXT, PROTWORDS.TXT, OPEN-EXCHANGE-RATES.JSON, SYNONYMS.TXT, CURRENCY.XML, MAPPING-ISOLATIN1ACCENT.TXT]
[junit4:junit4]   2> 4978 T2380 oasc.CachingDirectoryFactory.close Releasing directory:/Users/jenkins/jenkins-slave/workspace/Lucene-Solr-trunk-MacOSX/solr/build/solr-core/test/J0/./org.apache.solr.cloud.BasicDistributedZkTest-1359850910098/jetty1
[junit4:junit4]   2> 4980 T2380 oass.SolrIndexSearcher.<init> Opening Searcher@734d2f93 main
[junit4:junit4]   2> 4981 T2380 oasu.CommitTracker.<init> Hard AutoCommit: disabled
[junit4:junit4]   2> 4981 T2380 oasu.CommitTracker.<init> Soft AutoCommit: disabled
[junit4:junit4]   2> 4982 T2380 oashc.SpellCheckComponent.inform Initializing spell checkers
[junit4:junit4]   2> 4990 T2380 oass.DirectSolrSpellChecker.init init: {name=direct,classname=DirectSolrSpellChecker,field=lowerfilt,minQueryLength=3}
[junit4:junit4]   2> 5024 T2381 oasc.SolrCore.registerSearcher [collection1] Registered new searcher Searcher@734d2f93 main{StandardDirectoryReader(segments_1:1)}
[junit4:junit4]   2> 5030 T2380 oasc.ZkController.publish publishing core=collection1 state=down
[junit4:junit4]   2> 5031 T2380 oasc.ZkController.publish numShards not found on descriptor - reading it from system property
[junit4:junit4]   2> 5120 T2361 oascc.ZkStateReader.updateClusterState Updating cloud state from ZooKeeper... 
[junit4:junit4]   2> 5121 T2361 oasc.Overseer$ClusterStateUpdater.updateState Update state numShards=1 message={
[junit4:junit4]   2> 	  "operation":"state",
[junit4:junit4]   2> 	  "numShards":"1",
[junit4:junit4]   2> 	  "shard":"shard1",
[junit4:junit4]   2> 	  "roles":null,
[junit4:junit4]   2> 	  "state":"active",
[junit4:junit4]   2> 	  "core":"collection1",
[junit4:junit4]   2> 	  "collection":"control_collection",
[junit4:junit4]   2> 	  "node_name":"127.0.0.1:49787_",
[junit4:junit4]   2> 	  "base_url":"http://127.0.0.1:49787"}
[junit4:junit4]   2> 5128 T2361 oasc.Overseer$ClusterStateUpdater.updateState Update state numShards=2 message={
[junit4:junit4]   2> 	  "operation":"state",
[junit4:junit4]   2> 	  "numShards":"2",
[junit4:junit4]   2> 	  "shard":null,
[junit4:junit4]   2> 	  "roles":null,
[junit4:junit4]   2> 	  "state":"down",
[junit4:junit4]   2> 	  "core":"collection1",
[junit4:junit4]   2> 	  "collection":"collection1",
[junit4:junit4]   2> 	  "node_name":"127.0.0.1:49791_",
[junit4:junit4]   2> 	  "base_url":"http://127.0.0.1:49791"}
[junit4:junit4]   2> 5128 T2361 oasc.Overseer$ClusterStateUpdater.createCollection Create collection collection1 with numShards 2
[junit4:junit4]   2> 5129 T2361 oasc.Overseer$ClusterStateUpdater.updateState Assigning new node to shard shard=shard1
[junit4:junit4]   2> 5136 T2360 oascc.ZkStateReader$2.process A cluster state change: WatchedEvent state:SyncConnected type:NodeDataChanged path:/clusterstate.json, has occurred - updating... (live nodes size: 2)
[junit4:junit4]   2> 5136 T2366 oascc.ZkStateReader$2.process A cluster state change: WatchedEvent state:SyncConnected type:NodeDataChanged path:/clusterstate.json, has occurred - updating... (live nodes size: 2)
[junit4:junit4]   2> 5137 T2379 oascc.ZkStateReader$2.process A cluster state change: WatchedEvent state:SyncConnected type:NodeDataChanged path:/clusterstate.json, has occurred - updating... (live nodes size: 2)
[junit4:junit4]   2> 6034 T2380 oasc.CoreContainer.registerCore registering core: collection1
[junit4:junit4]   2> 6034 T2380 oasc.ZkController.register Register replica - core:collection1 address:http://127.0.0.1:49791 collection:collection1 shard:shard1
[junit4:junit4]   2> 6036 T2380 oascc.SolrZkClient.makePath makePath: /collections/collection1/leader_elect/shard1/election
[junit4:junit4]   2> 6046 T2343 oazs.PrepRequestProcessor.pRequest Got user-level KeeperException when processing sessionid:0x13c9d6e31990006 type:delete cxid:0x43 zxid:0x5a txntype:-1 reqpath:n/a Error Path:/solr/collections/collection1/leaders Error:KeeperErrorCode = NoNode for /solr/collections/collection1/leaders
[junit4:junit4]   2> 6046 T2380 oasc.ShardLeaderElectionContext.runLeaderProcess Running the leader process.
[junit4:junit4]   2> 6047 T2343 oazs.PrepRequestProcessor.pRequest Got user-level KeeperException when processing sessionid:0x13c9d6e31990006 type:create cxid:0x44 zxid:0x5b txntype:-1 reqpath:n/a Error Path:/solr/overseer Error:KeeperErrorCode = NodeExists for /solr/overseer
[junit4:junit4]   2> 6050 T2380 oasc.ShardLeaderElectionContext.waitForReplicasToComeUp Enough replicas found to continue.
[junit4:junit4]   2> 6050 T2380 oasc.ShardLeaderElectionContext.runLeaderProcess I may be the new leader - try and sync
[junit4:junit4]   2> 6050 T2380 oasc.SyncStrategy.sync Sync replicas to http://127.0.0.1:49791/collection1/
[junit4:junit4]   2> 6050 T2380 oasc.SyncStrategy.syncReplicas Sync Success - now sync replicas to me
[junit4:junit4]   2> 6051 T2380 oasc.SyncStrategy.syncToMe http://127.0.0.1:49791/collection1/ has no replicas
[junit4:junit4]   2> 6051 T2380 oasc.ShardLeaderElectionContext.runLeaderProcess I am the new leader: http://127.0.0.1:49791/collection1/
[junit4:junit4]   2> 6051 T2380 oascc.SolrZkClient.makePath makePath: /collections/collection1/leaders/shard1
[junit4:junit4]   2> 6057 T2343 oazs.PrepRequestProcessor.pRequest Got user-level KeeperException when processing sessionid:0x13c9d6e31990006 type:create cxid:0x4e zxid:0x5f txntype:-1 reqpath:n/a Error Path:/solr/overseer Error:KeeperErrorCode = NodeExists for /solr/overseer
[junit4:junit4]   2> 6649 T2361 oascc.ZkStateReader.updateClusterState Updating cloud state from ZooKeeper... 
[junit4:junit4]   2> 6665 T2366 oascc.ZkStateReader$2.process A cluster state change: WatchedEvent state:SyncConnected type:NodeDataChanged path:/clusterstate.json, has occurred - updating... (live nodes size: 2)
[junit4:junit4]   2> 6665 T2360 oascc.ZkStateReader$2.process A cluster state change: WatchedEvent state:SyncConnected type:NodeDataChanged path:/clusterstate.json, has occurred - updating... (live nodes size: 2)
[junit4:junit4]   2> 6665 T2379 oascc.ZkStateReader$2.process A cluster state change: WatchedEvent state:SyncConnected type:NodeDataChanged path:/clusterstate.json, has occurred - updating... (live nodes size: 2)
[junit4:junit4]   2> 6676 T2380 oasc.ZkController.register We are http://127.0.0.1:49791/collection1/ and leader is http://127.0.0.1:49791/collection1/
[junit4:junit4]   2> 6677 T2380 oasc.ZkController.register No LogReplay needed for core=collection1 baseURL=http://127.0.0.1:49791
[junit4:junit4]   2> 6677 T2380 oasc.ZkController.checkRecovery I am the leader, no recovery necessary
[junit4:junit4]   2> 6677 T2380 oasc.ZkController.publish publishing core=collection1 state=active
[junit4:junit4]   2> 6677 T2380 oasc.ZkController.publish numShards not found on descriptor - reading it from system property
[junit4:junit4]   2> 6680 T2380 oascc.ZkStateReader.updateClusterState Updating cloud state from ZooKeeper... 
[junit4:junit4]   2> 6682 T2338 oass.SolrDispatchFilter.init user.dir=/Users/jenkins/jenkins-slave/workspace/Lucene-Solr-trunk-MacOSX/solr/build/solr-core/test/J0
[junit4:junit4]   2> 6683 T2338 oass.SolrDispatchFilter.init SolrDispatchFilter.init() done
[junit4:junit4]   2> 6683 T2338 oascsi.HttpClientUtil.createClient Creating new http client, config:maxConnections=128&maxConnectionsPerHost=32&followRedirects=false
[junit4:junit4]   2> 6880 T2338 oejs.Server.doStart jetty-8.1.8.v20121106
[junit4:junit4]   2> 6885 T2338 oejs.AbstractConnector.doStart Started SelectChannelConnector@127.0.0.1:49794
[junit4:junit4]   2> 6886 T2338 oass.SolrDispatchFilter.init SolrDispatchFilter.init()
[junit4:junit4]   2> 6886 T2338 oasc.SolrResourceLoader.locateSolrHome JNDI not configured for solr (NoInitialContextEx)
[junit4:junit4]   2> 6887 T2338 oasc.SolrResourceLoader.locateSolrHome using system property solr.solr.home: /Users/jenkins/jenkins-slave/workspace/Lucene-Solr-trunk-MacOSX/solr/build/solr-core/test/J0/./org.apache.solr.cloud.BasicDistributedZkTest-jetty2-1359850916784
[junit4:junit4]   2> 6888 T2338 oasc.CoreContainer$Initializer.initialize looking for solr.xml: /Users/jenkins/jenkins-slave/workspace/Lucene-Solr-trunk-MacOSX/solr/build/solr-core/test/J0/./org.apache.solr.cloud.BasicDistributedZkTest-jetty2-1359850916784/solr.xml
[junit4:junit4]   2> 6888 T2338 oasc.CoreContainer.<init> New CoreContainer 646428869
[junit4:junit4]   2> 6889 T2338 oasc.CoreContainer.load Loading CoreContainer using Solr Home: '/Users/jenkins/jenkins-slave/workspace/Lucene-Solr-trunk-MacOSX/solr/build/solr-core/test/J0/./org.apache.solr.cloud.BasicDistributedZkTest-jetty2-1359850916784/'
[junit4:junit4]   2> 6889 T2338 oasc.SolrResourceLoader.<init> new SolrResourceLoader for directory: '/Users/jenkins/jenkins-slave/workspace/Lucene-Solr-trunk-MacOSX/solr/build/solr-core/test/J0/./org.apache.solr.cloud.BasicDistributedZkTest-jetty2-1359850916784/'
[junit4:junit4]   2> 6925 T2338 oashc.HttpShardHandlerFactory.getParameter Setting socketTimeout to: 60000
[junit4:junit4]   2> 6926 T2338 oashc.HttpShardHandlerFactory.getParameter Setting urlScheme to: http://
[junit4:junit4]   2> 6926 T2338 oashc.HttpShardHandlerFactory.getParameter Setting connTimeout to: 15000
[junit4:junit4]   2> 6927 T2338 oashc.HttpShardHandlerFactory.getParameter Setting maxConnectionsPerHost to: 20
[junit4:junit4]   2> 6927 T2338 oashc.HttpShardHandlerFactory.getParameter Setting corePoolSize to: 0
[junit4:junit4]   2> 6928 T2338 oashc.HttpShardHandlerFactory.getParameter Setting maximumPoolSize to: 2147483647
[junit4:junit4]   2> 6928 T2338 oashc.HttpShardHandlerFactory.getParameter Setting maxThreadIdleTime to: 5
[junit4:junit4]   2> 6929 T2338 oashc.HttpShardHandlerFactory.getParameter Setting sizeOfQueue to: -1
[junit4:junit4]   2> 6930 T2338 oashc.HttpShardHandlerFactory.getParameter Setting fairnessPolicy to: false
[junit4:junit4]   2> 6930 T2338 oascsi.HttpClientUtil.createClient Creating new http client, config:maxConnectionsPerHost=20&maxConnections=10000&socketTimeout=60000&connTimeout=15000&retry=false
[junit4:junit4]   2> 6942 T2338 oasc.CoreContainer.load Registering Log Listener
[junit4:junit4]   2> 6959 T2338 oasc.CoreContainer.initZooKeeper Zookeeper client=127.0.0.1:49784/solr
[junit4:junit4]   2> 6960 T2338 oasc.ZkController.checkChrootPath zkHost includes chroot
[junit4:junit4]   2> 6960 T2338 oaz.ZooKeeper.<init> Initiating client connection, connectString=127.0.0.1:49784 sessionTimeout=60000 watcher=org.apache.solr.common.cloud.ConnectionManager@672538de
[junit4:junit4]   2> 6961 T2338 oascc.ConnectionManager.waitForConnected Waiting for client to connect to ZooKeeper
[junit4:junit4]   2> 6962 T2391 oaz.ClientCnxn$SendThread.logStartConnect Opening socket connection to server localhost/127.0.0.1:49784. Will not attempt to authenticate using SASL (access denied ("javax.security.auth.AuthPermission" "getLoginConfiguration"))
[junit4:junit4]   2> 6963 T2391 oaz.ClientCnxn$SendThread.primeConnection Socket connection established to localhost/127.0.0.1:49784, initiating session
[junit4:junit4]   2> 6963 T2340 oazs.NIOServerCnxnFactory.run Accepted socket connection from /127.0.0.1:49795
[junit4:junit4]   2> 6963 T2340 oazs.ZooKeeperServer.processConnectRequest Client attempting to establish new session at /127.0.0.1:49795
[junit4:junit4]   2> 6965 T2342 oazs.ZooKeeperServer.finishSessionInit Established session 0x13c9d6e31990007 with negotiated timeout 20000 for client /127.0.0.1:49795
[junit4:junit4]   2> 6965 T2391 oaz.ClientCnxn$SendThread.onConnected Session establishment complete on server localhost/127.0.0.1:49784, sessionid = 0x13c9d6e31990007, negotiated timeout = 20000
[junit4:junit4]   2> 6965 T2392 oascc.ConnectionManager.process Watcher org.apache.solr.common.cloud.ConnectionManager@672538de name:ZooKeeperConnection Watcher:127.0.0.1:49784 got event WatchedEvent state:SyncConnected type:None path:null path:null type:None
[junit4:junit4]   2> 6965 T2338 oascc.ConnectionManager.waitForConnected Client is connected to ZooKeeper
[junit4:junit4]   2> 6967 T2343 oazs.PrepRequestProcessor.pRequest2Txn Processed session termination for sessionid: 0x13c9d6e31990007
[junit4:junit4]   2> 6968 T2340 oazs.NIOServerCnxn.closeSock Closed socket connection for client /127.0.0.1:49795 which had sessionid 0x13c9d6e31990007
[junit4:junit4]   2> 6968 T2392 oaz.ClientCnxn$EventThread.run EventThread shut down
[junit4:junit4]   2> 6968 T2338 oaz.ZooKeeper.close Session: 0x13c9d6e31990007 closed
[junit4:junit4]   2> 6970 T2338 oascsi.HttpClientUtil.createClient Creating new http client, config:maxConnections=500&maxConnectionsPerHost=16&socketTimeout=60000&connTimeout=15000
[junit4:junit4]   2> 6975 T2338 oaz.ZooKeeper.<init> Initiating client connection, connectString=127.0.0.1:49784/solr sessionTimeout=30000 watcher=org.apache.solr.common.cloud.ConnectionManager@70b6887d
[junit4:junit4]   2> 6977 T2338 oascc.ConnectionManager.waitForConnected Waiting for client to connect to ZooKeeper
[junit4:junit4]   2> 6977 T2393 oaz.ClientCnxn$SendThread.logStartConnect Opening socket connection to server localhost/127.0.0.1:49784. Will not attempt to authenticate using SASL (access denied ("javax.security.auth.AuthPermission" "getLoginConfiguration"))
[junit4:junit4]   2> 6978 T2393 oaz.ClientCnxn$SendThread.primeConnection Socket connection established to localhost/127.0.0.1:49784, initiating session
[junit4:junit4]   2> 6978 T2340 oazs.NIOServerCnxnFactory.run Accepted socket connection from /127.0.0.1:49796
[junit4:junit4]   2> 6979 T2340 oazs.ZooKeeperServer.processConnectRequest Client attempting to establish new session at /127.0.0.1:49796
[junit4:junit4]   2> 6980 T2342 oazs.ZooKeeperServer.finishSessionInit Established session 0x13c9d6e31990008 with negotiated timeout 20000 for client /127.0.0.1:49796
[junit4:junit4]   2> 6980 T2393 oaz.ClientCnxn$SendThread.onConnected Session establishment complete on server localhost/127.0.0.1:49784, sessionid = 0x13c9d6e31990008, negotiated timeout = 20000
[junit4:junit4]   2> 6981 T2394 oascc.ConnectionManager.process Watcher org.apache.solr.common.cloud.ConnectionManager@70b6887d name:ZooKeeperConnection Watcher:127.0.0.1:49784/solr got event WatchedEvent state:SyncConnected type:None path:null path:null type:None
[junit4:junit4]   2> 6981 T2338 oascc.ConnectionManager.waitForConnected Client is connected to ZooKeeper
[junit4:junit4]   2> 6982 T2343 oazs.PrepRequestProcessor.pRequest Got user-level KeeperException when processing sessionid:0x13c9d6e31990008 type:create cxid:0x1 zxid:0x6c txntype:-1 reqpath:n/a Error Path:/solr/overseer Error:KeeperErrorCode = NodeExists for /solr/overseer
[junit4:junit4]   2> 6984 T2343 oazs.PrepRequestProcessor.pRequest Got user-level KeeperException when processing sessionid:0x13c9d6e31990008 type:create cxid:0x2 zxid:0x6d txntype:-1 reqpath:n/a Error Path:/solr/overseer Error:KeeperErrorCode = NodeExists for /solr/overseer
[junit4:junit4]   2> 6985 T2338 oasc.ZkController.createEphemeralLiveNode Register node as live in ZooKeeper:/live_nodes/127.0.0.1:49794_
[junit4:junit4]   2> 6986 T2343 oazs.PrepRequestProcessor.pRequest Got user-level KeeperException when processing sessionid:0x13c9d6e31990008 type:delete cxid:0x4 zxid:0x6e txntype:-1 reqpath:n/a Error Path:/solr/live_nodes/127.0.0.1:49794_ Error:KeeperErrorCode = NoNode for /solr/live_nodes/127.0.0.1:49794_
[junit4:junit4]   2> 6987 T2338 oascc.SolrZkClient.makePath makePath: /live_nodes/127.0.0.1:49794_
[junit4:junit4]   2> 6991 T2379 oascc.ZkStateReader$2.process A cluster state change: WatchedEvent state:SyncConnected type:NodeChildrenChanged path:/live_nodes, has occurred - updating... (live nodes size: 2)
[junit4:junit4]   2> 6992 T2360 oascc.ZkStateReader$3.process Updating live nodes... (3)
[junit4:junit4]   2> 6992 T2366 oascc.ZkStateReader$3.process Updating live nodes... (3)
[junit4:junit4]   2> 6992 T2360 oascc.ZkStateReader$2.process A cluster state change: WatchedEvent state:SyncConnected type:NodeChildrenChanged path:/live_nodes, has occurred - updating... (live nodes size: 3)
[junit4:junit4]   2> 6992 T2366 oascc.ZkStateReader$2.process A cluster state change: WatchedEvent state:SyncConnected type:NodeChildrenChanged path:/live_nodes, has occurred - updating... (live nodes size: 3)
[junit4:junit4]   2> 6996 T2379 oascc.ZkStateReader$3.process Updating live nodes... (3)
[junit4:junit4]   2> 7000 T2338 oascc.ZkStateReader.createClusterStateWatchersAndUpdate Updating cluster state from ZooKeeper... 
[junit4:junit4]   2> 7008 T2395 oasc.CoreContainer.create Creating SolrCore 'collection1' using instanceDir: /Users/jenkins/jenkins-slave/workspace/Lucene-Solr-trunk-MacOSX/solr/build/solr-core/test/J0/./org.apache.solr.cloud.BasicDistributedZkTest-jetty2-1359850916784/collection1
[junit4:junit4]   2> 7008 T2395 oasc.ZkController.createCollectionZkNode Check for collection zkNode:collection1
[junit4:junit4]   2> 7009 T2395 oasc.ZkController.createCollectionZkNode Collection zkNode exists
[junit4:junit4]   2> 7010 T2395 oasc.ZkController.readConfigName Load collection config from:/collections/collection1
[junit4:junit4]   2> 7012 T2395 oasc.SolrResourceLoader.<init> new SolrResourceLoader for directory: '/Users/jenkins/jenkins-slave/workspace/Lucene-Solr-trunk-MacOSX/solr/build/solr-core/test/J0/./org.apache.solr.cloud.BasicDistributedZkTest-jetty2-1359850916784/collection1/'
[junit4:junit4]   2> 7012 T2395 oasc.SolrResourceLoader.replaceClassLoader Adding 'file:/Users/jenkins/jenkins-slave/workspace/Lucene-Solr-trunk-MacOSX/solr/build/solr-core/test/J0/org.apache.solr.cloud.BasicDistributedZkTest-jetty2-1359850916784/collection1/lib/classes/' to classloader
[junit4:junit4]   2> 7013 T2395 oasc.SolrResourceLoader.replaceClassLoader Adding 'file:/Users/jenkins/jenkins-slave/workspace/Lucene-Solr-trunk-MacOSX/solr/build/solr-core/test/J0/org.apache.solr.cloud.BasicDistributedZkTest-jetty2-1359850916784/collection1/lib/README' to classloader
[junit4:junit4]   2> 7063 T2395 oasc.SolrConfig.<init> Using Lucene MatchVersion: LUCENE_50
[junit4:junit4]   2> 7125 T2395 oasc.SolrConfig.<init> Loaded SolrConfig: solrconfig.xml
[junit4:junit4]   2> 7127 T2395 oass.IndexSchema.readSchema Reading Solr Schema
[junit4:junit4]   2> 7133 T2395 oass.IndexSchema.readSchema Schema name=test
[junit4:junit4]   2> 7766 T2395 oass.OpenExchangeRatesOrgProvider.init Initialized with rates=open-exchange-rates.json, refreshInterval=1440.
[junit4:junit4]   2> 7775 T2395 oass.IndexSchema.readSchema default search field in schema is text
[junit4:junit4]   2> 7779 T2395 oass.IndexSchema.readSchema unique key field: id
[junit4:junit4]   2> 7801 T2395 oass.FileExchangeRateProvider.reload Reloading exchange rates from file currency.xml
[junit4:junit4]   2> 7807 T2395 oass.FileExchangeRateProvider.reload Reloading exchange rates from file currency.xml
[junit4:junit4]   2> 7812 T2395 oass.OpenExchangeRatesOrgProvider.reload Reloading exchange rates from open-exchange-rates.json
[junit4:junit4]   2> 7814 T2395 oass.OpenExchangeRatesOrgProvider.reload Reloading exchange rates from open-exchange-rates.json
[junit4:junit4]   2> 7816 T2395 oasc.SolrCore.<init> [collection1] Opening new SolrCore at /Users/jenkins/jenkins-slave/workspace/Lucene-Solr-trunk-MacOSX/solr/build/solr-core/test/J0/./org.apache.solr.cloud.BasicDistributedZkTest-jetty2-1359850916784/collection1/, dataDir=./org.apache.solr.cloud.BasicDistributedZkTest-1359850910098/jetty2/
[junit4:junit4]   2> 7816 T2395 oasc.JmxMonitoredMap.<init> JMX monitoring is enabled. Adding Solr mbeans to JMX Server: com.sun.jmx.mbeanserver.JmxMBeanServer@3f80cfa7
[junit4:junit4]   2> 7817 T2395 oasc.SolrCore.initDirectoryFactory solr.NRTCachingDirectoryFactory
[junit4:junit4]   2> 7818 T2395 oasc.CachingDirectoryFactory.get return new directory for /Users/jenkins/jenkins-slave/workspace/Lucene-Solr-trunk-MacOSX/solr/build/solr-core/test/J0/./org.apache.solr.cloud.BasicDistributedZkTest-1359850910098/jetty2 forceNew:false
[junit4:junit4]   2> 7818 T2395 oasc.CachingDirectoryFactory.close Releasing directory:/Users/jenkins/jenkins-slave/workspace/Lucene-Solr-trunk-MacOSX/solr/build/solr-core/test/J0/./org.apache.solr.cloud.BasicDistributedZkTest-1359850910098/jetty2
[junit4:junit4]   2> 7819 T2395 oasc.SolrCore.getNewIndexDir New index directory detected: old=null new=./org.apache.solr.cloud.BasicDistributedZkTest-1359850910098/jetty2/index/
[junit4:junit4]   2> 7819 T2395 oasc.SolrCore.initIndex WARNING [collection1] Solr index directory './org.apache.solr.cloud.BasicDistributedZkTest-1359850910098/jetty2/index' doesn't exist. Creating new index...
[junit4:junit4]   2> 7820 T2395 oasc.CachingDirectoryFactory.get return new directory for /Users/jenkins/jenkins-slave/workspace/Lucene-Solr-trunk-MacOSX/solr/build/solr-core/test/J0/./org.apache.solr.cloud.BasicDistributedZkTest-1359850910098/jetty2/index forceNew:false
[junit4:junit4]   2> 7825 T2395 oasc.SolrDeletionPolicy.onCommit SolrDeletionPolicy.onCommit: commits:num=1
[junit4:junit4]   2> 		commit{dir=RateLimitedDirectoryWrapper(NRTCachingDirectory(org.apache.lucene.store.NIOFSDirectory@/Users/jenkins/jenkins-slave/workspace/Lucene-Solr-trunk-MacOSX/solr/build/solr-core/test/J0/org.apache.solr.cloud.BasicDistributedZkTest-1359850910098/jetty2/index lockFactory=org.apache.lucene.store.NativeFSLockFactory@23f3ef77; maxCacheMB=48.0 maxMergeSizeMB=4.0)),segFN=segments_1,generation=1,filenames=[segments_1]
[junit4:junit4]   2> 7825 T2395 oasc.SolrDeletionPolicy.updateCommits newest commit = 1[segments_1]
[junit4:junit4]   2> 7826 T2395 oasc.CachingDirectoryFactory.close Releasing directory:/Users/jenkins/jenkins-slave/workspace/Lucene-Solr-trunk-MacOSX/solr/build/solr-core/test/J0/./org.apache.solr.cloud.BasicDistributedZkTest-1359850910098/jetty2/index
[junit4:junit4]   2> 7827 T2395 oasc.SolrCore.initWriters created xml: solr.XMLResponseWriter
[junit4:junit4]   2> 7829 T2395 oasup.UpdateRequestProcessorChain.init inserting DistributedUpdateProcessorFactory into updateRequestProcessorChain "dedupe"
[junit4:junit4]   2> 7829 T2395 oasup.UpdateRequestProcessorChain.init inserting DistributedUpdateProcessorFactory into updateRequestProcessorChain "dedupe-allfields"
[junit4:junit4]   2> 7830 T2395 oasup.UpdateRequestProcessorChain.init inserting DistributedUpdateProcessorFactory into updateRequestProcessorChain "stored_sig"
[junit4:junit4]   2> 7830 T2395 oasup.UpdateRequestProcessorChain.init inserting DistributedUpdateProcessorFactory into updateRequestProcessorChain "uniq-fields"
[junit4:junit4]   2> 7831 T2395 oasup.UpdateRequestProcessorChain.init inserting DistributedUpdateProcessorFactory into updateRequestProcessorChain "distrib-dup-test-chain-implicit"
[junit4:junit4]   2> 7832 T2395 oasc.RequestHandlers.initHandlersFromConfig adding lazy requestHandler: solr.ReplicationHandler
[junit4:junit4]   2> 7833 T2395 oasc.RequestHandlers.initHandlersFromConfig created /replication: solr.ReplicationHandler
[junit4:junit4]   2> 7833 T2395 oasc.RequestHandlers.initHandlersFromConfig created standard: solr.StandardRequestHandler
[junit4:junit4]   2> 7834 T2395 oasc.RequestHandlers.initHandlersFromConfig created /get: solr.RealTimeGetHandler
[junit4:junit4]   2> 7834 T2395 oasc.RequestHandlers.initHandlersFromConfig created dismax: solr.SearchHandler
[junit4:junit4]   2> 7835 T2395 oasc.RequestHandlers.initHandlersFromConfig created mock: org.apache.solr.core.MockQuerySenderListenerReqHandler
[junit4:junit4]   2> 7836 T2395 oasc.RequestHandlers.initHandlersFromConfig created /admin/: org.apache.solr.handler.admin.AdminHandlers
[junit4:junit4]   2> 7836 T2395 oasc.RequestHandlers.initHandlersFromConfig created defaults: solr.StandardRequestHandler
[junit4:junit4]   2> 7837 T2395 oasc.RequestHandlers.initHandlersFromConfig adding lazy requestHandler: solr.StandardRequestHandler
[junit4:junit4]   2> 7837 T2395 oasc.RequestHandlers.initHandlersFromConfig created lazy: solr.StandardRequestHandler
[junit4:junit4]   2> 7838 T2395 oasc.RequestHandlers.initHandlersFromConfig created /update: solr.UpdateRequestHandler
[junit4:junit4]   2> 7838 T2395 oasc.RequestHandlers.initHandlersFromConfig created /terms: org.apache.solr.handler.component.SearchHandler
[junit4:junit4]   2> 7839 T2395 oasc.RequestHandlers.initHandlersFromConfig created spellCheckCompRH: org.apache.solr.handler.component.SearchHandler
[junit4:junit4]   2> 7840 T2395 oasc.RequestHandlers.initHandlersFromConfig created spellCheckCompRH_Direct: org.apache.solr.handler.component.SearchHandler
[junit4:junit4]   2> 7840 T2395 oasc.RequestHandlers.initHandlersFromConfig created spellCheckWithWordbreak: org.apache.solr.handler.component.SearchHandler
[junit4:junit4]   2> 7841 T2395 oasc.RequestHandlers.initHandlersFromConfig created spellCheckWithWordbreak_Direct: org.apache.solr.handler.component.SearchHandler
[junit4:junit4]   2> 7841 T2395 oasc.RequestHandlers.initHandlersFromConfig created spellCheckCompRH1: org.apache.solr.handler.component.SearchHandler
[junit4:junit4]   2> 7842 T2395 oasc.RequestHandlers.initHandlersFromConfig created mltrh: org.apache.solr.handler.component.SearchHandler
[junit4:junit4]   2> 7842 T2395 oasc.RequestHandlers.initHandlersFromConfig created tvrh: org.apache.solr.handler.component.SearchHandler
[junit4:junit4]   2> 7843 T2395 oasc.RequestHandlers.initHandlersFromConfig created /mlt: solr.MoreLikeThisHandler
[junit4:junit4]   2> 7844 T2395 oasc.RequestHandlers.initHandlersFromConfig created /debug/dump: solr.DumpRequestHandler
[junit4:junit4]   2> 7851 T2395 oashl.XMLLoader.init xsltCacheLifetimeSeconds=60
[junit4:junit4]   2> 7854 T2395 oasc.SolrCore.initDeprecatedSupport WARNING solrconfig.xml uses deprecated <admin/gettableFiles>, Please update your config to use the ShowFileRequestHandler.
[junit4:junit4]   2> 7857 T2395 oasc.SolrCore.initDeprecatedSupport WARNING adding ShowFileRequestHandler with hidden files: [SCHEMA.XML, OLD_SYNONYMS.TXT, STOPWORDS.TXT, PROTWORDS.TXT, OPEN-EXCHANGE-RATES.JSON, SYNONYMS.TXT, CURRENCY.XML, MAPPING-ISOLATIN1ACCENT.TXT]
[junit4:junit4]   2> 7860 T2395 oasc.CachingDirectoryFactory.close Releasing directory:/Users/jenkins/jenkins-slave/workspace/Lucene-Solr-trunk-MacOSX/solr/build/solr-core/test/J0/./org.apache.solr.cloud.BasicDistributedZkTest-1359850910098/jetty2
[junit4:junit4]   2> 7862 T2395 oass.SolrIndexSearcher.<init> Opening Searcher@59817e19 main
[junit4:junit4]   2> 7863 T2395 oasu.CommitTracker.<init> Hard AutoCommit: disabled
[junit4:junit4]   2> 7863 T2395 oasu.CommitTracker.<init> Soft AutoCommit: disabled
[junit4:junit4]   2> 7864 T2395 oashc.SpellCheckComponent.inform Initializing spell checkers
[junit4:junit4]   2> 7872 T2395 oass.DirectSolrSpellChecker.init init: {name=direct,classname=DirectSolrSpellChecker,field=lowerfilt,minQueryLength=3}
[junit4:junit4]   2> 7902 T2396 oasc.SolrCore.registerSearcher [collection1] Registered new searcher Searcher@59817e19 main{StandardDirectoryReader(segments_1:1)}
[junit4:junit4]   2> 7910 T2395 oasc.ZkController.publish publishing core=collection1 state=down
[junit4:junit4]   2> 7910 T2395 oasc.ZkController.publish numShards not found on descriptor - reading it from system property
[junit4:junit4]   2> 8177 T2361 oascc.ZkStateReader.updateClusterState Updating cloud state from ZooKeeper... 
[junit4:junit4]   2> 8178 T2361 oasc.Overseer$ClusterStateUpdater.updateState Update state numShards=2 message={
[junit4:junit4]   2> 	  "operation":"state",
[junit4:junit4]   2> 	  "numShards":"2",
[junit4:junit4]   2> 	  "shard":"shard1",
[junit4:junit4]   2> 	  "roles":null,
[junit4:junit4]   2> 	  "state":"active",
[junit4:junit4]   2> 	  "core":"collection1",
[junit4:junit4]   2> 	  "collection":"collection1",
[junit4:junit4]   2> 	  "node_name":"127.0.0.1:49791_",
[junit4:junit4]   2> 	  "base_url":"http://127.0.0.1:49791"}
[junit4:junit4]   2> 8183 T2361 oasc.Overseer$ClusterStateUpdater.updateState Update state numShards=2 message={
[junit4:junit4]   2> 	  "operation":"state",
[junit4:junit4]   2> 	  "numShards":"2",
[junit4:junit4]   2> 	  "shard":null,
[junit4:junit4]   2> 	  "roles":null,
[junit4:junit4]   2> 	  "state":"down",
[junit4:junit4]   2> 	  "core":"collection1",
[junit4:junit4]   2> 	  "collection":"collection1",
[junit4:junit4]   2> 	  "node_name":"127.0.0.1:49794_",
[junit4:junit4]   2> 	  "base_url":"http://127.0.0.1:49794"}
[junit4:junit4]   2> 8184 T2361 oasc.Overseer$ClusterStateUpdater.updateState Collection already exists with numShards=2
[junit4:junit4]   2> 8184 T2361 oasc.Overseer$ClusterStateUpdater.updateState Assigning new node to shard shard=shard2
[junit4:junit4]   2> 8189 T2366 oascc.ZkStateReader$2.process A cluster state change: WatchedEvent state:SyncConnected type:NodeDataChanged path:/clusterstate.json, has occurred - updating... (live nodes size: 3)
[junit4:junit4]   2> 8190 T2379 oascc.ZkStateReader$2.process A cluster state change: WatchedEvent state:SyncConnected type:NodeDataChanged path:/clusterstate.json, has occurred - updating... (live nodes size: 3)
[junit4:junit4]   2> 8190 T2360 oascc.ZkStateReader$2.process A cluster state change: WatchedEvent state:SyncConnected type:NodeDataChanged path:/clusterstate.json, has occurred - updating... (live nodes size: 3)
[junit4:junit4]   2> 8190 T2394 oascc.ZkStateReader$2.process A cluster state change: WatchedEvent state:SyncConnected type:NodeDataChanged path:/clusterstate.json, has occurred - updating... (live nodes size: 3)
[junit4:junit4]   2> 8914 T2395 oasc.CoreContainer.registerCore registering core: collection1
[junit4:junit4]   2> 8914 T2395 oasc.ZkController.register Register replica - core:collection1 address:http://127.0.0.1:49794 collection:collection1 shard:shard2
[junit4:junit4]   2> 8915 T2395 oascc.SolrZkClient.makePath makePath: /collections/collection1/leader_elect/shard2/election
[junit4:junit4]   2> 8925 T2343 oazs.PrepRequestProcessor.pRequest Got user-level KeeperException when processing sessionid:0x13c9d6e31990008 type:delete cxid:0x42 zxid:0x7c txntype:-1 reqpath:n/a Error Path:/solr/collections/collection1/leaders/shard2 Error:KeeperErrorCode = NoNode for /solr/collections/collection1/leaders/shard2
[junit4:junit4]   2> 8926 T2395 oasc.ShardLeaderElectionContext.runLeaderProcess Running the leader process.
[junit4:junit4]   2> 8926 T2343 oazs.PrepRequestProcessor.pRequest Got user-level KeeperException when processing sessionid:0x13c9d6e31990008 type:create cxid:0x43 zxid:0x7d txntype:-1 reqpath:n/a Error Path:/solr/overseer Error:KeeperErrorCode = NodeExists for /solr/overseer
[junit4:junit4]   2> 8929 T2395 oasc.ShardLeaderElectionContext.waitForReplicasToComeUp Enough replicas found to continue.
[junit4:junit4]   2> 8929 T2395 oasc.ShardLeaderElectionContext.runLeaderProcess I may be the new leader - try and sync
[junit4:junit4]   2> 8929 T2395 oasc.SyncStrategy.sync Sync replicas to http://127.0.0.1:49794/collection1/
[junit4:junit4]   2> 8930 T2395 oasc.SyncStrategy.syncReplicas Sync Success - now sync replicas to me
[junit4:junit4]   2> 8930 T2395 oasc.SyncStrategy.syncToMe http://127.0.0.1:49794/collection1/ has no replicas
[junit4:junit4]   2> 8930 T2395 oasc.ShardLeaderElectionContext.runLeaderProcess I am the new leader: http://127.0.0.1:49794/collection1/
[junit4:junit4]   2> 8930 T2395 oascc.SolrZkClient.makePath makePath: /collections/collection1/leaders/shard2
[junit4:junit4]   2> 8936 T2343 oazs.PrepRequestProcessor.pRequest Got user-level KeeperException when processing sessionid:0x13c9d6e31990008 type:create cxid:0x4c zxid:0x80 txntype:-1 reqpath:n/a Error Path:/solr/overseer Error:KeeperErrorCode = NodeExists for /solr/overseer
[junit4:junit4]   2> 9701 T2361 oascc.ZkStateReader.updateClusterState Updating cloud state from ZooKeeper... 
[junit4:junit4]   2> 9717 T2360 oascc.ZkStateReader$2.process A cluster state change: WatchedEvent state:SyncConnected type:NodeDataChanged path:/clusterstate.json, has occurred - updating... (live nodes size: 3)
[junit4:junit4]   2> 9717 T2366 oascc.ZkStateReader$2.process A cluster state change: WatchedEvent state:SyncConnected type:NodeDataChanged path:/clusterstate.json, has occurred - updating... (live nodes size: 3)
[junit4:junit4]   2> 9717 T2394 oascc.ZkStateReader$2.process A cluster state change: WatchedEvent state:SyncConnected type:NodeDataChanged path:/clusterstate.json, has occurred - updating... (live nodes size: 3)
[junit4:junit4]   2> 9717 T2379 oascc.ZkStateReader$2.process A cluster state change: WatchedEvent state:SyncConnected type:NodeDataChanged path:/clusterstate.json, has occurred - updating... (live nodes size: 3)
[junit4:junit4]   2> 9756 T2395 oasc.ZkController.register We are http://127.0.0.1:49794/collection1/ and leader is http://127.0.0.1:49794/collection1/
[junit4:junit4]   2> 9757 T2395 oasc.ZkController.register No LogReplay needed for core=collection1 baseURL=http://127.0.0.1:49794
[junit4:junit4]   2> 9757 T2395 oasc.ZkController.checkRecovery I am the leader, no recovery necessary
[junit4:junit4]   2> 9758 T2395 oasc.ZkController.publish publishing core=collection1 state=active
[junit4:junit4]   2> 9758 T2395 oasc.ZkController.publish numShards not found on descriptor - reading it from system property
[junit4:junit4]   2> 9762 T2395 oascc.ZkStateReader.updateClusterState Updating cloud state from ZooKeeper... 
[junit4:junit4]   2> 9764 T2338 oass.SolrDispatchFilter.init user.dir=/Users/jenkins/jenkins-slave/workspace/Lucene-Solr-trunk-MacOSX/solr/build/solr-core/test/J0
[junit4:junit4]   2> 9764 T2338 oass.SolrDispatchFilter.init SolrDispatchFilter.init() done
[junit4:junit4]   2> 9765 T2338 oascsi.HttpClientUtil.createClient Creating new http client, config:maxConnections=128&maxConnectionsPerHost=32&followRedirects=false
[junit4:junit4]   2> 9953 T2338 oejs.Server.doStart jetty-8.1.8.v20121106
[junit4:junit4]   2> 9958 T2338 oejs.AbstractConnector.doStart Started SelectChannelConnector@127.0.0.1:49797
[junit4:junit4]   2> 9959 T2338 oass.SolrDispatchFilter.init SolrDispatchFilter.init()
[junit4:junit4]   2> 9959 T2338 oasc.SolrResourceLoader.locateSolrHome JNDI not configured for solr (NoInitialContextEx)
[junit4:junit4]   2> 9959 T2338 oasc.SolrResourceLoader.locateSolrHome using system property solr.solr.home: /Users/jenkins/jenkins-slave/workspace/Lucene-Solr-trunk-MacOSX/solr/build/solr-core/test/J0/./org.apache.solr.cloud.BasicDistributedZkTest-jetty3-1359850919864
[junit4:junit4]   2> 9960 T2338 oasc.CoreContainer$Initializer.initialize looking for solr.xml: /Users/jenkins/jenkins-slave/workspace/Lucene-Solr-trunk-MacOSX/solr/build/solr-core/test/J0/./org.apache.solr.cloud.BasicDistributedZkTest-jetty3-1359850919864/solr.xml
[junit4:junit4]   2> 9960 T2338 oasc.CoreContainer.<init> New CoreContainer 1638152971
[junit4:junit4]   2> 9961 T2338 oasc.CoreContainer.load Loading CoreContainer using Solr Home: '/Users/jenkins/jenkins-slave/workspace/Lucene-Solr-trunk-MacOSX/solr/build/solr-core/test/J0/./org.apache.solr.cloud.BasicDistributedZkTest-jetty3-1359850919864/'
[junit4:junit4]   2> 9961 T2338 oasc.SolrResourceLoader.<init> new SolrResourceLoader for directory: '/Users/jenkins/jenkins-slave/workspace/Lucene-Solr-trunk-MacOSX/solr/build/solr-core/test/J0/./org.apache.solr.cloud.BasicDistributedZkTest-jetty3-1359850919864/'
[junit4:junit4]   2> 9996 T2338 oashc.HttpShardHandlerFactory.getParameter Setting socketTimeout to: 60000
[junit4:junit4]   2> 9997 T2338 oashc.HttpShardHandlerFactory.getParameter Setting urlScheme to: http://
[junit4:junit4]   2> 9998 T2338 oashc.HttpShardHandlerFactory.getParameter Setting connTimeout to: 15000
[junit4:junit4]   2> 9999 T2338 oashc.HttpShardHandlerFactory.getParameter Setting maxConnectionsPerHost to: 20
[junit4:junit4]   2> 9999 T2338 oashc.HttpShardHandlerFactory.getParameter Setting corePoolSize to: 0
[junit4:junit4]   2> 10000 T2338 oashc.HttpShardHandlerFactory.getParameter Setting maximumPoolSize to: 2147483647
[junit4:junit4]   2> 10001 T2338 oashc.HttpShardHandlerFactory.getParameter Setting maxThreadIdleTime to: 5
[junit4:junit4]   2> 10001 T2338 oashc.HttpShardHandlerFactory.getParameter Setting sizeOfQueue to: -1
[junit4:junit4]   2> 10002 T2338 oashc.HttpShardHandlerFactory.getParameter Setting fairnessPolicy to: false
[junit4:junit4]   2> 10002 T2338 oascsi.HttpClientUtil.createClient Creating new http client, config:maxConnectionsPerHost=20&maxConnections=10000&socketTimeout=60000&connTimeout=15000&retry=false
[junit4:junit4]   2> 10016 T2338 oasc.CoreContainer.load Registering Log Listener
[junit4:junit4]   2> 10036 T2338 oasc.CoreContainer.initZooKeeper Zookeeper client=127.0.0.1:49784/solr
[junit4:junit4]   2> 10037 T2338 oasc.ZkController.checkChrootPath zkHost includes chroot
[junit4:junit4]   2> 10038 T2338 oaz.ZooKeeper.<init> Initiating client connection, connectString=127.0.0.1:49784 sessionTimeout=60000 watcher=org.apache.solr.common.cloud.ConnectionManager@4e7a23b1
[junit4:junit4]   2> 10039 T2338 oascc.ConnectionManager.waitForConnected Waiting for client to connect to ZooKeeper
[junit4:junit4]   2> 10040 T2406 oaz.ClientCnxn$SendThread.logStartConnect Opening socket connection to server localhost/127.0.0.1:49784. Will not attempt to authenticate using SASL (access denied ("javax.security.auth.AuthPermission" "getLoginConfiguration"))
[junit4:junit4]   2> 10041 T2406 oaz.ClientCnxn$SendThread.primeConnection Socket connection established to localhost/127.0.0.1:49784, initiating session
[junit4:junit4]   2> 10041 T2340 oazs.NIOServerCnxnFactory.run Accepted socket connection from /127.0.0.1:49798
[junit4:junit4]   2> 10041 T2340 oazs.ZooKeeperServer.processConnectRequest Client attempting to establish new session at /127.0.0.1:49798
[junit4:junit4]   2> 10043 T2342 oazs.ZooKeeperServer.finishSessionInit Established session 0x13c9d6e31990009 with negotiated timeout 20000 for client /127.0.0.1:49798
[junit4:junit4]   2> 10043 T2406 oaz.ClientCnxn$SendThread.onConnected Session establishment complete on server localhost/127.0.0.1:49784, sessionid = 0x13c9d6e31990009, negotiated timeout = 20000
[junit4:junit4]   2> 10044 T2407 oascc.ConnectionManager.process Watcher org.apache.solr.common.cloud.ConnectionManager@4e7a23b1 name:ZooKeeperConnection Watcher:127.0.0.1:49784 got event WatchedEvent state:SyncConnected type:None path:null path:null type:None
[junit4:junit4]   2> 10044 T2338 oascc.ConnectionManager.waitForConnected Client is connected to ZooKeeper
[junit4:junit4]   2> 10046 T2343 oazs.PrepRequestProcessor.pRequest2Txn Processed session termination for sessionid: 0x13c9d6e31990009
[junit4:junit4]   2> 10048 T2340 oazs.NIOServerCnxn.closeSock Closed socket connection for client /127.0.0.1:49798 which had sessionid 0x13c9d6e31990009
[junit4:junit4]   2> 10049 T2338 oaz.ZooKeeper.close Session: 0x13c9d6e31990009 closed
[junit4:junit4]   2> 10050 T2338 oascsi.HttpClientUtil.createClient Creating new http client, config:maxConnections=500&maxConnectionsPerHost=16&socketTimeout=60000&connTimeout=15000
[junit4:junit4]   2> 10049 T2407 oaz.ClientCnxn$EventThread.run EventThread shut down
[junit4:junit4]   2> 10056 T2338 oaz.ZooKeeper.<init> Initiating client connection, connectString=127.0.0.1:49784/solr sessionTimeout=30000 watcher=org.apache.solr.common.cloud.ConnectionManager@436a7b7c
[junit4:junit4]   2> 10057 T2338 oascc.ConnectionManager.waitForConnected Waiting for client to connect to ZooKeeper
[junit4:junit4]   2> 10058 T2408 oaz.ClientCnxn$SendThread.logStartConnect Opening socket connection to server localhost/127.0.0.1:49784. Will not attempt to authenticate using SASL (access denied ("javax.security.auth.AuthPermission" "getLoginConfiguration"))
[junit4:junit4]   2> 10059 T2408 oaz.ClientCnxn$SendThread.primeConnection Socket connection established to localhost/127.0.0.1:49784, initiating session
[junit4:junit4]   2> 10059 T2340 oazs.NIOServerCnxnFactory.run Accepted socket connection from /127.0.0.1:49799
[junit4:junit4]   2> 10059 T2340 oazs.ZooKeeperServer.processConnectRequest Client attempting to establish new session at /127.0.0.1:49799
[junit4:junit4]   2> 10061 T2342 oazs.ZooKeeperServer.finishSessionInit Established session 0x13c9d6e3199000a with negotiated timeout 20000 for client /127.0.0.1:49799
[junit4:junit4]   2> 10061 T2408 oaz.ClientCnxn$SendThread.onConnected Session establishment complete on server localhost/127.0.0.1:49784, sessionid = 0x13c9d6e3199000a, negotiated timeout = 20000
[junit4:junit4]   2> 10061 T2409 oascc.ConnectionManager.process Watcher org.apache.solr.common.cloud.ConnectionManager@436a7b7c name:ZooKeeperConnection Watcher:127.0.0.1:49784/solr got event WatchedEvent state:SyncConnected type:None path:null path:null type:None
[junit4:junit4]   2> 10062 T2338 oascc.ConnectionManager.waitForConnected Client is connected to ZooKeeper
[junit4:junit4]   2> 10063 T2343 oazs.PrepRequestProcessor.pRequest Got user-level KeeperException when processing sessionid:0x13c9d6e3199000a type:create cxid:0x1 zxid:0x8d txntype:-1 reqpath:n/a Error Path:/solr/overseer Error:KeeperErrorCode = NodeExists for /solr/overseer
[junit4:junit4]   2> 10065 T2343 oazs.PrepRequestProcessor.pRequest Got user-level KeeperException when processing sessionid:0x13c9d6e3199000a type:create cxid:0x2 zxid:0x8e txntype:-1 reqpath:n/a Error Path:/solr/overseer Error:KeeperErrorCode = NodeExists for /solr/overseer
[junit4:junit4]   2> 10067 T2338 oasc.ZkController.createEphemeralLiveNode Register node as live in ZooKeeper:/live_nodes/127.0.0.1:49797_
[junit4:junit4]   2> 10068 T2343 oazs.PrepRequestProcessor.pRequest Got user-level KeeperException when processing sessionid:0x13c9d6e3199000a type:delete cxid:0x4 zxid:0x8f txntype:-1 reqpath:n/a Error Path:/solr/live_nodes/127.0.0.1:49797_ Error:KeeperErrorCode = NoNode for /solr/live_nodes/127.0.0.1:49797_
[junit4:junit4]   2> 10069 T2338 oascc.SolrZkClient.makePath makePath: /live_nodes/127.0.0.1:49797_
[junit4:junit4]   2> 10073 T2379 oascc.ZkStateReader$2.process A cluster state change: WatchedEvent state:SyncConnected type:NodeChildrenChanged path:/live_nodes, has occurred - updating... (live nodes size: 3)
[junit4:junit4]   2> 10073 T2394 oascc.ZkStateReader$2.process A cluster state change: WatchedEvent state:SyncConnected type:NodeChildrenChanged path:/live_nodes, has occurred - updating... (live nodes size: 3)
[junit4:junit4]   2> 10075 T2366 oascc.ZkStateReader$3.process Updating live nodes... (4)
[junit4:junit4]   2> 10076 T2366 oascc.ZkStateReader$2.process A cluster state change: WatchedEvent state:SyncConnected type:NodeChildrenChanged path:/live_nodes, has occurred - updating... (live nodes size: 4)
[junit4:junit4]   2> 10076 T2360 oascc.ZkStateReader$3.process Updating live nodes... (4)
[junit4:junit4]   2> 10076 T2360 oascc.ZkStateReader$2.process A cluster state change: WatchedEvent state:SyncConnected type:NodeChildrenChanged path:/live_nodes, has occurred - updating... (live nodes size: 4)
[junit4:junit4]   2> 10079 T2394 oascc.ZkStateReader$3.process Updating live nodes... (4)
[junit4:junit4]   2> 10080 T2379 oascc.ZkStateReader$3.process Updating live nodes... (4)
[junit4:junit4]   2> 10084 T2338 oascc.ZkStateReader.createClusterStateWatchersAndUpdate Updating cluster state from ZooKeeper... 
[junit4:junit4]   2> 10092 T2410 oasc.CoreContainer.create Creating SolrCore 'collection1' using instanceDir: /Users/jenkins/jenkins-slave/workspace/Lucene-Solr-trunk-MacOSX/solr/build/solr-core/test/J0/./org.apache.solr.cloud.BasicDistributedZkTest-jetty3-1359850919864/collection1
[junit4:junit4]   2> 10092 T2410 oasc.ZkController.createCollectionZkNode Check for collection zkNode:collection1
[junit4:junit4]   2> 10093 T2410 oasc.ZkController.createCollectionZkNode Collection zkNode exists
[junit4:junit4]   2> 10094 T2410 oasc.ZkController.readConfigName Load collection config from:/collections/collection1
[junit4:junit4]   2> 10096 T2410 oasc.SolrResourceLoader.<init> new SolrResourceLoader for directory: '/Users/jenkins/jenkins-slave/workspace/Lucene-Solr-trunk-MacOSX/solr/build/solr-core/test/J0/./org.apache.solr.cloud.BasicDistributedZkTest-jetty3-1359850919864/collection1/'
[junit4:junit4]   2> 10097 T2410 oasc.SolrResourceLoader.replaceClassLoader Adding 'file:/Users/jenkins/jenkins-slave/workspace/Lucene-Solr-trunk-MacOSX/solr/build/solr-core/test/J0/org.apache.solr.cloud.BasicDistributedZkTest-jetty3-1359850919864/collection1/lib/classes/' to classloader
[junit4:junit4]   2> 10097 T2410 oasc.SolrResourceLoader.replaceClassLoader Adding 'file:/Users/jenkins/jenkins-slave/workspace/Lucene-Solr-trunk-MacOSX/solr/build/solr-core/test/J0/org.apache.solr.cloud.BasicDistributedZkTest-jetty3-1359850919864/collection1/lib/README' to classloader
[junit4:junit4]   2> 10135 T2410 oasc.SolrConfig.<init> Using Lucene MatchVersion: LUCENE_50
[junit4:junit4]   2> 10200 T2410 oasc.SolrConfig.<init> Loaded SolrConfig: solrconfig.xml
[junit4:junit4]   2> 10202 T2410 oass.IndexSchema.readSchema Reading Solr Schema
[junit4:junit4]   2> 10207 T2410 oass.IndexSchema.readSchema Schema name=test
[junit4:junit4]   2> 10878 T2410 oass.OpenExchangeRatesOrgProvider.init Initialized with rates=open-exchange-rates.json, refreshInterval=1440.
[junit4:junit4]   2> 10886 T2410 oass.IndexSchema.readSchema default search field in schema is text
[junit4:junit4]   2> 10889 T2410 oass.IndexSchema.readSchema unique key field: id
[junit4:junit4]   2> 10912 T2410 oass.FileExchangeRateProvider.reload Reloading exchange rates from file currency.xml
[junit4:junit4]   2> 10918 T2410 oass.FileExchangeRateProvider.reload Reloading exchange rates from file currency.xml
[junit4:junit4]   2> 10924 T2410 oass.OpenExchangeRatesOrgProvider.reload Reloading exchange rates from open-exchange-rates.json
[junit4:junit4]   2> 10926 T2410 oass.OpenExchangeRatesOrgProvider.reload Reloading exchange rates from open-exchange-rates.json
[junit4:junit4]   2> 10928 T2410 oasc.SolrCore.<init> [collection1] Opening new SolrCore at /Users/jenkins/jenkins-slave/workspace/Lucene-Solr-trunk-MacOSX/solr/build/solr-core/test/J0/./org.apache.solr.cloud.BasicDistributedZkTest-jetty3-1359850919864/collection1/, dataDir=./org.apache.solr.cloud.BasicDistributedZkTest-1359850910098/jetty3/
[junit4:junit4]   2> 10928 T2410 oasc.JmxMonitoredMap.<init> JMX monitoring is enabled. Adding Solr mbeans to JMX Server: com.sun.jmx.mbeanserver.JmxMBeanServer@3f80cfa7
[junit4:junit4]   2> 10929 T2410 oasc.SolrCore.initDirectoryFactory solr.NRTCachingDirectoryFactory
[junit4:junit4]   2> 10930 T2410 oasc.CachingDirectoryFactory.get return new directory for /Users/jenkins/jenkins-slave/workspace/Lucene-Solr-trunk-MacOSX/solr/build/solr-core/test/J0/./org.apache.solr.cloud.BasicDistributedZkTest-1359850910098/jetty3 forceNew:false
[junit4:junit4]   2> 10930 T2410 oasc.CachingDirectoryFactory.close Releasing directory:/Users/jenkins/jenkins-slave/workspace/Lucene-Solr-trunk-MacOSX/solr/build/solr-core/test/J0/./org.apache.solr.cloud.BasicDistributedZkTest-1359850910098/jetty3
[junit4:junit4]   2> 10931 T2410 oasc.SolrCore.getNewIndexDir New index directory detected: old=null new=./org.apache.solr.cloud.BasicDistributedZkTest-1359850910098/jetty3/index/
[junit4:junit4]   2> 10932 T2410 oasc.SolrCore.initIndex WARNING [collection1] Solr index directory './org.apache.solr.cloud.BasicDistributedZkTest-1359850910098/jetty3/index' doesn't exist. Creating new index...
[junit4:junit4]   2> 10932 T2410 oasc.CachingDirectoryFactory.get return new directory for /Users/jenkins/jenkins-slave/workspace/Lucene-Solr-trunk-MacOSX/solr/build/solr-core/test/J0/./org.apache.solr.cloud.BasicDistributedZkTest-1359850910098/jetty3/index forceNew:false
[junit4:junit4]   2> 10936 T2410 oasc.SolrDeletionPolicy.onCommit SolrDeletionPolicy.onCommit: commits:num=1
[junit4:junit4]   2> 		commit{dir=RateLimitedDirectoryWrapper(NRTCachingDirectory(org.apache.lucene.store.NIOFSDirectory@/Users/jenkins/jenkins-slave/workspace/Lucene-Solr-trunk-MacOSX/solr/build/solr-core/test/J0/org.apache.solr.cloud.BasicDistributedZkTest-1359850910098/jetty3/index lockFactory=org.apache.lucene.store.NativeFSLockFactory@7753772c; maxCacheMB=48.0 maxMergeSizeMB=4.0)),segFN=segments_1,generation=1,filenames=[segments_1]
[junit4:junit4]   2> 10937 T2410 oasc.SolrDeletionPolicy.updateCommits newest commit = 1[segments_1]
[junit4:junit4]   2> 10938 T2410 oasc.CachingDirectoryFactory.close Releasing directory:/Users/jenkins/jenkins-slave/workspace/Lucene-Solr-trunk-MacOSX/solr/build/solr-core/test/J0/./org.apache.solr.cloud.BasicDistributedZkTest-1359850910098/jetty3/index
[junit4:junit4]   2> 10938 T2410 oasc.SolrCore.initWriters created xml: solr.XMLResponseWriter
[junit4:junit4]   2> 10941 T2410 oasup.UpdateRequestProcessorChain.init inserting DistributedUpdateProcessorFactory into updateRequestProcessorChain "dedupe"
[junit4:junit4]   2> 10941 T2410 oasup.UpdateRequestProcessorChain.init inserting DistributedUpdateProcessorFactory into updateRequestProcessorChain "dedupe-allfields"
[junit4:junit4]   2> 10941 T2410 oasup.UpdateRequestProcessorChain.init inserting DistributedUpdateProcessorFactory into updateRequestProcessorChain "stored_sig"
[junit4:junit4]   2> 10942 T2410 oasup.UpdateRequestProcessorChain.init inserting DistributedUpdateProcessorFactory into updateRequestProcessorChain "uniq-fields"
[junit4:junit4]   2> 10942 T2410 oasup.UpdateRequestProcessorChain.init inserting DistributedUpdateProcessorFactory into updateRequestProcessorChain "distrib-dup-test-chain-implicit"
[junit4:junit4]   2> 10943 T2410 oasc.RequestHandlers.initHandlersFromConfig adding lazy requestHandler: solr.ReplicationHandler
[junit4:junit4]   2> 10943 T2410 oasc.RequestHandlers.initHandlersFromConfig created /replication: solr.ReplicationHandler
[junit4:junit4]   2> 10944 T2410 oasc.RequestHandlers.initHandlersFromConfig created standard: solr.StandardRequestHandler
[junit4:junit4]   2> 10944 T2410 oasc.RequestHandlers.initHandlersFromConfig created /get: solr.RealTimeGetHandler
[junit4:junit4]   2> 10945 T2410 oasc.RequestHandlers.initHandlersFromConfig created dismax: solr.SearchHandler
[junit4:junit4]   2> 10946 T2410 oasc.RequestHandlers.initHandlersFromConfig created mock: org.apache.solr.core.MockQuerySenderListenerReqHandler
[junit4:junit4]   2> 10946 T2410 oasc.RequestHandlers.initHandlersFromConfig created /admin/: org.apache.solr.handler.admin.AdminHandlers
[junit4:junit4]   2> 10946 T2410 oasc.RequestHandlers.initHandlersFromConfig created defaults: solr.StandardRequestHandler
[junit4:junit4]   2> 10947 T2410 oasc.RequestHandlers.initHandlersFromConfig adding lazy requestHandler: solr.StandardRequestHandler
[junit4:junit4]   2> 10947 T2410 oasc.RequestHandlers.initHandlersFromConfig created lazy: solr.StandardRequestHandler
[junit4:junit4]   2> 10948 T2410 oasc.RequestHandlers.initHandlersFromConfig created /update: solr.UpdateRequestHandler
[junit4:junit4]   2> 10948 T2410 oasc.RequestHandlers.initHandlersFromConfig created /terms: org.apache.solr.handler.component.SearchHandler
[junit4:junit4]   2> 10949 T2410 oasc.RequestHandlers.initHandlersFromConfig created spellCheckCompRH: org.apache.solr.handler.component.SearchHandler
[junit4:junit4]   2> 10949 T2410 oasc.RequestHandlers.initHandlersFromConfig created spellCheckCompRH_Direct: org.apache.solr.handler.component.SearchHandler
[junit4:junit4]   2> 10950 T2410 oasc.RequestHandlers.initHandlersFromConfig created spellCheckWithWordbreak: org.apache.solr.handler.component.SearchHandler
[junit4:junit4]   2> 10950 T2410 oasc.RequestHandlers.initHandlersFromConfig created spellCheckWithWordbreak_Direct: org.apache.solr.handler.component.SearchHandler
[junit4:junit4]   2> 10951 T2410 oasc.RequestHandlers.initHandlersFromConfig created spellCheckCompRH1: org.apache.solr.handler.component.SearchHandler
[junit4:junit4]   2> 10951 T2410 oasc.RequestHandlers.initHandlersFromConfig created mltrh: org.apache.solr.handler.component.SearchHandler
[junit4:junit4]   2> 10952 T2410 oasc.RequestHandlers.initHandlersFromConfig created tvrh: org.apache.solr.handler.component.SearchHandler
[junit4:junit4]   2> 10952 T2410 oasc.RequestHandlers.initHandlersFromConfig created /mlt: solr.MoreLikeThisHandler
[junit4:junit4]   2> 10953 T2410 oasc.RequestHandlers.initHandlersFromConfig created /debug/dump: solr.DumpRequestHandler
[junit4:junit4]   2> 10959 T2410 oashl.XMLLoader.init xsltCacheLifetimeSeconds=60
[junit4:junit4]   2> 10963 T2410 oasc.SolrCore.initDeprecatedSupport WARNING solrconfig.xml uses deprecated <admin/gettableFiles>, Please update your config to use the ShowFileRequestHandler.
[junit4:junit4]   2> 10964 T2410 oasc.SolrCore.initDeprecatedSupport WARNING adding ShowFileRequestHandler with hidden files: [SCHEMA.XML, OLD_SYNONYMS.TXT, STOPWORDS.TXT, PROTWORDS.TXT, OPEN-EXCHANGE-RATES.JSON, SYNONYMS.TXT, CURRENCY.XML, MAPPING-ISOLATIN1ACCENT.TXT]
[junit4:junit4]   2> 10967 T2410 oasc.CachingDirectoryFactory.close Releasing directory:/Users/jenkins/jenkins-slave/workspace/Lucene-Solr-trunk-MacOSX/solr/build/solr-core/test/J0/./org.apache.solr.cloud.BasicDistributedZkTest-1359850910098/jetty3
[junit4:junit4]   2> 10969 T2410 oass.SolrIndexSearcher.<init> Opening Searcher@12c546bd main
[junit4:junit4]   2> 10970 T2410 oasu.CommitTracker.<init> Hard AutoCommit: disabled
[junit4:junit4]   2> 10970 T2410 oasu.CommitTracker.<init> Soft AutoCommit: disabled
[junit4:junit4]   2> 10971 T2410 oashc.SpellCheckComponent.inform Initializing spell checkers
[junit4:junit4]   2> 10976 T2410 oass.DirectSolrSpellChecker.init init: {name=direct,classname=DirectSolrSpellChecker,field=lowerfilt,minQueryLength=3}
[junit4:junit4]   2> 11008 T2411 oasc.SolrCore.registerSearcher [collection1] Registered new searcher Searcher@12c546bd main{StandardDirectoryReader(segments_1:1)}
[junit4:junit4]   2> 11014 T2410 oasc.ZkController.publish publishing core=collection1 state=down
[junit4:junit4]   2> 11015 T2410 oasc.ZkController.publish numShards not found on descriptor - reading it from system property
[junit4:junit4]   2> 11234 T2361 oascc.ZkStateReader.updateClusterState Updating cloud state from ZooKeeper... 
[junit4:junit4]   2> 11236 T2361 oasc.Overseer$ClusterStateUpdater.updateState Update state numShards=2 message={
[junit4:junit4]   2> 	  "operation":"state",
[junit4:junit4]   2> 	  "numShards":"2",
[junit4:junit4]   2> 	  "shard":"shard2",
[junit4:junit4]   2> 	  "roles":null,
[junit4:junit4]   2> 	  "state":"active",
[junit4:junit4]   2> 	  "core":"collection1",
[junit4:junit4]   2> 	  "collection":"collection1",
[junit4:junit4]   2> 	  "node_name":"127.0.0.1:49794_",
[junit4:junit4]   2> 	  "base_url":"http://127.0.0.1:49794"}
[junit4:junit4]   2> 11242 T2361 oasc.Overseer$ClusterStateUpdater.updateState Update state numShards=2 message={
[junit4:junit4]   2> 	  "operation":"state",
[junit4:junit4]   2> 	  "numShards":"2",
[junit4:junit4]   2> 	  "shard":null,
[junit4:junit4]   2> 	  "roles":null,
[junit4:junit4]   2> 	  "state":"down",
[junit4:junit4]   2> 	  "core":"collection1",
[junit4:junit4]   2> 	  "collection":"collection1",
[junit4:junit4]   2> 	  "node_name":"127.0.0.1:49797_",
[junit4:junit4]   2> 	  "base_url":"http://127.0.0.1:49797"}
[junit4:junit4]   2> 11243 T2361 oasc.Overseer$ClusterStateUpdater.updateState Collection already exists with numShards=2
[junit4:junit4]   2> 11243 T2361 oasc.Overseer$ClusterStateUpdater.updateState Assigning new node to shard shard=shard1
[junit4:junit4]   2> 11252 T2394 oascc.ZkStateReader$2.process A cluster state change: WatchedEvent state:SyncConnected type:NodeDataChanged path:/clusterstate.json, has occurred - updating... (live nodes size: 4)
[junit4:junit4]   2> 11252 T2409 oascc.ZkStateReader$2.process A cluster state change: WatchedEvent state:SyncConnected type:NodeDataChanged path:/clusterstate.json, has occurred - updating... (live nodes size: 4)
[junit4:junit4]   2> 11252 T2360 oascc.ZkStateReader$2.process A cluster state change: WatchedEvent state:SyncConnected type:NodeDataChanged path:/clusterstate.json, has occurred - updating... (live nodes size: 4)
[junit4:junit4]   2> 11252 T2366 oascc.ZkStateReader$2.process A cluster state change: WatchedEvent state:SyncConnected type:NodeDataChanged path:/clusterstate.json, has occurred - updating... (live nodes size: 4)
[junit4:junit4]   2> 11253 T2379 oascc.ZkStateReader$2.process A cluster state change: WatchedEvent state:SyncConnected type:NodeDataChanged path:/clusterstate.json, has occurred - updating... (live nodes size: 4)
[junit4:junit4]   2> 12019 T2410 oasc.CoreContainer.registerCore registering core: collection1
[junit4:junit4]   2> 12020 T2410 oasc.ZkController.register Register replica - core:collection1 address:http://127.0.0.1:49797 collection:collection1 shard:shard1
[junit4:junit4]   2> 12025 T2410 oasc.ZkController.register We are http://127.0.0.1:49797/collection1/ and leader is http://127.0.0.1:49791/collection1/
[junit4:junit4]   2> 12025 T2410 oasc.ZkController.register No LogReplay needed for core=collection1 baseURL=http://127.0.0.1:49797
[junit4:junit4]   2> 12025 T2410 oasc.ZkController.checkRecovery Core needs to recover:collection1
[junit4:junit4]   2> 12025 T2410 oasu.DefaultSolrCoreState.doRecovery Running recovery - first canceling any ongoing recovery
[junit4:junit4]   2> ASYNC  NEW_CORE C218 name=collection1 org.apache.solr.core.SolrCore@34b00010 url=http://127.0.0.1:49797/collection1 node=127.0.0.1:49797_ C218_STATE=coll:collection1 core:collection1 props:{shard=null, roles=null, state=down, core=collection1, collection=collection1, node_name=127.0.0.1:49797_, base_url=http://127.0.0.1:49797}
[junit4:junit4]   2> 12026 T2412 C218 P49797 oasc.RecoveryStrategy.run Starting recovery process.  core=collection1 recoveringAfterStartup=true
[junit4:junit4]   2> 12026 T2412 C218 P49797 oasc.RecoveryStrategy.doRecovery ###### startupVersions=[]
[junit4:junit4]   2> 12026 T2410 oascc.ZkStateReader.updateClusterState Updating cloud state from ZooKeeper... 
[junit4:junit4]   2> 12027 T2412 C218 P49797 oasc.ZkController.publish publishing core=collection1 state=recovering
[junit4:junit4]   2> 12027 T2412 C218 P49797 oasc.ZkController.publish numShards not found on descriptor - reading it from system property
[junit4:junit4]   2> 12028 T2338 oass.SolrDispatchFilter.init user.dir=/Users/jenkins/jenkins-slave/workspace/Lucene-Solr-trunk-MacOSX/solr/build/solr-core/test/J0
[junit4:junit4]   2> 12029 T2412 C218 P49797 oascsi.HttpClientUtil.createClient Creating new http client, config:maxConnections=128&maxConnectionsPerHost=32&followRedirects=false
[junit4:junit4]   2> 12029 T2338 oass.SolrDispatchFilter.init SolrDispatchFilter.init() done
[junit4:junit4]   2> 12030 T2338 oascsi.HttpClientUtil.createClient Creating new http client, config:maxConnections=128&maxConnectionsPerHost=32&followRedirects=false
[junit4:junit4]   2> 12218 T2338 oejs.Server.doStart jetty-8.1.8.v20121106
[junit4:junit4]   2> 12222 T2338 oejs.AbstractConnector.doStart Started SelectChannelConnector@127.0.0.1:49801
[junit4:junit4]   2> 12222 T2338 oass.SolrDispatchFilter.init SolrDispatchFilter.init()
[junit4:junit4]   2> 12223 T2338 oasc.SolrResourceLoader.locateSolrHome JNDI not configured for solr (NoInitialContextEx)
[junit4:junit4]   2> 12223 T2338 oasc.SolrResourceLoader.locateSolrHome using system property solr.solr.home: /Users/jenkins/jenkins-slave/workspace/Lucene-Solr-trunk-MacOSX/solr/build/solr-core/test/J0/./org.apache.solr.cloud.BasicDistributedZkTest-jetty4-1359850922128
[junit4:junit4]   2> 12224 T2338 oasc.CoreContainer$Initializer.initialize looking for solr.xml: /Users/jenkins/jenkins-slave/workspace/Lucene-Solr-trunk-MacOSX/solr/build/solr-core/test/J0/./org.apache.solr.cloud.BasicDistributedZkTest-jetty4-1359850922128/solr.xml
[junit4:junit4]   2> 12224 T2338 oasc.CoreContainer.<init> New CoreContainer 1985640498
[junit4:junit4]   2> 12224 T2338 oasc.CoreContainer.load Loading CoreContainer using Solr Home: '/Users/jenkins/jenkins-slave/workspace/Lucene-Solr-trunk-MacOSX/solr/build/solr-core/test/J0/./org.apache.solr.cloud.BasicDistributedZkTest-jetty4-1359850922128/'
[junit4:junit4]   2> 12225 T2338 oasc.SolrResourceLoader.<init> new SolrResourceLoader for directory: '/Users/jenkins/jenkins-slave/workspace/Lucene-Solr-trunk-MacOSX/solr/build/solr-core/test/J0/./org.apache.solr.cloud.BasicDistributedZkTest-jetty4-1359850922128/'
[junit4:junit4]   2> 12440 T2338 oashc.HttpShardHandlerFactory.getParameter Setting socketTimeout to: 60000
[junit4:junit4]   2> 12441 T2338 oashc.HttpShardHandlerFactory.getParameter Setting urlScheme to: http://
[junit4:junit4]   2> 12441 T2338 oashc.HttpShardHandlerFactory.getParameter Setting connTimeout to: 15000
[junit4:junit4]   2> 12442 T2338 oashc.HttpShardHandlerFactory.getParameter Setting maxConnectionsPerHost to: 20
[junit4:junit4]   2> 12442 T2338 oashc.HttpShardHandlerFactory.getParameter Setting corePoolSize to: 0
[junit4:junit4]   2> 12443 T2338 oashc.HttpShardHandlerFactory.getParameter Setting maximumPoolSize to: 2147483647
[junit4:junit4]   2> 12443 T2338 oashc.HttpShardHandlerFactory.getParameter Setting maxThreadIdleTime to: 5
[junit4:junit4]   2> 12444 T2338 oashc.HttpShardHandlerFactory.getParameter Setting sizeOfQueue to: -1
[junit4:junit4]   2> 12444 T2338 oashc.HttpShardHandlerFactory.getParameter Setting fairnessPolicy to: false
[junit4:junit4]   2> 12445 T2338 oascsi.HttpClientUtil.createClient Creating new http client, config:maxConnectionsPerHost=20&maxConnections=10000&socketTimeout=60000&connTimeout=15000&retry=false
[junit4:junit4]   2> 12458 T2338 oasc.CoreContainer.load Registering Log Listener
[junit4:junit4]   2> 12477 T2338 oasc.CoreContainer.initZooKeeper Zookeeper client=127.0.0.1:49784/solr
[junit4:junit4]   2> 12478 T2338 oasc.ZkController.checkChrootPath zkHost includes chroot
[junit4:junit4]   2> 12479 T2338 oaz.ZooKeeper.<init> Initiating client connection, connectString=127.0.0.1:49784 sessionTimeout=60000 watcher=org.apache.solr.common.cloud.ConnectionManager@26a7eb98
[junit4:junit4]   2> 12480 T2338 oascc.ConnectionManager.waitForConnected Waiting for client to connect to ZooKeeper
[junit4:junit4]   2> 12481 T2422 oaz.ClientCnxn$SendThread.logStartConnect Opening socket connection to server localhost/127.0.0.1:49784. Will not attempt to authenticate using SASL (access denied ("javax.security.auth.AuthPermission" "getLoginConfiguration"))
[junit4:junit4]   2> 12482 T2422 oaz.ClientCnxn$SendThread.primeConnection Socket connection established to localhost/127.0.0.1:49784, initiating session
[junit4:junit4]   2> 12482 T2340 oazs.NIOServerCnxnFactory.run Accepted socket connection from /127.0.0.1:49802
[junit4:junit4]   2> 12483 T2340 oazs.ZooKeeperServer.processConnectRequest Client attempting to establish new session at /127.0.0.1:49802
[junit4:junit4]   2> 12620 T2342 oazs.ZooKeeperServer.finishSessionInit Established session 0x13c9d6e3199000b with negotiated timeout 20000 for client /127.0.0.1:49802
[junit4:junit4]   2> 12620 T2422 oaz.ClientCnxn$SendThread.onConnected Session establishment complete on server localhost/127.0.0.1:49784, sessionid = 0x13c9d6e3199000b, negotiated timeout = 20000
[junit4:junit4]   2> 12621 T2423 oascc.ConnectionManager.process Watcher org.apache.solr.common.cloud.ConnectionManager@26a7eb98 name:ZooKeeperConnection Watcher:127.0.0.1:49784 got event WatchedEvent state:SyncConnected type:None path:null path:null type:None
[junit4:junit4]   2> 12621 T2338 oascc.ConnectionManager.waitForConnected Client is connected to ZooKeeper
[junit4:junit4]   2> 12623 T2343 oazs.PrepRequestProcessor.pRequest2Txn Processed session termination for sessionid: 0x13c9d6e3199000b
[junit4:junit4]   2> 12626 T2340 oazs.NIOServerCnxn.closeSock Closed socket connection for client /127.0.0.1:49802 which had sessionid 0x13c9d6e3199000b
[junit4:junit4]   2> 12627 T2338 oaz.ZooKeeper.close Session: 0x13c9d6e3199000b closed
[junit4:junit4]   2> 12627 T2338 oascsi.HttpClientUtil.createClient Creating new http client, config:maxConnections=500&maxConnectionsPerHost=16&socketTimeout=60000&connTimeout=15000
[junit4:junit4]   2> 12628 T2423 oaz.ClientCnxn$EventThread.run EventThread shut down
[junit4:junit4]   2> 12634 T2338 oaz.ZooKeeper.<init> Initiating client connection, connectString=127.0.0.1:49784/solr sessionTimeout=30000 watcher=org.apache.solr.common.cloud.ConnectionManager@18bcb1d5
[junit4:junit4]   2> 12637 T2424 oaz.ClientCnxn$SendThread.logStartConnect Opening socket connection to server localhost/127.0.0.1:49784. Will not attempt to authenticate using SASL (access denied ("javax.security.auth.AuthPermission" "getLoginConfiguration"))
[junit4:junit4]   2> 12637 T2338 oascc.ConnectionManager.waitForConnected Waiting for client to connect to ZooKeeper
[junit4:junit4]   2> 12638 T2424 oaz.ClientCnxn$SendThread.primeConnection Socket connection established to localhost/127.0.0.1:49784, initiating session
[junit4:junit4]   2> 12638 T2340 oazs.NIOServerCnxnFactory.run Accepted socket connection from /127.0.0.1:49803
[junit4:junit4]   2> 12639 T2340 oazs.ZooKeeperServer.processConnectRequest Client attempting to establish new session at /127.0.0.1:49803
[junit4:junit4]   2> 12640 T2342 oazs.ZooKeeperServer.finishSessionInit Established session 0x13c9d6e3199000c with negotiated timeout 20000 for client /127.0.0.1:49803
[junit4:junit4]   2> 12641 T2424 oaz.ClientCnxn$SendThread.onConnected Session establishment complete on server localhost/127.0.0.1:49784, sessionid = 0x13c9d6e3199000c, negotiated timeout = 20000
[junit4:junit4]   2> 12641 T2425 oascc.ConnectionManager.process Watcher org.apache.solr.common.cloud.ConnectionManager@18bcb1d5 name:ZooKeeperConnection Watcher:127.0.0.1:49784/solr got event WatchedEvent state:SyncConnected type:None path:null path:null type:None
[junit4:junit4]   2> 12641 T2338 oascc.ConnectionManager.waitForConnected Client is connected to ZooKeeper
[junit4:junit4]   2> 12642 T2343 oazs.PrepRequestProcessor.pRequest Got user-level KeeperException when processing sessionid:0x13c9d6e3199000c type:create cxid:0x1 zxid:0x9f txntype:-1 reqpath:n/a Error Path:/solr/overseer Error:KeeperErrorCode = NodeExists for /solr/overseer
[junit4:junit4]   2> 12643 T2343 oazs.PrepRequestProcessor.pRequest Got user-level KeeperException when processing sessionid:0x13c9d6e3199000c type:create cxid:0x2 zxid:0xa0 txntype:-1 reqpath:n/a Error Path:/solr/overseer Error:KeeperErrorCode = NodeExists for /solr/overseer
[junit4:junit4]   2> 12645 T2338 oasc.ZkController.createEphemeralLiveNode Register node as live in ZooKeeper:/live_nodes/127.0.0.1:49801_
[junit4:junit4]   2> 12646 T2343 oazs.PrepRequestProcessor.pRequest Got user-level KeeperException when processing sessionid:0x13c9d6e3199000c type:delete cxid:0x4 zxid:0xa1 txntype:-1 reqpath:n/a Error Path:/solr/live_nodes/127.0.0.1:49801_ Error:KeeperErrorCode = NoNode for /solr/live_nodes/127.0.0.1:49801_
[junit4:junit4]   2> 12647 T2338 oascc.SolrZkClient.makePath makePath: /live_nodes/127.0.0.1:49801_
[junit4:junit4]   2> 12651 T2409 oascc.ZkStateReader$2.process A cluster state change: WatchedEvent state:SyncConnected type:NodeChildrenChanged path:/live_nodes, has occurred - updating... (live nodes size: 4)
[junit4:junit4]   2> 12651 T2394 oascc.ZkStateReader$2.process A cluster state change: WatchedEvent state:SyncConnected type:NodeChildrenChanged path:/live_nodes, has occurred - updating... (live nodes size: 4)
[junit4:junit4]   2> 12651 T2379 oascc.ZkStateReader$2.process A cluster state change: WatchedEvent state:SyncConnected type:NodeChildrenChanged path:/live_nodes, has occurred - updating... (live nodes size: 4)
[junit4:junit4]   2> 12653 T2366 oascc.ZkStateReader$3.process Updating live nodes... (5)
[junit4:junit4]   2> 12653 T2366 oascc.ZkStateReader$2.process A cluster state change: WatchedEvent state:SyncConnected type:NodeChildrenChanged path:/live_nodes, has occurred - updating... (live nodes size: 5)
[junit4:junit4]   2> 12653 T2360 oascc.ZkStateReader$3.process Updating live nodes... (5)
[junit4:junit4]   2> 12653 T2360 oascc.ZkStateReader$2.process A cluster state change: WatchedEvent state:SyncConnected type:NodeChildrenChanged path:/live_nodes, has occurred - updating... (live nodes size: 5)
[junit4:junit4]   2> 12656 T2379 oascc.ZkStateReader$3.process Updating live nodes... (5)
[junit4:junit4]   2> 12657 T2394 oascc.ZkStateReader$3.process Updating live nodes... (5)
[junit4:junit4]   2> 12657 T2409 oascc.ZkStateReader$3.process Updating live nodes... (5)
[junit4:junit4]   2> 12660 T2338 oascc.ZkStateReader.createClusterStateWatchersAndUpdate Updating cluster state from ZooKeeper... 
[junit4:junit4]   2> 12670 T2426 oasc.CoreContainer.create Creating SolrCore 'collection1' using instanceDir: /Users/jenkins/jenkins-slave/workspace/Lucene-Solr-trunk-MacOSX/solr/build/solr-core/test/J0/./org.apache.solr.cloud.BasicDistributedZkTest-jetty4-1359850922128/collection1
[junit4:junit4]   2> 12670 T2426 oasc.ZkController.createCollectionZkNode Check for collection zkNode:collection1
[junit4:junit4]   2> 12676 T2426 oasc.ZkController.createCollectionZkNode Collection zkNode exists
[junit4:junit4]   2> 12676 T2426 oasc.ZkController.readConfigName Load collection config from:/collections/collection1
[junit4:junit4]   2> 12678 T2426 oasc.SolrResourceLoader.<init> new SolrResourceLoader for directory: '/Users/jenkins/jenkins-slave/workspace/Lucene-Solr-trunk-MacOSX/solr/build/solr-core/test/J0/./org.apache.solr.cloud.BasicDistributedZkTest-jetty4-1359850922128/collection1/'
[junit4:junit4]   2> 12679 T2426 oasc.SolrResourceLoader.replaceClassLoader Adding 'file:/Users/jenkins/jenkins-slave/workspace/Lucene-Solr-trunk-MacOSX/solr/build/solr-core/test/J0/org.apache.solr.cloud.BasicDistributedZkTest-jetty4-1359850922128/collection1/lib/classes/' to classloader
[junit4:junit4]   2> 12679 T2426 oasc.SolrResourceLoader.replaceClassLoader Adding 'file:/Users/jenkins/jenkins-slave/workspace/Lucene-Solr-trunk-MacOSX/solr/build/solr-core/test/J0/org.apache.solr.cloud.BasicDistributedZkTest-jetty4-1359850922128/collection1/lib/README' to classloader
[junit4:junit4]   2> 12740 T2426 oasc.SolrConfig.<init> Using Lucene MatchVersion: LUCENE_50
[junit4:junit4]   2> 12769 T2361 oascc.ZkStateReader.updateClusterState Updating cloud state from ZooKeeper... 
[junit4:junit4]   2> 12771 T2361 oasc.Overseer$ClusterStateUpdater.updateState Update state numShards=2 message={
[junit4:junit4]   2> 	  "operation":"state",
[junit4:junit4]   2> 	  "numShards":"2",
[junit4:junit4]   2> 	  "shard":"shard1",
[junit4:junit4]   2> 	  "roles":null,
[junit4:junit4]   2> 	  "state":"recovering",
[junit4:junit4]   2> 	  "core":"collection1",
[junit4:junit4]   2> 	  "collection":"collection1",
[junit4:junit4]   2> 	  "node_name":"127.0.0.1:49797_",
[junit4:junit4]   2> 	  "base_url":"http://127.0.0.1:49797"}
[junit4:junit4]   2> 12778 T2425 oascc.ZkStateReader$2.process A cluster state change: WatchedEvent state:SyncConnected type:NodeDataChanged path:/clusterstate.json, has occurred - updating... (live nodes size: 5)
[junit4:junit4]   2> 12779 T2360 oascc.ZkStateReader$2.process A cluster state change: WatchedEvent state:SyncConnected type:NodeDataChanged path:/clusterstate.json, has occurred - updating... (live nodes size: 5)
[junit4:junit4]   2> 12780 T2379 oascc.ZkStateReader$2.process A cluster state change: WatchedEvent state:SyncConnected type:NodeDataChanged path:/clusterstate.json, has occurred - updating... (live nodes size: 5)
[junit4:junit4]   2> 12781 T2366 oascc.ZkStateReader$2.process A cluster state change: WatchedEvent state:SyncConnected type:NodeDataChanged path:/clusterstate.json, has occurred - updating... (live nodes size: 5)
[junit4:junit4]   2> 12781 T2409 oascc.ZkStateReader$2.process A cluster state change: WatchedEvent state:SyncConnected type:NodeDataChanged path:/clusterstate.json, has occurred - updating... (live nodes size: 5)
[junit4:junit4]   2> 12782 T2394 oascc.ZkStateReader$2.process A cluster state change: WatchedEvent state:SyncConnected type:NodeDataChanged path:/clusterstate.json, has occurred - updating... (live nodes size: 5)
[junit4:junit4]   2> 12827 T2426 oasc.SolrConfig.<init> Loaded SolrConfig: solrconfig.xml
[junit4:junit4]   2> 12829 T2426 oass.IndexSchema.readSchema Reading Solr Schema
[junit4:junit4]   2> 12838 T2426 oass.IndexSchema.readSchema Schema name=test
[junit4:junit4]   2> 13527 T2426 oass.OpenExchangeRatesOrgProvider.init Initialized with rates=open-exchange-rates.json, refreshInterval=1440.
[junit4:junit4]   2> 13536 T2426 oass.IndexSchema.readSchema default search field in schema is text
[junit4:junit4]   2> 13539 T2426 oass.IndexSchema.readSchema unique key field: id
[junit4:junit4]   2> 13562 T2426 oass.FileExchangeRateProvider.reload Reloading exchange rates from file currency.xml
[junit4:junit4]   2> 13570 T2426 oass.FileExchangeRateProvider.reload Reloading exchange rates from file currency.xml
[junit4:junit4]   2> 13577 T2426 oass.OpenExchangeRatesOrgProvider.reload Reloading exchange rates from open-exchange-rates.json
[junit4:junit4]   2> 13579 T2426 oass.OpenExchangeRatesOrgProvider.reload Reloading exchange rates from open-exchange-rates.json
[junit4:junit4]   2> 13581 T2426 oasc.SolrCore.<init> [collection1] Opening new SolrCore at /Users/jenkins/jenkins-slave/workspace/Lucene-Solr-trunk-MacOSX/solr/build/solr-core/test/J0/./org.apache.solr.cloud.BasicDistributedZkTest-jetty4-1359850922128/collection1/, dataDir=./org.apache.solr.cloud.BasicDistributedZkTest-1359850910098/jetty4/
[junit4:junit4]   2> 13581 T2426 oasc.JmxMonitoredMap.<init> JMX monitoring is enabled. Adding Solr mbeans to JMX Server: com.sun.jmx.mbeanserver.JmxMBeanServer@3f80cfa7
[junit4:junit4]   2> 13582 T2426 oasc.SolrCore.initDirectoryFactory solr.NRTCachingDirectoryFactory
[junit4:junit4]   2> 13582 T2426 oasc.CachingDirectoryFactory.get return new directory for /Users/jenkins/jenkins-slave/workspace/Lucene-Solr-trunk-MacOSX/solr/build/solr-core/test/J0/./org.apache.solr.cloud.BasicDistributedZkTest-1359850910098/jetty4 forceNew:false
[junit4:junit4]   2> 13583 T2426 oasc.CachingDirectoryFactory.close Releasing directory:/Users/jenkins/jenkins-slave/workspace/Lucene-Solr-trunk-MacOSX/solr/build/solr-core/test/J0/./org.apache.solr.cloud.BasicDistributedZkTest-1359850910098/jetty4
[junit4:junit4]   2> 13583 T2426 oasc.SolrCore.getNewIndexDir New index directory detected: old=null new=./org.apache.solr.cloud.BasicDistributedZkTest-1359850910098/jetty4/index/
[junit4:junit4]   2> 13584 T2426 oasc.SolrCore.initIndex WARNING [collection1] Solr index directory './org.apache.solr.cloud.BasicDistributedZkTest-1359850910098/jetty4/index' doesn't exist. Creating new index...
[junit4:junit4]   2> 13584 T2426 oasc.CachingDirectoryFactory.get return new directory for /Users/jenkins/jenkins-slave/workspace/Lucene-Solr-trunk-MacOSX/solr/build/solr-core/test/J0/./org.apache.solr.cloud.BasicDistributedZkTest-1359850910098/jetty4/index forceNew:false
[junit4:junit4]   2> 13588 T2426 oasc.SolrDeletionPolicy.onCommit SolrDeletionPolicy.onCommit: commits:num=1
[junit4:junit4]   2> 		commit{dir=RateLimitedDirectoryWrapper(NRTCachingDirectory(org.apache.lucene.store.NIOFSDirectory@/Users/jenkins/jenkins-slave/workspace/Lucene-Solr-trunk-MacOSX/solr/build/solr-core/test/J0/org.apache.solr.cloud.BasicDistributedZkTest-1359850910098/jetty4/index lockFactory=org.apache.lucene.store.NativeFSLockFactory@4a0bdc22; maxCacheMB=48.0 maxMergeSizeMB=4.0)),segFN=segments_1,generation=1,filenames=[segments_1]
[junit4:junit4]   2> 13588 T2426 oasc.SolrDeletionPolicy.updateCommits newest commit = 1[segments_1]
[junit4:junit4]   2> 13589 T2426 oasc.CachingDirectoryFactory.close Releasing directory:/Users/jenkins/jenkins-slave/workspace/Lucene-Solr-trunk-MacOSX/solr/build/solr-core/test/J0/./org.apache.solr.cloud.BasicDistributedZkTest-1359850910098/jetty4/index
[junit4:junit4]   2> 13590 T2426 oasc.SolrCore.initWriters created xml: solr.XMLResponseWriter
[junit4:junit4]   2> 13592 T2426 oasup.UpdateRequestProcessorChain.init inserting DistributedUpdateProcessorFactory into updateRequestProcessorChain "dedupe"
[junit4:junit4]   2> 13593 T2426 oasup.UpdateRequestProcessorChain.init inserting DistributedUpdateProcessorFactory into updateRequestProcessorChain "dedupe-allfields"
[junit4:junit4]   2> 13593 T2426 oasup.UpdateRequestProcessorChain.init inserting DistributedUpdateProcessorFactory into updateRequestProcessorChain "stored_sig"
[junit4:junit4]   2> 13593 T2426 oasup.UpdateRequestProcessorChain.init inserting DistributedUpdateProcessorFactory into updateRequestProcessorChain "uniq-fields"
[junit4:junit4]   2> 13595 T2426 oasup.UpdateRequestProcessorChain.init inserting DistributedUpdateProcessorFactory into updateRequestProcessorChain "distrib-dup-test-chain-implicit"
[junit4:junit4]   2> 13595 T2426 oasc.RequestHandlers.initHandlersFromConfig adding lazy requestHandler: solr.ReplicationHandler
[junit4:junit4]   2> 13596 T2426 oasc.RequestHandlers.initHandlersFromConfig created /replication: solr.ReplicationHandler
[junit4:junit4]   2> 13597 T2426 oasc.RequestHandlers.initHandlersFromConfig created standard: solr.StandardRequestHandler
[junit4:junit4]   2> 13597 T2426 oasc.RequestHandlers.initHandlersFromConfig created /get: solr.RealTimeGetHandler
[junit4:junit4]   2> 13598 T2426 oasc.RequestHandlers.initHandlersFromConfig created dismax: solr.SearchHandler
[junit4:junit4]   2> 13599 T2426 oasc.RequestHandlers.initHandlersFromConfig created mock: org.apache.solr.core.MockQuerySenderListenerReqHandler
[junit4:junit4]   2> 13599 T2426 oasc.RequestHandlers.initHandlersFromConfig created /admin/: org.apache.solr.handler.admin.AdminHandlers
[junit4:junit4]   2> 13600 T2426 oasc.RequestHandlers.initHandlersFromConfig created defaults: solr.StandardRequestHandler
[junit4:junit4]   2> 13600 T2426 oasc.RequestHandlers.initHandlersFromConfig adding lazy requestHandler: solr.StandardRequestHandler
[junit4:junit4]   2> 13601 T2426 oasc.RequestHandlers.initHandlersFromConfig created lazy: solr.StandardRequestHandler
[junit4:junit4]   2> 13601 T2426 oasc.RequestHandlers.initHandlersFromConfig created /update: solr.UpdateRequestHandler
[junit4:junit4]   2> 13602 T2426 oasc.RequestHandlers.initHandlersFromConfig created /terms: org.apache.solr.handler.component.SearchHandler
[junit4:junit4]   2> 13602 T2426 oasc.RequestHandlers.initHandlersFromConfig created spellCheckCompRH: org.apache.solr.handler.component.SearchHandler
[junit4:junit4]   2> 13603 T2426 oasc.RequestHandlers.initHandlersFromConfig created spellCheckCompRH_Direct: org.apache.solr.handler.component.SearchHandler
[junit4:junit4]   2> 13604 T2426 oasc.RequestHandlers.initHandlersFromConfig created spellCheckWithWordbreak: org.apache.solr.handler.component.SearchHandler
[junit4:junit4]   2> 13604 T2426 oasc.RequestHandlers.initHandlersFromConfig created spellCheckWithWordbreak_Direct: org.apache.solr.handler.component.SearchHandler
[junit4:junit4]   2> 13605 T2426 oasc.RequestHandlers.initHandlersFromConfig created spellCheckCompRH1: org.apache.solr.handler.component.SearchHandler
[junit4:junit4]   2> 13606 T2426 oasc.RequestHandlers.initHandlersFromConfig created mltrh: org.apache.solr.handler.component.SearchHandler
[junit4:junit4]   2> 13607 T2426 oasc.RequestHandlers.initHandlersFromConfig created tvrh: org.apache.solr.handler.component.SearchHandler
[junit4:junit4]   2> 13607 T2426 oasc.RequestHandlers.initHandlersFromConfig created /mlt: solr.MoreLikeThisHandler
[junit4:junit4]   2> 13608 T2426 oasc.RequestHandlers.initHandlersFromConfig created /debug/dump: solr.DumpRequestHandler
[junit4:junit4]   2> 13615 T2426 oashl.XMLLoader.init xsltCacheLifetimeSeconds=60
[junit4:junit4]   2> 13618 T2426 oasc.SolrCore.initDeprecatedSupport WARNING solrconfig.xml uses deprecated <admin/gettableFiles>, Please update your config to use the ShowFileRequestHandler.
[junit4:junit4]   2> 13620 T2426 oasc.SolrCore.initDeprecatedSupport WARNING adding ShowFileRequestHandler with hidden files: [SCHEMA.XML, OLD_SYNONYMS.TXT, STOPWORDS.TXT, PROTWORDS.TXT, OPEN-EXCHANGE-RATES.JSON, SYNONYMS.TXT, CURRENCY.XML, MAPPING-ISOLATIN1ACCENT.TXT]
[junit4:junit4]   2> 13623 T2426 oasc.CachingDirectoryFactory.close Releasing directory:/Users/jenkins/jenkins-slave/workspace/Lucene-Solr-trunk-MacOSX/solr/build/solr-core/test/J0/./org.apache.solr.cloud.BasicDistributedZkTest-1359850910098/jetty4
[junit4:junit4]   2> 13624 T2426 oass.SolrIndexSearcher.<init> Opening Searcher@4fdb6a3f main
[junit4:junit4]   2> 13625 T2426 oasu.CommitTracker.<init> Hard AutoCommit: disabled
[junit4:junit4]   2> 13626 T2426 oasu.CommitTracker.<init> Soft AutoCommit: disabled
[junit4:junit4]   2> 13626 T2426 oashc.SpellCheckComponent.inform Initializing spell checkers
[junit4:junit4]   2> 13632 T2426 oass.DirectSolrSpellChecker.init init: {name=direct,classname=DirectSolrSpellChecker,field=lowerfilt,minQueryLength=3}
[junit4:junit4]   2> 13672 T2427 oasc.SolrCore.registerSearcher [collection1] Registered new searcher Searcher@4fdb6a3f main{StandardDirectoryReader(segments_1:1)}
[junit4:junit4]   2> 13678 T2426 oasc.ZkController.publish publishing core=collection1 state=down
[junit4:junit4]   2> 13679 T2426 oasc.ZkController.publish numShards not found on descriptor - reading it from system property
[junit4:junit4]   2> 14292 T2361 oascc.ZkStateReader.updateClusterState Updating cloud state from ZooKeeper... 
[junit4:junit4]   2> 14293 T2361 oasc.Overseer$ClusterStateUpdater.updateState Update state numShards=2 message={
[junit4:junit4]   2> 	  "operation":"state",
[junit4:junit4]   2> 	  "numShards":"2",
[junit4:junit4]   2> 	  "shard":null,
[junit4:junit4]   2> 	  "roles":null,
[junit4:junit4]   2> 	  "state":"down",
[junit4:junit4]   2> 	  "core":"collection1",
[junit4:junit4]   2> 	  "collection":"collection1",
[junit4:junit4]   2> 	  "node_name":"127.0.0.1:49801_",
[junit4:junit4]   2> 	  "base_url":"http://127.0.0.1:49801"}
[junit4:junit4]   2> 14293 T2361 oasc.Overseer$ClusterStateUpdater.updateState Collection already exists with numShards=2
[junit4:junit4]   2> 14293 T2361 oasc.Overseer$ClusterStateUpdater.updateState Assigning new node to shard shard=shard2
[junit4:junit4]   2> 14299 T2394 oascc.ZkStateReader$2.process A cluster state change: WatchedEvent state:SyncConnected type:NodeDataChanged path:/clusterstate.json, has occurred - updating... (live nodes size: 5)
[junit4:junit4]   2> 14299 T2366 oascc.ZkStateReader$2.process A cluster state change: WatchedEvent state:SyncConnected type:NodeDataChanged path:/clusterstate.json, has occurred - updating... (live nodes size: 5)
[junit4:junit4]   2> 14300 T2379 oascc.ZkStateReader$2.process A cluster state change: WatchedEvent state:SyncConnected type:NodeDataChanged path:/clusterstate.json, has occurred - updating... (live nodes size: 5)
[junit4:junit4]   2> 14299 T2360 oascc.ZkStateReader$2.process A cluster state change: WatchedEvent state:SyncConnected type:NodeDataChanged path:/clusterstate.json, has occurred - updating... (live nodes size: 5)
[junit4:junit4]   2> 14300 T2409 oascc.ZkStateReader$2.process A cluster state change: WatchedEvent state:SyncConnected type:NodeDataChanged path:/clusterstate.json, has occurred - updating... (live nodes size: 5)
[junit4:junit4]   2> 14300 T2425 oascc.ZkStateReader$2.process A cluster state change: WatchedEvent state:SyncConnected type:NodeDataChanged path:/clusterstate.json, has occurred - updating... (live nodes size: 5)
[junit4:junit4]   2> 14683 T2426 oasc.CoreContainer.registerCore registering core: collection1
[junit4:junit4]   2> 14683 T2426 oasc.ZkController.register Register replica - core:collection1 address:http://127.0.0.1:49801 collection:collection1 shard:shard2
[junit4:junit4]   2> 14688 T2426 oasc.ZkController.register We are http://127.0.0.1:49801/collection1/ and leader is http://127.0.0.1:49794/collection1/
[junit4:junit4]   2> 14689 T2426 oasc.ZkController.register No LogReplay needed for core=collection1 baseURL=http://127.0.0.1:49801
[junit4:junit4]   2> 14689 T2426 oasc.ZkController.checkRecovery Core needs to recover:collection1
[junit4:junit4]   2> 14689 T2426 oasu.DefaultSolrCoreState.doRecovery Running recovery - first canceling any ongoing recovery
[junit4:junit4]   2> ASYNC  NEW_CORE C219 name=collection1 org.apache.solr.core.SolrCore@6e55e681 url=http://127.0.0.1:49801/collection1 node=127.0.0.1:49801_ C219_STATE=coll:collection1 core:collection1 props:{shard=null, roles=null, state=down, core=collection1, collection=collection1, node_name=127.0.0.1:49801_, base_url=http://127.0.0.1:49801}
[junit4:junit4]   2> 14690 T2428 C219 P49801 oasc.RecoveryStrategy.run Starting recovery process.  core=collection1 recoveringAfterStartup=true
[junit4:junit4]   2> 14690 T2426 oascc.ZkStateReader.updateClusterState Updating cloud state from ZooKeeper... 
[junit4:junit4]   2> 14690 T2428 C219 P49801 oasc.RecoveryStrategy.doRecovery ###### startupVersions=[]
[junit4:junit4]   2> 14690 T2428 C219 P49801 oasc.ZkController.publish publishing core=collection1 state=recovering
[junit4:junit4]   2> 14691 T2428 C219 P49801 oasc.ZkController.publish numShards not found on descriptor - reading it from system property
[junit4:junit4]   2> 14691 T2338 oass.SolrDispatchFilter.init user.dir=/Users/jenkins/jenkins-slave/workspace/Lucene-Solr-trunk-MacOSX/solr/build/solr-core/test/J0
[junit4:junit4]   2> 14692 T2428 C219 P49801 oascsi.HttpClientUtil.createClient Creating new http client, config:maxConnections=128&maxConnectionsPerHost=32&followRedirects=false
[junit4:junit4]   2> 14692 T2338 oass.SolrDispatchFilter.init SolrDispatchFilter.init() done
[junit4:junit4]   2> 14692 T2338 oascsi.HttpClientUtil.createClient Creating new http client, config:maxConnections=128&maxConnectionsPerHost=32&followRedirects=false
[junit4:junit4]   2> 14699 T2338 oascc.ZkStateReader.updateClusterState Updating cloud state from ZooKeeper... 
[junit4:junit4]   2> 14701 T2338 oasc.AbstractDistribZkTestBase.waitForRecoveriesToFinish Wait for recoveries to finish - collection: collection1 failOnTimeout:true timeout (sec):230
[junit4:junit4]   2> 14702 T2338 oascc.ZkStateReader.updateClusterState Updating cloud state from ZooKeeper... 
[junit4:junit4]   2>  C218_STATE=coll:collection1 core:collection1 props:{shard=shard1, roles=null, state=recovering, core=collection1, collection=collection1, node_name=127.0.0.1:49797_, base_url=http://127.0.0.1:49797}
[junit4:junit4]   2> 15043 T2412 C218 P49797 oasc.RecoveryStrategy.doRecovery Attempting to PeerSync from http://127.0.0.1:49791/collection1/ core=collection1 - recoveringAfterStartup=true
[junit4:junit4]   2> 15043 T2412 C218 P49797 oasu.PeerSync.sync PeerSync: core=collection1 url=http://127.0.0.1:49797 START replicas=[http://127.0.0.1:49791/collection1/] nUpdates=100
[junit4:junit4]   2> 15044 T2412 C218 P49797 oasu.PeerSync.sync WARNING no frame of reference to tell of we've missed updates
[junit4:junit4]   2> 15044 T2412 C218 P49797 oasc.RecoveryStrategy.doRecovery PeerSync Recovery was not successful - trying replication. core=collection1
[junit4:junit4]   2> 15044 T2412 C218 P49797 oasc.RecoveryStrategy.doRecovery Starting Replication Recovery. core=collection1
[junit4:junit4]   2> 15044 T2412 C218 P49797 oasc.RecoveryStrategy.doRecovery Begin buffering updates. core=collection1
[junit4:junit4]   2> 15044 T2412 C218 P49797 oasu.UpdateLog.bufferUpdates Starting to buffer updates. FSUpdateLog{state=ACTIVE, tlog=null}
[junit4:junit4]   2> 15045 T2412 C218 P49797 oasc.RecoveryStrategy.replicate Attempting to replicate from http://127.0.0.1:49791/collection1/. core=collection1
[junit4:junit4]   2> 15045 T2412 C218 P49797 oascsi.HttpClientUtil.createClient Creating new http client, config:maxConnections=128&maxConnectionsPerHost=32&followRedirects=false
[junit4:junit4]   2> ASYNC  NEW_CORE C220 name=collection1 org.apache.solr.core.SolrCore@5fbfd675 url=http://127.0.0.1:49791/collection1 node=127.0.0.1:49791_ C220_STATE=coll:collection1 core:collection1 props:{shard=shard1, roles=null, state=active, core=collection1, collection=collection1, node_name=127.0.0.1:49791_, base_url=http://127.0.0.1:49791, leader=true}
[junit4:junit4]   2> 15051 T2373 C220 P49791 REQ /get {getVersions=100&distrib=false&wt=javabin&qt=/get&version=2} status=0 QTime=0 
[junit4:junit4]   2> 15052 T2371 C220 P49791 oasu.DirectUpdateHandler2.commit start commit{,optimize=false,openSearcher=false,waitSearcher=true,expungeDeletes=false,softCommit=false}
[junit4:junit4]   2> 15053 T2371 C220 P49791 oasc.CachingDirectoryFactory.close Releasing directory:/Users/jenkins/jenkins-slave/workspace/Lucene-Solr-trunk-MacOSX/solr/build/solr-core/test/J0/./org.apache.solr.cloud.BasicDistributedZkTest-1359850910098/jetty1
[junit4:junit4]   2> 15056 T2371 C220 P49791 oasc.SolrDeletionPolicy.onInit SolrDeletionPolicy.onInit: commits:num=1
[junit4:junit4]   2> 		commit{dir=RateLimitedDirectoryWrapper(NRTCachingDirectory(org.apache.lucene.store.NIOFSDirectory@/Users/jenkins/jenkins-slave/workspace/Lucene-Solr-trunk-MacOSX/solr/build/solr-core/test/J0/org.apache.solr.cloud.BasicDistributedZkTest-1359850910098/jetty1/index lockFactory=org.apache.lucene.store.NativeFSLockFactory@259bff1e; maxCacheMB=48.0 maxMergeSizeMB=4.0)),segFN=segments_1,generation=1,filenames=[segments_1]
[junit4:junit4]   2> 15057 T2371 C220 P49791 oasc.SolrDeletionPolicy.updateCommits newest commit = 1[segments_1]
[junit4:junit4]   2> 15059 T2371 C220 P49791 oasc.SolrDeletionPolicy.onCommit SolrDeletionPolicy.onCommit: commits:num=2
[junit4:junit4]   2> 		commit{dir=RateLimitedDirectoryWrapper(NRTCachingDirectory(org.apache.lucene.store.NIOFSDirectory@/Users/jenkins/jenkins-slave/workspace/Lucene-Solr-trunk-MacOSX/solr/build/solr-core/test/J0/org.apache.solr.cloud.BasicDistributedZkTest-1359850910098/jetty1/index lockFactory=org.apache.lucene.store.NativeFSLockFactory@259bff1e; maxCacheMB=48.0 maxMergeSizeMB=4.0)),segFN=segments_1,generation=1,filenames=[segments_1]
[junit4:junit4]   2> 		commit{dir=RateLimitedDirectoryWrapper(NRTCachingDirectory(org.apache.lucene.store.NIOFSDirectory@/Users/jenkins/jenkins-slave/workspace/Lucene-Solr-trunk-MacOSX/solr/build/solr-core/test/J0/org.apache.solr.cloud.BasicDistributedZkTest-1359850910098/jetty1/index lockFactory=org.apache.lucene.store.NativeFSLockFactory@259bff1e; maxCacheMB=48.0 maxMergeSizeMB=4.0)),segFN=segments_2,generation=2,filenames=[segments_2]
[junit4:junit4]   2> 15060 T2371 C220 P49791 oasc.SolrDeletionPolicy.updateCommits newest commit = 2[segments_2]
[junit4:junit4]   2> 15061 T2371 C220 P49791 oasc.CachingDirectoryFactory.close Releasing directory:/Users/jenkins/jenkins-slave/workspace/Lucene-Solr-trunk-MacOSX/solr/build/solr-core/test/J0/./org.apache.solr.cloud.BasicDistributedZkTest-1359850910098/jetty1
[junit4:junit4]   2> 15061 T2371 C220 P49791 oass.SolrIndexSearcher.<init> Opening Searcher@547fb5b6 realtime
[junit4:junit4]   2> 15061 T2371 C220 P49791 oasu.DirectUpdateHandler2.commit end_commit_flush
[junit4:junit4]   2> 15062 T2371 C220 P49791 /update {waitSearcher=true&openSearcher=false&commit=true&wt=javabin&commit_end_point=true&version=2&softCommit=false} {commit=} 0 10
[junit4:junit4]   2> 15063 T2412 C218 P49797 oash.ReplicationHandler.inform Commits will be reserved for  10000
[junit4:junit4]   2> 15063 T2412 C218 P49797 oash.SnapPuller.<init>  No value set for 'pollInterval'. Timer Task not started.
[junit4:junit4]   2> 15065 T2370 C220 P49791 oash.ReplicationHandler.inform Commits will be reserved for  10000
[junit4:junit4]   2> 15066 T2370 C220 P49791 REQ /replication {command=indexversion&qt=/replication&wt=javabin&version=2} status=0 QTime=2 
[junit4:junit4]   2> 15066 T2412 C218 P49797 oash.SnapPuller.fetchLatestIndex Master's generation: 2
[junit4:junit4]   2> 15067 T2412 C218 P49797 oash.SnapPuller.fetchLatestIndex Slave's generation: 1
[junit4:junit4]   2> 15067 T2412 C218 P49797 oash.SnapPuller.fetchLatestIndex Starting replication process
[junit4:junit4]   2> 15069 T2372 C220 P49791 oasc.CachingDirectoryFactory.close Releasing directory:/Users/jenkins/jenkins-slave/workspace/Lucene-Solr-trunk-MacOSX/solr/build/solr-core/test/J0/./org.apache.solr.cloud.BasicDistributedZkTest-1359850910098/jetty1
[junit4:junit4]   2> 15069 T2372 C220 P49791 oasc.CachingDirectoryFactory.close Releasing directory:/Users/jenkins/jenkins-slave/workspace/Lucene-Solr-trunk-MacOSX/solr/build/solr-core/test/J0/./org.apache.solr.cloud.BasicDistributedZkTest-1359850910098/jetty1/index
[junit4:junit4]   2> 15070 T2372 C220 P49791 REQ /replication {command=filelist&qt=/replication&wt=javabin&generation=2&version=2} status=0 QTime=1 
[junit4:junit4]   2> 15070 T2412 C218 P49797 oash.SnapPuller.fetchLatestIndex Number of files in latest index in master: 1
[junit4:junit4]   2> 15071 T2412 C218 P49797 oasc.CachingDirectoryFactory.get return new directory for /Users/jenkins/jenkins-slave/workspace/Lucene-Solr-trunk-MacOSX/solr/build/solr-core/test/J0/./org.apache.solr.cloud.BasicDistributedZkTest-1359850910098/jetty3/index.20130203022205162 forceNew:false
[junit4:junit4]   2> 15071 T2412 C218 P49797 oasc.CachingDirectoryFactory.close Releasing directory:/Users/jenkins/jenkins-slave/workspace/Lucene-Solr-trunk-MacOSX/solr/build/solr-core/test/J0/./org.apache.solr.cloud.BasicDistributedZkTest-1359850910098/jetty3
[junit4:junit4]   2> 15072 T2412 C218 P49797 oash.SnapPuller.fetchLatestIndex Starting download to RateLimitedDirectoryWrapper(NRTCachingDirectory(org.apache.lucene.store.NIOFSDirectory@/Users/jenkins/jenkins-slave/workspace/Lucene-Solr-trunk-MacOSX/solr/build/solr-core/test/J0/org.apache.solr.cloud.BasicDistributedZkTest-1359850910098/jetty3/index.20130203022205162 lockFactory=org.apache.lucene.store.NativeFSLockFactory@3d44b1be; maxCacheMB=48.0 maxMergeSizeMB=4.0)) fullCopy=true
[junit4:junit4]   2> 15075 T2374 C220 P49791 REQ /replication {file=segments_2&command=filecontent&checksum=true&wt=filestream&qt=/replication&generation=2} status=0 QTime=1 
[junit4:junit4]   2> 15076 T2412 C218 P49797 oasc.CachingDirectoryFactory.close Releasing directory:/Users/jenkins/jenkins-slave/workspace/Lucene-Solr-trunk-MacOSX/solr/build/solr-core/test/J0/./org.apache.solr.cloud.BasicDistributedZkTest-1359850910098/jetty3/index
[junit4:junit4]   2> 15077 T2412 C218 P49797 oash.SnapPuller.fetchLatestIndex Total time taken for download : 0 secs
[junit4:junit4]   2> 15077 T2412 C218 P49797 oash.SnapPuller.modifyIndexProps New index installed. Updating index properties... index=index.20130203022205162
[junit4:junit4]   2> 15078 T2412 C218 P49797 oasc.CachingDirectoryFactory.close Releasing directory:/Users/jenkins/jenkins-slave/workspace/Lucene-Solr-trunk-MacOSX/solr/build/solr-core/test/J0/./org.apache.solr.cloud.BasicDistributedZkTest-1359850910098/jetty3
[junit4:junit4]   2> 15078 T2412 C218 P49797 oasc.CachingDirectoryFactory.close Releasing directory:/Users/jenkins/jenkins-slave/workspace/Lucene-Solr-trunk-MacOSX/solr/build/solr-core/test/J0/./org.apache.solr.cloud.BasicDistributedZkTest-1359850910098/jetty3
[junit4:junit4]   2> 15078 T2412 C218 P49797 oasc.SolrCore.getNewIndexDir New index directory detected: old=./org.apache.solr.cloud.BasicDistributedZkTest-1359850910098/jetty3/index/ new=./org.apache.solr.cloud.BasicDistributedZkTest-1359850910098/jetty3/index.20130203022205162
[junit4:junit4]   2> 15080 T2412 C218 P49797 oasc.SolrDeletionPolicy.onInit SolrDeletionPolicy.onInit: commits:num=1
[junit4:junit4]   2> 		commit{dir=RateLimitedDirectoryWrapper(NRTCachingDirectory(org.apache.lucene.store.NIOFSDirectory@/Users/jenkins/jenkins-slave/workspace/Lucene-Solr-trunk-MacOSX/solr/build/solr-core/test/J0/org.apache.solr.cloud.BasicDistributedZkTest-1359850910098/jetty3/index.20130203022205162 lockFactory=org.apache.lucene.store.NativeFSLockFactory@3d44b1be; maxCacheMB=48.0 maxMergeSizeMB=4.0)),segFN=segments_2,generation=2,filenames=[segments_2]
[junit4:junit4]   2> 15081 T2412 C218 P49797 oasc.SolrDeletionPolicy.updateCommits newest commit = 2[segments_2]
[junit4:junit4]   2> 15082 T2412 C218 P49797 oasc.CachingDirectoryFactory.close Releasing directory:/Users/jenkins/jenkins-slave/workspace/Lucene-Solr-trunk-MacOSX/solr/build/solr-core/test/J0/./org.apache.solr.cloud.BasicDistributedZkTest-1359850910098/jetty3
[junit4:junit4]   2> 15082 T2412 C218 P49797 oasu.DefaultSolrCoreState.newIndexWriter Creating new IndexWriter...
[junit4:junit4]   2> 15083 T2412 C218 P49797 oasu.DefaultSolrCoreState.newIndexWriter Waiting until IndexWriter is unused... core=collection1
[junit4:junit4]   2> 15083 T2412 C218 P49797 oasu.DefaultSolrCoreState.newIndexWriter Rollback old IndexWriter... core=collection1
[junit4:junit4]   2> 15084 T2412 C218 P49797 oasc.CachingDirectoryFactory.close Releasing directory:/Users/jenkins/jenkins-slave/workspace/Lucene-Solr-trunk-MacOSX/solr/build/solr-core/test/J0/./org.apache.solr.cloud.BasicDistributedZkTest-1359850910098/jetty3/index.20130203022205162
[junit4:junit4]   2> 15084 T2412 C218 P49797 oasc.CachingDirectoryFactory.close Releasing directory:/Users/jenkins/jenkins-slave/workspace/Lucene-Solr-trunk-MacOSX/solr/build/solr-core/test/J0/./org.apache.solr.cloud.BasicDistributedZkTest-1359850910098/jetty3
[junit4:junit4]   2> 15086 T2412 C218 P49797 oasc.SolrDeletionPolicy.onInit SolrDeletionPolicy.onInit: commits:num=1
[junit4:junit4]   2> 		commit{dir=RateLimitedDirectoryWrapper(NRTCachingDirectory(org.apache.lucene.store.NIOFSDirectory@/Users/jenkins/jenkins-slave/workspace/Lucene-Solr-trunk-MacOSX/solr/build/solr-core/test/J0/org.apache.solr.cloud.BasicDistributedZkTest-1359850910098/jetty3/index.20130203022205162 lockFactory=org.apache.lucene.store.NativeFSLockFactory@3d44b1be; maxCacheMB=48.0 maxMergeSizeMB=4.0)),segFN=segments_2,generation=2,filenames=[segments_2]
[junit4:junit4]   2> 15086 T2412 C218 P49797 oasc.SolrDeletionPolicy.updateCommits newest commit = 2[segments_2]
[junit4:junit4]   2> 15086 T2412 C218 P49797 oasu.DefaultSolrCoreState.newIndexWriter New IndexWriter is ready to be used.
[junit4:junit4]   2> 15087 T2412 C218 P49797 oasc.CachingDirectoryFactory.close Releasing directory:/Users/jenkins/jenkins-slave/workspace/Lucene-Solr-trunk-MacOSX/solr/build/solr-core/test/J0/./org.apache.solr.cloud.BasicDistributedZkTest-1359850910098/jetty3
[junit4:junit4]   2> 15087 T2412 C218 P49797 oass.SolrIndexSearcher.<init> Opening Searcher@55f35f0b main
[junit4:junit4]   2> 15089 T2411 oasc.SolrCore.registerSearcher [collection1] Registered new searcher Searcher@55f35f0b main{StandardDirectoryReader(segments_2:1:nrt)}
[junit4:junit4]   2> 15089 T2411 oasc.CachingDirectoryFactory.close Releasing directory:/Users/jenkins/jenkins-slave/workspace/Lucene-Solr-trunk-MacOSX/solr/build/solr-core/test/J0/./org.apache.solr.cloud.BasicDistributedZkTest-1359850910098/jetty3/index
[junit4:junit4]   2> 15090 T2412 C218 P49797 oasu.DirectUpdateHandler2.commit start commit{,optimize=false,openSearcher=false,waitSearcher=false,expungeDeletes=false,softCommit=false}
[junit4:junit4]   2> 15091 T2412 C218 P49797 oasc.SolrDeletionPolicy.onCommit SolrDeletionPolicy.onCommit: commits:num=2
[junit4:junit4]   2> 		commit{dir=RateLimitedDirectoryWrapper(NRTCachingDirectory(org.apache.lucene.store.NIOFSDirectory@/Users/jenkins/jenkins-slave/workspace/Lucene-Solr-trunk-MacOSX/solr/build/solr-core/test/J0/org.apache.solr.cloud.BasicDistributedZkTest-1359850910098/jetty3/index.20130203022205162 lockFactory=org.apache.lucene.store.NativeFSLockFactory@3d44b1be; maxCacheMB=48.0 maxMergeSizeMB=4.0)),segFN=segments_2,generation=2,filenames=[segments_2]
[junit4:junit4]   2> 		commit{dir=RateLimitedDirectoryWrapper(NRTCachingDirectory(org.apache.lucene.store.NIOFSDirectory@/Users/jenkins/jenkins-slave/workspace/Lucene-Solr-trunk-MacOSX/solr/build/solr-core/test/J0/org.apache.solr.cloud.BasicDistributedZkTest-1359850910098/jetty3/index.20130203022205162 lockFactory=org.apache.lucene.store.NativeFSLockFactory@3d44b1be; maxCacheMB=48.0 maxMergeSizeMB=4.0)),segFN=segments_3,generation=3,filenames=[segments_3]
[junit4:junit4]   2> 15091 T2412 C218 P49797 oasc.SolrDeletionPolicy.updateCommits newest commit = 3[segments_3]
[junit4:junit4]   2> 15093 T2412 C218 P49797 oasc.CachingDirectoryFactory.close Releasing directory:/Users/jenkins/jenkins-slave/workspace/Lucene-Solr-trunk-MacOSX/solr/build/solr-core/test/J0/./org.apache.solr.cloud.BasicDistributedZkTest-1359850910098/jetty3
[junit4:junit4]   2> 15093 T2412 C218 P49797 oasu.DirectUpdateHandler2.commit end_commit_flush
[junit4:junit4]   2> 15093 T2412 C218 P49797 oasc.CachingDirectoryFactory.close Releasing directory:/Users/jenkins/jenkins-slave/workspace/Lucene-Solr-trunk-MacOSX/solr/build/solr-core/test/J0/./org.apache.solr.cloud.BasicDistributedZkTest-1359850910098/jetty3/index.20130203022205162
[junit4:junit4]   2> 15093 T2412 C218 P49797 oasc.CachingDirectoryFactory.close Releasing directory:/Users/jenkins/jenkins-slave/workspace/Lucene-Solr-trunk-MacOSX/solr/build/solr-core/test/J0/./org.apache.solr.cloud.BasicDistributedZkTest-1359850910098/jetty3/index
[junit4:junit4]   2> 15094 T2412 C218 P49797 oasc.RecoveryStrategy.replay No replay needed. core=collection1
[junit4:junit4]   2> 15094 T2412 C218 P49797 oasc.RecoveryStrategy.doRecovery Replication Recovery was successful - registering as Active. core=collection1
[junit4:junit4]   2> 15094 T2412 C218 P49797 oasc.ZkController.publish publishing core=collection1 state=active
[junit4:junit4]   2> 15094 T2412 C218 P49797 oasc.ZkController.publish numShards not found on descriptor - reading it from system property
[junit4:junit4]   2> 15096 T2412 C218 P49797 oasc.RecoveryStrategy.doRecovery Finished recovery process. core=collection1
[junit4:junit4]   2> 15705 T2338 oascc.ZkStateReader.updateClusterState Updating cloud state from ZooKeeper... 
[junit4:junit4]   2> 15809 T2361 oascc.ZkStateReader.updateClusterState Updating cloud state from ZooKeeper... 
[junit4:junit4]   2> 15811 T2361 oasc.Overseer$ClusterStateUpdater.updateState Update state numShards=2 message={
[junit4:junit4]   2> 	  "operation":"state",
[junit4:junit4]   2> 	  "numShards":"2",
[junit4:junit4]   2> 	  "shard":"shard2",
[junit4:junit4]   2> 	  "roles":null,
[junit4:junit4]   2> 	  "state":"recovering",
[junit4:junit4]   2> 	  "core":"collection1",
[junit4:junit4]   2> 	  "collection":"collection1",
[junit4:junit4]   2> 	  "node_name":"127.0.0.1:49801_",
[junit4:junit4]   2> 	  "base_url":"http://127.0.0.1:49801"}
[junit4:junit4]   2> 15816 T2361 oasc.Overseer$ClusterStateUpdater.updateState Update state numShards=2 message={
[junit4:junit4]   2> 	  "operation":"state",
[junit4:junit4]   2> 	  "numShards":"2",
[junit4:junit4]   2> 	  "shard":"shard1",
[junit4:junit4]   2> 	  "roles":null,
[junit4:junit4]   2> 	  "state":"active",
[junit4:junit4]   2> 	  "core":"collection1",
[junit4:junit4]   2> 	  "collection":"collection1",
[junit4:junit4]   2> 	  "node_name":"127.0.0.1:49797_",
[junit4:junit4]   2> 	  "base_url":"http://127.0.0.1:49797"}
[junit4:junit4]   2> 15822 T2425 oascc.ZkStateReader$2.process A cluster state change: WatchedEvent state:SyncConnected type:NodeDataChanged path:/clusterstate.json, has occurred - updating... (live nodes size: 5)
[junit4:junit4]   2> 15822 T2366 oascc.ZkStateReader$2.process A cluster state change: WatchedEvent state:SyncConnected type:NodeDataChanged path:/clusterstate.json, has occurred - updating... (live nodes size: 5)
[junit4:junit4]   2> 15822 T2394 oascc.ZkStateReader$2.process A cluster state change: WatchedEvent state:SyncConnected type:NodeDataChanged path:/clusterstate.json, has occurred - updating... (live nodes size: 5)
[junit4:junit4]   2> 15822 T2409 oascc.ZkStateReader$2.process A cluster state change: WatchedEvent state:SyncConnected type:NodeDataChanged path:/clusterstate.json, has occurred - updating... (live nodes size: 5)
[junit4:junit4]   2> 15822 T2379 oascc.ZkStateReader$2.process A cluster state change: WatchedEvent state:SyncConnected type:NodeDataChanged path:/clusterstate.json, has occurred - updating... (live nodes size: 5)
[junit4:junit4]   2> 15822 T2360 oascc.ZkStateReader$2.process A cluster state change: WatchedEvent state:SyncConnected type:NodeDataChanged path:/clusterstate.json, has occurred - updating... (live nodes size: 5)
[junit4:junit4]   2> 16709 T2338 oascc.ZkStateReader.updateClusterState Updating cloud state from ZooKeeper... 
[junit4:junit4]   2> 17713 T2338 oascc.ZkStateReader.updateClusterState Updating cloud state from ZooKeeper... 
[junit4:junit4]   2>  C219_STATE=coll:collection1 core:collection1 props:{shard=shard2, roles=null, state=recovering, core=collection1, collection=collection1, node_name=127.0.0.1:49801_, base_url=http://127.0.0.1:49801}
[junit4:junit4]   2> 18707 T2428 C219 P49801 oasc.RecoveryStrategy.doRecovery Attempting to PeerSync from http://127.0.0.1:49794/collection1/ core=collection1 - recoveringAfterStartup=true
[junit4:junit4]   2> 18707 T2428 C219 P49801 oasu.PeerSync.sync PeerSync: core=collection1 url=http://127.0.0.1:49801 START replicas=[http://127.0.0.1:49794/collection1/] nUpdates=100
[junit4:junit4]   2> 18708 T2428 C219 P49801 oasu.PeerSync.sync WARNING no frame of reference to tell of we've missed updates
[junit4:junit4]   2> 18708 T2428 C219 P49801 oasc.RecoveryStrategy.doRecovery PeerSync Recovery was not successful - trying replication. core=collection1
[junit4:junit4]   2> 18708 T2428 C219 P49801 oasc.RecoveryStrategy.doRecovery Starting Replication Recovery. core=collection1
[junit4:junit4]   2> 18708 T2428 C219 P49801 oasc.RecoveryStrategy.doRecovery Begin buffering updates. core=collection1
[junit4:junit4]   2> 18708 T2428 C219 P49801 oasu.UpdateLog.bufferUpdates Starting to buffer updates. FSUpdateLog{state=ACTIVE, tlog=null}
[junit4:junit4]   2> 18709 T2428 C219 P49801 oasc.RecoveryStrategy.replicate Attempting to replicate from http://127.0.0.1:49794/collection1/. core=collection1
[junit4:junit4]   2> 18710 T2428 C219 P49801 oascsi.HttpClientUtil.createClient Creating new http client, config:maxConnections=128&maxConnectionsPerHost=32&followRedirects=false
[junit4:junit4]   2> ASYNC  NEW_CORE C221 name=collection1 org.apache.solr.core.SolrCore@4a2d4ee5 url=http://127.0.0.1:49794/collection1 node=127.0.0.1:49794_ C221_STATE=coll:collection1 core:collection1 props:{shard=shard2, roles=null, state=active, core=collection1, collection=collection1, node_name=127.0.0.1:49794_, base_url=http://127.0.0.1:49794, leader=true}
[junit4:junit4]   2> 18715 T2386 C221 P49794 REQ /get {getVersions=100&distrib=false&wt=javabin&qt=/get&version=2} status=0 QTime=0 
[junit4:junit4]   2> 18717 T2338 oascc.ZkStateReader.updateClusterState Updating cloud state from ZooKeeper... 
[junit4:junit4]   2> 18719 T2387 C221 P49794 oasu.DirectUpdateHandler2.commit start commit{,optimize=false,openSearcher=false,waitSearcher=true,expungeDeletes=false,softCommit=false}
[junit4:junit4]   2> 18720 T2387 C221 P49794 oasc.CachingDirectoryFactory.close Releasing directory:/Users/jenkins/jenkins-slave/workspace/Lucene-Solr-trunk-MacOSX/solr/build/solr-core/test/J0/./org.apache.solr.cloud.BasicDistributedZkTest-1359850910098/jetty2
[junit4:junit4]   2> 18722 T2387 C221 P49794 oasc.SolrDeletionPolicy.onInit SolrDeletionPolicy.onInit: commits:num=1
[junit4:junit4]   2> 		commit{dir=RateLimitedDirectoryWrapper(NRTCachingDirectory(org.apache.lucene.store.NIOFSDirectory@/Users/jenkins/jenkins-slave/workspace/Lucene-Solr-trunk-MacOSX/solr/build/solr-core/test/J0/org.apache.solr.cloud.BasicDistributedZkTest-1359850910098/jetty2/index lockFactory=org.apache.lucene.store.NativeFSLockFactory@23f3ef77; maxCacheMB=48.0 maxMergeSizeMB=4.0)),segFN=segments_1,generation=1,filenames=[segments_1]
[junit4:junit4]   2> 18723 T2387 C221 P49794 oasc.SolrDeletionPolicy.updateCommits newest commit = 1[segments_1]
[junit4:junit4]   2> 18725 T2387 C221 P49794 oasc.SolrDeletionPolicy.onCommit SolrDeletionPolicy.onCommit: commits:num=2
[junit4:junit4]   2> 		commit{dir=RateLimitedDirectoryWrapper(NRTCachingDirectory(org.apache.lucene.store.NIOFSDirectory@/Users/jenkins/jenkins-slave/workspace/Lucene-Solr-trunk-MacOSX/solr/build/solr-core/test/J0/org.apache.solr.cloud.BasicDistributedZkTest-1359850910098/jetty2/index lockFactory=org.apache.lucene.store.NativeFSLockFactory@23f3ef77; maxCacheMB=48.0 maxMergeSizeMB=4.0)),segFN=segments_1,generation=1,filenames=[segments_1]
[junit4:junit4]   2> 		commit{dir=RateLimitedDirectoryWrapper(NRTCachingDirectory(org.apache.lucene.store.NIOFSDirectory@/Users/jenkins/jenkins-slave/workspace/Lucene-Solr-trunk-MacOSX/solr/build/solr-core/test/J0/org.apache.solr.cloud.BasicDistributedZkTest-1359850910098/jetty2/index lockFactory=org.apache.lucene.store.NativeFSLockFactory@23f3ef77; maxCacheMB=48.0 maxMergeSizeMB=4.0)),segFN=segments_2,generation=2,filenames=[segments_2]
[junit4:junit4]   2> 18726 T2387 C221 P49794 oasc.SolrDeletionPolicy.updateCommits newest commit = 2[segments_2]
[junit4:junit4]   2> 18726 T2387 C221 P49794 oasc.CachingDirectoryFactory.close Releasing directory:/Users/jenkins/jenkins-slave/workspace/Lucene-Solr-trunk-MacOSX/solr/build/solr-core/test/J0/./org.apache.solr.cloud.BasicDistributedZkTest-1359850910098/jetty2
[junit4:junit4]   2> 18727 T2387 C221 P49794 oass.SolrIndexSearcher.<init> Opening Searcher@6bae898c realtime
[junit4:junit4]   2> 18727 T2387 C221 P49794 oasu.DirectUpdateHandler2.commit end_commit_flush
[junit4:junit4]   2> 18727 T2387 C221 P49794 /update {waitSearcher=true&openSearcher=false&commit=true&wt=javabin&commit_end_point=true&version=2&softCommit=false} {commit=} 0 8
[junit4:junit4]   2> 18728 T2428 C219 P49801 oash.ReplicationHandler.inform Commits will be reserved for  10000
[junit4:junit4]   2> 18728 T2428 C219 P49801 oash.SnapPuller.<init>  No value set for 'pollInterval'. Timer Task not started.
[junit4:junit4]   2> 18730 T2389 C221 P49794 oash.ReplicationHandler.inform Commits will be reserved for  10000
[junit4:junit4]   2> 18731 T2389 C221 P49794 REQ /replication {command=indexversion&qt=/replication&wt=javabin&version=2} status=0 QTime=1 
[junit4:junit4]   2> 18732 T2428 C219 P49801 oash.SnapPuller.fetchLatestIndex Master's generation: 2
[junit4:junit4]   2> 18732 T2428 C219 P49801 oash.SnapPuller.fetchLatestIndex Slave's generation: 1
[junit4:junit4]   2> 18732 T2428 C219 P49801 oash.SnapPuller.fetchLatestIndex Starting replication process
[junit4:junit4]   2> 18736 T2390 C221 P49794 oasc.CachingDirectoryFactory.close Releasing directory:/Users/jenkins/jenkins-slave/workspace/Lucene-Solr-trunk-MacOSX/solr/build/solr-core/test/J0/./org.apache.solr.cloud.BasicDistributedZkTest-1359850910098/jetty2
[junit4:junit4]   2> 18737 T2390 C221 P49794 oasc.CachingDirectoryFactory.close Releasing directory:/Users/jenkins/jenkins-slave/workspace/Lucene-Solr-trunk-MacOSX/solr/build/solr-core/test/J0/./org.apache.solr.cloud.BasicDistributedZkTest-1359850910098/jetty2/index
[junit4:junit4]   2> 18737 T2390 C221 P49794 REQ /replication {command=filelist&qt=/replication&wt=javabin&generation=2&version=2} status=0 QTime=1 
[junit4:junit4]   2> 18738 T2428 C219 P49801 oash.SnapPuller.fetchLatestIndex Number of files in latest index in master: 1
[junit4:junit4]   2> 18738 T2428 C219 P49801 oasc.CachingDirectoryFactory.get return new directory for /Users/jenkins/jenkins-slave/workspace/Lucene-Solr-trunk-MacOSX/solr/build/solr-core/test/J0/./org.apache.solr.cloud.BasicDistributedZkTest-1359850910098/jetty4/index.20130203022208829 forceNew:false
[junit4:junit4]   2> 18739 T2428 C219 P49801 oasc.CachingDirectoryFactory.close Releasing directory:/Users/jenkins/jenkins-slave/workspace/Lucene-Solr-trunk-MacOSX/solr/build/solr-core/test/J0/./org.apache.solr.cloud.BasicDistributedZkTest-1359850910098/jetty4
[junit4:junit4]   2> 18739 T2428 C219 P49801 oash.SnapPuller.fetchLatestIndex Starting download to RateLimitedDirectoryWrapper(NRTCachingDirectory(org.apache.lucene.store.NIOFSDirectory@/Users/jenkins/jenkins-slave/workspace/Lucene-Solr-trunk-MacOSX/solr/build/solr-core/test/J0/org.apache.solr.cloud.BasicDistributedZkTest-1359850910098/jetty4/index.20130203022208829 lockFactory=org.apache.lucene.store.NativeFSLockFactory@555857fc; maxCacheMB=48.0 maxMergeSizeMB=4.0)) fullCopy=true
[junit4:junit4]   2> 18742 T2386 C221 P49794 REQ /replication {file=segments_2&command=filecontent&checksum=true&wt=filestream&qt=/replication&generation=2} status=0 QTime=0 
[junit4:junit4]   2> 18744 T2428 C219 P49801 oasc.CachingDirectoryFactory.close Releasing directory:/Users/jenkins/jenkins-slave/workspace/Lucene-Solr-trunk-MacOSX/solr/build/solr-core/test/J0/./org.apache.solr.cloud.BasicDistributedZkTest-1359850910098/jetty4/index
[junit4:junit4]   2> 18745 T2428 C219 P49801 oash.SnapPuller.fetchLatestIndex Total time taken for download : 0 secs
[junit4:junit4]   2> 18745 T2428 C219 P49801 oash.SnapPuller.modifyIndexProps New index installed. Updating index properties... index=index.20130203022208829
[junit4:junit4]   2> 18746 T2428 C219 P49801 oasc.CachingDirectoryFactory.close Releasing directory:/Users/jenkins/jenkins-slave/workspace/Lucene-Solr-trunk-MacOSX/solr/build/solr-core/test/J0/./org.apache.solr.cloud.BasicDistributedZkTest-1359850910098/jetty4
[junit4:junit4]   2> 18746 T2428 C219 P49801 oasc.CachingDirectoryFactory.close Releasing directory:/Users/jenkins/jenkins-slave/workspace/Lucene-Solr-trunk-MacOSX/solr/build/solr-core/test/J0/./org.apache.solr.cloud.BasicDistributedZkTest-1359850910098/jetty4
[junit4:junit4]   2> 18746 T2428 C219 P49801 oasc.SolrCore.getNewIndexDir New index directory detected: old=./org.apache.solr.cloud.BasicDistributedZkTest-1359850910098/jetty4/index/ new=./org.apache.solr.cloud.BasicDistributedZkTest-1359850910098/jetty4/index.20130203022208829
[junit4:junit4]   2> 18748 T2428 C219 P49801 oasc.SolrDeletionPolicy.onInit SolrDeletionPolicy.onInit: commits:num=1
[junit4:junit4]   2> 		commit{dir=RateLimitedDirectoryWrapper(NRTCachingDirectory(org.apache.lucene.store.NIOFSDirectory@/Users/jenkins/jenkins-slave/workspace/Lucene-Solr-trunk-MacOSX/solr/build/solr-core/test/J0/org.apache.solr.cloud.BasicDistributedZkTest-1359850910098/jetty4/index.20130203022208829 lockFactory=org.apache.lucene.store.NativeFSLockFactory@555857fc; maxCacheMB=48.0 maxMergeSizeMB=4.0)),segFN=segments_2,generation=2,filenames=[segments_2]
[junit4:junit4]   2> 18749 T2428 C219 P49801 oasc.SolrDeletionPolicy.updateCommits newest commit = 2[segments_2]
[junit4:junit4]   2> 18750 T2428 C219 P49801 oasc.CachingDirectoryFactory.close Releasing directory:/Users/jenkins/jenkins-slave/workspace/Lucene-Solr-trunk-MacOSX/solr/build/solr-core/test/J0/./org.apache.solr.cloud.BasicDistributedZkTest-1359850910098/jetty4
[junit4:junit4]   2> 18750 T2428 C219 P49801 oasu.DefaultSolrCoreState.newIndexWriter Creating new IndexWriter...
[junit4:junit4]   2> 18751 T2428 C219 P49801 oasu.DefaultSolrCoreState.newIndexWriter Waiting until IndexWriter is unused... core=collection1
[junit4:junit4]   2> 18751 T2428 C219 P49801 oasu.DefaultSolrCoreState.newIndexWriter Rollback old IndexWriter... core=collection1
[junit4:junit4]   2> 18751 T2428 C219 P49801 oasc.CachingDirectoryFactory.close Releasing directory:/Users/jenkins/jenkins-slave/workspace/Lucene-Solr-trunk-MacOSX/solr/build/solr-core/test/J0/./org.apache.solr.cloud.BasicDistributedZkTest-1359850910098/jetty4/index.20130203022208829
[junit4:junit4]   2> 18752 T2428 C219 P49801 oasc.CachingDirectoryFactory.close Releasing directory:/Users/jenkins/jenkins-slave/workspace/Lucene-Solr-trunk-MacOSX/solr/build/solr-core/test/J0/./org.apache.solr.cloud.BasicDistributedZkTest-1359850910098/jetty4
[junit4:junit4]   2> 18756 T2428 C219 P49801 oasc.SolrDeletionPolicy.onInit SolrDeletionPolicy.onInit: commits:num=1
[junit4:junit4]   2> 		commit{dir=RateLimitedDirectoryWrapper(NRTCachingDirectory(org.apache.lucene.store.NIOFSDirectory@/Users/jenkins/jenkins-slave/workspace/Lucene-Solr-trunk-MacOSX/solr/build/solr-core/test/J0/org.apache.solr.cloud.BasicDistributedZkTest-1359850910098/jetty4/index.20130203022208829 lockFactory=org.apache.lucene.store.NativeFSLockFactory@555857fc; maxCacheMB=48.0 maxMergeSizeMB=4.0)),segFN=segments_2,generation=2,filenames=[segments_2]
[junit4:junit4]   2> 18756 T2428 C219 P49801 oasc.SolrDeletionPolicy.updateCommits newest commit = 2[segments_2]
[junit4:junit4]   2> 18757 T2428 C219 P49801 oasu.DefaultSolrCoreState.newIndexWriter New IndexWriter is ready to be used.
[junit4:junit4]   2> 18757 T2428 C219 P49801 oasc.CachingDirectoryFactory.close Releasing directory:/Users/jenkins/jenkins-slave/workspace/Lucene-Solr-trunk-MacOSX/solr/build/solr-core/test/J0/./org.apache.solr.cloud.BasicDistributedZkTest-1359850910098/jetty4
[junit4:junit4]   2> 18758 T2428 C219 P49801 oass.SolrIndexSearcher.<init> Opening Searcher@7275e6e2 main
[junit4:junit4]   2> 18760 T2427 oasc.SolrCore.registerSearcher [collection1] Registered new searcher Searcher@7275e6e2 main{StandardDirectoryReader(segments_2:1:nrt)}
[junit4:junit4]   2> 18760 T2427 oasc.CachingDirectoryFactory.close Releasing directory:/Users/jenkins/jenkins-slave/workspace/Lucene-Solr-trunk-MacOSX/solr/build/solr-core/test/J0/./org.apache.solr.cloud.BasicDistributedZkTest-1359850910098/jetty4/index
[junit4:junit4]   2> 18761 T2428 C219 P49801 oasu.DirectUpdateHandler2.commit start commit{,optimize=false,openSearcher=false,waitSearcher=false,expungeDeletes=false,softCommit=false}
[junit4:junit4]   2> 18763 T2428 C219 P49801 oasc.SolrDeletionPolicy.onCommit SolrDeletionPolicy.onCommit: commits:num=2
[junit4:junit4]   2> 		commit{dir=RateLimitedDirectoryWrapper(NRTCachingDirectory(org.apache.lucene.store.NIOFSDirectory@/Users/jenkins/jenkins-slave/workspace/Lucene-Solr-trunk-MacOSX/solr/build/solr-core/test/J0/org.apache.solr.cloud.BasicDistributedZkTest-1359850910098/jetty4/index.20130203022208829 lockFactory=org.apache.lucene.store.NativeFSLockFactory@555857fc; maxCacheMB=48.0 maxMergeSizeMB=4.0)),segFN=segments_2,generation=2,filenames=[segments_2]
[junit4:junit4]   2> 		commit{dir=RateLimitedDirectoryWrapper(NRTCachingDirectory(org.apache.lucene.store.NIOFSDirectory@/Users/jenkins/jenkins-slave/workspace/Lucene-Solr-trunk-MacOSX/solr/build/solr-core/test/J0/org.apache.solr.cloud.BasicDistributedZkTest-1359850910098/jetty4/index.20130203022208829 lockFactory=org.apache.lucene.store.NativeFSLockFactory@555857fc; maxCacheMB=48.0 maxMergeSizeMB=4.0)),segFN=segments_3,generation=3,filenames=[segments_3]
[junit4:junit4]   2> 18763 T2428 C219 P49801 oasc.SolrDeletionPolicy.updateCommits newest commit = 3[segments_3]
[junit4:junit4]   2> 18764 T2428 C219 P49801 oasc.CachingDirectoryFactory.close Releasing directory:/Users/jenkins/jenkins-slave/workspace/Lucene-Solr-trunk-MacOSX/solr/build/solr-core/test/J0/./org.apache.solr.cloud.BasicDistributedZkTest-1359850910098/jetty4
[junit4:junit4]   2> 18764 T2428 C219 P49801 oasu.DirectUpdateHandler2.commit end_commit_flush
[junit4:junit4]   2> 18765 T2428 C219 P49801 oasc.CachingDirectoryFactory.close Releasing directory:/Users/jenkins/jenkins-slave/workspace/Lucene-Solr-trunk-MacOSX/solr/build/solr-core/test/J0/./org.apache.solr.cloud.BasicDistributedZkTest-1359850910098/jetty4/index.20130203022208829
[junit4:junit4]   2> 18765 T2428 C219 P49801 oasc.CachingDirectoryFactory.close Releasing directory:/Users/jenkins/jenkins-slave/workspace/Lucene-Solr-trunk-MacOSX/solr/build/solr-core/test/J0/./org.apache.solr.cloud.BasicDistributedZkTest-1359850910098/jetty4/index
[junit4:junit4]   2> 18765 T2428 C219 P49801 oasc.RecoveryStrategy.replay No replay needed. core=collection1
[junit4:junit4]   2> 18765 T2428 C219 P49801 oasc.RecoveryStrategy.doRecovery Replication Recovery was successful - registering as Active. core=collection1
[junit4:junit4]   2> 18766 T2428 C219 P49801 oasc.ZkController.publish publishing core=collection1 state=active
[junit4:junit4]   2> 18766 T2428 C219 P49801 oasc.ZkController.publish numShards not found on descriptor - reading it from system property
[junit4:junit4]   2> 18768 T2428 C219 P49801 oasc.RecoveryStrategy.doRecovery Finished recovery process. core=collection1
[junit4:junit4]   2> 18843 T2361 oascc.ZkStateReader.updateClusterState Updating cloud state from ZooKeeper... 
[junit4:junit4]   2> 18844 T2361 oasc.Overseer$ClusterStateUpdater.updateState Update state numShards=2 message={
[junit4:junit4]   2> 	  "operation":"state",
[junit4:junit4]   2> 	  "numShards":"2",
[junit4:junit4]   2> 	  "shard":"shard2",
[junit4:junit4]   2> 	  "roles":null,
[junit4:junit4]   2> 	  "state":"active",
[junit4:junit4]   2> 	  "core":"collection1",
[junit4:junit4]   2> 	  "collection":"collection1",
[junit4:junit4]   2> 	  "node_name":"127.0.0.1:49801_",
[junit4:junit4]   2> 	  "base_url":"http://127.0.0.1:49801"}
[junit4:junit4]   2> 18856 T2425 oascc.ZkStateReader$2.process A cluster state change: WatchedEvent state:SyncConnected type:NodeDataChanged path:/clusterstate.json, has occurred - updating... (live nodes size: 5)
[junit4:junit4]   2> 18856 T2394 oascc.ZkStateReader$2.process A cluster state change: WatchedEvent state:SyncConnected type:NodeDataChanged path:/clusterstate.json, has occurred - updating... (live nodes size: 5)
[junit4:junit4]   2> 18856 T2379 oascc.ZkStateReader$2.process A cluster state change: WatchedEvent state:SyncConnected type:NodeDataChanged path:/clusterstate.json, has occurred - updating... (live nodes size: 5)
[junit4:junit4]   2> 18857 T2360 oascc.ZkStateReader$2.process A cluster state change: WatchedEvent state:SyncConnected type:NodeDataChanged path:/clusterstate.json, has occurred - updating... (live nodes size: 5)
[junit4:junit4]   2> 18856 T2409 oascc.ZkStateReader$2.process A cluster state change: WatchedEvent state:SyncConnected type:NodeDataChanged path:/clusterstate.json, has occurred - updating... (live nodes size: 5)
[junit4:junit4]   2> 18856 T2366 oascc.ZkStateReader$2.process A cluster state change: WatchedEvent state:SyncConnected type:NodeDataChanged path:/clusterstate.json, has occurred - updating... (live nodes size: 5)
[junit4:junit4]   2> 19722 T2338 oascc.ZkStateReader.updateClusterState Updating cloud state from ZooKeeper... 
[junit4:junit4]   2> 19723 T2338 oasc.AbstractDistribZkTestBase.waitForRecoveriesToFinish Recoveries finished - collection: collection1
[junit4:junit4]   2> ASYNC  NEW_CORE C222 name=collection1 org.apache.solr.core.SolrCore@5f2e3cae url=http://127.0.0.1:49787/collection1 node=127.0.0.1:49787_ C222_STATE=coll:control_collection core:collection1 props:{shard=shard1, roles=null, state=active, core=collection1, collection=control_collection, node_name=127.0.0.1:49787_, base_url=http://127.0.0.1:49787, leader=true}
[junit4:junit4]   2> 19734 T2356 C222 P49787 oasc.CachingDirectoryFactory.close Releasing directory:/Users/jenkins/jenkins-slave/workspace/Lucene-Solr-trunk-MacOSX/solr/build/solr-core/test/J0/./org.apache.solr.cloud.BasicDistributedZkTest-1359850910098/control/data
[junit4:junit4]   2> 19738 T2356 C222 P49787 oasc.SolrDeletionPolicy.onInit SolrDeletionPolicy.onInit: commits:num=1
[junit4:junit4]   2> 		commit{dir=RateLimitedDirectoryWrapper(NRTCachingDirectory(org.apache.lucene.store.NIOFSDirectory@/Users/jenkins/jenkins-slave/workspace/Lucene-Solr-trunk-MacOSX/solr/build/solr-core/test/J0/org.apache.solr.cloud.BasicDistributedZkTest-1359850910098/control/data/index lockFactory=org.apache.lucene.store.NativeFSLockFactory@3c8c03ae; maxCacheMB=48.0 maxMergeSizeMB=4.0)),segFN=segments_1,generation=1,filenames=[segments_1]
[junit4:junit4]   2> 19739 T2356 C222 P49787 oasc.SolrDeletionPolicy.updateCommits newest commit = 1[segments_1]
[junit4:junit4]   2> 19740 T2356 C222 P49787 oasc.CachingDirectoryFactory.close Releasing directory:/Users/jenkins/jenkins-slave/workspace/Lucene-Solr-trunk-MacOSX/solr/build/solr-core/test/J0/./org.apache.solr.cloud.BasicDistributedZkTest-1359850910098/control/data
[junit4:junit4]   2> 19741 T2356 C222 P49787 oass.SolrIndexSearcher.<init> Opening Searcher@77f70d3a realtime
[junit4:junit4]   2> 19741 T2356 C222 P49787 /update {wt=javabin&version=2} {deleteByQuery=*:* (-1425907048591130624)} 0 8
[junit4:junit4]   2> 19746 T2374 C220 P49791 oasc.CachingDirectoryFactory.close Releasing directory:/Users/jenkins/jenkins-slave/workspace/Lucene-Solr-trunk-MacOSX/solr/build/solr-core/test/J0/./org.apache.solr.cloud.BasicDistributedZkTest-1359850910098/jetty1
[junit4:junit4]   2> 19754 T2388 C221 P49794 oasc.CachingDirectoryFactory.close Releasing directory:/Users/jenkins/jenkins-slave/workspace/Lucene-Solr-trunk-MacOSX/solr/build/solr-core/test/J0/./org.apache.solr.cloud.BasicDistributedZkTest-1359850910098/jetty2
[junit4:junit4]   2>  C218_STATE=coll:collection1 core:collection1 props:{shard=shard1, roles=null, state=active, core=collection1, collection=collection1, node_name=127.0.0.1:49797_, base_url=http://127.0.0.1:49797}
[junit4:junit4]   2> 19762 T2400 C218 P49797 oasc.CachingDirectoryFactory.close Releasing directory:/Users/jenkins/jenkins-slave/workspace/Lucene-Solr-trunk-MacOSX/solr/build/solr-core/test/J0/./org.apache.solr.cloud.BasicDistributedZkTest-1359850910098/jetty3
[junit4:junit4]   2> 19763 T2400 C218 P49797 /update {update.distrib=FROMLEADER&_version_=-1425907048602664960&update.from=http://127.0.0.1:49791/collection1/&wt=javabin&version=2} {deleteByQuery=*:* (-1425907048602664960)} 0 3
[junit4:junit4]   2>  C219_STATE=coll:collection1 core:collection1 props:{shard=shard2, roles=null, state=active, core=collection1, collection=collection1, node_name=127.0.0.1:49801_, base_url=http://127.0.0.1:49801}
[junit4:junit4]   2> 19767 T2416 C219 P49801 oasc.CachingDirectoryFactory.close Releasing directory:/Users/jenkins/jenkins-slave/workspace/Lucene-Solr-trunk-MacOSX/solr/build/solr-core/test/J0/./org.apache.solr.cloud.BasicDistributedZkTest-1359850910098/jetty4
[junit4:junit4]   2> 19768 T2416 C219 P49801 /update {update.distrib=FROMLEADER&_version_=-1425907048611053568&update.from=http://127.0.0.1:49794/collection1/&wt=javabin&version=2} {deleteByQuery=*:* (-1425907048611053568)} 0 3
[junit4:junit4]   2> 19769 T2388 C221 P49794 /update {update.distrib=TOLEADER&wt=javabin&version=2} {deleteByQuery=*:* (-1425907048611053568)} 0 17
[junit4:junit4]   2> 19770 T2374 C220 P49791 /update {wt=javabin&version=2} {deleteByQuery=*:* (-1425907048602664960)} 0 26
[junit4:junit4]   2> 19779 T2351 C222 P49787 /update {wt=javabin&version=2} {add=[1 (1425907048636219392)]} 0 4
[junit4:junit4]   2> 19791 T2401 C218 P49797 /update {distrib.from=http://127.0.0.1:49791/collection1/&update.distrib=FROMLEADER&wt=javabin&version=2} {add=[1 (1425907048642510848)]} 0 3
[junit4:junit4]   2> 19792 T2373 C220 P49791 /update {wt=javabin&version=2} {add=[1 (1425907048642510848)]} 0 10
[junit4:junit4]   2> 19797 T2353 C222 P49787 /update {wt=javabin&version=2} {add=[2 (1425907048656142336)]} 0 2
[junit4:junit4]   2> 19822 T2417 C219 P49801 /update {distrib.from=http://127.0.0.1:49794/collection1/&update.distrib=FROMLEADER&wt=javabin&version=2} {add=[2 (1425907048667676672)]} 0 8
[junit4:junit4]   2> 19824 T2389 C221 P49794 /update {distrib.from=http://127.0.0.1:49791/collection1/&update.distrib=TOLEADER&wt=javabin&version=2} {add=[2 (1425907048667676672)]} 0 18
[junit4:junit4]   2> 19826 T2371 C220 P49791 /update {wt=javabin&version=2} {add=[2]} 0 26
[junit4:junit4]   2> 19836 T2354 C222 P49787 /update {wt=javabin&version=2} {add=[3 (1425907048695988224)]} 0 3
[junit4:junit4]   2> 19845 T2418 C219 P49801 /update {distrib.from=http://127.0.0.1:49794/collection1/&update.distrib=FROMLEADER&wt=javabin&version=2} {add=[3 (1425907048702279680)]} 0 2
[junit4:junit4]   2> 19846 T2390 C221 P49794 /update {wt=javabin&version=2} {add=[3 (1425907048702279680)]} 0 7
[junit4:junit4]   2> 19852 T2355 C222 P49787 /update {wt=javabin&version=2} {add=[4 (1425907048713814016)]} 0 2
[junit4:junit4]   2> 19861 T2402 C218 P49797 /update {distrib.from=http://127.0.0.1:49791/collection1/&update.distrib=FROMLEADER&wt=javabin&version=2} {add=[4 (1425907048720105472)]} 0 1
[junit4:junit4]   2> 19862 T2375 C220 P49791 /update {wt=javabin&version=2} {add=[4 (1425907048720105472)]} 0 6
[junit4:junit4]   2> 19867 T2356 C222 P49787 /update {wt=javabin&version=2} {add=[5 (1425907048730591232)]} 0 1
[junit4:junit4]   2> 19875 T2419 C219 P49801 /update {distrib.from=http://127.0.0.1:49794/collection1/&update.distrib=FROMLEADER&wt=javabin&version=2} {add=[5 (1425907048734785536)]} 0 1
[junit4:junit4]   2> 19876 T2386 C221 P49794 /update {wt=javabin&version=2} {add=[5 (1425907048734785536)]} 0 6
[junit4:junit4]   2> 19881 T2352 C222 P49787 /update {wt=javabin&version=2} {add=[6 (1425907048745271296)]} 0 1
[junit4:junit4]   2> 19897 T2421 C219 P49801 /update {distrib.from=http://127.0.0.1:49794/collection1/&update.distrib=FROMLEADER&wt=javabin&version=2} {add=[6 (1425907048752611328)]} 0 1
[junit4:junit4]   2> 19898 T2385 C221 P49794 /update {distrib.from=http://127.0.0.1:49791/collection1/&update.distrib=TOLEADER&wt=javabin&version=2} {add=[6 (1425907048752611328)]} 0 11
[juni

[...truncated too long message...]

zedtesting.rules.SystemPropertiesRestoreRule$1.evaluate(SystemPropertiesRestoreRule.java:53)
[junit4:junit4]    > 	at org.apache.lucene.util.TestRuleSetupTeardownChained$1.evaluate(TestRuleSetupTeardownChained.java:50)
[junit4:junit4]    > 	at org.apache.lucene.util.TestRuleFieldCacheSanity$1.evaluate(TestRuleFieldCacheSanity.java:51)
[junit4:junit4]    > 	at org.apache.lucene.util.AbstractBeforeAfterRule$1.evaluate(AbstractBeforeAfterRule.java:46)
[junit4:junit4]    > 	at com.carrotsearch.randomizedtesting.rules.SystemPropertiesInvariantRule$1.evaluate(SystemPropertiesInvariantRule.java:55)
[junit4:junit4]    > 	at org.apache.lucene.util.TestRuleThreadAndTestName$1.evaluate(TestRuleThreadAndTestName.java:49)
[junit4:junit4]    > 	at org.apache.lucene.util.TestRuleIgnoreAfterMaxFailures$1.evaluate(TestRuleIgnoreAfterMaxFailures.java:70)
[junit4:junit4]    > 	at org.apache.lucene.util.TestRuleMarkFailure$1.evaluate(TestRuleMarkFailure.java:48)
[junit4:junit4]    > 	at com.carrotsearch.randomizedtesting.rules.StatementAdapter.evaluate(StatementAdapter.java:36)
[junit4:junit4]    > 	at com.carrotsearch.randomizedtesting.ThreadLeakControl$StatementRunner.run(ThreadLeakControl.java:358)
[junit4:junit4]    > 	at com.carrotsearch.randomizedtesting.ThreadLeakControl.forkTimeoutingTask(ThreadLeakControl.java:782)
[junit4:junit4]    > 	at com.carrotsearch.randomizedtesting.ThreadLeakControl$3.evaluate(ThreadLeakControl.java:442)
[junit4:junit4]    > 	at com.carrotsearch.randomizedtesting.RandomizedRunner.runSingleTest(RandomizedRunner.java:746)
[junit4:junit4]    > 	at com.carrotsearch.randomizedtesting.RandomizedRunner$3.evaluate(RandomizedRunner.java:648)
[junit4:junit4]    > 	at com.carrotsearch.randomizedtesting.RandomizedRunner$4.evaluate(RandomizedRunner.java:682)
[junit4:junit4]    > 	at com.carrotsearch.randomizedtesting.RandomizedRunner$5.evaluate(RandomizedRunner.java:693)
[junit4:junit4]    > 	at com.carrotsearch.randomizedtesting.rules.StatementAdapter.evaluate(StatementAdapter.java:36)
[junit4:junit4]    > 	at com.carrotsearch.randomizedtesting.rules.SystemPropertiesRestoreRule$1.evaluate(SystemPropertiesRestoreRule.java:53)
[junit4:junit4]    > 	at org.apache.lucene.util.AbstractBeforeAfterRule$1.evaluate(AbstractBeforeAfterRule.java:46)
[junit4:junit4]    > 	at org.apache.lucene.util.TestRuleStoreClassName$1.evaluate(TestRuleStoreClassName.java:42)
[junit4:junit4]    > 	at com.carrotsearch.randomizedtesting.rules.SystemPropertiesInvariantRule$1.evaluate(SystemPropertiesInvariantRule.java:55)
[junit4:junit4]    > 	at com.carrotsearch.randomizedtesting.rules.NoShadowingOrOverridesOnMethodsRule$1.evaluate(NoShadowingOrOverridesOnMethodsRule.java:39)
[junit4:junit4]    > 	at com.carrotsearch.randomizedtesting.rules.NoShadowingOrOverridesOnMethodsRule$1.evaluate(NoShadowingOrOverridesOnMethodsRule.java:39)
[junit4:junit4]    > 	at com.carrotsearch.randomizedtesting.rules.StatementAdapter.evaluate(StatementAdapter.java:36)
[junit4:junit4]    > 	at org.apache.lucene.util.TestRuleAssertionsRequired$1.evaluate(TestRuleAssertionsRequired.java:43)
[junit4:junit4]    > 	at org.apache.lucene.util.TestRuleMarkFailure$1.evaluate(TestRuleMarkFailure.java:48)
[junit4:junit4]    > 	at org.apache.lucene.util.TestRuleIgnoreAfterMaxFailures$1.evaluate(TestRuleIgnoreAfterMaxFailures.java:70)
[junit4:junit4]    > 	at org.apache.lucene.util.TestRuleIgnoreTestSuites$1.evaluate(TestRuleIgnoreTestSuites.java:55)
[junit4:junit4]    > 	at com.carrotsearch.randomizedtesting.rules.StatementAdapter.evaluate(StatementAdapter.java:36)
[junit4:junit4]    > 	at com.carrotsearch.randomizedtesting.ThreadLeakControl$StatementRunner.run(ThreadLeakControl.java:358)
[junit4:junit4]    > 	at java.lang.Thread.run(Thread.java:722)
[junit4:junit4]   2> 368904 T2338 oas.SolrTestCaseJ4.deleteCore ###deleteCore
[junit4:junit4]   2> NOTE: test params are: codec=Lucene42: {n_f1=MockFixedIntBlock(blockSize=760), foo_b=PostingsFormat(name=Memory doPackFST= true), cat=PostingsFormat(name=Memory doPackFST= false), foo_d=Pulsing41(freqCutoff=14 minBlockSize=5 maxBlockSize=55), foo_f=PostingsFormat(name=Memory doPackFST= true), n_tl1=MockFixedIntBlock(blockSize=760), n_d1=PostingsFormat(name=Memory doPackFST= false), rnd_b=Pulsing41(freqCutoff=14 minBlockSize=5 maxBlockSize=55), intDefault=PostingsFormat(name=Memory doPackFST= false), n_td1=MockFixedIntBlock(blockSize=760), timestamp=PostingsFormat(name=Memory doPackFST= false), id=Pulsing41(freqCutoff=14 minBlockSize=5 maxBlockSize=55), range_facet_sl=PostingsFormat(name=Memory doPackFST= true), range_facet_si=MockFixedIntBlock(blockSize=760), oddField_s=PostingsFormat(name=Memory doPackFST= true), sequence_i=PostingsFormat(name=Memory doPackFST= true), name=Pulsing41(freqCutoff=14 minBlockSize=5 maxBlockSize=55), foo_i=MockFixedIntBlock(blockSize=760), regex_dup_B_s=PostingsFormat(name=Memory doPackFST= false), multiDefault=MockFixedIntBlock(blockSize=760), n_tf1=PostingsFormat(name=Memory doPackFST= false), n_dt1=MockFixedIntBlock(blockSize=760), genre_s=PostingsFormat(name=Memory doPackFST= true), author_t=MockFixedIntBlock(blockSize=760), n_ti1=Pulsing41(freqCutoff=14 minBlockSize=5 maxBlockSize=55), range_facet_l=PostingsFormat(name=Memory doPackFST= false), text=PostingsFormat(name=Memory doPackFST= true), _version_=PostingsFormat(name=Memory doPackFST= false), val_i=Pulsing41(freqCutoff=14 minBlockSize=5 maxBlockSize=55), SubjectTerms_mfacet=PostingsFormat(name=Memory doPackFST= false), series_t=MockFixedIntBlock(blockSize=760), a_t=PostingsFormat(name=Memory doPackFST= false), n_tdt1=PostingsFormat(name=Memory doPackFST= false), regex_dup_A_s=PostingsFormat(name=Memory doPackFST= true), price=PostingsFormat(name=Memory doPackFST= true), other_tl1=PostingsFormat(name=Memory doPackFST= false), n_l1=PostingsFormat(name=Memory doPackFST= false), a_si=MockFixedIntBlock(blockSize=760), inStock=PostingsFormat(name=Memory doPackFST= true)}, sim=DefaultSimilarity, locale=es_GT, timezone=Europe/Riga
[junit4:junit4]   2> NOTE: Mac OS X 10.8.2 x86_64/Oracle Corporation 1.7.0_10 (64-bit)/cpus=2,threads=1,free=244911080,total=536870912
[junit4:junit4]   2> NOTE: All tests run in this JVM: [TestTrie, ZkControllerTest, TermVectorComponentTest, TestQuerySenderListener, ZkCLITest, ShardRoutingTest, SolrInfoMBeanTest, ResourceLoaderTest, DOMUtilTest, TestStressLucene, ChaosMonkeySafeLeaderTest, StatsComponentTest, TestReplicationHandler, OpenExchangeRatesOrgProviderTest, TestSort, OutputWriterTest, TestStressReorder, FileBasedSpellCheckerTest, RequiredFieldsTest, LoggingHandlerTest, DistanceFunctionTest, OverseerCollectionProcessorTest, TestAnalyzedSuggestions, PingRequestHandlerTest, TestDFRSimilarityFactory, XsltUpdateRequestHandlerTest, PathHierarchyTokenizerFactoryTest, FileUtilsTest, SolrCmdDistributorTest, ChaosMonkeyNothingIsSafeTest, DateMathParserTest, TestLRUCache, TestSolrJ, TestArbitraryIndexDir, ConvertedLegacyTest, ClusterStateTest, ClusterStateUpdateTest, TestLuceneMatchVersion, BasicZkTest, SimpleFacetsTest, UpdateRequestProcessorFactoryTest, TestMultiCoreConfBootstrap, PluginInfoTest, EchoParamsTest, CopyFieldTest, TestDocSet, TestStressVersions, SpatialFilterTest, TestExtendedDismaxParser, BadIndexSchemaTest, UpdateParamsTest, TestGroupingSearch, TestUtils, SuggesterFSTTest, RequestHandlersTest, TestSolr4Spatial, CacheHeaderTest, CoreContainerCoreInitFailuresTest, FieldMutatingUpdateProcessorTest, TestRTGBase, SpellCheckComponentTest, TestRandomFaceting, TestLMJelinekMercerSimilarityFactory, DirectSolrConnectionTest, TestCSVLoader, ShowFileRequestHandlerTest, IndexReaderFactoryTest, FastVectorHighlighterTest, TestValueSourceCache, CoreAdminHandlerTest, SoftAutoCommitTest, TestElisionMultitermQuery, TestPseudoReturnFields, TestFaceting, TestWriterPerf, TestBinaryResponseWriter, TestSolrDeletionPolicy2, TestStressRecovery, SortByFunctionTest, SolrIndexConfigTest, TestDistributedGrouping, TestZkChroot, TestSolrCoreProperties, IndexBasedSpellCheckerTest, TestWordDelimiterFilterFactory, DateFieldTest, ExternalFileFieldSortTest, AutoCommitTest, ZkNodePropsTest, SuggesterWFSTTest, TestBM25SimilarityFactory, TestCharFilters, SuggesterTSTTest, CSVRequestHandlerTest, MoreLikeThisHandlerTest, TestPluginEnable, TermsComponentTest, SampleTest, CircularListTest, BadComponentTest, TestFastOutputStream, TestAtomicUpdateErrorCases, TestSolrDeletionPolicy1, TestRecovery, TestSearchPerf, TestDefaultSimilarityFactory, DocumentAnalysisRequestHandlerTest, HardAutoCommitTest, TestPhraseSuggestions, CollectionsAPIDistributedZkTest, TestFiltering, TestNumberUtils, NumericFieldsTest, DirectUpdateHandlerOptimizeTest, ScriptEngineTest, SynonymTokenizerTest, TestPropInject, TestUpdate, BasicDistributedZkTest]
[junit4:junit4] Completed in 369.26s, 1 test, 1 failure <<< FAILURES!

[...truncated 379 lines...]
BUILD FAILED
/Users/jenkins/jenkins-slave/workspace/Lucene-Solr-trunk-MacOSX/build.xml:346: The following error occurred while executing this line:
/Users/jenkins/jenkins-slave/workspace/Lucene-Solr-trunk-MacOSX/build.xml:39: The following error occurred while executing this line:
/Users/jenkins/jenkins-slave/workspace/Lucene-Solr-trunk-MacOSX/solr/build.xml:178: The following error occurred while executing this line:
/Users/jenkins/jenkins-slave/workspace/Lucene-Solr-trunk-MacOSX/solr/common-build.xml:428: The following error occurred while executing this line:
/Users/jenkins/jenkins-slave/workspace/Lucene-Solr-trunk-MacOSX/lucene/common-build.xml:1176: The following error occurred while executing this line:
/Users/jenkins/jenkins-slave/workspace/Lucene-Solr-trunk-MacOSX/lucene/common-build.xml:841: There were test failures: 249 suites, 1038 tests, 1 failure, 14 ignored (3 assumptions)

Total time: 65 minutes 18 seconds
Build step 'Invoke Ant' marked build as failure
Archiving artifacts
Recording test results
Description set: Java: 64bit/jdk1.7.0 -XX:+UseG1GC
Email was triggered for: Failure
Sending email for trigger: Failure



Mime
View raw message