lucene-dev mailing list archives

Site index · List index
Message view « Date » · « Thread »
Top « Date » · « Thread »
From Apache Jenkins Server <jenk...@builds.apache.org>
Subject [JENKINS] Lucene-Solr-Tests-4.x-java7 - Build # 954 - Still Failing
Date Fri, 01 Feb 2013 11:02:17 GMT
Build: https://builds.apache.org/job/Lucene-Solr-Tests-4.x-java7/954/

1 tests failed.
FAILED:  org.apache.lucene.codecs.lucene3x.TestLucene3xTermVectorsFormat.testRandom

Error Message:
expected:<[oadguelkoy, jfbtlwzfek]> but was:<[dzhnlix, jfbtlwzfek]>

Stack Trace:
java.lang.AssertionError: expected:<[oadguelkoy, jfbtlwzfek]> but was:<[dzhnlix,
jfbtlwzfek]>
	at __randomizedtesting.SeedInfo.seed([347CCCF3A020208D:4630E9FC114096FE]:0)
	at org.junit.Assert.fail(Assert.java:93)
	at org.junit.Assert.failNotEquals(Assert.java:647)
	at org.junit.Assert.assertEquals(Assert.java:128)
	at org.junit.Assert.assertEquals(Assert.java:147)
	at org.apache.lucene.index.BaseTermVectorsFormatTestCase.assertEquals(BaseTermVectorsFormatTestCase.java:375)
	at org.apache.lucene.index.BaseTermVectorsFormatTestCase.testRandom(BaseTermVectorsFormatTestCase.java:625)
	at sun.reflect.NativeMethodAccessorImpl.invoke0(Native Method)
	at sun.reflect.NativeMethodAccessorImpl.invoke(NativeMethodAccessorImpl.java:57)
	at sun.reflect.DelegatingMethodAccessorImpl.invoke(DelegatingMethodAccessorImpl.java:43)
	at java.lang.reflect.Method.invoke(Method.java:601)
	at com.carrotsearch.randomizedtesting.RandomizedRunner.invoke(RandomizedRunner.java:1559)
	at com.carrotsearch.randomizedtesting.RandomizedRunner.access$600(RandomizedRunner.java:79)
	at com.carrotsearch.randomizedtesting.RandomizedRunner$6.evaluate(RandomizedRunner.java:737)
	at com.carrotsearch.randomizedtesting.RandomizedRunner$7.evaluate(RandomizedRunner.java:773)
	at com.carrotsearch.randomizedtesting.RandomizedRunner$8.evaluate(RandomizedRunner.java:787)
	at org.apache.lucene.util.TestRuleSetupTeardownChained$1.evaluate(TestRuleSetupTeardownChained.java:50)
	at org.apache.lucene.util.TestRuleFieldCacheSanity$1.evaluate(TestRuleFieldCacheSanity.java:51)
	at org.apache.lucene.util.AbstractBeforeAfterRule$1.evaluate(AbstractBeforeAfterRule.java:46)
	at com.carrotsearch.randomizedtesting.rules.SystemPropertiesInvariantRule$1.evaluate(SystemPropertiesInvariantRule.java:55)
	at org.apache.lucene.util.TestRuleThreadAndTestName$1.evaluate(TestRuleThreadAndTestName.java:49)
	at org.apache.lucene.util.TestRuleIgnoreAfterMaxFailures$1.evaluate(TestRuleIgnoreAfterMaxFailures.java:70)
	at org.apache.lucene.util.TestRuleMarkFailure$1.evaluate(TestRuleMarkFailure.java:48)
	at com.carrotsearch.randomizedtesting.rules.StatementAdapter.evaluate(StatementAdapter.java:36)
	at com.carrotsearch.randomizedtesting.ThreadLeakControl$StatementRunner.run(ThreadLeakControl.java:358)
	at com.carrotsearch.randomizedtesting.ThreadLeakControl.forkTimeoutingTask(ThreadLeakControl.java:782)
	at com.carrotsearch.randomizedtesting.ThreadLeakControl$3.evaluate(ThreadLeakControl.java:442)
	at com.carrotsearch.randomizedtesting.RandomizedRunner.runSingleTest(RandomizedRunner.java:746)
	at com.carrotsearch.randomizedtesting.RandomizedRunner$3.evaluate(RandomizedRunner.java:648)
	at com.carrotsearch.randomizedtesting.RandomizedRunner$4.evaluate(RandomizedRunner.java:682)
	at com.carrotsearch.randomizedtesting.RandomizedRunner$5.evaluate(RandomizedRunner.java:693)
	at org.apache.lucene.util.AbstractBeforeAfterRule$1.evaluate(AbstractBeforeAfterRule.java:46)
	at org.apache.lucene.util.TestRuleStoreClassName$1.evaluate(TestRuleStoreClassName.java:42)
	at com.carrotsearch.randomizedtesting.rules.SystemPropertiesInvariantRule$1.evaluate(SystemPropertiesInvariantRule.java:55)
	at com.carrotsearch.randomizedtesting.rules.NoShadowingOrOverridesOnMethodsRule$1.evaluate(NoShadowingOrOverridesOnMethodsRule.java:39)
	at com.carrotsearch.randomizedtesting.rules.NoShadowingOrOverridesOnMethodsRule$1.evaluate(NoShadowingOrOverridesOnMethodsRule.java:39)
	at com.carrotsearch.randomizedtesting.rules.StatementAdapter.evaluate(StatementAdapter.java:36)
	at org.apache.lucene.util.TestRuleAssertionsRequired$1.evaluate(TestRuleAssertionsRequired.java:43)
	at org.apache.lucene.util.TestRuleMarkFailure$1.evaluate(TestRuleMarkFailure.java:48)
	at org.apache.lucene.util.TestRuleIgnoreAfterMaxFailures$1.evaluate(TestRuleIgnoreAfterMaxFailures.java:70)
	at org.apache.lucene.util.TestRuleIgnoreTestSuites$1.evaluate(TestRuleIgnoreTestSuites.java:55)
	at com.carrotsearch.randomizedtesting.rules.StatementAdapter.evaluate(StatementAdapter.java:36)
	at com.carrotsearch.randomizedtesting.ThreadLeakControl$StatementRunner.run(ThreadLeakControl.java:358)
	at java.lang.Thread.run(Thread.java:722)




Build Log:
[...truncated 1119 lines...]
[junit4:junit4] Suite: org.apache.lucene.codecs.lucene3x.TestLucene3xTermVectorsFormat
[junit4:junit4]   2> NOTE: reproduce with: ant test  -Dtestcase=TestLucene3xTermVectorsFormat
-Dtests.method=testRandom -Dtests.seed=347CCCF3A020208D -Dtests.multiplier=3 -Dtests.slow=true
-Dtests.locale=pl -Dtests.timezone=America/Thule -Dtests.file.encoding=US-ASCII
[junit4:junit4] FAILURE 0.23s J0 | TestLucene3xTermVectorsFormat.testRandom <<<
[junit4:junit4]    > Throwable #1: java.lang.AssertionError: expected:<[oadguelkoy,
jfbtlwzfek]> but was:<[dzhnlix, jfbtlwzfek]>
[junit4:junit4]    > 	at __randomizedtesting.SeedInfo.seed([347CCCF3A020208D:4630E9FC114096FE]:0)
[junit4:junit4]    > 	at org.junit.Assert.fail(Assert.java:93)
[junit4:junit4]    > 	at org.junit.Assert.failNotEquals(Assert.java:647)
[junit4:junit4]    > 	at org.junit.Assert.assertEquals(Assert.java:128)
[junit4:junit4]    > 	at org.junit.Assert.assertEquals(Assert.java:147)
[junit4:junit4]    > 	at org.apache.lucene.index.BaseTermVectorsFormatTestCase.assertEquals(BaseTermVectorsFormatTestCase.java:375)
[junit4:junit4]    > 	at org.apache.lucene.index.BaseTermVectorsFormatTestCase.testRandom(BaseTermVectorsFormatTestCase.java:625)
[junit4:junit4]    > 	at sun.reflect.NativeMethodAccessorImpl.invoke0(Native Method)
[junit4:junit4]    > 	at sun.reflect.NativeMethodAccessorImpl.invoke(NativeMethodAccessorImpl.java:57)
[junit4:junit4]    > 	at sun.reflect.DelegatingMethodAccessorImpl.invoke(DelegatingMethodAccessorImpl.java:43)
[junit4:junit4]    > 	at java.lang.reflect.Method.invoke(Method.java:601)
[junit4:junit4]    > 	at com.carrotsearch.randomizedtesting.RandomizedRunner.invoke(RandomizedRunner.java:1559)
[junit4:junit4]    > 	at com.carrotsearch.randomizedtesting.RandomizedRunner.access$600(RandomizedRunner.java:79)
[junit4:junit4]    > 	at com.carrotsearch.randomizedtesting.RandomizedRunner$6.evaluate(RandomizedRunner.java:737)
[junit4:junit4]    > 	at com.carrotsearch.randomizedtesting.RandomizedRunner$7.evaluate(RandomizedRunner.java:773)
[junit4:junit4]    > 	at com.carrotsearch.randomizedtesting.RandomizedRunner$8.evaluate(RandomizedRunner.java:787)
[junit4:junit4]    > 	at org.apache.lucene.util.TestRuleSetupTeardownChained$1.evaluate(TestRuleSetupTeardownChained.java:50)
[junit4:junit4]    > 	at org.apache.lucene.util.TestRuleFieldCacheSanity$1.evaluate(TestRuleFieldCacheSanity.java:51)
[junit4:junit4]    > 	at org.apache.lucene.util.AbstractBeforeAfterRule$1.evaluate(AbstractBeforeAfterRule.java:46)
[junit4:junit4]    > 	at com.carrotsearch.randomizedtesting.rules.SystemPropertiesInvariantRule$1.evaluate(SystemPropertiesInvariantRule.java:55)
[junit4:junit4]    > 	at org.apache.lucene.util.TestRuleThreadAndTestName$1.evaluate(TestRuleThreadAndTestName.java:49)
[junit4:junit4]    > 	at org.apache.lucene.util.TestRuleIgnoreAfterMaxFailures$1.evaluate(TestRuleIgnoreAfterMaxFailures.java:70)
[junit4:junit4]    > 	at org.apache.lucene.util.TestRuleMarkFailure$1.evaluate(TestRuleMarkFailure.java:48)
[junit4:junit4]    > 	at com.carrotsearch.randomizedtesting.rules.StatementAdapter.evaluate(StatementAdapter.java:36)
[junit4:junit4]    > 	at com.carrotsearch.randomizedtesting.ThreadLeakControl$StatementRunner.run(ThreadLeakControl.java:358)
[junit4:junit4]    > 	at com.carrotsearch.randomizedtesting.ThreadLeakControl.forkTimeoutingTask(ThreadLeakControl.java:782)
[junit4:junit4]    > 	at com.carrotsearch.randomizedtesting.ThreadLeakControl$3.evaluate(ThreadLeakControl.java:442)
[junit4:junit4]    > 	at com.carrotsearch.randomizedtesting.RandomizedRunner.runSingleTest(RandomizedRunner.java:746)
[junit4:junit4]    > 	at com.carrotsearch.randomizedtesting.RandomizedRunner$3.evaluate(RandomizedRunner.java:648)
[junit4:junit4]    > 	at com.carrotsearch.randomizedtesting.RandomizedRunner$4.evaluate(RandomizedRunner.java:682)
[junit4:junit4]    > 	at com.carrotsearch.randomizedtesting.RandomizedRunner$5.evaluate(RandomizedRunner.java:693)
[junit4:junit4]    > 	at org.apache.lucene.util.AbstractBeforeAfterRule$1.evaluate(AbstractBeforeAfterRule.java:46)
[junit4:junit4]    > 	at org.apache.lucene.util.TestRuleStoreClassName$1.evaluate(TestRuleStoreClassName.java:42)
[junit4:junit4]    > 	at com.carrotsearch.randomizedtesting.rules.SystemPropertiesInvariantRule$1.evaluate(SystemPropertiesInvariantRule.java:55)
[junit4:junit4]    > 	at com.carrotsearch.randomizedtesting.rules.NoShadowingOrOverridesOnMethodsRule$1.evaluate(NoShadowingOrOverridesOnMethodsRule.java:39)
[junit4:junit4]    > 	at com.carrotsearch.randomizedtesting.rules.NoShadowingOrOverridesOnMethodsRule$1.evaluate(NoShadowingOrOverridesOnMethodsRule.java:39)
[junit4:junit4]    > 	at com.carrotsearch.randomizedtesting.rules.StatementAdapter.evaluate(StatementAdapter.java:36)
[junit4:junit4]    > 	at org.apache.lucene.util.TestRuleAssertionsRequired$1.evaluate(TestRuleAssertionsRequired.java:43)
[junit4:junit4]    > 	at org.apache.lucene.util.TestRuleMarkFailure$1.evaluate(TestRuleMarkFailure.java:48)
[junit4:junit4]    > 	at org.apache.lucene.util.TestRuleIgnoreAfterMaxFailures$1.evaluate(TestRuleIgnoreAfterMaxFailures.java:70)
[junit4:junit4]    > 	at org.apache.lucene.util.TestRuleIgnoreTestSuites$1.evaluate(TestRuleIgnoreTestSuites.java:55)
[junit4:junit4]    > 	at com.carrotsearch.randomizedtesting.rules.StatementAdapter.evaluate(StatementAdapter.java:36)
[junit4:junit4]    > 	at com.carrotsearch.randomizedtesting.ThreadLeakControl$StatementRunner.run(ThreadLeakControl.java:358)
[junit4:junit4]    > 	at java.lang.Thread.run(Thread.java:722)
[junit4:junit4]   2> NOTE: test params are: codec=Lucene40, sim=DefaultSimilarity, locale=pl,
timezone=America/Thule
[junit4:junit4]   2> NOTE: FreeBSD 9.0-RELEASE amd64/Oracle Corporation 1.7.0_09 (64-bit)/cpus=16,threads=1,free=280634960,total=515899392
[junit4:junit4]   2> NOTE: All tests run in this JVM: [TestCompressingStoredFieldsFormat,
TestCheckIndex, TestSimilarityBase, TestTermVectors, TestSameTokenSamePosition, TestCompoundFile,
TestIndexWriter, TestTermdocPerf, TestGraphTokenizers, TestTimeLimitingCollector, TestBasicOperations,
TestStressIndexing2, Nested1, TestSpecialOperations, TestPrefixFilter, TestSegmentTermEnum,
TestPriorityQueue, TestIndexWriterWithThreads, TestPrefixCodedTerms, TestSearchForDuplicates,
TestFilteredSearch, TestPayloadNearQuery, TestSimilarity, TestConcurrentMergeScheduler, TestBackwardsCompatibility3x,
TestComplexExplanations, TestShardSearching, TestLiveFieldValues, TestCopyBytes, TestBitVector,
TestFixedBitSet, TestBlockPostingsFormat2, TestMultiThreadTermVectors, TestTieredMergePolicy,
TestIndexWriterOnJRECrash, TestBagOfPostings, TestTermRangeQuery, TestSpanFirstQuery, TestIndexWriterExceptions,
Test4GBStoredFields, TestSpansAdvanced2, TestDocValuesScoring, TestSpanMultiTermQueryWrapper,
TestCharTermAttributeImpl, TestCloseableThreadLocal, TestIsCurrent, Before3, Before3, TestScorerPerf,
TestFieldValueFilter, Nested1, TestWindowsMMap, TestBackwardsCompatibility, TestDeletionPolicy,
ThrowInUncaught, TestBlockPostingsFormat3, Nested1, TestRollingUpdates, TestNewestSegment,
TestMultiPhraseQuery, Test2BPositions, TestIndexableField, TestSegmentReader, TestNumericUtils,
TestComplexExplanationsOfNonMatches, Nested, Nested, TestTerm, TestConsistentFieldNumbers,
TestFilterIterator, TestSort, TestPrefixQuery, TestIndexWriterReader, TestBytesRefHash, TestDeterminism,
TestSearchAfter, TestScoreCachingWrappingScorer, TestBlockPostingsFormat, TestByteBlockPool,
TestDoubleBarrelLRUCache, TestNumericTokenStream, TestCrash, TestDocIdSet, TestDemo, TestMultiTermConstantScore,
TestPackedInts, TestNorms, TestNumericRangeQuery64, TestSearcherManager, TestNRTThreads, TestByteSlices,
TestAtomicUpdate, TestTermsEnum, TestIndexWriterMerging, TestLucene40PostingsReader, TestOpenBitSet,
TestMinimize, TestSloppyPhraseQuery, TestNRTManager, TestIndexWriterDelete, TestLongPostings,
TestCustomNorms, TestSnapshotDeletionPolicy, TestIndexWriterNRTIsCurrent, TestNRTReaderWithThreads,
TestDocValuesIndexing, TestStressNRT, TestCrashCausesCorruptIndex, TestRAMDirectory, TestUTF32ToUTF8,
TestSegmentMerger, TestTransactions, TestThreadedForceMerge, TestPerFieldPostingsFormat, TestFieldCacheRangeFilter,
TestCodecs, TestIndexInput, TestSpans, TestLazyProxSkipping, TestPayloadTermQuery, TestTermsEnum2,
TestDisjunctionMaxQuery, TestSimpleSearchEquivalence, Nested, Nested, Nested, Nested, Nested,
Nested, Nested, Nested, Nested, Nested, Nested, Nested, Nested, Nested, Nested, Nested, Nested,
Nested, Nested, Nested, Nested, TestTermRangeFilter, TestFilteredQuery, TestPayloadExplanations,
TestDocsAndPositions, TestUnicodeUtil, TestMultiFields, TestOmitPositions, TestPayloads, TestFuzzyQuery,
TestBooleanOr, TestSmallFloat, TestDocument, TestIndexWriterConfig, TestNoDeletionPolicy,
TestTermScorer, TestSubScorerFreqs, TestDateFilter, TestBooleanScorer, TestPhrasePrefixQuery,
TestRecyclingByteBlockAllocator, Nested, TestParallelTermEnum, TestFieldCacheTermsFilter,
TestNot, TestDateSort, TestTopScoreDocCollector, TestBytesRef, TestNoMergePolicy, TestRamUsageEstimator,
TestNamedSPILoader, TestFieldInfos, TestPositiveScoresOnlyCollector, TestNoMergeScheduler,
TestIndexCommit, TestWorstCaseTestBehavior, TestCompressingTermVectorsFormat, TestImpersonation,
TestLucene3xTermVectorsFormat]
[junit4:junit4] Completed on J0 in 3.43s, 5 tests, 1 failure <<< FAILURES!

[...truncated 46 lines...]
BUILD FAILED
/usr/home/hudson/hudson-slave/workspace/Lucene-Solr-Tests-4.x-java7/build.xml:346: The following
error occurred while executing this line:
/usr/home/hudson/hudson-slave/workspace/Lucene-Solr-Tests-4.x-java7/build.xml:39: The following
error occurred while executing this line:
/usr/home/hudson/hudson-slave/workspace/Lucene-Solr-Tests-4.x-java7/lucene/build.xml:50: The
following error occurred while executing this line:
/usr/home/hudson/hudson-slave/workspace/Lucene-Solr-Tests-4.x-java7/lucene/common-build.xml:1176:
The following error occurred while executing this line:
/usr/home/hudson/hudson-slave/workspace/Lucene-Solr-Tests-4.x-java7/lucene/common-build.xml:841:
There were test failures: 335 suites, 1907 tests, 1 failure, 24 ignored (12 assumptions)

Total time: 8 minutes 57 seconds
Build step 'Invoke Ant' marked build as failure
Archiving artifacts
Recording test results
Email was triggered for: Failure
Sending email for trigger: Failure



Mime
View raw message