lucene-dev mailing list archives

Site index · List index
Message view « Date » · « Thread »
Top « Date » · « Thread »
From Policeman Jenkins Server <jenk...@thetaphi.de>
Subject [JENKINS] Lucene-Solr-trunk-MacOSX (64bit/jdk1.7.0) - Build # 183 - Still Failing!
Date Mon, 04 Feb 2013 17:22:12 GMT
Build: http://jenkins.thetaphi.de/job/Lucene-Solr-trunk-MacOSX/183/
Java: 64bit/jdk1.7.0 -XX:+UseConcMarkSweepGC

1 tests failed.
FAILED:  org.apache.solr.cloud.BasicDistributedZkTest.testDistribSearch

Error Message:
There are still nodes recoverying - waited for 230 seconds

Stack Trace:
java.lang.AssertionError: There are still nodes recoverying - waited for 230 seconds
	at __randomizedtesting.SeedInfo.seed([E5B379AFE0DDDCD6:6455F7B79782BCEA]:0)
	at org.junit.Assert.fail(Assert.java:93)
	at org.apache.solr.cloud.AbstractDistribZkTestBase.waitForRecoveriesToFinish(AbstractDistribZkTestBase.java:168)
	at org.apache.solr.cloud.AbstractDistribZkTestBase.waitForRecoveriesToFinish(AbstractDistribZkTestBase.java:126)
	at org.apache.solr.cloud.AbstractDistribZkTestBase.waitForRecoveriesToFinish(AbstractDistribZkTestBase.java:121)
	at org.apache.solr.cloud.BasicDistributedZkTest.testCoreUnloadAndLeaders(BasicDistributedZkTest.java:599)
	at org.apache.solr.cloud.BasicDistributedZkTest.doTest(BasicDistributedZkTest.java:337)
	at org.apache.solr.BaseDistributedSearchTestCase.testDistribSearch(BaseDistributedSearchTestCase.java:794)
	at sun.reflect.NativeMethodAccessorImpl.invoke0(Native Method)
	at sun.reflect.NativeMethodAccessorImpl.invoke(NativeMethodAccessorImpl.java:57)
	at sun.reflect.DelegatingMethodAccessorImpl.invoke(DelegatingMethodAccessorImpl.java:43)
	at java.lang.reflect.Method.invoke(Method.java:601)
	at com.carrotsearch.randomizedtesting.RandomizedRunner.invoke(RandomizedRunner.java:1559)
	at com.carrotsearch.randomizedtesting.RandomizedRunner.access$600(RandomizedRunner.java:79)
	at com.carrotsearch.randomizedtesting.RandomizedRunner$6.evaluate(RandomizedRunner.java:737)
	at com.carrotsearch.randomizedtesting.RandomizedRunner$7.evaluate(RandomizedRunner.java:773)
	at com.carrotsearch.randomizedtesting.RandomizedRunner$8.evaluate(RandomizedRunner.java:787)
	at com.carrotsearch.randomizedtesting.rules.SystemPropertiesRestoreRule$1.evaluate(SystemPropertiesRestoreRule.java:53)
	at org.apache.lucene.util.TestRuleSetupTeardownChained$1.evaluate(TestRuleSetupTeardownChained.java:50)
	at org.apache.lucene.util.TestRuleFieldCacheSanity$1.evaluate(TestRuleFieldCacheSanity.java:51)
	at org.apache.lucene.util.AbstractBeforeAfterRule$1.evaluate(AbstractBeforeAfterRule.java:46)
	at com.carrotsearch.randomizedtesting.rules.SystemPropertiesInvariantRule$1.evaluate(SystemPropertiesInvariantRule.java:55)
	at org.apache.lucene.util.TestRuleThreadAndTestName$1.evaluate(TestRuleThreadAndTestName.java:49)
	at org.apache.lucene.util.TestRuleIgnoreAfterMaxFailures$1.evaluate(TestRuleIgnoreAfterMaxFailures.java:70)
	at org.apache.lucene.util.TestRuleMarkFailure$1.evaluate(TestRuleMarkFailure.java:48)
	at com.carrotsearch.randomizedtesting.rules.StatementAdapter.evaluate(StatementAdapter.java:36)
	at com.carrotsearch.randomizedtesting.ThreadLeakControl$StatementRunner.run(ThreadLeakControl.java:358)
	at com.carrotsearch.randomizedtesting.ThreadLeakControl.forkTimeoutingTask(ThreadLeakControl.java:782)
	at com.carrotsearch.randomizedtesting.ThreadLeakControl$3.evaluate(ThreadLeakControl.java:442)
	at com.carrotsearch.randomizedtesting.RandomizedRunner.runSingleTest(RandomizedRunner.java:746)
	at com.carrotsearch.randomizedtesting.RandomizedRunner$3.evaluate(RandomizedRunner.java:648)
	at com.carrotsearch.randomizedtesting.RandomizedRunner$4.evaluate(RandomizedRunner.java:682)
	at com.carrotsearch.randomizedtesting.RandomizedRunner$5.evaluate(RandomizedRunner.java:693)
	at com.carrotsearch.randomizedtesting.rules.StatementAdapter.evaluate(StatementAdapter.java:36)
	at com.carrotsearch.randomizedtesting.rules.SystemPropertiesRestoreRule$1.evaluate(SystemPropertiesRestoreRule.java:53)
	at org.apache.lucene.util.AbstractBeforeAfterRule$1.evaluate(AbstractBeforeAfterRule.java:46)
	at org.apache.lucene.util.TestRuleStoreClassName$1.evaluate(TestRuleStoreClassName.java:42)
	at com.carrotsearch.randomizedtesting.rules.SystemPropertiesInvariantRule$1.evaluate(SystemPropertiesInvariantRule.java:55)
	at com.carrotsearch.randomizedtesting.rules.NoShadowingOrOverridesOnMethodsRule$1.evaluate(NoShadowingOrOverridesOnMethodsRule.java:39)
	at com.carrotsearch.randomizedtesting.rules.NoShadowingOrOverridesOnMethodsRule$1.evaluate(NoShadowingOrOverridesOnMethodsRule.java:39)
	at com.carrotsearch.randomizedtesting.rules.StatementAdapter.evaluate(StatementAdapter.java:36)
	at org.apache.lucene.util.TestRuleAssertionsRequired$1.evaluate(TestRuleAssertionsRequired.java:43)
	at org.apache.lucene.util.TestRuleMarkFailure$1.evaluate(TestRuleMarkFailure.java:48)
	at org.apache.lucene.util.TestRuleIgnoreAfterMaxFailures$1.evaluate(TestRuleIgnoreAfterMaxFailures.java:70)
	at org.apache.lucene.util.TestRuleIgnoreTestSuites$1.evaluate(TestRuleIgnoreTestSuites.java:55)
	at com.carrotsearch.randomizedtesting.rules.StatementAdapter.evaluate(StatementAdapter.java:36)
	at com.carrotsearch.randomizedtesting.ThreadLeakControl$StatementRunner.run(ThreadLeakControl.java:358)
	at java.lang.Thread.run(Thread.java:722)




Build Log:
[...truncated 9010 lines...]
[junit4:junit4] Suite: org.apache.solr.cloud.BasicDistributedZkTest
[junit4:junit4]   2> 0 T2149 oas.BaseDistributedSearchTestCase.initHostContext Setting hostContext system property: /
[junit4:junit4]   2> 9 T2149 oas.SolrTestCaseJ4.setUp ###Starting testDistribSearch
[junit4:junit4]   2> Creating dataDir: /Users/jenkins/jenkins-slave/workspace/Lucene-Solr-trunk-MacOSX/solr/build/solr-core/test/J0/./solrtest-BasicDistributedZkTest-1359997319318
[junit4:junit4]   2> 10 T2149 oasc.ZkTestServer.run STARTING ZK TEST SERVER
[junit4:junit4]   2> 12 T2150 oasc.ZkTestServer$ZKServerMain.runFromConfig Starting server
[junit4:junit4]   2> 14 T2150 oazs.ZooKeeperServer.setTickTime tickTime set to 1000
[junit4:junit4]   2> 14 T2150 oazs.ZooKeeperServer.setMinSessionTimeout minSessionTimeout set to -1
[junit4:junit4]   2> 14 T2150 oazs.ZooKeeperServer.setMaxSessionTimeout maxSessionTimeout set to -1
[junit4:junit4]   2> 15 T2150 oazs.NIOServerCnxnFactory.configure binding to port 0.0.0.0/0.0.0.0:0
[junit4:junit4]   2> 16 T2150 oazsp.FileTxnSnapLog.save Snapshotting: 0x0 to /Users/jenkins/jenkins-slave/workspace/Lucene-Solr-trunk-MacOSX/solr/build/solr-core/test/J0/./org.apache.solr.cloud.BasicDistributedZkTest-1359997319318/zookeeper/server1/data/version-2/snapshot.0
[junit4:junit4]   2> 113 T2149 oasc.ZkTestServer.run start zk server on port:49792
[junit4:junit4]   2> 114 T2149 oaz.ZooKeeper.<init> Initiating client connection, connectString=127.0.0.1:49792 sessionTimeout=10000 watcher=org.apache.solr.common.cloud.ConnectionManager@acb04c5
[junit4:junit4]   2> 115 T2149 oascc.ConnectionManager.waitForConnected Waiting for client to connect to ZooKeeper
[junit4:junit4]   2> 116 T2155 oaz.ClientCnxn$SendThread.logStartConnect Opening socket connection to server localhost/127.0.0.1:49792. Will not attempt to authenticate using SASL (access denied ("javax.security.auth.AuthPermission" "getLoginConfiguration"))
[junit4:junit4]   2> 117 T2155 oaz.ClientCnxn$SendThread.primeConnection Socket connection established to localhost/127.0.0.1:49792, initiating session
[junit4:junit4]   2> 117 T2151 oazs.NIOServerCnxnFactory.run Accepted socket connection from /127.0.0.1:49793
[junit4:junit4]   2> 118 T2151 oazs.ZooKeeperServer.processConnectRequest Client attempting to establish new session at /127.0.0.1:49793
[junit4:junit4]   2> 119 T2153 oazsp.FileTxnLog.append Creating new log file: log.1
[junit4:junit4]   2> 124 T2153 oazs.ZooKeeperServer.finishSessionInit Established session 0x13ca628389d0000 with negotiated timeout 10000 for client /127.0.0.1:49793
[junit4:junit4]   2> 124 T2155 oaz.ClientCnxn$SendThread.onConnected Session establishment complete on server localhost/127.0.0.1:49792, sessionid = 0x13ca628389d0000, negotiated timeout = 10000
[junit4:junit4]   2> 125 T2156 oascc.ConnectionManager.process Watcher org.apache.solr.common.cloud.ConnectionManager@acb04c5 name:ZooKeeperConnection Watcher:127.0.0.1:49792 got event WatchedEvent state:SyncConnected type:None path:null path:null type:None
[junit4:junit4]   2> 125 T2149 oascc.ConnectionManager.waitForConnected Client is connected to ZooKeeper
[junit4:junit4]   2> 126 T2149 oascc.SolrZkClient.makePath makePath: /solr
[junit4:junit4]   2> 131 T2154 oazs.PrepRequestProcessor.pRequest2Txn Processed session termination for sessionid: 0x13ca628389d0000
[junit4:junit4]   2> 132 T2156 oaz.ClientCnxn$EventThread.run EventThread shut down
[junit4:junit4]   2> 132 T2149 oaz.ZooKeeper.close Session: 0x13ca628389d0000 closed
[junit4:junit4]   2> 133 T2151 oazs.NIOServerCnxn.closeSock Closed socket connection for client /127.0.0.1:49793 which had sessionid 0x13ca628389d0000
[junit4:junit4]   2> 133 T2149 oaz.ZooKeeper.<init> Initiating client connection, connectString=127.0.0.1:49792/solr sessionTimeout=10000 watcher=org.apache.solr.common.cloud.ConnectionManager@2cd37f1
[junit4:junit4]   2> 134 T2149 oascc.ConnectionManager.waitForConnected Waiting for client to connect to ZooKeeper
[junit4:junit4]   2> 135 T2157 oaz.ClientCnxn$SendThread.logStartConnect Opening socket connection to server localhost/127.0.0.1:49792. Will not attempt to authenticate using SASL (access denied ("javax.security.auth.AuthPermission" "getLoginConfiguration"))
[junit4:junit4]   2> 145 T2157 oaz.ClientCnxn$SendThread.primeConnection Socket connection established to localhost/127.0.0.1:49792, initiating session
[junit4:junit4]   2> 145 T2151 oazs.NIOServerCnxnFactory.run Accepted socket connection from /127.0.0.1:49794
[junit4:junit4]   2> 146 T2151 oazs.ZooKeeperServer.processConnectRequest Client attempting to establish new session at /127.0.0.1:49794
[junit4:junit4]   2> 148 T2153 oazs.ZooKeeperServer.finishSessionInit Established session 0x13ca628389d0001 with negotiated timeout 10000 for client /127.0.0.1:49794
[junit4:junit4]   2> 148 T2157 oaz.ClientCnxn$SendThread.onConnected Session establishment complete on server localhost/127.0.0.1:49792, sessionid = 0x13ca628389d0001, negotiated timeout = 10000
[junit4:junit4]   2> 148 T2158 oascc.ConnectionManager.process Watcher org.apache.solr.common.cloud.ConnectionManager@2cd37f1 name:ZooKeeperConnection Watcher:127.0.0.1:49792/solr got event WatchedEvent state:SyncConnected type:None path:null path:null type:None
[junit4:junit4]   2> 149 T2149 oascc.ConnectionManager.waitForConnected Client is connected to ZooKeeper
[junit4:junit4]   2> 149 T2149 oascc.SolrZkClient.makePath makePath: /collections/collection1
[junit4:junit4]   2> 155 T2149 oascc.SolrZkClient.makePath makePath: /collections/collection1/shards
[junit4:junit4]   2> 159 T2149 oascc.SolrZkClient.makePath makePath: /collections/control_collection
[junit4:junit4]   2> 164 T2149 oascc.SolrZkClient.makePath makePath: /collections/control_collection/shards
[junit4:junit4]   2> 168 T2149 oasc.AbstractZkTestCase.putConfig put /Users/jenkins/jenkins-slave/workspace/Lucene-Solr-trunk-MacOSX/solr/build/solr-core/test-files/solr/collection1/conf/solrconfig.xml to /configs/conf1/solrconfig.xml
[junit4:junit4]   2> 169 T2149 oascc.SolrZkClient.makePath makePath: /configs/conf1/solrconfig.xml
[junit4:junit4]   2> 179 T2149 oasc.AbstractZkTestCase.putConfig put /Users/jenkins/jenkins-slave/workspace/Lucene-Solr-trunk-MacOSX/solr/build/solr-core/test-files/solr/collection1/conf/schema.xml to /configs/conf1/schema.xml
[junit4:junit4]   2> 179 T2149 oascc.SolrZkClient.makePath makePath: /configs/conf1/schema.xml
[junit4:junit4]   2> 185 T2149 oasc.AbstractZkTestCase.putConfig put /Users/jenkins/jenkins-slave/workspace/Lucene-Solr-trunk-MacOSX/solr/build/solr-core/test-files/solr/collection1/conf/stopwords.txt to /configs/conf1/stopwords.txt
[junit4:junit4]   2> 186 T2149 oascc.SolrZkClient.makePath makePath: /configs/conf1/stopwords.txt
[junit4:junit4]   2> 193 T2149 oasc.AbstractZkTestCase.putConfig put /Users/jenkins/jenkins-slave/workspace/Lucene-Solr-trunk-MacOSX/solr/build/solr-core/test-files/solr/collection1/conf/protwords.txt to /configs/conf1/protwords.txt
[junit4:junit4]   2> 194 T2149 oascc.SolrZkClient.makePath makePath: /configs/conf1/protwords.txt
[junit4:junit4]   2> 200 T2149 oasc.AbstractZkTestCase.putConfig put /Users/jenkins/jenkins-slave/workspace/Lucene-Solr-trunk-MacOSX/solr/build/solr-core/test-files/solr/collection1/conf/currency.xml to /configs/conf1/currency.xml
[junit4:junit4]   2> 201 T2149 oascc.SolrZkClient.makePath makePath: /configs/conf1/currency.xml
[junit4:junit4]   2> 207 T2149 oasc.AbstractZkTestCase.putConfig put /Users/jenkins/jenkins-slave/workspace/Lucene-Solr-trunk-MacOSX/solr/build/solr-core/test-files/solr/collection1/conf/open-exchange-rates.json to /configs/conf1/open-exchange-rates.json
[junit4:junit4]   2> 208 T2149 oascc.SolrZkClient.makePath makePath: /configs/conf1/open-exchange-rates.json
[junit4:junit4]   2> 213 T2149 oasc.AbstractZkTestCase.putConfig put /Users/jenkins/jenkins-slave/workspace/Lucene-Solr-trunk-MacOSX/solr/build/solr-core/test-files/solr/collection1/conf/mapping-ISOLatin1Accent.txt to /configs/conf1/mapping-ISOLatin1Accent.txt
[junit4:junit4]   2> 214 T2149 oascc.SolrZkClient.makePath makePath: /configs/conf1/mapping-ISOLatin1Accent.txt
[junit4:junit4]   2> 219 T2149 oasc.AbstractZkTestCase.putConfig put /Users/jenkins/jenkins-slave/workspace/Lucene-Solr-trunk-MacOSX/solr/build/solr-core/test-files/solr/collection1/conf/old_synonyms.txt to /configs/conf1/old_synonyms.txt
[junit4:junit4]   2> 219 T2149 oascc.SolrZkClient.makePath makePath: /configs/conf1/old_synonyms.txt
[junit4:junit4]   2> 224 T2149 oasc.AbstractZkTestCase.putConfig put /Users/jenkins/jenkins-slave/workspace/Lucene-Solr-trunk-MacOSX/solr/build/solr-core/test-files/solr/collection1/conf/synonyms.txt to /configs/conf1/synonyms.txt
[junit4:junit4]   2> 225 T2149 oascc.SolrZkClient.makePath makePath: /configs/conf1/synonyms.txt
[junit4:junit4]   2> 231 T2154 oazs.PrepRequestProcessor.pRequest2Txn Processed session termination for sessionid: 0x13ca628389d0001
[junit4:junit4]   2> 232 T2151 oazs.NIOServerCnxn.closeSock Closed socket connection for client /127.0.0.1:49794 which had sessionid 0x13ca628389d0001
[junit4:junit4]   2> 232 T2149 oaz.ZooKeeper.close Session: 0x13ca628389d0001 closed
[junit4:junit4]   2> 232 T2158 oaz.ClientCnxn$EventThread.run EventThread shut down
[junit4:junit4]   2> 405 T2149 oejs.Server.doStart jetty-8.1.8.v20121106
[junit4:junit4]   2> 409 T2149 oejs.AbstractConnector.doStart Started SelectChannelConnector@127.0.0.1:49795
[junit4:junit4]   2> 410 T2149 oass.SolrDispatchFilter.init SolrDispatchFilter.init()
[junit4:junit4]   2> 411 T2149 oasc.SolrResourceLoader.locateSolrHome JNDI not configured for solr (NoInitialContextEx)
[junit4:junit4]   2> 411 T2149 oasc.SolrResourceLoader.locateSolrHome using system property solr.solr.home: /Users/jenkins/jenkins-slave/workspace/Lucene-Solr-trunk-MacOSX/solr/build/solr-core/test/J0/./org.apache.solr.cloud.BasicDistributedZkTest-controljetty-1359997319542
[junit4:junit4]   2> 412 T2149 oasc.CoreContainer$Initializer.initialize looking for solr.xml: /Users/jenkins/jenkins-slave/workspace/Lucene-Solr-trunk-MacOSX/solr/build/solr-core/test/J0/./org.apache.solr.cloud.BasicDistributedZkTest-controljetty-1359997319542/solr.xml
[junit4:junit4]   2> 412 T2149 oasc.CoreContainer.<init> New CoreContainer 1966313772
[junit4:junit4]   2> 413 T2149 oasc.CoreContainer.load Loading CoreContainer using Solr Home: '/Users/jenkins/jenkins-slave/workspace/Lucene-Solr-trunk-MacOSX/solr/build/solr-core/test/J0/./org.apache.solr.cloud.BasicDistributedZkTest-controljetty-1359997319542/'
[junit4:junit4]   2> 414 T2149 oasc.SolrResourceLoader.<init> new SolrResourceLoader for directory: '/Users/jenkins/jenkins-slave/workspace/Lucene-Solr-trunk-MacOSX/solr/build/solr-core/test/J0/./org.apache.solr.cloud.BasicDistributedZkTest-controljetty-1359997319542/'
[junit4:junit4]   2> 452 T2149 oashc.HttpShardHandlerFactory.getParameter Setting socketTimeout to: 60000
[junit4:junit4]   2> 453 T2149 oashc.HttpShardHandlerFactory.getParameter Setting urlScheme to: http://
[junit4:junit4]   2> 454 T2149 oashc.HttpShardHandlerFactory.getParameter Setting connTimeout to: 15000
[junit4:junit4]   2> 454 T2149 oashc.HttpShardHandlerFactory.getParameter Setting maxConnectionsPerHost to: 20
[junit4:junit4]   2> 455 T2149 oashc.HttpShardHandlerFactory.getParameter Setting corePoolSize to: 0
[junit4:junit4]   2> 456 T2149 oashc.HttpShardHandlerFactory.getParameter Setting maximumPoolSize to: 2147483647
[junit4:junit4]   2> 456 T2149 oashc.HttpShardHandlerFactory.getParameter Setting maxThreadIdleTime to: 5
[junit4:junit4]   2> 457 T2149 oashc.HttpShardHandlerFactory.getParameter Setting sizeOfQueue to: -1
[junit4:junit4]   2> 457 T2149 oashc.HttpShardHandlerFactory.getParameter Setting fairnessPolicy to: false
[junit4:junit4]   2> 458 T2149 oascsi.HttpClientUtil.createClient Creating new http client, config:maxConnectionsPerHost=20&maxConnections=10000&socketTimeout=60000&connTimeout=15000&retry=false
[junit4:junit4]   2> 471 T2149 oasc.CoreContainer.load Registering Log Listener
[junit4:junit4]   2> 492 T2149 oasc.CoreContainer.initZooKeeper Zookeeper client=127.0.0.1:49792/solr
[junit4:junit4]   2> 493 T2149 oasc.ZkController.checkChrootPath zkHost includes chroot
[junit4:junit4]   2> 494 T2149 oaz.ZooKeeper.<init> Initiating client connection, connectString=127.0.0.1:49792 sessionTimeout=60000 watcher=org.apache.solr.common.cloud.ConnectionManager@487fc905
[junit4:junit4]   2> 495 T2149 oascc.ConnectionManager.waitForConnected Waiting for client to connect to ZooKeeper
[junit4:junit4]   2> 495 T2168 oaz.ClientCnxn$SendThread.logStartConnect Opening socket connection to server localhost/127.0.0.1:49792. Will not attempt to authenticate using SASL (access denied ("javax.security.auth.AuthPermission" "getLoginConfiguration"))
[junit4:junit4]   2> 497 T2168 oaz.ClientCnxn$SendThread.primeConnection Socket connection established to localhost/127.0.0.1:49792, initiating session
[junit4:junit4]   2> 498 T2151 oazs.NIOServerCnxnFactory.run Accepted socket connection from /127.0.0.1:49796
[junit4:junit4]   2> 498 T2151 oazs.ZooKeeperServer.processConnectRequest Client attempting to establish new session at /127.0.0.1:49796
[junit4:junit4]   2> 500 T2153 oazs.ZooKeeperServer.finishSessionInit Established session 0x13ca628389d0002 with negotiated timeout 20000 for client /127.0.0.1:49796
[junit4:junit4]   2> 500 T2168 oaz.ClientCnxn$SendThread.onConnected Session establishment complete on server localhost/127.0.0.1:49792, sessionid = 0x13ca628389d0002, negotiated timeout = 20000
[junit4:junit4]   2> 500 T2169 oascc.ConnectionManager.process Watcher org.apache.solr.common.cloud.ConnectionManager@487fc905 name:ZooKeeperConnection Watcher:127.0.0.1:49792 got event WatchedEvent state:SyncConnected type:None path:null path:null type:None
[junit4:junit4]   2> 500 T2149 oascc.ConnectionManager.waitForConnected Client is connected to ZooKeeper
[junit4:junit4]   2> 503 T2154 oazs.PrepRequestProcessor.pRequest2Txn Processed session termination for sessionid: 0x13ca628389d0002
[junit4:junit4]   2> 504 T2151 oazs.NIOServerCnxn.closeSock Closed socket connection for client /127.0.0.1:49796 which had sessionid 0x13ca628389d0002
[junit4:junit4]   2> 504 T2169 oaz.ClientCnxn$EventThread.run EventThread shut down
[junit4:junit4]   2> 504 T2149 oaz.ZooKeeper.close Session: 0x13ca628389d0002 closed
[junit4:junit4]   2> 506 T2149 oascsi.HttpClientUtil.createClient Creating new http client, config:maxConnections=500&maxConnectionsPerHost=16&socketTimeout=60000&connTimeout=15000
[junit4:junit4]   2> 511 T2149 oaz.ZooKeeper.<init> Initiating client connection, connectString=127.0.0.1:49792/solr sessionTimeout=30000 watcher=org.apache.solr.common.cloud.ConnectionManager@78e4ef07
[junit4:junit4]   2> 512 T2149 oascc.ConnectionManager.waitForConnected Waiting for client to connect to ZooKeeper
[junit4:junit4]   2> 513 T2170 oaz.ClientCnxn$SendThread.logStartConnect Opening socket connection to server localhost/127.0.0.1:49792. Will not attempt to authenticate using SASL (access denied ("javax.security.auth.AuthPermission" "getLoginConfiguration"))
[junit4:junit4]   2> 514 T2170 oaz.ClientCnxn$SendThread.primeConnection Socket connection established to localhost/127.0.0.1:49792, initiating session
[junit4:junit4]   2> 514 T2151 oazs.NIOServerCnxnFactory.run Accepted socket connection from /127.0.0.1:49797
[junit4:junit4]   2> 515 T2151 oazs.ZooKeeperServer.processConnectRequest Client attempting to establish new session at /127.0.0.1:49797
[junit4:junit4]   2> 516 T2153 oazs.ZooKeeperServer.finishSessionInit Established session 0x13ca628389d0003 with negotiated timeout 20000 for client /127.0.0.1:49797
[junit4:junit4]   2> 516 T2170 oaz.ClientCnxn$SendThread.onConnected Session establishment complete on server localhost/127.0.0.1:49792, sessionid = 0x13ca628389d0003, negotiated timeout = 20000
[junit4:junit4]   2> 517 T2171 oascc.ConnectionManager.process Watcher org.apache.solr.common.cloud.ConnectionManager@78e4ef07 name:ZooKeeperConnection Watcher:127.0.0.1:49792/solr got event WatchedEvent state:SyncConnected type:None path:null path:null type:None
[junit4:junit4]   2> 517 T2149 oascc.ConnectionManager.waitForConnected Client is connected to ZooKeeper
[junit4:junit4]   2> 520 T2154 oazs.PrepRequestProcessor.pRequest Got user-level KeeperException when processing sessionid:0x13ca628389d0003 type:create cxid:0x2 zxid:0x1a txntype:-1 reqpath:n/a Error Path:/solr/overseer Error:KeeperErrorCode = NodeExists for /solr/overseer
[junit4:junit4]   2> 522 T2149 oascc.SolrZkClient.makePath makePath: /live_nodes
[junit4:junit4]   2> 525 T2149 oasc.ZkController.createEphemeralLiveNode Register node as live in ZooKeeper:/live_nodes/127.0.0.1:49795_
[junit4:junit4]   2> 526 T2154 oazs.PrepRequestProcessor.pRequest Got user-level KeeperException when processing sessionid:0x13ca628389d0003 type:delete cxid:0x7 zxid:0x1c txntype:-1 reqpath:n/a Error Path:/solr/live_nodes/127.0.0.1:49795_ Error:KeeperErrorCode = NoNode for /solr/live_nodes/127.0.0.1:49795_
[junit4:junit4]   2> 527 T2149 oascc.SolrZkClient.makePath makePath: /live_nodes/127.0.0.1:49795_
[junit4:junit4]   2> 533 T2149 oascc.SolrZkClient.makePath makePath: /overseer_elect/election
[junit4:junit4]   2> 541 T2154 oazs.PrepRequestProcessor.pRequest Got user-level KeeperException when processing sessionid:0x13ca628389d0003 type:delete cxid:0x15 zxid:0x21 txntype:-1 reqpath:n/a Error Path:/solr/overseer_elect/leader Error:KeeperErrorCode = NoNode for /solr/overseer_elect/leader
[junit4:junit4]   2> 542 T2149 oascc.SolrZkClient.makePath makePath: /overseer_elect/leader
[junit4:junit4]   2> 547 T2149 oasc.Overseer.start Overseer (id=89128784319283203-127.0.0.1:49795_-n_0000000000) starting
[junit4:junit4]   2> 548 T2154 oazs.PrepRequestProcessor.pRequest Got user-level KeeperException when processing sessionid:0x13ca628389d0003 type:create cxid:0x1a zxid:0x23 txntype:-1 reqpath:n/a Error Path:/solr/overseer Error:KeeperErrorCode = NodeExists for /solr/overseer
[junit4:junit4]   2> 549 T2154 oazs.PrepRequestProcessor.pRequest Got user-level KeeperException when processing sessionid:0x13ca628389d0003 type:create cxid:0x1b zxid:0x24 txntype:-1 reqpath:n/a Error Path:/solr/overseer Error:KeeperErrorCode = NodeExists for /solr/overseer
[junit4:junit4]   2> 551 T2154 oazs.PrepRequestProcessor.pRequest Got user-level KeeperException when processing sessionid:0x13ca628389d0003 type:create cxid:0x1c zxid:0x25 txntype:-1 reqpath:n/a Error Path:/solr/overseer Error:KeeperErrorCode = NodeExists for /solr/overseer
[junit4:junit4]   2> 553 T2154 oazs.PrepRequestProcessor.pRequest Got user-level KeeperException when processing sessionid:0x13ca628389d0003 type:create cxid:0x1d zxid:0x26 txntype:-1 reqpath:n/a Error Path:/solr/overseer Error:KeeperErrorCode = NodeExists for /solr/overseer
[junit4:junit4]   2> 554 T2173 oasc.OverseerCollectionProcessor.run Process current queue of collection creations
[junit4:junit4]   2> 556 T2149 oascc.SolrZkClient.makePath makePath: /clusterstate.json
[junit4:junit4]   2> 561 T2149 oascc.ZkStateReader.createClusterStateWatchersAndUpdate Updating cluster state from ZooKeeper... 
[junit4:junit4]   2> 565 T2172 oasc.Overseer$ClusterStateUpdater.run Starting to work on the main queue
[junit4:junit4]   2> 571 T2174 oasc.CoreContainer.create Creating SolrCore 'collection1' using instanceDir: /Users/jenkins/jenkins-slave/workspace/Lucene-Solr-trunk-MacOSX/solr/build/solr-core/test/J0/./org.apache.solr.cloud.BasicDistributedZkTest-controljetty-1359997319542/collection1
[junit4:junit4]   2> 571 T2174 oasc.ZkController.createCollectionZkNode Check for collection zkNode:control_collection
[junit4:junit4]   2> 572 T2174 oasc.ZkController.createCollectionZkNode Collection zkNode exists
[junit4:junit4]   2> 573 T2174 oasc.ZkController.readConfigName Load collection config from:/collections/control_collection
[junit4:junit4]   2> 575 T2174 oasc.SolrResourceLoader.<init> new SolrResourceLoader for directory: '/Users/jenkins/jenkins-slave/workspace/Lucene-Solr-trunk-MacOSX/solr/build/solr-core/test/J0/./org.apache.solr.cloud.BasicDistributedZkTest-controljetty-1359997319542/collection1/'
[junit4:junit4]   2> 576 T2174 oasc.SolrResourceLoader.replaceClassLoader Adding 'file:/Users/jenkins/jenkins-slave/workspace/Lucene-Solr-trunk-MacOSX/solr/build/solr-core/test/J0/org.apache.solr.cloud.BasicDistributedZkTest-controljetty-1359997319542/collection1/lib/classes/' to classloader
[junit4:junit4]   2> 577 T2174 oasc.SolrResourceLoader.replaceClassLoader Adding 'file:/Users/jenkins/jenkins-slave/workspace/Lucene-Solr-trunk-MacOSX/solr/build/solr-core/test/J0/org.apache.solr.cloud.BasicDistributedZkTest-controljetty-1359997319542/collection1/lib/README' to classloader
[junit4:junit4]   2> 641 T2174 oasc.SolrConfig.<init> Using Lucene MatchVersion: LUCENE_50
[junit4:junit4]   2> 720 T2174 oasc.SolrConfig.<init> Loaded SolrConfig: solrconfig.xml
[junit4:junit4]   2> 721 T2174 oass.IndexSchema.readSchema Reading Solr Schema
[junit4:junit4]   2> 727 T2174 oass.IndexSchema.readSchema Schema name=test
[junit4:junit4]   2> 1391 T2174 oass.OpenExchangeRatesOrgProvider.init Initialized with rates=open-exchange-rates.json, refreshInterval=1440.
[junit4:junit4]   2> 1401 T2174 oass.IndexSchema.readSchema default search field in schema is text
[junit4:junit4]   2> 1404 T2174 oass.IndexSchema.readSchema unique key field: id
[junit4:junit4]   2> 1426 T2174 oass.FileExchangeRateProvider.reload Reloading exchange rates from file currency.xml
[junit4:junit4]   2> 1431 T2174 oass.FileExchangeRateProvider.reload Reloading exchange rates from file currency.xml
[junit4:junit4]   2> 1436 T2174 oass.OpenExchangeRatesOrgProvider.reload Reloading exchange rates from open-exchange-rates.json
[junit4:junit4]   2> 1438 T2174 oass.OpenExchangeRatesOrgProvider.reload Reloading exchange rates from open-exchange-rates.json
[junit4:junit4]   2> 1440 T2174 oasc.SolrCore.<init> [collection1] Opening new SolrCore at /Users/jenkins/jenkins-slave/workspace/Lucene-Solr-trunk-MacOSX/solr/build/solr-core/test/J0/./org.apache.solr.cloud.BasicDistributedZkTest-controljetty-1359997319542/collection1/, dataDir=./org.apache.solr.cloud.BasicDistributedZkTest-1359997319318/control/data/
[junit4:junit4]   2> 1441 T2174 oasc.JmxMonitoredMap.<init> JMX monitoring is enabled. Adding Solr mbeans to JMX Server: com.sun.jmx.mbeanserver.JmxMBeanServer@679e2502
[junit4:junit4]   2> 1441 T2174 oasc.SolrCore.initDirectoryFactory solr.NRTCachingDirectoryFactory
[junit4:junit4]   2> 1442 T2174 oasc.CachingDirectoryFactory.get return new directory for /Users/jenkins/jenkins-slave/workspace/Lucene-Solr-trunk-MacOSX/solr/build/solr-core/test/J0/./org.apache.solr.cloud.BasicDistributedZkTest-1359997319318/control/data forceNew:false
[junit4:junit4]   2> 1443 T2174 oasc.CachingDirectoryFactory.close Releasing directory:/Users/jenkins/jenkins-slave/workspace/Lucene-Solr-trunk-MacOSX/solr/build/solr-core/test/J0/./org.apache.solr.cloud.BasicDistributedZkTest-1359997319318/control/data
[junit4:junit4]   2> 1443 T2174 oasc.SolrCore.getNewIndexDir New index directory detected: old=null new=./org.apache.solr.cloud.BasicDistributedZkTest-1359997319318/control/data/index/
[junit4:junit4]   2> 1444 T2174 oasc.SolrCore.initIndex WARNING [collection1] Solr index directory './org.apache.solr.cloud.BasicDistributedZkTest-1359997319318/control/data/index' doesn't exist. Creating new index...
[junit4:junit4]   2> 1445 T2174 oasc.CachingDirectoryFactory.get return new directory for /Users/jenkins/jenkins-slave/workspace/Lucene-Solr-trunk-MacOSX/solr/build/solr-core/test/J0/./org.apache.solr.cloud.BasicDistributedZkTest-1359997319318/control/data/index forceNew:false
[junit4:junit4]   2> 1450 T2174 oasc.SolrDeletionPolicy.onCommit SolrDeletionPolicy.onCommit: commits:num=1
[junit4:junit4]   2> 		commit{dir=RateLimitedDirectoryWrapper(NRTCachingDirectory(org.apache.lucene.store.NIOFSDirectory@/Users/jenkins/jenkins-slave/workspace/Lucene-Solr-trunk-MacOSX/solr/build/solr-core/test/J0/org.apache.solr.cloud.BasicDistributedZkTest-1359997319318/control/data/index lockFactory=org.apache.lucene.store.NativeFSLockFactory@4312f795; maxCacheMB=48.0 maxMergeSizeMB=4.0)),segFN=segments_1,generation=1,filenames=[segments_1]
[junit4:junit4]   2> 1450 T2174 oasc.SolrDeletionPolicy.updateCommits newest commit = 1[segments_1]
[junit4:junit4]   2> 1451 T2174 oasc.CachingDirectoryFactory.close Releasing directory:/Users/jenkins/jenkins-slave/workspace/Lucene-Solr-trunk-MacOSX/solr/build/solr-core/test/J0/./org.apache.solr.cloud.BasicDistributedZkTest-1359997319318/control/data/index
[junit4:junit4]   2> 1451 T2174 oasc.SolrCore.initWriters created xml: solr.XMLResponseWriter
[junit4:junit4]   2> 1454 T2174 oasup.UpdateRequestProcessorChain.init inserting DistributedUpdateProcessorFactory into updateRequestProcessorChain "dedupe"
[junit4:junit4]   2> 1454 T2174 oasup.UpdateRequestProcessorChain.init inserting DistributedUpdateProcessorFactory into updateRequestProcessorChain "dedupe-allfields"
[junit4:junit4]   2> 1455 T2174 oasup.UpdateRequestProcessorChain.init inserting DistributedUpdateProcessorFactory into updateRequestProcessorChain "stored_sig"
[junit4:junit4]   2> 1455 T2174 oasup.UpdateRequestProcessorChain.init inserting DistributedUpdateProcessorFactory into updateRequestProcessorChain "uniq-fields"
[junit4:junit4]   2> 1457 T2174 oasup.UpdateRequestProcessorChain.init inserting DistributedUpdateProcessorFactory into updateRequestProcessorChain "distrib-dup-test-chain-implicit"
[junit4:junit4]   2> 1457 T2174 oasc.RequestHandlers.initHandlersFromConfig adding lazy requestHandler: solr.ReplicationHandler
[junit4:junit4]   2> 1458 T2174 oasc.RequestHandlers.initHandlersFromConfig created /replication: solr.ReplicationHandler
[junit4:junit4]   2> 1459 T2174 oasc.RequestHandlers.initHandlersFromConfig created standard: solr.StandardRequestHandler
[junit4:junit4]   2> 1459 T2174 oasc.RequestHandlers.initHandlersFromConfig created /get: solr.RealTimeGetHandler
[junit4:junit4]   2> 1460 T2174 oasc.RequestHandlers.initHandlersFromConfig created dismax: solr.SearchHandler
[junit4:junit4]   2> 1460 T2174 oasc.RequestHandlers.initHandlersFromConfig created mock: org.apache.solr.core.MockQuerySenderListenerReqHandler
[junit4:junit4]   2> 1461 T2174 oasc.RequestHandlers.initHandlersFromConfig created /admin/: org.apache.solr.handler.admin.AdminHandlers
[junit4:junit4]   2> 1461 T2174 oasc.RequestHandlers.initHandlersFromConfig created defaults: solr.StandardRequestHandler
[junit4:junit4]   2> 1462 T2174 oasc.RequestHandlers.initHandlersFromConfig adding lazy requestHandler: solr.StandardRequestHandler
[junit4:junit4]   2> 1462 T2174 oasc.RequestHandlers.initHandlersFromConfig created lazy: solr.StandardRequestHandler
[junit4:junit4]   2> 1463 T2174 oasc.RequestHandlers.initHandlersFromConfig created /update: solr.UpdateRequestHandler
[junit4:junit4]   2> 1463 T2174 oasc.RequestHandlers.initHandlersFromConfig created /terms: org.apache.solr.handler.component.SearchHandler
[junit4:junit4]   2> 1464 T2174 oasc.RequestHandlers.initHandlersFromConfig created spellCheckCompRH: org.apache.solr.handler.component.SearchHandler
[junit4:junit4]   2> 1464 T2174 oasc.RequestHandlers.initHandlersFromConfig created spellCheckCompRH_Direct: org.apache.solr.handler.component.SearchHandler
[junit4:junit4]   2> 1465 T2174 oasc.RequestHandlers.initHandlersFromConfig created spellCheckWithWordbreak: org.apache.solr.handler.component.SearchHandler
[junit4:junit4]   2> 1465 T2174 oasc.RequestHandlers.initHandlersFromConfig created spellCheckWithWordbreak_Direct: org.apache.solr.handler.component.SearchHandler
[junit4:junit4]   2> 1466 T2174 oasc.RequestHandlers.initHandlersFromConfig created spellCheckCompRH1: org.apache.solr.handler.component.SearchHandler
[junit4:junit4]   2> 1466 T2174 oasc.RequestHandlers.initHandlersFromConfig created mltrh: org.apache.solr.handler.component.SearchHandler
[junit4:junit4]   2> 1467 T2174 oasc.RequestHandlers.initHandlersFromConfig created tvrh: org.apache.solr.handler.component.SearchHandler
[junit4:junit4]   2> 1467 T2174 oasc.RequestHandlers.initHandlersFromConfig created /mlt: solr.MoreLikeThisHandler
[junit4:junit4]   2> 1468 T2174 oasc.RequestHandlers.initHandlersFromConfig created /debug/dump: solr.DumpRequestHandler
[junit4:junit4]   2> 1476 T2174 oashl.XMLLoader.init xsltCacheLifetimeSeconds=60
[junit4:junit4]   2> 1480 T2174 oasc.SolrCore.initDeprecatedSupport WARNING solrconfig.xml uses deprecated <admin/gettableFiles>, Please update your config to use the ShowFileRequestHandler.
[junit4:junit4]   2> 1482 T2174 oasc.SolrCore.initDeprecatedSupport WARNING adding ShowFileRequestHandler with hidden files: [SCHEMA.XML, OLD_SYNONYMS.TXT, STOPWORDS.TXT, PROTWORDS.TXT, OPEN-EXCHANGE-RATES.JSON, SYNONYMS.TXT, CURRENCY.XML, MAPPING-ISOLATIN1ACCENT.TXT]
[junit4:junit4]   2> 1485 T2174 oasc.CachingDirectoryFactory.close Releasing directory:/Users/jenkins/jenkins-slave/workspace/Lucene-Solr-trunk-MacOSX/solr/build/solr-core/test/J0/./org.apache.solr.cloud.BasicDistributedZkTest-1359997319318/control/data
[junit4:junit4]   2> 1486 T2174 oass.SolrIndexSearcher.<init> Opening Searcher@4bbcc354 main
[junit4:junit4]   2> 1488 T2174 oasu.CommitTracker.<init> Hard AutoCommit: disabled
[junit4:junit4]   2> 1488 T2174 oasu.CommitTracker.<init> Soft AutoCommit: disabled
[junit4:junit4]   2> 1488 T2174 oashc.SpellCheckComponent.inform Initializing spell checkers
[junit4:junit4]   2> 1494 T2174 oass.DirectSolrSpellChecker.init init: {name=direct,classname=DirectSolrSpellChecker,field=lowerfilt,minQueryLength=3}
[junit4:junit4]   2> 1527 T2175 oasc.SolrCore.registerSearcher [collection1] Registered new searcher Searcher@4bbcc354 main{StandardDirectoryReader(segments_1:1)}
[junit4:junit4]   2> 1532 T2174 oasc.ZkController.publish publishing core=collection1 state=down
[junit4:junit4]   2> 1533 T2174 oasc.ZkController.publish numShards not found on descriptor - reading it from system property
[junit4:junit4]   2> 1534 T2154 oazs.PrepRequestProcessor.pRequest Got user-level KeeperException when processing sessionid:0x13ca628389d0003 type:create cxid:0x50 zxid:0x29 txntype:-1 reqpath:n/a Error Path:/solr/overseer/queue Error:KeeperErrorCode = NoNode for /solr/overseer/queue
[junit4:junit4]   2> 2076 T2172 oascc.ZkStateReader.updateClusterState Updating cloud state from ZooKeeper... 
[junit4:junit4]   2> 2079 T2172 oasc.Overseer$ClusterStateUpdater.updateState Update state numShards=1 message={
[junit4:junit4]   2> 	  "operation":"state",
[junit4:junit4]   2> 	  "numShards":"1",
[junit4:junit4]   2> 	  "shard":null,
[junit4:junit4]   2> 	  "roles":null,
[junit4:junit4]   2> 	  "state":"down",
[junit4:junit4]   2> 	  "core":"collection1",
[junit4:junit4]   2> 	  "collection":"control_collection",
[junit4:junit4]   2> 	  "node_name":"127.0.0.1:49795_",
[junit4:junit4]   2> 	  "base_url":"http://127.0.0.1:49795"}
[junit4:junit4]   2> 2080 T2172 oasc.Overseer$ClusterStateUpdater.createCollection Create collection control_collection with numShards 1
[junit4:junit4]   2> 2081 T2172 oasc.Overseer$ClusterStateUpdater.updateState Assigning new node to shard shard=shard1
[junit4:junit4]   2> 2083 T2154 oazs.PrepRequestProcessor.pRequest Got user-level KeeperException when processing sessionid:0x13ca628389d0003 type:create cxid:0x58 zxid:0x2c txntype:-1 reqpath:n/a Error Path:/solr/overseer/queue-work Error:KeeperErrorCode = NoNode for /solr/overseer/queue-work
[junit4:junit4]   2> 2100 T2171 oascc.ZkStateReader$2.process A cluster state change: WatchedEvent state:SyncConnected type:NodeDataChanged path:/clusterstate.json, has occurred - updating... (live nodes size: 1)
[junit4:junit4]   2> 2539 T2174 oasc.CoreContainer.registerCore registering core: collection1
[junit4:junit4]   2> 2539 T2174 oasc.ZkController.register Register replica - core:collection1 address:http://127.0.0.1:49795 collection:control_collection shard:shard1
[junit4:junit4]   2> 2541 T2174 oascc.SolrZkClient.makePath makePath: /collections/control_collection/leader_elect/shard1/election
[junit4:junit4]   2> 2553 T2154 oazs.PrepRequestProcessor.pRequest Got user-level KeeperException when processing sessionid:0x13ca628389d0003 type:delete cxid:0x72 zxid:0x36 txntype:-1 reqpath:n/a Error Path:/solr/collections/control_collection/leaders Error:KeeperErrorCode = NoNode for /solr/collections/control_collection/leaders
[junit4:junit4]   2> 2554 T2174 oasc.ShardLeaderElectionContext.runLeaderProcess Running the leader process.
[junit4:junit4]   2> 2555 T2154 oazs.PrepRequestProcessor.pRequest Got user-level KeeperException when processing sessionid:0x13ca628389d0003 type:create cxid:0x73 zxid:0x37 txntype:-1 reqpath:n/a Error Path:/solr/overseer Error:KeeperErrorCode = NodeExists for /solr/overseer
[junit4:junit4]   2> 2558 T2174 oasc.ShardLeaderElectionContext.waitForReplicasToComeUp Enough replicas found to continue.
[junit4:junit4]   2> 2558 T2174 oasc.ShardLeaderElectionContext.runLeaderProcess I may be the new leader - try and sync
[junit4:junit4]   2> 2558 T2174 oasc.SyncStrategy.sync Sync replicas to http://127.0.0.1:49795/collection1/
[junit4:junit4]   2> 2559 T2174 oasc.SyncStrategy.syncReplicas Sync Success - now sync replicas to me
[junit4:junit4]   2> 2559 T2174 oasc.SyncStrategy.syncToMe http://127.0.0.1:49795/collection1/ has no replicas
[junit4:junit4]   2> 2559 T2174 oasc.ShardLeaderElectionContext.runLeaderProcess I am the new leader: http://127.0.0.1:49795/collection1/
[junit4:junit4]   2> 2559 T2174 oascc.SolrZkClient.makePath makePath: /collections/control_collection/leaders/shard1
[junit4:junit4]   2> 2566 T2154 oazs.PrepRequestProcessor.pRequest Got user-level KeeperException when processing sessionid:0x13ca628389d0003 type:create cxid:0x7d zxid:0x3b txntype:-1 reqpath:n/a Error Path:/solr/overseer Error:KeeperErrorCode = NodeExists for /solr/overseer
[junit4:junit4]   2> 3614 T2172 oascc.ZkStateReader.updateClusterState Updating cloud state from ZooKeeper... 
[junit4:junit4]   2> 3630 T2171 oascc.ZkStateReader$2.process A cluster state change: WatchedEvent state:SyncConnected type:NodeDataChanged path:/clusterstate.json, has occurred - updating... (live nodes size: 1)
[junit4:junit4]   2> 3685 T2174 oasc.ZkController.register We are http://127.0.0.1:49795/collection1/ and leader is http://127.0.0.1:49795/collection1/
[junit4:junit4]   2> 3686 T2174 oasc.ZkController.register No LogReplay needed for core=collection1 baseURL=http://127.0.0.1:49795
[junit4:junit4]   2> 3686 T2174 oasc.ZkController.checkRecovery I am the leader, no recovery necessary
[junit4:junit4]   2> 3686 T2174 oasc.ZkController.publish publishing core=collection1 state=active
[junit4:junit4]   2> 3686 T2174 oasc.ZkController.publish numShards not found on descriptor - reading it from system property
[junit4:junit4]   2> 3699 T2174 oascc.ZkStateReader.updateClusterState Updating cloud state from ZooKeeper... 
[junit4:junit4]   2> 3702 T2149 oass.SolrDispatchFilter.init user.dir=/Users/jenkins/jenkins-slave/workspace/Lucene-Solr-trunk-MacOSX/solr/build/solr-core/test/J0
[junit4:junit4]   2> 3703 T2149 oass.SolrDispatchFilter.init SolrDispatchFilter.init() done
[junit4:junit4]   2> 3703 T2149 oascsi.HttpClientUtil.createClient Creating new http client, config:maxConnections=128&maxConnectionsPerHost=32&followRedirects=false
[junit4:junit4]   2> 3710 T2149 oascsi.HttpClientUtil.createClient Creating new http client, config:
[junit4:junit4]   2> 3715 T2149 oaz.ZooKeeper.<init> Initiating client connection, connectString=127.0.0.1:49792/solr sessionTimeout=10000 watcher=org.apache.solr.common.cloud.ConnectionManager@50cae6ab
[junit4:junit4]   2> 3716 T2149 oascc.ConnectionManager.waitForConnected Waiting for client to connect to ZooKeeper
[junit4:junit4]   2> 3717 T2176 oaz.ClientCnxn$SendThread.logStartConnect Opening socket connection to server localhost/127.0.0.1:49792. Will not attempt to authenticate using SASL (access denied ("javax.security.auth.AuthPermission" "getLoginConfiguration"))
[junit4:junit4]   2> 3717 T2176 oaz.ClientCnxn$SendThread.primeConnection Socket connection established to localhost/127.0.0.1:49792, initiating session
[junit4:junit4]   2> 3718 T2151 oazs.NIOServerCnxnFactory.run Accepted socket connection from /127.0.0.1:49798
[junit4:junit4]   2> 3718 T2151 oazs.ZooKeeperServer.processConnectRequest Client attempting to establish new session at /127.0.0.1:49798
[junit4:junit4]   2> 3719 T2153 oazs.ZooKeeperServer.finishSessionInit Established session 0x13ca628389d0004 with negotiated timeout 10000 for client /127.0.0.1:49798
[junit4:junit4]   2> 3720 T2176 oaz.ClientCnxn$SendThread.onConnected Session establishment complete on server localhost/127.0.0.1:49792, sessionid = 0x13ca628389d0004, negotiated timeout = 10000
[junit4:junit4]   2> 3720 T2177 oascc.ConnectionManager.process Watcher org.apache.solr.common.cloud.ConnectionManager@50cae6ab name:ZooKeeperConnection Watcher:127.0.0.1:49792/solr got event WatchedEvent state:SyncConnected type:None path:null path:null type:None
[junit4:junit4]   2> 3720 T2149 oascc.ConnectionManager.waitForConnected Client is connected to ZooKeeper
[junit4:junit4]   2> 3723 T2149 oascc.ZkStateReader.createClusterStateWatchersAndUpdate Updating cluster state from ZooKeeper... 
[junit4:junit4]   2> 3726 T2149 oasc.ChaosMonkey.monkeyLog monkey: init - expire sessions:true cause connection loss:true
[junit4:junit4]   2> 3924 T2149 oejs.Server.doStart jetty-8.1.8.v20121106
[junit4:junit4]   2> 3927 T2149 oejs.AbstractConnector.doStart Started SelectChannelConnector@127.0.0.1:49799
[junit4:junit4]   2> 3929 T2149 oass.SolrDispatchFilter.init SolrDispatchFilter.init()
[junit4:junit4]   2> 3929 T2149 oasc.SolrResourceLoader.locateSolrHome JNDI not configured for solr (NoInitialContextEx)
[junit4:junit4]   2> 3930 T2149 oasc.SolrResourceLoader.locateSolrHome using system property solr.solr.home: /Users/jenkins/jenkins-slave/workspace/Lucene-Solr-trunk-MacOSX/solr/build/solr-core/test/J0/./org.apache.solr.cloud.BasicDistributedZkTest-jetty1-1359997323034
[junit4:junit4]   2> 3931 T2149 oasc.CoreContainer$Initializer.initialize looking for solr.xml: /Users/jenkins/jenkins-slave/workspace/Lucene-Solr-trunk-MacOSX/solr/build/solr-core/test/J0/./org.apache.solr.cloud.BasicDistributedZkTest-jetty1-1359997323034/solr.xml
[junit4:junit4]   2> 3931 T2149 oasc.CoreContainer.<init> New CoreContainer 1305431574
[junit4:junit4]   2> 3932 T2149 oasc.CoreContainer.load Loading CoreContainer using Solr Home: '/Users/jenkins/jenkins-slave/workspace/Lucene-Solr-trunk-MacOSX/solr/build/solr-core/test/J0/./org.apache.solr.cloud.BasicDistributedZkTest-jetty1-1359997323034/'
[junit4:junit4]   2> 3932 T2149 oasc.SolrResourceLoader.<init> new SolrResourceLoader for directory: '/Users/jenkins/jenkins-slave/workspace/Lucene-Solr-trunk-MacOSX/solr/build/solr-core/test/J0/./org.apache.solr.cloud.BasicDistributedZkTest-jetty1-1359997323034/'
[junit4:junit4]   2> 3973 T2149 oashc.HttpShardHandlerFactory.getParameter Setting socketTimeout to: 60000
[junit4:junit4]   2> 3974 T2149 oashc.HttpShardHandlerFactory.getParameter Setting urlScheme to: http://
[junit4:junit4]   2> 3975 T2149 oashc.HttpShardHandlerFactory.getParameter Setting connTimeout to: 15000
[junit4:junit4]   2> 3975 T2149 oashc.HttpShardHandlerFactory.getParameter Setting maxConnectionsPerHost to: 20
[junit4:junit4]   2> 3976 T2149 oashc.HttpShardHandlerFactory.getParameter Setting corePoolSize to: 0
[junit4:junit4]   2> 3977 T2149 oashc.HttpShardHandlerFactory.getParameter Setting maximumPoolSize to: 2147483647
[junit4:junit4]   2> 3977 T2149 oashc.HttpShardHandlerFactory.getParameter Setting maxThreadIdleTime to: 5
[junit4:junit4]   2> 3978 T2149 oashc.HttpShardHandlerFactory.getParameter Setting sizeOfQueue to: -1
[junit4:junit4]   2> 3978 T2149 oashc.HttpShardHandlerFactory.getParameter Setting fairnessPolicy to: false
[junit4:junit4]   2> 3979 T2149 oascsi.HttpClientUtil.createClient Creating new http client, config:maxConnectionsPerHost=20&maxConnections=10000&socketTimeout=60000&connTimeout=15000&retry=false
[junit4:junit4]   2> 3992 T2149 oasc.CoreContainer.load Registering Log Listener
[junit4:junit4]   2> 4012 T2149 oasc.CoreContainer.initZooKeeper Zookeeper client=127.0.0.1:49792/solr
[junit4:junit4]   2> 4013 T2149 oasc.ZkController.checkChrootPath zkHost includes chroot
[junit4:junit4]   2> 4014 T2149 oaz.ZooKeeper.<init> Initiating client connection, connectString=127.0.0.1:49792 sessionTimeout=60000 watcher=org.apache.solr.common.cloud.ConnectionManager@2bd91d25
[junit4:junit4]   2> 4015 T2149 oascc.ConnectionManager.waitForConnected Waiting for client to connect to ZooKeeper
[junit4:junit4]   2> 4015 T2187 oaz.ClientCnxn$SendThread.logStartConnect Opening socket connection to server localhost/127.0.0.1:49792. Will not attempt to authenticate using SASL (access denied ("javax.security.auth.AuthPermission" "getLoginConfiguration"))
[junit4:junit4]   2> 4017 T2187 oaz.ClientCnxn$SendThread.primeConnection Socket connection established to localhost/127.0.0.1:49792, initiating session
[junit4:junit4]   2> 4017 T2151 oazs.NIOServerCnxnFactory.run Accepted socket connection from /127.0.0.1:49800
[junit4:junit4]   2> 4018 T2151 oazs.ZooKeeperServer.processConnectRequest Client attempting to establish new session at /127.0.0.1:49800
[junit4:junit4]   2> 4316 T2153 oazs.ZooKeeperServer.finishSessionInit Established session 0x13ca628389d0005 with negotiated timeout 20000 for client /127.0.0.1:49800
[junit4:junit4]   2> 4316 T2187 oaz.ClientCnxn$SendThread.onConnected Session establishment complete on server localhost/127.0.0.1:49792, sessionid = 0x13ca628389d0005, negotiated timeout = 20000
[junit4:junit4]   2> 4317 T2188 oascc.ConnectionManager.process Watcher org.apache.solr.common.cloud.ConnectionManager@2bd91d25 name:ZooKeeperConnection Watcher:127.0.0.1:49792 got event WatchedEvent state:SyncConnected type:None path:null path:null type:None
[junit4:junit4]   2> 4318 T2149 oascc.ConnectionManager.waitForConnected Client is connected to ZooKeeper
[junit4:junit4]   2> 4322 T2154 oazs.PrepRequestProcessor.pRequest2Txn Processed session termination for sessionid: 0x13ca628389d0005
[junit4:junit4]   2> 4323 T2151 oazs.NIOServerCnxn.closeSock Closed socket connection for client /127.0.0.1:49800 which had sessionid 0x13ca628389d0005
[junit4:junit4]   2> 4324 T2188 oaz.ClientCnxn$EventThread.run EventThread shut down
[junit4:junit4]   2> 4323 T2149 oaz.ZooKeeper.close Session: 0x13ca628389d0005 closed
[junit4:junit4]   2> 4325 T2149 oascsi.HttpClientUtil.createClient Creating new http client, config:maxConnections=500&maxConnectionsPerHost=16&socketTimeout=60000&connTimeout=15000
[junit4:junit4]   2> 4329 T2149 oaz.ZooKeeper.<init> Initiating client connection, connectString=127.0.0.1:49792/solr sessionTimeout=30000 watcher=org.apache.solr.common.cloud.ConnectionManager@52ba7516
[junit4:junit4]   2> 4330 T2149 oascc.ConnectionManager.waitForConnected Waiting for client to connect to ZooKeeper
[junit4:junit4]   2> 4331 T2189 oaz.ClientCnxn$SendThread.logStartConnect Opening socket connection to server localhost/127.0.0.1:49792. Will not attempt to authenticate using SASL (access denied ("javax.security.auth.AuthPermission" "getLoginConfiguration"))
[junit4:junit4]   2> 4332 T2189 oaz.ClientCnxn$SendThread.primeConnection Socket connection established to localhost/127.0.0.1:49792, initiating session
[junit4:junit4]   2> 4332 T2151 oazs.NIOServerCnxnFactory.run Accepted socket connection from /127.0.0.1:49801
[junit4:junit4]   2> 4333 T2151 oazs.ZooKeeperServer.processConnectRequest Client attempting to establish new session at /127.0.0.1:49801
[junit4:junit4]   2> 4334 T2153 oazs.ZooKeeperServer.finishSessionInit Established session 0x13ca628389d0006 with negotiated timeout 20000 for client /127.0.0.1:49801
[junit4:junit4]   2> 4334 T2189 oaz.ClientCnxn$SendThread.onConnected Session establishment complete on server localhost/127.0.0.1:49792, sessionid = 0x13ca628389d0006, negotiated timeout = 20000
[junit4:junit4]   2> 4334 T2190 oascc.ConnectionManager.process Watcher org.apache.solr.common.cloud.ConnectionManager@52ba7516 name:ZooKeeperConnection Watcher:127.0.0.1:49792/solr got event WatchedEvent state:SyncConnected type:None path:null path:null type:None
[junit4:junit4]   2> 4335 T2149 oascc.ConnectionManager.waitForConnected Client is connected to ZooKeeper
[junit4:junit4]   2> 4337 T2154 oazs.PrepRequestProcessor.pRequest Got user-level KeeperException when processing sessionid:0x13ca628389d0006 type:create cxid:0x1 zxid:0x49 txntype:-1 reqpath:n/a Error Path:/solr/overseer Error:KeeperErrorCode = NodeExists for /solr/overseer
[junit4:junit4]   2> 4338 T2154 oazs.PrepRequestProcessor.pRequest Got user-level KeeperException when processing sessionid:0x13ca628389d0006 type:create cxid:0x2 zxid:0x4a txntype:-1 reqpath:n/a Error Path:/solr/overseer Error:KeeperErrorCode = NodeExists for /solr/overseer
[junit4:junit4]   2> 4340 T2149 oasc.ZkController.createEphemeralLiveNode Register node as live in ZooKeeper:/live_nodes/127.0.0.1:49799_
[junit4:junit4]   2> 4341 T2154 oazs.PrepRequestProcessor.pRequest Got user-level KeeperException when processing sessionid:0x13ca628389d0006 type:delete cxid:0x4 zxid:0x4b txntype:-1 reqpath:n/a Error Path:/solr/live_nodes/127.0.0.1:49799_ Error:KeeperErrorCode = NoNode for /solr/live_nodes/127.0.0.1:49799_
[junit4:junit4]   2> 4342 T2149 oascc.SolrZkClient.makePath makePath: /live_nodes/127.0.0.1:49799_
[junit4:junit4]   2> 4346 T2171 oascc.ZkStateReader$2.process A cluster state change: WatchedEvent state:SyncConnected type:NodeChildrenChanged path:/live_nodes, has occurred - updating... (live nodes size: 1)
[junit4:junit4]   2> 4347 T2177 oascc.ZkStateReader$3.process Updating live nodes... (2)
[junit4:junit4]   2> 4350 T2171 oascc.ZkStateReader$3.process Updating live nodes... (2)
[junit4:junit4]   2> 4353 T2149 oascc.ZkStateReader.createClusterStateWatchersAndUpdate Updating cluster state from ZooKeeper... 
[junit4:junit4]   2> 4362 T2191 oasc.CoreContainer.create Creating SolrCore 'collection1' using instanceDir: /Users/jenkins/jenkins-slave/workspace/Lucene-Solr-trunk-MacOSX/solr/build/solr-core/test/J0/./org.apache.solr.cloud.BasicDistributedZkTest-jetty1-1359997323034/collection1
[junit4:junit4]   2> 4362 T2191 oasc.ZkController.createCollectionZkNode Check for collection zkNode:collection1
[junit4:junit4]   2> 4363 T2191 oasc.ZkController.createCollectionZkNode Collection zkNode exists
[junit4:junit4]   2> 4364 T2191 oasc.ZkController.readConfigName Load collection config from:/collections/collection1
[junit4:junit4]   2> 4366 T2191 oasc.SolrResourceLoader.<init> new SolrResourceLoader for directory: '/Users/jenkins/jenkins-slave/workspace/Lucene-Solr-trunk-MacOSX/solr/build/solr-core/test/J0/./org.apache.solr.cloud.BasicDistributedZkTest-jetty1-1359997323034/collection1/'
[junit4:junit4]   2> 4367 T2191 oasc.SolrResourceLoader.replaceClassLoader Adding 'file:/Users/jenkins/jenkins-slave/workspace/Lucene-Solr-trunk-MacOSX/solr/build/solr-core/test/J0/org.apache.solr.cloud.BasicDistributedZkTest-jetty1-1359997323034/collection1/lib/classes/' to classloader
[junit4:junit4]   2> 4367 T2191 oasc.SolrResourceLoader.replaceClassLoader Adding 'file:/Users/jenkins/jenkins-slave/workspace/Lucene-Solr-trunk-MacOSX/solr/build/solr-core/test/J0/org.apache.solr.cloud.BasicDistributedZkTest-jetty1-1359997323034/collection1/lib/README' to classloader
[junit4:junit4]   2> 4431 T2191 oasc.SolrConfig.<init> Using Lucene MatchVersion: LUCENE_50
[junit4:junit4]   2> 4512 T2191 oasc.SolrConfig.<init> Loaded SolrConfig: solrconfig.xml
[junit4:junit4]   2> 4513 T2191 oass.IndexSchema.readSchema Reading Solr Schema
[junit4:junit4]   2> 4519 T2191 oass.IndexSchema.readSchema Schema name=test
[junit4:junit4]   2> 5139 T2172 oascc.ZkStateReader.updateClusterState Updating cloud state from ZooKeeper... 
[junit4:junit4]   2> 5140 T2172 oasc.Overseer$ClusterStateUpdater.updateState Update state numShards=1 message={
[junit4:junit4]   2> 	  "operation":"state",
[junit4:junit4]   2> 	  "numShards":"1",
[junit4:junit4]   2> 	  "shard":"shard1",
[junit4:junit4]   2> 	  "roles":null,
[junit4:junit4]   2> 	  "state":"active",
[junit4:junit4]   2> 	  "core":"collection1",
[junit4:junit4]   2> 	  "collection":"control_collection",
[junit4:junit4]   2> 	  "node_name":"127.0.0.1:49795_",
[junit4:junit4]   2> 	  "base_url":"http://127.0.0.1:49795"}
[junit4:junit4]   2> 5146 T2171 oascc.ZkStateReader$2.process A cluster state change: WatchedEvent state:SyncConnected type:NodeDataChanged path:/clusterstate.json, has occurred - updating... (live nodes size: 2)
[junit4:junit4]   2> 5146 T2177 oascc.ZkStateReader$2.process A cluster state change: WatchedEvent state:SyncConnected type:NodeDataChanged path:/clusterstate.json, has occurred - updating... (live nodes size: 2)
[junit4:junit4]   2> 5150 T2190 oascc.ZkStateReader$2.process A cluster state change: WatchedEvent state:SyncConnected type:NodeDataChanged path:/clusterstate.json, has occurred - updating... (live nodes size: 2)
[junit4:junit4]   2> 5156 T2191 oass.OpenExchangeRatesOrgProvider.init Initialized with rates=open-exchange-rates.json, refreshInterval=1440.
[junit4:junit4]   2> 5166 T2191 oass.IndexSchema.readSchema default search field in schema is text
[junit4:junit4]   2> 5169 T2191 oass.IndexSchema.readSchema unique key field: id
[junit4:junit4]   2> 5192 T2191 oass.FileExchangeRateProvider.reload Reloading exchange rates from file currency.xml
[junit4:junit4]   2> 5198 T2191 oass.FileExchangeRateProvider.reload Reloading exchange rates from file currency.xml
[junit4:junit4]   2> 5203 T2191 oass.OpenExchangeRatesOrgProvider.reload Reloading exchange rates from open-exchange-rates.json
[junit4:junit4]   2> 5205 T2191 oass.OpenExchangeRatesOrgProvider.reload Reloading exchange rates from open-exchange-rates.json
[junit4:junit4]   2> 5207 T2191 oasc.SolrCore.<init> [collection1] Opening new SolrCore at /Users/jenkins/jenkins-slave/workspace/Lucene-Solr-trunk-MacOSX/solr/build/solr-core/test/J0/./org.apache.solr.cloud.BasicDistributedZkTest-jetty1-1359997323034/collection1/, dataDir=./org.apache.solr.cloud.BasicDistributedZkTest-1359997319318/jetty1/
[junit4:junit4]   2> 5207 T2191 oasc.JmxMonitoredMap.<init> JMX monitoring is enabled. Adding Solr mbeans to JMX Server: com.sun.jmx.mbeanserver.JmxMBeanServer@679e2502
[junit4:junit4]   2> 5208 T2191 oasc.SolrCore.initDirectoryFactory solr.NRTCachingDirectoryFactory
[junit4:junit4]   2> 5209 T2191 oasc.CachingDirectoryFactory.get return new directory for /Users/jenkins/jenkins-slave/workspace/Lucene-Solr-trunk-MacOSX/solr/build/solr-core/test/J0/./org.apache.solr.cloud.BasicDistributedZkTest-1359997319318/jetty1 forceNew:false
[junit4:junit4]   2> 5209 T2191 oasc.CachingDirectoryFactory.close Releasing directory:/Users/jenkins/jenkins-slave/workspace/Lucene-Solr-trunk-MacOSX/solr/build/solr-core/test/J0/./org.apache.solr.cloud.BasicDistributedZkTest-1359997319318/jetty1
[junit4:junit4]   2> 5210 T2191 oasc.SolrCore.getNewIndexDir New index directory detected: old=null new=./org.apache.solr.cloud.BasicDistributedZkTest-1359997319318/jetty1/index/
[junit4:junit4]   2> 5210 T2191 oasc.SolrCore.initIndex WARNING [collection1] Solr index directory './org.apache.solr.cloud.BasicDistributedZkTest-1359997319318/jetty1/index' doesn't exist. Creating new index...
[junit4:junit4]   2> 5212 T2191 oasc.CachingDirectoryFactory.get return new directory for /Users/jenkins/jenkins-slave/workspace/Lucene-Solr-trunk-MacOSX/solr/build/solr-core/test/J0/./org.apache.solr.cloud.BasicDistributedZkTest-1359997319318/jetty1/index forceNew:false
[junit4:junit4]   2> 5217 T2191 oasc.SolrDeletionPolicy.onCommit SolrDeletionPolicy.onCommit: commits:num=1
[junit4:junit4]   2> 		commit{dir=RateLimitedDirectoryWrapper(NRTCachingDirectory(org.apache.lucene.store.NIOFSDirectory@/Users/jenkins/jenkins-slave/workspace/Lucene-Solr-trunk-MacOSX/solr/build/solr-core/test/J0/org.apache.solr.cloud.BasicDistributedZkTest-1359997319318/jetty1/index lockFactory=org.apache.lucene.store.NativeFSLockFactory@15ddf9d; maxCacheMB=48.0 maxMergeSizeMB=4.0)),segFN=segments_1,generation=1,filenames=[segments_1]
[junit4:junit4]   2> 5217 T2191 oasc.SolrDeletionPolicy.updateCommits newest commit = 1[segments_1]
[junit4:junit4]   2> 5218 T2191 oasc.CachingDirectoryFactory.close Releasing directory:/Users/jenkins/jenkins-slave/workspace/Lucene-Solr-trunk-MacOSX/solr/build/solr-core/test/J0/./org.apache.solr.cloud.BasicDistributedZkTest-1359997319318/jetty1/index
[junit4:junit4]   2> 5218 T2191 oasc.SolrCore.initWriters created xml: solr.XMLResponseWriter
[junit4:junit4]   2> 5221 T2191 oasup.UpdateRequestProcessorChain.init inserting DistributedUpdateProcessorFactory into updateRequestProcessorChain "dedupe"
[junit4:junit4]   2> 5221 T2191 oasup.UpdateRequestProcessorChain.init inserting DistributedUpdateProcessorFactory into updateRequestProcessorChain "dedupe-allfields"
[junit4:junit4]   2> 5222 T2191 oasup.UpdateRequestProcessorChain.init inserting DistributedUpdateProcessorFactory into updateRequestProcessorChain "stored_sig"
[junit4:junit4]   2> 5222 T2191 oasup.UpdateRequestProcessorChain.init inserting DistributedUpdateProcessorFactory into updateRequestProcessorChain "uniq-fields"
[junit4:junit4]   2> 5223 T2191 oasup.UpdateRequestProcessorChain.init inserting DistributedUpdateProcessorFactory into updateRequestProcessorChain "distrib-dup-test-chain-implicit"
[junit4:junit4]   2> 5224 T2191 oasc.RequestHandlers.initHandlersFromConfig adding lazy requestHandler: solr.ReplicationHandler
[junit4:junit4]   2> 5224 T2191 oasc.RequestHandlers.initHandlersFromConfig created /replication: solr.ReplicationHandler
[junit4:junit4]   2> 5225 T2191 oasc.RequestHandlers.initHandlersFromConfig created standard: solr.StandardRequestHandler
[junit4:junit4]   2> 5226 T2191 oasc.RequestHandlers.initHandlersFromConfig created /get: solr.RealTimeGetHandler
[junit4:junit4]   2> 5226 T2191 oasc.RequestHandlers.initHandlersFromConfig created dismax: solr.SearchHandler
[junit4:junit4]   2> 5228 T2191 oasc.RequestHandlers.initHandlersFromConfig created mock: org.apache.solr.core.MockQuerySenderListenerReqHandler
[junit4:junit4]   2> 5228 T2191 oasc.RequestHandlers.initHandlersFromConfig created /admin/: org.apache.solr.handler.admin.AdminHandlers
[junit4:junit4]   2> 5229 T2191 oasc.RequestHandlers.initHandlersFromConfig created defaults: solr.StandardRequestHandler
[junit4:junit4]   2> 5229 T2191 oasc.RequestHandlers.initHandlersFromConfig adding lazy requestHandler: solr.StandardRequestHandler
[junit4:junit4]   2> 5230 T2191 oasc.RequestHandlers.initHandlersFromConfig created lazy: solr.StandardRequestHandler
[junit4:junit4]   2> 5230 T2191 oasc.RequestHandlers.initHandlersFromConfig created /update: solr.UpdateRequestHandler
[junit4:junit4]   2> 5231 T2191 oasc.RequestHandlers.initHandlersFromConfig created /terms: org.apache.solr.handler.component.SearchHandler
[junit4:junit4]   2> 5231 T2191 oasc.RequestHandlers.initHandlersFromConfig created spellCheckCompRH: org.apache.solr.handler.component.SearchHandler
[junit4:junit4]   2> 5232 T2191 oasc.RequestHandlers.initHandlersFromConfig created spellCheckCompRH_Direct: org.apache.solr.handler.component.SearchHandler
[junit4:junit4]   2> 5232 T2191 oasc.RequestHandlers.initHandlersFromConfig created spellCheckWithWordbreak: org.apache.solr.handler.component.SearchHandler
[junit4:junit4]   2> 5233 T2191 oasc.RequestHandlers.initHandlersFromConfig created spellCheckWithWordbreak_Direct: org.apache.solr.handler.component.SearchHandler
[junit4:junit4]   2> 5234 T2191 oasc.RequestHandlers.initHandlersFromConfig created spellCheckCompRH1: org.apache.solr.handler.component.SearchHandler
[junit4:junit4]   2> 5234 T2191 oasc.RequestHandlers.initHandlersFromConfig created mltrh: org.apache.solr.handler.component.SearchHandler
[junit4:junit4]   2> 5235 T2191 oasc.RequestHandlers.initHandlersFromConfig created tvrh: org.apache.solr.handler.component.SearchHandler
[junit4:junit4]   2> 5235 T2191 oasc.RequestHandlers.initHandlersFromConfig created /mlt: solr.MoreLikeThisHandler
[junit4:junit4]   2> 5236 T2191 oasc.RequestHandlers.initHandlersFromConfig created /debug/dump: solr.DumpRequestHandler
[junit4:junit4]   2> 5242 T2191 oashl.XMLLoader.init xsltCacheLifetimeSeconds=60
[junit4:junit4]   2> 5245 T2191 oasc.SolrCore.initDeprecatedSupport WARNING solrconfig.xml uses deprecated <admin/gettableFiles>, Please update your config to use the ShowFileRequestHandler.
[junit4:junit4]   2> 5246 T2191 oasc.SolrCore.initDeprecatedSupport WARNING adding ShowFileRequestHandler with hidden files: [SCHEMA.XML, OLD_SYNONYMS.TXT, STOPWORDS.TXT, PROTWORDS.TXT, OPEN-EXCHANGE-RATES.JSON, SYNONYMS.TXT, CURRENCY.XML, MAPPING-ISOLATIN1ACCENT.TXT]
[junit4:junit4]   2> 5248 T2191 oasc.CachingDirectoryFactory.close Releasing directory:/Users/jenkins/jenkins-slave/workspace/Lucene-Solr-trunk-MacOSX/solr/build/solr-core/test/J0/./org.apache.solr.cloud.BasicDistributedZkTest-1359997319318/jetty1
[junit4:junit4]   2> 5249 T2191 oass.SolrIndexSearcher.<init> Opening Searcher@32dbc0b2 main
[junit4:junit4]   2> 5250 T2191 oasu.CommitTracker.<init> Hard AutoCommit: disabled
[junit4:junit4]   2> 5251 T2191 oasu.CommitTracker.<init> Soft AutoCommit: disabled
[junit4:junit4]   2> 5251 T2191 oashc.SpellCheckComponent.inform Initializing spell checkers
[junit4:junit4]   2> 5255 T2191 oass.DirectSolrSpellChecker.init init: {name=direct,classname=DirectSolrSpellChecker,field=lowerfilt,minQueryLength=3}
[junit4:junit4]   2> 5277 T2192 oasc.SolrCore.registerSearcher [collection1] Registered new searcher Searcher@32dbc0b2 main{StandardDirectoryReader(segments_1:1)}
[junit4:junit4]   2> 5281 T2191 oasc.ZkController.publish publishing core=collection1 state=down
[junit4:junit4]   2> 5281 T2191 oasc.ZkController.publish numShards not found on descriptor - reading it from system property
[junit4:junit4]   2> 6659 T2172 oascc.ZkStateReader.updateClusterState Updating cloud state from ZooKeeper... 
[junit4:junit4]   2> 6661 T2172 oasc.Overseer$ClusterStateUpdater.updateState Update state numShards=2 message={
[junit4:junit4]   2> 	  "operation":"state",
[junit4:junit4]   2> 	  "numShards":"2",
[junit4:junit4]   2> 	  "shard":null,
[junit4:junit4]   2> 	  "roles":null,
[junit4:junit4]   2> 	  "state":"down",
[junit4:junit4]   2> 	  "core":"collection1",
[junit4:junit4]   2> 	  "collection":"collection1",
[junit4:junit4]   2> 	  "node_name":"127.0.0.1:49799_",
[junit4:junit4]   2> 	  "base_url":"http://127.0.0.1:49799"}
[junit4:junit4]   2> 6661 T2172 oasc.Overseer$ClusterStateUpdater.createCollection Create collection collection1 with numShards 2
[junit4:junit4]   2> 6662 T2172 oasc.Overseer$ClusterStateUpdater.updateState Assigning new node to shard shard=shard1
[junit4:junit4]   2> 6671 T2177 oascc.ZkStateReader$2.process A cluster state change: WatchedEvent state:SyncConnected type:NodeDataChanged path:/clusterstate.json, has occurred - updating... (live nodes size: 2)
[junit4:junit4]   2> 6671 T2171 oascc.ZkStateReader$2.process A cluster state change: WatchedEvent state:SyncConnected type:NodeDataChanged path:/clusterstate.json, has occurred - updating... (live nodes size: 2)
[junit4:junit4]   2> 6671 T2190 oascc.ZkStateReader$2.process A cluster state change: WatchedEvent state:SyncConnected type:NodeDataChanged path:/clusterstate.json, has occurred - updating... (live nodes size: 2)
[junit4:junit4]   2> 7285 T2191 oasc.CoreContainer.registerCore registering core: collection1
[junit4:junit4]   2> 7286 T2191 oasc.ZkController.register Register replica - core:collection1 address:http://127.0.0.1:49799 collection:collection1 shard:shard1
[junit4:junit4]   2> 7287 T2191 oascc.SolrZkClient.makePath makePath: /collections/collection1/leader_elect/shard1/election
[junit4:junit4]   2> 7297 T2154 oazs.PrepRequestProcessor.pRequest Got user-level KeeperException when processing sessionid:0x13ca628389d0006 type:delete cxid:0x45 zxid:0x5b txntype:-1 reqpath:n/a Error Path:/solr/collections/collection1/leaders Error:KeeperErrorCode = NoNode for /solr/collections/collection1/leaders
[junit4:junit4]   2> 7298 T2191 oasc.ShardLeaderElectionContext.runLeaderProcess Running the leader process.
[junit4:junit4]   2> 7299 T2154 oazs.PrepRequestProcessor.pRequest Got user-level KeeperException when processing sessionid:0x13ca628389d0006 type:create cxid:0x46 zxid:0x5c txntype:-1 reqpath:n/a Error Path:/solr/overseer Error:KeeperErrorCode = NodeExists for /solr/overseer
[junit4:junit4]   2> 7302 T2191 oasc.ShardLeaderElectionContext.waitForReplicasToComeUp Enough replicas found to continue.
[junit4:junit4]   2> 7302 T2191 oasc.ShardLeaderElectionContext.runLeaderProcess I may be the new leader - try and sync
[junit4:junit4]   2> 7302 T2191 oasc.SyncStrategy.sync Sync replicas to http://127.0.0.1:49799/collection1/
[junit4:junit4]   2> 7303 T2191 oasc.SyncStrategy.syncReplicas Sync Success - now sync replicas to me
[junit4:junit4]   2> 7303 T2191 oasc.SyncStrategy.syncToMe http://127.0.0.1:49799/collection1/ has no replicas
[junit4:junit4]   2> 7303 T2191 oasc.ShardLeaderElectionContext.runLeaderProcess I am the new leader: http://127.0.0.1:49799/collection1/
[junit4:junit4]   2> 7303 T2191 oascc.SolrZkClient.makePath makePath: /collections/collection1/leaders/shard1
[junit4:junit4]   2> 7309 T2154 oazs.PrepRequestProcessor.pRequest Got user-level KeeperException when processing sessionid:0x13ca628389d0006 type:create cxid:0x50 zxid:0x60 txntype:-1 reqpath:n/a Error Path:/solr/overseer Error:KeeperErrorCode = NodeExists for /solr/overseer
[junit4:junit4]   2> 8183 T2172 oascc.ZkStateReader.updateClusterState Updating cloud state from ZooKeeper... 
[junit4:junit4]   2> 8197 T2171 oascc.ZkStateReader$2.process A cluster state change: WatchedEvent state:SyncConnected type:NodeDataChanged path:/clusterstate.json, has occurred - updating... (live nodes size: 2)
[junit4:junit4]   2> 8197 T2190 oascc.ZkStateReader$2.process A cluster state change: WatchedEvent state:SyncConnected type:NodeDataChanged path:/clusterstate.json, has occurred - updating... (live nodes size: 2)
[junit4:junit4]   2> 8197 T2177 oascc.ZkStateReader$2.process A cluster state change: WatchedEvent state:SyncConnected type:NodeDataChanged path:/clusterstate.json, has occurred - updating... (live nodes size: 2)
[junit4:junit4]   2> 8233 T2191 oasc.ZkController.register We are http://127.0.0.1:49799/collection1/ and leader is http://127.0.0.1:49799/collection1/
[junit4:junit4]   2> 8234 T2191 oasc.ZkController.register No LogReplay needed for core=collection1 baseURL=http://127.0.0.1:49799
[junit4:junit4]   2> 8234 T2191 oasc.ZkController.checkRecovery I am the leader, no recovery necessary
[junit4:junit4]   2> 8234 T2191 oasc.ZkController.publish publishing core=collection1 state=active
[junit4:junit4]   2> 8235 T2191 oasc.ZkController.publish numShards not found on descriptor - reading it from system property
[junit4:junit4]   2> 8239 T2191 oascc.ZkStateReader.updateClusterState Updating cloud state from ZooKeeper... 
[junit4:junit4]   2> 8240 T2149 oass.SolrDispatchFilter.init user.dir=/Users/jenkins/jenkins-slave/workspace/Lucene-Solr-trunk-MacOSX/solr/build/solr-core/test/J0
[junit4:junit4]   2> 8241 T2149 oass.SolrDispatchFilter.init SolrDispatchFilter.init() done
[junit4:junit4]   2> 8242 T2149 oascsi.HttpClientUtil.createClient Creating new http client, config:maxConnections=128&maxConnectionsPerHost=32&followRedirects=false
[junit4:junit4]   2> 8421 T2149 oejs.Server.doStart jetty-8.1.8.v20121106
[junit4:junit4]   2> 8426 T2149 oejs.AbstractConnector.doStart Started SelectChannelConnector@127.0.0.1:49802
[junit4:junit4]   2> 8427 T2149 oass.SolrDispatchFilter.init SolrDispatchFilter.init()
[junit4:junit4]   2> 8427 T2149 oasc.SolrResourceLoader.locateSolrHome JNDI not configured for solr (NoInitialContextEx)
[junit4:junit4]   2> 8428 T2149 oasc.SolrResourceLoader.locateSolrHome using system property solr.solr.home: /Users/jenkins/jenkins-slave/workspace/Lucene-Solr-trunk-MacOSX/solr/build/solr-core/test/J0/./org.apache.solr.cloud.BasicDistributedZkTest-jetty2-1359997327556
[junit4:junit4]   2> 8428 T2149 oasc.CoreContainer$Initializer.initialize looking for solr.xml: /Users/jenkins/jenkins-slave/workspace/Lucene-Solr-trunk-MacOSX/solr/build/solr-core/test/J0/./org.apache.solr.cloud.BasicDistributedZkTest-jetty2-1359997327556/solr.xml
[junit4:junit4]   2> 8429 T2149 oasc.CoreContainer.<init> New CoreContainer 1492392133
[junit4:junit4]   2> 8430 T2149 oasc.CoreContainer.load Loading CoreContainer using Solr Home: '/Users/jenkins/jenkins-slave/workspace/Lucene-Solr-trunk-MacOSX/solr/build/solr-core/test/J0/./org.apache.solr.cloud.BasicDistributedZkTest-jetty2-1359997327556/'
[junit4:junit4]   2> 8430 T2149 oasc.SolrResourceLoader.<init> new SolrResourceLoader for directory: '/Users/jenkins/jenkins-slave/workspace/Lucene-Solr-trunk-MacOSX/solr/build/solr-core/test/J0/./org.apache.solr.cloud.BasicDistributedZkTest-jetty2-1359997327556/'
[junit4:junit4]   2> 8467 T2149 oashc.HttpShardHandlerFactory.getParameter Setting socketTimeout to: 60000
[junit4:junit4]   2> 8468 T2149 oashc.HttpShardHandlerFactory.getParameter Setting urlScheme to: http://
[junit4:junit4]   2> 8468 T2149 oashc.HttpShardHandlerFactory.getParameter Setting connTimeout to: 15000
[junit4:junit4]   2> 8469 T2149 oashc.HttpShardHandlerFactory.getParameter Setting maxConnectionsPerHost to: 20
[junit4:junit4]   2> 8469 T2149 oashc.HttpShardHandlerFactory.getParameter Setting corePoolSize to: 0
[junit4:junit4]   2> 8470 T2149 oashc.HttpShardHandlerFactory.getParameter Setting maximumPoolSize to: 2147483647
[junit4:junit4]   2> 8470 T2149 oashc.HttpShardHandlerFactory.getParameter Setting maxThreadIdleTime to: 5
[junit4:junit4]   2> 8471 T2149 oashc.HttpShardHandlerFactory.getParameter Setting sizeOfQueue to: -1
[junit4:junit4]   2> 8471 T2149 oashc.HttpShardHandlerFactory.getParameter Setting fairnessPolicy to: false
[junit4:junit4]   2> 8472 T2149 oascsi.HttpClientUtil.createClient Creating new http client, config:maxConnectionsPerHost=20&maxConnections=10000&socketTimeout=60000&connTimeout=15000&retry=false
[junit4:junit4]   2> 8484 T2149 oasc.CoreContainer.load Registering Log Listener
[junit4:junit4]   2> 8502 T2149 oasc.CoreContainer.initZooKeeper Zookeeper client=127.0.0.1:49792/solr
[junit4:junit4]   2> 8503 T2149 oasc.ZkController.checkChrootPath zkHost includes chroot
[junit4:junit4]   2> 8504 T2149 oaz.ZooKeeper.<init> Initiating client connection, connectString=127.0.0.1:49792 sessionTimeout=60000 watcher=org.apache.solr.common.cloud.ConnectionManager@451af7dd
[junit4:junit4]   2> 8505 T2149 oascc.ConnectionManager.waitForConnected Waiting for client to connect to ZooKeeper
[junit4:junit4]   2> 8505 T2202 oaz.ClientCnxn$SendThread.logStartConnect Opening socket connection to server localhost/127.0.0.1:49792. Will not attempt to authenticate using SASL (access denied ("javax.security.auth.AuthPermission" "getLoginConfiguration"))
[junit4:junit4]   2> 8507 T2202 oaz.ClientCnxn$SendThread.primeConnection Socket connection established to localhost/127.0.0.1:49792, initiating session
[junit4:junit4]   2> 8507 T2151 oazs.NIOServerCnxnFactory.run Accepted socket connection from /127.0.0.1:49803
[junit4:junit4]   2> 8508 T2151 oazs.ZooKeeperServer.processConnectRequest Client attempting to establish new session at /127.0.0.1:49803
[junit4:junit4]   2> 8509 T2153 oazs.ZooKeeperServer.finishSessionInit Established session 0x13ca628389d0007 with negotiated timeout 20000 for client /127.0.0.1:49803
[junit4:junit4]   2> 8509 T2202 oaz.ClientCnxn$SendThread.onConnected Session establishment complete on server localhost/127.0.0.1:49792, sessionid = 0x13ca628389d0007, negotiated timeout = 20000
[junit4:junit4]   2> 8510 T2203 oascc.ConnectionManager.process Watcher org.apache.solr.common.cloud.ConnectionManager@451af7dd name:ZooKeeperConnection Watcher:127.0.0.1:49792 got event WatchedEvent state:SyncConnected type:None path:null path:null type:None
[junit4:junit4]   2> 8510 T2149 oascc.ConnectionManager.waitForConnected Client is connected to ZooKeeper
[junit4:junit4]   2> 8512 T2154 oazs.PrepRequestProcessor.pRequest2Txn Processed session termination for sessionid: 0x13ca628389d0007
[junit4:junit4]   2> 8513 T2151 oazs.NIOServerCnxn.closeSock Closed socket connection for client /127.0.0.1:49803 which had sessionid 0x13ca628389d0007
[junit4:junit4]   2> 8513 T2149 oaz.ZooKeeper.close Session: 0x13ca628389d0007 closed
[junit4:junit4]   2> 8514 T2203 oaz.ClientCnxn$EventThread.run EventThread shut down
[junit4:junit4]   2> 8514 T2149 oascsi.HttpClientUtil.createClient Creating new http client, config:maxConnections=500&maxConnectionsPerHost=16&socketTimeout=60000&connTimeout=15000
[junit4:junit4]   2> 8519 T2149 oaz.ZooKeeper.<init> Initiating client connection, connectString=127.0.0.1:49792/solr sessionTimeout=30000 watcher=org.apache.solr.common.cloud.ConnectionManager@1b787d50
[junit4:junit4]   2> 8520 T2149 oascc.ConnectionManager.waitForConnected Waiting for client to connect to ZooKeeper
[junit4:junit4]   2> 8521 T2204 oaz.ClientCnxn$SendThread.logStartConnect Opening socket connection to server localhost/127.0.0.1:49792. Will not attempt to authenticate using SASL (access denied ("javax.security.auth.AuthPermission" "getLoginConfiguration"))
[junit4:junit4]   2> 8521 T2204 oaz.ClientCnxn$SendThread.primeConnection Socket connection established to localhost/127.0.0.1:49792, initiating session
[junit4:junit4]   2> 8522 T2151 oazs.NIOServerCnxnFactory.run Accepted socket connection from /127.0.0.1:49804
[junit4:junit4]   2> 8522 T2151 oazs.ZooKeeperServer.processConnectRequest Client attempting to establish new session at /127.0.0.1:49804
[junit4:junit4]   2> 8523 T2153 oazs.ZooKeeperServer.finishSessionInit Established session 0x13ca628389d0008 with negotiated timeout 20000 for client /127.0.0.1:49804
[junit4:junit4]   2> 8523 T2204 oaz.ClientCnxn$SendThread.onConnected Session establishment complete on server localhost/127.0.0.1:49792, sessionid = 0x13ca628389d0008, negotiated timeout = 20000
[junit4:junit4]   2> 8524 T2205 oascc.ConnectionManager.process Watcher org.apache.solr.common.cloud.ConnectionManager@1b787d50 name:ZooKeeperConnection Watcher:127.0.0.1:49792/solr got event WatchedEvent state:SyncConnected type:None path:null path:null type:None
[junit4:junit4]   2> 8524 T2149 oascc.ConnectionManager.waitForConnected Client is connected to ZooKeeper
[junit4:junit4]   2> 8526 T2154 oazs.PrepRequestProcessor.pRequest Got user-level KeeperException when processing sessionid:0x13ca628389d0008 type:create cxid:0x1 zxid:0x6d txntype:-1 reqpath:n/a Error Path:/solr/overseer Error:KeeperErrorCode = NodeExists for /solr/overseer
[junit4:junit4]   2> 8527 T2154 oazs.PrepRequestProcessor.pRequest Got user-level KeeperException when processing sessionid:0x13ca628389d0008 type:create cxid:0x2 zxid:0x6e txntype:-1 reqpath:n/a Error Path:/solr/overseer Error:KeeperErrorCode = NodeExists for /solr/overseer
[junit4:junit4]   2> 8529 T2149 oasc.ZkController.createEphemeralLiveNode Register node as live in ZooKeeper:/live_nodes/127.0.0.1:49802_
[junit4:junit4]   2> 8530 T2154 oazs.PrepRequestProcessor.pRequest Got user-level KeeperException when processing sessionid:0x13ca628389d0008 type:delete cxid:0x4 zxid:0x6f txntype:-1 reqpath:n/a Error Path:/solr/live_nodes/127.0.0.1:49802_ Error:KeeperErrorCode = NoNode for /solr/live_nodes/127.0.0.1:49802_
[junit4:junit4]   2> 8531 T2149 oascc.SolrZkClient.makePath makePath: /live_nodes/127.0.0.1:49802_
[junit4:junit4]   2> 8534 T2171 oascc.ZkStateReader$2.process A cluster state change: WatchedEvent state:SyncConnected type:NodeChildrenChanged path:/live_nodes, has occurred - updating... (live nodes size: 2)
[junit4:junit4]   2> 8535 T2177 oascc.ZkStateReader$3.process Updating live nodes... (3)
[junit4:junit4]   2> 8535 T2177 oascc.ZkStateReader$2.process A cluster state change: WatchedEvent state:SyncConnected type:NodeChildrenChanged path:/live_nodes, has occurred - updating... (live nodes size: 3)
[junit4:junit4]   2> 8536 T2190 oascc.ZkStateReader$3.process Updating live nodes... (3)
[junit4:junit4]   2> 8536 T2190 oascc.ZkStateReader$2.process A cluster state change: WatchedEvent state:SyncConnected type:NodeChildrenChanged path:/live_nodes, has occurred - updating... (live nodes size: 3)
[junit4:junit4]   2> 8539 T2171 oascc.ZkStateReader$3.process Updating live nodes... (3)
[junit4:junit4]   2> 8543 T2149 oascc.ZkStateReader.createClusterStateWatchersAndUpdate Updating cluster state from ZooKeeper... 
[junit4:junit4]   2> 8551 T2206 oasc.CoreContainer.create Creating SolrCore 'collection1' using instanceDir: /Users/jenkins/jenkins-slave/workspace/Lucene-Solr-trunk-MacOSX/solr/build/solr-core/test/J0/./org.apache.solr.cloud.BasicDistributedZkTest-jetty2-1359997327556/collection1
[junit4:junit4]   2> 8551 T2206 oasc.ZkController.createCollectionZkNode Check for collection zkNode:collection1
[junit4:junit4]   2> 8552 T2206 oasc.ZkController.createCollectionZkNode Collection zkNode exists
[junit4:junit4]   2> 8552 T2206 oasc.ZkController.readConfigName Load collection config from:/collections/collection1
[junit4:junit4]   2> 8554 T2206 oasc.SolrResourceLoader.<init> new SolrResourceLoader for directory: '/Users/jenkins/jenkins-slave/workspace/Lucene-Solr-trunk-MacOSX/solr/build/solr-core/test/J0/./org.apache.solr.cloud.BasicDistributedZkTest-jetty2-1359997327556/collection1/'
[junit4:junit4]   2> 8555 T2206 oasc.SolrResourceLoader.replaceClassLoader Adding 'file:/Users/jenkins/jenkins-slave/workspace/Lucene-Solr-trunk-MacOSX/solr/build/solr-core/test/J0/org.apache.solr.cloud.BasicDistributedZkTest-jetty2-1359997327556/collection1/lib/classes/' to classloader
[junit4:junit4]   2> 8555 T2206 oasc.SolrResourceLoader.replaceClassLoader Adding 'file:/Users/jenkins/jenkins-slave/workspace/Lucene-Solr-trunk-MacOSX/solr/build/solr-core/test/J0/org.apache.solr.cloud.BasicDistributedZkTest-jetty2-1359997327556/collection1/lib/README' to classloader
[junit4:junit4]   2> 8617 T2206 oasc.SolrConfig.<init> Using Lucene MatchVersion: LUCENE_50
[junit4:junit4]   2> 8689 T2206 oasc.SolrConfig.<init> Loaded SolrConfig: solrconfig.xml
[junit4:junit4]   2> 8690 T2206 oass.IndexSchema.readSchema Reading Solr Schema
[junit4:junit4]   2> 8695 T2206 oass.IndexSchema.readSchema Schema name=test
[junit4:junit4]   2> 9451 T2206 oass.OpenExchangeRatesOrgProvider.init Initialized with rates=open-exchange-rates.json, refreshInterval=1440.
[junit4:junit4]   2> 9467 T2206 oass.IndexSchema.readSchema default search field in schema is text
[junit4:junit4]   2> 9473 T2206 oass.IndexSchema.readSchema unique key field: id
[junit4:junit4]   2> 9507 T2206 oass.FileExchangeRateProvider.reload Reloading exchange rates from file currency.xml
[junit4:junit4]   2> 9520 T2206 oass.FileExchangeRateProvider.reload Reloading exchange rates from file currency.xml
[junit4:junit4]   2> 9529 T2206 oass.OpenExchangeRatesOrgProvider.reload Reloading exchange rates from open-exchange-rates.json
[junit4:junit4]   2> 9531 T2206 oass.OpenExchangeRatesOrgProvider.reload Reloading exchange rates from open-exchange-rates.json
[junit4:junit4]   2> 9534 T2206 oasc.SolrCore.<init> [collection1] Opening new SolrCore at /Users/jenkins/jenkins-slave/workspace/Lucene-Solr-trunk-MacOSX/solr/build/solr-core/test/J0/./org.apache.solr.cloud.BasicDistributedZkTest-jetty2-1359997327556/collection1/, dataDir=./org.apache.solr.cloud.BasicDistributedZkTest-1359997319318/jetty2/
[junit4:junit4]   2> 9534 T2206 oasc.JmxMonitoredMap.<init> JMX monitoring is enabled. Adding Solr mbeans to JMX Server: com.sun.jmx.mbeanserver.JmxMBeanServer@679e2502
[junit4:junit4]   2> 9535 T2206 oasc.SolrCore.initDirectoryFactory solr.NRTCachingDirectoryFactory
[junit4:junit4]   2> 9535 T2206 oasc.CachingDirectoryFactory.get return new directory for /Users/jenkins/jenkins-slave/workspace/Lucene-Solr-trunk-MacOSX/solr/build/solr-core/test/J0/./org.apache.solr.cloud.BasicDistributedZkTest-1359997319318/jetty2 forceNew:false
[junit4:junit4]   2> 9537 T2206 oasc.CachingDirectoryFactory.close Releasing directory:/Users/jenkins/jenkins-slave/workspace/Lucene-Solr-trunk-MacOSX/solr/build/solr-core/test/J0/./org.apache.solr.cloud.BasicDistributedZkTest-1359997319318/jetty2
[junit4:junit4]   2> 9537 T2206 oasc.SolrCore.getNewIndexDir New index directory detected: old=null new=./org.apache.solr.cloud.BasicDistributedZkTest-1359997319318/jetty2/index/
[junit4:junit4]   2> 9538 T2206 oasc.SolrCore.initIndex WARNING [collection1] Solr index directory './org.apache.solr.cloud.BasicDistributedZkTest-1359997319318/jetty2/index' doesn't exist. Creating new index...
[junit4:junit4]   2> 9539 T2206 oasc.CachingDirectoryFactory.get return new directory for /Users/jenkins/jenkins-slave/workspace/Lucene-Solr-trunk-MacOSX/solr/build/solr-core/test/J0/./org.apache.solr.cloud.BasicDistributedZkTest-1359997319318/jetty2/index forceNew:false
[junit4:junit4]   2> 9543 T2206 oasc.SolrDeletionPolicy.onCommit SolrDeletionPolicy.onCommit: commits:num=1
[junit4:junit4]   2> 		commit{dir=RateLimitedDirectoryWrapper(NRTCachingDirectory(org.apache.lucene.store.NIOFSDirectory@/Users/jenkins/jenkins-slave/workspace/Lucene-Solr-trunk-MacOSX/solr/build/solr-core/test/J0/org.apache.solr.cloud.BasicDistributedZkTest-1359997319318/jetty2/index lockFactory=org.apache.lucene.store.NativeFSLockFactory@26a32e6d; maxCacheMB=48.0 maxMergeSizeMB=4.0)),segFN=segments_1,generation=1,filenames=[segments_1]
[junit4:junit4]   2> 9544 T2206 oasc.SolrDeletionPolicy.updateCommits newest commit = 1[segments_1]
[junit4:junit4]   2> 9545 T2206 oasc.CachingDirectoryFactory.close Releasing directory:/Users/jenkins/jenkins-slave/workspace/Lucene-Solr-trunk-MacOSX/solr/build/solr-core/test/J0/./org.apache.solr.cloud.BasicDistributedZkTest-1359997319318/jetty2/index
[junit4:junit4]   2> 9545 T2206 oasc.SolrCore.initWriters created xml: solr.XMLResponseWriter
[junit4:junit4]   2> 9548 T2206 oasup.UpdateRequestProcessorChain.init inserting DistributedUpdateProcessorFactory into updateRequestProcessorChain "dedupe"
[junit4:junit4]   2> 9548 T2206 oasup.UpdateRequestProcessorChain.init inserting DistributedUpdateProcessorFactory into updateRequestProcessorChain "dedupe-allfields"
[junit4:junit4]   2> 9549 T2206 oasup.UpdateRequestProcessorChain.init inserting DistributedUpdateProcessorFactory into updateRequestProcessorChain "stored_sig"
[junit4:junit4]   2> 9549 T2206 oasup.UpdateRequestProcessorChain.init inserting DistributedUpdateProcessorFactory into updateRequestProcessorChain "uniq-fields"
[junit4:junit4]   2> 9550 T2206 oasup.UpdateRequestProcessorChain.init inserting DistributedUpdateProcessorFactory into updateRequestProcessorChain "distrib-dup-test-chain-implicit"
[junit4:junit4]   2> 9550 T2206 oasc.RequestHandlers.initHandlersFromConfig adding lazy requestHandler: solr.ReplicationHandler
[junit4:junit4]   2> 9551 T2206 oasc.RequestHandlers.initHandlersFromConfig created /replication: solr.ReplicationHandler
[junit4:junit4]   2> 9552 T2206 oasc.RequestHandlers.initHandlersFromConfig created standard: solr.StandardRequestHandler
[junit4:junit4]   2> 9552 T2206 oasc.RequestHandlers.initHandlersFromConfig created /get: solr.RealTimeGetHandler
[junit4:junit4]   2> 9553 T2206 oasc.RequestHandlers.initHandlersFromConfig created dismax: solr.SearchHandler
[junit4:junit4]   2> 9554 T2206 oasc.RequestHandlers.initHandlersFromConfig created mock: org.apache.solr.core.MockQuerySenderListenerReqHandler
[junit4:junit4]   2> 9554 T2206 oasc.RequestHandlers.initHandlersFromConfig created /admin/: org.apache.solr.handler.admin.AdminHandlers
[junit4:junit4]   2> 9555 T2206 oasc.RequestHandlers.initHandlersFromConfig created defaults: solr.StandardRequestHandler
[junit4:junit4]   2> 9555 T2206 oasc.RequestHandlers.initHandlersFromConfig adding lazy requestHandler: solr.StandardRequestHandler
[junit4:junit4]   2> 9556 T2206 oasc.RequestHandlers.initHandlersFromConfig created lazy: solr.StandardRequestHandler
[junit4:junit4]   2> 9556 T2206 oasc.RequestHandlers.initHandlersFromConfig created /update: solr.UpdateRequestHandler
[junit4:junit4]   2> 9557 T2206 oasc.RequestHandlers.initHandlersFromConfig created /terms: org.apache.solr.handler.component.SearchHandler
[junit4:junit4]   2> 9557 T2206 oasc.RequestHandlers.initHandlersFromConfig created spellCheckCompRH: org.apache.solr.handler.component.SearchHandler
[junit4:junit4]   2> 9558 T2206 oasc.RequestHandlers.initHandlersFromConfig created spellCheckCompRH_Direct: org.apache.solr.handler.component.SearchHandler
[junit4:junit4]   2> 9559 T2206 oasc.RequestHandlers.initHandlersFromConfig created spellCheckWithWordbreak: org.apache.solr.handler.component.SearchHandler
[junit4:junit4]   2> 9559 T2206 oasc.RequestHandlers.initHandlersFromConfig created spellCheckWithWordbreak_Direct: org.apache.solr.handler.component.SearchHandler
[junit4:junit4]   2> 9560 T2206 oasc.RequestHandlers.initHandlersFromConfig created spellCheckCompRH1: org.apache.solr.handler.component.SearchHandler
[junit4:junit4]   2> 9560 T2206 oasc.RequestHandlers.initHandlersFromConfig created mltrh: org.apache.solr.handler.component.SearchHandler
[junit4:junit4]   2> 9561 T2206 oasc.RequestHandlers.initHandlersFromConfig created tvrh: org.apache.solr.handler.component.SearchHandler
[junit4:junit4]   2> 9562 T2206 oasc.RequestHandlers.initHandlersFromConfig created /mlt: solr.MoreLikeThisHandler
[junit4:junit4]   2> 9562 T2206 oasc.RequestHandlers.initHandlersFromConfig created /debug/dump: solr.DumpRequestHandler
[junit4:junit4]   2> 9572 T2206 oashl.XMLLoader.init xsltCacheLifetimeSeconds=60
[junit4:junit4]   2> 9577 T2206 oasc.SolrCore.initDeprecatedSupport WARNING solrconfig.xml uses deprecated <admin/gettableFiles>, Please update your config to use the ShowFileRequestHandler.
[junit4:junit4]   2> 9579 T2206 oasc.SolrCore.initDeprecatedSupport WARNING adding ShowFileRequestHandler with hidden files: [SCHEMA.XML, OLD_SYNONYMS.TXT, STOPWORDS.TXT, PROTWORDS.TXT, OPEN-EXCHANGE-RATES.JSON, SYNONYMS.TXT, CURRENCY.XML, MAPPING-ISOLATIN1ACCENT.TXT]
[junit4:junit4]   2> 9582 T2206 oasc.CachingDirectoryFactory.close Releasing directory:/Users/jenkins/jenkins-slave/workspace/Lucene-Solr-trunk-MacOSX/solr/build/solr-core/test/J0/./org.apache.solr.cloud.BasicDistributedZkTest-1359997319318/jetty2
[junit4:junit4]   2> 9583 T2206 oass.SolrIndexSearcher.<init> Opening Searcher@4d07f8c2 main
[junit4:junit4]   2> 9584 T2206 oasu.CommitTracker.<init> Hard AutoCommit: disabled
[junit4:junit4]   2> 9585 T2206 oasu.CommitTracker.<init> Soft AutoCommit: disabled
[junit4:junit4]   2> 9585 T2206 oashc.SpellCheckComponent.inform Initializing spell checkers
[junit4:junit4]   2> 9591 T2206 oass.DirectSolrSpellChecker.init init: {name=direct,classname=DirectSolrSpellChecker,field=lowerfilt,minQueryLength=3}
[junit4:junit4]   2> 9632 T2207 oasc.SolrCore.registerSearcher [collection1] Registered new searcher Searcher@4d07f8c2 main{StandardDirectoryReader(segments_1:1)}
[junit4:junit4]   2> 9637 T2206 oasc.ZkController.publish publishing core=collection1 state=down
[junit4:junit4]   2> 9638 T2206 oasc.ZkController.publish numShards not found on descriptor - reading it from system property
[junit4:junit4]   2> 9712 T2172 oascc.ZkStateReader.updateClusterState Updating cloud state from ZooKeeper... 
[junit4:junit4]   2> 9718 T2172 oasc.Overseer$ClusterStateUpdater.updateState Update state numShards=2 message={
[junit4:junit4]   2> 	  "operation":"state",
[junit4:junit4]   2> 	  "numShards":"2",
[junit4:junit4]   2> 	  "shard":"shard1",
[junit4:junit4]   2> 	  "roles":null,
[junit4:junit4]   2> 	  "state":"active",
[junit4:junit4]   2> 	  "core":"collection1",
[junit4:junit4]   2> 	  "collection":"collection1",
[junit4:junit4]   2> 	  "node_name":"127.0.0.1:49799_",
[junit4:junit4]   2> 	  "base_url":"http://127.0.0.1:49799"}
[junit4:junit4]   2> 9724 T2172 oasc.Overseer$ClusterStateUpdater.updateState Update state numShards=2 message={
[junit4:junit4]   2> 	  "operation":"state",
[junit4:junit4]   2> 	  "numShards":"2",
[junit4:junit4]   2> 	  "shard":null,
[junit4:junit4]   2> 	  "roles":null,
[junit4:junit4]   2> 	  "state":"down",
[junit4:junit4]   2> 	  "core":"collection1",
[junit4:junit4]   2> 	  "collection":"collection1",
[junit4:junit4]   2> 	  "node_name":"127.0.0.1:49802_",
[junit4:junit4]   2> 	  "base_url":"http://127.0.0.1:49802"}
[junit4:junit4]   2> 9724 T2172 oasc.Overseer$ClusterStateUpdater.updateState Collection already exists with numShards=2
[junit4:junit4]   2> 9724 T2172 oasc.Overseer$ClusterStateUpdater.updateState Assigning new node to shard shard=shard2
[junit4:junit4]   2> 9735 T2171 oascc.ZkStateReader$2.process A cluster state change: WatchedEvent state:SyncConnected type:NodeDataChanged path:/clusterstate.json, has occurred - updating... (live nodes size: 3)
[junit4:junit4]   2> 9735 T2177 oascc.ZkStateReader$2.process A cluster state change: WatchedEvent state:SyncConnected type:NodeDataChanged path:/clusterstate.json, has occurred - updating... (live nodes size: 3)
[junit4:junit4]   2> 9735 T2190 oascc.ZkStateReader$2.process A cluster state change: WatchedEvent state:SyncConnected type:NodeDataChanged path:/clusterstate.json, has occurred - updating... (live nodes size: 3)
[junit4:junit4]   2> 9735 T2205 oascc.ZkStateReader$2.process A cluster state change: WatchedEvent state:SyncConnected type:NodeDataChanged path:/clusterstate.json, has occurred - updating... (live nodes size: 3)
[junit4:junit4]   2> 10641 T2206 oasc.CoreContainer.registerCore registering core: collection1
[junit4:junit4]   2> 10642 T2206 oasc.ZkController.register Register replica - core:collection1 address:http://127.0.0.1:49802 collection:collection1 shard:shard2
[junit4:junit4]   2> 10643 T2206 oascc.SolrZkClient.makePath makePath: /collections/collection1/leader_elect/shard2/election
[junit4:junit4]   2> 10653 T2154 oazs.PrepRequestProcessor.pRequest Got user-level KeeperException when processing sessionid:0x13ca628389d0008 type:delete cxid:0x42 zxid:0x7d txntype:-1 reqpath:n/a Error Path:/solr/collections/collection1/leaders/shard2 Error:KeeperErrorCode = NoNode for /solr/collections/collection1/leaders/shard2
[junit4:junit4]   2> 10654 T2206 oasc.ShardLeaderElectionContext.runLeaderProcess Running the leader process.
[junit4:junit4]   2> 10655 T2154 oazs.PrepRequestProcessor.pRequest Got user-level KeeperException when processing sessionid:0x13ca628389d0008 type:create cxid:0x43 zxid:0x7e txntype:-1 reqpath:n/a Error Path:/solr/overseer Error:KeeperErrorCode = NodeExists for /solr/overseer
[junit4:junit4]   2> 10658 T2206 oasc.ShardLeaderElectionContext.waitForReplicasToComeUp Enough replicas found to continue.
[junit4:junit4]   2> 10658 T2206 oasc.ShardLeaderElectionContext.runLeaderProcess I may be the new leader - try and sync
[junit4:junit4]   2> 10658 T2206 oasc.SyncStrategy.sync Sync replicas to http://127.0.0.1:49802/collection1/
[junit4:junit4]   2> 10659 T2206 oasc.SyncStrategy.syncReplicas Sync Success - now sync replicas to me
[junit4:junit4]   2> 10659 T2206 oasc.SyncStrategy.syncToMe http://127.0.0.1:49802/collection1/ has no replicas
[junit4:junit4]   2> 10659 T2206 oasc.ShardLeaderElectionContext.runLeaderProcess I am the new leader: http://127.0.0.1:49802/collection1/
[junit4:junit4]   2> 10660 T2206 oascc.SolrZkClient.makePath makePath: /collections/collection1/leaders/shard2
[junit4:junit4]   2> 10666 T2154 oazs.PrepRequestProcessor.pRequest Got user-level KeeperException when processing sessionid:0x13ca628389d0008 type:create cxid:0x4c zxid:0x81 txntype:-1 reqpath:n/a Error Path:/solr/overseer Error:KeeperErrorCode = NodeExists for /solr/overseer
[junit4:junit4]   2> 11253 T2172 oascc.ZkStateReader.updateClusterState Updating cloud state from ZooKeeper... 
[junit4:junit4]   2> 11268 T2177 oascc.ZkStateReader$2.process A cluster state change: WatchedEvent state:SyncConnected type:NodeDataChanged path:/clusterstate.json, has occurred - updating... (live nodes size: 3)
[junit4:junit4]   2> 11269 T2205 oascc.ZkStateReader$2.process A cluster state change: WatchedEvent state:SyncConnected type:NodeDataChanged path:/clusterstate.json, has occurred - updating... (live nodes size: 3)
[junit4:junit4]   2> 11269 T2171 oascc.ZkStateReader$2.process A cluster state change: WatchedEvent state:SyncConnected type:NodeDataChanged path:/clusterstate.json, has occurred - updating... (live nodes size: 3)
[junit4:junit4]   2> 11269 T2190 oascc.ZkStateReader$2.process A cluster state change: WatchedEvent state:SyncConnected type:NodeDataChanged path:/clusterstate.json, has occurred - updating... (live nodes size: 3)
[junit4:junit4]   2> 11293 T2206 oasc.ZkController.register We are http://127.0.0.1:49802/collection1/ and leader is http://127.0.0.1:49802/collection1/
[junit4:junit4]   2> 11293 T2206 oasc.ZkController.register No LogReplay needed for core=collection1 baseURL=http://127.0.0.1:49802
[junit4:junit4]   2> 11294 T2206 oasc.ZkController.checkRecovery I am the leader, no recovery necessary
[junit4:junit4]   2> 11294 T2206 oasc.ZkController.publish publishing core=collection1 state=active
[junit4:junit4]   2> 11294 T2206 oasc.ZkController.publish numShards not found on descriptor - reading it from system property
[junit4:junit4]   2> 11298 T2206 oascc.ZkStateReader.updateClusterState Updating cloud state from ZooKeeper... 
[junit4:junit4]   2> 11300 T2149 oass.SolrDispatchFilter.init user.dir=/Users/jenkins/jenkins-slave/workspace/Lucene-Solr-trunk-MacOSX/solr/build/solr-core/test/J0
[junit4:junit4]   2> 11300 T2149 oass.SolrDispatchFilter.init SolrDispatchFilter.init() done
[junit4:junit4]   2> 11301 T2149 oascsi.HttpClientUtil.createClient Creating new http client, config:maxConnections=128&maxConnectionsPerHost=32&followRedirects=false
[junit4:junit4]   2> 11513 T2149 oejs.Server.doStart jetty-8.1.8.v20121106
[junit4:junit4]   2> 11517 T2149 oejs.AbstractConnector.doStart Started SelectChannelConnector@127.0.0.1:49805
[junit4:junit4]   2> 11519 T2149 oass.SolrDispatchFilter.init SolrDispatchFilter.init()
[junit4:junit4]   2> 11520 T2149 oasc.SolrResourceLoader.locateSolrHome JNDI not configured for solr (NoInitialContextEx)
[junit4:junit4]   2> 11520 T2149 oasc.SolrResourceLoader.locateSolrHome using system property solr.solr.home: /Users/jenkins/jenkins-slave/workspace/Lucene-Solr-trunk-MacOSX/solr/build/solr-core/test/J0/./org.apache.solr.cloud.BasicDistributedZkTest-jetty3-1359997330615
[junit4:junit4]   2> 11521 T2149 oasc.CoreContainer$Initializer.initialize looking for solr.xml: /Users/jenkins/jenkins-slave/workspace/Lucene-Solr-trunk-MacOSX/solr/build/solr-core/test/J0/./org.apache.solr.cloud.BasicDistributedZkTest-jetty3-1359997330615/solr.xml
[junit4:junit4]   2> 11521 T2149 oasc.CoreContainer.<init> New CoreContainer 1784898702
[junit4:junit4]   2> 11522 T2149 oasc.CoreContainer.load Loading CoreContainer using Solr Home: '/Users/jenkins/jenkins-slave/workspace/Lucene-Solr-trunk-MacOSX/solr/build/solr-core/test/J0/./org.apache.solr.cloud.BasicDistributedZkTest-jetty3-1359997330615/'
[junit4:junit4]   2> 11523 T2149 oasc.SolrResourceLoader.<init> new SolrResourceLoader for directory: '/Users/jenkins/jenkins-slave/workspace/Lucene-Solr-trunk-MacOSX/solr/build/solr-core/test/J0/./org.apache.solr.cloud.BasicDistributedZkTest-jetty3-1359997330615/'
[junit4:junit4]   2> 11580 T2149 oashc.HttpShardHandlerFactory.getParameter Setting socketTimeout to: 60000
[junit4:junit4]   2> 11581 T2149 oashc.HttpShardHandlerFactory.getParameter Setting urlScheme to: http://
[junit4:junit4]   2> 11582 T2149 oashc.HttpShardHandlerFactory.getParameter Setting connTimeout to: 15000
[junit4:junit4]   2> 11583 T2149 oashc.HttpShardHandlerFactory.getParameter Setting maxConnectionsPerHost to: 20
[junit4:junit4]   2> 11583 T2149 oashc.HttpShardHandlerFactory.getParameter Setting corePoolSize to: 0
[junit4:junit4]   2> 11584 T2149 oashc.HttpShardHandlerFactory.getParameter Setting maximumPoolSize to: 2147483647
[junit4:junit4]   2> 11585 T2149 oashc.HttpShardHandlerFactory.getParameter Setting maxThreadIdleTime to: 5
[junit4:junit4]   2> 11586 T2149 oashc.HttpShardHandlerFactory.getParameter Setting sizeOfQueue to: -1
[junit4:junit4]   2> 11586 T2149 oashc.HttpShardHandlerFactory.getParameter Setting fairnessPolicy to: false
[junit4:junit4]   2> 11587 T2149 oascsi.HttpClientUtil.createClient Creating new http client, config:maxConnectionsPerHost=20&maxConnections=10000&socketTimeout=60000&connTimeout=15000&retry=false
[junit4:junit4]   2> 11604 T2149 oasc.CoreContainer.load Registering Log Listener
[junit4:junit4]   2> 11624 T2149 oasc.CoreContainer.initZooKeeper Zookeeper client=127.0.0.1:49792/solr
[junit4:junit4]   2> 11625 T2149 oasc.ZkController.checkChrootPath zkHost includes chroot
[junit4:junit4]   2> 11626 T2149 oaz.ZooKeeper.<init> Initiating client connection, connectString=127.0.0.1:49792 sessionTimeout=60000 watcher=org.apache.solr.common.cloud.ConnectionManager@7e29f616
[junit4:junit4]   2> 11627 T2149 oascc.ConnectionManager.waitForConnected Waiting for client to connect to ZooKeeper
[junit4:junit4]   2> 11628 T2217 oaz.ClientCnxn$SendThread.logStartConnect Opening socket connection to server localhost/127.0.0.1:49792. Will not attempt to authenticate using SASL (access denied ("javax.security.auth.AuthPermission" "getLoginConfiguration"))
[junit4:junit4]   2> 11629 T2217 oaz.ClientCnxn$SendThread.primeConnection Socket connection established to localhost/127.0.0.1:49792, initiating session
[junit4:junit4]   2> 11629 T2151 oazs.NIOServerCnxnFactory.run Accepted socket connection from /127.0.0.1:49806
[junit4:junit4]   2> 11630 T2151 oazs.ZooKeeperServer.processConnectRequest Client attempting to establish new session at /127.0.0.1:49806
[junit4:junit4]   2> 11631 T2153 oazs.ZooKeeperServer.finishSessionInit Established session 0x13ca628389d0009 with negotiated timeout 20000 for client /127.0.0.1:49806
[junit4:junit4]   2> 11631 T2217 oaz.ClientCnxn$SendThread.onConnected Session establishment complete on server localhost/127.0.0.1:49792, sessionid = 0x13ca628389d0009, negotiated timeout = 20000
[junit4:junit4]   2> 11632 T2218 oascc.ConnectionManager.process Watcher org.apache.solr.common.cloud.ConnectionManager@7e29f616 name:ZooKeeperConnection Watcher:127.0.0.1:49792 got event WatchedEvent state:SyncConnected type:None path:null path:null type:None
[junit4:junit4]   2> 11632 T2149 oascc.ConnectionManager.waitForConnected Client is connected to ZooKeeper
[junit4:junit4]   2> 11635 T2154 oazs.PrepRequestProcessor.pRequest2Txn Processed session termination for sessionid: 0x13ca628389d0009
[junit4:junit4]   2> 11636 T2151 oazs.NIOServerCnxn.closeSock Closed socket connection for client /127.0.0.1:49806 which had sessionid 0x13ca628389d0009
[junit4:junit4]   2> 11636 T2149 oaz.ZooKeeper.close Session: 0x13ca628389d0009 closed
[junit4:junit4]   2> 11637 T2218 oaz.ClientCnxn$EventThread.run EventThread shut down
[junit4:junit4]   2> 11637 T2149 oascsi.HttpClientUtil.createClient Creating new http client, config:maxConnections=500&maxConnectionsPerHost=16&socketTimeout=60000&connTimeout=15000
[junit4:junit4]   2> 11643 T2149 oaz.ZooKeeper.<init> Initiating client connection, connectString=127.0.0.1:49792/solr sessionTimeout=30000 watcher=org.apache.solr.common.cloud.ConnectionManager@7434ad3e
[junit4:junit4]   2> 11644 T2149 oascc.ConnectionManager.waitForConnected Waiting for client to connect to ZooKeeper
[junit4:junit4]   2> 11645 T2219 oaz.ClientCnxn$SendThread.logStartConnect Opening socket connection to server localhost/127.0.0.1:49792. Will not attempt to authenticate using SASL (access denied ("javax.security.auth.AuthPermission" "getLoginConfiguration"))
[junit4:junit4]   2> 11646 T2219 oaz.ClientCnxn$SendThread.primeConnection Socket connection established to localhost/127.0.0.1:49792, initiating session
[junit4:junit4]   2> 11646 T2151 oazs.NIOServerCnxnFactory.run Accepted socket connection from /127.0.0.1:49807
[junit4:junit4]   2> 11647 T2151 oazs.ZooKeeperServer.processConnectRequest Client attempting to establish new session at /127.0.0.1:49807
[junit4:junit4]   2> 11648 T2153 oazs.ZooKeeperServer.finishSessionInit Established session 0x13ca628389d000a with negotiated timeout 20000 for client /127.0.0.1:49807
[junit4:junit4]   2> 11648 T2219 oaz.ClientCnxn$SendThread.onConnected Session establishment complete on server localhost/127.0.0.1:49792, sessionid = 0x13ca628389d000a, negotiated timeout = 20000
[junit4:junit4]   2> 11648 T2220 oascc.ConnectionManager.process Watcher org.apache.solr.common.cloud.ConnectionManager@7434ad3e name:ZooKeeperConnection Watcher:127.0.0.1:49792/solr got event WatchedEvent state:SyncConnected type:None path:null path:null type:None
[junit4:junit4]   2> 11649 T2149 oascc.ConnectionManager.waitForConnected Client is connected to ZooKeeper
[junit4:junit4]   2> 11651 T2154 oazs.PrepRequestProcessor.pRequest Got user-level KeeperException when processing sessionid:0x13ca628389d000a type:create cxid:0x1 zxid:0x8e txntype:-1 reqpath:n/a Error Path:/solr/overseer Error:KeeperErrorCode = NodeExists for /solr/overseer
[junit4:junit4]   2> 11652 T2154 oazs.PrepRequestProcessor.pRequest Got user-level KeeperException when processing sessionid:0x13ca628389d000a type:create cxid:0x2 zxid:0x8f txntype:-1 reqpath:n/a Error Path:/solr/overseer Error:KeeperErrorCode = NodeExists for /solr/overseer
[junit4:junit4]   2> 11654 T2149 oasc.ZkController.createEphemeralLiveNode Register node as live in ZooKeeper:/live_nodes/127.0.0.1:49805_
[junit4:junit4]   2> 11655 T2154 oazs.PrepRequestProcessor.pRequest Got user-level KeeperException when processing sessionid:0x13ca628389d000a type:delete cxid:0x4 zxid:0x90 txntype:-1 reqpath:n/a Error Path:/solr/live_nodes/127.0.0.1:49805_ Error:KeeperErrorCode = NoNode for /solr/live_nodes/127.0.0.1:49805_
[junit4:junit4]   2> 11656 T2149 oascc.SolrZkClient.makePath makePath: /live_nodes/127.0.0.1:49805_
[junit4:junit4]   2> 11660 T2171 oascc.ZkStateReader$2.process A cluster state change: WatchedEvent state:SyncConnected type:NodeChildrenChanged path:/live_nodes, has occurred - updating... (live nodes size: 3)
[junit4:junit4]   2> 11661 T2177 oascc.ZkStateReader$3.process Updating live nodes... (4)
[junit4:junit4]   2> 11662 T2177 oascc.ZkStateReader$2.process A cluster state change: WatchedEvent state:SyncConnected type:NodeChildrenChanged path:/live_nodes, has occurred - updating... (live nodes size: 4)
[junit4:junit4]   2> 11662 T2205 oascc.ZkStateReader$3.process Updating live nodes... (4)
[junit4:junit4]   2> 11662 T2205 oascc.ZkStateReader$2.process A cluster state change: WatchedEvent state:SyncConnected type:NodeChildrenChanged path:/live_nodes, has occurred - updating... (live nodes size: 4)
[junit4:junit4]   2> 11663 T2190 oascc.ZkStateReader$3.process Updating live nodes... (4)
[junit4:junit4]   2> 11663 T2190 oascc.ZkStateReader$2.process A cluster state change: WatchedEvent state:SyncConnected type:NodeChildrenChanged path:/live_nodes, has occurred - updating... (live nodes size: 4)
[junit4:junit4]   2> 11667 T2171 oascc.ZkStateReader$3.process Updating live nodes... (4)
[junit4:junit4]   2> 11671 T2149 oascc.ZkStateReader.createClusterStateWatchersAndUpdate Updating cluster state from ZooKeeper... 
[junit4:junit4]   2> 11680 T2221 oasc.CoreContainer.create Creating SolrCore 'collection1' using instanceDir: /Users/jenkins/jenkins-slave/workspace/Lucene-Solr-trunk-MacOSX/solr/build/solr-core/test/J0/./org.apache.solr.cloud.BasicDistributedZkTest-jetty3-1359997330615/collection1
[junit4:junit4]   2> 11680 T2221 oasc.ZkController.createCollectionZkNode Check for collection zkNode:collection1
[junit4:junit4]   2> 11681 T2221 oasc.ZkController.createCollectionZkNode Collection zkNode exists
[junit4:junit4]   2> 11682 T2221 oasc.ZkController.readConfigName Load collection config from:/collections/collection1
[junit4:junit4]   2> 11684 T2221 oasc.SolrResourceLoader.<init> new SolrResourceLoader for directory: '/Users/jenkins/jenkins-slave/workspace/Lucene-Solr-trunk-MacOSX/solr/build/solr-core/test/J0/./org.apache.solr.cloud.BasicDistributedZkTest-jetty3-1359997330615/collection1/'
[junit4:junit4]   2> 11685 T2221 oasc.SolrResourceLoader.replaceClassLoader Adding 'file:/Users/jenkins/jenkins-slave/workspace/Lucene-Solr-trunk-MacOSX/solr/build/solr-core/test/J0/org.apache.solr.cloud.BasicDistributedZkTest-jetty3-1359997330615/collection1/lib/classes/' to classloader
[junit4:junit4]   2> 11685 T2221 oasc.SolrResourceLoader.replaceClassLoader Adding 'file:/Users/jenkins/jenkins-slave/workspace/Lucene-Solr-trunk-MacOSX/solr/build/solr-core/test/J0/org.apache.solr.cloud.BasicDistributedZkTest-jetty3-1359997330615/collection1/lib/README' to classloader
[junit4:junit4]   2> 11749 T2221 oasc.SolrConfig.<init> Using Lucene MatchVersion: LUCENE_50
[junit4:junit4]   2> 11829 T2221 oasc.SolrConfig.<init> Loaded SolrConfig: solrconfig.xml
[junit4:junit4]   2> 11830 T2221 oass.IndexSchema.readSchema Reading Solr Schema
[junit4:junit4]   2> 11835 T2221 oass.IndexSchema.readSchema Schema name=test
[junit4:junit4]   2> 12610 T2221 oass.OpenExchangeRatesOrgProvider.init Initialized with rates=open-exchange-rates.json, refreshInterval=1440.
[junit4:junit4]   2> 12620 T2221 oass.IndexSchema.readSchema default search field in schema is text
[junit4:junit4]   2> 12624 T2221 oass.IndexSchema.readSchema unique key field: id
[junit4:junit4]   2> 12650 T2221 oass.FileExchangeRateProvider.reload Reloading exchange rates from file currency.xml
[junit4:junit4]   2> 12656 T2221 oass.FileExchangeRateProvider.reload Reloading exchange rates from file currency.xml
[junit4:junit4]   2> 12663 T2221 oass.OpenExchangeRatesOrgProvider.reload Reloading exchange rates from open-exchange-rates.json
[junit4:junit4]   2> 12666 T2221 oass.OpenExchangeRatesOrgProvider.reload Reloading exchange rates from open-exchange-rates.json
[junit4:junit4]   2> 12668 T2221 oasc.SolrCore.<init> [collection1] Opening new SolrCore at /Users/jenkins/jenkins-slave/workspace/Lucene-Solr-trunk-MacOSX/solr/build/solr-core/test/J0/./org.apache.solr.cloud.BasicDistributedZkTest-jetty3-1359997330615/collection1/, dataDir=./org.apache.solr.cloud.BasicDistributedZkTest-1359997319318/jetty3/
[junit4:junit4]   2> 12669 T2221 oasc.JmxMonitoredMap.<init> JMX monitoring is enabled. Adding Solr mbeans to JMX Server: com.sun.jmx.mbeanserver.JmxMBeanServer@679e2502
[junit4:junit4]   2> 12670 T2221 oasc.SolrCore.initDirectoryFactory solr.NRTCachingDirectoryFactory
[junit4:junit4]   2> 12671 T2221 oasc.CachingDirectoryFactory.get return new directory for /Users/jenkins/jenkins-slave/workspace/Lucene-Solr-trunk-MacOSX/solr/build/solr-core/test/J0/./org.apache.solr.cloud.BasicDistributedZkTest-1359997319318/jetty3 forceNew:false
[junit4:junit4]   2> 12671 T2221 oasc.CachingDirectoryFactory.close Releasing directory:/Users/jenkins/jenkins-slave/workspace/Lucene-Solr-trunk-MacOSX/solr/build/solr-core/test/J0/./org.apache.solr.cloud.BasicDistributedZkTest-1359997319318/jetty3
[junit4:junit4]   2> 12671 T2221 oasc.SolrCore.getNewIndexDir New index directory detected: old=null new=./org.apache.solr.cloud.BasicDistributedZkTest-1359997319318/jetty3/index/
[junit4:junit4]   2> 12672 T2221 oasc.SolrCore.initIndex WARNING [collection1] Solr index directory './org.apache.solr.cloud.BasicDistributedZkTest-1359997319318/jetty3/index' doesn't exist. Creating new index...
[junit4:junit4]   2> 12673 T2221 oasc.CachingDirectoryFactory.get return new directory for /Users/jenkins/jenkins-slave/workspace/Lucene-Solr-trunk-MacOSX/solr/build/solr-core/test/J0/./org.apache.solr.cloud.BasicDistributedZkTest-1359997319318/jetty3/index forceNew:false
[junit4:junit4]   2> 12678 T2221 oasc.SolrDeletionPolicy.onCommit SolrDeletionPolicy.onCommit: commits:num=1
[junit4:junit4]   2> 		commit{dir=RateLimitedDirectoryWrapper(NRTCachingDirectory(org.apache.lucene.store.NIOFSDirectory@/Users/jenkins/jenkins-slave/workspace/Lucene-Solr-trunk-MacOSX/solr/build/solr-core/test/J0/org.apache.solr.cloud.BasicDistributedZkTest-1359997319318/jetty3/index lockFactory=org.apache.lucene.store.NativeFSLockFactory@5c1499c8; maxCacheMB=48.0 maxMergeSizeMB=4.0)),segFN=segments_1,generation=1,filenames=[segments_1]
[junit4:junit4]   2> 12679 T2221 oasc.SolrDeletionPolicy.updateCommits newest commit = 1[segments_1]
[junit4:junit4]   2> 12680 T2221 oasc.CachingDirectoryFactory.close Releasing directory:/Users/jenkins/jenkins-slave/workspace/Lucene-Solr-trunk-MacOSX/solr/build/solr-core/test/J0/./org.apache.solr.cloud.BasicDistributedZkTest-1359997319318/jetty3/index
[junit4:junit4]   2> 12680 T2221 oasc.SolrCore.initWriters created xml: solr.XMLResponseWriter
[junit4:junit4]   2> 12683 T2221 oasup.UpdateRequestProcessorChain.init inserting DistributedUpdateProcessorFactory into updateRequestProcessorChain "dedupe"
[junit4:junit4]   2> 12684 T2221 oasup.UpdateRequestProcessorChain.init inserting DistributedUpdateProcessorFactory into updateRequestProcessorChain "dedupe-allfields"
[junit4:junit4]   2> 12684 T2221 oasup.UpdateRequestProcessorChain.init inserting DistributedUpdateProcessorFactory into updateRequestProcessorChain "stored_sig"
[junit4:junit4]   2> 12685 T2221 oasup.UpdateRequestProcessorChain.init inserting DistributedUpdateProcessorFactory into updateRequestProcessorChain "uniq-fields"
[junit4:junit4]   2> 12686 T2221 oasup.UpdateRequestProcessorChain.init inserting DistributedUpdateProcessorFactory into updateRequestProcessorChain "distrib-dup-test-chain-implicit"
[junit4:junit4]   2> 12687 T2221 oasc.RequestHandlers.initHandlersFromConfig adding lazy requestHandler: solr.ReplicationHandler
[junit4:junit4]   2> 12687 T2221 oasc.RequestHandlers.initHandlersFromConfig created /replication: solr.ReplicationHandler
[junit4:junit4]   2> 12688 T2221 oasc.RequestHandlers.initHandlersFromConfig created standard: solr.StandardRequestHandler
[junit4:junit4]   2> 12689 T2221 oasc.RequestHandlers.initHandlersFromConfig created /get: solr.RealTimeGetHandler
[junit4:junit4]   2> 12689 T2221 oasc.RequestHandlers.initHandlersFromConfig created dismax: solr.SearchHandler
[junit4:junit4]   2> 12690 T2221 oasc.RequestHandlers.initHandlersFromConfig created mock: org.apache.solr.core.MockQuerySenderListenerReqHandler
[junit4:junit4]   2> 12691 T2221 oasc.RequestHandlers.initHandlersFromConfig created /admin/: org.apache.solr.handler.admin.AdminHandlers
[junit4:junit4]   2> 12691 T2221 oasc.RequestHandlers.initHandlersFromConfig created defaults: solr.StandardRequestHandler
[junit4:junit4]   2> 12691 T2221 oasc.RequestHandlers.initHandlersFromConfig adding lazy requestHandler: solr.StandardRequestHandler
[junit4:junit4]   2> 12692 T2221 oasc.RequestHandlers.initHandlersFromConfig created lazy: solr.StandardRequestHandler
[junit4:junit4]   2> 12693 T2221 oasc.RequestHandlers.initHandlersFromConfig created /update: solr.UpdateRequestHandler
[junit4:junit4]   2> 12693 T2221 oasc.RequestHandlers.initHandlersFromConfig created /terms: org.apache.solr.handler.component.SearchHandler
[junit4:junit4]   2> 12694 T2221 oasc.RequestHandlers.initHandlersFromConfig created spellCheckCompRH: org.apache.solr.handler.component.SearchHandler
[junit4:junit4]   2> 12695 T2221 oasc.RequestHandlers.initHandlersFromConfig created spellCheckCompRH_Direct: org.apache.solr.handler.component.SearchHandler
[junit4:junit4]   2> 12695 T2221 oasc.RequestHandlers.initHandlersFromConfig created spellCheckWithWordbreak: org.apache.solr.handler.component.SearchHandler
[junit4:junit4]   2> 12696 T2221 oasc.RequestHandlers.initHandlersFromConfig created spellCheckWithWordbreak_Direct: org.apache.solr.handler.component.SearchHandler
[junit4:junit4]   2> 12696 T2221 oasc.RequestHandlers.initHandlersFromConfig created spellCheckCompRH1: org.apache.solr.handler.component.SearchHandler
[junit4:junit4]   2> 12697 T2221 oasc.RequestHandlers.initHandlersFromConfig created mltrh: org.apache.solr.handler.component.SearchHandler
[junit4:junit4]   2> 12698 T2221 oasc.RequestHandlers.initHandlersFromConfig created tvrh: org.apache.solr.handler.component.SearchHandler
[junit4:junit4]   2> 12698 T2221 oasc.RequestHandlers.initHandlersFromConfig created /mlt: solr.MoreLikeThisHandler
[junit4:junit4]   2> 12699 T2221 oasc.RequestHandlers.initHandlersFromConfig created /debug/dump: solr.DumpRequestHandler
[junit4:junit4]   2> 12706 T2221 oashl.XMLLoader.init xsltCacheLifetimeSeconds=60
[junit4:junit4]   2> 12710 T2221 oasc.SolrCore.initDeprecatedSupport WARNING solrconfig.xml uses deprecated <admin/gettableFiles>, Please update your config to use the ShowFileRequestHandler.
[junit4:junit4]   2> 12712 T2221 oasc.SolrCore.initDeprecatedSupport WARNING adding ShowFileRequestHandler with hidden files: [SCHEMA.XML, OLD_SYNONYMS.TXT, STOPWORDS.TXT, PROTWORDS.TXT, OPEN-EXCHANGE-RATES.JSON, SYNONYMS.TXT, CURRENCY.XML, MAPPING-ISOLATIN1ACCENT.TXT]
[junit4:junit4]   2> 12715 T2221 oasc.CachingDirectoryFactory.close Releasing directory:/Users/jenkins/jenkins-slave/workspace/Lucene-Solr-trunk-MacOSX/solr/build/solr-core/test/J0/./org.apache.solr.cloud.BasicDistributedZkTest-1359997319318/jetty3
[junit4:junit4]   2> 12716 T2221 oass.SolrIndexSearcher.<init> Opening Searcher@5579e89d main
[junit4:junit4]   2> 12717 T2221 oasu.CommitTracker.<init> Hard AutoCommit: disabled
[junit4:junit4]   2> 12718 T2221 oasu.CommitTracker.<init> Soft AutoCommit: disabled
[junit4:junit4]   2> 12718 T2221 oashc.SpellCheckComponent.inform Initializing spell checkers
[junit4:junit4]   2> 12725 T2221 oass.DirectSolrSpellChecker.init init: {name=direct,classname=DirectSolrSpellChecker,field=lowerfilt,minQueryLength=3}
[junit4:junit4]   2> 12766 T2222 oasc.SolrCore.registerSearcher [collection1] Registered new searcher Searcher@5579e89d main{StandardDirectoryReader(segments_1:1)}
[junit4:junit4]   2> 12773 T2221 oasc.ZkController.publish publishing core=collection1 state=down
[junit4:junit4]   2> 12773 T2221 oasc.ZkController.publish numShards not found on descriptor - reading it from system property
[junit4:junit4]   2> 12782 T2172 oascc.ZkStateReader.updateClusterState Updating cloud state from ZooKeeper... 
[junit4:junit4]   2> 12783 T2172 oasc.Overseer$ClusterStateUpdater.updateState Update state numShards=2 message={
[junit4:junit4]   2> 	  "operation":"state",
[junit4:junit4]   2> 	  "numShards":"2",
[junit4:junit4]   2> 	  "shard":"shard2",
[junit4:junit4]   2> 	  "roles":null,
[junit4:junit4]   2> 	  "state":"active",
[junit4:junit4]   2> 	  "core":"collection1",
[junit4:junit4]   2> 	  "collection":"collection1",
[junit4:junit4]   2> 	  "node_name":"127.0.0.1:49802_",
[junit4:junit4]   2> 	  "base_url":"http://127.0.0.1:49802"}
[junit4:junit4]   2> 12791 T2172 oasc.Overseer$ClusterStateUpdater.updateState Update state numShards=2 message={
[junit4:junit4]   2> 	  "operation":"state",
[junit4:junit4]   2> 	  "numShards":"2",
[junit4:junit4]   2> 	  "shard":null,
[junit4:junit4]   2> 	  "roles":null,
[junit4:junit4]   2> 	  "state":"down",
[junit4:junit4]   2> 	  "core":"collection1",
[junit4:junit4]   2> 	  "collection":"collection1",
[junit4:junit4]   2> 	  "node_name":"127.0.0.1:49805_",
[junit4:junit4]   2> 	  "base_url":"http://127.0.0.1:49805"}
[junit4:junit4]   2> 12791 T2172 oasc.Overseer$ClusterStateUpdater.updateState Collection already exists with numShards=2
[junit4:junit4]   2> 12791 T2172 oasc.Overseer$ClusterStateUpdater.updateState Assigning new node to shard shard=shard1
[junit4:junit4]   2> 12800 T2171 oascc.ZkStateReader$2.process A cluster state change: WatchedEvent state:SyncConnected type:NodeDataChanged path:/clusterstate.json, has occurred - updating... (live nodes size: 4)
[junit4:junit4]   2> 12800 T2205 oascc.ZkStateReader$2.process A cluster state change: WatchedEvent state:SyncConnected type:NodeDataChanged path:/clusterstate.json, has occurred - updating... (live nodes size: 4)
[junit4:junit4]   2> 12801 T2177 oascc.ZkStateReader$2.process A cluster state change: WatchedEvent state:SyncConnected type:NodeDataChanged path:/clusterstate.json, has occurred - updating... (live nodes size: 4)
[junit4:junit4]   2> 12801 T2220 oascc.ZkStateReader$2.process A cluster state change: WatchedEvent state:SyncConnected type:NodeDataChanged path:/clusterstate.json, has occurred - updating... (live nodes size: 4)
[junit4:junit4]   2> 12801 T2190 oascc.ZkStateReader$2.process A cluster state change: WatchedEvent state:SyncConnected type:NodeDataChanged path:/clusterstate.json, has occurred - updating... (live nodes size: 4)
[junit4:junit4]   2> 13782 T2221 oasc.CoreContainer.registerCore registering core: collection1
[junit4:junit4]   2> 13783 T2221 oasc.ZkController.register Register replica - core:collection1 address:http://127.0.0.1:49805 collection:collection1 shard:shard1
[junit4:junit4]   2> 13788 T2221 oasc.ZkController.register We are http://127.0.0.1:49805/collection1/ and leader is http://127.0.0.1:49799/collection1/
[junit4:junit4]   2> 13789 T2221 oasc.ZkController.register No LogReplay needed for core=collection1 baseURL=http://127.0.0.1:49805
[junit4:junit4]   2> 13789 T2221 oasc.ZkController.checkRecovery Core needs to recover:collection1
[junit4:junit4]   2> 13789 T2221 oasu.DefaultSolrCoreState.doRecovery Running recovery - first canceling any ongoing recovery
[junit4:junit4]   2> ASYNC  NEW_CORE C219 name=collection1 org.apache.solr.core.SolrCore@3dbedf43 url=http://127.0.0.1:49805/collection1 node=127.0.0.1:49805_ C219_STATE=coll:collection1 core:collection1 props:{shard=null, roles=null, state=down, core=collection1, collection=collection1, node_name=127.0.0.1:49805_, base_url=http://127.0.0.1:49805}
[junit4:junit4]   2> 13790 T2223 C219 P49805 oasc.RecoveryStrategy.run Starting recovery process.  core=collection1 recoveringAfterStartup=true
[junit4:junit4]   2> 13790 T2223 C219 P49805 oasc.RecoveryStrategy.doRecovery ###### startupVersions=[]
[junit4:junit4]   2> 13791 T2223 C219 P49805 oasc.ZkController.publish publishing core=collection1 state=recovering
[junit4:junit4]   2> 13791 T2221 oascc.ZkStateReader.updateClusterState Updating cloud state from ZooKeeper... 
[junit4:junit4]   2> 13791 T2223 C219 P49805 oasc.ZkController.publish numShards not found on descriptor - reading it from system property
[junit4:junit4]   2> 13793 T2149 oass.SolrDispatchFilter.init user.dir=/Users/jenkins/jenkins-slave/workspace/Lucene-Solr-trunk-MacOSX/solr/build/solr-core/test/J0
[junit4:junit4]   2> 13794 T2223 C219 P49805 oascsi.HttpClientUtil.createClient Creating new http client, config:maxConnections=128&maxConnectionsPerHost=32&followRedirects=false
[junit4:junit4]   2> 13794 T2149 oass.SolrDispatchFilter.init SolrDispatchFilter.init() done
[junit4:junit4]   2> 13795 T2149 oascsi.HttpClientUtil.createClient Creating new http client, config:maxConnections=128&maxConnectionsPerHost=32&followRedirects=false
[junit4:junit4]   2> 14016 T2149 oejs.Server.doStart jetty-8.1.8.v20121106
[junit4:junit4]   2> 14021 T2149 oejs.AbstractConnector.doStart Started SelectChannelConnector@127.0.0.1:49809
[junit4:junit4]   2> 14023 T2149 oass.SolrDispatchFilter.init SolrDispatchFilter.init()
[junit4:junit4]   2> 14023 T2149 oasc.SolrResourceLoader.locateSolrHome JNDI not configured for solr (NoInitialContextEx)
[junit4:junit4]   2> 14024 T2149 oasc.SolrResourceLoader.locateSolrHome using system property solr.solr.home: /Users/jenkins/jenkins-slave/workspace/Lucene-Solr-trunk-MacOSX/solr/build/solr-core/test/J0/./org.apache.solr.cloud.BasicDistributedZkTest-jetty4-1359997333111
[junit4:junit4]   2> 14024 T2149 oasc.CoreContainer$Initializer.initialize looking for solr.xml: /Users/jenkins/jenkins-slave/workspace/Lucene-Solr-trunk-MacOSX/solr/build/solr-core/test/J0/./org.apache.solr.cloud.BasicDistributedZkTest-jetty4-1359997333111/solr.xml
[junit4:junit4]   2> 14025 T2149 oasc.CoreContainer.<init> New CoreContainer 263516826
[junit4:junit4]   2> 14026 T2149 oasc.CoreContainer.load Loading CoreContainer using Solr Home: '/Users/jenkins/jenkins-slave/workspace/Lucene-Solr-trunk-MacOSX/solr/build/solr-core/test/J0/./org.apache.solr.cloud.BasicDistributedZkTest-jetty4-1359997333111/'
[junit4:junit4]   2> 14026 T2149 oasc.SolrResourceLoader.<init> new SolrResourceLoader for directory: '/Users/jenkins/jenkins-slave/workspace/Lucene-Solr-trunk-MacOSX/solr/build/solr-core/test/J0/./org.apache.solr.cloud.BasicDistributedZkTest-jetty4-1359997333111/'
[junit4:junit4]   2> 14066 T2149 oashc.HttpShardHandlerFactory.getParameter Setting socketTimeout to: 60000
[junit4:junit4]   2> 14067 T2149 oashc.HttpShardHandlerFactory.getParameter Setting urlScheme to: http://
[junit4:junit4]   2> 14068 T2149 oashc.HttpShardHandlerFactory.getParameter Setting connTimeout to: 15000
[junit4:junit4]   2> 14068 T2149 oashc.HttpShardHandlerFactory.getParameter Setting maxConnectionsPerHost to: 20
[junit4:junit4]   2> 14069 T2149 oashc.HttpShardHandlerFactory.getParameter Setting corePoolSize to: 0
[junit4:junit4]   2> 14069 T2149 oashc.HttpShardHandlerFactory.getParameter Setting maximumPoolSize to: 2147483647
[junit4:junit4]   2> 14070 T2149 oashc.HttpShardHandlerFactory.getParameter Setting maxThreadIdleTime to: 5
[junit4:junit4]   2> 14070 T2149 oashc.HttpShardHandlerFactory.getParameter Setting sizeOfQueue to: -1
[junit4:junit4]   2> 14071 T2149 oashc.HttpShardHandlerFactory.getParameter Setting fairnessPolicy to: false
[junit4:junit4]   2> 14072 T2149 oascsi.HttpClientUtil.createClient Creating new http client, config:maxConnectionsPerHost=20&maxConnections=10000&socketTimeout=60000&connTimeout=15000&retry=false
[junit4:junit4]   2> 14104 T2149 oasc.CoreContainer.load Registering Log Listener
[junit4:junit4]   2> 14129 T2149 oasc.CoreContainer.initZooKeeper Zookeeper client=127.0.0.1:49792/solr
[junit4:junit4]   2> 14130 T2149 oasc.ZkController.checkChrootPath zkHost includes chroot
[junit4:junit4]   2> 14130 T2149 oaz.ZooKeeper.<init> Initiating client connection, connectString=127.0.0.1:49792 sessionTimeout=60000 watcher=org.apache.solr.common.cloud.ConnectionManager@29af0b2b
[junit4:junit4]   2> 14132 T2149 oascc.ConnectionManager.waitForConnected Waiting for client to connect to ZooKeeper
[junit4:junit4]   2> 14132 T2233 oaz.ClientCnxn$SendThread.logStartConnect Opening socket connection to server localhost/127.0.0.1:49792. Will not attempt to authenticate using SASL (access denied ("javax.security.auth.AuthPermission" "getLoginConfiguration"))
[junit4:junit4]   2> 14135 T2233 oaz.ClientCnxn$SendThread.primeConnection Socket connection established to localhost/127.0.0.1:49792, initiating session
[junit4:junit4]   2> 14135 T2151 oazs.NIOServerCnxnFactory.run Accepted socket connection from /127.0.0.1:49810
[junit4:junit4]   2> 14135 T2151 oazs.ZooKeeperServer.processConnectRequest Client attempting to establish new session at /127.0.0.1:49810
[junit4:junit4]   2> 14137 T2153 oazs.ZooKeeperServer.finishSessionInit Established session 0x13ca628389d000b with negotiated timeout 20000 for client /127.0.0.1:49810
[junit4:junit4]   2> 14137 T2233 oaz.ClientCnxn$SendThread.onConnected Session establishment complete on server localhost/127.0.0.1:49792, sessionid = 0x13ca628389d000b, negotiated timeout = 20000
[junit4:junit4]   2> 14138 T2234 oascc.ConnectionManager.process Watcher org.apache.solr.common.cloud.ConnectionManager@29af0b2b name:ZooKeeperConnection Watcher:127.0.0.1:49792 got event WatchedEvent state:SyncConnected type:None path:null path:null type:None
[junit4:junit4]   2> 14138 T2149 oascc.ConnectionManager.waitForConnected Client is connected to ZooKeeper
[junit4:junit4]   2> 14141 T2154 oazs.PrepRequestProcessor.pRequest2Txn Processed session termination for sessionid: 0x13ca628389d000b
[junit4:junit4]   2> 14142 T2151 oazs.NIOServerCnxn.closeSock Closed socket connection for client /127.0.0.1:49810 which had sessionid 0x13ca628389d000b
[junit4:junit4]   2> 14143 T2234 oaz.ClientCnxn$EventThread.run EventThread shut down
[junit4:junit4]   2> 14142 T2149 oaz.ZooKeeper.close Session: 0x13ca628389d000b closed
[junit4:junit4]   2> 14144 T2149 oascsi.HttpClientUtil.createClient Creating new http client, config:maxConnections=500&maxConnectionsPerHost=16&socketTimeout=60000&connTimeout=15000
[junit4:junit4]   2> 14149 T2149 oaz.ZooKeeper.<init> Initiating client connection, connectString=127.0.0.1:49792/solr sessionTimeout=30000 watcher=org.apache.solr.common.cloud.ConnectionManager@6eaa909b
[junit4:junit4]   2> 14151 T2149 oascc.ConnectionManager.waitForConnected Waiting for client to connect to ZooKeeper
[junit4:junit4]   2> 14151 T2235 oaz.ClientCnxn$SendThread.logStartConnect Opening socket connection to server localhost/127.0.0.1:49792. Will not attempt to authenticate using SASL (access denied ("javax.security.auth.AuthPermission" "getLoginConfiguration"))
[junit4:junit4]   2> 14152 T2235 oaz.ClientCnxn$SendThread.primeConnection Socket connection established to localhost/127.0.0.1:49792, initiating session
[junit4:junit4]   2> 14153 T2151 oazs.NIOServerCnxnFactory.run Accepted socket connection from /127.0.0.1:49811
[junit4:junit4]   2> 14154 T2151 oazs.ZooKeeperServer.processConnectRequest Client attempting to establish new session at /127.0.0.1:49811
[junit4:junit4]   2> 14155 T2153 oazs.ZooKeeperServer.finishSessionInit Established session 0x13ca628389d000c with negotiated timeout 20000 for client /127.0.0.1:49811
[junit4:junit4]   2> 14155 T2235 oaz.ClientCnxn$SendThread.onConnected Session establishment complete on server localhost/127.0.0.1:49792, sessionid = 0x13ca628389d000c, negotiated timeout = 20000
[junit4:junit4]   2> 14156 T2236 oascc.ConnectionManager.process Watcher org.apache.solr.common.cloud.ConnectionManager@6eaa909b name:ZooKeeperConnection Watcher:127.0.0.1:49792/solr got event WatchedEvent state:SyncConnected type:None path:null path:null type:None
[junit4:junit4]   2> 14156 T2149 oascc.ConnectionManager.waitForConnected Client is connected to ZooKeeper
[junit4:junit4]   2> 14158 T2154 oazs.PrepRequestProcessor.pRequest Got user-level KeeperException when processing sessionid:0x13ca628389d000c type:create cxid:0x1 zxid:0xa0 txntype:-1 reqpath:n/a Error Path:/solr/overseer Error:KeeperErrorCode = NodeExists for /solr/overseer
[junit4:junit4]   2> 14160 T2154 oazs.PrepRequestProcessor.pRequest Got user-level KeeperException when processing sessionid:0x13ca628389d000c type:create cxid:0x2 zxid:0xa1 txntype:-1 reqpath:n/a Error Path:/solr/overseer Error:KeeperErrorCode = NodeExists for /solr/overseer
[junit4:junit4]   2> 14162 T2149 oasc.ZkController.createEphemeralLiveNode Register node as live in ZooKeeper:/live_nodes/127.0.0.1:49809_
[junit4:junit4]   2> 14164 T2154 oazs.PrepRequestProcessor.pRequest Got user-level KeeperException when processing sessionid:0x13ca628389d000c type:delete cxid:0x4 zxid:0xa2 txntype:-1 reqpath:n/a Error Path:/solr/live_nodes/127.0.0.1:49809_ Error:KeeperErrorCode = NoNode for /solr/live_nodes/127.0.0.1:49809_
[junit4:junit4]   2> 14165 T2149 oascc.SolrZkClient.makePath makePath: /live_nodes/127.0.0.1:49809_
[junit4:junit4]   2> 14169 T2171 oascc.ZkStateReader$2.process A cluster state change: WatchedEvent state:SyncConnected type:NodeChildrenChanged path:/live_nodes, has occurred - updating... (live nodes size: 4)
[junit4:junit4]   2> 14171 T2205 oascc.ZkStateReader$3.process Updating live nodes... (5)
[junit4:junit4]   2> 14171 T2177 oascc.ZkStateReader$3.process Updating live nodes... (5)
[junit4:junit4]   2> 14171 T2220 oascc.ZkStateReader$3.process Updating live nodes... (5)
[junit4:junit4]   2> 14171 T2220 oascc.ZkStateReader$2.process A cluster state change: WatchedEvent state:SyncConnected type:NodeChildrenChanged path:/live_nodes, has occurred - updating... (live nodes size: 5)
[junit4:junit4]   2> 14172 T2177 oascc.ZkStateReader$2.process A cluster state change: WatchedEvent state:SyncConnected type:NodeChildrenChanged path:/live_nodes, has occurred - updating... (live nodes size: 5)
[junit4:junit4]   2> 14171 T2205 oascc.ZkStateReader$2.process A cluster state change: WatchedEvent state:SyncConnected type:NodeChildrenChanged path:/live_nodes, has occurred - updating... (live nodes size: 5)
[junit4:junit4]   2> 14172 T2190 oascc.ZkStateReader$3.process Updating live nodes... (5)
[junit4:junit4]   2> 14173 T2190 oascc.ZkStateReader$2.process A cluster state change: WatchedEvent state:SyncConnected type:NodeChildrenChanged path:/live_nodes, has occurred - updating... (live nodes size: 5)
[junit4:junit4]   2> 14176 T2171 oascc.ZkStateReader$3.process Updating live nodes... (5)
[junit4:junit4]   2> 14182 T2149 oascc.ZkStateReader.createClusterStateWatchersAndUpdate Updating cluster state from ZooKeeper... 
[junit4:junit4]   2> 14192 T2237 oasc.CoreContainer.create Creating SolrCore 'collection1' using instanceDir: /Users/jenkins/jenkins-slave/workspace/Lucene-Solr-trunk-MacOSX/solr/build/solr-core/test/J0/./org.apache.solr.cloud.BasicDistributedZkTest-jetty4-1359997333111/collection1
[junit4:junit4]   2> 14192 T2237 oasc.ZkController.createCollectionZkNode Check for collection zkNode:collection1
[junit4:junit4]   2> 14194 T2237 oasc.ZkController.createCollectionZkNode Collection zkNode exists
[junit4:junit4]   2> 14194 T2237 oasc.ZkController.readConfigName Load collection config from:/collections/collection1
[junit4:junit4]   2> 14196 T2237 oasc.SolrResourceLoader.<init> new SolrResourceLoader for directory: '/Users/jenkins/jenkins-slave/workspace/Lucene-Solr-trunk-MacOSX/solr/build/solr-core/test/J0/./org.apache.solr.cloud.BasicDistributedZkTest-jetty4-1359997333111/collection1/'
[junit4:junit4]   2> 14197 T2237 oasc.SolrResourceLoader.replaceClassLoader Adding 'file:/Users/jenkins/jenkins-slave/workspace/Lucene-Solr-trunk-MacOSX/solr/build/solr-core/test/J0/org.apache.solr.cloud.BasicDistributedZkTest-jetty4-1359997333111/collection1/lib/classes/' to classloader
[junit4:junit4]   2> 14198 T2237 oasc.SolrResourceLoader.replaceClassLoader Adding 'file:/Users/jenkins/jenkins-slave/workspace/Lucene-Solr-trunk-MacOSX/solr/build/solr-core/test/J0/org.apache.solr.cloud.BasicDistributedZkTest-jetty4-1359997333111/collection1/lib/README' to classloader
[junit4:junit4]   2> 14280 T2237 oasc.SolrConfig.<init> Using Lucene MatchVersion: LUCENE_50
[junit4:junit4]   2> 14318 T2172 oascc.ZkStateReader.updateClusterState Updating cloud state from ZooKeeper... 
[junit4:junit4]   2> 14319 T2172 oasc.Overseer$ClusterStateUpdater.updateState Update state numShards=2 message={
[junit4:junit4]   2> 	  "operation":"state",
[junit4:junit4]   2> 	  "numShards":"2",
[junit4:junit4]   2> 	  "shard":"shard1",
[junit4:junit4]   2> 	  "roles":null,
[junit4:junit4]   2> 	  "state":"recovering",
[junit4:junit4]   2> 	  "core":"collection1",
[junit4:junit4]   2> 	  "collection":"collection1",
[junit4:junit4]   2> 	  "node_name":"127.0.0.1:49805_",
[junit4:junit4]   2> 	  "base_url":"http://127.0.0.1:49805"}
[junit4:junit4]   2> 14327 T2171 oascc.ZkStateReader$2.process A cluster state change: WatchedEvent state:SyncConnected type:NodeDataChanged path:/clusterstate.json, has occurred - updating... (live nodes size: 5)
[junit4:junit4]   2> 14328 T2236 oascc.ZkStateReader$2.process A cluster state change: WatchedEvent state:SyncConnected type:NodeDataChanged path:/clusterstate.json, has occurred - updating... (live nodes size: 5)
[junit4:junit4]   2> 14334 T2220 oascc.ZkStateReader$2.process A cluster state change: WatchedEvent state:SyncConnected type:NodeDataChanged path:/clusterstate.json, has occurred - updating... (live nodes size: 5)
[junit4:junit4]   2> 14334 T2205 oascc.ZkStateReader$2.process A cluster state change: WatchedEvent state:SyncConnected type:NodeDataChanged path:/clusterstate.json, has occurred - updating... (live nodes size: 5)
[junit4:junit4]   2> 14336 T2190 oascc.ZkStateReader$2.process A cluster state change: WatchedEvent state:SyncConnected type:NodeDataChanged path:/clusterstate.json, has occurred - updating... (live nodes size: 5)
[junit4:junit4]   2> 14337 T2177 oascc.ZkStateReader$2.process A cluster state change: WatchedEvent state:SyncConnected type:NodeDataChanged path:/clusterstate.json, has occurred - updating... (live nodes size: 5)
[junit4:junit4]   2> 14352 T2237 oasc.SolrConfig.<init> Loaded SolrConfig: solrconfig.xml
[junit4:junit4]   2> 14354 T2237 oass.IndexSchema.readSchema Reading Solr Schema
[junit4:junit4]   2> 14383 T2237 oass.IndexSchema.readSchema Schema name=test
[junit4:junit4]   2> 15096 T2237 oass.OpenExchangeRatesOrgProvider.init Initialized with rates=open-exchange-rates.json, refreshInterval=1440.
[junit4:junit4]   2> 15118 T2237 oass.IndexSchema.readSchema default search field in schema is text
[junit4:junit4]   2> 15126 T2237 oass.IndexSchema.readSchema unique key field: id
[junit4:junit4]   2> 15154 T2237 oass.FileExchangeRateProvider.reload Reloading exchange rates from file currency.xml
[junit4:junit4]   2> 15163 T2237 oass.FileExchangeRateProvider.reload Reloading exchange rates from file currency.xml
[junit4:junit4]   2> 15170 T2237 oass.OpenExchangeRatesOrgProvider.reload Reloading exchange rates from open-exchange-rates.json
[junit4:junit4]   2> 15173 T2237 oass.OpenExchangeRatesOrgProvider.reload Reloading exchange rates from open-exchange-rates.json
[junit4:junit4]   2> 15175 T2237 oasc.SolrCore.<init> [collection1] Opening new SolrCore at /Users/jenkins/jenkins-slave/workspace/Lucene-Solr-trunk-MacOSX/solr/build/solr-core/test/J0/./org.apache.solr.cloud.BasicDistributedZkTest-jetty4-1359997333111/collection1/, dataDir=./org.apache.solr.cloud.BasicDistributedZkTest-1359997319318/jetty4/
[junit4:junit4]   2> 15176 T2237 oasc.JmxMonitoredMap.<init> JMX monitoring is enabled. Adding Solr mbeans to JMX Server: com.sun.jmx.mbeanserver.JmxMBeanServer@679e2502
[junit4:junit4]   2> 15177 T2237 oasc.SolrCore.initDirectoryFactory solr.NRTCachingDirectoryFactory
[junit4:junit4]   2> 15178 T2237 oasc.CachingDirectoryFactory.get return new directory for /Users/jenkins/jenkins-slave/workspace/Lucene-Solr-trunk-MacOSX/solr/build/solr-core/test/J0/./org.apache.solr.cloud.BasicDistributedZkTest-1359997319318/jetty4 forceNew:false
[junit4:junit4]   2> 15179 T2237 oasc.CachingDirectoryFactory.close Releasing directory:/Users/jenkins/jenkins-slave/workspace/Lucene-Solr-trunk-MacOSX/solr/build/solr-core/test/J0/./org.apache.solr.cloud.BasicDistributedZkTest-1359997319318/jetty4
[junit4:junit4]   2> 15180 T2237 oasc.SolrCore.getNewIndexDir New index directory detected: old=null new=./org.apache.solr.cloud.BasicDistributedZkTest-1359997319318/jetty4/index/
[junit4:junit4]   2> 15181 T2237 oasc.SolrCore.initIndex WARNING [collection1] Solr index directory './org.apache.solr.cloud.BasicDistributedZkTest-1359997319318/jetty4/index' doesn't exist. Creating new index...
[junit4:junit4]   2> 15182 T2237 oasc.CachingDirectoryFactory.get return new directory for /Users/jenkins/jenkins-slave/workspace/Lucene-Solr-trunk-MacOSX/solr/build/solr-core/test/J0/./org.apache.solr.cloud.BasicDistributedZkTest-1359997319318/jetty4/index forceNew:false
[junit4:junit4]   2> 15187 T2237 oasc.SolrDeletionPolicy.onCommit SolrDeletionPolicy.onCommit: commits:num=1
[junit4:junit4]   2> 		commit{dir=RateLimitedDirectoryWrapper(NRTCachingDirectory(org.apache.lucene.store.NIOFSDirectory@/Users/jenkins/jenkins-slave/workspace/Lucene-Solr-trunk-MacOSX/solr/build/solr-core/test/J0/org.apache.solr.cloud.BasicDistributedZkTest-1359997319318/jetty4/index lockFactory=org.apache.lucene.store.NativeFSLockFactory@5b03f3c0; maxCacheMB=48.0 maxMergeSizeMB=4.0)),segFN=segments_1,generation=1,filenames=[segments_1]
[junit4:junit4]   2> 15187 T2237 oasc.SolrDeletionPolicy.updateCommits newest commit = 1[segments_1]
[junit4:junit4]   2> 15188 T2237 oasc.CachingDirectoryFactory.close Releasing directory:/Users/jenkins/jenkins-slave/workspace/Lucene-Solr-trunk-MacOSX/solr/build/solr-core/test/J0/./org.apache.solr.cloud.BasicDistributedZkTest-1359997319318/jetty4/index
[junit4:junit4]   2> 15188 T2237 oasc.SolrCore.initWriters created xml: solr.XMLResponseWriter
[junit4:junit4]   2> 15191 T2237 oasup.UpdateRequestProcessorChain.init inserting DistributedUpdateProcessorFactory into updateRequestProcessorChain "dedupe"
[junit4:junit4]   2> 15191 T2237 oasup.UpdateRequestProcessorChain.init inserting DistributedUpdateProcessorFactory into updateRequestProcessorChain "dedupe-allfields"
[junit4:junit4]   2> 15192 T2237 oasup.UpdateRequestProcessorChain.init inserting DistributedUpdateProcessorFactory into updateRequestProcessorChain "stored_sig"
[junit4:junit4]   2> 15192 T2237 oasup.UpdateRequestProcessorChain.init inserting DistributedUpdateProcessorFactory into updateRequestProcessorChain "uniq-fields"
[junit4:junit4]   2> 15193 T2237 oasup.UpdateRequestProcessorChain.init inserting DistributedUpdateProcessorFactory into updateRequestProcessorChain "distrib-dup-test-chain-implicit"
[junit4:junit4]   2> 15193 T2237 oasc.RequestHandlers.initHandlersFromConfig adding lazy requestHandler: solr.ReplicationHandler
[junit4:junit4]   2> 15194 T2237 oasc.RequestHandlers.initHandlersFromConfig created /replication: solr.ReplicationHandler
[junit4:junit4]   2> 15195 T2237 oasc.RequestHandlers.initHandlersFromConfig created standard: solr.StandardRequestHandler
[junit4:junit4]   2> 15195 T2237 oasc.RequestHandlers.initHandlersFromConfig created /get: solr.RealTimeGetHandler
[junit4:junit4]   2> 15196 T2237 oasc.RequestHandlers.initHandlersFromConfig created dismax: solr.SearchHandler
[junit4:junit4]   2> 15197 T2237 oasc.RequestHandlers.initHandlersFromConfig created mock: org.apache.solr.core.MockQuerySenderListenerReqHandler
[junit4:junit4]   2> 15197 T2237 oasc.RequestHandlers.initHandlersFromConfig created /admin/: org.apache.solr.handler.admin.AdminHandlers
[junit4:junit4]   2> 15198 T2237 oasc.RequestHandlers.initHandlersFromConfig created defaults: solr.StandardRequestHandler
[junit4:junit4]   2> 15198 T2237 oasc.RequestHandlers.initHandlersFromConfig adding lazy requestHandler: solr.StandardRequestHandler
[junit4:junit4]   2> 15199 T2237 oasc.RequestHandlers.initHandlersFromConfig created lazy: solr.StandardRequestHandler
[junit4:junit4]   2> 15199 T2237 oasc.RequestHandlers.initHandlersFromConfig created /update: solr.UpdateRequestHandler
[junit4:junit4]   2> 15200 T2237 oasc.RequestHandlers.initHandlersFromConfig created /terms: org.apache.solr.handler.component.SearchHandler
[junit4:junit4]   2> 15200 T2237 oasc.RequestHandlers.initHandlersFromConfig created spellCheckCompRH: org.apache.solr.handler.component.SearchHandler
[junit4:junit4]   2> 15201 T2237 oasc.RequestHandlers.initHandlersFromConfig created spellCheckCompRH_Direct: org.apache.solr.handler.component.SearchHandler
[junit4:junit4]   2> 15202 T2237 oasc.RequestHandlers.initHandlersFromConfig created spellCheckWithWordbreak: org.apache.solr.handler.component.SearchHandler
[junit4:junit4]   2> 15203 T2237 oasc.RequestHandlers.initHandlersFromConfig created spellCheckWithWordbreak_Direct: org.apache.solr.handler.component.SearchHandler
[junit4:junit4]   2> 15203 T2237 oasc.RequestHandlers.initHandlersFromConfig created spellCheckCompRH1: org.apache.solr.handler.component.SearchHandler
[junit4:junit4]   2> 15204 T2237 oasc.RequestHandlers.initHandlersFromConfig created mltrh: org.apache.solr.handler.component.SearchHandler
[junit4:junit4]   2> 15204 T2237 oasc.RequestHandlers.initHandlersFromConfig created tvrh: org.apache.solr.handler.component.SearchHandler
[junit4:junit4]   2> 15205 T2237 oasc.RequestHandlers.initHandlersFromConfig created /mlt: solr.MoreLikeThisHandler
[junit4:junit4]   2> 15206 T2237 oasc.RequestHandlers.initHandlersFromConfig created /debug/dump: solr.DumpRequestHandler
[junit4:junit4]   2> 15212 T2237 oashl.XMLLoader.init xsltCacheLifetimeSeconds=60
[junit4:junit4]   2> 15216 T2237 oasc.SolrCore.initDeprecatedSupport WARNING solrconfig.xml uses deprecated <admin/gettableFiles>, Please update your config to use the ShowFileRequestHandler.
[junit4:junit4]   2> 15217 T2237 oasc.SolrCore.initDeprecatedSupport WARNING adding ShowFileRequestHandler with hidden files: [SCHEMA.XML, OLD_SYNONYMS.TXT, STOPWORDS.TXT, PROTWORDS.TXT, OPEN-EXCHANGE-RATES.JSON, SYNONYMS.TXT, CURRENCY.XML, MAPPING-ISOLATIN1ACCENT.TXT]
[junit4:junit4]   2> 15220 T2237 oasc.CachingDirectoryFactory.close Releasing directory:/Users/jenkins/jenkins-slave/workspace/Lucene-Solr-trunk-MacOSX/solr/build/solr-core/test/J0/./org.apache.solr.cloud.BasicDistributedZkTest-1359997319318/jetty4
[junit4:junit4]   2> 15222 T2237 oass.SolrIndexSearcher.<init> Opening Searcher@6399684d main
[junit4:junit4]   2> 15223 T2237 oasu.CommitTracker.<init> Hard AutoCommit: disabled
[junit4:junit4]   2> 15223 T2237 oasu.CommitTracker.<init> Soft AutoCommit: disabled
[junit4:junit4]   2> 15224 T2237 oashc.SpellCheckComponent.inform Initializing spell checkers
[junit4:junit4]   2> 15229 T2237 oass.DirectSolrSpellChecker.init init: {name=direct,classname=DirectSolrSpellChecker,field=lowerfilt,minQueryLength=3}
[junit4:junit4]   2> 15261 T2238 oasc.SolrCore.registerSearcher [collection1] Registered new searcher Searcher@6399684d main{StandardDirectoryReader(segments_1:1)}
[junit4:junit4]   2> 15266 T2237 oasc.ZkController.publish publishing core=collection1 state=down
[junit4:junit4]   2> 15266 T2237 oasc.ZkController.publish numShards not found on descriptor - reading it from system property
[junit4:junit4]   2> 15838 T2172 oascc.ZkStateReader.updateClusterState Updating cloud state from ZooKeeper... 
[junit4:junit4]   2> 15840 T2172 oasc.Overseer$ClusterStateUpdater.updateState Update state numShards=2 message={
[junit4:junit4]   2> 	  "operation":"state",
[junit4:junit4]   2> 	  "numShards":"2",
[junit4:junit4]   2> 	  "shard":null,
[junit4:junit4]   2> 	  "roles":null,
[junit4:junit4]   2> 	  "state":"down",
[junit4:junit4]   2> 	  "core":"collection1",
[junit4:junit4]   2> 	  "collection":"collection1",
[junit4:junit4]   2> 	  "node_name":"127.0.0.1:49809_",
[junit4:junit4]   2> 	  "base_url":"http://127.0.0.1:49809"}
[junit4:junit4]   2> 15840 T2172 oasc.Overseer$ClusterStateUpdater.updateState Collection already exists with numShards=2
[junit4:junit4]   2> 15840 T2172 oasc.Overseer$ClusterStateUpdater.updateState Assigning new node to shard shard=shard2
[junit4:junit4]   2> 15849 T2171 oascc.ZkStateReader$2.process A cluster state change: WatchedEvent state:SyncConnected type:NodeDataChanged path:/clusterstate.json, has occurred - updating... (live nodes size: 5)
[junit4:junit4]   2> 15850 T2236 oascc.ZkStateReader$2.process A cluster state change: WatchedEvent state:SyncConnected type:NodeDataChanged path:/clusterstate.json, has occurred - updating... (live nodes size: 5)
[junit4:junit4]   2> 15850 T2205 oascc.ZkStateReader$2.process A cluster state change: WatchedEvent state:SyncConnected type:NodeDataChanged path:/clusterstate.json, has occurred - updating... (live nodes size: 5)
[junit4:junit4]   2> 15851 T2220 oascc.ZkStateReader$2.process A cluster state change: WatchedEvent state:SyncConnected type:NodeDataChanged path:/clusterstate.json, has occurred - updating... (live nodes size: 5)
[junit4:junit4]   2> 15849 T2177 oascc.ZkStateReader$2.process A cluster state change: WatchedEvent state:SyncConnected type:NodeDataChanged path:/clusterstate.json, has occurred - updating... (live nodes size: 5)
[junit4:junit4]   2> 15850 T2190 oascc.ZkStateReader$2.process A cluster state change: WatchedEvent state:SyncConnected type:NodeDataChanged path:/clusterstate.json, has occurred - updating... (live nodes size: 5)
[junit4:junit4]   2> 16270 T2237 oasc.CoreContainer.registerCore registering core: collection1
[junit4:junit4]   2> 16270 T2237 oasc.ZkController.register Register replica - core:collection1 address:http://127.0.0.1:49809 collection:collection1 shard:shard2
[junit4:junit4]   2> 16276 T2237 oasc.ZkController.register We are http://127.0.0.1:49809/collection1/ and leader is http://127.0.0.1:49802/collection1/
[junit4:junit4]   2> 16277 T2237 oasc.ZkController.register No LogReplay needed for core=collection1 baseURL=http://127.0.0.1:49809
[junit4:junit4]   2> 16278 T2237 oasc.ZkController.checkRecovery Core needs to recover:collection1
[junit4:junit4]   2> 16278 T2237 oasu.DefaultSolrCoreState.doRecovery Running recovery - first canceling any ongoing recovery
[junit4:junit4]   2> ASYNC  NEW_CORE C220 name=collection1 org.apache.solr.core.SolrCore@7f0d194d url=http://127.0.0.1:49809/collection1 node=127.0.0.1:49809_ C220_STATE=coll:collection1 core:collection1 props:{shard=null, roles=null, state=down, core=collection1, collection=collection1, node_name=127.0.0.1:49809_, base_url=http://127.0.0.1:49809}
[junit4:junit4]   2> 16279 T2239 C220 P49809 oasc.RecoveryStrategy.run Starting recovery process.  core=collection1 recoveringAfterStartup=true
[junit4:junit4]   2> 16279 T2239 C220 P49809 oasc.RecoveryStrategy.doRecovery ###### startupVersions=[]
[junit4:junit4]   2> 16280 T2239 C220 P49809 oasc.ZkController.publish publishing core=collection1 state=recovering
[junit4:junit4]   2> 16280 T2237 oascc.ZkStateReader.updateClusterState Updating cloud state from ZooKeeper... 
[junit4:junit4]   2> 16280 T2239 C220 P49809 oasc.ZkController.publish numShards not found on descriptor - reading it from system property
[junit4:junit4]   2> 16282 T2149 oass.SolrDispatchFilter.init user.dir=/Users/jenkins/jenkins-slave/workspace/Lucene-Solr-trunk-MacOSX/solr/build/solr-core/test/J0
[junit4:junit4]   2> 16283 T2239 C220 P49809 oascsi.HttpClientUtil.createClient Creating new http client, config:maxConnections=128&maxConnectionsPerHost=32&followRedirects=false
[junit4:junit4]   2> 16283 T2149 oass.SolrDispatchFilter.init SolrDispatchFilter.init() done
[junit4:junit4]   2> 16284 T2149 oascsi.HttpClientUtil.createClient Creating new http client, config:maxConnections=128&maxConnectionsPerHost=32&followRedirects=false
[junit4:junit4]   2> 16292 T2149 oascc.ZkStateReader.updateClusterState Updating cloud state from ZooKeeper... 
[junit4:junit4]   2> 16294 T2149 oasc.AbstractDistribZkTestBase.waitForRecoveriesToFinish Wait for recoveries to finish - collection: collection1 failOnTimeout:true timeout (sec):230
[junit4:junit4]   2> 16297 T2149 oascc.ZkStateReader.updateClusterState Updating cloud state from ZooKeeper... 
[junit4:junit4]   2>  C219_STATE=coll:collection1 core:collection1 props:{shard=shard1, roles=null, state=recovering, core=collection1, collection=collection1, node_name=127.0.0.1:49805_, base_url=http://127.0.0.1:49805}
[junit4:junit4]   2> 16811 T2223 C219 P49805 oasc.RecoveryStrategy.doRecovery Attempting to PeerSync from http://127.0.0.1:49799/collection1/ core=collection1 - recoveringAfterStartup=true
[junit4:junit4]   2> 16811 T2223 C219 P49805 oasu.PeerSync.sync PeerSync: core=collection1 url=http://127.0.0.1:49805 START replicas=[http://127.0.0.1:49799/collection1/] nUpdates=100
[junit4:junit4]   2> 16812 T2223 C219 P49805 oasu.PeerSync.sync WARNING no frame of reference to tell of we've missed updates
[junit4:junit4]   2> 16813 T2223 C219 P49805 oasc.RecoveryStrategy.doRecovery PeerSync Recovery was not successful - trying replication. core=collection1
[junit4:junit4]   2> 16813 T2223 C219 P49805 oasc.RecoveryStrategy.doRecovery Starting Replication Recovery. core=collection1
[junit4:junit4]   2> 16814 T2223 C219 P49805 oasc.RecoveryStrategy.doRecovery Begin buffering updates. core=collection1
[junit4:junit4]   2> 16814 T2223 C219 P49805 oasu.UpdateLog.bufferUpdates Starting to buffer updates. FSUpdateLog{state=ACTIVE, tlog=null}
[junit4:junit4]   2> 16814 T2223 C219 P49805 oasc.RecoveryStrategy.replicate Attempting to replicate from http://127.0.0.1:49799/collection1/. core=collection1
[junit4:junit4]   2> 16814 T2223 C219 P49805 oascsi.HttpClientUtil.createClient Creating new http client, config:maxConnections=128&maxConnectionsPerHost=32&followRedirects=false
[junit4:junit4]   2> ASYNC  NEW_CORE C221 name=collection1 org.apache.solr.core.SolrCore@6a16a971 url=http://127.0.0.1:49799/collection1 node=127.0.0.1:49799_ C221_STATE=coll:collection1 core:collection1 props:{shard=shard1, roles=null, state=active, core=collection1, collection=collection1, node_name=127.0.0.1:49799_, base_url=http://127.0.0.1:49799, leader=true}
[junit4:junit4]   2> 16824 T2181 C221 P49799 REQ /get {getVersions=100&distrib=false&wt=javabin&qt=/get&version=2} status=0 QTime=0 
[junit4:junit4]   2> 16824 T2184 C221 P49799 oasu.DirectUpdateHandler2.commit start commit{,optimize=false,openSearcher=false,waitSearcher=true,expungeDeletes=false,softCommit=false}
[junit4:junit4]   2> 16826 T2184 C221 P49799 oasc.CachingDirectoryFactory.close Releasing directory:/Users/jenkins/jenkins-slave/workspace/Lucene-Solr-trunk-MacOSX/solr/build/solr-core/test/J0/./org.apache.solr.cloud.BasicDistributedZkTest-1359997319318/jetty1
[junit4:junit4]   2> 16828 T2184 C221 P49799 oasc.SolrDeletionPolicy.onInit SolrDeletionPolicy.onInit: commits:num=1
[junit4:junit4]   2> 		commit{dir=RateLimitedDirectoryWrapper(NRTCachingDirectory(org.apache.lucene.store.NIOFSDirectory@/Users/jenkins/jenkins-slave/workspace/Lucene-Solr-trunk-MacOSX/solr/build/solr-core/test/J0/org.apache.solr.cloud.BasicDistributedZkTest-1359997319318/jetty1/index lockFactory=org.apache.lucene.store.NativeFSLockFactory@15ddf9d; maxCacheMB=48.0 maxMergeSizeMB=4.0)),segFN=segments_1,generation=1,filenames=[segments_1]
[junit4:junit4]   2> 16829 T2184 C221 P49799 oasc.SolrDeletionPolicy.updateCommits newest commit = 1[segments_1]
[junit4:junit4]   2> 16831 T2184 C221 P49799 oasc.SolrDeletionPolicy.onCommit SolrDeletionPolicy.onCommit: commits:num=2
[junit4:junit4]   2> 		commit{dir=RateLimitedDirectoryWrapper(NRTCachingDirectory(org.apache.lucene.store.NIOFSDirectory@/Users/jenkins/jenkins-slave/workspace/Lucene-Solr-trunk-MacOSX/solr/build/solr-core/test/J0/org.apache.solr.cloud.BasicDistributedZkTest-1359997319318/jetty1/index lockFactory=org.apache.lucene.store.NativeFSLockFactory@15ddf9d; maxCacheMB=48.0 maxMergeSizeMB=4.0)),segFN=segments_1,generation=1,filenames=[segments_1]
[junit4:junit4]   2> 		commit{dir=RateLimitedDirectoryWrapper(NRTCachingDirectory(org.apache.lucene.store.NIOFSDirectory@/Users/jenkins/jenkins-slave/workspace/Lucene-Solr-trunk-MacOSX/solr/build/solr-core/test/J0/org.apache.solr.cloud.BasicDistributedZkTest-1359997319318/jetty1/index lockFactory=org.apache.lucene.store.NativeFSLockFactory@15ddf9d; maxCacheMB=48.0 maxMergeSizeMB=4.0)),segFN=segments_2,generation=2,filenames=[segments_2]
[junit4:junit4]   2> 16832 T2184 C221 P49799 oasc.SolrDeletionPolicy.updateCommits newest commit = 2[segments_2]
[junit4:junit4]   2> 16832 T2184 C221 P49799 oasc.CachingDirectoryFactory.close Releasing directory:/Users/jenkins/jenkins-slave/workspace/Lucene-Solr-trunk-MacOSX/solr/build/solr-core/test/J0/./org.apache.solr.cloud.BasicDistributedZkTest-1359997319318/jetty1
[junit4:junit4]   2> 16833 T2184 C221 P49799 oass.SolrIndexSearcher.<init> Opening Searcher@24e88ab1 realtime
[junit4:junit4]   2> 16833 T2184 C221 P49799 oasu.DirectUpdateHandler2.commit end_commit_flush
[junit4:junit4]   2> 16833 T2184 C221 P49799 /update {waitSearcher=true&openSearcher=false&commit=true&wt=javabin&commit_end_point=true&version=2&softCommit=false} {commit=} 0 9
[junit4:junit4]   2> 16835 T2223 C219 P49805 oash.ReplicationHandler.inform Commits will be reserved for  10000
[junit4:junit4]   2> 16836 T2223 C219 P49805 oash.SnapPuller.<init>  No value set for 'pollInterval'. Timer Task not started.
[junit4:junit4]   2> 16839 T2182 C221 P49799 oash.ReplicationHandler.inform Commits will be reserved for  10000
[junit4:junit4]   2> 16839 T2182 C221 P49799 REQ /replication {command=indexversion&qt=/replication&wt=javabin&version=2} status=0 QTime=1 
[junit4:junit4]   2> 16840 T2223 C219 P49805 oash.SnapPuller.fetchLatestIndex Master's generation: 2
[junit4:junit4]   2> 16840 T2223 C219 P49805 oash.SnapPuller.fetchLatestIndex Slave's generation: 1
[junit4:junit4]   2> 16840 T2223 C219 P49805 oash.SnapPuller.fetchLatestIndex Starting replication process
[junit4:junit4]   2> 16842 T2183 C221 P49799 oasc.CachingDirectoryFactory.close Releasing directory:/Users/jenkins/jenkins-slave/workspace/Lucene-Solr-trunk-MacOSX/solr/build/solr-core/test/J0/./org.apache.solr.cloud.BasicDistributedZkTest-1359997319318/jetty1
[junit4:junit4]   2> 16843 T2183 C221 P49799 oasc.CachingDirectoryFactory.close Releasing directory:/Users/jenkins/jenkins-slave/workspace/Lucene-Solr-trunk-MacOSX/solr/build/solr-core/test/J0/./org.apache.solr.cloud.BasicDistributedZkTest-1359997319318/jetty1/index
[junit4:junit4]   2> 16844 T2183 C221 P49799 REQ /replication {command=filelist&qt=/replication&wt=javabin&generation=2&version=2} status=0 QTime=2 
[junit4:junit4]   2> 16844 T2223 C219 P49805 oash.SnapPuller.fetchLatestIndex Number of files in latest index in master: 1
[junit4:junit4]   2> 16845 T2223 C219 P49805 oasc.CachingDirectoryFactory.get return new directory for /Users/jenkins/jenkins-slave/workspace/Lucene-Solr-trunk-MacOSX/solr/build/solr-core/test/J0/./org.apache.solr.cloud.BasicDistributedZkTest-1359997319318/jetty3/index.20130205020216153 forceNew:false
[junit4:junit4]   2> 16846 T2223 C219 P49805 oasc.CachingDirectoryFactory.close Releasing directory:/Users/jenkins/jenkins-slave/workspace/Lucene-Solr-trunk-MacOSX/solr/build/solr-core/test/J0/./org.apache.solr.cloud.BasicDistributedZkTest-1359997319318/jetty3
[junit4:junit4]   2> 16846 T2223 C219 P49805 oash.SnapPuller.fetchLatestIndex Starting download to RateLimitedDirectoryWrapper(NRTCachingDirectory(org.apache.lucene.store.NIOFSDirectory@/Users/jenkins/jenkins-slave/workspace/Lucene-Solr-trunk-MacOSX/solr/build/solr-core/test/J0/org.apache.solr.cloud.BasicDistributedZkTest-1359997319318/jetty3/index.20130205020216153 lockFactory=org.apache.lucene.store.NativeFSLockFactory@56c8fa27; maxCacheMB=48.0 maxMergeSizeMB=4.0)) fullCopy=true
[junit4:junit4]   2> 16856 T2181 C221 P49799 REQ /replication {file=segments_2&command=filecontent&checksum=true&wt=filestream&qt=/replication&generation=2} status=0 QTime=1 
[junit4:junit4]   2> 16870 T2223 C219 P49805 oasc.CachingDirectoryFactory.close Releasing directory:/Users/jenkins/jenkins-slave/workspace/Lucene-Solr-trunk-MacOSX/solr/build/solr-core/test/J0/./org.apache.solr.cloud.BasicDistributedZkTest-1359997319318/jetty3/index
[junit4:junit4]   2> 16871 T2223 C219 P49805 oash.SnapPuller.fetchLatestIndex Total time taken for download : 0 secs
[junit4:junit4]   2> 16871 T2223 C219 P49805 oash.SnapPuller.modifyIndexProps New index installed. Updating index properties... index=index.20130205020216153
[junit4:junit4]   2> 16872 T2223 C219 P49805 oasc.CachingDirectoryFactory.close Releasing directory:/Users/jenkins/jenkins-slave/workspace/Lucene-Solr-trunk-MacOSX/solr/build/solr-core/test/J0/./org.apache.solr.cloud.BasicDistributedZkTest-1359997319318/jetty3
[junit4:junit4]   2> 16873 T2223 C219 P49805 oasc.CachingDirectoryFactory.close Releasing directory:/Users/jenkins/jenkins-slave/workspace/Lucene-Solr-trunk-MacOSX/solr/build/solr-core/test/J0/./org.apache.solr.cloud.BasicDistributedZkTest-1359997319318/jetty3
[junit4:junit4]   2> 16873 T2223 C219 P49805 oasc.SolrCore.getNewIndexDir New index directory detected: old=./org.apache.solr.cloud.BasicDistributedZkTest-1359997319318/jetty3/index/ new=./org.apache.solr.cloud.BasicDistributedZkTest-1359997319318/jetty3/index.20130205020216153
[junit4:junit4]   2> 16876 T2223 C219 P49805 oasc.SolrDeletionPolicy.onInit SolrDeletionPolicy.onInit: commits:num=1
[junit4:junit4]   2> 		commit{dir=RateLimitedDirectoryWrapper(NRTCachingDirectory(org.apache.lucene.store.NIOFSDirectory@/Users/jenkins/jenkins-slave/workspace/Lucene-Solr-trunk-MacOSX/solr/build/solr-core/test/J0/org.apache.solr.cloud.BasicDistributedZkTest-1359997319318/jetty3/index.20130205020216153 lockFactory=org.apache.lucene.store.NativeFSLockFactory@56c8fa27; maxCacheMB=48.0 maxMergeSizeMB=4.0)),segFN=segments_2,generation=2,filenames=[segments_2]
[junit4:junit4]   2> 16877 T2223 C219 P49805 oasc.SolrDeletionPolicy.updateCommits newest commit = 2[segments_2]
[junit4:junit4]   2> 16878 T2223 C219 P49805 oasc.CachingDirectoryFactory.close Releasing directory:/Users/jenkins/jenkins-slave/workspace/Lucene-Solr-trunk-MacOSX/solr/build/solr-core/test/J0/./org.apache.solr.cloud.BasicDistributedZkTest-1359997319318/jetty3
[junit4:junit4]   2> 16878 T2223 C219 P49805 oasu.DefaultSolrCoreState.newIndexWriter Creating new IndexWriter...
[junit4:junit4]   2> 16879 T2223 C219 P49805 oasu.DefaultSolrCoreState.newIndexWriter Waiting until IndexWriter is unused... core=collection1
[junit4:junit4]   2> 16879 T2223 C219 P49805 oasu.DefaultSolrCoreState.newIndexWriter Rollback old IndexWriter... core=collection1
[junit4:junit4]   2> 16880 T2223 C219 P49805 oasc.CachingDirectoryFactory.close Releasing directory:/Users/jenkins/jenkins-slave/workspace/Lucene-Solr-trunk-MacOSX/solr/build/solr-core/test/J0/./org.apache.solr.cloud.BasicDistributedZkTest-1359997319318/jetty3/index.20130205020216153
[junit4:junit4]   2> 16880 T2223 C219 P49805 oasc.CachingDirectoryFactory.close Releasing directory:/Users/jenkins/jenkins-slave/workspace/Lucene-Solr-trunk-MacOSX/solr/build/solr-core/test/J0/./org.apache.solr.cloud.BasicDistributedZkTest-1359997319318/jetty3
[junit4:junit4]   2> 16883 T2223 C219 P49805 oasc.SolrDeletionPolicy.onInit SolrDeletionPolicy.onInit: commits:num=1
[junit4:junit4]   2> 		commit{dir=RateLimitedDirectoryWrapper(NRTCachingDirectory(org.apache.lucene.store.NIOFSDirectory@/Users/jenkins/jenkins-slave/workspace/Lucene-Solr-trunk-MacOSX/solr/build/solr-core/test/J0/org.apache.solr.cloud.BasicDistributedZkTest-1359997319318/jetty3/index.20130205020216153 lockFactory=org.apache.lucene.store.NativeFSLockFactory@56c8fa27; maxCacheMB=48.0 maxMergeSizeMB=4.0)),segFN=segments_2,generation=2,filenames=[segments_2]
[junit4:junit4]   2> 16884 T2223 C219 P49805 oasc.SolrDeletionPolicy.updateCommits newest commit = 2[segments_2]
[junit4:junit4]   2> 16884 T2223 C219 P49805 oasu.DefaultSolrCoreState.newIndexWriter New IndexWriter is ready to be used.
[junit4:junit4]   2> 16884 T2223 C219 P49805 oasc.CachingDirectoryFactory.close Releasing directory:/Users/jenkins/jenkins-slave/workspace/Lucene-Solr-trunk-MacOSX/solr/build/solr-core/test/J0/./org.apache.solr.cloud.BasicDistributedZkTest-1359997319318/jetty3
[junit4:junit4]   2> 16885 T2223 C219 P49805 oass.SolrIndexSearcher.<init> Opening Searcher@25f340f2 main
[junit4:junit4]   2> 16887 T2222 oasc.SolrCore.registerSearcher [collection1] Registered new searcher Searcher@25f340f2 main{StandardDirectoryReader(segments_2:1:nrt)}
[junit4:junit4]   2> 16887 T2222 oasc.CachingDirectoryFactory.close Releasing directory:/Users/jenkins/jenkins-slave/workspace/Lucene-Solr-trunk-MacOSX/solr/build/solr-core/test/J0/./org.apache.solr.cloud.BasicDistributedZkTest-1359997319318/jetty3/index
[junit4:junit4]   2> 16888 T2223 C219 P49805 oasu.DirectUpdateHandler2.commit start commit{,optimize=false,openSearcher=false,waitSearcher=false,expungeDeletes=false,softCommit=false}
[junit4:junit4]   2> 16890 T2223 C219 P49805 oasc.SolrDeletionPolicy.onCommit SolrDeletionPolicy.onCommit: commits:num=2
[junit4:junit4]   2> 		commit{dir=RateLimitedDirectoryWrapper(NRTCachingDirectory(org.apache.lucene.store.NIOFSDirectory@/Users/jenkins/jenkins-slave/workspace/Lucene-Solr-trunk-MacOSX/solr/build/solr-core/test/J0/org.apache.solr.cloud.BasicDistributedZkTest-1359997319318/jetty3/index.20130205020216153 lockFactory=org.apache.lucene.store.NativeFSLockFactory@56c8fa27; maxCacheMB=48.0 maxMergeSizeMB=4.0)),segFN=segments_2,generation=2,filenames=[segments_2]
[junit4:junit4]   2> 		commit{dir=RateLimitedDirectoryWrapper(NRTCachingDirectory(org.apache.lucene.store.NIOFSDirectory@/Users/jenkins/jenkins-slave/workspace/Lucene-Solr-trunk-MacOSX/solr/build/solr-core/test/J0/org.apache.solr.cloud.BasicDistributedZkTest-1359997319318/jetty3/index.20130205020216153 lockFactory=org.apache.lucene.store.NativeFSLockFactory@56c8fa27; maxCacheMB=48.0 maxMergeSizeMB=4.0)),segFN=segments_3,generation=3,filenames=[segments_3]
[junit4:junit4]   2> 16890 T2223 C219 P49805 oasc.SolrDeletionPolicy.updateCommits newest commit = 3[segments_3]
[junit4:junit4]   2> 16891 T2223 C219 P49805 oasc.CachingDirectoryFactory.close Releasing directory:/Users/jenkins/jenkins-slave/workspace/Lucene-Solr-trunk-MacOSX/solr/build/solr-core/test/J0/./org.apache.solr.cloud.BasicDistributedZkTest-1359997319318/jetty3
[junit4:junit4]   2> 16892 T2223 C219 P49805 oasu.DirectUpdateHandler2.commit end_commit_flush
[junit4:junit4]   2> 16892 T2223 C219 P49805 oasc.CachingDirectoryFactory.close Releasing directory:/Users/jenkins/jenkins-slave/workspace/Lucene-Solr-trunk-MacOSX/solr/build/solr-core/test/J0/./org.apache.solr.cloud.BasicDistributedZkTest-1359997319318/jetty3/index.20130205020216153
[junit4:junit4]   2> 16892 T2223 C219 P49805 oasc.CachingDirectoryFactory.close Releasing directory:/Users/jenkins/jenkins-slave/workspace/Lucene-Solr-trunk-MacOSX/solr/build/solr-core/test/J0/./org.apache.solr.cloud.BasicDistributedZkTest-1359997319318/jetty3/index
[junit4:junit4]   2> 16892 T2223 C219 P49805 oasc.RecoveryStrategy.replay No replay needed. core=collection1
[junit4:junit4]   2> 16893 T2223 C219 P49805 oasc.RecoveryStrategy.doRecovery Replication Recovery was successful - registering as Active. core=collection1
[junit4:junit4]   2> 16893 T2223 C219 P49805 oasc.ZkController.publish publishing core=collection1 state=active
[junit4:junit4]   2> 16893 T2223 C219 P49805 oasc.ZkController.publish numShards not found on descriptor - reading it from system property
[junit4:junit4]   2> 16895 T2223 C219 P49805 oasc.RecoveryStrategy.doRecovery Finished recovery process. core=collection1
[junit4:junit4]   2> 17304 T2149 oascc.ZkStateReader.updateClusterState Updating cloud state from ZooKeeper... 
[junit4:junit4]   2> 17363 T2172 oascc.ZkStateReader.updateClusterState Updating cloud state from ZooKeeper... 
[junit4:junit4]   2> 17365 T2172 oasc.Overseer$ClusterStateUpdater.updateState Update state numShards=2 message={
[junit4:junit4]   2> 	  "operation":"state",
[junit4:junit4]   2> 	  "numShards":"2",
[junit4:junit4]   2> 	  "shard":"shard2",
[junit4:junit4]   2> 	  "roles":null,
[junit4:junit4]   2> 	  "state":"recovering",
[junit4:junit4]   2> 	  "core":"collection1",
[junit4:junit4]   2> 	  "collection":"collection1",
[junit4:junit4]   2> 	  "node_name":"127.0.0.1:49809_",
[junit4:junit4]   2> 	  "base_url":"http://127.0.0.1:49809"}
[junit4:junit4]   2> 17373 T2172 oasc.Overseer$ClusterStateUpdater.updateState Update state numShards=2 message={
[junit4:junit4]   2> 	  "operation":"state",
[junit4:junit4]   2> 	  "numShards":"2",
[junit4:junit4]   2> 	  "shard":"shard1",
[junit4:junit4]   2> 	  "roles":null,
[junit4:junit4]   2> 	  "state":"active",
[junit4:junit4]   2> 	  "core":"collection1",
[junit4:junit4]   2> 	  "collection":"collection1",
[junit4:junit4]   2> 	  "node_name":"127.0.0.1:49805_",
[junit4:junit4]   2> 	  "base_url":"http://127.0.0.1:49805"}
[junit4:junit4]   2> 17382 T2171 oascc.ZkStateReader$2.process A cluster state change: WatchedEvent state:SyncConnected type:NodeDataChanged path:/clusterstate.json, has occurred - updating... (live nodes size: 5)
[junit4:junit4]   2> 17382 T2236 oascc.ZkStateReader$2.process A cluster state change: WatchedEvent state:SyncConnected type:NodeDataChanged path:/clusterstate.json, has occurred - updating... (live nodes size: 5)
[junit4:junit4]   2> 17382 T2177 oascc.ZkStateReader$2.process A cluster state change: WatchedEvent state:SyncConnected type:NodeDataChanged path:/clusterstate.json, has occurred - updating... (live nodes size: 5)
[junit4:junit4]   2> 17383 T2220 oascc.ZkStateReader$2.process A cluster state change: WatchedEvent state:SyncConnected type:NodeDataChanged path:/clusterstate.json, has occurred - updating... (live nodes size: 5)
[junit4:junit4]   2> 17382 T2205 oascc.ZkStateReader$2.process A cluster state change: WatchedEvent state:SyncConnected type:NodeDataChanged path:/clusterstate.json, has occurred - updating... (live nodes size: 5)
[junit4:junit4]   2> 17383 T2190 oascc.ZkStateReader$2.process A cluster state change: WatchedEvent state:SyncConnected type:NodeDataChanged path:/clusterstate.json, has occurred - updating... (live nodes size: 5)
[junit4:junit4]   2> 18309 T2149 oascc.ZkStateReader.updateClusterState Updating cloud state from ZooKeeper... 
[junit4:junit4]   2> 19313 T2149 oascc.ZkStateReader.updateClusterState Updating cloud state from ZooKeeper... 
[junit4:junit4]   2>  C220_STATE=coll:collection1 core:collection1 props:{shard=shard2, roles=null, state=recovering, core=collection1, collection=collection1, node_name=127.0.0.1:49809_, base_url=http://127.0.0.1:49809}
[junit4:junit4]   2> 20300 T2239 C220 P49809 oasc.RecoveryStrategy.doRecovery Attempting to PeerSync from http://127.0.0.1:49802/collection1/ core=collection1 - recoveringAfterStartup=true
[junit4:junit4]   2> 20300 T2239 C220 P49809 oasu.PeerSync.sync PeerSync: core=collection1 url=http://127.0.0.1:49809 START replicas=[http://127.0.0.1:49802/collection1/] nUpdates=100
[junit4:junit4]   2> 20301 T2239 C220 P49809 oasu.PeerSync.sync WARNING no frame of reference to tell of we've missed updates
[junit4:junit4]   2> 20301 T2239 C220 P49809 oasc.RecoveryStrategy.doRecovery PeerSync Recovery was not successful - trying replication. core=collection1
[junit4:junit4]   2> 20301 T2239 C220 P49809 oasc.RecoveryStrategy.doRecovery Starting Replication Recovery. core=collection1
[junit4:junit4]   2> 20301 T2239 C220 P49809 oasc.RecoveryStrategy.doRecovery Begin buffering updates. core=collection1
[junit4:junit4]   2> 20302 T2239 C220 P49809 oasu.UpdateLog.bufferUpdates Starting to buffer updates. FSUpdateLog{state=ACTIVE, tlog=null}
[junit4:junit4]   2> 20302 T2239 C220 P49809 oasc.RecoveryStrategy.replicate Attempting to replicate from http://127.0.0.1:49802/collection1/. core=collection1
[junit4:junit4]   2> 20302 T2239 C220 P49809 oascsi.HttpClientUtil.createClient Creating new http client, config:maxConnections=128&maxConnectionsPerHost=32&followRedirects=false
[junit4:junit4]   2> ASYNC  NEW_CORE C222 name=collection1 org.apache.solr.core.SolrCore@774c02ad url=http://127.0.0.1:49802/collection1 node=127.0.0.1:49802_ C222_STATE=coll:collection1 core:collection1 props:{shard=shard2, roles=null, state=active, core=collection1, collection=collection1, node_name=127.0.0.1:49802_, base_url=http://127.0.0.1:49802, leader=true}
[junit4:junit4]   2> 20314 T2197 C222 P49802 REQ /get {getVersions=100&distrib=false&wt=javabin&qt=/get&version=2} status=0 QTime=0 
[junit4:junit4]   2> 20317 T2149 oascc.ZkStateReader.updateClusterState Updating cloud state from ZooKeeper... 
[junit4:junit4]   2> 20320 T2196 C222 P49802 oasu.DirectUpdateHandler2.commit start commit{,optimize=false,openSearcher=false,waitSearcher=true,expungeDeletes=false,softCommit=false}
[junit4:junit4]   2> 20321 T2196 C222 P49802 oasc.CachingDirectoryFactory.close Releasing directory:/Users/jenkins/jenkins-slave/workspace/Lucene-Solr-trunk-MacOSX/solr/build/solr-core/test/J0/./org.apache.solr.cloud.BasicDistributedZkTest-1359997319318/jetty2
[junit4:junit4]   2> 20324 T2196 C222 P49802 oasc.SolrDeletionPolicy.onInit SolrDeletionPolicy.onInit: commits:num=1
[junit4:junit4]   2> 		commit{dir=RateLimitedDirectoryWrapper(NRTCachingDirectory(org.apache.lucene.store.NIOFSDirectory@/Users/jenkins/jenkins-slave/workspace/Lucene-Solr-trunk-MacOSX/solr/build/solr-core/test/J0/org.apache.solr.cloud.BasicDistributedZkTest-1359997319318/jetty2/index lockFactory=org.apache.lucene.store.NativeFSLockFactory@26a32e6d; maxCacheMB=48.0 maxMergeSizeMB=4.0)),segFN=segments_1,generation=1,filenames=[segments_1]
[junit4:junit4]   2> 20325 T2196 C222 P49802 oasc.SolrDeletionPolicy.updateCommits newest commit = 1[segments_1]
[junit4:junit4]   2> 20328 T2196 C222 P49802 oasc.SolrDeletionPolicy.onCommit SolrDeletionPolicy.onCommit: commits:num=2
[junit4:junit4]   2> 		commit{dir=RateLimitedDirectoryWrapper(NRTCachingDirectory(org.apache.lucene.store.NIOFSDirectory@/Users/jenkins/jenkins-slave/workspace/Lucene-Solr-trunk-MacOSX/solr/build/solr-core/test/J0/org.apache.solr.cloud.BasicDistributedZkTest-1359997319318/jetty2/index lockFactory=org.apache.lucene.store.NativeFSLockFactory@26a32e6d; maxCacheMB=48.0 maxMergeSizeMB=4.0)),segFN=segments_1,generation=1,filenames=[segments_1]
[junit4:junit4]   2> 		commit{dir=RateLimitedDirectoryWrapper(NRTCachingDirectory(org.apache.lucene.store.NIOFSDirectory@/Users/jenkins/jenkins-slave/workspace/Lucene-Solr-trunk-MacOSX/solr/build/solr-core/test/J0/org.apache.solr.cloud.BasicDistributedZkTest-1359997319318/jetty2/index lockFactory=org.apache.lucene.store.NativeFSLockFactory@26a32e6d; maxCacheMB=48.0 maxMergeSizeMB=4.0)),segFN=segments_2,generation=2,filenames=[segments_2]
[junit4:junit4]   2> 20329 T2196 C222 P49802 oasc.SolrDeletionPolicy.updateCommits newest commit = 2[segments_2]
[junit4:junit4]   2> 20330 T2196 C222 P49802 oasc.CachingDirectoryFactory.close Releasing directory:/Users/jenkins/jenkins-slave/workspace/Lucene-Solr-trunk-MacOSX/solr/build/solr-core/test/J0/./org.apache.solr.cloud.BasicDistributedZkTest-1359997319318/jetty2
[junit4:junit4]   2> 20331 T2196 C222 P49802 oass.SolrIndexSearcher.<init> Opening Searcher@61191ab1 realtime
[junit4:junit4]   2> 20331 T2196 C222 P49802 oasu.DirectUpdateHandler2.commit end_commit_flush
[junit4:junit4]   2> 20331 T2196 C222 P49802 /update {waitSearcher=true&openSearcher=false&commit=true&wt=javabin&commit_end_point=true&version=2&softCommit=false} {commit=} 0 11
[junit4:junit4]   2> 20333 T2239 C220 P49809 oash.ReplicationHandler.inform Commits will be reserved for  10000
[junit4:junit4]   2> 20334 T2239 C220 P49809 oash.SnapPuller.<init>  No value set for 'pollInterval'. Timer Task not started.
[junit4:junit4]   2> 20337 T2200 C222 P49802 oash.ReplicationHandler.inform Commits will be reserved for  10000
[junit4:junit4]   2> 20337 T2200 C222 P49802 REQ /replication {command=indexversion&qt=/replication&wt=javabin&version=2} status=0 QTime=1 
[junit4:junit4]   2> 20338 T2239 C220 P49809 oash.SnapPuller.fetchLatestIndex Master's generation: 2
[junit4:junit4]   2> 20338 T2239 C220 P49809 oash.SnapPuller.fetchLatestIndex Slave's generation: 1
[junit4:junit4]   2> 20338 T2239 C220 P49809 oash.SnapPuller.fetchLatestIndex Starting replication process
[junit4:junit4]   2> 20343 T2201 C222 P49802 oasc.CachingDirectoryFactory.close Releasing directory:/Users/jenkins/jenkins-slave/workspace/Lucene-Solr-trunk-MacOSX/solr/build/solr-core/test/J0/./org.apache.solr.cloud.BasicDistributedZkTest-1359997319318/jetty2
[junit4:junit4]   2> 20344 T2201 C222 P49802 oasc.CachingDirectoryFactory.close Releasing directory:/Users/jenkins/jenkins-slave/workspace/Lucene-Solr-trunk-MacOSX/solr/build/solr-core/test/J0/./org.apache.solr.cloud.BasicDistributedZkTest-1359997319318/jetty2/index
[junit4:junit4]   2> 20345 T2201 C222 P49802 REQ /replication {command=filelist&qt=/replication&wt=javabin&generation=2&version=2} status=0 QTime=2 
[junit4:junit4]   2> 20346 T2239 C220 P49809 oash.SnapPuller.fetchLatestIndex Number of files in latest index in master: 1
[junit4:junit4]   2> 20347 T2239 C220 P49809 oasc.CachingDirectoryFactory.get return new directory for /Users/jenkins/jenkins-slave/workspace/Lucene-Solr-trunk-MacOSX/solr/build/solr-core/test/J0/./org.apache.solr.cloud.BasicDistributedZkTest-1359997319318/jetty4/index.20130205020219654 forceNew:false
[junit4:junit4]   2> 20347 T2239 C220 P49809 oasc.CachingDirectoryFactory.close Releasing directory:/Users/jenkins/jenkins-slave/workspace/Lucene-Solr-trunk-MacOSX/solr/build/solr-core/test/J0/./org.apache.solr.cloud.BasicDistributedZkTest-1359997319318/jetty4
[junit4:junit4]   2> 20348 T2239 C220 P49809 oash.SnapPuller.fetchLatestIndex Starting download to RateLimitedDirectoryWrapper(NRTCachingDirectory(org.apache.lucene.store.NIOFSDirectory@/Users/jenkins/jenkins-slave/workspace/Lucene-Solr-trunk-MacOSX/solr/build/solr-core/test/J0/org.apache.solr.cloud.BasicDistributedZkTest-1359997319318/jetty4/index.20130205020219654 lockFactory=org.apache.lucene.store.NativeFSLockFactory@1370d2c5; maxCacheMB=48.0 maxMergeSizeMB=4.0)) fullCopy=true
[junit4:junit4]   2> 20355 T2197 C222 P49802 REQ /replication {file=segments_2&command=filecontent&checksum=true&wt=filestream&qt=/replication&generation=2} status=0 QTime=0 
[junit4:junit4]   2> 20358 T2239 C220 P49809 oasc.CachingDirectoryFactory.close Releasing directory:/Users/jenkins/jenkins-slave/workspace/Lucene-Solr-trunk-MacOSX/solr/build/solr-core/test/J0/./org.apache.solr.cloud.BasicDistributedZkTest-1359997319318/jetty4/index
[junit4:junit4]   2> 20359 T2239 C220 P49809 oash.SnapPuller.fetchLatestIndex Total time taken for download : 0 secs
[junit4:junit4]   2> 20359 T2239 C220 P49809 oash.SnapPuller.modifyIndexProps New index installed. Updating index properties... index=index.20130205020219654
[junit4:junit4]   2> 20361 T2239 C220 P49809 oasc.CachingDirectoryFactory.close Releasing directory:/Users/jenkins/jenkins-slave/workspace/Lucene-Solr-trunk-MacOSX/solr/build/solr-core/test/J0/./org.apache.solr.cloud.BasicDistributedZkTest-1359997319318/jetty4
[junit4:junit4]   2> 20361 T2239 C220 P49809 oasc.CachingDirectoryFactory.close Releasing directory:/Users/jenkins/jenkins-slave/workspace/Lucene-Solr-trunk-MacOSX/solr/build/solr-core/test/J0/./org.apache.solr.cloud.BasicDistributedZkTest-1359997319318/jetty4
[junit4:junit4]   2> 20362 T2239 C220 P49809 oasc.SolrCore.getNewIndexDir New index directory detected: old=./org.apache.solr.cloud.BasicDistributedZkTest-1359997319318/jetty4/index/ new=./org.apache.solr.cloud.BasicDistributedZkTest-1359997319318/jetty4/index.20130205020219654
[junit4:junit4]   2> 20365 T2239 C220 P49809 oasc.SolrDeletionPolicy.onInit SolrDeletionPolicy.onInit: commits:num=1
[junit4:junit4]   2> 		commit{dir=RateLimitedDirectoryWrapper(NRTCachingDirectory(org.apache.lucene.store.NIOFSDirectory@/Users/jenkins/jenkins-slave/workspace/Lucene-Solr-trunk-MacOSX/solr/build/solr-core/test/J0/org.apache.solr.cloud.BasicDistributedZkTest-1359997319318/jetty4/index.20130205020219654 lockFactory=org.apache.lucene.store.NativeFSLockFactory@1370d2c5; maxCacheMB=48.0 maxMergeSizeMB=4.0)),segFN=segments_2,generation=2,filenames=[segments_2]
[junit4:junit4]   2> 20366 T2239 C220 P49809 oasc.SolrDeletionPolicy.updateCommits newest commit = 2[segments_2]
[junit4:junit4]   2> 20367 T2239 C220 P49809 oasc.CachingDirectoryFactory.close Releasing directory:/Users/jenkins/jenkins-slave/workspace/Lucene-Solr-trunk-MacOSX/solr/build/solr-core/test/J0/./org.apache.solr.cloud.BasicDistributedZkTest-1359997319318/jetty4
[junit4:junit4]   2> 20368 T2239 C220 P49809 oasu.DefaultSolrCoreState.newIndexWriter Creating new IndexWriter...
[junit4:junit4]   2> 20368 T2239 C220 P49809 oasu.DefaultSolrCoreState.newIndexWriter Waiting until IndexWriter is unused... core=collection1
[junit4:junit4]   2> 20368 T2239 C220 P49809 oasu.DefaultSolrCoreState.newIndexWriter Rollback old IndexWriter... core=collection1
[junit4:junit4]   2> 20369 T2239 C220 P49809 oasc.CachingDirectoryFactory.close Releasing directory:/Users/jenkins/jenkins-slave/workspace/Lucene-Solr-trunk-MacOSX/solr/build/solr-core/test/J0/./org.apache.solr.cloud.BasicDistributedZkTest-1359997319318/jetty4/index.20130205020219654
[junit4:junit4]   2> 20370 T2239 C220 P49809 oasc.CachingDirectoryFactory.close Releasing directory:/Users/jenkins/jenkins-slave/workspace/Lucene-Solr-trunk-MacOSX/solr/build/solr-core/test/J0/./org.apache.solr.cloud.BasicDistributedZkTest-1359997319318/jetty4
[junit4:junit4]   2> 20373 T2239 C220 P49809 oasc.SolrDeletionPolicy.onInit SolrDeletionPolicy.onInit: commits:num=1
[junit4:junit4]   2> 		commit{dir=RateLimitedDirectoryWrapper(NRTCachingDirectory(org.apache.lucene.store.NIOFSDirectory@/Users/jenkins/jenkins-slave/workspace/Lucene-Solr-trunk-MacOSX/solr/build/solr-core/test/J0/org.apache.solr.cloud.BasicDistributedZkTest-1359997319318/jetty4/index.20130205020219654 lockFactory=org.apache.lucene.store.NativeFSLockFactory@1370d2c5; maxCacheMB=48.0 maxMergeSizeMB=4.0)),segFN=segments_2,generation=2,filenames=[segments_2]
[junit4:junit4]   2> 20373 T2239 C220 P49809 oasc.SolrDeletionPolicy.updateCommits newest commit = 2[segments_2]
[junit4:junit4]   2> 20374 T2239 C220 P49809 oasu.DefaultSolrCoreState.newIndexWriter New IndexWriter is ready to be used.
[junit4:junit4]   2> 20374 T2239 C220 P49809 oasc.CachingDirectoryFactory.close Releasing directory:/Users/jenkins/jenkins-slave/workspace/Lucene-Solr-trunk-MacOSX/solr/build/solr-core/test/J0/./org.apache.solr.cloud.BasicDistributedZkTest-1359997319318/jetty4
[junit4:junit4]   2> 20375 T2239 C220 P49809 oass.SolrIndexSearcher.<init> Opening Searcher@3c065812 main
[junit4:junit4]   2> 20377 T2238 oasc.SolrCore.registerSearcher [collection1] Registered new searcher Searcher@3c065812 main{StandardDirectoryReader(segments_2:1:nrt)}
[junit4:junit4]   2> 20377 T2238 oasc.CachingDirectoryFactory.close Releasing directory:/Users/jenkins/jenkins-slave/workspace/Lucene-Solr-trunk-MacOSX/solr/build/solr-core/test/J0/./org.apache.solr.cloud.BasicDistributedZkTest-1359997319318/jetty4/index
[junit4:junit4]   2> 20378 T2239 C220 P49809 oasu.DirectUpdateHandler2.commit start commit{,optimize=false,openSearcher=false,waitSearcher=false,expungeDeletes=false,softCommit=false}
[junit4:junit4]   2> 20380 T2239 C220 P49809 oasc.SolrDeletionPolicy.onCommit SolrDeletionPolicy.onCommit: commits:num=2
[junit4:junit4]   2> 		commit{dir=RateLimitedDirectoryWrapper(NRTCachingDirectory(org.apache.lucene.store.NIOFSDirectory@/Users/jenkins/jenkins-slave/workspace/Lucene-Solr-trunk-MacOSX/solr/build/solr-core/test/J0/org.apache.solr.cloud.BasicDistributedZkTest-1359997319318/jetty4/index.20130205020219654 lockFactory=org.apache.lucene.store.NativeFSLockFactory@1370d2c5; maxCacheMB=48.0 maxMergeSizeMB=4.0)),segFN=segments_2,generation=2,filenames=[segments_2]
[junit4:junit4]   2> 		commit{dir=RateLimitedDirectoryWrapper(NRTCachingDirectory(org.apache.lucene.store.NIOFSDirectory@/Users/jenkins/jenkins-slave/workspace/Lucene-Solr-trunk-MacOSX/solr/build/solr-core/test/J0/org.apache.solr.cloud.BasicDistributedZkTest-1359997319318/jetty4/index.20130205020219654 lockFactory=org.apache.lucene.store.NativeFSLockFactory@1370d2c5; maxCacheMB=48.0 maxMergeSizeMB=4.0)),segFN=segments_3,generation=3,filenames=[segments_3]
[junit4:junit4]   2> 20381 T2239 C220 P49809 oasc.SolrDeletionPolicy.updateCommits newest commit = 3[segments_3]
[junit4:junit4]   2> 20382 T2239 C220 P49809 oasc.CachingDirectoryFactory.close Releasing directory:/Users/jenkins/jenkins-slave/workspace/Lucene-Solr-trunk-MacOSX/solr/build/solr-core/test/J0/./org.apache.solr.cloud.BasicDistributedZkTest-1359997319318/jetty4
[junit4:junit4]   2> 20382 T2239 C220 P49809 oasu.DirectUpdateHandler2.commit end_commit_flush
[junit4:junit4]   2> 20382 T2239 C220 P49809 oasc.CachingDirectoryFactory.close Releasing directory:/Users/jenkins/jenkins-slave/workspace/Lucene-Solr-trunk-MacOSX/solr/build/solr-core/test/J0/./org.apache.solr.cloud.BasicDistributedZkTest-1359997319318/jetty4/index.20130205020219654
[junit4:junit4]   2> 20383 T2239 C220 P49809 oasc.CachingDirectoryFactory.close Releasing directory:/Users/jenkins/jenkins-slave/workspace/Lucene-Solr-trunk-MacOSX/solr/build/solr-core/test/J0/./org.apache.solr.cloud.BasicDistributedZkTest-1359997319318/jetty4/index
[junit4:junit4]   2> 20383 T2239 C220 P49809 oasc.RecoveryStrategy.replay No replay needed. core=collection1
[junit4:junit4]   2> 20384 T2239 C220 P49809 oasc.RecoveryStrategy.doRecovery Replication Recovery was successful - registering as Active. core=collection1
[junit4:junit4]   2> 20384 T2239 C220 P49809 oasc.ZkController.publish publishing core=collection1 state=active
[junit4:junit4]   2> 20384 T2239 C220 P49809 oasc.ZkController.publish numShards not found on descriptor - reading it from system property
[junit4:junit4]   2> 20386 T2239 C220 P49809 oasc.RecoveryStrategy.doRecovery Finished recovery process. core=collection1
[junit4:junit4]   2> 20403 T2172 oascc.ZkStateReader.updateClusterState Updating cloud state from ZooKeeper... 
[junit4:junit4]   2> 20405 T2172 oasc.Overseer$ClusterStateUpdater.updateState Update state numShards=2 message={
[junit4:junit4]   2> 	  "operation":"state",
[junit4:junit4]   2> 	  "numShards":"2",
[junit4:junit4]   2> 	  "shard":"shard2",
[junit4:junit4]   2> 	  "roles":null,
[junit4:junit4]   2> 	  "state":"active",
[junit4:junit4]   2> 	  "core":"collection1",
[junit4:junit4]   2> 	  "collection":"collection1",
[junit4:junit4]   2> 	  "node_name":"127.0.0.1:49809_",
[junit4:junit4]   2> 	  "base_url":"http://127.0.0.1:49809"}
[junit4:junit4]   2> 20413 T2171 oascc.ZkStateReader$2.process A cluster state change: WatchedEvent state:SyncConnected type:NodeDataChanged path:/clusterstate.json, has occurred - updating... (live nodes size: 5)
[junit4:junit4]   2> 20413 T2177 oascc.ZkStateReader$2.process A cluster state change: WatchedEvent state:SyncConnected type:NodeDataChanged path:/clusterstate.json, has occurred - updating... (live nodes size: 5)
[junit4:junit4]   2> 20414 T2205 oascc.ZkStateReader$2.process A cluster state change: WatchedEvent state:SyncConnected type:NodeDataChanged path:/clusterstate.json, has occurred - updating... (live nodes size: 5)
[junit4:junit4]   2> 20414 T2190 oascc.ZkStateReader$2.process A cluster state change: WatchedEvent state:SyncConnected type:NodeDataChanged path:/clusterstate.json, has occurred - updating... (live nodes size: 5)
[junit4:junit4]   2> 20415 T2220 oascc.ZkStateReader$2.process A cluster state change: WatchedEvent state:SyncConnected type:NodeDataChanged path:/clusterstate.json, has occurred - updating... (live nodes size: 5)
[junit4:junit4]   2> 20414 T2236 oascc.ZkStateReader$2.process A cluster state change: WatchedEvent state:SyncConnected type:NodeDataChanged path:/clusterstate.json, has occurred - updating... (live nodes size: 5)
[junit4:junit4]   2> 21320 T2149 oascc.ZkStateReader.updateClusterState Updating cloud state from ZooKeeper... 
[junit4:junit4]   2> 21322 T2149 oasc.AbstractDistribZkTestBase.waitForRecoveriesToFinish Recoveries finished - collection: collection1
[junit4:junit4]   2> ASYNC  NEW_CORE C223 name=collection1 org.apache.solr.core.SolrCore@5631d918 url=http://127.0.0.1:49795/collection1 node=127.0.0.1:49795_ C223_STATE=coll:control_collection core:collection1 props:{shard=shard1, roles=null, state=active, core=collection1, collection=control_collection, node_name=127.0.0.1:49795_, base_url=http://127.0.0.1:49795, leader=true}
[junit4:junit4]   2> 21333 T2165 C223 P49795 oasc.CachingDirectoryFactory.close Releasing directory:/Users/jenkins/jenkins-slave/workspace/Lucene-Solr-trunk-MacOSX/solr/build/solr-core/test/J0/./org.apache.solr.cloud.BasicDistributedZkTest-1359997319318/control/data
[junit4:junit4]   2> 21336 T2165 C223 P49795 oasc.SolrDeletionPolicy.onInit SolrDeletionPolicy.onInit: commits:num=1
[junit4:junit4]   2> 		commit{dir=RateLimitedDirectoryWrapper(NRTCachingDirectory(org.apache.lucene.store.NIOFSDirectory@/Users/jenkins/jenkins-slave/workspace/Lucene-Solr-trunk-MacOSX/solr/build/solr-core/test/J0/org.apache.solr.cloud.BasicDistributedZkTest-1359997319318/control/data/index lockFactory=org.apache.lucene.store.NativeFSLockFactory@4312f795; maxCacheMB=48.0 maxMergeSizeMB=4.0)),segFN=segments_1,generation=1,filenames=[segments_1]
[junit4:junit4]   2> 21338 T2165 C223 P49795 oasc.SolrDeletionPolicy.updateCommits newest commit = 1[segments_1]
[junit4:junit4]   2> 21340 T2165 C223 P49795 oasc.CachingDirectoryFactory.close Releasing directory:/Users/jenkins/jenkins-slave/workspace/Lucene-Solr-trunk-MacOSX/solr/build/solr-core/test/J0/./org.apache.solr.cloud.BasicDistributedZkTest-1359997319318/control/data
[junit4:junit4]   2> 21340 T2165 C223 P49795 oass.SolrIndexSearcher.<init> Opening Searcher@443daf11 realtime
[junit4:junit4]   2> 21341 T2165 C223 P49795 /update {wt=javabin&version=2} {deleteByQuery=*:* (-1426060571458928640)} 0 9
[junit4:junit4]   2> 21346 T2199 C222 P49802 oasc.CachingDirectoryFactory.close Releasing directory:/Users/jenkins/jenkins-slave/workspace/Lucene-Solr-trunk-MacOSX/solr/build/solr-core/test/J0/./org.apache.solr.cloud.BasicDistributedZkTest-1359997319318/jetty2
[junit4:junit4]   2> 21353 T2181 C221 P49799 oasc.CachingDirectoryFactory.close Releasing directory:/Users/jenkins/jenkins-slave/workspace/Lucene-Solr-trunk-MacOSX/solr/build/solr-core/test/J0/./org.apache.solr.cloud.BasicDistributedZkTest-1359997319318/jetty1
[junit4:junit4]   2>  C220_STATE=coll:collection1 core:collection1 props:{shard=shard2, roles=null, state=active, core=collection1, collection=collection1, node_name=127.0.0.1:49809_, base_url=http://127.0.0.1:49809}
[junit4:junit4]   2> 21360 T2227 C220 P49809 oasc.CachingDirectoryFactory.close Releasing directory:/Users/jenkins/jenkins-slave/workspace/Lucene-Solr-trunk-MacOSX/solr/build/solr-core/test/J0/./org.apache.solr.cloud.BasicDistributedZkTest-1359997319318/jetty4
[junit4:junit4]   2> 21361 T2227 C220 P49809 /update {update.distrib=FROMLEADER&_version_=-1426060571471511552&update.from=http://127.0.0.1:49802/collection1/&wt=javabin&version=2} {deleteByQuery=*:* (-1426060571471511552)} 0 3
[junit4:junit4]   2>  C219_STATE=coll:collection1 core:collection1 props:{shard=shard1, roles=null, state=active, core=collection1, collection=collection1, node_name=127.0.0.1:49805_, base_url=http://127.0.0.1:49805}
[junit4:junit4]   2> 21365 T2211 C219 P49805 oasc.CachingDirectoryFactory.close Releasing directory:/Users/jenkins/jenkins-slave/workspace/Lucene-Solr-trunk-MacOSX/solr/build/solr-core/test/J0/./org.apache.solr.cloud.BasicDistributedZkTest-1359997319318/jetty3
[junit4:junit4]   2> 21366 T2211 C219 P49805 /update {update.distrib=FROMLEADER&_version_=-1426060571478851584&update.from=http://127.0.0.1:49799/collection1/&wt=javabin&version=2} {deleteByQuery=*:* (-1426060571478851584)} 0 3
[junit4:junit4]   2> 21368 T2181 C221 P49799 /update {update.distrib=TOLEADER&wt=javabin&version=2} {deleteByQuery=*:* (-1426060571478851584)} 0 17
[junit4:junit4]   2> 21368 T2199 C222 P49802 /update {wt=javabin&version=2} {deleteByQuery=*:* (-1426060571471511552)} 0 24
[junit4:junit4]   2> 21376 T2166 C223 P49795 /update {wt=javabin&version=2} {add=[1 (1426060571500871680)]} 0 4
[junit4:junit4]   2> 21403 T2212 C219 P49805 /update {distrib.from=http://127.0.0.1:49799/collection1/&update.distrib=FROMLEADER&wt=javabin&version=2} {add=[1 (1426060571508211712)]} 0 3
[junit4:junit4]   2> 21404 T2185 C221 P49799 /update {wt=javabin&version=2} {add=[1 (1426060571508211712)]} 0 25
[junit4:junit4]   2> 21409 T2167 C223 P49795 /update {wt=javabin&version=2} {add=[2 (1426060571538620416)]} 0 2
[junit4:junit4]   2> 21423 T2228 C220 P49809 /update {distrib.from=http://127.0.0.1:49802/collection1/&update.distrib=FROMLEADER&wt=javabin&version=2} {add=[2 (1426060571545960448)]} 0 3
[junit4:junit4]   2> 21424 T2200 C222 P49802 /update {distrib.from=http://127.0.0.1:49799/collection1/&update.distrib=TOLEADER&wt=javabin&version=2} {add=[2 (1426060571545960448)]} 0 10
[junit4:junit4]   2> 21425 T2184 C221 P49799 /update {wt=javabin&version=2} {add=[2]} 0 13
[junit4:junit4]   2> 21430 T2162 C223 P49795 /update {wt=javabin&version=2} {add=[3 (1426060571560640512)]} 0 2
[junit4:junit4]   2> 21440 T2229 C220 P49809 /update {distrib.from=http://127.0.0.1:49802/collection1/&update.distrib=FROMLEADER&wt=javabin&version=2} {add=[3 (1426060571566931968)]} 0 2
[junit4:junit4]   2> 21441 T2201 C222 P49802 /update {wt=javabin&version=2} {add=[3 (1426060571566931968)]} 0 6
[junit4:junit4]   2> 21445 T2163 C223 P49795 /update {wt=javabin&version=2} {add=[4 (1426060571576369152)]} 0 1
[junit4:junit4]   2> 21455 T2213 C219 P49805 /update {distrib.from=http://127.0.0.1:49799/collection1/&update.distrib=FROMLEADER&wt=javabin&version=2} {add=[4 (1426060571582660608)]} 0 1
[junit4:junit4]   2> 21456 T2186 C221 P49799 /update {distrib.from=http://127.0.0.1:49802/collection1/&update.distrib=TOLEADER&wt=javabin&version=2} {add=[4 (1426060571582660608)]} 0 6
[junit4:junit4]   2> 21457 T219

[...truncated too long message...]

zedRunner$8.evaluate(RandomizedRunner.java:787)
[junit4:junit4]    > 	at com.carrotsearch.randomizedtesting.rules.SystemPropertiesRestoreRule$1.evaluate(SystemPropertiesRestoreRule.java:53)
[junit4:junit4]    > 	at org.apache.lucene.util.TestRuleSetupTeardownChained$1.evaluate(TestRuleSetupTeardownChained.java:50)
[junit4:junit4]    > 	at org.apache.lucene.util.TestRuleFieldCacheSanity$1.evaluate(TestRuleFieldCacheSanity.java:51)
[junit4:junit4]    > 	at org.apache.lucene.util.AbstractBeforeAfterRule$1.evaluate(AbstractBeforeAfterRule.java:46)
[junit4:junit4]    > 	at com.carrotsearch.randomizedtesting.rules.SystemPropertiesInvariantRule$1.evaluate(SystemPropertiesInvariantRule.java:55)
[junit4:junit4]    > 	at org.apache.lucene.util.TestRuleThreadAndTestName$1.evaluate(TestRuleThreadAndTestName.java:49)
[junit4:junit4]    > 	at org.apache.lucene.util.TestRuleIgnoreAfterMaxFailures$1.evaluate(TestRuleIgnoreAfterMaxFailures.java:70)
[junit4:junit4]    > 	at org.apache.lucene.util.TestRuleMarkFailure$1.evaluate(TestRuleMarkFailure.java:48)
[junit4:junit4]    > 	at com.carrotsearch.randomizedtesting.rules.StatementAdapter.evaluate(StatementAdapter.java:36)
[junit4:junit4]    > 	at com.carrotsearch.randomizedtesting.ThreadLeakControl$StatementRunner.run(ThreadLeakControl.java:358)
[junit4:junit4]    > 	at com.carrotsearch.randomizedtesting.ThreadLeakControl.forkTimeoutingTask(ThreadLeakControl.java:782)
[junit4:junit4]    > 	at com.carrotsearch.randomizedtesting.ThreadLeakControl$3.evaluate(ThreadLeakControl.java:442)
[junit4:junit4]    > 	at com.carrotsearch.randomizedtesting.RandomizedRunner.runSingleTest(RandomizedRunner.java:746)
[junit4:junit4]    > 	at com.carrotsearch.randomizedtesting.RandomizedRunner$3.evaluate(RandomizedRunner.java:648)
[junit4:junit4]    > 	at com.carrotsearch.randomizedtesting.RandomizedRunner$4.evaluate(RandomizedRunner.java:682)
[junit4:junit4]    > 	at com.carrotsearch.randomizedtesting.RandomizedRunner$5.evaluate(RandomizedRunner.java:693)
[junit4:junit4]    > 	at com.carrotsearch.randomizedtesting.rules.StatementAdapter.evaluate(StatementAdapter.java:36)
[junit4:junit4]    > 	at com.carrotsearch.randomizedtesting.rules.SystemPropertiesRestoreRule$1.evaluate(SystemPropertiesRestoreRule.java:53)
[junit4:junit4]    > 	at org.apache.lucene.util.AbstractBeforeAfterRule$1.evaluate(AbstractBeforeAfterRule.java:46)
[junit4:junit4]    > 	at org.apache.lucene.util.TestRuleStoreClassName$1.evaluate(TestRuleStoreClassName.java:42)
[junit4:junit4]    > 	at com.carrotsearch.randomizedtesting.rules.SystemPropertiesInvariantRule$1.evaluate(SystemPropertiesInvariantRule.java:55)
[junit4:junit4]    > 	at com.carrotsearch.randomizedtesting.rules.NoShadowingOrOverridesOnMethodsRule$1.evaluate(NoShadowingOrOverridesOnMethodsRule.java:39)
[junit4:junit4]    > 	at com.carrotsearch.randomizedtesting.rules.NoShadowingOrOverridesOnMethodsRule$1.evaluate(NoShadowingOrOverridesOnMethodsRule.java:39)
[junit4:junit4]    > 	at com.carrotsearch.randomizedtesting.rules.StatementAdapter.evaluate(StatementAdapter.java:36)
[junit4:junit4]    > 	at org.apache.lucene.util.TestRuleAssertionsRequired$1.evaluate(TestRuleAssertionsRequired.java:43)
[junit4:junit4]    > 	at org.apache.lucene.util.TestRuleMarkFailure$1.evaluate(TestRuleMarkFailure.java:48)
[junit4:junit4]    > 	at org.apache.lucene.util.TestRuleIgnoreAfterMaxFailures$1.evaluate(TestRuleIgnoreAfterMaxFailures.java:70)
[junit4:junit4]    > 	at org.apache.lucene.util.TestRuleIgnoreTestSuites$1.evaluate(TestRuleIgnoreTestSuites.java:55)
[junit4:junit4]    > 	at com.carrotsearch.randomizedtesting.rules.StatementAdapter.evaluate(StatementAdapter.java:36)
[junit4:junit4]    > 	at com.carrotsearch.randomizedtesting.ThreadLeakControl$StatementRunner.run(ThreadLeakControl.java:358)
[junit4:junit4]    > 	at java.lang.Thread.run(Thread.java:722)
[junit4:junit4]   2> 382099 T2149 oas.SolrTestCaseJ4.deleteCore ###deleteCore
[junit4:junit4]   2> NOTE: test params are: codec=Lucene42: {n_f1=PostingsFormat(name=Direct), foo_b=Lucene41(blocksize=128), cat=Pulsing41(freqCutoff=12 minBlockSize=24 maxBlockSize=89), foo_d=MockFixedIntBlock(blockSize=806), foo_f=Lucene41(blocksize=128), n_tl1=PostingsFormat(name=Direct), n_d1=Pulsing41(freqCutoff=12 minBlockSize=24 maxBlockSize=89), rnd_b=MockFixedIntBlock(blockSize=806), intDefault=PostingsFormat(name=Direct), n_td1=PostingsFormat(name=Direct), timestamp=Pulsing41(freqCutoff=12 minBlockSize=24 maxBlockSize=89), id=MockFixedIntBlock(blockSize=806), range_facet_sl=MockFixedIntBlock(blockSize=806), range_facet_si=Pulsing41(freqCutoff=12 minBlockSize=24 maxBlockSize=89), oddField_s=MockFixedIntBlock(blockSize=806), sequence_i=MockFixedIntBlock(blockSize=806), name=MockFixedIntBlock(blockSize=806), foo_i=PostingsFormat(name=Direct), regex_dup_B_s=Pulsing41(freqCutoff=12 minBlockSize=24 maxBlockSize=89), multiDefault=Pulsing41(freqCutoff=12 minBlockSize=24 maxBlockSize=89), n_tf1=Pulsing41(freqCutoff=12 minBlockSize=24 maxBlockSize=89), n_dt1=PostingsFormat(name=Direct), genre_s=MockFixedIntBlock(blockSize=806), author_t=PostingsFormat(name=Direct), n_ti1=MockFixedIntBlock(blockSize=806), range_facet_l=Pulsing41(freqCutoff=12 minBlockSize=24 maxBlockSize=89), text=Lucene41(blocksize=128), _version_=PostingsFormat(name=Direct), val_i=MockFixedIntBlock(blockSize=806), SubjectTerms_mfacet=PostingsFormat(name=Direct), series_t=PostingsFormat(name=Direct), a_t=Pulsing41(freqCutoff=12 minBlockSize=24 maxBlockSize=89), n_tdt1=PostingsFormat(name=Direct), regex_dup_A_s=Lucene41(blocksize=128), price=Lucene41(blocksize=128), other_tl1=PostingsFormat(name=Direct), n_l1=Pulsing41(freqCutoff=12 minBlockSize=24 maxBlockSize=89), a_si=PostingsFormat(name=Direct), inStock=Lucene41(blocksize=128)}, sim=RandomSimilarityProvider(queryNorm=true,coord=yes): {}, locale=el, timezone=Asia/Seoul
[junit4:junit4]   2> NOTE: Mac OS X 10.8.2 x86_64/Oracle Corporation 1.7.0_10 (64-bit)/cpus=2,threads=1,free=57980176,total=241139712
[junit4:junit4]   2> NOTE: All tests run in this JVM: [LegacyHTMLStripCharFilterTest, SearchHandlerTest, ExternalFileFieldSortTest, CollectionsAPIDistributedZkTest, AutoCommitTest, TestOmitPositions, TermVectorComponentTest, TestExtendedDismaxParser, TestCollationField, TestComponentsName, SimplePostToolTest, TestSolrCoreProperties, NotRequiredUniqueKeyTest, TestQuerySenderListener, HardAutoCommitTest, TestStressReorder, TestLMDirichletSimilarityFactory, FieldMutatingUpdateProcessorTest, TestIBSimilarityFactory, TestFuzzyAnalyzedSuggestions, UpdateParamsTest, HighlighterConfigTest, TestFaceting, TestJoin, SolrRequestParserTest, DistributedQueryElevationComponentTest, TestFastLRUCache, RequestHandlersTest, PrimitiveFieldTypeTest, TestConfig, DateMathParserTest, SystemInfoHandlerTest, ReturnFieldsTest, HighlighterTest, DefaultValueUpdateProcessorTest, BadIndexSchemaTest, SpellingQueryConverterTest, PathHierarchyTokenizerFactoryTest, TestLRUCache, SuggesterWFSTTest, TestRangeQuery, TestPerFieldSimilarity, TestStressLucene, TestValueSourceCache, TestBadConfig, CoreContainerCoreInitFailuresTest, SyncSliceTest, TestFoldingMultitermQuery, TestDocumentBuilder, OpenExchangeRatesOrgProviderTest, TestCSVResponseWriter, CSVRequestHandlerTest, ResponseLogComponentTest, SuggesterFSTTest, FastVectorHighlighterTest, MBeansHandlerTest, RecoveryZkTest, DirectSolrSpellCheckerTest, SignatureUpdateProcessorFactoryTest, ConvertedLegacyTest, SolrCoreCheckLockOnStartupTest, CacheHeaderTest, SampleTest, TestBinaryField, SpellPossibilityIteratorTest, StatelessScriptUpdateProcessorFactoryTest, ZkControllerTest, FieldAnalysisRequestHandlerTest, TestLMJelinekMercerSimilarityFactory, TestCSVLoader, TestSolrXMLSerializer, DebugComponentTest, BinaryUpdateRequestHandlerTest, SortByFunctionTest, TestRecovery, TestWordDelimiterFilterFactory, PingRequestHandlerTest, SchemaVersionSpecificBehaviorTest, TestPhraseSuggestions, ScriptEngineTest, SoftAutoCommitTest, TestSolrQueryParser, QueryParsingTest, BasicZkTest, SolrIndexConfigTest, TestSort, TestFastOutputStream, QueryEqualityTest, TestFastWriter, RegexBoostProcessorTest, TestBM25SimilarityFactory, LeaderElectionIntegrationTest, AnalysisAfterCoreReloadTest, PeerSyncTest, StandardRequestHandlerTest, MinimalSchemaTest, SimpleFacetsTest, LoggingHandlerTest, CircularListTest, TestSolrJ, EchoParamsTest, ZkCLITest, TestReplicationHandler, TestBinaryResponseWriter, DirectSolrConnectionTest, TestIndexSearcher, DistanceFunctionTest, TestDistributedGrouping, TestRealTimeGet, OutputWriterTest, TestLFUCache, DocumentBuilderTest, CopyFieldTest, TestAtomicUpdateErrorCases, TestAnalyzedSuggestions, TestSolrDeletionPolicy1, TestNumberUtils, DirectUpdateHandlerTest, SuggesterTest, BasicDistributedZkTest]
[junit4:junit4] Completed in 382.60s, 1 test, 1 failure <<< FAILURES!

[...truncated 386 lines...]
BUILD FAILED
/Users/jenkins/jenkins-slave/workspace/Lucene-Solr-trunk-MacOSX/build.xml:346: The following error occurred while executing this line:
/Users/jenkins/jenkins-slave/workspace/Lucene-Solr-trunk-MacOSX/build.xml:39: The following error occurred while executing this line:
/Users/jenkins/jenkins-slave/workspace/Lucene-Solr-trunk-MacOSX/solr/build.xml:178: The following error occurred while executing this line:
/Users/jenkins/jenkins-slave/workspace/Lucene-Solr-trunk-MacOSX/solr/common-build.xml:428: The following error occurred while executing this line:
/Users/jenkins/jenkins-slave/workspace/Lucene-Solr-trunk-MacOSX/lucene/common-build.xml:1176: The following error occurred while executing this line:
/Users/jenkins/jenkins-slave/workspace/Lucene-Solr-trunk-MacOSX/lucene/common-build.xml:841: There were test failures: 249 suites, 1038 tests, 1 failure, 14 ignored (3 assumptions)

Total time: 62 minutes 52 seconds
Build step 'Invoke Ant' marked build as failure
Archiving artifacts
Recording test results
Description set: Java: 64bit/jdk1.7.0 -XX:+UseConcMarkSweepGC
Email was triggered for: Failure
Sending email for trigger: Failure



Mime
View raw message