lucene-dev mailing list archives

Site index · List index
Message view « Date » · « Thread »
Top « Date » · « Thread »
From Policeman Jenkins Server <jenk...@thetaphi.de>
Subject [JENKINS] Lucene-Solr-trunk-MacOSX (64bit/jdk1.7.0) - Build # 184 - Still Failing!
Date Mon, 04 Feb 2013 22:19:47 GMT
Build: http://jenkins.thetaphi.de/job/Lucene-Solr-trunk-MacOSX/184/
Java: 64bit/jdk1.7.0 -XX:+UseConcMarkSweepGC

1 tests failed.
REGRESSION:  org.apache.solr.cloud.BasicDistributedZk2Test.testDistribSearch

Error Message:
IOException occured when talking to server at: http://127.0.0.1:50615/_/collection1

Stack Trace:
org.apache.solr.client.solrj.SolrServerException: IOException occured when talking to server at: http://127.0.0.1:50615/_/collection1
	at __randomizedtesting.SeedInfo.seed([41B4DADA8284A736:C05254C2F5DBC70A]:0)
	at org.apache.solr.client.solrj.impl.HttpSolrServer.request(HttpSolrServer.java:416)
	at org.apache.solr.client.solrj.impl.HttpSolrServer.request(HttpSolrServer.java:181)
	at org.apache.solr.client.solrj.request.AbstractUpdateRequest.process(AbstractUpdateRequest.java:117)
	at org.apache.solr.cloud.AbstractFullDistribZkTestBase.index_specific(AbstractFullDistribZkTestBase.java:575)
	at org.apache.solr.cloud.AbstractFullDistribZkTestBase.checkQueries(AbstractFullDistribZkTestBase.java:750)
	at org.apache.solr.cloud.BasicDistributedZk2Test.doTest(BasicDistributedZk2Test.java:101)
	at org.apache.solr.BaseDistributedSearchTestCase.testDistribSearch(BaseDistributedSearchTestCase.java:794)
	at sun.reflect.NativeMethodAccessorImpl.invoke0(Native Method)
	at sun.reflect.NativeMethodAccessorImpl.invoke(NativeMethodAccessorImpl.java:57)
	at sun.reflect.DelegatingMethodAccessorImpl.invoke(DelegatingMethodAccessorImpl.java:43)
	at java.lang.reflect.Method.invoke(Method.java:601)
	at com.carrotsearch.randomizedtesting.RandomizedRunner.invoke(RandomizedRunner.java:1559)
	at com.carrotsearch.randomizedtesting.RandomizedRunner.access$600(RandomizedRunner.java:79)
	at com.carrotsearch.randomizedtesting.RandomizedRunner$6.evaluate(RandomizedRunner.java:737)
	at com.carrotsearch.randomizedtesting.RandomizedRunner$7.evaluate(RandomizedRunner.java:773)
	at com.carrotsearch.randomizedtesting.RandomizedRunner$8.evaluate(RandomizedRunner.java:787)
	at com.carrotsearch.randomizedtesting.rules.SystemPropertiesRestoreRule$1.evaluate(SystemPropertiesRestoreRule.java:53)
	at org.apache.lucene.util.TestRuleSetupTeardownChained$1.evaluate(TestRuleSetupTeardownChained.java:50)
	at org.apache.lucene.util.TestRuleFieldCacheSanity$1.evaluate(TestRuleFieldCacheSanity.java:51)
	at org.apache.lucene.util.AbstractBeforeAfterRule$1.evaluate(AbstractBeforeAfterRule.java:46)
	at com.carrotsearch.randomizedtesting.rules.SystemPropertiesInvariantRule$1.evaluate(SystemPropertiesInvariantRule.java:55)
	at org.apache.lucene.util.TestRuleThreadAndTestName$1.evaluate(TestRuleThreadAndTestName.java:49)
	at org.apache.lucene.util.TestRuleIgnoreAfterMaxFailures$1.evaluate(TestRuleIgnoreAfterMaxFailures.java:70)
	at org.apache.lucene.util.TestRuleMarkFailure$1.evaluate(TestRuleMarkFailure.java:48)
	at com.carrotsearch.randomizedtesting.rules.StatementAdapter.evaluate(StatementAdapter.java:36)
	at com.carrotsearch.randomizedtesting.ThreadLeakControl$StatementRunner.run(ThreadLeakControl.java:358)
	at com.carrotsearch.randomizedtesting.ThreadLeakControl.forkTimeoutingTask(ThreadLeakControl.java:782)
	at com.carrotsearch.randomizedtesting.ThreadLeakControl$3.evaluate(ThreadLeakControl.java:442)
	at com.carrotsearch.randomizedtesting.RandomizedRunner.runSingleTest(RandomizedRunner.java:746)
	at com.carrotsearch.randomizedtesting.RandomizedRunner$3.evaluate(RandomizedRunner.java:648)
	at com.carrotsearch.randomizedtesting.RandomizedRunner$4.evaluate(RandomizedRunner.java:682)
	at com.carrotsearch.randomizedtesting.RandomizedRunner$5.evaluate(RandomizedRunner.java:693)
	at com.carrotsearch.randomizedtesting.rules.StatementAdapter.evaluate(StatementAdapter.java:36)
	at com.carrotsearch.randomizedtesting.rules.SystemPropertiesRestoreRule$1.evaluate(SystemPropertiesRestoreRule.java:53)
	at org.apache.lucene.util.AbstractBeforeAfterRule$1.evaluate(AbstractBeforeAfterRule.java:46)
	at org.apache.lucene.util.TestRuleStoreClassName$1.evaluate(TestRuleStoreClassName.java:42)
	at com.carrotsearch.randomizedtesting.rules.SystemPropertiesInvariantRule$1.evaluate(SystemPropertiesInvariantRule.java:55)
	at com.carrotsearch.randomizedtesting.rules.NoShadowingOrOverridesOnMethodsRule$1.evaluate(NoShadowingOrOverridesOnMethodsRule.java:39)
	at com.carrotsearch.randomizedtesting.rules.NoShadowingOrOverridesOnMethodsRule$1.evaluate(NoShadowingOrOverridesOnMethodsRule.java:39)
	at com.carrotsearch.randomizedtesting.rules.StatementAdapter.evaluate(StatementAdapter.java:36)
	at org.apache.lucene.util.TestRuleAssertionsRequired$1.evaluate(TestRuleAssertionsRequired.java:43)
	at org.apache.lucene.util.TestRuleMarkFailure$1.evaluate(TestRuleMarkFailure.java:48)
	at org.apache.lucene.util.TestRuleIgnoreAfterMaxFailures$1.evaluate(TestRuleIgnoreAfterMaxFailures.java:70)
	at org.apache.lucene.util.TestRuleIgnoreTestSuites$1.evaluate(TestRuleIgnoreTestSuites.java:55)
	at com.carrotsearch.randomizedtesting.rules.StatementAdapter.evaluate(StatementAdapter.java:36)
	at com.carrotsearch.randomizedtesting.ThreadLeakControl$StatementRunner.run(ThreadLeakControl.java:358)
	at java.lang.Thread.run(Thread.java:722)
Caused by: java.net.SocketException: Invalid argument
	at java.net.SocketInputStream.socketRead0(Native Method)
	at java.net.SocketInputStream.read(SocketInputStream.java:150)
	at java.net.SocketInputStream.read(SocketInputStream.java:121)
	at org.apache.http.impl.io.AbstractSessionInputBuffer.fillBuffer(AbstractSessionInputBuffer.java:149)
	at org.apache.http.impl.io.SocketInputBuffer.fillBuffer(SocketInputBuffer.java:111)
	at org.apache.http.impl.io.AbstractSessionInputBuffer.readLine(AbstractSessionInputBuffer.java:264)
	at org.apache.http.impl.conn.DefaultResponseParser.parseHead(DefaultResponseParser.java:98)
	at org.apache.http.impl.io.AbstractMessageParser.parse(AbstractMessageParser.java:252)
	at org.apache.http.impl.AbstractHttpClientConnection.receiveResponseHeader(AbstractHttpClientConnection.java:282)
	at org.apache.http.impl.conn.DefaultClientConnection.receiveResponseHeader(DefaultClientConnection.java:247)
	at org.apache.http.impl.conn.AbstractClientConnAdapter.receiveResponseHeader(AbstractClientConnAdapter.java:216)
	at org.apache.http.protocol.HttpRequestExecutor.doReceiveResponse(HttpRequestExecutor.java:298)
	at org.apache.http.protocol.HttpRequestExecutor.execute(HttpRequestExecutor.java:125)
	at org.apache.http.impl.client.DefaultRequestDirector.tryExecute(DefaultRequestDirector.java:647)
	at org.apache.http.impl.client.DefaultRequestDirector.execute(DefaultRequestDirector.java:464)
	at org.apache.http.impl.client.AbstractHttpClient.execute(AbstractHttpClient.java:820)
	at org.apache.http.impl.client.AbstractHttpClient.execute(AbstractHttpClient.java:754)
	at org.apache.http.impl.client.AbstractHttpClient.execute(AbstractHttpClient.java:732)
	at org.apache.solr.client.solrj.impl.HttpSolrServer.request(HttpSolrServer.java:353)
	... 46 more




Build Log:
[...truncated 9313 lines...]
[junit4:junit4] Suite: org.apache.solr.cloud.BasicDistributedZk2Test
[junit4:junit4]   2> 0 T4702 oas.BaseDistributedSearchTestCase.initHostContext Setting hostContext system property: /_/
[junit4:junit4]   2> 6 T4702 oas.SolrTestCaseJ4.setUp ###Starting testDistribSearch
[junit4:junit4]   2> Creating dataDir: /Users/jenkins/jenkins-slave/workspace/Lucene-Solr-trunk-MacOSX/solr/build/solr-core/test/J0/./solrtest-BasicDistributedZk2Test-1360016233408
[junit4:junit4]   2> 8 T4702 oasc.ZkTestServer.run STARTING ZK TEST SERVER
[junit4:junit4]   2> 9 T4703 oasc.ZkTestServer$ZKServerMain.runFromConfig Starting server
[junit4:junit4]   2> 10 T4703 oazs.ZooKeeperServer.setTickTime tickTime set to 1000
[junit4:junit4]   2> 10 T4703 oazs.ZooKeeperServer.setMinSessionTimeout minSessionTimeout set to -1
[junit4:junit4]   2> 11 T4703 oazs.ZooKeeperServer.setMaxSessionTimeout maxSessionTimeout set to -1
[junit4:junit4]   2> 11 T4703 oazs.NIOServerCnxnFactory.configure binding to port 0.0.0.0/0.0.0.0:0
[junit4:junit4]   2> 12 T4703 oazsp.FileTxnSnapLog.save Snapshotting: 0x0 to /Users/jenkins/jenkins-slave/workspace/Lucene-Solr-trunk-MacOSX/solr/build/solr-core/test/J0/./org.apache.solr.cloud.BasicDistributedZk2Test-1360016233408/zookeeper/server1/data/version-2/snapshot.0
[junit4:junit4]   2> 110 T4702 oasc.ZkTestServer.run start zk server on port:50602
[junit4:junit4]   2> 111 T4702 oaz.ZooKeeper.<init> Initiating client connection, connectString=127.0.0.1:50602 sessionTimeout=10000 watcher=org.apache.solr.common.cloud.ConnectionManager@6d6651bd
[junit4:junit4]   2> 113 T4702 oascc.ConnectionManager.waitForConnected Waiting for client to connect to ZooKeeper
[junit4:junit4]   2> 114 T4708 oaz.ClientCnxn$SendThread.logStartConnect Opening socket connection to server localhost/127.0.0.1:50602. Will not attempt to authenticate using SASL (access denied ("javax.security.auth.AuthPermission" "getLoginConfiguration"))
[junit4:junit4]   2> 116 T4708 oaz.ClientCnxn$SendThread.primeConnection Socket connection established to localhost/127.0.0.1:50602, initiating session
[junit4:junit4]   2> 117 T4704 oazs.NIOServerCnxnFactory.run Accepted socket connection from /127.0.0.1:50603
[junit4:junit4]   2> 120 T4704 oazs.ZooKeeperServer.processConnectRequest Client attempting to establish new session at /127.0.0.1:50603
[junit4:junit4]   2> 121 T4706 oazsp.FileTxnLog.append Creating new log file: log.1
[junit4:junit4]   2> 126 T4706 oazs.ZooKeeperServer.finishSessionInit Established session 0x13ca748d3c60000 with negotiated timeout 10000 for client /127.0.0.1:50603
[junit4:junit4]   2> 126 T4708 oaz.ClientCnxn$SendThread.onConnected Session establishment complete on server localhost/127.0.0.1:50602, sessionid = 0x13ca748d3c60000, negotiated timeout = 10000
[junit4:junit4]   2> 128 T4709 oascc.ConnectionManager.process Watcher org.apache.solr.common.cloud.ConnectionManager@6d6651bd name:ZooKeeperConnection Watcher:127.0.0.1:50602 got event WatchedEvent state:SyncConnected type:None path:null path:null type:None
[junit4:junit4]   2> 129 T4702 oascc.ConnectionManager.waitForConnected Client is connected to ZooKeeper
[junit4:junit4]   2> 129 T4702 oascc.SolrZkClient.makePath makePath: /solr
[junit4:junit4]   2> 139 T4707 oazs.PrepRequestProcessor.pRequest2Txn Processed session termination for sessionid: 0x13ca748d3c60000
[junit4:junit4]   2> 142 T4709 oaz.ClientCnxn$EventThread.run EventThread shut down
[junit4:junit4]   2> 141 T4702 oaz.ZooKeeper.close Session: 0x13ca748d3c60000 closed
[junit4:junit4]   2> 145 T4704 oazs.NIOServerCnxn.closeSock Closed socket connection for client /127.0.0.1:50603 which had sessionid 0x13ca748d3c60000
[junit4:junit4]   2> 145 T4702 oaz.ZooKeeper.<init> Initiating client connection, connectString=127.0.0.1:50602/solr sessionTimeout=10000 watcher=org.apache.solr.common.cloud.ConnectionManager@fc514ab
[junit4:junit4]   2> 149 T4702 oascc.ConnectionManager.waitForConnected Waiting for client to connect to ZooKeeper
[junit4:junit4]   2> 150 T4710 oaz.ClientCnxn$SendThread.logStartConnect Opening socket connection to server localhost/127.0.0.1:50602. Will not attempt to authenticate using SASL (access denied ("javax.security.auth.AuthPermission" "getLoginConfiguration"))
[junit4:junit4]   2> 153 T4710 oaz.ClientCnxn$SendThread.primeConnection Socket connection established to localhost/127.0.0.1:50602, initiating session
[junit4:junit4]   2> 154 T4704 oazs.NIOServerCnxnFactory.run Accepted socket connection from /127.0.0.1:50604
[junit4:junit4]   2> 155 T4704 oazs.ZooKeeperServer.processConnectRequest Client attempting to establish new session at /127.0.0.1:50604
[junit4:junit4]   2> 158 T4706 oazs.ZooKeeperServer.finishSessionInit Established session 0x13ca748d3c60001 with negotiated timeout 10000 for client /127.0.0.1:50604
[junit4:junit4]   2> 158 T4710 oaz.ClientCnxn$SendThread.onConnected Session establishment complete on server localhost/127.0.0.1:50602, sessionid = 0x13ca748d3c60001, negotiated timeout = 10000
[junit4:junit4]   2> 160 T4711 oascc.ConnectionManager.process Watcher org.apache.solr.common.cloud.ConnectionManager@fc514ab name:ZooKeeperConnection Watcher:127.0.0.1:50602/solr got event WatchedEvent state:SyncConnected type:None path:null path:null type:None
[junit4:junit4]   2> 161 T4702 oascc.ConnectionManager.waitForConnected Client is connected to ZooKeeper
[junit4:junit4]   2> 162 T4702 oascc.SolrZkClient.makePath makePath: /collections/collection1
[junit4:junit4]   2> 174 T4702 oascc.SolrZkClient.makePath makePath: /collections/collection1/shards
[junit4:junit4]   2> 185 T4702 oascc.SolrZkClient.makePath makePath: /collections/control_collection
[junit4:junit4]   2> 193 T4702 oascc.SolrZkClient.makePath makePath: /collections/control_collection/shards
[junit4:junit4]   2> 205 T4702 oasc.AbstractZkTestCase.putConfig put /Users/jenkins/jenkins-slave/workspace/Lucene-Solr-trunk-MacOSX/solr/build/solr-core/test-files/solr/collection1/conf/solrconfig.xml to /configs/conf1/solrconfig.xml
[junit4:junit4]   2> 210 T4702 oascc.SolrZkClient.makePath makePath: /configs/conf1/solrconfig.xml
[junit4:junit4]   2> 220 T4702 oasc.AbstractZkTestCase.putConfig put /Users/jenkins/jenkins-slave/workspace/Lucene-Solr-trunk-MacOSX/solr/build/solr-core/test-files/solr/collection1/conf/schema.xml to /configs/conf1/schema.xml
[junit4:junit4]   2> 221 T4702 oascc.SolrZkClient.makePath makePath: /configs/conf1/schema.xml
[junit4:junit4]   2> 236 T4702 oasc.AbstractZkTestCase.putConfig put /Users/jenkins/jenkins-slave/workspace/Lucene-Solr-trunk-MacOSX/solr/build/solr-core/test-files/solr/collection1/conf/stopwords.txt to /configs/conf1/stopwords.txt
[junit4:junit4]   2> 237 T4702 oascc.SolrZkClient.makePath makePath: /configs/conf1/stopwords.txt
[junit4:junit4]   2> 242 T4702 oasc.AbstractZkTestCase.putConfig put /Users/jenkins/jenkins-slave/workspace/Lucene-Solr-trunk-MacOSX/solr/build/solr-core/test-files/solr/collection1/conf/protwords.txt to /configs/conf1/protwords.txt
[junit4:junit4]   2> 243 T4702 oascc.SolrZkClient.makePath makePath: /configs/conf1/protwords.txt
[junit4:junit4]   2> 248 T4702 oasc.AbstractZkTestCase.putConfig put /Users/jenkins/jenkins-slave/workspace/Lucene-Solr-trunk-MacOSX/solr/build/solr-core/test-files/solr/collection1/conf/currency.xml to /configs/conf1/currency.xml
[junit4:junit4]   2> 248 T4702 oascc.SolrZkClient.makePath makePath: /configs/conf1/currency.xml
[junit4:junit4]   2> 253 T4702 oasc.AbstractZkTestCase.putConfig put /Users/jenkins/jenkins-slave/workspace/Lucene-Solr-trunk-MacOSX/solr/build/solr-core/test-files/solr/collection1/conf/open-exchange-rates.json to /configs/conf1/open-exchange-rates.json
[junit4:junit4]   2> 253 T4702 oascc.SolrZkClient.makePath makePath: /configs/conf1/open-exchange-rates.json
[junit4:junit4]   2> 258 T4702 oasc.AbstractZkTestCase.putConfig put /Users/jenkins/jenkins-slave/workspace/Lucene-Solr-trunk-MacOSX/solr/build/solr-core/test-files/solr/collection1/conf/mapping-ISOLatin1Accent.txt to /configs/conf1/mapping-ISOLatin1Accent.txt
[junit4:junit4]   2> 259 T4702 oascc.SolrZkClient.makePath makePath: /configs/conf1/mapping-ISOLatin1Accent.txt
[junit4:junit4]   2> 263 T4702 oasc.AbstractZkTestCase.putConfig put /Users/jenkins/jenkins-slave/workspace/Lucene-Solr-trunk-MacOSX/solr/build/solr-core/test-files/solr/collection1/conf/old_synonyms.txt to /configs/conf1/old_synonyms.txt
[junit4:junit4]   2> 263 T4702 oascc.SolrZkClient.makePath makePath: /configs/conf1/old_synonyms.txt
[junit4:junit4]   2> 268 T4702 oasc.AbstractZkTestCase.putConfig put /Users/jenkins/jenkins-slave/workspace/Lucene-Solr-trunk-MacOSX/solr/build/solr-core/test-files/solr/collection1/conf/synonyms.txt to /configs/conf1/synonyms.txt
[junit4:junit4]   2> 269 T4702 oascc.SolrZkClient.makePath makePath: /configs/conf1/synonyms.txt
[junit4:junit4]   2> 273 T4707 oazs.PrepRequestProcessor.pRequest2Txn Processed session termination for sessionid: 0x13ca748d3c60001
[junit4:junit4]   2> 274 T4704 oazs.NIOServerCnxn.closeSock Closed socket connection for client /127.0.0.1:50604 which had sessionid 0x13ca748d3c60001
[junit4:junit4]   2> 275 T4711 oaz.ClientCnxn$EventThread.run EventThread shut down
[junit4:junit4]   2> 274 T4702 oaz.ZooKeeper.close Session: 0x13ca748d3c60001 closed
[junit4:junit4]   2> 519 T4702 oejs.Server.doStart jetty-8.1.8.v20121106
[junit4:junit4]   2> 527 T4702 oejs.AbstractConnector.doStart Started SelectChannelConnector@127.0.0.1:50605
[junit4:junit4]   2> 528 T4702 oass.SolrDispatchFilter.init SolrDispatchFilter.init()
[junit4:junit4]   2> 529 T4702 oasc.SolrResourceLoader.locateSolrHome JNDI not configured for solr (NoInitialContextEx)
[junit4:junit4]   2> 530 T4702 oasc.SolrResourceLoader.locateSolrHome using system property solr.solr.home: /Users/jenkins/jenkins-slave/workspace/Lucene-Solr-trunk-MacOSX/solr/build/solr-core/test/J0/./org.apache.solr.cloud.BasicDistributedZk2Test-controljetty-1360016233677
[junit4:junit4]   2> 530 T4702 oasc.CoreContainer$Initializer.initialize looking for solr.xml: /Users/jenkins/jenkins-slave/workspace/Lucene-Solr-trunk-MacOSX/solr/build/solr-core/test/J0/./org.apache.solr.cloud.BasicDistributedZk2Test-controljetty-1360016233677/solr.xml
[junit4:junit4]   2> 531 T4702 oasc.CoreContainer.<init> New CoreContainer 1125478500
[junit4:junit4]   2> 531 T4702 oasc.CoreContainer.load Loading CoreContainer using Solr Home: '/Users/jenkins/jenkins-slave/workspace/Lucene-Solr-trunk-MacOSX/solr/build/solr-core/test/J0/./org.apache.solr.cloud.BasicDistributedZk2Test-controljetty-1360016233677/'
[junit4:junit4]   2> 532 T4702 oasc.SolrResourceLoader.<init> new SolrResourceLoader for directory: '/Users/jenkins/jenkins-slave/workspace/Lucene-Solr-trunk-MacOSX/solr/build/solr-core/test/J0/./org.apache.solr.cloud.BasicDistributedZk2Test-controljetty-1360016233677/'
[junit4:junit4]   2> 756 T4702 oashc.HttpShardHandlerFactory.getParameter Setting socketTimeout to: 60000
[junit4:junit4]   2> 757 T4702 oashc.HttpShardHandlerFactory.getParameter Setting urlScheme to: http://
[junit4:junit4]   2> 758 T4702 oashc.HttpShardHandlerFactory.getParameter Setting connTimeout to: 15000
[junit4:junit4]   2> 758 T4702 oashc.HttpShardHandlerFactory.getParameter Setting maxConnectionsPerHost to: 20
[junit4:junit4]   2> 758 T4702 oashc.HttpShardHandlerFactory.getParameter Setting corePoolSize to: 0
[junit4:junit4]   2> 759 T4702 oashc.HttpShardHandlerFactory.getParameter Setting maximumPoolSize to: 2147483647
[junit4:junit4]   2> 759 T4702 oashc.HttpShardHandlerFactory.getParameter Setting maxThreadIdleTime to: 5
[junit4:junit4]   2> 760 T4702 oashc.HttpShardHandlerFactory.getParameter Setting sizeOfQueue to: -1
[junit4:junit4]   2> 760 T4702 oashc.HttpShardHandlerFactory.getParameter Setting fairnessPolicy to: false
[junit4:junit4]   2> 761 T4702 oascsi.HttpClientUtil.createClient Creating new http client, config:maxConnectionsPerHost=20&maxConnections=10000&socketTimeout=60000&connTimeout=15000&retry=false
[junit4:junit4]   2> 772 T4702 oasc.CoreContainer.load Registering Log Listener
[junit4:junit4]   2> 789 T4702 oasc.CoreContainer.initZooKeeper Zookeeper client=127.0.0.1:50602/solr
[junit4:junit4]   2> 790 T4702 oasc.ZkController.checkChrootPath zkHost includes chroot
[junit4:junit4]   2> 791 T4702 oaz.ZooKeeper.<init> Initiating client connection, connectString=127.0.0.1:50602 sessionTimeout=60000 watcher=org.apache.solr.common.cloud.ConnectionManager@8ea0ef3
[junit4:junit4]   2> 792 T4702 oascc.ConnectionManager.waitForConnected Waiting for client to connect to ZooKeeper
[junit4:junit4]   2> 793 T4721 oaz.ClientCnxn$SendThread.logStartConnect Opening socket connection to server localhost/127.0.0.1:50602. Will not attempt to authenticate using SASL (access denied ("javax.security.auth.AuthPermission" "getLoginConfiguration"))
[junit4:junit4]   2> 794 T4721 oaz.ClientCnxn$SendThread.primeConnection Socket connection established to localhost/127.0.0.1:50602, initiating session
[junit4:junit4]   2> 794 T4704 oazs.NIOServerCnxnFactory.run Accepted socket connection from /127.0.0.1:50606
[junit4:junit4]   2> 795 T4704 oazs.ZooKeeperServer.processConnectRequest Client attempting to establish new session at /127.0.0.1:50606
[junit4:junit4]   2> 1073 T4706 oazs.ZooKeeperServer.finishSessionInit Established session 0x13ca748d3c60002 with negotiated timeout 20000 for client /127.0.0.1:50606
[junit4:junit4]   2> 1074 T4721 oaz.ClientCnxn$SendThread.onConnected Session establishment complete on server localhost/127.0.0.1:50602, sessionid = 0x13ca748d3c60002, negotiated timeout = 20000
[junit4:junit4]   2> 1075 T4722 oascc.ConnectionManager.process Watcher org.apache.solr.common.cloud.ConnectionManager@8ea0ef3 name:ZooKeeperConnection Watcher:127.0.0.1:50602 got event WatchedEvent state:SyncConnected type:None path:null path:null type:None
[junit4:junit4]   2> 1075 T4702 oascc.ConnectionManager.waitForConnected Client is connected to ZooKeeper
[junit4:junit4]   2> 1077 T4707 oazs.PrepRequestProcessor.pRequest2Txn Processed session termination for sessionid: 0x13ca748d3c60002
[junit4:junit4]   2> 1095 T4704 oazs.NIOServerCnxn.closeSock Closed socket connection for client /127.0.0.1:50606 which had sessionid 0x13ca748d3c60002
[junit4:junit4]   2> 1096 T4702 oaz.ZooKeeper.close Session: 0x13ca748d3c60002 closed
[junit4:junit4]   2> 1098 T4702 oascsi.HttpClientUtil.createClient Creating new http client, config:maxConnections=500&maxConnectionsPerHost=16&socketTimeout=60000&connTimeout=15000
[junit4:junit4]   2> 1118 T4702 oaz.ZooKeeper.<init> Initiating client connection, connectString=127.0.0.1:50602/solr sessionTimeout=30000 watcher=org.apache.solr.common.cloud.ConnectionManager@67a3512c
[junit4:junit4]   2> 1121 T4722 oaz.ClientCnxn$EventThread.run EventThread shut down
[junit4:junit4]   2> 1133 T4702 oascc.ConnectionManager.waitForConnected Waiting for client to connect to ZooKeeper
[junit4:junit4]   2> 1135 T4723 oaz.ClientCnxn$SendThread.logStartConnect Opening socket connection to server localhost/127.0.0.1:50602. Will not attempt to authenticate using SASL (access denied ("javax.security.auth.AuthPermission" "getLoginConfiguration"))
[junit4:junit4]   2> 1135 T4723 oaz.ClientCnxn$SendThread.primeConnection Socket connection established to localhost/127.0.0.1:50602, initiating session
[junit4:junit4]   2> 1136 T4704 oazs.NIOServerCnxnFactory.run Accepted socket connection from /127.0.0.1:50607
[junit4:junit4]   2> 1137 T4704 oazs.ZooKeeperServer.processConnectRequest Client attempting to establish new session at /127.0.0.1:50607
[junit4:junit4]   2> 1137 T4706 oazs.ZooKeeperServer.finishSessionInit Established session 0x13ca748d3c60003 with negotiated timeout 20000 for client /127.0.0.1:50607
[junit4:junit4]   2> 1138 T4723 oaz.ClientCnxn$SendThread.onConnected Session establishment complete on server localhost/127.0.0.1:50602, sessionid = 0x13ca748d3c60003, negotiated timeout = 20000
[junit4:junit4]   2> 1138 T4724 oascc.ConnectionManager.process Watcher org.apache.solr.common.cloud.ConnectionManager@67a3512c name:ZooKeeperConnection Watcher:127.0.0.1:50602/solr got event WatchedEvent state:SyncConnected type:None path:null path:null type:None
[junit4:junit4]   2> 1138 T4702 oascc.ConnectionManager.waitForConnected Client is connected to ZooKeeper
[junit4:junit4]   2> 1140 T4707 oazs.PrepRequestProcessor.pRequest Got user-level KeeperException when processing sessionid:0x13ca748d3c60003 type:create cxid:0x2 zxid:0x1a txntype:-1 reqpath:n/a Error Path:/solr/overseer Error:KeeperErrorCode = NodeExists for /solr/overseer
[junit4:junit4]   2> 1141 T4702 oascc.SolrZkClient.makePath makePath: /live_nodes
[junit4:junit4]   2> 1144 T4702 oasc.ZkController.createEphemeralLiveNode Register node as live in ZooKeeper:/live_nodes/127.0.0.1:50605__
[junit4:junit4]   2> 1146 T4707 oazs.PrepRequestProcessor.pRequest Got user-level KeeperException when processing sessionid:0x13ca748d3c60003 type:delete cxid:0x7 zxid:0x1c txntype:-1 reqpath:n/a Error Path:/solr/live_nodes/127.0.0.1:50605__ Error:KeeperErrorCode = NoNode for /solr/live_nodes/127.0.0.1:50605__
[junit4:junit4]   2> 1147 T4702 oascc.SolrZkClient.makePath makePath: /live_nodes/127.0.0.1:50605__
[junit4:junit4]   2> 1151 T4702 oascc.SolrZkClient.makePath makePath: /overseer_elect/election
[junit4:junit4]   2> 1157 T4707 oazs.PrepRequestProcessor.pRequest Got user-level KeeperException when processing sessionid:0x13ca748d3c60003 type:delete cxid:0x15 zxid:0x21 txntype:-1 reqpath:n/a Error Path:/solr/overseer_elect/leader Error:KeeperErrorCode = NoNode for /solr/overseer_elect/leader
[junit4:junit4]   2> 1158 T4702 oascc.SolrZkClient.makePath makePath: /overseer_elect/leader
[junit4:junit4]   2> 1161 T4702 oasc.Overseer.start Overseer (id=89130023873019907-127.0.0.1:50605__-n_0000000000) starting
[junit4:junit4]   2> 1162 T4707 oazs.PrepRequestProcessor.pRequest Got user-level KeeperException when processing sessionid:0x13ca748d3c60003 type:create cxid:0x1a zxid:0x23 txntype:-1 reqpath:n/a Error Path:/solr/overseer Error:KeeperErrorCode = NodeExists for /solr/overseer
[junit4:junit4]   2> 1164 T4707 oazs.PrepRequestProcessor.pRequest Got user-level KeeperException when processing sessionid:0x13ca748d3c60003 type:create cxid:0x1b zxid:0x24 txntype:-1 reqpath:n/a Error Path:/solr/overseer Error:KeeperErrorCode = NodeExists for /solr/overseer
[junit4:junit4]   2> 1165 T4707 oazs.PrepRequestProcessor.pRequest Got user-level KeeperException when processing sessionid:0x13ca748d3c60003 type:create cxid:0x1c zxid:0x25 txntype:-1 reqpath:n/a Error Path:/solr/overseer Error:KeeperErrorCode = NodeExists for /solr/overseer
[junit4:junit4]   2> 1166 T4707 oazs.PrepRequestProcessor.pRequest Got user-level KeeperException when processing sessionid:0x13ca748d3c60003 type:create cxid:0x1d zxid:0x26 txntype:-1 reqpath:n/a Error Path:/solr/overseer Error:KeeperErrorCode = NodeExists for /solr/overseer
[junit4:junit4]   2> 1168 T4726 oasc.OverseerCollectionProcessor.run Process current queue of collection creations
[junit4:junit4]   2> 1170 T4702 oascc.SolrZkClient.makePath makePath: /clusterstate.json
[junit4:junit4]   2> 1175 T4702 oascc.ZkStateReader.createClusterStateWatchersAndUpdate Updating cluster state from ZooKeeper... 
[junit4:junit4]   2> 1183 T4727 oasc.CoreContainer.create Creating SolrCore 'collection1' using instanceDir: /Users/jenkins/jenkins-slave/workspace/Lucene-Solr-trunk-MacOSX/solr/build/solr-core/test/J0/./org.apache.solr.cloud.BasicDistributedZk2Test-controljetty-1360016233677/collection1
[junit4:junit4]   2> 1183 T4727 oasc.ZkController.createCollectionZkNode Check for collection zkNode:control_collection
[junit4:junit4]   2> 1184 T4725 oasc.Overseer$ClusterStateUpdater.run Starting to work on the main queue
[junit4:junit4]   2> 1187 T4727 oasc.ZkController.createCollectionZkNode Collection zkNode exists
[junit4:junit4]   2> 1187 T4727 oasc.ZkController.readConfigName Load collection config from:/collections/control_collection
[junit4:junit4]   2> 1190 T4727 oasc.SolrResourceLoader.<init> new SolrResourceLoader for directory: '/Users/jenkins/jenkins-slave/workspace/Lucene-Solr-trunk-MacOSX/solr/build/solr-core/test/J0/./org.apache.solr.cloud.BasicDistributedZk2Test-controljetty-1360016233677/collection1/'
[junit4:junit4]   2> 1191 T4727 oasc.SolrResourceLoader.replaceClassLoader Adding 'file:/Users/jenkins/jenkins-slave/workspace/Lucene-Solr-trunk-MacOSX/solr/build/solr-core/test/J0/org.apache.solr.cloud.BasicDistributedZk2Test-controljetty-1360016233677/collection1/lib/classes/' to classloader
[junit4:junit4]   2> 1191 T4727 oasc.SolrResourceLoader.replaceClassLoader Adding 'file:/Users/jenkins/jenkins-slave/workspace/Lucene-Solr-trunk-MacOSX/solr/build/solr-core/test/J0/org.apache.solr.cloud.BasicDistributedZk2Test-controljetty-1360016233677/collection1/lib/README' to classloader
[junit4:junit4]   2> 1271 T4727 oasc.SolrConfig.<init> Using Lucene MatchVersion: LUCENE_50
[junit4:junit4]   2> 1358 T4727 oasc.SolrConfig.<init> Loaded SolrConfig: solrconfig.xml
[junit4:junit4]   2> 1359 T4727 oass.IndexSchema.readSchema Reading Solr Schema
[junit4:junit4]   2> 1385 T4727 oass.IndexSchema.readSchema Schema name=test
[junit4:junit4]   2> 2169 T4727 oass.OpenExchangeRatesOrgProvider.init Initialized with rates=open-exchange-rates.json, refreshInterval=1440.
[junit4:junit4]   2> 2187 T4727 oass.IndexSchema.readSchema default search field in schema is text
[junit4:junit4]   2> 2191 T4727 oass.IndexSchema.readSchema unique key field: id
[junit4:junit4]   2> 2217 T4727 oass.FileExchangeRateProvider.reload Reloading exchange rates from file currency.xml
[junit4:junit4]   2> 2231 T4727 oass.FileExchangeRateProvider.reload Reloading exchange rates from file currency.xml
[junit4:junit4]   2> 2242 T4727 oass.OpenExchangeRatesOrgProvider.reload Reloading exchange rates from open-exchange-rates.json
[junit4:junit4]   2> 2246 T4727 oass.OpenExchangeRatesOrgProvider.reload Reloading exchange rates from open-exchange-rates.json
[junit4:junit4]   2> 2250 T4727 oasc.SolrCore.<init> [collection1] Opening new SolrCore at /Users/jenkins/jenkins-slave/workspace/Lucene-Solr-trunk-MacOSX/solr/build/solr-core/test/J0/./org.apache.solr.cloud.BasicDistributedZk2Test-controljetty-1360016233677/collection1/, dataDir=./org.apache.solr.cloud.BasicDistributedZk2Test-1360016233408/control/data/
[junit4:junit4]   2> 2250 T4727 oasc.JmxMonitoredMap.<init> JMX monitoring is enabled. Adding Solr mbeans to JMX Server: com.sun.jmx.mbeanserver.JmxMBeanServer@4506213e
[junit4:junit4]   2> 2251 T4727 oasc.SolrCore.initDirectoryFactory solr.StandardDirectoryFactory
[junit4:junit4]   2> 2252 T4727 oasc.CachingDirectoryFactory.get return new directory for /Users/jenkins/jenkins-slave/workspace/Lucene-Solr-trunk-MacOSX/solr/build/solr-core/test/J0/./org.apache.solr.cloud.BasicDistributedZk2Test-1360016233408/control/data forceNew:false
[junit4:junit4]   2> 2253 T4727 oasc.CachingDirectoryFactory.close Releasing directory:/Users/jenkins/jenkins-slave/workspace/Lucene-Solr-trunk-MacOSX/solr/build/solr-core/test/J0/./org.apache.solr.cloud.BasicDistributedZk2Test-1360016233408/control/data
[junit4:junit4]   2> 2253 T4727 oasc.SolrCore.getNewIndexDir New index directory detected: old=null new=./org.apache.solr.cloud.BasicDistributedZk2Test-1360016233408/control/data/index/
[junit4:junit4]   2> 2254 T4727 oasc.SolrCore.initIndex WARNING [collection1] Solr index directory './org.apache.solr.cloud.BasicDistributedZk2Test-1360016233408/control/data/index' doesn't exist. Creating new index...
[junit4:junit4]   2> 2254 T4727 oasc.CachingDirectoryFactory.get return new directory for /Users/jenkins/jenkins-slave/workspace/Lucene-Solr-trunk-MacOSX/solr/build/solr-core/test/J0/./org.apache.solr.cloud.BasicDistributedZk2Test-1360016233408/control/data/index forceNew:false
[junit4:junit4]   2> 2259 T4727 oasc.SolrDeletionPolicy.onCommit SolrDeletionPolicy.onCommit: commits:num=1
[junit4:junit4]   2> 		commit{dir=RateLimitedDirectoryWrapper(org.apache.lucene.store.NIOFSDirectory@/Users/jenkins/jenkins-slave/workspace/Lucene-Solr-trunk-MacOSX/solr/build/solr-core/test/J0/org.apache.solr.cloud.BasicDistributedZk2Test-1360016233408/control/data/index lockFactory=org.apache.lucene.store.NativeFSLockFactory@62df5ff4),segFN=segments_1,generation=1,filenames=[segments_1]
[junit4:junit4]   2> 2260 T4727 oasc.SolrDeletionPolicy.updateCommits newest commit = 1[segments_1]
[junit4:junit4]   2> 2261 T4727 oasc.CachingDirectoryFactory.close Releasing directory:/Users/jenkins/jenkins-slave/workspace/Lucene-Solr-trunk-MacOSX/solr/build/solr-core/test/J0/./org.apache.solr.cloud.BasicDistributedZk2Test-1360016233408/control/data/index
[junit4:junit4]   2> 2261 T4727 oasc.SolrCore.initWriters created xml: solr.XMLResponseWriter
[junit4:junit4]   2> 2263 T4727 oasup.UpdateRequestProcessorChain.init inserting DistributedUpdateProcessorFactory into updateRequestProcessorChain "dedupe"
[junit4:junit4]   2> 2264 T4727 oasup.UpdateRequestProcessorChain.init inserting DistributedUpdateProcessorFactory into updateRequestProcessorChain "dedupe-allfields"
[junit4:junit4]   2> 2264 T4727 oasup.UpdateRequestProcessorChain.init inserting DistributedUpdateProcessorFactory into updateRequestProcessorChain "stored_sig"
[junit4:junit4]   2> 2264 T4727 oasup.UpdateRequestProcessorChain.init inserting DistributedUpdateProcessorFactory into updateRequestProcessorChain "uniq-fields"
[junit4:junit4]   2> 2265 T4727 oasup.UpdateRequestProcessorChain.init inserting DistributedUpdateProcessorFactory into updateRequestProcessorChain "distrib-dup-test-chain-implicit"
[junit4:junit4]   2> 2265 T4727 oasc.RequestHandlers.initHandlersFromConfig adding lazy requestHandler: solr.ReplicationHandler
[junit4:junit4]   2> 2266 T4727 oasc.RequestHandlers.initHandlersFromConfig created /replication: solr.ReplicationHandler
[junit4:junit4]   2> 2267 T4727 oasc.RequestHandlers.initHandlersFromConfig created standard: solr.StandardRequestHandler
[junit4:junit4]   2> 2267 T4727 oasc.RequestHandlers.initHandlersFromConfig created /get: solr.RealTimeGetHandler
[junit4:junit4]   2> 2268 T4727 oasc.RequestHandlers.initHandlersFromConfig created dismax: solr.SearchHandler
[junit4:junit4]   2> 2268 T4727 oasc.RequestHandlers.initHandlersFromConfig created mock: org.apache.solr.core.MockQuerySenderListenerReqHandler
[junit4:junit4]   2> 2269 T4727 oasc.RequestHandlers.initHandlersFromConfig created /admin/: org.apache.solr.handler.admin.AdminHandlers
[junit4:junit4]   2> 2269 T4727 oasc.RequestHandlers.initHandlersFromConfig created defaults: solr.StandardRequestHandler
[junit4:junit4]   2> 2270 T4727 oasc.RequestHandlers.initHandlersFromConfig adding lazy requestHandler: solr.StandardRequestHandler
[junit4:junit4]   2> 2270 T4727 oasc.RequestHandlers.initHandlersFromConfig created lazy: solr.StandardRequestHandler
[junit4:junit4]   2> 2271 T4727 oasc.RequestHandlers.initHandlersFromConfig created /update: solr.UpdateRequestHandler
[junit4:junit4]   2> 2271 T4727 oasc.RequestHandlers.initHandlersFromConfig created /terms: org.apache.solr.handler.component.SearchHandler
[junit4:junit4]   2> 2272 T4727 oasc.RequestHandlers.initHandlersFromConfig created spellCheckCompRH: org.apache.solr.handler.component.SearchHandler
[junit4:junit4]   2> 2272 T4727 oasc.RequestHandlers.initHandlersFromConfig created spellCheckCompRH_Direct: org.apache.solr.handler.component.SearchHandler
[junit4:junit4]   2> 2273 T4727 oasc.RequestHandlers.initHandlersFromConfig created spellCheckWithWordbreak: org.apache.solr.handler.component.SearchHandler
[junit4:junit4]   2> 2273 T4727 oasc.RequestHandlers.initHandlersFromConfig created spellCheckWithWordbreak_Direct: org.apache.solr.handler.component.SearchHandler
[junit4:junit4]   2> 2274 T4727 oasc.RequestHandlers.initHandlersFromConfig created spellCheckCompRH1: org.apache.solr.handler.component.SearchHandler
[junit4:junit4]   2> 2274 T4727 oasc.RequestHandlers.initHandlersFromConfig created mltrh: org.apache.solr.handler.component.SearchHandler
[junit4:junit4]   2> 2275 T4727 oasc.RequestHandlers.initHandlersFromConfig created tvrh: org.apache.solr.handler.component.SearchHandler
[junit4:junit4]   2> 2275 T4727 oasc.RequestHandlers.initHandlersFromConfig created /mlt: solr.MoreLikeThisHandler
[junit4:junit4]   2> 2276 T4727 oasc.RequestHandlers.initHandlersFromConfig created /debug/dump: solr.DumpRequestHandler
[junit4:junit4]   2> 2283 T4727 oashl.XMLLoader.init xsltCacheLifetimeSeconds=60
[junit4:junit4]   2> 2287 T4727 oasc.SolrCore.initDeprecatedSupport WARNING solrconfig.xml uses deprecated <admin/gettableFiles>, Please update your config to use the ShowFileRequestHandler.
[junit4:junit4]   2> 2288 T4727 oasc.SolrCore.initDeprecatedSupport WARNING adding ShowFileRequestHandler with hidden files: [SCHEMA.XML, OLD_SYNONYMS.TXT, STOPWORDS.TXT, PROTWORDS.TXT, OPEN-EXCHANGE-RATES.JSON, SYNONYMS.TXT, CURRENCY.XML, MAPPING-ISOLATIN1ACCENT.TXT]
[junit4:junit4]   2> 2292 T4727 oasc.CachingDirectoryFactory.close Releasing directory:/Users/jenkins/jenkins-slave/workspace/Lucene-Solr-trunk-MacOSX/solr/build/solr-core/test/J0/./org.apache.solr.cloud.BasicDistributedZk2Test-1360016233408/control/data
[junit4:junit4]   2> 2294 T4727 oass.SolrIndexSearcher.<init> Opening Searcher@3e92d0fc main
[junit4:junit4]   2> 2295 T4727 oasu.CommitTracker.<init> Hard AutoCommit: disabled
[junit4:junit4]   2> 2295 T4727 oasu.CommitTracker.<init> Soft AutoCommit: disabled
[junit4:junit4]   2> 2296 T4727 oashc.SpellCheckComponent.inform Initializing spell checkers
[junit4:junit4]   2> 2302 T4727 oass.DirectSolrSpellChecker.init init: {name=direct,classname=DirectSolrSpellChecker,field=lowerfilt,minQueryLength=3}
[junit4:junit4]   2> 2355 T4728 oasc.SolrCore.registerSearcher [collection1] Registered new searcher Searcher@3e92d0fc main{StandardDirectoryReader(segments_1:1)}
[junit4:junit4]   2> 2373 T4727 oasc.ZkController.publish publishing core=collection1 state=down
[junit4:junit4]   2> 2373 T4727 oasc.ZkController.publish numShards not found on descriptor - reading it from system property
[junit4:junit4]   2> 2377 T4707 oazs.PrepRequestProcessor.pRequest Got user-level KeeperException when processing sessionid:0x13ca748d3c60003 type:create cxid:0x50 zxid:0x29 txntype:-1 reqpath:n/a Error Path:/solr/overseer/queue Error:KeeperErrorCode = NoNode for /solr/overseer/queue
[junit4:junit4]   2> 2705 T4725 oascc.ZkStateReader.updateClusterState Updating cloud state from ZooKeeper... 
[junit4:junit4]   2> 2706 T4725 oasc.Overseer$ClusterStateUpdater.updateState Update state numShards=1 message={
[junit4:junit4]   2> 	  "operation":"state",
[junit4:junit4]   2> 	  "numShards":"1",
[junit4:junit4]   2> 	  "shard":null,
[junit4:junit4]   2> 	  "roles":null,
[junit4:junit4]   2> 	  "state":"down",
[junit4:junit4]   2> 	  "core":"collection1",
[junit4:junit4]   2> 	  "collection":"control_collection",
[junit4:junit4]   2> 	  "node_name":"127.0.0.1:50605__",
[junit4:junit4]   2> 	  "base_url":"http://127.0.0.1:50605/_"}
[junit4:junit4]   2> 2706 T4725 oasc.Overseer$ClusterStateUpdater.createCollection Create collection control_collection with numShards 1
[junit4:junit4]   2> 2706 T4725 oasc.Overseer$ClusterStateUpdater.updateState Assigning new node to shard shard=shard1
[junit4:junit4]   2> 2707 T4707 oazs.PrepRequestProcessor.pRequest Got user-level KeeperException when processing sessionid:0x13ca748d3c60003 type:create cxid:0x58 zxid:0x2c txntype:-1 reqpath:n/a Error Path:/solr/overseer/queue-work Error:KeeperErrorCode = NoNode for /solr/overseer/queue-work
[junit4:junit4]   2> 3153 T4724 oascc.ZkStateReader$2.process A cluster state change: WatchedEvent state:SyncConnected type:NodeDataChanged path:/clusterstate.json, has occurred - updating... (live nodes size: 1)
[junit4:junit4]   2> 3400 T4727 oasc.CoreContainer.registerCore registering core: collection1
[junit4:junit4]   2> 3401 T4727 oasc.ZkController.register Register replica - core:collection1 address:http://127.0.0.1:50605/_ collection:control_collection shard:shard1
[junit4:junit4]   2> 3405 T4727 oascc.SolrZkClient.makePath makePath: /collections/control_collection/leader_elect/shard1/election
[junit4:junit4]   2> 3421 T4707 oazs.PrepRequestProcessor.pRequest Got user-level KeeperException when processing sessionid:0x13ca748d3c60003 type:delete cxid:0x72 zxid:0x36 txntype:-1 reqpath:n/a Error Path:/solr/collections/control_collection/leaders Error:KeeperErrorCode = NoNode for /solr/collections/control_collection/leaders
[junit4:junit4]   2> 3422 T4727 oasc.ShardLeaderElectionContext.runLeaderProcess Running the leader process.
[junit4:junit4]   2> 3423 T4707 oazs.PrepRequestProcessor.pRequest Got user-level KeeperException when processing sessionid:0x13ca748d3c60003 type:create cxid:0x73 zxid:0x37 txntype:-1 reqpath:n/a Error Path:/solr/overseer Error:KeeperErrorCode = NodeExists for /solr/overseer
[junit4:junit4]   2> 3426 T4727 oasc.ShardLeaderElectionContext.waitForReplicasToComeUp Enough replicas found to continue.
[junit4:junit4]   2> 3426 T4727 oasc.ShardLeaderElectionContext.runLeaderProcess I may be the new leader - try and sync
[junit4:junit4]   2> 3426 T4727 oasc.SyncStrategy.sync Sync replicas to http://127.0.0.1:50605/_/collection1/
[junit4:junit4]   2> 3427 T4727 oasc.SyncStrategy.syncReplicas Sync Success - now sync replicas to me
[junit4:junit4]   2> 3427 T4727 oasc.SyncStrategy.syncToMe http://127.0.0.1:50605/_/collection1/ has no replicas
[junit4:junit4]   2> 3428 T4727 oasc.ShardLeaderElectionContext.runLeaderProcess I am the new leader: http://127.0.0.1:50605/_/collection1/
[junit4:junit4]   2> 3428 T4727 oascc.SolrZkClient.makePath makePath: /collections/control_collection/leaders/shard1
[junit4:junit4]   2> 3435 T4707 oazs.PrepRequestProcessor.pRequest Got user-level KeeperException when processing sessionid:0x13ca748d3c60003 type:create cxid:0x7d zxid:0x3b txntype:-1 reqpath:n/a Error Path:/solr/overseer Error:KeeperErrorCode = NodeExists for /solr/overseer
[junit4:junit4]   2> 4664 T4725 oascc.ZkStateReader.updateClusterState Updating cloud state from ZooKeeper... 
[junit4:junit4]   2> 4693 T4724 oascc.ZkStateReader$2.process A cluster state change: WatchedEvent state:SyncConnected type:NodeDataChanged path:/clusterstate.json, has occurred - updating... (live nodes size: 1)
[junit4:junit4]   2> 4731 T4727 oasc.ZkController.register We are http://127.0.0.1:50605/_/collection1/ and leader is http://127.0.0.1:50605/_/collection1/
[junit4:junit4]   2> 4732 T4727 oasc.ZkController.register No LogReplay needed for core=collection1 baseURL=http://127.0.0.1:50605/_
[junit4:junit4]   2> 4732 T4727 oasc.ZkController.checkRecovery I am the leader, no recovery necessary
[junit4:junit4]   2> 4733 T4727 oasc.ZkController.publish publishing core=collection1 state=active
[junit4:junit4]   2> 4734 T4727 oasc.ZkController.publish numShards not found on descriptor - reading it from system property
[junit4:junit4]   2> 4739 T4727 oascc.ZkStateReader.updateClusterState Updating cloud state from ZooKeeper... 
[junit4:junit4]   2> 4743 T4702 oass.SolrDispatchFilter.init user.dir=/Users/jenkins/jenkins-slave/workspace/Lucene-Solr-trunk-MacOSX/solr/build/solr-core/test/J0
[junit4:junit4]   2> 4745 T4702 oass.SolrDispatchFilter.init SolrDispatchFilter.init() done
[junit4:junit4]   2> 4746 T4702 oascsi.HttpClientUtil.createClient Creating new http client, config:maxConnections=128&maxConnectionsPerHost=32&followRedirects=false
[junit4:junit4]   2> 4767 T4702 oascsi.HttpClientUtil.createClient Creating new http client, config:
[junit4:junit4]   2> 4774 T4702 oaz.ZooKeeper.<init> Initiating client connection, connectString=127.0.0.1:50602/solr sessionTimeout=10000 watcher=org.apache.solr.common.cloud.ConnectionManager@6f2133bb
[junit4:junit4]   2> 4776 T4702 oascc.ConnectionManager.waitForConnected Waiting for client to connect to ZooKeeper
[junit4:junit4]   2> 4776 T4729 oaz.ClientCnxn$SendThread.logStartConnect Opening socket connection to server localhost/127.0.0.1:50602. Will not attempt to authenticate using SASL (access denied ("javax.security.auth.AuthPermission" "getLoginConfiguration"))
[junit4:junit4]   2> 4777 T4729 oaz.ClientCnxn$SendThread.primeConnection Socket connection established to localhost/127.0.0.1:50602, initiating session
[junit4:junit4]   2> 4777 T4704 oazs.NIOServerCnxnFactory.run Accepted socket connection from /127.0.0.1:50608
[junit4:junit4]   2> 4778 T4704 oazs.ZooKeeperServer.processConnectRequest Client attempting to establish new session at /127.0.0.1:50608
[junit4:junit4]   2> 4779 T4706 oazs.ZooKeeperServer.finishSessionInit Established session 0x13ca748d3c60004 with negotiated timeout 10000 for client /127.0.0.1:50608
[junit4:junit4]   2> 4779 T4729 oaz.ClientCnxn$SendThread.onConnected Session establishment complete on server localhost/127.0.0.1:50602, sessionid = 0x13ca748d3c60004, negotiated timeout = 10000
[junit4:junit4]   2> 4780 T4730 oascc.ConnectionManager.process Watcher org.apache.solr.common.cloud.ConnectionManager@6f2133bb name:ZooKeeperConnection Watcher:127.0.0.1:50602/solr got event WatchedEvent state:SyncConnected type:None path:null path:null type:None
[junit4:junit4]   2> 4780 T4702 oascc.ConnectionManager.waitForConnected Client is connected to ZooKeeper
[junit4:junit4]   2> 4781 T4702 oascc.ZkStateReader.createClusterStateWatchersAndUpdate Updating cluster state from ZooKeeper... 
[junit4:junit4]   2> 4784 T4702 oasc.ChaosMonkey.monkeyLog monkey: init - expire sessions:true cause connection loss:true
[junit4:junit4]   2> 4956 T4702 oejs.Server.doStart jetty-8.1.8.v20121106
[junit4:junit4]   2> 4959 T4702 oejs.AbstractConnector.doStart Started SelectChannelConnector@127.0.0.1:50609
[junit4:junit4]   2> 4961 T4702 oass.SolrDispatchFilter.init SolrDispatchFilter.init()
[junit4:junit4]   2> 4961 T4702 oasc.SolrResourceLoader.locateSolrHome JNDI not configured for solr (NoInitialContextEx)
[junit4:junit4]   2> 4962 T4702 oasc.SolrResourceLoader.locateSolrHome using system property solr.solr.home: /Users/jenkins/jenkins-slave/workspace/Lucene-Solr-trunk-MacOSX/solr/build/solr-core/test/J0/./org.apache.solr.cloud.BasicDistributedZk2Test-jetty1-1360016238185
[junit4:junit4]   2> 4962 T4702 oasc.CoreContainer$Initializer.initialize looking for solr.xml: /Users/jenkins/jenkins-slave/workspace/Lucene-Solr-trunk-MacOSX/solr/build/solr-core/test/J0/./org.apache.solr.cloud.BasicDistributedZk2Test-jetty1-1360016238185/solr.xml
[junit4:junit4]   2> 4963 T4702 oasc.CoreContainer.<init> New CoreContainer 1621801131
[junit4:junit4]   2> 4964 T4702 oasc.CoreContainer.load Loading CoreContainer using Solr Home: '/Users/jenkins/jenkins-slave/workspace/Lucene-Solr-trunk-MacOSX/solr/build/solr-core/test/J0/./org.apache.solr.cloud.BasicDistributedZk2Test-jetty1-1360016238185/'
[junit4:junit4]   2> 4964 T4702 oasc.SolrResourceLoader.<init> new SolrResourceLoader for directory: '/Users/jenkins/jenkins-slave/workspace/Lucene-Solr-trunk-MacOSX/solr/build/solr-core/test/J0/./org.apache.solr.cloud.BasicDistributedZk2Test-jetty1-1360016238185/'
[junit4:junit4]   2> 5000 T4702 oashc.HttpShardHandlerFactory.getParameter Setting socketTimeout to: 60000
[junit4:junit4]   2> 5001 T4702 oashc.HttpShardHandlerFactory.getParameter Setting urlScheme to: http://
[junit4:junit4]   2> 5001 T4702 oashc.HttpShardHandlerFactory.getParameter Setting connTimeout to: 15000
[junit4:junit4]   2> 5002 T4702 oashc.HttpShardHandlerFactory.getParameter Setting maxConnectionsPerHost to: 20
[junit4:junit4]   2> 5003 T4702 oashc.HttpShardHandlerFactory.getParameter Setting corePoolSize to: 0
[junit4:junit4]   2> 5003 T4702 oashc.HttpShardHandlerFactory.getParameter Setting maximumPoolSize to: 2147483647
[junit4:junit4]   2> 5004 T4702 oashc.HttpShardHandlerFactory.getParameter Setting maxThreadIdleTime to: 5
[junit4:junit4]   2> 5004 T4702 oashc.HttpShardHandlerFactory.getParameter Setting sizeOfQueue to: -1
[junit4:junit4]   2> 5005 T4702 oashc.HttpShardHandlerFactory.getParameter Setting fairnessPolicy to: false
[junit4:junit4]   2> 5005 T4702 oascsi.HttpClientUtil.createClient Creating new http client, config:maxConnectionsPerHost=20&maxConnections=10000&socketTimeout=60000&connTimeout=15000&retry=false
[junit4:junit4]   2> 5017 T4702 oasc.CoreContainer.load Registering Log Listener
[junit4:junit4]   2> 5033 T4702 oasc.CoreContainer.initZooKeeper Zookeeper client=127.0.0.1:50602/solr
[junit4:junit4]   2> 5033 T4702 oasc.ZkController.checkChrootPath zkHost includes chroot
[junit4:junit4]   2> 5034 T4702 oaz.ZooKeeper.<init> Initiating client connection, connectString=127.0.0.1:50602 sessionTimeout=60000 watcher=org.apache.solr.common.cloud.ConnectionManager@d4c2f9a
[junit4:junit4]   2> 5035 T4702 oascc.ConnectionManager.waitForConnected Waiting for client to connect to ZooKeeper
[junit4:junit4]   2> 5036 T4740 oaz.ClientCnxn$SendThread.logStartConnect Opening socket connection to server localhost/127.0.0.1:50602. Will not attempt to authenticate using SASL (access denied ("javax.security.auth.AuthPermission" "getLoginConfiguration"))
[junit4:junit4]   2> 5037 T4740 oaz.ClientCnxn$SendThread.primeConnection Socket connection established to localhost/127.0.0.1:50602, initiating session
[junit4:junit4]   2> 5037 T4704 oazs.NIOServerCnxnFactory.run Accepted socket connection from /127.0.0.1:50610
[junit4:junit4]   2> 5037 T4704 oazs.ZooKeeperServer.processConnectRequest Client attempting to establish new session at /127.0.0.1:50610
[junit4:junit4]   2> 5038 T4706 oazs.ZooKeeperServer.finishSessionInit Established session 0x13ca748d3c60005 with negotiated timeout 20000 for client /127.0.0.1:50610
[junit4:junit4]   2> 5039 T4740 oaz.ClientCnxn$SendThread.onConnected Session establishment complete on server localhost/127.0.0.1:50602, sessionid = 0x13ca748d3c60005, negotiated timeout = 20000
[junit4:junit4]   2> 5039 T4741 oascc.ConnectionManager.process Watcher org.apache.solr.common.cloud.ConnectionManager@d4c2f9a name:ZooKeeperConnection Watcher:127.0.0.1:50602 got event WatchedEvent state:SyncConnected type:None path:null path:null type:None
[junit4:junit4]   2> 5039 T4702 oascc.ConnectionManager.waitForConnected Client is connected to ZooKeeper
[junit4:junit4]   2> 5041 T4707 oazs.PrepRequestProcessor.pRequest2Txn Processed session termination for sessionid: 0x13ca748d3c60005
[junit4:junit4]   2> 5042 T4704 oazs.NIOServerCnxn.closeSock Closed socket connection for client /127.0.0.1:50610 which had sessionid 0x13ca748d3c60005
[junit4:junit4]   2> 5042 T4741 oaz.ClientCnxn$EventThread.run EventThread shut down
[junit4:junit4]   2> 5042 T4702 oaz.ZooKeeper.close Session: 0x13ca748d3c60005 closed
[junit4:junit4]   2> 5043 T4702 oascsi.HttpClientUtil.createClient Creating new http client, config:maxConnections=500&maxConnectionsPerHost=16&socketTimeout=60000&connTimeout=15000
[junit4:junit4]   2> 5047 T4702 oaz.ZooKeeper.<init> Initiating client connection, connectString=127.0.0.1:50602/solr sessionTimeout=30000 watcher=org.apache.solr.common.cloud.ConnectionManager@51be97a2
[junit4:junit4]   2> 5049 T4742 oaz.ClientCnxn$SendThread.logStartConnect Opening socket connection to server localhost/127.0.0.1:50602. Will not attempt to authenticate using SASL (access denied ("javax.security.auth.AuthPermission" "getLoginConfiguration"))
[junit4:junit4]   2> 5048 T4702 oascc.ConnectionManager.waitForConnected Waiting for client to connect to ZooKeeper
[junit4:junit4]   2> 5049 T4742 oaz.ClientCnxn$SendThread.primeConnection Socket connection established to localhost/127.0.0.1:50602, initiating session
[junit4:junit4]   2> 5050 T4704 oazs.NIOServerCnxnFactory.run Accepted socket connection from /127.0.0.1:50611
[junit4:junit4]   2> 5050 T4704 oazs.ZooKeeperServer.processConnectRequest Client attempting to establish new session at /127.0.0.1:50611
[junit4:junit4]   2> 5051 T4706 oazs.ZooKeeperServer.finishSessionInit Established session 0x13ca748d3c60006 with negotiated timeout 20000 for client /127.0.0.1:50611
[junit4:junit4]   2> 5051 T4742 oaz.ClientCnxn$SendThread.onConnected Session establishment complete on server localhost/127.0.0.1:50602, sessionid = 0x13ca748d3c60006, negotiated timeout = 20000
[junit4:junit4]   2> 5052 T4743 oascc.ConnectionManager.process Watcher org.apache.solr.common.cloud.ConnectionManager@51be97a2 name:ZooKeeperConnection Watcher:127.0.0.1:50602/solr got event WatchedEvent state:SyncConnected type:None path:null path:null type:None
[junit4:junit4]   2> 5052 T4702 oascc.ConnectionManager.waitForConnected Client is connected to ZooKeeper
[junit4:junit4]   2> 5053 T4707 oazs.PrepRequestProcessor.pRequest Got user-level KeeperException when processing sessionid:0x13ca748d3c60006 type:create cxid:0x1 zxid:0x49 txntype:-1 reqpath:n/a Error Path:/solr/overseer Error:KeeperErrorCode = NodeExists for /solr/overseer
[junit4:junit4]   2> 5054 T4707 oazs.PrepRequestProcessor.pRequest Got user-level KeeperException when processing sessionid:0x13ca748d3c60006 type:create cxid:0x2 zxid:0x4a txntype:-1 reqpath:n/a Error Path:/solr/overseer Error:KeeperErrorCode = NodeExists for /solr/overseer
[junit4:junit4]   2> 5056 T4702 oasc.ZkController.createEphemeralLiveNode Register node as live in ZooKeeper:/live_nodes/127.0.0.1:50609__
[junit4:junit4]   2> 5057 T4707 oazs.PrepRequestProcessor.pRequest Got user-level KeeperException when processing sessionid:0x13ca748d3c60006 type:delete cxid:0x4 zxid:0x4b txntype:-1 reqpath:n/a Error Path:/solr/live_nodes/127.0.0.1:50609__ Error:KeeperErrorCode = NoNode for /solr/live_nodes/127.0.0.1:50609__
[junit4:junit4]   2> 5058 T4702 oascc.SolrZkClient.makePath makePath: /live_nodes/127.0.0.1:50609__
[junit4:junit4]   2> 5061 T4724 oascc.ZkStateReader$2.process A cluster state change: WatchedEvent state:SyncConnected type:NodeChildrenChanged path:/live_nodes, has occurred - updating... (live nodes size: 1)
[junit4:junit4]   2> 5062 T4730 oascc.ZkStateReader$3.process Updating live nodes... (2)
[junit4:junit4]   2> 5064 T4724 oascc.ZkStateReader$3.process Updating live nodes... (2)
[junit4:junit4]   2> 5069 T4702 oascc.ZkStateReader.createClusterStateWatchersAndUpdate Updating cluster state from ZooKeeper... 
[junit4:junit4]   2> 5077 T4744 oasc.CoreContainer.create Creating SolrCore 'collection1' using instanceDir: /Users/jenkins/jenkins-slave/workspace/Lucene-Solr-trunk-MacOSX/solr/build/solr-core/test/J0/./org.apache.solr.cloud.BasicDistributedZk2Test-jetty1-1360016238185/collection1
[junit4:junit4]   2> 5077 T4744 oasc.ZkController.createCollectionZkNode Check for collection zkNode:collection1
[junit4:junit4]   2> 5078 T4744 oasc.ZkController.createCollectionZkNode Collection zkNode exists
[junit4:junit4]   2> 5078 T4744 oasc.ZkController.readConfigName Load collection config from:/collections/collection1
[junit4:junit4]   2> 5080 T4744 oasc.SolrResourceLoader.<init> new SolrResourceLoader for directory: '/Users/jenkins/jenkins-slave/workspace/Lucene-Solr-trunk-MacOSX/solr/build/solr-core/test/J0/./org.apache.solr.cloud.BasicDistributedZk2Test-jetty1-1360016238185/collection1/'
[junit4:junit4]   2> 5081 T4744 oasc.SolrResourceLoader.replaceClassLoader Adding 'file:/Users/jenkins/jenkins-slave/workspace/Lucene-Solr-trunk-MacOSX/solr/build/solr-core/test/J0/org.apache.solr.cloud.BasicDistributedZk2Test-jetty1-1360016238185/collection1/lib/classes/' to classloader
[junit4:junit4]   2> 5081 T4744 oasc.SolrResourceLoader.replaceClassLoader Adding 'file:/Users/jenkins/jenkins-slave/workspace/Lucene-Solr-trunk-MacOSX/solr/build/solr-core/test/J0/org.apache.solr.cloud.BasicDistributedZk2Test-jetty1-1360016238185/collection1/lib/README' to classloader
[junit4:junit4]   2> 5124 T4744 oasc.SolrConfig.<init> Using Lucene MatchVersion: LUCENE_50
[junit4:junit4]   2> 5198 T4744 oasc.SolrConfig.<init> Loaded SolrConfig: solrconfig.xml
[junit4:junit4]   2> 5199 T4744 oass.IndexSchema.readSchema Reading Solr Schema
[junit4:junit4]   2> 5206 T4744 oass.IndexSchema.readSchema Schema name=test
[junit4:junit4]   2> 5712 T4744 oass.OpenExchangeRatesOrgProvider.init Initialized with rates=open-exchange-rates.json, refreshInterval=1440.
[junit4:junit4]   2> 5721 T4744 oass.IndexSchema.readSchema default search field in schema is text
[junit4:junit4]   2> 5724 T4744 oass.IndexSchema.readSchema unique key field: id
[junit4:junit4]   2> 5744 T4744 oass.FileExchangeRateProvider.reload Reloading exchange rates from file currency.xml
[junit4:junit4]   2> 5749 T4744 oass.FileExchangeRateProvider.reload Reloading exchange rates from file currency.xml
[junit4:junit4]   2> 5754 T4744 oass.OpenExchangeRatesOrgProvider.reload Reloading exchange rates from open-exchange-rates.json
[junit4:junit4]   2> 5756 T4744 oass.OpenExchangeRatesOrgProvider.reload Reloading exchange rates from open-exchange-rates.json
[junit4:junit4]   2> 5757 T4744 oasc.SolrCore.<init> [collection1] Opening new SolrCore at /Users/jenkins/jenkins-slave/workspace/Lucene-Solr-trunk-MacOSX/solr/build/solr-core/test/J0/./org.apache.solr.cloud.BasicDistributedZk2Test-jetty1-1360016238185/collection1/, dataDir=./org.apache.solr.cloud.BasicDistributedZk2Test-1360016233408/jetty1/
[junit4:junit4]   2> 5758 T4744 oasc.JmxMonitoredMap.<init> JMX monitoring is enabled. Adding Solr mbeans to JMX Server: com.sun.jmx.mbeanserver.JmxMBeanServer@4506213e
[junit4:junit4]   2> 5758 T4744 oasc.SolrCore.initDirectoryFactory solr.StandardDirectoryFactory
[junit4:junit4]   2> 5759 T4744 oasc.CachingDirectoryFactory.get return new directory for /Users/jenkins/jenkins-slave/workspace/Lucene-Solr-trunk-MacOSX/solr/build/solr-core/test/J0/./org.apache.solr.cloud.BasicDistributedZk2Test-1360016233408/jetty1 forceNew:false
[junit4:junit4]   2> 5759 T4744 oasc.CachingDirectoryFactory.close Releasing directory:/Users/jenkins/jenkins-slave/workspace/Lucene-Solr-trunk-MacOSX/solr/build/solr-core/test/J0/./org.apache.solr.cloud.BasicDistributedZk2Test-1360016233408/jetty1
[junit4:junit4]   2> 5760 T4744 oasc.SolrCore.getNewIndexDir New index directory detected: old=null new=./org.apache.solr.cloud.BasicDistributedZk2Test-1360016233408/jetty1/index/
[junit4:junit4]   2> 5760 T4744 oasc.SolrCore.initIndex WARNING [collection1] Solr index directory './org.apache.solr.cloud.BasicDistributedZk2Test-1360016233408/jetty1/index' doesn't exist. Creating new index...
[junit4:junit4]   2> 5761 T4744 oasc.CachingDirectoryFactory.get return new directory for /Users/jenkins/jenkins-slave/workspace/Lucene-Solr-trunk-MacOSX/solr/build/solr-core/test/J0/./org.apache.solr.cloud.BasicDistributedZk2Test-1360016233408/jetty1/index forceNew:false
[junit4:junit4]   2> 5765 T4744 oasc.SolrDeletionPolicy.onCommit SolrDeletionPolicy.onCommit: commits:num=1
[junit4:junit4]   2> 		commit{dir=RateLimitedDirectoryWrapper(org.apache.lucene.store.NIOFSDirectory@/Users/jenkins/jenkins-slave/workspace/Lucene-Solr-trunk-MacOSX/solr/build/solr-core/test/J0/org.apache.solr.cloud.BasicDistributedZk2Test-1360016233408/jetty1/index lockFactory=org.apache.lucene.store.NativeFSLockFactory@47e85781),segFN=segments_1,generation=1,filenames=[segments_1]
[junit4:junit4]   2> 5766 T4744 oasc.SolrDeletionPolicy.updateCommits newest commit = 1[segments_1]
[junit4:junit4]   2> 5767 T4744 oasc.CachingDirectoryFactory.close Releasing directory:/Users/jenkins/jenkins-slave/workspace/Lucene-Solr-trunk-MacOSX/solr/build/solr-core/test/J0/./org.apache.solr.cloud.BasicDistributedZk2Test-1360016233408/jetty1/index
[junit4:junit4]   2> 5767 T4744 oasc.SolrCore.initWriters created xml: solr.XMLResponseWriter
[junit4:junit4]   2> 5770 T4744 oasup.UpdateRequestProcessorChain.init inserting DistributedUpdateProcessorFactory into updateRequestProcessorChain "dedupe"
[junit4:junit4]   2> 5770 T4744 oasup.UpdateRequestProcessorChain.init inserting DistributedUpdateProcessorFactory into updateRequestProcessorChain "dedupe-allfields"
[junit4:junit4]   2> 5771 T4744 oasup.UpdateRequestProcessorChain.init inserting DistributedUpdateProcessorFactory into updateRequestProcessorChain "stored_sig"
[junit4:junit4]   2> 5771 T4744 oasup.UpdateRequestProcessorChain.init inserting DistributedUpdateProcessorFactory into updateRequestProcessorChain "uniq-fields"
[junit4:junit4]   2> 5772 T4744 oasup.UpdateRequestProcessorChain.init inserting DistributedUpdateProcessorFactory into updateRequestProcessorChain "distrib-dup-test-chain-implicit"
[junit4:junit4]   2> 5772 T4744 oasc.RequestHandlers.initHandlersFromConfig adding lazy requestHandler: solr.ReplicationHandler
[junit4:junit4]   2> 5774 T4744 oasc.RequestHandlers.initHandlersFromConfig created /replication: solr.ReplicationHandler
[junit4:junit4]   2> 5774 T4744 oasc.RequestHandlers.initHandlersFromConfig created standard: solr.StandardRequestHandler
[junit4:junit4]   2> 5775 T4744 oasc.RequestHandlers.initHandlersFromConfig created /get: solr.RealTimeGetHandler
[junit4:junit4]   2> 5775 T4744 oasc.RequestHandlers.initHandlersFromConfig created dismax: solr.SearchHandler
[junit4:junit4]   2> 5776 T4744 oasc.RequestHandlers.initHandlersFromConfig created mock: org.apache.solr.core.MockQuerySenderListenerReqHandler
[junit4:junit4]   2> 5777 T4744 oasc.RequestHandlers.initHandlersFromConfig created /admin/: org.apache.solr.handler.admin.AdminHandlers
[junit4:junit4]   2> 5777 T4744 oasc.RequestHandlers.initHandlersFromConfig created defaults: solr.StandardRequestHandler
[junit4:junit4]   2> 5777 T4744 oasc.RequestHandlers.initHandlersFromConfig adding lazy requestHandler: solr.StandardRequestHandler
[junit4:junit4]   2> 5778 T4744 oasc.RequestHandlers.initHandlersFromConfig created lazy: solr.StandardRequestHandler
[junit4:junit4]   2> 5778 T4744 oasc.RequestHandlers.initHandlersFromConfig created /update: solr.UpdateRequestHandler
[junit4:junit4]   2> 5779 T4744 oasc.RequestHandlers.initHandlersFromConfig created /terms: org.apache.solr.handler.component.SearchHandler
[junit4:junit4]   2> 5779 T4744 oasc.RequestHandlers.initHandlersFromConfig created spellCheckCompRH: org.apache.solr.handler.component.SearchHandler
[junit4:junit4]   2> 5780 T4744 oasc.RequestHandlers.initHandlersFromConfig created spellCheckCompRH_Direct: org.apache.solr.handler.component.SearchHandler
[junit4:junit4]   2> 5780 T4744 oasc.RequestHandlers.initHandlersFromConfig created spellCheckWithWordbreak: org.apache.solr.handler.component.SearchHandler
[junit4:junit4]   2> 5781 T4744 oasc.RequestHandlers.initHandlersFromConfig created spellCheckWithWordbreak_Direct: org.apache.solr.handler.component.SearchHandler
[junit4:junit4]   2> 5782 T4744 oasc.RequestHandlers.initHandlersFromConfig created spellCheckCompRH1: org.apache.solr.handler.component.SearchHandler
[junit4:junit4]   2> 5782 T4744 oasc.RequestHandlers.initHandlersFromConfig created mltrh: org.apache.solr.handler.component.SearchHandler
[junit4:junit4]   2> 5783 T4744 oasc.RequestHandlers.initHandlersFromConfig created tvrh: org.apache.solr.handler.component.SearchHandler
[junit4:junit4]   2> 5783 T4744 oasc.RequestHandlers.initHandlersFromConfig created /mlt: solr.MoreLikeThisHandler
[junit4:junit4]   2> 5784 T4744 oasc.RequestHandlers.initHandlersFromConfig created /debug/dump: solr.DumpRequestHandler
[junit4:junit4]   2> 5789 T4744 oashl.XMLLoader.init xsltCacheLifetimeSeconds=60
[junit4:junit4]   2> 5792 T4744 oasc.SolrCore.initDeprecatedSupport WARNING solrconfig.xml uses deprecated <admin/gettableFiles>, Please update your config to use the ShowFileRequestHandler.
[junit4:junit4]   2> 5793 T4744 oasc.SolrCore.initDeprecatedSupport WARNING adding ShowFileRequestHandler with hidden files: [SCHEMA.XML, OLD_SYNONYMS.TXT, STOPWORDS.TXT, PROTWORDS.TXT, OPEN-EXCHANGE-RATES.JSON, SYNONYMS.TXT, CURRENCY.XML, MAPPING-ISOLATIN1ACCENT.TXT]
[junit4:junit4]   2> 5795 T4744 oasc.CachingDirectoryFactory.close Releasing directory:/Users/jenkins/jenkins-slave/workspace/Lucene-Solr-trunk-MacOSX/solr/build/solr-core/test/J0/./org.apache.solr.cloud.BasicDistributedZk2Test-1360016233408/jetty1
[junit4:junit4]   2> 5797 T4744 oass.SolrIndexSearcher.<init> Opening Searcher@a167fbb main
[junit4:junit4]   2> 5797 T4744 oasu.CommitTracker.<init> Hard AutoCommit: disabled
[junit4:junit4]   2> 5798 T4744 oasu.CommitTracker.<init> Soft AutoCommit: disabled
[junit4:junit4]   2> 5798 T4744 oashc.SpellCheckComponent.inform Initializing spell checkers
[junit4:junit4]   2> 5804 T4744 oass.DirectSolrSpellChecker.init init: {name=direct,classname=DirectSolrSpellChecker,field=lowerfilt,minQueryLength=3}
[junit4:junit4]   2> 5839 T4745 oasc.SolrCore.registerSearcher [collection1] Registered new searcher Searcher@a167fbb main{StandardDirectoryReader(segments_1:1)}
[junit4:junit4]   2> 5843 T4744 oasc.ZkController.publish publishing core=collection1 state=down
[junit4:junit4]   2> 5844 T4744 oasc.ZkController.publish numShards not found on descriptor - reading it from system property
[junit4:junit4]   2> 6215 T4725 oascc.ZkStateReader.updateClusterState Updating cloud state from ZooKeeper... 
[junit4:junit4]   2> 6217 T4725 oasc.Overseer$ClusterStateUpdater.updateState Update state numShards=1 message={
[junit4:junit4]   2> 	  "operation":"state",
[junit4:junit4]   2> 	  "numShards":"1",
[junit4:junit4]   2> 	  "shard":"shard1",
[junit4:junit4]   2> 	  "roles":null,
[junit4:junit4]   2> 	  "state":"active",
[junit4:junit4]   2> 	  "core":"collection1",
[junit4:junit4]   2> 	  "collection":"control_collection",
[junit4:junit4]   2> 	  "node_name":"127.0.0.1:50605__",
[junit4:junit4]   2> 	  "base_url":"http://127.0.0.1:50605/_"}
[junit4:junit4]   2> 6227 T4725 oasc.Overseer$ClusterStateUpdater.updateState Update state numShards=2 message={
[junit4:junit4]   2> 	  "operation":"state",
[junit4:junit4]   2> 	  "numShards":"2",
[junit4:junit4]   2> 	  "shard":null,
[junit4:junit4]   2> 	  "roles":null,
[junit4:junit4]   2> 	  "state":"down",
[junit4:junit4]   2> 	  "core":"collection1",
[junit4:junit4]   2> 	  "collection":"collection1",
[junit4:junit4]   2> 	  "node_name":"127.0.0.1:50609__",
[junit4:junit4]   2> 	  "base_url":"http://127.0.0.1:50609/_"}
[junit4:junit4]   2> 6227 T4725 oasc.Overseer$ClusterStateUpdater.createCollection Create collection collection1 with numShards 2
[junit4:junit4]   2> 6227 T4725 oasc.Overseer$ClusterStateUpdater.updateState Assigning new node to shard shard=shard1
[junit4:junit4]   2> 6234 T4743 oascc.ZkStateReader$2.process A cluster state change: WatchedEvent state:SyncConnected type:NodeDataChanged path:/clusterstate.json, has occurred - updating... (live nodes size: 2)
[junit4:junit4]   2> 6234 T4730 oascc.ZkStateReader$2.process A cluster state change: WatchedEvent state:SyncConnected type:NodeDataChanged path:/clusterstate.json, has occurred - updating... (live nodes size: 2)
[junit4:junit4]   2> 6234 T4724 oascc.ZkStateReader$2.process A cluster state change: WatchedEvent state:SyncConnected type:NodeDataChanged path:/clusterstate.json, has occurred - updating... (live nodes size: 2)
[junit4:junit4]   2> 6847 T4744 oasc.CoreContainer.registerCore registering core: collection1
[junit4:junit4]   2> 6848 T4744 oasc.ZkController.register Register replica - core:collection1 address:http://127.0.0.1:50609/_ collection:collection1 shard:shard1
[junit4:junit4]   2> 6851 T4744 oascc.SolrZkClient.makePath makePath: /collections/collection1/leader_elect/shard1/election
[junit4:junit4]   2> 6888 T4707 oazs.PrepRequestProcessor.pRequest Got user-level KeeperException when processing sessionid:0x13ca748d3c60006 type:delete cxid:0x43 zxid:0x5a txntype:-1 reqpath:n/a Error Path:/solr/collections/collection1/leaders Error:KeeperErrorCode = NoNode for /solr/collections/collection1/leaders
[junit4:junit4]   2> 6891 T4744 oasc.ShardLeaderElectionContext.runLeaderProcess Running the leader process.
[junit4:junit4]   2> 6893 T4707 oazs.PrepRequestProcessor.pRequest Got user-level KeeperException when processing sessionid:0x13ca748d3c60006 type:create cxid:0x44 zxid:0x5b txntype:-1 reqpath:n/a Error Path:/solr/overseer Error:KeeperErrorCode = NodeExists for /solr/overseer
[junit4:junit4]   2> 6896 T4744 oasc.ShardLeaderElectionContext.waitForReplicasToComeUp Enough replicas found to continue.
[junit4:junit4]   2> 6896 T4744 oasc.ShardLeaderElectionContext.runLeaderProcess I may be the new leader - try and sync
[junit4:junit4]   2> 6897 T4744 oasc.SyncStrategy.sync Sync replicas to http://127.0.0.1:50609/_/collection1/
[junit4:junit4]   2> 6897 T4744 oasc.SyncStrategy.syncReplicas Sync Success - now sync replicas to me
[junit4:junit4]   2> 6897 T4744 oasc.SyncStrategy.syncToMe http://127.0.0.1:50609/_/collection1/ has no replicas
[junit4:junit4]   2> 6898 T4744 oasc.ShardLeaderElectionContext.runLeaderProcess I am the new leader: http://127.0.0.1:50609/_/collection1/
[junit4:junit4]   2> 6898 T4744 oascc.SolrZkClient.makePath makePath: /collections/collection1/leaders/shard1
[junit4:junit4]   2> 6906 T4707 oazs.PrepRequestProcessor.pRequest Got user-level KeeperException when processing sessionid:0x13ca748d3c60006 type:create cxid:0x4e zxid:0x5f txntype:-1 reqpath:n/a Error Path:/solr/overseer Error:KeeperErrorCode = NodeExists for /solr/overseer
[junit4:junit4]   2> 7752 T4725 oascc.ZkStateReader.updateClusterState Updating cloud state from ZooKeeper... 
[junit4:junit4]   2> 7784 T4730 oascc.ZkStateReader$2.process A cluster state change: WatchedEvent state:SyncConnected type:NodeDataChanged path:/clusterstate.json, has occurred - updating... (live nodes size: 2)
[junit4:junit4]   2> 7785 T4724 oascc.ZkStateReader$2.process A cluster state change: WatchedEvent state:SyncConnected type:NodeDataChanged path:/clusterstate.json, has occurred - updating... (live nodes size: 2)
[junit4:junit4]   2> 7785 T4743 oascc.ZkStateReader$2.process A cluster state change: WatchedEvent state:SyncConnected type:NodeDataChanged path:/clusterstate.json, has occurred - updating... (live nodes size: 2)
[junit4:junit4]   2> 7831 T4744 oasc.ZkController.register We are http://127.0.0.1:50609/_/collection1/ and leader is http://127.0.0.1:50609/_/collection1/
[junit4:junit4]   2> 7832 T4744 oasc.ZkController.register No LogReplay needed for core=collection1 baseURL=http://127.0.0.1:50609/_
[junit4:junit4]   2> 7833 T4744 oasc.ZkController.checkRecovery I am the leader, no recovery necessary
[junit4:junit4]   2> 7834 T4744 oasc.ZkController.publish publishing core=collection1 state=active
[junit4:junit4]   2> 7834 T4744 oasc.ZkController.publish numShards not found on descriptor - reading it from system property
[junit4:junit4]   2> 7840 T4744 oascc.ZkStateReader.updateClusterState Updating cloud state from ZooKeeper... 
[junit4:junit4]   2> 7844 T4702 oass.SolrDispatchFilter.init user.dir=/Users/jenkins/jenkins-slave/workspace/Lucene-Solr-trunk-MacOSX/solr/build/solr-core/test/J0
[junit4:junit4]   2> 7845 T4702 oass.SolrDispatchFilter.init SolrDispatchFilter.init() done
[junit4:junit4]   2> 7847 T4702 oascsi.HttpClientUtil.createClient Creating new http client, config:maxConnections=128&maxConnectionsPerHost=32&followRedirects=false
[junit4:junit4]   2> 8052 T4702 oejs.Server.doStart jetty-8.1.8.v20121106
[junit4:junit4]   2> 8057 T4702 oejs.AbstractConnector.doStart Started SelectChannelConnector@127.0.0.1:50612
[junit4:junit4]   2> 8058 T4702 oass.SolrDispatchFilter.init SolrDispatchFilter.init()
[junit4:junit4]   2> 8058 T4702 oasc.SolrResourceLoader.locateSolrHome JNDI not configured for solr (NoInitialContextEx)
[junit4:junit4]   2> 8059 T4702 oasc.SolrResourceLoader.locateSolrHome using system property solr.solr.home: /Users/jenkins/jenkins-slave/workspace/Lucene-Solr-trunk-MacOSX/solr/build/solr-core/test/J0/./org.apache.solr.cloud.BasicDistributedZk2Test-jetty2-1360016241263
[junit4:junit4]   2> 8059 T4702 oasc.CoreContainer$Initializer.initialize looking for solr.xml: /Users/jenkins/jenkins-slave/workspace/Lucene-Solr-trunk-MacOSX/solr/build/solr-core/test/J0/./org.apache.solr.cloud.BasicDistributedZk2Test-jetty2-1360016241263/solr.xml
[junit4:junit4]   2> 8060 T4702 oasc.CoreContainer.<init> New CoreContainer 569690408
[junit4:junit4]   2> 8061 T4702 oasc.CoreContainer.load Loading CoreContainer using Solr Home: '/Users/jenkins/jenkins-slave/workspace/Lucene-Solr-trunk-MacOSX/solr/build/solr-core/test/J0/./org.apache.solr.cloud.BasicDistributedZk2Test-jetty2-1360016241263/'
[junit4:junit4]   2> 8061 T4702 oasc.SolrResourceLoader.<init> new SolrResourceLoader for directory: '/Users/jenkins/jenkins-slave/workspace/Lucene-Solr-trunk-MacOSX/solr/build/solr-core/test/J0/./org.apache.solr.cloud.BasicDistributedZk2Test-jetty2-1360016241263/'
[junit4:junit4]   2> 8096 T4702 oashc.HttpShardHandlerFactory.getParameter Setting socketTimeout to: 60000
[junit4:junit4]   2> 8097 T4702 oashc.HttpShardHandlerFactory.getParameter Setting urlScheme to: http://
[junit4:junit4]   2> 8097 T4702 oashc.HttpShardHandlerFactory.getParameter Setting connTimeout to: 15000
[junit4:junit4]   2> 8098 T4702 oashc.HttpShardHandlerFactory.getParameter Setting maxConnectionsPerHost to: 20
[junit4:junit4]   2> 8099 T4702 oashc.HttpShardHandlerFactory.getParameter Setting corePoolSize to: 0
[junit4:junit4]   2> 8099 T4702 oashc.HttpShardHandlerFactory.getParameter Setting maximumPoolSize to: 2147483647
[junit4:junit4]   2> 8100 T4702 oashc.HttpShardHandlerFactory.getParameter Setting maxThreadIdleTime to: 5
[junit4:junit4]   2> 8100 T4702 oashc.HttpShardHandlerFactory.getParameter Setting sizeOfQueue to: -1
[junit4:junit4]   2> 8101 T4702 oashc.HttpShardHandlerFactory.getParameter Setting fairnessPolicy to: false
[junit4:junit4]   2> 8101 T4702 oascsi.HttpClientUtil.createClient Creating new http client, config:maxConnectionsPerHost=20&maxConnections=10000&socketTimeout=60000&connTimeout=15000&retry=false
[junit4:junit4]   2> 8114 T4702 oasc.CoreContainer.load Registering Log Listener
[junit4:junit4]   2> 8132 T4702 oasc.CoreContainer.initZooKeeper Zookeeper client=127.0.0.1:50602/solr
[junit4:junit4]   2> 8134 T4702 oasc.ZkController.checkChrootPath zkHost includes chroot
[junit4:junit4]   2> 8135 T4702 oaz.ZooKeeper.<init> Initiating client connection, connectString=127.0.0.1:50602 sessionTimeout=60000 watcher=org.apache.solr.common.cloud.ConnectionManager@6bf76ed6
[junit4:junit4]   2> 8136 T4702 oascc.ConnectionManager.waitForConnected Waiting for client to connect to ZooKeeper
[junit4:junit4]   2> 8136 T4755 oaz.ClientCnxn$SendThread.logStartConnect Opening socket connection to server localhost/127.0.0.1:50602. Will not attempt to authenticate using SASL (access denied ("javax.security.auth.AuthPermission" "getLoginConfiguration"))
[junit4:junit4]   2> 8137 T4755 oaz.ClientCnxn$SendThread.primeConnection Socket connection established to localhost/127.0.0.1:50602, initiating session
[junit4:junit4]   2> 8137 T4704 oazs.NIOServerCnxnFactory.run Accepted socket connection from /127.0.0.1:50613
[junit4:junit4]   2> 8138 T4704 oazs.ZooKeeperServer.processConnectRequest Client attempting to establish new session at /127.0.0.1:50613
[junit4:junit4]   2> 8139 T4706 oazs.ZooKeeperServer.finishSessionInit Established session 0x13ca748d3c60007 with negotiated timeout 20000 for client /127.0.0.1:50613
[junit4:junit4]   2> 8139 T4755 oaz.ClientCnxn$SendThread.onConnected Session establishment complete on server localhost/127.0.0.1:50602, sessionid = 0x13ca748d3c60007, negotiated timeout = 20000
[junit4:junit4]   2> 8139 T4756 oascc.ConnectionManager.process Watcher org.apache.solr.common.cloud.ConnectionManager@6bf76ed6 name:ZooKeeperConnection Watcher:127.0.0.1:50602 got event WatchedEvent state:SyncConnected type:None path:null path:null type:None
[junit4:junit4]   2> 8140 T4702 oascc.ConnectionManager.waitForConnected Client is connected to ZooKeeper
[junit4:junit4]   2> 8142 T4707 oazs.PrepRequestProcessor.pRequest2Txn Processed session termination for sessionid: 0x13ca748d3c60007
[junit4:junit4]   2> 8143 T4704 oazs.NIOServerCnxn.closeSock Closed socket connection for client /127.0.0.1:50613 which had sessionid 0x13ca748d3c60007
[junit4:junit4]   2> 8143 T4756 oaz.ClientCnxn$EventThread.run EventThread shut down
[junit4:junit4]   2> 8143 T4702 oaz.ZooKeeper.close Session: 0x13ca748d3c60007 closed
[junit4:junit4]   2> 8144 T4702 oascsi.HttpClientUtil.createClient Creating new http client, config:maxConnections=500&maxConnectionsPerHost=16&socketTimeout=60000&connTimeout=15000
[junit4:junit4]   2> 8149 T4702 oaz.ZooKeeper.<init> Initiating client connection, connectString=127.0.0.1:50602/solr sessionTimeout=30000 watcher=org.apache.solr.common.cloud.ConnectionManager@372a1010
[junit4:junit4]   2> 8150 T4702 oascc.ConnectionManager.waitForConnected Waiting for client to connect to ZooKeeper
[junit4:junit4]   2> 8150 T4757 oaz.ClientCnxn$SendThread.logStartConnect Opening socket connection to server localhost/127.0.0.1:50602. Will not attempt to authenticate using SASL (access denied ("javax.security.auth.AuthPermission" "getLoginConfiguration"))
[junit4:junit4]   2> 8151 T4757 oaz.ClientCnxn$SendThread.primeConnection Socket connection established to localhost/127.0.0.1:50602, initiating session
[junit4:junit4]   2> 8151 T4704 oazs.NIOServerCnxnFactory.run Accepted socket connection from /127.0.0.1:50614
[junit4:junit4]   2> 8152 T4704 oazs.ZooKeeperServer.processConnectRequest Client attempting to establish new session at /127.0.0.1:50614
[junit4:junit4]   2> 8153 T4706 oazs.ZooKeeperServer.finishSessionInit Established session 0x13ca748d3c60008 with negotiated timeout 20000 for client /127.0.0.1:50614
[junit4:junit4]   2> 8153 T4757 oaz.ClientCnxn$SendThread.onConnected Session establishment complete on server localhost/127.0.0.1:50602, sessionid = 0x13ca748d3c60008, negotiated timeout = 20000
[junit4:junit4]   2> 8154 T4758 oascc.ConnectionManager.process Watcher org.apache.solr.common.cloud.ConnectionManager@372a1010 name:ZooKeeperConnection Watcher:127.0.0.1:50602/solr got event WatchedEvent state:SyncConnected type:None path:null path:null type:None
[junit4:junit4]   2> 8154 T4702 oascc.ConnectionManager.waitForConnected Client is connected to ZooKeeper
[junit4:junit4]   2> 8155 T4707 oazs.PrepRequestProcessor.pRequest Got user-level KeeperException when processing sessionid:0x13ca748d3c60008 type:create cxid:0x1 zxid:0x6c txntype:-1 reqpath:n/a Error Path:/solr/overseer Error:KeeperErrorCode = NodeExists for /solr/overseer
[junit4:junit4]   2> 8158 T4707 oazs.PrepRequestProcessor.pRequest Got user-level KeeperException when processing sessionid:0x13ca748d3c60008 type:create cxid:0x2 zxid:0x6d txntype:-1 reqpath:n/a Error Path:/solr/overseer Error:KeeperErrorCode = NodeExists for /solr/overseer
[junit4:junit4]   2> 8160 T4702 oasc.ZkController.createEphemeralLiveNode Register node as live in ZooKeeper:/live_nodes/127.0.0.1:50612__
[junit4:junit4]   2> 8161 T4707 oazs.PrepRequestProcessor.pRequest Got user-level KeeperException when processing sessionid:0x13ca748d3c60008 type:delete cxid:0x4 zxid:0x6e txntype:-1 reqpath:n/a Error Path:/solr/live_nodes/127.0.0.1:50612__ Error:KeeperErrorCode = NoNode for /solr/live_nodes/127.0.0.1:50612__
[junit4:junit4]   2> 8162 T4702 oascc.SolrZkClient.makePath makePath: /live_nodes/127.0.0.1:50612__
[junit4:junit4]   2> 8165 T4743 oascc.ZkStateReader$2.process A cluster state change: WatchedEvent state:SyncConnected type:NodeChildrenChanged path:/live_nodes, has occurred - updating... (live nodes size: 2)
[junit4:junit4]   2> 8165 T4724 oascc.ZkStateReader$2.process A cluster state change: WatchedEvent state:SyncConnected type:NodeChildrenChanged path:/live_nodes, has occurred - updating... (live nodes size: 2)
[junit4:junit4]   2> 8166 T4730 oascc.ZkStateReader$3.process Updating live nodes... (3)
[junit4:junit4]   2> 8167 T4730 oascc.ZkStateReader$2.process A cluster state change: WatchedEvent state:SyncConnected type:NodeChildrenChanged path:/live_nodes, has occurred - updating... (live nodes size: 3)
[junit4:junit4]   2> 8169 T4743 oascc.ZkStateReader$3.process Updating live nodes... (3)
[junit4:junit4]   2> 8169 T4724 oascc.ZkStateReader$3.process Updating live nodes... (3)
[junit4:junit4]   2> 8174 T4702 oascc.ZkStateReader.createClusterStateWatchersAndUpdate Updating cluster state from ZooKeeper... 
[junit4:junit4]   2> 8183 T4759 oasc.CoreContainer.create Creating SolrCore 'collection1' using instanceDir: /Users/jenkins/jenkins-slave/workspace/Lucene-Solr-trunk-MacOSX/solr/build/solr-core/test/J0/./org.apache.solr.cloud.BasicDistributedZk2Test-jetty2-1360016241263/collection1
[junit4:junit4]   2> 8183 T4759 oasc.ZkController.createCollectionZkNode Check for collection zkNode:collection1
[junit4:junit4]   2> 8184 T4759 oasc.ZkController.createCollectionZkNode Collection zkNode exists
[junit4:junit4]   2> 8184 T4759 oasc.ZkController.readConfigName Load collection config from:/collections/collection1
[junit4:junit4]   2> 8186 T4759 oasc.SolrResourceLoader.<init> new SolrResourceLoader for directory: '/Users/jenkins/jenkins-slave/workspace/Lucene-Solr-trunk-MacOSX/solr/build/solr-core/test/J0/./org.apache.solr.cloud.BasicDistributedZk2Test-jetty2-1360016241263/collection1/'
[junit4:junit4]   2> 8187 T4759 oasc.SolrResourceLoader.replaceClassLoader Adding 'file:/Users/jenkins/jenkins-slave/workspace/Lucene-Solr-trunk-MacOSX/solr/build/solr-core/test/J0/org.apache.solr.cloud.BasicDistributedZk2Test-jetty2-1360016241263/collection1/lib/classes/' to classloader
[junit4:junit4]   2> 8188 T4759 oasc.SolrResourceLoader.replaceClassLoader Adding 'file:/Users/jenkins/jenkins-slave/workspace/Lucene-Solr-trunk-MacOSX/solr/build/solr-core/test/J0/org.apache.solr.cloud.BasicDistributedZk2Test-jetty2-1360016241263/collection1/lib/README' to classloader
[junit4:junit4]   2> 8233 T4759 oasc.SolrConfig.<init> Using Lucene MatchVersion: LUCENE_50
[junit4:junit4]   2> 8327 T4759 oasc.SolrConfig.<init> Loaded SolrConfig: solrconfig.xml
[junit4:junit4]   2> 8328 T4759 oass.IndexSchema.readSchema Reading Solr Schema
[junit4:junit4]   2> 8336 T4759 oass.IndexSchema.readSchema Schema name=test
[junit4:junit4]   2> 8854 T4759 oass.OpenExchangeRatesOrgProvider.init Initialized with rates=open-exchange-rates.json, refreshInterval=1440.
[junit4:junit4]   2> 8863 T4759 oass.IndexSchema.readSchema default search field in schema is text
[junit4:junit4]   2> 8867 T4759 oass.IndexSchema.readSchema unique key field: id
[junit4:junit4]   2> 8886 T4759 oass.FileExchangeRateProvider.reload Reloading exchange rates from file currency.xml
[junit4:junit4]   2> 8892 T4759 oass.FileExchangeRateProvider.reload Reloading exchange rates from file currency.xml
[junit4:junit4]   2> 8897 T4759 oass.OpenExchangeRatesOrgProvider.reload Reloading exchange rates from open-exchange-rates.json
[junit4:junit4]   2> 8899 T4759 oass.OpenExchangeRatesOrgProvider.reload Reloading exchange rates from open-exchange-rates.json
[junit4:junit4]   2> 8900 T4759 oasc.SolrCore.<init> [collection1] Opening new SolrCore at /Users/jenkins/jenkins-slave/workspace/Lucene-Solr-trunk-MacOSX/solr/build/solr-core/test/J0/./org.apache.solr.cloud.BasicDistributedZk2Test-jetty2-1360016241263/collection1/, dataDir=./org.apache.solr.cloud.BasicDistributedZk2Test-1360016233408/jetty2/
[junit4:junit4]   2> 8901 T4759 oasc.JmxMonitoredMap.<init> JMX monitoring is enabled. Adding Solr mbeans to JMX Server: com.sun.jmx.mbeanserver.JmxMBeanServer@4506213e
[junit4:junit4]   2> 8901 T4759 oasc.SolrCore.initDirectoryFactory solr.StandardDirectoryFactory
[junit4:junit4]   2> 8902 T4759 oasc.CachingDirectoryFactory.get return new directory for /Users/jenkins/jenkins-slave/workspace/Lucene-Solr-trunk-MacOSX/solr/build/solr-core/test/J0/./org.apache.solr.cloud.BasicDistributedZk2Test-1360016233408/jetty2 forceNew:false
[junit4:junit4]   2> 8902 T4759 oasc.CachingDirectoryFactory.close Releasing directory:/Users/jenkins/jenkins-slave/workspace/Lucene-Solr-trunk-MacOSX/solr/build/solr-core/test/J0/./org.apache.solr.cloud.BasicDistributedZk2Test-1360016233408/jetty2
[junit4:junit4]   2> 8903 T4759 oasc.SolrCore.getNewIndexDir New index directory detected: old=null new=./org.apache.solr.cloud.BasicDistributedZk2Test-1360016233408/jetty2/index/
[junit4:junit4]   2> 8903 T4759 oasc.SolrCore.initIndex WARNING [collection1] Solr index directory './org.apache.solr.cloud.BasicDistributedZk2Test-1360016233408/jetty2/index' doesn't exist. Creating new index...
[junit4:junit4]   2> 8904 T4759 oasc.CachingDirectoryFactory.get return new directory for /Users/jenkins/jenkins-slave/workspace/Lucene-Solr-trunk-MacOSX/solr/build/solr-core/test/J0/./org.apache.solr.cloud.BasicDistributedZk2Test-1360016233408/jetty2/index forceNew:false
[junit4:junit4]   2> 8907 T4759 oasc.SolrDeletionPolicy.onCommit SolrDeletionPolicy.onCommit: commits:num=1
[junit4:junit4]   2> 		commit{dir=RateLimitedDirectoryWrapper(org.apache.lucene.store.NIOFSDirectory@/Users/jenkins/jenkins-slave/workspace/Lucene-Solr-trunk-MacOSX/solr/build/solr-core/test/J0/org.apache.solr.cloud.BasicDistributedZk2Test-1360016233408/jetty2/index lockFactory=org.apache.lucene.store.NativeFSLockFactory@739e543b),segFN=segments_1,generation=1,filenames=[segments_1]
[junit4:junit4]   2> 8908 T4759 oasc.SolrDeletionPolicy.updateCommits newest commit = 1[segments_1]
[junit4:junit4]   2> 8908 T4759 oasc.CachingDirectoryFactory.close Releasing directory:/Users/jenkins/jenkins-slave/workspace/Lucene-Solr-trunk-MacOSX/solr/build/solr-core/test/J0/./org.apache.solr.cloud.BasicDistributedZk2Test-1360016233408/jetty2/index
[junit4:junit4]   2> 8909 T4759 oasc.SolrCore.initWriters created xml: solr.XMLResponseWriter
[junit4:junit4]   2> 8911 T4759 oasup.UpdateRequestProcessorChain.init inserting DistributedUpdateProcessorFactory into updateRequestProcessorChain "dedupe"
[junit4:junit4]   2> 8911 T4759 oasup.UpdateRequestProcessorChain.init inserting DistributedUpdateProcessorFactory into updateRequestProcessorChain "dedupe-allfields"
[junit4:junit4]   2> 8912 T4759 oasup.UpdateRequestProcessorChain.init inserting DistributedUpdateProcessorFactory into updateRequestProcessorChain "stored_sig"
[junit4:junit4]   2> 8912 T4759 oasup.UpdateRequestProcessorChain.init inserting DistributedUpdateProcessorFactory into updateRequestProcessorChain "uniq-fields"
[junit4:junit4]   2> 8913 T4759 oasup.UpdateRequestProcessorChain.init inserting DistributedUpdateProcessorFactory into updateRequestProcessorChain "distrib-dup-test-chain-implicit"
[junit4:junit4]   2> 8913 T4759 oasc.RequestHandlers.initHandlersFromConfig adding lazy requestHandler: solr.ReplicationHandler
[junit4:junit4]   2> 8914 T4759 oasc.RequestHandlers.initHandlersFromConfig created /replication: solr.ReplicationHandler
[junit4:junit4]   2> 8914 T4759 oasc.RequestHandlers.initHandlersFromConfig created standard: solr.StandardRequestHandler
[junit4:junit4]   2> 8915 T4759 oasc.RequestHandlers.initHandlersFromConfig created /get: solr.RealTimeGetHandler
[junit4:junit4]   2> 8916 T4759 oasc.RequestHandlers.initHandlersFromConfig created dismax: solr.SearchHandler
[junit4:junit4]   2> 8917 T4759 oasc.RequestHandlers.initHandlersFromConfig created mock: org.apache.solr.core.MockQuerySenderListenerReqHandler
[junit4:junit4]   2> 8917 T4759 oasc.RequestHandlers.initHandlersFromConfig created /admin/: org.apache.solr.handler.admin.AdminHandlers
[junit4:junit4]   2> 8918 T4759 oasc.RequestHandlers.initHandlersFromConfig created defaults: solr.StandardRequestHandler
[junit4:junit4]   2> 8918 T4759 oasc.RequestHandlers.initHandlersFromConfig adding lazy requestHandler: solr.StandardRequestHandler
[junit4:junit4]   2> 8919 T4759 oasc.RequestHandlers.initHandlersFromConfig created lazy: solr.StandardRequestHandler
[junit4:junit4]   2> 8919 T4759 oasc.RequestHandlers.initHandlersFromConfig created /update: solr.UpdateRequestHandler
[junit4:junit4]   2> 8920 T4759 oasc.RequestHandlers.initHandlersFromConfig created /terms: org.apache.solr.handler.component.SearchHandler
[junit4:junit4]   2> 8921 T4759 oasc.RequestHandlers.initHandlersFromConfig created spellCheckCompRH: org.apache.solr.handler.component.SearchHandler
[junit4:junit4]   2> 8921 T4759 oasc.RequestHandlers.initHandlersFromConfig created spellCheckCompRH_Direct: org.apache.solr.handler.component.SearchHandler
[junit4:junit4]   2> 8922 T4759 oasc.RequestHandlers.initHandlersFromConfig created spellCheckWithWordbreak: org.apache.solr.handler.component.SearchHandler
[junit4:junit4]   2> 8923 T4759 oasc.RequestHandlers.initHandlersFromConfig created spellCheckWithWordbreak_Direct: org.apache.solr.handler.component.SearchHandler
[junit4:junit4]   2> 8923 T4759 oasc.RequestHandlers.initHandlersFromConfig created spellCheckCompRH1: org.apache.solr.handler.component.SearchHandler
[junit4:junit4]   2> 8924 T4759 oasc.RequestHandlers.initHandlersFromConfig created mltrh: org.apache.solr.handler.component.SearchHandler
[junit4:junit4]   2> 8925 T4759 oasc.RequestHandlers.initHandlersFromConfig created tvrh: org.apache.solr.handler.component.SearchHandler
[junit4:junit4]   2> 8925 T4759 oasc.RequestHandlers.initHandlersFromConfig created /mlt: solr.MoreLikeThisHandler
[junit4:junit4]   2> 8926 T4759 oasc.RequestHandlers.initHandlersFromConfig created /debug/dump: solr.DumpRequestHandler
[junit4:junit4]   2> 8933 T4759 oashl.XMLLoader.init xsltCacheLifetimeSeconds=60
[junit4:junit4]   2> 8936 T4759 oasc.SolrCore.initDeprecatedSupport WARNING solrconfig.xml uses deprecated <admin/gettableFiles>, Please update your config to use the ShowFileRequestHandler.
[junit4:junit4]   2> 8937 T4759 oasc.SolrCore.initDeprecatedSupport WARNING adding ShowFileRequestHandler with hidden files: [SCHEMA.XML, OLD_SYNONYMS.TXT, STOPWORDS.TXT, PROTWORDS.TXT, OPEN-EXCHANGE-RATES.JSON, SYNONYMS.TXT, CURRENCY.XML, MAPPING-ISOLATIN1ACCENT.TXT]
[junit4:junit4]   2> 8940 T4759 oasc.CachingDirectoryFactory.close Releasing directory:/Users/jenkins/jenkins-slave/workspace/Lucene-Solr-trunk-MacOSX/solr/build/solr-core/test/J0/./org.apache.solr.cloud.BasicDistributedZk2Test-1360016233408/jetty2
[junit4:junit4]   2> 8941 T4759 oass.SolrIndexSearcher.<init> Opening Searcher@a7f17a main
[junit4:junit4]   2> 8942 T4759 oasu.CommitTracker.<init> Hard AutoCommit: disabled
[junit4:junit4]   2> 8942 T4759 oasu.CommitTracker.<init> Soft AutoCommit: disabled
[junit4:junit4]   2> 8943 T4759 oashc.SpellCheckComponent.inform Initializing spell checkers
[junit4:junit4]   2> 8948 T4759 oass.DirectSolrSpellChecker.init init: {name=direct,classname=DirectSolrSpellChecker,field=lowerfilt,minQueryLength=3}
[junit4:junit4]   2> 8977 T4760 oasc.SolrCore.registerSearcher [collection1] Registered new searcher Searcher@a7f17a main{StandardDirectoryReader(segments_1:1)}
[junit4:junit4]   2> 8981 T4759 oasc.ZkController.publish publishing core=collection1 state=down
[junit4:junit4]   2> 8981 T4759 oasc.ZkController.publish numShards not found on descriptor - reading it from system property
[junit4:junit4]   2> 9307 T4725 oascc.ZkStateReader.updateClusterState Updating cloud state from ZooKeeper... 
[junit4:junit4]   2> 9308 T4725 oasc.Overseer$ClusterStateUpdater.updateState Update state numShards=2 message={
[junit4:junit4]   2> 	  "operation":"state",
[junit4:junit4]   2> 	  "numShards":"2",
[junit4:junit4]   2> 	  "shard":"shard1",
[junit4:junit4]   2> 	  "roles":null,
[junit4:junit4]   2> 	  "state":"active",
[junit4:junit4]   2> 	  "core":"collection1",
[junit4:junit4]   2> 	  "collection":"collection1",
[junit4:junit4]   2> 	  "node_name":"127.0.0.1:50609__",
[junit4:junit4]   2> 	  "base_url":"http://127.0.0.1:50609/_"}
[junit4:junit4]   2> 9314 T4725 oasc.Overseer$ClusterStateUpdater.updateState Update state numShards=2 message={
[junit4:junit4]   2> 	  "operation":"state",
[junit4:junit4]   2> 	  "numShards":"2",
[junit4:junit4]   2> 	  "shard":null,
[junit4:junit4]   2> 	  "roles":null,
[junit4:junit4]   2> 	  "state":"down",
[junit4:junit4]   2> 	  "core":"collection1",
[junit4:junit4]   2> 	  "collection":"collection1",
[junit4:junit4]   2> 	  "node_name":"127.0.0.1:50612__",
[junit4:junit4]   2> 	  "base_url":"http://127.0.0.1:50612/_"}
[junit4:junit4]   2> 9314 T4725 oasc.Overseer$ClusterStateUpdater.updateState Collection already exists with numShards=2
[junit4:junit4]   2> 9314 T4725 oasc.Overseer$ClusterStateUpdater.updateState Assigning new node to shard shard=shard2
[junit4:junit4]   2> 9320 T4758 oascc.ZkStateReader$2.process A cluster state change: WatchedEvent state:SyncConnected type:NodeDataChanged path:/clusterstate.json, has occurred - updating... (live nodes size: 3)
[junit4:junit4]   2> 9321 T4724 oascc.ZkStateReader$2.process A cluster state change: WatchedEvent state:SyncConnected type:NodeDataChanged path:/clusterstate.json, has occurred - updating... (live nodes size: 3)
[junit4:junit4]   2> 9321 T4743 oascc.ZkStateReader$2.process A cluster state change: WatchedEvent state:SyncConnected type:NodeDataChanged path:/clusterstate.json, has occurred - updating... (live nodes size: 3)
[junit4:junit4]   2> 9321 T4730 oascc.ZkStateReader$2.process A cluster state change: WatchedEvent state:SyncConnected type:NodeDataChanged path:/clusterstate.json, has occurred - updating... (live nodes size: 3)
[junit4:junit4]   2> 9985 T4759 oasc.CoreContainer.registerCore registering core: collection1
[junit4:junit4]   2> 9985 T4759 oasc.ZkController.register Register replica - core:collection1 address:http://127.0.0.1:50612/_ collection:collection1 shard:shard2
[junit4:junit4]   2> 9986 T4759 oascc.SolrZkClient.makePath makePath: /collections/collection1/leader_elect/shard2/election
[junit4:junit4]   2> 9996 T4707 oazs.PrepRequestProcessor.pRequest Got user-level KeeperException when processing sessionid:0x13ca748d3c60008 type:delete cxid:0x42 zxid:0x7c txntype:-1 reqpath:n/a Error Path:/solr/collections/collection1/leaders/shard2 Error:KeeperErrorCode = NoNode for /solr/collections/collection1/leaders/shard2
[junit4:junit4]   2> 9997 T4759 oasc.ShardLeaderElectionContext.runLeaderProcess Running the leader process.
[junit4:junit4]   2> 9998 T4707 oazs.PrepRequestProcessor.pRequest Got user-level KeeperException when processing sessionid:0x13ca748d3c60008 type:create cxid:0x43 zxid:0x7d txntype:-1 reqpath:n/a Error Path:/solr/overseer Error:KeeperErrorCode = NodeExists for /solr/overseer
[junit4:junit4]   2> 10001 T4759 oasc.ShardLeaderElectionContext.waitForReplicasToComeUp Enough replicas found to continue.
[junit4:junit4]   2> 10001 T4759 oasc.ShardLeaderElectionContext.runLeaderProcess I may be the new leader - try and sync
[junit4:junit4]   2> 10001 T4759 oasc.SyncStrategy.sync Sync replicas to http://127.0.0.1:50612/_/collection1/
[junit4:junit4]   2> 10001 T4759 oasc.SyncStrategy.syncReplicas Sync Success - now sync replicas to me
[junit4:junit4]   2> 10002 T4759 oasc.SyncStrategy.syncToMe http://127.0.0.1:50612/_/collection1/ has no replicas
[junit4:junit4]   2> 10002 T4759 oasc.ShardLeaderElectionContext.runLeaderProcess I am the new leader: http://127.0.0.1:50612/_/collection1/
[junit4:junit4]   2> 10002 T4759 oascc.SolrZkClient.makePath makePath: /collections/collection1/leaders/shard2
[junit4:junit4]   2> 10008 T4707 oazs.PrepRequestProcessor.pRequest Got user-level KeeperException when processing sessionid:0x13ca748d3c60008 type:create cxid:0x4c zxid:0x80 txntype:-1 reqpath:n/a Error Path:/solr/overseer Error:KeeperErrorCode = NodeExists for /solr/overseer
[junit4:junit4]   2> 10837 T4725 oascc.ZkStateReader.updateClusterState Updating cloud state from ZooKeeper... 
[junit4:junit4]   2> 10861 T4743 oascc.ZkStateReader$2.process A cluster state change: WatchedEvent state:SyncConnected type:NodeDataChanged path:/clusterstate.json, has occurred - updating... (live nodes size: 3)
[junit4:junit4]   2> 10862 T4724 oascc.ZkStateReader$2.process A cluster state change: WatchedEvent state:SyncConnected type:NodeDataChanged path:/clusterstate.json, has occurred - updating... (live nodes size: 3)
[junit4:junit4]   2> 10862 T4730 oascc.ZkStateReader$2.process A cluster state change: WatchedEvent state:SyncConnected type:NodeDataChanged path:/clusterstate.json, has occurred - updating... (live nodes size: 3)
[junit4:junit4]   2> 10862 T4758 oascc.ZkStateReader$2.process A cluster state change: WatchedEvent state:SyncConnected type:NodeDataChanged path:/clusterstate.json, has occurred - updating... (live nodes size: 3)
[junit4:junit4]   2> 10879 T4759 oasc.ZkController.register We are http://127.0.0.1:50612/_/collection1/ and leader is http://127.0.0.1:50612/_/collection1/
[junit4:junit4]   2> 10881 T4759 oasc.ZkController.register No LogReplay needed for core=collection1 baseURL=http://127.0.0.1:50612/_
[junit4:junit4]   2> 10881 T4759 oasc.ZkController.checkRecovery I am the leader, no recovery necessary
[junit4:junit4]   2> 10882 T4759 oasc.ZkController.publish publishing core=collection1 state=active
[junit4:junit4]   2> 10883 T4759 oasc.ZkController.publish numShards not found on descriptor - reading it from system property
[junit4:junit4]   2> 10890 T4759 oascc.ZkStateReader.updateClusterState Updating cloud state from ZooKeeper... 
[junit4:junit4]   2> 10893 T4702 oass.SolrDispatchFilter.init user.dir=/Users/jenkins/jenkins-slave/workspace/Lucene-Solr-trunk-MacOSX/solr/build/solr-core/test/J0
[junit4:junit4]   2> 10894 T4702 oass.SolrDispatchFilter.init SolrDispatchFilter.init() done
[junit4:junit4]   2> 10894 T4702 oascsi.HttpClientUtil.createClient Creating new http client, config:maxConnections=128&maxConnectionsPerHost=32&followRedirects=false
[junit4:junit4]   2> 11134 T4702 oejs.Server.doStart jetty-8.1.8.v20121106
[junit4:junit4]   2> 11139 T4702 oejs.AbstractConnector.doStart Started SelectChannelConnector@127.0.0.1:50615
[junit4:junit4]   2> 11140 T4702 oass.SolrDispatchFilter.init SolrDispatchFilter.init()
[junit4:junit4]   2> 11141 T4702 oasc.SolrResourceLoader.locateSolrHome JNDI not configured for solr (NoInitialContextEx)
[junit4:junit4]   2> 11141 T4702 oasc.SolrResourceLoader.locateSolrHome using system property solr.solr.home: /Users/jenkins/jenkins-slave/workspace/Lucene-Solr-trunk-MacOSX/solr/build/solr-core/test/J0/./org.apache.solr.cloud.BasicDistributedZk2Test-jetty3-1360016244300
[junit4:junit4]   2> 11142 T4702 oasc.CoreContainer$Initializer.initialize looking for solr.xml: /Users/jenkins/jenkins-slave/workspace/Lucene-Solr-trunk-MacOSX/solr/build/solr-core/test/J0/./org.apache.solr.cloud.BasicDistributedZk2Test-jetty3-1360016244300/solr.xml
[junit4:junit4]   2> 11142 T4702 oasc.CoreContainer.<init> New CoreContainer 419079149
[junit4:junit4]   2> 11143 T4702 oasc.CoreContainer.load Loading CoreContainer using Solr Home: '/Users/jenkins/jenkins-slave/workspace/Lucene-Solr-trunk-MacOSX/solr/build/solr-core/test/J0/./org.apache.solr.cloud.BasicDistributedZk2Test-jetty3-1360016244300/'
[junit4:junit4]   2> 11143 T4702 oasc.SolrResourceLoader.<init> new SolrResourceLoader for directory: '/Users/jenkins/jenkins-slave/workspace/Lucene-Solr-trunk-MacOSX/solr/build/solr-core/test/J0/./org.apache.solr.cloud.BasicDistributedZk2Test-jetty3-1360016244300/'
[junit4:junit4]   2> 11189 T4702 oashc.HttpShardHandlerFactory.getParameter Setting socketTimeout to: 60000
[junit4:junit4]   2> 11190 T4702 oashc.HttpShardHandlerFactory.getParameter Setting urlScheme to: http://
[junit4:junit4]   2> 11191 T4702 oashc.HttpShardHandlerFactory.getParameter Setting connTimeout to: 15000
[junit4:junit4]   2> 11191 T4702 oashc.HttpShardHandlerFactory.getParameter Setting maxConnectionsPerHost to: 20
[junit4:junit4]   2> 11192 T4702 oashc.HttpShardHandlerFactory.getParameter Setting corePoolSize to: 0
[junit4:junit4]   2> 11192 T4702 oashc.HttpShardHandlerFactory.getParameter Setting maximumPoolSize to: 2147483647
[junit4:junit4]   2> 11193 T4702 oashc.HttpShardHandlerFactory.getParameter Setting maxThreadIdleTime to: 5
[junit4:junit4]   2> 11194 T4702 oashc.HttpShardHandlerFactory.getParameter Setting sizeOfQueue to: -1
[junit4:junit4]   2> 11194 T4702 oashc.HttpShardHandlerFactory.getParameter Setting fairnessPolicy to: false
[junit4:junit4]   2> 11195 T4702 oascsi.HttpClientUtil.createClient Creating new http client, config:maxConnectionsPerHost=20&maxConnections=10000&socketTimeout=60000&connTimeout=15000&retry=false
[junit4:junit4]   2> 11213 T4702 oasc.CoreContainer.load Registering Log Listener
[junit4:junit4]   2> 11233 T4702 oasc.CoreContainer.initZooKeeper Zookeeper client=127.0.0.1:50602/solr
[junit4:junit4]   2> 11234 T4702 oasc.ZkController.checkChrootPath zkHost includes chroot
[junit4:junit4]   2> 11235 T4702 oaz.ZooKeeper.<init> Initiating client connection, connectString=127.0.0.1:50602 sessionTimeout=60000 watcher=org.apache.solr.common.cloud.ConnectionManager@29c149e2
[junit4:junit4]   2> 11236 T4702 oascc.ConnectionManager.waitForConnected Waiting for client to connect to ZooKeeper
[junit4:junit4]   2> 11237 T4770 oaz.ClientCnxn$SendThread.logStartConnect Opening socket connection to server localhost/127.0.0.1:50602. Will not attempt to authenticate using SASL (access denied ("javax.security.auth.AuthPermission" "getLoginConfiguration"))
[junit4:junit4]   2> 11238 T4770 oaz.ClientCnxn$SendThread.primeConnection Socket connection established to localhost/127.0.0.1:50602, initiating session
[junit4:junit4]   2> 11238 T4704 oazs.NIOServerCnxnFactory.run Accepted socket connection from /127.0.0.1:50616
[junit4:junit4]   2> 11239 T4704 oazs.ZooKeeperServer.processConnectRequest Client attempting to establish new session at /127.0.0.1:50616
[junit4:junit4]   2> 11240 T4706 oazs.ZooKeeperServer.finishSessionInit Established session 0x13ca748d3c60009 with negotiated timeout 20000 for client /127.0.0.1:50616
[junit4:junit4]   2> 11240 T4770 oaz.ClientCnxn$SendThread.onConnected Session establishment complete on server localhost/127.0.0.1:50602, sessionid = 0x13ca748d3c60009, negotiated timeout = 20000
[junit4:junit4]   2> 11241 T4771 oascc.ConnectionManager.process Watcher org.apache.solr.common.cloud.ConnectionManager@29c149e2 name:ZooKeeperConnection Watcher:127.0.0.1:50602 got event WatchedEvent state:SyncConnected type:None path:null path:null type:None
[junit4:junit4]   2> 11241 T4702 oascc.ConnectionManager.waitForConnected Client is connected to ZooKeeper
[junit4:junit4]   2> 11243 T4707 oazs.PrepRequestProcessor.pRequest2Txn Processed session termination for sessionid: 0x13ca748d3c60009
[junit4:junit4]   2> 11244 T4704 oazs.NIOServerCnxn.closeSock Closed socket connection for client /127.0.0.1:50616 which had sessionid 0x13ca748d3c60009
[junit4:junit4]   2> 11244 T4702 oaz.ZooKeeper.close Session: 0x13ca748d3c60009 closed
[junit4:junit4]   2> 11245 T4771 oaz.ClientCnxn$EventThread.run EventThread shut down
[junit4:junit4]   2> 11245 T4702 oascsi.HttpClientUtil.createClient Creating new http client, config:maxConnections=500&maxConnectionsPerHost=16&socketTimeout=60000&connTimeout=15000
[junit4:junit4]   2> 11250 T4702 oaz.ZooKeeper.<init> Initiating client connection, connectString=127.0.0.1:50602/solr sessionTimeout=30000 watcher=org.apache.solr.common.cloud.ConnectionManager@1e19f4b8
[junit4:junit4]   2> 11251 T4702 oascc.ConnectionManager.waitForConnected Waiting for client to connect to ZooKeeper
[junit4:junit4]   2> 11251 T4772 oaz.ClientCnxn$SendThread.logStartConnect Opening socket connection to server localhost/127.0.0.1:50602. Will not attempt to authenticate using SASL (access denied ("javax.security.auth.AuthPermission" "getLoginConfiguration"))
[junit4:junit4]   2> 11252 T4772 oaz.ClientCnxn$SendThread.primeConnection Socket connection established to localhost/127.0.0.1:50602, initiating session
[junit4:junit4]   2> 11253 T4704 oazs.NIOServerCnxnFactory.run Accepted socket connection from /127.0.0.1:50617
[junit4:junit4]   2> 11253 T4704 oazs.ZooKeeperServer.processConnectRequest Client attempting to establish new session at /127.0.0.1:50617
[junit4:junit4]   2> 11255 T4706 oazs.ZooKeeperServer.finishSessionInit Established session 0x13ca748d3c6000a with negotiated timeout 20000 for client /127.0.0.1:50617
[junit4:junit4]   2> 11255 T4772 oaz.ClientCnxn$SendThread.onConnected Session establishment complete on server localhost/127.0.0.1:50602, sessionid = 0x13ca748d3c6000a, negotiated timeout = 20000
[junit4:junit4]   2> 11255 T4773 oascc.ConnectionManager.process Watcher org.apache.solr.common.cloud.ConnectionManager@1e19f4b8 name:ZooKeeperConnection Watcher:127.0.0.1:50602/solr got event WatchedEvent state:SyncConnected type:None path:null path:null type:None
[junit4:junit4]   2> 11256 T4702 oascc.ConnectionManager.waitForConnected Client is connected to ZooKeeper
[junit4:junit4]   2> 11257 T4707 oazs.PrepRequestProcessor.pRequest Got user-level KeeperException when processing sessionid:0x13ca748d3c6000a type:create cxid:0x1 zxid:0x8d txntype:-1 reqpath:n/a Error Path:/solr/overseer Error:KeeperErrorCode = NodeExists for /solr/overseer
[junit4:junit4]   2> 11258 T4707 oazs.PrepRequestProcessor.pRequest Got user-level KeeperException when processing sessionid:0x13ca748d3c6000a type:create cxid:0x2 zxid:0x8e txntype:-1 reqpath:n/a Error Path:/solr/overseer Error:KeeperErrorCode = NodeExists for /solr/overseer
[junit4:junit4]   2> 11260 T4702 oasc.ZkController.createEphemeralLiveNode Register node as live in ZooKeeper:/live_nodes/127.0.0.1:50615__
[junit4:junit4]   2> 11261 T4707 oazs.PrepRequestProcessor.pRequest Got user-level KeeperException when processing sessionid:0x13ca748d3c6000a type:delete cxid:0x4 zxid:0x8f txntype:-1 reqpath:n/a Error Path:/solr/live_nodes/127.0.0.1:50615__ Error:KeeperErrorCode = NoNode for /solr/live_nodes/127.0.0.1:50615__
[junit4:junit4]   2> 11262 T4702 oascc.SolrZkClient.makePath makePath: /live_nodes/127.0.0.1:50615__
[junit4:junit4]   2> 11266 T4724 oascc.ZkStateReader$2.process A cluster state change: WatchedEvent state:SyncConnected type:NodeChildrenChanged path:/live_nodes, has occurred - updating... (live nodes size: 3)
[junit4:junit4]   2> 11266 T4743 oascc.ZkStateReader$2.process A cluster state change: WatchedEvent state:SyncConnected type:NodeChildrenChanged path:/live_nodes, has occurred - updating... (live nodes size: 3)
[junit4:junit4]   2> 11268 T4730 oascc.ZkStateReader$3.process Updating live nodes... (4)
[junit4:junit4]   2> 11268 T4730 oascc.ZkStateReader$2.process A cluster state change: WatchedEvent state:SyncConnected type:NodeChildrenChanged path:/live_nodes, has occurred - updating... (live nodes size: 4)
[junit4:junit4]   2> 11268 T4758 oascc.ZkStateReader$3.process Updating live nodes... (4)
[junit4:junit4]   2> 11269 T4758 oascc.ZkStateReader$2.process A cluster state change: WatchedEvent state:SyncConnected type:NodeChildrenChanged path:/live_nodes, has occurred - updating... (live nodes size: 4)
[junit4:junit4]   2> 11270 T4724 oascc.ZkStateReader$3.process Updating live nodes... (4)
[junit4:junit4]   2> 11271 T4743 oascc.ZkStateReader$3.process Updating live nodes... (4)
[junit4:junit4]   2> 11276 T4702 oascc.ZkStateReader.createClusterStateWatchersAndUpdate Updating cluster state from ZooKeeper... 
[junit4:junit4]   2> 11285 T4774 oasc.CoreContainer.create Creating SolrCore 'collection1' using instanceDir: /Users/jenkins/jenkins-slave/workspace/Lucene-Solr-trunk-MacOSX/solr/build/solr-core/test/J0/./org.apache.solr.cloud.BasicDistributedZk2Test-jetty3-1360016244300/collection1
[junit4:junit4]   2> 11285 T4774 oasc.ZkController.createCollectionZkNode Check for collection zkNode:collection1
[junit4:junit4]   2> 11287 T4774 oasc.ZkController.createCollectionZkNode Collection zkNode exists
[junit4:junit4]   2> 11287 T4774 oasc.ZkController.readConfigName Load collection config from:/collections/collection1
[junit4:junit4]   2> 11289 T4774 oasc.SolrResourceLoader.<init> new SolrResourceLoader for directory: '/Users/jenkins/jenkins-slave/workspace/Lucene-Solr-trunk-MacOSX/solr/build/solr-core/test/J0/./org.apache.solr.cloud.BasicDistributedZk2Test-jetty3-1360016244300/collection1/'
[junit4:junit4]   2> 11290 T4774 oasc.SolrResourceLoader.replaceClassLoader Adding 'file:/Users/jenkins/jenkins-slave/workspace/Lucene-Solr-trunk-MacOSX/solr/build/solr-core/test/J0/org.apache.solr.cloud.BasicDistributedZk2Test-jetty3-1360016244300/collection1/lib/classes/' to classloader
[junit4:junit4]   2> 11291 T4774 oasc.SolrResourceLoader.replaceClassLoader Adding 'file:/Users/jenkins/jenkins-slave/workspace/Lucene-Solr-trunk-MacOSX/solr/build/solr-core/test/J0/org.apache.solr.cloud.BasicDistributedZk2Test-jetty3-1360016244300/collection1/lib/README' to classloader
[junit4:junit4]   2> 11372 T4774 oasc.SolrConfig.<init> Using Lucene MatchVersion: LUCENE_50
[junit4:junit4]   2> 11447 T4774 oasc.SolrConfig.<init> Loaded SolrConfig: solrconfig.xml
[junit4:junit4]   2> 11448 T4774 oass.IndexSchema.readSchema Reading Solr Schema
[junit4:junit4]   2> 11458 T4774 oass.IndexSchema.readSchema Schema name=test
[junit4:junit4]   2> 12056 T4774 oass.OpenExchangeRatesOrgProvider.init Initialized with rates=open-exchange-rates.json, refreshInterval=1440.
[junit4:junit4]   2> 12067 T4774 oass.IndexSchema.readSchema default search field in schema is text
[junit4:junit4]   2> 12071 T4774 oass.IndexSchema.readSchema unique key field: id
[junit4:junit4]   2> 12091 T4774 oass.FileExchangeRateProvider.reload Reloading exchange rates from file currency.xml
[junit4:junit4]   2> 12097 T4774 oass.FileExchangeRateProvider.reload Reloading exchange rates from file currency.xml
[junit4:junit4]   2> 12107 T4774 oass.OpenExchangeRatesOrgProvider.reload Reloading exchange rates from open-exchange-rates.json
[junit4:junit4]   2> 12110 T4774 oass.OpenExchangeRatesOrgProvider.reload Reloading exchange rates from open-exchange-rates.json
[junit4:junit4]   2> 12112 T4774 oasc.SolrCore.<init> [collection1] Opening new SolrCore at /Users/jenkins/jenkins-slave/workspace/Lucene-Solr-trunk-MacOSX/solr/build/solr-core/test/J0/./org.apache.solr.cloud.BasicDistributedZk2Test-jetty3-1360016244300/collection1/, dataDir=./org.apache.solr.cloud.BasicDistributedZk2Test-1360016233408/jetty3/
[junit4:junit4]   2> 12113 T4774 oasc.JmxMonitoredMap.<init> JMX monitoring is enabled. Adding Solr mbeans to JMX Server: com.sun.jmx.mbeanserver.JmxMBeanServer@4506213e
[junit4:junit4]   2> 12114 T4774 oasc.SolrCore.initDirectoryFactory solr.StandardDirectoryFactory
[junit4:junit4]   2> 12115 T4774 oasc.CachingDirectoryFactory.get return new directory for /Users/jenkins/jenkins-slave/workspace/Lucene-Solr-trunk-MacOSX/solr/build/solr-core/test/J0/./org.apache.solr.cloud.BasicDistributedZk2Test-1360016233408/jetty3 forceNew:false
[junit4:junit4]   2> 12116 T4774 oasc.CachingDirectoryFactory.close Releasing directory:/Users/jenkins/jenkins-slave/workspace/Lucene-Solr-trunk-MacOSX/solr/build/solr-core/test/J0/./org.apache.solr.cloud.BasicDistributedZk2Test-1360016233408/jetty3
[junit4:junit4]   2> 12116 T4774 oasc.SolrCore.getNewIndexDir New index directory detected: old=null new=./org.apache.solr.cloud.BasicDistributedZk2Test-1360016233408/jetty3/index/
[junit4:junit4]   2> 12117 T4774 oasc.SolrCore.initIndex WARNING [collection1] Solr index directory './org.apache.solr.cloud.BasicDistributedZk2Test-1360016233408/jetty3/index' doesn't exist. Creating new index...
[junit4:junit4]   2> 12118 T4774 oasc.CachingDirectoryFactory.get return new directory for /Users/jenkins/jenkins-slave/workspace/Lucene-Solr-trunk-MacOSX/solr/build/solr-core/test/J0/./org.apache.solr.cloud.BasicDistributedZk2Test-1360016233408/jetty3/index forceNew:false
[junit4:junit4]   2> 12124 T4774 oasc.SolrDeletionPolicy.onCommit SolrDeletionPolicy.onCommit: commits:num=1
[junit4:junit4]   2> 		commit{dir=RateLimitedDirectoryWrapper(org.apache.lucene.store.NIOFSDirectory@/Users/jenkins/jenkins-slave/workspace/Lucene-Solr-trunk-MacOSX/solr/build/solr-core/test/J0/org.apache.solr.cloud.BasicDistributedZk2Test-1360016233408/jetty3/index lockFactory=org.apache.lucene.store.NativeFSLockFactory@3e1ade7d),segFN=segments_1,generation=1,filenames=[segments_1]
[junit4:junit4]   2> 12125 T4774 oasc.SolrDeletionPolicy.updateCommits newest commit = 1[segments_1]
[junit4:junit4]   2> 12126 T4774 oasc.CachingDirectoryFactory.close Releasing directory:/Users/jenkins/jenkins-slave/workspace/Lucene-Solr-trunk-MacOSX/solr/build/solr-core/test/J0/./org.apache.solr.cloud.BasicDistributedZk2Test-1360016233408/jetty3/index
[junit4:junit4]   2> 12126 T4774 oasc.SolrCore.initWriters created xml: solr.XMLResponseWriter
[junit4:junit4]   2> 12129 T4774 oasup.UpdateRequestProcessorChain.init inserting DistributedUpdateProcessorFactory into updateRequestProcessorChain "dedupe"
[junit4:junit4]   2> 12129 T4774 oasup.UpdateRequestProcessorChain.init inserting DistributedUpdateProcessorFactory into updateRequestProcessorChain "dedupe-allfields"
[junit4:junit4]   2> 12129 T4774 oasup.UpdateRequestProcessorChain.init inserting DistributedUpdateProcessorFactory into updateRequestProcessorChain "stored_sig"
[junit4:junit4]   2> 12130 T4774 oasup.UpdateRequestProcessorChain.init inserting DistributedUpdateProcessorFactory into updateRequestProcessorChain "uniq-fields"
[junit4:junit4]   2> 12130 T4774 oasup.UpdateRequestProcessorChain.init inserting DistributedUpdateProcessorFactory into updateRequestProcessorChain "distrib-dup-test-chain-implicit"
[junit4:junit4]   2> 12131 T4774 oasc.RequestHandlers.initHandlersFromConfig adding lazy requestHandler: solr.ReplicationHandler
[junit4:junit4]   2> 12131 T4774 oasc.RequestHandlers.initHandlersFromConfig created /replication: solr.ReplicationHandler
[junit4:junit4]   2> 12132 T4774 oasc.RequestHandlers.initHandlersFromConfig created standard: solr.StandardRequestHandler
[junit4:junit4]   2> 12133 T4774 oasc.RequestHandlers.initHandlersFromConfig created /get: solr.RealTimeGetHandler
[junit4:junit4]   2> 12134 T4774 oasc.RequestHandlers.initHandlersFromConfig created dismax: solr.SearchHandler
[junit4:junit4]   2> 12135 T4774 oasc.RequestHandlers.initHandlersFromConfig created mock: org.apache.solr.core.MockQuerySenderListenerReqHandler
[junit4:junit4]   2> 12136 T4774 oasc.RequestHandlers.initHandlersFromConfig created /admin/: org.apache.solr.handler.admin.AdminHandlers
[junit4:junit4]   2> 12137 T4774 oasc.RequestHandlers.initHandlersFromConfig created defaults: solr.StandardRequestHandler
[junit4:junit4]   2> 12137 T4774 oasc.RequestHandlers.initHandlersFromConfig adding lazy requestHandler: solr.StandardRequestHandler
[junit4:junit4]   2> 12138 T4774 oasc.RequestHandlers.initHandlersFromConfig created lazy: solr.StandardRequestHandler
[junit4:junit4]   2> 12138 T4774 oasc.RequestHandlers.initHandlersFromConfig created /update: solr.UpdateRequestHandler
[junit4:junit4]   2> 12139 T4774 oasc.RequestHandlers.initHandlersFromConfig created /terms: org.apache.solr.handler.component.SearchHandler
[junit4:junit4]   2> 12140 T4774 oasc.RequestHandlers.initHandlersFromConfig created spellCheckCompRH: org.apache.solr.handler.component.SearchHandler
[junit4:junit4]   2> 12140 T4774 oasc.RequestHandlers.initHandlersFromConfig created spellCheckCompRH_Direct: org.apache.solr.handler.component.SearchHandler
[junit4:junit4]   2> 12141 T4774 oasc.RequestHandlers.initHandlersFromConfig created spellCheckWithWordbreak: org.apache.solr.handler.component.SearchHandler
[junit4:junit4]   2> 12142 T4774 oasc.RequestHandlers.initHandlersFromConfig created spellCheckWithWordbreak_Direct: org.apache.solr.handler.component.SearchHandler
[junit4:junit4]   2> 12142 T4774 oasc.RequestHandlers.initHandlersFromConfig created spellCheckCompRH1: org.apache.solr.handler.component.SearchHandler
[junit4:junit4]   2> 12143 T4774 oasc.RequestHandlers.initHandlersFromConfig created mltrh: org.apache.solr.handler.component.SearchHandler
[junit4:junit4]   2> 12144 T4774 oasc.RequestHandlers.initHandlersFromConfig created tvrh: org.apache.solr.handler.component.SearchHandler
[junit4:junit4]   2> 12144 T4774 oasc.RequestHandlers.initHandlersFromConfig created /mlt: solr.MoreLikeThisHandler
[junit4:junit4]   2> 12145 T4774 oasc.RequestHandlers.initHandlersFromConfig created /debug/dump: solr.DumpRequestHandler
[junit4:junit4]   2> 12152 T4774 oashl.XMLLoader.init xsltCacheLifetimeSeconds=60
[junit4:junit4]   2> 12154 T4774 oasc.SolrCore.initDeprecatedSupport WARNING solrconfig.xml uses deprecated <admin/gettableFiles>, Please update your config to use the ShowFileRequestHandler.
[junit4:junit4]   2> 12155 T4774 oasc.SolrCore.initDeprecatedSupport WARNING adding ShowFileRequestHandler with hidden files: [SCHEMA.XML, OLD_SYNONYMS.TXT, STOPWORDS.TXT, PROTWORDS.TXT, OPEN-EXCHANGE-RATES.JSON, SYNONYMS.TXT, CURRENCY.XML, MAPPING-ISOLATIN1ACCENT.TXT]
[junit4:junit4]   2> 12157 T4774 oasc.CachingDirectoryFactory.close Releasing directory:/Users/jenkins/jenkins-slave/workspace/Lucene-Solr-trunk-MacOSX/solr/build/solr-core/test/J0/./org.apache.solr.cloud.BasicDistributedZk2Test-1360016233408/jetty3
[junit4:junit4]   2> 12158 T4774 oass.SolrIndexSearcher.<init> Opening Searcher@1a3f1e83 main
[junit4:junit4]   2> 12159 T4774 oasu.CommitTracker.<init> Hard AutoCommit: disabled
[junit4:junit4]   2> 12159 T4774 oasu.CommitTracker.<init> Soft AutoCommit: disabled
[junit4:junit4]   2> 12160 T4774 oashc.SpellCheckComponent.inform Initializing spell checkers
[junit4:junit4]   2> 12165 T4774 oass.DirectSolrSpellChecker.init init: {name=direct,classname=DirectSolrSpellChecker,field=lowerfilt,minQueryLength=3}
[junit4:junit4]   2> 12195 T4775 oasc.SolrCore.registerSearcher [collection1] Registered new searcher Searcher@1a3f1e83 main{StandardDirectoryReader(segments_1:1)}
[junit4:junit4]   2> 12198 T4774 oasc.ZkController.publish publishing core=collection1 state=down
[junit4:junit4]   2> 12198 T4774 oasc.ZkController.publish numShards not found on descriptor - reading it from system property
[junit4:junit4]   2> 12388 T4725 oascc.ZkStateReader.updateClusterState Updating cloud state from ZooKeeper... 
[junit4:junit4]   2> 12390 T4725 oasc.Overseer$ClusterStateUpdater.updateState Update state numShards=2 message={
[junit4:junit4]   2> 	  "operation":"state",
[junit4:junit4]   2> 	  "numShards":"2",
[junit4:junit4]   2> 	  "shard":"shard2",
[junit4:junit4]   2> 	  "roles":null,
[junit4:junit4]   2> 	  "state":"active",
[junit4:junit4]   2> 	  "core":"collection1",
[junit4:junit4]   2> 	  "collection":"collection1",
[junit4:junit4]   2> 	  "node_name":"127.0.0.1:50612__",
[junit4:junit4]   2> 	  "base_url":"http://127.0.0.1:50612/_"}
[junit4:junit4]   2> 12403 T4725 oasc.Overseer$ClusterStateUpdater.updateState Update state numShards=2 message={
[junit4:junit4]   2> 	  "operation":"state",
[junit4:junit4]   2> 	  "numShards":"2",
[junit4:junit4]   2> 	  "shard":null,
[junit4:junit4]   2> 	  "roles":null,
[junit4:junit4]   2> 	  "state":"down",
[junit4:junit4]   2> 	  "core":"collection1",
[junit4:junit4]   2> 	  "collection":"collection1",
[junit4:junit4]   2> 	  "node_name":"127.0.0.1:50615__",
[junit4:junit4]   2> 	  "base_url":"http://127.0.0.1:50615/_"}
[junit4:junit4]   2> 12404 T4725 oasc.Overseer$ClusterStateUpdater.updateState Collection already exists with numShards=2
[junit4:junit4]   2> 12404 T4725 oasc.Overseer$ClusterStateUpdater.updateState Assigning new node to shard shard=shard1
[junit4:junit4]   2> 12417 T4758 oascc.ZkStateReader$2.process A cluster state change: WatchedEvent state:SyncConnected type:NodeDataChanged path:/clusterstate.json, has occurred - updating... (live nodes size: 4)
[junit4:junit4]   2> 12419 T4773 oascc.ZkStateReader$2.process A cluster state change: WatchedEvent state:SyncConnected type:NodeDataChanged path:/clusterstate.json, has occurred - updating... (live nodes size: 4)
[junit4:junit4]   2> 12419 T4724 oascc.ZkStateReader$2.process A cluster state change: WatchedEvent state:SyncConnected type:NodeDataChanged path:/clusterstate.json, has occurred - updating... (live nodes size: 4)
[junit4:junit4]   2> 12420 T4730 oascc.ZkStateReader$2.process A cluster state change: WatchedEvent state:SyncConnected type:NodeDataChanged path:/clusterstate.json, has occurred - updating... (live nodes size: 4)
[junit4:junit4]   2> 12419 T4743 oascc.ZkStateReader$2.process A cluster state change: WatchedEvent state:SyncConnected type:NodeDataChanged path:/clusterstate.json, has occurred - updating... (live nodes size: 4)
[junit4:junit4]   2> 13201 T4774 oasc.CoreContainer.registerCore registering core: collection1
[junit4:junit4]   2> 13202 T4774 oasc.ZkController.register Register replica - core:collection1 address:http://127.0.0.1:50615/_ collection:collection1 shard:shard1
[junit4:junit4]   2> 13212 T4774 oasc.ZkController.register We are http://127.0.0.1:50615/_/collection1/ and leader is http://127.0.0.1:50609/_/collection1/
[junit4:junit4]   2> 13213 T4774 oasc.ZkController.register No LogReplay needed for core=collection1 baseURL=http://127.0.0.1:50615/_
[junit4:junit4]   2> 13213 T4774 oasc.ZkController.checkRecovery Core needs to recover:collection1
[junit4:junit4]   2> 13214 T4774 oasu.DefaultSolrCoreState.doRecovery Running recovery - first canceling any ongoing recovery
[junit4:junit4]   2> ASYNC  NEW_CORE C348 name=collection1 org.apache.solr.core.SolrCore@9ca0f42 url=http://127.0.0.1:50615/_/collection1 node=127.0.0.1:50615__ C348_STATE=coll:collection1 core:collection1 props:{shard=null, roles=null, state=down, core=collection1, collection=collection1, node_name=127.0.0.1:50615__, base_url=http://127.0.0.1:50615/_}
[junit4:junit4]   2> 13216 T4776 C348 P50615 oasc.RecoveryStrategy.run Starting recovery process.  core=collection1 recoveringAfterStartup=true
[junit4:junit4]   2> 13217 T4776 C348 P50615 oasc.RecoveryStrategy.doRecovery ###### startupVersions=[]
[junit4:junit4]   2> 13217 T4774 oascc.ZkStateReader.updateClusterState Updating cloud state from ZooKeeper... 
[junit4:junit4]   2> 13217 T4776 C348 P50615 oasc.ZkController.publish publishing core=collection1 state=recovering
[junit4:junit4]   2> 13218 T4776 C348 P50615 oasc.ZkController.publish numShards not found on descriptor - reading it from system property
[junit4:junit4]   2> 13219 T4702 oass.SolrDispatchFilter.init user.dir=/Users/jenkins/jenkins-slave/workspace/Lucene-Solr-trunk-MacOSX/solr/build/solr-core/test/J0
[junit4:junit4]   2> 13221 T4702 oass.SolrDispatchFilter.init SolrDispatchFilter.init() done
[junit4:junit4]   2> 13221 T4776 C348 P50615 oascsi.HttpClientUtil.createClient Creating new http client, config:maxConnections=128&maxConnectionsPerHost=32&followRedirects=false
[junit4:junit4]   2> 13222 T4702 oascsi.HttpClientUtil.createClient Creating new http client, config:maxConnections=128&maxConnectionsPerHost=32&followRedirects=false
[junit4:junit4]   2> 13781 T4702 oejs.Server.doStart jetty-8.1.8.v20121106
[junit4:junit4]   2> 13786 T4702 oejs.AbstractConnector.doStart Started SelectChannelConnector@127.0.0.1:50619
[junit4:junit4]   2> 13786 T4702 oass.SolrDispatchFilter.init SolrDispatchFilter.init()
[junit4:junit4]   2> 13787 T4702 oasc.SolrResourceLoader.locateSolrHome JNDI not configured for solr (NoInitialContextEx)
[junit4:junit4]   2> 13788 T4702 oasc.SolrResourceLoader.locateSolrHome using system property solr.solr.home: /Users/jenkins/jenkins-slave/workspace/Lucene-Solr-trunk-MacOSX/solr/build/solr-core/test/J0/./org.apache.solr.cloud.BasicDistributedZk2Test-jetty4-1360016246634
[junit4:junit4]   2> 13788 T4702 oasc.CoreContainer$Initializer.initialize looking for solr.xml: /Users/jenkins/jenkins-slave/workspace/Lucene-Solr-trunk-MacOSX/solr/build/solr-core/test/J0/./org.apache.solr.cloud.BasicDistributedZk2Test-jetty4-1360016246634/solr.xml
[junit4:junit4]   2> 13788 T4702 oasc.CoreContainer.<init> New CoreContainer 2029691501
[junit4:junit4]   2> 13789 T4702 oasc.CoreContainer.load Loading CoreContainer using Solr Home: '/Users/jenkins/jenkins-slave/workspace/Lucene-Solr-trunk-MacOSX/solr/build/solr-core/test/J0/./org.apache.solr.cloud.BasicDistributedZk2Test-jetty4-1360016246634/'
[junit4:junit4]   2> 13789 T4702 oasc.SolrResourceLoader.<init> new SolrResourceLoader for directory: '/Users/jenkins/jenkins-slave/workspace/Lucene-Solr-trunk-MacOSX/solr/build/solr-core/test/J0/./org.apache.solr.cloud.BasicDistributedZk2Test-jetty4-1360016246634/'
[junit4:junit4]   2> 13820 T4702 oashc.HttpShardHandlerFactory.getParameter Setting socketTimeout to: 60000
[junit4:junit4]   2> 13820 T4702 oashc.HttpShardHandlerFactory.getParameter Setting urlScheme to: http://
[junit4:junit4]   2> 13821 T4702 oashc.HttpShardHandlerFactory.getParameter Setting connTimeout to: 15000
[junit4:junit4]   2> 13821 T4702 oashc.HttpShardHandlerFactory.getParameter Setting maxConnectionsPerHost to: 20
[junit4:junit4]   2> 13822 T4702 oashc.HttpShardHandlerFactory.getParameter Setting corePoolSize to: 0
[junit4:junit4]   2> 13822 T4702 oashc.HttpShardHandlerFactory.getParameter Setting maximumPoolSize to: 2147483647
[junit4:junit4]   2> 13823 T4702 oashc.HttpShardHandlerFactory.getParameter Setting maxThreadIdleTime to: 5
[junit4:junit4]   2> 13823 T4702 oashc.HttpShardHandlerFactory.getParameter Setting sizeOfQueue to: -1
[junit4:junit4]   2> 13824 T4702 oashc.HttpShardHandlerFactory.getParameter Setting fairnessPolicy to: false
[junit4:junit4]   2> 13824 T4702 oascsi.HttpClientUtil.createClient Creating new http client, config:maxConnectionsPerHost=20&maxConnections=10000&socketTimeout=60000&connTimeout=15000&retry=false
[junit4:junit4]   2> 13836 T4702 oasc.CoreContainer.load Registering Log Listener
[junit4:junit4]   2> 13856 T4702 oasc.CoreContainer.initZooKeeper Zookeeper client=127.0.0.1:50602/solr
[junit4:junit4]   2> 13857 T4702 oasc.ZkController.checkChrootPath zkHost includes chroot
[junit4:junit4]   2> 13858 T4702 oaz.ZooKeeper.<init> Initiating client connection, connectString=127.0.0.1:50602 sessionTimeout=60000 watcher=org.apache.solr.common.cloud.ConnectionManager@101ce12c
[junit4:junit4]   2> 13860 T4702 oascc.ConnectionManager.waitForConnected Waiting for client to connect to ZooKeeper
[junit4:junit4]   2> 13861 T4786 oaz.ClientCnxn$SendThread.logStartConnect Opening socket connection to server localhost/127.0.0.1:50602. Will not attempt to authenticate using SASL (access denied ("javax.security.auth.AuthPermission" "getLoginConfiguration"))
[junit4:junit4]   2> 13862 T4786 oaz.ClientCnxn$SendThread.primeConnection Socket connection established to localhost/127.0.0.1:50602, initiating session
[junit4:junit4]   2> 13862 T4704 oazs.NIOServerCnxnFactory.run Accepted socket connection from /127.0.0.1:50620
[junit4:junit4]   2> 13862 T4704 oazs.ZooKeeperServer.processConnectRequest Client attempting to establish new session at /127.0.0.1:50620
[junit4:junit4]   2> 13864 T4706 oazs.ZooKeeperServer.finishSessionInit Established session 0x13ca748d3c6000b with negotiated timeout 20000 for client /127.0.0.1:50620
[junit4:junit4]   2> 13864 T4786 oaz.ClientCnxn$SendThread.onConnected Session establishment complete on server localhost/127.0.0.1:50602, sessionid = 0x13ca748d3c6000b, negotiated timeout = 20000
[junit4:junit4]   2> 13865 T4787 oascc.ConnectionManager.process Watcher org.apache.solr.common.cloud.ConnectionManager@101ce12c name:ZooKeeperConnection Watcher:127.0.0.1:50602 got event WatchedEvent state:SyncConnected type:None path:null path:null type:None
[junit4:junit4]   2> 13865 T4702 oascc.ConnectionManager.waitForConnected Client is connected to ZooKeeper
[junit4:junit4]   2> 13867 T4707 oazs.PrepRequestProcessor.pRequest2Txn Processed session termination for sessionid: 0x13ca748d3c6000b
[junit4:junit4]   2> 13868 T4704 oazs.NIOServerCnxn.closeSock Closed socket connection for client /127.0.0.1:50620 which had sessionid 0x13ca748d3c6000b
[junit4:junit4]   2> 13868 T4787 oaz.ClientCnxn$EventThread.run EventThread shut down
[junit4:junit4]   2> 13868 T4702 oaz.ZooKeeper.close Session: 0x13ca748d3c6000b closed
[junit4:junit4]   2> 13869 T4702 oascsi.HttpClientUtil.createClient Creating new http client, config:maxConnections=500&maxConnectionsPerHost=16&socketTimeout=60000&connTimeout=15000
[junit4:junit4]   2> 13875 T4702 oaz.ZooKeeper.<init> Initiating client connection, connectString=127.0.0.1:50602/solr sessionTimeout=30000 watcher=org.apache.solr.common.cloud.ConnectionManager@f73e91e
[junit4:junit4]   2> 13876 T4702 oascc.ConnectionManager.waitForConnected Waiting for client to connect to ZooKeeper
[junit4:junit4]   2> 13877 T4788 oaz.ClientCnxn$SendThread.logStartConnect Opening socket connection to server localhost/127.0.0.1:50602. Will not attempt to authenticate using SASL (access denied ("javax.security.auth.AuthPermission" "getLoginConfiguration"))
[junit4:junit4]   2> 13878 T4788 oaz.ClientCnxn$SendThread.primeConnection Socket connection established to localhost/127.0.0.1:50602, initiating session
[junit4:junit4]   2> 13878 T4704 oazs.NIOServerCnxnFactory.run Accepted socket connection from /127.0.0.1:50621
[junit4:junit4]   2> 13879 T4704 oazs.ZooKeeperServer.processConnectRequest Client attempting to establish new session at /127.0.0.1:50621
[junit4:junit4]   2> 13880 T4706 oazs.ZooKeeperServer.finishSessionInit Established session 0x13ca748d3c6000c with negotiated timeout 20000 for client /127.0.0.1:50621
[junit4:junit4]   2> 13880 T4788 oaz.ClientCnxn$SendThread.onConnected Session establishment complete on server localhost/127.0.0.1:50602, sessionid = 0x13ca748d3c6000c, negotiated timeout = 20000
[junit4:junit4]   2> 13881 T4789 oascc.ConnectionManager.process Watcher org.apache.solr.common.cloud.ConnectionManager@f73e91e name:ZooKeeperConnection Watcher:127.0.0.1:50602/solr got event WatchedEvent state:SyncConnected type:None path:null path:null type:None
[junit4:junit4]   2> 13881 T4702 oascc.ConnectionManager.waitForConnected Client is connected to ZooKeeper
[junit4:junit4]   2> 13882 T4707 oazs.PrepRequestProcessor.pRequest Got user-level KeeperException when processing sessionid:0x13ca748d3c6000c type:create cxid:0x1 zxid:0x9f txntype:-1 reqpath:n/a Error Path:/solr/overseer Error:KeeperErrorCode = NodeExists for /solr/overseer
[junit4:junit4]   2> 13884 T4707 oazs.PrepRequestProcessor.pRequest Got user-level KeeperException when processing sessionid:0x13ca748d3c6000c type:create cxid:0x2 zxid:0xa0 txntype:-1 reqpath:n/a Error Path:/solr/overseer Error:KeeperErrorCode = NodeExists for /solr/overseer
[junit4:junit4]   2> 13885 T4702 oasc.ZkController.createEphemeralLiveNode Register node as live in ZooKeeper:/live_nodes/127.0.0.1:50619__
[junit4:junit4]   2> 13886 T4707 oazs.PrepRequestProcessor.pRequest Got user-level KeeperException when processing sessionid:0x13ca748d3c6000c type:delete cxid:0x4 zxid:0xa1 txntype:-1 reqpath:n/a Error Path:/solr/live_nodes/127.0.0.1:50619__ Error:KeeperErrorCode = NoNode for /solr/live_nodes/127.0.0.1:50619__
[junit4:junit4]   2> 13887 T4702 oascc.SolrZkClient.makePath makePath: /live_nodes/127.0.0.1:50619__
[junit4:junit4]   2> 13891 T4743 oascc.ZkStateReader$2.process A cluster state change: WatchedEvent state:SyncConnected type:NodeChildrenChanged path:/live_nodes, has occurred - updating... (live nodes size: 4)
[junit4:junit4]   2> 13891 T4773 oascc.ZkStateReader$2.process A cluster state change: WatchedEvent state:SyncConnected type:NodeChildrenChanged path:/live_nodes, has occurred - updating... (live nodes size: 4)
[junit4:junit4]   2> 13891 T4724 oascc.ZkStateReader$2.process A cluster state change: WatchedEvent state:SyncConnected type:NodeChildrenChanged path:/live_nodes, has occurred - updating... (live nodes size: 4)
[junit4:junit4]   2> 13893 T4758 oascc.ZkStateReader$3.process Updating live nodes... (5)
[junit4:junit4]   2> 13893 T4758 oascc.ZkStateReader$2.process A cluster state change: WatchedEvent state:SyncConnected type:NodeChildrenChanged path:/live_nodes, has occurred - updating... (live nodes size: 5)
[junit4:junit4]   2> 13894 T4730 oascc.ZkStateReader$3.process Updating live nodes... (5)
[junit4:junit4]   2> 13894 T4730 oascc.ZkStateReader$2.process A cluster state change: WatchedEvent state:SyncConnected type:NodeChildrenChanged path:/live_nodes, has occurred - updating... (live nodes size: 5)
[junit4:junit4]   2> 13896 T4743 oascc.ZkStateReader$3.process Updating live nodes... (5)
[junit4:junit4]   2> 13897 T4773 oascc.ZkStateReader$3.process Updating live nodes... (5)
[junit4:junit4]   2> 13897 T4724 oascc.ZkStateReader$3.process Updating live nodes... (5)
[junit4:junit4]   2> 13903 T4702 oascc.ZkStateReader.createClusterStateWatchersAndUpdate Updating cluster state from ZooKeeper... 
[junit4:junit4]   2> 13912 T4790 oasc.CoreContainer.create Creating SolrCore 'collection1' using instanceDir: /Users/jenkins/jenkins-slave/workspace/Lucene-Solr-trunk-MacOSX/solr/build/solr-core/test/J0/./org.apache.solr.cloud.BasicDistributedZk2Test-jetty4-1360016246634/collection1
[junit4:junit4]   2> 13912 T4790 oasc.ZkController.createCollectionZkNode Check for collection zkNode:collection1
[junit4:junit4]   2> 13913 T4790 oasc.ZkController.createCollectionZkNode Collection zkNode exists
[junit4:junit4]   2> 13914 T4790 oasc.ZkController.readConfigName Load collection config from:/collections/collection1
[junit4:junit4]   2> 13916 T4790 oasc.SolrResourceLoader.<init> new SolrResourceLoader for directory: '/Users/jenkins/jenkins-slave/workspace/Lucene-Solr-trunk-MacOSX/solr/build/solr-core/test/J0/./org.apache.solr.cloud.BasicDistributedZk2Test-jetty4-1360016246634/collection1/'
[junit4:junit4]   2> 13917 T4790 oasc.SolrResourceLoader.replaceClassLoader Adding 'file:/Users/jenkins/jenkins-slave/workspace/Lucene-Solr-trunk-MacOSX/solr/build/solr-core/test/J0/org.apache.solr.cloud.BasicDistributedZk2Test-jetty4-1360016246634/collection1/lib/classes/' to classloader
[junit4:junit4]   2> 13918 T4790 oasc.SolrResourceLoader.replaceClassLoader Adding 'file:/Users/jenkins/jenkins-slave/workspace/Lucene-Solr-trunk-MacOSX/solr/build/solr-core/test/J0/org.apache.solr.cloud.BasicDistributedZk2Test-jetty4-1360016246634/collection1/lib/README' to classloader
[junit4:junit4]   2> 13938 T4725 oascc.ZkStateReader.updateClusterState Updating cloud state from ZooKeeper... 
[junit4:junit4]   2> 13939 T4725 oasc.Overseer$ClusterStateUpdater.updateState Update state numShards=2 message={
[junit4:junit4]   2> 	  "operation":"state",
[junit4:junit4]   2> 	  "numShards":"2",
[junit4:junit4]   2> 	  "shard":"shard1",
[junit4:junit4]   2> 	  "roles":null,
[junit4:junit4]   2> 	  "state":"recovering",
[junit4:junit4]   2> 	  "core":"collection1",
[junit4:junit4]   2> 	  "collection":"collection1",
[junit4:junit4]   2> 	  "node_name":"127.0.0.1:50615__",
[junit4:junit4]   2> 	  "base_url":"http://127.0.0.1:50615/_"}
[junit4:junit4]   2> 13946 T4758 oascc.ZkStateReader$2.process A cluster state change: WatchedEvent state:SyncConnected type:NodeDataChanged path:/clusterstate.json, has occurred - updating... (live nodes size: 5)
[junit4:junit4]   2> 13946 T4773 oascc.ZkStateReader$2.process A cluster state change: WatchedEvent state:SyncConnected type:NodeDataChanged path:/clusterstate.json, has occurred - updating... (live nodes size: 5)
[junit4:junit4]   2> 13946 T4789 oascc.ZkStateReader$2.process A cluster state change: WatchedEvent state:SyncConnected type:NodeDataChanged path:/clusterstate.json, has occurred - updating... (live nodes size: 5)
[junit4:junit4]   2> 13946 T4730 oascc.ZkStateReader$2.process A cluster state change: WatchedEvent state:SyncConnected type:NodeDataChanged path:/clusterstate.json, has occurred - updating... (live nodes size: 5)
[junit4:junit4]   2> 13947 T4743 oascc.ZkStateReader$2.process A cluster state change: WatchedEvent state:SyncConnected type:NodeDataChanged path:/clusterstate.json, has occurred - updating... (live nodes size: 5)
[junit4:junit4]   2> 13946 T4724 oascc.ZkStateReader$2.process A cluster state change: WatchedEvent state:SyncConnected type:NodeDataChanged path:/clusterstate.json, has occurred - updating... (live nodes size: 5)
[junit4:junit4]   2> 13992 T4790 oasc.SolrConfig.<init> Using Lucene MatchVersion: LUCENE_50
[junit4:junit4]   2> 14065 T4790 oasc.SolrConfig.<init> Loaded SolrConfig: solrconfig.xml
[junit4:junit4]   2> 14067 T4790 oass.IndexSchema.readSchema Reading Solr Schema
[junit4:junit4]   2> 14087 T4790 oass.IndexSchema.readSchema Schema name=test
[junit4:junit4]   2> 14698 T4790 oass.OpenExchangeRatesOrgProvider.init Initialized with rates=open-exchange-rates.json, refreshInterval=1440.
[junit4:junit4]   2> 14710 T4790 oass.IndexSchema.readSchema default search field in schema is text
[junit4:junit4]   2> 14714 T4790 oass.IndexSchema.readSchema unique key field: id
[junit4:junit4]   2> 14738 T4790 oass.FileExchangeRateProvider.reload Reloading exchange rates from file currency.xml
[junit4:junit4]   2> 14746 T4790 oass.FileExchangeRateProvider.reload Reloading exchange rates from file currency.xml
[junit4:junit4]   2> 14751 T4790 oass.OpenExchangeRatesOrgProvider.reload Reloading exchange rates from open-exchange-rates.json
[junit4:junit4]   2> 14753 T4790 oass.OpenExchangeRatesOrgProvider.reload Reloading exchange rates from open-exchange-rates.json
[junit4:junit4]   2> 14754 T4790 oasc.SolrCore.<init> [collection1] Opening new SolrCore at /Users/jenkins/jenkins-slave/workspace/Lucene-Solr-trunk-MacOSX/solr/build/solr-core/test/J0/./org.apache.solr.cloud.BasicDistributedZk2Test-jetty4-1360016246634/collection1/, dataDir=./org.apache.solr.cloud.BasicDistributedZk2Test-1360016233408/jetty4/
[junit4:junit4]   2> 14755 T4790 oasc.JmxMonitoredMap.<init> JMX monitoring is enabled. Adding Solr mbeans to JMX Server: com.sun.jmx.mbeanserver.JmxMBeanServer@4506213e
[junit4:junit4]   2> 14755 T4790 oasc.SolrCore.initDirectoryFactory solr.StandardDirectoryFactory
[junit4:junit4]   2> 14756 T4790 oasc.CachingDirectoryFactory.get return new directory for /Users/jenkins/jenkins-slave/workspace/Lucene-Solr-trunk-MacOSX/solr/build/solr-core/test/J0/./org.apache.solr.cloud.BasicDistributedZk2Test-1360016233408/jetty4 forceNew:false
[junit4:junit4]   2> 14757 T4790 oasc.CachingDirectoryFactory.close Releasing directory:/Users/jenkins/jenkins-slave/workspace/Lucene-Solr-trunk-MacOSX/solr/build/solr-core/test/J0/./org.apache.solr.cloud.BasicDistributedZk2Test-1360016233408/jetty4
[junit4:junit4]   2> 14757 T4790 oasc.SolrCore.getNewIndexDir New index directory detected: old=null new=./org.apache.solr.cloud.BasicDistributedZk2Test-1360016233408/jetty4/index/
[junit4:junit4]   2> 14757 T4790 oasc.SolrCore.initIndex WARNING [collection1] Solr index directory './org.apache.solr.cloud.BasicDistributedZk2Test-1360016233408/jetty4/index' doesn't exist. Creating new index...
[junit4:junit4]   2> 14758 T4790 oasc.CachingDirectoryFactory.get return new directory for /Users/jenkins/jenkins-slave/workspace/Lucene-Solr-trunk-MacOSX/solr/build/solr-core/test/J0/./org.apache.solr.cloud.BasicDistributedZk2Test-1360016233408/jetty4/index forceNew:false
[junit4:junit4]   2> 14761 T4790 oasc.SolrDeletionPolicy.onCommit SolrDeletionPolicy.onCommit: commits:num=1
[junit4:junit4]   2> 		commit{dir=RateLimitedDirectoryWrapper(org.apache.lucene.store.NIOFSDirectory@/Users/jenkins/jenkins-slave/workspace/Lucene-Solr-trunk-MacOSX/solr/build/solr-core/test/J0/org.apache.solr.cloud.BasicDistributedZk2Test-1360016233408/jetty4/index lockFactory=org.apache.lucene.store.NativeFSLockFactory@19d7e358),segFN=segments_1,generation=1,filenames=[segments_1]
[junit4:junit4]   2> 14761 T4790 oasc.SolrDeletionPolicy.updateCommits newest commit = 1[segments_1]
[junit4:junit4]   2> 14761 T4790 oasc.CachingDirectoryFactory.close Releasing directory:/Users/jenkins/jenkins-slave/workspace/Lucene-Solr-trunk-MacOSX/solr/build/solr-core/test/J0/./org.apache.solr.cloud.BasicDistributedZk2Test-1360016233408/jetty4/index
[junit4:junit4]   2> 14762 T4790 oasc.SolrCore.initWriters created xml: solr.XMLResponseWriter
[junit4:junit4]   2> 14763 T4790 oasup.UpdateRequestProcessorChain.init inserting DistributedUpdateProcessorFactory into updateRequestProcessorChain "dedupe"
[junit4:junit4]   2> 14763 T4790 oasup.UpdateRequestProcessorChain.init inserting DistributedUpdateProcessorFactory into updateRequestProcessorChain "dedupe-allfields"
[junit4:junit4]   2> 14764 T4790 oasup.UpdateRequestProcessorChain.init inserting DistributedUpdateProcessorFactory into updateRequestProcessorChain "stored_sig"
[junit4:junit4]   2> 14764 T4790 oasup.UpdateRequestProcessorChain.init inserting DistributedUpdateProcessorFactory into updateRequestProcessorChain "uniq-fields"
[junit4:junit4]   2> 14764 T4790 oasup.UpdateRequestProcessorChain.init inserting DistributedUpdateProcessorFactory into updateRequestProcessorChain "distrib-dup-test-chain-implicit"
[junit4:junit4]   2> 14765 T4790 oasc.RequestHandlers.initHandlersFromConfig adding lazy requestHandler: solr.ReplicationHandler
[junit4:junit4]   2> 14765 T4790 oasc.RequestHandlers.initHandlersFromConfig created /replication: solr.ReplicationHandler
[junit4:junit4]   2> 14765 T4790 oasc.RequestHandlers.initHandlersFromConfig created standard: solr.StandardRequestHandler
[junit4:junit4]   2> 14767 T4790 oasc.RequestHandlers.initHandlersFromConfig created /get: solr.RealTimeGetHandler
[junit4:junit4]   2> 14768 T4790 oasc.RequestHandlers.initHandlersFromConfig created dismax: solr.SearchHandler
[junit4:junit4]   2> 14768 T4790 oasc.RequestHandlers.initHandlersFromConfig created mock: org.apache.solr.core.MockQuerySenderListenerReqHandler
[junit4:junit4]   2> 14769 T4790 oasc.RequestHandlers.initHandlersFromConfig created /admin/: org.apache.solr.handler.admin.AdminHandlers
[junit4:junit4]   2> 14769 T4790 oasc.RequestHandlers.initHandlersFromConfig created defaults: solr.StandardRequestHandler
[junit4:junit4]   2> 14769 T4790 oasc.RequestHandlers.initHandlersFromConfig adding lazy requestHandler: solr.StandardRequestHandler
[junit4:junit4]   2> 14770 T4790 oasc.RequestHandlers.initHandlersFromConfig created lazy: solr.StandardRequestHandler
[junit4:junit4]   2> 14770 T4790 oasc.RequestHandlers.initHandlersFromConfig created /update: solr.UpdateRequestHandler
[junit4:junit4]   2> 14771 T4790 oasc.RequestHandlers.initHandlersFromConfig created /terms: org.apache.solr.handler.component.SearchHandler
[junit4:junit4]   2> 14771 T4790 oasc.RequestHandlers.initHandlersFromConfig created spellCheckCompRH: org.apache.solr.handler.component.SearchHandler
[junit4:junit4]   2> 14772 T4790 oasc.RequestHandlers.initHandlersFromConfig created spellCheckCompRH_Direct: org.apache.solr.handler.component.SearchHandler
[junit4:junit4]   2> 14772 T4790 oasc.RequestHandlers.initHandlersFromConfig created spellCheckWithWordbreak: org.apache.solr.handler.component.SearchHandler
[junit4:junit4]   2> 14773 T4790 oasc.RequestHandlers.initHandlersFromConfig created spellCheckWithWordbreak_Direct: org.apache.solr.handler.component.SearchHandler
[junit4:junit4]   2> 14773 T4790 oasc.RequestHandlers.initHandlersFromConfig created spellCheckCompRH1: org.apache.solr.handler.component.SearchHandler
[junit4:junit4]   2> 14774 T4790 oasc.RequestHandlers.initHandlersFromConfig created mltrh: org.apache.solr.handler.component.SearchHandler
[junit4:junit4]   2> 14774 T4790 oasc.RequestHandlers.initHandlersFromConfig created tvrh: org.apache.solr.handler.component.SearchHandler
[junit4:junit4]   2> 14774 T4790 oasc.RequestHandlers.initHandlersFromConfig created /mlt: solr.MoreLikeThisHandler
[junit4:junit4]   2> 14775 T4790 oasc.RequestHandlers.initHandlersFromConfig created /debug/dump: solr.DumpRequestHandler
[junit4:junit4]   2> 14780 T4790 oashl.XMLLoader.init xsltCacheLifetimeSeconds=60
[junit4:junit4]   2> 14782 T4790 oasc.SolrCore.initDeprecatedSupport WARNING solrconfig.xml uses deprecated <admin/gettableFiles>, Please update your config to use the ShowFileRequestHandler.
[junit4:junit4]   2> 14784 T4790 oasc.SolrCore.initDeprecatedSupport WARNING adding ShowFileRequestHandler with hidden files: [SCHEMA.XML, OLD_SYNONYMS.TXT, STOPWORDS.TXT, PROTWORDS.TXT, OPEN-EXCHANGE-RATES.JSON, SYNONYMS.TXT, CURRENCY.XML, MAPPING-ISOLATIN1ACCENT.TXT]
[junit4:junit4]   2> 14786 T4790 oasc.CachingDirectoryFactory.close Releasing directory:/Users/jenkins/jenkins-slave/workspace/Lucene-Solr-trunk-MacOSX/solr/build/solr-core/test/J0/./org.apache.solr.cloud.BasicDistributedZk2Test-1360016233408/jetty4
[junit4:junit4]   2> 14787 T4790 oass.SolrIndexSearcher.<init> Opening Searcher@53e3cbb6 main
[junit4:junit4]   2> 14788 T4790 oasu.CommitTracker.<init> Hard AutoCommit: disabled
[junit4:junit4]   2> 14788 T4790 oasu.CommitTracker.<init> Soft AutoCommit: disabled
[junit4:junit4]   2> 14789 T4790 oashc.SpellCheckComponent.inform Initializing spell checkers
[junit4:junit4]   2> 14793 T4790 oass.DirectSolrSpellChecker.init init: {name=direct,classname=DirectSolrSpellChecker,field=lowerfilt,minQueryLength=3}
[junit4:junit4]   2> 14821 T4791 oasc.SolrCore.registerSearcher [collection1] Registered new searcher Searcher@53e3cbb6 main{StandardDirectoryReader(segments_1:1)}
[junit4:junit4]   2> 14827 T4790 oasc.ZkController.publish publishing core=collection1 state=down
[junit4:junit4]   2> 14827 T4790 oasc.ZkController.publish numShards not found on descriptor - reading it from system property
[junit4:junit4]   2> 15483 T4725 oascc.ZkStateReader.updateClusterState Updating cloud state from ZooKeeper... 
[junit4:junit4]   2> 15484 T4725 oasc.Overseer$ClusterStateUpdater.updateState Update state numShards=2 message={
[junit4:junit4]   2> 	  "operation":"state",
[junit4:junit4]   2> 	  "numShards":"2",
[junit4:junit4]   2> 	  "shard":null,
[junit4:junit4]   2> 	  "roles":null,
[junit4:junit4]   2> 	  "state":"down",
[junit4:junit4]   2> 	  "core":"collection1",
[junit4:junit4]   2> 	  "collection":"collection1",
[junit4:junit4]   2> 	  "node_name":"127.0.0.1:50619__",
[junit4:junit4]   2> 	  "base_url":"http://127.0.0.1:50619/_"}
[junit4:junit4]   2> 15484 T4725 oasc.Overseer$ClusterStateUpdater.updateState Collection already exists with numShards=2
[junit4:junit4]   2> 15485 T4725 oasc.Overseer$ClusterStateUpdater.updateState Assigning new node to shard shard=shard2
[junit4:junit4]   2> 15492 T4773 oascc.ZkStateReader$2.process A cluster state change: WatchedEvent state:SyncConnected type:NodeDataChanged path:/clusterstate.json, has occurred - updating... (live nodes size: 5)
[junit4:junit4]   2> 15492 T4743 oascc.ZkStateReader$2.process A cluster state change: WatchedEvent state:SyncConnected type:NodeDataChanged path:/clusterstate.json, has occurred - updating... (live nodes size: 5)
[junit4:junit4]   2> 15492 T4724 oascc.ZkStateReader$2.process A cluster state change: WatchedEvent state:SyncConnected type:NodeDataChanged path:/clusterstate.json, has occurred - updating... (live nodes size: 5)
[junit4:junit4]   2> 15492 T4730 oascc.ZkStateReader$2.process A cluster state change: WatchedEvent state:SyncConnected type:NodeDataChanged path:/clusterstate.json, has occurred - updating... (live nodes size: 5)
[junit4:junit4]   2> 15492 T4789 oascc.ZkStateReader$2.process A cluster state change: WatchedEvent state:SyncConnected type:NodeDataChanged path:/clusterstate.json, has occurred - updating... (live nodes size: 5)
[junit4:junit4]   2> 15492 T4758 oascc.ZkStateReader$2.process A cluster state change: WatchedEvent state:SyncConnected type:NodeDataChanged path:/clusterstate.json, has occurred - updating... (live nodes size: 5)
[junit4:junit4]   2> 15830 T4790 oasc.CoreContainer.registerCore registering core: collection1
[junit4:junit4]   2> 15831 T4790 oasc.ZkController.register Register replica - core:collection1 address:http://127.0.0.1:50619/_ collection:collection1 shard:shard2
[junit4:junit4]   2> 15841 T4790 oasc.ZkController.register We are http://127.0.0.1:50619/_/collection1/ and leader is http://127.0.0.1:50612/_/collection1/
[junit4:junit4]   2> 15842 T4790 oasc.ZkController.register No LogReplay needed for core=collection1 baseURL=http://127.0.0.1:50619/_
[junit4:junit4]   2> 15843 T4790 oasc.ZkController.checkRecovery Core needs to recover:collection1
[junit4:junit4]   2> 15844 T4790 oasu.DefaultSolrCoreState.doRecovery Running recovery - first canceling any ongoing recovery
[junit4:junit4]   2> ASYNC  NEW_CORE C349 name=collection1 org.apache.solr.core.SolrCore@51eb0143 url=http://127.0.0.1:50619/_/collection1 node=127.0.0.1:50619__ C349_STATE=coll:collection1 core:collection1 props:{shard=null, roles=null, state=down, core=collection1, collection=collection1, node_name=127.0.0.1:50619__, base_url=http://127.0.0.1:50619/_}
[junit4:junit4]   2> 15845 T4792 C349 P50619 oasc.RecoveryStrategy.run Starting recovery process.  core=collection1 recoveringAfterStartup=true
[junit4:junit4]   2> 15846 T4792 C349 P50619 oasc.RecoveryStrategy.doRecovery ###### startupVersions=[]
[junit4:junit4]   2> 15846 T4790 oascc.ZkStateReader.updateClusterState Updating cloud state from ZooKeeper... 
[junit4:junit4]   2> 15847 T4792 C349 P50619 oasc.ZkController.publish publishing core=collection1 state=recovering
[junit4:junit4]   2> 15849 T4792 C349 P50619 oasc.ZkController.publish numShards not found on descriptor - reading it from system property
[junit4:junit4]   2> 15850 T4702 oass.SolrDispatchFilter.init user.dir=/Users/jenkins/jenkins-slave/workspace/Lucene-Solr-trunk-MacOSX/solr/build/solr-core/test/J0
[junit4:junit4]   2> 15852 T4792 C349 P50619 oascsi.HttpClientUtil.createClient Creating new http client, config:maxConnections=128&maxConnectionsPerHost=32&followRedirects=false
[junit4:junit4]   2> 15852 T4702 oass.SolrDispatchFilter.init SolrDispatchFilter.init() done
[junit4:junit4]   2> 15854 T4702 oascsi.HttpClientUtil.createClient Creating new http client, config:maxConnections=128&maxConnectionsPerHost=32&followRedirects=false
[junit4:junit4]   2> 15874 T4702 oascc.ZkStateReader.updateClusterState Updating cloud state from ZooKeeper... 
[junit4:junit4]   2> ASYNC  NEW_CORE C350 name=collection1 org.apache.solr.core.SolrCore@8ed88ac url=http://127.0.0.1:50605/_/collection1 node=127.0.0.1:50605__ C350_STATE=coll:control_collection core:collection1 props:{shard=shard1, roles=null, state=active, core=collection1, collection=control_collection, node_name=127.0.0.1:50605__, base_url=http://127.0.0.1:50605/_, leader=true}
[junit4:junit4]   2> 15886 T4716 C350 P50605 oasc.CachingDirectoryFactory.close Releasing directory:/Users/jenkins/jenkins-slave/workspace/Lucene-Solr-trunk-MacOSX/solr/build/solr-core/test/J0/./org.apache.solr.cloud.BasicDistributedZk2Test-1360016233408/control/data
[junit4:junit4]   2> 15889 T4716 C350 P50605 oasc.SolrDeletionPolicy.onInit SolrDeletionPolicy.onInit: commits:num=1
[junit4:junit4]   2> 		commit{dir=RateLimitedDirectoryWrapper(org.apache.lucene.store.NIOFSDirectory@/Users/jenkins/jenkins-slave/workspace/Lucene-Solr-trunk-MacOSX/solr/build/solr-core/test/J0/org.apache.solr.cloud.BasicDistributedZk2Test-1360016233408/control/data/index lockFactory=org.apache.lucene.store.NativeFSLockFactory@62df5ff4),segFN=segments_1,generation=1,filenames=[segments_1]
[junit4:junit4]   2> 15890 T4716 C350 P50605 oasc.SolrDeletionPolicy.updateCommits newest commit = 1[segments_1]
[junit4:junit4]   2> 15895 T4716 C350 P50605 /update {wt=javabin&version=2} {add=[1 (1426080398611316736)]} 0 11
[junit4:junit4]   2> ASYNC  NEW_CORE C351 name=collection1 org.apache.solr.core.SolrCore@751c978b url=http://127.0.0.1:50609/_/collection1 node=127.0.0.1:50609__ C351_STATE=coll:collection1 core:collection1 props:{shard=shard1, roles=null, state=active, core=collection1, collection=collection1, node_name=127.0.0.1:50609__, base_url=http://127.0.0.1:50609/_, leader=true}
[junit4:junit4]   2> 15906 T4736 C351 P50609 oasc.CachingDirectoryFactory.close Releasing directory:/Users/jenkins/jenkins-slave/workspace/Lucene-Solr-trunk-MacOSX/solr/build/solr-core/test/J0/./org.apache.solr.cloud.BasicDistributedZk2Test-1360016233408/jetty1
[junit4:junit4]   2> 15910 T4736 C351 P50609 oasc.SolrDeletionPolicy.onInit SolrDeletionPolicy.onInit: commits:num=1
[junit4:junit4]   2> 		commit{dir=RateLimitedDirectoryWrapper(org.apache.lucene.store.NIOFSDirectory@/Users/jenkins/jenkins-slave/workspace/Lucene-Solr-trunk-MacOSX/solr/build/solr-core/test/J0/org.apache.solr.cloud.BasicDistributedZk2Test-1360016233408/jetty1/index lockFactory=org.apache.lucene.store.NativeFSLockFactory@47e85781),segFN=segments_1,generation=1,filenames=[segments_1]
[junit4:junit4]   2> 15911 T4736 C351 P50609 oasc.SolrDeletionPolicy.updateCommits newest commit = 1[segments_1]
[junit4:junit4]   2>  C348_STATE=coll:collection1 core:collection1 props:{shard=shard1, roles=null, state=recovering, core=collection1, collection=collection1, node_name=127.0.0.1:50615__, base_url=http://127.0.0.1:50615/_}
[junit4:junit4]   2> 15924 T4767 C348 P50615 oasc.CachingDirectoryFactory.close Releasing directory:/Users/jenkins/jenkins-slave/workspace/Lucene-Solr-trunk-MacOSX/solr/build/solr-core/test/J0/./org.apache.solr.cloud.BasicDistributedZk2Test-1360016233408/jetty3
[junit4:junit4]   2> 15927 T4767 C348 P50615 oasc.SolrDeletionPolicy.onInit SolrDeletionPolicy.onInit: commits:num=1
[junit4:junit4]   2> 		commit{dir=RateLimitedDirectoryWrapper(org.apache.lucene.store.NIOFSDirectory@/Users/jenkins/jenkins-slave/workspace/Lucene-Solr-trunk-MacOSX/solr/build/solr-core/test/J0/org.apache.solr.cloud.BasicDistributedZk2Test-1360016233408/jetty3/index lockFactory=org.apache.lucene.store.NativeFSLockFactory@3e1ade7d),segFN=segments_1,generation=1,filenames=[segments_1]
[junit4:junit4]   2> 15928 T4767 C348 P50615 oasc.SolrDeletionPolicy.updateCommits newest commit = 1[segments_1]
[junit4:junit4]   2> 15933 T4767 C348 P50615 /update {distrib.from=http://127.0.0.1:50609/_/collection1/&update.distrib=FROMLEADER&wt=javabin&version=2} {add=[1 (1426080398632288256)]} 0 10
[junit4:junit4]   2> 15934 T4736 C351 P50609 /update {wt=javabin&version=2} {add=[1 (1426080398632288256)]} 0 30
[junit4:junit4]   2> 15939 T4717 C350 P50605 oasu.DirectUpdateHandler2.commit start commit{,optimize=false,openSearcher=true,waitSearcher=true,expungeDeletes=false,softCommit=false}
[junit4:junit4]   2> 15963 T4717 C350 P50605 oasc.SolrDeletionPolicy.onCommit SolrDeletionPolicy.onCommit: commits:num=2
[junit4:junit4]   2> 		commit{dir=RateLimitedDirectoryWrapper(org.apache.lucene.store.NIOFSDirectory@/Users/jenkins/jenkins-slave/workspace/Lucene-Solr-trunk-MacOSX/solr/build/solr-core/test/J0/org.apache.solr.cloud.BasicDistributedZk2Test-1360016233408/control/data/index lockFactory=org.apache.lucene.store.NativeFSLockFactory@62df5ff4),segFN=segments_1,generation=1,filenames=[segments_1]
[junit4:junit4]   2> 		commit{dir=RateLimitedDirectoryWrapper(org.apache.lucene.store.NIOFSDirectory@/Users/jenkins/jenkins-slave/workspace/Lucene-Solr-trunk-MacOSX/solr/build/solr-core/test/J0/org.apache.solr.cloud.BasicDistributedZk2Test-1360016233408/control/data/index lockFactory=org.apache.lucene.store.NativeFSLockFactory@62df5ff4),segFN=segments_2,generation=2,filenames=[_0_Lucene41_0.pos, _0_TestBloomFilteredLucene41Postings_0.tim, _0_TestBloomFilteredLucene41Postings_0.tip, _0_MockFixedIntBlock_0.tib, _0_TestBloomFilteredLucene41Postings_0.pos, _0_MockFixedIntBlock_0.pyl, _0_MockFixedIntBlock_0.skp, _0_Pulsing41_0.tim, _0_Pulsing41_0.tip, _0_MockFixedIntBlock_0.tii, _0.si, _0_Lucene41_0.tim, _0_Lucene41_0.tip, _0.fnm, _0_TestBloomFilteredLucene41Postings_0.blm, _0_MockFixedIntBlock_0.pos, _0_nrm.cfs, _0_MockFixedIntBlock_0.frq, _0_Pulsing41_0.doc, _0_Pulsing41_0.pos, _0_Lucene41_0.doc, _0_MockFixedIntBlock_0.doc, _0_nrm.cfe, _0_TestBloomFilteredLucene41Postings_0.doc, segments_2, _0.fdx, _0.fdt]
[junit4:junit4]   2> 15963 T4717 C350 P50605 oasc.SolrDeletionPolicy.updateCommits newest commit = 2[_0_Lucene41_0.pos, _0_TestBloomFilteredLucene41Postings_0.tim, _0_TestBloomFilteredLucene41Postings_0.tip, _0_MockFixedIntBlock_0.tib, _0_TestBloomFilteredLucene41Postings_0.pos, _0_MockFixedIntBlock_0.pyl, _0_MockFixedIntBlock_0.skp, _0_Pulsing41_0.tim, _0_Pulsing41_0.tip, _0_MockFixedIntBlock_0.tii, _0.si, _0_Lucene41_0.tim, _0_Lucene41_0.tip, _0.fnm, _0_TestBloomFilteredLucene41Postings_0.blm, _0_MockFixedIntBlock_0.pos, _0_nrm.cfs, _0_MockFixedIntBlock_0.frq, _0_Pulsing41_0.doc, _0_Pulsing41_0.pos, _0_Lucene41_0.doc, _0_MockFixedIntBlock_0.doc, _0_nrm.cfe, _0_TestBloomFilteredLucene41Postings_0.doc, segments_2, _0.fdx, _0.fdt]
[junit4:junit4]   2> 15964 T4717 C350 P50605 oasc.CachingDirectoryFactory.close Releasing directory:/Users/jenkins/jenkins-slave/workspace/Lucene-Solr-trunk-MacOSX/solr/build/solr-core/test/J0/./org.apache.solr.cloud.BasicDistributedZk2Test-1360016233408/control/data
[junit4:junit4]   2> 15974 T4717 C350 P50605 oass.SolrIndexSearcher.<init> Opening Searcher@217ff724 main
[junit4:junit4]   2> 15976 T4717 C350 P50605 oasu.DirectUpdateHandler2.commit end_commit_flush
[junit4:junit4]   2> 15977 T4728 oasc.SolrCore.registerSearcher [collection1] Registered new searcher Searcher@217ff724 main{StandardDirectoryReader(segments_2:3 _0(5.0):C1)}
[junit4:junit4]   2> 15978 T4728 oasc.CachingDirectoryFactory.close Releasing directory:/Users/jenkins/jenkins-slave/workspace/Lucene-Solr-trunk-MacOSX/solr/build/solr-core/test/J0/./org.apache.solr.cloud.BasicDistributedZk2Test-1360016233408/control/data/index
[junit4:junit4]   2> 15978 T4717 C350 P50605 /update {waitSearcher=true&commit=true&wt=javabin&version=2&softCommit=false} {commit=} 0 40
[junit4:junit4]   2> 15982 T4739 C351 P50609 oasu.DirectUpdateHandler2.commit start commit{,optimize=false,openSearcher=true,waitSearcher=true,expungeDeletes=false,softCommit=false}
[junit4:junit4]   2> 16008 T4739 C351 P50609 oasc.SolrDeletionPolicy.onCommit SolrDeletionPolicy.onCommit: commits:num=2
[junit4:junit4]   2> 		commit{dir=RateLimitedDirectoryWrapper(org.apache.lucene.store.NIOFSDirectory@/Users/jenkins/jenkins-slave/workspace/Lucene-Solr-trunk-MacOSX/solr/build/solr-core/test/J0/org.apache.solr.cloud.BasicDistributedZk2Test-1360016233408/jetty1/index lockFactory=org.apache.lucene.store.NativeFSLockFactory@47e85781),segFN=segments_1,generation=1,filenames=[segments_1]
[junit4:junit4]   2> 		commit{dir=RateLimitedDirectoryWrapper(org.apache.lucene.store.NIOFSDirectory@/Users/jenkins/jenkins-slave/workspace/Lucene-Solr-trunk-MacOSX/solr/build/solr-core/test/J0/org.apache.solr.cloud.BasicDistributedZk2Test-1360016233408/jetty1/index lockFactory=org.apache.lucene.store.NativeFSLockFactory@47e85781),segFN=segments_2,generation=2,filenames=[_0_Lucene41_0.pos, _0_TestBloomFilteredLucene41Postings_0.tim, _0_TestBloomFilteredLucene41Postings_0.tip, _0_MockFixedIntBlock_0.tib, _0_TestBloomFilteredLucene41Postings_0.pos, _0_MockFixedIntBlock_0.pyl, _0_MockFixedIntBlock_0.skp, _0_Pulsing41_0.tim, _0_Pulsing41_0.tip, _0_MockFixedIntBlock_0.tii, _0.si, _0_Lucene41_0.tim, _0_Lucene41_0.tip, _0.fnm, _0_TestBloomFilteredLucene41Postings_0.blm, _0_MockFixedIntBlock_0.pos, _0_nrm.cfs, _0_MockFixedIntBlock_0.frq, _0_Pulsing41_0.doc, _0_Pulsing41_0.pos, _0_Lucene41_0.doc, _0_MockFixedIntBlock_0.doc, _0_nrm.cfe, _0_TestBloomFilteredLucene41Postings_0.doc, segments_2, _0.fdx, _0.fdt]
[junit4:junit4]   2> 16009 T4739 C351 P50609 oasc.SolrDeletionPolicy.updateCommits newest commit = 2[_0_Lucene41_0.pos, _0_TestBloomFilteredLucene41Postings_0.tim, _0_TestBloomFilteredLucene41Postings_0.tip, _0_MockFixedIntBlock_0.tib, _0_TestBloomFilteredLucene41Postings_0.pos, _0_MockFixedIntBlock_0.pyl, _0_MockFixedIntBlock_0.skp, _0_Pulsing41_0.tim, _0_Pulsing41_0.tip, _0_MockFixedIntBlock_0.tii, _0.si, _0_Lucene41_0.tim, _0_Lucene41_0.tip, _0.fnm, _0_TestBloomFilteredLucene41Postings_0.blm, _0_MockFixedIntBlock_0.pos, _0_nrm.cfs, _0_MockFixedIntBlock_0.frq, _0_Pulsing41_0.doc, _0_Pulsing41_0.pos, _0_Lucene41_0.doc, _0_MockFixedIntBlock_0.doc, _0_nrm.cfe, _0_TestBloomFilteredLucene41Postings_0.doc, segments_2, _0.fdx, _0.fdt]
[junit4:junit4]   2> 16010 T4739 C351 P50609 oasc.CachingDirectoryFactory.close Releasing directory:/Users/jenkins/jenkins-slave/workspace/Lucene-Solr-trunk-MacOSX/solr/build/solr-core/test/J0/./org.apache.solr.cloud.BasicDistributedZk2Test-1360016233408/jetty1
[junit4:junit4]   2> 16019 T4739 C351 P50609 oass.SolrIndexSearcher.<init> Opening Searcher@77066d09 main
[junit4:junit4]   2> 16020 T4739 C351 P50609 oasu.DirectUpdateHandler2.commit end_commit_flush
[junit4:junit4]   2> 16021 T4745 oasc.SolrCore.registerSearcher [collection1] Registered new searcher Searcher@77066d09 main{StandardDirectoryReader(segments_2:3 _0(5.0):C1)}
[junit4:junit4]   2> 16022 T4745 oasc.CachingDirectoryFactory.close Releasing directory:/Users/jenkins/jenkins-slave/workspace/Lucene-Solr-trunk-MacOSX/solr/build/solr-core/test/J0/./org.apache.solr.cloud.BasicDistributedZk2Test-1360016233408/jetty1/index
[junit4:junit4]   2> 16022 T4739 C351 P50609 oasu.SolrCmdDistributor.distribCommit Distrib commit to:[StdNode: http://127.0.0.1:50615/_/collection1/, StdNode: http://127.0.0.1:50612/_/collection1/, StdNode: http://127.0.0.1:50619/_/collection1/] params:commit_end_point=true&commit=true&softCommit=false&waitSearcher=true&expungeDeletes=false
[junit4:junit4]   2> 16026 T4768 C348 P50615 oasu.DirectUpdateHandler2.commit start commit{,optimize=false,openSearcher=true,waitSearcher=true,expungeDeletes=false,softCommit=false}
[junit4:junit4]   2> ASYNC  NEW_CORE C352 name=collection1 org.apache.solr.core.SolrCore@2c38288b url=http://127.0.0.1:50612/_/collection1 node=127.0.0.1:50612__ C352_STATE=coll:collection1 core:collection1 props:{shard=shard2, roles=null, state=active, core=collection1, collection=collection1, node_name=127.0.0.1:50612__, base_url=http://127.0.0.1:50612/_, leader=true}
[junit4:junit4]   2> 16052 T4751 C352 P50612 oasu.DirectUpdateHandler2.commit start commit{,optimize=false,openSearcher=true,waitSearcher=true,expungeDeletes=false,softCommit=false}
[junit4:junit4]   2> 16053 T4785 C349 P50619 oasu.DirectUpdateHandler2.commit start commit{,optimize=false,openSearcher=true,waitSearcher=true,expungeDeletes=false,softCommit=false}
[junit4:junit4]   2> 16064 T4751 C352 P50612 oasc.CachingDirectoryFactory.close Releasing directory:/Users/jenkins/jenkins-slave/workspace/Lucene-Solr-trunk-MacOSX/solr/build/solr-core/test/J0/./org.apache.solr.cloud.BasicDistributedZk2Test-1360016233408/jetty2
[junit4:junit4]   2> 16068 T4751 C352 P50612 oasc.SolrDeletionPolicy.onInit SolrDeletionPolicy.onInit: commits:num=1
[junit4:junit4]   2> 		commit{dir=RateLimitedDirectoryWrapper(org.apache.lucene.store.NIOFSDirectory@/Users/jenkins/jenkins-slave/workspace/Lucene-Solr-trunk-MacOSX/solr/build/solr-core/test/J0/org.apache.solr.cloud.BasicDistributedZk2Test-1360016233408/jetty2/index lockFactory=org.apache.lucene.store.NativeFSLockFactory@739e543b),segFN=segments_1,generation=1,filenames=[segments_1]
[junit4:junit4]   2> 16068 T4785 C349 P50619 oasc.CachingDirectoryFactory.close Releasing directory:/Users/jenkins/jenkins-slave/workspace/Lucene-Solr-trunk-MacOSX/solr/build/solr-core/test/J0/./org.apache.solr.cloud.BasicDistributedZk2Test-1360016233408/jetty4
[junit4:junit4]   2> 16071 T4785 C349 P50619 oasc.SolrDeletionPolicy.onInit SolrDeletionPolicy.onInit: commits:num=1
[junit4:junit4]   2> 		commit{dir=RateLimitedDirectoryWrapper(org.apache.lucene.store.NIOFSDirectory@/Users/jenkins/jenkins-slave/workspace/Lucene-Solr-trunk-MacOSX/solr/build/solr-core/test/J0/org.apache.solr.cloud.BasicDistributedZk2Test-1360016233408/jetty4/index lockFactory=org.apache.lucene.store.NativeFSLockFactory@19d7e358),segFN=segments_1,generation=1,filenames=[segments_1]
[junit4:junit4]   2> 16077 T4751 C352 P50612 oasc.SolrDeletionPolicy.updateCommits newest commit = 1[segments_1]
[junit4:junit4]   2> 16077 T4785 C349 P50619 oasc.SolrDeletionPolicy.updateCommits newest commit = 1[segments_1]
[junit4:junit4]   2> 16090 T4751 C352 P50612 oasc.SolrDeletionPolicy.onCommit SolrDeletionPolicy.onCommit: commits:num=2
[junit4:junit4]   2> 		commit{dir=RateLimitedDirectoryWrapper(org.apache.lucene.store.NIOFSDirectory@/Users/jenkins/jenkins-slave/workspace/Lucene-Solr-trunk-MacOSX/solr/build/solr-core/test/J0/org.apache.solr.cloud.BasicDistributedZk2Test-1360016233408/jetty2/index lockFactory=org.apache.lucene.store.NativeFSLockFactory@739e543b),segFN=segments_1,generation=1,filenames=[segments_1]
[junit4:junit4]   2> 		commit{dir=RateLimitedDirectoryWrapper(org.apache.lucene.store.NIOFSDirectory@/Users/jenkins/jenkins-slave/workspace/Lucene-Solr-trunk-MacOSX/solr/build/solr-core/test/J0/org.apache.solr.cloud.BasicDistributedZk2Test-1360016233408/jetty2/index lockFactory=org.apache.lucene.store.NativeFSLockFactory@739e543b),segFN=segments_2,generation=2,filenames=[segments_2]
[junit4:junit4]   2> 16091 T4751 C352 P50612 oasc.SolrDeletionPolicy.updateCommits newest commit = 2[segments_2]
[junit4:junit4]   2> 16092 T4785 C349 P50619 oasc.SolrDeletionPolicy.onCommit SolrDeletionPolicy.onCommit: commits:num=2
[junit4:junit4]   2> 		commit{dir=RateLimitedDirectoryWrapper(org.apache.lucene.store.NIOFSDirectory@/Users/jenkins/jenkins-slave/workspace/Lucene-Solr-trunk-MacOSX/solr/build/solr-core/test/J0/org.apache.solr.cloud.BasicDistributedZk2Test-1360016233408/jetty4/index lockFactory=org.apache.lucene.store.NativeFSLockFactory@19d7e358),segFN=segments_1,generation=1,filenames=[segments_1]
[junit4:junit4]   2> 		commit{dir=RateLimitedDirectoryWrapper(org.apache.lucene.store.NIOFSDirectory@/Users/jenkins/jenkins-slave/workspace/Lucene-Solr-trunk-MacOSX/solr/build/solr-core/test/J0/org.apache.solr.cloud.BasicDistributedZk2Test-1360016233408/jetty4/index lockFactory=org.apache.lucene.store.NativeFSLockFactory@19d7e358),segFN=segments_2,generation=2,filenames=[segments_2]
[junit4:junit4]   2> 16093 T4785 C349 P50619 oasc.SolrDeletionPolicy.updateCommits newest commit = 2[segments_2]
[junit4:junit4]   2> 16094 T4785 C349 P50619 oasc.CachingDirectoryFactory.close Releasing directory:/Users/jenkins/jenkins-slave/workspace/Lucene-Solr-trunk-MacOSX/solr/build/solr-core/test/J0/./org.apache.solr.cloud.BasicDistributedZk2Test-1360016233408/jetty4
[junit4:junit4]   2> 16096 T4785 C349 P50619 oass.SolrIndexSearcher.<init> Opening Searcher@3e78e423 main
[junit4:junit4]   2> 16097 T4785 C349 P50619 oasu.DirectUpdateHandler2.commit end_commit_flush
[junit4:junit4]   2> 16093 T4751 C352 P50612 oasc.CachingDirectoryFactory.close Releasing directory:/Users/jenkins/jenkins-slave/workspace/Lucene-Solr-trunk-MacOSX/solr/build/solr-core/test/J0/./org.apache.solr.cloud.BasicDistributedZk2Test-1360016233408/jetty2
[junit4:junit4]   2> 16105 T4751 C352 P50612 oass.SolrIndexSearcher.<init> Opening Searcher@11fa35f8 main
[junit4:junit4]   2> 16105 T4751 C352 P50612 oasu.DirectUpdateHandler2.commit end_commit_flush
[junit4:junit4]   2> 16106 T4768 C348 P50615 oasc.SolrDeletionPolicy.onCommit SolrDeletionPolicy.onCommit: commits:num=2
[junit4:junit4]   2> 		commit{dir=RateLimitedDirectoryWrapper(org.apache.lucene.store.NIOFSDirectory@/Users/jenkins/jenkins-slave/workspace/Lucene-Solr-trunk-MacOSX/solr/build/solr-core/test/J0/org.apache.solr.cloud.BasicDistributedZk2Test-1360016233408/jetty3/index lockFactory=org.apache.lucene.store.NativeFSLockFactory@3e1ade7d),segFN=segments_1,generation=1,filenames=[segments_1]
[junit4:junit4]   2> 		commit{dir=RateLimitedDirectoryWrapper(org.apache.lucene.store.NIOFSDirectory@/Users/jenkins/jenkins-slave/workspace/Lucene-Solr-trunk-MacOSX/solr/build/solr-core/test/J0/org.apache.solr.cloud.BasicDistributedZk2Test-1360016233408/jetty3/index lockFactory=org.apache.lucene.store.NativeFSLockFactory@3e1ade7d),segFN=segments_2,generation=2,filenames=[_0_Lucene41_0.pos, _0_TestBloomFilteredLucene41Postings_0.tim, _0_TestBloomFilteredLucene41Postings_0.tip, _0_MockFixedIntBlock_0.tib, _0_TestBloomFilteredLucene41Postings_0.pos, _0_MockFixedIntBlock_0.pyl, _0_MockFixedIntBlock_0.skp, _0_Pulsing41_0.tim, _0_Pulsing41_0.tip, _0_MockFixedIntBlock_0.tii, _0.si, _0_Lucene41_0.tim, _0_Lucene41_0.tip, _0.fnm, _0_TestBloomFilteredLucene41Postings_0.blm, _0_MockFixedIntBlock_0.pos, _0_nrm.cfs, _0_MockFixedIntBlock_0.frq, _0_Pulsing41_0.doc, _0_Pulsing41_0.pos, _0_Lucene41_0.doc, _0_MockFixedIntBlock_0.doc, _0_nrm.cfe, _0_TestBloomFilteredLucene41Postings_0.doc, segments_2, _0.fdx, _0.fdt]
[junit4:junit4]   2> 16109 T4791 oasc.SolrCore.registerSearcher [collection1] Registered new searcher Searcher@3e78e423 main{StandardDirectoryReader(segments_1:1)}
[junit4:junit4]   2> 16110 T4791 oasc.CachingDirectoryFactory.close Releasing directory:/Users/jenkins/jenkins-slave/workspace/Lucene-Solr-trunk-MacOSX/solr/build/solr-core/test/J0/./org.apache.solr.cloud.BasicDistributedZk2Test-1360016233408/jetty4/index
[junit4:junit4]   2> 16107 T4768 C348 P50615 oasc.SolrDeletionPolicy.updateCommits newest commit = 2[_0_Lucene41_0.pos, _0_TestBloomFilteredLucene41Postings_0.tim, _0_TestBloomFilteredLucene41Postings_0.tip, _0_MockFixedIntBlock_0.tib, _0_TestBloomFilteredLucene41Postings_0.pos, _0_MockFixedIntBlock_0.pyl, _0_MockFixedIntBlock_0.skp, _0_Pulsing41_0.tim, _0_Pulsing41_0.tip, _0_MockFixedIntBlock_0.tii, _0.si, _0_Lucene41_0.tim, _0_Lucene41_0.tip, _0.fnm, _0_TestBloomFilteredLucene41Postings_0.blm, _0_MockFixedIntBlock_0.pos, _0_nrm.cfs, _0_MockFixedIntBlock_0.frq, _0_Pulsing41_0.doc, _0_Pulsing41_0.pos, _0_Lucene41_0.doc, _0_MockFixedIntBlock_0.doc, _0_nrm.cfe, _0_TestBloomFilteredLucene41Postings_0.doc, segments_2, _0.fdx, _0.fdt]
[junit4:junit4]   2> 16111 T4768 C348 P50615 oasc.CachingDirectoryFactory.close Releasing directory:/Users/jenkins/jenkins-slave/workspace/Lucene-Solr-trunk-MacOSX/solr/build/solr-core/test/J0/./org.apache.solr.cloud.BasicDistributedZk2Test-1360016233408/jetty3
[junit4:junit4]   2> 16117 T4760 oasc.SolrCore.registerSearcher [collection1] Registered new searcher Searcher@11fa35f8 main{StandardDirectoryReader(segments_1:1)}
[junit4:junit4]   2> 16117 T4760 oasc.CachingDirectoryFactory.close Releasing directory:/Users/jenkins/jenkins-slave/workspace/Lucene-Solr-trunk-MacOSX/solr/build/solr-core/test/J0/./org.apache.solr.cloud.BasicDistributedZk2Test-1360016233408/jetty2/index
[junit4:junit4]   2> 16120 T4785 C349 P50619 /update {waitSearcher=true&commit=true&wt=javabin&expungeDeletes=false&commit_end_point=true&version=2&softCommit=false} {commit=} 0 67
[junit4:junit4]   2> 16125 T4768 C348 P50615 oass.SolrIndexSearcher.<init> Opening Searcher@45338b5e main
[junit4:junit4]   2> 16126 T4768 C348 P50615 oasu.DirectUpdateHandler2.commit end_commit_flush
[junit4:junit4]   2> 16127 T4751 C352 P50612 /update {waitSearcher=true&commit=true&wt=javabin&expungeDeletes=false&commit_end_point=true&version=2&softCommit=false} {commit=} 0 75
[junit4:junit4]   2> 16130 T4775 oasc.SolrCore.registerSearcher [collection1] Registered new searcher Searcher@45338b5e main{StandardDirectoryReader(segments_2:3 _0(5.0):C1)}
[junit4:junit4]   2> 16130 T4775 oasc.CachingDirectoryFactory.close Releasing directory:/Users/jenkins/jenkins-slave/workspace/Lucene-Solr-trunk-MacOSX/solr/build/solr-core/test/J0/./org.apache.solr.cloud.BasicDistributedZk2Test-1360016233408/jetty3/index
[junit4:junit4]   2> 16130 T4768 C348 P50615 /update {waitSearcher=true&commit=true&wt=javabin&expungeDeletes=false&commit_end_point=true&version=2&softCommit=false} {commit=} 0 104
[junit4:junit4]   2> 16131 T4739 C351 P50609 /update {waitSearcher=true&commit=true&wt=javabin&version=2&softCommit=false} {commit=} 0 149
[junit4:junit4]   2> 16133 T4702 oasc.AbstractDistribZkTestBase.waitForRecoveriesToFinish Wait for recoveries to finish - collection: collection1 failOnTimeout:true timeout (sec):230
[junit4:junit4]   2> 16134 T4702 oascc.ZkStateReader.updateClusterState Updating cloud state from ZooKeeper... 
[junit4:junit4]   2> 16238 T4776 C348 P50615 oasc.RecoveryStrategy.doRecovery Attempting to PeerSync from http://127.0.0.1:50609/_/collection1/ core=collection1 - recoveringAfterStartup=true
[junit4:junit4]   2> 16239 T4776 C348 P50615 oasu.PeerSync.sync PeerSync: core=collection1 url=http://127.0.0.1:50615/_ START replicas=[http://127.0.0.1:50609/_/collection1/] nUpdates=100
[junit4:junit4]   2> 16239 T4776 C348 P50615 oasu.PeerSync.sync WARNING no frame of reference to tell of we've missed updates
[junit4:junit4]   2> 16240 T4776 C348 P50615 oasc.RecoveryStrategy.doRecovery PeerSync Recovery was not successful - trying replication. core=collection1
[junit4:junit4]   2> 16240 T4776 C348 P50615 oasc.RecoveryStrategy.doRecovery Starting Replication Recovery. core=collection1
[junit4:junit4]   2> 16240 T4776 C348 P50615 oasc.RecoveryStrategy.doRecovery Begin buffering updates. core=collection1
[junit4:junit4]   2> 16241 T4776 C348 P50615 oasu.UpdateLog.bufferUpdates Starting to buffer updates. FSUpdateLog{state=ACTIVE, tlog=null}
[junit4:junit4]   2> 16241 T4776 C348 P50615 oasc.RecoveryStrategy.replicate Attempting to replicate from http://127.0.0.1:50609/_/collection1/. core=collection1
[junit4:junit4]   2> 16241 T4776 C348 P50615 oascsi.HttpClientUtil.createClient Creating new http client, config:maxConnections=128&maxConnectionsPerHost=32&followRedirects=false
[junit4:junit4]   2> 16252 T4734 C351 P50609 oasu.DirectUpdateHandler2.commit start commit{,optimize=false,openSearcher=false,waitSearcher=true,expungeDeletes=false,softCommit=false}
[junit4:junit4]   2> 16253 T4735 C351 P50609 REQ /get {getVersions=100&distrib=false&wt=javabin&qt=/get&version=2} status=0 QTime=0 
[junit4:junit4]   2> 16261 T4734 C351 P50609 oasc.SolrDeletionPolicy.onCommit SolrDeletionPolicy.onCommit: commits:num=2
[junit4:junit4]   2> 		commit{dir=RateLimitedDirectoryWrapper(org.apache.lucene.store.NIOFSDirectory@/Users/jenkins/jenkins-slave/workspace/Lucene-Solr-trunk-MacOSX/solr/build/solr-core/test/J0/org.apache.solr.cloud.BasicDistributedZk2Test-1360016233408/jetty1/index lockFactory=org.apache.lucene.store.NativeFSLockFactory@47e85781),segFN=segments_2,generation=2,filenames=[_0_Lucene41_0.pos, _0_TestBloomFilteredLucene41Postings_0.tim, _0_TestBloomFilteredLucene41Postings_0.tip, _0_MockFixedIntBlock_0.tib, _0_TestBloomFilteredLucene41Postings_0.pos, _0_MockFixedIntBlock_0.pyl, _0_MockFixedIntBlock_0.skp, _0_Pulsing41_0.tim, _0_Pulsing41_0.tip, _0_MockFixedIntBlock_0.tii, _0.si, _0_Lucene41_0.tim, _0_Lucene41_0.tip, _0.fnm, _0_TestBloomFilteredLucene41Postings_0.blm, _0_MockFixedIntBlock_0.pos, _0_nrm.cfs, _0_MockFixedIntBlock_0.frq, _0_Pulsing41_0.doc, _0_Pulsing41_0.pos, _0_Lucene41_0.doc, _0_MockFixedIntBlock_0.doc, _0_nrm.cfe, _0_TestBloomFilteredLucene41Postings_0.doc, segments_2, _0.fdx, _0.fdt]
[junit4:junit4]   2> 		commit{dir=RateLimitedDirectoryWrapper(org.apache.lucene.store.NIOFSDirectory@/Users/jenkins/jenkins-slave/workspace/Lucene-Solr-trunk-MacOSX/solr/build/solr-core/test/J0/org.apache.solr.cloud.BasicDistributedZk2Test-1360016233408/jetty1/index lockFactory=org.apache.lucene.store.NativeFSLockFactory@47e85781),segFN=segments_3,generation=3,filenames=[_0_Lucene41_0.pos, _0_TestBloomFilteredLucene41Postings_0.tim, _0_TestBloomFilteredLucene41Postings_0.tip, _0_MockFixedIntBlock_0.tib, _0_TestBloomFilteredLucene41Postings_0.pos, _0_MockFixedIntBlock_0.pyl, _0_MockFixedIntBlock_0.skp, _0_Pulsing41_0.tim, _0_Pulsing41_0.tip, _0_MockFixedIntBlock_0.tii, _0.si, _0_Lucene41_0.tim, _0_Lucene41_0.tip, _0.fnm, _0_TestBloomFilteredLucene41Postings_0.blm, _0_MockFixedIntBlock_0.pos, _0_nrm.cfs, _0_MockFixedIntBlock_0.frq, _0_Pulsing41_0.doc, _0_Pulsing41_0.pos, _0_Lucene41_0.doc, _0_MockFixedIntBlock_0.doc, _0_nrm.cfe, _0_TestBloomFilteredLucene41Postings_0.doc, _0.fdx, _0.fdt, segments_3]
[junit4:junit4]   2> 16262 T4734 C351 P50609 oasc.SolrDeletionPolicy.updateCommits newest commit = 3[_0_Lucene41_0.pos, _0_TestBloomFilteredLucene41Postings_0.tim, _0_TestBloomFilteredLucene41Postings_0.tip, _0_MockFixedIntBlock_0.tib, _0_TestBloomFilteredLucene41Postings_0.pos, _0_MockFixedIntBlock_0.pyl, _0_MockFixedIntBlock_0.skp, _0_Pulsing41_0.tim, _0_Pulsing41_0.tip, _0_MockFixedIntBlock_0.tii, _0.si, _0_Lucene41_0.tim, _0_Lucene41_0.tip, _0.fnm, _0_TestBloomFilteredLucene41Postings_0.blm, _0_MockFixedIntBlock_0.pos, _0_nrm.cfs, _0_MockFixedIntBlock_0.frq, _0_Pulsing41_0.doc, _0_Pulsing41_0.pos, _0_Lucene41_0.doc, _0_MockFixedIntBlock_0.doc, _0_nrm.cfe, _0_TestBloomFilteredLucene41Postings_0.doc, _0.fdx, _0.fdt, segments_3]
[junit4:junit4]   2> 16264 T4734 C351 P50609 oasc.CachingDirectoryFactory.close Releasing directory:/Users/jenkins/jenkins-slave/workspace/Lucene-Solr-trunk-MacOSX/solr/build/solr-core/test/J0/./org.apache.solr.cloud.BasicDistributedZk2Test-1360016233408/jetty1
[junit4:junit4]   2> 16271 T4734 C351 P50609 oass.SolrIndexSearcher.<init> Opening Searcher@75d49e3d realtime
[junit4:junit4]   2> 16272 T4734 C351 P50609 oasu.DirectUpdateHandler2.commit end_commit_flush
[junit4:junit4]   2> 16273 T4734 C351 P50609 /update {waitSearcher=true&openSearcher=false&commit=true&wt=javabin&commit_end_point=true&version=2&softCommit=false} {commit=} 0 21
[junit4:junit4]   2> 16277 T4776 C348 P50615 oash.ReplicationHandler.inform Commits will be reserved for  10000
[junit4:junit4]   2> 16277 T4776 C348 P50615 oash.SnapPuller.<init>  No value set for 'pollInterval'. Timer Task not started.
[junit4:junit4]   2> 16280 T4738 C351 P50609 oash.ReplicationHandler.inform Commits will be reserved for  10000
[junit4:junit4]   2> 16281 T4738 C351 P50609 REQ /replication {command=indexversion&qt=/replication&wt=javabin&version=2} status=0 QTime=2 
[junit4:junit4]   2> 16282 T4776 C348 P50615 oash.SnapPuller.fetchLatestIndex Master's generation: 3
[junit4:junit4]   2> 16282 T4776 C348 P50615 oash.SnapPuller.fetchLatestIndex Slave's generation: 2
[junit4:junit4]   2> 16282 T4776 C348 P50615 oash.SnapPuller.fetchLatestIndex Starting replication process
[junit4:junit4]   2> 16285 T4739 C351 P50609 oasc.CachingDirectoryFactory.close Releasing directory:/Users/jenkins/jenkins-slave/workspace/Lucene-Solr-trunk-MacOSX/solr/build/solr-core/test/J0/./org.apache.solr.cloud.BasicDistributedZk2Test-1360016233408/jetty1
[junit4:junit4]   2> 16287 T4739 C351 P50609 oasc.CachingDirectoryFactory.close Releasing directory:/Users/jenkins/jenkins-slave/workspace/Lucene-Solr-trunk-MacOSX/solr/build/solr-core/test/J0/./org.apache.solr.cloud.BasicDistributedZk2Test-1360016233408/jetty1/index
[junit4:junit4]   2> 16288 T4739 C351 P50609 REQ /replication {command=filelist&qt=/replication&wt=javabin&generation=3&version=2} status=0 QTime=3 
[junit4:junit4]   2> 16289 T4776 C348 P50615 oash.SnapPuller.fetchLatestIndex Number of files in latest index in master: 27
[junit4:junit4]   2> 16290 T4776 C348 P50615 oasc.CachingDirectoryFactory.get return new directory for /Users/jenkins/jenkins-slave/workspace/Lucene-Solr-trunk-MacOSX/solr/build/solr-core/test/J0/./org.apache.solr.cloud.BasicDistributedZk2Test-1360016233408/jetty3/index.20130205061729691 forceNew:false
[junit4:junit4]   2> 16291 T4776 C348 P50615 oasc.CachingDirectoryFactory.close Releasing directory:/Users/jenkins/jenkins-slave/workspace/Lucene-Solr-trunk-MacOSX/solr/build/solr-core/test/J0/./org.apache.solr.cloud.BasicDistributedZk2Test-1360016233408/jetty3
[junit4:junit4]   2> 16295 T4776 C348 P50615 oash.SnapPuller.fetchLatestIndex Starting download to RateLimitedDirectoryWrapper(org.apache.lucene.store.NIOFSDirectory@/Users/jenkins/jenkins-slave/workspace/Lucene-Solr-trunk-MacOSX/solr/build/solr-core/test/J0/org.apache.solr.cloud.BasicDistributedZk2Test-1360016233408/jetty3/index.20130205061729691 lockFactory=org.apache.lucene.store.NativeFSLockFactory@3d13d76d) fullCopy=true
[junit4:junit4]   2> 16298 T4735 C351 P50609 REQ /replication {file=_0_TestBloomFilteredLucene41Postings_0.tim&command=filecontent&checksum=true&wt=filestream&qt=/replication&generation=3} status=0 QTime=0 
[junit4:junit4]   2> 16303 T4737 C351 P50609 REQ /replication {file=_0_Lucene41_0.pos&command=filecontent&checksum=true&wt=filestream&qt=/replication&generation=3} status=0 QTime=0 
[junit4:junit4]   2> 16309 T4734 C351 P50609 REQ /replication {file=_0_TestBloomFilteredLucene41Postings_0.tip&command=filecontent&checksum=true&wt=filestream&qt=/replication&generation=3} status=0 QTime=0 
[junit4:junit4]   2> 16315 T4736 C351 P50609 REQ /replication {file=_0_MockFixedIntBlock_0.tib&command=filecontent&checksum=true&wt=filestream&qt=/replication&generation=3} status=0 QTime=0 
[junit4:junit4]   2> 16320 T4738 C351 P50609 REQ /replication {file=_0_TestBloomFilteredLucene41Postings_0.pos&command=filecontent&checksum=true&wt=filestream&qt=/replication&generation=3} status=0 QTime=0 
[junit4:junit4]   2> 16325 T4739 C351 P50609 REQ /replication {file=_0_MockFixedIntBlock_0.skp&command=filecontent&checksum=true&wt=filestream&qt=/replication&generation=3} status=0 QTime=0 
[junit4:junit4]   2> 16327 T4776 C348 P50615 oash.SnapPuller$DirectoryFileFetcher.fetchPackets WARNING No content recieved for file: {name=_0_MockFixedIntBlock_0.skp, size=0}
[junit4:junit4]   2> 16331 T4735 C351 P50609 REQ /replication {file=_0_MockFixedIntBlock_0.pyl&command=filecontent&checksum=true&wt=filestream&qt=/replication&generation=3} status=0 QTime=1 
[junit4:junit4]   2> 16332 T4776 C348 P50615 oash.SnapPuller$DirectoryFileFetcher.fetchPackets WARNING No content recieved for file: {name=_0_MockFixedIntBlock_0.pyl, size=0}
[junit4:junit4]   2> 16336 T4737 C351 P50609 REQ /replication {file=_0_Pulsing41_0.tim&command=filecontent&checksum=true&wt=filestream&qt=/replication&generation=3} status=0 QTime=0 
[junit4:junit4]   2> 16344 T4734 C351 P50609 REQ /replication {file=_0_MockFixedIntBlock_0.tii&command=filecontent&checksum=true&wt=filestream&qt=/replication&generation=3} status=0 QTime=1 
[junit4:junit4]   2> 16353 T4736 C351 P50609 REQ /replication {file=_0_Pulsing41_0.tip&command=filecontent&checksum=true&wt=filestream&qt=/replication&generation=3} status=0 QTime=0 
[junit4:junit4]   2> 16358 T4738 C351 P50609 REQ /replication {file=_0.si&command=filecontent&checksum=true&wt=filestream&qt=/replication&generation=3} status=0 QTime=0 
[junit4:junit4]   2> 16362 T4739 C351 P50609 REQ /replication {file=_0_Lucene41_0.tim&command=filecontent&checksum=true&wt=filestream&qt=/replication&generation=3} status=0 QTime=0 
[junit4:junit4]   2> 16370 T4735 C351 P50609 REQ /replication {file=_0_Lucene41_0.tip&command=filecontent&checksum=true&wt=filestream&qt=/replication&generation=3} status=0 QTime=0 
[junit4:junit4]   2> 16377 T4737 C351 P50609 REQ /replication {file=_0.fnm&command=filecontent&checksum=true&wt=filestream&qt=/replication&generation=3} status=0 QTime=1 
[junit4:junit4]   2> 16382 T4734 C351 P50609 REQ /replication {file=_0_TestBloomFilteredLucene41Postings_0.blm&command=filecontent&checksum=true&wt=filestream&qt=/replication&generation=3} status=0 QTime=0 
[junit4:junit4]   2> 16389 T4736 C351 P50609 REQ /replication {file=_0_MockFixedIntBlock_0.pos&command=filecontent&checksum=true&wt=filestream&qt=/replication&generation=3} status=0 QTime=1 
[junit4:junit4]   2> 16399 T4738 C351 P50609 REQ /replication {file=_0_nrm.cfs&command=filecontent&checksum=true&wt=filestream&qt=/replication&generation=3} status=0 QTime=0 
[junit4:junit4]   2> 16409 T4739 C351 P50609 REQ /replication {file=_0_MockFixedIntBlock_0.frq&command=filecontent&checksum=true&wt=filestream&qt=/replication&generation=3} status=0 QTime=1 
[junit4:junit4]   2> 16413 T4735 C351 P50609 REQ /replication {file=_0_Pulsing41_0.pos&command=filecontent&checksum=true&wt=filestream&qt=/replication&generation=3} status=0 QTime=0 
[junit4:junit4]   2> 16418 T4737 C351 P50609 REQ /replication {file=_0_Pulsing41_0.doc&command=filecontent&checksum=true&wt=filestream&qt=/replication&generation=3} status=0 QTime=1 
[junit4:junit4]   2> 16422 T4734 C351 P50609 REQ /replication {file=_0_Lucene41_0.doc&command=filecontent&checksum=true&wt=filestream&qt=/replication&generation=3} status=0 QTime=0 
[junit4:junit4]   2> 16427 T4736 C351 P50609 REQ /replication {file=_0_MockFixedIntBlock_0.doc&command=filecontent&checksum=true&wt=filestream&qt=/replication&generation=3} status=0 QTime=0 
[junit4:junit4]   2> 16431 T4738 C351 P50609 REQ /replication {file=_0_nrm.cfe&command=filecontent&checksum=true&wt=filestream&qt=/replication&generation=3} status=0 QTime=0 
[junit4:junit4]   2> 16437 T4739 C351 P50609 REQ /replication {file=_0_TestBloomFilteredLucene41Postings_0.doc&command=filecontent&checksum=true&wt=filestream&qt=/replication&generation=3} status=0 QTime=1 
[junit4:junit4]   2> 16449 T4735 C351 P50609 REQ /replication {file=_0.fdx&command=filecontent&checksum=true&wt=filestream&qt=/replication&generation=3} status=0 QTime=1 
[junit4:junit4]   2> 16458 T4737 C351 P50609 REQ /replication {file=segments_3&command=filecontent&checksum=true&wt=filestream&qt=/replication&generation=3} status=0 QTime=0 
[junit4:junit4]   2> 16469 T4734 C351 P50609 REQ /replication {file=_0.fdt&command=filecontent&checksum=true&wt=filestream&qt=/replication&generation=3} status=0 QTime=1 
[junit4:junit4]   2> 16470 T4776 C348 P50615 oasc.CachingDirectoryFactory.close Releasing directory:/Users/jenkins/jenkins-slave/workspace/Lucene-Solr-trunk-MacOSX/solr/build/solr-core/test/J0/./org.apache.solr.cloud.BasicDistributedZk2Test-1360016233408/jetty3/index
[junit4:junit4]   2> 16471 T4776 C348 P50615 oash.SnapPuller.fetchLatestIndex Total time taken for download : 0 secs
[junit4:junit4]   2> 16471 T4776 C348 P50615 oash.SnapPuller.modifyIndexProps New index installed. Updating index properties... index=index.20130205061729691
[junit4:junit4]   2> 16474 T4776 C348 P50615 oasc.CachingDirectoryFactory.close Releasing directory:/Users/jenkins/jenkins-slave/workspace/Lucene-Solr-trunk-MacOSX/solr/build/solr-core/test/J0/./org.apache.solr.cloud.BasicDistributedZk2Test-1360016233408/jetty3
[junit4:junit4]   2> 16478 T4776 C348 P50615 oasc.CachingDirectoryFactory.close Releasing directory:/Users/jenkins/jenkins-slave/workspace/Lucene-Solr-trunk-MacOSX/solr/build/solr-core/test/J0/./org.apache.solr.cloud.BasicDistributedZk2Test-1360016233408/jetty3
[junit4:junit4]   2> 16479 T4776 C348 P50615 oasu.DefaultSolrCoreState.newIndexWriter Creating new IndexWriter...
[junit4:junit4]   2> 16480 T4776 C348 P50615 oasu.DefaultSolrCoreState.newIndexWriter Waiting until IndexWriter is unused... core=collection1
[junit4:junit4]   2> 16480 T4776 C348 P50615 oasu.DefaultSolrCoreState.newIndexWriter Rollback old IndexWriter... core=collection1
[junit4:junit4]   2> 16500 T4776 C348 P50615 oasc.CachingDirectoryFactory.close Releasing directory:/Users/jenkins/jenkins-slave/workspace/Lucene-Solr-trunk-MacOSX/solr/build/solr-core/test/J0/./org.apache.solr.cloud.BasicDistributedZk2Test-1360016233408/jetty3/index
[junit4:junit4]   2> 16502 T4776 C348 P50615 oasc.CachingDirectoryFactory.close Releasing directory:/Users/jenkins/jenkins-slave/workspace/Lucene-Solr-trunk-MacOSX/solr/build/solr-core/test/J0/./org.apache.solr.cloud.BasicDistributedZk2Test-1360016233408/jetty3
[junit4:junit4]   2> 16503 T4776 C348 P50615 oasc.SolrCore.getNewIndexDir New index directory detected: old=./org.apache.solr.cloud.BasicDistributedZk2Test-1360016233408/jetty3/index/ new=./org.apache.solr.cloud.BasicDistributedZk2Test-1360016233408/jetty3/index.20130205061729691
[junit4:junit4]   2> 16517 T4776 C348 P50615 oasc.SolrDeletionPolicy.onInit SolrDeletionPolicy.onInit: commits:num=1
[junit4:junit4]   2> 		commit{dir=RateLimitedDirectoryWrapper(org.apache.lucene.store.NIOFSDirectory@/Users/jenkins/jenkins-slave/workspace/Lucene-Solr-trunk-MacOSX/solr/build/solr-core/test/J0/org.apache.solr.cloud.BasicDistributedZk2Test-1360016233408/jetty3/index.20130205061729691 lockFactory=org.apache.lucene.store.NativeFSLockFactory@3d13d76d),segFN=segments_3,generation=3,filenames=[_0_TestBloomFilteredLucene41Postings_0.tim, _0_Lucene41_0.pos, _0_TestBloomFilteredLucene41Postings_0.tip, _0_MockFixedIntBlock_0.tib, _0_TestBloomFilteredLucene41Postings_0.pos, _0_MockFixedIntBlock_0.skp, _0_MockFixedIntBlock_0.pyl, _0_Pulsing41_0.tim, _0_MockFixedIntBlock_0.tii, _0_Pulsing41_0.tip, _0.si, _0_Lucene41_0.tim, _0_Lucene41_0.tip, _0.fnm, _0_TestBloomFilteredLucene41Postings_0.blm, _0_MockFixedIntBlock_0.pos, _0_nrm.cfs, _0_MockFixedIntBlock_0.frq, _0_Pulsing41_0.doc, _0_Pulsing41_0.pos, _0_Lucene41_0.doc, _0_MockFixedIntBlock_0.doc, _0_nrm.cfe, _0_TestBloomFilteredLucene41Postings_0.doc, _0.fdx, _0.fdt, segments_3]
[junit4:junit4]   2> 16518 T4776 C348 P50615 oasc.SolrDeletionPolicy.updateCommits newest commit = 3[_0_TestBloomFilteredLucene41Postings_0.tim, _0_Lucene41_0.pos, _0_TestBloomFilteredLucene41Postings_0.tip, _0_MockFixedIntBlock_0.tib, _0_TestBloomFilteredLucene41Postings_0.pos, _0_MockFixedIntBlock_0.skp, _0_MockFixedIntBlock_0.pyl, _0_Pulsing41_0.tim, _0_MockFixedIntBlock_0.tii, _0_Pulsing41_0.tip, _0.si, _0_Lucene41_0.tim, _0_Lucene41_0.tip, _0.fnm, _0_TestBloomFilteredLucene41Postings_0.blm, _0_MockFixedIntBlock_0.pos, _0_nrm.cfs, _0_MockFixedIntBlock_0.frq, _0_Pulsing41_0.doc, _0_Pulsing41_0.pos, _0_Lucene41_0.doc, _0_MockFixedIntBlock_0.doc, _0_nrm.cfe, _0_TestBloomFilteredLucene41Postings_0.doc, _0.fdx, _0.fdt, segments_3]
[junit4:junit4]   2> 16518 T4776 C348 P50615 oasu.DefaultSolrCoreState.newIndexWriter New IndexWriter is ready to be used.
[junit4:junit4]   2> 16519 T4776 C348 P50615 oasc.CachingDirectoryFactory.close Releasing directory:/Users/jenkins/jenkins-slave/workspace/Lucene-Solr-trunk-MacOSX/solr/build/solr-core/test/J0/./org.apache.solr.cloud.BasicDistributedZk2Test-1360016233408/jetty3
[junit4:junit4]   2> 16523 T4776 C348 P50615 oass.SolrIndexSearcher.<init> Opening Searcher@5261f676 main
[junit4:junit4]   2> 16524 T4775 oasc.SolrCore.registerSearcher [collection1] Registered new searcher Searcher@5261f676 main{StandardDirectoryReader(segments_3:3:nrt _0(5.0):C1)}
[junit4:junit4]   2> 16525 T4775 oasc.CachingDirectoryFactory.close Releasing directory:/Users/jenkins/jenkins-slave/workspace/Lucene-Solr-trunk-MacOSX/solr/build/solr-core/test/J0/./org.apache.solr.cloud.BasicDistributedZk2Test-1360016233408/jetty3/index
[junit4:junit4]   2> 16525 T4776 C348 P50615 oasu.DirectUpdateHandler2.commit start commit{,optimize=false,openSearcher=false,waitSearcher=false,expungeDeletes=false,softCommit=false}
[junit4:junit4]   2> 16529 T4776 C348 P50615 oasc.SolrDeletionPolicy.onCommit SolrDeletionPolicy.onCommit: commits:num=2
[junit4:junit4]   2> 		commit{dir=RateLimitedDirectoryWrapper(org.apache.lucene.store.NIOFSDirectory@/Users/jenkins/jenkins-slave/workspace/Lucene-Solr-trunk-MacOSX/solr/build/solr-core/test/J0/org.apache.solr.cloud.BasicDistributedZk2Test-1360016233408/jetty3/index.20130205061729691 lockFactory=org.apache.lucene.store.NativeFSLockFactory@3d13d76d),segFN=segments_3,generation=3,filenames=[_0_TestBloomFilteredLucene41Postings_0.tim, _0_Lucene41_0.pos, _0_TestBloomFilteredLucene41Postings_0.tip, _0_MockFixedIntBlock_0.tib, _0_TestBloomFilteredLucene41Postings_0.pos, _0_MockFixedIntBlock_0.skp, _0_MockFixedIntBlock_0.pyl, _0_Pulsing41_0.tim, _0_MockFixedIntBlock_0.tii, _0_Pulsing41_0.tip, _0.si, _0_Lucene41_0.tim, _0_Lucene41_0.tip, _0.fnm, _0_TestBloomFilteredLucene41Postings_0.blm, _0_MockFixedIntBlock_0.pos, _0_nrm.cfs, _0_MockFixedIntBlock_0.frq, _0_Pulsing41_0.doc, _0_P

[...truncated too long message...]

p.impl.io.AbstractSessionInputBuffer.fillBuffer(AbstractSessionInputBuffer.java:149)
[junit4:junit4]    > 	at org.apache.http.impl.io.SocketInputBuffer.fillBuffer(SocketInputBuffer.java:111)
[junit4:junit4]    > 	at org.apache.http.impl.io.AbstractSessionInputBuffer.readLine(AbstractSessionInputBuffer.java:264)
[junit4:junit4]    > 	at org.apache.http.impl.conn.DefaultResponseParser.parseHead(DefaultResponseParser.java:98)
[junit4:junit4]    > 	at org.apache.http.impl.io.AbstractMessageParser.parse(AbstractMessageParser.java:252)
[junit4:junit4]    > 	at org.apache.http.impl.AbstractHttpClientConnection.receiveResponseHeader(AbstractHttpClientConnection.java:282)
[junit4:junit4]    > 	at org.apache.http.impl.conn.DefaultClientConnection.receiveResponseHeader(DefaultClientConnection.java:247)
[junit4:junit4]    > 	at org.apache.http.impl.conn.AbstractClientConnAdapter.receiveResponseHeader(AbstractClientConnAdapter.java:216)
[junit4:junit4]    > 	at org.apache.http.protocol.HttpRequestExecutor.doReceiveResponse(HttpRequestExecutor.java:298)
[junit4:junit4]    > 	at org.apache.http.protocol.HttpRequestExecutor.execute(HttpRequestExecutor.java:125)
[junit4:junit4]    > 	at org.apache.http.impl.client.DefaultRequestDirector.tryExecute(DefaultRequestDirector.java:647)
[junit4:junit4]    > 	at org.apache.http.impl.client.DefaultRequestDirector.execute(DefaultRequestDirector.java:464)
[junit4:junit4]    > 	at org.apache.http.impl.client.AbstractHttpClient.execute(AbstractHttpClient.java:820)
[junit4:junit4]    > 	at org.apache.http.impl.client.AbstractHttpClient.execute(AbstractHttpClient.java:754)
[junit4:junit4]    > 	at org.apache.http.impl.client.AbstractHttpClient.execute(AbstractHttpClient.java:732)
[junit4:junit4]    > 	at org.apache.solr.client.solrj.impl.HttpSolrServer.request(HttpSolrServer.java:353)
[junit4:junit4]    > 	... 46 more
[junit4:junit4]   2> 30151 T4702 oas.SolrTestCaseJ4.deleteCore ###deleteCore
[junit4:junit4]   2> NOTE: test params are: codec=Lucene42: {n_f1=Pulsing41(freqCutoff=16 minBlockSize=90 maxBlockSize=267), foo_b=Lucene41(blocksize=128), foo_d=MockFixedIntBlock(blockSize=880), foo_f=Lucene41(blocksize=128), n_tl1=Pulsing41(freqCutoff=16 minBlockSize=90 maxBlockSize=267), n_d1=PostingsFormat(name=TestBloomFilteredLucene41Postings), rnd_b=MockFixedIntBlock(blockSize=880), intDefault=Pulsing41(freqCutoff=16 minBlockSize=90 maxBlockSize=267), n_td1=Pulsing41(freqCutoff=16 minBlockSize=90 maxBlockSize=267), timestamp=PostingsFormat(name=TestBloomFilteredLucene41Postings), id=MockFixedIntBlock(blockSize=880), range_facet_sl=MockFixedIntBlock(blockSize=880), range_facet_si=PostingsFormat(name=TestBloomFilteredLucene41Postings), oddField_s=MockFixedIntBlock(blockSize=880), multiDefault=PostingsFormat(name=TestBloomFilteredLucene41Postings), n_tf1=PostingsFormat(name=TestBloomFilteredLucene41Postings), n_dt1=Pulsing41(freqCutoff=16 minBlockSize=90 maxBlockSize=267), n_ti1=MockFixedIntBlock(blockSize=880), range_facet_l=PostingsFormat(name=TestBloomFilteredLucene41Postings), text=Lucene41(blocksize=128), _version_=Pulsing41(freqCutoff=16 minBlockSize=90 maxBlockSize=267), SubjectTerms_mfacet=Pulsing41(freqCutoff=16 minBlockSize=90 maxBlockSize=267), a_t=PostingsFormat(name=TestBloomFilteredLucene41Postings), n_tdt1=Pulsing41(freqCutoff=16 minBlockSize=90 maxBlockSize=267), other_tl1=Pulsing41(freqCutoff=16 minBlockSize=90 maxBlockSize=267), n_l1=PostingsFormat(name=TestBloomFilteredLucene41Postings), a_si=Pulsing41(freqCutoff=16 minBlockSize=90 maxBlockSize=267)}, sim=RandomSimilarityProvider(queryNorm=false,coord=no): {}, locale=lv_LV, timezone=Asia/Makassar
[junit4:junit4]   2> NOTE: Mac OS X 10.8.2 x86_64/Oracle Corporation 1.7.0_10 (64-bit)/cpus=2,threads=2,free=380599808,total=519438336
[junit4:junit4]   2> NOTE: All tests run in this JVM: [TestReversedWildcardFilterFactory, BasicZkTest, FullSolrCloudDistribCmdsTest, CacheHeaderTest, HighlighterTest, TestFastWriter, TestDFRSimilarityFactory, TestWriterPerf, DocumentBuilderTest, HardAutoCommitTest, QueryEqualityTest, TestPartialUpdateDeduplication, SuggesterTSTTest, TestRandomFaceting, TestDocumentBuilder, TestStressReorder, TestLazyCores, TestSolrXMLSerializer, DistributedTermsComponentTest, WordBreakSolrSpellCheckerTest, EchoParamsTest, UpdateParamsTest, TestSuggestSpellingConverter, TestCharFilters, TestSystemIdResolver, MoreLikeThisHandlerTest, TestMergePolicyConfig, BasicFunctionalityTest, TestHashPartitioner, PrimUtilsTest, RequestHandlersTest, TestLFUCache, TestNumberUtils, TestPerFieldSimilarity, SolrPluginUtilsTest, ShardRoutingTest, TestUpdate, CircularListTest, TestCoreContainer, ResourceLoaderTest, MinimalSchemaTest, TestSurroundQueryParser, OverseerCollectionProcessorTest, TestStressRecovery, LeaderElectionIntegrationTest, HighlighterConfigTest, JsonLoaderTest, IndexSchemaRuntimeFieldTest, TestSolrDeletionPolicy1, ChaosMonkeySafeLeaderTest, SortByFunctionTest, TestAnalyzedSuggestions, AlternateDirectoryTest, DisMaxRequestHandlerTest, DirectUpdateHandlerTest, ReturnFieldsTest, TestZkChroot, TestValueSourceCache, TestRTGBase, RequiredFieldsTest, SyncSliceTest, TestExtendedDismaxParser, ZkNodePropsTest, TestOmitPositions, TestJoin, FastVectorHighlighterTest, SpellingQueryConverterTest, FileUtilsTest, TestPropInject, SoftAutoCommitTest, SuggesterTest, TestFiltering, ChaosMonkeyNothingIsSafeTest, UniqFieldsUpdateProcessorFactoryTest, ClusterStateTest, CurrencyFieldTest, TestFastLRUCache, TestReplicationHandler, TestStressLucene, TestRecovery, BadComponentTest, SystemInfoHandlerTest, PreAnalyzedFieldTest, TestBinaryField, FieldAnalysisRequestHandlerTest, TestDistributedGrouping, TestQueryTypes, OutputWriterTest, TestIndexingPerformance, SpellCheckComponentTest, IndexReaderFactoryTest, UpdateRequestProcessorFactoryTest, TestWordDelimiterFilterFactory, SolrCmdDistributorTest, TestPhraseSuggestions, TermVectorComponentDistributedTest, DirectSolrSpellCheckerTest, SynonymTokenizerTest, AnalysisAfterCoreReloadTest, TestDocSet, CopyFieldTest, IndexSchemaTest, TestSolr4Spatial, TestPseudoReturnFields, CoreContainerCoreInitFailuresTest, QueryElevationComponentTest, CollectionsAPIDistributedZkTest, DirectSolrConnectionTest, SuggesterWFSTTest, TestSolrJ, SignatureUpdateProcessorFactoryTest, TestJmxMonitoredMap, TestSolrDeletionPolicy2, PathHierarchyTokenizerFactoryTest, TestComponentsName, TestFuzzyAnalyzedSuggestions, TestQuerySenderNoQuery, DocumentAnalysisRequestHandlerTest, SchemaVersionSpecificBehaviorTest, TimeZoneUtilsTest, SolrCoreTest, BasicDistributedZkTest, OverseerTest, RecoveryZkTest, LeaderElectionTest, DistributedSpellCheckComponentTest, TestRealTimeGet, ZkControllerTest, TestDistributedSearch, SpellCheckCollatorTest, AutoCommitTest, ZkSolrClientTest, TestFaceting, StatsComponentTest, IndexBasedSpellCheckerTest, TestRangeQuery, TestMultiCoreConfBootstrap, SimpleFacetsTest, LukeRequestHandlerTest, TestSort, TestGroupingSearch, FileBasedSpellCheckerTest, ConvertedLegacyTest, PeerSyncTest, TestBinaryResponseWriter, TestJmxIntegration, SampleTest, TestIndexSearcher, CoreAdminHandlerTest, TestFunctionQuery, TestTrie, SolrRequestParserTest, TestRemoteStreaming, TestCSVLoader, PolyFieldTest, SpatialFilterTest, TestCSVResponseWriter, MBeansHandlerTest, DistributedQueryElevationComponentTest, BinaryUpdateRequestHandlerTest, QueryParsingTest, TermsComponentTest, DistanceFunctionTest, SolrInfoMBeanTest, XsltUpdateRequestHandlerTest, StandardRequestHandlerTest, TestPHPSerializedResponseWriter, XmlUpdateRequestHandlerTest, PingRequestHandlerTest, TermVectorComponentTest, DirectUpdateHandlerOptimizeTest, TestSolrQueryParser, DebugComponentTest, JSONWriterTest, SearchHandlerTest, SuggesterFSTTest, TestArbitraryIndexDir, TestQueryUtils, LoggingHandlerTest, CSVRequestHandlerTest, ShowFileRequestHandlerTest, TestSearchPerf, NotRequiredUniqueKeyTest, BadIndexSchemaTest, TestFoldingMultitermQuery, SolrCoreCheckLockOnStartupTest, TestLuceneMatchVersion, NoCacheHeaderTest, PrimitiveFieldTypeTest, FieldMutatingUpdateProcessorTest, SOLR749Test, TestPropInjectDefaults, DefaultValueUpdateProcessorTest, TestXIncludeConfig, TestQuerySenderListener, TestCollationField, SolrIndexConfigTest, NumericFieldsTest, MultiTermTest, TestSolrCoreProperties, TestConfig, SpellPossibilityIteratorTest, TestBM25SimilarityFactory, TestLMDirichletSimilarityFactory, TestPluginEnable, LegacyHTMLStripCharFilterTest, TestLMJelinekMercerSimilarityFactory, TestIBSimilarityFactory, TestCodecSupport, TestDefaultSimilarityFactory, DateMathParserTest, URLClassifyProcessorTest, PluginInfoTest, OpenExchangeRatesOrgProviderTest, DateFieldTest, TestBadConfig, DOMUtilTest, TestLRUCache, UUIDFieldTest, RAMDirectoryFactoryTest, TestUtils, BasicDistributedZk2Test]
[junit4:junit4] Completed in 30.19s, 1 test, 1 error <<< FAILURES!

[...truncated 60 lines...]
BUILD FAILED
/Users/jenkins/jenkins-slave/workspace/Lucene-Solr-trunk-MacOSX/build.xml:346: The following error occurred while executing this line:
/Users/jenkins/jenkins-slave/workspace/Lucene-Solr-trunk-MacOSX/build.xml:39: The following error occurred while executing this line:
/Users/jenkins/jenkins-slave/workspace/Lucene-Solr-trunk-MacOSX/solr/build.xml:178: The following error occurred while executing this line:
/Users/jenkins/jenkins-slave/workspace/Lucene-Solr-trunk-MacOSX/solr/common-build.xml:428: The following error occurred while executing this line:
/Users/jenkins/jenkins-slave/workspace/Lucene-Solr-trunk-MacOSX/lucene/common-build.xml:1176: The following error occurred while executing this line:
/Users/jenkins/jenkins-slave/workspace/Lucene-Solr-trunk-MacOSX/lucene/common-build.xml:841: There were test failures: 249 suites, 1038 tests, 1 error, 14 ignored (3 assumptions)

Total time: 60 minutes 39 seconds
Build step 'Invoke Ant' marked build as failure
Archiving artifacts
Recording test results
Description set: Java: 64bit/jdk1.7.0 -XX:+UseConcMarkSweepGC
Email was triggered for: Failure
Sending email for trigger: Failure



Mime
View raw message