lucene-dev mailing list archives

Site index · List index
Message view « Date » · « Thread »
Top « Date » · « Thread »
From Apache Jenkins Server <jenk...@builds.apache.org>
Subject [JENKINS] Lucene-Solr-Tests-trunk-java7 - Build # 3702 - Still Failing
Date Sat, 02 Feb 2013 14:57:06 GMT
Build: https://builds.apache.org/job/Lucene-Solr-Tests-trunk-java7/3702/

1 tests failed.
REGRESSION:  org.apache.solr.cloud.SyncSliceTest.testDistribSearch

Error Message:
shard1 should have just been set up to be inconsistent - but it's still consistent

Stack Trace:
java.lang.AssertionError: shard1 should have just been set up to be inconsistent - but it's still consistent
	at __randomizedtesting.SeedInfo.seed([25484D8AD1576AAC:A4AEC392A6080A90]:0)
	at org.junit.Assert.fail(Assert.java:93)
	at org.junit.Assert.assertTrue(Assert.java:43)
	at org.junit.Assert.assertNotNull(Assert.java:526)
	at org.apache.solr.cloud.SyncSliceTest.doTest(SyncSliceTest.java:214)
	at org.apache.solr.BaseDistributedSearchTestCase.testDistribSearch(BaseDistributedSearchTestCase.java:794)
	at sun.reflect.NativeMethodAccessorImpl.invoke0(Native Method)
	at sun.reflect.NativeMethodAccessorImpl.invoke(NativeMethodAccessorImpl.java:57)
	at sun.reflect.DelegatingMethodAccessorImpl.invoke(DelegatingMethodAccessorImpl.java:43)
	at java.lang.reflect.Method.invoke(Method.java:601)
	at com.carrotsearch.randomizedtesting.RandomizedRunner.invoke(RandomizedRunner.java:1559)
	at com.carrotsearch.randomizedtesting.RandomizedRunner.access$600(RandomizedRunner.java:79)
	at com.carrotsearch.randomizedtesting.RandomizedRunner$6.evaluate(RandomizedRunner.java:737)
	at com.carrotsearch.randomizedtesting.RandomizedRunner$7.evaluate(RandomizedRunner.java:773)
	at com.carrotsearch.randomizedtesting.RandomizedRunner$8.evaluate(RandomizedRunner.java:787)
	at com.carrotsearch.randomizedtesting.rules.SystemPropertiesRestoreRule$1.evaluate(SystemPropertiesRestoreRule.java:53)
	at org.apache.lucene.util.TestRuleSetupTeardownChained$1.evaluate(TestRuleSetupTeardownChained.java:50)
	at org.apache.lucene.util.TestRuleFieldCacheSanity$1.evaluate(TestRuleFieldCacheSanity.java:51)
	at org.apache.lucene.util.AbstractBeforeAfterRule$1.evaluate(AbstractBeforeAfterRule.java:46)
	at com.carrotsearch.randomizedtesting.rules.SystemPropertiesInvariantRule$1.evaluate(SystemPropertiesInvariantRule.java:55)
	at org.apache.lucene.util.TestRuleThreadAndTestName$1.evaluate(TestRuleThreadAndTestName.java:49)
	at org.apache.lucene.util.TestRuleIgnoreAfterMaxFailures$1.evaluate(TestRuleIgnoreAfterMaxFailures.java:70)
	at org.apache.lucene.util.TestRuleMarkFailure$1.evaluate(TestRuleMarkFailure.java:48)
	at com.carrotsearch.randomizedtesting.rules.StatementAdapter.evaluate(StatementAdapter.java:36)
	at com.carrotsearch.randomizedtesting.ThreadLeakControl$StatementRunner.run(ThreadLeakControl.java:358)
	at com.carrotsearch.randomizedtesting.ThreadLeakControl.forkTimeoutingTask(ThreadLeakControl.java:782)
	at com.carrotsearch.randomizedtesting.ThreadLeakControl$3.evaluate(ThreadLeakControl.java:442)
	at com.carrotsearch.randomizedtesting.RandomizedRunner.runSingleTest(RandomizedRunner.java:746)
	at com.carrotsearch.randomizedtesting.RandomizedRunner$3.evaluate(RandomizedRunner.java:648)
	at com.carrotsearch.randomizedtesting.RandomizedRunner$4.evaluate(RandomizedRunner.java:682)
	at com.carrotsearch.randomizedtesting.RandomizedRunner$5.evaluate(RandomizedRunner.java:693)
	at com.carrotsearch.randomizedtesting.rules.StatementAdapter.evaluate(StatementAdapter.java:36)
	at com.carrotsearch.randomizedtesting.rules.SystemPropertiesRestoreRule$1.evaluate(SystemPropertiesRestoreRule.java:53)
	at org.apache.lucene.util.AbstractBeforeAfterRule$1.evaluate(AbstractBeforeAfterRule.java:46)
	at org.apache.lucene.util.TestRuleStoreClassName$1.evaluate(TestRuleStoreClassName.java:42)
	at com.carrotsearch.randomizedtesting.rules.SystemPropertiesInvariantRule$1.evaluate(SystemPropertiesInvariantRule.java:55)
	at com.carrotsearch.randomizedtesting.rules.NoShadowingOrOverridesOnMethodsRule$1.evaluate(NoShadowingOrOverridesOnMethodsRule.java:39)
	at com.carrotsearch.randomizedtesting.rules.NoShadowingOrOverridesOnMethodsRule$1.evaluate(NoShadowingOrOverridesOnMethodsRule.java:39)
	at com.carrotsearch.randomizedtesting.rules.StatementAdapter.evaluate(StatementAdapter.java:36)
	at org.apache.lucene.util.TestRuleAssertionsRequired$1.evaluate(TestRuleAssertionsRequired.java:43)
	at org.apache.lucene.util.TestRuleMarkFailure$1.evaluate(TestRuleMarkFailure.java:48)
	at org.apache.lucene.util.TestRuleIgnoreAfterMaxFailures$1.evaluate(TestRuleIgnoreAfterMaxFailures.java:70)
	at org.apache.lucene.util.TestRuleIgnoreTestSuites$1.evaluate(TestRuleIgnoreTestSuites.java:55)
	at com.carrotsearch.randomizedtesting.rules.StatementAdapter.evaluate(StatementAdapter.java:36)
	at com.carrotsearch.randomizedtesting.ThreadLeakControl$StatementRunner.run(ThreadLeakControl.java:358)
	at java.lang.Thread.run(Thread.java:722)




Build Log:
[...truncated 9412 lines...]
[junit4:junit4] Suite: org.apache.solr.cloud.SyncSliceTest
[junit4:junit4]   2> 0 T2697 oas.BaseDistributedSearchTestCase.initHostContext Setting hostContext system property: /h_vtp/t
[junit4:junit4]   2> 6 T2697 oas.SolrTestCaseJ4.setUp ###Starting testDistribSearch
[junit4:junit4]   2> Creating dataDir: /usr/home/hudson/hudson-slave/workspace/Lucene-Solr-Tests-trunk-java7/solr/build/solr-core/test/J1/./solrtest-SyncSliceTest-1359816869628
[junit4:junit4]   2> 7 T2697 oasc.ZkTestServer.run STARTING ZK TEST SERVER
[junit4:junit4]   2> 8 T2698 oasc.ZkTestServer$ZKServerMain.runFromConfig Starting server
[junit4:junit4]   2> 11 T2698 oazs.ZooKeeperServer.setTickTime tickTime set to 1000
[junit4:junit4]   2> 11 T2698 oazs.ZooKeeperServer.setMinSessionTimeout minSessionTimeout set to -1
[junit4:junit4]   2> 11 T2698 oazs.ZooKeeperServer.setMaxSessionTimeout maxSessionTimeout set to -1
[junit4:junit4]   2> 12 T2698 oazs.NIOServerCnxnFactory.configure binding to port 0.0.0.0/0.0.0.0:0
[junit4:junit4]   2> 13 T2698 oazsp.FileTxnSnapLog.save Snapshotting: 0x0 to /usr/home/hudson/hudson-slave/workspace/Lucene-Solr-Tests-trunk-java7/solr/build/solr-core/test/J1/./org.apache.solr.cloud.SyncSliceTest-1359816869627/zookeeper/server1/data/version-2/snapshot.0
[junit4:junit4]   2> 108 T2697 oasc.ZkTestServer.run start zk server on port:21162
[junit4:junit4]   2> 108 T2697 oaz.ZooKeeper.<init> Initiating client connection, connectString=127.0.0.1:21162 sessionTimeout=10000 watcher=org.apache.solr.common.cloud.ConnectionManager@3933c5d4
[junit4:junit4]   2> 109 T2697 oascc.ConnectionManager.waitForConnected Waiting for client to connect to ZooKeeper
[junit4:junit4]   2> 109 T2703 oaz.ClientCnxn$SendThread.logStartConnect Opening socket connection to server localhost/127.0.0.1:21162. Will not attempt to authenticate using SASL (access denied ("javax.security.auth.AuthPermission" "getLoginConfiguration"))
[junit4:junit4]   2> 110 T2703 oaz.ClientCnxn$SendThread.primeConnection Socket connection established to localhost/127.0.0.1:21162, initiating session
[junit4:junit4]   2> 110 T2699 oazs.NIOServerCnxnFactory.run Accepted socket connection from /140.211.11.196:18776
[junit4:junit4]   2> 111 T2699 oazs.ZooKeeperServer.processConnectRequest Client attempting to establish new session at /140.211.11.196:18776
[junit4:junit4]   2> 111 T2701 oazsp.FileTxnLog.append Creating new log file: log.1
[junit4:junit4]   2> 114 T2701 oazs.ZooKeeperServer.finishSessionInit Established session 0x13c9b66c7020000 with negotiated timeout 10000 for client /140.211.11.196:18776
[junit4:junit4]   2> 114 T2703 oaz.ClientCnxn$SendThread.onConnected Session establishment complete on server localhost/127.0.0.1:21162, sessionid = 0x13c9b66c7020000, negotiated timeout = 10000
[junit4:junit4]   2> 114 T2704 oascc.ConnectionManager.process Watcher org.apache.solr.common.cloud.ConnectionManager@3933c5d4 name:ZooKeeperConnection Watcher:127.0.0.1:21162 got event WatchedEvent state:SyncConnected type:None path:null path:null type:None
[junit4:junit4]   2> 114 T2697 oascc.ConnectionManager.waitForConnected Client is connected to ZooKeeper
[junit4:junit4]   2> 115 T2697 oascc.SolrZkClient.makePath makePath: /solr
[junit4:junit4]   2> 118 T2702 oazs.PrepRequestProcessor.pRequest2Txn Processed session termination for sessionid: 0x13c9b66c7020000
[junit4:junit4]   2> 129 T2704 oaz.ClientCnxn$EventThread.run EventThread shut down
[junit4:junit4]   2> 130 T2699 oazs.NIOServerCnxn.closeSock Closed socket connection for client /140.211.11.196:18776 which had sessionid 0x13c9b66c7020000
[junit4:junit4]   2> 129 T2697 oaz.ZooKeeper.close Session: 0x13c9b66c7020000 closed
[junit4:junit4]   2> 131 T2697 oaz.ZooKeeper.<init> Initiating client connection, connectString=127.0.0.1:21162/solr sessionTimeout=10000 watcher=org.apache.solr.common.cloud.ConnectionManager@7a13b09f
[junit4:junit4]   2> 132 T2697 oascc.ConnectionManager.waitForConnected Waiting for client to connect to ZooKeeper
[junit4:junit4]   2> 132 T2705 oaz.ClientCnxn$SendThread.logStartConnect Opening socket connection to server localhost/127.0.0.1:21162. Will not attempt to authenticate using SASL (access denied ("javax.security.auth.AuthPermission" "getLoginConfiguration"))
[junit4:junit4]   2> 132 T2705 oaz.ClientCnxn$SendThread.primeConnection Socket connection established to localhost/127.0.0.1:21162, initiating session
[junit4:junit4]   2> 133 T2699 oazs.NIOServerCnxnFactory.run Accepted socket connection from /140.211.11.196:31986
[junit4:junit4]   2> 133 T2699 oazs.ZooKeeperServer.processConnectRequest Client attempting to establish new session at /140.211.11.196:31986
[junit4:junit4]   2> 134 T2701 oazs.ZooKeeperServer.finishSessionInit Established session 0x13c9b66c7020001 with negotiated timeout 10000 for client /140.211.11.196:31986
[junit4:junit4]   2> 134 T2705 oaz.ClientCnxn$SendThread.onConnected Session establishment complete on server localhost/127.0.0.1:21162, sessionid = 0x13c9b66c7020001, negotiated timeout = 10000
[junit4:junit4]   2> 135 T2706 oascc.ConnectionManager.process Watcher org.apache.solr.common.cloud.ConnectionManager@7a13b09f name:ZooKeeperConnection Watcher:127.0.0.1:21162/solr got event WatchedEvent state:SyncConnected type:None path:null path:null type:None
[junit4:junit4]   2> 135 T2697 oascc.ConnectionManager.waitForConnected Client is connected to ZooKeeper
[junit4:junit4]   2> 136 T2697 oascc.SolrZkClient.makePath makePath: /collections/collection1
[junit4:junit4]   2> 140 T2697 oascc.SolrZkClient.makePath makePath: /collections/collection1/shards
[junit4:junit4]   2> 148 T2697 oascc.SolrZkClient.makePath makePath: /collections/control_collection
[junit4:junit4]   2> 151 T2697 oascc.SolrZkClient.makePath makePath: /collections/control_collection/shards
[junit4:junit4]   2> 154 T2697 oasc.AbstractZkTestCase.putConfig put /usr/home/hudson/hudson-slave/workspace/Lucene-Solr-Tests-trunk-java7/solr/build/solr-core/test-files/solr/collection1/conf/solrconfig.xml to /configs/conf1/solrconfig.xml
[junit4:junit4]   2> 155 T2697 oascc.SolrZkClient.makePath makePath: /configs/conf1/solrconfig.xml
[junit4:junit4]   2> 173 T2697 oasc.AbstractZkTestCase.putConfig put /usr/home/hudson/hudson-slave/workspace/Lucene-Solr-Tests-trunk-java7/solr/build/solr-core/test-files/solr/collection1/conf/schema.xml to /configs/conf1/schema.xml
[junit4:junit4]   2> 174 T2697 oascc.SolrZkClient.makePath makePath: /configs/conf1/schema.xml
[junit4:junit4]   2> 278 T2697 oasc.AbstractZkTestCase.putConfig put /usr/home/hudson/hudson-slave/workspace/Lucene-Solr-Tests-trunk-java7/solr/build/solr-core/test-files/solr/collection1/conf/stopwords.txt to /configs/conf1/stopwords.txt
[junit4:junit4]   2> 279 T2697 oascc.SolrZkClient.makePath makePath: /configs/conf1/stopwords.txt
[junit4:junit4]   2> 283 T2697 oasc.AbstractZkTestCase.putConfig put /usr/home/hudson/hudson-slave/workspace/Lucene-Solr-Tests-trunk-java7/solr/build/solr-core/test-files/solr/collection1/conf/protwords.txt to /configs/conf1/protwords.txt
[junit4:junit4]   2> 284 T2697 oascc.SolrZkClient.makePath makePath: /configs/conf1/protwords.txt
[junit4:junit4]   2> 294 T2697 oasc.AbstractZkTestCase.putConfig put /usr/home/hudson/hudson-slave/workspace/Lucene-Solr-Tests-trunk-java7/solr/build/solr-core/test-files/solr/collection1/conf/currency.xml to /configs/conf1/currency.xml
[junit4:junit4]   2> 295 T2697 oascc.SolrZkClient.makePath makePath: /configs/conf1/currency.xml
[junit4:junit4]   2> 298 T2697 oasc.AbstractZkTestCase.putConfig put /usr/home/hudson/hudson-slave/workspace/Lucene-Solr-Tests-trunk-java7/solr/build/solr-core/test-files/solr/collection1/conf/open-exchange-rates.json to /configs/conf1/open-exchange-rates.json
[junit4:junit4]   2> 298 T2697 oascc.SolrZkClient.makePath makePath: /configs/conf1/open-exchange-rates.json
[junit4:junit4]   2> 302 T2697 oasc.AbstractZkTestCase.putConfig put /usr/home/hudson/hudson-slave/workspace/Lucene-Solr-Tests-trunk-java7/solr/build/solr-core/test-files/solr/collection1/conf/mapping-ISOLatin1Accent.txt to /configs/conf1/mapping-ISOLatin1Accent.txt
[junit4:junit4]   2> 303 T2697 oascc.SolrZkClient.makePath makePath: /configs/conf1/mapping-ISOLatin1Accent.txt
[junit4:junit4]   2> 306 T2697 oasc.AbstractZkTestCase.putConfig put /usr/home/hudson/hudson-slave/workspace/Lucene-Solr-Tests-trunk-java7/solr/build/solr-core/test-files/solr/collection1/conf/old_synonyms.txt to /configs/conf1/old_synonyms.txt
[junit4:junit4]   2> 307 T2697 oascc.SolrZkClient.makePath makePath: /configs/conf1/old_synonyms.txt
[junit4:junit4]   2> 310 T2697 oasc.AbstractZkTestCase.putConfig put /usr/home/hudson/hudson-slave/workspace/Lucene-Solr-Tests-trunk-java7/solr/build/solr-core/test-files/solr/collection1/conf/synonyms.txt to /configs/conf1/synonyms.txt
[junit4:junit4]   2> 311 T2697 oascc.SolrZkClient.makePath makePath: /configs/conf1/synonyms.txt
[junit4:junit4]   2> 313 T2702 oazs.PrepRequestProcessor.pRequest2Txn Processed session termination for sessionid: 0x13c9b66c7020001
[junit4:junit4]   2> 320 T2706 oaz.ClientCnxn$EventThread.run EventThread shut down
[junit4:junit4]   2> 320 T2699 oazs.NIOServerCnxn.closeSock Closed socket connection for client /140.211.11.196:31986 which had sessionid 0x13c9b66c7020001
[junit4:junit4]   2> 320 T2697 oaz.ZooKeeper.close Session: 0x13c9b66c7020001 closed
[junit4:junit4]   2> 486 T2697 oejs.Server.doStart jetty-8.1.8.v20121106
[junit4:junit4]   2> 491 T2697 oejs.AbstractConnector.doStart Started SocketConnector@127.0.0.1:56011
[junit4:junit4]   2> 492 T2697 oass.SolrDispatchFilter.init SolrDispatchFilter.init()
[junit4:junit4]   2> 493 T2697 oasc.SolrResourceLoader.locateSolrHome JNDI not configured for solr (NoInitialContextEx)
[junit4:junit4]   2> 493 T2697 oasc.SolrResourceLoader.locateSolrHome using system property solr.solr.home: /usr/home/hudson/hudson-slave/workspace/Lucene-Solr-Tests-trunk-java7/solr/build/solr-core/test/J1/./org.apache.solr.cloud.SyncSliceTest-controljetty-1359816869942
[junit4:junit4]   2> 494 T2697 oasc.CoreContainer$Initializer.initialize looking for solr.xml: /usr/home/hudson/hudson-slave/workspace/Lucene-Solr-Tests-trunk-java7/solr/build/solr-core/test/J1/./org.apache.solr.cloud.SyncSliceTest-controljetty-1359816869942/solr.xml
[junit4:junit4]   2> 494 T2697 oasc.CoreContainer.<init> New CoreContainer 289000432
[junit4:junit4]   2> 495 T2697 oasc.CoreContainer.load Loading CoreContainer using Solr Home: '/usr/home/hudson/hudson-slave/workspace/Lucene-Solr-Tests-trunk-java7/solr/build/solr-core/test/J1/./org.apache.solr.cloud.SyncSliceTest-controljetty-1359816869942/'
[junit4:junit4]   2> 496 T2697 oasc.SolrResourceLoader.<init> new SolrResourceLoader for directory: '/usr/home/hudson/hudson-slave/workspace/Lucene-Solr-Tests-trunk-java7/solr/build/solr-core/test/J1/./org.apache.solr.cloud.SyncSliceTest-controljetty-1359816869942/'
[junit4:junit4]   2> 563 T2697 oashc.HttpShardHandlerFactory.getParameter Setting socketTimeout to: 60000
[junit4:junit4]   2> 564 T2697 oashc.HttpShardHandlerFactory.getParameter Setting urlScheme to: http://
[junit4:junit4]   2> 564 T2697 oashc.HttpShardHandlerFactory.getParameter Setting connTimeout to: 15000
[junit4:junit4]   2> 565 T2697 oashc.HttpShardHandlerFactory.getParameter Setting maxConnectionsPerHost to: 20
[junit4:junit4]   2> 565 T2697 oashc.HttpShardHandlerFactory.getParameter Setting corePoolSize to: 0
[junit4:junit4]   2> 566 T2697 oashc.HttpShardHandlerFactory.getParameter Setting maximumPoolSize to: 2147483647
[junit4:junit4]   2> 566 T2697 oashc.HttpShardHandlerFactory.getParameter Setting maxThreadIdleTime to: 5
[junit4:junit4]   2> 567 T2697 oashc.HttpShardHandlerFactory.getParameter Setting sizeOfQueue to: -1
[junit4:junit4]   2> 567 T2697 oashc.HttpShardHandlerFactory.getParameter Setting fairnessPolicy to: false
[junit4:junit4]   2> 568 T2697 oascsi.HttpClientUtil.createClient Creating new http client, config:maxConnectionsPerHost=20&maxConnections=10000&socketTimeout=60000&connTimeout=15000&retry=false
[junit4:junit4]   2> 592 T2697 oasc.CoreContainer.load Registering Log Listener
[junit4:junit4]   2> 614 T2697 oasc.CoreContainer.initZooKeeper Zookeeper client=127.0.0.1:21162/solr
[junit4:junit4]   2> 615 T2697 oasc.ZkController.checkChrootPath zkHost includes chroot
[junit4:junit4]   2> 615 T2697 oaz.ZooKeeper.<init> Initiating client connection, connectString=127.0.0.1:21162 sessionTimeout=60000 watcher=org.apache.solr.common.cloud.ConnectionManager@12006d7b
[junit4:junit4]   2> 616 T2697 oascc.ConnectionManager.waitForConnected Waiting for client to connect to ZooKeeper
[junit4:junit4]   2> 617 T2716 oaz.ClientCnxn$SendThread.logStartConnect Opening socket connection to server localhost/127.0.0.1:21162. Will not attempt to authenticate using SASL (access denied ("javax.security.auth.AuthPermission" "getLoginConfiguration"))
[junit4:junit4]   2> 617 T2716 oaz.ClientCnxn$SendThread.primeConnection Socket connection established to localhost/127.0.0.1:21162, initiating session
[junit4:junit4]   2> 618 T2699 oazs.NIOServerCnxnFactory.run Accepted socket connection from /140.211.11.196:32170
[junit4:junit4]   2> 618 T2699 oazs.ZooKeeperServer.processConnectRequest Client attempting to establish new session at /140.211.11.196:32170
[junit4:junit4]   2> 622 T2701 oazs.ZooKeeperServer.finishSessionInit Established session 0x13c9b66c7020002 with negotiated timeout 20000 for client /140.211.11.196:32170
[junit4:junit4]   2> 623 T2716 oaz.ClientCnxn$SendThread.onConnected Session establishment complete on server localhost/127.0.0.1:21162, sessionid = 0x13c9b66c7020002, negotiated timeout = 20000
[junit4:junit4]   2> 623 T2717 oascc.ConnectionManager.process Watcher org.apache.solr.common.cloud.ConnectionManager@12006d7b name:ZooKeeperConnection Watcher:127.0.0.1:21162 got event WatchedEvent state:SyncConnected type:None path:null path:null type:None
[junit4:junit4]   2> 623 T2697 oascc.ConnectionManager.waitForConnected Client is connected to ZooKeeper
[junit4:junit4]   2> 625 T2702 oazs.PrepRequestProcessor.pRequest2Txn Processed session termination for sessionid: 0x13c9b66c7020002
[junit4:junit4]   2> 633 T2699 oazs.NIOServerCnxn.closeSock Closed socket connection for client /140.211.11.196:32170 which had sessionid 0x13c9b66c7020002
[junit4:junit4]   2> 633 T2717 oaz.ClientCnxn$EventThread.run EventThread shut down
[junit4:junit4]   2> 633 T2697 oaz.ZooKeeper.close Session: 0x13c9b66c7020002 closed
[junit4:junit4]   2> 635 T2697 oascsi.HttpClientUtil.createClient Creating new http client, config:maxConnections=500&maxConnectionsPerHost=16&socketTimeout=60000&connTimeout=15000
[junit4:junit4]   2> 647 T2697 oaz.ZooKeeper.<init> Initiating client connection, connectString=127.0.0.1:21162/solr sessionTimeout=30000 watcher=org.apache.solr.common.cloud.ConnectionManager@2292f6d9
[junit4:junit4]   2> 648 T2697 oascc.ConnectionManager.waitForConnected Waiting for client to connect to ZooKeeper
[junit4:junit4]   2> 649 T2718 oaz.ClientCnxn$SendThread.logStartConnect Opening socket connection to server localhost/127.0.0.1:21162. Will not attempt to authenticate using SASL (access denied ("javax.security.auth.AuthPermission" "getLoginConfiguration"))
[junit4:junit4]   2> 649 T2718 oaz.ClientCnxn$SendThread.primeConnection Socket connection established to localhost/127.0.0.1:21162, initiating session
[junit4:junit4]   2> 650 T2699 oazs.NIOServerCnxnFactory.run Accepted socket connection from /140.211.11.196:20410
[junit4:junit4]   2> 650 T2699 oazs.ZooKeeperServer.processConnectRequest Client attempting to establish new session at /140.211.11.196:20410
[junit4:junit4]   2> 658 T2701 oazs.ZooKeeperServer.finishSessionInit Established session 0x13c9b66c7020003 with negotiated timeout 20000 for client /140.211.11.196:20410
[junit4:junit4]   2> 658 T2718 oaz.ClientCnxn$SendThread.onConnected Session establishment complete on server localhost/127.0.0.1:21162, sessionid = 0x13c9b66c7020003, negotiated timeout = 20000
[junit4:junit4]   2> 659 T2719 oascc.ConnectionManager.process Watcher org.apache.solr.common.cloud.ConnectionManager@2292f6d9 name:ZooKeeperConnection Watcher:127.0.0.1:21162/solr got event WatchedEvent state:SyncConnected type:None path:null path:null type:None
[junit4:junit4]   2> 659 T2697 oascc.ConnectionManager.waitForConnected Client is connected to ZooKeeper
[junit4:junit4]   2> 668 T2702 oazs.PrepRequestProcessor.pRequest Got user-level KeeperException when processing sessionid:0x13c9b66c7020003 type:create cxid:0x2 zxid:0x1a txntype:-1 reqpath:n/a Error Path:/solr/overseer Error:KeeperErrorCode = NodeExists for /solr/overseer
[junit4:junit4]   2> 689 T2697 oascc.SolrZkClient.makePath makePath: /live_nodes
[junit4:junit4]   2> 692 T2697 oasc.ZkController.createEphemeralLiveNode Register node as live in ZooKeeper:/live_nodes/127.0.0.1:56011_h_vtp%2Ft
[junit4:junit4]   2> 693 T2702 oazs.PrepRequestProcessor.pRequest Got user-level KeeperException when processing sessionid:0x13c9b66c7020003 type:delete cxid:0x7 zxid:0x1c txntype:-1 reqpath:n/a Error Path:/solr/live_nodes/127.0.0.1:56011_h_vtp%2Ft Error:KeeperErrorCode = NoNode for /solr/live_nodes/127.0.0.1:56011_h_vtp%2Ft
[junit4:junit4]   2> 694 T2697 oascc.SolrZkClient.makePath makePath: /live_nodes/127.0.0.1:56011_h_vtp%2Ft
[junit4:junit4]   2> 704 T2697 oascc.SolrZkClient.makePath makePath: /overseer_elect/election
[junit4:junit4]   2> 730 T2702 oazs.PrepRequestProcessor.pRequest Got user-level KeeperException when processing sessionid:0x13c9b66c7020003 type:delete cxid:0x15 zxid:0x21 txntype:-1 reqpath:n/a Error Path:/solr/overseer_elect/leader Error:KeeperErrorCode = NoNode for /solr/overseer_elect/leader
[junit4:junit4]   2> 737 T2697 oascc.SolrZkClient.makePath makePath: /overseer_elect/leader
[junit4:junit4]   2> 746 T2697 oasc.Overseer.start Overseer (id=89116958368333827-127.0.0.1:56011_h_vtp%2Ft-n_0000000000) starting
[junit4:junit4]   2> 747 T2702 oazs.PrepRequestProcessor.pRequest Got user-level KeeperException when processing sessionid:0x13c9b66c7020003 type:create cxid:0x1a zxid:0x23 txntype:-1 reqpath:n/a Error Path:/solr/overseer Error:KeeperErrorCode = NodeExists for /solr/overseer
[junit4:junit4]   2> 756 T2702 oazs.PrepRequestProcessor.pRequest Got user-level KeeperException when processing sessionid:0x13c9b66c7020003 type:create cxid:0x1b zxid:0x24 txntype:-1 reqpath:n/a Error Path:/solr/overseer Error:KeeperErrorCode = NodeExists for /solr/overseer
[junit4:junit4]   2> 758 T2702 oazs.PrepRequestProcessor.pRequest Got user-level KeeperException when processing sessionid:0x13c9b66c7020003 type:create cxid:0x1c zxid:0x25 txntype:-1 reqpath:n/a Error Path:/solr/overseer Error:KeeperErrorCode = NodeExists for /solr/overseer
[junit4:junit4]   2> 764 T2702 oazs.PrepRequestProcessor.pRequest Got user-level KeeperException when processing sessionid:0x13c9b66c7020003 type:create cxid:0x1d zxid:0x26 txntype:-1 reqpath:n/a Error Path:/solr/overseer Error:KeeperErrorCode = NodeExists for /solr/overseer
[junit4:junit4]   2> 766 T2721 oasc.OverseerCollectionProcessor.run Process current queue of collection creations
[junit4:junit4]   2> 767 T2697 oascc.SolrZkClient.makePath makePath: /clusterstate.json
[junit4:junit4]   2> 777 T2697 oascc.ZkStateReader.createClusterStateWatchersAndUpdate Updating cluster state from ZooKeeper... 
[junit4:junit4]   2> 785 T2722 oasc.CoreContainer.create Creating SolrCore 'collection1' using instanceDir: /usr/home/hudson/hudson-slave/workspace/Lucene-Solr-Tests-trunk-java7/solr/build/solr-core/test/J1/./org.apache.solr.cloud.SyncSliceTest-controljetty-1359816869942/collection1
[junit4:junit4]   2> 785 T2720 oasc.Overseer$ClusterStateUpdater.run Starting to work on the main queue
[junit4:junit4]   2> 786 T2722 oasc.ZkController.createCollectionZkNode Check for collection zkNode:control_collection
[junit4:junit4]   2> 786 T2722 oasc.ZkController.createCollectionZkNode Collection zkNode exists
[junit4:junit4]   2> 787 T2722 oasc.ZkController.readConfigName Load collection config from:/collections/control_collection
[junit4:junit4]   2> 788 T2722 oasc.SolrResourceLoader.<init> new SolrResourceLoader for directory: '/usr/home/hudson/hudson-slave/workspace/Lucene-Solr-Tests-trunk-java7/solr/build/solr-core/test/J1/./org.apache.solr.cloud.SyncSliceTest-controljetty-1359816869942/collection1/'
[junit4:junit4]   2> 789 T2722 oasc.SolrResourceLoader.replaceClassLoader Adding 'file:/usr/home/hudson/hudson-slave/workspace/Lucene-Solr-Tests-trunk-java7/solr/build/solr-core/test/J1/org.apache.solr.cloud.SyncSliceTest-controljetty-1359816869942/collection1/lib/classes/' to classloader
[junit4:junit4]   2> 790 T2722 oasc.SolrResourceLoader.replaceClassLoader Adding 'file:/usr/home/hudson/hudson-slave/workspace/Lucene-Solr-Tests-trunk-java7/solr/build/solr-core/test/J1/org.apache.solr.cloud.SyncSliceTest-controljetty-1359816869942/collection1/lib/README' to classloader
[junit4:junit4]   2> 845 T2722 oasc.SolrConfig.<init> Using Lucene MatchVersion: LUCENE_50
[junit4:junit4]   2> 919 T2722 oasc.SolrConfig.<init> Loaded SolrConfig: solrconfig.xml
[junit4:junit4]   2> 1019 T2722 oass.IndexSchema.readSchema Reading Solr Schema
[junit4:junit4]   2> 1026 T2722 oass.IndexSchema.readSchema Schema name=test
[junit4:junit4]   2> 1681 T2722 oass.OpenExchangeRatesOrgProvider.init Initialized with rates=open-exchange-rates.json, refreshInterval=1440.
[junit4:junit4]   2> 1692 T2722 oass.IndexSchema.readSchema default search field in schema is text
[junit4:junit4]   2> 1696 T2722 oass.IndexSchema.readSchema unique key field: id
[junit4:junit4]   2> 1710 T2722 oass.FileExchangeRateProvider.reload Reloading exchange rates from file currency.xml
[junit4:junit4]   2> 1715 T2722 oass.FileExchangeRateProvider.reload Reloading exchange rates from file currency.xml
[junit4:junit4]   2> 1720 T2722 oass.OpenExchangeRatesOrgProvider.reload Reloading exchange rates from open-exchange-rates.json
[junit4:junit4]   2> 1721 T2722 oass.OpenExchangeRatesOrgProvider.reload Reloading exchange rates from open-exchange-rates.json
[junit4:junit4]   2> 1722 T2722 oasc.SolrCore.<init> [collection1] Opening new SolrCore at /usr/home/hudson/hudson-slave/workspace/Lucene-Solr-Tests-trunk-java7/solr/build/solr-core/test/J1/./org.apache.solr.cloud.SyncSliceTest-controljetty-1359816869942/collection1/, dataDir=./org.apache.solr.cloud.SyncSliceTest-1359816869627/control/data/
[junit4:junit4]   2> 1722 T2722 oasc.JmxMonitoredMap.<init> JMX monitoring is enabled. Adding Solr mbeans to JMX Server: com.sun.jmx.mbeanserver.JmxMBeanServer@12bef803
[junit4:junit4]   2> 1723 T2722 oasc.SolrCore.initDirectoryFactory solr.NRTCachingDirectoryFactory
[junit4:junit4]   2> 1724 T2722 oasc.CachingDirectoryFactory.get return new directory for /usr/home/hudson/hudson-slave/workspace/Lucene-Solr-Tests-trunk-java7/solr/build/solr-core/test/J1/./org.apache.solr.cloud.SyncSliceTest-1359816869627/control/data forceNew:false
[junit4:junit4]   2> 1725 T2722 oasc.CachingDirectoryFactory.close Releasing directory:/usr/home/hudson/hudson-slave/workspace/Lucene-Solr-Tests-trunk-java7/solr/build/solr-core/test/J1/./org.apache.solr.cloud.SyncSliceTest-1359816869627/control/data
[junit4:junit4]   2> 1725 T2722 oasc.SolrCore.getNewIndexDir New index directory detected: old=null new=./org.apache.solr.cloud.SyncSliceTest-1359816869627/control/data/index/
[junit4:junit4]   2> 1726 T2722 oasc.SolrCore.initIndex WARNING [collection1] Solr index directory './org.apache.solr.cloud.SyncSliceTest-1359816869627/control/data/index' doesn't exist. Creating new index...
[junit4:junit4]   2> 1727 T2722 oasc.CachingDirectoryFactory.get return new directory for /usr/home/hudson/hudson-slave/workspace/Lucene-Solr-Tests-trunk-java7/solr/build/solr-core/test/J1/./org.apache.solr.cloud.SyncSliceTest-1359816869627/control/data/index forceNew:false
[junit4:junit4]   2> 1734 T2722 oasc.SolrDeletionPolicy.onCommit SolrDeletionPolicy.onCommit: commits:num=1
[junit4:junit4]   2> 		commit{dir=RateLimitedDirectoryWrapper(NRTCachingDirectory(org.apache.lucene.store.NIOFSDirectory@/usr/home/hudson/hudson-slave/workspace/Lucene-Solr-Tests-trunk-java7/solr/build/solr-core/test/J1/org.apache.solr.cloud.SyncSliceTest-1359816869627/control/data/index lockFactory=org.apache.lucene.store.NativeFSLockFactory@25b6aed5; maxCacheMB=48.0 maxMergeSizeMB=4.0)),segFN=segments_1,generation=1,filenames=[segments_1]
[junit4:junit4]   2> 1734 T2722 oasc.SolrDeletionPolicy.updateCommits newest commit = 1[segments_1]
[junit4:junit4]   2> 1735 T2722 oasc.CachingDirectoryFactory.close Releasing directory:/usr/home/hudson/hudson-slave/workspace/Lucene-Solr-Tests-trunk-java7/solr/build/solr-core/test/J1/./org.apache.solr.cloud.SyncSliceTest-1359816869627/control/data/index
[junit4:junit4]   2> 1736 T2722 oasc.SolrCore.initWriters created xml: solr.XMLResponseWriter
[junit4:junit4]   2> 1738 T2722 oasup.UpdateRequestProcessorChain.init inserting DistributedUpdateProcessorFactory into updateRequestProcessorChain "dedupe"
[junit4:junit4]   2> 1738 T2722 oasup.UpdateRequestProcessorChain.init inserting DistributedUpdateProcessorFactory into updateRequestProcessorChain "dedupe-allfields"
[junit4:junit4]   2> 1738 T2722 oasup.UpdateRequestProcessorChain.init inserting DistributedUpdateProcessorFactory into updateRequestProcessorChain "stored_sig"
[junit4:junit4]   2> 1739 T2722 oasup.UpdateRequestProcessorChain.init inserting DistributedUpdateProcessorFactory into updateRequestProcessorChain "uniq-fields"
[junit4:junit4]   2> 1739 T2722 oasup.UpdateRequestProcessorChain.init inserting DistributedUpdateProcessorFactory into updateRequestProcessorChain "distrib-dup-test-chain-implicit"
[junit4:junit4]   2> 1739 T2722 oasc.RequestHandlers.initHandlersFromConfig adding lazy requestHandler: solr.ReplicationHandler
[junit4:junit4]   2> 1740 T2722 oasc.RequestHandlers.initHandlersFromConfig created /replication: solr.ReplicationHandler
[junit4:junit4]   2> 1740 T2722 oasc.RequestHandlers.initHandlersFromConfig created standard: solr.StandardRequestHandler
[junit4:junit4]   2> 1741 T2722 oasc.RequestHandlers.initHandlersFromConfig created /get: solr.RealTimeGetHandler
[junit4:junit4]   2> 1741 T2722 oasc.RequestHandlers.initHandlersFromConfig created dismax: solr.SearchHandler
[junit4:junit4]   2> 1742 T2722 oasc.RequestHandlers.initHandlersFromConfig created mock: org.apache.solr.core.MockQuerySenderListenerReqHandler
[junit4:junit4]   2> 1742 T2722 oasc.RequestHandlers.initHandlersFromConfig created /admin/: org.apache.solr.handler.admin.AdminHandlers
[junit4:junit4]   2> 1743 T2722 oasc.RequestHandlers.initHandlersFromConfig created defaults: solr.StandardRequestHandler
[junit4:junit4]   2> 1743 T2722 oasc.RequestHandlers.initHandlersFromConfig adding lazy requestHandler: solr.StandardRequestHandler
[junit4:junit4]   2> 1743 T2722 oasc.RequestHandlers.initHandlersFromConfig created lazy: solr.StandardRequestHandler
[junit4:junit4]   2> 1744 T2722 oasc.RequestHandlers.initHandlersFromConfig created /update: solr.UpdateRequestHandler
[junit4:junit4]   2> 1744 T2722 oasc.RequestHandlers.initHandlersFromConfig created /terms: org.apache.solr.handler.component.SearchHandler
[junit4:junit4]   2> 1745 T2722 oasc.RequestHandlers.initHandlersFromConfig created spellCheckCompRH: org.apache.solr.handler.component.SearchHandler
[junit4:junit4]   2> 1745 T2722 oasc.RequestHandlers.initHandlersFromConfig created spellCheckCompRH_Direct: org.apache.solr.handler.component.SearchHandler
[junit4:junit4]   2> 1746 T2722 oasc.RequestHandlers.initHandlersFromConfig created spellCheckWithWordbreak: org.apache.solr.handler.component.SearchHandler
[junit4:junit4]   2> 1746 T2722 oasc.RequestHandlers.initHandlersFromConfig created spellCheckWithWordbreak_Direct: org.apache.solr.handler.component.SearchHandler
[junit4:junit4]   2> 1747 T2722 oasc.RequestHandlers.initHandlersFromConfig created spellCheckCompRH1: org.apache.solr.handler.component.SearchHandler
[junit4:junit4]   2> 1747 T2722 oasc.RequestHandlers.initHandlersFromConfig created mltrh: org.apache.solr.handler.component.SearchHandler
[junit4:junit4]   2> 1747 T2722 oasc.RequestHandlers.initHandlersFromConfig created tvrh: org.apache.solr.handler.component.SearchHandler
[junit4:junit4]   2> 1748 T2722 oasc.RequestHandlers.initHandlersFromConfig created /mlt: solr.MoreLikeThisHandler
[junit4:junit4]   2> 1748 T2722 oasc.RequestHandlers.initHandlersFromConfig created /debug/dump: solr.DumpRequestHandler
[junit4:junit4]   2> 1762 T2722 oashl.XMLLoader.init xsltCacheLifetimeSeconds=60
[junit4:junit4]   2> 1766 T2722 oasc.SolrCore.initDeprecatedSupport WARNING solrconfig.xml uses deprecated <admin/gettableFiles>, Please update your config to use the ShowFileRequestHandler.
[junit4:junit4]   2> 1768 T2722 oasc.SolrCore.initDeprecatedSupport WARNING adding ShowFileRequestHandler with hidden files: [SCHEMA.XML, OLD_SYNONYMS.TXT, STOPWORDS.TXT, PROTWORDS.TXT, OPEN-EXCHANGE-RATES.JSON, SYNONYMS.TXT, CURRENCY.XML, MAPPING-ISOLATIN1ACCENT.TXT]
[junit4:junit4]   2> 1770 T2722 oasc.CachingDirectoryFactory.close Releasing directory:/usr/home/hudson/hudson-slave/workspace/Lucene-Solr-Tests-trunk-java7/solr/build/solr-core/test/J1/./org.apache.solr.cloud.SyncSliceTest-1359816869627/control/data
[junit4:junit4]   2> 1772 T2722 oass.SolrIndexSearcher.<init> Opening Searcher@5d54c58 main
[junit4:junit4]   2> 1773 T2722 oasu.CommitTracker.<init> Hard AutoCommit: disabled
[junit4:junit4]   2> 1773 T2722 oasu.CommitTracker.<init> Soft AutoCommit: disabled
[junit4:junit4]   2> 1774 T2722 oashc.SpellCheckComponent.inform Initializing spell checkers
[junit4:junit4]   2> 1782 T2722 oass.DirectSolrSpellChecker.init init: {name=direct,classname=DirectSolrSpellChecker,field=lowerfilt,minQueryLength=3}
[junit4:junit4]   2> 1841 T2723 oasc.SolrCore.registerSearcher [collection1] Registered new searcher Searcher@5d54c58 main{StandardDirectoryReader(segments_1:1)}
[junit4:junit4]   2> 1845 T2722 oasc.ZkController.publish publishing core=collection1 state=down
[junit4:junit4]   2> 1846 T2722 oasc.ZkController.publish numShards not found on descriptor - reading it from system property
[junit4:junit4]   2> 1846 T2702 oazs.PrepRequestProcessor.pRequest Got user-level KeeperException when processing sessionid:0x13c9b66c7020003 type:create cxid:0x50 zxid:0x29 txntype:-1 reqpath:n/a Error Path:/solr/overseer/queue Error:KeeperErrorCode = NoNode for /solr/overseer/queue
[junit4:junit4]   2> 2289 T2720 oascc.ZkStateReader.updateClusterState Updating cloud state from ZooKeeper... 
[junit4:junit4]   2> 2290 T2720 oasc.Overseer$ClusterStateUpdater.updateState Update state numShards=1 message={
[junit4:junit4]   2> 	  "operation":"state",
[junit4:junit4]   2> 	  "numShards":"1",
[junit4:junit4]   2> 	  "shard":null,
[junit4:junit4]   2> 	  "roles":null,
[junit4:junit4]   2> 	  "state":"down",
[junit4:junit4]   2> 	  "core":"collection1",
[junit4:junit4]   2> 	  "collection":"control_collection",
[junit4:junit4]   2> 	  "node_name":"127.0.0.1:56011_h_vtp%2Ft",
[junit4:junit4]   2> 	  "base_url":"http://127.0.0.1:56011/h_vtp/t"}
[junit4:junit4]   2> 2291 T2720 oasc.Overseer$ClusterStateUpdater.createCollection Create collection control_collection with numShards 1
[junit4:junit4]   2> 2291 T2720 oasc.Overseer$ClusterStateUpdater.updateState Assigning new node to shard shard=shard1
[junit4:junit4]   2> 2291 T2702 oazs.PrepRequestProcessor.pRequest Got user-level KeeperException when processing sessionid:0x13c9b66c7020003 type:create cxid:0x58 zxid:0x2c txntype:-1 reqpath:n/a Error Path:/solr/overseer/queue-work Error:KeeperErrorCode = NoNode for /solr/overseer/queue-work
[junit4:junit4]   2> 2307 T2719 oascc.ZkStateReader$2.process A cluster state change: WatchedEvent state:SyncConnected type:NodeDataChanged path:/clusterstate.json, has occurred - updating... (live nodes size: 1)
[junit4:junit4]   2> 2855 T2722 oasc.CoreContainer.registerCore registering core: collection1
[junit4:junit4]   2> 2855 T2722 oasc.ZkController.register Register replica - core:collection1 address:http://127.0.0.1:56011/h_vtp/t collection:control_collection shard:shard1
[junit4:junit4]   2> 2856 T2722 oascc.SolrZkClient.makePath makePath: /collections/control_collection/leader_elect/shard1/election
[junit4:junit4]   2> 2876 T2702 oazs.PrepRequestProcessor.pRequest Got user-level KeeperException when processing sessionid:0x13c9b66c7020003 type:delete cxid:0x72 zxid:0x36 txntype:-1 reqpath:n/a Error Path:/solr/collections/control_collection/leaders Error:KeeperErrorCode = NoNode for /solr/collections/control_collection/leaders
[junit4:junit4]   2> 2877 T2722 oasc.ShardLeaderElectionContext.runLeaderProcess Running the leader process.
[junit4:junit4]   2> 2878 T2702 oazs.PrepRequestProcessor.pRequest Got user-level KeeperException when processing sessionid:0x13c9b66c7020003 type:create cxid:0x73 zxid:0x37 txntype:-1 reqpath:n/a Error Path:/solr/overseer Error:KeeperErrorCode = NodeExists for /solr/overseer
[junit4:junit4]   2> 2880 T2722 oasc.ShardLeaderElectionContext.waitForReplicasToComeUp Enough replicas found to continue.
[junit4:junit4]   2> 2880 T2722 oasc.ShardLeaderElectionContext.runLeaderProcess I may be the new leader - try and sync
[junit4:junit4]   2> 2880 T2722 oasc.SyncStrategy.sync Sync replicas to http://127.0.0.1:56011/h_vtp/t/collection1/
[junit4:junit4]   2> 2881 T2722 oasc.SyncStrategy.syncReplicas Sync Success - now sync replicas to me
[junit4:junit4]   2> 2881 T2722 oasc.SyncStrategy.syncToMe http://127.0.0.1:56011/h_vtp/t/collection1/ has no replicas
[junit4:junit4]   2> 2881 T2722 oasc.ShardLeaderElectionContext.runLeaderProcess I am the new leader: http://127.0.0.1:56011/h_vtp/t/collection1/
[junit4:junit4]   2> 2881 T2722 oascc.SolrZkClient.makePath makePath: /collections/control_collection/leaders/shard1
[junit4:junit4]   2> 2885 T2702 oazs.PrepRequestProcessor.pRequest Got user-level KeeperException when processing sessionid:0x13c9b66c7020003 type:create cxid:0x7d zxid:0x3b txntype:-1 reqpath:n/a Error Path:/solr/overseer Error:KeeperErrorCode = NodeExists for /solr/overseer
[junit4:junit4]   2> 3811 T2720 oascc.ZkStateReader.updateClusterState Updating cloud state from ZooKeeper... 
[junit4:junit4]   2> 3871 T2719 oascc.ZkStateReader$2.process A cluster state change: WatchedEvent state:SyncConnected type:NodeDataChanged path:/clusterstate.json, has occurred - updating... (live nodes size: 1)
[junit4:junit4]   2> 3907 T2722 oasc.ZkController.register We are http://127.0.0.1:56011/h_vtp/t/collection1/ and leader is http://127.0.0.1:56011/h_vtp/t/collection1/
[junit4:junit4]   2> 3907 T2722 oasc.ZkController.register No LogReplay needed for core=collection1 baseURL=http://127.0.0.1:56011/h_vtp/t
[junit4:junit4]   2> 3907 T2722 oasc.ZkController.checkRecovery I am the leader, no recovery necessary
[junit4:junit4]   2> 3907 T2722 oasc.ZkController.publish publishing core=collection1 state=active
[junit4:junit4]   2> 3908 T2722 oasc.ZkController.publish numShards not found on descriptor - reading it from system property
[junit4:junit4]   2> 3910 T2722 oascc.ZkStateReader.updateClusterState Updating cloud state from ZooKeeper... 
[junit4:junit4]   2> 3911 T2697 oass.SolrDispatchFilter.init user.dir=/usr/home/hudson/hudson-slave/workspace/Lucene-Solr-Tests-trunk-java7/solr/build/solr-core/test/J1
[junit4:junit4]   2> 3912 T2697 oass.SolrDispatchFilter.init SolrDispatchFilter.init() done
[junit4:junit4]   2> 3912 T2697 oascsi.HttpClientUtil.createClient Creating new http client, config:maxConnections=128&maxConnectionsPerHost=32&followRedirects=false
[junit4:junit4]   2> 3926 T2697 oascsi.HttpClientUtil.createClient Creating new http client, config:
[junit4:junit4]   2> 3935 T2697 oaz.ZooKeeper.<init> Initiating client connection, connectString=127.0.0.1:21162/solr sessionTimeout=10000 watcher=org.apache.solr.common.cloud.ConnectionManager@677e2999
[junit4:junit4]   2> 3936 T2697 oascc.ConnectionManager.waitForConnected Waiting for client to connect to ZooKeeper
[junit4:junit4]   2> 3936 T2724 oaz.ClientCnxn$SendThread.logStartConnect Opening socket connection to server localhost/127.0.0.1:21162. Will not attempt to authenticate using SASL (access denied ("javax.security.auth.AuthPermission" "getLoginConfiguration"))
[junit4:junit4]   2> 3937 T2724 oaz.ClientCnxn$SendThread.primeConnection Socket connection established to localhost/127.0.0.1:21162, initiating session
[junit4:junit4]   2> 3937 T2699 oazs.NIOServerCnxnFactory.run Accepted socket connection from /140.211.11.196:14970
[junit4:junit4]   2> 3938 T2699 oazs.ZooKeeperServer.processConnectRequest Client attempting to establish new session at /140.211.11.196:14970
[junit4:junit4]   2> 3939 T2701 oazs.ZooKeeperServer.finishSessionInit Established session 0x13c9b66c7020004 with negotiated timeout 10000 for client /140.211.11.196:14970
[junit4:junit4]   2> 3939 T2724 oaz.ClientCnxn$SendThread.onConnected Session establishment complete on server localhost/127.0.0.1:21162, sessionid = 0x13c9b66c7020004, negotiated timeout = 10000
[junit4:junit4]   2> 3939 T2725 oascc.ConnectionManager.process Watcher org.apache.solr.common.cloud.ConnectionManager@677e2999 name:ZooKeeperConnection Watcher:127.0.0.1:21162/solr got event WatchedEvent state:SyncConnected type:None path:null path:null type:None
[junit4:junit4]   2> 3940 T2697 oascc.ConnectionManager.waitForConnected Client is connected to ZooKeeper
[junit4:junit4]   2> 3942 T2697 oascc.ZkStateReader.createClusterStateWatchersAndUpdate Updating cluster state from ZooKeeper... 
[junit4:junit4]   2> 3943 T2697 oasc.ChaosMonkey.monkeyLog monkey: init - expire sessions:true cause connection loss:true
[junit4:junit4]   2> 4111 T2697 oejs.Server.doStart jetty-8.1.8.v20121106
[junit4:junit4]   2> 4114 T2697 oejs.AbstractConnector.doStart Started SocketConnector@127.0.0.1:30878
[junit4:junit4]   2> 4115 T2697 oass.SolrDispatchFilter.init SolrDispatchFilter.init()
[junit4:junit4]   2> 4117 T2697 oasc.SolrResourceLoader.locateSolrHome JNDI not configured for solr (NoInitialContextEx)
[junit4:junit4]   2> 4117 T2697 oasc.SolrResourceLoader.locateSolrHome using system property solr.solr.home: /usr/home/hudson/hudson-slave/workspace/Lucene-Solr-Tests-trunk-java7/solr/build/solr-core/test/J1/./org.apache.solr.cloud.SyncSliceTest-jetty1-1359816873565
[junit4:junit4]   2> 4118 T2697 oasc.CoreContainer$Initializer.initialize looking for solr.xml: /usr/home/hudson/hudson-slave/workspace/Lucene-Solr-Tests-trunk-java7/solr/build/solr-core/test/J1/./org.apache.solr.cloud.SyncSliceTest-jetty1-1359816873565/solr.xml
[junit4:junit4]   2> 4118 T2697 oasc.CoreContainer.<init> New CoreContainer 1945306197
[junit4:junit4]   2> 4119 T2697 oasc.CoreContainer.load Loading CoreContainer using Solr Home: '/usr/home/hudson/hudson-slave/workspace/Lucene-Solr-Tests-trunk-java7/solr/build/solr-core/test/J1/./org.apache.solr.cloud.SyncSliceTest-jetty1-1359816873565/'
[junit4:junit4]   2> 4119 T2697 oasc.SolrResourceLoader.<init> new SolrResourceLoader for directory: '/usr/home/hudson/hudson-slave/workspace/Lucene-Solr-Tests-trunk-java7/solr/build/solr-core/test/J1/./org.apache.solr.cloud.SyncSliceTest-jetty1-1359816873565/'
[junit4:junit4]   2> 4177 T2697 oashc.HttpShardHandlerFactory.getParameter Setting socketTimeout to: 60000
[junit4:junit4]   2> 4178 T2697 oashc.HttpShardHandlerFactory.getParameter Setting urlScheme to: http://
[junit4:junit4]   2> 4179 T2697 oashc.HttpShardHandlerFactory.getParameter Setting connTimeout to: 15000
[junit4:junit4]   2> 4179 T2697 oashc.HttpShardHandlerFactory.getParameter Setting maxConnectionsPerHost to: 20
[junit4:junit4]   2> 4180 T2697 oashc.HttpShardHandlerFactory.getParameter Setting corePoolSize to: 0
[junit4:junit4]   2> 4180 T2697 oashc.HttpShardHandlerFactory.getParameter Setting maximumPoolSize to: 2147483647
[junit4:junit4]   2> 4181 T2697 oashc.HttpShardHandlerFactory.getParameter Setting maxThreadIdleTime to: 5
[junit4:junit4]   2> 4181 T2697 oashc.HttpShardHandlerFactory.getParameter Setting sizeOfQueue to: -1
[junit4:junit4]   2> 4182 T2697 oashc.HttpShardHandlerFactory.getParameter Setting fairnessPolicy to: false
[junit4:junit4]   2> 4182 T2697 oascsi.HttpClientUtil.createClient Creating new http client, config:maxConnectionsPerHost=20&maxConnections=10000&socketTimeout=60000&connTimeout=15000&retry=false
[junit4:junit4]   2> 4202 T2697 oasc.CoreContainer.load Registering Log Listener
[junit4:junit4]   2> 4223 T2697 oasc.CoreContainer.initZooKeeper Zookeeper client=127.0.0.1:21162/solr
[junit4:junit4]   2> 4223 T2697 oasc.ZkController.checkChrootPath zkHost includes chroot
[junit4:junit4]   2> 4224 T2697 oaz.ZooKeeper.<init> Initiating client connection, connectString=127.0.0.1:21162 sessionTimeout=60000 watcher=org.apache.solr.common.cloud.ConnectionManager@2bcd6006
[junit4:junit4]   2> 4225 T2697 oascc.ConnectionManager.waitForConnected Waiting for client to connect to ZooKeeper
[junit4:junit4]   2> 4226 T2735 oaz.ClientCnxn$SendThread.logStartConnect Opening socket connection to server localhost/127.0.0.1:21162. Will not attempt to authenticate using SASL (access denied ("javax.security.auth.AuthPermission" "getLoginConfiguration"))
[junit4:junit4]   2> 4226 T2735 oaz.ClientCnxn$SendThread.primeConnection Socket connection established to localhost/127.0.0.1:21162, initiating session
[junit4:junit4]   2> 4226 T2699 oazs.NIOServerCnxnFactory.run Accepted socket connection from /140.211.11.196:65146
[junit4:junit4]   2> 4227 T2699 oazs.ZooKeeperServer.processConnectRequest Client attempting to establish new session at /140.211.11.196:65146
[junit4:junit4]   2> 4228 T2701 oazs.ZooKeeperServer.finishSessionInit Established session 0x13c9b66c7020005 with negotiated timeout 20000 for client /140.211.11.196:65146
[junit4:junit4]   2> 4228 T2735 oaz.ClientCnxn$SendThread.onConnected Session establishment complete on server localhost/127.0.0.1:21162, sessionid = 0x13c9b66c7020005, negotiated timeout = 20000
[junit4:junit4]   2> 4229 T2736 oascc.ConnectionManager.process Watcher org.apache.solr.common.cloud.ConnectionManager@2bcd6006 name:ZooKeeperConnection Watcher:127.0.0.1:21162 got event WatchedEvent state:SyncConnected type:None path:null path:null type:None
[junit4:junit4]   2> 4229 T2697 oascc.ConnectionManager.waitForConnected Client is connected to ZooKeeper
[junit4:junit4]   2> 4231 T2702 oazs.PrepRequestProcessor.pRequest2Txn Processed session termination for sessionid: 0x13c9b66c7020005
[junit4:junit4]   2> 4232 T2736 oaz.ClientCnxn$EventThread.run EventThread shut down
[junit4:junit4]   2> 4232 T2699 oazs.NIOServerCnxn.closeSock Closed socket connection for client /140.211.11.196:65146 which had sessionid 0x13c9b66c7020005
[junit4:junit4]   2> 4232 T2697 oaz.ZooKeeper.close Session: 0x13c9b66c7020005 closed
[junit4:junit4]   2> 4233 T2697 oascsi.HttpClientUtil.createClient Creating new http client, config:maxConnections=500&maxConnectionsPerHost=16&socketTimeout=60000&connTimeout=15000
[junit4:junit4]   2> 4244 T2697 oaz.ZooKeeper.<init> Initiating client connection, connectString=127.0.0.1:21162/solr sessionTimeout=30000 watcher=org.apache.solr.common.cloud.ConnectionManager@787f92d3
[junit4:junit4]   2> 4245 T2697 oascc.ConnectionManager.waitForConnected Waiting for client to connect to ZooKeeper
[junit4:junit4]   2> 4246 T2737 oaz.ClientCnxn$SendThread.logStartConnect Opening socket connection to server localhost/127.0.0.1:21162. Will not attempt to authenticate using SASL (access denied ("javax.security.auth.AuthPermission" "getLoginConfiguration"))
[junit4:junit4]   2> 4246 T2737 oaz.ClientCnxn$SendThread.primeConnection Socket connection established to localhost/127.0.0.1:21162, initiating session
[junit4:junit4]   2> 4246 T2699 oazs.NIOServerCnxnFactory.run Accepted socket connection from /140.211.11.196:40852
[junit4:junit4]   2> 4247 T2699 oazs.ZooKeeperServer.processConnectRequest Client attempting to establish new session at /140.211.11.196:40852
[junit4:junit4]   2> 4248 T2701 oazs.ZooKeeperServer.finishSessionInit Established session 0x13c9b66c7020006 with negotiated timeout 20000 for client /140.211.11.196:40852
[junit4:junit4]   2> 4248 T2737 oaz.ClientCnxn$SendThread.onConnected Session establishment complete on server localhost/127.0.0.1:21162, sessionid = 0x13c9b66c7020006, negotiated timeout = 20000
[junit4:junit4]   2> 4249 T2738 oascc.ConnectionManager.process Watcher org.apache.solr.common.cloud.ConnectionManager@787f92d3 name:ZooKeeperConnection Watcher:127.0.0.1:21162/solr got event WatchedEvent state:SyncConnected type:None path:null path:null type:None
[junit4:junit4]   2> 4249 T2697 oascc.ConnectionManager.waitForConnected Client is connected to ZooKeeper
[junit4:junit4]   2> 4250 T2702 oazs.PrepRequestProcessor.pRequest Got user-level KeeperException when processing sessionid:0x13c9b66c7020006 type:create cxid:0x1 zxid:0x49 txntype:-1 reqpath:n/a Error Path:/solr/overseer Error:KeeperErrorCode = NodeExists for /solr/overseer
[junit4:junit4]   2> 4252 T2702 oazs.PrepRequestProcessor.pRequest Got user-level KeeperException when processing sessionid:0x13c9b66c7020006 type:create cxid:0x2 zxid:0x4a txntype:-1 reqpath:n/a Error Path:/solr/overseer Error:KeeperErrorCode = NodeExists for /solr/overseer
[junit4:junit4]   2> 4253 T2697 oasc.ZkController.createEphemeralLiveNode Register node as live in ZooKeeper:/live_nodes/127.0.0.1:30878_h_vtp%2Ft
[junit4:junit4]   2> 4254 T2702 oazs.PrepRequestProcessor.pRequest Got user-level KeeperException when processing sessionid:0x13c9b66c7020006 type:delete cxid:0x4 zxid:0x4b txntype:-1 reqpath:n/a Error Path:/solr/live_nodes/127.0.0.1:30878_h_vtp%2Ft Error:KeeperErrorCode = NoNode for /solr/live_nodes/127.0.0.1:30878_h_vtp%2Ft
[junit4:junit4]   2> 4261 T2697 oascc.SolrZkClient.makePath makePath: /live_nodes/127.0.0.1:30878_h_vtp%2Ft
[junit4:junit4]   2> 4264 T2719 oascc.ZkStateReader$2.process A cluster state change: WatchedEvent state:SyncConnected type:NodeChildrenChanged path:/live_nodes, has occurred - updating... (live nodes size: 1)
[junit4:junit4]   2> 4264 T2725 oascc.ZkStateReader$3.process Updating live nodes... (2)
[junit4:junit4]   2> 4266 T2719 oascc.ZkStateReader$3.process Updating live nodes... (2)
[junit4:junit4]   2> 4268 T2697 oascc.ZkStateReader.createClusterStateWatchersAndUpdate Updating cluster state from ZooKeeper... 
[junit4:junit4]   2> 4275 T2739 oasc.CoreContainer.create Creating SolrCore 'collection1' using instanceDir: /usr/home/hudson/hudson-slave/workspace/Lucene-Solr-Tests-trunk-java7/solr/build/solr-core/test/J1/./org.apache.solr.cloud.SyncSliceTest-jetty1-1359816873565/collection1
[junit4:junit4]   2> 4275 T2739 oasc.ZkController.createCollectionZkNode Check for collection zkNode:collection1
[junit4:junit4]   2> 4276 T2739 oasc.ZkController.createCollectionZkNode Collection zkNode exists
[junit4:junit4]   2> 4276 T2739 oasc.ZkController.readConfigName Load collection config from:/collections/collection1
[junit4:junit4]   2> 4277 T2739 oasc.SolrResourceLoader.<init> new SolrResourceLoader for directory: '/usr/home/hudson/hudson-slave/workspace/Lucene-Solr-Tests-trunk-java7/solr/build/solr-core/test/J1/./org.apache.solr.cloud.SyncSliceTest-jetty1-1359816873565/collection1/'
[junit4:junit4]   2> 4279 T2739 oasc.SolrResourceLoader.replaceClassLoader Adding 'file:/usr/home/hudson/hudson-slave/workspace/Lucene-Solr-Tests-trunk-java7/solr/build/solr-core/test/J1/org.apache.solr.cloud.SyncSliceTest-jetty1-1359816873565/collection1/lib/classes/' to classloader
[junit4:junit4]   2> 4279 T2739 oasc.SolrResourceLoader.replaceClassLoader Adding 'file:/usr/home/hudson/hudson-slave/workspace/Lucene-Solr-Tests-trunk-java7/solr/build/solr-core/test/J1/org.apache.solr.cloud.SyncSliceTest-jetty1-1359816873565/collection1/lib/README' to classloader
[junit4:junit4]   2> 4336 T2739 oasc.SolrConfig.<init> Using Lucene MatchVersion: LUCENE_50
[junit4:junit4]   2> 4411 T2739 oasc.SolrConfig.<init> Loaded SolrConfig: solrconfig.xml
[junit4:junit4]   2> 4512 T2739 oass.IndexSchema.readSchema Reading Solr Schema
[junit4:junit4]   2> 4519 T2739 oass.IndexSchema.readSchema Schema name=test
[junit4:junit4]   2> 5169 T2739 oass.OpenExchangeRatesOrgProvider.init Initialized with rates=open-exchange-rates.json, refreshInterval=1440.
[junit4:junit4]   2> 5180 T2739 oass.IndexSchema.readSchema default search field in schema is text
[junit4:junit4]   2> 5184 T2739 oass.IndexSchema.readSchema unique key field: id
[junit4:junit4]   2> 5197 T2739 oass.FileExchangeRateProvider.reload Reloading exchange rates from file currency.xml
[junit4:junit4]   2> 5202 T2739 oass.FileExchangeRateProvider.reload Reloading exchange rates from file currency.xml
[junit4:junit4]   2> 5207 T2739 oass.OpenExchangeRatesOrgProvider.reload Reloading exchange rates from open-exchange-rates.json
[junit4:junit4]   2> 5208 T2739 oass.OpenExchangeRatesOrgProvider.reload Reloading exchange rates from open-exchange-rates.json
[junit4:junit4]   2> 5209 T2739 oasc.SolrCore.<init> [collection1] Opening new SolrCore at /usr/home/hudson/hudson-slave/workspace/Lucene-Solr-Tests-trunk-java7/solr/build/solr-core/test/J1/./org.apache.solr.cloud.SyncSliceTest-jetty1-1359816873565/collection1/, dataDir=./org.apache.solr.cloud.SyncSliceTest-1359816869627/jetty1/
[junit4:junit4]   2> 5210 T2739 oasc.JmxMonitoredMap.<init> JMX monitoring is enabled. Adding Solr mbeans to JMX Server: com.sun.jmx.mbeanserver.JmxMBeanServer@12bef803
[junit4:junit4]   2> 5210 T2739 oasc.SolrCore.initDirectoryFactory solr.NRTCachingDirectoryFactory
[junit4:junit4]   2> 5211 T2739 oasc.CachingDirectoryFactory.get return new directory for /usr/home/hudson/hudson-slave/workspace/Lucene-Solr-Tests-trunk-java7/solr/build/solr-core/test/J1/./org.apache.solr.cloud.SyncSliceTest-1359816869627/jetty1 forceNew:false
[junit4:junit4]   2> 5212 T2739 oasc.CachingDirectoryFactory.close Releasing directory:/usr/home/hudson/hudson-slave/workspace/Lucene-Solr-Tests-trunk-java7/solr/build/solr-core/test/J1/./org.apache.solr.cloud.SyncSliceTest-1359816869627/jetty1
[junit4:junit4]   2> 5212 T2739 oasc.SolrCore.getNewIndexDir New index directory detected: old=null new=./org.apache.solr.cloud.SyncSliceTest-1359816869627/jetty1/index/
[junit4:junit4]   2> 5213 T2739 oasc.SolrCore.initIndex WARNING [collection1] Solr index directory './org.apache.solr.cloud.SyncSliceTest-1359816869627/jetty1/index' doesn't exist. Creating new index...
[junit4:junit4]   2> 5213 T2739 oasc.CachingDirectoryFactory.get return new directory for /usr/home/hudson/hudson-slave/workspace/Lucene-Solr-Tests-trunk-java7/solr/build/solr-core/test/J1/./org.apache.solr.cloud.SyncSliceTest-1359816869627/jetty1/index forceNew:false
[junit4:junit4]   2> 5247 T2739 oasc.SolrDeletionPolicy.onCommit SolrDeletionPolicy.onCommit: commits:num=1
[junit4:junit4]   2> 		commit{dir=RateLimitedDirectoryWrapper(NRTCachingDirectory(org.apache.lucene.store.NIOFSDirectory@/usr/home/hudson/hudson-slave/workspace/Lucene-Solr-Tests-trunk-java7/solr/build/solr-core/test/J1/org.apache.solr.cloud.SyncSliceTest-1359816869627/jetty1/index lockFactory=org.apache.lucene.store.NativeFSLockFactory@5227b13d; maxCacheMB=48.0 maxMergeSizeMB=4.0)),segFN=segments_1,generation=1,filenames=[segments_1]
[junit4:junit4]   2> 5247 T2739 oasc.SolrDeletionPolicy.updateCommits newest commit = 1[segments_1]
[junit4:junit4]   2> 5248 T2739 oasc.CachingDirectoryFactory.close Releasing directory:/usr/home/hudson/hudson-slave/workspace/Lucene-Solr-Tests-trunk-java7/solr/build/solr-core/test/J1/./org.apache.solr.cloud.SyncSliceTest-1359816869627/jetty1/index
[junit4:junit4]   2> 5249 T2739 oasc.SolrCore.initWriters created xml: solr.XMLResponseWriter
[junit4:junit4]   2> 5251 T2739 oasup.UpdateRequestProcessorChain.init inserting DistributedUpdateProcessorFactory into updateRequestProcessorChain "dedupe"
[junit4:junit4]   2> 5251 T2739 oasup.UpdateRequestProcessorChain.init inserting DistributedUpdateProcessorFactory into updateRequestProcessorChain "dedupe-allfields"
[junit4:junit4]   2> 5252 T2739 oasup.UpdateRequestProcessorChain.init inserting DistributedUpdateProcessorFactory into updateRequestProcessorChain "stored_sig"
[junit4:junit4]   2> 5252 T2739 oasup.UpdateRequestProcessorChain.init inserting DistributedUpdateProcessorFactory into updateRequestProcessorChain "uniq-fields"
[junit4:junit4]   2> 5253 T2739 oasup.UpdateRequestProcessorChain.init inserting DistributedUpdateProcessorFactory into updateRequestProcessorChain "distrib-dup-test-chain-implicit"
[junit4:junit4]   2> 5253 T2739 oasc.RequestHandlers.initHandlersFromConfig adding lazy requestHandler: solr.ReplicationHandler
[junit4:junit4]   2> 5253 T2739 oasc.RequestHandlers.initHandlersFromConfig created /replication: solr.ReplicationHandler
[junit4:junit4]   2> 5254 T2739 oasc.RequestHandlers.initHandlersFromConfig created standard: solr.StandardRequestHandler
[junit4:junit4]   2> 5254 T2739 oasc.RequestHandlers.initHandlersFromConfig created /get: solr.RealTimeGetHandler
[junit4:junit4]   2> 5255 T2739 oasc.RequestHandlers.initHandlersFromConfig created dismax: solr.SearchHandler
[junit4:junit4]   2> 5256 T2739 oasc.RequestHandlers.initHandlersFromConfig created mock: org.apache.solr.core.MockQuerySenderListenerReqHandler
[junit4:junit4]   2> 5256 T2739 oasc.RequestHandlers.initHandlersFromConfig created /admin/: org.apache.solr.handler.admin.AdminHandlers
[junit4:junit4]   2> 5257 T2739 oasc.RequestHandlers.initHandlersFromConfig created defaults: solr.StandardRequestHandler
[junit4:junit4]   2> 5257 T2739 oasc.RequestHandlers.initHandlersFromConfig adding lazy requestHandler: solr.StandardRequestHandler
[junit4:junit4]   2> 5257 T2739 oasc.RequestHandlers.initHandlersFromConfig created lazy: solr.StandardRequestHandler
[junit4:junit4]   2> 5258 T2739 oasc.RequestHandlers.initHandlersFromConfig created /update: solr.UpdateRequestHandler
[junit4:junit4]   2> 5258 T2739 oasc.RequestHandlers.initHandlersFromConfig created /terms: org.apache.solr.handler.component.SearchHandler
[junit4:junit4]   2> 5259 T2739 oasc.RequestHandlers.initHandlersFromConfig created spellCheckCompRH: org.apache.solr.handler.component.SearchHandler
[junit4:junit4]   2> 5259 T2739 oasc.RequestHandlers.initHandlersFromConfig created spellCheckCompRH_Direct: org.apache.solr.handler.component.SearchHandler
[junit4:junit4]   2> 5260 T2739 oasc.RequestHandlers.initHandlersFromConfig created spellCheckWithWordbreak: org.apache.solr.handler.component.SearchHandler
[junit4:junit4]   2> 5261 T2739 oasc.RequestHandlers.initHandlersFromConfig created spellCheckWithWordbreak_Direct: org.apache.solr.handler.component.SearchHandler
[junit4:junit4]   2> 5261 T2739 oasc.RequestHandlers.initHandlersFromConfig created spellCheckCompRH1: org.apache.solr.handler.component.SearchHandler
[junit4:junit4]   2> 5262 T2739 oasc.RequestHandlers.initHandlersFromConfig created mltrh: org.apache.solr.handler.component.SearchHandler
[junit4:junit4]   2> 5262 T2739 oasc.RequestHandlers.initHandlersFromConfig created tvrh: org.apache.solr.handler.component.SearchHandler
[junit4:junit4]   2> 5263 T2739 oasc.RequestHandlers.initHandlersFromConfig created /mlt: solr.MoreLikeThisHandler
[junit4:junit4]   2> 5263 T2739 oasc.RequestHandlers.initHandlersFromConfig created /debug/dump: solr.DumpRequestHandler
[junit4:junit4]   2> 5276 T2739 oashl.XMLLoader.init xsltCacheLifetimeSeconds=60
[junit4:junit4]   2> 5281 T2739 oasc.SolrCore.initDeprecatedSupport WARNING solrconfig.xml uses deprecated <admin/gettableFiles>, Please update your config to use the ShowFileRequestHandler.
[junit4:junit4]   2> 5282 T2739 oasc.SolrCore.initDeprecatedSupport WARNING adding ShowFileRequestHandler with hidden files: [SCHEMA.XML, OLD_SYNONYMS.TXT, STOPWORDS.TXT, PROTWORDS.TXT, OPEN-EXCHANGE-RATES.JSON, SYNONYMS.TXT, CURRENCY.XML, MAPPING-ISOLATIN1ACCENT.TXT]
[junit4:junit4]   2> 5285 T2739 oasc.CachingDirectoryFactory.close Releasing directory:/usr/home/hudson/hudson-slave/workspace/Lucene-Solr-Tests-trunk-java7/solr/build/solr-core/test/J1/./org.apache.solr.cloud.SyncSliceTest-1359816869627/jetty1
[junit4:junit4]   2> 5287 T2739 oass.SolrIndexSearcher.<init> Opening Searcher@6165fee1 main
[junit4:junit4]   2> 5288 T2739 oasu.CommitTracker.<init> Hard AutoCommit: disabled
[junit4:junit4]   2> 5288 T2739 oasu.CommitTracker.<init> Soft AutoCommit: disabled
[junit4:junit4]   2> 5289 T2739 oashc.SpellCheckComponent.inform Initializing spell checkers
[junit4:junit4]   2> 5297 T2739 oass.DirectSolrSpellChecker.init init: {name=direct,classname=DirectSolrSpellChecker,field=lowerfilt,minQueryLength=3}
[junit4:junit4]   2> 5346 T2740 oasc.SolrCore.registerSearcher [collection1] Registered new searcher Searcher@6165fee1 main{StandardDirectoryReader(segments_1:1)}
[junit4:junit4]   2> 5350 T2739 oasc.ZkController.publish publishing core=collection1 state=down
[junit4:junit4]   2> 5350 T2739 oasc.ZkController.publish numShards not found on descriptor - reading it from system property
[junit4:junit4]   2> 5382 T2720 oascc.ZkStateReader.updateClusterState Updating cloud state from ZooKeeper... 
[junit4:junit4]   2> 5383 T2720 oasc.Overseer$ClusterStateUpdater.updateState Update state numShards=1 message={
[junit4:junit4]   2> 	  "operation":"state",
[junit4:junit4]   2> 	  "numShards":"1",
[junit4:junit4]   2> 	  "shard":"shard1",
[junit4:junit4]   2> 	  "roles":null,
[junit4:junit4]   2> 	  "state":"active",
[junit4:junit4]   2> 	  "core":"collection1",
[junit4:junit4]   2> 	  "collection":"control_collection",
[junit4:junit4]   2> 	  "node_name":"127.0.0.1:56011_h_vtp%2Ft",
[junit4:junit4]   2> 	  "base_url":"http://127.0.0.1:56011/h_vtp/t"}
[junit4:junit4]   2> 5387 T2720 oasc.Overseer$ClusterStateUpdater.updateState Update state numShards=1 message={
[junit4:junit4]   2> 	  "operation":"state",
[junit4:junit4]   2> 	  "numShards":"1",
[junit4:junit4]   2> 	  "shard":null,
[junit4:junit4]   2> 	  "roles":null,
[junit4:junit4]   2> 	  "state":"down",
[junit4:junit4]   2> 	  "core":"collection1",
[junit4:junit4]   2> 	  "collection":"collection1",
[junit4:junit4]   2> 	  "node_name":"127.0.0.1:30878_h_vtp%2Ft",
[junit4:junit4]   2> 	  "base_url":"http://127.0.0.1:30878/h_vtp/t"}
[junit4:junit4]   2> 5387 T2720 oasc.Overseer$ClusterStateUpdater.createCollection Create collection collection1 with numShards 1
[junit4:junit4]   2> 5387 T2720 oasc.Overseer$ClusterStateUpdater.updateState Assigning new node to shard shard=shard1
[junit4:junit4]   2> 5398 T2725 oascc.ZkStateReader$2.process A cluster state change: WatchedEvent state:SyncConnected type:NodeDataChanged path:/clusterstate.json, has occurred - updating... (live nodes size: 2)
[junit4:junit4]   2> 5398 T2738 oascc.ZkStateReader$2.process A cluster state change: WatchedEvent state:SyncConnected type:NodeDataChanged path:/clusterstate.json, has occurred - updating... (live nodes size: 2)
[junit4:junit4]   2> 5398 T2719 oascc.ZkStateReader$2.process A cluster state change: WatchedEvent state:SyncConnected type:NodeDataChanged path:/clusterstate.json, has occurred - updating... (live nodes size: 2)
[junit4:junit4]   2> 6353 T2739 oasc.CoreContainer.registerCore registering core: collection1
[junit4:junit4]   2> 6353 T2739 oasc.ZkController.register Register replica - core:collection1 address:http://127.0.0.1:30878/h_vtp/t collection:collection1 shard:shard1
[junit4:junit4]   2> 6354 T2739 oascc.SolrZkClient.makePath makePath: /collections/collection1/leader_elect/shard1/election
[junit4:junit4]   2> 6401 T2702 oazs.PrepRequestProcessor.pRequest Got user-level KeeperException when processing sessionid:0x13c9b66c7020006 type:delete cxid:0x43 zxid:0x5a txntype:-1 reqpath:n/a Error Path:/solr/collections/collection1/leaders Error:KeeperErrorCode = NoNode for /solr/collections/collection1/leaders
[junit4:junit4]   2> 6402 T2739 oasc.ShardLeaderElectionContext.runLeaderProcess Running the leader process.
[junit4:junit4]   2> 6403 T2702 oazs.PrepRequestProcessor.pRequest Got user-level KeeperException when processing sessionid:0x13c9b66c7020006 type:create cxid:0x44 zxid:0x5b txntype:-1 reqpath:n/a Error Path:/solr/overseer Error:KeeperErrorCode = NodeExists for /solr/overseer
[junit4:junit4]   2> 6411 T2739 oasc.ShardLeaderElectionContext.waitForReplicasToComeUp Enough replicas found to continue.
[junit4:junit4]   2> 6412 T2739 oasc.ShardLeaderElectionContext.runLeaderProcess I may be the new leader - try and sync
[junit4:junit4]   2> 6412 T2739 oasc.SyncStrategy.sync Sync replicas to http://127.0.0.1:30878/h_vtp/t/collection1/
[junit4:junit4]   2> 6412 T2739 oasc.SyncStrategy.syncReplicas Sync Success - now sync replicas to me
[junit4:junit4]   2> 6412 T2739 oasc.SyncStrategy.syncToMe http://127.0.0.1:30878/h_vtp/t/collection1/ has no replicas
[junit4:junit4]   2> 6413 T2739 oasc.ShardLeaderElectionContext.runLeaderProcess I am the new leader: http://127.0.0.1:30878/h_vtp/t/collection1/
[junit4:junit4]   2> 6413 T2739 oascc.SolrZkClient.makePath makePath: /collections/collection1/leaders/shard1
[junit4:junit4]   2> 6417 T2702 oazs.PrepRequestProcessor.pRequest Got user-level KeeperException when processing sessionid:0x13c9b66c7020006 type:create cxid:0x4e zxid:0x5f txntype:-1 reqpath:n/a Error Path:/solr/overseer Error:KeeperErrorCode = NodeExists for /solr/overseer
[junit4:junit4]   2> 6911 T2720 oascc.ZkStateReader.updateClusterState Updating cloud state from ZooKeeper... 
[junit4:junit4]   2> 6930 T2719 oascc.ZkStateReader$2.process A cluster state change: WatchedEvent state:SyncConnected type:NodeDataChanged path:/clusterstate.json, has occurred - updating... (live nodes size: 2)
[junit4:junit4]   2> 6930 T2725 oascc.ZkStateReader$2.process A cluster state change: WatchedEvent state:SyncConnected type:NodeDataChanged path:/clusterstate.json, has occurred - updating... (live nodes size: 2)
[junit4:junit4]   2> 6930 T2738 oascc.ZkStateReader$2.process A cluster state change: WatchedEvent state:SyncConnected type:NodeDataChanged path:/clusterstate.json, has occurred - updating... (live nodes size: 2)
[junit4:junit4]   2> 6941 T2739 oasc.ZkController.register We are http://127.0.0.1:30878/h_vtp/t/collection1/ and leader is http://127.0.0.1:30878/h_vtp/t/collection1/
[junit4:junit4]   2> 6941 T2739 oasc.ZkController.register No LogReplay needed for core=collection1 baseURL=http://127.0.0.1:30878/h_vtp/t
[junit4:junit4]   2> 6941 T2739 oasc.ZkController.checkRecovery I am the leader, no recovery necessary
[junit4:junit4]   2> 6941 T2739 oasc.ZkController.publish publishing core=collection1 state=active
[junit4:junit4]   2> 6942 T2739 oasc.ZkController.publish numShards not found on descriptor - reading it from system property
[junit4:junit4]   2> 6943 T2739 oascc.ZkStateReader.updateClusterState Updating cloud state from ZooKeeper... 
[junit4:junit4]   2> 6944 T2697 oass.SolrDispatchFilter.init user.dir=/usr/home/hudson/hudson-slave/workspace/Lucene-Solr-Tests-trunk-java7/solr/build/solr-core/test/J1
[junit4:junit4]   2> 6945 T2697 oass.SolrDispatchFilter.init SolrDispatchFilter.init() done
[junit4:junit4]   2> 6945 T2697 oascsi.HttpClientUtil.createClient Creating new http client, config:maxConnections=128&maxConnectionsPerHost=32&followRedirects=false
[junit4:junit4]   2> 7120 T2697 oejs.Server.doStart jetty-8.1.8.v20121106
[junit4:junit4]   2> 7123 T2697 oejs.AbstractConnector.doStart Started SocketConnector@127.0.0.1:14367
[junit4:junit4]   2> 7124 T2697 oass.SolrDispatchFilter.init SolrDispatchFilter.init()
[junit4:junit4]   2> 7125 T2697 oasc.SolrResourceLoader.locateSolrHome JNDI not configured for solr (NoInitialContextEx)
[junit4:junit4]   2> 7125 T2697 oasc.SolrResourceLoader.locateSolrHome using system property solr.solr.home: /usr/home/hudson/hudson-slave/workspace/Lucene-Solr-Tests-trunk-java7/solr/build/solr-core/test/J1/./org.apache.solr.cloud.SyncSliceTest-jetty2-1359816876580
[junit4:junit4]   2> 7125 T2697 oasc.CoreContainer$Initializer.initialize looking for solr.xml: /usr/home/hudson/hudson-slave/workspace/Lucene-Solr-Tests-trunk-java7/solr/build/solr-core/test/J1/./org.apache.solr.cloud.SyncSliceTest-jetty2-1359816876580/solr.xml
[junit4:junit4]   2> 7126 T2697 oasc.CoreContainer.<init> New CoreContainer 1740916061
[junit4:junit4]   2> 7127 T2697 oasc.CoreContainer.load Loading CoreContainer using Solr Home: '/usr/home/hudson/hudson-slave/workspace/Lucene-Solr-Tests-trunk-java7/solr/build/solr-core/test/J1/./org.apache.solr.cloud.SyncSliceTest-jetty2-1359816876580/'
[junit4:junit4]   2> 7127 T2697 oasc.SolrResourceLoader.<init> new SolrResourceLoader for directory: '/usr/home/hudson/hudson-slave/workspace/Lucene-Solr-Tests-trunk-java7/solr/build/solr-core/test/J1/./org.apache.solr.cloud.SyncSliceTest-jetty2-1359816876580/'
[junit4:junit4]   2> 7184 T2697 oashc.HttpShardHandlerFactory.getParameter Setting socketTimeout to: 60000
[junit4:junit4]   2> 7185 T2697 oashc.HttpShardHandlerFactory.getParameter Setting urlScheme to: http://
[junit4:junit4]   2> 7185 T2697 oashc.HttpShardHandlerFactory.getParameter Setting connTimeout to: 15000
[junit4:junit4]   2> 7185 T2697 oashc.HttpShardHandlerFactory.getParameter Setting maxConnectionsPerHost to: 20
[junit4:junit4]   2> 7186 T2697 oashc.HttpShardHandlerFactory.getParameter Setting corePoolSize to: 0
[junit4:junit4]   2> 7186 T2697 oashc.HttpShardHandlerFactory.getParameter Setting maximumPoolSize to: 2147483647
[junit4:junit4]   2> 7187 T2697 oashc.HttpShardHandlerFactory.getParameter Setting maxThreadIdleTime to: 5
[junit4:junit4]   2> 7187 T2697 oashc.HttpShardHandlerFactory.getParameter Setting sizeOfQueue to: -1
[junit4:junit4]   2> 7188 T2697 oashc.HttpShardHandlerFactory.getParameter Setting fairnessPolicy to: false
[junit4:junit4]   2> 7188 T2697 oascsi.HttpClientUtil.createClient Creating new http client, config:maxConnectionsPerHost=20&maxConnections=10000&socketTimeout=60000&connTimeout=15000&retry=false
[junit4:junit4]   2> 7209 T2697 oasc.CoreContainer.load Registering Log Listener
[junit4:junit4]   2> 7229 T2697 oasc.CoreContainer.initZooKeeper Zookeeper client=127.0.0.1:21162/solr
[junit4:junit4]   2> 7229 T2697 oasc.ZkController.checkChrootPath zkHost includes chroot
[junit4:junit4]   2> 7230 T2697 oaz.ZooKeeper.<init> Initiating client connection, connectString=127.0.0.1:21162 sessionTimeout=60000 watcher=org.apache.solr.common.cloud.ConnectionManager@1fdb755
[junit4:junit4]   2> 7231 T2697 oascc.ConnectionManager.waitForConnected Waiting for client to connect to ZooKeeper
[junit4:junit4]   2> 7231 T2750 oaz.ClientCnxn$SendThread.logStartConnect Opening socket connection to server localhost/127.0.0.1:21162. Will not attempt to authenticate using SASL (access denied ("javax.security.auth.AuthPermission" "getLoginConfiguration"))
[junit4:junit4]   2> 7232 T2750 oaz.ClientCnxn$SendThread.primeConnection Socket connection established to localhost/127.0.0.1:21162, initiating session
[junit4:junit4]   2> 7232 T2699 oazs.NIOServerCnxnFactory.run Accepted socket connection from /140.211.11.196:60788
[junit4:junit4]   2> 7233 T2699 oazs.ZooKeeperServer.processConnectRequest Client attempting to establish new session at /140.211.11.196:60788
[junit4:junit4]   2> 7234 T2701 oazs.ZooKeeperServer.finishSessionInit Established session 0x13c9b66c7020007 with negotiated timeout 20000 for client /140.211.11.196:60788
[junit4:junit4]   2> 7234 T2750 oaz.ClientCnxn$SendThread.onConnected Session establishment complete on server localhost/127.0.0.1:21162, sessionid = 0x13c9b66c7020007, negotiated timeout = 20000
[junit4:junit4]   2> 7235 T2751 oascc.ConnectionManager.process Watcher org.apache.solr.common.cloud.ConnectionManager@1fdb755 name:ZooKeeperConnection Watcher:127.0.0.1:21162 got event WatchedEvent state:SyncConnected type:None path:null path:null type:None
[junit4:junit4]   2> 7235 T2697 oascc.ConnectionManager.waitForConnected Client is connected to ZooKeeper
[junit4:junit4]   2> 7236 T2702 oazs.PrepRequestProcessor.pRequest2Txn Processed session termination for sessionid: 0x13c9b66c7020007
[junit4:junit4]   2> 7240 T2699 oazs.NIOServerCnxn.closeSock Closed socket connection for client /140.211.11.196:60788 which had sessionid 0x13c9b66c7020007
[junit4:junit4]   2> 7240 T2751 oaz.ClientCnxn$EventThread.run EventThread shut down
[junit4:junit4]   2> 7240 T2697 oaz.ZooKeeper.close Session: 0x13c9b66c7020007 closed
[junit4:junit4]   2> 7241 T2697 oascsi.HttpClientUtil.createClient Creating new http client, config:maxConnections=500&maxConnectionsPerHost=16&socketTimeout=60000&connTimeout=15000
[junit4:junit4]   2> 7253 T2697 oaz.ZooKeeper.<init> Initiating client connection, connectString=127.0.0.1:21162/solr sessionTimeout=30000 watcher=org.apache.solr.common.cloud.ConnectionManager@3b2ccaef
[junit4:junit4]   2> 7254 T2697 oascc.ConnectionManager.waitForConnected Waiting for client to connect to ZooKeeper
[junit4:junit4]   2> 7254 T2752 oaz.ClientCnxn$SendThread.logStartConnect Opening socket connection to server localhost/127.0.0.1:21162. Will not attempt to authenticate using SASL (access denied ("javax.security.auth.AuthPermission" "getLoginConfiguration"))
[junit4:junit4]   2> 7255 T2752 oaz.ClientCnxn$SendThread.primeConnection Socket connection established to localhost/127.0.0.1:21162, initiating session
[junit4:junit4]   2> 7255 T2699 oazs.NIOServerCnxnFactory.run Accepted socket connection from /140.211.11.196:51520
[junit4:junit4]   2> 7256 T2699 oazs.ZooKeeperServer.processConnectRequest Client attempting to establish new session at /140.211.11.196:51520
[junit4:junit4]   2> 7258 T2701 oazs.ZooKeeperServer.finishSessionInit Established session 0x13c9b66c7020008 with negotiated timeout 20000 for client /140.211.11.196:51520
[junit4:junit4]   2> 7258 T2752 oaz.ClientCnxn$SendThread.onConnected Session establishment complete on server localhost/127.0.0.1:21162, sessionid = 0x13c9b66c7020008, negotiated timeout = 20000
[junit4:junit4]   2> 7258 T2753 oascc.ConnectionManager.process Watcher org.apache.solr.common.cloud.ConnectionManager@3b2ccaef name:ZooKeeperConnection Watcher:127.0.0.1:21162/solr got event WatchedEvent state:SyncConnected type:None path:null path:null type:None
[junit4:junit4]   2> 7258 T2697 oascc.ConnectionManager.waitForConnected Client is connected to ZooKeeper
[junit4:junit4]   2> 7260 T2702 oazs.PrepRequestProcessor.pRequest Got user-level KeeperException when processing sessionid:0x13c9b66c7020008 type:create cxid:0x1 zxid:0x6c txntype:-1 reqpath:n/a Error Path:/solr/overseer Error:KeeperErrorCode = NodeExists for /solr/overseer
[junit4:junit4]   2> 7261 T2702 oazs.PrepRequestProcessor.pRequest Got user-level KeeperException when processing sessionid:0x13c9b66c7020008 type:create cxid:0x2 zxid:0x6d txntype:-1 reqpath:n/a Error Path:/solr/overseer Error:KeeperErrorCode = NodeExists for /solr/overseer
[junit4:junit4]   2> 7273 T2697 oasc.ZkController.createEphemeralLiveNode Register node as live in ZooKeeper:/live_nodes/127.0.0.1:14367_h_vtp%2Ft
[junit4:junit4]   2> 7274 T2702 oazs.PrepRequestProcessor.pRequest Got user-level KeeperException when processing sessionid:0x13c9b66c7020008 type:delete cxid:0x4 zxid:0x6e txntype:-1 reqpath:n/a Error Path:/solr/live_nodes/127.0.0.1:14367_h_vtp%2Ft Error:KeeperErrorCode = NoNode for /solr/live_nodes/127.0.0.1:14367_h_vtp%2Ft
[junit4:junit4]   2> 7275 T2697 oascc.SolrZkClient.makePath makePath: /live_nodes/127.0.0.1:14367_h_vtp%2Ft
[junit4:junit4]   2> 7281 T2719 oascc.ZkStateReader$2.process A cluster state change: WatchedEvent state:SyncConnected type:NodeChildrenChanged path:/live_nodes, has occurred - updating... (live nodes size: 2)
[junit4:junit4]   2> 7281 T2738 oascc.ZkStateReader$2.process A cluster state change: WatchedEvent state:SyncConnected type:NodeChildrenChanged path:/live_nodes, has occurred - updating... (live nodes size: 2)
[junit4:junit4]   2> 7281 T2725 oascc.ZkStateReader$3.process Updating live nodes... (3)
[junit4:junit4]   2> 7282 T2725 oascc.ZkStateReader$2.process A cluster state change: WatchedEvent state:SyncConnected type:NodeChildrenChanged path:/live_nodes, has occurred - updating... (live nodes size: 3)
[junit4:junit4]   2> 7283 T2719 oascc.ZkStateReader$3.process Updating live nodes... (3)
[junit4:junit4]   2> 7283 T2738 oascc.ZkStateReader$3.process Updating live nodes... (3)
[junit4:junit4]   2> 7284 T2697 oascc.ZkStateReader.createClusterStateWatchersAndUpdate Updating cluster state from ZooKeeper... 
[junit4:junit4]   2> 7291 T2754 oasc.CoreContainer.create Creating SolrCore 'collection1' using instanceDir: /usr/home/hudson/hudson-slave/workspace/Lucene-Solr-Tests-trunk-java7/solr/build/solr-core/test/J1/./org.apache.solr.cloud.SyncSliceTest-jetty2-1359816876580/collection1
[junit4:junit4]   2> 7291 T2754 oasc.ZkController.createCollectionZkNode Check for collection zkNode:collection1
[junit4:junit4]   2> 7292 T2754 oasc.ZkController.createCollectionZkNode Collection zkNode exists
[junit4:junit4]   2> 7292 T2754 oasc.ZkController.readConfigName Load collection config from:/collections/collection1
[junit4:junit4]   2> 7293 T2754 oasc.SolrResourceLoader.<init> new SolrResourceLoader for directory: '/usr/home/hudson/hudson-slave/workspace/Lucene-Solr-Tests-trunk-java7/solr/build/solr-core/test/J1/./org.apache.solr.cloud.SyncSliceTest-jetty2-1359816876580/collection1/'
[junit4:junit4]   2> 7295 T2754 oasc.SolrResourceLoader.replaceClassLoader Adding 'file:/usr/home/hudson/hudson-slave/workspace/Lucene-Solr-Tests-trunk-java7/solr/build/solr-core/test/J1/org.apache.solr.cloud.SyncSliceTest-jetty2-1359816876580/collection1/lib/README' to classloader
[junit4:junit4]   2> 7295 T2754 oasc.SolrResourceLoader.replaceClassLoader Adding 'file:/usr/home/hudson/hudson-slave/workspace/Lucene-Solr-Tests-trunk-java7/solr/build/solr-core/test/J1/org.apache.solr.cloud.SyncSliceTest-jetty2-1359816876580/collection1/lib/classes/' to classloader
[junit4:junit4]   2> 7350 T2754 oasc.SolrConfig.<init> Using Lucene MatchVersion: LUCENE_50
[junit4:junit4]   2> 7423 T2754 oasc.SolrConfig.<init> Loaded SolrConfig: solrconfig.xml
[junit4:junit4]   2> 7524 T2754 oass.IndexSchema.readSchema Reading Solr Schema
[junit4:junit4]   2> 7530 T2754 oass.IndexSchema.readSchema Schema name=test
[junit4:junit4]   2> 8442 T2720 oascc.ZkStateReader.updateClusterState Updating cloud state from ZooKeeper... 
[junit4:junit4]   2> 8442 T2720 oasc.Overseer$ClusterStateUpdater.updateState Update state numShards=1 message={
[junit4:junit4]   2> 	  "operation":"state",
[junit4:junit4]   2> 	  "numShards":"1",
[junit4:junit4]   2> 	  "shard":"shard1",
[junit4:junit4]   2> 	  "roles":null,
[junit4:junit4]   2> 	  "state":"active",
[junit4:junit4]   2> 	  "core":"collection1",
[junit4:junit4]   2> 	  "collection":"collection1",
[junit4:junit4]   2> 	  "node_name":"127.0.0.1:30878_h_vtp%2Ft",
[junit4:junit4]   2> 	  "base_url":"http://127.0.0.1:30878/h_vtp/t"}
[junit4:junit4]   2> 8455 T2754 oass.OpenExchangeRatesOrgProvider.init Initialized with rates=open-exchange-rates.json, refreshInterval=1440.
[junit4:junit4]   2> 8455 T2719 oascc.ZkStateReader$2.process A cluster state change: WatchedEvent state:SyncConnected type:NodeDataChanged path:/clusterstate.json, has occurred - updating... (live nodes size: 3)
[junit4:junit4]   2> 8455 T2753 oascc.ZkStateReader$2.process A cluster state change: WatchedEvent state:SyncConnected type:NodeDataChanged path:/clusterstate.json, has occurred - updating... (live nodes size: 3)
[junit4:junit4]   2> 8455 T2725 oascc.ZkStateReader$2.process A cluster state change: WatchedEvent state:SyncConnected type:NodeDataChanged path:/clusterstate.json, has occurred - updating... (live nodes size: 3)
[junit4:junit4]   2> 8455 T2738 oascc.ZkStateReader$2.process A cluster state change: WatchedEvent state:SyncConnected type:NodeDataChanged path:/clusterstate.json, has occurred - updating... (live nodes size: 3)
[junit4:junit4]   2> 8468 T2754 oass.IndexSchema.readSchema default search field in schema is text
[junit4:junit4]   2> 8472 T2754 oass.IndexSchema.readSchema unique key field: id
[junit4:junit4]   2> 8485 T2754 oass.FileExchangeRateProvider.reload Reloading exchange rates from file currency.xml
[junit4:junit4]   2> 8490 T2754 oass.FileExchangeRateProvider.reload Reloading exchange rates from file currency.xml
[junit4:junit4]   2> 8495 T2754 oass.OpenExchangeRatesOrgProvider.reload Reloading exchange rates from open-exchange-rates.json
[junit4:junit4]   2> 8496 T2754 oass.OpenExchangeRatesOrgProvider.reload Reloading exchange rates from open-exchange-rates.json
[junit4:junit4]   2> 8497 T2754 oasc.SolrCore.<init> [collection1] Opening new SolrCore at /usr/home/hudson/hudson-slave/workspace/Lucene-Solr-Tests-trunk-java7/solr/build/solr-core/test/J1/./org.apache.solr.cloud.SyncSliceTest-jetty2-1359816876580/collection1/, dataDir=./org.apache.solr.cloud.SyncSliceTest-1359816869627/jetty2/
[junit4:junit4]   2> 8498 T2754 oasc.JmxMonitoredMap.<init> JMX monitoring is enabled. Adding Solr mbeans to JMX Server: com.sun.jmx.mbeanserver.JmxMBeanServer@12bef803
[junit4:junit4]   2> 8498 T2754 oasc.SolrCore.initDirectoryFactory solr.NRTCachingDirectoryFactory
[junit4:junit4]   2> 8499 T2754 oasc.CachingDirectoryFactory.get return new directory for /usr/home/hudson/hudson-slave/workspace/Lucene-Solr-Tests-trunk-java7/solr/build/solr-core/test/J1/./org.apache.solr.cloud.SyncSliceTest-1359816869627/jetty2 forceNew:false
[junit4:junit4]   2> 8500 T2754 oasc.CachingDirectoryFactory.close Releasing directory:/usr/home/hudson/hudson-slave/workspace/Lucene-Solr-Tests-trunk-java7/solr/build/solr-core/test/J1/./org.apache.solr.cloud.SyncSliceTest-1359816869627/jetty2
[junit4:junit4]   2> 8500 T2754 oasc.SolrCore.getNewIndexDir New index directory detected: old=null new=./org.apache.solr.cloud.SyncSliceTest-1359816869627/jetty2/index/
[junit4:junit4]   2> 8501 T2754 oasc.SolrCore.initIndex WARNING [collection1] Solr index directory './org.apache.solr.cloud.SyncSliceTest-1359816869627/jetty2/index' doesn't exist. Creating new index...
[junit4:junit4]   2> 8501 T2754 oasc.CachingDirectoryFactory.get return new directory for /usr/home/hudson/hudson-slave/workspace/Lucene-Solr-Tests-trunk-java7/solr/build/solr-core/test/J1/./org.apache.solr.cloud.SyncSliceTest-1359816869627/jetty2/index forceNew:false
[junit4:junit4]   2> 8508 T2754 oasc.SolrDeletionPolicy.onCommit SolrDeletionPolicy.onCommit: commits:num=1
[junit4:junit4]   2> 		commit{dir=RateLimitedDirectoryWrapper(NRTCachingDirectory(org.apache.lucene.store.NIOFSDirectory@/usr/home/hudson/hudson-slave/workspace/Lucene-Solr-Tests-trunk-java7/solr/build/solr-core/test/J1/org.apache.solr.cloud.SyncSliceTest-1359816869627/jetty2/index lockFactory=org.apache.lucene.store.NativeFSLockFactory@443844c7; maxCacheMB=48.0 maxMergeSizeMB=4.0)),segFN=segments_1,generation=1,filenames=[segments_1]
[junit4:junit4]   2> 8508 T2754 oasc.SolrDeletionPolicy.updateCommits newest commit = 1[segments_1]
[junit4:junit4]   2> 8509 T2754 oasc.CachingDirectoryFactory.close Releasing directory:/usr/home/hudson/hudson-slave/workspace/Lucene-Solr-Tests-trunk-java7/solr/build/solr-core/test/J1/./org.apache.solr.cloud.SyncSliceTest-1359816869627/jetty2/index
[junit4:junit4]   2> 8510 T2754 oasc.SolrCore.initWriters created xml: solr.XMLResponseWriter
[junit4:junit4]   2> 8512 T2754 oasup.UpdateRequestProcessorChain.init inserting DistributedUpdateProcessorFactory into updateRequestProcessorChain "dedupe"
[junit4:junit4]   2> 8512 T2754 oasup.UpdateRequestProcessorChain.init inserting DistributedUpdateProcessorFactory into updateRequestProcessorChain "dedupe-allfields"
[junit4:junit4]   2> 8512 T2754 oasup.UpdateRequestProcessorChain.init inserting DistributedUpdateProcessorFactory into updateRequestProcessorChain "stored_sig"
[junit4:junit4]   2> 8513 T2754 oasup.UpdateRequestProcessorChain.init inserting DistributedUpdateProcessorFactory into updateRequestProcessorChain "uniq-fields"
[junit4:junit4]   2> 8513 T2754 oasup.UpdateRequestProcessorChain.init inserting DistributedUpdateProcessorFactory into updateRequestProcessorChain "distrib-dup-test-chain-implicit"
[junit4:junit4]   2> 8514 T2754 oasc.RequestHandlers.initHandlersFromConfig adding lazy requestHandler: solr.ReplicationHandler
[junit4:junit4]   2> 8514 T2754 oasc.RequestHandlers.initHandlersFromConfig created /replication: solr.ReplicationHandler
[junit4:junit4]   2> 8515 T2754 oasc.RequestHandlers.initHandlersFromConfig created standard: solr.StandardRequestHandler
[junit4:junit4]   2> 8515 T2754 oasc.RequestHandlers.initHandlersFromConfig created /get: solr.RealTimeGetHandler
[junit4:junit4]   2> 8516 T2754 oasc.RequestHandlers.initHandlersFromConfig created dismax: solr.SearchHandler
[junit4:junit4]   2> 8516 T2754 oasc.RequestHandlers.initHandlersFromConfig created mock: org.apache.solr.core.MockQuerySenderListenerReqHandler
[junit4:junit4]   2> 8517 T2754 oasc.RequestHandlers.initHandlersFromConfig created /admin/: org.apache.solr.handler.admin.AdminHandlers
[junit4:junit4]   2> 8517 T2754 oasc.RequestHandlers.initHandlersFromConfig created defaults: solr.StandardRequestHandler
[junit4:junit4]   2> 8518 T2754 oasc.RequestHandlers.initHandlersFromConfig adding lazy requestHandler: solr.StandardRequestHandler
[junit4:junit4]   2> 8518 T2754 oasc.RequestHandlers.initHandlersFromConfig created lazy: solr.StandardRequestHandler
[junit4:junit4]   2> 8519 T2754 oasc.RequestHandlers.initHandlersFromConfig created /update: solr.UpdateRequestHandler
[junit4:junit4]   2> 8519 T2754 oasc.RequestHandlers.initHandlersFromConfig created /terms: org.apache.solr.handler.component.SearchHandler
[junit4:junit4]   2> 8520 T2754 oasc.RequestHandlers.initHandlersFromConfig created spellCheckCompRH: org.apache.solr.handler.component.SearchHandler
[junit4:junit4]   2> 8520 T2754 oasc.RequestHandlers.initHandlersFromConfig created spellCheckCompRH_Direct: org.apache.solr.handler.component.SearchHandler
[junit4:junit4]   2> 8521 T2754 oasc.RequestHandlers.initHandlersFromConfig created spellCheckWithWordbreak: org.apache.solr.handler.component.SearchHandler
[junit4:junit4]   2> 8521 T2754 oasc.RequestHandlers.initHandlersFromConfig created spellCheckWithWordbreak_Direct: org.apache.solr.handler.component.SearchHandler
[junit4:junit4]   2> 8522 T2754 oasc.RequestHandlers.initHandlersFromConfig created spellCheckCompRH1: org.apache.solr.handler.component.SearchHandler
[junit4:junit4]   2> 8523 T2754 oasc.RequestHandlers.initHandlersFromConfig created mltrh: org.apache.solr.handler.component.SearchHandler
[junit4:junit4]   2> 8523 T2754 oasc.RequestHandlers.initHandlersFromConfig created tvrh: org.apache.solr.handler.component.SearchHandler
[junit4:junit4]   2> 8524 T2754 oasc.RequestHandlers.initHandlersFromConfig created /mlt: solr.MoreLikeThisHandler
[junit4:junit4]   2> 8524 T2754 oasc.RequestHandlers.initHandlersFromConfig created /debug/dump: solr.DumpRequestHandler
[junit4:junit4]   2> 8537 T2754 oashl.XMLLoader.init xsltCacheLifetimeSeconds=60
[junit4:junit4]   2> 8542 T2754 oasc.SolrCore.initDeprecatedSupport WARNING solrconfig.xml uses deprecated <admin/gettableFiles>, Please update your config to use the ShowFileRequestHandler.
[junit4:junit4]   2> 8543 T2754 oasc.SolrCore.initDeprecatedSupport WARNING adding ShowFileRequestHandler with hidden files: [SCHEMA.XML, OLD_SYNONYMS.TXT, STOPWORDS.TXT, PROTWORDS.TXT, OPEN-EXCHANGE-RATES.JSON, SYNONYMS.TXT, CURRENCY.XML, MAPPING-ISOLATIN1ACCENT.TXT]
[junit4:junit4]   2> 8546 T2754 oasc.CachingDirectoryFactory.close Releasing directory:/usr/home/hudson/hudson-slave/workspace/Lucene-Solr-Tests-trunk-java7/solr/build/solr-core/test/J1/./org.apache.solr.cloud.SyncSliceTest-1359816869627/jetty2
[junit4:junit4]   2> 8547 T2754 oass.SolrIndexSearcher.<init> Opening Searcher@5e961fa9 main
[junit4:junit4]   2> 8548 T2754 oasu.CommitTracker.<init> Hard AutoCommit: disabled
[junit4:junit4]   2> 8549 T2754 oasu.CommitTracker.<init> Soft AutoCommit: disabled
[junit4:junit4]   2> 8549 T2754 oashc.SpellCheckComponent.inform Initializing spell checkers
[junit4:junit4]   2> 8556 T2754 oass.DirectSolrSpellChecker.init init: {name=direct,classname=DirectSolrSpellChecker,field=lowerfilt,minQueryLength=3}
[junit4:junit4]   2> 8615 T2755 oasc.SolrCore.registerSearcher [collection1] Registered new searcher Searcher@5e961fa9 main{StandardDirectoryReader(segments_1:1)}
[junit4:junit4]   2> 8620 T2754 oasc.ZkController.publish publishing core=collection1 state=down
[junit4:junit4]   2> 8620 T2754 oasc.ZkController.publish numShards not found on descriptor - reading it from system property
[junit4:junit4]   2> 9960 T2720 oascc.ZkStateReader.updateClusterState Updating cloud state from ZooKeeper... 
[junit4:junit4]   2> 9961 T2720 oasc.Overseer$ClusterStateUpdater.updateState Update state numShards=1 message={
[junit4:junit4]   2> 	  "operation":"state",
[junit4:junit4]   2> 	  "numShards":"1",
[junit4:junit4]   2> 	  "shard":null,
[junit4:junit4]   2> 	  "roles":null,
[junit4:junit4]   2> 	  "state":"down",
[junit4:junit4]   2> 	  "core":"collection1",
[junit4:junit4]   2> 	  "collection":"collection1",
[junit4:junit4]   2> 	  "node_name":"127.0.0.1:14367_h_vtp%2Ft",
[junit4:junit4]   2> 	  "base_url":"http://127.0.0.1:14367/h_vtp/t"}
[junit4:junit4]   2> 9962 T2720 oasc.Overseer$ClusterStateUpdater.updateState Collection already exists with numShards=1
[junit4:junit4]   2> 9962 T2720 oasc.Overseer$ClusterStateUpdater.updateState Assigning new node to shard shard=shard1
[junit4:junit4]   2> 9975 T2719 oascc.ZkStateReader$2.process A cluster state change: WatchedEvent state:SyncConnected type:NodeDataChanged path:/clusterstate.json, has occurred - updating... (live nodes size: 3)
[junit4:junit4]   2> 9975 T2725 oascc.ZkStateReader$2.process A cluster state change: WatchedEvent state:SyncConnected type:NodeDataChanged path:/clusterstate.json, has occurred - updating... (live nodes size: 3)
[junit4:junit4]   2> 9975 T2738 oascc.ZkStateReader$2.process A cluster state change: WatchedEvent state:SyncConnected type:NodeDataChanged path:/clusterstate.json, has occurred - updating... (live nodes size: 3)
[junit4:junit4]   2> 9975 T2753 oascc.ZkStateReader$2.process A cluster state change: WatchedEvent state:SyncConnected type:NodeDataChanged path:/clusterstate.json, has occurred - updating... (live nodes size: 3)
[junit4:junit4]   2> 10624 T2754 oasc.CoreContainer.registerCore registering core: collection1
[junit4:junit4]   2> 10624 T2754 oasc.ZkController.register Register replica - core:collection1 address:http://127.0.0.1:14367/h_vtp/t collection:collection1 shard:shard1
[junit4:junit4]   2> 10627 T2754 oasc.ZkController.register We are http://127.0.0.1:14367/h_vtp/t/collection1/ and leader is http://127.0.0.1:30878/h_vtp/t/collection1/
[junit4:junit4]   2> 10627 T2754 oasc.ZkController.register No LogReplay needed for core=collection1 baseURL=http://127.0.0.1:14367/h_vtp/t
[junit4:junit4]   2> 10628 T2754 oasc.ZkController.checkRecovery Core needs to recover:collection1
[junit4:junit4]   2> 10628 T2754 oasu.DefaultSolrCoreState.doRecovery Running recovery - first canceling any ongoing recovery
[junit4:junit4]   2> ASYNC  NEW_CORE C213 name=collection1 org.apache.solr.core.SolrCore@60b0c0ba url=http://127.0.0.1:14367/h_vtp/t/collection1 node=127.0.0.1:14367_h_vtp%2Ft C213_STATE=coll:collection1 core:collection1 props:{shard=null, roles=null, state=down, core=collection1, collection=collection1, node_name=127.0.0.1:14367_h_vtp%2Ft, base_url=http://127.0.0.1:14367/h_vtp/t}
[junit4:junit4]   2> 10628 T2756 C213 P14367 oasc.RecoveryStrategy.run Starting recovery process.  core=collection1 recoveringAfterStartup=true
[junit4:junit4]   2> 10629 T2754 oascc.ZkStateReader.updateClusterState Updating cloud state from ZooKeeper... 
[junit4:junit4]   2> 10630 T2756 C213 P14367 oasc.RecoveryStrategy.doRecovery ###### startupVersions=[]
[junit4:junit4]   2> 10630 T2756 C213 P14367 oasc.ZkController.publish publishing core=collection1 state=recovering
[junit4:junit4]   2> 10630 T2756 C213 P14367 oasc.ZkController.publish numShards not found on descriptor - reading it from system property
[junit4:junit4]   2> 10631 T2697 oass.SolrDispatchFilter.init user.dir=/usr/home/hudson/hudson-slave/workspace/Lucene-Solr-Tests-trunk-java7/solr/build/solr-core/test/J1
[junit4:junit4]   2> 10631 T2697 oass.SolrDispatchFilter.init SolrDispatchFilter.init() done
[junit4:junit4]   2> 10632 T2756 C213 P14367 oascsi.HttpClientUtil.createClient Creating new http client, config:maxConnections=128&maxConnectionsPerHost=32&followRedirects=false
[junit4:junit4]   2> 10632 T2697 oascsi.HttpClientUtil.createClient Creating new http client, config:maxConnections=128&maxConnectionsPerHost=32&followRedirects=false
[junit4:junit4]   2> 10813 T2697 oejs.Server.doStart jetty-8.1.8.v20121106
[junit4:junit4]   2> 10817 T2697 oejs.AbstractConnector.doStart Started SocketConnector@127.0.0.1:14607
[junit4:junit4]   2> 10817 T2697 oass.SolrDispatchFilter.init SolrDispatchFilter.init()
[junit4:junit4]   2> 10818 T2697 oasc.SolrResourceLoader.locateSolrHome JNDI not configured for solr (NoInitialContextEx)
[junit4:junit4]   2> 10818 T2697 oasc.SolrResourceLoader.locateSolrHome using system property solr.solr.home: /usr/home/hudson/hudson-slave/workspace/Lucene-Solr-Tests-trunk-java7/solr/build/solr-core/test/J1/./org.apache.solr.cloud.SyncSliceTest-jetty3-1359816880269
[junit4:junit4]   2> 10819 T2697 oasc.CoreContainer$Initializer.initialize looking for solr.xml: /usr/home/hudson/hudson-slave/workspace/Lucene-Solr-Tests-trunk-java7/solr/build/solr-core/test/J1/./org.apache.solr.cloud.SyncSliceTest-jetty3-1359816880269/solr.xml
[junit4:junit4]   2> 10819 T2697 oasc.CoreContainer.<init> New CoreContainer 260397513
[junit4:junit4]   2> 10820 T2697 oasc.CoreContainer.load Loading CoreContainer using Solr Home: '/usr/home/hudson/hudson-slave/workspace/Lucene-Solr-Tests-trunk-java7/solr/build/solr-core/test/J1/./org.apache.solr.cloud.SyncSliceTest-jetty3-1359816880269/'
[junit4:junit4]   2> 10821 T2697 oasc.SolrResourceLoader.<init> new SolrResourceLoader for directory: '/usr/home/hudson/hudson-slave/workspace/Lucene-Solr-Tests-trunk-java7/solr/build/solr-core/test/J1/./org.apache.solr.cloud.SyncSliceTest-jetty3-1359816880269/'
[junit4:junit4]   2> 10878 T2697 oashc.HttpShardHandlerFactory.getParameter Setting socketTimeout to: 60000
[junit4:junit4]   2> 10878 T2697 oashc.HttpShardHandlerFactory.getParameter Setting urlScheme to: http://
[junit4:junit4]   2> 10879 T2697 oashc.HttpShardHandlerFactory.getParameter Setting connTimeout to: 15000
[junit4:junit4]   2> 10879 T2697 oashc.HttpShardHandlerFactory.getParameter Setting maxConnectionsPerHost to: 20
[junit4:junit4]   2> 10880 T2697 oashc.HttpShardHandlerFactory.getParameter Setting corePoolSize to: 0
[junit4:junit4]   2> 10880 T2697 oashc.HttpShardHandlerFactory.getParameter Setting maximumPoolSize to: 2147483647
[junit4:junit4]   2> 10881 T2697 oashc.HttpShardHandlerFactory.getParameter Setting maxThreadIdleTime to: 5
[junit4:junit4]   2> 10881 T2697 oashc.HttpShardHandlerFactory.getParameter Setting sizeOfQueue to: -1
[junit4:junit4]   2> 10882 T2697 oashc.HttpShardHandlerFactory.getParameter Setting fairnessPolicy to: false
[junit4:junit4]   2> 10882 T2697 oascsi.HttpClientUtil.createClient Creating new http client, config:maxConnectionsPerHost=20&maxConnections=10000&socketTimeout=60000&connTimeout=15000&retry=false
[junit4:junit4]   2> 10903 T2697 oasc.CoreContainer.load Registering Log Listener
[junit4:junit4]   2> 10924 T2697 oasc.CoreContainer.initZooKeeper Zookeeper client=127.0.0.1:21162/solr
[junit4:junit4]   2> 10924 T2697 oasc.ZkController.checkChrootPath zkHost includes chroot
[junit4:junit4]   2> 10925 T2697 oaz.ZooKeeper.<init> Initiating client connection, connectString=127.0.0.1:21162 sessionTimeout=60000 watcher=org.apache.solr.common.cloud.ConnectionManager@45a195c5
[junit4:junit4]   2> 10926 T2697 oascc.ConnectionManager.waitForConnected Waiting for client to connect to ZooKeeper
[junit4:junit4]   2> 10926 T2766 oaz.ClientCnxn$SendThread.logStartConnect Opening socket connection to server localhost/127.0.0.1:21162. Will not attempt to authenticate using SASL (access denied ("javax.security.auth.AuthPermission" "getLoginConfiguration"))
[junit4:junit4]   2> 10927 T2766 oaz.ClientCnxn$SendThread.primeConnection Socket connection established to localhost/127.0.0.1:21162, initiating session
[junit4:junit4]   2> 10927 T2699 oazs.NIOServerCnxnFactory.run Accepted socket connection from /140.211.11.196:43838
[junit4:junit4]   2> 10928 T2699 oazs.ZooKeeperServer.processConnectRequest Client attempting to establish new session at /140.211.11.196:43838
[junit4:junit4]   2> 10930 T2701 oazs.ZooKeeperServer.finishSessionInit Established session 0x13c9b66c7020009 with negotiated timeout 20000 for client /140.211.11.196:43838
[junit4:junit4]   2> 10930 T2766 oaz.ClientCnxn$SendThread.onConnected Session establishment complete on server localhost/127.0.0.1:21162, sessionid = 0x13c9b66c7020009, negotiated timeout = 20000
[junit4:junit4]   2> 10930 T2767 oascc.ConnectionManager.process Watcher org.apache.solr.common.cloud.ConnectionManager@45a195c5 name:ZooKeeperConnection Watcher:127.0.0.1:21162 got event WatchedEvent state:SyncConnected type:None path:null path:null type:None
[junit4:junit4]   2> 10931 T2697 oascc.ConnectionManager.waitForConnected Client is connected to ZooKeeper
[junit4:junit4]   2> 10932 T2702 oazs.PrepRequestProcessor.pRequest2Txn Processed session termination for sessionid: 0x13c9b66c7020009
[junit4:junit4]   2> 10944 T2767 oaz.ClientCnxn$EventThread.run EventThread shut down
[junit4:junit4]   2> 10944 T2699 oazs.NIOServerCnxn.closeSock Closed socket connection for client /140.211.11.196:43838 which had sessionid 0x13c9b66c7020009
[junit4:junit4]   2> 10944 T2697 oaz.ZooKeeper.close Session: 0x13c9b66c7020009 closed
[junit4:junit4]   2> 10945 T2697 oascsi.HttpClientUtil.createClient Creating new http client, config:maxConnections=500&maxConnectionsPerHost=16&socketTimeout=60000&connTimeout=15000
[junit4:junit4]   2> 10955 T2697 oaz.ZooKeeper.<init> Initiating client connection, connectString=127.0.0.1:21162/solr sessionTimeout=30000 watcher=org.apache.solr.common.cloud.ConnectionManager@794a038b
[junit4:junit4]   2> 10956 T2697 oascc.ConnectionManager.waitForConnected Waiting for client to connect to ZooKeeper
[junit4:junit4]   2> 10956 T2768 oaz.ClientCnxn$SendThread.logStartConnect Opening socket connection to server localhost/127.0.0.1:21162. Will not attempt to authenticate using SASL (access denied ("javax.security.auth.AuthPermission" "getLoginConfiguration"))
[junit4:junit4]   2> 10957 T2768 oaz.ClientCnxn$SendThread.primeConnection Socket connection established to localhost/127.0.0.1:21162, initiating session
[junit4:junit4]   2> 10957 T2699 oazs.NIOServerCnxnFactory.run Accepted socket connection from /140.211.11.196:65365
[junit4:junit4]   2> 10957 T2699 oazs.ZooKeeperServer.processConnectRequest Client attempting to establish new session at /140.211.11.196:65365
[junit4:junit4]   2> 10959 T2701 oazs.ZooKeeperServer.finishSessionInit Established session 0x13c9b66c702000a with negotiated timeout 20000 for client /140.211.11.196:65365
[junit4:junit4]   2> 10959 T2768 oaz.ClientCnxn$SendThread.onConnected Session establishment complete on server localhost/127.0.0.1:21162, sessionid = 0x13c9b66c702000a, negotiated timeout = 20000
[junit4:junit4]   2> 10959 T2769 oascc.ConnectionManager.process Watcher org.apache.solr.common.cloud.ConnectionManager@794a038b name:ZooKeeperConnection Watcher:127.0.0.1:21162/solr got event WatchedEvent state:SyncConnected type:None path:null path:null type:None
[junit4:junit4]   2> 10959 T2697 oascc.ConnectionManager.waitForConnected Client is connected to ZooKeeper
[junit4:junit4]   2> 10960 T2702 oazs.PrepRequestProcessor.pRequest Got user-level KeeperException when processing sessionid:0x13c9b66c702000a type:create cxid:0x1 zxid:0x7f txntype:-1 reqpath:n/a Error Path:/solr/overseer Error:KeeperErrorCode = NodeExists for /solr/overseer
[junit4:junit4]   2> 10962 T2702 oazs.PrepRequestProcessor.pRequest Got user-level KeeperException when processing sessionid:0x13c9b66c702000a type:create cxid:0x2 zxid:0x80 txntype:-1 reqpath:n/a Error Path:/solr/overseer Error:KeeperErrorCode = NodeExists for /solr/overseer
[junit4:junit4]   2> 10964 T2697 oasc.ZkController.createEphemeralLiveNode Register node as live in ZooKeeper:/live_nodes/127.0.0.1:14607_h_vtp%2Ft
[junit4:junit4]   2> 10964 T2702 oazs.PrepRequestProcessor.pRequest Got user-level KeeperException when processing sessionid:0x13c9b66c702000a type:delete cxid:0x4 zxid:0x81 txntype:-1 reqpath:n/a Error Path:/solr/live_nodes/127.0.0.1:14607_h_vtp%2Ft Error:KeeperErrorCode = NoNode for /solr/live_nodes/127.0.0.1:14607_h_vtp%2Ft
[junit4:junit4]   2> 10966 T2697 oascc.SolrZkClient.makePath makePath: /live_nodes/127.0.0.1:14607_h_vtp%2Ft
[junit4:junit4]   2> 10973 T2738 oascc.ZkStateReader$2.process A cluster state change: WatchedEvent state:SyncConnected type:NodeChildrenChanged path:/live_nodes, has occurred - updating... (live nodes size: 3)
[junit4:junit4]   2> 10973 T2719 oascc.ZkStateReader$2.process A cluster state change: WatchedEvent state:SyncConnected type:NodeChildrenChanged path:/live_nodes, has occurred - updating... (live nodes size: 3)
[junit4:junit4]   2> 10973 T2753 oascc.ZkStateReader$2.process A cluster state change: WatchedEvent state:SyncConnected type:NodeChildrenChanged path:/live_nodes, has occurred - updating... (live nodes size: 3)
[junit4:junit4]   2> 10974 T2725 oascc.ZkStateReader$3.process Updating live nodes... (4)
[junit4:junit4]   2> 10974 T2725 oascc.ZkStateReader$2.process A cluster state change: WatchedEvent state:SyncConnected type:NodeChildrenChanged path:/live_nodes, has occurred - updating... (live nodes size: 4)
[junit4:junit4]   2> 10975 T2738 oascc.ZkStateReader$3.process Updating live nodes... (4)
[junit4:junit4]   2> 10976 T2719 oascc.ZkStateReader$3.process Updating live nodes... (4)
[junit4:junit4]   2> 10976 T2753 oascc.ZkStateReader$3.process Updating live nodes... (4)
[junit4:junit4]   2> 10977 T2697 oascc.ZkStateReader.createClusterStateWatchersAndUpdate Updating cluster state from ZooKeeper... 
[junit4:junit4]   2> 10984 T2770 oasc.CoreContainer.create Creating SolrCore 'collection1' using instanceDir: /usr/home/hudson/hudson-slave/workspace/Lucene-Solr-Tests-trunk-java7/solr/build/solr-core/test/J1/./org.apache.solr.cloud.SyncSliceTest-jetty3-1359816880269/collection1
[junit4:junit4]   2> 10984 T2770 oasc.ZkController.createCollectionZkNode Check for collection zkNode:collection1
[junit4:junit4]   2> 10985 T2770 oasc.ZkController.createCollectionZkNode Collection zkNode exists
[junit4:junit4]   2> 10985 T2770 oasc.ZkController.readConfigName Load collection config from:/collections/collection1
[junit4:junit4]   2> 10987 T2770 oasc.SolrResourceLoader.<init> new SolrResourceLoader for directory: '/usr/home/hudson/hudson-slave/workspace/Lucene-Solr-Tests-trunk-java7/solr/build/solr-core/test/J1/./org.apache.solr.cloud.SyncSliceTest-jetty3-1359816880269/collection1/'
[junit4:junit4]   2> 10988 T2770 oasc.SolrResourceLoader.replaceClassLoader Adding 'file:/usr/home/hudson/hudson-slave/workspace/Lucene-Solr-Tests-trunk-java7/solr/build/solr-core/test/J1/org.apache.solr.cloud.SyncSliceTest-jetty3-1359816880269/collection1/lib/README' to classloader
[junit4:junit4]   2> 10988 T2770 oasc.SolrResourceLoader.replaceClassLoader Adding 'file:/usr/home/hudson/hudson-slave/workspace/Lucene-Solr-Tests-trunk-java7/solr/build/solr-core/test/J1/org.apache.solr.cloud.SyncSliceTest-jetty3-1359816880269/collection1/lib/classes/' to classloader
[junit4:junit4]   2> 11049 T2770 oasc.SolrConfig.<init> Using Lucene MatchVersion: LUCENE_50
[junit4:junit4]   2> 11126 T2770 oasc.SolrConfig.<init> Loaded SolrConfig: solrconfig.xml
[junit4:junit4]   2> 11227 T2770 oass.IndexSchema.readSchema Reading Solr Schema
[junit4:junit4]   2> 11233 T2770 oass.IndexSchema.readSchema Schema name=test
[junit4:junit4]   2> 11479 T2720 oascc.ZkStateReader.updateClusterState Updating cloud state from ZooKeeper... 
[junit4:junit4]   2> 11480 T2720 oasc.Overseer$ClusterStateUpdater.updateState Update state numShards=1 message={
[junit4:junit4]   2> 	  "operation":"state",
[junit4:junit4]   2> 	  "numShards":"1",
[junit4:junit4]   2> 	  "shard":"shard1",
[junit4:junit4]   2> 	  "roles":null,
[junit4:junit4]   2> 	  "state":"recovering",
[junit4:junit4]   2> 	  "core":"collection1",
[junit4:junit4]   2> 	  "collection":"collection1",
[junit4:junit4]   2> 	  "node_name":"127.0.0.1:14367_h_vtp%2Ft",
[junit4:junit4]   2> 	  "base_url":"http://127.0.0.1:14367/h_vtp/t"}
[junit4:junit4]   2> 11526 T2719 oascc.ZkStateReader$2.process A cluster state change: WatchedEvent state:SyncConnected type:NodeDataChanged path:/clusterstate.json, has occurred - updating... (live nodes size: 4)
[junit4:junit4]   2> 11526 T2769 oascc.ZkStateReader$2.process A cluster state change: WatchedEvent state:SyncConnected type:NodeDataChanged path:/clusterstate.json, has occurred - updating... (live nodes size: 4)
[junit4:junit4]   2> 11526 T2753 oascc.ZkStateReader$2.process A cluster state change: WatchedEvent state:SyncConnected type:NodeDataChanged path:/clusterstate.json, has occurred - updating... (live nodes size: 4)
[junit4:junit4]   2> 11526 T2725 oascc.ZkStateReader$2.process A cluster state change: WatchedEvent state:SyncConnected type:NodeDataChanged path:/clusterstate.json, has occurred - updating... (live nodes size: 4)
[junit4:junit4]   2> 11526 T2738 oascc.ZkStateReader$2.process A cluster state change: WatchedEvent state:SyncConnected type:NodeDataChanged path:/clusterstate.json, has occurred - updating... (live nodes size: 4)
[junit4:junit4]   2> 11892 T2770 oass.OpenExchangeRatesOrgProvider.init Initialized with rates=open-exchange-rates.json, refreshInterval=1440.
[junit4:junit4]   2> 11903 T2770 oass.IndexSchema.readSchema default search field in schema is text
[junit4:junit4]   2> 11907 T2770 oass.IndexSchema.readSchema unique key field: id
[junit4:junit4]   2> 11921 T2770 oass.FileExchangeRateProvider.reload Reloading exchange rates from file currency.xml
[junit4:junit4]   2> 11925 T2770 oass.FileExchangeRateProvider.reload Reloading exchange rates from file currency.xml
[junit4:junit4]   2> 11930 T2770 oass.OpenExchangeRatesOrgProvider.reload Reloading exchange rates from open-exchange-rates.json
[junit4:junit4]   2> 11931 T2770 oass.OpenExchangeRatesOrgProvider.reload Reloading exchange rates from open-exchange-rates.json
[junit4:junit4]   2> 11932 T2770 oasc.SolrCore.<init> [collection1] Opening new SolrCore at /usr/home/hudson/hudson-slave/workspace/Lucene-Solr-Tests-trunk-java7/solr/build/solr-core/test/J1/./org.apache.solr.cloud.SyncSliceTest-jetty3-1359816880269/collection1/, dataDir=./org.apache.solr.cloud.SyncSliceTest-1359816869627/jetty3/
[junit4:junit4]   2> 11932 T2770 oasc.JmxMonitoredMap.<init> JMX monitoring is enabled. Adding Solr mbeans to JMX Server: com.sun.jmx.mbeanserver.JmxMBeanServer@12bef803
[junit4:junit4]   2> 11933 T2770 oasc.SolrCore.initDirectoryFactory solr.NRTCachingDirectoryFactory
[junit4:junit4]   2> 11934 T2770 oasc.CachingDirectoryFactory.get return new directory for /usr/home/hudson/hudson-slave/workspace/Lucene-Solr-Tests-trunk-java7/solr/build/solr-core/test/J1/./org.apache.solr.cloud.SyncSliceTest-1359816869627/jetty3 forceNew:false
[junit4:junit4]   2> 11934 T2770 oasc.CachingDirectoryFactory.close Releasing directory:/usr/home/hudson/hudson-slave/workspace/Lucene-Solr-Tests-trunk-java7/solr/build/solr-core/test/J1/./org.apache.solr.cloud.SyncSliceTest-1359816869627/jetty3
[junit4:junit4]   2> 11935 T2770 oasc.SolrCore.getNewIndexDir New index directory detected: old=null new=./org.apache.solr.cloud.SyncSliceTest-1359816869627/jetty3/index/
[junit4:junit4]   2> 11935 T2770 oasc.SolrCore.initIndex WARNING [collection1] Solr index directory './org.apache.solr.cloud.SyncSliceTest-1359816869627/jetty3/index' doesn't exist. Creating new index...
[junit4:junit4]   2> 11936 T2770 oasc.CachingDirectoryFactory.get return new directory for /usr/home/hudson/hudson-slave/workspace/Lucene-Solr-Tests-trunk-java7/solr/build/solr-core/test/J1/./org.apache.solr.cloud.SyncSliceTest-1359816869627/jetty3/index forceNew:false
[junit4:junit4]   2> 11942 T2770 oasc.SolrDeletionPolicy.onCommit SolrDeletionPolicy.onCommit: commits:num=1
[junit4:junit4]   2> 		commit{dir=RateLimitedDirectoryWrapper(NRTCachingDirectory(org.apache.lucene.store.NIOFSDirectory@/usr/home/hudson/hudson-slave/workspace/Lucene-Solr-Tests-trunk-java7/solr/build/solr-core/test/J1/org.apache.solr.cloud.SyncSliceTest-1359816869627/jetty3/index lockFactory=org.apache.lucene.store.NativeFSLockFactory@710bc4a7; maxCacheMB=48.0 maxMergeSizeMB=4.0)),segFN=segments_1,generation=1,filenames=[segments_1]
[junit4:junit4]   2> 11942 T2770 oasc.SolrDeletionPolicy.updateCommits newest commit = 1[segments_1]
[junit4:junit4]   2> 11943 T2770 oasc.CachingDirectoryFactory.close Releasing directory:/usr/home/hudson/hudson-slave/workspace/Lucene-Solr-Tests-trunk-java7/solr/build/solr-core/test/J1/./org.apache.solr.cloud.SyncSliceTest-1359816869627/jetty3/index
[junit4:junit4]   2> 11944 T2770 oasc.SolrCore.initWriters created xml: solr.XMLResponseWriter
[junit4:junit4]   2> 11946 T2770 oasup.UpdateRequestProcessorChain.init inserting DistributedUpdateProcessorFactory into updateRequestProcessorChain "dedupe"
[junit4:junit4]   2> 11946 T2770 oasup.UpdateRequestProcessorChain.init inserting DistributedUpdateProcessorFactory into updateRequestProcessorChain "dedupe-allfields"
[junit4:junit4]   2> 11946 T2770 oasup.UpdateRequestProcessorChain.init inserting DistributedUpdateProcessorFactory into updateRequestProcessorChain "stored_sig"
[junit4:junit4]   2> 11947 T2770 oasup.UpdateRequestProcessorChain.init inserting DistributedUpdateProcessorFactory into updateRequestProcessorChain "uniq-fields"
[junit4:junit4]   2> 11947 T2770 oasup.UpdateRequestProcessorChain.init inserting DistributedUpdateProcessorFactory into updateRequestProcessorChain "distrib-dup-test-chain-implicit"
[junit4:junit4]   2> 11948 T2770 oasc.RequestHandlers.initHandlersFromConfig adding lazy requestHandler: solr.ReplicationHandler
[junit4:junit4]   2> 11948 T2770 oasc.RequestHandlers.initHandlersFromConfig created /replication: solr.ReplicationHandler
[junit4:junit4]   2> 11948 T2770 oasc.RequestHandlers.initHandlersFromConfig created standard: solr.StandardRequestHandler
[junit4:junit4]   2> 11949 T2770 oasc.RequestHandlers.initHandlersFromConfig created /get: solr.RealTimeGetHandler
[junit4:junit4]   2> 11950 T2770 oasc.RequestHandlers.initHandlersFromConfig created dismax: solr.SearchHandler
[junit4:junit4]   2> 11950 T2770 oasc.RequestHandlers.initHandlersFromConfig created mock: org.apache.solr.core.MockQuerySenderListenerReqHandler
[junit4:junit4]   2> 11951 T2770 oasc.RequestHandlers.initHandlersFromConfig created /admin/: org.apache.solr.handler.admin.AdminHandlers
[junit4:junit4]   2> 11951 T2770 oasc.RequestHandlers.initHandlersFromConfig created defaults: solr.StandardRequestHandler
[junit4:junit4]   2> 11951 T2770 oasc.RequestHandlers.initHandlersFromConfig adding lazy requestHandler: solr.StandardRequestHandler
[junit4:junit4]   2> 11952 T2770 oasc.RequestHandlers.initHandlersFromConfig created lazy: solr.StandardRequestHandler
[junit4:junit4]   2> 11952 T2770 oasc.RequestHandlers.initHandlersFromConfig created /update: solr.UpdateRequestHandler
[junit4:junit4]   2> 11953 T2770 oasc.RequestHandlers.initHandlersFromConfig created /terms: org.apache.solr.handler.component.SearchHandler
[junit4:junit4]   2> 11953 T2770 oasc.RequestHandlers.initHandlersFromConfig created spellCheckCompRH: org.apache.solr.handler.component.SearchHandler
[junit4:junit4]   2> 11954 T2770 oasc.RequestHandlers.initHandlersFromConfig created spellCheckCompRH_Direct: org.apache.solr.handler.component.SearchHandler
[junit4:junit4]   2> 11954 T2770 oasc.RequestHandlers.initHandlersFromConfig created spellCheckWithWordbreak: org.apache.solr.handler.component.SearchHandler
[junit4:junit4]   2> 11955 T2770 oasc.RequestHandlers.initHandlersFromConfig created spellCheckWithWordbreak_Direct: org.apache.solr.handler.component.SearchHandler
[junit4:junit4]   2> 11955 T2770 oasc.RequestHandlers.initHandlersFromConfig created spellCheckCompRH1: org.apache.solr.handler.component.SearchHandler
[junit4:junit4]   2> 11956 T2770 oasc.RequestHandlers.initHandlersFromConfig created mltrh: org.apache.solr.handler.component.SearchHandler
[junit4:junit4]   2> 11956 T2770 oasc.RequestHandlers.initHandlersFromConfig created tvrh: org.apache.solr.handler.component.SearchHandler
[junit4:junit4]   2> 11957 T2770 oasc.RequestHandlers.initHandlersFromConfig created /mlt: solr.MoreLikeThisHandler
[junit4:junit4]   2> 11957 T2770 oasc.RequestHandlers.initHandlersFromConfig created /debug/dump: solr.DumpRequestHandler
[junit4:junit4]   2> 11969 T2770 oashl.XMLLoader.init xsltCacheLifetimeSeconds=60
[junit4:junit4]   2> 11973 T2770 oasc.SolrCore.initDeprecatedSupport WARNING solrconfig.xml uses deprecated <admin/gettableFiles>, Please update your config to use the ShowFileRequestHandler.
[junit4:junit4]   2> 11974 T2770 oasc.SolrCore.initDeprecatedSupport WARNING adding ShowFileRequestHandler with hidden files: [SCHEMA.XML, OLD_SYNONYMS.TXT, STOPWORDS.TXT, PROTWORDS.TXT, OPEN-EXCHANGE-RATES.JSON, SYNONYMS.TXT, CURRENCY.XML, MAPPING-ISOLATIN1ACCENT.TXT]
[junit4:junit4]   2> 11977 T2770 oasc.CachingDirectoryFactory.close Releasing directory:/usr/home/hudson/hudson-slave/workspace/Lucene-Solr-Tests-trunk-java7/solr/build/solr-core/test/J1/./org.apache.solr.cloud.SyncSliceTest-1359816869627/jetty3
[junit4:junit4]   2> 11978 T2770 oass.SolrIndexSearcher.<init> Opening Searcher@39ebca1c main
[junit4:junit4]   2> 11979 T2770 oasu.CommitTracker.<init> Hard AutoCommit: disabled
[junit4:junit4]   2> 11980 T2770 oasu.CommitTracker.<init> Soft AutoCommit: disabled
[junit4:junit4]   2> 11980 T2770 oashc.SpellCheckComponent.inform Initializing spell checkers
[junit4:junit4]   2> 11987 T2770 oass.DirectSolrSpellChecker.init init: {name=direct,classname=DirectSolrSpellChecker,field=lowerfilt,minQueryLength=3}
[junit4:junit4]   2> 12046 T2771 oasc.SolrCore.registerSearcher [collection1] Registered new searcher Searcher@39ebca1c main{StandardDirectoryReader(segments_1:1)}
[junit4:junit4]   2> 12052 T2770 oasc.ZkController.publish publishing core=collection1 state=down
[junit4:junit4]   2> 12052 T2770 oasc.ZkController.publish numShards not found on descriptor - reading it from system property
[junit4:junit4]   2> 13032 T2720 oascc.ZkStateReader.updateClusterState Updating cloud state from ZooKeeper... 
[junit4:junit4]   2> 13033 T2720 oasc.Overseer$ClusterStateUpdater.updateState Update state numShards=1 message={
[junit4:junit4]   2> 	  "operation":"state",
[junit4:junit4]   2> 	  "numShards":"1",
[junit4:junit4]   2> 	  "shard":null,
[junit4:junit4]   2> 	  "roles":null,
[junit4:junit4]   2> 	  "state":"down",
[junit4:junit4]   2> 	  "core":"collection1",
[junit4:junit4]   2> 	  "collection":"collection1",
[junit4:junit4]   2> 	  "node_name":"127.0.0.1:14607_h_vtp%2Ft",
[junit4:junit4]   2> 	  "base_url":"http://127.0.0.1:14607/h_vtp/t"}
[junit4:junit4]   2> 13034 T2720 oasc.Overseer$ClusterStateUpdater.updateState Collection already exists with numShards=1
[junit4:junit4]   2> 13034 T2720 oasc.Overseer$ClusterStateUpdater.updateState Assigning new node to shard shard=shard1
[junit4:junit4]   2> 13047 T2719 oascc.ZkStateReader$2.process A cluster state change: WatchedEvent state:SyncConnected type:NodeDataChanged path:/clusterstate.json, has occurred - updating... (live nodes size: 4)
[junit4:junit4]   2> 13047 T2769 oascc.ZkStateReader$2.process A cluster state change: WatchedEvent state:SyncConnected type:NodeDataChanged path:/clusterstate.json, has occurred - updating... (live nodes size: 4)
[junit4:junit4]   2> 13047 T2738 oascc.ZkStateReader$2.process A cluster state change: WatchedEvent state:SyncConnected type:NodeDataChanged path:/clusterstate.json, has occurred - updating... (live nodes size: 4)
[junit4:junit4]   2> 13047 T2725 oascc.ZkStateReader$2.process A cluster state change: WatchedEvent state:SyncConnected type:NodeDataChanged path:/clusterstate.json, has occurred - updating... (live nodes size: 4)
[junit4:junit4]   2> 13047 T2753 oascc.ZkStateReader$2.process A cluster state change: WatchedEvent state:SyncConnected type:NodeDataChanged path:/clusterstate.json, has occurred - updating... (live nodes size: 4)
[junit4:junit4]   2> 13054 T2770 oasc.CoreContainer.registerCore registering core: collection1
[junit4:junit4]   2> 13054 T2770 oasc.ZkController.register Register replica - core:collection1 address:http://127.0.0.1:14607/h_vtp/t collection:collection1 shard:shard1
[junit4:junit4]   2> 13057 T2770 oasc.ZkController.register We are http://127.0.0.1:14607/h_vtp/t/collection1/ and leader is http://127.0.0.1:30878/h_vtp/t/collection1/
[junit4:junit4]   2> 13057 T2770 oasc.ZkController.register No LogReplay needed for core=collection1 baseURL=http://127.0.0.1:14607/h_vtp/t
[junit4:junit4]   2> 13058 T2770 oasc.ZkController.checkRecovery Core needs to recover:collection1
[junit4:junit4]   2> 13058 T2770 oasu.DefaultSolrCoreState.doRecovery Running recovery - first canceling any ongoing recovery
[junit4:junit4]   2> ASYNC  NEW_CORE C214 name=collection1 org.apache.solr.core.SolrCore@5d4854e8 url=http://127.0.0.1:14607/h_vtp/t/collection1 node=127.0.0.1:14607_h_vtp%2Ft C214_STATE=coll:collection1 core:collection1 props:{shard=null, roles=null, state=down, core=collection1, collection=collection1, node_name=127.0.0.1:14607_h_vtp%2Ft, base_url=http://127.0.0.1:14607/h_vtp/t}
[junit4:junit4]   2> 13058 T2772 C214 P14607 oasc.RecoveryStrategy.run Starting recovery process.  core=collection1 recoveringAfterStartup=true
[junit4:junit4]   2> 13059 T2770 oascc.ZkStateReader.updateClusterState Updating cloud state from ZooKeeper... 
[junit4:junit4]   2> 13060 T2772 C214 P14607 oasc.RecoveryStrategy.doRecovery ###### startupVersions=[]
[junit4:junit4]   2> 13060 T2772 C214 P14607 oasc.ZkController.publish publishing core=collection1 state=recovering
[junit4:junit4]   2> 13060 T2772 C214 P14607 oasc.ZkController.publish numShards not found on descriptor - reading it from system property
[junit4:junit4]   2> 13061 T2697 oass.SolrDispatchFilter.init user.dir=/usr/home/hudson/hudson-slave/workspace/Lucene-Solr-Tests-trunk-java7/solr/build/solr-core/test/J1
[junit4:junit4]   2> 13061 T2697 oass.SolrDispatchFilter.init SolrDispatchFilter.init() done
[junit4:junit4]   2> 13062 T2772 C214 P14607 oascsi.HttpClientUtil.createClient Creating new http client, config:maxConnections=128&maxConnectionsPerHost=32&followRedirects=false
[junit4:junit4]   2> 13062 T2697 oascsi.HttpClientUtil.createClient Creating new http client, config:maxConnections=128&maxConnectionsPerHost=32&followRedirects=false
[junit4:junit4]   2> 13267 T2697 oejs.Server.doStart jetty-8.1.8.v20121106
[junit4:junit4]   2> 13269 T2697 oejs.AbstractConnector.doStart Started SocketConnector@127.0.0.1:26299
[junit4:junit4]   2> 13270 T2697 oass.SolrDispatchFilter.init SolrDispatchFilter.init()
[junit4:junit4]   2> 13271 T2697 oasc.SolrResourceLoader.locateSolrHome JNDI not configured for solr (NoInitialContextEx)
[junit4:junit4]   2> 13271 T2697 oasc.SolrResourceLoader.locateSolrHome using system property solr.solr.home: /usr/home/hudson/hudson-slave/workspace/Lucene-Solr-Tests-trunk-java7/solr/build/solr-core/test/J1/./org.apache.solr.cloud.SyncSliceTest-jetty4-1359816882703
[junit4:junit4]   2> 13272 T2697 oasc.CoreContainer$Initializer.initialize looking for solr.xml: /usr/home/hudson/hudson-slave/workspace/Lucene-Solr-Tests-trunk-java7/solr/build/solr-core/test/J1/./org.apache.solr.cloud.SyncSliceTest-jetty4-1359816882703/solr.xml
[junit4:junit4]   2> 13272 T2697 oasc.CoreContainer.<init> New CoreContainer 1331693958
[junit4:junit4]   2> 13273 T2697 oasc.CoreContainer.load Loading CoreContainer using Solr Home: '/usr/home/hudson/hudson-slave/workspace/Lucene-Solr-Tests-trunk-java7/solr/build/solr-core/test/J1/./org.apache.solr.cloud.SyncSliceTest-jetty4-1359816882703/'
[junit4:junit4]   2> 13274 T2697 oasc.SolrResourceLoader.<init> new SolrResourceLoader for directory: '/usr/home/hudson/hudson-slave/workspace/Lucene-Solr-Tests-trunk-java7/solr/build/solr-core/test/J1/./org.apache.solr.cloud.SyncSliceTest-jetty4-1359816882703/'
[junit4:junit4]   2> 13330 T2697 oashc.HttpShardHandlerFactory.getParameter Setting socketTimeout to: 60000
[junit4:junit4]   2> 13331 T2697 oashc.HttpShardHandlerFactory.getParameter Setting urlScheme to: http://
[junit4:junit4]   2> 13331 T2697 oashc.HttpShardHandlerFactory.getParameter Setting connTimeout to: 15000
[junit4:junit4]   2> 13332 T2697 oashc.HttpShardHandlerFactory.getParameter Setting maxConnectionsPerHost to: 20
[junit4:junit4]   2> 13332 T2697 oashc.HttpShardHandlerFactory.getParameter Setting corePoolSize to: 0
[junit4:junit4]   2> 13333 T2697 oashc.HttpShardHandlerFactory.getParameter Setting maximumPoolSize to: 2147483647
[junit4:junit4]   2> 13333 T2697 oashc.HttpShardHandlerFactory.getParameter Setting maxThreadIdleTime to: 5
[junit4:junit4]   2> 13334 T2697 oashc.HttpShardHandlerFactory.getParameter Setting sizeOfQueue to: -1
[junit4:junit4]   2> 13334 T2697 oashc.HttpShardHandlerFactory.getParameter Setting fairnessPolicy to: false
[junit4:junit4]   2> 13335 T2697 oascsi.HttpClientUtil.createClient Creating new http client, config:maxConnectionsPerHost=20&maxConnections=10000&socketTimeout=60000&connTimeout=15000&retry=false
[junit4:junit4]   2> 13355 T2697 oasc.CoreContainer.load Registering Log Listener
[junit4:junit4]   2> 13375 T2697 oasc.CoreContainer.initZooKeeper Zookeeper client=127.0.0.1:21162/solr
[junit4:junit4]   2> 13376 T2697 oasc.ZkController.checkChrootPath zkHost includes chroot
[junit4:junit4]   2> 13377 T2697 oaz.ZooKeeper.<init> Initiating client connection, connectString=127.0.0.1:21162 sessionTimeout=60000 watcher=org.apache.solr.common.cloud.ConnectionManager@41a7bec1
[junit4:junit4]   2> 13378 T2697 oascc.ConnectionManager.waitForConnected Waiting for client to connect to ZooKeeper
[junit4:junit4]   2> 13378 T2782 oaz.ClientCnxn$SendThread.logStartConnect Opening socket connection to server localhost/127.0.0.1:21162. Will not attempt to authenticate using SASL (access denied ("javax.security.auth.AuthPermission" "getLoginConfiguration"))
[junit4:junit4]   2> 13379 T2782 oaz.ClientCnxn$SendThread.primeConnection Socket connection established to localhost/127.0.0.1:21162, initiating session
[junit4:junit4]   2> 13379 T2699 oazs.NIOServerCnxnFactory.run Accepted socket connection from /140.211.11.196:33281
[junit4:junit4]   2> 13380 T2699 oazs.ZooKeeperServer.processConnectRequest Client attempting to establish new session at /140.211.11.196:33281
[junit4:junit4]   2> 13382 T2701 oazs.ZooKeeperServer.finishSessionInit Established session 0x13c9b66c702000b with negotiated timeout 20000 for client /140.211.11.196:33281
[junit4:junit4]   2> 13382 T2782 oaz.ClientCnxn$SendThread.onConnected Session establishment complete on server localhost/127.0.0.1:21162, sessionid = 0x13c9b66c702000b, negotiated timeout = 20000
[junit4:junit4]   2> 13382 T2783 oascc.ConnectionManager.process Watcher org.apache.solr.common.cloud.ConnectionManager@41a7bec1 name:ZooKeeperConnection Watcher:127.0.0.1:21162 got event WatchedEvent state:SyncConnected type:None path:null path:null type:None
[junit4:junit4]   2> 13382 T2697 oascc.ConnectionManager.waitForConnected Client is connected to ZooKeeper
[junit4:junit4]   2> 13385 T2702 oazs.PrepRequestProcessor.pRequest2Txn Processed session termination for sessionid: 0x13c9b66c702000b
[junit4:junit4]   2> 13394 T2783 oaz.ClientCnxn$EventThread.run EventThread shut down
[junit4:junit4]   2> 13394 T2699 oazs.NIOServerCnxn.closeSock Closed socket connection for client /140.211.11.196:33281 which had sessionid 0x13c9b66c702000b
[junit4:junit4]   2> 13394 T2697 oaz.ZooKeeper.close Session: 0x13c9b66c702000b closed
[junit4:junit4]   2> 13395 T2697 oascsi.HttpClientUtil.createClient Creating new http client, config:maxConnections=500&maxConnectionsPerHost=16&socketTimeout=60000&connTimeout=15000
[junit4:junit4]   2> 13404 T2697 oaz.ZooKeeper.<init> Initiating client connection, connectString=127.0.0.1:21162/solr sessionTimeout=30000 watcher=org.apache.solr.common.cloud.ConnectionManager@25d56f62
[junit4:junit4]   2> 13406 T2697 oascc.ConnectionManager.waitForConnected Waiting for client to connect to ZooKeeper
[junit4:junit4]   2> 13406 T2784 oaz.ClientCnxn$SendThread.logStartConnect Opening socket connection to server localhost/127.0.0.1:21162. Will not attempt to authenticate using SASL (access denied ("javax.security.auth.AuthPermission" "getLoginConfiguration"))
[junit4:junit4]   2> 13406 T2784 oaz.ClientCnxn$SendThread.primeConnection Socket connection established to localhost/127.0.0.1:21162, initiating session
[junit4:junit4]   2> 13407 T2699 oazs.NIOServerCnxnFactory.run Accepted socket connection from /140.211.11.196:13832
[junit4:junit4]   2> 13407 T2699 oazs.ZooKeeperServer.processConnectRequest Client attempting to establish new session at /140.211.11.196:13832
[junit4:junit4]   2> 13408 T2701 oazs.ZooKeeperServer.finishSessionInit Established session 0x13c9b66c702000c with negotiated timeout 20000 for client /140.211.11.196:13832
[junit4:junit4]   2> 13409 T2784 oaz.ClientCnxn$SendThread.onConnected Session establishment complete on server localhost/127.0.0.1:21162, sessionid = 0x13c9b66c702000c, negotiated timeout = 20000
[junit4:junit4]   2> 13409 T2785 oascc.ConnectionManager.process Watcher org.apache.solr.common.cloud.ConnectionManager@25d56f62 name:ZooKeeperConnection Watcher:127.0.0.1:21162/solr got event WatchedEvent state:SyncConnected type:None path:null path:null type:None
[junit4:junit4]   2> 13409 T2697 oascc.ConnectionManager.waitForConnected Client is connected to ZooKeeper
[junit4:junit4]   2> 13410 T2702 oazs.PrepRequestProcessor.pRequest Got user-level KeeperException when processing sessionid:0x13c9b66c702000c type:create cxid:0x1 zxid:0x92 txntype:-1 reqpath:n/a Error Path:/solr/overseer Error:KeeperErrorCode = NodeExists for /solr/overseer
[junit4:junit4]   2> 13412 T2702 oazs.PrepRequestProcessor.pRequest Got user-level KeeperException when processing sessionid:0x13c9b66c702000c type:create cxid:0x2 zxid:0x93 txntype:-1 reqpath:n/a Error Path:/solr/overseer Error:KeeperErrorCode = NodeExists for /solr/overseer
[junit4:junit4]   2> 13422 T2697 oasc.ZkController.createEphemeralLiveNode Register node as live in ZooKeeper:/live_nodes/127.0.0.1:26299_h_vtp%2Ft
[junit4:junit4]   2> 13423 T2702 oazs.PrepRequestProcessor.pRequest Got user-level KeeperException when processing sessionid:0x13c9b66c702000c type:delete cxid:0x4 zxid:0x94 txntype:-1 reqpath:n/a Error Path:/solr/live_nodes/127.0.0.1:26299_h_vtp%2Ft Error:KeeperErrorCode = NoNode for /solr/live_nodes/127.0.0.1:26299_h_vtp%2Ft
[junit4:junit4]   2> 13424 T2697 oascc.SolrZkClient.makePath makePath: /live_nodes/127.0.0.1:26299_h_vtp%2Ft
[junit4:junit4]   2> 13431 T2719 oascc.ZkStateReader$2.process A cluster state change: WatchedEvent state:SyncConnected type:NodeChildrenChanged path:/live_nodes, has occurred - updating... (live nodes size: 4)
[junit4:junit4]   2> 13431 T2738 oascc.ZkStateReader$2.process A cluster state change: WatchedEvent state:SyncConnected type:NodeChildrenChanged path:/live_nodes, has occurred - updating... (live nodes size: 4)
[junit4:junit4]   2> 13431 T2769 oascc.ZkStateReader$2.process A cluster state change: WatchedEvent state:SyncConnected type:NodeChildrenChanged path:/live_nodes, has occurred - updating... (live nodes size: 4)
[junit4:junit4]   2> 13431 T2753 oascc.ZkStateReader$2.process A cluster state change: WatchedEvent state:SyncConnected type:NodeChildrenChanged path:/live_nodes, has occurred - updating... (live nodes size: 4)
[junit4:junit4]   2> 13431 T2725 oascc.ZkStateReader$3.process Updating live nodes... (5)
[junit4:junit4]   2> 13431 T2725 oascc.ZkStateReader$2.process A cluster state change: WatchedEvent state:SyncConnected type:NodeChildrenChanged path:/live_nodes, has occurred - updating... (live nodes size: 5)
[junit4:junit4]   2> 13433 T2719 oascc.ZkStateReader$3.process Updating live nodes... (5)
[junit4:junit4]   2> 13433 T2753 oascc.ZkStateReader$3.process Updating live nodes... (5)
[junit4:junit4]   2> 13434 T2769 oascc.ZkStateReader$3.process Updating live nodes... (5)
[junit4:junit4]   2> 13434 T2738 oascc.ZkStateReader$3.process Updating live nodes... (5)
[junit4:junit4]   2> 13435 T2697 oascc.ZkStateReader.createClusterStateWatchersAndUpdate Updating cluster state from ZooKeeper... 
[junit4:junit4]   2> 13442 T2786 oasc.CoreContainer.create Creating SolrCore 'collection1' using instanceDir: /usr/home/hudson/hudson-slave/workspace/Lucene-Solr-Tests-trunk-java7/solr/build/solr-core/test/J1/./org.apache.solr.cloud.SyncSliceTest-jetty4-1359816882703/collection1
[junit4:junit4]   2> 13442 T2786 oasc.ZkController.createCollectionZkNode Check for collection zkNode:collection1
[junit4:junit4]   2> 13443 T2786 oasc.ZkController.createCollectionZkNode Collection zkNode exists
[junit4:junit4]   2> 13443 T2786 oasc.ZkController.readConfigName Load collection config from:/collections/collection1
[junit4:junit4]   2> 13444 T2786 oasc.SolrResourceLoader.<init> new SolrResourceLoader for directory: '/usr/home/hudson/hudson-slave/workspace/Lucene-Solr-Tests-trunk-java7/solr/build/solr-core/test/J1/./org.apache.solr.cloud.SyncSliceTest-jetty4-1359816882703/collection1/'
[junit4:junit4]   2> 13446 T2786 oasc.SolrResourceLoader.replaceClassLoader Adding 'file:/usr/home/hudson/hudson-slave/workspace/Lucene-Solr-Tests-trunk-java7/solr/build/solr-core/test/J1/org.apache.solr.cloud.SyncSliceTest-jetty4-1359816882703/collection1/lib/classes/' to classloader
[junit4:junit4]   2> 13446 T2786 oasc.SolrResourceLoader.replaceClassLoader Adding 'file:/usr/home/hudson/hudson-slave/workspace/Lucene-Solr-Tests-trunk-java7/solr/build/solr-core/test/J1/org.apache.solr.cloud.SyncSliceTest-jetty4-1359816882703/collection1/lib/README' to classloader
[junit4:junit4]   2> 13501 T2786 oasc.SolrConfig.<init> Using Lucene MatchVersion: LUCENE_50
[junit4:junit4]   2> 13574 T2786 oasc.SolrConfig.<init> Loaded SolrConfig: solrconfig.xml
[junit4:junit4]   2>  C213_STATE=coll:collection1 core:collection1 props:{shard=shard1, roles=null, state=recovering, core=collection1, collection=collection1, node_name=127.0.0.1:14367_h_vtp%2Ft, base_url=http://127.0.0.1:14367/h_vtp/t}
[junit4:junit4]   2> 13652 T2756 C213 P14367 oasc.RecoveryStrategy.doRecovery Attempting to PeerSync from http://127.0.0.1:30878/h_vtp/t/collection1/ core=collection1 - recoveringAfterStartup=true
[junit4:junit4]   2> 13652 T2756 C213 P14367 oasu.PeerSync.sync PeerSync: core=collection1 url=http://127.0.0.1:14367/h_vtp/t START replicas=[http://127.0.0.1:30878/h_vtp/t/collection1/] nUpdates=100
[junit4:junit4]   2> 13652 T2756 C213 P14367 oasu.PeerSync.sync WARNING no frame of reference to tell of we've missed updates
[junit4:junit4]   2> 13653 T2756 C213 P14367 oasc.RecoveryStrategy.doRecovery PeerSync Recovery was not successful - trying replication. core=collection1
[junit4:junit4]   2> 13653 T2756 C213 P14367 oasc.RecoveryStrategy.doRecovery Starting Replication Recovery. core=collection1
[junit4:junit4]   2> 13653 T2756 C213 P14367 oasc.RecoveryStrategy.doRecovery Begin buffering updates. core=collection1
[junit4:junit4]   2> 13653 T2756 C213 P14367 oasu.UpdateLog.bufferUpdates Starting to buffer updates. FSUpdateLog{state=ACTIVE, tlog=null}
[junit4:junit4]   2> 13653 T2756 C213 P14367 oasc.RecoveryStrategy.replicate Attempting to replicate from http://127.0.0.1:30878/h_vtp/t/collection1/. core=collection1
[junit4:junit4]   2> 13654 T2756 C213 P14367 oascsi.HttpClientUtil.createClient Creating new http client, config:maxConnections=128&maxConnectionsPerHost=32&followRedirects=false
[junit4:junit4]   2> ASYNC  NEW_CORE C215 name=collection1 org.apache.solr.core.SolrCore@1d080c9a url=http://127.0.0.1:30878/h_vtp/t/collection1 node=127.0.0.1:30878_h_vtp%2Ft C215_STATE=coll:collection1 core:collection1 props:{shard=shard1, roles=null, state=active, core=collection1, collection=collection1, node_name=127.0.0.1:30878_h_vtp%2Ft, base_url=http://127.0.0.1:30878/h_vtp/t, leader=true}
[junit4:junit4]   2> 13661 T2730 C215 P30878 REQ /get {getVersions=100&distrib=false&wt=javabin&qt=/get&version=2} status=0 QTime=0 
[junit4:junit4]   2> 13665 T2731 C215 P30878 oasu.DirectUpdateHandler2.commit start commit{,optimize=false,openSearcher=false,waitSearcher=true,expungeDeletes=false,softCommit=false}
[junit4:junit4]   2> 13666 T2731 C215 P30878 oasc.CachingDirectoryFactory.close Releasing directory:/usr/home/hudson/hudson-slave/workspace/Lucene-Solr-Tests-trunk-java7/solr/build/solr-core/test/J1/./org.apache.solr.cloud.SyncSliceTest-1359816869627/jetty1
[junit4:junit4]   2> 13670 T2731 C215 P30878 oasc.SolrDeletionPolicy.onInit SolrDeletionPolicy.onInit: commits:num=1
[junit4:junit4]   2> 		commit{dir=RateLimitedDirectoryWrapper(NRTCachingDirectory(org.apache.lucene.store.NIOFSDirectory@/usr/home/hudson/hudson-slave/workspace/Lucene-Solr-Tests-trunk-java7/solr/build/solr-core/test/J1/org.apache.solr.cloud.SyncSliceTest-1359816869627/jetty1/index lockFactory=org.apache.lucene.store.NativeFSLockFactory@5227b13d; maxCacheMB=48.0 maxMergeSizeMB=4.0)),segFN=segments_1,generation=1,filenames=[segments_1]
[junit4:junit4]   2> 13671 T2731 C215 P30878 oasc.SolrDeletionPolicy.updateCommits newest commit = 1[segments_1]
[junit4:junit4]   2> 13675 T2786 oass.IndexSchema.readSchema Reading Solr Schema
[junit4:junit4]   2> 13691 T2786 oass.IndexSchema.readSchema Schema name=test
[junit4:junit4]   2> 13703 T2731 C215 P30878 oasc.SolrDeletionPolicy.onCommit SolrDeletionPolicy.onCommit: commits:num=2
[junit4:junit4]   2> 		commit{dir=RateLimitedDirectoryWrapper(NRTCachingDirectory(org.apache.lucene.store.NIOFSDirectory@/usr/home/hudson/hudson-slave/workspace/Lucene-Solr-Tests-trunk-java7/solr/build/solr-core/test/J1/org.apache.solr.cloud.SyncSliceTest-1359816869627/jetty1/index lockFactory=org.apache.lucene.store.NativeFSLockFactory@5227b13d; maxCacheMB=48.0 maxMergeSizeMB=4.0)),segFN=segments_1,generation=1,filenames=[segments_1]
[junit4:junit4]   2> 		commit{dir=RateLimitedDirectoryWrapper(NRTCachingDirectory(org.apache.lucene.store.NIOFSDirectory@/usr/home/hudson/hudson-slave/workspace/Lucene-Solr-Tests-trunk-java7/solr/build/solr-core/test/J1/org.apache.solr.cloud.SyncSliceTest-1359816869627/jetty1/index lockFactory=org.apache.lucene.store.NativeFSLockFactory@5227b13d; maxCacheMB=48.0 maxMergeSizeMB=4.0)),segFN=segments_2,generation=2,filenames=[segments_2]
[junit4:junit4]   2> 13704 T2731 C215 P30878 oasc.SolrDeletionPolicy.updateCommits newest commit = 2[segments_2]
[junit4:junit4]   2> 13706 T2731 C215 P30878 oasc.CachingDirectoryFactory.close Releasing directory:/usr/home/hudson/hudson-slave/workspace/Lucene-Solr-Tests-trunk-java7/solr/build/solr-core/test/J1/./org.apache.solr.cloud.SyncSliceTest-1359816869627/jetty1
[junit4:junit4]   2> 13707 T2731 C215 P30878 oass.SolrIndexSearcher.<init> Opening Searcher@74df71b7 realtime
[junit4:junit4]   2> 13707 T2731 C215 P30878 oasu.DirectUpdateHandler2.commit end_commit_flush
[junit4:junit4]   2> 13708 T2731 C215 P30878 /update {waitSearcher=true&openSearcher=false&commit=true&wt=javabin&commit_end_point=true&version=2&softCommit=false} {commit=} 0 43
[junit4:junit4]   2> 13709 T2756 C213 P14367 oash.ReplicationHandler.inform Commits will be reserved for  10000
[junit4:junit4]   2> 13710 T2756 C213 P14367 oash.SnapPuller.<init>  No value set for 'pollInterval'. Timer Task not started.
[junit4:junit4]   2> 13713 T2732 C215 P30878 oash.ReplicationHandler.inform Commits will be reserved for  10000
[junit4:junit4]   2> 13713 T2732 C215 P30878 REQ /replication {command=indexversion&qt=/replication&wt=javabin&version=2} status=0 QTime=2 
[junit4:junit4]   2> 13714 T2756 C213 P14367 oash.SnapPuller.fetchLatestIndex Master's generation: 2
[junit4:junit4]   2> 13714 T2756 C213 P14367 oash.SnapPuller.fetchLatestIndex Slave's generation: 1
[junit4:junit4]   2> 13714 T2756 C213 P14367 oash.SnapPuller.fetchLatestIndex Starting replication process
[junit4:junit4]   2> 13716 T2732 C215 P30878 oasc.CachingDirectoryFactory.close Releasing directory:/usr/home/hudson/hudson-slave/workspace/Lucene-Solr-Tests-trunk-java7/solr/build/solr-core/test/J1/./org.apache.solr.cloud.SyncSliceTest-1359816869627/jetty1
[junit4:junit4]   2> 13717 T2732 C215 P30878 oasc.CachingDirectoryFactory.close Releasing directory:/usr/home/hudson/hudson-slave/workspace/Lucene-Solr-Tests-trunk-java7/solr/build/solr-core/test/J1/./org.apache.solr.cloud.SyncSliceTest-1359816869627/jetty1/index
[junit4:junit4]   2> 13718 T2732 C215 P30878 REQ /replication {command=filelist&qt=/replication&wt=javabin&generation=2&version=2} status=0 QTime=2 
[junit4:junit4]   2> 13718 T2756 C213 P14367 oash.SnapPuller.fetchLatestIndex Number of files in latest index in master: 1
[junit4:junit4]   2> 13720 T2756 C213 P14367 oasc.CachingDirectoryFactory.get return new directory for /usr/home/hudson/hudson-slave/workspace/Lucene-Solr-Tests-trunk-java7/solr/build/solr-core/test/J1/./org.apache.solr.cloud.SyncSliceTest-1359816869627/jetty2/index.20130203015443340 forceNew:false
[junit4:junit4]   2> 13720 T2756 C213 P14367 oasc.CachingDirectoryFactory.close Releasing directory:/usr/home/hudson/hudson-slave/workspace/Lucene-Solr-Tests-trunk-java7/solr/build/solr-core/test/J1/./org.apache.solr.cloud.SyncSliceTest-1359816869627/jetty2
[junit4:junit4]   2> 13721 T2756 C213 P14367 oash.SnapPuller.fetchLatestIndex Starting download to RateLimitedDirectoryWrapper(NRTCachingDirectory(org.apache.lucene.store.NIOFSDirectory@/usr/home/hudson/hudson-slave/workspace/Lucene-Solr-Tests-trunk-java7/solr/build/solr-core/test/J1/org.apache.solr.cloud.SyncSliceTest-1359816869627/jetty2/index.20130203015443340 lockFactory=org.apache.lucene.store.NativeFSLockFactory@6fc05777; maxCacheMB=48.0 maxMergeSizeMB=4.0)) fullCopy=true
[junit4:junit4]   2> 13725 T2732 C215 P30878 REQ /replication {file=segments_2&command=filecontent&checksum=true&wt=filestream&qt=/replication&generation=2} status=0 QTime=0 
[junit4:junit4]   2> 13727 T2756 C213 P14367 oasc.CachingDirectoryFactory.close Releasing directory:/usr/home/hudson/hudson-slave/workspace/Lucene-Solr-Tests-trunk-java7/solr/build/solr-core/test/J1/./org.apache.solr.cloud.SyncSliceTest-1359816869627/jetty2/index
[junit4:junit4]   2> 13728 T2756 C213 P14367 oash.SnapPuller.fetchLatestIndex Total time taken for download : 0 secs
[junit4:junit4]   2> 13728 T2756 C213 P14367 oash.SnapPuller.modifyIndexProps New index installed. Updating index properties... index=index.20130203015443340
[junit4:junit4]   2> 13730 T2756 C213 P14367 oasc.CachingDirectoryFactory.close Releasing directory:/usr/home/hudson/hudson-slave/workspace/Lucene-Solr-Tests-trunk-java7/solr/build/solr-core/test/J1/./org.apache.solr.cloud.SyncSliceTest-1359816869627/jetty2
[junit4:junit4]   2> 13730 T2756 C213 P14367 oasc.CachingDirectoryFactory.close Releasing directory:/usr/home/hudson/hudson-slave/workspace/Lucene-Solr-Tests-trunk-java7/solr/build/solr-core/test/J1/./org.apache.solr.cloud.SyncSliceTest-1359816869627/jetty2
[junit4:junit4]   2> 13731 T2756 C213 P14367 oasc.SolrCore.getNewIndexDir New index directory detected: old=./org.apache.solr.cloud.SyncSliceTest-1359816869627/jetty2/index/ new=./org.apache.solr.cloud.SyncSliceTest-1359816869627/jetty2/index.20130203015443340
[junit4:junit4]   2> 13735 T2756 C213 P14367 oasc.SolrDeletionPolicy.onInit SolrDeletionPolicy.onInit: commits:num=1
[junit4:junit4]   2> 		commit{dir=RateLimitedDirectoryWrapper(NRTCachingDirectory(org.apache.lucene.store.NIOFSDirectory@/usr/home/hudson/hudson-slave/workspace/Lucene-Solr-Tests-trunk-java7/solr/build/solr-core/test/J1/org.apache.solr.cloud.SyncSliceTest-1359816869627/jetty2/index.20130203015443340 lockFactory=org.apache.lucene.store.NativeFSLockFactory@6fc05777; maxCacheMB=48.0 maxMergeSizeMB=4.0)),segFN=segments_2,generation=2,filenames=[segments_2]
[junit4:junit4]   2> 13735 T2756 C213 P14367 oasc.SolrDeletionPolicy.updateCommits newest commit = 2[segments_2]
[junit4:junit4]   2> 13737 T2756 C213 P14367 oasc.CachingDirectoryFactory.close Releasing directory:/usr/home/hudson/hudson-slave/workspace/Lucene-Solr-Tests-trunk-java7/solr/build/solr-core/test/J1/./org.apache.solr.cloud.SyncSliceTest-1359816869627/jetty2
[junit4:junit4]   2> 13737 T2756 C213 P14367 oasu.DefaultSolrCoreState.newIndexWriter Creating new IndexWriter...
[junit4:junit4]   2> 13737 T2756 C213 P14367 oasu.DefaultSolrCoreState.newIndexWriter Waiting until IndexWriter is unused... core=collection1
[junit4:junit4]   2> 13737 T2756 C213 P14367 oasu.DefaultSolrCoreState.newIndexWriter Rollback old IndexWriter... core=collection1
[junit4:junit4]   2> 13738 T2756 C213 P14367 oasc.CachingDirectoryFactory.close Releasing directory:/usr/home/hudson/hudson-slave/workspace/Lucene-Solr-Tests-trunk-java7/solr/build/solr-core/test/J1/./org.apache.solr.cloud.SyncSliceTest-1359816869627/jetty2/index.20130203015443340
[junit4:junit4]   2> 13739 T2756 C213 P14367 oasc.CachingDirectoryFactory.close Releasing directory:/usr/home/hudson/hudson-slave/workspace/Lucene-Solr-Tests-trunk-java7/solr/build/solr-core/test/J1/./org.apache.solr.cloud.SyncSliceTest-1359816869627/jetty2
[junit4:junit4]   2> 13743 T2756 C213 P14367 oasc.SolrDeletionPolicy.onInit SolrDeletionPolicy.onInit: commits:num=1
[junit4:junit4]   2> 		commit{dir=RateLimitedDirectoryWrapper(NRTCachingDirectory(org.apache.lucene.store.NIOFSDirectory@/usr/home/hudson/hudson-slave/workspace/Lucene-Solr-Tests-trunk-java7/solr/build/solr-core/test/J1/org.apache.solr.cloud.SyncSliceTest-1359816869627/jetty2/index.20130203015443340 lockFactory=org.apache.lucene.store.NativeFSLockFactory@6fc05777; maxCacheMB=48.0 maxMergeSizeMB=4.0)),segFN=segments_2,generation=2,filenames=[segments_2]
[junit4:junit4]   2> 13744 T2756 C213 P14367 oasc.SolrDeletionPolicy.updateCommits newest commit = 2[segments_2]
[junit4:junit4]   2> 13744 T2756 C213 P14367 oasu.DefaultSolrCoreState.newIndexWriter New IndexWriter is ready to be used.
[junit4:junit4]   2> 13745 T2756 C213 P14367 oasc.CachingDirectoryFactory.close Releasing directory:/usr/home/hudson/hudson-slave/workspace/Lucene-Solr-Tests-trunk-java7/solr/build/solr-core/test/J1/./org.apache.solr.cloud.SyncSliceTest-1359816869627/jetty2
[junit4:junit4]   2> 13745 T2756 C213 P14367 oass.SolrIndexSearcher.<init> Opening Searcher@4201ba20 main
[junit4:junit4]   2> 13747 T2755 oasc.SolrCore.registerSearcher [collection1] Registered new searcher Searcher@4201ba20 main{StandardDirectoryReader(segments_2:1:nrt)}
[junit4:junit4]   2> 13747 T2755 oasc.CachingDirectoryFactory.close Releasing directory:/usr/home/hudson/hudson-slave/workspace/Lucene-Solr-Tests-trunk-java7/solr/build/solr-core/test/J1/./org.apache.solr.cloud.SyncSliceTest-1359816869627/jetty2/index
[junit4:junit4]   2> 13747 T2756 C213 P14367 oasu.DirectUpdateHandler2.commit start commit{,optimize=false,openSearcher=false,waitSearcher=false,expungeDeletes=false,softCommit=false}
[junit4:junit4]   2> 13751 T2756 C213 P14367 oasc.SolrDeletionPolicy.onCommit SolrDeletionPolicy.onCommit: commits:num=2
[junit4:junit4]   2> 		commit{dir=RateLimitedDirectoryWrapper(NRTCachingDirectory(org.apache.lucene.store.NIOFSDirectory@/usr/home/hudson/hudson-slave/workspace/Lucene-Solr-Tests-trunk-java7/solr/build/solr-core/test/J1/org.apache.solr.cloud.SyncSliceTest-1359816869627/jetty2/index.20130203015443340 lockFactory=org.apache.lucene.store.NativeFSLockFactory@6fc05777; maxCacheMB=48.0 maxMergeSizeMB=4.0)),segFN=segments_2,generation=2,filenames=[segments_2]
[junit4:junit4]   2> 		commit{dir=RateLimitedDirectoryWrapper(NRTCachingDirectory(org.apache.lucene.store.NIOFSDirectory@/usr/home/hudson/hudson-slave/workspace/Lucene-Solr-Tests-trunk-java7/solr/build/solr-core/test/J1/org.apache.solr.cloud.SyncSliceTest-1359816869627/jetty2/index.20130203015443340 lockFactory=org.apache.lucene.store.NativeFSLockFactory@6fc05777; maxCacheMB=48.0 maxMergeSizeMB=4.0)),segFN=segments_3,generation=3,filenames=[segments_3]
[junit4:junit4]   2> 13752 T2756 C213 P14367 oasc.SolrDeletionPolicy.updateCommits newest commit = 3[segments_3]
[junit4:junit4]   2> 13753 T2756 C213 P14367 oasc.CachingDirectoryFactory.close Releasing directory:/usr/home/hudson/hudson-slave/workspace/Lucene-Solr-Tests-trunk-java7/solr/build/solr-core/test/J1/./org.apache.solr.cloud.SyncSliceTest-1359816869627/jetty2
[junit4:junit4]   2> 13753 T2756 C213 P14367 oasu.DirectUpdateHandler2.commit end_commit_flush
[junit4:junit4]   2> 13753 T2756 C213 P14367 oasc.CachingDirectoryFactory.close Releasing directory:/usr/home/hudson/hudson-slave/workspace/Lucene-Solr-Tests-trunk-java7/solr/build/solr-core/test/J1/./org.apache.solr.cloud.SyncSliceTest-1359816869627/jetty2/index.20130203015443340
[junit4:junit4]   2> 13754 T2756 C213 P14367 oasc.CachingDirectoryFactory.close Releasing directory:/usr/home/hudson/hudson-slave/workspace/Lucene-Solr-Tests-trunk-java7/solr/build/solr-core/test/J1/./org.apache.solr.cloud.SyncSliceTest-1359816869627/jetty2/index
[junit4:junit4]   2> 13754 T2756 C213 P14367 oasc.RecoveryStrategy.replay No replay needed. core=collection1
[junit4:junit4]   2> 13754 T2756 C213 P14367 oasc.RecoveryStrategy.doRecovery Replication Recovery was successful - registering as Active. core=collection1
[junit4:junit4]   2> 13754 T2756 C213 P14367 oasc.ZkController.publish publishing core=collection1 state=active
[junit4:junit4]   2> 13755 T2756 C213 P14367 oasc.ZkController.publish numShards not found on descriptor - reading it from system property
[junit4:junit4]   2> 13761 T2756 C213 P14367 oasc.RecoveryStrategy.doRecovery Finished recovery process. core=collection1
[junit4:junit4]   2> 14319 T2786 oass.OpenExchangeRatesOrgProvider.init Initialized with rates=open-exchange-rates.json, refreshInterval=1440.
[junit4:junit4]   2> 14330 T2786 oass.IndexSchema.readSchema default search field in schema is text
[junit4:junit4]   2> 14335 T2786 oass.IndexSchema.readSchema unique key field: id
[junit4:junit4]   2> 14348 T2786 oass.FileExchangeRateProvider.reload Reloading exchange rates from file currency.xml
[junit4:junit4]   2> 14365 T2786 oass.FileExchangeRateProvider.reload Reloading exchange rates from file currency.xml
[junit4:junit4]   2> 14370 T2786 oass.OpenExchangeRatesOrgProvider.reload Reloading exchange rates from open-exchange-rates.json
[junit4:junit4]   2> 14371 T2786 oass.OpenExchangeRatesOrgProvider.reload Reloading exchange rates from open-exchange-rates.json
[junit4:junit4]   2> 14373 T2786 oasc.SolrCore.<init> [collection1] Opening new SolrCore at /usr/home/hudson/hudson-slave/workspace/Lucene-Solr-Tests-trunk-java7/solr/build/solr-core/test/J1/./org.apache.solr.cloud.SyncSliceTest-jetty4-1359816882703/collection1/, dataDir=./org.apache.solr.cloud.SyncSliceTest-1359816869627/jetty4/
[junit4:junit4]   2> 14373 T2786 oasc.JmxMonitoredMap.<init> JMX monitoring is enabled. Adding Solr mbeans to JMX Server: com.sun.jmx.mbeanserver.JmxMBeanServer@12bef803
[junit4:junit4]   2> 14373 T2786 oasc.SolrCore.initDirectoryFactory solr.NRTCachingDirectoryFactory
[junit4:junit4]   2> 14374 T2786 oasc.CachingDirectoryFactory.get return new directory for /usr/home/hudson/hudson-slave/workspace/Lucene-Solr-Tests-trunk-java7/solr/build/solr-core/test/J1/./org.apache.solr.cloud.SyncSliceTest-1359816869627/jetty4 forceNew:false
[junit4:junit4]   2> 14375 T2786 oasc.CachingDirectoryFactory.close Releasing directory:/usr/home/hudson/hudson-slave/workspace/Lucene-Solr-Tests-trunk-java7/solr/build/solr-core/test/J1/./org.apache.solr.cloud.SyncSliceTest-1359816869627/jetty4
[junit4:junit4]   2> 14375 T2786 oasc.SolrCore.getNewIndexDir New index directory detected: old=null new=./org.apache.solr.cloud.SyncSliceTest-1359816869627/jetty4/index/
[junit4:junit4]   2> 14376 T2786 oasc.SolrCore.initIndex WARNING [collection1] Solr index directory './org.apache.solr.cloud.SyncSliceTest-1359816869627/jetty4/index' doesn't exist. Creating new index...
[junit4:junit4]   2> 14377 T2786 oasc.CachingDirectoryFactory.get return new directory for /usr/home/hudson/hudson-slave/workspace/Lucene-Solr-Tests-trunk-java7/solr/build/solr-core/test/J1/./org.apache.solr.cloud.SyncSliceTest-1359816869627/jetty4/index forceNew:false
[junit4:junit4]   2> 14383 T2786 oasc.SolrDeletionPolicy.onCommit SolrDeletionPolicy.onCommit: commits:num=1
[junit4:junit4]   2> 		commit{dir=RateLimitedDirectoryWrapper(NRTCachingDirectory(org.apache.lucene.store.NIOFSDirectory@/usr/home/hudson/hudson-slave/workspace/Lucene-Solr-Tests-trunk-java7/solr/build/solr-core/test/J1/org.apache.solr.cloud.SyncSliceTest-1359816869627/jetty4/index lockFactory=org.apache.lucene.store.NativeFSLockFactory@6f99d33c; maxCacheMB=48.0 maxMergeSizeMB=4.0)),segFN=segments_1,generation=1,filenames=[segments_1]
[junit4:junit4]   2> 14383 T2786 oasc.SolrDeletionPolicy.updateCommits newest commit = 1[segments_1]
[junit4:junit4]   2> 14385 T2786 oasc.CachingDirectoryFactory.close Releasing directory:/usr/home/hudson/hudson-slave/workspace/Lucene-Solr-Tests-trunk-java7/solr/build/solr-core/test/J1/./org.apache.solr.cloud.SyncSliceTest-1359816869627/jetty4/index
[junit4:junit4]   2> 14385 T2786 oasc.SolrCore.initWriters created xml: solr.XMLResponseWriter
[junit4:junit4]   2> 14387 T2786 oasup.UpdateRequestProcessorChain.init inserting DistributedUpdateProcessorFactory into updateRequestProcessorChain "dedupe"
[junit4:junit4]   2> 14387 T2786 oasup.UpdateRequestProcessorChain.init inserting DistributedUpdateProcessorFactory into updateRequestProcessorChain "dedupe-allfields"
[junit4:junit4]   2> 14388 T2786 oasup.UpdateRequestProcessorChain.init inserting DistributedUpdateProcessorFactory into updateRequestProcessorChain "stored_sig"
[junit4:junit4]   2> 14388 T2786 oasup.UpdateRequestProcessorChain.init inserting DistributedUpdateProcessorFactory into updateRequestProcessorChain "uniq-fields"
[junit4:junit4]   2> 14389 T2786 oasup.UpdateRequestProcessorChain.init inserting DistributedUpdateProcessorFactory into updateRequestProcessorChain "distrib-dup-test-chain-implicit"
[junit4:junit4]   2> 14389 T2786 oasc.RequestHandlers.initHandlersFromConfig adding lazy requestHandler: solr.ReplicationHandler
[junit4:junit4]   2> 14389 T2786 oasc.RequestHandlers.initHandlersFromConfig created /replication: solr.ReplicationHandler
[junit4:junit4]   2> 14390 T2786 oasc.RequestHandlers.initHandlersFromConfig created standard: solr.StandardRequestHandler
[junit4:junit4]   2> 14391 T2786 oasc.RequestHandlers.initHandlersFromConfig created /get: solr.RealTimeGetHandler
[junit4:junit4]   2> 14391 T2786 oasc.RequestHandlers.initHandlersFromConfig created dismax: solr.SearchHandler
[junit4:junit4]   2> 14392 T2786 oasc.RequestHandlers.initHandlersFromConfig created mock: org.apache.solr.core.MockQuerySenderListenerReqHandler
[junit4:junit4]   2> 14392 T2786 oasc.RequestHandlers.initHandlersFromConfig created /admin/: org.apache.solr.handler.admin.AdminHandlers
[junit4:junit4]   2> 14393 T2786 oasc.RequestHandlers.initHandlersFromConfig created defaults: solr.StandardRequestHandler
[junit4:junit4]   2> 14393 T2786 oasc.RequestHandlers.initHandlersFromConfig adding lazy requestHandler: solr.StandardRequestHandler
[junit4:junit4]   2> 14394 T2786 oasc.RequestHandlers.initHandlersFromConfig created lazy: solr.StandardRequestHandler
[junit4:junit4]   2> 14394 T2786 oasc.RequestHandlers.initHandlersFromConfig created /update: solr.UpdateRequestHandler
[junit4:junit4]   2> 14395 T2786 oasc.RequestHandlers.initHandlersFromConfig created /terms: org.apache.solr.handler.component.SearchHandler
[junit4:junit4]   2> 14395 T2786 oasc.RequestHandlers.initHandlersFromConfig created spellCheckCompRH: org.apache.solr.handler.component.SearchHandler
[junit4:junit4]   2> 14396 T2786 oasc.RequestHandlers.initHandlersFromConfig created spellCheckCompRH_Direct: org.apache.solr.handler.component.SearchHandler
[junit4:junit4]   2> 14396 T2786 oasc.RequestHandlers.initHandlersFromConfig created spellCheckWithWordbreak: org.apache.solr.handler.component.SearchHandler
[junit4:junit4]   2> 14397 T2786 oasc.RequestHandlers.initHandlersFromConfig created spellCheckWithWordbreak_Direct: org.apache.solr.handler.component.SearchHandler
[junit4:junit4]   2> 14397 T2786 oasc.RequestHandlers.initHandlersFromConfig created spellCheckCompRH1: org.apache.solr.handler.component.SearchHandler
[junit4:junit4]   2> 14398 T2786 oasc.RequestHandlers.initHandlersFromConfig created mltrh: org.apache.solr.handler.component.SearchHandler
[junit4:junit4]   2> 14398 T2786 oasc.RequestHandlers.initHandlersFromConfig created tvrh: org.apache.solr.handler.component.SearchHandler
[junit4:junit4]   2> 14399 T2786 oasc.RequestHandlers.initHandlersFromConfig created /mlt: solr.MoreLikeThisHandler
[junit4:junit4]   2> 14400 T2786 oasc.RequestHandlers.initHandlersFromConfig created /debug/dump: solr.DumpRequestHandler
[junit4:junit4]   2> 14414 T2786 oashl.XMLLoader.init xsltCacheLifetimeSeconds=60
[junit4:junit4]   2> 14419 T2786 oasc.SolrCore.initDeprecatedSupport WARNING solrconfig.xml uses deprecated <admin/gettableFiles>, Please update your config to use the ShowFileRequestHandler.
[junit4:junit4]   2> 14421 T2786 oasc.SolrCore.initDeprecatedSupport WARNING adding ShowFileRequestHandler with hidden files: [SCHEMA.XML, OLD_SYNONYMS.TXT, STOPWORDS.TXT, PROTWORDS.TXT, OPEN-EXCHANGE-RATES.JSON, SYNONYMS.TXT, CURRENCY.XML, MAPPING-ISOLATIN1ACCENT.TXT]
[junit4:junit4]   2> 14423 T2786 oasc.CachingDirectoryFactory.close Releasing directory:/usr/home/hudson/hudson-slave/workspace/Lucene-Solr-Tests-trunk-java7/solr/build/solr-core/test/J1/./org.apache.solr.cloud.SyncSliceTest-1359816869627/jetty4
[junit4:junit4]   2> 14425 T2786 oass.SolrIndexSearcher.<init> Opening Searcher@542bf1d0 main
[junit4:junit4]   2> 14426 T2786 oasu.CommitTracker.<init> Hard AutoCommit: disabled
[junit4:junit4]   2> 14426 T2786 oasu.CommitTracker.<init> Soft AutoCommit: disabled
[junit4:junit4]   2> 14427 T2786 oashc.SpellCheckComponent.inform Initializing spell checkers
[junit4:junit4]   2> 14442 T2786 oass.DirectSolrSpellChecker.init init: {name=direct,classname=DirectSolrSpellChecker,field=lowerfilt,minQueryLength=3}
[junit4:junit4]   2> 14525 T2789 oasc.SolrCore.registerSearcher [collection1] Registered new searcher Searcher@542bf1d0 main{StandardDirectoryReader(segments_1:1)}
[junit4:junit4]   2> 14530 T2786 oasc.ZkController.publish publishing core=collection1 state=down
[junit4:junit4]   2> 14531 T2786 oasc.ZkController.publish numShards not found on descriptor - reading it from system property
[junit4:junit4]   2> 14551 T2720 oascc.ZkStateReader.updateClusterState Updating cloud state from ZooKeeper... 
[junit4:junit4]   2> 14552 T2720 oasc.Overseer$ClusterStateUpdater.updateState Update state numShards=1 message={
[junit4:junit4]   2> 	  "operation":"state",
[junit4:junit4]   2> 	  "numShards":"1",
[junit4:junit4]   2> 	  "shard":"shard1",
[junit4:junit4]   2> 	  "roles":null,
[junit4:junit4]   2> 	  "state":"recovering",
[junit4:junit4]   2> 	  "core":"collection1",
[junit4:junit4]   2> 	  "collection":"collection1",
[junit4:junit4]   2> 	  "node_name":"127.0.0.1:14607_h_vtp%2Ft",
[junit4:junit4]   2> 	  "base_url":"http://127.0.0.1:14607/h_vtp/t"}
[junit4:junit4]   2> 14558 T2720 oasc.Overseer$ClusterStateUpdater.updateState Update state numShards=1 message={
[junit4:junit4]   2> 	  "operation":"state",
[junit4:junit4]   2> 	  "numShards":"1",
[junit4:junit4]   2> 	  "shard":"shard1",
[junit4:junit4]   2> 	  "roles":null,
[junit4:junit4]   2> 	  "state":"active",
[junit4:junit4]   2> 	  "core":"collection1",
[junit4:junit4]   2> 	  "collection":"collection1",
[junit4:junit4]   2> 	  "node_name":"127.0.0.1:14367_h_vtp%2Ft",
[junit4:junit4]   2> 	  "base_url":"http://127.0.0.1:14367/h_vtp/t"}
[junit4:junit4]   2> 14572 T2720 oasc.Overseer$ClusterStateUpdater.updateState Update state numShards=1 message={
[junit4:junit4]   2> 	  "operation":"state",
[junit4:junit4]   2> 	  "numShards":"1",
[junit4:junit4]   2> 	  "shard":null,
[junit4:junit4]   2> 	  "roles":null,
[junit4:junit4]   2> 	  "state":"down",
[junit4:junit4]   2> 	  "core":"collection1",
[junit4:junit4]   2> 	  "collection":"collection1",
[junit4:junit4]   2> 	  "node_name":"127.0.0.1:26299_h_vtp%2Ft",
[junit4:junit4]   2> 	  "base_url":"http://127.0.0.1:26299/h_vtp/t"}
[junit4:junit4]   2> 14572 T2720 oasc.Overseer$ClusterStateUpdater.updateState Collection already exists with numShards=1
[junit4:junit4]   2> 14572 T2720 oasc.Overseer$ClusterStateUpdater.updateState Assigning new node to shard shard=shard1
[junit4:junit4]   2> 14584 T2719 oascc.ZkStateReader$2.process A cluster state change: WatchedEvent state:SyncConnected type:NodeDataChanged path:/clusterstate.json, has occurred - updating... (live nodes size: 5)
[junit4:junit4]   2> 14584 T2769 oascc.ZkStateReader$2.process A cluster state change: WatchedEvent state:SyncConnected type:NodeDataChanged path:/clusterstate.json, has occurred - updating... (live nodes size: 5)
[junit4:junit4]   2> 14584 T2725 oascc.ZkStateReader$2.process A cluster state change: WatchedEvent state:SyncConnected type:NodeDataChanged path:/clusterstate.json, has occurred - updating... (live nodes size: 5)
[junit4:junit4]   2> 14584 T2738 oascc.ZkStateReader$2.process A cluster state change: WatchedEvent state:SyncConnected type:NodeDataChanged path:/clusterstate.json, has occurred - updating... (live nodes size: 5)
[junit4:junit4]   2> 14584 T2753 oascc.ZkStateReader$2.process A cluster state change: WatchedEvent state:SyncConnected type:NodeDataChanged path:/clusterstate.json, has occurred - updating... (live nodes size: 5)
[junit4:junit4]   2> 14584 T2785 oascc.ZkStateReader$2.process A cluster state change: WatchedEvent state:SyncConnected type:NodeDataChanged path:/clusterstate.json, has occurred - updating... (live nodes size: 5)
[junit4:junit4]   2> 15538 T2786 oasc.CoreContainer.registerCore registering core: collection1
[junit4:junit4]   2> 15538 T2786 oasc.ZkController.register Register replica - core:collection1 address:http://127.0.0.1:26299/h_vtp/t collection:collection1 shard:shard1
[junit4:junit4]   2> 15542 T2786 oasc.ZkController.register We are http://127.0.0.1:26299/h_vtp/t/collection1/ and leader is http://127.0.0.1:30878/h_vtp/t/collection1/
[junit4:junit4]   2> 15542 T2786 oasc.ZkController.register No LogReplay needed for core=collection1 baseURL=http://127.0.0.1:26299/h_vtp/t
[junit4:junit4]   2> 15542 T2786 oasc.ZkController.checkRecovery Core needs to recover:collection1
[junit4:junit4]   2> 15543 T2786 oasu.DefaultSolrCoreState.doRecovery Running recovery - first canceling any ongoing recovery
[junit4:junit4]   2> ASYNC  NEW_CORE C216 name=collection1 org.apache.solr.core.SolrCore@5fe82e4d url=http://127.0.0.1:26299/h_vtp/t/collection1 node=127.0.0.1:26299_h_vtp%2Ft C216_STATE=coll:collection1 core:collection1 props:{shard=null, roles=null, state=down, core=collection1, collection=collection1, node_name=127.0.0.1:26299_h_vtp%2Ft, base_url=http://127.0.0.1:26299/h_vtp/t}
[junit4:junit4]   2> 15544 T2790 C216 P26299 oasc.RecoveryStrategy.run Starting recovery process.  core=collection1 recoveringAfterStartup=true
[junit4:junit4]   2> 15544 T2790 C216 P26299 oasc.RecoveryStrategy.doRecovery ###### startupVersions=[]
[junit4:junit4]   2> 15544 T2786 oascc.ZkStateReader.updateClusterState Updating cloud state from ZooKeeper... 
[junit4:junit4]   2> 15545 T2790 C216 P26299 oasc.ZkController.publish publishing core=collection1 state=recovering
[junit4:junit4]   2> 15545 T2790 C216 P26299 oasc.ZkController.publish numShards not found on descriptor - reading it from system property
[junit4:junit4]   2> 15546 T2697 oass.SolrDispatchFilter.init user.dir=/usr/home/hudson/hudson-slave/workspace/Lucene-Solr-Tests-trunk-java7/solr/build/solr-core/test/J1
[junit4:junit4]   2> 15546 T2697 oass.SolrDispatchFilter.init SolrDispatchFilter.init() done
[junit4:junit4]   2> 15547 T2790 C216 P26299 oascsi.HttpClientUtil.createClient Creating new http client, config:maxConnections=128&maxConnectionsPerHost=32&followRedirects=false
[junit4:junit4]   2> 15547 T2697 oascsi.HttpClientUtil.createClient Creating new http client, config:maxConnections=128&maxConnectionsPerHost=32&followRedirects=false
[junit4:junit4]   2> 15566 T2697 oascc.ZkStateReader.updateClusterState Updating cloud state from ZooKeeper... 
[junit4:junit4]   2> 15567 T2697 oasc.AbstractFullDistribZkTestBase.waitForThingsToLevelOut Wait for recoveries to finish - wait 15 for each attempt
[junit4:junit4]   2> 15568 T2697 oasc.AbstractDistribZkTestBase.waitForRecoveriesToFinish Wait for recoveries to finish - collection: collection1 failOnTimeout:true timeout (sec):15
[junit4:junit4]   2> 15569 T2697 oascc.ZkStateReader.updateClusterState Updating cloud state from ZooKeeper... 
[junit4:junit4]   2> 16099 T2720 oascc.ZkStateReader.updateClusterState Updating cloud state from ZooKeeper... 
[junit4:junit4]   2> 16100 T2720 oasc.Overseer$ClusterStateUpdater.updateState Update state numShards=1 message={
[junit4:junit4]   2> 	  "operation":"state",
[junit4:junit4]   2> 	  "numShards":"1",
[junit4:junit4]   2> 	  "shard":"shard1",
[junit4:junit4]   2> 	  "roles":null,
[junit4:junit4]   2> 	  "state":"recovering",
[junit4:junit4]   2> 	  "core":"collection1",
[junit4:junit4]   2> 	  "collection":"collection1",
[junit4:junit4]   2> 	  "node_name":"127.0.0.1:26299_h_vtp%2Ft",
[junit4:junit4]   2> 	  "base_url":"http://127.0.0.1:26299/h_vtp/t"}
[junit4:junit4]   2> 16199 T2785 oascc.ZkStateReader$2.process A cluster state change: WatchedEvent state:SyncConnected type:NodeDataChanged path:/clusterstate.json, has occurred - updating... (live nodes size: 5)
[junit4:junit4]   2> 16199 T2725 oascc.ZkStateReader$2.process A cluster state change: WatchedEvent state:SyncConnected type:NodeDataChanged path:/clusterstate.json, has occurred - updating... (live nodes size: 5)
[junit4:junit4]   2> 16199 T2719 oascc.ZkStateReader$2.process A cluster state change: WatchedEvent state:SyncConnected type:NodeDataChanged path:/clusterstate.json, has occurred - updating... (live nodes size: 5)
[junit4:junit4]   2> 16199 T2769 oascc.ZkStateReader$2.process A cluster state change: WatchedEvent state:SyncConnected type:NodeDataChanged path:/clusterstate.json, has occurred - updating... (live nodes size: 5)
[junit4:junit4]   2> 16199 T2753 oascc.ZkStateReader$2.process A cluster state change: WatchedEvent state:SyncConnected type:NodeDataChanged path:/clusterstate.json, has occurred - updating... (live nodes size: 5)
[junit4:junit4]   2> 16199 T2738 oascc.ZkStateReader$2.process A cluster state change: WatchedEvent state:SyncConnected type:NodeDataChanged path:/clusterstate.json, has occurred - updating... (live nodes size: 5)
[junit4:junit4]   2> 16570 T2697 oascc.ZkStateReader.updateClusterState Updating cloud state from ZooKeeper... 
[junit4:junit4]   2>  C214_STATE=coll:collection1 core:collection1 props:{shard=shard1, roles=null, state=recovering, core=collection1, collection=collection1, node_name=127.0.0.1:14607_h_vtp%2Ft, base_url=http://127.0.0.1:14607/h_vtp/t}
[junit4:junit4]   2> 17086 T2772 C214 P14607 oasc.RecoveryStrategy.doRecovery Attempting to PeerSync from http://127.0.0.1:30878/h_vtp/t/collection1/ core=collection1 - recoveringAfterStartup=true
[junit4:junit4]   2> 17086 T2772 C214 P14607 oasu.PeerSync.sync PeerSync: core=collection1 url=http://127.0.0.1:14607/h_vtp/t START replicas=[http://127.0.0.1:30878/h_vtp/t/collection1/] nUpdates=100
[junit4:junit4]   2> 17088 T2772 C214 P14607 oasu.PeerSync.sync WARNING no frame of reference to tell of we've missed updates
[junit4:junit4]   2> 17088 T2772 C214 P14607 oasc.RecoveryStrategy.doRecovery PeerSync Recovery was not successful - trying replication. core=collection1
[junit4:junit4]   2> 17088 T2772 C214 P14607 oasc.RecoveryStrategy.doRecovery Starting Replication Recovery. core=collection1
[junit4:junit4]   2> 17088 T2772 C214 P14607 oasc.RecoveryStrategy.doRecovery Begin buffering updates. core=collection1
[junit4:junit4]   2> 17088 T2772 C214 P14607 oasu.UpdateLog.bufferUpdates Starting to buffer updates. FSUpdateLog{state=ACTIVE, tlog=null}
[junit4:junit4]   2> 17089 T2772 C214 P14607 oasc.RecoveryStrategy.replicate Attempting to replicate from http://127.0.0.1:30878/h_vtp/t/collection1/. core=collection1
[junit4:junit4]   2> 17089 T2772 C214 P14607 oascsi.HttpClientUtil.createClient Creating new http client, config:maxConnections=128&maxConnectionsPerHost=32&followRedirects=false
[junit4:junit4]   2> 17090 T2730 C215 P30878 REQ /get {getVersions=100&distrib=false&wt=javabin&qt=/get&version=2} status=0 QTime=0 
[junit4:junit4]   2> 17100 T2734 C215 P30878 oasu.DirectUpdateHandler2.commit start commit{,optimize=false,openSearcher=false,waitSearcher=true,expungeDeletes=false,softCommit=false}
[junit4:junit4]   2> 17106 T2734 C215 P30878 oasc.SolrDeletionPolicy.onCommit SolrDeletionPolicy.onCommit: commits:num=2
[junit4:junit4]   2> 		commit{dir=RateLimitedDirectoryWrapper(NRTCachingDirectory(org.apache.lucene.store.NIOFSDirectory@/usr/home/hudson/hudson-slave/workspace/Lucene-Solr-Tests-trunk-java7/solr/build/solr-core/test/J1/org.apache.solr.cloud.SyncSliceTest-1359816869627/jetty1/index lockFactory=org.apache.lucene.store.NativeFSLockFactory@5227b13d; maxCacheMB=48.0 maxMergeSizeMB=4.0)),segFN=segments_2,generation=2,filenames=[segments_2]
[junit4:junit4]   2> 		commit{dir=RateLimitedDirectoryWrapper(NRTCachingDirectory(org.apache.lucene.store.NIOFSDirectory@/usr/home/hudson/hudson-slave/workspace/Lucene-Solr-Tests-trunk-java7/solr/build/solr-core/test/J1/org.apache.solr.cloud.SyncSliceTest-1359816869627/jetty1/index lockFactory=org.apache.lucene.store.NativeFSLockFactory@5227b13d; maxCacheMB=48.0 maxMergeSizeMB=4.0)),segFN=segments_3,generation=3,filenames=[segments_3]
[junit4:junit4]   2> 17107 T2734 C215 P30878 oasc.SolrDeletionPolicy.updateCommits newest commit = 3[segments_3]
[junit4:junit4]   2> 17107 T2734 C215 P30878 oasc.CachingDirectoryFactory.close Releasing directory:/usr/home/hudson/hudson-slave/workspace/Lucene-Solr-Tests-trunk-java7/solr/build/solr-core/test/J1/./org.apache.solr.cloud.SyncSliceTest-1359816869627/jetty1
[junit4:junit4]   2> 17108 T2734 C215 P30878 oasu.DirectUpdateHandler2.commit end_commit_flush
[junit4:junit4]   2> 17108 T2734 C215 P30878 /update {waitSearcher=true&openSearcher=false&commit=true&wt=javabin&commit_end_point=true&version=2&softCommit=false} {commit=} 0 9
[junit4:junit4]   2> 17109 T2772 C214 P14607 oash.ReplicationHandler.inform Commits will be reserved for  10000
[junit4:junit4]   2> 17110 T2772 C214 P14607 oash.SnapPuller.<init>  No value set for 'pollInterval'. Timer Task not started.
[junit4:junit4]   2> 17112 T2732 C215 P30878 REQ /replication {command=indexversion&qt=/replication&wt=javabin&version=2} status=0 QTime=0 
[junit4:junit4]   2> 17113 T2772 C214 P14607 oash.SnapPuller.fetchLatestIndex Master's generation: 3
[junit4:junit4]   2> 17113 T2772 C214 P14607 oash.SnapPuller.fetchLatestIndex Slave's generation: 1
[junit4:junit4]   2> 17113 T2772 C214 P14607 oash.SnapPuller.fetchLatestIndex Starting replication process
[junit4:junit4]   2> 17116 T2732 C215 P30878 oasc.CachingDirectoryFactory.close Releasing directory:/usr/home/hudson/hudson-slave/workspace/Lucene-Solr-Tests-trunk-java7/solr/build/solr-core/test/J1/./org.apache.solr.cloud.SyncSliceTest-1359816869627/jetty1
[junit4:junit4]   2> 17117 T2732 C215 P30878 oasc.CachingDirectoryFactory.close Releasing directory:/usr/home/hudson/hudson-slave/workspace/Lucene-Solr-Tests-trunk-java7/solr/build/solr-core/test/J1/./org.apache.solr.cloud.SyncSliceTest-1359816869627/jetty1/index
[junit4:junit4]   2> 17117 T2732 C215 P30878 REQ /replication {command=filelist&qt=/replication&wt=javabin&generation=3&version=2} status=0 QTime=1 
[junit4:junit4]   2> 17118 T2772 C214 P14607 oash.SnapPuller.fetchLatestIndex Number of files in latest index in master: 1
[junit4:junit4]   2> 17120 T2772 C214 P14607 oasc.CachingDirectoryFactory.get return new directory for /usr/home/hudson/hudson-slave/workspace/Lucene-Solr-Tests-trunk-java7/solr/build/solr-core/test/J1/./org.apache.solr.cloud.SyncSliceTest-1359816869627/jetty3/index.20130203015446740 forceNew:false
[junit4:junit4]   2> 17120 T2772 C214 P14607 oasc.CachingDirectoryFactory.close Releasing directory:/usr/home/hudson/hudson-slave/workspace/Lucene-Solr-Tests-trunk-java7/solr/build/solr-core/test/J1/./org.apache.solr.cloud.SyncSliceTest-1359816869627/jetty3
[junit4:junit4]   2> 17121 T2772 C214 P14607 oash.SnapPuller.fetchLatestIndex Starting download to RateLimitedDirectoryWrapper(NRTCachingDirectory(org.apache.lucene.store.NIOFSDirectory@/usr/home/hudson/hudson-slave/workspace/Lucene-Solr-Tests-trunk-java7/solr/build/solr-core/test/J1/org.apache.solr.cloud.SyncSliceTest-1359816869627/jetty3/index.20130203015446740 lockFactory=org.apache.lucene.store.NativeFSLockFactory@56d5e4fe; maxCacheMB=48.0 maxMergeSizeMB=4.0)) fullCopy=true
[junit4:junit4]   2> 17149 T2732 C215 P30878 REQ /replication {file=segments_3&command=filecontent&checksum=true&wt=filestream&qt=/replication&generation=3} status=0 QTime=0 
[junit4:junit4]   2> 17152 T2772 C214 P14607 oasc.CachingDirectoryFactory.close Releasing directory:/usr/home/hudson/hudson-slave/workspace/Lucene-Solr-Tests-trunk-java7/solr/build/solr-core/test/J1/./org.apache.solr.cloud.SyncSliceTest-1359816869627/jetty3/index
[junit4:junit4]   2> 17152 T2772 C214 P14607 oash.SnapPuller.fetchLatestIndex Total time taken for download : 0 secs
[junit4:junit4]   2> 17153 T2772 C214 P14607 oash.SnapPuller.modifyIndexProps New index installed. Updating index properties... index=index.20130203015446740
[junit4:junit4]   2> 17154 T2772 C214 P14607 oasc.CachingDirectoryFactory.close Releasing directory:/usr/home/hudson/hudson-slave/workspace/Lucene-Solr-Tests-trunk-java7/solr/build/solr-core/test/J1/./org.apache.solr.cloud.SyncSliceTest-1359816869627/jetty3
[junit4:junit4]   2> 17155 T2772 C214 P14607 oasc.CachingDirectoryFactory.close Releasing directory:/usr/home/hudson/hudson-slave/workspace/Lucene-Solr-Tests-trunk-java7/solr/build/solr-core/test/J1/./org.apache.solr.cloud.SyncSliceTest-1359816869627/jetty3
[junit4:junit4]   2> 17155 T2772 C214 P14607 oasc.SolrCore.getNewIndexDir New index directory detected: old=./org.apache.solr.cloud.SyncSliceTest-1359816869627/jetty3/index/ new=./org.apache.solr.cloud.SyncSliceTest-1359816869627/jetty3/index.20130203015446740
[junit4:junit4]   2> 17159 T2772 C214 P14607 oasc.SolrDeletionPolicy.onInit SolrDeletionPolicy.onInit: commits:num=1
[junit4:junit4]   2> 		commit{dir=RateLimitedDirectoryWrapper(NRTCachingDirectory(org.apache.lucene.store.NIOFSDirectory@/usr/home/hudson/hudson-slave/workspace/Lucene-Solr-Tests-trunk-java7/solr/build/solr-core/test/J1/org.apache.solr.cloud.SyncSliceTest-1359816869627/jetty3/index.20130203015446740 lockFactory=org.apache.lucene.store.NativeFSLockFactory@56d5e4fe; maxCacheMB=48.0 maxMergeSizeMB=4.0)),segFN=segments_3,generation=3,filenames=[segments_3]
[junit4:junit4]   2> 17160 T2772 C214 P14607 oasc.SolrDeletionPolicy.updateCommits newest commit = 3[segments_3]
[junit4:junit4]   2> 17161 T2772 C214 P14607 oasc.CachingDirectoryFactory.close Releasing directory:/usr/home/hudson/hudson-slave/workspace/Lucene-Solr-Tests-trunk-java7/solr/build/solr-core/test/J1/./org.apache.solr.cloud.SyncSliceTest-1359816869627/jetty3
[junit4:junit4]   2> 17161 T2772 C214 P14607 oasu.DefaultSolrCoreState.newIndexWriter Creating new IndexWriter...
[junit4:junit4]   2> 17162 T2772 C214 P14607 oasu.DefaultSolrCoreState.newIndexWriter Waiting until IndexWriter is unused... core=collection1
[junit4:junit4]   2> 17162 T2772 C214 P14607 oasu.DefaultSolrCoreState.newIndexWriter Rollback old IndexWriter... core=collection1
[junit4:junit4]   2> 17163 T2772 C214 P14607 oasc.CachingDirectoryFactory.close Releasing directory:/usr/home/hudson/hudson-slave/workspace/Lucene-Solr-Tests-trunk-java7/solr/build/solr-core/test/J1/./org.apache.solr.cloud.SyncSliceTest-1359816869627/jetty3/index.20130203015446740
[junit4:junit4]   2> 17163 T2772 C214 P14607 oasc.CachingDirectoryFactory.close Releasing directory:/usr/home/hudson/hudson-slave/workspace/Lucene-Solr-Tests-trunk-java7/solr/build/solr-core/test/J1/./org.apache.solr.cloud.SyncSliceTest-1359816869627/jetty3
[junit4:junit4]   2> 17167 T2772 C214 P14607 oasc.SolrDeletionPolicy.onInit SolrDeletionPolicy.onInit: commits:num=1
[junit4:junit4]   2> 		commit{dir=RateLimitedDirectoryWrapper(NRTCachingDirectory(org.apache.lucene.store.NIOFSDirectory@/usr/home/hudson/hudson-slave/workspace/Lucene-Solr-Tests-trunk-java7/solr/build/solr-core/test/J1/org.apache.solr.cloud.SyncSliceTest-1359816869627/jetty3/index.20130203015446740 lockFactory=org.apache.lucene.store.NativeFSLockFactory@56d5e4fe; maxCacheMB=48.0 maxMergeSizeMB=4.0)),segFN=segments_3,generation=3,filenames=[segments_3]
[junit4:junit4]   2> 17167 T2772 C214 P14607 oasc.SolrDeletionPolicy.updateCommits newest commit = 3[segments_3]
[junit4:junit4]   2> 17167 T2772 C214 P14607 oasu.DefaultSolrCoreState.newIndexWriter New IndexWriter is ready to be used.
[junit4:junit4]   2> 17168 T2772 C214 P14607 oasc.CachingDirectoryFactory.close Releasing directory:/usr/home/hudson/hudson-slave/workspace/Lucene-Solr-Tests-trunk-java7/solr/build/solr-core/test/J1/./org.apache.solr.cloud.SyncSliceTest-1359816869627/jetty3
[junit4:junit4]   2> 17168 T2772 C214 P14607 oass.SolrIndexSearcher.<init> Opening Searcher@2935183b main
[junit4:junit4]   2> 17170 T2771 oasc.SolrCore.registerSearcher [collection1] Registered new searcher Searcher@2935183b main{StandardDirectoryReader(segments_3:1:nrt)}
[junit4:junit4]   2> 17170 T2771 oasc.CachingDirectoryFactory.close Releasing directory:/usr/home/hudson/hudson-slave/workspace/Lucene-Solr-Tests-trunk-java7/solr/build/solr-core/test/J1/./org.apache.solr.cloud.SyncSliceTest-1359816869627/jetty3/index
[junit4:junit4]   2> 17171 T2772 C214 P14607 oasu.DirectUpdateHandler2.commit start commit{,optimize=false,openSearcher=false,waitSearcher=false,expungeDeletes=false,softCommit=false}
[junit4:junit4]   2> 17174 T2772 C214 P14607 oasc.SolrDeletionPolicy.onCommit SolrDeletionPolicy.onCommit: commits:num=2
[junit4:junit4]   2> 		commit{dir=RateLimitedDirectoryWrapper(NRTCachingDirectory(org.apache.lucene.store.NIOFSDirectory@/usr/home/hudson/hudson-slave/workspace/Lucene-Solr-Tests-trunk-java7/solr/build/solr-core/test/J1/org.apache.solr.cloud.SyncSliceTest-1359816869627/jetty3/index.20130203015446740 lockFactory=org.apache.lucene.store.NativeFSLockFactory@56d5e4fe; maxCacheMB=48.0 maxMergeSizeMB=4.0)),segFN=segments_3,generation=3,filenames=[segments_3]
[junit4:junit4]   2> 		commit{dir=RateLimitedDirectoryWrapper(NRTCachingDirectory(org.apache.lucene.store.NIOFSDirectory@/usr/home/hudson/hudson-slave/workspace/Lucene-Solr-Tests-trunk-java7/solr/build/solr-core/test/J1/org.apache.solr.cloud.SyncSliceTest-1359816869627/jetty3/index.20130203015446740 lockFactory=org.apache.lucene.store.NativeFSLockFactory@56d5e4fe; maxCacheMB=48.0 maxMergeSizeMB=4.0)),segFN=segments_4,generation=4,filenames=[segments_4]
[junit4:junit4]   2> 17174 T2772 C214 P14607 oasc.SolrDeletionPolicy.updateCommits newest commit = 4[segments_4]
[junit4:junit4]   2> 17175 T2772 C214 P14607 oasc.CachingDirectoryFactory.close Releasing directory:/usr/home/hudson/hudson-slave/workspace/Lucene-Solr-Tests-trunk-java7/solr/build/solr-core/test/J1/./org.apache.solr.cloud.SyncSliceTest-1359816869627/jetty3
[junit4:junit4]   2> 17175 T2772 C214 P14607 oasu.DirectUpdateHandler2.commit end_commit_flush
[junit4:junit4]   2> 17176 T2772 C214 P14607 oasc.CachingDirectoryFactory.close Releasing directory:/usr/home/hudson/hudson-slave/workspace/Lucene-Solr-Tests-trunk-java7/solr/build/solr-core/test/J1/./org.apache.solr.cloud.SyncSliceTest-1359816869627/jetty3/index.20130203015446740
[junit4:junit4]   2> 17176 T2772 C214 P14607 oasc.CachingDirectoryFactory.close Releasing directory:/usr/home/hudson/hudson-slave/workspace/Lucene-Solr-Tests-trunk-java7/solr/build/solr-core/test/J1/./org.apache.solr.cloud.SyncSliceTest-1359816869627/jetty3/index
[junit4:junit4]   2> 17176 T2772 C214 P14607 oasc.RecoveryStrategy.replay No replay needed. core=collection1
[junit4:junit4]   2> 17176 T2772 C214 P14607 oasc.RecoveryStrategy.doRecovery Replication Recovery was successful - registering as Active. core=collection1
[junit4:junit4]   2> 17177 T2772 C214 P14607 oasc.ZkController.publish publishing core=collection1 state=active
[junit4:junit4]   2> 17177 T2772 C214 P14607 oasc.ZkController.publish numShards not found on descriptor - reading it from system property
[junit4:junit4]   2> 17184 T2772 C214 P14607 oasc.RecoveryStrategy.doRecovery Finished recovery process. core=collection1
[junit4:junit4]   2> 17572 T2697 oascc.ZkStateReader.updateClusterState Updating cloud state from ZooKeeper... 
[junit4:junit4]   2> 17726 T2720 oascc.ZkStateReader.updateClusterState Updating cloud state from ZooKeeper... 
[junit4:junit4]   2> 17727 T2720 oasc.Overseer$ClusterStateUpdater.updateState Update state numShards=1 message={
[junit4:junit4]   2> 	  "operation":"state",
[junit4:junit4]   2> 	  "numShards":"1",
[junit4:junit4]   2> 	  "shard":"shard1",
[junit4:junit4]   2> 	  "roles":null,
[junit4:junit4]   2> 	  "state":"active",
[junit4:junit4]   2> 	  "core":"collection1",
[junit4:junit4]   2> 	  "collection":"collection1",
[junit4:junit4]   2> 	  "node_name":"127.0.0.1:14607_h_vtp%2Ft",
[junit4:junit4]   2> 	  "base_url":"http://127.0.0.1:14607/h_vtp/t"}
[junit4:junit4]   2> 17743 T2719 oascc.ZkStateReader$2.process A cluster state change: WatchedEvent state:SyncConnected type:NodeDataChanged path:/clusterstate.json, has occurred - updating... (live nodes size: 5)
[junit4:junit4]   2> 17743 T2785 oascc.ZkStateReader$2.process A cluster state change: WatchedEvent state:SyncConnected type:NodeDataChanged path:/clusterstate.json, has occurred - updating... (live nodes size: 5)
[junit4:junit4]   2> 17743 T2769 oascc.ZkStateReader$2.process A cluster state change: WatchedEvent state:SyncConnected type:NodeDataChanged path:/clusterstate.json, has occurred - updating... (live nodes size: 5)
[junit4:junit4]   2> 17743 T2725 oascc.ZkStateReader$2.process A cluster state change: WatchedEvent state:SyncConnected type:NodeDataChanged path:/clusterstate.json, has occurred - updating... (live nodes size: 5)
[junit4:junit4]   2> 17743 T2753 oascc.ZkStateReader$2.process A cluster state change: WatchedEvent state:SyncConnected type:NodeDataChanged path:/clusterstate.json, has occurred - updating... (live nodes size: 5)
[junit4:junit4]   2> 17743 T2738 oascc.ZkStateReader$2.process A cluster state change: WatchedEvent state:SyncConnected type:NodeDataChanged path:/clusterstate.json, has occurred - updating... (live nodes size: 5)
[junit4:junit4]   2>  C216_STATE=coll:collection1 core:collection1 props:{shard=shard1, roles=null, state=recovering, core=collection1, collection=collection1, node_name=127.0.0.1:26299_h_vtp%2Ft, base_url=http://127.0.0.1:26299/h_vtp/t}
[junit4:junit4]   2> 18569 T2790 C216 P26299 oasc.RecoveryStrategy.doRecovery Attempting to PeerSync from http://127.0.0.1:30878/h_vtp/t/collection1/ core=collection1 - recoveringAfterStartup=true
[junit4:junit4]   2> 18569 T2790 C216 P26299 oasu.PeerSync.sync PeerSync: core=collection1 url=http://127.0.0.1:26299/h_vtp/t START replicas=[http://127.0.0.1:30878/h_vtp/t/collection1/] nUpdates=100
[junit4:junit4]   2> 18571 T2790 C216 P26299 oasu.PeerSync.sync WARNING no frame of reference to tell of we've missed updates
[junit4:junit4]   2> 18571 T2790 C216 P26299 oasc.RecoveryStrategy.doRecovery PeerSync Recovery was not successful - trying replication. core=collection1
[junit4:junit4]   2> 18571 T2790 C216 P26299 oasc.RecoveryStrategy.doRecovery Starting Replication Recovery. core=collection1
[junit4:junit4]   2> 18571 T2790 C216 P26299 oasc.RecoveryStrategy.doRecovery Begin buffering updates. core=collection1
[junit4:junit4]   2> 18571 T2790 C216 P26299 oasu.UpdateLog.bufferUpdates Starting to buffer updates. FSUpdateLog{state=ACTIVE, tlog=null}
[junit4:junit4]   2> 18572 T2790 C216 P26299 oasc.RecoveryStrategy.replicate Attempting to replicate from http://127.0.0.1:30878/h_vtp/t/collection1/. core=collection1
[junit4:junit4]   2> 18572 T2790 C216 P26299 oascsi.HttpClientUtil.createClient Creating new http client, config:maxConnections=128&maxConnectionsPerHost=32&followRedirects=false
[junit4:junit4]   2> 18573 T2730 C215 P30878 REQ /get {getVersions=100&distrib=false&wt=javabin&qt=/get&version=2} status=0 QTime=0 
[junit4:junit4]   2> 18575 T2697 oascc.ZkStateReader.updateClusterState Updating cloud state from ZooKeeper... 
[junit4:junit4]   2> 18587 T2728 C215 P30878 oasu.DirectUpdateHandler2.commit start commit{,optimize=false,openSearcher=false,waitSearcher=true,expungeDeletes=false,softCommit=false}
[junit4:junit4]   2> 18618 T2728 C215 P30878 oasc.SolrDeletionPolicy.onCommit SolrDeletionPolicy.onCommit: commits:num=3
[junit4:junit4]   2> 		commit{dir=RateLimitedDirectoryWrapper(NRTCachingDirectory(org.apache.lucene.store.NIOFSDirectory@/usr/home/hudson/hudson-slave/workspace/Lucene-Solr-Tests-trunk-java7/solr/build/solr-core/test/J1/org.apache.solr.cloud.SyncSliceTest-1359816869627/jetty1/index lockFactory=org.apache.lucene.store.NativeFSLockFactory@5227b13d; maxCacheMB=48.0 maxMergeSizeMB=4.0)),segFN=segments_2,generation=2,filenames=[segments_2]
[junit4:junit4]   2> 		commit{dir=RateLimitedDirectoryWrapper(NRTCachingDirectory(org.apache.lucene.store.NIOFSDirectory@/usr/home/hudson/hudson-slave/workspace/Lucene-Solr-Tests-trunk-java7/solr/build/solr-core/test/J1/org.apache.solr.cloud.SyncSliceTest-1359816869627/jetty1/index lockFactory=org.apache.lucene.store.NativeFSLockFactory@5227b13d; maxCacheMB=48.0 maxMergeSizeMB=4.0)),segFN=segments_3,generation=3,filenames=[segments_3]
[junit4:junit4]   2> 		commit{dir=RateLimitedDirectoryWrapper(NRTCachingDirectory(org.apache.lucene.store.NIOFSDirectory@/usr/home/hudson/hudson-slave/workspace/Lucene-Solr-Tests-trunk-java7/solr/build/solr-core/test/J1/org.apache.solr.cloud.SyncSliceTest-1359816869627/jetty1/index lockFactory=org.apache.lucene.store.NativeFSLockFactory@5227b13d; maxCacheMB=48.0 maxMergeSizeMB=4.0)),segFN=segments_4,generation=4,filenames=[segments_4]
[junit4:junit4]   2> 18618 T2728 C215 P30878 oasc.SolrDeletionPolicy.updateCommits newest commit = 4[segments_4]
[junit4:junit4]   2> 18619 T2728 C215 P30878 oasc.CachingDirectoryFactory.close Releasing directory:/usr/home/hudson/hudson-slave/workspace/Lucene-Solr-Tests-trunk-java7/solr/build/solr-core/test/J1/./org.apache.solr.cloud.SyncSliceTest-1359816869627/jetty1
[junit4:junit4]   2> 18620 T2728 C215 P30878 oasu.DirectUpdateHandler2.commit end_commit_flush
[junit4:junit4]   2> 18620 T2728 C215 P30878 /update {waitSearcher=true&openSearcher=false&commit=true&wt=javabin&commit_end_point=true&version=2&softCommit=false} {commit=} 0 33
[junit4:junit4]   2> 18621 T2790 C216 P26299 oash.ReplicationHandler.inform Commits will be reserved for  10000
[junit4:junit4]   2> 18621 T2790 C216 P26299 oash.SnapPuller.<init>  No value set for 'pollInterval'. Timer Task not started.
[junit4:junit4]   2> 18624 T2732 C215 P30878 REQ /replication {command=indexversion&qt=/replication&wt=javabin&version=2} status=0 QTime=0 
[junit4:junit4]   2> 18625 T2790 C216 P26299 oash.SnapPuller.fetchLatestIndex Master's generation: 4
[junit4:junit4]   2> 18625 T2790 C216 P26299 oash.SnapPuller.fetchLatestIndex Slave's generation: 1
[junit4:junit4]   2> 18625 T2790 C216 P26299 oash.SnapPuller.fetchLatestIndex Starting replication process
[junit4:junit4]   2> 18628 T2732 C215 P30878 oasc.CachingDirectoryFactory.close Releasing directory:/usr/home/hudson/hudson-slave/workspace/Lucene-Solr-Tests-trunk-java7/solr/build/solr-core/test/J1/./org.apache.solr.cloud.SyncSliceTest-1359816869627/jetty1
[junit4:junit4]   2> 18629 T2732 C215 P30878 oasc.CachingDirectoryFactory.close Releasing directory:/usr/home/hudson/hudson-slave/workspace/Lucene-Solr-Tests-trunk-java7/solr/build/solr-core/test/J1/./org.apache.solr.cloud.SyncSliceTest-1359816869627/jetty1/index
[junit4:junit4]   2> 18629 T2732 C215 P30878 REQ /replication {command=filelist&qt=/replication&wt=javabin&generation=4&version=2} status=0 QTime=1 
[junit4:junit4]   2> 18630 T2790 C216 P26299 oash.SnapPuller.fetchLatestIndex Number of files in latest index in master: 1
[junit4:junit4]   2> 18632 T2790 C216 P26299 oasc.CachingDirectoryFactory.get return new directory for /usr/home/hudson/hudson-slave/workspace/Lucene-Solr-Tests-trunk-java7/solr/build/solr-core/test/J1/./org.apache.solr.cloud.SyncSliceTest-1359816869627/jetty4/index.20130203015448251 forceNew:false
[junit4:junit4]   2> 18632 T2790 C216 P26299 oasc.CachingDirectoryFactory.close Releasing directory:/usr/home/hudson/hudson-slave/workspace/Lucene-Solr-Tests-trunk-java7/solr/build/solr-core/test/J1/./org.apache.solr.cloud.SyncSliceTest-1359816869627/jetty4
[junit4:junit4]   2> 18633 T2790 C216 P26299 oash.SnapPuller.fetchLatestIndex Starting download to RateLimitedDirectoryWrapper(NRTCachingDirectory(org.apache.lucene.store.NIOFSDirectory@/usr/home/hudson/hudson-slave/workspace/Lucene-Solr-Tests-trunk-java7/solr/build/solr-core/test/J1/org.apache.solr.cloud.SyncSliceTest-1359816869627/jetty4/index.20130203015448251 lockFactory=org.apache.lucene.store.NativeFSLockFactory@226a54e1; maxCacheMB=48.0 maxMergeSizeMB=4.0)) fullCopy=true
[junit4:junit4]   2> 18637 T2732 C215 P30878 REQ /replication {file=segments_4&command=filecontent&checksum=true&wt=filestream&qt=/replication&generation=4} status=0 QTime=0 
[junit4:junit4]   2> 18639 T2790 C216 P26299 oasc.CachingDirectoryFactory.close Releasing directory:/usr/home/hudson/hudson-slave/workspace/Lucene-Solr-Tests-trunk-java7/solr/build/solr-core/test/J1/./org.apache.solr.cloud.SyncSliceTest-1359816869627/jetty4/index
[junit4:junit4]   2> 18640 T2790 C216 P26299 oash.SnapPuller.fetchLatestIndex Total time taken for download : 0 secs
[junit4:junit4]   2> 18640 T2790 C216 P26299 oash.SnapPuller.modifyIndexProps New index installed. Updating index properties... index=index.20130203015448251
[junit4:junit4]   2> 18641 T2790 C216 P26299 oasc.CachingDirectoryFactory.close Releasing directory:/usr/home/hudson/hudson-slave/workspace/Lucene-Solr-Tests-trunk-java7/solr/build/solr-core/test/J1/./org.apache.solr.cloud.SyncSliceTest-1359816869627/jetty4
[junit4:junit4]   2> 18642 T2790 C216 P26299 oasc.CachingDirectoryFactory.close Releasing directory:/usr/home/hudson/hudson-slave/workspace/Lucene-Solr-Tests-trunk-java7/solr/build/solr-core/test/J1/./org.apache.solr.cloud.SyncSliceTest-1359816869627/jetty4
[junit4:junit4]   2> 18642 T2790 C216 P26299 oasc.SolrCore.getNewIndexDir New index directory detected: old=./org.apache.solr.cloud.SyncSliceTest-1359816869627/jetty4/index/ new=./org.apache.solr.cloud.SyncSliceTest-1359816869627/jetty4/index.20130203015448251
[junit4:junit4]   2> 18646 T2790 C216 P26299 oasc.SolrDeletionPolicy.onInit SolrDeletionPolicy.onInit: commits:num=1
[junit4:junit4]   2> 		commit{dir=RateLimitedDirectoryWrapper(NRTCachingDirectory(org.apache.lucene.store.NIOFSDirectory@/usr/home/hudson/hudson-slave/workspace/Lucene-Solr-Tests-trunk-java7/solr/build/solr-core/test/J1/org.apache.solr.cloud.SyncSliceTest-1359816869627/jetty4/index.20130203015448251 lockFactory=org.apache.lucene.store.NativeFSLockFactory@226a54e1; maxCacheMB=48.0 maxMergeSizeMB=4.0)),segFN=segments_4,generation=4,filenames=[segments_4]
[junit4:junit4]   2> 18646 T2790 C216 P26299 oasc.SolrDeletionPolicy.updateCommits newest commit = 4[segments_4]
[junit4:junit4]   2> 18648 T2790 C216 P26299 oasc.CachingDirectoryFactory.close Releasing directory:/usr/home/hudson/hudson-slave/workspace/Lucene-Solr-Tests-trunk-java7/solr/build/solr-core/test/J1/./org.apache.solr.cloud.SyncSliceTest-1359816869627/jetty4
[junit4:junit4]   2> 18648 T2790 C216 P26299 oasu.DefaultSolrCoreState.newIndexWriter Creating new IndexWriter...
[junit4:junit4]   2> 18648 T2790 C216 P26299 oasu.DefaultSolrCoreState.newIndexWriter Waiting until IndexWriter is unused... core=collection1
[junit4:junit4]   2> 18648 T2790 C216 P26299 oasu.DefaultSolrCoreState.newIndexWriter Rollback old IndexWriter... core=collection1
[junit4:junit4]   2> 18649 T2790 C216 P26299 oasc.CachingDirectoryFactory.

[...truncated too long message...]

 > 	at org.junit.Assert.fail(Assert.java:93)
[junit4:junit4]    > 	at org.junit.Assert.assertTrue(Assert.java:43)
[junit4:junit4]    > 	at org.junit.Assert.assertNotNull(Assert.java:526)
[junit4:junit4]    > 	at org.apache.solr.cloud.SyncSliceTest.doTest(SyncSliceTest.java:214)
[junit4:junit4]    > 	at org.apache.solr.BaseDistributedSearchTestCase.testDistribSearch(BaseDistributedSearchTestCase.java:794)
[junit4:junit4]    > 	at sun.reflect.NativeMethodAccessorImpl.invoke0(Native Method)
[junit4:junit4]    > 	at sun.reflect.NativeMethodAccessorImpl.invoke(NativeMethodAccessorImpl.java:57)
[junit4:junit4]    > 	at sun.reflect.DelegatingMethodAccessorImpl.invoke(DelegatingMethodAccessorImpl.java:43)
[junit4:junit4]    > 	at java.lang.reflect.Method.invoke(Method.java:601)
[junit4:junit4]    > 	at com.carrotsearch.randomizedtesting.RandomizedRunner.invoke(RandomizedRunner.java:1559)
[junit4:junit4]    > 	at com.carrotsearch.randomizedtesting.RandomizedRunner.access$600(RandomizedRunner.java:79)
[junit4:junit4]    > 	at com.carrotsearch.randomizedtesting.RandomizedRunner$6.evaluate(RandomizedRunner.java:737)
[junit4:junit4]    > 	at com.carrotsearch.randomizedtesting.RandomizedRunner$7.evaluate(RandomizedRunner.java:773)
[junit4:junit4]    > 	at com.carrotsearch.randomizedtesting.RandomizedRunner$8.evaluate(RandomizedRunner.java:787)
[junit4:junit4]    > 	at com.carrotsearch.randomizedtesting.rules.SystemPropertiesRestoreRule$1.evaluate(SystemPropertiesRestoreRule.java:53)
[junit4:junit4]    > 	at org.apache.lucene.util.TestRuleSetupTeardownChained$1.evaluate(TestRuleSetupTeardownChained.java:50)
[junit4:junit4]    > 	at org.apache.lucene.util.TestRuleFieldCacheSanity$1.evaluate(TestRuleFieldCacheSanity.java:51)
[junit4:junit4]    > 	at org.apache.lucene.util.AbstractBeforeAfterRule$1.evaluate(AbstractBeforeAfterRule.java:46)
[junit4:junit4]    > 	at com.carrotsearch.randomizedtesting.rules.SystemPropertiesInvariantRule$1.evaluate(SystemPropertiesInvariantRule.java:55)
[junit4:junit4]    > 	at org.apache.lucene.util.TestRuleThreadAndTestName$1.evaluate(TestRuleThreadAndTestName.java:49)
[junit4:junit4]    > 	at org.apache.lucene.util.TestRuleIgnoreAfterMaxFailures$1.evaluate(TestRuleIgnoreAfterMaxFailures.java:70)
[junit4:junit4]    > 	at org.apache.lucene.util.TestRuleMarkFailure$1.evaluate(TestRuleMarkFailure.java:48)
[junit4:junit4]    > 	at com.carrotsearch.randomizedtesting.rules.StatementAdapter.evaluate(StatementAdapter.java:36)
[junit4:junit4]    > 	at com.carrotsearch.randomizedtesting.ThreadLeakControl$StatementRunner.run(ThreadLeakControl.java:358)
[junit4:junit4]    > 	at com.carrotsearch.randomizedtesting.ThreadLeakControl.forkTimeoutingTask(ThreadLeakControl.java:782)
[junit4:junit4]    > 	at com.carrotsearch.randomizedtesting.ThreadLeakControl$3.evaluate(ThreadLeakControl.java:442)
[junit4:junit4]    > 	at com.carrotsearch.randomizedtesting.RandomizedRunner.runSingleTest(RandomizedRunner.java:746)
[junit4:junit4]    > 	at com.carrotsearch.randomizedtesting.RandomizedRunner$3.evaluate(RandomizedRunner.java:648)
[junit4:junit4]    > 	at com.carrotsearch.randomizedtesting.RandomizedRunner$4.evaluate(RandomizedRunner.java:682)
[junit4:junit4]    > 	at com.carrotsearch.randomizedtesting.RandomizedRunner$5.evaluate(RandomizedRunner.java:693)
[junit4:junit4]    > 	at com.carrotsearch.randomizedtesting.rules.StatementAdapter.evaluate(StatementAdapter.java:36)
[junit4:junit4]    > 	at com.carrotsearch.randomizedtesting.rules.SystemPropertiesRestoreRule$1.evaluate(SystemPropertiesRestoreRule.java:53)
[junit4:junit4]    > 	at org.apache.lucene.util.AbstractBeforeAfterRule$1.evaluate(AbstractBeforeAfterRule.java:46)
[junit4:junit4]    > 	at org.apache.lucene.util.TestRuleStoreClassName$1.evaluate(TestRuleStoreClassName.java:42)
[junit4:junit4]    > 	at com.carrotsearch.randomizedtesting.rules.SystemPropertiesInvariantRule$1.evaluate(SystemPropertiesInvariantRule.java:55)
[junit4:junit4]    > 	at com.carrotsearch.randomizedtesting.rules.NoShadowingOrOverridesOnMethodsRule$1.evaluate(NoShadowingOrOverridesOnMethodsRule.java:39)
[junit4:junit4]    > 	at com.carrotsearch.randomizedtesting.rules.NoShadowingOrOverridesOnMethodsRule$1.evaluate(NoShadowingOrOverridesOnMethodsRule.java:39)
[junit4:junit4]    > 	at com.carrotsearch.randomizedtesting.rules.StatementAdapter.evaluate(StatementAdapter.java:36)
[junit4:junit4]    > 	at org.apache.lucene.util.TestRuleAssertionsRequired$1.evaluate(TestRuleAssertionsRequired.java:43)
[junit4:junit4]    > 	at org.apache.lucene.util.TestRuleMarkFailure$1.evaluate(TestRuleMarkFailure.java:48)
[junit4:junit4]    > 	at org.apache.lucene.util.TestRuleIgnoreAfterMaxFailures$1.evaluate(TestRuleIgnoreAfterMaxFailures.java:70)
[junit4:junit4]    > 	at org.apache.lucene.util.TestRuleIgnoreTestSuites$1.evaluate(TestRuleIgnoreTestSuites.java:55)
[junit4:junit4]    > 	at com.carrotsearch.randomizedtesting.rules.StatementAdapter.evaluate(StatementAdapter.java:36)
[junit4:junit4]    > 	at com.carrotsearch.randomizedtesting.ThreadLeakControl$StatementRunner.run(ThreadLeakControl.java:358)
[junit4:junit4]    > 	at java.lang.Thread.run(Thread.java:722)
[junit4:junit4]   2> 145466 T2697 oas.SolrTestCaseJ4.deleteCore ###deleteCore
[junit4:junit4]   2> NOTE: test params are: codec=Lucene42: {range_facet_l=MockVariableIntBlock(baseBlockSize=85), text=PostingsFormat(name=Lucene41WithOrds), _version_=MockVariableIntBlock(baseBlockSize=85), rnd_b=PostingsFormat(name=TestBloomFilteredLucene41Postings), intDefault=MockVariableIntBlock(baseBlockSize=85), timestamp=MockVariableIntBlock(baseBlockSize=85), id=PostingsFormat(name=TestBloomFilteredLucene41Postings), a_t=MockVariableIntBlock(baseBlockSize=85), range_facet_sl=PostingsFormat(name=Lucene41WithOrds), range_facet_si=PostingsFormat(name=Asserting), other_tl1=MockVariableIntBlock(baseBlockSize=85), multiDefault=PostingsFormat(name=Asserting), a_si=PostingsFormat(name=Asserting)}, sim=DefaultSimilarity, locale=vi, timezone=Australia/Sydney
[junit4:junit4]   2> NOTE: FreeBSD 9.0-RELEASE amd64/Oracle Corporation 1.7.0_09 (64-bit)/cpus=16,threads=2,free=255532880,total=534773760
[junit4:junit4]   2> NOTE: All tests run in this JVM: [TestDFRSimilarityFactory, TestCodecSupport, TestTrie, OutputWriterTest, TestRemoteStreaming, TestDistributedGrouping, TestRealTimeGet, ConvertedLegacyTest, SchemaVersionSpecificBehaviorTest, TestArbitraryIndexDir, RegexBoostProcessorTest, DOMUtilTest, BasicZkTest, SynonymTokenizerTest, TestMultiCoreConfBootstrap, SuggesterTSTTest, BadIndexSchemaTest, DocumentAnalysisRequestHandlerTest, TestDocSet, TestPropInject, TestSolrJ, QueryEqualityTest, ShardRoutingTest, PolyFieldTest, FileUtilsTest, DirectSolrSpellCheckerTest, IndexSchemaTest, EchoParamsTest, TestStressLucene, TestSolrDeletionPolicy1, TestLRUCache, TestWriterPerf, UUIDFieldTest, BasicFunctionalityTest, ClusterStateTest, XsltUpdateRequestHandlerTest, RequiredFieldsTest, DirectUpdateHandlerTest, TermVectorComponentTest, DistributedQueryElevationComponentTest, StandardRequestHandlerTest, ShowFileRequestHandlerTest, PrimitiveFieldTypeTest, TestReplicationHandler, TestRTGBase, TestJmxIntegration, SoftAutoCommitTest, PathHierarchyTokenizerFactoryTest, ShardRoutingCustomTest, PrimUtilsTest, TestSolrDeletionPolicy2, TestUpdate, LegacyHTMLStripCharFilterTest, TestCSVResponseWriter, TermVectorComponentDistributedTest, TestStressReorder, TestOmitPositions, HighlighterTest, LukeRequestHandlerTest, TestSurroundQueryParser, BasicDistributedZkTest, ZkSolrClientTest, TestHashPartitioner, StatsComponentTest, TestRecovery, SolrCoreTest, TestRangeQuery, SimpleFacetsTest, TestCoreContainer, TestSort, TestGroupingSearch, PeerSyncTest, SignatureUpdateProcessorFactoryTest, SampleTest, CoreAdminHandlerTest, TestFunctionQuery, TestCSVLoader, MBeansHandlerTest, DisMaxRequestHandlerTest, QueryParsingTest, MinimalSchemaTest, XmlUpdateRequestHandlerTest, JsonLoaderTest, IndexSchemaRuntimeFieldTest, TestValueSourceCache, TestReversedWildcardFilterFactory, DebugComponentTest, ReturnFieldsTest, SearchHandlerTest, TestQueryUtils, UpdateParamsTest, CSVRequestHandlerTest, TestSearchPerf, AlternateDirectoryTest, FieldMutatingUpdateProcessorTest, TestPropInjectDefaults, TestXIncludeConfig, TestQuerySenderListener, SolrIndexConfigTest, NumericFieldsTest, TestSolrCoreProperties, TestPhraseSuggestions, TestPluginEnable, TestLMJelinekMercerSimilarityFactory, TimeZoneUtilsTest, DateMathParserTest, PluginInfoTest, OpenExchangeRatesOrgProviderTest, TestSolrXMLSerializer, TestSuggestSpellingConverter, ChaosMonkeySafeLeaderTest, SystemInfoHandlerTest, ChaosMonkeyNothingIsSafeTest, TestDocumentBuilder, ClusterStateUpdateTest, CollectionsAPIDistributedZkTest, OverseerCollectionProcessorTest, SyncSliceTest]
[junit4:junit4] Completed on J1 in 145.49s, 1 test, 1 failure <<< FAILURES!

[...truncated 10 lines...]
BUILD FAILED
/usr/home/hudson/hudson-slave/workspace/Lucene-Solr-Tests-trunk-java7/build.xml:346: The following error occurred while executing this line:
/usr/home/hudson/hudson-slave/workspace/Lucene-Solr-Tests-trunk-java7/build.xml:39: The following error occurred while executing this line:
/usr/home/hudson/hudson-slave/workspace/Lucene-Solr-Tests-trunk-java7/solr/build.xml:178: The following error occurred while executing this line:
/usr/home/hudson/hudson-slave/workspace/Lucene-Solr-Tests-trunk-java7/solr/common-build.xml:428: The following error occurred while executing this line:
/usr/home/hudson/hudson-slave/workspace/Lucene-Solr-Tests-trunk-java7/lucene/common-build.xml:1176: The following error occurred while executing this line:
/usr/home/hudson/hudson-slave/workspace/Lucene-Solr-Tests-trunk-java7/lucene/common-build.xml:841: There were test failures: 249 suites, 1038 tests, 1 failure, 23 ignored (5 assumptions)

Total time: 41 minutes 49 seconds
Build step 'Invoke Ant' marked build as failure
Archiving artifacts
Recording test results
Email was triggered for: Failure
Sending email for trigger: Failure



Mime
View raw message