lucene-dev mailing list archives

Site index · List index
Message view « Date » · « Thread »
Top « Date » · « Thread »
From Policeman Jenkins Server <jenk...@thetaphi.de>
Subject [JENKINS] Lucene-Solr-4.x-MacOSX (64bit/jdk1.7.0) - Build # 197 - Failure!
Date Mon, 11 Feb 2013 03:41:13 GMT
Build: http://jenkins.thetaphi.de/job/Lucene-Solr-4.x-MacOSX/197/
Java: 64bit/jdk1.7.0 -XX:+UseConcMarkSweepGC

1 tests failed.
REGRESSION:  org.apache.solr.cloud.BasicDistributedZkTest.testDistribSearch

Error Message:
There are still nodes recoverying - waited for 230 seconds

Stack Trace:
java.lang.AssertionError: There are still nodes recoverying - waited for 230 seconds
	at __randomizedtesting.SeedInfo.seed([7D9AEE8DEABAC638:FC7C60959DE5A604]:0)
	at org.junit.Assert.fail(Assert.java:93)
	at org.apache.solr.cloud.AbstractDistribZkTestBase.waitForRecoveriesToFinish(AbstractDistribZkTestBase.java:168)
	at org.apache.solr.cloud.AbstractDistribZkTestBase.waitForRecoveriesToFinish(AbstractDistribZkTestBase.java:126)
	at org.apache.solr.cloud.AbstractDistribZkTestBase.waitForRecoveriesToFinish(AbstractDistribZkTestBase.java:121)
	at org.apache.solr.cloud.BasicDistributedZkTest.testCoreUnloadAndLeaders(BasicDistributedZkTest.java:599)
	at org.apache.solr.cloud.BasicDistributedZkTest.doTest(BasicDistributedZkTest.java:337)
	at org.apache.solr.BaseDistributedSearchTestCase.testDistribSearch(BaseDistributedSearchTestCase.java:794)
	at sun.reflect.NativeMethodAccessorImpl.invoke0(Native Method)
	at sun.reflect.NativeMethodAccessorImpl.invoke(NativeMethodAccessorImpl.java:57)
	at sun.reflect.DelegatingMethodAccessorImpl.invoke(DelegatingMethodAccessorImpl.java:43)
	at java.lang.reflect.Method.invoke(Method.java:601)
	at com.carrotsearch.randomizedtesting.RandomizedRunner.invoke(RandomizedRunner.java:1559)
	at com.carrotsearch.randomizedtesting.RandomizedRunner.access$600(RandomizedRunner.java:79)
	at com.carrotsearch.randomizedtesting.RandomizedRunner$6.evaluate(RandomizedRunner.java:737)
	at com.carrotsearch.randomizedtesting.RandomizedRunner$7.evaluate(RandomizedRunner.java:773)
	at com.carrotsearch.randomizedtesting.RandomizedRunner$8.evaluate(RandomizedRunner.java:787)
	at com.carrotsearch.randomizedtesting.rules.SystemPropertiesRestoreRule$1.evaluate(SystemPropertiesRestoreRule.java:53)
	at org.apache.lucene.util.TestRuleSetupTeardownChained$1.evaluate(TestRuleSetupTeardownChained.java:50)
	at org.apache.lucene.util.TestRuleFieldCacheSanity$1.evaluate(TestRuleFieldCacheSanity.java:51)
	at org.apache.lucene.util.AbstractBeforeAfterRule$1.evaluate(AbstractBeforeAfterRule.java:46)
	at com.carrotsearch.randomizedtesting.rules.SystemPropertiesInvariantRule$1.evaluate(SystemPropertiesInvariantRule.java:55)
	at org.apache.lucene.util.TestRuleThreadAndTestName$1.evaluate(TestRuleThreadAndTestName.java:49)
	at org.apache.lucene.util.TestRuleIgnoreAfterMaxFailures$1.evaluate(TestRuleIgnoreAfterMaxFailures.java:70)
	at org.apache.lucene.util.TestRuleMarkFailure$1.evaluate(TestRuleMarkFailure.java:48)
	at com.carrotsearch.randomizedtesting.rules.StatementAdapter.evaluate(StatementAdapter.java:36)
	at com.carrotsearch.randomizedtesting.ThreadLeakControl$StatementRunner.run(ThreadLeakControl.java:358)
	at com.carrotsearch.randomizedtesting.ThreadLeakControl.forkTimeoutingTask(ThreadLeakControl.java:782)
	at com.carrotsearch.randomizedtesting.ThreadLeakControl$3.evaluate(ThreadLeakControl.java:442)
	at com.carrotsearch.randomizedtesting.RandomizedRunner.runSingleTest(RandomizedRunner.java:746)
	at com.carrotsearch.randomizedtesting.RandomizedRunner$3.evaluate(RandomizedRunner.java:648)
	at com.carrotsearch.randomizedtesting.RandomizedRunner$4.evaluate(RandomizedRunner.java:682)
	at com.carrotsearch.randomizedtesting.RandomizedRunner$5.evaluate(RandomizedRunner.java:693)
	at com.carrotsearch.randomizedtesting.rules.StatementAdapter.evaluate(StatementAdapter.java:36)
	at com.carrotsearch.randomizedtesting.rules.SystemPropertiesRestoreRule$1.evaluate(SystemPropertiesRestoreRule.java:53)
	at org.apache.lucene.util.AbstractBeforeAfterRule$1.evaluate(AbstractBeforeAfterRule.java:46)
	at org.apache.lucene.util.TestRuleStoreClassName$1.evaluate(TestRuleStoreClassName.java:42)
	at com.carrotsearch.randomizedtesting.rules.SystemPropertiesInvariantRule$1.evaluate(SystemPropertiesInvariantRule.java:55)
	at com.carrotsearch.randomizedtesting.rules.NoShadowingOrOverridesOnMethodsRule$1.evaluate(NoShadowingOrOverridesOnMethodsRule.java:39)
	at com.carrotsearch.randomizedtesting.rules.NoShadowingOrOverridesOnMethodsRule$1.evaluate(NoShadowingOrOverridesOnMethodsRule.java:39)
	at com.carrotsearch.randomizedtesting.rules.StatementAdapter.evaluate(StatementAdapter.java:36)
	at org.apache.lucene.util.TestRuleAssertionsRequired$1.evaluate(TestRuleAssertionsRequired.java:43)
	at org.apache.lucene.util.TestRuleMarkFailure$1.evaluate(TestRuleMarkFailure.java:48)
	at org.apache.lucene.util.TestRuleIgnoreAfterMaxFailures$1.evaluate(TestRuleIgnoreAfterMaxFailures.java:70)
	at org.apache.lucene.util.TestRuleIgnoreTestSuites$1.evaluate(TestRuleIgnoreTestSuites.java:55)
	at com.carrotsearch.randomizedtesting.rules.StatementAdapter.evaluate(StatementAdapter.java:36)
	at com.carrotsearch.randomizedtesting.ThreadLeakControl$StatementRunner.run(ThreadLeakControl.java:358)
	at java.lang.Thread.run(Thread.java:722)




Build Log:
[...truncated 8957 lines...]
[junit4:junit4] Suite: org.apache.solr.cloud.BasicDistributedZkTest
[junit4:junit4]   2> 0 T2758 oas.BaseDistributedSearchTestCase.initHostContext Setting hostContext system property: /
[junit4:junit4]   2> 11 T2758 oas.SolrTestCaseJ4.setUp ###Starting testDistribSearch
[junit4:junit4]   2> Creating dataDir: /Users/jenkins/jenkins-slave/workspace/Lucene-Solr-4.x-MacOSX/solr/build/solr-core/test/J0/./solrtest-BasicDistributedZkTest-1360552043848
[junit4:junit4]   2> 13 T2758 oasc.ZkTestServer.run STARTING ZK TEST SERVER
[junit4:junit4]   2> 14 T2759 oasc.ZkTestServer$ZKServerMain.runFromConfig Starting server
[junit4:junit4]   2> 16 T2759 oazs.ZooKeeperServer.setTickTime tickTime set to 1000
[junit4:junit4]   2> 16 T2759 oazs.ZooKeeperServer.setMinSessionTimeout minSessionTimeout set to -1
[junit4:junit4]   2> 16 T2759 oazs.ZooKeeperServer.setMaxSessionTimeout maxSessionTimeout set to -1
[junit4:junit4]   2> 17 T2759 oazs.NIOServerCnxnFactory.configure binding to port 0.0.0.0/0.0.0.0:0
[junit4:junit4]   2> 18 T2759 oazsp.FileTxnSnapLog.save Snapshotting: 0x0 to /Users/jenkins/jenkins-slave/workspace/Lucene-Solr-4.x-MacOSX/solr/build/solr-core/test/J0/./org.apache.solr.cloud.BasicDistributedZkTest-1360552043848/zookeeper/server1/data/version-2/snapshot.0
[junit4:junit4]   2> 115 T2758 oasc.ZkTestServer.run start zk server on port:51794
[junit4:junit4]   2> 116 T2758 oaz.ZooKeeper.<init> Initiating client connection, connectString=127.0.0.1:51794 sessionTimeout=10000 watcher=org.apache.solr.common.cloud.ConnectionManager@3b5d4d97
[junit4:junit4]   2> 117 T2758 oascc.ConnectionManager.waitForConnected Waiting for client to connect to ZooKeeper
[junit4:junit4]   2> 118 T2764 oaz.ClientCnxn$SendThread.logStartConnect Opening socket connection to server localhost/127.0.0.1:51794. Will not attempt to authenticate using SASL (access denied ("javax.security.auth.AuthPermission" "getLoginConfiguration"))
[junit4:junit4]   2> 118 T2764 oaz.ClientCnxn$SendThread.primeConnection Socket connection established to localhost/127.0.0.1:51794, initiating session
[junit4:junit4]   2> 119 T2760 oazs.NIOServerCnxnFactory.run Accepted socket connection from /127.0.0.1:51795
[junit4:junit4]   2> 120 T2760 oazs.ZooKeeperServer.processConnectRequest Client attempting to establish new session at /127.0.0.1:51795
[junit4:junit4]   2> 121 T2762 oazsp.FileTxnLog.append Creating new log file: log.1
[junit4:junit4]   2> 124 T2762 oazs.ZooKeeperServer.finishSessionInit Established session 0x13cc738a5500000 with negotiated timeout 10000 for client /127.0.0.1:51795
[junit4:junit4]   2> 124 T2764 oaz.ClientCnxn$SendThread.onConnected Session establishment complete on server localhost/127.0.0.1:51794, sessionid = 0x13cc738a5500000, negotiated timeout = 10000
[junit4:junit4]   2> 125 T2765 oascc.ConnectionManager.process Watcher org.apache.solr.common.cloud.ConnectionManager@3b5d4d97 name:ZooKeeperConnection Watcher:127.0.0.1:51794 got event WatchedEvent state:SyncConnected type:None path:null path:null type:None
[junit4:junit4]   2> 126 T2758 oascc.ConnectionManager.waitForConnected Client is connected to ZooKeeper
[junit4:junit4]   2> 126 T2758 oascc.SolrZkClient.makePath makePath: /solr
[junit4:junit4]   2> 131 T2763 oazs.PrepRequestProcessor.pRequest2Txn Processed session termination for sessionid: 0x13cc738a5500000
[junit4:junit4]   2> 132 T2765 oaz.ClientCnxn$EventThread.run EventThread shut down
[junit4:junit4]   2> 132 T2758 oaz.ZooKeeper.close Session: 0x13cc738a5500000 closed
[junit4:junit4]   2> 133 T2760 oazs.NIOServerCnxn.closeSock Closed socket connection for client /127.0.0.1:51795 which had sessionid 0x13cc738a5500000
[junit4:junit4]   2> 134 T2758 oaz.ZooKeeper.<init> Initiating client connection, connectString=127.0.0.1:51794/solr sessionTimeout=10000 watcher=org.apache.solr.common.cloud.ConnectionManager@5380136e
[junit4:junit4]   2> 135 T2758 oascc.ConnectionManager.waitForConnected Waiting for client to connect to ZooKeeper
[junit4:junit4]   2> 135 T2766 oaz.ClientCnxn$SendThread.logStartConnect Opening socket connection to server localhost/127.0.0.1:51794. Will not attempt to authenticate using SASL (access denied ("javax.security.auth.AuthPermission" "getLoginConfiguration"))
[junit4:junit4]   2> 136 T2766 oaz.ClientCnxn$SendThread.primeConnection Socket connection established to localhost/127.0.0.1:51794, initiating session
[junit4:junit4]   2> 137 T2760 oazs.NIOServerCnxnFactory.run Accepted socket connection from /127.0.0.1:51796
[junit4:junit4]   2> 137 T2760 oazs.ZooKeeperServer.processConnectRequest Client attempting to establish new session at /127.0.0.1:51796
[junit4:junit4]   2> 139 T2762 oazs.ZooKeeperServer.finishSessionInit Established session 0x13cc738a5500001 with negotiated timeout 10000 for client /127.0.0.1:51796
[junit4:junit4]   2> 139 T2766 oaz.ClientCnxn$SendThread.onConnected Session establishment complete on server localhost/127.0.0.1:51794, sessionid = 0x13cc738a5500001, negotiated timeout = 10000
[junit4:junit4]   2> 140 T2767 oascc.ConnectionManager.process Watcher org.apache.solr.common.cloud.ConnectionManager@5380136e name:ZooKeeperConnection Watcher:127.0.0.1:51794/solr got event WatchedEvent state:SyncConnected type:None path:null path:null type:None
[junit4:junit4]   2> 140 T2758 oascc.ConnectionManager.waitForConnected Client is connected to ZooKeeper
[junit4:junit4]   2> 141 T2758 oascc.SolrZkClient.makePath makePath: /collections/collection1
[junit4:junit4]   2> 146 T2758 oascc.SolrZkClient.makePath makePath: /collections/collection1/shards
[junit4:junit4]   2> 151 T2758 oascc.SolrZkClient.makePath makePath: /collections/control_collection
[junit4:junit4]   2> 156 T2758 oascc.SolrZkClient.makePath makePath: /collections/control_collection/shards
[junit4:junit4]   2> 161 T2758 oasc.AbstractZkTestCase.putConfig put /Users/jenkins/jenkins-slave/workspace/Lucene-Solr-4.x-MacOSX/solr/build/solr-core/test-files/solr/collection1/conf/solrconfig.xml to /configs/conf1/solrconfig.xml
[junit4:junit4]   2> 162 T2758 oascc.SolrZkClient.makePath makePath: /configs/conf1/solrconfig.xml
[junit4:junit4]   2> 170 T2758 oasc.AbstractZkTestCase.putConfig put /Users/jenkins/jenkins-slave/workspace/Lucene-Solr-4.x-MacOSX/solr/build/solr-core/test-files/solr/collection1/conf/schema.xml to /configs/conf1/schema.xml
[junit4:junit4]   2> 171 T2758 oascc.SolrZkClient.makePath makePath: /configs/conf1/schema.xml
[junit4:junit4]   2> 177 T2758 oasc.AbstractZkTestCase.putConfig put /Users/jenkins/jenkins-slave/workspace/Lucene-Solr-4.x-MacOSX/solr/build/solr-core/test-files/solr/collection1/conf/stopwords.txt to /configs/conf1/stopwords.txt
[junit4:junit4]   2> 178 T2758 oascc.SolrZkClient.makePath makePath: /configs/conf1/stopwords.txt
[junit4:junit4]   2> 183 T2758 oasc.AbstractZkTestCase.putConfig put /Users/jenkins/jenkins-slave/workspace/Lucene-Solr-4.x-MacOSX/solr/build/solr-core/test-files/solr/collection1/conf/protwords.txt to /configs/conf1/protwords.txt
[junit4:junit4]   2> 184 T2758 oascc.SolrZkClient.makePath makePath: /configs/conf1/protwords.txt
[junit4:junit4]   2> 189 T2758 oasc.AbstractZkTestCase.putConfig put /Users/jenkins/jenkins-slave/workspace/Lucene-Solr-4.x-MacOSX/solr/build/solr-core/test-files/solr/collection1/conf/currency.xml to /configs/conf1/currency.xml
[junit4:junit4]   2> 189 T2758 oascc.SolrZkClient.makePath makePath: /configs/conf1/currency.xml
[junit4:junit4]   2> 195 T2758 oasc.AbstractZkTestCase.putConfig put /Users/jenkins/jenkins-slave/workspace/Lucene-Solr-4.x-MacOSX/solr/build/solr-core/test-files/solr/collection1/conf/open-exchange-rates.json to /configs/conf1/open-exchange-rates.json
[junit4:junit4]   2> 195 T2758 oascc.SolrZkClient.makePath makePath: /configs/conf1/open-exchange-rates.json
[junit4:junit4]   2> 200 T2758 oasc.AbstractZkTestCase.putConfig put /Users/jenkins/jenkins-slave/workspace/Lucene-Solr-4.x-MacOSX/solr/build/solr-core/test-files/solr/collection1/conf/mapping-ISOLatin1Accent.txt to /configs/conf1/mapping-ISOLatin1Accent.txt
[junit4:junit4]   2> 201 T2758 oascc.SolrZkClient.makePath makePath: /configs/conf1/mapping-ISOLatin1Accent.txt
[junit4:junit4]   2> 206 T2758 oasc.AbstractZkTestCase.putConfig put /Users/jenkins/jenkins-slave/workspace/Lucene-Solr-4.x-MacOSX/solr/build/solr-core/test-files/solr/collection1/conf/old_synonyms.txt to /configs/conf1/old_synonyms.txt
[junit4:junit4]   2> 207 T2758 oascc.SolrZkClient.makePath makePath: /configs/conf1/old_synonyms.txt
[junit4:junit4]   2> 212 T2758 oasc.AbstractZkTestCase.putConfig put /Users/jenkins/jenkins-slave/workspace/Lucene-Solr-4.x-MacOSX/solr/build/solr-core/test-files/solr/collection1/conf/synonyms.txt to /configs/conf1/synonyms.txt
[junit4:junit4]   2> 212 T2758 oascc.SolrZkClient.makePath makePath: /configs/conf1/synonyms.txt
[junit4:junit4]   2> 218 T2763 oazs.PrepRequestProcessor.pRequest2Txn Processed session termination for sessionid: 0x13cc738a5500001
[junit4:junit4]   2> 220 T2760 oazs.NIOServerCnxn.closeSock Closed socket connection for client /127.0.0.1:51796 which had sessionid 0x13cc738a5500001
[junit4:junit4]   2> 220 T2767 oaz.ClientCnxn$EventThread.run EventThread shut down
[junit4:junit4]   2> 220 T2758 oaz.ZooKeeper.close Session: 0x13cc738a5500001 closed
[junit4:junit4]   2> 424 T2758 oejs.Server.doStart jetty-8.1.8.v20121106
[junit4:junit4]   2> 432 T2758 oejs.AbstractConnector.doStart Started SelectChannelConnector@127.0.0.1:51797
[junit4:junit4]   2> 434 T2758 oass.SolrDispatchFilter.init SolrDispatchFilter.init()
[junit4:junit4]   2> 435 T2758 oasc.SolrResourceLoader.locateSolrHome JNDI not configured for solr (NoInitialContextEx)
[junit4:junit4]   2> 435 T2758 oasc.SolrResourceLoader.locateSolrHome using system property solr.solr.home: /Users/jenkins/jenkins-slave/workspace/Lucene-Solr-4.x-MacOSX/solr/build/solr-core/test/J0/./org.apache.solr.cloud.BasicDistributedZkTest-controljetty-1360552044058
[junit4:junit4]   2> 436 T2758 oasc.CoreContainer$Initializer.initialize looking for solr.xml: /Users/jenkins/jenkins-slave/workspace/Lucene-Solr-4.x-MacOSX/solr/build/solr-core/test/J0/./org.apache.solr.cloud.BasicDistributedZkTest-controljetty-1360552044058/solr.xml
[junit4:junit4]   2> 437 T2758 oasc.CoreContainer.<init> New CoreContainer 1631541561
[junit4:junit4]   2> 437 T2758 oasc.CoreContainer.load Loading CoreContainer using Solr Home: '/Users/jenkins/jenkins-slave/workspace/Lucene-Solr-4.x-MacOSX/solr/build/solr-core/test/J0/./org.apache.solr.cloud.BasicDistributedZkTest-controljetty-1360552044058/'
[junit4:junit4]   2> 438 T2758 oasc.SolrResourceLoader.<init> new SolrResourceLoader for directory: '/Users/jenkins/jenkins-slave/workspace/Lucene-Solr-4.x-MacOSX/solr/build/solr-core/test/J0/./org.apache.solr.cloud.BasicDistributedZkTest-controljetty-1360552044058/'
[junit4:junit4]   2> 493 T2758 oashc.HttpShardHandlerFactory.getParameter Setting socketTimeout to: 60000
[junit4:junit4]   2> 494 T2758 oashc.HttpShardHandlerFactory.getParameter Setting urlScheme to: http://
[junit4:junit4]   2> 494 T2758 oashc.HttpShardHandlerFactory.getParameter Setting connTimeout to: 15000
[junit4:junit4]   2> 495 T2758 oashc.HttpShardHandlerFactory.getParameter Setting maxConnectionsPerHost to: 20
[junit4:junit4]   2> 496 T2758 oashc.HttpShardHandlerFactory.getParameter Setting corePoolSize to: 0
[junit4:junit4]   2> 496 T2758 oashc.HttpShardHandlerFactory.getParameter Setting maximumPoolSize to: 2147483647
[junit4:junit4]   2> 498 T2758 oashc.HttpShardHandlerFactory.getParameter Setting maxThreadIdleTime to: 5
[junit4:junit4]   2> 498 T2758 oashc.HttpShardHandlerFactory.getParameter Setting sizeOfQueue to: -1
[junit4:junit4]   2> 499 T2758 oashc.HttpShardHandlerFactory.getParameter Setting fairnessPolicy to: false
[junit4:junit4]   2> 499 T2758 oascsi.HttpClientUtil.createClient Creating new http client, config:maxConnectionsPerHost=20&maxConnections=10000&socketTimeout=60000&connTimeout=15000&retry=false
[junit4:junit4]   2> 513 T2758 oasc.CoreContainer.load Registering Log Listener
[junit4:junit4]   2> 546 T2758 oasc.CoreContainer.initZooKeeper Zookeeper client=127.0.0.1:51794/solr
[junit4:junit4]   2> 547 T2758 oasc.ZkController.checkChrootPath zkHost includes chroot
[junit4:junit4]   2> 548 T2758 oaz.ZooKeeper.<init> Initiating client connection, connectString=127.0.0.1:51794 sessionTimeout=60000 watcher=org.apache.solr.common.cloud.ConnectionManager@2c17a901
[junit4:junit4]   2> 549 T2758 oascc.ConnectionManager.waitForConnected Waiting for client to connect to ZooKeeper
[junit4:junit4]   2> 549 T2777 oaz.ClientCnxn$SendThread.logStartConnect Opening socket connection to server localhost/127.0.0.1:51794. Will not attempt to authenticate using SASL (access denied ("javax.security.auth.AuthPermission" "getLoginConfiguration"))
[junit4:junit4]   2> 551 T2777 oaz.ClientCnxn$SendThread.primeConnection Socket connection established to localhost/127.0.0.1:51794, initiating session
[junit4:junit4]   2> 551 T2760 oazs.NIOServerCnxnFactory.run Accepted socket connection from /127.0.0.1:51798
[junit4:junit4]   2> 552 T2760 oazs.ZooKeeperServer.processConnectRequest Client attempting to establish new session at /127.0.0.1:51798
[junit4:junit4]   2> 554 T2762 oazs.ZooKeeperServer.finishSessionInit Established session 0x13cc738a5500002 with negotiated timeout 20000 for client /127.0.0.1:51798
[junit4:junit4]   2> 554 T2777 oaz.ClientCnxn$SendThread.onConnected Session establishment complete on server localhost/127.0.0.1:51794, sessionid = 0x13cc738a5500002, negotiated timeout = 20000
[junit4:junit4]   2> 555 T2778 oascc.ConnectionManager.process Watcher org.apache.solr.common.cloud.ConnectionManager@2c17a901 name:ZooKeeperConnection Watcher:127.0.0.1:51794 got event WatchedEvent state:SyncConnected type:None path:null path:null type:None
[junit4:junit4]   2> 555 T2758 oascc.ConnectionManager.waitForConnected Client is connected to ZooKeeper
[junit4:junit4]   2> 557 T2763 oazs.PrepRequestProcessor.pRequest2Txn Processed session termination for sessionid: 0x13cc738a5500002
[junit4:junit4]   2> 558 T2760 oazs.NIOServerCnxn.closeSock Closed socket connection for client /127.0.0.1:51798 which had sessionid 0x13cc738a5500002
[junit4:junit4]   2> 559 T2778 oaz.ClientCnxn$EventThread.run EventThread shut down
[junit4:junit4]   2> 559 T2758 oaz.ZooKeeper.close Session: 0x13cc738a5500002 closed
[junit4:junit4]   2> 560 T2758 oascsi.HttpClientUtil.createClient Creating new http client, config:maxConnections=500&maxConnectionsPerHost=16&socketTimeout=60000&connTimeout=15000
[junit4:junit4]   2> 566 T2758 oaz.ZooKeeper.<init> Initiating client connection, connectString=127.0.0.1:51794/solr sessionTimeout=30000 watcher=org.apache.solr.common.cloud.ConnectionManager@64da582d
[junit4:junit4]   2> 567 T2758 oascc.ConnectionManager.waitForConnected Waiting for client to connect to ZooKeeper
[junit4:junit4]   2> 567 T2779 oaz.ClientCnxn$SendThread.logStartConnect Opening socket connection to server localhost/127.0.0.1:51794. Will not attempt to authenticate using SASL (access denied ("javax.security.auth.AuthPermission" "getLoginConfiguration"))
[junit4:junit4]   2> 568 T2779 oaz.ClientCnxn$SendThread.primeConnection Socket connection established to localhost/127.0.0.1:51794, initiating session
[junit4:junit4]   2> 569 T2760 oazs.NIOServerCnxnFactory.run Accepted socket connection from /127.0.0.1:51799
[junit4:junit4]   2> 569 T2760 oazs.ZooKeeperServer.processConnectRequest Client attempting to establish new session at /127.0.0.1:51799
[junit4:junit4]   2> 571 T2762 oazs.ZooKeeperServer.finishSessionInit Established session 0x13cc738a5500003 with negotiated timeout 20000 for client /127.0.0.1:51799
[junit4:junit4]   2> 571 T2779 oaz.ClientCnxn$SendThread.onConnected Session establishment complete on server localhost/127.0.0.1:51794, sessionid = 0x13cc738a5500003, negotiated timeout = 20000
[junit4:junit4]   2> 572 T2780 oascc.ConnectionManager.process Watcher org.apache.solr.common.cloud.ConnectionManager@64da582d name:ZooKeeperConnection Watcher:127.0.0.1:51794/solr got event WatchedEvent state:SyncConnected type:None path:null path:null type:None
[junit4:junit4]   2> 572 T2758 oascc.ConnectionManager.waitForConnected Client is connected to ZooKeeper
[junit4:junit4]   2> 576 T2763 oazs.PrepRequestProcessor.pRequest Got user-level KeeperException when processing sessionid:0x13cc738a5500003 type:create cxid:0x2 zxid:0x1a txntype:-1 reqpath:n/a Error Path:/solr/overseer Error:KeeperErrorCode = NodeExists for /solr/overseer
[junit4:junit4]   2> 579 T2758 oascc.SolrZkClient.makePath makePath: /live_nodes
[junit4:junit4]   2> 583 T2758 oasc.ZkController.createEphemeralLiveNode Register node as live in ZooKeeper:/live_nodes/127.0.0.1:51797_
[junit4:junit4]   2> 584 T2763 oazs.PrepRequestProcessor.pRequest Got user-level KeeperException when processing sessionid:0x13cc738a5500003 type:delete cxid:0x8 zxid:0x1c txntype:-1 reqpath:n/a Error Path:/solr/live_nodes/127.0.0.1:51797_ Error:KeeperErrorCode = NoNode for /solr/live_nodes/127.0.0.1:51797_
[junit4:junit4]   2> 585 T2758 oascc.SolrZkClient.makePath makePath: /live_nodes/127.0.0.1:51797_
[junit4:junit4]   2> 591 T2758 oascc.SolrZkClient.makePath makePath: /overseer_elect/election
[junit4:junit4]   2> 600 T2763 oazs.PrepRequestProcessor.pRequest Got user-level KeeperException when processing sessionid:0x13cc738a5500003 type:delete cxid:0x16 zxid:0x21 txntype:-1 reqpath:n/a Error Path:/solr/overseer_elect/leader Error:KeeperErrorCode = NoNode for /solr/overseer_elect/leader
[junit4:junit4]   2> 601 T2758 oascc.SolrZkClient.makePath makePath: /overseer_elect/leader
[junit4:junit4]   2> 605 T2758 oasc.Overseer.start Overseer (id=89165138746146819-127.0.0.1:51797_-n_0000000000) starting
[junit4:junit4]   2> 606 T2763 oazs.PrepRequestProcessor.pRequest Got user-level KeeperException when processing sessionid:0x13cc738a5500003 type:create cxid:0x1b zxid:0x23 txntype:-1 reqpath:n/a Error Path:/solr/overseer Error:KeeperErrorCode = NodeExists for /solr/overseer
[junit4:junit4]   2> 608 T2763 oazs.PrepRequestProcessor.pRequest Got user-level KeeperException when processing sessionid:0x13cc738a5500003 type:create cxid:0x1c zxid:0x24 txntype:-1 reqpath:n/a Error Path:/solr/overseer Error:KeeperErrorCode = NodeExists for /solr/overseer
[junit4:junit4]   2> 609 T2763 oazs.PrepRequestProcessor.pRequest Got user-level KeeperException when processing sessionid:0x13cc738a5500003 type:create cxid:0x1d zxid:0x25 txntype:-1 reqpath:n/a Error Path:/solr/overseer Error:KeeperErrorCode = NodeExists for /solr/overseer
[junit4:junit4]   2> 611 T2763 oazs.PrepRequestProcessor.pRequest Got user-level KeeperException when processing sessionid:0x13cc738a5500003 type:create cxid:0x1e zxid:0x26 txntype:-1 reqpath:n/a Error Path:/solr/overseer Error:KeeperErrorCode = NodeExists for /solr/overseer
[junit4:junit4]   2> 613 T2782 oasc.OverseerCollectionProcessor.run Process current queue of collection creations
[junit4:junit4]   2> 617 T2781 oasc.Overseer$ClusterStateUpdater.run Starting to work on the main queue
[junit4:junit4]   2> 620 T2758 oascc.SolrZkClient.makePath makePath: /clusterstate.json
[junit4:junit4]   2> 625 T2758 oascc.ZkStateReader.createClusterStateWatchersAndUpdate Updating cluster state from ZooKeeper... 
[junit4:junit4]   2> 636 T2783 oasc.CoreContainer.create Creating SolrCore 'collection1' using instanceDir: /Users/jenkins/jenkins-slave/workspace/Lucene-Solr-4.x-MacOSX/solr/build/solr-core/test/J0/./org.apache.solr.cloud.BasicDistributedZkTest-controljetty-1360552044058/collection1
[junit4:junit4]   2> 636 T2783 oasc.ZkController.createCollectionZkNode Check for collection zkNode:control_collection
[junit4:junit4]   2> 638 T2783 oasc.ZkController.createCollectionZkNode Collection zkNode exists
[junit4:junit4]   2> 638 T2783 oasc.ZkController.readConfigName Load collection config from:/collections/control_collection
[junit4:junit4]   2> 640 T2783 oasc.SolrResourceLoader.<init> new SolrResourceLoader for directory: '/Users/jenkins/jenkins-slave/workspace/Lucene-Solr-4.x-MacOSX/solr/build/solr-core/test/J0/./org.apache.solr.cloud.BasicDistributedZkTest-controljetty-1360552044058/collection1/'
[junit4:junit4]   2> 641 T2783 oasc.SolrResourceLoader.replaceClassLoader Adding 'file:/Users/jenkins/jenkins-slave/workspace/Lucene-Solr-4.x-MacOSX/solr/build/solr-core/test/J0/org.apache.solr.cloud.BasicDistributedZkTest-controljetty-1360552044058/collection1/lib/classes/' to classloader
[junit4:junit4]   2> 642 T2783 oasc.SolrResourceLoader.replaceClassLoader Adding 'file:/Users/jenkins/jenkins-slave/workspace/Lucene-Solr-4.x-MacOSX/solr/build/solr-core/test/J0/org.apache.solr.cloud.BasicDistributedZkTest-controljetty-1360552044058/collection1/lib/README' to classloader
[junit4:junit4]   2> 708 T2783 oasc.SolrConfig.<init> Using Lucene MatchVersion: LUCENE_42
[junit4:junit4]   2> 807 T2783 oasc.SolrConfig.<init> Loaded SolrConfig: solrconfig.xml
[junit4:junit4]   2> 818 T2783 oass.IndexSchema.readSchema Reading Solr Schema
[junit4:junit4]   2> 835 T2783 oass.IndexSchema.readSchema Schema name=test
[junit4:junit4]   2> 1718 T2783 oass.OpenExchangeRatesOrgProvider.init Initialized with rates=open-exchange-rates.json, refreshInterval=1440.
[junit4:junit4]   2> 1726 T2783 oass.IndexSchema.readSchema default search field in schema is text
[junit4:junit4]   2> 1731 T2783 oass.IndexSchema.readSchema unique key field: id
[junit4:junit4]   2> 1774 T2783 oass.FileExchangeRateProvider.reload Reloading exchange rates from file currency.xml
[junit4:junit4]   2> 1780 T2783 oass.FileExchangeRateProvider.reload Reloading exchange rates from file currency.xml
[junit4:junit4]   2> 1786 T2783 oass.OpenExchangeRatesOrgProvider.reload Reloading exchange rates from open-exchange-rates.json
[junit4:junit4]   2> 1788 T2783 oass.OpenExchangeRatesOrgProvider.reload Reloading exchange rates from open-exchange-rates.json
[junit4:junit4]   2> 1790 T2783 oasc.SolrCore.<init> [collection1] Opening new SolrCore at /Users/jenkins/jenkins-slave/workspace/Lucene-Solr-4.x-MacOSX/solr/build/solr-core/test/J0/./org.apache.solr.cloud.BasicDistributedZkTest-controljetty-1360552044058/collection1/, dataDir=./org.apache.solr.cloud.BasicDistributedZkTest-1360552043848/control/data/
[junit4:junit4]   2> 1791 T2783 oasc.JmxMonitoredMap.<init> JMX monitoring is enabled. Adding Solr mbeans to JMX Server: com.sun.jmx.mbeanserver.JmxMBeanServer@746a56f0
[junit4:junit4]   2> 1792 T2783 oasc.SolrCore.initDirectoryFactory solr.NRTCachingDirectoryFactory
[junit4:junit4]   2> 1793 T2783 oasc.CachingDirectoryFactory.get return new directory for /Users/jenkins/jenkins-slave/workspace/Lucene-Solr-4.x-MacOSX/solr/build/solr-core/test/J0/./org.apache.solr.cloud.BasicDistributedZkTest-1360552043848/control/data forceNew:false
[junit4:junit4]   2> 1794 T2783 oasc.CachingDirectoryFactory.close Releasing directory:/Users/jenkins/jenkins-slave/workspace/Lucene-Solr-4.x-MacOSX/solr/build/solr-core/test/J0/./org.apache.solr.cloud.BasicDistributedZkTest-1360552043848/control/data
[junit4:junit4]   2> 1794 T2783 oasc.SolrCore.getNewIndexDir New index directory detected: old=null new=./org.apache.solr.cloud.BasicDistributedZkTest-1360552043848/control/data/index/
[junit4:junit4]   2> 1795 T2783 oasc.SolrCore.initIndex WARNING [collection1] Solr index directory './org.apache.solr.cloud.BasicDistributedZkTest-1360552043848/control/data/index' doesn't exist. Creating new index...
[junit4:junit4]   2> 1796 T2783 oasc.CachingDirectoryFactory.get return new directory for /Users/jenkins/jenkins-slave/workspace/Lucene-Solr-4.x-MacOSX/solr/build/solr-core/test/J0/./org.apache.solr.cloud.BasicDistributedZkTest-1360552043848/control/data/index forceNew:false
[junit4:junit4]   2> 1802 T2783 oasc.SolrDeletionPolicy.onCommit SolrDeletionPolicy.onCommit: commits:num=1
[junit4:junit4]   2> 		commit{dir=RateLimitedDirectoryWrapper(NRTCachingDirectory(org.apache.lucene.store.NIOFSDirectory@/Users/jenkins/jenkins-slave/workspace/Lucene-Solr-4.x-MacOSX/solr/build/solr-core/test/J0/org.apache.solr.cloud.BasicDistributedZkTest-1360552043848/control/data/index lockFactory=org.apache.lucene.store.NativeFSLockFactory@5b18a9a6; maxCacheMB=48.0 maxMergeSizeMB=4.0)),segFN=segments_1,generation=1,filenames=[segments_1]
[junit4:junit4]   2> 1803 T2783 oasc.SolrDeletionPolicy.updateCommits newest commit = 1[segments_1]
[junit4:junit4]   2> 1803 T2783 oasc.CachingDirectoryFactory.close Releasing directory:/Users/jenkins/jenkins-slave/workspace/Lucene-Solr-4.x-MacOSX/solr/build/solr-core/test/J0/./org.apache.solr.cloud.BasicDistributedZkTest-1360552043848/control/data/index
[junit4:junit4]   2> 1804 T2783 oasc.SolrCore.initWriters created xml: solr.XMLResponseWriter
[junit4:junit4]   2> 1807 T2783 oasup.UpdateRequestProcessorChain.init inserting DistributedUpdateProcessorFactory into updateRequestProcessorChain "dedupe"
[junit4:junit4]   2> 1808 T2783 oasup.UpdateRequestProcessorChain.init inserting DistributedUpdateProcessorFactory into updateRequestProcessorChain "dedupe-allfields"
[junit4:junit4]   2> 1808 T2783 oasup.UpdateRequestProcessorChain.init inserting DistributedUpdateProcessorFactory into updateRequestProcessorChain "stored_sig"
[junit4:junit4]   2> 1809 T2783 oasup.UpdateRequestProcessorChain.init inserting DistributedUpdateProcessorFactory into updateRequestProcessorChain "uniq-fields"
[junit4:junit4]   2> 1810 T2783 oasup.UpdateRequestProcessorChain.init inserting DistributedUpdateProcessorFactory into updateRequestProcessorChain "distrib-dup-test-chain-implicit"
[junit4:junit4]   2> 1810 T2783 oasc.RequestHandlers.initHandlersFromConfig adding lazy requestHandler: solr.ReplicationHandler
[junit4:junit4]   2> 1811 T2783 oasc.RequestHandlers.initHandlersFromConfig created /replication: solr.ReplicationHandler
[junit4:junit4]   2> 1812 T2783 oasc.RequestHandlers.initHandlersFromConfig created standard: solr.StandardRequestHandler
[junit4:junit4]   2> 1813 T2783 oasc.RequestHandlers.initHandlersFromConfig created /get: solr.RealTimeGetHandler
[junit4:junit4]   2> 1813 T2783 oasc.RequestHandlers.initHandlersFromConfig created dismax: solr.SearchHandler
[junit4:junit4]   2> 1814 T2783 oasc.RequestHandlers.initHandlersFromConfig created mock: org.apache.solr.core.MockQuerySenderListenerReqHandler
[junit4:junit4]   2> 1815 T2783 oasc.RequestHandlers.initHandlersFromConfig created /admin/: org.apache.solr.handler.admin.AdminHandlers
[junit4:junit4]   2> 1815 T2783 oasc.RequestHandlers.initHandlersFromConfig created defaults: solr.StandardRequestHandler
[junit4:junit4]   2> 1816 T2783 oasc.RequestHandlers.initHandlersFromConfig adding lazy requestHandler: solr.StandardRequestHandler
[junit4:junit4]   2> 1816 T2783 oasc.RequestHandlers.initHandlersFromConfig created lazy: solr.StandardRequestHandler
[junit4:junit4]   2> 1819 T2783 oasc.RequestHandlers.initHandlersFromConfig created /update: solr.UpdateRequestHandler
[junit4:junit4]   2> 1823 T2783 oasc.RequestHandlers.initHandlersFromConfig created /terms: org.apache.solr.handler.component.SearchHandler
[junit4:junit4]   2> 1824 T2783 oasc.RequestHandlers.initHandlersFromConfig created spellCheckCompRH: org.apache.solr.handler.component.SearchHandler
[junit4:junit4]   2> 1824 T2783 oasc.RequestHandlers.initHandlersFromConfig created spellCheckCompRH_Direct: org.apache.solr.handler.component.SearchHandler
[junit4:junit4]   2> 1825 T2783 oasc.RequestHandlers.initHandlersFromConfig created spellCheckWithWordbreak: org.apache.solr.handler.component.SearchHandler
[junit4:junit4]   2> 1826 T2783 oasc.RequestHandlers.initHandlersFromConfig created spellCheckWithWordbreak_Direct: org.apache.solr.handler.component.SearchHandler
[junit4:junit4]   2> 1826 T2783 oasc.RequestHandlers.initHandlersFromConfig created spellCheckCompRH1: org.apache.solr.handler.component.SearchHandler
[junit4:junit4]   2> 1827 T2783 oasc.RequestHandlers.initHandlersFromConfig created mltrh: org.apache.solr.handler.component.SearchHandler
[junit4:junit4]   2> 1827 T2783 oasc.RequestHandlers.initHandlersFromConfig created tvrh: org.apache.solr.handler.component.SearchHandler
[junit4:junit4]   2> 1828 T2783 oasc.RequestHandlers.initHandlersFromConfig created /mlt: solr.MoreLikeThisHandler
[junit4:junit4]   2> 1829 T2783 oasc.RequestHandlers.initHandlersFromConfig created /debug/dump: solr.DumpRequestHandler
[junit4:junit4]   2> 1836 T2783 oashl.XMLLoader.init xsltCacheLifetimeSeconds=60
[junit4:junit4]   2> 1839 T2783 oasc.SolrCore.initDeprecatedSupport WARNING solrconfig.xml uses deprecated <admin/gettableFiles>, Please update your config to use the ShowFileRequestHandler.
[junit4:junit4]   2> 1841 T2783 oasc.SolrCore.initDeprecatedSupport WARNING adding ShowFileRequestHandler with hidden files: [SCHEMA.XML, OLD_SYNONYMS.TXT, STOPWORDS.TXT, PROTWORDS.TXT, OPEN-EXCHANGE-RATES.JSON, SYNONYMS.TXT, CURRENCY.XML, MAPPING-ISOLATIN1ACCENT.TXT]
[junit4:junit4]   2> 1845 T2783 oasc.CachingDirectoryFactory.close Releasing directory:/Users/jenkins/jenkins-slave/workspace/Lucene-Solr-4.x-MacOSX/solr/build/solr-core/test/J0/./org.apache.solr.cloud.BasicDistributedZkTest-1360552043848/control/data
[junit4:junit4]   2> 1847 T2783 oass.SolrIndexSearcher.<init> Opening Searcher@37ea3d06 main
[junit4:junit4]   2> 1848 T2783 oasu.CommitTracker.<init> Hard AutoCommit: disabled
[junit4:junit4]   2> 1849 T2783 oasu.CommitTracker.<init> Soft AutoCommit: disabled
[junit4:junit4]   2> 1850 T2783 oashc.SpellCheckComponent.inform Initializing spell checkers
[junit4:junit4]   2> 1860 T2783 oass.DirectSolrSpellChecker.init init: {name=direct,classname=DirectSolrSpellChecker,field=lowerfilt,minQueryLength=3}
[junit4:junit4]   2> 1896 T2784 oasc.SolrCore.registerSearcher [collection1] Registered new searcher Searcher@37ea3d06 main{StandardDirectoryReader(segments_1:1)}
[junit4:junit4]   2> 1906 T2783 oasc.ZkController.publish publishing core=collection1 state=down
[junit4:junit4]   2> 1906 T2783 oasc.ZkController.publish numShards not found on descriptor - reading it from system property
[junit4:junit4]   2> 1908 T2763 oazs.PrepRequestProcessor.pRequest Got user-level KeeperException when processing sessionid:0x13cc738a5500003 type:create cxid:0x51 zxid:0x29 txntype:-1 reqpath:n/a Error Path:/solr/overseer/queue Error:KeeperErrorCode = NoNode for /solr/overseer/queue
[junit4:junit4]   2> 2135 T2781 oascc.ZkStateReader.updateClusterState Updating cloud state from ZooKeeper... 
[junit4:junit4]   2> 2136 T2781 oasc.Overseer$ClusterStateUpdater.updateState Update state numShards=1 message={
[junit4:junit4]   2> 	  "operation":"state",
[junit4:junit4]   2> 	  "numShards":"1",
[junit4:junit4]   2> 	  "shard":null,
[junit4:junit4]   2> 	  "roles":null,
[junit4:junit4]   2> 	  "state":"down",
[junit4:junit4]   2> 	  "core":"collection1",
[junit4:junit4]   2> 	  "collection":"control_collection",
[junit4:junit4]   2> 	  "node_name":"127.0.0.1:51797_",
[junit4:junit4]   2> 	  "base_url":"http://127.0.0.1:51797"}
[junit4:junit4]   2> 2137 T2781 oasc.Overseer$ClusterStateUpdater.createCollection Create collection control_collection with numShards 1
[junit4:junit4]   2> 2137 T2781 oasc.Overseer$ClusterStateUpdater.updateState Assigning new node to shard shard=shard1
[junit4:junit4]   2> 2138 T2763 oazs.PrepRequestProcessor.pRequest Got user-level KeeperException when processing sessionid:0x13cc738a5500003 type:create cxid:0x59 zxid:0x2c txntype:-1 reqpath:n/a Error Path:/solr/overseer/queue-work Error:KeeperErrorCode = NoNode for /solr/overseer/queue-work
[junit4:junit4]   2> 2147 T2780 oascc.ZkStateReader$2.process A cluster state change: WatchedEvent state:SyncConnected type:NodeDataChanged path:/clusterstate.json, has occurred - updating... (live nodes size: 1)
[junit4:junit4]   2> 2912 T2783 oasc.CoreContainer.registerCore registering core: collection1
[junit4:junit4]   2> 2912 T2783 oasc.ZkController.register Register replica - core:collection1 address:http://127.0.0.1:51797 collection:control_collection shard:shard1
[junit4:junit4]   2> 2914 T2783 oascc.SolrZkClient.makePath makePath: /collections/control_collection/leader_elect/shard1/election
[junit4:junit4]   2> 2926 T2763 oazs.PrepRequestProcessor.pRequest Got user-level KeeperException when processing sessionid:0x13cc738a5500003 type:delete cxid:0x73 zxid:0x36 txntype:-1 reqpath:n/a Error Path:/solr/collections/control_collection/leaders Error:KeeperErrorCode = NoNode for /solr/collections/control_collection/leaders
[junit4:junit4]   2> 2928 T2783 oasc.ShardLeaderElectionContext.runLeaderProcess Running the leader process.
[junit4:junit4]   2> 2928 T2763 oazs.PrepRequestProcessor.pRequest Got user-level KeeperException when processing sessionid:0x13cc738a5500003 type:create cxid:0x74 zxid:0x37 txntype:-1 reqpath:n/a Error Path:/solr/overseer Error:KeeperErrorCode = NodeExists for /solr/overseer
[junit4:junit4]   2> 2931 T2783 oasc.ShardLeaderElectionContext.waitForReplicasToComeUp Enough replicas found to continue.
[junit4:junit4]   2> 2931 T2783 oasc.ShardLeaderElectionContext.runLeaderProcess I may be the new leader - try and sync
[junit4:junit4]   2> 2932 T2783 oasc.SyncStrategy.sync Sync replicas to http://127.0.0.1:51797/collection1/
[junit4:junit4]   2> 2932 T2783 oasc.SyncStrategy.syncReplicas Sync Success - now sync replicas to me
[junit4:junit4]   2> 2932 T2783 oasc.SyncStrategy.syncToMe http://127.0.0.1:51797/collection1/ has no replicas
[junit4:junit4]   2> 2932 T2783 oasc.ShardLeaderElectionContext.runLeaderProcess I am the new leader: http://127.0.0.1:51797/collection1/
[junit4:junit4]   2> 2933 T2783 oascc.SolrZkClient.makePath makePath: /collections/control_collection/leaders/shard1
[junit4:junit4]   2> 2942 T2763 oazs.PrepRequestProcessor.pRequest Got user-level KeeperException when processing sessionid:0x13cc738a5500003 type:create cxid:0x7e zxid:0x3b txntype:-1 reqpath:n/a Error Path:/solr/overseer Error:KeeperErrorCode = NodeExists for /solr/overseer
[junit4:junit4]   2> 3656 T2781 oascc.ZkStateReader.updateClusterState Updating cloud state from ZooKeeper... 
[junit4:junit4]   2> 3672 T2780 oascc.ZkStateReader$2.process A cluster state change: WatchedEvent state:SyncConnected type:NodeDataChanged path:/clusterstate.json, has occurred - updating... (live nodes size: 1)
[junit4:junit4]   2> 3690 T2783 oasc.ZkController.register We are http://127.0.0.1:51797/collection1/ and leader is http://127.0.0.1:51797/collection1/
[junit4:junit4]   2> 3691 T2783 oasc.ZkController.register No LogReplay needed for core=collection1 baseURL=http://127.0.0.1:51797
[junit4:junit4]   2> 3691 T2783 oasc.ZkController.checkRecovery I am the leader, no recovery necessary
[junit4:junit4]   2> 3691 T2783 oasc.ZkController.publish publishing core=collection1 state=active
[junit4:junit4]   2> 3692 T2783 oasc.ZkController.publish numShards not found on descriptor - reading it from system property
[junit4:junit4]   2> 3696 T2783 oascc.ZkStateReader.updateClusterState Updating cloud state from ZooKeeper... 
[junit4:junit4]   2> 3698 T2758 oass.SolrDispatchFilter.init user.dir=/Users/jenkins/jenkins-slave/workspace/Lucene-Solr-4.x-MacOSX/solr/build/solr-core/test/J0
[junit4:junit4]   2> 3699 T2758 oass.SolrDispatchFilter.init SolrDispatchFilter.init() done
[junit4:junit4]   2> 3699 T2758 oascsi.HttpClientUtil.createClient Creating new http client, config:maxConnections=128&maxConnectionsPerHost=32&followRedirects=false
[junit4:junit4]   2> 3710 T2758 oascsi.HttpClientUtil.createClient Creating new http client, config:
[junit4:junit4]   2> 3719 T2758 oaz.ZooKeeper.<init> Initiating client connection, connectString=127.0.0.1:51794/solr sessionTimeout=10000 watcher=org.apache.solr.common.cloud.ConnectionManager@7d4bf07f
[junit4:junit4]   2> 3721 T2758 oascc.ConnectionManager.waitForConnected Waiting for client to connect to ZooKeeper
[junit4:junit4]   2> 3722 T2785 oaz.ClientCnxn$SendThread.logStartConnect Opening socket connection to server localhost/127.0.0.1:51794. Will not attempt to authenticate using SASL (access denied ("javax.security.auth.AuthPermission" "getLoginConfiguration"))
[junit4:junit4]   2> 3723 T2785 oaz.ClientCnxn$SendThread.primeConnection Socket connection established to localhost/127.0.0.1:51794, initiating session
[junit4:junit4]   2> 3724 T2760 oazs.NIOServerCnxnFactory.run Accepted socket connection from /127.0.0.1:51800
[junit4:junit4]   2> 3725 T2760 oazs.ZooKeeperServer.processConnectRequest Client attempting to establish new session at /127.0.0.1:51800
[junit4:junit4]   2> 3727 T2762 oazs.ZooKeeperServer.finishSessionInit Established session 0x13cc738a5500004 with negotiated timeout 10000 for client /127.0.0.1:51800
[junit4:junit4]   2> 3727 T2785 oaz.ClientCnxn$SendThread.onConnected Session establishment complete on server localhost/127.0.0.1:51794, sessionid = 0x13cc738a5500004, negotiated timeout = 10000
[junit4:junit4]   2> 3728 T2786 oascc.ConnectionManager.process Watcher org.apache.solr.common.cloud.ConnectionManager@7d4bf07f name:ZooKeeperConnection Watcher:127.0.0.1:51794/solr got event WatchedEvent state:SyncConnected type:None path:null path:null type:None
[junit4:junit4]   2> 3729 T2758 oascc.ConnectionManager.waitForConnected Client is connected to ZooKeeper
[junit4:junit4]   2> 3731 T2758 oascc.ZkStateReader.createClusterStateWatchersAndUpdate Updating cluster state from ZooKeeper... 
[junit4:junit4]   2> 3736 T2758 oasc.ChaosMonkey.monkeyLog monkey: init - expire sessions:true cause connection loss:true
[junit4:junit4]   2> 4026 T2758 oejs.Server.doStart jetty-8.1.8.v20121106
[junit4:junit4]   2> 4033 T2758 oejs.AbstractConnector.doStart Started SelectChannelConnector@127.0.0.1:51801
[junit4:junit4]   2> 4034 T2758 oass.SolrDispatchFilter.init SolrDispatchFilter.init()
[junit4:junit4]   2> 4035 T2758 oasc.SolrResourceLoader.locateSolrHome JNDI not configured for solr (NoInitialContextEx)
[junit4:junit4]   2> 4035 T2758 oasc.SolrResourceLoader.locateSolrHome using system property solr.solr.home: /Users/jenkins/jenkins-slave/workspace/Lucene-Solr-4.x-MacOSX/solr/build/solr-core/test/J0/./org.apache.solr.cloud.BasicDistributedZkTest-jetty1-1360552047573
[junit4:junit4]   2> 4036 T2758 oasc.CoreContainer$Initializer.initialize looking for solr.xml: /Users/jenkins/jenkins-slave/workspace/Lucene-Solr-4.x-MacOSX/solr/build/solr-core/test/J0/./org.apache.solr.cloud.BasicDistributedZkTest-jetty1-1360552047573/solr.xml
[junit4:junit4]   2> 4037 T2758 oasc.CoreContainer.<init> New CoreContainer 932005732
[junit4:junit4]   2> 4037 T2758 oasc.CoreContainer.load Loading CoreContainer using Solr Home: '/Users/jenkins/jenkins-slave/workspace/Lucene-Solr-4.x-MacOSX/solr/build/solr-core/test/J0/./org.apache.solr.cloud.BasicDistributedZkTest-jetty1-1360552047573/'
[junit4:junit4]   2> 4038 T2758 oasc.SolrResourceLoader.<init> new SolrResourceLoader for directory: '/Users/jenkins/jenkins-slave/workspace/Lucene-Solr-4.x-MacOSX/solr/build/solr-core/test/J0/./org.apache.solr.cloud.BasicDistributedZkTest-jetty1-1360552047573/'
[junit4:junit4]   2> 4082 T2758 oashc.HttpShardHandlerFactory.getParameter Setting socketTimeout to: 60000
[junit4:junit4]   2> 4083 T2758 oashc.HttpShardHandlerFactory.getParameter Setting urlScheme to: http://
[junit4:junit4]   2> 4084 T2758 oashc.HttpShardHandlerFactory.getParameter Setting connTimeout to: 15000
[junit4:junit4]   2> 4084 T2758 oashc.HttpShardHandlerFactory.getParameter Setting maxConnectionsPerHost to: 20
[junit4:junit4]   2> 4085 T2758 oashc.HttpShardHandlerFactory.getParameter Setting corePoolSize to: 0
[junit4:junit4]   2> 4085 T2758 oashc.HttpShardHandlerFactory.getParameter Setting maximumPoolSize to: 2147483647
[junit4:junit4]   2> 4086 T2758 oashc.HttpShardHandlerFactory.getParameter Setting maxThreadIdleTime to: 5
[junit4:junit4]   2> 4086 T2758 oashc.HttpShardHandlerFactory.getParameter Setting sizeOfQueue to: -1
[junit4:junit4]   2> 4087 T2758 oashc.HttpShardHandlerFactory.getParameter Setting fairnessPolicy to: false
[junit4:junit4]   2> 4087 T2758 oascsi.HttpClientUtil.createClient Creating new http client, config:maxConnectionsPerHost=20&maxConnections=10000&socketTimeout=60000&connTimeout=15000&retry=false
[junit4:junit4]   2> 4161 T2758 oasc.CoreContainer.load Registering Log Listener
[junit4:junit4]   2> 4193 T2758 oasc.CoreContainer.initZooKeeper Zookeeper client=127.0.0.1:51794/solr
[junit4:junit4]   2> 4193 T2758 oasc.ZkController.checkChrootPath zkHost includes chroot
[junit4:junit4]   2> 4194 T2758 oaz.ZooKeeper.<init> Initiating client connection, connectString=127.0.0.1:51794 sessionTimeout=60000 watcher=org.apache.solr.common.cloud.ConnectionManager@40e585d4
[junit4:junit4]   2> 4196 T2796 oaz.ClientCnxn$SendThread.logStartConnect Opening socket connection to server localhost/127.0.0.1:51794. Will not attempt to authenticate using SASL (access denied ("javax.security.auth.AuthPermission" "getLoginConfiguration"))
[junit4:junit4]   2> 4196 T2758 oascc.ConnectionManager.waitForConnected Waiting for client to connect to ZooKeeper
[junit4:junit4]   2> 4199 T2760 oazs.NIOServerCnxnFactory.run Accepted socket connection from /127.0.0.1:51802
[junit4:junit4]   2> 4199 T2796 oaz.ClientCnxn$SendThread.primeConnection Socket connection established to localhost/127.0.0.1:51794, initiating session
[junit4:junit4]   2> 4201 T2760 oazs.ZooKeeperServer.processConnectRequest Client attempting to establish new session at /127.0.0.1:51802
[junit4:junit4]   2> 4202 T2762 oazs.ZooKeeperServer.finishSessionInit Established session 0x13cc738a5500005 with negotiated timeout 20000 for client /127.0.0.1:51802
[junit4:junit4]   2> 4202 T2796 oaz.ClientCnxn$SendThread.onConnected Session establishment complete on server localhost/127.0.0.1:51794, sessionid = 0x13cc738a5500005, negotiated timeout = 20000
[junit4:junit4]   2> 4203 T2797 oascc.ConnectionManager.process Watcher org.apache.solr.common.cloud.ConnectionManager@40e585d4 name:ZooKeeperConnection Watcher:127.0.0.1:51794 got event WatchedEvent state:SyncConnected type:None path:null path:null type:None
[junit4:junit4]   2> 4203 T2758 oascc.ConnectionManager.waitForConnected Client is connected to ZooKeeper
[junit4:junit4]   2> 4208 T2763 oazs.PrepRequestProcessor.pRequest2Txn Processed session termination for sessionid: 0x13cc738a5500005
[junit4:junit4]   2> 4209 T2760 oazs.NIOServerCnxn.closeSock Closed socket connection for client /127.0.0.1:51802 which had sessionid 0x13cc738a5500005
[junit4:junit4]   2> 4210 T2758 oaz.ZooKeeper.close Session: 0x13cc738a5500005 closed
[junit4:junit4]   2> 4210 T2758 oascsi.HttpClientUtil.createClient Creating new http client, config:maxConnections=500&maxConnectionsPerHost=16&socketTimeout=60000&connTimeout=15000
[junit4:junit4]   2> 4216 T2797 oaz.ClientCnxn$EventThread.run EventThread shut down
[junit4:junit4]   2> 4217 T2758 oaz.ZooKeeper.<init> Initiating client connection, connectString=127.0.0.1:51794/solr sessionTimeout=30000 watcher=org.apache.solr.common.cloud.ConnectionManager@73f87555
[junit4:junit4]   2> 4219 T2758 oascc.ConnectionManager.waitForConnected Waiting for client to connect to ZooKeeper
[junit4:junit4]   2> 4220 T2798 oaz.ClientCnxn$SendThread.logStartConnect Opening socket connection to server localhost/127.0.0.1:51794. Will not attempt to authenticate using SASL (access denied ("javax.security.auth.AuthPermission" "getLoginConfiguration"))
[junit4:junit4]   2> 4221 T2798 oaz.ClientCnxn$SendThread.primeConnection Socket connection established to localhost/127.0.0.1:51794, initiating session
[junit4:junit4]   2> 4221 T2760 oazs.NIOServerCnxnFactory.run Accepted socket connection from /127.0.0.1:51803
[junit4:junit4]   2> 4222 T2760 oazs.ZooKeeperServer.processConnectRequest Client attempting to establish new session at /127.0.0.1:51803
[junit4:junit4]   2> 4224 T2762 oazs.ZooKeeperServer.finishSessionInit Established session 0x13cc738a5500006 with negotiated timeout 20000 for client /127.0.0.1:51803
[junit4:junit4]   2> 4224 T2798 oaz.ClientCnxn$SendThread.onConnected Session establishment complete on server localhost/127.0.0.1:51794, sessionid = 0x13cc738a5500006, negotiated timeout = 20000
[junit4:junit4]   2> 4224 T2799 oascc.ConnectionManager.process Watcher org.apache.solr.common.cloud.ConnectionManager@73f87555 name:ZooKeeperConnection Watcher:127.0.0.1:51794/solr got event WatchedEvent state:SyncConnected type:None path:null path:null type:None
[junit4:junit4]   2> 4225 T2758 oascc.ConnectionManager.waitForConnected Client is connected to ZooKeeper
[junit4:junit4]   2> 4226 T2763 oazs.PrepRequestProcessor.pRequest Got user-level KeeperException when processing sessionid:0x13cc738a5500006 type:create cxid:0x1 zxid:0x49 txntype:-1 reqpath:n/a Error Path:/solr/overseer Error:KeeperErrorCode = NodeExists for /solr/overseer
[junit4:junit4]   2> 4227 T2763 oazs.PrepRequestProcessor.pRequest Got user-level KeeperException when processing sessionid:0x13cc738a5500006 type:create cxid:0x2 zxid:0x4a txntype:-1 reqpath:n/a Error Path:/solr/overseer Error:KeeperErrorCode = NodeExists for /solr/overseer
[junit4:junit4]   2> 4232 T2758 oascc.ZkStateReader.createClusterStateWatchersAndUpdate Updating cluster state from ZooKeeper... 
[junit4:junit4]   2> 4239 T2758 oasc.ZkController.createEphemeralLiveNode Register node as live in ZooKeeper:/live_nodes/127.0.0.1:51801_
[junit4:junit4]   2> 4240 T2763 oazs.PrepRequestProcessor.pRequest Got user-level KeeperException when processing sessionid:0x13cc738a5500006 type:delete cxid:0x9 zxid:0x4b txntype:-1 reqpath:n/a Error Path:/solr/live_nodes/127.0.0.1:51801_ Error:KeeperErrorCode = NoNode for /solr/live_nodes/127.0.0.1:51801_
[junit4:junit4]   2> 4241 T2758 oascc.SolrZkClient.makePath makePath: /live_nodes/127.0.0.1:51801_
[junit4:junit4]   2> 4247 T2780 oascc.ZkStateReader$3.process Updating live nodes... (2)
[junit4:junit4]   2> 4247 T2780 oascc.ZkStateReader$2.process A cluster state change: WatchedEvent state:SyncConnected type:NodeChildrenChanged path:/live_nodes, has occurred - updating... (live nodes size: 2)
[junit4:junit4]   2> 4248 T2799 oascc.ZkStateReader$3.process Updating live nodes... (2)
[junit4:junit4]   2> 4249 T2786 oascc.ZkStateReader$3.process Updating live nodes... (2)
[junit4:junit4]   2> 4261 T2800 oasc.CoreContainer.create Creating SolrCore 'collection1' using instanceDir: /Users/jenkins/jenkins-slave/workspace/Lucene-Solr-4.x-MacOSX/solr/build/solr-core/test/J0/./org.apache.solr.cloud.BasicDistributedZkTest-jetty1-1360552047573/collection1
[junit4:junit4]   2> 4261 T2800 oasc.ZkController.createCollectionZkNode Check for collection zkNode:collection1
[junit4:junit4]   2> 4262 T2800 oasc.ZkController.createCollectionZkNode Collection zkNode exists
[junit4:junit4]   2> 4263 T2800 oasc.ZkController.readConfigName Load collection config from:/collections/collection1
[junit4:junit4]   2> 4268 T2800 oasc.SolrResourceLoader.<init> new SolrResourceLoader for directory: '/Users/jenkins/jenkins-slave/workspace/Lucene-Solr-4.x-MacOSX/solr/build/solr-core/test/J0/./org.apache.solr.cloud.BasicDistributedZkTest-jetty1-1360552047573/collection1/'
[junit4:junit4]   2> 4269 T2800 oasc.SolrResourceLoader.replaceClassLoader Adding 'file:/Users/jenkins/jenkins-slave/workspace/Lucene-Solr-4.x-MacOSX/solr/build/solr-core/test/J0/org.apache.solr.cloud.BasicDistributedZkTest-jetty1-1360552047573/collection1/lib/classes/' to classloader
[junit4:junit4]   2> 4269 T2800 oasc.SolrResourceLoader.replaceClassLoader Adding 'file:/Users/jenkins/jenkins-slave/workspace/Lucene-Solr-4.x-MacOSX/solr/build/solr-core/test/J0/org.apache.solr.cloud.BasicDistributedZkTest-jetty1-1360552047573/collection1/lib/README' to classloader
[junit4:junit4]   2> 4335 T2800 oasc.SolrConfig.<init> Using Lucene MatchVersion: LUCENE_42
[junit4:junit4]   2> 4437 T2800 oasc.SolrConfig.<init> Loaded SolrConfig: solrconfig.xml
[junit4:junit4]   2> 4439 T2800 oass.IndexSchema.readSchema Reading Solr Schema
[junit4:junit4]   2> 4446 T2800 oass.IndexSchema.readSchema Schema name=test
[junit4:junit4]   2> 5185 T2781 oascc.ZkStateReader.updateClusterState Updating cloud state from ZooKeeper... 
[junit4:junit4]   2> 5186 T2781 oasc.Overseer$ClusterStateUpdater.updateState Update state numShards=1 message={
[junit4:junit4]   2> 	  "operation":"state",
[junit4:junit4]   2> 	  "numShards":"1",
[junit4:junit4]   2> 	  "shard":"shard1",
[junit4:junit4]   2> 	  "roles":null,
[junit4:junit4]   2> 	  "state":"active",
[junit4:junit4]   2> 	  "core":"collection1",
[junit4:junit4]   2> 	  "collection":"control_collection",
[junit4:junit4]   2> 	  "node_name":"127.0.0.1:51797_",
[junit4:junit4]   2> 	  "base_url":"http://127.0.0.1:51797"}
[junit4:junit4]   2> 5195 T2786 oascc.ZkStateReader$2.process A cluster state change: WatchedEvent state:SyncConnected type:NodeDataChanged path:/clusterstate.json, has occurred - updating... (live nodes size: 2)
[junit4:junit4]   2> 5195 T2780 oascc.ZkStateReader$2.process A cluster state change: WatchedEvent state:SyncConnected type:NodeDataChanged path:/clusterstate.json, has occurred - updating... (live nodes size: 2)
[junit4:junit4]   2> 5196 T2799 oascc.ZkStateReader$2.process A cluster state change: WatchedEvent state:SyncConnected type:NodeDataChanged path:/clusterstate.json, has occurred - updating... (live nodes size: 2)
[junit4:junit4]   2> 5218 T2800 oass.OpenExchangeRatesOrgProvider.init Initialized with rates=open-exchange-rates.json, refreshInterval=1440.
[junit4:junit4]   2> 5228 T2800 oass.IndexSchema.readSchema default search field in schema is text
[junit4:junit4]   2> 5232 T2800 oass.IndexSchema.readSchema unique key field: id
[junit4:junit4]   2> 5259 T2800 oass.FileExchangeRateProvider.reload Reloading exchange rates from file currency.xml
[junit4:junit4]   2> 5278 T2800 oass.FileExchangeRateProvider.reload Reloading exchange rates from file currency.xml
[junit4:junit4]   2> 5287 T2800 oass.OpenExchangeRatesOrgProvider.reload Reloading exchange rates from open-exchange-rates.json
[junit4:junit4]   2> 5289 T2800 oass.OpenExchangeRatesOrgProvider.reload Reloading exchange rates from open-exchange-rates.json
[junit4:junit4]   2> 5291 T2800 oasc.SolrCore.<init> [collection1] Opening new SolrCore at /Users/jenkins/jenkins-slave/workspace/Lucene-Solr-4.x-MacOSX/solr/build/solr-core/test/J0/./org.apache.solr.cloud.BasicDistributedZkTest-jetty1-1360552047573/collection1/, dataDir=./org.apache.solr.cloud.BasicDistributedZkTest-1360552043848/jetty1/
[junit4:junit4]   2> 5292 T2800 oasc.JmxMonitoredMap.<init> JMX monitoring is enabled. Adding Solr mbeans to JMX Server: com.sun.jmx.mbeanserver.JmxMBeanServer@746a56f0
[junit4:junit4]   2> 5292 T2800 oasc.SolrCore.initDirectoryFactory solr.NRTCachingDirectoryFactory
[junit4:junit4]   2> 5293 T2800 oasc.CachingDirectoryFactory.get return new directory for /Users/jenkins/jenkins-slave/workspace/Lucene-Solr-4.x-MacOSX/solr/build/solr-core/test/J0/./org.apache.solr.cloud.BasicDistributedZkTest-1360552043848/jetty1 forceNew:false
[junit4:junit4]   2> 5294 T2800 oasc.CachingDirectoryFactory.close Releasing directory:/Users/jenkins/jenkins-slave/workspace/Lucene-Solr-4.x-MacOSX/solr/build/solr-core/test/J0/./org.apache.solr.cloud.BasicDistributedZkTest-1360552043848/jetty1
[junit4:junit4]   2> 5294 T2800 oasc.SolrCore.getNewIndexDir New index directory detected: old=null new=./org.apache.solr.cloud.BasicDistributedZkTest-1360552043848/jetty1/index/
[junit4:junit4]   2> 5295 T2800 oasc.SolrCore.initIndex WARNING [collection1] Solr index directory './org.apache.solr.cloud.BasicDistributedZkTest-1360552043848/jetty1/index' doesn't exist. Creating new index...
[junit4:junit4]   2> 5296 T2800 oasc.CachingDirectoryFactory.get return new directory for /Users/jenkins/jenkins-slave/workspace/Lucene-Solr-4.x-MacOSX/solr/build/solr-core/test/J0/./org.apache.solr.cloud.BasicDistributedZkTest-1360552043848/jetty1/index forceNew:false
[junit4:junit4]   2> 5312 T2800 oasc.SolrDeletionPolicy.onCommit SolrDeletionPolicy.onCommit: commits:num=1
[junit4:junit4]   2> 		commit{dir=RateLimitedDirectoryWrapper(NRTCachingDirectory(org.apache.lucene.store.NIOFSDirectory@/Users/jenkins/jenkins-slave/workspace/Lucene-Solr-4.x-MacOSX/solr/build/solr-core/test/J0/org.apache.solr.cloud.BasicDistributedZkTest-1360552043848/jetty1/index lockFactory=org.apache.lucene.store.NativeFSLockFactory@760e3574; maxCacheMB=48.0 maxMergeSizeMB=4.0)),segFN=segments_1,generation=1,filenames=[segments_1]
[junit4:junit4]   2> 5313 T2800 oasc.SolrDeletionPolicy.updateCommits newest commit = 1[segments_1]
[junit4:junit4]   2> 5314 T2800 oasc.CachingDirectoryFactory.close Releasing directory:/Users/jenkins/jenkins-slave/workspace/Lucene-Solr-4.x-MacOSX/solr/build/solr-core/test/J0/./org.apache.solr.cloud.BasicDistributedZkTest-1360552043848/jetty1/index
[junit4:junit4]   2> 5315 T2800 oasc.SolrCore.initWriters created xml: solr.XMLResponseWriter
[junit4:junit4]   2> 5319 T2800 oasup.UpdateRequestProcessorChain.init inserting DistributedUpdateProcessorFactory into updateRequestProcessorChain "dedupe"
[junit4:junit4]   2> 5319 T2800 oasup.UpdateRequestProcessorChain.init inserting DistributedUpdateProcessorFactory into updateRequestProcessorChain "dedupe-allfields"
[junit4:junit4]   2> 5320 T2800 oasup.UpdateRequestProcessorChain.init inserting DistributedUpdateProcessorFactory into updateRequestProcessorChain "stored_sig"
[junit4:junit4]   2> 5321 T2800 oasup.UpdateRequestProcessorChain.init inserting DistributedUpdateProcessorFactory into updateRequestProcessorChain "uniq-fields"
[junit4:junit4]   2> 5322 T2800 oasup.UpdateRequestProcessorChain.init inserting DistributedUpdateProcessorFactory into updateRequestProcessorChain "distrib-dup-test-chain-implicit"
[junit4:junit4]   2> 5322 T2800 oasc.RequestHandlers.initHandlersFromConfig adding lazy requestHandler: solr.ReplicationHandler
[junit4:junit4]   2> 5328 T2800 oasc.RequestHandlers.initHandlersFromConfig created /replication: solr.ReplicationHandler
[junit4:junit4]   2> 5329 T2800 oasc.RequestHandlers.initHandlersFromConfig created standard: solr.StandardRequestHandler
[junit4:junit4]   2> 5330 T2800 oasc.RequestHandlers.initHandlersFromConfig created /get: solr.RealTimeGetHandler
[junit4:junit4]   2> 5331 T2800 oasc.RequestHandlers.initHandlersFromConfig created dismax: solr.SearchHandler
[junit4:junit4]   2> 5333 T2800 oasc.RequestHandlers.initHandlersFromConfig created mock: org.apache.solr.core.MockQuerySenderListenerReqHandler
[junit4:junit4]   2> 5336 T2800 oasc.RequestHandlers.initHandlersFromConfig created /admin/: org.apache.solr.handler.admin.AdminHandlers
[junit4:junit4]   2> 5337 T2800 oasc.RequestHandlers.initHandlersFromConfig created defaults: solr.StandardRequestHandler
[junit4:junit4]   2> 5337 T2800 oasc.RequestHandlers.initHandlersFromConfig adding lazy requestHandler: solr.StandardRequestHandler
[junit4:junit4]   2> 5337 T2800 oasc.RequestHandlers.initHandlersFromConfig created lazy: solr.StandardRequestHandler
[junit4:junit4]   2> 5338 T2800 oasc.RequestHandlers.initHandlersFromConfig created /update: solr.UpdateRequestHandler
[junit4:junit4]   2> 5339 T2800 oasc.RequestHandlers.initHandlersFromConfig created /terms: org.apache.solr.handler.component.SearchHandler
[junit4:junit4]   2> 5340 T2800 oasc.RequestHandlers.initHandlersFromConfig created spellCheckCompRH: org.apache.solr.handler.component.SearchHandler
[junit4:junit4]   2> 5340 T2800 oasc.RequestHandlers.initHandlersFromConfig created spellCheckCompRH_Direct: org.apache.solr.handler.component.SearchHandler
[junit4:junit4]   2> 5341 T2800 oasc.RequestHandlers.initHandlersFromConfig created spellCheckWithWordbreak: org.apache.solr.handler.component.SearchHandler
[junit4:junit4]   2> 5342 T2800 oasc.RequestHandlers.initHandlersFromConfig created spellCheckWithWordbreak_Direct: org.apache.solr.handler.component.SearchHandler
[junit4:junit4]   2> 5343 T2800 oasc.RequestHandlers.initHandlersFromConfig created spellCheckCompRH1: org.apache.solr.handler.component.SearchHandler
[junit4:junit4]   2> 5344 T2800 oasc.RequestHandlers.initHandlersFromConfig created mltrh: org.apache.solr.handler.component.SearchHandler
[junit4:junit4]   2> 5345 T2800 oasc.RequestHandlers.initHandlersFromConfig created tvrh: org.apache.solr.handler.component.SearchHandler
[junit4:junit4]   2> 5364 T2800 oasc.RequestHandlers.initHandlersFromConfig created /mlt: solr.MoreLikeThisHandler
[junit4:junit4]   2> 5365 T2800 oasc.RequestHandlers.initHandlersFromConfig created /debug/dump: solr.DumpRequestHandler
[junit4:junit4]   2> 5372 T2800 oashl.XMLLoader.init xsltCacheLifetimeSeconds=60
[junit4:junit4]   2> 5377 T2800 oasc.SolrCore.initDeprecatedSupport WARNING solrconfig.xml uses deprecated <admin/gettableFiles>, Please update your config to use the ShowFileRequestHandler.
[junit4:junit4]   2> 5382 T2800 oasc.SolrCore.initDeprecatedSupport WARNING adding ShowFileRequestHandler with hidden files: [SCHEMA.XML, OLD_SYNONYMS.TXT, STOPWORDS.TXT, PROTWORDS.TXT, OPEN-EXCHANGE-RATES.JSON, SYNONYMS.TXT, CURRENCY.XML, MAPPING-ISOLATIN1ACCENT.TXT]
[junit4:junit4]   2> 5385 T2800 oasc.CachingDirectoryFactory.close Releasing directory:/Users/jenkins/jenkins-slave/workspace/Lucene-Solr-4.x-MacOSX/solr/build/solr-core/test/J0/./org.apache.solr.cloud.BasicDistributedZkTest-1360552043848/jetty1
[junit4:junit4]   2> 5387 T2800 oass.SolrIndexSearcher.<init> Opening Searcher@29ff2d4f main
[junit4:junit4]   2> 5388 T2800 oasu.CommitTracker.<init> Hard AutoCommit: disabled
[junit4:junit4]   2> 5388 T2800 oasu.CommitTracker.<init> Soft AutoCommit: disabled
[junit4:junit4]   2> 5389 T2800 oashc.SpellCheckComponent.inform Initializing spell checkers
[junit4:junit4]   2> 5395 T2800 oass.DirectSolrSpellChecker.init init: {name=direct,classname=DirectSolrSpellChecker,field=lowerfilt,minQueryLength=3}
[junit4:junit4]   2> 5428 T2801 oasc.SolrCore.registerSearcher [collection1] Registered new searcher Searcher@29ff2d4f main{StandardDirectoryReader(segments_1:1)}
[junit4:junit4]   2> 5435 T2800 oasc.ZkController.publish publishing core=collection1 state=down
[junit4:junit4]   2> 5436 T2800 oasc.ZkController.publish numShards not found on descriptor - reading it from system property
[junit4:junit4]   2> 6708 T2781 oascc.ZkStateReader.updateClusterState Updating cloud state from ZooKeeper... 
[junit4:junit4]   2> 6710 T2781 oasc.Overseer$ClusterStateUpdater.updateState Update state numShards=2 message={
[junit4:junit4]   2> 	  "operation":"state",
[junit4:junit4]   2> 	  "numShards":"2",
[junit4:junit4]   2> 	  "shard":null,
[junit4:junit4]   2> 	  "roles":null,
[junit4:junit4]   2> 	  "state":"down",
[junit4:junit4]   2> 	  "core":"collection1",
[junit4:junit4]   2> 	  "collection":"collection1",
[junit4:junit4]   2> 	  "node_name":"127.0.0.1:51801_",
[junit4:junit4]   2> 	  "base_url":"http://127.0.0.1:51801"}
[junit4:junit4]   2> 6710 T2781 oasc.Overseer$ClusterStateUpdater.createCollection Create collection collection1 with numShards 2
[junit4:junit4]   2> 6711 T2781 oasc.Overseer$ClusterStateUpdater.updateState Assigning new node to shard shard=shard1
[junit4:junit4]   2> 6720 T2786 oascc.ZkStateReader$2.process A cluster state change: WatchedEvent state:SyncConnected type:NodeDataChanged path:/clusterstate.json, has occurred - updating... (live nodes size: 2)
[junit4:junit4]   2> 6721 T2780 oascc.ZkStateReader$2.process A cluster state change: WatchedEvent state:SyncConnected type:NodeDataChanged path:/clusterstate.json, has occurred - updating... (live nodes size: 2)
[junit4:junit4]   2> 6721 T2799 oascc.ZkStateReader$2.process A cluster state change: WatchedEvent state:SyncConnected type:NodeDataChanged path:/clusterstate.json, has occurred - updating... (live nodes size: 2)
[junit4:junit4]   2> 7442 T2800 oasc.CoreContainer.registerCore registering core: collection1
[junit4:junit4]   2> 7442 T2800 oasc.ZkController.register Register replica - core:collection1 address:http://127.0.0.1:51801 collection:collection1 shard:shard1
[junit4:junit4]   2> 7444 T2800 oascc.SolrZkClient.makePath makePath: /collections/collection1/leader_elect/shard1/election
[junit4:junit4]   2> 7457 T2763 oazs.PrepRequestProcessor.pRequest Got user-level KeeperException when processing sessionid:0x13cc738a5500006 type:delete cxid:0x47 zxid:0x5b txntype:-1 reqpath:n/a Error Path:/solr/collections/collection1/leaders Error:KeeperErrorCode = NoNode for /solr/collections/collection1/leaders
[junit4:junit4]   2> 7458 T2800 oasc.ShardLeaderElectionContext.runLeaderProcess Running the leader process.
[junit4:junit4]   2> 7459 T2763 oazs.PrepRequestProcessor.pRequest Got user-level KeeperException when processing sessionid:0x13cc738a5500006 type:create cxid:0x48 zxid:0x5c txntype:-1 reqpath:n/a Error Path:/solr/overseer Error:KeeperErrorCode = NodeExists for /solr/overseer
[junit4:junit4]   2> 7462 T2800 oasc.ShardLeaderElectionContext.waitForReplicasToComeUp Enough replicas found to continue.
[junit4:junit4]   2> 7463 T2800 oasc.ShardLeaderElectionContext.runLeaderProcess I may be the new leader - try and sync
[junit4:junit4]   2> 7463 T2800 oasc.SyncStrategy.sync Sync replicas to http://127.0.0.1:51801/collection1/
[junit4:junit4]   2> 7464 T2800 oasc.SyncStrategy.syncReplicas Sync Success - now sync replicas to me
[junit4:junit4]   2> 7464 T2800 oasc.SyncStrategy.syncToMe http://127.0.0.1:51801/collection1/ has no replicas
[junit4:junit4]   2> 7464 T2800 oasc.ShardLeaderElectionContext.runLeaderProcess I am the new leader: http://127.0.0.1:51801/collection1/
[junit4:junit4]   2> 7464 T2800 oascc.SolrZkClient.makePath makePath: /collections/collection1/leaders/shard1
[junit4:junit4]   2> 7474 T2763 oazs.PrepRequestProcessor.pRequest Got user-level KeeperException when processing sessionid:0x13cc738a5500006 type:create cxid:0x52 zxid:0x60 txntype:-1 reqpath:n/a Error Path:/solr/overseer Error:KeeperErrorCode = NodeExists for /solr/overseer
[junit4:junit4]   2> 8230 T2781 oascc.ZkStateReader.updateClusterState Updating cloud state from ZooKeeper... 
[junit4:junit4]   2> 8243 T2780 oascc.ZkStateReader$2.process A cluster state change: WatchedEvent state:SyncConnected type:NodeDataChanged path:/clusterstate.json, has occurred - updating... (live nodes size: 2)
[junit4:junit4]   2> 8244 T2786 oascc.ZkStateReader$2.process A cluster state change: WatchedEvent state:SyncConnected type:NodeDataChanged path:/clusterstate.json, has occurred - updating... (live nodes size: 2)
[junit4:junit4]   2> 8244 T2799 oascc.ZkStateReader$2.process A cluster state change: WatchedEvent state:SyncConnected type:NodeDataChanged path:/clusterstate.json, has occurred - updating... (live nodes size: 2)
[junit4:junit4]   2> 8297 T2800 oasc.ZkController.register We are http://127.0.0.1:51801/collection1/ and leader is http://127.0.0.1:51801/collection1/
[junit4:junit4]   2> 8298 T2800 oasc.ZkController.register No LogReplay needed for core=collection1 baseURL=http://127.0.0.1:51801
[junit4:junit4]   2> 8298 T2800 oasc.ZkController.checkRecovery I am the leader, no recovery necessary
[junit4:junit4]   2> 8298 T2800 oasc.ZkController.publish publishing core=collection1 state=active
[junit4:junit4]   2> 8299 T2800 oasc.ZkController.publish numShards not found on descriptor - reading it from system property
[junit4:junit4]   2> 8302 T2800 oascc.ZkStateReader.updateClusterState Updating cloud state from ZooKeeper... 
[junit4:junit4]   2> 8304 T2758 oass.SolrDispatchFilter.init user.dir=/Users/jenkins/jenkins-slave/workspace/Lucene-Solr-4.x-MacOSX/solr/build/solr-core/test/J0
[junit4:junit4]   2> 8305 T2758 oass.SolrDispatchFilter.init SolrDispatchFilter.init() done
[junit4:junit4]   2> 8306 T2758 oascsi.HttpClientUtil.createClient Creating new http client, config:maxConnections=128&maxConnectionsPerHost=32&followRedirects=false
[junit4:junit4]   2> 8513 T2758 oejs.Server.doStart jetty-8.1.8.v20121106
[junit4:junit4]   2> 8520 T2758 oejs.AbstractConnector.doStart Started SelectChannelConnector@127.0.0.1:51804
[junit4:junit4]   2> 8521 T2758 oass.SolrDispatchFilter.init SolrDispatchFilter.init()
[junit4:junit4]   2> 8522 T2758 oasc.SolrResourceLoader.locateSolrHome JNDI not configured for solr (NoInitialContextEx)
[junit4:junit4]   2> 8522 T2758 oasc.SolrResourceLoader.locateSolrHome using system property solr.solr.home: /Users/jenkins/jenkins-slave/workspace/Lucene-Solr-4.x-MacOSX/solr/build/solr-core/test/J0/./org.apache.solr.cloud.BasicDistributedZkTest-jetty2-1360552052149
[junit4:junit4]   2> 8523 T2758 oasc.CoreContainer$Initializer.initialize looking for solr.xml: /Users/jenkins/jenkins-slave/workspace/Lucene-Solr-4.x-MacOSX/solr/build/solr-core/test/J0/./org.apache.solr.cloud.BasicDistributedZkTest-jetty2-1360552052149/solr.xml
[junit4:junit4]   2> 8524 T2758 oasc.CoreContainer.<init> New CoreContainer 1538805187
[junit4:junit4]   2> 8524 T2758 oasc.CoreContainer.load Loading CoreContainer using Solr Home: '/Users/jenkins/jenkins-slave/workspace/Lucene-Solr-4.x-MacOSX/solr/build/solr-core/test/J0/./org.apache.solr.cloud.BasicDistributedZkTest-jetty2-1360552052149/'
[junit4:junit4]   2> 8525 T2758 oasc.SolrResourceLoader.<init> new SolrResourceLoader for directory: '/Users/jenkins/jenkins-slave/workspace/Lucene-Solr-4.x-MacOSX/solr/build/solr-core/test/J0/./org.apache.solr.cloud.BasicDistributedZkTest-jetty2-1360552052149/'
[junit4:junit4]   2> 8578 T2758 oashc.HttpShardHandlerFactory.getParameter Setting socketTimeout to: 60000
[junit4:junit4]   2> 8579 T2758 oashc.HttpShardHandlerFactory.getParameter Setting urlScheme to: http://
[junit4:junit4]   2> 8580 T2758 oashc.HttpShardHandlerFactory.getParameter Setting connTimeout to: 15000
[junit4:junit4]   2> 8580 T2758 oashc.HttpShardHandlerFactory.getParameter Setting maxConnectionsPerHost to: 20
[junit4:junit4]   2> 8581 T2758 oashc.HttpShardHandlerFactory.getParameter Setting corePoolSize to: 0
[junit4:junit4]   2> 8581 T2758 oashc.HttpShardHandlerFactory.getParameter Setting maximumPoolSize to: 2147483647
[junit4:junit4]   2> 8582 T2758 oashc.HttpShardHandlerFactory.getParameter Setting maxThreadIdleTime to: 5
[junit4:junit4]   2> 8583 T2758 oashc.HttpShardHandlerFactory.getParameter Setting sizeOfQueue to: -1
[junit4:junit4]   2> 8583 T2758 oashc.HttpShardHandlerFactory.getParameter Setting fairnessPolicy to: false
[junit4:junit4]   2> 8584 T2758 oascsi.HttpClientUtil.createClient Creating new http client, config:maxConnectionsPerHost=20&maxConnections=10000&socketTimeout=60000&connTimeout=15000&retry=false
[junit4:junit4]   2> 8597 T2758 oasc.CoreContainer.load Registering Log Listener
[junit4:junit4]   2> 8641 T2758 oasc.CoreContainer.initZooKeeper Zookeeper client=127.0.0.1:51794/solr
[junit4:junit4]   2> 8642 T2758 oasc.ZkController.checkChrootPath zkHost includes chroot
[junit4:junit4]   2> 8643 T2758 oaz.ZooKeeper.<init> Initiating client connection, connectString=127.0.0.1:51794 sessionTimeout=60000 watcher=org.apache.solr.common.cloud.ConnectionManager@66f198d9
[junit4:junit4]   2> 8645 T2758 oascc.ConnectionManager.waitForConnected Waiting for client to connect to ZooKeeper
[junit4:junit4]   2> 8645 T2811 oaz.ClientCnxn$SendThread.logStartConnect Opening socket connection to server localhost/127.0.0.1:51794. Will not attempt to authenticate using SASL (access denied ("javax.security.auth.AuthPermission" "getLoginConfiguration"))
[junit4:junit4]   2> 8647 T2811 oaz.ClientCnxn$SendThread.primeConnection Socket connection established to localhost/127.0.0.1:51794, initiating session
[junit4:junit4]   2> 8648 T2760 oazs.NIOServerCnxnFactory.run Accepted socket connection from /127.0.0.1:51805
[junit4:junit4]   2> 8648 T2760 oazs.ZooKeeperServer.processConnectRequest Client attempting to establish new session at /127.0.0.1:51805
[junit4:junit4]   2> 8649 T2762 oazs.ZooKeeperServer.finishSessionInit Established session 0x13cc738a5500007 with negotiated timeout 20000 for client /127.0.0.1:51805
[junit4:junit4]   2> 8650 T2811 oaz.ClientCnxn$SendThread.onConnected Session establishment complete on server localhost/127.0.0.1:51794, sessionid = 0x13cc738a5500007, negotiated timeout = 20000
[junit4:junit4]   2> 8650 T2812 oascc.ConnectionManager.process Watcher org.apache.solr.common.cloud.ConnectionManager@66f198d9 name:ZooKeeperConnection Watcher:127.0.0.1:51794 got event WatchedEvent state:SyncConnected type:None path:null path:null type:None
[junit4:junit4]   2> 8650 T2758 oascc.ConnectionManager.waitForConnected Client is connected to ZooKeeper
[junit4:junit4]   2> 8652 T2763 oazs.PrepRequestProcessor.pRequest2Txn Processed session termination for sessionid: 0x13cc738a5500007
[junit4:junit4]   2> 8654 T2760 oazs.NIOServerCnxn.closeSock Closed socket connection for client /127.0.0.1:51805 which had sessionid 0x13cc738a5500007
[junit4:junit4]   2> 8654 T2758 oaz.ZooKeeper.close Session: 0x13cc738a5500007 closed
[junit4:junit4]   2> 8654 T2812 oaz.ClientCnxn$EventThread.run EventThread shut down
[junit4:junit4]   2> 8655 T2758 oascsi.HttpClientUtil.createClient Creating new http client, config:maxConnections=500&maxConnectionsPerHost=16&socketTimeout=60000&connTimeout=15000
[junit4:junit4]   2> 8663 T2758 oaz.ZooKeeper.<init> Initiating client connection, connectString=127.0.0.1:51794/solr sessionTimeout=30000 watcher=org.apache.solr.common.cloud.ConnectionManager@7e9f196e
[junit4:junit4]   2> 8666 T2758 oascc.ConnectionManager.waitForConnected Waiting for client to connect to ZooKeeper
[junit4:junit4]   2> 8666 T2813 oaz.ClientCnxn$SendThread.logStartConnect Opening socket connection to server localhost/127.0.0.1:51794. Will not attempt to authenticate using SASL (access denied ("javax.security.auth.AuthPermission" "getLoginConfiguration"))
[junit4:junit4]   2> 8667 T2813 oaz.ClientCnxn$SendThread.primeConnection Socket connection established to localhost/127.0.0.1:51794, initiating session
[junit4:junit4]   2> 8668 T2760 oazs.NIOServerCnxnFactory.run Accepted socket connection from /127.0.0.1:51806
[junit4:junit4]   2> 8669 T2760 oazs.ZooKeeperServer.processConnectRequest Client attempting to establish new session at /127.0.0.1:51806
[junit4:junit4]   2> 8671 T2762 oazs.ZooKeeperServer.finishSessionInit Established session 0x13cc738a5500008 with negotiated timeout 20000 for client /127.0.0.1:51806
[junit4:junit4]   2> 8671 T2813 oaz.ClientCnxn$SendThread.onConnected Session establishment complete on server localhost/127.0.0.1:51794, sessionid = 0x13cc738a5500008, negotiated timeout = 20000
[junit4:junit4]   2> 8671 T2814 oascc.ConnectionManager.process Watcher org.apache.solr.common.cloud.ConnectionManager@7e9f196e name:ZooKeeperConnection Watcher:127.0.0.1:51794/solr got event WatchedEvent state:SyncConnected type:None path:null path:null type:None
[junit4:junit4]   2> 8672 T2758 oascc.ConnectionManager.waitForConnected Client is connected to ZooKeeper
[junit4:junit4]   2> 8673 T2763 oazs.PrepRequestProcessor.pRequest Got user-level KeeperException when processing sessionid:0x13cc738a5500008 type:create cxid:0x1 zxid:0x6d txntype:-1 reqpath:n/a Error Path:/solr/overseer Error:KeeperErrorCode = NodeExists for /solr/overseer
[junit4:junit4]   2> 8675 T2763 oazs.PrepRequestProcessor.pRequest Got user-level KeeperException when processing sessionid:0x13cc738a5500008 type:create cxid:0x2 zxid:0x6e txntype:-1 reqpath:n/a Error Path:/solr/overseer Error:KeeperErrorCode = NodeExists for /solr/overseer
[junit4:junit4]   2> 8679 T2758 oascc.ZkStateReader.createClusterStateWatchersAndUpdate Updating cluster state from ZooKeeper... 
[junit4:junit4]   2> 8684 T2758 oasc.ZkController.createEphemeralLiveNode Register node as live in ZooKeeper:/live_nodes/127.0.0.1:51804_
[junit4:junit4]   2> 8686 T2763 oazs.PrepRequestProcessor.pRequest Got user-level KeeperException when processing sessionid:0x13cc738a5500008 type:delete cxid:0x9 zxid:0x6f txntype:-1 reqpath:n/a Error Path:/solr/live_nodes/127.0.0.1:51804_ Error:KeeperErrorCode = NoNode for /solr/live_nodes/127.0.0.1:51804_
[junit4:junit4]   2> 8687 T2758 oascc.SolrZkClient.makePath makePath: /live_nodes/127.0.0.1:51804_
[junit4:junit4]   2> 8694 T2780 oascc.ZkStateReader$3.process Updating live nodes... (3)
[junit4:junit4]   2> 8694 T2799 oascc.ZkStateReader$3.process Updating live nodes... (3)
[junit4:junit4]   2> 8694 T2799 oascc.ZkStateReader$2.process A cluster state change: WatchedEvent state:SyncConnected type:NodeChildrenChanged path:/live_nodes, has occurred - updating... (live nodes size: 3)
[junit4:junit4]   2> 8694 T2786 oascc.ZkStateReader$3.process Updating live nodes... (3)
[junit4:junit4]   2> 8695 T2786 oascc.ZkStateReader$2.process A cluster state change: WatchedEvent state:SyncConnected type:NodeChildrenChanged path:/live_nodes, has occurred - updating... (live nodes size: 3)
[junit4:junit4]   2> 8695 T2780 oascc.ZkStateReader$2.process A cluster state change: WatchedEvent state:SyncConnected type:NodeChildrenChanged path:/live_nodes, has occurred - updating... (live nodes size: 3)
[junit4:junit4]   2> 8695 T2814 oascc.ZkStateReader$3.process Updating live nodes... (3)
[junit4:junit4]   2> 8707 T2815 oasc.CoreContainer.create Creating SolrCore 'collection1' using instanceDir: /Users/jenkins/jenkins-slave/workspace/Lucene-Solr-4.x-MacOSX/solr/build/solr-core/test/J0/./org.apache.solr.cloud.BasicDistributedZkTest-jetty2-1360552052149/collection1
[junit4:junit4]   2> 8707 T2815 oasc.ZkController.createCollectionZkNode Check for collection zkNode:collection1
[junit4:junit4]   2> 8709 T2815 oasc.ZkController.createCollectionZkNode Collection zkNode exists
[junit4:junit4]   2> 8709 T2815 oasc.ZkController.readConfigName Load collection config from:/collections/collection1
[junit4:junit4]   2> 8711 T2815 oasc.SolrResourceLoader.<init> new SolrResourceLoader for directory: '/Users/jenkins/jenkins-slave/workspace/Lucene-Solr-4.x-MacOSX/solr/build/solr-core/test/J0/./org.apache.solr.cloud.BasicDistributedZkTest-jetty2-1360552052149/collection1/'
[junit4:junit4]   2> 8712 T2815 oasc.SolrResourceLoader.replaceClassLoader Adding 'file:/Users/jenkins/jenkins-slave/workspace/Lucene-Solr-4.x-MacOSX/solr/build/solr-core/test/J0/org.apache.solr.cloud.BasicDistributedZkTest-jetty2-1360552052149/collection1/lib/classes/' to classloader
[junit4:junit4]   2> 8713 T2815 oasc.SolrResourceLoader.replaceClassLoader Adding 'file:/Users/jenkins/jenkins-slave/workspace/Lucene-Solr-4.x-MacOSX/solr/build/solr-core/test/J0/org.apache.solr.cloud.BasicDistributedZkTest-jetty2-1360552052149/collection1/lib/README' to classloader
[junit4:junit4]   2> 8770 T2815 oasc.SolrConfig.<init> Using Lucene MatchVersion: LUCENE_42
[junit4:junit4]   2> 8861 T2815 oasc.SolrConfig.<init> Loaded SolrConfig: solrconfig.xml
[junit4:junit4]   2> 8863 T2815 oass.IndexSchema.readSchema Reading Solr Schema
[junit4:junit4]   2> 8873 T2815 oass.IndexSchema.readSchema Schema name=test
[junit4:junit4]   2> 9724 T2815 oass.OpenExchangeRatesOrgProvider.init Initialized with rates=open-exchange-rates.json, refreshInterval=1440.
[junit4:junit4]   2> 9733 T2815 oass.IndexSchema.readSchema default search field in schema is text
[junit4:junit4]   2> 9737 T2815 oass.IndexSchema.readSchema unique key field: id
[junit4:junit4]   2> 9755 T2781 oascc.ZkStateReader.updateClusterState Updating cloud state from ZooKeeper... 
[junit4:junit4]   2> 9756 T2781 oasc.Overseer$ClusterStateUpdater.updateState Update state numShards=2 message={
[junit4:junit4]   2> 	  "operation":"state",
[junit4:junit4]   2> 	  "numShards":"2",
[junit4:junit4]   2> 	  "shard":"shard1",
[junit4:junit4]   2> 	  "roles":null,
[junit4:junit4]   2> 	  "state":"active",
[junit4:junit4]   2> 	  "core":"collection1",
[junit4:junit4]   2> 	  "collection":"collection1",
[junit4:junit4]   2> 	  "node_name":"127.0.0.1:51801_",
[junit4:junit4]   2> 	  "base_url":"http://127.0.0.1:51801"}
[junit4:junit4]   2> 9760 T2815 oass.FileExchangeRateProvider.reload Reloading exchange rates from file currency.xml
[junit4:junit4]   2> 9763 T2780 oascc.ZkStateReader$2.process A cluster state change: WatchedEvent state:SyncConnected type:NodeDataChanged path:/clusterstate.json, has occurred - updating... (live nodes size: 3)
[junit4:junit4]   2> 9764 T2786 oascc.ZkStateReader$2.process A cluster state change: WatchedEvent state:SyncConnected type:NodeDataChanged path:/clusterstate.json, has occurred - updating... (live nodes size: 3)
[junit4:junit4]   2> 9766 T2815 oass.FileExchangeRateProvider.reload Reloading exchange rates from file currency.xml
[junit4:junit4]   2> 9768 T2799 oascc.ZkStateReader$2.process A cluster state change: WatchedEvent state:SyncConnected type:NodeDataChanged path:/clusterstate.json, has occurred - updating... (live nodes size: 3)
[junit4:junit4]   2> 9769 T2814 oascc.ZkStateReader$2.process A cluster state change: WatchedEvent state:SyncConnected type:NodeDataChanged path:/clusterstate.json, has occurred - updating... (live nodes size: 3)
[junit4:junit4]   2> 9774 T2815 oass.OpenExchangeRatesOrgProvider.reload Reloading exchange rates from open-exchange-rates.json
[junit4:junit4]   2> 9785 T2815 oass.OpenExchangeRatesOrgProvider.reload Reloading exchange rates from open-exchange-rates.json
[junit4:junit4]   2> 9788 T2815 oasc.SolrCore.<init> [collection1] Opening new SolrCore at /Users/jenkins/jenkins-slave/workspace/Lucene-Solr-4.x-MacOSX/solr/build/solr-core/test/J0/./org.apache.solr.cloud.BasicDistributedZkTest-jetty2-1360552052149/collection1/, dataDir=./org.apache.solr.cloud.BasicDistributedZkTest-1360552043848/jetty2/
[junit4:junit4]   2> 9788 T2815 oasc.JmxMonitoredMap.<init> JMX monitoring is enabled. Adding Solr mbeans to JMX Server: com.sun.jmx.mbeanserver.JmxMBeanServer@746a56f0
[junit4:junit4]   2> 9789 T2815 oasc.SolrCore.initDirectoryFactory solr.NRTCachingDirectoryFactory
[junit4:junit4]   2> 9790 T2815 oasc.CachingDirectoryFactory.get return new directory for /Users/jenkins/jenkins-slave/workspace/Lucene-Solr-4.x-MacOSX/solr/build/solr-core/test/J0/./org.apache.solr.cloud.BasicDistributedZkTest-1360552043848/jetty2 forceNew:false
[junit4:junit4]   2> 9790 T2815 oasc.CachingDirectoryFactory.close Releasing directory:/Users/jenkins/jenkins-slave/workspace/Lucene-Solr-4.x-MacOSX/solr/build/solr-core/test/J0/./org.apache.solr.cloud.BasicDistributedZkTest-1360552043848/jetty2
[junit4:junit4]   2> 9791 T2815 oasc.SolrCore.getNewIndexDir New index directory detected: old=null new=./org.apache.solr.cloud.BasicDistributedZkTest-1360552043848/jetty2/index/
[junit4:junit4]   2> 9791 T2815 oasc.SolrCore.initIndex WARNING [collection1] Solr index directory './org.apache.solr.cloud.BasicDistributedZkTest-1360552043848/jetty2/index' doesn't exist. Creating new index...
[junit4:junit4]   2> 9792 T2815 oasc.CachingDirectoryFactory.get return new directory for /Users/jenkins/jenkins-slave/workspace/Lucene-Solr-4.x-MacOSX/solr/build/solr-core/test/J0/./org.apache.solr.cloud.BasicDistributedZkTest-1360552043848/jetty2/index forceNew:false
[junit4:junit4]   2> 9797 T2815 oasc.SolrDeletionPolicy.onCommit SolrDeletionPolicy.onCommit: commits:num=1
[junit4:junit4]   2> 		commit{dir=RateLimitedDirectoryWrapper(NRTCachingDirectory(org.apache.lucene.store.NIOFSDirectory@/Users/jenkins/jenkins-slave/workspace/Lucene-Solr-4.x-MacOSX/solr/build/solr-core/test/J0/org.apache.solr.cloud.BasicDistributedZkTest-1360552043848/jetty2/index lockFactory=org.apache.lucene.store.NativeFSLockFactory@4a9419cb; maxCacheMB=48.0 maxMergeSizeMB=4.0)),segFN=segments_1,generation=1,filenames=[segments_1]
[junit4:junit4]   2> 9798 T2815 oasc.SolrDeletionPolicy.updateCommits newest commit = 1[segments_1]
[junit4:junit4]   2> 9798 T2815 oasc.CachingDirectoryFactory.close Releasing directory:/Users/jenkins/jenkins-slave/workspace/Lucene-Solr-4.x-MacOSX/solr/build/solr-core/test/J0/./org.apache.solr.cloud.BasicDistributedZkTest-1360552043848/jetty2/index
[junit4:junit4]   2> 9799 T2815 oasc.SolrCore.initWriters created xml: solr.XMLResponseWriter
[junit4:junit4]   2> 9802 T2815 oasup.UpdateRequestProcessorChain.init inserting DistributedUpdateProcessorFactory into updateRequestProcessorChain "dedupe"
[junit4:junit4]   2> 9803 T2815 oasup.UpdateRequestProcessorChain.init inserting DistributedUpdateProcessorFactory into updateRequestProcessorChain "dedupe-allfields"
[junit4:junit4]   2> 9803 T2815 oasup.UpdateRequestProcessorChain.init inserting DistributedUpdateProcessorFactory into updateRequestProcessorChain "stored_sig"
[junit4:junit4]   2> 9805 T2815 oasup.UpdateRequestProcessorChain.init inserting DistributedUpdateProcessorFactory into updateRequestProcessorChain "uniq-fields"
[junit4:junit4]   2> 9806 T2815 oasup.UpdateRequestProcessorChain.init inserting DistributedUpdateProcessorFactory into updateRequestProcessorChain "distrib-dup-test-chain-implicit"
[junit4:junit4]   2> 9806 T2815 oasc.RequestHandlers.initHandlersFromConfig adding lazy requestHandler: solr.ReplicationHandler
[junit4:junit4]   2> 9807 T2815 oasc.RequestHandlers.initHandlersFromConfig created /replication: solr.ReplicationHandler
[junit4:junit4]   2> 9807 T2815 oasc.RequestHandlers.initHandlersFromConfig created standard: solr.StandardRequestHandler
[junit4:junit4]   2> 9808 T2815 oasc.RequestHandlers.initHandlersFromConfig created /get: solr.RealTimeGetHandler
[junit4:junit4]   2> 9809 T2815 oasc.RequestHandlers.initHandlersFromConfig created dismax: solr.SearchHandler
[junit4:junit4]   2> 9810 T2815 oasc.RequestHandlers.initHandlersFromConfig created mock: org.apache.solr.core.MockQuerySenderListenerReqHandler
[junit4:junit4]   2> 9810 T2815 oasc.RequestHandlers.initHandlersFromConfig created /admin/: org.apache.solr.handler.admin.AdminHandlers
[junit4:junit4]   2> 9811 T2815 oasc.RequestHandlers.initHandlersFromConfig created defaults: solr.StandardRequestHandler
[junit4:junit4]   2> 9811 T2815 oasc.RequestHandlers.initHandlersFromConfig adding lazy requestHandler: solr.StandardRequestHandler
[junit4:junit4]   2> 9812 T2815 oasc.RequestHandlers.initHandlersFromConfig created lazy: solr.StandardRequestHandler
[junit4:junit4]   2> 9813 T2815 oasc.RequestHandlers.initHandlersFromConfig created /update: solr.UpdateRequestHandler
[junit4:junit4]   2> 9814 T2815 oasc.RequestHandlers.initHandlersFromConfig created /terms: org.apache.solr.handler.component.SearchHandler
[junit4:junit4]   2> 9814 T2815 oasc.RequestHandlers.initHandlersFromConfig created spellCheckCompRH: org.apache.solr.handler.component.SearchHandler
[junit4:junit4]   2> 9815 T2815 oasc.RequestHandlers.initHandlersFromConfig created spellCheckCompRH_Direct: org.apache.solr.handler.component.SearchHandler
[junit4:junit4]   2> 9816 T2815 oasc.RequestHandlers.initHandlersFromConfig created spellCheckWithWordbreak: org.apache.solr.handler.component.SearchHandler
[junit4:junit4]   2> 9817 T2815 oasc.RequestHandlers.initHandlersFromConfig created spellCheckWithWordbreak_Direct: org.apache.solr.handler.component.SearchHandler
[junit4:junit4]   2> 9817 T2815 oasc.RequestHandlers.initHandlersFromConfig created spellCheckCompRH1: org.apache.solr.handler.component.SearchHandler
[junit4:junit4]   2> 9818 T2815 oasc.RequestHandlers.initHandlersFromConfig created mltrh: org.apache.solr.handler.component.SearchHandler
[junit4:junit4]   2> 9819 T2815 oasc.RequestHandlers.initHandlersFromConfig created tvrh: org.apache.solr.handler.component.SearchHandler
[junit4:junit4]   2> 9820 T2815 oasc.RequestHandlers.initHandlersFromConfig created /mlt: solr.MoreLikeThisHandler
[junit4:junit4]   2> 9820 T2815 oasc.RequestHandlers.initHandlersFromConfig created /debug/dump: solr.DumpRequestHandler
[junit4:junit4]   2> 9827 T2815 oashl.XMLLoader.init xsltCacheLifetimeSeconds=60
[junit4:junit4]   2> 9831 T2815 oasc.SolrCore.initDeprecatedSupport WARNING solrconfig.xml uses deprecated <admin/gettableFiles>, Please update your config to use the ShowFileRequestHandler.
[junit4:junit4]   2> 9833 T2815 oasc.SolrCore.initDeprecatedSupport WARNING adding ShowFileRequestHandler with hidden files: [SCHEMA.XML, OLD_SYNONYMS.TXT, STOPWORDS.TXT, PROTWORDS.TXT, OPEN-EXCHANGE-RATES.JSON, SYNONYMS.TXT, CURRENCY.XML, MAPPING-ISOLATIN1ACCENT.TXT]
[junit4:junit4]   2> 9836 T2815 oasc.CachingDirectoryFactory.close Releasing directory:/Users/jenkins/jenkins-slave/workspace/Lucene-Solr-4.x-MacOSX/solr/build/solr-core/test/J0/./org.apache.solr.cloud.BasicDistributedZkTest-1360552043848/jetty2
[junit4:junit4]   2> 9837 T2815 oass.SolrIndexSearcher.<init> Opening Searcher@65f8e067 main
[junit4:junit4]   2> 9839 T2815 oasu.CommitTracker.<init> Hard AutoCommit: disabled
[junit4:junit4]   2> 9839 T2815 oasu.CommitTracker.<init> Soft AutoCommit: disabled
[junit4:junit4]   2> 9840 T2815 oashc.SpellCheckComponent.inform Initializing spell checkers
[junit4:junit4]   2> 9846 T2815 oass.DirectSolrSpellChecker.init init: {name=direct,classname=DirectSolrSpellChecker,field=lowerfilt,minQueryLength=3}
[junit4:junit4]   2> 9884 T2816 oasc.SolrCore.registerSearcher [collection1] Registered new searcher Searcher@65f8e067 main{StandardDirectoryReader(segments_1:1)}
[junit4:junit4]   2> 9892 T2815 oasc.ZkController.publish publishing core=collection1 state=down
[junit4:junit4]   2> 9892 T2815 oasc.ZkController.publish numShards not found on descriptor - reading it from system property
[junit4:junit4]   2> 11275 T2781 oascc.ZkStateReader.updateClusterState Updating cloud state from ZooKeeper... 
[junit4:junit4]   2> 11276 T2781 oasc.Overseer$ClusterStateUpdater.updateState Update state numShards=2 message={
[junit4:junit4]   2> 	  "operation":"state",
[junit4:junit4]   2> 	  "numShards":"2",
[junit4:junit4]   2> 	  "shard":null,
[junit4:junit4]   2> 	  "roles":null,
[junit4:junit4]   2> 	  "state":"down",
[junit4:junit4]   2> 	  "core":"collection1",
[junit4:junit4]   2> 	  "collection":"collection1",
[junit4:junit4]   2> 	  "node_name":"127.0.0.1:51804_",
[junit4:junit4]   2> 	  "base_url":"http://127.0.0.1:51804"}
[junit4:junit4]   2> 11276 T2781 oasc.Overseer$ClusterStateUpdater.updateState Collection already exists with numShards=2
[junit4:junit4]   2> 11277 T2781 oasc.Overseer$ClusterStateUpdater.updateState Assigning new node to shard shard=shard2
[junit4:junit4]   2> 11285 T2780 oascc.ZkStateReader$2.process A cluster state change: WatchedEvent state:SyncConnected type:NodeDataChanged path:/clusterstate.json, has occurred - updating... (live nodes size: 3)
[junit4:junit4]   2> 11285 T2799 oascc.ZkStateReader$2.process A cluster state change: WatchedEvent state:SyncConnected type:NodeDataChanged path:/clusterstate.json, has occurred - updating... (live nodes size: 3)
[junit4:junit4]   2> 11285 T2814 oascc.ZkStateReader$2.process A cluster state change: WatchedEvent state:SyncConnected type:NodeDataChanged path:/clusterstate.json, has occurred - updating... (live nodes size: 3)
[junit4:junit4]   2> 11285 T2786 oascc.ZkStateReader$2.process A cluster state change: WatchedEvent state:SyncConnected type:NodeDataChanged path:/clusterstate.json, has occurred - updating... (live nodes size: 3)
[junit4:junit4]   2> 11897 T2815 oasc.CoreContainer.registerCore registering core: collection1
[junit4:junit4]   2> 11897 T2815 oasc.ZkController.register Register replica - core:collection1 address:http://127.0.0.1:51804 collection:collection1 shard:shard2
[junit4:junit4]   2> 11899 T2815 oascc.SolrZkClient.makePath makePath: /collections/collection1/leader_elect/shard2/election
[junit4:junit4]   2> 11912 T2763 oazs.PrepRequestProcessor.pRequest Got user-level KeeperException when processing sessionid:0x13cc738a5500008 type:delete cxid:0x46 zxid:0x7e txntype:-1 reqpath:n/a Error Path:/solr/collections/collection1/leaders/shard2 Error:KeeperErrorCode = NoNode for /solr/collections/collection1/leaders/shard2
[junit4:junit4]   2> 11914 T2815 oasc.ShardLeaderElectionContext.runLeaderProcess Running the leader process.
[junit4:junit4]   2> 11915 T2763 oazs.PrepRequestProcessor.pRequest Got user-level KeeperException when processing sessionid:0x13cc738a5500008 type:create cxid:0x47 zxid:0x7f txntype:-1 reqpath:n/a Error Path:/solr/overseer Error:KeeperErrorCode = NodeExists for /solr/overseer
[junit4:junit4]   2> 11919 T2815 oasc.ShardLeaderElectionContext.waitForReplicasToComeUp Enough replicas found to continue.
[junit4:junit4]   2> 11919 T2815 oasc.ShardLeaderElectionContext.runLeaderProcess I may be the new leader - try and sync
[junit4:junit4]   2> 11919 T2815 oasc.SyncStrategy.sync Sync replicas to http://127.0.0.1:51804/collection1/
[junit4:junit4]   2> 11920 T2815 oasc.SyncStrategy.syncReplicas Sync Success - now sync replicas to me
[junit4:junit4]   2> 11920 T2815 oasc.SyncStrategy.syncToMe http://127.0.0.1:51804/collection1/ has no replicas
[junit4:junit4]   2> 11920 T2815 oasc.ShardLeaderElectionContext.runLeaderProcess I am the new leader: http://127.0.0.1:51804/collection1/
[junit4:junit4]   2> 11921 T2815 oascc.SolrZkClient.makePath makePath: /collections/collection1/leaders/shard2
[junit4:junit4]   2> 11928 T2763 oazs.PrepRequestProcessor.pRequest Got user-level KeeperException when processing sessionid:0x13cc738a5500008 type:create cxid:0x50 zxid:0x82 txntype:-1 reqpath:n/a Error Path:/solr/overseer Error:KeeperErrorCode = NodeExists for /solr/overseer
[junit4:junit4]   2> 12794 T2781 oascc.ZkStateReader.updateClusterState Updating cloud state from ZooKeeper... 
[junit4:junit4]   2> 12810 T2799 oascc.ZkStateReader$2.process A cluster state change: WatchedEvent state:SyncConnected type:NodeDataChanged path:/clusterstate.json, has occurred - updating... (live nodes size: 3)
[junit4:junit4]   2> 12810 T2780 oascc.ZkStateReader$2.process A cluster state change: WatchedEvent state:SyncConnected type:NodeDataChanged path:/clusterstate.json, has occurred - updating... (live nodes size: 3)
[junit4:junit4]   2> 12811 T2786 oascc.ZkStateReader$2.process A cluster state change: WatchedEvent state:SyncConnected type:NodeDataChanged path:/clusterstate.json, has occurred - updating... (live nodes size: 3)
[junit4:junit4]   2> 12811 T2814 oascc.ZkStateReader$2.process A cluster state change: WatchedEvent state:SyncConnected type:NodeDataChanged path:/clusterstate.json, has occurred - updating... (live nodes size: 3)
[junit4:junit4]   2> 12857 T2815 oasc.ZkController.register We are http://127.0.0.1:51804/collection1/ and leader is http://127.0.0.1:51804/collection1/
[junit4:junit4]   2> 12857 T2815 oasc.ZkController.register No LogReplay needed for core=collection1 baseURL=http://127.0.0.1:51804
[junit4:junit4]   2> 12857 T2815 oasc.ZkController.checkRecovery I am the leader, no recovery necessary
[junit4:junit4]   2> 12858 T2815 oasc.ZkController.publish publishing core=collection1 state=active
[junit4:junit4]   2> 12858 T2815 oasc.ZkController.publish numShards not found on descriptor - reading it from system property
[junit4:junit4]   2> 12861 T2815 oascc.ZkStateReader.updateClusterState Updating cloud state from ZooKeeper... 
[junit4:junit4]   2> 12862 T2758 oass.SolrDispatchFilter.init user.dir=/Users/jenkins/jenkins-slave/workspace/Lucene-Solr-4.x-MacOSX/solr/build/solr-core/test/J0
[junit4:junit4]   2> 12863 T2758 oass.SolrDispatchFilter.init SolrDispatchFilter.init() done
[junit4:junit4]   2> 12863 T2758 oascsi.HttpClientUtil.createClient Creating new http client, config:maxConnections=128&maxConnectionsPerHost=32&followRedirects=false
[junit4:junit4]   2> 13039 T2758 oejs.Server.doStart jetty-8.1.8.v20121106
[junit4:junit4]   2> 13046 T2758 oejs.AbstractConnector.doStart Started SelectChannelConnector@127.0.0.1:51807
[junit4:junit4]   2> 13048 T2758 oass.SolrDispatchFilter.init SolrDispatchFilter.init()
[junit4:junit4]   2> 13049 T2758 oasc.SolrResourceLoader.locateSolrHome JNDI not configured for solr (NoInitialContextEx)
[junit4:junit4]   2> 13050 T2758 oasc.SolrResourceLoader.locateSolrHome using system property solr.solr.home: /Users/jenkins/jenkins-slave/workspace/Lucene-Solr-4.x-MacOSX/solr/build/solr-core/test/J0/./org.apache.solr.cloud.BasicDistributedZkTest-jetty3-1360552056706
[junit4:junit4]   2> 13051 T2758 oasc.CoreContainer$Initializer.initialize looking for solr.xml: /Users/jenkins/jenkins-slave/workspace/Lucene-Solr-4.x-MacOSX/solr/build/solr-core/test/J0/./org.apache.solr.cloud.BasicDistributedZkTest-jetty3-1360552056706/solr.xml
[junit4:junit4]   2> 13052 T2758 oasc.CoreContainer.<init> New CoreContainer 1709950640
[junit4:junit4]   2> 13053 T2758 oasc.CoreContainer.load Loading CoreContainer using Solr Home: '/Users/jenkins/jenkins-slave/workspace/Lucene-Solr-4.x-MacOSX/solr/build/solr-core/test/J0/./org.apache.solr.cloud.BasicDistributedZkTest-jetty3-1360552056706/'
[junit4:junit4]   2> 13054 T2758 oasc.SolrResourceLoader.<init> new SolrResourceLoader for directory: '/Users/jenkins/jenkins-slave/workspace/Lucene-Solr-4.x-MacOSX/solr/build/solr-core/test/J0/./org.apache.solr.cloud.BasicDistributedZkTest-jetty3-1360552056706/'
[junit4:junit4]   2> 13117 T2758 oashc.HttpShardHandlerFactory.getParameter Setting socketTimeout to: 60000
[junit4:junit4]   2> 13118 T2758 oashc.HttpShardHandlerFactory.getParameter Setting urlScheme to: http://
[junit4:junit4]   2> 13118 T2758 oashc.HttpShardHandlerFactory.getParameter Setting connTimeout to: 15000
[junit4:junit4]   2> 13119 T2758 oashc.HttpShardHandlerFactory.getParameter Setting maxConnectionsPerHost to: 20
[junit4:junit4]   2> 13119 T2758 oashc.HttpShardHandlerFactory.getParameter Setting corePoolSize to: 0
[junit4:junit4]   2> 13120 T2758 oashc.HttpShardHandlerFactory.getParameter Setting maximumPoolSize to: 2147483647
[junit4:junit4]   2> 13120 T2758 oashc.HttpShardHandlerFactory.getParameter Setting maxThreadIdleTime to: 5
[junit4:junit4]   2> 13121 T2758 oashc.HttpShardHandlerFactory.getParameter Setting sizeOfQueue to: -1
[junit4:junit4]   2> 13121 T2758 oashc.HttpShardHandlerFactory.getParameter Setting fairnessPolicy to: false
[junit4:junit4]   2> 13122 T2758 oascsi.HttpClientUtil.createClient Creating new http client, config:maxConnectionsPerHost=20&maxConnections=10000&socketTimeout=60000&connTimeout=15000&retry=false
[junit4:junit4]   2> 13133 T2758 oasc.CoreContainer.load Registering Log Listener
[junit4:junit4]   2> 13162 T2758 oasc.CoreContainer.initZooKeeper Zookeeper client=127.0.0.1:51794/solr
[junit4:junit4]   2> 13163 T2758 oasc.ZkController.checkChrootPath zkHost includes chroot
[junit4:junit4]   2> 13164 T2758 oaz.ZooKeeper.<init> Initiating client connection, connectString=127.0.0.1:51794 sessionTimeout=60000 watcher=org.apache.solr.common.cloud.ConnectionManager@69756a1e
[junit4:junit4]   2> 13165 T2758 oascc.ConnectionManager.waitForConnected Waiting for client to connect to ZooKeeper
[junit4:junit4]   2> 13166 T2826 oaz.ClientCnxn$SendThread.logStartConnect Opening socket connection to server localhost/127.0.0.1:51794. Will not attempt to authenticate using SASL (access denied ("javax.security.auth.AuthPermission" "getLoginConfiguration"))
[junit4:junit4]   2> 13167 T2826 oaz.ClientCnxn$SendThread.primeConnection Socket connection established to localhost/127.0.0.1:51794, initiating session
[junit4:junit4]   2> 13167 T2760 oazs.NIOServerCnxnFactory.run Accepted socket connection from /127.0.0.1:51808
[junit4:junit4]   2> 13168 T2760 oazs.ZooKeeperServer.processConnectRequest Client attempting to establish new session at /127.0.0.1:51808
[junit4:junit4]   2> 13169 T2762 oazs.ZooKeeperServer.finishSessionInit Established session 0x13cc738a5500009 with negotiated timeout 20000 for client /127.0.0.1:51808
[junit4:junit4]   2> 13170 T2826 oaz.ClientCnxn$SendThread.onConnected Session establishment complete on server localhost/127.0.0.1:51794, sessionid = 0x13cc738a5500009, negotiated timeout = 20000
[junit4:junit4]   2> 13170 T2827 oascc.ConnectionManager.process Watcher org.apache.solr.common.cloud.ConnectionManager@69756a1e name:ZooKeeperConnection Watcher:127.0.0.1:51794 got event WatchedEvent state:SyncConnected type:None path:null path:null type:None
[junit4:junit4]   2> 13171 T2758 oascc.ConnectionManager.waitForConnected Client is connected to ZooKeeper
[junit4:junit4]   2> 13173 T2763 oazs.PrepRequestProcessor.pRequest2Txn Processed session termination for sessionid: 0x13cc738a5500009
[junit4:junit4]   2> 13175 T2760 oazs.NIOServerCnxn.closeSock Closed socket connection for client /127.0.0.1:51808 which had sessionid 0x13cc738a5500009
[junit4:junit4]   2> 13175 T2827 oaz.ClientCnxn$EventThread.run EventThread shut down
[junit4:junit4]   2> 13175 T2758 oaz.ZooKeeper.close Session: 0x13cc738a5500009 closed
[junit4:junit4]   2> 13176 T2758 oascsi.HttpClientUtil.createClient Creating new http client, config:maxConnections=500&maxConnectionsPerHost=16&socketTimeout=60000&connTimeout=15000
[junit4:junit4]   2> 13180 T2758 oaz.ZooKeeper.<init> Initiating client connection, connectString=127.0.0.1:51794/solr sessionTimeout=30000 watcher=org.apache.solr.common.cloud.ConnectionManager@622a2a21
[junit4:junit4]   2> 13181 T2758 oascc.ConnectionManager.waitForConnected Waiting for client to connect to ZooKeeper
[junit4:junit4]   2> 13182 T2828 oaz.ClientCnxn$SendThread.logStartConnect Opening socket connection to server localhost/127.0.0.1:51794. Will not attempt to authenticate using SASL (access denied ("javax.security.auth.AuthPermission" "getLoginConfiguration"))
[junit4:junit4]   2> 13183 T2828 oaz.ClientCnxn$SendThread.primeConnection Socket connection established to localhost/127.0.0.1:51794, initiating session
[junit4:junit4]   2> 13184 T2760 oazs.NIOServerCnxnFactory.run Accepted socket connection from /127.0.0.1:51809
[junit4:junit4]   2> 13184 T2760 oazs.ZooKeeperServer.processConnectRequest Client attempting to establish new session at /127.0.0.1:51809
[junit4:junit4]   2> 13186 T2762 oazs.ZooKeeperServer.finishSessionInit Established session 0x13cc738a550000a with negotiated timeout 20000 for client /127.0.0.1:51809
[junit4:junit4]   2> 13186 T2828 oaz.ClientCnxn$SendThread.onConnected Session establishment complete on server localhost/127.0.0.1:51794, sessionid = 0x13cc738a550000a, negotiated timeout = 20000
[junit4:junit4]   2> 13187 T2829 oascc.ConnectionManager.process Watcher org.apache.solr.common.cloud.ConnectionManager@622a2a21 name:ZooKeeperConnection Watcher:127.0.0.1:51794/solr got event WatchedEvent state:SyncConnected type:None path:null path:null type:None
[junit4:junit4]   2> 13187 T2758 oascc.ConnectionManager.waitForConnected Client is connected to ZooKeeper
[junit4:junit4]   2> 13188 T2763 oazs.PrepRequestProcessor.pRequest Got user-level KeeperException when processing sessionid:0x13cc738a550000a type:create cxid:0x1 zxid:0x8f txntype:-1 reqpath:n/a Error Path:/solr/overseer Error:KeeperErrorCode = NodeExists for /solr/overseer
[junit4:junit4]   2> 13190 T2763 oazs.PrepRequestProcessor.pRequest Got user-level KeeperException when processing sessionid:0x13cc738a550000a type:create cxid:0x2 zxid:0x90 txntype:-1 reqpath:n/a Error Path:/solr/overseer Error:KeeperErrorCode = NodeExists for /solr/overseer
[junit4:junit4]   2> 13193 T2758 oascc.ZkStateReader.createClusterStateWatchersAndUpdate Updating cluster state from ZooKeeper... 
[junit4:junit4]   2> 13197 T2758 oasc.ZkController.createEphemeralLiveNode Register node as live in ZooKeeper:/live_nodes/127.0.0.1:51807_
[junit4:junit4]   2> 13198 T2763 oazs.PrepRequestProcessor.pRequest Got user-level KeeperException when processing sessionid:0x13cc738a550000a type:delete cxid:0x9 zxid:0x91 txntype:-1 reqpath:n/a Error Path:/solr/live_nodes/127.0.0.1:51807_ Error:KeeperErrorCode = NoNode for /solr/live_nodes/127.0.0.1:51807_
[junit4:junit4]   2> 13200 T2758 oascc.SolrZkClient.makePath makePath: /live_nodes/127.0.0.1:51807_
[junit4:junit4]   2> 13205 T2786 oascc.ZkStateReader$3.process Updating live nodes... (4)
[junit4:junit4]   2> 13205 T2786 oascc.ZkStateReader$2.process A cluster state change: WatchedEvent state:SyncConnected type:NodeChildrenChanged path:/live_nodes, has occurred - updating... (live nodes size: 4)
[junit4:junit4]   2> 13206 T2829 oascc.ZkStateReader$3.process Updating live nodes... (4)
[junit4:junit4]   2> 13206 T2814 oascc.ZkStateReader$3.process Updating live nodes... (4)
[junit4:junit4]   2> 13206 T2780 oascc.ZkStateReader$3.process Updating live nodes... (4)
[junit4:junit4]   2> 13207 T2780 oascc.ZkStateReader$2.process A cluster state change: WatchedEvent state:SyncConnected type:NodeChildrenChanged path:/live_nodes, has occurred - updating... (live nodes size: 4)
[junit4:junit4]   2> 13207 T2799 oascc.ZkStateReader$3.process Updating live nodes... (4)
[junit4:junit4]   2> 13208 T2799 oascc.ZkStateReader$2.process A cluster state change: WatchedEvent state:SyncConnected type:NodeChildrenChanged path:/live_nodes, has occurred - updating... (live nodes size: 4)
[junit4:junit4]   2> 13207 T2814 oascc.ZkStateReader$2.process A cluster state change: WatchedEvent state:SyncConnected type:NodeChildrenChanged path:/live_nodes, has occurred - updating... (live nodes size: 4)
[junit4:junit4]   2> 13218 T2830 oasc.CoreContainer.create Creating SolrCore 'collection1' using instanceDir: /Users/jenkins/jenkins-slave/workspace/Lucene-Solr-4.x-MacOSX/solr/build/solr-core/test/J0/./org.apache.solr.cloud.BasicDistributedZkTest-jetty3-1360552056706/collection1
[junit4:junit4]   2> 13219 T2830 oasc.ZkController.createCollectionZkNode Check for collection zkNode:collection1
[junit4:junit4]   2> 13220 T2830 oasc.ZkController.createCollectionZkNode Collection zkNode exists
[junit4:junit4]   2> 13220 T2830 oasc.ZkController.readConfigName Load collection config from:/collections/collection1
[junit4:junit4]   2> 13222 T2830 oasc.SolrResourceLoader.<init> new SolrResourceLoader for directory: '/Users/jenkins/jenkins-slave/workspace/Lucene-Solr-4.x-MacOSX/solr/build/solr-core/test/J0/./org.apache.solr.cloud.BasicDistributedZkTest-jetty3-1360552056706/collection1/'
[junit4:junit4]   2> 13224 T2830 oasc.SolrResourceLoader.replaceClassLoader Adding 'file:/Users/jenkins/jenkins-slave/workspace/Lucene-Solr-4.x-MacOSX/solr/build/solr-core/test/J0/org.apache.solr.cloud.BasicDistributedZkTest-jetty3-1360552056706/collection1/lib/classes/' to classloader
[junit4:junit4]   2> 13224 T2830 oasc.SolrResourceLoader.replaceClassLoader Adding 'file:/Users/jenkins/jenkins-slave/workspace/Lucene-Solr-4.x-MacOSX/solr/build/solr-core/test/J0/org.apache.solr.cloud.BasicDistributedZkTest-jetty3-1360552056706/collection1/lib/README' to classloader
[junit4:junit4]   2> 13296 T2830 oasc.SolrConfig.<init> Using Lucene MatchVersion: LUCENE_42
[junit4:junit4]   2> 13423 T2830 oasc.SolrConfig.<init> Loaded SolrConfig: solrconfig.xml
[junit4:junit4]   2> 13426 T2830 oass.IndexSchema.readSchema Reading Solr Schema
[junit4:junit4]   2> 13433 T2830 oass.IndexSchema.readSchema Schema name=test
[junit4:junit4]   2> 14163 T2830 oass.OpenExchangeRatesOrgProvider.init Initialized with rates=open-exchange-rates.json, refreshInterval=1440.
[junit4:junit4]   2> 14172 T2830 oass.IndexSchema.readSchema default search field in schema is text
[junit4:junit4]   2> 14175 T2830 oass.IndexSchema.readSchema unique key field: id
[junit4:junit4]   2> 14204 T2830 oass.FileExchangeRateProvider.reload Reloading exchange rates from file currency.xml
[junit4:junit4]   2> 14213 T2830 oass.FileExchangeRateProvider.reload Reloading exchange rates from file currency.xml
[junit4:junit4]   2> 14223 T2830 oass.OpenExchangeRatesOrgProvider.reload Reloading exchange rates from open-exchange-rates.json
[junit4:junit4]   2> 14227 T2830 oass.OpenExchangeRatesOrgProvider.reload Reloading exchange rates from open-exchange-rates.json
[junit4:junit4]   2> 14230 T2830 oasc.SolrCore.<init> [collection1] Opening new SolrCore at /Users/jenkins/jenkins-slave/workspace/Lucene-Solr-4.x-MacOSX/solr/build/solr-core/test/J0/./org.apache.solr.cloud.BasicDistributedZkTest-jetty3-1360552056706/collection1/, dataDir=./org.apache.solr.cloud.BasicDistributedZkTest-1360552043848/jetty3/
[junit4:junit4]   2> 14231 T2830 oasc.JmxMonitoredMap.<init> JMX monitoring is enabled. Adding Solr mbeans to JMX Server: com.sun.jmx.mbeanserver.JmxMBeanServer@746a56f0
[junit4:junit4]   2> 14231 T2830 oasc.SolrCore.initDirectoryFactory solr.NRTCachingDirectoryFactory
[junit4:junit4]   2> 14232 T2830 oasc.CachingDirectoryFactory.get return new directory for /Users/jenkins/jenkins-slave/workspace/Lucene-Solr-4.x-MacOSX/solr/build/solr-core/test/J0/./org.apache.solr.cloud.BasicDistributedZkTest-1360552043848/jetty3 forceNew:false
[junit4:junit4]   2> 14233 T2830 oasc.CachingDirectoryFactory.close Releasing directory:/Users/jenkins/jenkins-slave/workspace/Lucene-Solr-4.x-MacOSX/solr/build/solr-core/test/J0/./org.apache.solr.cloud.BasicDistributedZkTest-1360552043848/jetty3
[junit4:junit4]   2> 14233 T2830 oasc.SolrCore.getNewIndexDir New index directory detected: old=null new=./org.apache.solr.cloud.BasicDistributedZkTest-1360552043848/jetty3/index/
[junit4:junit4]   2> 14234 T2830 oasc.SolrCore.initIndex WARNING [collection1] Solr index directory './org.apache.solr.cloud.BasicDistributedZkTest-1360552043848/jetty3/index' doesn't exist. Creating new index...
[junit4:junit4]   2> 14236 T2830 oasc.CachingDirectoryFactory.get return new directory for /Users/jenkins/jenkins-slave/workspace/Lucene-Solr-4.x-MacOSX/solr/build/solr-core/test/J0/./org.apache.solr.cloud.BasicDistributedZkTest-1360552043848/jetty3/index forceNew:false
[junit4:junit4]   2> 14239 T2830 oasc.SolrDeletionPolicy.onCommit SolrDeletionPolicy.onCommit: commits:num=1
[junit4:junit4]   2> 		commit{dir=RateLimitedDirectoryWrapper(NRTCachingDirectory(org.apache.lucene.store.NIOFSDirectory@/Users/jenkins/jenkins-slave/workspace/Lucene-Solr-4.x-MacOSX/solr/build/solr-core/test/J0/org.apache.solr.cloud.BasicDistributedZkTest-1360552043848/jetty3/index lockFactory=org.apache.lucene.store.NativeFSLockFactory@4b04978c; maxCacheMB=48.0 maxMergeSizeMB=4.0)),segFN=segments_1,generation=1,filenames=[segments_1]
[junit4:junit4]   2> 14240 T2830 oasc.SolrDeletionPolicy.updateCommits newest commit = 1[segments_1]
[junit4:junit4]   2> 14240 T2830 oasc.CachingDirectoryFactory.close Releasing directory:/Users/jenkins/jenkins-slave/workspace/Lucene-Solr-4.x-MacOSX/solr/build/solr-core/test/J0/./org.apache.solr.cloud.BasicDistributedZkTest-1360552043848/jetty3/index
[junit4:junit4]   2> 14241 T2830 oasc.SolrCore.initWriters created xml: solr.XMLResponseWriter
[junit4:junit4]   2> 14243 T2830 oasup.UpdateRequestProcessorChain.init inserting DistributedUpdateProcessorFactory into updateRequestProcessorChain "dedupe"
[junit4:junit4]   2> 14244 T2830 oasup.UpdateRequestProcessorChain.init inserting DistributedUpdateProcessorFactory into updateRequestProcessorChain "dedupe-allfields"
[junit4:junit4]   2> 14244 T2830 oasup.UpdateRequestProcessorChain.init inserting DistributedUpdateProcessorFactory into updateRequestProcessorChain "stored_sig"
[junit4:junit4]   2> 14244 T2830 oasup.UpdateRequestProcessorChain.init inserting DistributedUpdateProcessorFactory into updateRequestProcessorChain "uniq-fields"
[junit4:junit4]   2> 14245 T2830 oasup.UpdateRequestProcessorChain.init inserting DistributedUpdateProcessorFactory into updateRequestProcessorChain "distrib-dup-test-chain-implicit"
[junit4:junit4]   2> 14246 T2830 oasc.RequestHandlers.initHandlersFromConfig adding lazy requestHandler: solr.ReplicationHandler
[junit4:junit4]   2> 14246 T2830 oasc.RequestHandlers.initHandlersFromConfig created /replication: solr.ReplicationHandler
[junit4:junit4]   2> 14247 T2830 oasc.RequestHandlers.initHandlersFromConfig created standard: solr.StandardRequestHandler
[junit4:junit4]   2> 14247 T2830 oasc.RequestHandlers.initHandlersFromConfig created /get: solr.RealTimeGetHandler
[junit4:junit4]   2> 14248 T2830 oasc.RequestHandlers.initHandlersFromConfig created dismax: solr.SearchHandler
[junit4:junit4]   2> 14249 T2830 oasc.RequestHandlers.initHandlersFromConfig created mock: org.apache.solr.core.MockQuerySenderListenerReqHandler
[junit4:junit4]   2> 14249 T2830 oasc.RequestHandlers.initHandlersFromConfig created /admin/: org.apache.solr.handler.admin.AdminHandlers
[junit4:junit4]   2> 14250 T2830 oasc.RequestHandlers.initHandlersFromConfig created defaults: solr.StandardRequestHandler
[junit4:junit4]   2> 14250 T2830 oasc.RequestHandlers.initHandlersFromConfig adding lazy requestHandler: solr.StandardRequestHandler
[junit4:junit4]   2> 14251 T2830 oasc.RequestHandlers.initHandlersFromConfig created lazy: solr.StandardRequestHandler
[junit4:junit4]   2> 14265 T2830 oasc.RequestHandlers.initHandlersFromConfig created /update: solr.UpdateRequestHandler
[junit4:junit4]   2> 14267 T2830 oasc.RequestHandlers.initHandlersFromConfig created /terms: org.apache.solr.handler.component.SearchHandler
[junit4:junit4]   2> 14268 T2830 oasc.RequestHandlers.initHandlersFromConfig created spellCheckCompRH: org.apache.solr.handler.component.SearchHandler
[junit4:junit4]   2> 14268 T2830 oasc.RequestHandlers.initHandlersFromConfig created spellCheckCompRH_Direct: org.apache.solr.handler.component.SearchHandler
[junit4:junit4]   2> 14269 T2830 oasc.RequestHandlers.initHandlersFromConfig created spellCheckWithWordbreak: org.apache.solr.handler.component.SearchHandler
[junit4:junit4]   2> 14270 T2830 oasc.RequestHandlers.initHandlersFromConfig created spellCheckWithWordbreak_Direct: org.apache.solr.handler.component.SearchHandler
[junit4:junit4]   2> 14271 T2830 oasc.RequestHandlers.initHandlersFromConfig created spellCheckCompRH1: org.apache.solr.handler.component.SearchHandler
[junit4:junit4]   2> 14272 T2830 oasc.RequestHandlers.initHandlersFromConfig created mltrh: org.apache.solr.handler.component.SearchHandler
[junit4:junit4]   2> 14273 T2830 oasc.RequestHandlers.initHandlersFromConfig created tvrh: org.apache.solr.handler.component.SearchHandler
[junit4:junit4]   2> 14273 T2830 oasc.RequestHandlers.initHandlersFromConfig created /mlt: solr.MoreLikeThisHandler
[junit4:junit4]   2> 14274 T2830 oasc.RequestHandlers.initHandlersFromConfig created /debug/dump: solr.DumpRequestHandler
[junit4:junit4]   2> 14281 T2830 oashl.XMLLoader.init xsltCacheLifetimeSeconds=60
[junit4:junit4]   2> 14286 T2830 oasc.SolrCore.initDeprecatedSupport WARNING solrconfig.xml uses deprecated <admin/gettableFiles>, Please update your config to use the ShowFileRequestHandler.
[junit4:junit4]   2> 14288 T2830 oasc.SolrCore.initDeprecatedSupport WARNING adding ShowFileRequestHandler with hidden files: [SCHEMA.XML, OLD_SYNONYMS.TXT, STOPWORDS.TXT, PROTWORDS.TXT, OPEN-EXCHANGE-RATES.JSON, SYNONYMS.TXT, CURRENCY.XML, MAPPING-ISOLATIN1ACCENT.TXT]
[junit4:junit4]   2> 14291 T2830 oasc.CachingDirectoryFactory.close Releasing directory:/Users/jenkins/jenkins-slave/workspace/Lucene-Solr-4.x-MacOSX/solr/build/solr-core/test/J0/./org.apache.solr.cloud.BasicDistributedZkTest-1360552043848/jetty3
[junit4:junit4]   2> 14293 T2830 oass.SolrIndexSearcher.<init> Opening Searcher@12b9ca3a main
[junit4:junit4]   2> 14294 T2830 oasu.CommitTracker.<init> Hard AutoCommit: disabled
[junit4:junit4]   2> 14294 T2830 oasu.CommitTracker.<init> Soft AutoCommit: disabled
[junit4:junit4]   2> 14295 T2830 oashc.SpellCheckComponent.inform Initializing spell checkers
[junit4:junit4]   2> 14301 T2830 oass.DirectSolrSpellChecker.init init: {name=direct,classname=DirectSolrSpellChecker,field=lowerfilt,minQueryLength=3}
[junit4:junit4]   2> 14324 T2781 oascc.ZkStateReader.updateClusterState Updating cloud state from ZooKeeper... 
[junit4:junit4]   2> 14326 T2781 oasc.Overseer$ClusterStateUpdater.updateState Update state numShards=2 message={
[junit4:junit4]   2> 	  "operation":"state",
[junit4:junit4]   2> 	  "numShards":"2",
[junit4:junit4]   2> 	  "shard":"shard2",
[junit4:junit4]   2> 	  "roles":null,
[junit4:junit4]   2> 	  "state":"active",
[junit4:junit4]   2> 	  "core":"collection1",
[junit4:junit4]   2> 	  "collection":"collection1",
[junit4:junit4]   2> 	  "node_name":"127.0.0.1:51804_",
[junit4:junit4]   2> 	  "base_url":"http://127.0.0.1:51804"}
[junit4:junit4]   2> 14336 T2799 oascc.ZkStateReader$2.process A cluster state change: WatchedEvent state:SyncConnected type:NodeDataChanged path:/clusterstate.json, has occurred - updating... (live nodes size: 4)
[junit4:junit4]   2> 14337 T2814 oascc.ZkStateReader$2.process A cluster state change: WatchedEvent state:SyncConnected type:NodeDataChanged path:/clusterstate.json, has occurred - updating... (live nodes size: 4)
[junit4:junit4]   2> 14343 T2780 oascc.ZkStateReader$2.process A cluster state change: WatchedEvent state:SyncConnected type:NodeDataChanged path:/clusterstate.json, has occurred - updating... (live nodes size: 4)
[junit4:junit4]   2> 14344 T2786 oascc.ZkStateReader$2.process A cluster state change: WatchedEvent state:SyncConnected type:NodeDataChanged path:/clusterstate.json, has occurred - updating... (live nodes size: 4)
[junit4:junit4]   2> 14346 T2829 oascc.ZkStateReader$2.process A cluster state change: WatchedEvent state:SyncConnected type:NodeDataChanged path:/clusterstate.json, has occurred - updating... (live nodes size: 4)
[junit4:junit4]   2> 14347 T2831 oasc.SolrCore.registerSearcher [collection1] Registered new searcher Searcher@12b9ca3a main{StandardDirectoryReader(segments_1:1)}
[junit4:junit4]   2> 14360 T2830 oasc.ZkController.publish publishing core=collection1 state=down
[junit4:junit4]   2> 14361 T2830 oasc.ZkController.publish numShards not found on descriptor - reading it from system property
[junit4:junit4]   2> 15858 T2781 oascc.ZkStateReader.updateClusterState Updating cloud state from ZooKeeper... 
[junit4:junit4]   2> 15859 T2781 oasc.Overseer$ClusterStateUpdater.updateState Update state numShards=2 message={
[junit4:junit4]   2> 	  "operation":"state",
[junit4:junit4]   2> 	  "numShards":"2",
[junit4:junit4]   2> 	  "shard":null,
[junit4:junit4]   2> 	  "roles":null,
[junit4:junit4]   2> 	  "state":"down",
[junit4:junit4]   2> 	  "core":"collection1",
[junit4:junit4]   2> 	  "collection":"collection1",
[junit4:junit4]   2> 	  "node_name":"127.0.0.1:51807_",
[junit4:junit4]   2> 	  "base_url":"http://127.0.0.1:51807"}
[junit4:junit4]   2> 15860 T2781 oasc.Overseer$ClusterStateUpdater.updateState Collection already exists with numShards=2
[junit4:junit4]   2> 15860 T2781 oasc.Overseer$ClusterStateUpdater.updateState Assigning new node to shard shard=shard1
[junit4:junit4]   2> 15868 T2780 oascc.ZkStateReader$2.process A cluster state change: WatchedEvent state:SyncConnected type:NodeDataChanged path:/clusterstate.json, has occurred - updating... (live nodes size: 4)
[junit4:junit4]   2> 15868 T2829 oascc.ZkStateReader$2.process A cluster state change: WatchedEvent state:SyncConnected type:NodeDataChanged path:/clusterstate.json, has occurred - updating... (live nodes size: 4)
[junit4:junit4]   2> 15868 T2786 oascc.ZkStateReader$2.process A cluster state change: WatchedEvent state:SyncConnected type:NodeDataChanged path:/clusterstate.json, has occurred - updating... (live nodes size: 4)
[junit4:junit4]   2> 15869 T2799 oascc.ZkStateReader$2.process A cluster state change: WatchedEvent state:SyncConnected type:NodeDataChanged path:/clusterstate.json, has occurred - updating... (live nodes size: 4)
[junit4:junit4]   2> 15868 T2814 oascc.ZkStateReader$2.process A cluster state change: WatchedEvent state:SyncConnected type:NodeDataChanged path:/clusterstate.json, has occurred - updating... (live nodes size: 4)
[junit4:junit4]   2> 16368 T2830 oasc.CoreContainer.registerCore registering core: collection1
[junit4:junit4]   2> 16368 T2830 oasc.ZkController.register Register replica - core:collection1 address:http://127.0.0.1:51807 collection:collection1 shard:shard1
[junit4:junit4]   2> 16374 T2830 oasc.ZkController.register We are http://127.0.0.1:51807/collection1/ and leader is http://127.0.0.1:51801/collection1/
[junit4:junit4]   2> 16374 T2830 oasc.ZkController.register No LogReplay needed for core=collection1 baseURL=http://127.0.0.1:51807
[junit4:junit4]   2> 16375 T2830 oasc.ZkController.checkRecovery Core needs to recover:collection1
[junit4:junit4]   2> 16375 T2830 oasu.DefaultSolrCoreState.doRecovery Running recovery - first canceling any ongoing recovery
[junit4:junit4]   2> ASYNC  NEW_CORE C185 name=collection1 org.apache.solr.core.SolrCore@8cca210 url=http://127.0.0.1:51807/collection1 node=127.0.0.1:51807_ C185_STATE=coll:collection1 core:collection1 props:{shard=null, roles=null, state=down, core=collection1, collection=collection1, node_name=127.0.0.1:51807_, base_url=http://127.0.0.1:51807}
[junit4:junit4]   2> 16378 T2832 C185 P51807 oasc.RecoveryStrategy.run Starting recovery process.  core=collection1 recoveringAfterStartup=true
[junit4:junit4]   2> 16379 T2832 C185 P51807 oasc.RecoveryStrategy.doRecovery ###### startupVersions=[]
[junit4:junit4]   2> 16378 T2830 oascc.ZkStateReader.updateClusterState Updating cloud state from ZooKeeper... 
[junit4:junit4]   2> 16379 T2832 C185 P51807 oasc.ZkController.publish publishing core=collection1 state=recovering
[junit4:junit4]   2> 16380 T2832 C185 P51807 oasc.ZkController.publish numShards not found on descriptor - reading it from system property
[junit4:junit4]   2> 16381 T2758 oass.SolrDispatchFilter.init user.dir=/Users/jenkins/jenkins-slave/workspace/Lucene-Solr-4.x-MacOSX/solr/build/solr-core/test/J0
[junit4:junit4]   2> 16382 T2832 C185 P51807 oascsi.HttpClientUtil.createClient Creating new http client, config:maxConnections=128&maxConnectionsPerHost=32&followRedirects=false
[junit4:junit4]   2> 16382 T2758 oass.SolrDispatchFilter.init SolrDispatchFilter.init() done
[junit4:junit4]   2> 16383 T2758 oascsi.HttpClientUtil.createClient Creating new http client, config:maxConnections=128&maxConnectionsPerHost=32&followRedirects=false
[junit4:junit4]   2> 16571 T2758 oejs.Server.doStart jetty-8.1.8.v20121106
[junit4:junit4]   2> 16576 T2758 oejs.AbstractConnector.doStart Started SelectChannelConnector@127.0.0.1:51811
[junit4:junit4]   2> 16577 T2758 oass.SolrDispatchFilter.init SolrDispatchFilter.init()
[junit4:junit4]   2> 16578 T2758 oasc.SolrResourceLoader.locateSolrHome JNDI not configured for solr (NoInitialContextEx)
[junit4:junit4]   2> 16578 T2758 oasc.SolrResourceLoader.locateSolrHome using system property solr.solr.home: /Users/jenkins/jenkins-slave/workspace/Lucene-Solr-4.x-MacOSX/solr/build/solr-core/test/J0/./org.apache.solr.cloud.BasicDistributedZkTest-jetty4-1360552060227
[junit4:junit4]   2> 16579 T2758 oasc.CoreContainer$Initializer.initialize looking for solr.xml: /Users/jenkins/jenkins-slave/workspace/Lucene-Solr-4.x-MacOSX/solr/build/solr-core/test/J0/./org.apache.solr.cloud.BasicDistributedZkTest-jetty4-1360552060227/solr.xml
[junit4:junit4]   2> 16579 T2758 oasc.CoreContainer.<init> New CoreContainer 517338764
[junit4:junit4]   2> 16580 T2758 oasc.CoreContainer.load Loading CoreContainer using Solr Home: '/Users/jenkins/jenkins-slave/workspace/Lucene-Solr-4.x-MacOSX/solr/build/solr-core/test/J0/./org.apache.solr.cloud.BasicDistributedZkTest-jetty4-1360552060227/'
[junit4:junit4]   2> 16581 T2758 oasc.SolrResourceLoader.<init> new SolrResourceLoader for directory: '/Users/jenkins/jenkins-slave/workspace/Lucene-Solr-4.x-MacOSX/solr/build/solr-core/test/J0/./org.apache.solr.cloud.BasicDistributedZkTest-jetty4-1360552060227/'
[junit4:junit4]   2> 16628 T2758 oashc.HttpShardHandlerFactory.getParameter Setting socketTimeout to: 60000
[junit4:junit4]   2> 16629 T2758 oashc.HttpShardHandlerFactory.getParameter Setting urlScheme to: http://
[junit4:junit4]   2> 16631 T2758 oashc.HttpShardHandlerFactory.getParameter Setting connTimeout to: 15000
[junit4:junit4]   2> 16632 T2758 oashc.HttpShardHandlerFactory.getParameter Setting maxConnectionsPerHost to: 20
[junit4:junit4]   2> 16633 T2758 oashc.HttpShardHandlerFactory.getParameter Setting corePoolSize to: 0
[junit4:junit4]   2> 16633 T2758 oashc.HttpShardHandlerFactory.getParameter Setting maximumPoolSize to: 2147483647
[junit4:junit4]   2> 16634 T2758 oashc.HttpShardHandlerFactory.getParameter Setting maxThreadIdleTime to: 5
[junit4:junit4]   2> 16635 T2758 oashc.HttpShardHandlerFactory.getParameter Setting sizeOfQueue to: -1
[junit4:junit4]   2> 16636 T2758 oashc.HttpShardHandlerFactory.getParameter Setting fairnessPolicy to: false
[junit4:junit4]   2> 16637 T2758 oascsi.HttpClientUtil.createClient Creating new http client, config:maxConnectionsPerHost=20&maxConnections=10000&socketTimeout=60000&connTimeout=15000&retry=false
[junit4:junit4]   2> 16650 T2758 oasc.CoreContainer.load Registering Log Listener
[junit4:junit4]   2> 16680 T2758 oasc.CoreContainer.initZooKeeper Zookeeper client=127.0.0.1:51794/solr
[junit4:junit4]   2> 16681 T2758 oasc.ZkController.checkChrootPath zkHost includes chroot
[junit4:junit4]   2> 16682 T2758 oaz.ZooKeeper.<init> Initiating client connection, connectString=127.0.0.1:51794 sessionTimeout=60000 watcher=org.apache.solr.common.cloud.ConnectionManager@6e0db262
[junit4:junit4]   2> 16683 T2758 oascc.ConnectionManager.waitForConnected Waiting for client to connect to ZooKeeper
[junit4:junit4]   2> 16684 T2842 oaz.ClientCnxn$SendThread.logStartConnect Opening socket connection to server localhost/127.0.0.1:51794. Will not attempt to authenticate using SASL (access denied ("javax.security.auth.AuthPermission" "getLoginConfiguration"))
[junit4:junit4]   2> 16685 T2842 oaz.ClientCnxn$SendThread.primeConnection Socket connection established to localhost/127.0.0.1:51794, initiating session
[junit4:junit4]   2> 16686 T2760 oazs.NIOServerCnxnFactory.run Accepted socket connection from /127.0.0.1:51812
[junit4:junit4]   2> 16686 T2760 oazs.ZooKeeperServer.processConnectRequest Client attempting to establish new session at /127.0.0.1:51812
[junit4:junit4]   2> 16688 T2762 oazs.ZooKeeperServer.finishSessionInit Established session 0x13cc738a550000b with negotiated timeout 20000 for client /127.0.0.1:51812
[junit4:junit4]   2> 16688 T2842 oaz.ClientCnxn$SendThread.onConnected Session establishment complete on server localhost/127.0.0.1:51794, sessionid = 0x13cc738a550000b, negotiated timeout = 20000
[junit4:junit4]   2> 16688 T2843 oascc.ConnectionManager.process Watcher org.apache.solr.common.cloud.ConnectionManager@6e0db262 name:ZooKeeperConnection Watcher:127.0.0.1:51794 got event WatchedEvent state:SyncConnected type:None path:null path:null type:None
[junit4:junit4]   2> 16689 T2758 oascc.ConnectionManager.waitForConnected Client is connected to ZooKeeper
[junit4:junit4]   2> 16691 T2763 oazs.PrepRequestProcessor.pRequest2Txn Processed session termination for sessionid: 0x13cc738a550000b
[junit4:junit4]   2> 16692 T2760 oazs.NIOServerCnxn.closeSock Closed socket connection for client /127.0.0.1:51812 which had sessionid 0x13cc738a550000b
[junit4:junit4]   2> 16692 T2843 oaz.ClientCnxn$EventThread.run EventThread shut down
[junit4:junit4]   2> 16692 T2758 oaz.ZooKeeper.close Session: 0x13cc738a550000b closed
[junit4:junit4]   2> 16694 T2758 oascsi.HttpClientUtil.createClient Creating new http client, config:maxConnections=500&maxConnectionsPerHost=16&socketTimeout=60000&connTimeout=15000
[junit4:junit4]   2> 16699 T2758 oaz.ZooKeeper.<init> Initiating client connection, connectString=127.0.0.1:51794/solr sessionTimeout=30000 watcher=org.apache.solr.common.cloud.ConnectionManager@24fd13a9
[junit4:junit4]   2> 16701 T2758 oascc.ConnectionManager.waitForConnected Waiting for client to connect to ZooKeeper
[junit4:junit4]   2> 16701 T2844 oaz.ClientCnxn$SendThread.logStartConnect Opening socket connection to server localhost/127.0.0.1:51794. Will not attempt to authenticate using SASL (access denied ("javax.security.auth.AuthPermission" "getLoginConfiguration"))
[junit4:junit4]   2> 16702 T2844 oaz.ClientCnxn$SendThread.primeConnection Socket connection established to localhost/127.0.0.1:51794, initiating session
[junit4:junit4]   2> 16703 T2760 oazs.NIOServerCnxnFactory.run Accepted socket connection from /127.0.0.1:51813
[junit4:junit4]   2> 16704 T2760 oazs.ZooKeeperServer.processConnectRequest Client attempting to establish new session at /127.0.0.1:51813
[junit4:junit4]   2> 16705 T2762 oazs.ZooKeeperServer.finishSessionInit Established session 0x13cc738a550000c with negotiated timeout 20000 for client /127.0.0.1:51813
[junit4:junit4]   2> 16705 T2844 oaz.ClientCnxn$SendThread.onConnected Session establishment complete on server localhost/127.0.0.1:51794, sessionid = 0x13cc738a550000c, negotiated timeout = 20000
[junit4:junit4]   2> 16706 T2845 oascc.ConnectionManager.process Watcher org.apache.solr.common.cloud.ConnectionManager@24fd13a9 name:ZooKeeperConnection Watcher:127.0.0.1:51794/solr got event WatchedEvent state:SyncConnected type:None path:null path:null type:None
[junit4:junit4]   2> 16706 T2758 oascc.ConnectionManager.waitForConnected Client is connected to ZooKeeper
[junit4:junit4]   2> 16707 T2763 oazs.PrepRequestProcessor.pRequest Got user-level KeeperException when processing sessionid:0x13cc738a550000c type:create cxid:0x1 zxid:0xa2 txntype:-1 reqpath:n/a Error Path:/solr/overseer Error:KeeperErrorCode = NodeExists for /solr/overseer
[junit4:junit4]   2> 16709 T2763 oazs.PrepRequestProcessor.pRequest Got user-level KeeperException when processing sessionid:0x13cc738a550000c type:create cxid:0x2 zxid:0xa3 txntype:-1 reqpath:n/a Error Path:/solr/overseer Error:KeeperErrorCode = NodeExists for /solr/overseer
[junit4:junit4]   2> 16712 T2758 oascc.ZkStateReader.createClusterStateWatchersAndUpdate Updating cluster state from ZooKeeper... 
[junit4:junit4]   2> 16717 T2758 oasc.ZkController.createEphemeralLiveNode Register node as live in ZooKeeper:/live_nodes/127.0.0.1:51811_
[junit4:junit4]   2> 16719 T2763 oazs.PrepRequestProcessor.pRequest Got user-level KeeperException when processing sessionid:0x13cc738a550000c type:delete cxid:0x9 zxid:0xa4 txntype:-1 reqpath:n/a Error Path:/solr/live_nodes/127.0.0.1:51811_ Error:KeeperErrorCode = NoNode for /solr/live_nodes/127.0.0.1:51811_
[junit4:junit4]   2> 16720 T2758 oascc.SolrZkClient.makePath makePath: /live_nodes/127.0.0.1:51811_
[junit4:junit4]   2> 16727 T2799 oascc.ZkStateReader$3.process Updating live nodes... (5)
[junit4:junit4]   2> 16728 T2786 oascc.ZkStateReader$3.process Updating live nodes... (5)
[junit4:junit4]   2> 16728 T2799 oascc.ZkStateReader$2.process A cluster state change: WatchedEvent state:SyncConnected type:NodeChildrenChanged path:/live_nodes, has occurred - updating... (live nodes size: 5)
[junit4:junit4]   2> 16728 T2829 oascc.ZkStateReader$3.process Updating live nodes... (5)
[junit4:junit4]   2> 16729 T2829 oascc.ZkStateReader$2.process A cluster state change: WatchedEvent state:SyncConnected type:NodeChildrenChanged path:/live_nodes, has occurred - updating... (live nodes size: 5)
[junit4:junit4]   2> 16728 T2786 oascc.ZkStateReader$2.process A cluster state change: WatchedEvent state:SyncConnected type:NodeChildrenChanged path:/live_nodes, has occurred - updating... (live nodes size: 5)
[junit4:junit4]   2> 16729 T2845 oascc.ZkStateReader$3.process Updating live nodes... (5)
[junit4:junit4]   2> 16730 T2814 oascc.ZkStateReader$3.process Updating live nodes... (5)
[junit4:junit4]   2> 16731 T2814 oascc.ZkStateReader$2.process A cluster state change: WatchedEvent state:SyncConnected type:NodeChildrenChanged path:/live_nodes, has occurred - updating... (live nodes size: 5)
[junit4:junit4]   2> 16731 T2780 oascc.ZkStateReader$3.process Updating live nodes... (5)
[junit4:junit4]   2> 16731 T2780 oascc.ZkStateReader$2.process A cluster state change: WatchedEvent state:SyncConnected type:NodeChildrenChanged path:/live_nodes, has occurred - updating... (live nodes size: 5)
[junit4:junit4]   2> 16751 T2846 oasc.CoreContainer.create Creating SolrCore 'collection1' using instanceDir: /Users/jenkins/jenkins-slave/workspace/Lucene-Solr-4.x-MacOSX/solr/build/solr-core/test/J0/./org.apache.solr.cloud.BasicDistributedZkTest-jetty4-1360552060227/collection1
[junit4:junit4]   2> 16752 T2846 oasc.ZkController.createCollectionZkNode Check for collection zkNode:collection1
[junit4:junit4]   2> 16753 T2846 oasc.ZkController.createCollectionZkNode Collection zkNode exists
[junit4:junit4]   2> 16754 T2846 oasc.ZkController.readConfigName Load collection config from:/collections/collection1
[junit4:junit4]   2> 16757 T2846 oasc.SolrResourceLoader.<init> new SolrResourceLoader for directory: '/Users/jenkins/jenkins-slave/workspace/Lucene-Solr-4.x-MacOSX/solr/build/solr-core/test/J0/./org.apache.solr.cloud.BasicDistributedZkTest-jetty4-1360552060227/collection1/'
[junit4:junit4]   2> 16758 T2846 oasc.SolrResourceLoader.replaceClassLoader Adding 'file:/Users/jenkins/jenkins-slave/workspace/Lucene-Solr-4.x-MacOSX/solr/build/solr-core/test/J0/org.apache.solr.cloud.BasicDistributedZkTest-jetty4-1360552060227/collection1/lib/classes/' to classloader
[junit4:junit4]   2> 16759 T2846 oasc.SolrResourceLoader.replaceClassLoader Adding 'file:/Users/jenkins/jenkins-slave/workspace/Lucene-Solr-4.x-MacOSX/solr/build/solr-core/test/J0/org.apache.solr.cloud.BasicDistributedZkTest-jetty4-1360552060227/collection1/lib/README' to classloader
[junit4:junit4]   2> 16821 T2846 oasc.SolrConfig.<init> Using Lucene MatchVersion: LUCENE_42
[junit4:junit4]   2> 16920 T2846 oasc.SolrConfig.<init> Loaded SolrConfig: solrconfig.xml
[junit4:junit4]   2> 16922 T2846 oass.IndexSchema.readSchema Reading Solr Schema
[junit4:junit4]   2> 16932 T2846 oass.IndexSchema.readSchema Schema name=test
[junit4:junit4]   2> 17379 T2781 oascc.ZkStateReader.updateClusterState Updating cloud state from ZooKeeper... 
[junit4:junit4]   2> 17381 T2781 oasc.Overseer$ClusterStateUpdater.updateState Update state numShards=2 message={
[junit4:junit4]   2> 	  "operation":"state",
[junit4:junit4]   2> 	  "numShards":"2",
[junit4:junit4]   2> 	  "shard":"shard1",
[junit4:junit4]   2> 	  "roles":null,
[junit4:junit4]   2> 	  "state":"recovering",
[junit4:junit4]   2> 	  "core":"collection1",
[junit4:junit4]   2> 	  "collection":"collection1",
[junit4:junit4]   2> 	  "node_name":"127.0.0.1:51807_",
[junit4:junit4]   2> 	  "base_url":"http://127.0.0.1:51807"}
[junit4:junit4]   2> 17390 T2780 oascc.ZkStateReader$2.process A cluster state change: WatchedEvent state:SyncConnected type:NodeDataChanged path:/clusterstate.json, has occurred - updating... (live nodes size: 5)
[junit4:junit4]   2> 17390 T2799 oascc.ZkStateReader$2.process A cluster state change: WatchedEvent state:SyncConnected type:NodeDataChanged path:/clusterstate.json, has occurred - updating... (live nodes size: 5)
[junit4:junit4]   2> 17391 T2845 oascc.ZkStateReader$2.process A cluster state change: WatchedEvent state:SyncConnected type:NodeDataChanged path:/clusterstate.json, has occurred - updating... (live nodes size: 5)
[junit4:junit4]   2> 17392 T2829 oascc.ZkStateReader$2.process A cluster state change: WatchedEvent state:SyncConnected type:NodeDataChanged path:/clusterstate.json, has occurred - updating... (live nodes size: 5)
[junit4:junit4]   2> 17392 T2786 oascc.ZkStateReader$2.process A cluster state change: WatchedEvent state:SyncConnected type:NodeDataChanged path:/clusterstate.json, has occurred - updating... (live nodes size: 5)
[junit4:junit4]   2> 17393 T2814 oascc.ZkStateReader$2.process A cluster state change: WatchedEvent state:SyncConnected type:NodeDataChanged path:/clusterstate.json, has occurred - updating... (live nodes size: 5)
[junit4:junit4]   2> 17636 T2846 oass.OpenExchangeRatesOrgProvider.init Initialized with rates=open-exchange-rates.json, refreshInterval=1440.
[junit4:junit4]   2> 17646 T2846 oass.IndexSchema.readSchema default search field in schema is text
[junit4:junit4]   2> 17649 T2846 oass.IndexSchema.readSchema unique key field: id
[junit4:junit4]   2> 17682 T2846 oass.FileExchangeRateProvider.reload Reloading exchange rates from file currency.xml
[junit4:junit4]   2> 17697 T2846 oass.FileExchangeRateProvider.reload Reloading exchange rates from file currency.xml
[junit4:junit4]   2> 17710 T2846 oass.OpenExchangeRatesOrgProvider.reload Reloading exchange rates from open-exchange-rates.json
[junit4:junit4]   2> 17715 T2846 oass.OpenExchangeRatesOrgProvider.reload Reloading exchange rates from open-exchange-rates.json
[junit4:junit4]   2> 17720 T2846 oasc.SolrCore.<init> [collection1] Opening new SolrCore at /Users/jenkins/jenkins-slave/workspace/Lucene-Solr-4.x-MacOSX/solr/build/solr-core/test/J0/./org.apache.solr.cloud.BasicDistributedZkTest-jetty4-1360552060227/collection1/, dataDir=./org.apache.solr.cloud.BasicDistributedZkTest-1360552043848/jetty4/
[junit4:junit4]   2> 17721 T2846 oasc.JmxMonitoredMap.<init> JMX monitoring is enabled. Adding Solr mbeans to JMX Server: com.sun.jmx.mbeanserver.JmxMBeanServer@746a56f0
[junit4:junit4]   2> 17722 T2846 oasc.SolrCore.initDirectoryFactory solr.NRTCachingDirectoryFactory
[junit4:junit4]   2> 17724 T2846 oasc.CachingDirectoryFactory.get return new directory for /Users/jenkins/jenkins-slave/workspace/Lucene-Solr-4.x-MacOSX/solr/build/solr-core/test/J0/./org.apache.solr.cloud.BasicDistributedZkTest-1360552043848/jetty4 forceNew:false
[junit4:junit4]   2> 17725 T2846 oasc.CachingDirectoryFactory.close Releasing directory:/Users/jenkins/jenkins-slave/workspace/Lucene-Solr-4.x-MacOSX/solr/build/solr-core/test/J0/./org.apache.solr.cloud.BasicDistributedZkTest-1360552043848/jetty4
[junit4:junit4]   2> 17725 T2846 oasc.SolrCore.getNewIndexDir New index directory detected: old=null new=./org.apache.solr.cloud.BasicDistributedZkTest-1360552043848/jetty4/index/
[junit4:junit4]   2> 17726 T2846 oasc.SolrCore.initIndex WARNING [collection1] Solr index directory './org.apache.solr.cloud.BasicDistributedZkTest-1360552043848/jetty4/index' doesn't exist. Creating new index...
[junit4:junit4]   2> 17728 T2846 oasc.CachingDirectoryFactory.get return new directory for /Users/jenkins/jenkins-slave/workspace/Lucene-Solr-4.x-MacOSX/solr/build/solr-core/test/J0/./org.apache.solr.cloud.BasicDistributedZkTest-1360552043848/jetty4/index forceNew:false
[junit4:junit4]   2> 17740 T2846 oasc.SolrDeletionPolicy.onCommit SolrDeletionPolicy.onCommit: commits:num=1
[junit4:junit4]   2> 		commit{dir=RateLimitedDirectoryWrapper(NRTCachingDirectory(org.apache.lucene.store.NIOFSDirectory@/Users/jenkins/jenkins-slave/workspace/Lucene-Solr-4.x-MacOSX/solr/build/solr-core/test/J0/org.apache.solr.cloud.BasicDistributedZkTest-1360552043848/jetty4/index lockFactory=org.apache.lucene.store.NativeFSLockFactory@db2f3a6; maxCacheMB=48.0 maxMergeSizeMB=4.0)),segFN=segments_1,generation=1,filenames=[segments_1]
[junit4:junit4]   2> 17741 T2846 oasc.SolrDeletionPolicy.updateCommits newest commit = 1[segments_1]
[junit4:junit4]   2> 17742 T2846 oasc.CachingDirectoryFactory.close Releasing directory:/Users/jenkins/jenkins-slave/workspace/Lucene-Solr-4.x-MacOSX/solr/build/solr-core/test/J0/./org.apache.solr.cloud.BasicDistributedZkTest-1360552043848/jetty4/index
[junit4:junit4]   2> 17743 T2846 oasc.SolrCore.initWriters created xml: solr.XMLResponseWriter
[junit4:junit4]   2> 17748 T2846 oasup.UpdateRequestProcessorChain.init inserting DistributedUpdateProcessorFactory into updateRequestProcessorChain "dedupe"
[junit4:junit4]   2> 17749 T2846 oasup.UpdateRequestProcessorChain.init inserting DistributedUpdateProcessorFactory into updateRequestProcessorChain "dedupe-allfields"
[junit4:junit4]   2> 17750 T2846 oasup.UpdateRequestProcessorChain.init inserting DistributedUpdateProcessorFactory into updateRequestProcessorChain "stored_sig"
[junit4:junit4]   2> 17751 T2846 oasup.UpdateRequestProcessorChain.init inserting DistributedUpdateProcessorFactory into updateRequestProcessorChain "uniq-fields"
[junit4:junit4]   2> 17752 T2846 oasup.UpdateRequestProcessorChain.init inserting DistributedUpdateProcessorFactory into updateRequestProcessorChain "distrib-dup-test-chain-implicit"
[junit4:junit4]   2> 17753 T2846 oasc.RequestHandlers.initHandlersFromConfig adding lazy requestHandler: solr.ReplicationHandler
[junit4:junit4]   2> 17755 T2846 oasc.RequestHandlers.initHandlersFromConfig created /replication: solr.ReplicationHandler
[junit4:junit4]   2> 17757 T2846 oasc.RequestHandlers.initHandlersFromConfig created standard: solr.StandardRequestHandler
[junit4:junit4]   2> 17758 T2846 oasc.RequestHandlers.initHandlersFromConfig created /get: solr.RealTimeGetHandler
[junit4:junit4]   2> 17759 T2846 oasc.RequestHandlers.initHandlersFromConfig created dismax: solr.SearchHandler
[junit4:junit4]   2> 17761 T2846 oasc.RequestHandlers.initHandlersFromConfig created mock: org.apache.solr.core.MockQuerySenderListenerReqHandler
[junit4:junit4]   2> 17762 T2846 oasc.RequestHandlers.initHandlersFromConfig created /admin/: org.apache.solr.handler.admin.AdminHandlers
[junit4:junit4]   2> 17763 T2846 oasc.RequestHandlers.initHandlersFromConfig created defaults: solr.StandardRequestHandler
[junit4:junit4]   2> 17764 T2846 oasc.RequestHandlers.initHandlersFromConfig adding lazy requestHandler: solr.StandardRequestHandler
[junit4:junit4]   2> 17765 T2846 oasc.RequestHandlers.initHandlersFromConfig created lazy: solr.StandardRequestHandler
[junit4:junit4]   2> 17766 T2846 oasc.RequestHandlers.initHandlersFromConfig created /update: solr.UpdateRequestHandler
[junit4:junit4]   2> 17767 T2846 oasc.RequestHandlers.initHandlersFromConfig created /terms: org.apache.solr.handler.component.SearchHandler
[junit4:junit4]   2> 17769 T2846 oasc.RequestHandlers.initHandlersFromConfig created spellCheckCompRH: org.apache.solr.handler.component.SearchHandler
[junit4:junit4]   2> 17770 T2846 oasc.RequestHandlers.initHandlersFromConfig created spellCheckCompRH_Direct: org.apache.solr.handler.component.SearchHandler
[junit4:junit4]   2> 17771 T2846 oasc.RequestHandlers.initHandlersFromConfig created spellCheckWithWordbreak: org.apache.solr.handler.component.SearchHandler
[junit4:junit4]   2> 17772 T2846 oasc.RequestHandlers.initHandlersFromConfig created spellCheckWithWordbreak_Direct: org.apache.solr.handler.component.SearchHandler
[junit4:junit4]   2> 17774 T2846 oasc.RequestHandlers.initHandlersFromConfig created spellCheckCompRH1: org.apache.solr.handler.component.SearchHandler
[junit4:junit4]   2> 17793 T2846 oasc.RequestHandlers.initHandlersFromConfig created mltrh: org.apache.solr.handler.component.SearchHandler
[junit4:junit4]   2> 17795 T2846 oasc.RequestHandlers.initHandlersFromConfig created tvrh: org.apache.solr.handler.component.SearchHandler
[junit4:junit4]   2> 17796 T2846 oasc.RequestHandlers.initHandlersFromConfig created /mlt: solr.MoreLikeThisHandler
[junit4:junit4]   2> 17797 T2846 oasc.RequestHandlers.initHandlersFromConfig created /debug/dump: solr.DumpRequestHandler
[junit4:junit4]   2> 17811 T2846 oashl.XMLLoader.init xsltCacheLifetimeSeconds=60
[junit4:junit4]   2> 17817 T2846 oasc.SolrCore.initDeprecatedSupport WARNING solrconfig.xml uses deprecated <admin/gettableFiles>, Please update your config to use the ShowFileRequestHandler.
[junit4:junit4]   2> 17820 T2846 oasc.SolrCore.initDeprecatedSupport WARNING adding ShowFileRequestHandler with hidden files: [SCHEMA.XML, OLD_SYNONYMS.TXT, STOPWORDS.TXT, PROTWORDS.TXT, OPEN-EXCHANGE-RATES.JSON, SYNONYMS.TXT, CURRENCY.XML, MAPPING-ISOLATIN1ACCENT.TXT]
[junit4:junit4]   2> 17825 T2846 oasc.CachingDirectoryFactory.close Releasing directory:/Users/jenkins/jenkins-slave/workspace/Lucene-Solr-4.x-MacOSX/solr/build/solr-core/test/J0/./org.apache.solr.cloud.BasicDistributedZkTest-1360552043848/jetty4
[junit4:junit4]   2> 17827 T2846 oass.SolrIndexSearcher.<init> Opening Searcher@4fe07df1 main
[junit4:junit4]   2> 17829 T2846 oasu.CommitTracker.<init> Hard AutoCommit: disabled
[junit4:junit4]   2> 17830 T2846 oasu.CommitTracker.<init> Soft AutoCommit: disabled
[junit4:junit4]   2> 17831 T2846 oashc.SpellCheckComponent.inform Initializing spell checkers
[junit4:junit4]   2> 17844 T2846 oass.DirectSolrSpellChecker.init init: {name=direct,classname=DirectSolrSpellChecker,field=lowerfilt,minQueryLength=3}
[junit4:junit4]   2> 17900 T2847 oasc.SolrCore.registerSearcher [collection1] Registered new searcher Searcher@4fe07df1 main{StandardDirectoryReader(segments_1:1)}
[junit4:junit4]   2> 17915 T2846 oasc.ZkController.publish publishing core=collection1 state=down
[junit4:junit4]   2> 17915 T2846 oasc.ZkController.publish numShards not found on descriptor - reading it from system property
[junit4:junit4]   2> 18908 T2781 oascc.ZkStateReader.updateClusterState Updating cloud state from ZooKeeper... 
[junit4:junit4]   2> 18910 T2781 oasc.Overseer$ClusterStateUpdater.updateState Update state numShards=2 message={
[junit4:junit4]   2> 	  "operation":"state",
[junit4:junit4]   2> 	  "numShards":"2",
[junit4:junit4]   2> 	  "shard":null,
[junit4:junit4]   2> 	  "roles":null,
[junit4:junit4]   2> 	  "state":"down",
[junit4:junit4]   2> 	  "core":"collection1",
[junit4:junit4]   2> 	  "collection":"collection1",
[junit4:junit4]   2> 	  "node_name":"127.0.0.1:51811_",
[junit4:junit4]   2> 	  "base_url":"http://127.0.0.1:51811"}
[junit4:junit4]   2> 18911 T2781 oasc.Overseer$ClusterStateUpdater.updateState Collection already exists with numShards=2
[junit4:junit4]   2> 18911 T2781 oasc.Overseer$ClusterStateUpdater.updateState Assigning new node to shard shard=shard2
[junit4:junit4]   2> 18919 T2780 oascc.ZkStateReader$2.process A cluster state change: WatchedEvent state:SyncConnected type:NodeDataChanged path:/clusterstate.json, has occurred - updating... (live nodes size: 5)
[junit4:junit4]   2> 18920 T2799 oascc.ZkStateReader$2.process A cluster state change: WatchedEvent state:SyncConnected type:NodeDataChanged path:/clusterstate.json, has occurred - updating... (live nodes size: 5)
[junit4:junit4]   2> 18920 T2829 oascc.ZkStateReader$2.process A cluster state change: WatchedEvent state:SyncConnected type:NodeDataChanged path:/clusterstate.json, has occurred - updating... (live nodes size: 5)
[junit4:junit4]   2> 18920 T2814 oascc.ZkStateReader$2.process A cluster state change: WatchedEvent state:SyncConnected type:NodeDataChanged path:/clusterstate.json, has occurred - updating... (live nodes size: 5)
[junit4:junit4]   2> 18920 T2786 oascc.ZkStateReader$2.process A cluster state change: WatchedEvent state:SyncConnected type:NodeDataChanged path:/clusterstate.json, has occurred - updating... (live nodes size: 5)
[junit4:junit4]   2> 18920 T2845 oascc.ZkStateReader$2.process A cluster state change: WatchedEvent state:SyncConnected type:NodeDataChanged path:/clusterstate.json, has occurred - updating... (live nodes size: 5)
[junit4:junit4]   2> 19922 T2846 oasc.CoreContainer.registerCore registering core: collection1
[junit4:junit4]   2> 19923 T2846 oasc.ZkController.register Register replica - core:collection1 address:http://127.0.0.1:51811 collection:collection1 shard:shard2
[junit4:junit4]   2> 19929 T2846 oasc.ZkController.register We are http://127.0.0.1:51811/collection1/ and leader is http://127.0.0.1:51804/collection1/
[junit4:junit4]   2> 19930 T2846 oasc.ZkController.register No LogReplay needed for core=collection1 baseURL=http://127.0.0.1:51811
[junit4:junit4]   2> 19930 T2846 oasc.ZkController.checkRecovery Core needs to recover:collection1
[junit4:junit4]   2> 19930 T2846 oasu.DefaultSolrCoreState.doRecovery Running recovery - first canceling any ongoing recovery
[junit4:junit4]   2> ASYNC  NEW_CORE C186 name=collection1 org.apache.solr.core.SolrCore@5e4163ea url=http://127.0.0.1:51811/collection1 node=127.0.0.1:51811_ C186_STATE=coll:collection1 core:collection1 props:{shard=null, roles=null, state=down, core=collection1, collection=collection1, node_name=127.0.0.1:51811_, base_url=http://127.0.0.1:51811}
[junit4:junit4]   2> 19932 T2848 C186 P51811 oasc.RecoveryStrategy.run Starting recovery process.  core=collection1 recoveringAfterStartup=true
[junit4:junit4]   2> 19934 T2848 C186 P51811 oasc.RecoveryStrategy.doRecovery ###### startupVersions=[]
[junit4:junit4]   2> 19934 T2846 oascc.ZkStateReader.updateClusterState Updating cloud state from ZooKeeper... 
[junit4:junit4]   2> 19934 T2848 C186 P51811 oasc.ZkController.publish publishing core=collection1 state=recovering
[junit4:junit4]   2> 19935 T2848 C186 P51811 oasc.ZkController.publish numShards not found on descriptor - reading it from system property
[junit4:junit4]   2> 19936 T2758 oass.SolrDispatchFilter.init user.dir=/Users/jenkins/jenkins-slave/workspace/Lucene-Solr-4.x-MacOSX/solr/build/solr-core/test/J0
[junit4:junit4]   2> 19936 T2848 C186 P51811 oascsi.HttpClientUtil.createClient Creating new http client, config:maxConnections=128&maxConnectionsPerHost=32&followRedirects=false
[junit4:junit4]   2> 19936 T2758 oass.SolrDispatchFilter.init SolrDispatchFilter.init() done
[junit4:junit4]   2> 19937 T2758 oascsi.HttpClientUtil.createClient Creating new http client, config:maxConnections=128&maxConnectionsPerHost=32&followRedirects=false
[junit4:junit4]   2> 19946 T2758 oascc.ZkStateReader.updateClusterState Updating cloud state from ZooKeeper... 
[junit4:junit4]   2> 19950 T2758 oasc.AbstractDistribZkTestBase.waitForRecoveriesToFinish Wait for recoveries to finish - collection: collection1 failOnTimeout:true timeout (sec):230
[junit4:junit4]   2> 19952 T2758 oascc.ZkStateReader.updateClusterState Updating cloud state from ZooKeeper... 
[junit4:junit4]   2>  C185_STATE=coll:collection1 core:collection1 props:{shard=shard1, roles=null, state=recovering, core=collection1, collection=collection1, node_name=127.0.0.1:51807_, base_url=http://127.0.0.1:51807}
[junit4:junit4]   2> 20400 T2832 C185 P51807 oasc.RecoveryStrategy.doRecovery Attempting to PeerSync from http://127.0.0.1:51801/collection1/ core=collection1 - recoveringAfterStartup=true
[junit4:junit4]   2> 20401 T2832 C185 P51807 oasu.PeerSync.sync PeerSync: core=collection1 url=http://127.0.0.1:51807 START replicas=[http://127.0.0.1:51801/collection1/] nUpdates=100
[junit4:junit4]   2> 20402 T2832 C185 P51807 oasu.PeerSync.sync WARNING no frame of reference to tell of we've missed updates
[junit4:junit4]   2> 20403 T2832 C185 P51807 oasc.RecoveryStrategy.doRecovery PeerSync Recovery was not successful - trying replication. core=collection1
[junit4:junit4]   2> 20403 T2832 C185 P51807 oasc.RecoveryStrategy.doRecovery Starting Replication Recovery. core=collection1
[junit4:junit4]   2> 20403 T2832 C185 P51807 oasc.RecoveryStrategy.doRecovery Begin buffering updates. core=collection1
[junit4:junit4]   2> 20404 T2832 C185 P51807 oasu.UpdateLog.bufferUpdates Starting to buffer updates. FSUpdateLog{state=ACTIVE, tlog=null}
[junit4:junit4]   2> 20405 T2832 C185 P51807 oasc.RecoveryStrategy.replicate Attempting to replicate from http://127.0.0.1:51801/collection1/. core=collection1
[junit4:junit4]   2> 20405 T2832 C185 P51807 oascsi.HttpClientUtil.createClient Creating new http client, config:maxConnections=128&maxConnectionsPerHost=32&followRedirects=false
[junit4:junit4]   2> ASYNC  NEW_CORE C187 name=collection1 org.apache.solr.core.SolrCore@24699625 url=http://127.0.0.1:51801/collection1 node=127.0.0.1:51801_ C187_STATE=coll:collection1 core:collection1 props:{shard=shard1, roles=null, state=active, core=collection1, collection=collection1, node_name=127.0.0.1:51801_, base_url=http://127.0.0.1:51801, leader=true}
[junit4:junit4]   2> 20413 T2795 C187 P51801 REQ /get {getVersions=100&distrib=false&wt=javabin&qt=/get&version=2} status=0 QTime=1 
[junit4:junit4]   2> 20419 T2790 C187 P51801 oasu.DirectUpdateHandler2.commit start commit{,optimize=false,openSearcher=false,waitSearcher=true,expungeDeletes=false,softCommit=false}
[junit4:junit4]   2> 20421 T2790 C187 P51801 oasc.CachingDirectoryFactory.close Releasing directory:/Users/jenkins/jenkins-slave/workspace/Lucene-Solr-4.x-MacOSX/solr/build/solr-core/test/J0/./org.apache.solr.cloud.BasicDistributedZkTest-1360552043848/jetty1
[junit4:junit4]   2> 20424 T2790 C187 P51801 oasc.SolrDeletionPolicy.onInit SolrDeletionPolicy.onInit: commits:num=1
[junit4:junit4]   2> 		commit{dir=RateLimitedDirectoryWrapper(NRTCachingDirectory(org.apache.lucene.store.NIOFSDirectory@/Users/jenkins/jenkins-slave/workspace/Lucene-Solr-4.x-MacOSX/solr/build/solr-core/test/J0/org.apache.solr.cloud.BasicDistributedZkTest-1360552043848/jetty1/index lockFactory=org.apache.lucene.store.NativeFSLockFactory@760e3574; maxCacheMB=48.0 maxMergeSizeMB=4.0)),segFN=segments_1,generation=1,filenames=[segments_1]
[junit4:junit4]   2> 20425 T2790 C187 P51801 oasc.SolrDeletionPolicy.updateCommits newest commit = 1[segments_1]
[junit4:junit4]   2> 20428 T2790 C187 P51801 oasc.SolrDeletionPolicy.onCommit SolrDeletionPolicy.onCommit: commits:num=2
[junit4:junit4]   2> 		commit{dir=RateLimitedDirectoryWrapper(NRTCachingDirectory(org.apache.lucene.store.NIOFSDirectory@/Users/jenkins/jenkins-slave/workspace/Lucene-Solr-4.x-MacOSX/solr/build/solr-core/test/J0/org.apache.solr.cloud.BasicDistributedZkTest-1360552043848/jetty1/index lockFactory=org.apache.lucene.store.NativeFSLockFactory@760e3574; maxCacheMB=48.0 maxMergeSizeMB=4.0)),segFN=segments_1,generation=1,filenames=[segments_1]
[junit4:junit4]   2> 		commit{dir=RateLimitedDirectoryWrapper(NRTCachingDirectory(org.apache.lucene.store.NIOFSDirectory@/Users/jenkins/jenkins-slave/workspace/Lucene-Solr-4.x-MacOSX/solr/build/solr-core/test/J0/org.apache.solr.cloud.BasicDistributedZkTest-1360552043848/jetty1/index lockFactory=org.apache.lucene.store.NativeFSLockFactory@760e3574; maxCacheMB=48.0 maxMergeSizeMB=4.0)),segFN=segments_2,generation=2,filenames=[segments_2]
[junit4:junit4]   2> 20429 T2790 C187 P51801 oasc.SolrDeletionPolicy.updateCommits newest commit = 2[segments_2]
[junit4:junit4]   2> 20430 T2790 C187 P51801 oasc.CachingDirectoryFactory.close Releasing directory:/Users/jenkins/jenkins-slave/workspace/Lucene-Solr-4.x-MacOSX/solr/build/solr-core/test/J0/./org.apache.solr.cloud.BasicDistributedZkTest-1360552043848/jetty1
[junit4:junit4]   2> 20431 T2790 C187 P51801 oass.SolrIndexSearcher.<init> Opening Searcher@2c69ab58 realtime
[junit4:junit4]   2> 20432 T2790 C187 P51801 oasu.DirectUpdateHandler2.commit end_commit_flush
[junit4:junit4]   2> 20432 T2790 C187 P51801 /update {waitSearcher=true&openSearcher=false&commit=true&wt=javabin&commit_end_point=true&version=2&softCommit=false} {commit=} 0 13
[junit4:junit4]   2> 20434 T2832 C185 P51807 oash.ReplicationHandler.inform Commits will be reserved for  10000
[junit4:junit4]   2> 20434 T2832 C185 P51807 oash.SnapPuller.<init>  No value set for 'pollInterval'. Timer Task not started.
[junit4:junit4]   2> 20435 T2781 oascc.ZkStateReader.updateClusterState Updating cloud state from ZooKeeper... 
[junit4:junit4]   2> 20439 T2781 oasc.Overseer$ClusterStateUpdater.updateState Update state numShards=2 message={
[junit4:junit4]   2> 	  "operation":"state",
[junit4:junit4]   2> 	  "numShards":"2",
[junit4:junit4]   2> 	  "shard":"shard2",
[junit4:junit4]   2> 	  "roles":null,
[junit4:junit4]   2> 	  "state":"recovering",
[junit4:junit4]   2> 	  "core":"collection1",
[junit4:junit4]   2> 	  "collection":"collection1",
[junit4:junit4]   2> 	  "node_name":"127.0.0.1:51811_",
[junit4:junit4]   2> 	  "base_url":"http://127.0.0.1:51811"}
[junit4:junit4]   2> 20441 T2793 C187 P51801 oash.ReplicationHandler.inform Commits will be reserved for  10000
[junit4:junit4]   2> 20442 T2793 C187 P51801 REQ /replication {command=indexversion&qt=/replication&wt=javabin&version=2} status=0 QTime=3 
[junit4:junit4]   2> 20443 T2832 C185 P51807 oash.SnapPuller.fetchLatestIndex Master's generation: 2
[junit4:junit4]   2> 20443 T2832 C185 P51807 oash.SnapPuller.fetchLatestIndex Slave's generation: 1
[junit4:junit4]   2> 20443 T2832 C185 P51807 oash.SnapPuller.fetchLatestIndex Starting replication process
[junit4:junit4]   2> 20447 T2794 C187 P51801 oasc.CachingDirectoryFactory.close Releasing directory:/Users/jenkins/jenkins-slave/workspace/Lucene-Solr-4.x-MacOSX/solr/build/solr-core/test/J0/./org.apache.solr.cloud.BasicDistributedZkTest-1360552043848/jetty1
[junit4:junit4]   2> 20448 T2794 C187 P51801 oasc.CachingDirectoryFactory.close Releasing directory:/Users/jenkins/jenkins-slave/workspace/Lucene-Solr-4.x-MacOSX/solr/build/solr-core/test/J0/./org.apache.solr.cloud.BasicDistributedZkTest-1360552043848/jetty1/index
[junit4:junit4]   2> 20449 T2794 C187 P51801 REQ /replication {command=filelist&qt=/replication&wt=javabin&generation=2&version=2} status=0 QTime=3 
[junit4:junit4]   2> 20450 T2780 oascc.ZkStateReader$2.process A cluster state change: WatchedEvent state:SyncConnected type:NodeDataChanged path:/clusterstate.json, has occurred - updating... (live nodes size: 5)
[junit4:junit4]   2> 20451 T2829 oascc.ZkStateReader$2.process A cluster state change: WatchedEvent state:SyncConnected type:NodeDataChanged path:/clusterstate.json, has occurred - updating... (live nodes size: 5)
[junit4:junit4]   2> 20451 T2832 C185 P51807 oash.SnapPuller.fetchLatestIndex Number of files in latest index in master: 1
[junit4:junit4]   2> 20452 T2786 oascc.ZkStateReader$2.process A cluster state change: WatchedEvent state:SyncConnected type:NodeDataChanged path:/clusterstate.json, has occurred - updating... (live nodes size: 5)
[junit4:junit4]   2> 20453 T2814 oascc.ZkStateReader$2.process A cluster state change: WatchedEvent state:SyncConnected type:NodeDataChanged path:/clusterstate.json, has occurred - updating... (live nodes size: 5)
[junit4:junit4]   2> 20454 T2832 C185 P51807 oasc.CachingDirectoryFactory.get return new directory for /Users/jenkins/jenkins-slave/workspace/Lucene-Solr-4.x-MacOSX/solr/build/solr-core/test/J0/./org.apache.solr.cloud.BasicDistributedZkTest-1360552043848/jetty3/index.20130210220744288 forceNew:false
[junit4:junit4]   2> 20452 T2845 oascc.ZkStateReader$2.process A cluster state change: WatchedEvent state:SyncConnected type:NodeDataChanged path:/clusterstate.json, has occurred - updating... (live nodes size: 5)
[junit4:junit4]   2> 20456 T2832 C185 P51807 oasc.CachingDirectoryFactory.close Releasing directory:/Users/jenkins/jenkins-slave/workspace/Lucene-Solr-4.x-MacOSX/solr/build/solr-core/test/J0/./org.apache.solr.cloud.BasicDistributedZkTest-1360552043848/jetty3
[junit4:junit4]   2> 20452 T2799 oascc.ZkStateReader$2.process A cluster state change: WatchedEvent state:SyncConnected type:NodeDataChanged path:/clusterstate.json, has occurred - updating... (live nodes size: 5)
[junit4:junit4]   2> 20459 T2832 C185 P51807 oash.SnapPuller.fetchLatestIndex Starting download to RateLimitedDirectoryWrapper(NRTCachingDirectory(org.apache.lucene.store.NIOFSDirectory@/Users/jenkins/jenkins-slave/workspace/Lucene-Solr-4.x-MacOSX/solr/build/solr-core/test/J0/org.apache.solr.cloud.BasicDistributedZkTest-1360552043848/jetty3/index.20130210220744288 lockFactory=org.apache.lucene.store.NativeFSLockFactory@10c89c6; maxCacheMB=48.0 maxMergeSizeMB=4.0)) fullCopy=true
[junit4:junit4]   2> 20465 T2791 C187 P51801 REQ /replication {file=segments_2&command=filecontent&checksum=true&wt=filestream&qt=/replication&generation=2} status=0 QTime=1 
[junit4:junit4]   2> 20468 T2832 C185 P51807 oasc.CachingDirectoryFactory.close Releasing directory:/Users/jenkins/jenkins-slave/workspace/Lucene-Solr-4.x-MacOSX/solr/build/solr-core/test/J0/./org.apache.solr.cloud.BasicDistributedZkTest-1360552043848/jetty3/index
[junit4:junit4]   2> 20469 T2832 C185 P51807 oash.SnapPuller.fetchLatestIndex Total time taken for download : 0 secs
[junit4:junit4]   2> 20470 T2832 C185 P51807 oash.SnapPuller.modifyIndexProps New index installed. Updating index properties... index=index.20130210220744288
[junit4:junit4]   2> 20472 T2832 C185 P51807 oasc.CachingDirectoryFactory.close Releasing directory:/Users/jenkins/jenkins-slave/workspace/Lucene-Solr-4.x-MacOSX/solr/build/solr-core/test/J0/./org.apache.solr.cloud.BasicDistributedZkTest-1360552043848/jetty3
[junit4:junit4]   2> 20473 T2832 C185 P51807 oasc.CachingDirectoryFactory.close Releasing directory:/Users/jenkins/jenkins-slave/workspace/Lucene-Solr-4.x-MacOSX/solr/build/solr-core/test/J0/./org.apache.solr.cloud.BasicDistributedZkTest-1360552043848/jetty3
[junit4:junit4]   2> 20474 T2832 C185 P51807 oasc.SolrCore.getNewIndexDir New index directory detected: old=./org.apache.solr.cloud.BasicDistributedZkTest-1360552043848/jetty3/index/ new=./org.apache.solr.cloud.BasicDistributedZkTest-1360552043848/jetty3/index.20130210220744288
[junit4:junit4]   2> 20479 T2832 C185 P51807 oasc.SolrDeletionPolicy.onInit SolrDeletionPolicy.onInit: commits:num=1
[junit4:junit4]   2> 		commit{dir=RateLimitedDirectoryWrapper(NRTCachingDirectory(org.apache.lucene.store.NIOFSDirectory@/Users/jenkins/jenkins-slave/workspace/Lucene-Solr-4.x-MacOSX/solr/build/solr-core/test/J0/org.apache.solr.cloud.BasicDistributedZkTest-1360552043848/jetty3/index.20130210220744288 lockFactory=org.apache.lucene.store.NativeFSLockFactory@10c89c6; maxCacheMB=48.0 maxMergeSizeMB=4.0)),segFN=segments_2,generation=2,filenames=[segments_2]
[junit4:junit4]   2> 20480 T2832 C185 P51807 oasc.SolrDeletionPolicy.updateCommits newest commit = 2[segments_2]
[junit4:junit4]   2> 20483 T2832 C185 P51807 oasc.CachingDirectoryFactory.close Releasing directory:/Users/jenkins/jenkins-slave/workspace/Lucene-Solr-4.x-MacOSX/solr/build/solr-core/test/J0/./org.apache.solr.cloud.BasicDistributedZkTest-1360552043848/jetty3
[junit4:junit4]   2> 20483 T2832 C185 P51807 oasu.DefaultSolrCoreState.newIndexWriter Creating new IndexWriter...
[junit4:junit4]   2> 20484 T2832 C185 P51807 oasu.DefaultSolrCoreState.newIndexWriter Waiting until IndexWriter is unused... core=collection1
[junit4:junit4]   2> 20484 T2832 C185 P51807 oasu.DefaultSolrCoreState.newIndexWriter Rollback old IndexWriter... core=collection1
[junit4:junit4]   2> 20486 T2832 C185 P51807 oasc.CachingDirectoryFactory.close Releasing directory:/Users/jenkins/jenkins-slave/workspace/Lucene-Solr-4.x-MacOSX/solr/build/solr-core/test/J0/./org.apache.solr.cloud.BasicDistributedZkTest-1360552043848/jetty3/index.20130210220744288
[junit4:junit4]   2> 20487 T2832 C185 P51807 oasc.CachingDirectoryFactory.close Releasing directory:/Users/jenkins/jenkins-slave/workspace/Lucene-Solr-4.x-MacOSX/solr/build/solr-core/test/J0/./org.apache.solr.cloud.BasicDistributedZkTest-1360552043848/jetty3
[junit4:junit4]   2> 20492 T2832 C185 P51807 oasc.SolrDeletionPolicy.onInit SolrDeletionPolicy.onInit: commits:num=1
[junit4:junit4]   2> 		commit{dir=RateLimitedDirectoryWrapper(NRTCachingDirectory(org.apache.lucene.store.NIOFSDirectory@/Users/jenkins/jenkins-slave/workspace/Lucene-Solr-4.x-MacOSX/solr/build/solr-core/test/J0/org.apache.solr.cloud.BasicDistributedZkTest-1360552043848/jetty3/index.20130210220744288 lockFactory=org.apache.lucene.store.NativeFSLockFactory@10c89c6; maxCacheMB=48.0 maxMergeSizeMB=4.0)),segFN=segments_2,generation=2,filenames=[segments_2]
[junit4:junit4]   2> 20493 T2832 C185 P51807 oasc.SolrDeletionPolicy.updateCommits newest commit = 2[segments_2]
[junit4:junit4]   2> 20493 T2832 C185 P51807 oasu.DefaultSolrCoreState.newIndexWriter New IndexWriter is ready to be used.
[junit4:junit4]   2> 20494 T2832 C185 P51807 oasc.CachingDirectoryFactory.close Releasing directory:/Users/jenkins/jenkins-slave/workspace/Lucene-Solr-4.x-MacOSX/solr/build/solr-core/test/J0/./org.apache.solr.cloud.BasicDistributedZkTest-1360552043848/jetty3
[junit4:junit4]   2> 20495 T2832 C185 P51807 oass.SolrIndexSearcher.<init> Opening Searcher@764f920a main
[junit4:junit4]   2> 20499 T2831 oasc.SolrCore.registerSearcher [collection1] Registered new searcher Searcher@764f920a main{StandardDirectoryReader(segments_2:1:nrt)}
[junit4:junit4]   2> 20500 T2831 oasc.CachingDirectoryFactory.close Releasing directory:/Users/jenkins/jenkins-slave/workspace/Lucene-Solr-4.x-MacOSX/solr/build/solr-core/test/J0/./org.apache.solr.cloud.BasicDistributedZkTest-1360552043848/jetty3/index
[junit4:junit4]   2> 20501 T2832 C185 P51807 oasu.DirectUpdateHandler2.commit start commit{,optimize=false,openSearcher=false,waitSearcher=false,expungeDeletes=false,softCommit=false}
[junit4:junit4]   2> 20505 T2832 C185 P51807 oasc.SolrDeletionPolicy.onCommit SolrDeletionPolicy.onCommit: commits:num=2
[junit4:junit4]   2> 		commit{dir=RateLimitedDirectoryWrapper(NRTCachingDirectory(org.apache.lucene.store.NIOFSDirectory@/Users/jenkins/jenkins-slave/workspace/Lucene-Solr-4.x-MacOSX/solr/build/solr-core/test/J0/org.apache.solr.cloud.BasicDistributedZkTest-1360552043848/jetty3/index.20130210220744288 lockFactory=org.apache.lucene.store.NativeFSLockFactory@10c89c6; maxCacheMB=48.0 maxMergeSizeMB=4.0)),segFN=segments_2,generation=2,filenames=[segments_2]
[junit4:junit4]   2> 		commit{dir=RateLimitedDirectoryWrapper(NRTCachingDirectory(org.apache.lucene.store.NIOFSDirectory@/Users/jenkins/jenkins-slave/workspace/Lucene-Solr-4.x-MacOSX/solr/build/solr-core/test/J0/org.apache.solr.cloud.BasicDistributedZkTest-1360552043848/jetty3/index.20130210220744288 lockFactory=org.apache.lucene.store.NativeFSLockFactory@10c89c6; maxCacheMB=48.0 maxMergeSizeMB=4.0)),segFN=segments_3,generation=3,filenames=[segments_3]
[junit4:junit4]   2> 20506 T2832 C185 P51807 oasc.SolrDeletionPolicy.updateCommits newest commit = 3[segments_3]
[junit4:junit4]   2> 20508 T2832 C185 P51807 oasc.CachingDirectoryFactory.close Releasing directory:/Users/jenkins/jenkins-slave/workspace/Lucene-Solr-4.x-MacOSX/solr/build/solr-core/test/J0/./org.apache.solr.cloud.BasicDistributedZkTest-1360552043848/jetty3
[junit4:junit4]   2> 20508 T2832 C185 P51807 oasu.DirectUpdateHandler2.commit end_commit_flush
[junit4:junit4]   2> 20509 T2832 C185 P51807 oasc.CachingDirectoryFactory.close Releasing directory:/Users/jenkins/jenkins-slave/workspace/Lucene-Solr-4.x-MacOSX/solr/build/solr-core/test/J0/./org.apache.solr.cloud.BasicDistributedZkTest-1360552043848/jetty3/index.20130210220744288
[junit4:junit4]   2> 20509 T2832 C185 P51807 oasc.CachingDirectoryFactory.close Releasing directory:/Users/jenkins/jenkins-slave/workspace/Lucene-Solr-4.x-MacOSX/solr/build/solr-core/test/J0/./org.apache.solr.cloud.BasicDistributedZkTest-1360552043848/jetty3/index
[junit4:junit4]   2> 20510 T2832 C185 P51807 oasc.RecoveryStrategy.replay No replay needed. core=collection1
[junit4:junit4]   2> 20510 T2832 C185 P51807 oasc.RecoveryStrategy.doRecovery Replication Recovery was successful - registering as Active. core=collection1
[junit4:junit4]   2> 20511 T2832 C185 P51807 oasc.ZkController.publish publishing core=collection1 state=active
[junit4:junit4]   2> 20512 T2832 C185 P51807 oasc.ZkController.publish numShards not found on descriptor - reading it from system property
[junit4:junit4]   2> 20516 T2832 C185 P51807 oasc.RecoveryStrategy.doRecovery Finished recovery process. core=collection1
[junit4:junit4]   2> 20957 T2758 oascc.ZkStateReader.updateClusterState Updating cloud state from ZooKeeper... 
[junit4:junit4]   2> 21962 T2758 oascc.ZkStateReader.updateClusterState Updating cloud state from ZooKeeper... 
[junit4:junit4]   2> 21998 T2781 oascc.ZkStateReader.updateClusterState Updating cloud state from ZooKeeper... 
[junit4:junit4]   2> 21999 T2781 oasc.Overseer$ClusterStateUpdater.updateState Update state numShards=2 message={
[junit4:junit4]   2> 	  "operation":"state",
[junit4:junit4]   2> 	  "numShards":"2",
[junit4:junit4]   2> 	  "shard":"shard1",
[junit4:junit4]   2> 	  "roles":null,
[junit4:junit4]   2> 	  "state":"active",
[junit4:junit4]   2> 	  "core":"collection1",
[junit4:junit4]   2> 	  "collection":"collection1",
[junit4:junit4]   2> 	  "node_name":"127.0.0.1:51807_",
[junit4:junit4]   2> 	  "base_url":"http://127.0.0.1:51807"}
[junit4:junit4]   2> 22006 T2780 oascc.ZkStateReader$2.process A cluster state change: WatchedEvent state:SyncConnected type:NodeDataChanged path:/clusterstate.json, has occurred - updating... (live nodes size: 5)
[junit4:junit4]   2> 22006 T2829 oascc.ZkStateReader$2.process A cluster state change: WatchedEvent state:SyncConnected type:NodeDataChanged path:/clusterstate.json, has occurred - updating... (live nodes size: 5)
[junit4:junit4]   2> 22006 T2786 oascc.ZkStateReader$2.process A cluster state change: WatchedEvent state:SyncConnected type:NodeDataChanged path:/clusterstate.json, has occurred - updating... (live nodes size: 5)
[junit4:junit4]   2> 22007 T2799 oascc.ZkStateReader$2.process A cluster state change: WatchedEvent state:SyncConnected type:NodeDataChanged path:/clusterstate.json, has occurred - updating... (live nodes size: 5)
[junit4:junit4]   2> 22007 T2814 oascc.ZkStateReader$2.process A cluster state change: WatchedEvent state:SyncConnected type:NodeDataChanged path:/clusterstate.json, has occurred - updating... (live nodes size: 5)
[junit4:junit4]   2> 22007 T2845 oascc.ZkStateReader$2.process A cluster state change: WatchedEvent state:SyncConnected type:NodeDataChanged path:/clusterstate.json, has occurred - updating... (live nodes size: 5)
[junit4:junit4]   2>  C186_STATE=coll:collection1 core:collection1 props:{shard=shard2, roles=null, state=recovering, core=collection1, collection=collection1, node_name=127.0.0.1:51811_, base_url=http://127.0.0.1:51811}
[junit4:junit4]   2> 22951 T2848 C186 P51811 oasc.RecoveryStrategy.doRecovery Attempting to PeerSync from http://127.0.0.1:51804/collection1/ core=collection1 - recoveringAfterStartup=true
[junit4:junit4]   2> 22952 T2848 C186 P51811 oasu.PeerSync.sync PeerSync: core=collection1 url=http://127.0.0.1:51811 START replicas=[http://127.0.0.1:51804/collection1/] nUpdates=100
[junit4:junit4]   2> 22952 T2848 C186 P51811 oasu.PeerSync.sync WARNING no frame of reference to tell of we've missed updates
[junit4:junit4]   2> 22953 T2848 C186 P51811 oasc.RecoveryStrategy.doRecovery PeerSync Recovery was not successful - trying replication. core=collection1
[junit4:junit4]   2> 22953 T2848 C186 P51811 oasc.RecoveryStrategy.doRecovery Starting Replication Recovery. core=collection1
[junit4:junit4]   2> 22953 T2848 C186 P51811 oasc.RecoveryStrategy.doRecovery Begin buffering updates. core=collection1
[junit4:junit4]   2> 22954 T2848 C186 P51811 oasu.UpdateLog.bufferUpdates Starting to buffer updates. FSUpdateLog{state=ACTIVE, tlog=null}
[junit4:junit4]   2> 22954 T2848 C186 P51811 oasc.RecoveryStrategy.replicate Attempting to replicate from http://127.0.0.1:51804/collection1/. core=collection1
[junit4:junit4]   2> 22955 T2848 C186 P51811 oascsi.HttpClientUtil.createClient Creating new http client, config:maxConnections=128&maxConnectionsPerHost=32&followRedirects=false
[junit4:junit4]   2> ASYNC  NEW_CORE C188 name=collection1 org.apache.solr.core.SolrCore@666ad9e0 url=http://127.0.0.1:51804/collection1 node=127.0.0.1:51804_ C188_STATE=coll:collection1 core:collection1 props:{shard=shard2, roles=null, state=active, core=collection1, collection=collection1, node_name=127.0.0.1:51804_, base_url=http://127.0.0.1:51804, leader=true}
[junit4:junit4]   2> 22969 T2809 C188 P51804 REQ /get {getVersions=100&distrib=false&wt=javabin&qt=/get&version=2} status=0 QTime=2 
[junit4:junit4]   2> 22969 T2807 C188 P51804 oasu.DirectUpdateHandler2.commit start commit{,optimize=false,openSearcher=false,waitSearcher=true,expungeDeletes=false,softCommit=false}
[junit4:junit4]   2> 22972 T2758 oascc.ZkStateReader.updateClusterState Updating cloud state from ZooKeeper... 
[junit4:junit4]   2> 22972 T2807 C188 P51804 oasc.CachingDirectoryFactory.close Releasing directory:/Users/jenkins/jenkins-slave/workspace/Lucene-Solr-4.x-MacOSX/solr/build/solr-core/test/J0/./org.apache.solr.cloud.BasicDistributedZkTest-1360552043848/jetty2
[junit4:junit4]   2> 22995 T2807 C188 P51804 oasc.SolrDeletionPolicy.onInit SolrDeletionPolicy.onInit: commits:num=1
[junit4:junit4]   2> 		commit{dir=RateLimitedDirectoryWrapper(NRTCachingDirectory(org.apache.lucene.store.NIOFSDirectory@/Users/jenkins/jenkins-slave/workspace/Lucene-Solr-4.x-MacOSX/solr/build/solr-core/test/J0/org.apache.solr.cloud.BasicDistributedZkTest-1360552043848/jetty2/index lockFactory=org.apache.lucene.store.NativeFSLockFactory@4a9419cb; maxCacheMB=48.0 maxMergeSizeMB=4.0)),segFN=segments_1,generation=1,filenames=[segments_1]
[junit4:junit4]   2> 22998 T2807 C188 P51804 oasc.SolrDeletionPolicy.updateCommits newest commit = 1[segments_1]
[junit4:junit4]   2> 23003 T2807 C188 P51804 oasc.SolrDeletionPolicy.onCommit SolrDeletionPolicy.onCommit: commits:num=2
[junit4:junit4]   2> 		commit{dir=RateLimitedDirectoryWrapper(NRTCachingDirectory(org.apache.lucene.store.NIOFSDirectory@/Users/jenkins/jenkins-slave/workspace/Lucene-Solr-4.x-MacOSX/solr/build/solr-core/test/J0/org.apache.solr.cloud.BasicDistributedZkTest-1360552043848/jetty2/index lockFactory=org.apache.lucene.store.NativeFSLockFactory@4a9419cb; maxCacheMB=48.0 maxMergeSizeMB=4.0)),segFN=segments_1,generation=1,filenames=[segments_1]
[junit4:junit4]   2> 		commit{dir=RateLimitedDirectoryWrapper(NRTCachingDirectory(org.apache.lucene.store.NIOFSDirectory@/Users/jenkins/jenkins-slave/workspace/Lucene-Solr-4.x-MacOSX/solr/build/solr-core/test/J0/org.apache.solr.cloud.BasicDistributedZkTest-1360552043848/jetty2/index lockFactory=org.apache.lucene.store.NativeFSLockFactory@4a9419cb; maxCacheMB=48.0 maxMergeSizeMB=4.0)),segFN=segments_2,generation=2,filenames=[segments_2]
[junit4:junit4]   2> 23004 T2807 C188 P51804 oasc.SolrDeletionPolicy.updateCommits newest commit = 2[segments_2]
[junit4:junit4]   2> 23004 T2807 C188 P51804 oasc.CachingDirectoryFactory.close Releasing directory:/Users/jenkins/jenkins-slave/workspace/Lucene-Solr-4.x-MacOSX/solr/build/solr-core/test/J0/./org.apache.solr.cloud.BasicDistributedZkTest-1360552043848/jetty2
[junit4:junit4]   2> 23006 T2807 C188 P51804 oass.SolrIndexSearcher.<init> Opening Searcher@ad5d76e realtime
[junit4:junit4]   2> 23006 T2807 C188 P51804 oasu.DirectUpdateHandler2.commit end_commit_flush
[junit4:junit4]   2> 23006 T2807 C188 P51804 /update {waitSearcher=true&openSearcher=false&commit=true&wt=javabin&commit_end_point=true&version=2&softCommit=false} {commit=} 0 37
[junit4:junit4]   2> 23009 T2848 C186 P51811 oash.ReplicationHandler.inform Commits will be reserved for  10000
[junit4:junit4]   2> 23009 T2848 C186 P51811 oash.SnapPuller.<init>  No value set for 'pollInterval'. Timer Task not started.
[junit4:junit4]   2> 23013 T2810 C188 P51804 oash.ReplicationHandler.inform Commits will be reserved for  10000
[junit4:junit4]   2> 23013 T2810 C188 P51804 REQ /replication {command=indexversion&qt=/replication&wt=javabin&version=2} status=0 QTime=2 
[junit4:junit4]   2> 23015 T2848 C186 P51811 oash.SnapPuller.fetchLatestIndex Master's generation: 2
[junit4:junit4]   2> 23015 T2848 C186 P51811 oash.SnapPuller.fetchLatestIndex Slave's generation: 1
[junit4:junit4]   2> 23016 T2848 C186 P51811 oash.SnapPuller.fetchLatestIndex Starting replication process
[junit4:junit4]   2> 23019 T2805 C188 P51804 oasc.CachingDirectoryFactory.close Releasing directory:/Users/jenkins/jenkins-slave/workspace/Lucene-Solr-4.x-MacOSX/solr/build/solr-core/test/J0/./org.apache.solr.cloud.BasicDistributedZkTest-1360552043848/jetty2
[junit4:junit4]   2> 23020 T2805 C188 P51804 oasc.CachingDirectoryFactory.close Releasing directory:/Users/jenkins/jenkins-slave/workspace/Lucene-Solr-4.x-MacOSX/solr/build/solr-core/test/J0/./org.apache.solr.cloud.BasicDistributedZkTest-1360552043848/jetty2/index
[junit4:junit4]   2> 23020 T2805 C188 P51804 REQ /replication {command=filelist&qt=/replication&wt=javabin&generation=2&version=2} status=0 QTime=2 
[junit4:junit4]   2> 23021 T2848 C186 P51811 oash.SnapPuller.fetchLatestIndex Number of files in latest index in master: 1
[junit4:junit4]   2> 23023 T2848 C186 P51811 oasc.CachingDirectoryFactory.get return new directory for /Users/jenkins/jenkins-slave/workspace/Lucene-Solr-4.x-MacOSX/solr/build/solr-core/test/J0/./org.apache.solr.cloud.BasicDistributedZkTest-1360552043848/jetty4/index.20130210220746858 forceNew:false
[junit4:junit4]   2> 23024 T2848 C186 P51811 oasc.CachingDirectoryFactory.close Releasing directory:/Users/jenkins/jenkins-slave/workspace/Lucene-Solr-4.x-MacOSX/solr/build/solr-core/test/J0/./org.apache.solr.cloud.BasicDistributedZkTest-1360552043848/jetty4
[junit4:junit4]   2> 23026 T2848 C186 P51811 oash.SnapPuller.fetchLatestIndex Starting download to RateLimitedDirectoryWrapper(NRTCachingDirectory(org.apache.lucene.store.NIOFSDirectory@/Users/jenkins/jenkins-slave/workspace/Lucene-Solr-4.x-MacOSX/solr/build/solr-core/test/J0/org.apache.solr.cloud.BasicDistributedZkTest-1360552043848/jetty4/index.20130210220746858 lockFactory=org.apache.lucene.store.NativeFSLockFactory@4e0e837f; maxCacheMB=48.0 maxMergeSizeMB=4.0)) fullCopy=true
[junit4:junit4]   2> 23031 T2806 C188 P51804 REQ /replication {file=segments_2&command=filecontent&checksum=true&wt=filestream&qt=/replication&generation=2} status=0 QTime=1 
[junit4:junit4]   2> 23033 T2848 C186 P51811 oasc.CachingDirectoryFactory.close Releasing directory:/Users/jenkins/jenkins-slave/workspace/Lucene-Solr-4.x-MacOSX/solr/build/solr-core/test/J0/./org.apache.solr.cloud.BasicDistributedZkTest-1360552043848/jetty4/index
[junit4:junit4]   2> 23033 T2848 C186 P51811 oash.SnapPuller.fetchLatestIndex Total time taken for download : 0 secs
[junit4:junit4]   2> 23034 T2848 C186 P51811 oash.SnapPuller.modifyIndexProps New index installed. Updating index properties... index=index.20130210220746858
[junit4:junit4]   2> 23035 T2848 C186 P51811 oasc.CachingDirectoryFactory.close Releasing directory:/Users/jenkins/jenkins-slave/workspace/Lucene-Solr-4.x-MacOSX/solr/build/solr-core/test/J0/./org.apache.solr.cloud.BasicDistributedZkTest-1360552043848/jetty4
[junit4:junit4]   2> 23036 T2848 C186 P51811 oasc.CachingDirectoryFactory.close Releasing directory:/Users/jenkins/jenkins-slave/workspace/Lucene-Solr-4.x-MacOSX/solr/build/solr-core/test/J0/./org.apache.solr.cloud.BasicDistributedZkTest-1360552043848/jetty4
[junit4:junit4]   2> 23036 T2848 C186 P51811 oasc.SolrCore.getNewIndexDir New index directory detected: old=./org.apache.solr.cloud.BasicDistributedZkTest-1360552043848/jetty4/index/ new=./org.apache.solr.cloud.BasicDistributedZkTest-1360552043848/jetty4/index.20130210220746858
[junit4:junit4]   2> 23039 T2848 C186 P51811 oasc.SolrDeletionPolicy.onInit SolrDeletionPolicy.onInit: commits:num=1
[junit4:junit4]   2> 		commit{dir=RateLimitedDirectoryWrapper(NRTCachingDirectory(org.apache.lucene.store.NIOFSDirectory@/Users/jenkins/jenkins-slave/workspace/Lucene-Solr-4.x-MacOSX/solr/build/solr-core/test/J0/org.apache.solr.cloud.BasicDistributedZkTest-1360552043848/jetty4/index.20130210220746858 lockFactory=org.apache.lucene.store.NativeFSLockFactory@4e0e837f; maxCacheMB=48.0 maxMergeSizeMB=4.0)),segFN=segments_2,generation=2,filenames=[segments_2]
[junit4:junit4]   2> 23040 T2848 C186 P51811 oasc.SolrDeletionPolicy.updateCommits newest commit = 2[segments_2]
[junit4:junit4]   2> 23042 T2848 C186 P51811 oasc.CachingDirectoryFactory.close Releasing directory:/Users/jenkins/jenkins-slave/workspace/Lucene-Solr-4.x-MacOSX/solr/build/solr-core/test/J0/./org.apache.solr.cloud.BasicDistributedZkTest-1360552043848/jetty4
[junit4:junit4]   2> 23042 T2848 C186 P51811 oasu.DefaultSolrCoreState.newIndexWriter Creating new IndexWriter...
[junit4:junit4]   2> 23042 T2848 C186 P51811 oasu.DefaultSolrCoreState.newIndexWriter Waiting until IndexWriter is unused... core=collection1
[junit4:junit4]   2> 23043 T2848 C186 P51811 oasu.DefaultSolrCoreState.newIndexWriter Rollback old IndexWriter... core=collection1
[junit4:junit4]   2> 23044 T2848 C186 P51811 oasc.CachingDirectoryFactory.close Releasing directory:/Users/jenkins/jenkins-slave/workspace/Lucene-Solr-4.x-MacOSX/solr/build/solr-core/test/J0/./org.apache.solr.cloud.BasicDistributedZkTest-1360552043848/jetty4/index.20130210220746858
[junit4:junit4]   2> 23044 T2848 C186 P51811 oasc.CachingDirectoryFactory.close Releasing directory:/Users/jenkins/jenkins-slave/workspace/Lucene-Solr-4.x-MacOSX/solr/build/solr-core/test/J0/./org.apache.solr.cloud.BasicDistributedZkTest-1360552043848/jetty4
[junit4:junit4]   2> 23047 T2848 C186 P51811 oasc.SolrDeletionPolicy.onInit SolrDeletionPolicy.onInit: commits:num=1
[junit4:junit4]   2> 		commit{dir=RateLimitedDirectoryWrapper(NRTCachingDirectory(org.apache.lucene.store.NIOFSDirectory@/Users/jenkins/jenkins-slave/workspace/Lucene-Solr-4.x-MacOSX/solr/build/solr-core/test/J0/org.apache.solr.cloud.BasicDistributedZkTest-1360552043848/jetty4/index.20130210220746858 lockFactory=org.apache.lucene.store.NativeFSLockFactory@4e0e837f; maxCacheMB=48.0 maxMergeSizeMB=4.0)),segFN=segments_2,generation=2,filenames=[segments_2]
[junit4:junit4]   2> 23047 T2848 C186 P51811 oasc.SolrDeletionPolicy.updateCommits newest commit = 2[segments_2]
[junit4:junit4]   2> 23048 T2848 C186 P51811 oasu.DefaultSolrCoreState.newIndexWriter New IndexWriter is ready to be used.
[junit4:junit4]   2> 23048 T2848 C186 P51811 oasc.CachingDirectoryFactory.close Releasing directory:/Users/jenkins/jenkins-slave/workspace/Lucene-Solr-4.x-MacOSX/solr/build/solr-core/test/J0/./org.apache.solr.cloud.BasicDistributedZkTest-1360552043848/jetty4
[junit4:junit4]   2> 23049 T2848 C186 P51811 oass.SolrIndexSearcher.<init> Opening Searcher@144396d0 main
[junit4:junit4]   2> 23051 T2847 oasc.SolrCore.registerSearcher [collection1] Registered new searcher Searcher@144396d0 main{StandardDirectoryReader(segments_2:1:nrt)}
[junit4:junit4]   2> 23052 T2847 oasc.CachingDirectoryFactory.close Releasing directory:/Users/jenkins/jenkins-slave/workspace/Lucene-Solr-4.x-MacOSX/solr/build/solr-core/test/J0/./org.apache.solr.cloud.BasicDistributedZkTest-1360552043848/jetty4/index
[junit4:junit4]   2> 23063 T2848 C186 P51811 oasu.DirectUpdateHandler2.commit start commit{,optimize=false,openSearcher=false,waitSearcher=false,expungeDeletes=false,softCommit=false}
[junit4:junit4]   2> 23066 T2848 C186 P51811 oasc.SolrDeletionPolicy.onCommit SolrDeletionPolicy.onCommit: commits:num=2
[junit4:junit4]   2> 		commit{dir=RateLimitedDirectoryWrapper(NRTCachingDirectory(org.apache.lucene.store.NIOFSDirectory@/Users/jenkins/jenkins-slave/workspace/Lucene-Solr-4.x-MacOSX/solr/build/solr-core/test/J0/org.apache.solr.cloud.BasicDistributedZkTest-1360552043848/jetty4/index.20130210220746858 lockFactory=org.apache.lucene.store.NativeFSLockFactory@4e0e837f; maxCacheMB=48.0 maxMergeSizeMB=4.0)),segFN=segments_2,generation=2,filenames=[segments_2]
[junit4:junit4]   2> 		commit{dir=RateLimitedDirectoryWrapper(NRTCachingDirectory(org.apache.lucene.store.NIOFSDirectory@/Users/jenkins/jenkins-slave/workspace/Lucene-Solr-4.x-MacOSX/solr/build/solr-core/test/J0/org.apache.solr.cloud.BasicDistributedZkTest-1360552043848/jetty4/index.20130210220746858 lockFactory=org.apache.lucene.store.NativeFSLockFactory@4e0e837f; maxCacheMB=48.0 maxMergeSizeMB=4.0)),segFN=segments_3,generation=3,filenames=[segments_3]
[junit4:junit4]   2> 23067 T2848 C186 P51811 oasc.SolrDeletionPolicy.updateCommits newest commit = 3[segments_3]
[junit4:junit4]   2> 23068 T2848 C186 P51811 oasc.CachingDirectoryFactory.close Releasing directory:/Users/jenkins/jenkins-slave/workspace/Lucene-Solr-4.x-MacOSX/solr/build/solr-core/test/J0/./org.apache.solr.cloud.BasicDistributedZkTest-1360552043848/jetty4
[junit4:junit4]   2> 23068 T2848 C186 P51811 oasu.DirectUpdateHandler2.commit end_commit_flush
[junit4:junit4]   2> 23069 T2848 C186 P51811 oasc.CachingDirectoryFactory.close Releasing directory:/Users/jenkins/jenkins-slave/workspace/Lucene-Solr-4.x-MacOSX/solr/build/solr-core/test/J0/./org.apache.solr.cloud.BasicDistributedZkTest-1360552043848/jetty4/index.20130210220746858
[junit4:junit4]   2> 23069 T2848 C186 P51811 oasc.CachingDirectoryFactory.close Releasing directory:/Users/jenkins/jenkins-slave/workspace/Lucene-Solr-4.x-MacOSX/solr/build/solr-core/test/J0/./org.apache.solr.cloud.BasicDistributedZkTest-1360552043848/jetty4/index
[junit4:junit4]   2> 23069 T2848 C186 P51811 oasc.RecoveryStrategy.replay No replay needed. core=collection1
[junit4:junit4]   2> 23069 T2848 C186 P51811 oasc.RecoveryStrategy.doRecovery Replication Recovery was successful - registering as Active. core=collection1
[junit4:junit4]   2> 23070 T2848 C186 P51811 oasc.ZkController.publish publishing core=collection1 state=active
[junit4:junit4]   2> 23070 T2848 C186 P51811 oasc.ZkController.publish numShards not found on descriptor - reading it from system property
[junit4:junit4]   2> 23085 T2848 C186 P51811 oasc.RecoveryStrategy.doRecovery Finished recovery process. core=collection1
[junit4:junit4]   2> 23524 T2781 oascc.ZkStateReader.updateClusterState Updating cloud state from ZooKeeper... 
[junit4:junit4]   2> 23526 T2781 oasc.Overseer$ClusterStateUpdater.updateState Update state numShards=2 message={
[junit4:junit4]   2> 	  "operation":"state",
[junit4:junit4]   2> 	  "numShards":"2",
[junit4:junit4]   2> 	  "shard":"shard2",
[junit4:junit4]   2> 	  "roles":null,
[junit4:junit4]   2> 	  "state":"active",
[junit4:junit4]   2> 	  "core":"collection1",
[junit4:junit4]   2> 	  "collection":"collection1",
[junit4:junit4]   2> 	  "node_name":"127.0.0.1:51811_",
[junit4:junit4]   2> 	  "base_url":"http://127.0.0.1:51811"}
[junit4:junit4]   2> 23532 T2780 oascc.ZkStateReader$2.process A cluster state change: WatchedEvent state:SyncConnected type:NodeDataChanged path:/clusterstate.json, has occurred - updating... (live nodes size: 5)
[junit4:junit4]   2> 23532 T2799 oascc.ZkStateReader$2.process A cluster state change: WatchedEvent state:SyncConnected type:NodeDataChanged path:/clusterstate.json, has occurred - updating... (live nodes size: 5)
[junit4:junit4]   2> 23533 T2786 oascc.ZkStateReader$2.process A cluster state change: WatchedEvent state:SyncConnected type:NodeDataChanged path:/clusterstate.json, has occurred - updating... (live nodes size: 5)
[junit4:junit4]   2> 23533 T2814 oascc.ZkStateReader$2.process A cluster state change: WatchedEvent state:SyncConnected type:NodeDataChanged path:/clusterstate.json, has occurred - updating... (live nodes size: 5)
[junit4:junit4]   2> 23533 T2829 oascc.ZkStateReader$2.process A cluster state change: WatchedEvent state:SyncConnected type:NodeDataChanged path:/clusterstate.json, has occurred - updating... (live nodes size: 5)
[junit4:junit4]   2> 23533 T2845 oascc.ZkStateReader$2.process A cluster state change: WatchedEvent state:SyncConnected type:NodeDataChanged path:/clusterstate.json, has occurred - updating... (live nodes size: 5)
[junit4:junit4]   2> 23996 T2758 oascc.ZkStateReader.updateClusterState Updating cloud state from ZooKeeper... 
[junit4:junit4]   2> 23998 T2758 oasc.AbstractDistribZkTestBase.waitForRecoveriesToFinish Recoveries finished - collection: collection1
[junit4:junit4]   2> ASYNC  NEW_CORE C189 name=collection1 org.apache.solr.core.SolrCore@56d7850d url=http://127.0.0.1:51797/collection1 node=127.0.0.1:51797_ C189_STATE=coll:control_collection core:collection1 props:{shard=shard1, roles=null, state=active, core=collection1, collection=control_collection, node_name=127.0.0.1:51797_, base_url=http://127.0.0.1:51797, leader=true}
[junit4:junit4]   2> 24011 T2772 C189 P51797 oasc.CachingDirectoryFactory.close Releasing directory:/Users/jenkins/jenkins-slave/workspace/Lucene-Solr-4.x-MacOSX/solr/build/solr-core/test/J0/./org.apache.solr.cloud.BasicDistributedZkTest-1360552043848/control/data
[junit4:junit4]   2> 24015 T2772 C189 P51797 oasc.SolrDeletionPolicy.onInit SolrDeletionPolicy.onInit: commits:num=1
[junit4:junit4]   2> 		commit{dir=RateLimitedDirectoryWrapper(NRTCachingDirectory(org.apache.lucene.store.NIOFSDirectory@/Users/jenkins/jenkins-slave/workspace/Lucene-Solr-4.x-MacOSX/solr/build/solr-core/test/J0/org.apache.solr.cloud.BasicDistributedZkTest-1360552043848/control/data/index lockFactory=org.apache.lucene.store.NativeFSLockFactory@5b18a9a6; maxCacheMB=48.0 maxMergeSizeMB=4.0)),segFN=segments_1,generation=1,filenames=[segments_1]
[junit4:junit4]   2> 24017 T2772 C189 P51797 oasc.SolrDeletionPolicy.updateCommits newest commit = 1[segments_1]
[junit4:junit4]   2> 24019 T2772 C189 P51797 oasc.CachingDirectoryFactory.close Releasing directory:/Users/jenkins/jenkins-slave/workspace/Lucene-Solr-4.x-MacOSX/solr/build/solr-core/test/J0/./org.apache.solr.cloud.BasicDistributedZkTest-1360552043848/control/data
[junit4:junit4]   2> 24020 T2772 C189 P51797 oass.SolrIndexSearcher.<init> Opening Searcher@6e06a0d realtime
[junit4:junit4]   2> 24020 T2772 C189 P51797 /update {wt=javabin&version=2} {deleteByQuery=*:* (-1426642245091590144)} 0 12
[junit4:junit4]   2> 24024 T2790 C187 P51801 oasc.CachingDirectoryFactory.close Releasing directory:/Users/jenkins/jenkins-slave/workspace/Lucene-Solr-4.x-MacOSX/solr/build/solr-core/test/J0/./org.apache.solr.cloud.BasicDistributedZkTest-1360552043848/jetty1
[junit4:junit4]   2> 24032 T2808 C188 P51804 oasc.CachingDirectoryFactory.close Releasing directory:/Users/jenkins/jenkins-slave/workspace/Lucene-Solr-4.x-MacOSX/solr/build/solr-core/test/J0/./org.apache.solr.cloud.BasicDistributedZkTest-1360552043848/jetty2
[junit4:junit4]   2>  C185_STATE=coll:collection1 core:collection1 props:{shard=shard1, role

[...truncated too long message...]

e(RandomizedRunner.java:787)
[junit4:junit4]    > 	at com.carrotsearch.randomizedtesting.rules.SystemPropertiesRestoreRule$1.evaluate(SystemPropertiesRestoreRule.java:53)
[junit4:junit4]    > 	at org.apache.lucene.util.TestRuleSetupTeardownChained$1.evaluate(TestRuleSetupTeardownChained.java:50)
[junit4:junit4]    > 	at org.apache.lucene.util.TestRuleFieldCacheSanity$1.evaluate(TestRuleFieldCacheSanity.java:51)
[junit4:junit4]    > 	at org.apache.lucene.util.AbstractBeforeAfterRule$1.evaluate(AbstractBeforeAfterRule.java:46)
[junit4:junit4]    > 	at com.carrotsearch.randomizedtesting.rules.SystemPropertiesInvariantRule$1.evaluate(SystemPropertiesInvariantRule.java:55)
[junit4:junit4]    > 	at org.apache.lucene.util.TestRuleThreadAndTestName$1.evaluate(TestRuleThreadAndTestName.java:49)
[junit4:junit4]    > 	at org.apache.lucene.util.TestRuleIgnoreAfterMaxFailures$1.evaluate(TestRuleIgnoreAfterMaxFailures.java:70)
[junit4:junit4]    > 	at org.apache.lucene.util.TestRuleMarkFailure$1.evaluate(TestRuleMarkFailure.java:48)
[junit4:junit4]    > 	at com.carrotsearch.randomizedtesting.rules.StatementAdapter.evaluate(StatementAdapter.java:36)
[junit4:junit4]    > 	at com.carrotsearch.randomizedtesting.ThreadLeakControl$StatementRunner.run(ThreadLeakControl.java:358)
[junit4:junit4]    > 	at com.carrotsearch.randomizedtesting.ThreadLeakControl.forkTimeoutingTask(ThreadLeakControl.java:782)
[junit4:junit4]    > 	at com.carrotsearch.randomizedtesting.ThreadLeakControl$3.evaluate(ThreadLeakControl.java:442)
[junit4:junit4]    > 	at com.carrotsearch.randomizedtesting.RandomizedRunner.runSingleTest(RandomizedRunner.java:746)
[junit4:junit4]    > 	at com.carrotsearch.randomizedtesting.RandomizedRunner$3.evaluate(RandomizedRunner.java:648)
[junit4:junit4]    > 	at com.carrotsearch.randomizedtesting.RandomizedRunner$4.evaluate(RandomizedRunner.java:682)
[junit4:junit4]    > 	at com.carrotsearch.randomizedtesting.RandomizedRunner$5.evaluate(RandomizedRunner.java:693)
[junit4:junit4]    > 	at com.carrotsearch.randomizedtesting.rules.StatementAdapter.evaluate(StatementAdapter.java:36)
[junit4:junit4]    > 	at com.carrotsearch.randomizedtesting.rules.SystemPropertiesRestoreRule$1.evaluate(SystemPropertiesRestoreRule.java:53)
[junit4:junit4]    > 	at org.apache.lucene.util.AbstractBeforeAfterRule$1.evaluate(AbstractBeforeAfterRule.java:46)
[junit4:junit4]    > 	at org.apache.lucene.util.TestRuleStoreClassName$1.evaluate(TestRuleStoreClassName.java:42)
[junit4:junit4]    > 	at com.carrotsearch.randomizedtesting.rules.SystemPropertiesInvariantRule$1.evaluate(SystemPropertiesInvariantRule.java:55)
[junit4:junit4]    > 	at com.carrotsearch.randomizedtesting.rules.NoShadowingOrOverridesOnMethodsRule$1.evaluate(NoShadowingOrOverridesOnMethodsRule.java:39)
[junit4:junit4]    > 	at com.carrotsearch.randomizedtesting.rules.NoShadowingOrOverridesOnMethodsRule$1.evaluate(NoShadowingOrOverridesOnMethodsRule.java:39)
[junit4:junit4]    > 	at com.carrotsearch.randomizedtesting.rules.StatementAdapter.evaluate(StatementAdapter.java:36)
[junit4:junit4]    > 	at org.apache.lucene.util.TestRuleAssertionsRequired$1.evaluate(TestRuleAssertionsRequired.java:43)
[junit4:junit4]    > 	at org.apache.lucene.util.TestRuleMarkFailure$1.evaluate(TestRuleMarkFailure.java:48)
[junit4:junit4]    > 	at org.apache.lucene.util.TestRuleIgnoreAfterMaxFailures$1.evaluate(TestRuleIgnoreAfterMaxFailures.java:70)
[junit4:junit4]    > 	at org.apache.lucene.util.TestRuleIgnoreTestSuites$1.evaluate(TestRuleIgnoreTestSuites.java:55)
[junit4:junit4]    > 	at com.carrotsearch.randomizedtesting.rules.StatementAdapter.evaluate(StatementAdapter.java:36)
[junit4:junit4]    > 	at com.carrotsearch.randomizedtesting.ThreadLeakControl$StatementRunner.run(ThreadLeakControl.java:358)
[junit4:junit4]    > 	at java.lang.Thread.run(Thread.java:722)
[junit4:junit4]   2> 1168728 T2758 oas.SolrTestCaseJ4.deleteCore ###deleteCore
[junit4:junit4]   2> NOTE: test params are: codec=Lucene42: {n_f1=PostingsFormat(name=Direct), foo_b=PostingsFormat(name=Lucene41WithOrds), cat=Lucene41(blocksize=128), foo_d=MockVariableIntBlock(baseBlockSize=127), foo_f=PostingsFormat(name=Lucene41WithOrds), n_tl1=PostingsFormat(name=Direct), n_d1=Lucene41(blocksize=128), rnd_b=MockVariableIntBlock(baseBlockSize=127), intDefault=PostingsFormat(name=Direct), n_td1=PostingsFormat(name=Direct), timestamp=Lucene41(blocksize=128), id=MockVariableIntBlock(baseBlockSize=127), range_facet_sl=MockVariableIntBlock(baseBlockSize=127), range_facet_si=Lucene41(blocksize=128), oddField_s=MockVariableIntBlock(baseBlockSize=127), sequence_i=MockVariableIntBlock(baseBlockSize=127), name=MockVariableIntBlock(baseBlockSize=127), foo_i=PostingsFormat(name=Direct), regex_dup_B_s=Lucene41(blocksize=128), multiDefault=Lucene41(blocksize=128), n_tf1=Lucene41(blocksize=128), n_dt1=PostingsFormat(name=Direct), genre_s=MockVariableIntBlock(baseBlockSize=127), author_t=PostingsFormat(name=Direct), n_ti1=MockVariableIntBlock(baseBlockSize=127), range_facet_l=Lucene41(blocksize=128), text=PostingsFormat(name=Lucene41WithOrds), _version_=PostingsFormat(name=Direct), val_i=MockVariableIntBlock(baseBlockSize=127), SubjectTerms_mfacet=PostingsFormat(name=Direct), series_t=PostingsFormat(name=Direct), a_t=Lucene41(blocksize=128), n_tdt1=PostingsFormat(name=Direct), regex_dup_A_s=PostingsFormat(name=Lucene41WithOrds), price=PostingsFormat(name=Lucene41WithOrds), other_tl1=PostingsFormat(name=Direct), n_l1=Lucene41(blocksize=128), a_si=PostingsFormat(name=Direct), inStock=PostingsFormat(name=Lucene41WithOrds)}, docValues:{}, sim=RandomSimilarityProvider(queryNorm=false,coord=yes): {}, locale=is, timezone=America/Toronto
[junit4:junit4]   2> NOTE: Mac OS X 10.8.2 x86_64/Oracle Corporation 1.7.0_10 (64-bit)/cpus=2,threads=1,free=36751160,total=221569024
[junit4:junit4]   2> NOTE: All tests run in this JVM: [UpdateParamsTest, TestReversedWildcardFilterFactory, TestElisionMultitermQuery, IndexSchemaRuntimeFieldTest, StatelessScriptUpdateProcessorFactoryTest, TestSolrJ, TestCoreContainer, TermVectorComponentTest, TestSystemIdResolver, TestRemoteStreaming, UpdateRequestProcessorFactoryTest, TestFaceting, NumericFieldsTest, DefaultValueUpdateProcessorTest, TestOmitPositions, TestSurroundQueryParser, ZkControllerTest, TestFiltering, AlternateDirectoryTest, CircularListTest, QueryEqualityTest, ClusterStateTest, TestReload, TestPhraseSuggestions, CSVRequestHandlerTest, URLClassifyProcessorTest, TestRandomFaceting, SignatureUpdateProcessorFactoryTest, LegacyHTMLStripCharFilterTest, UUIDFieldTest, DateFieldTest, TestStressVersions, SampleTest, TestSolrQueryParser, MoreLikeThisHandlerTest, StatsComponentTest, IndexSchemaTest, RAMDirectoryFactoryTest, TestPseudoReturnFields, ShowFileRequestHandlerTest, ChaosMonkeySafeLeaderTest, SolrRequestParserTest, DirectUpdateHandlerOptimizeTest, FieldMutatingUpdateProcessorTest, TestLuceneMatchVersion, SolrIndexSplitterTest, TestExtendedDismaxParser, SuggesterTest, SpellPossibilityIteratorTest, RequestHandlersTest, SuggesterTSTTest, TestFastLRUCache, TestCodecSupport, SpellingQueryConverterTest, TestSolrIndexConfig, TestCSVLoader, TestXIncludeConfig, TestSolrDeletionPolicy1, LeaderElectionIntegrationTest, SpellCheckCollatorTest, IndexBasedSpellCheckerTest, TestReplicationHandler, ResourceLoaderTest, WordBreakSolrSpellCheckerTest, TestUpdate, DistributedTermsComponentTest, ZkCLITest, TestDFRSimilarityFactory, FieldAnalysisRequestHandlerTest, TestBinaryResponseWriter, ShardRoutingTest, XmlUpdateRequestHandlerTest, TestLFUCache, MBeansHandlerTest, TestSearchPerf, TestUtils, TestQueryUtils, TestGroupingSearch, OpenExchangeRatesOrgProviderTest, TestSort, SimplePostToolTest, AutoCommitTest, CacheHeaderTest, FullSolrCloudDistribCmdsTest, TestRecovery, JsonLoaderTest, ZkSolrClientTest, BasicFunctionalityTest, TestAtomicUpdateErrorCases, CoreAdminHandlerTest, FileBasedSpellCheckerTest, OverseerCollectionProcessorTest, TestValueSourceCache, TimeZoneUtilsTest, SolrCmdDistributorTest, TestFunctionQuery, SchemaVersionSpecificBehaviorTest, TestDistributedGrouping, PreAnalyzedFieldTest, BadComponentTest, LoggingHandlerTest, DisMaxRequestHandlerTest, PathHierarchyTokenizerFactoryTest, DocumentAnalysisRequestHandlerTest, ChaosMonkeyNothingIsSafeTest, TestStressLucene, CurrencyFieldTest, TestDistributedSearch, TestIndexSearcher, NoCacheHeaderTest, ZkNodePropsTest, TestCharFilters, TestIBSimilarityFactory, TestSolr4Spatial, MinimalSchemaTest, EchoParamsTest, SimpleFacetsTest, TestJmxMonitoredMap, CoreContainerCoreInitFailuresTest, TestSolrXMLSerializer, ReturnFieldsTest, BasicDistributedZkTest]
[junit4:junit4] Completed in 1169.19s, 1 test, 1 failure <<< FAILURES!

[...truncated 384 lines...]
BUILD FAILED
/Users/jenkins/jenkins-slave/workspace/Lucene-Solr-4.x-MacOSX/build.xml:381: The following error occurred while executing this line:
/Users/jenkins/jenkins-slave/workspace/Lucene-Solr-4.x-MacOSX/build.xml:361: The following error occurred while executing this line:
/Users/jenkins/jenkins-slave/workspace/Lucene-Solr-4.x-MacOSX/build.xml:39: The following error occurred while executing this line:
/Users/jenkins/jenkins-slave/workspace/Lucene-Solr-4.x-MacOSX/solr/build.xml:183: The following error occurred while executing this line:
/Users/jenkins/jenkins-slave/workspace/Lucene-Solr-4.x-MacOSX/solr/common-build.xml:447: The following error occurred while executing this line:
/Users/jenkins/jenkins-slave/workspace/Lucene-Solr-4.x-MacOSX/lucene/common-build.xml:1202: The following error occurred while executing this line:
/Users/jenkins/jenkins-slave/workspace/Lucene-Solr-4.x-MacOSX/lucene/common-build.xml:865: There were test failures: 251 suites, 1043 tests, 1 failure, 13 ignored (2 assumptions)

Total time: 78 minutes 44 seconds
Build step 'Invoke Ant' marked build as failure
Archiving artifacts
Recording test results
Description set: Java: 64bit/jdk1.7.0 -XX:+UseConcMarkSweepGC
Email was triggered for: Failure
Sending email for trigger: Failure



Mime
View raw message