lucene-dev mailing list archives

Site index · List index
Message view « Date » · « Thread »
Top « Date » · « Thread »
From Apache Jenkins Server <jenk...@builds.apache.org>
Subject [JENKINS] Lucene-Solr-Tests-4.x-Java6 - Build # 1296 - Still Failing
Date Fri, 01 Feb 2013 06:52:18 GMT
Build: https://builds.apache.org/job/Lucene-Solr-Tests-4.x-Java6/1296/

1 tests failed.
FAILED:  org.apache.solr.cloud.SyncSliceTest.testDistribSearch

Error Message:
shard1 should have just been set up to be inconsistent - but it's still consistent

Stack Trace:
java.lang.AssertionError: shard1 should have just been set up to be inconsistent - but it's still consistent
	at __randomizedtesting.SeedInfo.seed([7F12AEE6E902F2D8:FEF420FE9E5D92E4]:0)
	at org.junit.Assert.fail(Assert.java:93)
	at org.junit.Assert.assertTrue(Assert.java:43)
	at org.junit.Assert.assertNotNull(Assert.java:526)
	at org.apache.solr.cloud.SyncSliceTest.doTest(SyncSliceTest.java:214)
	at org.apache.solr.BaseDistributedSearchTestCase.testDistribSearch(BaseDistributedSearchTestCase.java:794)
	at sun.reflect.NativeMethodAccessorImpl.invoke0(Native Method)
	at sun.reflect.NativeMethodAccessorImpl.invoke(NativeMethodAccessorImpl.java:57)
	at sun.reflect.DelegatingMethodAccessorImpl.invoke(DelegatingMethodAccessorImpl.java:43)
	at java.lang.reflect.Method.invoke(Method.java:616)
	at com.carrotsearch.randomizedtesting.RandomizedRunner.invoke(RandomizedRunner.java:1559)
	at com.carrotsearch.randomizedtesting.RandomizedRunner.access$600(RandomizedRunner.java:79)
	at com.carrotsearch.randomizedtesting.RandomizedRunner$6.evaluate(RandomizedRunner.java:737)
	at com.carrotsearch.randomizedtesting.RandomizedRunner$7.evaluate(RandomizedRunner.java:773)
	at com.carrotsearch.randomizedtesting.RandomizedRunner$8.evaluate(RandomizedRunner.java:787)
	at com.carrotsearch.randomizedtesting.rules.SystemPropertiesRestoreRule$1.evaluate(SystemPropertiesRestoreRule.java:53)
	at org.apache.lucene.util.TestRuleSetupTeardownChained$1.evaluate(TestRuleSetupTeardownChained.java:50)
	at org.apache.lucene.util.TestRuleFieldCacheSanity$1.evaluate(TestRuleFieldCacheSanity.java:51)
	at org.apache.lucene.util.AbstractBeforeAfterRule$1.evaluate(AbstractBeforeAfterRule.java:46)
	at com.carrotsearch.randomizedtesting.rules.SystemPropertiesInvariantRule$1.evaluate(SystemPropertiesInvariantRule.java:55)
	at org.apache.lucene.util.TestRuleThreadAndTestName$1.evaluate(TestRuleThreadAndTestName.java:49)
	at org.apache.lucene.util.TestRuleIgnoreAfterMaxFailures$1.evaluate(TestRuleIgnoreAfterMaxFailures.java:70)
	at org.apache.lucene.util.TestRuleMarkFailure$1.evaluate(TestRuleMarkFailure.java:48)
	at com.carrotsearch.randomizedtesting.rules.StatementAdapter.evaluate(StatementAdapter.java:36)
	at com.carrotsearch.randomizedtesting.ThreadLeakControl$StatementRunner.run(ThreadLeakControl.java:358)
	at com.carrotsearch.randomizedtesting.ThreadLeakControl.forkTimeoutingTask(ThreadLeakControl.java:782)
	at com.carrotsearch.randomizedtesting.ThreadLeakControl$3.evaluate(ThreadLeakControl.java:442)
	at com.carrotsearch.randomizedtesting.RandomizedRunner.runSingleTest(RandomizedRunner.java:746)
	at com.carrotsearch.randomizedtesting.RandomizedRunner$3.evaluate(RandomizedRunner.java:648)
	at com.carrotsearch.randomizedtesting.RandomizedRunner$4.evaluate(RandomizedRunner.java:682)
	at com.carrotsearch.randomizedtesting.RandomizedRunner$5.evaluate(RandomizedRunner.java:693)
	at com.carrotsearch.randomizedtesting.rules.StatementAdapter.evaluate(StatementAdapter.java:36)
	at com.carrotsearch.randomizedtesting.rules.SystemPropertiesRestoreRule$1.evaluate(SystemPropertiesRestoreRule.java:53)
	at org.apache.lucene.util.AbstractBeforeAfterRule$1.evaluate(AbstractBeforeAfterRule.java:46)
	at org.apache.lucene.util.TestRuleStoreClassName$1.evaluate(TestRuleStoreClassName.java:42)
	at com.carrotsearch.randomizedtesting.rules.SystemPropertiesInvariantRule$1.evaluate(SystemPropertiesInvariantRule.java:55)
	at com.carrotsearch.randomizedtesting.rules.NoShadowingOrOverridesOnMethodsRule$1.evaluate(NoShadowingOrOverridesOnMethodsRule.java:39)
	at com.carrotsearch.randomizedtesting.rules.NoShadowingOrOverridesOnMethodsRule$1.evaluate(NoShadowingOrOverridesOnMethodsRule.java:39)
	at com.carrotsearch.randomizedtesting.rules.StatementAdapter.evaluate(StatementAdapter.java:36)
	at org.apache.lucene.util.TestRuleAssertionsRequired$1.evaluate(TestRuleAssertionsRequired.java:43)
	at org.apache.lucene.util.TestRuleMarkFailure$1.evaluate(TestRuleMarkFailure.java:48)
	at org.apache.lucene.util.TestRuleIgnoreAfterMaxFailures$1.evaluate(TestRuleIgnoreAfterMaxFailures.java:70)
	at org.apache.lucene.util.TestRuleIgnoreTestSuites$1.evaluate(TestRuleIgnoreTestSuites.java:55)
	at com.carrotsearch.randomizedtesting.rules.StatementAdapter.evaluate(StatementAdapter.java:36)
	at com.carrotsearch.randomizedtesting.ThreadLeakControl$StatementRunner.run(ThreadLeakControl.java:358)
	at java.lang.Thread.run(Thread.java:679)




Build Log:
[...truncated 8041 lines...]
[junit4:junit4] Suite: org.apache.solr.cloud.SyncSliceTest
[junit4:junit4]   2> 0 T30 oas.BaseDistributedSearchTestCase.initHostContext Setting hostContext system property: /ts/nc
[junit4:junit4]   2> 5 T30 oas.SolrTestCaseJ4.setUp ###Starting testDistribSearch
[junit4:junit4]   2> Creating dataDir: /usr/home/hudson/hudson-slave/workspace/Lucene-Solr-Tests-4.x-Java6/solr/build/solr-core/test/J0/./solrtest-SyncSliceTest-1359700583527
[junit4:junit4]   2> 11 T30 oasc.ZkTestServer.run STARTING ZK TEST SERVER
[junit4:junit4]   2> 16 T31 oasc.ZkTestServer$ZKServerMain.runFromConfig Starting server
[junit4:junit4]   2> 76 T31 oaz.Environment.logEnv Server environment:zookeeper.version=3.4.5-1392090, built on 09/30/2012 17:52 GMT
[junit4:junit4]   2> 76 T31 oaz.Environment.logEnv Server environment:host.name=lucene.zones.apache.org
[junit4:junit4]   2> 77 T31 oaz.Environment.logEnv Server environment:java.version=1.6.0_32
[junit4:junit4]   2> 77 T31 oaz.Environment.logEnv Server environment:java.vendor=Sun Microsystems Inc.
[junit4:junit4]   2> 77 T31 oaz.Environment.logEnv Server environment:java.home=/usr/local/openjdk6/jre
[junit4:junit4]   2> 78 T31 oaz.Environment.logEnv Server environment:java.class.path=/usr/home/hudson/hudson-slave/workspace/Lucene-Solr-Tests-4.x-Java6/solr/build/solr-core/classes/test:/usr/home/hudson/hudson-slave/workspace/Lucene-Solr-Tests-4.x-Java6/solr/build/solr-test-framework/classes/java:/usr/home/hudson/hudson-slave/workspace/Lucene-Solr-Tests-4.x-Java6/solr/build/solr-core/test-files:/usr/home/hudson/hudson-slave/workspace/Lucene-Solr-Tests-4.x-Java6/lucene/build/test-framework/classes/java:/usr/home/hudson/hudson-slave/workspace/Lucene-Solr-Tests-4.x-Java6/lucene/build/codecs/classes/java:/usr/home/hudson/hudson-slave/workspace/Lucene-Solr-Tests-4.x-Java6/solr/build/solr-solrj/classes/java:/usr/home/hudson/hudson-slave/workspace/Lucene-Solr-Tests-4.x-Java6/solr/build/solr-core/classes/java:/usr/home/hudson/hudson-slave/workspace/Lucene-Solr-Tests-4.x-Java6/lucene/build/analysis/common/lucene-analyzers-common-4.2-SNAPSHOT.jar:/usr/home/hudson/hudson-slave/workspace/Lucene-Solr-Tests-4.x-Java6/lucene/build/analysis/kuromoji/lucene-analyzers-kuromoji-4.2-SNAPSHOT.jar:/usr/home/hudson/hudson-slave/workspace/Lucene-Solr-Tests-4.x-Java6/lucene/build/analysis/phonetic/lucene-analyzers-phonetic-4.2-SNAPSHOT.jar:/usr/home/hudson/hudson-slave/workspace/Lucene-Solr-Tests-4.x-Java6/lucene/build/highlighter/lucene-highlighter-4.2-SNAPSHOT.jar:/usr/home/hudson/hudson-slave/workspace/Lucene-Solr-Tests-4.x-Java6/lucene/build/memory/lucene-memory-4.2-SNAPSHOT.jar:/usr/home/hudson/hudson-slave/workspace/Lucene-Solr-Tests-4.x-Java6/lucene/build/misc/lucene-misc-4.2-SNAPSHOT.jar:/usr/home/hudson/hudson-slave/workspace/Lucene-Solr-Tests-4.x-Java6/lucene/build/spatial/lucene-spatial-4.2-SNAPSHOT.jar:/usr/home/hudson/hudson-slave/workspace/Lucene-Solr-Tests-4.x-Java6/lucene/build/suggest/lucene-suggest-4.2-SNAPSHOT.jar:/usr/home/hudson/hudson-slave/workspace/Lucene-Solr-Tests-4.x-Java6/lucene/build/grouping/lucene-grouping-4.2-SNAPSHOT.jar:/usr/home/hudson/hudson-slave/workspace/Lucene-Solr-Tests-4.x-Java6/lucene/build/queries/lucene-queries-4.2-SNAPSHOT.jar:/usr/home/hudson/hudson-slave/workspace/Lucene-Solr-Tests-4.x-Java6/lucene/build/queryparser/lucene-queryparser-4.2-SNAPSHOT.jar:/usr/home/hudson/hudson-slave/workspace/Lucene-Solr-Tests-4.x-Java6/solr/core/lib/cglib-nodep-2.2.jar:/usr/home/hudson/hudson-slave/workspace/Lucene-Solr-Tests-4.x-Java6/solr/core/lib/commons-cli-1.2.jar:/usr/home/hudson/hudson-slave/workspace/Lucene-Solr-Tests-4.x-Java6/solr/core/lib/commons-codec-1.7.jar:/usr/home/hudson/hudson-slave/workspace/Lucene-Solr-Tests-4.x-Java6/solr/core/lib/commons-fileupload-1.2.1.jar:/usr/home/hudson/hudson-slave/workspace/Lucene-Solr-Tests-4.x-Java6/solr/core/lib/commons-lang-2.6.jar:/usr/home/hudson/hudson-slave/workspace/Lucene-Solr-Tests-4.x-Java6/solr/core/lib/easymock-3.0.jar:/usr/home/hudson/hudson-slave/workspace/Lucene-Solr-Tests-4.x-Java6/solr/core/lib/guava-13.0.1.jar:/usr/home/hudson/hudson-slave/workspace/Lucene-Solr-Tests-4.x-Java6/solr/core/lib/javax.servlet-api-3.0.1.jar:/usr/home/hudson/hudson-slave/workspace/Lucene-Solr-Tests-4.x-Java6/solr/core/lib/objenesis-1.2.jar:/usr/home/hudson/hudson-slave/workspace/Lucene-Solr-Tests-4.x-Java6/solr/core/lib/spatial4j-0.3.jar:/usr/home/hudson/hudson-slave/workspace/Lucene-Solr-Tests-4.x-Java6/solr/solrj/lib/commons-io-2.1.jar:/usr/home/hudson/hudson-slave/workspace/Lucene-Solr-Tests-4.x-Java6/solr/solrj/lib/httpclient-4.1.3.jar:/usr/home/hudson/hudson-slave/workspace/Lucene-Solr-Tests-4.x-Java6/solr/solrj/lib/httpcore-4.1.4.jar:/usr/home/hudson/hudson-slave/workspace/Lucene-Solr-Tests-4.x-Java6/solr/solrj/lib/httpmime-4.1.3.jar:/usr/home/hudson/hudson-slave/workspace/Lucene-Solr-Tests-4.x-Java6/solr/solrj/lib/jcl-over-slf4j-1.6.4.jar:/usr/home/hudson/hudson-slave/workspace/Lucene-Solr-Tests-4.x-Java6/solr/solrj/lib/slf4j-api-1.6.4.jar:/usr/home/hudson/hudson-slave/workspace/Lucene-Solr-Tests-4.x-Java6/solr/solrj/lib/slf4j-jdk14-1.6.4.jar:/usr/home/hudson/hudson-slave/workspace/Lucene-Solr-Tests-4.x-Java6/solr/solrj/lib/wstx-asl-3.2.7.jar:/usr/home/hudson/hudson-slave/workspace/Lucene-Solr-Tests-4.x-Java6/solr/solrj/lib/zookeeper-3.4.5.jar:/usr/home/hudson/hudson-slave/workspace/Lucene-Solr-Tests-4.x-Java6/solr/example/lib/jetty-continuation-8.1.8.v20121106.jar:/usr/home/hudson/hudson-slave/workspace/Lucene-Solr-Tests-4.x-Java6/solr/example/lib/jetty-deploy-8.1.8.v20121106.jar:/usr/home/hudson/hudson-slave/workspace/Lucene-Solr-Tests-4.x-Java6/solr/example/lib/jetty-http-8.1.8.v20121106.jar:/usr/home/hudson/hudson-slave/workspace/Lucene-Solr-Tests-4.x-Java6/solr/example/lib/jetty-io-8.1.8.v20121106.jar:/usr/home/hudson/hudson-slave/workspace/Lucene-Solr-Tests-4.x-Java6/solr/example/lib/jetty-jmx-8.1.8.v20121106.jar:/usr/home/hudson/hudson-slave/workspace/Lucene-Solr-Tests-4.x-Java6/solr/example/lib/jetty-security-8.1.8.v20121106.jar:/usr/home/hudson/hudson-slave/workspace/Lucene-Solr-Tests-4.x-Java6/solr/example/lib/jetty-server-8.1.8.v20121106.jar:/usr/home/hudson/hudson-slave/workspace/Lucene-Solr-Tests-4.x-Java6/solr/example/lib/jetty-servlet-8.1.8.v20121106.jar:/usr/home/hudson/hudson-slave/workspace/Lucene-Solr-Tests-4.x-Java6/solr/example/lib/jetty-util-8.1.8.v20121106.jar:/usr/home/hudson/hudson-slave/workspace/Lucene-Solr-Tests-4.x-Java6/solr/example/lib/jetty-webapp-8.1.8.v20121106.jar:/usr/home/hudson/hudson-slave/workspace/Lucene-Solr-Tests-4.x-Java6/solr/example/lib/jetty-xml-8.1.8.v20121106.jar:/usr/home/hudson/hudson-slave/workspace/Lucene-Solr-Tests-4.x-Java6/solr/example/lib/servlet-api-3.0.jar:/usr/home/hudson/hudson-slave/workspace/Lucene-Solr-Tests-4.x-Java6/solr/example/example-DIH/solr/db/lib/derby-10.9.1.0.jar:/usr/home/hudson/hudson-slave/workspace/Lucene-Solr-Tests-4.x-Java6/solr/example/example-DIH/solr/db/lib/hsqldb-1.8.0.10.jar:/usr/home/hudson/hudson-slave/workspace/Lucene-Solr-Tests-4.x-Java6/lucene/build/core/classes/java:/usr/home/hudson/hudson-slave/workspace/Lucene-Solr-Tests-4.x-Java6/lucene/test-framework/lib/junit-4.10.jar:/usr/home/hudson/hudson-slave/workspace/Lucene-Solr-Tests-4.x-Java6/lucene/test-framework/lib/randomizedtesting-runner-2.0.8.jar:/home/hudson/hudson-slave/tools/hudson.tasks.Ant_AntInstallation/ant-1.8.2/lib/ant-launcher.jar:/home/hudson/.ant/lib/ivy-2.2.0.jar:/home/hudson/hudson-slave/tools/hudson.tasks.Ant_AntInstallation/ant-1.8.2/lib/ant-commons-logging.jar:/home/hudson/hudson-slave/tools/hudson.tasks.Ant_AntInstallation/ant-1.8.2/lib/ant-apache-regexp.jar:/home/hudson/hudson-slave/tools/hudson.tasks.Ant_AntInstallation/ant-1.8.2/lib/ant-apache-oro.jar:/home/hudson/hudson-slave/tools/hudson.tasks.Ant_AntInstallation/ant-1.8.2/lib/ant-swing.jar:/home/hudson/hudson-slave/tools/hudson.tasks.Ant_AntInstallation/ant-1.8.2/lib/ant-jdepend.jar:/home/hudson/hudson-slave/tools/hudson.tasks.Ant_AntInstallation/ant-1.8.2/lib/ant-apache-xalan2.jar:/home/hudson/hudson-slave/tools/hudson.tasks.Ant_AntInstallation/ant-1.8.2/lib/ant-apache-bsf.jar:/home/hudson/hudson-slave/tools/hudson.tasks.Ant_AntInstallation/ant-1.8.2/lib/ant-junit4.jar:/home/hudson/hudson-slave/tools/hudson.tasks.Ant_AntInstallation/ant-1.8.2/lib/ant-commons-net.jar:/home/hudson/hudson-slave/tools/hudson.tasks.Ant_AntInstallation/ant-1.8.2/lib/ant-antlr.jar:/home/hudson/hudson-slave/tools/hudson.tasks.Ant_AntInstallation/ant-1.8.2/lib/ant-junit.jar:/home/hudson/hudson-slave/tools/hudson.tasks.Ant_AntInstallation/ant-1.8.2/lib/ant-jmf.jar:/home/hudson/hudson-slave/tools/hudson.tasks.Ant_AntInstallation/ant-1.8.2/lib/ant-netrexx.jar:/home/hudson/hudson-slave/tools/hudson.tasks.Ant_AntInstallation/ant-1.8.2/lib/ant-apache-log4j.jar:/home/hudson/hudson-slave/tools/hudson.tasks.Ant_AntInstallation/ant-1.8.2/lib/ant-apache-resolver.jar:/home/hudson/hudson-slave/tools/hudson.tasks.Ant_AntInstallation/ant-1.8.2/lib/ant.jar:/home/hudson/hudson-slave/tools/hudson.tasks.Ant_AntInstallation/ant-1.8.2/lib/ant-jsch.jar:/home/hudson/hudson-slave/tools/hudson.tasks.Ant_AntInstallation/ant-1.8.2/lib/ant-testutil.jar:/home/hudson/hudson-slave/tools/hudson.tasks.Ant_AntInstallation/ant-1.8.2/lib/ant-apache-bcel.jar:/home/hudson/hudson-slave/tools/hudson.tasks.Ant_AntInstallation/ant-1.8.2/lib/ant-jai.jar:/home/hudson/hudson-slave/tools/hudson.tasks.Ant_AntInstallation/ant-1.8.2/lib/ant-javamail.jar:/usr/local/openjdk6/lib/tools.jar:/home/hudson/.ivy2/cache/com.carrotsearch.randomizedtesting/junit4-ant/jars/junit4-ant-2.0.8.jar
[junit4:junit4]   2> 79 T31 oaz.Environment.logEnv Server environment:java.library.path=/usr/local/openjdk6/jre/lib/amd64/server:/usr/local/openjdk6/jre/lib/amd64:/usr/local/openjdk6/jre/../lib/amd64:/usr/java/packages/lib/amd64:/lib:/usr/lib:/usr/local/lib
[junit4:junit4]   2> 80 T31 oaz.Environment.logEnv Server environment:java.io.tmpdir=.
[junit4:junit4]   2> 80 T31 oaz.Environment.logEnv Server environment:java.compiler=<NA>
[junit4:junit4]   2> 80 T31 oaz.Environment.logEnv Server environment:os.name=FreeBSD
[junit4:junit4]   2> 81 T31 oaz.Environment.logEnv Server environment:os.arch=amd64
[junit4:junit4]   2> 81 T31 oaz.Environment.logEnv Server environment:os.version=9.0-RELEASE
[junit4:junit4]   2> 81 T31 oaz.Environment.logEnv Server environment:user.name=hudson
[junit4:junit4]   2> 81 T31 oaz.Environment.logEnv Server environment:user.home=/home/hudson
[junit4:junit4]   2> 82 T31 oaz.Environment.logEnv Server environment:user.dir=/usr/home/hudson/hudson-slave/workspace/Lucene-Solr-Tests-4.x-Java6/solr/build/solr-core/test/J0
[junit4:junit4]   2> 139 T31 oazs.ZooKeeperServer.setTickTime tickTime set to 1000
[junit4:junit4]   2> 140 T31 oazs.ZooKeeperServer.setMinSessionTimeout minSessionTimeout set to -1
[junit4:junit4]   2> 140 T31 oazs.ZooKeeperServer.setMaxSessionTimeout maxSessionTimeout set to -1
[junit4:junit4]   2> 148 T31 oazs.NIOServerCnxnFactory.configure binding to port 0.0.0.0/0.0.0.0:0
[junit4:junit4]   2> 218 T30 oasc.ZkTestServer.run start zk server on port:46809
[junit4:junit4]   2> 243 T31 oazsp.FileTxnSnapLog.save Snapshotting: 0x0 to /usr/home/hudson/hudson-slave/workspace/Lucene-Solr-Tests-4.x-Java6/solr/build/solr-core/test/J0/./org.apache.solr.cloud.SyncSliceTest-1359700583526/zookeeper/server1/data/version-2/snapshot.0
[junit4:junit4]   2> 393 T30 oaz.Environment.logEnv Client environment:zookeeper.version=3.4.5-1392090, built on 09/30/2012 17:52 GMT
[junit4:junit4]   2> 394 T30 oaz.Environment.logEnv Client environment:host.name=lucene.zones.apache.org
[junit4:junit4]   2> 395 T30 oaz.Environment.logEnv Client environment:java.version=1.6.0_32
[junit4:junit4]   2> 395 T30 oaz.Environment.logEnv Client environment:java.vendor=Sun Microsystems Inc.
[junit4:junit4]   2> 396 T30 oaz.Environment.logEnv Client environment:java.home=/usr/local/openjdk6/jre
[junit4:junit4]   2> 396 T30 oaz.Environment.logEnv Client environment:java.class.path=/usr/home/hudson/hudson-slave/workspace/Lucene-Solr-Tests-4.x-Java6/solr/build/solr-core/classes/test:/usr/home/hudson/hudson-slave/workspace/Lucene-Solr-Tests-4.x-Java6/solr/build/solr-test-framework/classes/java:/usr/home/hudson/hudson-slave/workspace/Lucene-Solr-Tests-4.x-Java6/solr/build/solr-core/test-files:/usr/home/hudson/hudson-slave/workspace/Lucene-Solr-Tests-4.x-Java6/lucene/build/test-framework/classes/java:/usr/home/hudson/hudson-slave/workspace/Lucene-Solr-Tests-4.x-Java6/lucene/build/codecs/classes/java:/usr/home/hudson/hudson-slave/workspace/Lucene-Solr-Tests-4.x-Java6/solr/build/solr-solrj/classes/java:/usr/home/hudson/hudson-slave/workspace/Lucene-Solr-Tests-4.x-Java6/solr/build/solr-core/classes/java:/usr/home/hudson/hudson-slave/workspace/Lucene-Solr-Tests-4.x-Java6/lucene/build/analysis/common/lucene-analyzers-common-4.2-SNAPSHOT.jar:/usr/home/hudson/hudson-slave/workspace/Lucene-Solr-Tests-4.x-Java6/lucene/build/analysis/kuromoji/lucene-analyzers-kuromoji-4.2-SNAPSHOT.jar:/usr/home/hudson/hudson-slave/workspace/Lucene-Solr-Tests-4.x-Java6/lucene/build/analysis/phonetic/lucene-analyzers-phonetic-4.2-SNAPSHOT.jar:/usr/home/hudson/hudson-slave/workspace/Lucene-Solr-Tests-4.x-Java6/lucene/build/highlighter/lucene-highlighter-4.2-SNAPSHOT.jar:/usr/home/hudson/hudson-slave/workspace/Lucene-Solr-Tests-4.x-Java6/lucene/build/memory/lucene-memory-4.2-SNAPSHOT.jar:/usr/home/hudson/hudson-slave/workspace/Lucene-Solr-Tests-4.x-Java6/lucene/build/misc/lucene-misc-4.2-SNAPSHOT.jar:/usr/home/hudson/hudson-slave/workspace/Lucene-Solr-Tests-4.x-Java6/lucene/build/spatial/lucene-spatial-4.2-SNAPSHOT.jar:/usr/home/hudson/hudson-slave/workspace/Lucene-Solr-Tests-4.x-Java6/lucene/build/suggest/lucene-suggest-4.2-SNAPSHOT.jar:/usr/home/hudson/hudson-slave/workspace/Lucene-Solr-Tests-4.x-Java6/lucene/build/grouping/lucene-grouping-4.2-SNAPSHOT.jar:/usr/home/hudson/hudson-slave/workspace/Lucene-Solr-Tests-4.x-Java6/lucene/build/queries/lucene-queries-4.2-SNAPSHOT.jar:/usr/home/hudson/hudson-slave/workspace/Lucene-Solr-Tests-4.x-Java6/lucene/build/queryparser/lucene-queryparser-4.2-SNAPSHOT.jar:/usr/home/hudson/hudson-slave/workspace/Lucene-Solr-Tests-4.x-Java6/solr/core/lib/cglib-nodep-2.2.jar:/usr/home/hudson/hudson-slave/workspace/Lucene-Solr-Tests-4.x-Java6/solr/core/lib/commons-cli-1.2.jar:/usr/home/hudson/hudson-slave/workspace/Lucene-Solr-Tests-4.x-Java6/solr/core/lib/commons-codec-1.7.jar:/usr/home/hudson/hudson-slave/workspace/Lucene-Solr-Tests-4.x-Java6/solr/core/lib/commons-fileupload-1.2.1.jar:/usr/home/hudson/hudson-slave/workspace/Lucene-Solr-Tests-4.x-Java6/solr/core/lib/commons-lang-2.6.jar:/usr/home/hudson/hudson-slave/workspace/Lucene-Solr-Tests-4.x-Java6/solr/core/lib/easymock-3.0.jar:/usr/home/hudson/hudson-slave/workspace/Lucene-Solr-Tests-4.x-Java6/solr/core/lib/guava-13.0.1.jar:/usr/home/hudson/hudson-slave/workspace/Lucene-Solr-Tests-4.x-Java6/solr/core/lib/javax.servlet-api-3.0.1.jar:/usr/home/hudson/hudson-slave/workspace/Lucene-Solr-Tests-4.x-Java6/solr/core/lib/objenesis-1.2.jar:/usr/home/hudson/hudson-slave/workspace/Lucene-Solr-Tests-4.x-Java6/solr/core/lib/spatial4j-0.3.jar:/usr/home/hudson/hudson-slave/workspace/Lucene-Solr-Tests-4.x-Java6/solr/solrj/lib/commons-io-2.1.jar:/usr/home/hudson/hudson-slave/workspace/Lucene-Solr-Tests-4.x-Java6/solr/solrj/lib/httpclient-4.1.3.jar:/usr/home/hudson/hudson-slave/workspace/Lucene-Solr-Tests-4.x-Java6/solr/solrj/lib/httpcore-4.1.4.jar:/usr/home/hudson/hudson-slave/workspace/Lucene-Solr-Tests-4.x-Java6/solr/solrj/lib/httpmime-4.1.3.jar:/usr/home/hudson/hudson-slave/workspace/Lucene-Solr-Tests-4.x-Java6/solr/solrj/lib/jcl-over-slf4j-1.6.4.jar:/usr/home/hudson/hudson-slave/workspace/Lucene-Solr-Tests-4.x-Java6/solr/solrj/lib/slf4j-api-1.6.4.jar:/usr/home/hudson/hudson-slave/workspace/Lucene-Solr-Tests-4.x-Java6/solr/solrj/lib/slf4j-jdk14-1.6.4.jar:/usr/home/hudson/hudson-slave/workspace/Lucene-Solr-Tests-4.x-Java6/solr/solrj/lib/wstx-asl-3.2.7.jar:/usr/home/hudson/hudson-slave/workspace/Lucene-Solr-Tests-4.x-Java6/solr/solrj/lib/zookeeper-3.4.5.jar:/usr/home/hudson/hudson-slave/workspace/Lucene-Solr-Tests-4.x-Java6/solr/example/lib/jetty-continuation-8.1.8.v20121106.jar:/usr/home/hudson/hudson-slave/workspace/Lucene-Solr-Tests-4.x-Java6/solr/example/lib/jetty-deploy-8.1.8.v20121106.jar:/usr/home/hudson/hudson-slave/workspace/Lucene-Solr-Tests-4.x-Java6/solr/example/lib/jetty-http-8.1.8.v20121106.jar:/usr/home/hudson/hudson-slave/workspace/Lucene-Solr-Tests-4.x-Java6/solr/example/lib/jetty-io-8.1.8.v20121106.jar:/usr/home/hudson/hudson-slave/workspace/Lucene-Solr-Tests-4.x-Java6/solr/example/lib/jetty-jmx-8.1.8.v20121106.jar:/usr/home/hudson/hudson-slave/workspace/Lucene-Solr-Tests-4.x-Java6/solr/example/lib/jetty-security-8.1.8.v20121106.jar:/usr/home/hudson/hudson-slave/workspace/Lucene-Solr-Tests-4.x-Java6/solr/example/lib/jetty-server-8.1.8.v20121106.jar:/usr/home/hudson/hudson-slave/workspace/Lucene-Solr-Tests-4.x-Java6/solr/example/lib/jetty-servlet-8.1.8.v20121106.jar:/usr/home/hudson/hudson-slave/workspace/Lucene-Solr-Tests-4.x-Java6/solr/example/lib/jetty-util-8.1.8.v20121106.jar:/usr/home/hudson/hudson-slave/workspace/Lucene-Solr-Tests-4.x-Java6/solr/example/lib/jetty-webapp-8.1.8.v20121106.jar:/usr/home/hudson/hudson-slave/workspace/Lucene-Solr-Tests-4.x-Java6/solr/example/lib/jetty-xml-8.1.8.v20121106.jar:/usr/home/hudson/hudson-slave/workspace/Lucene-Solr-Tests-4.x-Java6/solr/example/lib/servlet-api-3.0.jar:/usr/home/hudson/hudson-slave/workspace/Lucene-Solr-Tests-4.x-Java6/solr/example/example-DIH/solr/db/lib/derby-10.9.1.0.jar:/usr/home/hudson/hudson-slave/workspace/Lucene-Solr-Tests-4.x-Java6/solr/example/example-DIH/solr/db/lib/hsqldb-1.8.0.10.jar:/usr/home/hudson/hudson-slave/workspace/Lucene-Solr-Tests-4.x-Java6/lucene/build/core/classes/java:/usr/home/hudson/hudson-slave/workspace/Lucene-Solr-Tests-4.x-Java6/lucene/test-framework/lib/junit-4.10.jar:/usr/home/hudson/hudson-slave/workspace/Lucene-Solr-Tests-4.x-Java6/lucene/test-framework/lib/randomizedtesting-runner-2.0.8.jar:/home/hudson/hudson-slave/tools/hudson.tasks.Ant_AntInstallation/ant-1.8.2/lib/ant-launcher.jar:/home/hudson/.ant/lib/ivy-2.2.0.jar:/home/hudson/hudson-slave/tools/hudson.tasks.Ant_AntInstallation/ant-1.8.2/lib/ant-commons-logging.jar:/home/hudson/hudson-slave/tools/hudson.tasks.Ant_AntInstallation/ant-1.8.2/lib/ant-apache-regexp.jar:/home/hudson/hudson-slave/tools/hudson.tasks.Ant_AntInstallation/ant-1.8.2/lib/ant-apache-oro.jar:/home/hudson/hudson-slave/tools/hudson.tasks.Ant_AntInstallation/ant-1.8.2/lib/ant-swing.jar:/home/hudson/hudson-slave/tools/hudson.tasks.Ant_AntInstallation/ant-1.8.2/lib/ant-jdepend.jar:/home/hudson/hudson-slave/tools/hudson.tasks.Ant_AntInstallation/ant-1.8.2/lib/ant-apache-xalan2.jar:/home/hudson/hudson-slave/tools/hudson.tasks.Ant_AntInstallation/ant-1.8.2/lib/ant-apache-bsf.jar:/home/hudson/hudson-slave/tools/hudson.tasks.Ant_AntInstallation/ant-1.8.2/lib/ant-junit4.jar:/home/hudson/hudson-slave/tools/hudson.tasks.Ant_AntInstallation/ant-1.8.2/lib/ant-commons-net.jar:/home/hudson/hudson-slave/tools/hudson.tasks.Ant_AntInstallation/ant-1.8.2/lib/ant-antlr.jar:/home/hudson/hudson-slave/tools/hudson.tasks.Ant_AntInstallation/ant-1.8.2/lib/ant-junit.jar:/home/hudson/hudson-slave/tools/hudson.tasks.Ant_AntInstallation/ant-1.8.2/lib/ant-jmf.jar:/home/hudson/hudson-slave/tools/hudson.tasks.Ant_AntInstallation/ant-1.8.2/lib/ant-netrexx.jar:/home/hudson/hudson-slave/tools/hudson.tasks.Ant_AntInstallation/ant-1.8.2/lib/ant-apache-log4j.jar:/home/hudson/hudson-slave/tools/hudson.tasks.Ant_AntInstallation/ant-1.8.2/lib/ant-apache-resolver.jar:/home/hudson/hudson-slave/tools/hudson.tasks.Ant_AntInstallation/ant-1.8.2/lib/ant.jar:/home/hudson/hudson-slave/tools/hudson.tasks.Ant_AntInstallation/ant-1.8.2/lib/ant-jsch.jar:/home/hudson/hudson-slave/tools/hudson.tasks.Ant_AntInstallation/ant-1.8.2/lib/ant-testutil.jar:/home/hudson/hudson-slave/tools/hudson.tasks.Ant_AntInstallation/ant-1.8.2/lib/ant-apache-bcel.jar:/home/hudson/hudson-slave/tools/hudson.tasks.Ant_AntInstallation/ant-1.8.2/lib/ant-jai.jar:/home/hudson/hudson-slave/tools/hudson.tasks.Ant_AntInstallation/ant-1.8.2/lib/ant-javamail.jar:/usr/local/openjdk6/lib/tools.jar:/home/hudson/.ivy2/cache/com.carrotsearch.randomizedtesting/junit4-ant/jars/junit4-ant-2.0.8.jar
[junit4:junit4]   2> 398 T30 oaz.Environment.logEnv Client environment:java.library.path=/usr/local/openjdk6/jre/lib/amd64/server:/usr/local/openjdk6/jre/lib/amd64:/usr/local/openjdk6/jre/../lib/amd64:/usr/java/packages/lib/amd64:/lib:/usr/lib:/usr/local/lib
[junit4:junit4]   2> 399 T30 oaz.Environment.logEnv Client environment:java.io.tmpdir=.
[junit4:junit4]   2> 399 T30 oaz.Environment.logEnv Client environment:java.compiler=<NA>
[junit4:junit4]   2> 400 T30 oaz.Environment.logEnv Client environment:os.name=FreeBSD
[junit4:junit4]   2> 401 T30 oaz.Environment.logEnv Client environment:os.arch=amd64
[junit4:junit4]   2> 401 T30 oaz.Environment.logEnv Client environment:os.version=9.0-RELEASE
[junit4:junit4]   2> 402 T30 oaz.Environment.logEnv Client environment:user.name=hudson
[junit4:junit4]   2> 402 T30 oaz.Environment.logEnv Client environment:user.home=/home/hudson
[junit4:junit4]   2> 403 T30 oaz.Environment.logEnv Client environment:user.dir=/usr/home/hudson/hudson-slave/workspace/Lucene-Solr-Tests-4.x-Java6/solr/build/solr-core/test/J0
[junit4:junit4]   2> 408 T30 oaz.ZooKeeper.<init> Initiating client connection, connectString=127.0.0.1:46809 sessionTimeout=10000 watcher=org.apache.solr.common.cloud.ConnectionManager@65e73498
[junit4:junit4]   2> 540 T30 oascc.ConnectionManager.waitForConnected Waiting for client to connect to ZooKeeper
[junit4:junit4]   2> 553 T36 oaz.ClientCnxn$SendThread.logStartConnect Opening socket connection to server localhost/127.0.0.1:46809. Will not attempt to authenticate using SASL (access denied (javax.security.auth.AuthPermission getLoginConfiguration))
[junit4:junit4]   2> 557 T36 oaz.ClientCnxn$SendThread.primeConnection Socket connection established to localhost/127.0.0.1:46809, initiating session
[junit4:junit4]   2> 558 T32 oazs.NIOServerCnxnFactory.run Accepted socket connection from /140.211.11.196:50379
[junit4:junit4]   2> 595 T32 oazs.ZooKeeperServer.processConnectRequest Client attempting to establish new session at /140.211.11.196:50379
[junit4:junit4]   2> 612 T34 oazsp.FileTxnLog.append Creating new log file: log.1
[junit4:junit4]   2> 657 T34 oazs.ZooKeeperServer.finishSessionInit Established session 0x13c947865990000 with negotiated timeout 10000 for client /140.211.11.196:50379
[junit4:junit4]   2> 657 T36 oaz.ClientCnxn$SendThread.onConnected Session establishment complete on server localhost/127.0.0.1:46809, sessionid = 0x13c947865990000, negotiated timeout = 10000
[junit4:junit4]   2> 666 T37 oascc.ConnectionManager.process Watcher org.apache.solr.common.cloud.ConnectionManager@65e73498 name:ZooKeeperConnection Watcher:127.0.0.1:46809 got event WatchedEvent state:SyncConnected type:None path:null path:null type:None
[junit4:junit4]   2> 666 T30 oascc.ConnectionManager.waitForConnected Client is connected to ZooKeeper
[junit4:junit4]   2> 671 T30 oascc.SolrZkClient.makePath makePath: /solr
[junit4:junit4]   2> 763 T35 oazs.PrepRequestProcessor.pRequest2Txn Processed session termination for sessionid: 0x13c947865990000
[junit4:junit4]   2> 764 T37 oaz.ClientCnxn$EventThread.run EventThread shut down
[junit4:junit4]   2> 764 T30 oaz.ZooKeeper.close Session: 0x13c947865990000 closed
[junit4:junit4]   2> 766 T32 oazs.NIOServerCnxn.closeSock Closed socket connection for client /140.211.11.196:50379 which had sessionid 0x13c947865990000
[junit4:junit4]   2> 766 T30 oaz.ZooKeeper.<init> Initiating client connection, connectString=127.0.0.1:46809/solr sessionTimeout=10000 watcher=org.apache.solr.common.cloud.ConnectionManager@f7e5307
[junit4:junit4]   2> 767 T30 oascc.ConnectionManager.waitForConnected Waiting for client to connect to ZooKeeper
[junit4:junit4]   2> 768 T38 oaz.ClientCnxn$SendThread.logStartConnect Opening socket connection to server localhost/127.0.0.1:46809. Will not attempt to authenticate using SASL (access denied (javax.security.auth.AuthPermission getLoginConfiguration))
[junit4:junit4]   2> 769 T38 oaz.ClientCnxn$SendThread.primeConnection Socket connection established to localhost/127.0.0.1:46809, initiating session
[junit4:junit4]   2> 769 T32 oazs.NIOServerCnxnFactory.run Accepted socket connection from /140.211.11.196:39670
[junit4:junit4]   2> 770 T32 oazs.ZooKeeperServer.processConnectRequest Client attempting to establish new session at /140.211.11.196:39670
[junit4:junit4]   2> 771 T34 oazs.ZooKeeperServer.finishSessionInit Established session 0x13c947865990001 with negotiated timeout 10000 for client /140.211.11.196:39670
[junit4:junit4]   2> 772 T38 oaz.ClientCnxn$SendThread.onConnected Session establishment complete on server localhost/127.0.0.1:46809, sessionid = 0x13c947865990001, negotiated timeout = 10000
[junit4:junit4]   2> 772 T39 oascc.ConnectionManager.process Watcher org.apache.solr.common.cloud.ConnectionManager@f7e5307 name:ZooKeeperConnection Watcher:127.0.0.1:46809/solr got event WatchedEvent state:SyncConnected type:None path:null path:null type:None
[junit4:junit4]   2> 773 T30 oascc.ConnectionManager.waitForConnected Client is connected to ZooKeeper
[junit4:junit4]   2> 792 T30 oascc.SolrZkClient.makePath makePath: /collections/collection1
[junit4:junit4]   2> 799 T30 oascc.SolrZkClient.makePath makePath: /collections/collection1/shards
[junit4:junit4]   2> 805 T30 oascc.SolrZkClient.makePath makePath: /collections/control_collection
[junit4:junit4]   2> 810 T30 oascc.SolrZkClient.makePath makePath: /collections/control_collection/shards
[junit4:junit4]   2> 816 T30 oasc.AbstractZkTestCase.putConfig put /usr/home/hudson/hudson-slave/workspace/Lucene-Solr-Tests-4.x-Java6/solr/build/solr-core/test-files/solr/collection1/conf/solrconfig.xml to /configs/conf1/solrconfig.xml
[junit4:junit4]   2> 818 T30 oascc.SolrZkClient.makePath makePath: /configs/conf1/solrconfig.xml
[junit4:junit4]   2> 833 T30 oasc.AbstractZkTestCase.putConfig put /usr/home/hudson/hudson-slave/workspace/Lucene-Solr-Tests-4.x-Java6/solr/build/solr-core/test-files/solr/collection1/conf/schema.xml to /configs/conf1/schema.xml
[junit4:junit4]   2> 834 T30 oascc.SolrZkClient.makePath makePath: /configs/conf1/schema.xml
[junit4:junit4]   2> 942 T30 oasc.AbstractZkTestCase.putConfig put /usr/home/hudson/hudson-slave/workspace/Lucene-Solr-Tests-4.x-Java6/solr/build/solr-core/test-files/solr/collection1/conf/stopwords.txt to /configs/conf1/stopwords.txt
[junit4:junit4]   2> 943 T30 oascc.SolrZkClient.makePath makePath: /configs/conf1/stopwords.txt
[junit4:junit4]   2> 975 T30 oasc.AbstractZkTestCase.putConfig put /usr/home/hudson/hudson-slave/workspace/Lucene-Solr-Tests-4.x-Java6/solr/build/solr-core/test-files/solr/collection1/conf/protwords.txt to /configs/conf1/protwords.txt
[junit4:junit4]   2> 976 T30 oascc.SolrZkClient.makePath makePath: /configs/conf1/protwords.txt
[junit4:junit4]   2> 982 T30 oasc.AbstractZkTestCase.putConfig put /usr/home/hudson/hudson-slave/workspace/Lucene-Solr-Tests-4.x-Java6/solr/build/solr-core/test-files/solr/collection1/conf/currency.xml to /configs/conf1/currency.xml
[junit4:junit4]   2> 983 T30 oascc.SolrZkClient.makePath makePath: /configs/conf1/currency.xml
[junit4:junit4]   2> 989 T30 oasc.AbstractZkTestCase.putConfig put /usr/home/hudson/hudson-slave/workspace/Lucene-Solr-Tests-4.x-Java6/solr/build/solr-core/test-files/solr/collection1/conf/open-exchange-rates.json to /configs/conf1/open-exchange-rates.json
[junit4:junit4]   2> 990 T30 oascc.SolrZkClient.makePath makePath: /configs/conf1/open-exchange-rates.json
[junit4:junit4]   2> 997 T30 oasc.AbstractZkTestCase.putConfig put /usr/home/hudson/hudson-slave/workspace/Lucene-Solr-Tests-4.x-Java6/solr/build/solr-core/test-files/solr/collection1/conf/mapping-ISOLatin1Accent.txt to /configs/conf1/mapping-ISOLatin1Accent.txt
[junit4:junit4]   2> 998 T30 oascc.SolrZkClient.makePath makePath: /configs/conf1/mapping-ISOLatin1Accent.txt
[junit4:junit4]   2> 1004 T30 oasc.AbstractZkTestCase.putConfig put /usr/home/hudson/hudson-slave/workspace/Lucene-Solr-Tests-4.x-Java6/solr/build/solr-core/test-files/solr/collection1/conf/old_synonyms.txt to /configs/conf1/old_synonyms.txt
[junit4:junit4]   2> 1005 T30 oascc.SolrZkClient.makePath makePath: /configs/conf1/old_synonyms.txt
[junit4:junit4]   2> 1011 T30 oasc.AbstractZkTestCase.putConfig put /usr/home/hudson/hudson-slave/workspace/Lucene-Solr-Tests-4.x-Java6/solr/build/solr-core/test-files/solr/collection1/conf/synonyms.txt to /configs/conf1/synonyms.txt
[junit4:junit4]   2> 1012 T30 oascc.SolrZkClient.makePath makePath: /configs/conf1/synonyms.txt
[junit4:junit4]   2> 1018 T35 oazs.PrepRequestProcessor.pRequest2Txn Processed session termination for sessionid: 0x13c947865990001
[junit4:junit4]   2> 1020 T39 oaz.ClientCnxn$EventThread.run EventThread shut down
[junit4:junit4]   2> 1020 T32 oazs.NIOServerCnxn.closeSock Closed socket connection for client /140.211.11.196:39670 which had sessionid 0x13c947865990001
[junit4:junit4]   2> 1020 T30 oaz.ZooKeeper.close Session: 0x13c947865990001 closed
[junit4:junit4]   2> 1807 T30 oejs.Server.doStart jetty-8.1.8.v20121106
[junit4:junit4]   2> 2120 T30 oejs.AbstractConnector.doStart Started SocketConnector@127.0.0.1:40584
[junit4:junit4]   2> 2154 T30 oass.SolrDispatchFilter.init SolrDispatchFilter.init()
[junit4:junit4]   2> 2155 T30 oasc.SolrResourceLoader.locateSolrHome JNDI not configured for solr (NoInitialContextEx)
[junit4:junit4]   2> 2156 T30 oasc.SolrResourceLoader.locateSolrHome using system property solr.solr.home: /usr/home/hudson/hudson-slave/workspace/Lucene-Solr-Tests-4.x-Java6/solr/build/solr-core/test/J0/./org.apache.solr.cloud.SyncSliceTest-controljetty-1359700584542
[junit4:junit4]   2> 2156 T30 oasc.CoreContainer$Initializer.initialize looking for solr.xml: /usr/home/hudson/hudson-slave/workspace/Lucene-Solr-Tests-4.x-Java6/solr/build/solr-core/test/J0/./org.apache.solr.cloud.SyncSliceTest-controljetty-1359700584542/solr.xml
[junit4:junit4]   2> 2157 T30 oasc.CoreContainer.<init> New CoreContainer 1346092285
[junit4:junit4]   2> 2158 T30 oasc.CoreContainer.load Loading CoreContainer using Solr Home: '/usr/home/hudson/hudson-slave/workspace/Lucene-Solr-Tests-4.x-Java6/solr/build/solr-core/test/J0/./org.apache.solr.cloud.SyncSliceTest-controljetty-1359700584542/'
[junit4:junit4]   2> 2158 T30 oasc.SolrResourceLoader.<init> new SolrResourceLoader for directory: '/usr/home/hudson/hudson-slave/workspace/Lucene-Solr-Tests-4.x-Java6/solr/build/solr-core/test/J0/./org.apache.solr.cloud.SyncSliceTest-controljetty-1359700584542/'
[junit4:junit4]   2> 2200 T30 oashc.HttpShardHandlerFactory.getParameter Setting socketTimeout to: 60000
[junit4:junit4]   2> 2201 T30 oashc.HttpShardHandlerFactory.getParameter Setting urlScheme to: http://
[junit4:junit4]   2> 2201 T30 oashc.HttpShardHandlerFactory.getParameter Setting connTimeout to: 15000
[junit4:junit4]   2> 2202 T30 oashc.HttpShardHandlerFactory.getParameter Setting maxConnectionsPerHost to: 20
[junit4:junit4]   2> 2202 T30 oashc.HttpShardHandlerFactory.getParameter Setting corePoolSize to: 0
[junit4:junit4]   2> 2203 T30 oashc.HttpShardHandlerFactory.getParameter Setting maximumPoolSize to: 2147483647
[junit4:junit4]   2> 2203 T30 oashc.HttpShardHandlerFactory.getParameter Setting maxThreadIdleTime to: 5
[junit4:junit4]   2> 2204 T30 oashc.HttpShardHandlerFactory.getParameter Setting sizeOfQueue to: -1
[junit4:junit4]   2> 2204 T30 oashc.HttpShardHandlerFactory.getParameter Setting fairnessPolicy to: false
[junit4:junit4]   2> 2234 T30 oascsi.HttpClientUtil.createClient Creating new http client, config:maxConnectionsPerHost=20&maxConnections=10000&socketTimeout=60000&connTimeout=15000&retry=false
[junit4:junit4]   2> 2594 T30 oasc.CoreContainer.load Registering Log Listener
[junit4:junit4]   2> 2610 T30 oasc.CoreContainer.initZooKeeper Zookeeper client=127.0.0.1:46809/solr
[junit4:junit4]   2> 2628 T30 oasc.ZkController.checkChrootPath zkHost includes chroot
[junit4:junit4]   2> 2629 T30 oaz.ZooKeeper.<init> Initiating client connection, connectString=127.0.0.1:46809 sessionTimeout=60000 watcher=org.apache.solr.common.cloud.ConnectionManager@5ffdfb42
[junit4:junit4]   2> 2630 T30 oascc.ConnectionManager.waitForConnected Waiting for client to connect to ZooKeeper
[junit4:junit4]   2> 2632 T50 oaz.ClientCnxn$SendThread.logStartConnect Opening socket connection to server localhost/127.0.0.1:46809. Will not attempt to authenticate using SASL (access denied (javax.security.auth.AuthPermission getLoginConfiguration))
[junit4:junit4]   2> 2633 T50 oaz.ClientCnxn$SendThread.primeConnection Socket connection established to localhost/127.0.0.1:46809, initiating session
[junit4:junit4]   2> 2633 T32 oazs.NIOServerCnxnFactory.run Accepted socket connection from /140.211.11.196:57078
[junit4:junit4]   2> 2634 T32 oazs.ZooKeeperServer.processConnectRequest Client attempting to establish new session at /140.211.11.196:57078
[junit4:junit4]   2> 2635 T34 oazs.ZooKeeperServer.finishSessionInit Established session 0x13c947865990002 with negotiated timeout 20000 for client /140.211.11.196:57078
[junit4:junit4]   2> 2636 T50 oaz.ClientCnxn$SendThread.onConnected Session establishment complete on server localhost/127.0.0.1:46809, sessionid = 0x13c947865990002, negotiated timeout = 20000
[junit4:junit4]   2> 2637 T51 oascc.ConnectionManager.process Watcher org.apache.solr.common.cloud.ConnectionManager@5ffdfb42 name:ZooKeeperConnection Watcher:127.0.0.1:46809 got event WatchedEvent state:SyncConnected type:None path:null path:null type:None
[junit4:junit4]   2> 2637 T30 oascc.ConnectionManager.waitForConnected Client is connected to ZooKeeper
[junit4:junit4]   2> 2639 T35 oazs.PrepRequestProcessor.pRequest2Txn Processed session termination for sessionid: 0x13c947865990002
[junit4:junit4]   2> 2641 T32 oazs.NIOServerCnxn.closeSock Closed socket connection for client /140.211.11.196:57078 which had sessionid 0x13c947865990002
[junit4:junit4]   2> 2641 T30 oaz.ZooKeeper.close Session: 0x13c947865990002 closed
[junit4:junit4]   2> 2641 T51 oaz.ClientCnxn$EventThread.run EventThread shut down
[junit4:junit4]   2> 2644 T30 oascsi.HttpClientUtil.createClient Creating new http client, config:maxConnections=500&maxConnectionsPerHost=16&socketTimeout=60000&connTimeout=15000
[junit4:junit4]   2> 2657 T30 oaz.ZooKeeper.<init> Initiating client connection, connectString=127.0.0.1:46809/solr sessionTimeout=30000 watcher=org.apache.solr.common.cloud.ConnectionManager@6102d81c
[junit4:junit4]   2> 2658 T30 oascc.ConnectionManager.waitForConnected Waiting for client to connect to ZooKeeper
[junit4:junit4]   2> 2658 T52 oaz.ClientCnxn$SendThread.logStartConnect Opening socket connection to server localhost/127.0.0.1:46809. Will not attempt to authenticate using SASL (access denied (javax.security.auth.AuthPermission getLoginConfiguration))
[junit4:junit4]   2> 2659 T52 oaz.ClientCnxn$SendThread.primeConnection Socket connection established to localhost/127.0.0.1:46809, initiating session
[junit4:junit4]   2> 2659 T32 oazs.NIOServerCnxnFactory.run Accepted socket connection from /140.211.11.196:14096
[junit4:junit4]   2> 2660 T32 oazs.ZooKeeperServer.processConnectRequest Client attempting to establish new session at /140.211.11.196:14096
[junit4:junit4]   2> 2661 T34 oazs.ZooKeeperServer.finishSessionInit Established session 0x13c947865990003 with negotiated timeout 20000 for client /140.211.11.196:14096
[junit4:junit4]   2> 2662 T52 oaz.ClientCnxn$SendThread.onConnected Session establishment complete on server localhost/127.0.0.1:46809, sessionid = 0x13c947865990003, negotiated timeout = 20000
[junit4:junit4]   2> 2662 T53 oascc.ConnectionManager.process Watcher org.apache.solr.common.cloud.ConnectionManager@6102d81c name:ZooKeeperConnection Watcher:127.0.0.1:46809/solr got event WatchedEvent state:SyncConnected type:None path:null path:null type:None
[junit4:junit4]   2> 2663 T30 oascc.ConnectionManager.waitForConnected Client is connected to ZooKeeper
[junit4:junit4]   2> 2680 T35 oazs.PrepRequestProcessor.pRequest Got user-level KeeperException when processing sessionid:0x13c947865990003 type:create cxid:0x2 zxid:0x1a txntype:-1 reqpath:n/a Error Path:/solr/overseer Error:KeeperErrorCode = NodeExists for /solr/overseer
[junit4:junit4]   2> 2689 T30 oascc.SolrZkClient.makePath makePath: /live_nodes
[junit4:junit4]   2> 2692 T30 oasc.ZkController.createEphemeralLiveNode Register node as live in ZooKeeper:/live_nodes/127.0.0.1:40584_ts%2Fnc
[junit4:junit4]   2> 2697 T35 oazs.PrepRequestProcessor.pRequest Got user-level KeeperException when processing sessionid:0x13c947865990003 type:delete cxid:0x7 zxid:0x1c txntype:-1 reqpath:n/a Error Path:/solr/live_nodes/127.0.0.1:40584_ts%2Fnc Error:KeeperErrorCode = NoNode for /solr/live_nodes/127.0.0.1:40584_ts%2Fnc
[junit4:junit4]   2> 2698 T30 oascc.SolrZkClient.makePath makePath: /live_nodes/127.0.0.1:40584_ts%2Fnc
[junit4:junit4]   2> 2704 T30 oascc.SolrZkClient.makePath makePath: /overseer_elect/election
[junit4:junit4]   2> 2733 T35 oazs.PrepRequestProcessor.pRequest Got user-level KeeperException when processing sessionid:0x13c947865990003 type:delete cxid:0x15 zxid:0x21 txntype:-1 reqpath:n/a Error Path:/solr/overseer_elect/leader Error:KeeperErrorCode = NoNode for /solr/overseer_elect/leader
[junit4:junit4]   2> 2735 T30 oascc.SolrZkClient.makePath makePath: /overseer_elect/leader
[junit4:junit4]   2> 2740 T30 oasc.Overseer.start Overseer (id=89109337462079491-127.0.0.1:40584_ts%2Fnc-n_0000000000) starting
[junit4:junit4]   2> 2741 T35 oazs.PrepRequestProcessor.pRequest Got user-level KeeperException when processing sessionid:0x13c947865990003 type:create cxid:0x1a zxid:0x23 txntype:-1 reqpath:n/a Error Path:/solr/overseer Error:KeeperErrorCode = NodeExists for /solr/overseer
[junit4:junit4]   2> 2757 T35 oazs.PrepRequestProcessor.pRequest Got user-level KeeperException when processing sessionid:0x13c947865990003 type:create cxid:0x1b zxid:0x24 txntype:-1 reqpath:n/a Error Path:/solr/overseer Error:KeeperErrorCode = NodeExists for /solr/overseer
[junit4:junit4]   2> 2759 T35 oazs.PrepRequestProcessor.pRequest Got user-level KeeperException when processing sessionid:0x13c947865990003 type:create cxid:0x1c zxid:0x25 txntype:-1 reqpath:n/a Error Path:/solr/overseer Error:KeeperErrorCode = NodeExists for /solr/overseer
[junit4:junit4]   2> 2767 T35 oazs.PrepRequestProcessor.pRequest Got user-level KeeperException when processing sessionid:0x13c947865990003 type:create cxid:0x1d zxid:0x26 txntype:-1 reqpath:n/a Error Path:/solr/overseer Error:KeeperErrorCode = NodeExists for /solr/overseer
[junit4:junit4]   2> 2768 T55 oasc.OverseerCollectionProcessor.run Process current queue of collection creations
[junit4:junit4]   2> 2775 T30 oascc.SolrZkClient.makePath makePath: /clusterstate.json
[junit4:junit4]   2> 2781 T30 oascc.ZkStateReader.createClusterStateWatchersAndUpdate Updating cluster state from ZooKeeper... 
[junit4:junit4]   2> 2798 T54 oasc.Overseer$ClusterStateUpdater.run Starting to work on the main queue
[junit4:junit4]   2> 2835 T56 oasc.CoreContainer.create Creating SolrCore 'collection1' using instanceDir: /usr/home/hudson/hudson-slave/workspace/Lucene-Solr-Tests-4.x-Java6/solr/build/solr-core/test/J0/./org.apache.solr.cloud.SyncSliceTest-controljetty-1359700584542/collection1
[junit4:junit4]   2> 2836 T56 oasc.ZkController.createCollectionZkNode Check for collection zkNode:control_collection
[junit4:junit4]   2> 2837 T56 oasc.ZkController.createCollectionZkNode Collection zkNode exists
[junit4:junit4]   2> 2838 T56 oasc.ZkController.readConfigName Load collection config from:/collections/control_collection
[junit4:junit4]   2> 2841 T56 oasc.SolrResourceLoader.<init> new SolrResourceLoader for directory: '/usr/home/hudson/hudson-slave/workspace/Lucene-Solr-Tests-4.x-Java6/solr/build/solr-core/test/J0/./org.apache.solr.cloud.SyncSliceTest-controljetty-1359700584542/collection1/'
[junit4:junit4]   2> 2842 T56 oasc.SolrResourceLoader.replaceClassLoader Adding 'file:/usr/home/hudson/hudson-slave/workspace/Lucene-Solr-Tests-4.x-Java6/solr/build/solr-core/test/J0/org.apache.solr.cloud.SyncSliceTest-controljetty-1359700584542/collection1/lib/README' to classloader
[junit4:junit4]   2> 2843 T56 oasc.SolrResourceLoader.replaceClassLoader Adding 'file:/usr/home/hudson/hudson-slave/workspace/Lucene-Solr-Tests-4.x-Java6/solr/build/solr-core/test/J0/org.apache.solr.cloud.SyncSliceTest-controljetty-1359700584542/collection1/lib/classes/' to classloader
[junit4:junit4]   2> 2959 T56 oasc.SolrConfig.<init> Using Lucene MatchVersion: LUCENE_42
[junit4:junit4]   2> 3060 T56 oasc.SolrConfig.<init> Loaded SolrConfig: solrconfig.xml
[junit4:junit4]   2> 3161 T56 oass.IndexSchema.readSchema Reading Solr Schema
[junit4:junit4]   2> 3200 T56 oass.IndexSchema.readSchema Schema name=test
[junit4:junit4]   2> 3901 T56 oass.OpenExchangeRatesOrgProvider.init Initialized with rates=open-exchange-rates.json, refreshInterval=1440.
[junit4:junit4]   2> 3918 T56 oass.IndexSchema.readSchema default search field in schema is text
[junit4:junit4]   2> 3922 T56 oass.IndexSchema.readSchema unique key field: id
[junit4:junit4]   2> 3958 T56 oass.FileExchangeRateProvider.reload Reloading exchange rates from file currency.xml
[junit4:junit4]   2> 3965 T56 oass.FileExchangeRateProvider.reload Reloading exchange rates from file currency.xml
[junit4:junit4]   2> 3971 T56 oass.OpenExchangeRatesOrgProvider.reload Reloading exchange rates from open-exchange-rates.json
[junit4:junit4]   2> 3975 T56 oass.OpenExchangeRatesOrgProvider.reload Reloading exchange rates from open-exchange-rates.json
[junit4:junit4]   2> 3980 T56 oasc.SolrCore.<init> [collection1] Opening new SolrCore at /usr/home/hudson/hudson-slave/workspace/Lucene-Solr-Tests-4.x-Java6/solr/build/solr-core/test/J0/./org.apache.solr.cloud.SyncSliceTest-controljetty-1359700584542/collection1/, dataDir=./org.apache.solr.cloud.SyncSliceTest-1359700583526/control/data/
[junit4:junit4]   2> 3985 T56 oasc.JmxMonitoredMap.<init> JMX monitoring is enabled. Adding Solr mbeans to JMX Server: com.sun.jmx.mbeanserver.JmxMBeanServer@2658dd2d
[junit4:junit4]   2> 3987 T56 oasc.SolrCore.initDirectoryFactory solr.NRTCachingDirectoryFactory
[junit4:junit4]   2> 4023 T56 oasc.CachingDirectoryFactory.get return new directory for /usr/home/hudson/hudson-slave/workspace/Lucene-Solr-Tests-4.x-Java6/solr/build/solr-core/test/J0/./org.apache.solr.cloud.SyncSliceTest-1359700583526/control/data forceNew:false
[junit4:junit4]   2> 4024 T56 oasc.CachingDirectoryFactory.close Releasing directory:/usr/home/hudson/hudson-slave/workspace/Lucene-Solr-Tests-4.x-Java6/solr/build/solr-core/test/J0/./org.apache.solr.cloud.SyncSliceTest-1359700583526/control/data
[junit4:junit4]   2> 4024 T56 oasc.SolrCore.getNewIndexDir New index directory detected: old=null new=./org.apache.solr.cloud.SyncSliceTest-1359700583526/control/data/index/
[junit4:junit4]   2> 4025 T56 oasc.SolrCore.initIndex WARNING [collection1] Solr index directory './org.apache.solr.cloud.SyncSliceTest-1359700583526/control/data/index' doesn't exist. Creating new index...
[junit4:junit4]   2> 4026 T56 oasc.CachingDirectoryFactory.get return new directory for /usr/home/hudson/hudson-slave/workspace/Lucene-Solr-Tests-4.x-Java6/solr/build/solr-core/test/J0/./org.apache.solr.cloud.SyncSliceTest-1359700583526/control/data/index forceNew:false
[junit4:junit4]   2> 4061 T56 oasc.SolrDeletionPolicy.onCommit SolrDeletionPolicy.onCommit: commits:num=1
[junit4:junit4]   2> 		commit{dir=RateLimitedDirectoryWrapper(NRTCachingDirectory(org.apache.lucene.store.NIOFSDirectory@/usr/home/hudson/hudson-slave/workspace/Lucene-Solr-Tests-4.x-Java6/solr/build/solr-core/test/J0/org.apache.solr.cloud.SyncSliceTest-1359700583526/control/data/index lockFactory=org.apache.lucene.store.NativeFSLockFactory@46205df9; maxCacheMB=48.0 maxMergeSizeMB=4.0)),segFN=segments_1,generation=1,filenames=[segments_1]
[junit4:junit4]   2> 4062 T56 oasc.SolrDeletionPolicy.updateCommits newest commit = 1[segments_1]
[junit4:junit4]   2> 4063 T56 oasc.CachingDirectoryFactory.close Releasing directory:/usr/home/hudson/hudson-slave/workspace/Lucene-Solr-Tests-4.x-Java6/solr/build/solr-core/test/J0/./org.apache.solr.cloud.SyncSliceTest-1359700583526/control/data/index
[junit4:junit4]   2> 4063 T56 oasc.SolrCore.initWriters created xml: solr.XMLResponseWriter
[junit4:junit4]   2> 4066 T56 oasup.UpdateRequestProcessorChain.init inserting DistributedUpdateProcessorFactory into updateRequestProcessorChain "dedupe"
[junit4:junit4]   2> 4067 T56 oasup.UpdateRequestProcessorChain.init inserting DistributedUpdateProcessorFactory into updateRequestProcessorChain "dedupe-allfields"
[junit4:junit4]   2> 4067 T56 oasup.UpdateRequestProcessorChain.init inserting DistributedUpdateProcessorFactory into updateRequestProcessorChain "stored_sig"
[junit4:junit4]   2> 4068 T56 oasup.UpdateRequestProcessorChain.init inserting DistributedUpdateProcessorFactory into updateRequestProcessorChain "uniq-fields"
[junit4:junit4]   2> 4069 T56 oasup.UpdateRequestProcessorChain.init inserting DistributedUpdateProcessorFactory into updateRequestProcessorChain "distrib-dup-test-chain-implicit"
[junit4:junit4]   2> 4069 T56 oasc.RequestHandlers.initHandlersFromConfig adding lazy requestHandler: solr.ReplicationHandler
[junit4:junit4]   2> 4070 T56 oasc.RequestHandlers.initHandlersFromConfig created /replication: solr.ReplicationHandler
[junit4:junit4]   2> 4071 T56 oasc.RequestHandlers.initHandlersFromConfig created standard: solr.StandardRequestHandler
[junit4:junit4]   2> 4072 T56 oasc.RequestHandlers.initHandlersFromConfig created /get: solr.RealTimeGetHandler
[junit4:junit4]   2> 4073 T56 oasc.RequestHandlers.initHandlersFromConfig created dismax: solr.SearchHandler
[junit4:junit4]   2> 4074 T56 oasc.RequestHandlers.initHandlersFromConfig created mock: org.apache.solr.core.MockQuerySenderListenerReqHandler
[junit4:junit4]   2> 4075 T56 oasc.RequestHandlers.initHandlersFromConfig created /admin/: org.apache.solr.handler.admin.AdminHandlers
[junit4:junit4]   2> 4076 T56 oasc.RequestHandlers.initHandlersFromConfig created defaults: solr.StandardRequestHandler
[junit4:junit4]   2> 4076 T56 oasc.RequestHandlers.initHandlersFromConfig adding lazy requestHandler: solr.StandardRequestHandler
[junit4:junit4]   2> 4077 T56 oasc.RequestHandlers.initHandlersFromConfig created lazy: solr.StandardRequestHandler
[junit4:junit4]   2> 4078 T56 oasc.RequestHandlers.initHandlersFromConfig created /update: solr.UpdateRequestHandler
[junit4:junit4]   2> 4079 T56 oasc.RequestHandlers.initHandlersFromConfig created /terms: org.apache.solr.handler.component.SearchHandler
[junit4:junit4]   2> 4080 T56 oasc.RequestHandlers.initHandlersFromConfig created spellCheckCompRH: org.apache.solr.handler.component.SearchHandler
[junit4:junit4]   2> 4081 T56 oasc.RequestHandlers.initHandlersFromConfig created spellCheckCompRH_Direct: org.apache.solr.handler.component.SearchHandler
[junit4:junit4]   2> 4082 T56 oasc.RequestHandlers.initHandlersFromConfig created spellCheckWithWordbreak: org.apache.solr.handler.component.SearchHandler
[junit4:junit4]   2> 4083 T56 oasc.RequestHandlers.initHandlersFromConfig created spellCheckWithWordbreak_Direct: org.apache.solr.handler.component.SearchHandler
[junit4:junit4]   2> 4084 T56 oasc.RequestHandlers.initHandlersFromConfig created spellCheckCompRH1: org.apache.solr.handler.component.SearchHandler
[junit4:junit4]   2> 4085 T56 oasc.RequestHandlers.initHandlersFromConfig created mltrh: org.apache.solr.handler.component.SearchHandler
[junit4:junit4]   2> 4086 T56 oasc.RequestHandlers.initHandlersFromConfig created tvrh: org.apache.solr.handler.component.SearchHandler
[junit4:junit4]   2> 4088 T56 oasc.RequestHandlers.initHandlersFromConfig created /mlt: solr.MoreLikeThisHandler
[junit4:junit4]   2> 4089 T56 oasc.RequestHandlers.initHandlersFromConfig created /debug/dump: solr.DumpRequestHandler
[junit4:junit4]   2> 4096 T56 oashl.XMLLoader.init xsltCacheLifetimeSeconds=60
[junit4:junit4]   2> 4101 T56 oasc.SolrCore.initDeprecatedSupport WARNING solrconfig.xml uses deprecated <admin/gettableFiles>, Please update your config to use the ShowFileRequestHandler.
[junit4:junit4]   2> 4103 T56 oasc.SolrCore.initDeprecatedSupport WARNING adding ShowFileRequestHandler with hidden files: [SCHEMA.XML, OLD_SYNONYMS.TXT, STOPWORDS.TXT, PROTWORDS.TXT, OPEN-EXCHANGE-RATES.JSON, SYNONYMS.TXT, CURRENCY.XML, MAPPING-ISOLATIN1ACCENT.TXT]
[junit4:junit4]   2> 4107 T56 oasc.CachingDirectoryFactory.close Releasing directory:/usr/home/hudson/hudson-slave/workspace/Lucene-Solr-Tests-4.x-Java6/solr/build/solr-core/test/J0/./org.apache.solr.cloud.SyncSliceTest-1359700583526/control/data
[junit4:junit4]   2> 4109 T56 oass.SolrIndexSearcher.<init> Opening Searcher@16a6a7d2 main
[junit4:junit4]   2> 4134 T56 oasu.CommitTracker.<init> Hard AutoCommit: disabled
[junit4:junit4]   2> 4135 T56 oasu.CommitTracker.<init> Soft AutoCommit: disabled
[junit4:junit4]   2> 4136 T56 oashc.SpellCheckComponent.inform Initializing spell checkers
[junit4:junit4]   2> 4144 T56 oass.DirectSolrSpellChecker.init init: {name=direct,classname=DirectSolrSpellChecker,field=lowerfilt,minQueryLength=3}
[junit4:junit4]   2> 4210 T57 oasc.SolrCore.registerSearcher [collection1] Registered new searcher Searcher@16a6a7d2 main{StandardDirectoryReader(segments_1:1)}
[junit4:junit4]   2> 4225 T56 oasc.ZkController.publish publishing core=collection1 state=down
[junit4:junit4]   2> 4226 T56 oasc.ZkController.publish numShards not found on descriptor - reading it from system property
[junit4:junit4]   2> 4227 T35 oazs.PrepRequestProcessor.pRequest Got user-level KeeperException when processing sessionid:0x13c947865990003 type:create cxid:0x50 zxid:0x29 txntype:-1 reqpath:n/a Error Path:/solr/overseer/queue Error:KeeperErrorCode = NoNode for /solr/overseer/queue
[junit4:junit4]   2> 4309 T54 oascc.ZkStateReader.updateClusterState Updating cloud state from ZooKeeper... 
[junit4:junit4]   2> 4310 T54 oasc.Overseer$ClusterStateUpdater.updateState Update state numShards=1 message={
[junit4:junit4]   2> 	  "operation":"state",
[junit4:junit4]   2> 	  "numShards":"1",
[junit4:junit4]   2> 	  "shard":null,
[junit4:junit4]   2> 	  "roles":null,
[junit4:junit4]   2> 	  "state":"down",
[junit4:junit4]   2> 	  "core":"collection1",
[junit4:junit4]   2> 	  "collection":"control_collection",
[junit4:junit4]   2> 	  "node_name":"127.0.0.1:40584_ts%2Fnc",
[junit4:junit4]   2> 	  "base_url":"http://127.0.0.1:40584/ts/nc"}
[junit4:junit4]   2> 4311 T54 oasc.Overseer$ClusterStateUpdater.createCollection Create collection control_collection with numShards 1
[junit4:junit4]   2> 4345 T54 oasc.Overseer$ClusterStateUpdater.updateState Assigning new node to shard shard=shard1
[junit4:junit4]   2> 4346 T35 oazs.PrepRequestProcessor.pRequest Got user-level KeeperException when processing sessionid:0x13c947865990003 type:create cxid:0x58 zxid:0x2c txntype:-1 reqpath:n/a Error Path:/solr/overseer/queue-work Error:KeeperErrorCode = NoNode for /solr/overseer/queue-work
[junit4:junit4]   2> 4381 T53 oascc.ZkStateReader$2.process A cluster state change: WatchedEvent state:SyncConnected type:NodeDataChanged path:/clusterstate.json, has occurred - updating... (live nodes size: 1)
[junit4:junit4]   2> 5240 T56 oasc.CoreContainer.registerCore registering core: collection1
[junit4:junit4]   2> 5240 T56 oasc.ZkController.register Register replica - core:collection1 address:http://127.0.0.1:40584/ts/nc collection:control_collection shard:shard1
[junit4:junit4]   2> 5258 T56 oascsi.HttpClientUtil.createClient Creating new http client, config:maxConnections=10000&maxConnectionsPerHost=20&connTimeout=30000&socketTimeout=30000&retry=false
[junit4:junit4]   2> 5281 T56 oascc.SolrZkClient.makePath makePath: /collections/control_collection/leader_elect/shard1/election
[junit4:junit4]   2> 5328 T35 oazs.PrepRequestProcessor.pRequest Got user-level KeeperException when processing sessionid:0x13c947865990003 type:delete cxid:0x72 zxid:0x36 txntype:-1 reqpath:n/a Error Path:/solr/collections/control_collection/leaders Error:KeeperErrorCode = NoNode for /solr/collections/control_collection/leaders
[junit4:junit4]   2> 5329 T56 oasc.ShardLeaderElectionContext.runLeaderProcess Running the leader process.
[junit4:junit4]   2> 5330 T35 oazs.PrepRequestProcessor.pRequest Got user-level KeeperException when processing sessionid:0x13c947865990003 type:create cxid:0x73 zxid:0x37 txntype:-1 reqpath:n/a Error Path:/solr/overseer Error:KeeperErrorCode = NodeExists for /solr/overseer
[junit4:junit4]   2> 5340 T56 oasc.ShardLeaderElectionContext.waitForReplicasToComeUp Enough replicas found to continue.
[junit4:junit4]   2> 5340 T56 oasc.ShardLeaderElectionContext.runLeaderProcess I may be the new leader - try and sync
[junit4:junit4]   2> 5346 T56 oasc.SyncStrategy.sync Sync replicas to http://127.0.0.1:40584/ts/nc/collection1/
[junit4:junit4]   2> 5346 T56 oasc.SyncStrategy.syncReplicas Sync Success - now sync replicas to me
[junit4:junit4]   2> 5347 T56 oasc.SyncStrategy.syncToMe http://127.0.0.1:40584/ts/nc/collection1/ has no replicas
[junit4:junit4]   2> 5347 T56 oasc.ShardLeaderElectionContext.runLeaderProcess I am the new leader: http://127.0.0.1:40584/ts/nc/collection1/
[junit4:junit4]   2> 5347 T56 oascc.SolrZkClient.makePath makePath: /collections/control_collection/leaders/shard1
[junit4:junit4]   2> 5356 T35 oazs.PrepRequestProcessor.pRequest Got user-level KeeperException when processing sessionid:0x13c947865990003 type:create cxid:0x7d zxid:0x3b txntype:-1 reqpath:n/a Error Path:/solr/overseer Error:KeeperErrorCode = NodeExists for /solr/overseer
[junit4:junit4]   2> 5889 T54 oascc.ZkStateReader.updateClusterState Updating cloud state from ZooKeeper... 
[junit4:junit4]   2> 5910 T53 oascc.ZkStateReader$2.process A cluster state change: WatchedEvent state:SyncConnected type:NodeDataChanged path:/clusterstate.json, has occurred - updating... (live nodes size: 1)
[junit4:junit4]   2> 5927 T56 oasc.ZkController.register We are http://127.0.0.1:40584/ts/nc/collection1/ and leader is http://127.0.0.1:40584/ts/nc/collection1/
[junit4:junit4]   2> 5932 T56 oasc.ZkController.register No LogReplay needed for core=collection1 baseURL=http://127.0.0.1:40584/ts/nc
[junit4:junit4]   2> 5932 T56 oasc.ZkController.checkRecovery I am the leader, no recovery necessary
[junit4:junit4]   2> 5933 T56 oasc.ZkController.publish publishing core=collection1 state=active
[junit4:junit4]   2> 5933 T56 oasc.ZkController.publish numShards not found on descriptor - reading it from system property
[junit4:junit4]   2> 5935 T56 oascc.ZkStateReader.updateClusterState Updating cloud state from ZooKeeper... 
[junit4:junit4]   2> 5937 T30 oass.SolrDispatchFilter.init user.dir=/usr/home/hudson/hudson-slave/workspace/Lucene-Solr-Tests-4.x-Java6/solr/build/solr-core/test/J0
[junit4:junit4]   2> 5938 T30 oass.SolrDispatchFilter.init SolrDispatchFilter.init() done
[junit4:junit4]   2> 5986 T30 oascsi.HttpClientUtil.createClient Creating new http client, config:maxConnections=128&maxConnectionsPerHost=32&followRedirects=false
[junit4:junit4]   2> 6003 T30 oascsi.HttpClientUtil.createClient Creating new http client, config:
[junit4:junit4]   2> 6015 T30 oaz.ZooKeeper.<init> Initiating client connection, connectString=127.0.0.1:46809/solr sessionTimeout=10000 watcher=org.apache.solr.common.cloud.ConnectionManager@4263f6ea
[junit4:junit4]   2> 6016 T30 oascc.ConnectionManager.waitForConnected Waiting for client to connect to ZooKeeper
[junit4:junit4]   2> 6016 T58 oaz.ClientCnxn$SendThread.logStartConnect Opening socket connection to server localhost/127.0.0.1:46809. Will not attempt to authenticate using SASL (access denied (javax.security.auth.AuthPermission getLoginConfiguration))
[junit4:junit4]   2> 6017 T58 oaz.ClientCnxn$SendThread.primeConnection Socket connection established to localhost/127.0.0.1:46809, initiating session
[junit4:junit4]   2> 6017 T32 oazs.NIOServerCnxnFactory.run Accepted socket connection from /140.211.11.196:39063
[junit4:junit4]   2> 6018 T32 oazs.ZooKeeperServer.processConnectRequest Client attempting to establish new session at /140.211.11.196:39063
[junit4:junit4]   2> 6020 T34 oazs.ZooKeeperServer.finishSessionInit Established session 0x13c947865990004 with negotiated timeout 10000 for client /140.211.11.196:39063
[junit4:junit4]   2> 6020 T58 oaz.ClientCnxn$SendThread.onConnected Session establishment complete on server localhost/127.0.0.1:46809, sessionid = 0x13c947865990004, negotiated timeout = 10000
[junit4:junit4]   2> 6021 T59 oascc.ConnectionManager.process Watcher org.apache.solr.common.cloud.ConnectionManager@4263f6ea name:ZooKeeperConnection Watcher:127.0.0.1:46809/solr got event WatchedEvent state:SyncConnected type:None path:null path:null type:None
[junit4:junit4]   2> 6021 T30 oascc.ConnectionManager.waitForConnected Client is connected to ZooKeeper
[junit4:junit4]   2> 6023 T30 oascc.ZkStateReader.createClusterStateWatchersAndUpdate Updating cluster state from ZooKeeper... 
[junit4:junit4]   2> 6027 T30 oasc.ChaosMonkey.monkeyLog monkey: init - expire sessions:true cause connection loss:true
[junit4:junit4]   2> 6143 T30 oejs.Server.doStart jetty-8.1.8.v20121106
[junit4:junit4]   2> 6145 T30 oejs.AbstractConnector.doStart Started SocketConnector@127.0.0.1:52046
[junit4:junit4]   2> 6146 T30 oass.SolrDispatchFilter.init SolrDispatchFilter.init()
[junit4:junit4]   2> 6146 T30 oasc.SolrResourceLoader.locateSolrHome JNDI not configured for solr (NoInitialContextEx)
[junit4:junit4]   2> 6147 T30 oasc.SolrResourceLoader.locateSolrHome using system property solr.solr.home: /usr/home/hudson/hudson-slave/workspace/Lucene-Solr-Tests-4.x-Java6/solr/build/solr-core/test/J0/./org.apache.solr.cloud.SyncSliceTest-jetty1-1359700589548
[junit4:junit4]   2> 6147 T30 oasc.CoreContainer$Initializer.initialize looking for solr.xml: /usr/home/hudson/hudson-slave/workspace/Lucene-Solr-Tests-4.x-Java6/solr/build/solr-core/test/J0/./org.apache.solr.cloud.SyncSliceTest-jetty1-1359700589548/solr.xml
[junit4:junit4]   2> 6148 T30 oasc.CoreContainer.<init> New CoreContainer 895559168
[junit4:junit4]   2> 6148 T30 oasc.CoreContainer.load Loading CoreContainer using Solr Home: '/usr/home/hudson/hudson-slave/workspace/Lucene-Solr-Tests-4.x-Java6/solr/build/solr-core/test/J0/./org.apache.solr.cloud.SyncSliceTest-jetty1-1359700589548/'
[junit4:junit4]   2> 6149 T30 oasc.SolrResourceLoader.<init> new SolrResourceLoader for directory: '/usr/home/hudson/hudson-slave/workspace/Lucene-Solr-Tests-4.x-Java6/solr/build/solr-core/test/J0/./org.apache.solr.cloud.SyncSliceTest-jetty1-1359700589548/'
[junit4:junit4]   2> 6188 T30 oashc.HttpShardHandlerFactory.getParameter Setting socketTimeout to: 60000
[junit4:junit4]   2> 6188 T30 oashc.HttpShardHandlerFactory.getParameter Setting urlScheme to: http://
[junit4:junit4]   2> 6189 T30 oashc.HttpShardHandlerFactory.getParameter Setting connTimeout to: 15000
[junit4:junit4]   2> 6189 T30 oashc.HttpShardHandlerFactory.getParameter Setting maxConnectionsPerHost to: 20
[junit4:junit4]   2> 6189 T30 oashc.HttpShardHandlerFactory.getParameter Setting corePoolSize to: 0
[junit4:junit4]   2> 6190 T30 oashc.HttpShardHandlerFactory.getParameter Setting maximumPoolSize to: 2147483647
[junit4:junit4]   2> 6190 T30 oashc.HttpShardHandlerFactory.getParameter Setting maxThreadIdleTime to: 5
[junit4:junit4]   2> 6190 T30 oashc.HttpShardHandlerFactory.getParameter Setting sizeOfQueue to: -1
[junit4:junit4]   2> 6191 T30 oashc.HttpShardHandlerFactory.getParameter Setting fairnessPolicy to: false
[junit4:junit4]   2> 6191 T30 oascsi.HttpClientUtil.createClient Creating new http client, config:maxConnectionsPerHost=20&maxConnections=10000&socketTimeout=60000&connTimeout=15000&retry=false
[junit4:junit4]   2> 6205 T30 oasc.CoreContainer.load Registering Log Listener
[junit4:junit4]   2> 6221 T30 oasc.CoreContainer.initZooKeeper Zookeeper client=127.0.0.1:46809/solr
[junit4:junit4]   2> 6221 T30 oasc.ZkController.checkChrootPath zkHost includes chroot
[junit4:junit4]   2> 6222 T30 oaz.ZooKeeper.<init> Initiating client connection, connectString=127.0.0.1:46809 sessionTimeout=60000 watcher=org.apache.solr.common.cloud.ConnectionManager@64fde8da
[junit4:junit4]   2> 6223 T30 oascc.ConnectionManager.waitForConnected Waiting for client to connect to ZooKeeper
[junit4:junit4]   2> 6223 T69 oaz.ClientCnxn$SendThread.logStartConnect Opening socket connection to server localhost/127.0.0.1:46809. Will not attempt to authenticate using SASL (access denied (javax.security.auth.AuthPermission getLoginConfiguration))
[junit4:junit4]   2> 6224 T69 oaz.ClientCnxn$SendThread.primeConnection Socket connection established to localhost/127.0.0.1:46809, initiating session
[junit4:junit4]   2> 6224 T32 oazs.NIOServerCnxnFactory.run Accepted socket connection from /140.211.11.196:32067
[junit4:junit4]   2> 6225 T32 oazs.ZooKeeperServer.processConnectRequest Client attempting to establish new session at /140.211.11.196:32067
[junit4:junit4]   2> 6227 T34 oazs.ZooKeeperServer.finishSessionInit Established session 0x13c947865990005 with negotiated timeout 20000 for client /140.211.11.196:32067
[junit4:junit4]   2> 6227 T69 oaz.ClientCnxn$SendThread.onConnected Session establishment complete on server localhost/127.0.0.1:46809, sessionid = 0x13c947865990005, negotiated timeout = 20000
[junit4:junit4]   2> 6228 T70 oascc.ConnectionManager.process Watcher org.apache.solr.common.cloud.ConnectionManager@64fde8da name:ZooKeeperConnection Watcher:127.0.0.1:46809 got event WatchedEvent state:SyncConnected type:None path:null path:null type:None
[junit4:junit4]   2> 6228 T30 oascc.ConnectionManager.waitForConnected Client is connected to ZooKeeper
[junit4:junit4]   2> 6230 T35 oazs.PrepRequestProcessor.pRequest2Txn Processed session termination for sessionid: 0x13c947865990005
[junit4:junit4]   2> 6231 T70 oaz.ClientCnxn$EventThread.run EventThread shut down
[junit4:junit4]   2> 6231 T30 oaz.ZooKeeper.close Session: 0x13c947865990005 closed
[junit4:junit4]   2> 6231 T32 oazs.NIOServerCnxn.closeSock Closed socket connection for client /140.211.11.196:32067 which had sessionid 0x13c947865990005
[junit4:junit4]   2> 6232 T30 oascsi.HttpClientUtil.createClient Creating new http client, config:maxConnections=500&maxConnectionsPerHost=16&socketTimeout=60000&connTimeout=15000
[junit4:junit4]   2> 6240 T30 oaz.ZooKeeper.<init> Initiating client connection, connectString=127.0.0.1:46809/solr sessionTimeout=30000 watcher=org.apache.solr.common.cloud.ConnectionManager@3cee5a06
[junit4:junit4]   2> 6240 T30 oascc.ConnectionManager.waitForConnected Waiting for client to connect to ZooKeeper
[junit4:junit4]   2> 6241 T71 oaz.ClientCnxn$SendThread.logStartConnect Opening socket connection to server localhost/127.0.0.1:46809. Will not attempt to authenticate using SASL (access denied (javax.security.auth.AuthPermission getLoginConfiguration))
[junit4:junit4]   2> 6241 T71 oaz.ClientCnxn$SendThread.primeConnection Socket connection established to localhost/127.0.0.1:46809, initiating session
[junit4:junit4]   2> 6242 T32 oazs.NIOServerCnxnFactory.run Accepted socket connection from /140.211.11.196:49286
[junit4:junit4]   2> 6243 T32 oazs.ZooKeeperServer.processConnectRequest Client attempting to establish new session at /140.211.11.196:49286
[junit4:junit4]   2> 6244 T34 oazs.ZooKeeperServer.finishSessionInit Established session 0x13c947865990006 with negotiated timeout 20000 for client /140.211.11.196:49286
[junit4:junit4]   2> 6244 T71 oaz.ClientCnxn$SendThread.onConnected Session establishment complete on server localhost/127.0.0.1:46809, sessionid = 0x13c947865990006, negotiated timeout = 20000
[junit4:junit4]   2> 6245 T72 oascc.ConnectionManager.process Watcher org.apache.solr.common.cloud.ConnectionManager@3cee5a06 name:ZooKeeperConnection Watcher:127.0.0.1:46809/solr got event WatchedEvent state:SyncConnected type:None path:null path:null type:None
[junit4:junit4]   2> 6245 T30 oascc.ConnectionManager.waitForConnected Client is connected to ZooKeeper
[junit4:junit4]   2> 6246 T35 oazs.PrepRequestProcessor.pRequest Got user-level KeeperException when processing sessionid:0x13c947865990006 type:create cxid:0x1 zxid:0x49 txntype:-1 reqpath:n/a Error Path:/solr/overseer Error:KeeperErrorCode = NodeExists for /solr/overseer
[junit4:junit4]   2> 6248 T35 oazs.PrepRequestProcessor.pRequest Got user-level KeeperException when processing sessionid:0x13c947865990006 type:create cxid:0x2 zxid:0x4a txntype:-1 reqpath:n/a Error Path:/solr/overseer Error:KeeperErrorCode = NodeExists for /solr/overseer
[junit4:junit4]   2> 6256 T30 oasc.ZkController.createEphemeralLiveNode Register node as live in ZooKeeper:/live_nodes/127.0.0.1:52046_ts%2Fnc
[junit4:junit4]   2> 6256 T35 oazs.PrepRequestProcessor.pRequest Got user-level KeeperException when processing sessionid:0x13c947865990006 type:delete cxid:0x4 zxid:0x4b txntype:-1 reqpath:n/a Error Path:/solr/live_nodes/127.0.0.1:52046_ts%2Fnc Error:KeeperErrorCode = NoNode for /solr/live_nodes/127.0.0.1:52046_ts%2Fnc
[junit4:junit4]   2> 6258 T30 oascc.SolrZkClient.makePath makePath: /live_nodes/127.0.0.1:52046_ts%2Fnc
[junit4:junit4]   2> 6268 T53 oascc.ZkStateReader$3.process Updating live nodes... (2)
[junit4:junit4]   2> 6268 T59 oascc.ZkStateReader$3.process Updating live nodes... (2)
[junit4:junit4]   2> 6268 T53 oascc.ZkStateReader$2.process A cluster state change: WatchedEvent state:SyncConnected type:NodeChildrenChanged path:/live_nodes, has occurred - updating... (live nodes size: 2)
[junit4:junit4]   2> 6285 T30 oascc.ZkStateReader.createClusterStateWatchersAndUpdate Updating cluster state from ZooKeeper... 
[junit4:junit4]   2> 6308 T73 oasc.CoreContainer.create Creating SolrCore 'collection1' using instanceDir: /usr/home/hudson/hudson-slave/workspace/Lucene-Solr-Tests-4.x-Java6/solr/build/solr-core/test/J0/./org.apache.solr.cloud.SyncSliceTest-jetty1-1359700589548/collection1
[junit4:junit4]   2> 6309 T73 oasc.ZkController.createCollectionZkNode Check for collection zkNode:collection1
[junit4:junit4]   2> 6310 T73 oasc.ZkController.createCollectionZkNode Collection zkNode exists
[junit4:junit4]   2> 6310 T73 oasc.ZkController.readConfigName Load collection config from:/collections/collection1
[junit4:junit4]   2> 6312 T73 oasc.SolrResourceLoader.<init> new SolrResourceLoader for directory: '/usr/home/hudson/hudson-slave/workspace/Lucene-Solr-Tests-4.x-Java6/solr/build/solr-core/test/J0/./org.apache.solr.cloud.SyncSliceTest-jetty1-1359700589548/collection1/'
[junit4:junit4]   2> 6314 T73 oasc.SolrResourceLoader.replaceClassLoader Adding 'file:/usr/home/hudson/hudson-slave/workspace/Lucene-Solr-Tests-4.x-Java6/solr/build/solr-core/test/J0/org.apache.solr.cloud.SyncSliceTest-jetty1-1359700589548/collection1/lib/README' to classloader
[junit4:junit4]   2> 6315 T73 oasc.SolrResourceLoader.replaceClassLoader Adding 'file:/usr/home/hudson/hudson-slave/workspace/Lucene-Solr-Tests-4.x-Java6/solr/build/solr-core/test/J0/org.apache.solr.cloud.SyncSliceTest-jetty1-1359700589548/collection1/lib/classes/' to classloader
[junit4:junit4]   2> 6382 T73 oasc.SolrConfig.<init> Using Lucene MatchVersion: LUCENE_42
[junit4:junit4]   2> 6462 T73 oasc.SolrConfig.<init> Loaded SolrConfig: solrconfig.xml
[junit4:junit4]   2> 6563 T73 oass.IndexSchema.readSchema Reading Solr Schema
[junit4:junit4]   2> 6590 T73 oass.IndexSchema.readSchema Schema name=test
[junit4:junit4]   2> 7343 T73 oass.OpenExchangeRatesOrgProvider.init Initialized with rates=open-exchange-rates.json, refreshInterval=1440.
[junit4:junit4]   2> 7359 T73 oass.IndexSchema.readSchema default search field in schema is text
[junit4:junit4]   2> 7364 T73 oass.IndexSchema.readSchema unique key field: id
[junit4:junit4]   2> 7398 T73 oass.FileExchangeRateProvider.reload Reloading exchange rates from file currency.xml
[junit4:junit4]   2> 7406 T73 oass.FileExchangeRateProvider.reload Reloading exchange rates from file currency.xml
[junit4:junit4]   2> 7412 T73 oass.OpenExchangeRatesOrgProvider.reload Reloading exchange rates from open-exchange-rates.json
[junit4:junit4]   2> 7415 T73 oass.OpenExchangeRatesOrgProvider.reload Reloading exchange rates from open-exchange-rates.json
[junit4:junit4]   2> 7418 T73 oasc.SolrCore.<init> [collection1] Opening new SolrCore at /usr/home/hudson/hudson-slave/workspace/Lucene-Solr-Tests-4.x-Java6/solr/build/solr-core/test/J0/./org.apache.solr.cloud.SyncSliceTest-jetty1-1359700589548/collection1/, dataDir=./org.apache.solr.cloud.SyncSliceTest-1359700583526/jetty1/
[junit4:junit4]   2> 7419 T73 oasc.JmxMonitoredMap.<init> JMX monitoring is enabled. Adding Solr mbeans to JMX Server: com.sun.jmx.mbeanserver.JmxMBeanServer@2658dd2d
[junit4:junit4]   2> 7420 T73 oasc.SolrCore.initDirectoryFactory solr.NRTCachingDirectoryFactory
[junit4:junit4]   2> 7421 T73 oasc.CachingDirectoryFactory.get return new directory for /usr/home/hudson/hudson-slave/workspace/Lucene-Solr-Tests-4.x-Java6/solr/build/solr-core/test/J0/./org.apache.solr.cloud.SyncSliceTest-1359700583526/jetty1 forceNew:false
[junit4:junit4]   2> 7422 T73 oasc.CachingDirectoryFactory.close Releasing directory:/usr/home/hudson/hudson-slave/workspace/Lucene-Solr-Tests-4.x-Java6/solr/build/solr-core/test/J0/./org.apache.solr.cloud.SyncSliceTest-1359700583526/jetty1
[junit4:junit4]   2> 7422 T73 oasc.SolrCore.getNewIndexDir New index directory detected: old=null new=./org.apache.solr.cloud.SyncSliceTest-1359700583526/jetty1/index/
[junit4:junit4]   2> 7423 T73 oasc.SolrCore.initIndex WARNING [collection1] Solr index directory './org.apache.solr.cloud.SyncSliceTest-1359700583526/jetty1/index' doesn't exist. Creating new index...
[junit4:junit4]   2> 7424 T73 oasc.CachingDirectoryFactory.get return new directory for /usr/home/hudson/hudson-slave/workspace/Lucene-Solr-Tests-4.x-Java6/solr/build/solr-core/test/J0/./org.apache.solr.cloud.SyncSliceTest-1359700583526/jetty1/index forceNew:false
[junit4:junit4]   2> 7426 T54 oascc.ZkStateReader.updateClusterState Updating cloud state from ZooKeeper... 
[junit4:junit4]   2> 7427 T54 oasc.Overseer$ClusterStateUpdater.updateState Update state numShards=1 message={
[junit4:junit4]   2> 	  "operation":"state",
[junit4:junit4]   2> 	  "numShards":"1",
[junit4:junit4]   2> 	  "shard":"shard1",
[junit4:junit4]   2> 	  "roles":null,
[junit4:junit4]   2> 	  "state":"active",
[junit4:junit4]   2> 	  "core":"collection1",
[junit4:junit4]   2> 	  "collection":"control_collection",
[junit4:junit4]   2> 	  "node_name":"127.0.0.1:40584_ts%2Fnc",
[junit4:junit4]   2> 	  "base_url":"http://127.0.0.1:40584/ts/nc"}
[junit4:junit4]   2> 7445 T73 oasc.SolrDeletionPolicy.onCommit SolrDeletionPolicy.onCommit: commits:num=1
[junit4:junit4]   2> 		commit{dir=RateLimitedDirectoryWrapper(NRTCachingDirectory(org.apache.lucene.store.NIOFSDirectory@/usr/home/hudson/hudson-slave/workspace/Lucene-Solr-Tests-4.x-Java6/solr/build/solr-core/test/J0/org.apache.solr.cloud.SyncSliceTest-1359700583526/jetty1/index lockFactory=org.apache.lucene.store.NativeFSLockFactory@2b3e8c1c; maxCacheMB=48.0 maxMergeSizeMB=4.0)),segFN=segments_1,generation=1,filenames=[segments_1]
[junit4:junit4]   2> 7446 T73 oasc.SolrDeletionPolicy.updateCommits newest commit = 1[segments_1]
[junit4:junit4]   2> 7447 T73 oasc.CachingDirectoryFactory.close Releasing directory:/usr/home/hudson/hudson-slave/workspace/Lucene-Solr-Tests-4.x-Java6/solr/build/solr-core/test/J0/./org.apache.solr.cloud.SyncSliceTest-1359700583526/jetty1/index
[junit4:junit4]   2> 7447 T73 oasc.SolrCore.initWriters created xml: solr.XMLResponseWriter
[junit4:junit4]   2> 7448 T59 oascc.ZkStateReader$2.process A cluster state change: WatchedEvent state:SyncConnected type:NodeDataChanged path:/clusterstate.json, has occurred - updating... (live nodes size: 2)
[junit4:junit4]   2> 7448 T53 oascc.ZkStateReader$2.process A cluster state change: WatchedEvent state:SyncConnected type:NodeDataChanged path:/clusterstate.json, has occurred - updating... (live nodes size: 2)
[junit4:junit4]   2> 7448 T72 oascc.ZkStateReader$2.process A cluster state change: WatchedEvent state:SyncConnected type:NodeDataChanged path:/clusterstate.json, has occurred - updating... (live nodes size: 2)
[junit4:junit4]   2> 7453 T73 oasup.UpdateRequestProcessorChain.init inserting DistributedUpdateProcessorFactory into updateRequestProcessorChain "dedupe"
[junit4:junit4]   2> 7462 T73 oasup.UpdateRequestProcessorChain.init inserting DistributedUpdateProcessorFactory into updateRequestProcessorChain "dedupe-allfields"
[junit4:junit4]   2> 7463 T73 oasup.UpdateRequestProcessorChain.init inserting DistributedUpdateProcessorFactory into updateRequestProcessorChain "stored_sig"
[junit4:junit4]   2> 7464 T73 oasup.UpdateRequestProcessorChain.init inserting DistributedUpdateProcessorFactory into updateRequestProcessorChain "uniq-fields"
[junit4:junit4]   2> 7465 T73 oasup.UpdateRequestProcessorChain.init inserting DistributedUpdateProcessorFactory into updateRequestProcessorChain "distrib-dup-test-chain-implicit"
[junit4:junit4]   2> 7466 T73 oasc.RequestHandlers.initHandlersFromConfig adding lazy requestHandler: solr.ReplicationHandler
[junit4:junit4]   2> 7466 T73 oasc.RequestHandlers.initHandlersFromConfig created /replication: solr.ReplicationHandler
[junit4:junit4]   2> 7468 T73 oasc.RequestHandlers.initHandlersFromConfig created standard: solr.StandardRequestHandler
[junit4:junit4]   2> 7469 T73 oasc.RequestHandlers.initHandlersFromConfig created /get: solr.RealTimeGetHandler
[junit4:junit4]   2> 7470 T73 oasc.RequestHandlers.initHandlersFromConfig created dismax: solr.SearchHandler
[junit4:junit4]   2> 7471 T73 oasc.RequestHandlers.initHandlersFromConfig created mock: org.apache.solr.core.MockQuerySenderListenerReqHandler
[junit4:junit4]   2> 7472 T73 oasc.RequestHandlers.initHandlersFromConfig created /admin/: org.apache.solr.handler.admin.AdminHandlers
[junit4:junit4]   2> 7473 T73 oasc.RequestHandlers.initHandlersFromConfig created defaults: solr.StandardRequestHandler
[junit4:junit4]   2> 7474 T73 oasc.RequestHandlers.initHandlersFromConfig adding lazy requestHandler: solr.StandardRequestHandler
[junit4:junit4]   2> 7474 T73 oasc.RequestHandlers.initHandlersFromConfig created lazy: solr.StandardRequestHandler
[junit4:junit4]   2> 7476 T73 oasc.RequestHandlers.initHandlersFromConfig created /update: solr.UpdateRequestHandler
[junit4:junit4]   2> 7477 T73 oasc.RequestHandlers.initHandlersFromConfig created /terms: org.apache.solr.handler.component.SearchHandler
[junit4:junit4]   2> 7478 T73 oasc.RequestHandlers.initHandlersFromConfig created spellCheckCompRH: org.apache.solr.handler.component.SearchHandler
[junit4:junit4]   2> 7479 T73 oasc.RequestHandlers.initHandlersFromConfig created spellCheckCompRH_Direct: org.apache.solr.handler.component.SearchHandler
[junit4:junit4]   2> 7480 T73 oasc.RequestHandlers.initHandlersFromConfig created spellCheckWithWordbreak: org.apache.solr.handler.component.SearchHandler
[junit4:junit4]   2> 7482 T73 oasc.RequestHandlers.initHandlersFromConfig created spellCheckWithWordbreak_Direct: org.apache.solr.handler.component.SearchHandler
[junit4:junit4]   2> 7483 T73 oasc.RequestHandlers.initHandlersFromConfig created spellCheckCompRH1: org.apache.solr.handler.component.SearchHandler
[junit4:junit4]   2> 7484 T73 oasc.RequestHandlers.initHandlersFromConfig created mltrh: org.apache.solr.handler.component.SearchHandler
[junit4:junit4]   2> 7485 T73 oasc.RequestHandlers.initHandlersFromConfig created tvrh: org.apache.solr.handler.component.SearchHandler
[junit4:junit4]   2> 7486 T73 oasc.RequestHandlers.initHandlersFromConfig created /mlt: solr.MoreLikeThisHandler
[junit4:junit4]   2> 7488 T73 oasc.RequestHandlers.initHandlersFromConfig created /debug/dump: solr.DumpRequestHandler
[junit4:junit4]   2> 7496 T73 oashl.XMLLoader.init xsltCacheLifetimeSeconds=60
[junit4:junit4]   2> 7501 T73 oasc.SolrCore.initDeprecatedSupport WARNING solrconfig.xml uses deprecated <admin/gettableFiles>, Please update your config to use the ShowFileRequestHandler.
[junit4:junit4]   2> 7503 T73 oasc.SolrCore.initDeprecatedSupport WARNING adding ShowFileRequestHandler with hidden files: [SCHEMA.XML, OLD_SYNONYMS.TXT, STOPWORDS.TXT, PROTWORDS.TXT, OPEN-EXCHANGE-RATES.JSON, SYNONYMS.TXT, CURRENCY.XML, MAPPING-ISOLATIN1ACCENT.TXT]
[junit4:junit4]   2> 7506 T73 oasc.CachingDirectoryFactory.close Releasing directory:/usr/home/hudson/hudson-slave/workspace/Lucene-Solr-Tests-4.x-Java6/solr/build/solr-core/test/J0/./org.apache.solr.cloud.SyncSliceTest-1359700583526/jetty1
[junit4:junit4]   2> 7508 T73 oass.SolrIndexSearcher.<init> Opening Searcher@36db4bcf main
[junit4:junit4]   2> 7509 T73 oasu.CommitTracker.<init> Hard AutoCommit: disabled
[junit4:junit4]   2> 7510 T73 oasu.CommitTracker.<init> Soft AutoCommit: disabled
[junit4:junit4]   2> 7511 T73 oashc.SpellCheckComponent.inform Initializing spell checkers
[junit4:junit4]   2> 7518 T73 oass.DirectSolrSpellChecker.init init: {name=direct,classname=DirectSolrSpellChecker,field=lowerfilt,minQueryLength=3}
[junit4:junit4]   2> 7586 T74 oasc.SolrCore.registerSearcher [collection1] Registered new searcher Searcher@36db4bcf main{StandardDirectoryReader(segments_1:1)}
[junit4:junit4]   2> 7600 T73 oasc.ZkController.publish publishing core=collection1 state=down
[junit4:junit4]   2> 7601 T73 oasc.ZkController.publish numShards not found on descriptor - reading it from system property
[junit4:junit4]   2> 8968 T54 oascc.ZkStateReader.updateClusterState Updating cloud state from ZooKeeper... 
[junit4:junit4]   2> 8969 T54 oasc.Overseer$ClusterStateUpdater.updateState Update state numShards=1 message={
[junit4:junit4]   2> 	  "operation":"state",
[junit4:junit4]   2> 	  "numShards":"1",
[junit4:junit4]   2> 	  "shard":null,
[junit4:junit4]   2> 	  "roles":null,
[junit4:junit4]   2> 	  "state":"down",
[junit4:junit4]   2> 	  "core":"collection1",
[junit4:junit4]   2> 	  "collection":"collection1",
[junit4:junit4]   2> 	  "node_name":"127.0.0.1:52046_ts%2Fnc",
[junit4:junit4]   2> 	  "base_url":"http://127.0.0.1:52046/ts/nc"}
[junit4:junit4]   2> 8970 T54 oasc.Overseer$ClusterStateUpdater.createCollection Create collection collection1 with numShards 1
[junit4:junit4]   2> 8970 T54 oasc.Overseer$ClusterStateUpdater.updateState Assigning new node to shard shard=shard1
[junit4:junit4]   2> 8985 T53 oascc.ZkStateReader$2.process A cluster state change: WatchedEvent state:SyncConnected type:NodeDataChanged path:/clusterstate.json, has occurred - updating... (live nodes size: 2)
[junit4:junit4]   2> 8985 T72 oascc.ZkStateReader$2.process A cluster state change: WatchedEvent state:SyncConnected type:NodeDataChanged path:/clusterstate.json, has occurred - updating... (live nodes size: 2)
[junit4:junit4]   2> 8985 T59 oascc.ZkStateReader$2.process A cluster state change: WatchedEvent state:SyncConnected type:NodeDataChanged path:/clusterstate.json, has occurred - updating... (live nodes size: 2)
[junit4:junit4]   2> 9605 T73 oasc.CoreContainer.registerCore registering core: collection1
[junit4:junit4]   2> 9605 T73 oasc.ZkController.register Register replica - core:collection1 address:http://127.0.0.1:52046/ts/nc collection:collection1 shard:shard1
[junit4:junit4]   2> 9606 T73 oascc.SolrZkClient.makePath makePath: /collections/collection1/leader_elect/shard1/election
[junit4:junit4]   2> 9615 T35 oazs.PrepRequestProcessor.pRequest Got user-level KeeperException when processing sessionid:0x13c947865990006 type:delete cxid:0x45 zxid:0x5b txntype:-1 reqpath:n/a Error Path:/solr/collections/collection1/leaders Error:KeeperErrorCode = NoNode for /solr/collections/collection1/leaders
[junit4:junit4]   2> 9616 T73 oasc.ShardLeaderElectionContext.runLeaderProcess Running the leader process.
[junit4:junit4]   2> 9617 T35 oazs.PrepRequestProcessor.pRequest Got user-level KeeperException when processing sessionid:0x13c947865990006 type:create cxid:0x46 zxid:0x5c txntype:-1 reqpath:n/a Error Path:/solr/overseer Error:KeeperErrorCode = NodeExists for /solr/overseer
[junit4:junit4]   2> 9620 T73 oasc.ShardLeaderElectionContext.waitForReplicasToComeUp Enough replicas found to continue.
[junit4:junit4]   2> 9620 T73 oasc.ShardLeaderElectionContext.runLeaderProcess I may be the new leader - try and sync
[junit4:junit4]   2> 9620 T73 oasc.SyncStrategy.sync Sync replicas to http://127.0.0.1:52046/ts/nc/collection1/
[junit4:junit4]   2> 9621 T73 oasc.SyncStrategy.syncReplicas Sync Success - now sync replicas to me
[junit4:junit4]   2> 9621 T73 oasc.SyncStrategy.syncToMe http://127.0.0.1:52046/ts/nc/collection1/ has no replicas
[junit4:junit4]   2> 9621 T73 oasc.ShardLeaderElectionContext.runLeaderProcess I am the new leader: http://127.0.0.1:52046/ts/nc/collection1/
[junit4:junit4]   2> 9622 T73 oascc.SolrZkClient.makePath makePath: /collections/collection1/leaders/shard1
[junit4:junit4]   2> 9628 T35 oazs.PrepRequestProcessor.pRequest Got user-level KeeperException when processing sessionid:0x13c947865990006 type:create cxid:0x50 zxid:0x60 txntype:-1 reqpath:n/a Error Path:/solr/overseer Error:KeeperErrorCode = NodeExists for /solr/overseer
[junit4:junit4]   2> 10493 T54 oascc.ZkStateReader.updateClusterState Updating cloud state from ZooKeeper... 
[junit4:junit4]   2> 10514 T53 oascc.ZkStateReader$2.process A cluster state change: WatchedEvent state:SyncConnected type:NodeDataChanged path:/clusterstate.json, has occurred - updating... (live nodes size: 2)
[junit4:junit4]   2> 10514 T59 oascc.ZkStateReader$2.process A cluster state change: WatchedEvent state:SyncConnected type:NodeDataChanged path:/clusterstate.json, has occurred - updating... (live nodes size: 2)
[junit4:junit4]   2> 10515 T72 oascc.ZkStateReader$2.process A cluster state change: WatchedEvent state:SyncConnected type:NodeDataChanged path:/clusterstate.json, has occurred - updating... (live nodes size: 2)
[junit4:junit4]   2> 10549 T73 oasc.ZkController.register We are http://127.0.0.1:52046/ts/nc/collection1/ and leader is http://127.0.0.1:52046/ts/nc/collection1/
[junit4:junit4]   2> 10549 T73 oasc.ZkController.register No LogReplay needed for core=collection1 baseURL=http://127.0.0.1:52046/ts/nc
[junit4:junit4]   2> 10549 T73 oasc.ZkController.checkRecovery I am the leader, no recovery necessary
[junit4:junit4]   2> 10550 T73 oasc.ZkController.publish publishing core=collection1 state=active
[junit4:junit4]   2> 10550 T73 oasc.ZkController.publish numShards not found on descriptor - reading it from system property
[junit4:junit4]   2> 10553 T73 oascc.ZkStateReader.updateClusterState Updating cloud state from ZooKeeper... 
[junit4:junit4]   2> 10555 T30 oass.SolrDispatchFilter.init user.dir=/usr/home/hudson/hudson-slave/workspace/Lucene-Solr-Tests-4.x-Java6/solr/build/solr-core/test/J0
[junit4:junit4]   2> 10556 T30 oass.SolrDispatchFilter.init SolrDispatchFilter.init() done
[junit4:junit4]   2> 10557 T30 oascsi.HttpClientUtil.createClient Creating new http client, config:maxConnections=128&maxConnectionsPerHost=32&followRedirects=false
[junit4:junit4]   2> 10698 T30 oejs.Server.doStart jetty-8.1.8.v20121106
[junit4:junit4]   2> 10700 T30 oejs.AbstractConnector.doStart Started SocketConnector@127.0.0.1:39316
[junit4:junit4]   2> 10701 T30 oass.SolrDispatchFilter.init SolrDispatchFilter.init()
[junit4:junit4]   2> 10701 T30 oasc.SolrResourceLoader.locateSolrHome JNDI not configured for solr (NoInitialContextEx)
[junit4:junit4]   2> 10702 T30 oasc.SolrResourceLoader.locateSolrHome using system property solr.solr.home: /usr/home/hudson/hudson-slave/workspace/Lucene-Solr-Tests-4.x-Java6/solr/build/solr-core/test/J0/./org.apache.solr.cloud.SyncSliceTest-jetty2-1359700594095
[junit4:junit4]   2> 10702 T30 oasc.CoreContainer$Initializer.initialize looking for solr.xml: /usr/home/hudson/hudson-slave/workspace/Lucene-Solr-Tests-4.x-Java6/solr/build/solr-core/test/J0/./org.apache.solr.cloud.SyncSliceTest-jetty2-1359700594095/solr.xml
[junit4:junit4]   2> 10702 T30 oasc.CoreContainer.<init> New CoreContainer 204731486
[junit4:junit4]   2> 10703 T30 oasc.CoreContainer.load Loading CoreContainer using Solr Home: '/usr/home/hudson/hudson-slave/workspace/Lucene-Solr-Tests-4.x-Java6/solr/build/solr-core/test/J0/./org.apache.solr.cloud.SyncSliceTest-jetty2-1359700594095/'
[junit4:junit4]   2> 10703 T30 oasc.SolrResourceLoader.<init> new SolrResourceLoader for directory: '/usr/home/hudson/hudson-slave/workspace/Lucene-Solr-Tests-4.x-Java6/solr/build/solr-core/test/J0/./org.apache.solr.cloud.SyncSliceTest-jetty2-1359700594095/'
[junit4:junit4]   2> 10736 T30 oashc.HttpShardHandlerFactory.getParameter Setting socketTimeout to: 60000
[junit4:junit4]   2> 10737 T30 oashc.HttpShardHandlerFactory.getParameter Setting urlScheme to: http://
[junit4:junit4]   2> 10737 T30 oashc.HttpShardHandlerFactory.getParameter Setting connTimeout to: 15000
[junit4:junit4]   2> 10738 T30 oashc.HttpShardHandlerFactory.getParameter Setting maxConnectionsPerHost to: 20
[junit4:junit4]   2> 10738 T30 oashc.HttpShardHandlerFactory.getParameter Setting corePoolSize to: 0
[junit4:junit4]   2> 10738 T30 oashc.HttpShardHandlerFactory.getParameter Setting maximumPoolSize to: 2147483647
[junit4:junit4]   2> 10739 T30 oashc.HttpShardHandlerFactory.getParameter Setting maxThreadIdleTime to: 5
[junit4:junit4]   2> 10739 T30 oashc.HttpShardHandlerFactory.getParameter Setting sizeOfQueue to: -1
[junit4:junit4]   2> 10740 T30 oashc.HttpShardHandlerFactory.getParameter Setting fairnessPolicy to: false
[junit4:junit4]   2> 10740 T30 oascsi.HttpClientUtil.createClient Creating new http client, config:maxConnectionsPerHost=20&maxConnections=10000&socketTimeout=60000&connTimeout=15000&retry=false
[junit4:junit4]   2> 10756 T30 oasc.CoreContainer.load Registering Log Listener
[junit4:junit4]   2> 10771 T30 oasc.CoreContainer.initZooKeeper Zookeeper client=127.0.0.1:46809/solr
[junit4:junit4]   2> 10771 T30 oasc.ZkController.checkChrootPath zkHost includes chroot
[junit4:junit4]   2> 10772 T30 oaz.ZooKeeper.<init> Initiating client connection, connectString=127.0.0.1:46809 sessionTimeout=60000 watcher=org.apache.solr.common.cloud.ConnectionManager@6a754384
[junit4:junit4]   2> 10773 T30 oascc.ConnectionManager.waitForConnected Waiting for client to connect to ZooKeeper
[junit4:junit4]   2> 10773 T84 oaz.ClientCnxn$SendThread.logStartConnect Opening socket connection to server localhost/127.0.0.1:46809. Will not attempt to authenticate using SASL (access denied (javax.security.auth.AuthPermission getLoginConfiguration))
[junit4:junit4]   2> 10774 T84 oaz.ClientCnxn$SendThread.primeConnection Socket connection established to localhost/127.0.0.1:46809, initiating session
[junit4:junit4]   2> 10774 T32 oazs.NIOServerCnxnFactory.run Accepted socket connection from /140.211.11.196:47061
[junit4:junit4]   2> 10775 T32 oazs.ZooKeeperServer.processConnectRequest Client attempting to establish new session at /140.211.11.196:47061
[junit4:junit4]   2> 10777 T34 oazs.ZooKeeperServer.finishSessionInit Established session 0x13c947865990007 with negotiated timeout 20000 for client /140.211.11.196:47061
[junit4:junit4]   2> 10777 T84 oaz.ClientCnxn$SendThread.onConnected Session establishment complete on server localhost/127.0.0.1:46809, sessionid = 0x13c947865990007, negotiated timeout = 20000
[junit4:junit4]   2> 10778 T85 oascc.ConnectionManager.process Watcher org.apache.solr.common.cloud.ConnectionManager@6a754384 name:ZooKeeperConnection Watcher:127.0.0.1:46809 got event WatchedEvent state:SyncConnected type:None path:null path:null type:None
[junit4:junit4]   2> 10778 T30 oascc.ConnectionManager.waitForConnected Client is connected to ZooKeeper
[junit4:junit4]   2> 10780 T35 oazs.PrepRequestProcessor.pRequest2Txn Processed session termination for sessionid: 0x13c947865990007
[junit4:junit4]   2> 10781 T32 oazs.NIOServerCnxn.closeSock Closed socket connection for client /140.211.11.196:47061 which had sessionid 0x13c947865990007
[junit4:junit4]   2> 10782 T85 oaz.ClientCnxn$EventThread.run EventThread shut down
[junit4:junit4]   2> 10782 T30 oaz.ZooKeeper.close Session: 0x13c947865990007 closed
[junit4:junit4]   2> 10783 T30 oascsi.HttpClientUtil.createClient Creating new http client, config:maxConnections=500&maxConnectionsPerHost=16&socketTimeout=60000&connTimeout=15000
[junit4:junit4]   2> 10792 T30 oaz.ZooKeeper.<init> Initiating client connection, connectString=127.0.0.1:46809/solr sessionTimeout=30000 watcher=org.apache.solr.common.cloud.ConnectionManager@47fe256b
[junit4:junit4]   2> 10793 T30 oascc.ConnectionManager.waitForConnected Waiting for client to connect to ZooKeeper
[junit4:junit4]   2> 10793 T86 oaz.ClientCnxn$SendThread.logStartConnect Opening socket connection to server localhost/127.0.0.1:46809. Will not attempt to authenticate using SASL (access denied (javax.security.auth.AuthPermission getLoginConfiguration))
[junit4:junit4]   2> 10794 T86 oaz.ClientCnxn$SendThread.primeConnection Socket connection established to localhost/127.0.0.1:46809, initiating session
[junit4:junit4]   2> 10794 T32 oazs.NIOServerCnxnFactory.run Accepted socket connection from /140.211.11.196:35916
[junit4:junit4]   2> 10795 T32 oazs.ZooKeeperServer.processConnectRequest Client attempting to establish new session at /140.211.11.196:35916
[junit4:junit4]   2> 10796 T34 oazs.ZooKeeperServer.finishSessionInit Established session 0x13c947865990008 with negotiated timeout 20000 for client /140.211.11.196:35916
[junit4:junit4]   2> 10796 T86 oaz.ClientCnxn$SendThread.onConnected Session establishment complete on server localhost/127.0.0.1:46809, sessionid = 0x13c947865990008, negotiated timeout = 20000
[junit4:junit4]   2> 10797 T87 oascc.ConnectionManager.process Watcher org.apache.solr.common.cloud.ConnectionManager@47fe256b name:ZooKeeperConnection Watcher:127.0.0.1:46809/solr got event WatchedEvent state:SyncConnected type:None path:null path:null type:None
[junit4:junit4]   2> 10797 T30 oascc.ConnectionManager.waitForConnected Client is connected to ZooKeeper
[junit4:junit4]   2> 10798 T35 oazs.PrepRequestProcessor.pRequest Got user-level KeeperException when processing sessionid:0x13c947865990008 type:create cxid:0x1 zxid:0x6d txntype:-1 reqpath:n/a Error Path:/solr/overseer Error:KeeperErrorCode = NodeExists for /solr/overseer
[junit4:junit4]   2> 10800 T35 oazs.PrepRequestProcessor.pRequest Got user-level KeeperException when processing sessionid:0x13c947865990008 type:create cxid:0x2 zxid:0x6e txntype:-1 reqpath:n/a Error Path:/solr/overseer Error:KeeperErrorCode = NodeExists for /solr/overseer
[junit4:junit4]   2> 10808 T30 oasc.ZkController.createEphemeralLiveNode Register node as live in ZooKeeper:/live_nodes/127.0.0.1:39316_ts%2Fnc
[junit4:junit4]   2> 10808 T35 oazs.PrepRequestProcessor.pRequest Got user-level KeeperException when processing sessionid:0x13c947865990008 type:delete cxid:0x4 zxid:0x6f txntype:-1 reqpath:n/a Error Path:/solr/live_nodes/127.0.0.1:39316_ts%2Fnc Error:KeeperErrorCode = NoNode for /solr/live_nodes/127.0.0.1:39316_ts%2Fnc
[junit4:junit4]   2> 10810 T30 oascc.SolrZkClient.makePath makePath: /live_nodes/127.0.0.1:39316_ts%2Fnc
[junit4:junit4]   2> 10813 T72 oascc.ZkStateReader$2.process A cluster state change: WatchedEvent state:SyncConnected type:NodeChildrenChanged path:/live_nodes, has occurred - updating... (live nodes size: 2)
[junit4:junit4]   2> 10814 T53 oascc.ZkStateReader$3.process Updating live nodes... (3)
[junit4:junit4]   2> 10814 T59 oascc.ZkStateReader$3.process Updating live nodes... (3)
[junit4:junit4]   2> 10814 T53 oascc.ZkStateReader$2.process A cluster state change: WatchedEvent state:SyncConnected type:NodeChildrenChanged path:/live_nodes, has occurred - updating... (live nodes size: 3)
[junit4:junit4]   2> 10815 T59 oascc.ZkStateReader$2.process A cluster state change: WatchedEvent state:SyncConnected type:NodeChildrenChanged path:/live_nodes, has occurred - updating... (live nodes size: 3)
[junit4:junit4]   2> 10817 T72 oascc.ZkStateReader$3.process Updating live nodes... (3)
[junit4:junit4]   2> 10820 T30 oascc.ZkStateReader.createClusterStateWatchersAndUpdate Updating cluster state from ZooKeeper... 
[junit4:junit4]   2> 10829 T88 oasc.CoreContainer.create Creating SolrCore 'collection1' using instanceDir: /usr/home/hudson/hudson-slave/workspace/Lucene-Solr-Tests-4.x-Java6/solr/build/solr-core/test/J0/./org.apache.solr.cloud.SyncSliceTest-jetty2-1359700594095/collection1
[junit4:junit4]   2> 10830 T88 oasc.ZkController.createCollectionZkNode Check for collection zkNode:collection1
[junit4:junit4]   2> 10831 T88 oasc.ZkController.createCollectionZkNode Collection zkNode exists
[junit4:junit4]   2> 10831 T88 oasc.ZkController.readConfigName Load collection config from:/collections/collection1
[junit4:junit4]   2> 10833 T88 oasc.SolrResourceLoader.<init> new SolrResourceLoader for directory: '/usr/home/hudson/hudson-slave/workspace/Lucene-Solr-Tests-4.x-Java6/solr/build/solr-core/test/J0/./org.apache.solr.cloud.SyncSliceTest-jetty2-1359700594095/collection1/'
[junit4:junit4]   2> 10835 T88 oasc.SolrResourceLoader.replaceClassLoader Adding 'file:/usr/home/hudson/hudson-slave/workspace/Lucene-Solr-Tests-4.x-Java6/solr/build/solr-core/test/J0/org.apache.solr.cloud.SyncSliceTest-jetty2-1359700594095/collection1/lib/README' to classloader
[junit4:junit4]   2> 10836 T88 oasc.SolrResourceLoader.replaceClassLoader Adding 'file:/usr/home/hudson/hudson-slave/workspace/Lucene-Solr-Tests-4.x-Java6/solr/build/solr-core/test/J0/org.apache.solr.cloud.SyncSliceTest-jetty2-1359700594095/collection1/lib/classes/' to classloader
[junit4:junit4]   2> 10906 T88 oasc.SolrConfig.<init> Using Lucene MatchVersion: LUCENE_42
[junit4:junit4]   2> 10988 T88 oasc.SolrConfig.<init> Loaded SolrConfig: solrconfig.xml
[junit4:junit4]   2> 11089 T88 oass.IndexSchema.readSchema Reading Solr Schema
[junit4:junit4]   2> 11111 T88 oass.IndexSchema.readSchema Schema name=test
[junit4:junit4]   2> 11823 T88 oass.OpenExchangeRatesOrgProvider.init Initialized with rates=open-exchange-rates.json, refreshInterval=1440.
[junit4:junit4]   2> 11839 T88 oass.IndexSchema.readSchema default search field in schema is text
[junit4:junit4]   2> 11843 T88 oass.IndexSchema.readSchema unique key field: id
[junit4:junit4]   2> 11875 T88 oass.FileExchangeRateProvider.reload Reloading exchange rates from file currency.xml
[junit4:junit4]   2> 11882 T88 oass.FileExchangeRateProvider.reload Reloading exchange rates from file currency.xml
[junit4:junit4]   2> 11894 T88 oass.OpenExchangeRatesOrgProvider.reload Reloading exchange rates from open-exchange-rates.json
[junit4:junit4]   2> 11898 T88 oass.OpenExchangeRatesOrgProvider.reload Reloading exchange rates from open-exchange-rates.json
[junit4:junit4]   2> 11901 T88 oasc.SolrCore.<init> [collection1] Opening new SolrCore at /usr/home/hudson/hudson-slave/workspace/Lucene-Solr-Tests-4.x-Java6/solr/build/solr-core/test/J0/./org.apache.solr.cloud.SyncSliceTest-jetty2-1359700594095/collection1/, dataDir=./org.apache.solr.cloud.SyncSliceTest-1359700583526/jetty2/
[junit4:junit4]   2> 11901 T88 oasc.JmxMonitoredMap.<init> JMX monitoring is enabled. Adding Solr mbeans to JMX Server: com.sun.jmx.mbeanserver.JmxMBeanServer@2658dd2d
[junit4:junit4]   2> 11903 T88 oasc.SolrCore.initDirectoryFactory solr.NRTCachingDirectoryFactory
[junit4:junit4]   2> 11904 T88 oasc.CachingDirectoryFactory.get return new directory for /usr/home/hudson/hudson-slave/workspace/Lucene-Solr-Tests-4.x-Java6/solr/build/solr-core/test/J0/./org.apache.solr.cloud.SyncSliceTest-1359700583526/jetty2 forceNew:false
[junit4:junit4]   2> 11905 T88 oasc.CachingDirectoryFactory.close Releasing directory:/usr/home/hudson/hudson-slave/workspace/Lucene-Solr-Tests-4.x-Java6/solr/build/solr-core/test/J0/./org.apache.solr.cloud.SyncSliceTest-1359700583526/jetty2
[junit4:junit4]   2> 11905 T88 oasc.SolrCore.getNewIndexDir New index directory detected: old=null new=./org.apache.solr.cloud.SyncSliceTest-1359700583526/jetty2/index/
[junit4:junit4]   2> 11906 T88 oasc.SolrCore.initIndex WARNING [collection1] Solr index directory './org.apache.solr.cloud.SyncSliceTest-1359700583526/jetty2/index' doesn't exist. Creating new index...
[junit4:junit4]   2> 11907 T88 oasc.CachingDirectoryFactory.get return new directory for /usr/home/hudson/hudson-slave/workspace/Lucene-Solr-Tests-4.x-Java6/solr/build/solr-core/test/J0/./org.apache.solr.cloud.SyncSliceTest-1359700583526/jetty2/index forceNew:false
[junit4:junit4]   2> 11946 T88 oasc.SolrDeletionPolicy.onCommit SolrDeletionPolicy.onCommit: commits:num=1
[junit4:junit4]   2> 		commit{dir=RateLimitedDirectoryWrapper(NRTCachingDirectory(org.apache.lucene.store.NIOFSDirectory@/usr/home/hudson/hudson-slave/workspace/Lucene-Solr-Tests-4.x-Java6/solr/build/solr-core/test/J0/org.apache.solr.cloud.SyncSliceTest-1359700583526/jetty2/index lockFactory=org.apache.lucene.store.NativeFSLockFactory@2d11f5f1; maxCacheMB=48.0 maxMergeSizeMB=4.0)),segFN=segments_1,generation=1,filenames=[segments_1]
[junit4:junit4]   2> 11947 T88 oasc.SolrDeletionPolicy.updateCommits newest commit = 1[segments_1]
[junit4:junit4]   2> 11948 T88 oasc.CachingDirectoryFactory.close Releasing directory:/usr/home/hudson/hudson-slave/workspace/Lucene-Solr-Tests-4.x-Java6/solr/build/solr-core/test/J0/./org.apache.solr.cloud.SyncSliceTest-1359700583526/jetty2/index
[junit4:junit4]   2> 11949 T88 oasc.SolrCore.initWriters created xml: solr.XMLResponseWriter
[junit4:junit4]   2> 11953 T88 oasup.UpdateRequestProcessorChain.init inserting DistributedUpdateProcessorFactory into updateRequestProcessorChain "dedupe"
[junit4:junit4]   2> 11953 T88 oasup.UpdateRequestProcessorChain.init inserting DistributedUpdateProcessorFactory into updateRequestProcessorChain "dedupe-allfields"
[junit4:junit4]   2> 11954 T88 oasup.UpdateRequestProcessorChain.init inserting DistributedUpdateProcessorFactory into updateRequestProcessorChain "stored_sig"
[junit4:junit4]   2> 11954 T88 oasup.UpdateRequestProcessorChain.init inserting DistributedUpdateProcessorFactory into updateRequestProcessorChain "uniq-fields"
[junit4:junit4]   2> 11956 T88 oasup.UpdateRequestProcessorChain.init inserting DistributedUpdateProcessorFactory into updateRequestProcessorChain "distrib-dup-test-chain-implicit"
[junit4:junit4]   2> 11956 T88 oasc.RequestHandlers.initHandlersFromConfig adding lazy requestHandler: solr.ReplicationHandler
[junit4:junit4]   2> 11957 T88 oasc.RequestHandlers.initHandlersFromConfig created /replication: solr.ReplicationHandler
[junit4:junit4]   2> 11958 T88 oasc.RequestHandlers.initHandlersFromConfig created standard: solr.StandardRequestHandler
[junit4:junit4]   2> 11959 T88 oasc.RequestHandlers.initHandlersFromConfig created /get: solr.RealTimeGetHandler
[junit4:junit4]   2> 11960 T88 oasc.RequestHandlers.initHandlersFromConfig created dismax: solr.SearchHandler
[junit4:junit4]   2> 11962 T88 oasc.RequestHandlers.initHandlersFromConfig created mock: org.apache.solr.core.MockQuerySenderListenerReqHandler
[junit4:junit4]   2> 11962 T88 oasc.RequestHandlers.initHandlersFromConfig created /admin/: org.apache.solr.handler.admin.AdminHandlers
[junit4:junit4]   2> 11964 T88 oasc.RequestHandlers.initHandlersFromConfig created defaults: solr.StandardRequestHandler
[junit4:junit4]   2> 11964 T88 oasc.RequestHandlers.initHandlersFromConfig adding lazy requestHandler: solr.StandardRequestHandler
[junit4:junit4]   2> 11965 T88 oasc.RequestHandlers.initHandlersFromConfig created lazy: solr.StandardRequestHandler
[junit4:junit4]   2> 11966 T88 oasc.RequestHandlers.initHandlersFromConfig created /update: solr.UpdateRequestHandler
[junit4:junit4]   2> 11967 T88 oasc.RequestHandlers.initHandlersFromConfig created /terms: org.apache.solr.handler.component.SearchHandler
[junit4:junit4]   2> 11968 T88 oasc.RequestHandlers.initHandlersFromConfig created spellCheckCompRH: org.apache.solr.handler.component.SearchHandler
[junit4:junit4]   2> 11969 T88 oasc.RequestHandlers.initHandlersFromConfig created spellCheckCompRH_Direct: org.apache.solr.handler.component.SearchHandler
[junit4:junit4]   2> 11970 T88 oasc.RequestHandlers.initHandlersFromConfig created spellCheckWithWordbreak: org.apache.solr.handler.component.SearchHandler
[junit4:junit4]   2> 11971 T88 oasc.RequestHandlers.initHandlersFromConfig created spellCheckWithWordbreak_Direct: org.apache.solr.handler.component.SearchHandler
[junit4:junit4]   2> 11973 T88 oasc.RequestHandlers.initHandlersFromConfig created spellCheckCompRH1: org.apache.solr.handler.component.SearchHandler
[junit4:junit4]   2> 11974 T88 oasc.RequestHandlers.initHandlersFromConfig created mltrh: org.apache.solr.handler.component.SearchHandler
[junit4:junit4]   2> 11975 T88 oasc.RequestHandlers.initHandlersFromConfig created tvrh: org.apache.solr.handler.component.SearchHandler
[junit4:junit4]   2> 11976 T88 oasc.RequestHandlers.initHandlersFromConfig created /mlt: solr.MoreLikeThisHandler
[junit4:junit4]   2> 11978 T88 oasc.RequestHandlers.initHandlersFromConfig created /debug/dump: solr.DumpRequestHandler
[junit4:junit4]   2> 11985 T88 oashl.XMLLoader.init xsltCacheLifetimeSeconds=60
[junit4:junit4]   2> 11990 T88 oasc.SolrCore.initDeprecatedSupport WARNING solrconfig.xml uses deprecated <admin/gettableFiles>, Please update your config to use the ShowFileRequestHandler.
[junit4:junit4]   2> 11992 T88 oasc.SolrCore.initDeprecatedSupport WARNING adding ShowFileRequestHandler with hidden files: [SCHEMA.XML, OLD_SYNONYMS.TXT, STOPWORDS.TXT, PROTWORDS.TXT, OPEN-EXCHANGE-RATES.JSON, SYNONYMS.TXT, CURRENCY.XML, MAPPING-ISOLATIN1ACCENT.TXT]
[junit4:junit4]   2> 11995 T88 oasc.CachingDirectoryFactory.close Releasing directory:/usr/home/hudson/hudson-slave/workspace/Lucene-Solr-Tests-4.x-Java6/solr/build/solr-core/test/J0/./org.apache.solr.cloud.SyncSliceTest-1359700583526/jetty2
[junit4:junit4]   2> 11998 T88 oass.SolrIndexSearcher.<init> Opening Searcher@50a5314 main
[junit4:junit4]   2> 11999 T88 oasu.CommitTracker.<init> Hard AutoCommit: disabled
[junit4:junit4]   2> 12000 T88 oasu.CommitTracker.<init> Soft AutoCommit: disabled
[junit4:junit4]   2> 12001 T88 oashc.SpellCheckComponent.inform Initializing spell checkers
[junit4:junit4]   2> 12024 T88 oass.DirectSolrSpellChecker.init init: {name=direct,classname=DirectSolrSpellChecker,field=lowerfilt,minQueryLength=3}
[junit4:junit4]   2> 12030 T54 oascc.ZkStateReader.updateClusterState Updating cloud state from ZooKeeper... 
[junit4:junit4]   2> 12031 T54 oasc.Overseer$ClusterStateUpdater.updateState Update state numShards=1 message={
[junit4:junit4]   2> 	  "operation":"state",
[junit4:junit4]   2> 	  "numShards":"1",
[junit4:junit4]   2> 	  "shard":"shard1",
[junit4:junit4]   2> 	  "roles":null,
[junit4:junit4]   2> 	  "state":"active",
[junit4:junit4]   2> 	  "core":"collection1",
[junit4:junit4]   2> 	  "collection":"collection1",
[junit4:junit4]   2> 	  "node_name":"127.0.0.1:52046_ts%2Fnc",
[junit4:junit4]   2> 	  "base_url":"http://127.0.0.1:52046/ts/nc"}
[junit4:junit4]   2> 12158 T53 oascc.ZkStateReader$2.process A cluster state change: WatchedEvent state:SyncConnected type:NodeDataChanged path:/clusterstate.json, has occurred - updating... (live nodes size: 3)
[junit4:junit4]   2> 12158 T87 oascc.ZkStateReader$2.process A cluster state change: WatchedEvent state:SyncConnected type:NodeDataChanged path:/clusterstate.json, has occurred - updating... (live nodes size: 3)
[junit4:junit4]   2> 12158 T72 oascc.ZkStateReader$2.process A cluster state change: WatchedEvent state:SyncConnected type:NodeDataChanged path:/clusterstate.json, has occurred - updating... (live nodes size: 3)
[junit4:junit4]   2> 12158 T59 oascc.ZkStateReader$2.process A cluster state change: WatchedEvent state:SyncConnected type:NodeDataChanged path:/clusterstate.json, has occurred - updating... (live nodes size: 3)
[junit4:junit4]   2> 12193 T89 oasc.SolrCore.registerSearcher [collection1] Registered new searcher Searcher@50a5314 main{StandardDirectoryReader(segments_1:1)}
[junit4:junit4]   2> 12202 T88 oasc.ZkController.publish publishing core=collection1 state=down
[junit4:junit4]   2> 12202 T88 oasc.ZkController.publish numShards not found on descriptor - reading it from system property
[junit4:junit4]   2> 13673 T54 oascc.ZkStateReader.updateClusterState Updating cloud state from ZooKeeper... 
[junit4:junit4]   2> 13675 T54 oasc.Overseer$ClusterStateUpdater.updateState Update state numShards=1 message={
[junit4:junit4]   2> 	  "operation":"state",
[junit4:junit4]   2> 	  "numShards":"1",
[junit4:junit4]   2> 	  "shard":null,
[junit4:junit4]   2> 	  "roles":null,
[junit4:junit4]   2> 	  "state":"down",
[junit4:junit4]   2> 	  "core":"collection1",
[junit4:junit4]   2> 	  "collection":"collection1",
[junit4:junit4]   2> 	  "node_name":"127.0.0.1:39316_ts%2Fnc",
[junit4:junit4]   2> 	  "base_url":"http://127.0.0.1:39316/ts/nc"}
[junit4:junit4]   2> 13675 T54 oasc.Overseer$ClusterStateUpdater.updateState Collection already exists with numShards=1
[junit4:junit4]   2> 13675 T54 oasc.Overseer$ClusterStateUpdater.updateState Assigning new node to shard shard=shard1
[junit4:junit4]   2> 13684 T72 oascc.ZkStateReader$2.process A cluster state change: WatchedEvent state:SyncConnected type:NodeDataChanged path:/clusterstate.json, has occurred - updating... (live nodes size: 3)
[junit4:junit4]   2> 13684 T59 oascc.ZkStateReader$2.process A cluster state change: WatchedEvent state:SyncConnected type:NodeDataChanged path:/clusterstate.json, has occurred - updating... (live nodes size: 3)
[junit4:junit4]   2> 13684 T87 oascc.ZkStateReader$2.process A cluster state change: WatchedEvent state:SyncConnected type:NodeDataChanged path:/clusterstate.json, has occurred - updating... (live nodes size: 3)
[junit4:junit4]   2> 13684 T53 oascc.ZkStateReader$2.process A cluster state change: WatchedEvent state:SyncConnected type:NodeDataChanged path:/clusterstate.json, has occurred - updating... (live nodes size: 3)
[junit4:junit4]   2> 14206 T88 oasc.CoreContainer.registerCore registering core: collection1
[junit4:junit4]   2> 14206 T88 oasc.ZkController.register Register replica - core:collection1 address:http://127.0.0.1:39316/ts/nc collection:collection1 shard:shard1
[junit4:junit4]   2> 14213 T88 oasc.ZkController.register We are http://127.0.0.1:39316/ts/nc/collection1/ and leader is http://127.0.0.1:52046/ts/nc/collection1/
[junit4:junit4]   2> 14213 T88 oasc.ZkController.register No LogReplay needed for core=collection1 baseURL=http://127.0.0.1:39316/ts/nc
[junit4:junit4]   2> 14214 T88 oasc.ZkController.checkRecovery Core needs to recover:collection1
[junit4:junit4]   2> 14214 T88 oasu.DefaultSolrCoreState.doRecovery Running recovery - first canceling any ongoing recovery
[junit4:junit4]   2> ASYNC  NEW_CORE C5 name=collection1 org.apache.solr.core.SolrCore@7ea06d25 url=http://127.0.0.1:39316/ts/nc/collection1 node=127.0.0.1:39316_ts%2Fnc C5_STATE=coll:collection1 core:collection1 props:{shard=null, roles=null, state=down, core=collection1, collection=collection1, node_name=127.0.0.1:39316_ts%2Fnc, base_url=http://127.0.0.1:39316/ts/nc}
[junit4:junit4]   2> 14221 T90 C5 P39316 oasc.RecoveryStrategy.run Starting recovery process.  core=collection1 recoveringAfterStartup=true
[junit4:junit4]   2> 14222 T88 oascc.ZkStateReader.updateClusterState Updating cloud state from ZooKeeper... 
[junit4:junit4]   2> 14222 T90 C5 P39316 oasc.RecoveryStrategy.doRecovery ###### startupVersions=[]
[junit4:junit4]   2> 14223 T90 C5 P39316 oasc.ZkController.publish publishing core=collection1 state=recovering
[junit4:junit4]   2> 14223 T90 C5 P39316 oasc.ZkController.publish numShards not found on descriptor - reading it from system property
[junit4:junit4]   2> 14224 T30 oass.SolrDispatchFilter.init user.dir=/usr/home/hudson/hudson-slave/workspace/Lucene-Solr-Tests-4.x-Java6/solr/build/solr-core/test/J0
[junit4:junit4]   2> 14225 T30 oass.SolrDispatchFilter.init SolrDispatchFilter.init() done
[junit4:junit4]   2> 14225 T30 oascsi.HttpClientUtil.createClient Creating new http client, config:maxConnections=128&maxConnectionsPerHost=32&followRedirects=false
[junit4:junit4]   2> 14226 T90 C5 P39316 oascsi.HttpClientUtil.createClient Creating new http client, config:maxConnections=128&maxConnectionsPerHost=32&followRedirects=false
[junit4:junit4]   2> 14453 T30 oejs.Server.doStart jetty-8.1.8.v20121106
[junit4:junit4]   2> 14460 T30 oejs.AbstractConnector.doStart Started SocketConnector@127.0.0.1:45380
[junit4:junit4]   2> 14461 T30 oass.SolrDispatchFilter.init SolrDispatchFilter.init()
[junit4:junit4]   2> 14462 T30 oasc.SolrResourceLoader.locateSolrHome JNDI not configured for solr (NoInitialContextEx)
[junit4:junit4]   2> 14462 T30 oasc.SolrResourceLoader.locateSolrHome using system property solr.solr.home: /usr/home/hudson/hudson-slave/workspace/Lucene-Solr-Tests-4.x-Java6/solr/build/solr-core/test/J0/./org.apache.solr.cloud.SyncSliceTest-jetty3-1359700597766
[junit4:junit4]   2> 14463 T30 oasc.CoreContainer$Initializer.initialize looking for solr.xml: /usr/home/hudson/hudson-slave/workspace/Lucene-Solr-Tests-4.x-Java6/solr/build/solr-core/test/J0/./org.apache.solr.cloud.SyncSliceTest-jetty3-1359700597766/solr.xml
[junit4:junit4]   2> 14464 T30 oasc.CoreContainer.<init> New CoreContainer 12429675
[junit4:junit4]   2> 14465 T30 oasc.CoreContainer.load Loading CoreContainer using Solr Home: '/usr/home/hudson/hudson-slave/workspace/Lucene-Solr-Tests-4.x-Java6/solr/build/solr-core/test/J0/./org.apache.solr.cloud.SyncSliceTest-jetty3-1359700597766/'
[junit4:junit4]   2> 14465 T30 oasc.SolrResourceLoader.<init> new SolrResourceLoader for directory: '/usr/home/hudson/hudson-slave/workspace/Lucene-Solr-Tests-4.x-Java6/solr/build/solr-core/test/J0/./org.apache.solr.cloud.SyncSliceTest-jetty3-1359700597766/'
[junit4:junit4]   2> 14681 T30 oashc.HttpShardHandlerFactory.getParameter Setting socketTimeout to: 60000
[junit4:junit4]   2> 14682 T30 oashc.HttpShardHandlerFactory.getParameter Setting urlScheme to: http://
[junit4:junit4]   2> 14682 T30 oashc.HttpShardHandlerFactory.getParameter Setting connTimeout to: 15000
[junit4:junit4]   2> 14683 T30 oashc.HttpShardHandlerFactory.getParameter Setting maxConnectionsPerHost to: 20
[junit4:junit4]   2> 14683 T30 oashc.HttpShardHandlerFactory.getParameter Setting corePoolSize to: 0
[junit4:junit4]   2> 14684 T30 oashc.HttpShardHandlerFactory.getParameter Setting maximumPoolSize to: 2147483647
[junit4:junit4]   2> 14684 T30 oashc.HttpShardHandlerFactory.getParameter Setting maxThreadIdleTime to: 5
[junit4:junit4]   2> 14685 T30 oashc.HttpShardHandlerFactory.getParameter Setting sizeOfQueue to: -1
[junit4:junit4]   2> 14685 T30 oashc.HttpShardHandlerFactory.getParameter Setting fairnessPolicy to: false
[junit4:junit4]   2> 14686 T30 oascsi.HttpClientUtil.createClient Creating new http client, config:maxConnectionsPerHost=20&maxConnections=10000&socketTimeout=60000&connTimeout=15000&retry=false
[junit4:junit4]   2> 14736 T30 oasc.CoreContainer.load Registering Log Listener
[junit4:junit4]   2> 14861 T30 oasc.CoreContainer.initZooKeeper Zookeeper client=127.0.0.1:46809/solr
[junit4:junit4]   2> 14862 T30 oasc.ZkController.checkChrootPath zkHost includes chroot
[junit4:junit4]   2> 14862 T30 oaz.ZooKeeper.<init> Initiating client connection, connectString=127.0.0.1:46809 sessionTimeout=60000 watcher=org.apache.solr.common.cloud.ConnectionManager@5ced6f0d
[junit4:junit4]   2> 14863 T30 oascc.ConnectionManager.waitForConnected Waiting for client to connect to ZooKeeper
[junit4:junit4]   2> 14864 T100 oaz.ClientCnxn$SendThread.logStartConnect Opening socket connection to server localhost/127.0.0.1:46809. Will not attempt to authenticate using SASL (access denied (javax.security.auth.AuthPermission getLoginConfiguration))
[junit4:junit4]   2> 14865 T100 oaz.ClientCnxn$SendThread.primeConnection Socket connection established to localhost/127.0.0.1:46809, initiating session
[junit4:junit4]   2> 14865 T32 oazs.NIOServerCnxnFactory.run Accepted socket connection from /140.211.11.196:61044
[junit4:junit4]   2> 14866 T32 oazs.ZooKeeperServer.processConnectRequest Client attempting to establish new session at /140.211.11.196:61044
[junit4:junit4]   2> 14870 T34 oazs.ZooKeeperServer.finishSessionInit Established session 0x13c947865990009 with negotiated timeout 20000 for client /140.211.11.196:61044
[junit4:junit4]   2> 14870 T100 oaz.ClientCnxn$SendThread.onConnected Session establishment complete on server localhost/127.0.0.1:46809, sessionid = 0x13c947865990009, negotiated timeout = 20000
[junit4:junit4]   2> 14870 T101 oascc.ConnectionManager.process Watcher org.apache.solr.common.cloud.ConnectionManager@5ced6f0d name:ZooKeeperConnection Watcher:127.0.0.1:46809 got event WatchedEvent state:SyncConnected type:None path:null path:null type:None
[junit4:junit4]   2> 14871 T30 oascc.ConnectionManager.waitForConnected Client is connected to ZooKeeper
[junit4:junit4]   2> 14873 T35 oazs.PrepRequestProcessor.pRequest2Txn Processed session termination for sessionid: 0x13c947865990009
[junit4:junit4]   2> 14874 T101 oaz.ClientCnxn$EventThread.run EventThread shut down
[junit4:junit4]   2> 14875 T32 oazs.NIOServerCnxn.closeSock Closed socket connection for client /140.211.11.196:61044 which had sessionid 0x13c947865990009
[junit4:junit4]   2> 14874 T30 oaz.ZooKeeper.close Session: 0x13c947865990009 closed
[junit4:junit4]   2> 14876 T30 oascsi.HttpClientUtil.createClient Creating new http client, config:maxConnections=500&maxConnectionsPerHost=16&socketTimeout=60000&connTimeout=15000
[junit4:junit4]   2> 14896 T30 oaz.ZooKeeper.<init> Initiating client connection, connectString=127.0.0.1:46809/solr sessionTimeout=30000 watcher=org.apache.solr.common.cloud.ConnectionManager@6a3522b5
[junit4:junit4]   2> 14897 T30 oascc.ConnectionManager.waitForConnected Waiting for client to connect to ZooKeeper
[junit4:junit4]   2> 14897 T102 oaz.ClientCnxn$SendThread.logStartConnect Opening socket connection to server localhost/127.0.0.1:46809. Will not attempt to authenticate using SASL (access denied (javax.security.auth.AuthPermission getLoginConfiguration))
[junit4:junit4]   2> 14898 T102 oaz.ClientCnxn$SendThread.primeConnection Socket connection established to localhost/127.0.0.1:46809, initiating session
[junit4:junit4]   2> 14898 T32 oazs.NIOServerCnxnFactory.run Accepted socket connection from /140.211.11.196:50565
[junit4:junit4]   2> 14899 T32 oazs.ZooKeeperServer.processConnectRequest Client attempting to establish new session at /140.211.11.196:50565
[junit4:junit4]   2> 14900 T34 oazs.ZooKeeperServer.finishSessionInit Established session 0x13c94786599000a with negotiated timeout 20000 for client /140.211.11.196:50565
[junit4:junit4]   2> 14900 T102 oaz.ClientCnxn$SendThread.onConnected Session establishment complete on server localhost/127.0.0.1:46809, sessionid = 0x13c94786599000a, negotiated timeout = 20000
[junit4:junit4]   2> 14901 T103 oascc.ConnectionManager.process Watcher org.apache.solr.common.cloud.ConnectionManager@6a3522b5 name:ZooKeeperConnection Watcher:127.0.0.1:46809/solr got event WatchedEvent state:SyncConnected type:None path:null path:null type:None
[junit4:junit4]   2> 14901 T30 oascc.ConnectionManager.waitForConnected Client is connected to ZooKeeper
[junit4:junit4]   2> 14903 T35 oazs.PrepRequestProcessor.pRequest Got user-level KeeperException when processing sessionid:0x13c94786599000a type:create cxid:0x1 zxid:0x80 txntype:-1 reqpath:n/a Error Path:/solr/overseer Error:KeeperErrorCode = NodeExists for /solr/overseer
[junit4:junit4]   2> 14905 T35 oazs.PrepRequestProcessor.pRequest Got user-level KeeperException when processing sessionid:0x13c94786599000a type:create cxid:0x2 zxid:0x81 txntype:-1 reqpath:n/a Error Path:/solr/overseer Error:KeeperErrorCode = NodeExists for /solr/overseer
[junit4:junit4]   2> 14907 T30 oasc.ZkController.createEphemeralLiveNode Register node as live in ZooKeeper:/live_nodes/127.0.0.1:45380_ts%2Fnc
[junit4:junit4]   2> 14908 T35 oazs.PrepRequestProcessor.pRequest Got user-level KeeperException when processing sessionid:0x13c94786599000a type:delete cxid:0x4 zxid:0x82 txntype:-1 reqpath:n/a Error Path:/solr/live_nodes/127.0.0.1:45380_ts%2Fnc Error:KeeperErrorCode = NoNode for /solr/live_nodes/127.0.0.1:45380_ts%2Fnc
[junit4:junit4]   2> 14916 T30 oascc.SolrZkClient.makePath makePath: /live_nodes/127.0.0.1:45380_ts%2Fnc
[junit4:junit4]   2> 14920 T72 oascc.ZkStateReader$2.process A cluster state change: WatchedEvent state:SyncConnected type:NodeChildrenChanged path:/live_nodes, has occurred - updating... (live nodes size: 3)
[junit4:junit4]   2> 14920 T87 oascc.ZkStateReader$2.process A cluster state change: WatchedEvent state:SyncConnected type:NodeChildrenChanged path:/live_nodes, has occurred - updating... (live nodes size: 3)
[junit4:junit4]   2> 14921 T53 oascc.ZkStateReader$3.process Updating live nodes... (4)
[junit4:junit4]   2> 14921 T59 oascc.ZkStateReader$3.process Updating live nodes... (4)
[junit4:junit4]   2> 14921 T53 oascc.ZkStateReader$2.process A cluster state change: WatchedEvent state:SyncConnected type:NodeChildrenChanged path:/live_nodes, has occurred - updating... (live nodes size: 4)
[junit4:junit4]   2> 14921 T59 oascc.ZkStateReader$2.process A cluster state change: WatchedEvent state:SyncConnected type:NodeChildrenChanged path:/live_nodes, has occurred - updating... (live nodes size: 4)
[junit4:junit4]   2> 14924 T87 oascc.ZkStateReader$3.process Updating live nodes... (4)
[junit4:junit4]   2> 14924 T72 oascc.ZkStateReader$3.process Updating live nodes... (4)
[junit4:junit4]   2> 14928 T30 oascc.ZkStateReader.createClusterStateWatchersAndUpdate Updating cluster state from ZooKeeper... 
[junit4:junit4]   2> 14952 T104 oasc.CoreContainer.create Creating SolrCore 'collection1' using instanceDir: /usr/home/hudson/hudson-slave/workspace/Lucene-Solr-Tests-4.x-Java6/solr/build/solr-core/test/J0/./org.apache.solr.cloud.SyncSliceTest-jetty3-1359700597766/collection1
[junit4:junit4]   2> 14952 T104 oasc.ZkController.createCollectionZkNode Check for collection zkNode:collection1
[junit4:junit4]   2> 14954 T104 oasc.ZkController.createCollectionZkNode Collection zkNode exists
[junit4:junit4]   2> 14954 T104 oasc.ZkController.readConfigName Load collection config from:/collections/collection1
[junit4:junit4]   2> 14956 T104 oasc.SolrResourceLoader.<init> new SolrResourceLoader for directory: '/usr/home/hudson/hudson-slave/workspace/Lucene-Solr-Tests-4.x-Java6/solr/build/solr-core/test/J0/./org.apache.solr.cloud.SyncSliceTest-jetty3-1359700597766/collection1/'
[junit4:junit4]   2> 14958 T104 oasc.SolrResourceLoader.replaceClassLoader Adding 'file:/usr/home/hudson/hudson-slave/workspace/Lucene-Solr-Tests-4.x-Java6/solr/build/solr-core/test/J0/org.apache.solr.cloud.SyncSliceTest-jetty3-1359700597766/collection1/lib/README' to classloader
[junit4:junit4]   2> 14959 T104 oasc.SolrResourceLoader.replaceClassLoader Adding 'file:/usr/home/hudson/hudson-slave/workspace/Lucene-Solr-Tests-4.x-Java6/solr/build/solr-core/test/J0/org.apache.solr.cloud.SyncSliceTest-jetty3-1359700597766/collection1/lib/classes/' to classloader
[junit4:junit4]   2> 15193 T54 oascc.ZkStateReader.updateClusterState Updating cloud state from ZooKeeper... 
[junit4:junit4]   2> 15194 T54 oasc.Overseer$ClusterStateUpdater.updateState Update state numShards=1 message={
[junit4:junit4]   2> 	  "operation":"state",
[junit4:junit4]   2> 	  "numShards":"1",
[junit4:junit4]   2> 	  "shard":"shard1",
[junit4:junit4]   2> 	  "roles":null,
[junit4:junit4]   2> 	  "state":"recovering",
[junit4:junit4]   2> 	  "core":"collection1",
[junit4:junit4]   2> 	  "collection":"collection1",
[junit4:junit4]   2> 	  "node_name":"127.0.0.1:39316_ts%2Fnc",
[junit4:junit4]   2> 	  "base_url":"http://127.0.0.1:39316/ts/nc"}
[junit4:junit4]   2> 15209 T72 oascc.ZkStateReader$2.process A cluster state change: WatchedEvent state:SyncConnected type:NodeDataChanged path:/clusterstate.json, has occurred - updating... (live nodes size: 4)
[junit4:junit4]   2> 15209 T103 oascc.ZkStateReader$2.process A cluster state change: WatchedEvent state:SyncConnected type:NodeDataChanged path:/clusterstate.json, has occurred - updating... (live nodes size: 4)
[junit4:junit4]   2> 15209 T87 oascc.ZkStateReader$2.process A cluster state change: WatchedEvent state:SyncConnected type:NodeDataChanged path:/clusterstate.json, has occurred - updating... (live nodes size: 4)
[junit4:junit4]   2> 15209 T53 oascc.ZkStateReader$2.process A cluster state change: WatchedEvent state:SyncConnected type:NodeDataChanged path:/clusterstate.json, has occurred - updating... (live nodes size: 4)
[junit4:junit4]   2> 15209 T59 oascc.ZkStateReader$2.process A cluster state change: WatchedEvent state:SyncConnected type:NodeDataChanged path:/clusterstate.json, has occurred - updating... (live nodes size: 4)
[junit4:junit4]   2> 15537 T104 oasc.SolrConfig.<init> Using Lucene MatchVersion: LUCENE_42
[junit4:junit4]   2> 15700 T104 oasc.SolrConfig.<init> Loaded SolrConfig: solrconfig.xml
[junit4:junit4]   2> 15801 T104 oass.IndexSchema.readSchema Reading Solr Schema
[junit4:junit4]   2> 15822 T104 oass.IndexSchema.readSchema Schema name=test
[junit4:junit4]   2> 16463 T104 oass.OpenExchangeRatesOrgProvider.init Initialized with rates=open-exchange-rates.json, refreshInterval=1440.
[junit4:junit4]   2> 16478 T104 oass.IndexSchema.readSchema default search field in schema is text
[junit4:junit4]   2> 16483 T104 oass.IndexSchema.readSchema unique key field: id
[junit4:junit4]   2> 16513 T104 oass.FileExchangeRateProvider.reload Reloading exchange rates from file currency.xml
[junit4:junit4]   2> 16520 T104 oass.FileExchangeRateProvider.reload Reloading exchange rates from file currency.xml
[junit4:junit4]   2> 16526 T104 oass.OpenExchangeRatesOrgProvider.reload Reloading exchange rates from open-exchange-rates.json
[junit4:junit4]   2> 16528 T104 oass.OpenExchangeRatesOrgProvider.reload Reloading exchange rates from open-exchange-rates.json
[junit4:junit4]   2> 16531 T104 oasc.SolrCore.<init> [collection1] Opening new SolrCore at /usr/home/hudson/hudson-slave/workspace/Lucene-Solr-Tests-4.x-Java6/solr/build/solr-core/test/J0/./org.apache.solr.cloud.SyncSliceTest-jetty3-1359700597766/collection1/, dataDir=./org.apache.solr.cloud.SyncSliceTest-1359700583526/jetty3/
[junit4:junit4]   2> 16532 T104 oasc.JmxMonitoredMap.<init> JMX monitoring is enabled. Adding Solr mbeans to JMX Server: com.sun.jmx.mbeanserver.JmxMBeanServer@2658dd2d
[junit4:junit4]   2> 16533 T104 oasc.SolrCore.initDirectoryFactory solr.NRTCachingDirectoryFactory
[junit4:junit4]   2> 16534 T104 oasc.CachingDirectoryFactory.get return new directory for /usr/home/hudson/hudson-slave/workspace/Lucene-Solr-Tests-4.x-Java6/solr/build/solr-core/test/J0/./org.apache.solr.cloud.SyncSliceTest-1359700583526/jetty3 forceNew:false
[junit4:junit4]   2> 16534 T104 oasc.CachingDirectoryFactory.close Releasing directory:/usr/home/hudson/hudson-slave/workspace/Lucene-Solr-Tests-4.x-Java6/solr/build/solr-core/test/J0/./org.apache.solr.cloud.SyncSliceTest-1359700583526/jetty3
[junit4:junit4]   2> 16535 T104 oasc.SolrCore.getNewIndexDir New index directory detected: old=null new=./org.apache.solr.cloud.SyncSliceTest-1359700583526/jetty3/index/
[junit4:junit4]   2> 16535 T104 oasc.SolrCore.initIndex WARNING [collection1] Solr index directory './org.apache.solr.cloud.SyncSliceTest-1359700583526/jetty3/index' doesn't exist. Creating new index...
[junit4:junit4]   2> 16536 T104 oasc.CachingDirectoryFactory.get return new directory for /usr/home/hudson/hudson-slave/workspace/Lucene-Solr-Tests-4.x-Java6/solr/build/solr-core/test/J0/./org.apache.solr.cloud.SyncSliceTest-1359700583526/jetty3/index forceNew:false
[junit4:junit4]   2> 16568 T104 oasc.SolrDeletionPolicy.onCommit SolrDeletionPolicy.onCommit: commits:num=1
[junit4:junit4]   2> 		commit{dir=RateLimitedDirectoryWrapper(NRTCachingDirectory(org.apache.lucene.store.NIOFSDirectory@/usr/home/hudson/hudson-slave/workspace/Lucene-Solr-Tests-4.x-Java6/solr/build/solr-core/test/J0/org.apache.solr.cloud.SyncSliceTest-1359700583526/jetty3/index lockFactory=org.apache.lucene.store.NativeFSLockFactory@761da8fc; maxCacheMB=48.0 maxMergeSizeMB=4.0)),segFN=segments_1,generation=1,filenames=[segments_1]
[junit4:junit4]   2> 16568 T104 oasc.SolrDeletionPolicy.updateCommits newest commit = 1[segments_1]
[junit4:junit4]   2> 16570 T104 oasc.CachingDirectoryFactory.close Releasing directory:/usr/home/hudson/hudson-slave/workspace/Lucene-Solr-Tests-4.x-Java6/solr/build/solr-core/test/J0/./org.apache.solr.cloud.SyncSliceTest-1359700583526/jetty3/index
[junit4:junit4]   2> 16570 T104 oasc.SolrCore.initWriters created xml: solr.XMLResponseWriter
[junit4:junit4]   2> 16573 T104 oasup.UpdateRequestProcessorChain.init inserting DistributedUpdateProcessorFactory into updateRequestProcessorChain "dedupe"
[junit4:junit4]   2> 16574 T104 oasup.UpdateRequestProcessorChain.init inserting DistributedUpdateProcessorFactory into updateRequestProcessorChain "dedupe-allfields"
[junit4:junit4]   2> 16574 T104 oasup.UpdateRequestProcessorChain.init inserting DistributedUpdateProcessorFactory into updateRequestProcessorChain "stored_sig"
[junit4:junit4]   2> 16575 T104 oasup.UpdateRequestProcessorChain.init inserting DistributedUpdateProcessorFactory into updateRequestProcessorChain "uniq-fields"
[junit4:junit4]   2> 16576 T104 oasup.UpdateRequestProcessorChain.init inserting DistributedUpdateProcessorFactory into updateRequestProcessorChain "distrib-dup-test-chain-implicit"
[junit4:junit4]   2> 16576 T104 oasc.RequestHandlers.initHandlersFromConfig adding lazy requestHandler: solr.ReplicationHandler
[junit4:junit4]   2> 16577 T104 oasc.RequestHandlers.initHandlersFromConfig created /replication: solr.ReplicationHandler
[junit4:junit4]   2> 16578 T104 oasc.RequestHandlers.initHandlersFromConfig created standard: solr.StandardRequestHandler
[junit4:junit4]   2> 16579 T104 oasc.RequestHandlers.initHandlersFromConfig created /get: solr.RealTimeGetHandler
[junit4:junit4]   2> 16579 T104 oasc.RequestHandlers.initHandlersFromConfig created dismax: solr.SearchHandler
[junit4:junit4]   2> 16580 T104 oasc.RequestHandlers.initHandlersFromConfig created mock: org.apache.solr.core.MockQuerySenderListenerReqHandler
[junit4:junit4]   2> 16581 T104 oasc.RequestHandlers.initHandlersFromConfig created /admin/: org.apache.solr.handler.admin.AdminHandlers
[junit4:junit4]   2> 16582 T104 oasc.RequestHandlers.initHandlersFromConfig created defaults: solr.StandardRequestHandler
[junit4:junit4]   2> 16583 T104 oasc.RequestHandlers.initHandlersFromConfig adding lazy requestHandler: solr.StandardRequestHandler
[junit4:junit4]   2> 16583 T104 oasc.RequestHandlers.initHandlersFromConfig created lazy: solr.StandardRequestHandler
[junit4:junit4]   2> 16584 T104 oasc.RequestHandlers.initHandlersFromConfig created /update: solr.UpdateRequestHandler
[junit4:junit4]   2> 16585 T104 oasc.RequestHandlers.initHandlersFromConfig created /terms: org.apache.solr.handler.component.SearchHandler
[junit4:junit4]   2> 16586 T104 oasc.RequestHandlers.initHandlersFromConfig created spellCheckCompRH: org.apache.solr.handler.component.SearchHandler
[junit4:junit4]   2> 16587 T104 oasc.RequestHandlers.initHandlersFromConfig created spellCheckCompRH_Direct: org.apache.solr.handler.component.SearchHandler
[junit4:junit4]   2> 16588 T104 oasc.RequestHandlers.initHandlersFromConfig created spellCheckWithWordbreak: org.apache.solr.handler.component.SearchHandler
[junit4:junit4]   2> 16589 T104 oasc.RequestHandlers.initHandlersFromConfig created spellCheckWithWordbreak_Direct: org.apache.solr.handler.component.SearchHandler
[junit4:junit4]   2> 16590 T104 oasc.RequestHandlers.initHandlersFromConfig created spellCheckCompRH1: org.apache.solr.handler.component.SearchHandler
[junit4:junit4]   2> 16590 T104 oasc.RequestHandlers.initHandlersFromConfig created mltrh: org.apache.solr.handler.component.SearchHandler
[junit4:junit4]   2> 16591 T104 oasc.RequestHandlers.initHandlersFromConfig created tvrh: org.apache.solr.handler.component.SearchHandler
[junit4:junit4]   2> 16592 T104 oasc.RequestHandlers.initHandlersFromConfig created /mlt: solr.MoreLikeThisHandler
[junit4:junit4]   2> 16593 T104 oasc.RequestHandlers.initHandlersFromConfig created /debug/dump: solr.DumpRequestHandler
[junit4:junit4]   2> 16603 T104 oashl.XMLLoader.init xsltCacheLifetimeSeconds=60
[junit4:junit4]   2> 16610 T104 oasc.SolrCore.initDeprecatedSupport WARNING solrconfig.xml uses deprecated <admin/gettableFiles>, Please update your config to use the ShowFileRequestHandler.
[junit4:junit4]   2> 16612 T104 oasc.SolrCore.initDeprecatedSupport WARNING adding ShowFileRequestHandler with hidden files: [SCHEMA.XML, OLD_SYNONYMS.TXT, STOPWORDS.TXT, PROTWORDS.TXT, OPEN-EXCHANGE-RATES.JSON, SYNONYMS.TXT, CURRENCY.XML, MAPPING-ISOLATIN1ACCENT.TXT]
[junit4:junit4]   2> 16615 T104 oasc.CachingDirectoryFactory.close Releasing directory:/usr/home/hudson/hudson-slave/workspace/Lucene-Solr-Tests-4.x-Java6/solr/build/solr-core/test/J0/./org.apache.solr.cloud.SyncSliceTest-1359700583526/jetty3
[junit4:junit4]   2> 16617 T104 oass.SolrIndexSearcher.<init> Opening Searcher@39556aec main
[junit4:junit4]   2> 16618 T104 oasu.CommitTracker.<init> Hard AutoCommit: disabled
[junit4:junit4]   2> 16619 T104 oasu.CommitTracker.<init> Soft AutoCommit: disabled
[junit4:junit4]   2> 16619 T104 oashc.SpellCheckComponent.inform Initializing spell checkers
[junit4:junit4]   2> 16627 T104 oass.DirectSolrSpellChecker.init init: {name=direct,classname=DirectSolrSpellChecker,field=lowerfilt,minQueryLength=3}
[junit4:junit4]   2> 16712 T105 oasc.SolrCore.registerSearcher [collection1] Registered new searcher Searcher@39556aec main{StandardDirectoryReader(segments_1:1)}
[junit4:junit4]   2> 16722 T104 oasc.ZkController.publish publishing core=collection1 state=down
[junit4:junit4]   2> 16722 T104 oasc.ZkController.publish numShards not found on descriptor - reading it from system property
[junit4:junit4]   2>  C5_STATE=coll:collection1 core:collection1 props:{shard=shard1, roles=null, state=recovering, core=collection1, collection=collection1, node_name=127.0.0.1:39316_ts%2Fnc, base_url=http://127.0.0.1:39316/ts/nc}
[junit4:junit4]   2> 17659 T90 C5 P39316 oasc.RecoveryStrategy.doRecovery Attempting to PeerSync from http://127.0.0.1:52046/ts/nc/collection1/ core=collection1 - recoveringAfterStartup=true
[junit4:junit4]   2> 17669 T90 C5 P39316 oascsi.HttpClientUtil.createClient Creating new http client, config:maxConnectionsPerHost=20&maxConnections=10000&connTimeout=30000&socketTimeout=30000&retry=false
[junit4:junit4]   2> 17694 T90 C5 P39316 oasu.PeerSync.sync PeerSync: core=collection1 url=http://127.0.0.1:39316/ts/nc START replicas=[http://127.0.0.1:52046/ts/nc/collection1/] nUpdates=100
[junit4:junit4]   2> 17705 T90 C5 P39316 oasu.PeerSync.sync WARNING no frame of reference to tell of we've missed updates
[junit4:junit4]   2> 17705 T90 C5 P39316 oasc.RecoveryStrategy.doRecovery PeerSync Recovery was not successful - trying replication. core=collection1
[junit4:junit4]   2> 17706 T90 C5 P39316 oasc.RecoveryStrategy.doRecovery Starting Replication Recovery. core=collection1
[junit4:junit4]   2> 17706 T90 C5 P39316 oasc.RecoveryStrategy.doRecovery Begin buffering updates. core=collection1
[junit4:junit4]   2> 17706 T90 C5 P39316 oasu.UpdateLog.bufferUpdates Starting to buffer updates. FSUpdateLog{state=ACTIVE, tlog=null}
[junit4:junit4]   2> 17707 T90 C5 P39316 oasc.RecoveryStrategy.replicate Attempting to replicate from http://127.0.0.1:52046/ts/nc/collection1/. core=collection1
[junit4:junit4]   2> 17707 T90 C5 P39316 oascsi.HttpClientUtil.createClient Creating new http client, config:maxConnections=128&maxConnectionsPerHost=32&followRedirects=false
[junit4:junit4]   2> 18255 T54 oascc.ZkStateReader.updateClusterState Updating cloud state from ZooKeeper... 
[junit4:junit4]   2> 18257 T54 oasc.Overseer$ClusterStateUpdater.updateState Update state numShards=1 message={
[junit4:junit4]   2> 	  "operation":"state",
[junit4:junit4]   2> 	  "numShards":"1",
[junit4:junit4]   2> 	  "shard":null,
[junit4:junit4]   2> 	  "roles":null,
[junit4:junit4]   2> 	  "state":"down",
[junit4:junit4]   2> 	  "core":"collection1",
[junit4:junit4]   2> 	  "collection":"collection1",
[junit4:junit4]   2> 	  "node_name":"127.0.0.1:45380_ts%2Fnc",
[junit4:junit4]   2> 	  "base_url":"http://127.0.0.1:45380/ts/nc"}
[junit4:junit4]   2> 18257 T54 oasc.Overseer$ClusterStateUpdater.updateState Collection already exists with numShards=1
[junit4:junit4]   2> 18258 T54 oasc.Overseer$ClusterStateUpdater.updateState Assigning new node to shard shard=shard1
[junit4:junit4]   2> ASYNC  NEW_CORE C6 name=collection1 org.apache.solr.core.SolrCore@51430296 url=http://127.0.0.1:52046/ts/nc/collection1 node=127.0.0.1:52046_ts%2Fnc C6_STATE=coll:collection1 core:collection1 props:{shard=shard1, roles=null, state=active, core=collection1, collection=collection1, node_name=127.0.0.1:52046_ts%2Fnc, base_url=http://127.0.0.1:52046/ts/nc, leader=true}
[junit4:junit4]   2> 18278 T64 C6 P52046 REQ /get {getVersions=100&distrib=false&wt=javabin&qt=/get&version=2} status=0 QTime=11 
[junit4:junit4]   2> 18297 T72 oascc.ZkStateReader$2.process A cluster state change: WatchedEvent state:SyncConnected type:NodeDataChanged path:/clusterstate.json, has occurred - updating... (live nodes size: 4)
[junit4:junit4]   2> 18297 T87 oascc.ZkStateReader$2.process A cluster state change: WatchedEvent state:SyncConnected type:NodeDataChanged path:/clusterstate.json, has occurred - updating... (live nodes size: 4)
[junit4:junit4]   2> 18297 T59 oascc.ZkStateReader$2.process A cluster state change: WatchedEvent state:SyncConnected type:NodeDataChanged path:/clusterstate.json, has occurred - updating... (live nodes size: 4)
[junit4:junit4]   2> 18297 T103 oascc.ZkStateReader$2.process A cluster state change: WatchedEvent state:SyncConnected type:NodeDataChanged path:/clusterstate.json, has occurred - updating... (live nodes size: 4)
[junit4:junit4]   2> 18297 T53 oascc.ZkStateReader$2.process A cluster state change: WatchedEvent state:SyncConnected type:NodeDataChanged path:/clusterstate.json, has occurred - updating... (live nodes size: 4)
[junit4:junit4]   2> 18451 T63 C6 P52046 oasu.DirectUpdateHandler2.commit start commit{,optimize=false,openSearcher=false,waitSearcher=true,expungeDeletes=false,softCommit=false}
[junit4:junit4]   2> 18453 T63 C6 P52046 oasc.CachingDirectoryFactory.close Releasing directory:/usr/home/hudson/hudson-slave/workspace/Lucene-Solr-Tests-4.x-Java6/solr/build/solr-core/test/J0/./org.apache.solr.cloud.SyncSliceTest-1359700583526/jetty1
[junit4:junit4]   2> 18458 T63 C6 P52046 oasc.SolrDeletionPolicy.onInit SolrDeletionPolicy.onInit: commits:num=1
[junit4:junit4]   2> 		commit{dir=RateLimitedDirectoryWrapper(NRTCachingDirectory(org.apache.lucene.store.NIOFSDirectory@/usr/home/hudson/hudson-slave/workspace/Lucene-Solr-Tests-4.x-Java6/solr/build/solr-core/test/J0/org.apache.solr.cloud.SyncSliceTest-1359700583526/jetty1/index lockFactory=org.apache.lucene.store.NativeFSLockFactory@2b3e8c1c; maxCacheMB=48.0 maxMergeSizeMB=4.0)),segFN=segments_1,generation=1,filenames=[segments_1]
[junit4:junit4]   2> 18459 T63 C6 P52046 oasc.SolrDeletionPolicy.updateCommits newest commit = 1[segments_1]
[junit4:junit4]   2> 18477 T63 C6 P52046 oasc.SolrDeletionPolicy.onCommit SolrDeletionPolicy.onCommit: commits:num=2
[junit4:junit4]   2> 		commit{dir=RateLimitedDirectoryWrapper(NRTCachingDirectory(org.apache.lucene.store.NIOFSDirectory@/usr/home/hudson/hudson-slave/workspace/Lucene-Solr-Tests-4.x-Java6/solr/build/solr-core/test/J0/org.apache.solr.cloud.SyncSliceTest-1359700583526/jetty1/index lockFactory=org.apache.lucene.store.NativeFSLockFactory@2b3e8c1c; maxCacheMB=48.0 maxMergeSizeMB=4.0)),segFN=segments_1,generation=1,filenames=[segments_1]
[junit4:junit4]   2> 		commit{dir=RateLimitedDirectoryWrapper(NRTCachingDirectory(org.apache.lucene.store.NIOFSDirectory@/usr/home/hudson/hudson-slave/workspace/Lucene-Solr-Tests-4.x-Java6/solr/build/solr-core/test/J0/org.apache.solr.cloud.SyncSliceTest-1359700583526/jetty1/index lockFactory=org.apache.lucene.store.NativeFSLockFactory@2b3e8c1c; maxCacheMB=48.0 maxMergeSizeMB=4.0)),segFN=segments_2,generation=2,filenames=[segments_2]
[junit4:junit4]   2> 18477 T63 C6 P52046 oasc.SolrDeletionPolicy.updateCommits newest commit = 2[segments_2]
[junit4:junit4]   2> 18479 T63 C6 P52046 oasc.CachingDirectoryFactory.close Releasing directory:/usr/home/hudson/hudson-slave/workspace/Lucene-Solr-Tests-4.x-Java6/solr/build/solr-core/test/J0/./org.apache.solr.cloud.SyncSliceTest-1359700583526/jetty1
[junit4:junit4]   2> 18479 T63 C6 P52046 oass.SolrIndexSearcher.<init> Opening Searcher@787db430 realtime
[junit4:junit4]   2> 18480 T63 C6 P52046 oasu.DirectUpdateHandler2.commit end_commit_flush
[junit4:junit4]   2> 18480 T63 C6 P52046 /update {waitSearcher=true&openSearcher=false&commit=true&wt=javabin&commit_end_point=true&version=2&softCommit=false} {commit=} 0 213
[junit4:junit4]   2> 18482 T90 C5 P39316 oash.ReplicationHandler.inform Commits will be reserved for  10000
[junit4:junit4]   2> 18483 T90 C5 P39316 oascsi.HttpClientUtil.createClient Creating new http client, config:connTimeout=5000&socketTimeout=20000&allowCompression=false&maxConnections=10000&maxConnectionsPerHost=10000
[junit4:junit4]   2> 18512 T90 C5 P39316 oash.SnapPuller.<init>  No value set for 'pollInterval'. Timer Task not started.
[junit4:junit4]   2> 18577 T65 C6 P52046 oash.ReplicationHandler.inform Commits will be reserved for  10000
[junit4:junit4]   2> 18578 T65 C6 P52046 REQ /replication {command=indexversion&qt=/replication&wt=javabin&version=2} status=0 QTime=63 
[junit4:junit4]   2> 18580 T90 C5 P39316 oash.SnapPuller.fetchLatestIndex Master's generation: 2
[junit4:junit4]   2> 18581 T90 C5 P39316 oash.SnapPuller.fetchLatestIndex Slave's generation: 1
[junit4:junit4]   2> 18581 T90 C5 P39316 oash.SnapPuller.fetchLatestIndex Starting replication process
[junit4:junit4]   2> 18585 T65 C6 P52046 oasc.CachingDirectoryFactory.close Releasing directory:/usr/home/hudson/hudson-slave/workspace/Lucene-Solr-Tests-4.x-Java6/solr/build/solr-core/test/J0/./org.apache.solr.cloud.SyncSliceTest-1359700583526/jetty1
[junit4:junit4]   2> 18586 T65 C6 P52046 oasc.CachingDirectoryFactory.close Releasing directory:/usr/home/hudson/hudson-slave/workspace/Lucene-Solr-Tests-4.x-Java6/solr/build/solr-core/test/J0/./org.apache.solr.cloud.SyncSliceTest-1359700583526/jetty1/index
[junit4:junit4]   2> 18586 T65 C6 P52046 REQ /replication {command=filelist&qt=/replication&wt=javabin&generation=2&version=2} status=0 QTime=1 
[junit4:junit4]   2> 18588 T90 C5 P39316 oash.SnapPuller.fetchLatestIndex Number of files in latest index in master: 1
[junit4:junit4]   2> 18589 T90 C5 P39316 oasc.CachingDirectoryFactory.get return new directory for /usr/home/hudson/hudson-slave/workspace/Lucene-Solr-Tests-4.x-Java6/solr/build/solr-core/test/J0/./org.apache.solr.cloud.SyncSliceTest-1359700583526/jetty2/index.20130201063642109 forceNew:false
[junit4:junit4]   2> 18590 T90 C5 P39316 oasc.CachingDirectoryFactory.close Releasing directory:/usr/home/hudson/hudson-slave/workspace/Lucene-Solr-Tests-4.x-Java6/solr/build/solr-core/test/J0/./org.apache.solr.cloud.SyncSliceTest-1359700583526/jetty2
[junit4:junit4]   2> 18591 T90 C5 P39316 oash.SnapPuller.fetchLatestIndex Starting download to RateLimitedDirectoryWrapper(NRTCachingDirectory(org.apache.lucene.store.NIOFSDirectory@/usr/home/hudson/hudson-slave/workspace/Lucene-Solr-Tests-4.x-Java6/solr/build/solr-core/test/J0/org.apache.solr.cloud.SyncSliceTest-1359700583526/jetty2/index.20130201063642109 lockFactory=org.apache.lucene.store.NativeFSLockFactory@2cf0a755; maxCacheMB=48.0 maxMergeSizeMB=4.0)) fullCopy=true
[junit4:junit4]   2> 18606 T65 C6 P52046 REQ /replication {file=segments_2&command=filecontent&checksum=true&wt=filestream&qt=/replication&generation=2} status=0 QTime=6 
[junit4:junit4]   2> 18620 T90 C5 P39316 oasc.CachingDirectoryFactory.close Releasing directory:/usr/home/hudson/hudson-slave/workspace/Lucene-Solr-Tests-4.x-Java6/solr/build/solr-core/test/J0/./org.apache.solr.cloud.SyncSliceTest-1359700583526/jetty2/index
[junit4:junit4]   2> 18621 T90 C5 P39316 oash.SnapPuller.fetchLatestIndex Total time taken for download : 0 secs
[junit4:junit4]   2> 18622 T90 C5 P39316 oash.SnapPuller.modifyIndexProps New index installed. Updating index properties... index=index.20130201063642109
[junit4:junit4]   2> 18629 T90 C5 P39316 oasc.CachingDirectoryFactory.close Releasing directory:/usr/home/hudson/hudson-slave/workspace/Lucene-Solr-Tests-4.x-Java6/solr/build/solr-core/test/J0/./org.apache.solr.cloud.SyncSliceTest-1359700583526/jetty2
[junit4:junit4]   2> 18630 T90 C5 P39316 oasc.CachingDirectoryFactory.close Releasing directory:/usr/home/hudson/hudson-slave/workspace/Lucene-Solr-Tests-4.x-Java6/solr/build/solr-core/test/J0/./org.apache.solr.cloud.SyncSliceTest-1359700583526/jetty2
[junit4:junit4]   2> 18630 T90 C5 P39316 oasc.SolrCore.getNewIndexDir New index directory detected: old=./org.apache.solr.cloud.SyncSliceTest-1359700583526/jetty2/index/ new=./org.apache.solr.cloud.SyncSliceTest-1359700583526/jetty2/index.20130201063642109
[junit4:junit4]   2> 18634 T90 C5 P39316 oasc.SolrDeletionPolicy.onInit SolrDeletionPolicy.onInit: commits:num=1
[junit4:junit4]   2> 		commit{dir=RateLimitedDirectoryWrapper(NRTCachingDirectory(org.apache.lucene.store.NIOFSDirectory@/usr/home/hudson/hudson-slave/workspace/Lucene-Solr-Tests-4.x-Java6/solr/build/solr-core/test/J0/org.apache.solr.cloud.SyncSliceTest-1359700583526/jetty2/index.20130201063642109 lockFactory=org.apache.lucene.store.NativeFSLockFactory@2cf0a755; maxCacheMB=48.0 maxMergeSizeMB=4.0)),segFN=segments_2,generation=2,filenames=[segments_2]
[junit4:junit4]   2> 18635 T90 C5 P39316 oasc.SolrDeletionPolicy.updateCommits newest commit = 2[segments_2]
[junit4:junit4]   2> 18636 T90 C5 P39316 oasc.CachingDirectoryFactory.close Releasing directory:/usr/home/hudson/hudson-slave/workspace/Lucene-Solr-Tests-4.x-Java6/solr/build/solr-core/test/J0/./org.apache.solr.cloud.SyncSliceTest-1359700583526/jetty2
[junit4:junit4]   2> 18641 T90 C5 P39316 oasu.DefaultSolrCoreState.newIndexWriter Creating new IndexWriter...
[junit4:junit4]   2> 18641 T90 C5 P39316 oasu.DefaultSolrCoreState.newIndexWriter Waiting until IndexWriter is unused... core=collection1
[junit4:junit4]   2> 18642 T90 C5 P39316 oasu.DefaultSolrCoreState.newIndexWriter Rollback old IndexWriter... core=collection1
[junit4:junit4]   2> 18643 T90 C5 P39316 oasc.CachingDirectoryFactory.close Releasing directory:/usr/home/hudson/hudson-slave/workspace/Lucene-Solr-Tests-4.x-Java6/solr/build/solr-core/test/J0/./org.apache.solr.cloud.SyncSliceTest-1359700583526/jetty2/index.20130201063642109
[junit4:junit4]   2> 18644 T90 C5 P39316 oasc.CachingDirectoryFactory.close Releasing directory:/usr/home/hudson/hudson-slave/workspace/Lucene-Solr-Tests-4.x-Java6/solr/build/solr-core/test/J0/./org.apache.solr.cloud.SyncSliceTest-1359700583526/jetty2
[junit4:junit4]   2> 18647 T90 C5 P39316 oasc.SolrDeletionPolicy.onInit SolrDeletionPolicy.onInit: commits:num=1
[junit4:junit4]   2> 		commit{dir=RateLimitedDirectoryWrapper(NRTCachingDirectory(org.apache.lucene.store.NIOFSDirectory@/usr/home/hudson/hudson-slave/workspace/Lucene-Solr-Tests-4.x-Java6/solr/build/solr-core/test/J0/org.apache.solr.cloud.SyncSliceTest-1359700583526/jetty2/index.20130201063642109 lockFactory=org.apache.lucene.store.NativeFSLockFactory@2cf0a755; maxCacheMB=48.0 maxMergeSizeMB=4.0)),segFN=segments_2,generation=2,filenames=[segments_2]
[junit4:junit4]   2> 18648 T90 C5 P39316 oasc.SolrDeletionPolicy.updateCommits newest commit = 2[segments_2]
[junit4:junit4]   2> 18648 T90 C5 P39316 oasu.DefaultSolrCoreState.newIndexWriter New IndexWriter is ready to be used.
[junit4:junit4]   2> 18649 T90 C5 P39316 oasc.CachingDirectoryFactory.close Releasing directory:/usr/home/hudson/hudson-slave/workspace/Lucene-Solr-Tests-4.x-Java6/solr/build/solr-core/test/J0/./org.apache.solr.cloud.SyncSliceTest-1359700583526/jetty2
[junit4:junit4]   2> 18649 T90 C5 P39316 oass.SolrIndexSearcher.<init> Opening Searcher@5ad52411 main
[junit4:junit4]   2> 18653 T89 oasc.SolrCore.registerSearcher [collection1] Registered new searcher Searcher@5ad52411 main{StandardDirectoryReader(segments_2:1:nrt)}
[junit4:junit4]   2> 18654 T89 oasc.CachingDirectoryFactory.close Releasing directory:/usr/home/hudson/hudson-slave/workspace/Lucene-Solr-Tests-4.x-Java6/solr/build/solr-core/test/J0/./org.apache.solr.cloud.SyncSliceTest-1359700583526/jetty2/index
[junit4:junit4]   2> 18654 T90 C5 P39316 oasu.DirectUpdateHandler2.commit start commit{,optimize=false,openSearcher=false,waitSearcher=false,expungeDeletes=false,softCommit=false}
[junit4:junit4]   2> 18658 T90 C5 P39316 oasc.SolrDeletionPolicy.onCommit SolrDeletionPolicy.onCommit: commits:num=2
[junit4:junit4]   2> 		commit{dir=RateLimitedDirectoryWrapper(NRTCachingDirectory(org.apache.lucene.store.NIOFSDirectory@/usr/home/hudson/hudson-slave/workspace/Lucene-Solr-Tests-4.x-Java6/solr/build/solr-core/test/J0/org.apache.solr.cloud.SyncSliceTest-1359700583526/jetty2/index.20130201063642109 lockFactory=org.apache.lucene.store.NativeFSLockFactory@2cf0a755; maxCacheMB=48.0 maxMergeSizeMB=4.0)),segFN=segments_2,generation=2,filenames=[segments_2]
[junit4:junit4]   2> 		commit{dir=RateLimitedDirectoryWrapper(NRTCachingDirectory(org.apache.lucene.store.NIOFSDirectory@/usr/home/hudson/hudson-slave/workspace/Lucene-Solr-Tests-4.x-Java6/solr/build/solr-core/test/J0/org.apache.solr.cloud.SyncSliceTest-1359700583526/jetty2/index.20130201063642109 lockFactory=org.apache.lucene.store.NativeFSLockFactory@2cf0a755; maxCacheMB=48.0 maxMergeSizeMB=4.0)),segFN=segments_3,generation=3,filenames=[segments_3]
[junit4:junit4]   2> 18659 T90 C5 P39316 oasc.SolrDeletionPolicy.updateCommits newest commit = 3[segments_3]
[junit4:junit4]   2> 18660 T90 C5 P39316 oasc.CachingDirectoryFactory.close Releasing directory:/usr/home/hudson/hudson-slave/workspace/Lucene-Solr-Tests-4.x-Java6/solr/build/solr-core/test/J0/./org.apache.solr.cloud.SyncSliceTest-1359700583526/jetty2
[junit4:junit4]   2> 18660 T90 C5 P39316 oasu.DirectUpdateHandler2.commit end_commit_flush
[junit4:junit4]   2> 18661 T90 C5 P39316 oasc.CachingDirectoryFactory.close Releasing directory:/usr/home/hudson/hudson-slave/workspace/Lucene-Solr-Tests-4.x-Java6/solr/build/solr-core/test/J0/./org.apache.solr.cloud.SyncSliceTest-1359700583526/jetty2/index.20130201063642109
[junit4:junit4]   2> 18661 T90 C5 P39316 oasc.CachingDirectoryFactory.close Releasing directory:/usr/home/hudson/hudson-slave/workspace/Lucene-Solr-Tests-4.x-Java6/solr/build/solr-core/test/J0/./org.apache.solr.cloud.SyncSliceTest-1359700583526/jetty2/index
[junit4:junit4]   2> 18661 T90 C5 P39316 oasc.RecoveryStrategy.replay No replay needed. core=collection1
[junit4:junit4]   2> 18662 T90 C5 P39316 oasc.RecoveryStrategy.doRecovery Replication Recovery was successful - registering as Active. core=collection1
[junit4:junit4]   2> 18662 T90 C5 P39316 oasc.ZkController.publish publishing core=collection1 state=active
[junit4:junit4]   2> 18662 T90 C5 P39316 oasc.ZkController.publish numShards not found on descriptor - reading it from system property
[junit4:junit4]   2> 18665 T90 C5 P39316 oasc.RecoveryStrategy.doRecovery Finished recovery process. core=collection1
[junit4:junit4]   2> 18727 T104 oasc.CoreContainer.registerCore registering core: collection1
[junit4:junit4]   2> 18727 T104 oasc.ZkController.register Register replica - core:collection1 address:http://127.0.0.1:45380/ts/nc collection:collection1 shard:shard1
[junit4:junit4]   2> 18732 T104 oasc.ZkController.register We are http://127.0.0.1:45380/ts/nc/collection1/ and leader is http://127.0.0.1:52046/ts/nc/collection1/
[junit4:junit4]   2> 18732 T104 oasc.ZkController.register No LogReplay needed for core=collection1 baseURL=http://127.0.0.1:45380/ts/nc
[junit4:junit4]   2> 18733 T104 oasc.ZkController.checkRecovery Core needs to recover:collection1
[junit4:junit4]   2> 18733 T104 oasu.DefaultSolrCoreState.doRecovery Running recovery - first canceling any ongoing recovery
[junit4:junit4]   2> ASYNC  NEW_CORE C7 name=collection1 org.apache.solr.core.SolrCore@42bdfa0e url=http://127.0.0.1:45380/ts/nc/collection1 node=127.0.0.1:45380_ts%2Fnc C7_STATE=coll:collection1 core:collection1 props:{shard=null, roles=null, state=down, core=collection1, collection=collection1, node_name=127.0.0.1:45380_ts%2Fnc, base_url=http://127.0.0.1:45380/ts/nc}
[junit4:junit4]   2> 18734 T108 C7 P45380 oasc.RecoveryStrategy.run Starting recovery process.  core=collection1 recoveringAfterStartup=true
[junit4:junit4]   2> 18735 T108 C7 P45380 oasc.RecoveryStrategy.doRecovery ###### startupVersions=[]
[junit4:junit4]   2> 18735 T104 oascc.ZkStateReader.updateClusterState Updating cloud state from ZooKeeper... 
[junit4:junit4]   2> 18735 T108 C7 P45380 oasc.ZkController.publish publishing core=collection1 state=recovering
[junit4:junit4]   2> 18735 T108 C7 P45380 oasc.ZkController.publish numShards not found on descriptor - reading it from system property
[junit4:junit4]   2> 18736 T30 oass.SolrDispatchFilter.init user.dir=/usr/home/hudson/hudson-slave/workspace/Lucene-Solr-Tests-4.x-Java6/solr/build/solr-core/test/J0
[junit4:junit4]   2> 18737 T30 oass.SolrDispatchFilter.init SolrDispatchFilter.init() done
[junit4:junit4]   2> 18737 T30 oascsi.HttpClientUtil.createClient Creating new http client, config:maxConnections=128&maxConnectionsPerHost=32&followRedirects=false
[junit4:junit4]   2> 18737 T108 C7 P45380 oascsi.HttpClientUtil.createClient Creating new http client, config:maxConnections=128&maxConnectionsPerHost=32&followRedirects=false
[junit4:junit4]   2> 18869 T30 oejs.Server.doStart jetty-8.1.8.v20121106
[junit4:junit4]   2> 18872 T30 oejs.AbstractConnector.doStart Started SocketConnector@127.0.0.1:46904
[junit4:junit4]   2> 18872 T30 oass.SolrDispatchFilter.init SolrDispatchFilter.init()
[junit4:junit4]   2> 18873 T30 oasc.SolrResourceLoader.locateSolrHome JNDI not configured for solr (NoInitialContextEx)
[junit4:junit4]   2> 18873 T30 oasc.SolrResourceLoader.locateSolrHome using system property solr.solr.home: /usr/home/hudson/hudson-slave/workspace/Lucene-Solr-Tests-4.x-Java6/solr/build/solr-core/test/J0/./org.apache.solr.cloud.SyncSliceTest-jetty4-1359700602271
[junit4:junit4]   2> 18874 T30 oasc.CoreContainer$Initializer.initialize looking for solr.xml: /usr/home/hudson/hudson-slave/workspace/Lucene-Solr-Tests-4.x-Java6/solr/build/solr-core/test/J0/./org.apache.solr.cloud.SyncSliceTest-jetty4-1359700602271/solr.xml
[junit4:junit4]   2> 18874 T30 oasc.CoreContainer.<init> New CoreContainer 1092033939
[junit4:junit4]   2> 18875 T30 oasc.CoreContainer.load Loading CoreContainer using Solr Home: '/usr/home/hudson/hudson-slave/workspace/Lucene-Solr-Tests-4.x-Java6/solr/build/solr-core/test/J0/./org.apache.solr.cloud.SyncSliceTest-jetty4-1359700602271/'
[junit4:junit4]   2> 18875 T30 oasc.SolrResourceLoader.<init> new SolrResourceLoader for directory: '/usr/home/hudson/hudson-slave/workspace/Lucene-Solr-Tests-4.x-Java6/solr/build/solr-core/test/J0/./org.apache.solr.cloud.SyncSliceTest-jetty4-1359700602271/'
[junit4:junit4]   2> 18910 T30 oashc.HttpShardHandlerFactory.getParameter Setting socketTimeout to: 60000
[junit4:junit4]   2> 18911 T30 oashc.HttpShardHandlerFactory.getParameter Setting urlScheme to: http://
[junit4:junit4]   2> 18911 T30 oashc.HttpShardHandlerFactory.getParameter Setting connTimeout to: 15000
[junit4:junit4]   2> 18911 T30 oashc.HttpShardHandlerFactory.getParameter Setting maxConnectionsPerHost to: 20
[junit4:junit4]   2> 18912 T30 oashc.HttpShardHandlerFactory.getParameter Setting corePoolSize to: 0
[junit4:junit4]   2> 18912 T30 oashc.HttpShardHandlerFactory.getParameter Setting maximumPoolSize to: 2147483647
[junit4:junit4]   2> 18913 T30 oashc.HttpShardHandlerFactory.getParameter Setting maxThreadIdleTime to: 5
[junit4:junit4]   2> 18913 T30 oashc.HttpShardHandlerFactory.getParameter Setting sizeOfQueue to: -1
[junit4:junit4]   2> 18914 T30 oashc.HttpShardHandlerFactory.getParameter Setting fairnessPolicy to: false
[junit4:junit4]   2> 18914 T30 oascsi.HttpClientUtil.createClient Creating new http client, config:maxConnectionsPerHost=20&maxConnections=10000&socketTimeout=60000&connTimeout=15000&retry=false
[junit4:junit4]   2> 18930 T30 oasc.CoreContainer.load Registering Log Listener
[junit4:junit4]   2> 18945 T30 oasc.CoreContainer.initZooKeeper Zookeeper client=127.0.0.1:46809/solr
[junit4:junit4]   2> 18946 T30 oasc.ZkController.checkChrootPath zkHost includes chroot
[junit4:junit4]   2> 18946 T30 oaz.ZooKeeper.<init> Initiating client connection, connectString=127.0.0.1:46809 sessionTimeout=60000 watcher=org.apache.solr.common.cloud.ConnectionManager@74e7f9b3
[junit4:junit4]   2> 18947 T30 oascc.ConnectionManager.waitForConnected Waiting for client to connect to ZooKeeper
[junit4:junit4]   2> 18947 T118 oaz.ClientCnxn$SendThread.logStartConnect Opening socket connection to server localhost/127.0.0.1:46809. Will not attempt to authenticate using SASL (access denied (javax.security.auth.AuthPermission getLoginConfiguration))
[junit4:junit4]   2> 18948 T118 oaz.ClientCnxn$SendThread.primeConnection Socket connection established to localhost/127.0.0.1:46809, initiating session
[junit4:junit4]   2> 18948 T32 oazs.NIOServerCnxnFactory.run Accepted socket connection from /140.211.11.196:51434
[junit4:junit4]   2> 18949 T32 oazs.ZooKeeperServer.processConnectRequest Client attempting to establish new session at /140.211.11.196:51434
[junit4:junit4]   2> 18951 T34 oazs.ZooKeeperServer.finishSessionInit Established session 0x13c94786599000b with negotiated timeout 20000 for client /140.211.11.196:51434
[junit4:junit4]   2> 18951 T118 oaz.ClientCnxn$SendThread.onConnected Session establishment complete on server localhost/127.0.0.1:46809, sessionid = 0x13c94786599000b, negotiated timeout = 20000
[junit4:junit4]   2> 18951 T119 oascc.ConnectionManager.process Watcher org.apache.solr.common.cloud.ConnectionManager@74e7f9b3 name:ZooKeeperConnection Watcher:127.0.0.1:46809 got event WatchedEvent state:SyncConnected type:None path:null path:null type:None
[junit4:junit4]   2> 18951 T30 oascc.ConnectionManager.waitForConnected Client is connected to ZooKeeper
[junit4:junit4]   2> 18953 T35 oazs.PrepRequestProcessor.pRequest2Txn Processed session termination for sessionid: 0x13c94786599000b
[junit4:junit4]   2> 18954 T119 oaz.ClientCnxn$EventThread.run EventThread shut down
[junit4:junit4]   2> 18954 T30 oaz.ZooKeeper.close Session: 0x13c94786599000b closed
[junit4:junit4]   2> 18954 T32 oazs.NIOServerCnxn.closeSock Closed socket connection for client /140.211.11.196:51434 which had sessionid 0x13c94786599000b
[junit4:junit4]   2> 18955 T30 oascsi.HttpClientUtil.createClient Creating new http client, config:maxConnections=500&maxConnectionsPerHost=16&socketTimeout=60000&connTimeout=15000
[junit4:junit4]   2> 18963 T30 oaz.ZooKeeper.<init> Initiating client connection, connectString=127.0.0.1:46809/solr sessionTimeout=30000 watcher=org.apache.solr.common.cloud.ConnectionManager@4f8f104
[junit4:junit4]   2> 18964 T30 oascc.ConnectionManager.waitForConnected Waiting for client to connect to ZooKeeper
[junit4:junit4]   2> 18964 T120 oaz.ClientCnxn$SendThread.logStartConnect Opening socket connection to server localhost/127.0.0.1:46809. Will not attempt to authenticate using SASL (access denied (javax.security.auth.AuthPermission getLoginConfiguration))
[junit4:junit4]   2> 18965 T120 oaz.ClientCnxn$SendThread.primeConnection Socket connection established to localhost/127.0.0.1:46809, initiating session
[junit4:junit4]   2> 18965 T32 oazs.NIOServerCnxnFactory.run Accepted socket connection from /140.211.11.196:37622
[junit4:junit4]   2> 18966 T32 oazs.ZooKeeperServer.processConnectRequest Client attempting to establish new session at /140.211.11.196:37622
[junit4:junit4]   2> 18967 T34 oazs.ZooKeeperServer.finishSessionInit Established session 0x13c94786599000c with negotiated timeout 20000 for client /140.211.11.196:37622
[junit4:junit4]   2> 18967 T120 oaz.ClientCnxn$SendThread.onConnected Session establishment complete on server localhost/127.0.0.1:46809, sessionid = 0x13c94786599000c, negotiated timeout = 20000
[junit4:junit4]   2> 18967 T121 oascc.ConnectionManager.process Watcher org.apache.solr.common.cloud.ConnectionManager@4f8f104 name:ZooKeeperConnection Watcher:127.0.0.1:46809/solr got event WatchedEvent state:SyncConnected type:None path:null path:null type:None
[junit4:junit4]   2> 18968 T30 oascc.ConnectionManager.waitForConnected Client is connected to ZooKeeper
[junit4:junit4]   2> 18969 T35 oazs.PrepRequestProcessor.pRequest Got user-level KeeperException when processing sessionid:0x13c94786599000c type:create cxid:0x1 zxid:0x94 txntype:-1 reqpath:n/a Error Path:/solr/overseer Error:KeeperErrorCode = NodeExists for /solr/overseer
[junit4:junit4]   2> 18970 T35 oazs.PrepRequestProcessor.pRequest Got user-level KeeperException when processing sessionid:0x13c94786599000c type:create cxid:0x2 zxid:0x95 txntype:-1 reqpath:n/a Error Path:/solr/overseer Error:KeeperErrorCode = NodeExists for /solr/overseer
[junit4:junit4]   2> 18978 T30 oasc.ZkController.createEphemeralLiveNode Register node as live in ZooKeeper:/live_nodes/127.0.0.1:46904_ts%2Fnc
[junit4:junit4]   2> 18979 T35 oazs.PrepRequestProcessor.pRequest Got user-level KeeperException when processing sessionid:0x13c94786599000c type:delete cxid:0x4 zxid:0x96 txntype:-1 reqpath:n/a Error Path:/solr/live_nodes/127.0.0.1:46904_ts%2Fnc Error:KeeperErrorCode = NoNode for /solr/live_nodes/127.0.0.1:46904_ts%2Fnc
[junit4:junit4]   2> 18980 T30 oascc.SolrZkClient.makePath makePath: /live_nodes/127.0.0.1:46904_ts%2Fnc
[junit4:junit4]   2> 18982 T72 oascc.ZkStateReader$2.process A cluster state change: WatchedEvent state:SyncConnected type:NodeChildrenChanged path:/live_nodes, has occurred - updating... (live nodes size: 4)
[junit4:junit4]   2> 18983 T87 oascc.ZkStateReader$2.process A cluster state change: WatchedEvent state:SyncConnected type:NodeChildrenChanged path:/live_nodes, has occurred - updating... (live nodes size: 4)
[junit4:junit4]   2> 18983 T103 oascc.ZkStateReader$3.process Updating live nodes... (5)
[junit4:junit4]   2> 18984 T103 oascc.ZkStateReader$2.process A cluster state change: WatchedEvent state:SyncConnected type:NodeChildrenChanged path:/live_nodes, has occurred - updating... (live nodes size: 5)
[junit4:junit4]   2> 18984 T59 oascc.ZkStateReader$3.process Updating live nodes... (5)
[junit4:junit4]   2> 18984 T53 oascc.ZkStateReader$3.process Updating live nodes... (5)
[junit4:junit4]   2> 18984 T59 oascc.ZkStateReader$2.process A cluster state change: WatchedEvent state:SyncConnected type:NodeChildrenChanged path:/live_nodes, has occurred - updating... (live nodes size: 5)
[junit4:junit4]   2> 18985 T53 oascc.ZkStateReader$2.process A cluster state change: WatchedEvent state:SyncConnected type:NodeChildrenChanged path:/live_nodes, has occurred - updating... (live nodes size: 5)
[junit4:junit4]   2> 18986 T72 oascc.ZkStateReader$3.process Updating live nodes... (5)
[junit4:junit4]   2> 18986 T87 oascc.ZkStateReader$3.process Updating live nodes... (5)
[junit4:junit4]   2> 18989 T30 oascc.ZkStateReader.createClusterStateWatchersAndUpdate Updating cluster state from ZooKeeper... 
[junit4:junit4]   2> 18995 T122 oasc.CoreContainer.create Creating SolrCore 'collection1' using instanceDir: /usr/home/hudson/hudson-slave/workspace/Lucene-Solr-Tests-4.x-Java6/solr/build/solr-core/test/J0/./org.apache.solr.cloud.SyncSliceTest-jetty4-1359700602271/collection1
[junit4:junit4]   2> 18995 T122 oasc.ZkController.createCollectionZkNode Check for collection zkNode:collection1
[junit4:junit4]   2> 18996 T122 oasc.ZkController.createCollectionZkNode Collection zkNode exists
[junit4:junit4]   2> 18996 T122 oasc.ZkController.readConfigName Load collection config from:/collections/collection1
[junit4:junit4]   2> 18998 T122 oasc.SolrResourceLoader.<init> new SolrResourceLoader for directory: '/usr/home/hudson/hudson-slave/workspace/Lucene-Solr-Tests-4.x-Java6/solr/build/solr-core/test/J0/./org.apache.solr.cloud.SyncSliceTest-jetty4-1359700602271/collection1/'
[junit4:junit4]   2> 18998 T122 oasc.SolrResourceLoader.replaceClassLoader Adding 'file:/usr/home/hudson/hudson-slave/workspace/Lucene-Solr-Tests-4.x-Java6/solr/build/solr-core/test/J0/org.apache.solr.cloud.SyncSliceTest-jetty4-1359700602271/collection1/lib/README' to classloader
[junit4:junit4]   2> 18999 T122 oasc.SolrResourceLoader.replaceClassLoader Adding 'file:/usr/home/hudson/hudson-slave/workspace/Lucene-Solr-Tests-4.x-Java6/solr/build/solr-core/test/J0/org.apache.solr.cloud.SyncSliceTest-jetty4-1359700602271/collection1/lib/classes/' to classloader
[junit4:junit4]   2> 19040 T122 oasc.SolrConfig.<init> Using Lucene MatchVersion: LUCENE_42
[junit4:junit4]   2> 19092 T122 oasc.SolrConfig.<init> Loaded SolrConfig: solrconfig.xml
[junit4:junit4]   2> 19194 T122 oass.IndexSchema.readSchema Reading Solr Schema
[junit4:junit4]   2> 19204 T122 oass.IndexSchema.readSchema Schema name=test
[junit4:junit4]   2> 19838 T122 oass.OpenExchangeRatesOrgProvider.init Initialized with rates=open-exchange-rates.json, refreshInterval=1440.
[junit4:junit4]   2> 19852 T122 oass.IndexSchema.readSchema default search field in schema is text
[junit4:junit4]   2> 19856 T122 oass.IndexSchema.readSchema unique key field: id
[junit4:junit4]   2> 19862 T54 oascc.ZkStateReader.updateClusterState Updating cloud state from ZooKeeper... 
[junit4:junit4]   2> 19864 T54 oasc.Overseer$ClusterStateUpdater.updateState Update state numShards=1 message={
[junit4:junit4]   2> 	  "operation":"state",
[junit4:junit4]   2> 	  "numShards":"1",
[junit4:junit4]   2> 	  "shard":"shard1",
[junit4:junit4]   2> 	  "roles":null,
[junit4:junit4]   2> 	  "state":"active",
[junit4:junit4]   2> 	  "core":"collection1",
[junit4:junit4]   2> 	  "collection":"collection1",
[junit4:junit4]   2> 	  "node_name":"127.0.0.1:39316_ts%2Fnc",
[junit4:junit4]   2> 	  "base_url":"http://127.0.0.1:39316/ts/nc"}
[junit4:junit4]   2> 19903 T54 oasc.Overseer$ClusterStateUpdater.updateState Update state numShards=1 message={
[junit4:junit4]   2> 	  "operation":"state",
[junit4:junit4]   2> 	  "numShards":"1",
[junit4:junit4]   2> 	  "shard":"shard1",
[junit4:junit4]   2> 	  "roles":null,
[junit4:junit4]   2> 	  "state":"recovering",
[junit4:junit4]   2> 	  "core":"collection1",
[junit4:junit4]   2> 	  "collection":"collection1",
[junit4:junit4]   2> 	  "node_name":"127.0.0.1:45380_ts%2Fnc",
[junit4:junit4]   2> 	  "base_url":"http://127.0.0.1:45380/ts/nc"}
[junit4:junit4]   2> 19915 T121 oascc.ZkStateReader$2.process A cluster state change: WatchedEvent state:SyncConnected type:NodeDataChanged path:/clusterstate.json, has occurred - updating... (live nodes size: 5)
[junit4:junit4]   2> 19915 T72 oascc.ZkStateReader$2.process A cluster state change: WatchedEvent state:SyncConnected type:NodeDataChanged path:/clusterstate.json, has occurred - updating... (live nodes size: 5)
[junit4:junit4]   2> 19915 T87 oascc.ZkStateReader$2.process A cluster state change: WatchedEvent state:SyncConnected type:NodeDataChanged path:/clusterstate.json, has occurred - updating... (live nodes size: 5)
[junit4:junit4]   2> 19915 T59 oascc.ZkStateReader$2.process A cluster state change: WatchedEvent state:SyncConnected type:NodeDataChanged path:/clusterstate.json, has occurred - updating... (live nodes size: 5)
[junit4:junit4]   2> 19915 T53 oascc.ZkStateReader$2.process A cluster state change: WatchedEvent state:SyncConnected type:NodeDataChanged path:/clusterstate.json, has occurred - updating... (live nodes size: 5)
[junit4:junit4]   2> 19915 T103 oascc.ZkStateReader$2.process A cluster state change: WatchedEvent state:SyncConnected type:NodeDataChanged path:/clusterstate.json, has occurred - updating... (live nodes size: 5)
[junit4:junit4]   2> 19927 T122 oass.FileExchangeRateProvider.reload Reloading exchange rates from file currency.xml
[junit4:junit4]   2> 19933 T122 oass.FileExchangeRateProvider.reload Reloading exchange rates from file currency.xml
[junit4:junit4]   2> 19939 T122 oass.OpenExchangeRatesOrgProvider.reload Reloading exchange rates from open-exchange-rates.json
[junit4:junit4]   2> 19942 T122 oass.OpenExchangeRatesOrgProvider.reload Reloading exchange rates from open-exchange-rates.json
[junit4:junit4]   2> 19944 T122 oasc.SolrCore.<init> [collection1] Opening new SolrCore at /usr/home/hudson/hudson-slave/workspace/Lucene-Solr-Tests-4.x-Java6/solr/build/solr-core/test/J0/./org.apache.solr.cloud.SyncSliceTest-jetty4-1359700602271/collection1/, dataDir=./org.apache.solr.cloud.SyncSliceTest-1359700583526/jetty4/
[junit4:junit4]   2> 19944 T122 oasc.JmxMonitoredMap.<init> JMX monitoring is enabled. Adding Solr mbeans to JMX Server: com.sun.jmx.mbeanserver.JmxMBeanServer@2658dd2d
[junit4:junit4]   2> 19945 T122 oasc.SolrCore.initDirectoryFactory solr.NRTCachingDirectoryFactory
[junit4:junit4]   2> 19946 T122 oasc.CachingDirectoryFactory.get return new directory for /usr/home/hudson/hudson-slave/workspace/Lucene-Solr-Tests-4.x-Java6/solr/build/solr-core/test/J0/./org.apache.solr.cloud.SyncSliceTest-1359700583526/jetty4 forceNew:false
[junit4:junit4]   2> 19947 T122 oasc.CachingDirectoryFactory.close Releasing directory:/usr/home/hudson/hudson-slave/workspace/Lucene-Solr-Tests-4.x-Java6/solr/build/solr-core/test/J0/./org.apache.solr.cloud.SyncSliceTest-1359700583526/jetty4
[junit4:junit4]   2> 19947 T122 oasc.SolrCore.getNewIndexDir New index directory detected: old=null new=./org.apache.solr.cloud.SyncSliceTest-1359700583526/jetty4/index/
[junit4:junit4]   2> 19948 T122 oasc.SolrCore.initIndex WARNING [collection1] Solr index directory './org.apache.solr.cloud.SyncSliceTest-1359700583526/jetty4/index' doesn't exist. Creating new index...
[junit4:junit4]   2> 19949 T122 oasc.CachingDirectoryFactory.get return new directory for /usr/home/hudson/hudson-slave/workspace/Lucene-Solr-Tests-4.x-Java6/solr/build/solr-core/test/J0/./org.apache.solr.cloud.SyncSliceTest-1359700583526/jetty4/index forceNew:false
[junit4:junit4]   2> 19955 T122 oasc.SolrDeletionPolicy.onCommit SolrDeletionPolicy.onCommit: commits:num=1
[junit4:junit4]   2> 		commit{dir=RateLimitedDirectoryWrapper(NRTCachingDirectory(org.apache.lucene.store.NIOFSDirectory@/usr/home/hudson/hudson-slave/workspace/Lucene-Solr-Tests-4.x-Java6/solr/build/solr-core/test/J0/org.apache.solr.cloud.SyncSliceTest-1359700583526/jetty4/index lockFactory=org.apache.lucene.store.NativeFSLockFactory@49431028; maxCacheMB=48.0 maxMergeSizeMB=4.0)),segFN=segments_1,generation=1,filenames=[segments_1]
[junit4:junit4]   2> 19956 T122 oasc.SolrDeletionPolicy.updateCommits newest commit = 1[segments_1]
[junit4:junit4]   2> 19957 T122 oasc.CachingDirectoryFactory.close Releasing directory:/usr/home/hudson/hudson-slave/workspace/Lucene-Solr-Tests-4.x-Java6/solr/build/solr-core/test/J0/./org.apache.solr.cloud.SyncSliceTest-1359700583526/jetty4/index
[junit4:junit4]   2> 19957 T122 oasc.SolrCore.initWriters created xml: solr.XMLResponseWriter
[junit4:junit4]   2> 19961 T122 oasup.UpdateRequestProcessorChain.init inserting DistributedUpdateProcessorFactory into updateRequestProcessorChain "dedupe"
[junit4:junit4]   2> 19961 T122 oasup.UpdateRequestProcessorChain.init inserting DistributedUpdateProcessorFactory into updateRequestProcessorChain "dedupe-allfields"
[junit4:junit4]   2> 19962 T122 oasup.UpdateRequestProcessorChain.init inserting DistributedUpdateProcessorFactory into updateRequestProcessorChain "stored_sig"
[junit4:junit4]   2> 19962 T122 oasup.UpdateRequestProcessorChain.init inserting DistributedUpdateProcessorFactory into updateRequestProcessorChain "uniq-fields"
[junit4:junit4]   2> 19963 T122 oasup.UpdateRequestProcessorChain.init inserting DistributedUpdateProcessorFactory into updateRequestProcessorChain "distrib-dup-test-chain-implicit"
[junit4:junit4]   2> 19963 T122 oasc.RequestHandlers.initHandlersFromConfig adding lazy requestHandler: solr.ReplicationHandler
[junit4:junit4]   2> 19964 T122 oasc.RequestHandlers.initHandlersFromConfig created /replication: solr.ReplicationHandler
[junit4:junit4]   2> 19965 T122 oasc.RequestHandlers.initHandlersFromConfig created standard: solr.StandardRequestHandler
[junit4:junit4]   2> 19966 T122 oasc.RequestHandlers.initHandlersFromConfig created /get: solr.RealTimeGetHandler
[junit4:junit4]   2> 19966 T122 oasc.RequestHandlers.initHandlersFromConfig created dismax: solr.SearchHandler
[junit4:junit4]   2> 19967 T122 oasc.RequestHandlers.initHandlersFromConfig created mock: org.apache.solr.core.MockQuerySenderListenerReqHandler
[junit4:junit4]   2> 19968 T122 oasc.RequestHandlers.initHandlersFromConfig created /admin/: org.apache.solr.handler.admin.AdminHandlers
[junit4:junit4]   2> 19969 T122 oasc.RequestHandlers.initHandlersFromConfig created defaults: solr.StandardRequestHandler
[junit4:junit4]   2> 19969 T122 oasc.RequestHandlers.initHandlersFromConfig adding lazy requestHandler: solr.StandardRequestHandler
[junit4:junit4]   2> 19970 T122 oasc.RequestHandlers.initHandlersFromConfig created lazy: solr.StandardRequestHandler
[junit4:junit4]   2> 19971 T122 oasc.RequestHandlers.initHandlersFromConfig created /update: solr.UpdateRequestHandler
[junit4:junit4]   2> 19972 T122 oasc.RequestHandlers.initHandlersFromConfig created /terms: org.apache.solr.handler.component.SearchHandler
[junit4:junit4]   2> 19972 T122 oasc.RequestHandlers.initHandlersFromConfig created spellCheckCompRH: org.apache.solr.handler.component.SearchHandler
[junit4:junit4]   2> 19973 T122 oasc.RequestHandlers.initHandlersFromConfig created spellCheckCompRH_Direct: org.apache.solr.handler.component.SearchHandler
[junit4:junit4]   2> 19974 T122 oasc.RequestHandlers.initHandlersFromConfig created spellCheckWithWordbreak: org.apache.solr.handler.component.SearchHandler
[junit4:junit4]   2> 19975 T122 oasc.RequestHandlers.initHandlersFromConfig created spellCheckWithWordbreak_Direct: org.apache.solr.handler.component.SearchHandler
[junit4:junit4]   2> 19976 T122 oasc.RequestHandlers.initHandlersFromConfig created spellCheckCompRH1: org.apache.solr.handler.component.SearchHandler
[junit4:junit4]   2> 19977 T122 oasc.RequestHandlers.initHandlersFromConfig created mltrh: org.apache.solr.handler.component.SearchHandler
[junit4:junit4]   2> 19978 T122 oasc.RequestHandlers.initHandlersFromConfig created tvrh: org.apache.solr.handler.component.SearchHandler
[junit4:junit4]   2> 19979 T122 oasc.RequestHandlers.initHandlersFromConfig created /mlt: solr.MoreLikeThisHandler
[junit4:junit4]   2> 19980 T122 oasc.RequestHandlers.initHandlersFromConfig created /debug/dump: solr.DumpRequestHandler
[junit4:junit4]   2> 19987 T122 oashl.XMLLoader.init xsltCacheLifetimeSeconds=60
[junit4:junit4]   2> 19992 T122 oasc.SolrCore.initDeprecatedSupport WARNING solrconfig.xml uses deprecated <admin/gettableFiles>, Please update your config to use the ShowFileRequestHandler.
[junit4:junit4]   2> 19994 T122 oasc.SolrCore.initDeprecatedSupport WARNING adding ShowFileRequestHandler with hidden files: [SCHEMA.XML, OLD_SYNONYMS.TXT, STOPWORDS.TXT, PROTWORDS.TXT, OPEN-EXCHANGE-RATES.JSON, SYNONYMS.TXT, CURRENCY.XML, MAPPING-ISOLATIN1ACCENT.TXT]
[junit4:junit4]   2> 19997 T122 oasc.CachingDirectoryFactory.close Releasing directory:/usr/home/hudson/hudson-slave/workspace/Lucene-Solr-Tests-4.x-Java6/solr/build/solr-core/test/J0/./org.apache.solr.cloud.SyncSliceTest-1359700583526/jetty4
[junit4:junit4]   2> 19998 T122 oass.SolrIndexSearcher.<init> Opening Searcher@17b0b765 main
[junit4:junit4]   2> 20000 T122 oasu.CommitTracker.<init> Hard AutoCommit: disabled
[junit4:junit4]   2> 20000 T122 oasu.CommitTracker.<init> Soft AutoCommit: disabled
[junit4:junit4]   2> 20001 T122 oashc.SpellCheckComponent.inform Initializing spell checkers
[junit4:junit4]   2> 20008 T122 oass.DirectSolrSpellChecker.init init: {name=direct,classname=DirectSolrSpellChecker,field=lowerfilt,minQueryLength=3}
[junit4:junit4]   2> 20068 T123 oasc.SolrCore.registerSearcher [collection1] Registered new searcher Searcher@17b0b765 main{StandardDirectoryReader(segments_1:1)}
[junit4:junit4]   2> 20078 T122 oasc.ZkController.publish publishing core=collection1 state=down
[junit4:junit4]   2> 20079 T122 oasc.ZkController.publish numShards not found on descriptor - reading it from system property
[junit4:junit4]   2> 21429 T54 oascc.ZkStateReader.updateClusterState Updating cloud state from ZooKeeper... 
[junit4:junit4]   2> 21430 T54 oasc.Overseer$ClusterStateUpdater.updateState Update state numShards=1 message={
[junit4:junit4]   2> 	  "operation":"state",
[junit4:junit4]   2> 	  "numShards":"1",
[junit4:junit4]   2> 	  "shard":null,
[junit4:junit4]   2> 	  "roles":null,
[junit4:junit4]   2> 	  "state":"down",
[junit4:junit4]   2> 	  "core":"collection1",
[junit4:junit4]   2> 	  "collection":"collection1",
[junit4:junit4]   2> 	  "node_name":"127.0.0.1:46904_ts%2Fnc",
[junit4:junit4]   2> 	  "base_url":"http://127.0.0.1:46904/ts/nc"}
[junit4:junit4]   2> 21430 T54 oasc.Overseer$ClusterStateUpdater.updateState Collection already exists with numShards=1
[junit4:junit4]   2> 21430 T54 oasc.Overseer$ClusterStateUpdater.updateState Assigning new node to shard shard=shard1
[junit4:junit4]   2> 21443 T72 oascc.ZkStateReader$2.process A cluster state change: WatchedEvent state:SyncConnected type:NodeDataChanged path:/clusterstate.json, has occurred - updating... (live nodes size: 5)
[junit4:junit4]   2> 21443 T53 oascc.ZkStateReader$2.process A cluster state change: WatchedEvent state:SyncConnected type:NodeDataChanged path:/clusterstate.json, has occurred - updating... (live nodes size: 5)
[junit4:junit4]   2> 21443 T87 oascc.ZkStateReader$2.process A cluster state change: WatchedEvent state:SyncConnected type:NodeDataChanged path:/clusterstate.json, has occurred - updating... (live nodes size: 5)
[junit4:junit4]   2> 21443 T59 oascc.ZkStateReader$2.process A cluster state change: WatchedEvent state:SyncConnected type:NodeDataChanged path:/clusterstate.json, has occurred - updating... (live nodes size: 5)
[junit4:junit4]   2> 21443 T103 oascc.ZkStateReader$2.process A cluster state change: WatchedEvent state:SyncConnected type:NodeDataChanged path:/clusterstate.json, has occurred - updating... (live nodes size: 5)
[junit4:junit4]   2> 21443 T121 oascc.ZkStateReader$2.process A cluster state change: WatchedEvent state:SyncConnected type:NodeDataChanged path:/clusterstate.json, has occurred - updating... (live nodes size: 5)
[junit4:junit4]   2> 22083 T122 oasc.CoreContainer.registerCore registering core: collection1
[junit4:junit4]   2> 22083 T122 oasc.ZkController.register Register replica - core:collection1 address:http://127.0.0.1:46904/ts/nc collection:collection1 shard:shard1
[junit4:junit4]   2> 22092 T122 oasc.ZkController.register We are http://127.0.0.1:46904/ts/nc/collection1/ and leader is http://127.0.0.1:52046/ts/nc/collection1/
[junit4:junit4]   2> 22092 T122 oasc.ZkController.register No LogReplay needed for core=collection1 baseURL=http://127.0.0.1:46904/ts/nc
[junit4:junit4]   2> 22092 T122 oasc.ZkController.checkRecovery Core needs to recover:collection1
[junit4:junit4]   2> 22093 T122 oasu.DefaultSolrCoreState.doRecovery Running recovery - first canceling any ongoing recovery
[junit4:junit4]   2> ASYNC  NEW_CORE C8 name=collection1 org.apache.solr.core.SolrCore@3fbebee url=http://127.0.0.1:46904/ts/nc/collection1 node=127.0.0.1:46904_ts%2Fnc C8_STATE=coll:collection1 core:collection1 props:{shard=null, roles=null, state=down, core=collection1, collection=collection1, node_name=127.0.0.1:46904_ts%2Fnc, base_url=http://127.0.0.1:46904/ts/nc}
[junit4:junit4]   2> 22093 T124 C8 P46904 oasc.RecoveryStrategy.run Starting recovery process.  core=collection1 recoveringAfterStartup=true
[junit4:junit4]   2> 22094 T124 C8 P46904 oasc.RecoveryStrategy.doRecovery ###### startupVersions=[]
[junit4:junit4]   2> 22094 T122 oascc.ZkStateReader.updateClusterState Updating cloud state from ZooKeeper... 
[junit4:junit4]   2> 22094 T124 C8 P46904 oasc.ZkController.publish publishing core=collection1 state=recovering
[junit4:junit4]   2> 22095 T124 C8 P46904 oasc.ZkController.publish numShards not found on descriptor - reading it from system property
[junit4:junit4]   2> 22096 T30 oass.SolrDispatchFilter.init user.dir=/usr/home/hudson/hudson-slave/workspace/Lucene-Solr-Tests-4.x-Java6/solr/build/solr-core/test/J0
[junit4:junit4]   2> 22096 T30 oass.SolrDispatchFilter.init SolrDispatchFilter.init() done
[junit4:junit4]   2> 22097 T30 oascsi.HttpClientUtil.createClient Creating new http client, config:maxConnections=128&maxConnectionsPerHost=32&followRedirects=false
[junit4:junit4]   2> 22119 T124 C8 P46904 oascsi.HttpClientUtil.createClient Creating new http client, config:maxConnections=128&maxConnectionsPerHost=32&followRedirects=false
[junit4:junit4]   2> 22119 T30 oascc.ZkStateReader.updateClusterState Updating cloud state from ZooKeeper... 
[junit4:junit4]   2> 22121 T30 oasc.AbstractFullDistribZkTestBase.waitForThingsToLevelOut Wait for recoveries to finish - wait 15 for each attempt
[junit4:junit4]   2> 22122 T30 oasc.AbstractDistribZkTestBase.waitForRecoveriesToFinish Wait for recoveries to finish - collection: collection1 failOnTimeout:true timeout (sec):15
[junit4:junit4]   2> 22123 T30 oascc.ZkStateReader.updateClusterState Updating cloud state from ZooKeeper... 
[junit4:junit4]   2>  C7_STATE=coll:collection1 core:collection1 props:{shard=shard1, roles=null, state=recovering, core=collection1, collection=collection1, node_name=127.0.0.1:45380_ts%2Fnc, base_url=http://127.0.0.1:45380/ts/nc}
[junit4:junit4]   2> 22755 T108 C7 P45380 oasc.RecoveryStrategy.doRecovery Attempting to PeerSync from http://127.0.0.1:52046/ts/nc/collection1/ core=collection1 - recoveringAfterStartup=true
[junit4:junit4]   2> 22755 T108 C7 P45380 oasu.PeerSync.sync PeerSync: core=collection1 url=http://127.0.0.1:45380/ts/nc START replicas=[http://127.0.0.1:52046/ts/nc/collection1/] nUpdates=100
[junit4:junit4]   2> 22756 T108 C7 P45380 oasu.PeerSync.sync WARNING no frame of reference to tell of we've missed updates
[junit4:junit4]   2> 22757 T108 C7 P45380 oasc.RecoveryStrategy.doRecovery PeerSync Recovery was not successful - trying replication. core=collection1
[junit4:junit4]   2> 22757 T108 C7 P45380 oasc.RecoveryStrategy.doRecovery Starting Replication Recovery. core=collection1
[junit4:junit4]   2> 22757 T108 C7 P45380 oasc.RecoveryStrategy.doRecovery Begin buffering updates. core=collection1
[junit4:junit4]   2> 22758 T108 C7 P45380 oasu.UpdateLog.bufferUpdates Starting to buffer updates. FSUpdateLog{state=ACTIVE, tlog=null}
[junit4:junit4]   2> 22758 T108 C7 P45380 oasc.RecoveryStrategy.replicate Attempting to replicate from http://127.0.0.1:52046/ts/nc/collection1/. core=collection1
[junit4:junit4]   2> 22758 T108 C7 P45380 oascsi.HttpClientUtil.createClient Creating new http client, config:maxConnections=128&maxConnectionsPerHost=32&followRedirects=false
[junit4:junit4]   2> 22760 T64 C6 P52046 REQ /get {getVersions=100&distrib=false&wt=javabin&qt=/get&version=2} status=0 QTime=0 
[junit4:junit4]   2> 22773 T68 C6 P52046 oasu.DirectUpdateHandler2.commit start commit{,optimize=false,openSearcher=false,waitSearcher=true,expungeDeletes=false,softCommit=false}
[junit4:junit4]   2> 22778 T68 C6 P52046 oasc.SolrDeletionPolicy.onCommit SolrDeletionPolicy.onCommit: commits:num=2
[junit4:junit4]   2> 		commit{dir=RateLimitedDirectoryWrapper(NRTCachingDirectory(org.apache.lucene.store.NIOFSDirectory@/usr/home/hudson/hudson-slave/workspace/Lucene-Solr-Tests-4.x-Java6/solr/build/solr-core/test/J0/org.apache.solr.cloud.SyncSliceTest-1359700583526/jetty1/index lockFactory=org.apache.lucene.store.NativeFSLockFactory@2b3e8c1c; maxCacheMB=48.0 maxMergeSizeMB=4.0)),segFN=segments_2,generation=2,filenames=[segments_2]
[junit4:junit4]   2> 		commit{dir=RateLimitedDirectoryWrapper(NRTCachingDirectory(org.apache.lucene.store.NIOFSDirectory@/usr/home/hudson/hudson-slave/workspace/Lucene-Solr-Tests-4.x-Java6/solr/build/solr-core/test/J0/org.apache.solr.cloud.SyncSliceTest-1359700583526/jetty1/index lockFactory=org.apache.lucene.store.NativeFSLockFactory@2b3e8c1c; maxCacheMB=48.0 maxMergeSizeMB=4.0)),segFN=segments_3,generation=3,filenames=[segments_3]
[junit4:junit4]   2> 22778 T68 C6 P52046 oasc.SolrDeletionPolicy.updateCommits newest commit = 3[segments_3]
[junit4:junit4]   2> 22779 T68 C6 P52046 oasc.CachingDirectoryFactory.close Releasing directory:/usr/home/hudson/hudson-slave/workspace/Lucene-Solr-Tests-4.x-Java6/solr/build/solr-core/test/J0/./org.apache.solr.cloud.SyncSliceTest-1359700583526/jetty1
[junit4:junit4]   2> 22780 T68 C6 P52046 oasu.DirectUpdateHandler2.commit end_commit_flush
[junit4:junit4]   2> 22780 T68 C6 P52046 /update {waitSearcher=true&openSearcher=false&commit=true&wt=javabin&commit_end_point=true&version=2&softCommit=false} {commit=} 0 7
[junit4:junit4]   2> 22781 T108 C7 P45380 oash.ReplicationHandler.inform Commits will be reserved for  10000
[junit4:junit4]   2> 22782 T108 C7 P45380 oash.SnapPuller.<init>  No value set for 'pollInterval'. Timer Task not started.
[junit4:junit4]   2> 22786 T65 C6 P52046 REQ /replication {command=indexversion&qt=/replication&wt=javabin&version=2} status=0 QTime=0 
[junit4:junit4]   2> 22787 T108 C7 P45380 oash.SnapPuller.fetchLatestIndex Master's generation: 3
[junit4:junit4]   2> 22787 T108 C7 P45380 oash.SnapPuller.fetchLatestIndex Slave's generation: 1
[junit4:junit4]   2> 22788 T108 C7 P45380 oash.SnapPuller.fetchLatestIndex Starting replication process
[junit4:junit4]   2> 22791 T65 C6 P52046 oasc.CachingDirectoryFactory.close Releasing directory:/usr/home/hudson/hudson-slave/workspace/Lucene-Solr-Tests-4.x-Java6/solr/build/solr-core/test/J0/./org.apache.solr.cloud.SyncSliceTest-1359700583526/jetty1
[junit4:junit4]   2> 22791 T65 C6 P52046 oasc.CachingDirectoryFactory.close Releasing directory:/usr/home/hudson/hudson-slave/workspace/Lucene-Solr-Tests-4.x-Java6/solr/build/solr-core/test/J0/./org.apache.solr.cloud.SyncSliceTest-1359700583526/jetty1/index
[junit4:junit4]   2> 22792 T65 C6 P52046 REQ /replication {command=filelist&qt=/replication&wt=javabin&generation=3&version=2} status=0 QTime=2 
[junit4:junit4]   2> 22793 T108 C7 P45380 oash.SnapPuller.fetchLatestIndex Number of files in latest index in master: 1
[junit4:junit4]   2> 22794 T108 C7 P45380 oasc.CachingDirectoryFactory.get return new directory for /usr/home/hudson/hudson-slave/workspace/Lucene-Solr-Tests-4.x-Java6/solr/build/solr-core/test/J0/./org.apache.solr.cloud.SyncSliceTest-1359700583526/jetty3/index.20130201063646315 forceNew:false
[junit4:junit4]   2> 22802 T108 C7 P45380 oasc.CachingDirectoryFactory.close Releasing directory:/usr/home/hudson/hudson-slave/workspace/Lucene-Solr-Tests-4.x-Java6/solr/build/solr-core/test/J0/./org.apache.solr.cloud.SyncSliceTest-1359700583526/jetty3
[junit4:junit4]   2> 22803 T108 C7 P45380 oash.SnapPuller.fetchLatestIndex Starting download to RateLimitedDirectoryWrapper(NRTCachingDirectory(org.apache.lucene.store.NIOFSDirectory@/usr/home/hudson/hudson-slave/workspace/Lucene-Solr-Tests-4.x-Java6/solr/build/solr-core/test/J0/org.apache.solr.cloud.SyncSliceTest-1359700583526/jetty3/index.20130201063646315 lockFactory=org.apache.lucene.store.NativeFSLockFactory@65ddc55f; maxCacheMB=48.0 maxMergeSizeMB=4.0)) fullCopy=true
[junit4:junit4]   2> 22807 T65 C6 P52046 REQ /replication {file=segments_3&command=filecontent&checksum=true&wt=filestream&qt=/replication&generation=3} status=0 QTime=1 
[junit4:junit4]   2> 22809 T108 C7 P45380 oasc.CachingDirectoryFactory.close Releasing directory:/usr/home/hudson/hudson-slave/workspace/Lucene-Solr-Tests-4.x-Java6/solr/build/solr-core/test/J0/./org.apache.solr.cloud.SyncSliceTest-1359700583526/jetty3/index
[junit4:junit4]   2> 22809 T108 C7 P45380 oash.SnapPuller.fetchLatestIndex Total time taken for download : 0 secs
[junit4:junit4]   2> 22810 T108 C7 P45380 oash.SnapPuller.modifyIndexProps New index installed. Updating index properties... index=index.20130201063646315
[junit4:junit4]   2> 22811 T108 C7 P45380 oasc.CachingDirectoryFactory.close Releasing directory:/usr/home/hudson/hudson-slave/workspace/Lucene-Solr-Tests-4.x-Java6/solr/build/solr-core/test/J0/./org.apache.solr.cloud.SyncSliceTest-1359700583526/jetty3


[...truncated too long message...]

irectory@/usr/home/hudson/hudson-slave/workspace/Lucene-Solr-Tests-4.x-Java6/solr/build/solr-core/test/J0/org.apache.solr.cloud.SyncSliceTest-1359700583526/jetty4/index lockFactory=org.apache.lucene.store.NativeFSLockFactory@49431028; maxCacheMB=48.0 maxMergeSizeMB=4.0))
[junit4:junit4]   2> 149941 T30 oasc.CachingDirectoryFactory.closeDirectory Closing directory:/usr/home/hudson/hudson-slave/workspace/Lucene-Solr-Tests-4.x-Java6/solr/build/solr-core/test/J0/./org.apache.solr.cloud.SyncSliceTest-1359700583526/jetty4/index.20130201063648713
[junit4:junit4]   2> 149942 T30 oash.SnapPuller$2.postClose removing old index directory RateLimitedDirectoryWrapper(NRTCachingDirectory(org.apache.lucene.store.NIOFSDirectory@/usr/home/hudson/hudson-slave/workspace/Lucene-Solr-Tests-4.x-Java6/solr/build/solr-core/test/J0/org.apache.solr.cloud.SyncSliceTest-1359700583526/jetty4/index lockFactory=org.apache.lucene.store.NativeFSLockFactory@49431028; maxCacheMB=48.0 maxMergeSizeMB=4.0))
[junit4:junit4]   2> 149943 T30 oasc.CachingDirectoryFactory.close Closing directory when closing factory:/usr/home/hudson/hudson-slave/workspace/Lucene-Solr-Tests-4.x-Java6/solr/build/solr-core/test/J0/./org.apache.solr.cloud.SyncSliceTest-1359700583526/jetty4/index
[junit4:junit4]   2> 149943 T30 oasc.CachingDirectoryFactory.closeDirectory Closing directory:/usr/home/hudson/hudson-slave/workspace/Lucene-Solr-Tests-4.x-Java6/solr/build/solr-core/test/J0/./org.apache.solr.cloud.SyncSliceTest-1359700583526/jetty4/index
[junit4:junit4]   2> 149943 T30 oasc.CachingDirectoryFactory.close Closing directory when closing factory:/usr/home/hudson/hudson-slave/workspace/Lucene-Solr-Tests-4.x-Java6/solr/build/solr-core/test/J0/./org.apache.solr.cloud.SyncSliceTest-1359700583526/jetty4
[junit4:junit4]   2> 149944 T30 oasc.CachingDirectoryFactory.closeDirectory Closing directory:/usr/home/hudson/hudson-slave/workspace/Lucene-Solr-Tests-4.x-Java6/solr/build/solr-core/test/J0/./org.apache.solr.cloud.SyncSliceTest-1359700583526/jetty4
[junit4:junit4]   2> 150240 T121 oaz.ClientCnxn$EventThread.run EventThread shut down
[junit4:junit4]   2> 150240 T30 oaz.ZooKeeper.close Session: 0x13c94786599000c closed
[junit4:junit4]   2> 150242 T30 oejsh.ContextHandler.doStop stopped o.e.j.s.ServletContextHandler{/ts/nc,null}
[junit4:junit4]   2> 150551 T30 oas.SolrTestCaseJ4.tearDown ###Ending testDistribSearch
[junit4:junit4]   1> client port:0.0.0.0/0.0.0.0:0
[junit4:junit4]   2> NOTE: reproduce with: ant test  -Dtestcase=SyncSliceTest -Dtests.method=testDistribSearch -Dtests.seed=7F12AEE6E902F2D8 -Dtests.multiplier=3 -Dtests.slow=true -Dtests.locale=hu_HU -Dtests.timezone=GMT -Dtests.file.encoding=UTF-8
[junit4:junit4] FAILURE  151s J0 | SyncSliceTest.testDistribSearch <<<
[junit4:junit4]    > Throwable #1: java.lang.AssertionError: shard1 should have just been set up to be inconsistent - but it's still consistent
[junit4:junit4]    > 	at __randomizedtesting.SeedInfo.seed([7F12AEE6E902F2D8:FEF420FE9E5D92E4]:0)
[junit4:junit4]    > 	at org.junit.Assert.fail(Assert.java:93)
[junit4:junit4]    > 	at org.junit.Assert.assertTrue(Assert.java:43)
[junit4:junit4]    > 	at org.junit.Assert.assertNotNull(Assert.java:526)
[junit4:junit4]    > 	at org.apache.solr.cloud.SyncSliceTest.doTest(SyncSliceTest.java:214)
[junit4:junit4]    > 	at org.apache.solr.BaseDistributedSearchTestCase.testDistribSearch(BaseDistributedSearchTestCase.java:794)
[junit4:junit4]    > 	at sun.reflect.NativeMethodAccessorImpl.invoke0(Native Method)
[junit4:junit4]    > 	at sun.reflect.NativeMethodAccessorImpl.invoke(NativeMethodAccessorImpl.java:57)
[junit4:junit4]    > 	at sun.reflect.DelegatingMethodAccessorImpl.invoke(DelegatingMethodAccessorImpl.java:43)
[junit4:junit4]    > 	at java.lang.reflect.Method.invoke(Method.java:616)
[junit4:junit4]    > 	at com.carrotsearch.randomizedtesting.RandomizedRunner.invoke(RandomizedRunner.java:1559)
[junit4:junit4]    > 	at com.carrotsearch.randomizedtesting.RandomizedRunner.access$600(RandomizedRunner.java:79)
[junit4:junit4]    > 	at com.carrotsearch.randomizedtesting.RandomizedRunner$6.evaluate(RandomizedRunner.java:737)
[junit4:junit4]    > 	at com.carrotsearch.randomizedtesting.RandomizedRunner$7.evaluate(RandomizedRunner.java:773)
[junit4:junit4]    > 	at com.carrotsearch.randomizedtesting.RandomizedRunner$8.evaluate(RandomizedRunner.java:787)
[junit4:junit4]    > 	at com.carrotsearch.randomizedtesting.rules.SystemPropertiesRestoreRule$1.evaluate(SystemPropertiesRestoreRule.java:53)
[junit4:junit4]    > 	at org.apache.lucene.util.TestRuleSetupTeardownChained$1.evaluate(TestRuleSetupTeardownChained.java:50)
[junit4:junit4]    > 	at org.apache.lucene.util.TestRuleFieldCacheSanity$1.evaluate(TestRuleFieldCacheSanity.java:51)
[junit4:junit4]    > 	at org.apache.lucene.util.AbstractBeforeAfterRule$1.evaluate(AbstractBeforeAfterRule.java:46)
[junit4:junit4]    > 	at com.carrotsearch.randomizedtesting.rules.SystemPropertiesInvariantRule$1.evaluate(SystemPropertiesInvariantRule.java:55)
[junit4:junit4]    > 	at org.apache.lucene.util.TestRuleThreadAndTestName$1.evaluate(TestRuleThreadAndTestName.java:49)
[junit4:junit4]    > 	at org.apache.lucene.util.TestRuleIgnoreAfterMaxFailures$1.evaluate(TestRuleIgnoreAfterMaxFailures.java:70)
[junit4:junit4]    > 	at org.apache.lucene.util.TestRuleMarkFailure$1.evaluate(TestRuleMarkFailure.java:48)
[junit4:junit4]    > 	at com.carrotsearch.randomizedtesting.rules.StatementAdapter.evaluate(StatementAdapter.java:36)
[junit4:junit4]    > 	at com.carrotsearch.randomizedtesting.ThreadLeakControl$StatementRunner.run(ThreadLeakControl.java:358)
[junit4:junit4]    > 	at com.carrotsearch.randomizedtesting.ThreadLeakControl.forkTimeoutingTask(ThreadLeakControl.java:782)
[junit4:junit4]    > 	at com.carrotsearch.randomizedtesting.ThreadLeakControl$3.evaluate(ThreadLeakControl.java:442)
[junit4:junit4]    > 	at com.carrotsearch.randomizedtesting.RandomizedRunner.runSingleTest(RandomizedRunner.java:746)
[junit4:junit4]    > 	at com.carrotsearch.randomizedtesting.RandomizedRunner$3.evaluate(RandomizedRunner.java:648)
[junit4:junit4]    > 	at com.carrotsearch.randomizedtesting.RandomizedRunner$4.evaluate(RandomizedRunner.java:682)
[junit4:junit4]    > 	at com.carrotsearch.randomizedtesting.RandomizedRunner$5.evaluate(RandomizedRunner.java:693)
[junit4:junit4]    > 	at com.carrotsearch.randomizedtesting.rules.StatementAdapter.evaluate(StatementAdapter.java:36)
[junit4:junit4]    > 	at com.carrotsearch.randomizedtesting.rules.SystemPropertiesRestoreRule$1.evaluate(SystemPropertiesRestoreRule.java:53)
[junit4:junit4]    > 	at org.apache.lucene.util.AbstractBeforeAfterRule$1.evaluate(AbstractBeforeAfterRule.java:46)
[junit4:junit4]    > 	at org.apache.lucene.util.TestRuleStoreClassName$1.evaluate(TestRuleStoreClassName.java:42)
[junit4:junit4]    > 	at com.carrotsearch.randomizedtesting.rules.SystemPropertiesInvariantRule$1.evaluate(SystemPropertiesInvariantRule.java:55)
[junit4:junit4]    > 	at com.carrotsearch.randomizedtesting.rules.NoShadowingOrOverridesOnMethodsRule$1.evaluate(NoShadowingOrOverridesOnMethodsRule.java:39)
[junit4:junit4]    > 	at com.carrotsearch.randomizedtesting.rules.NoShadowingOrOverridesOnMethodsRule$1.evaluate(NoShadowingOrOverridesOnMethodsRule.java:39)
[junit4:junit4]    > 	at com.carrotsearch.randomizedtesting.rules.StatementAdapter.evaluate(StatementAdapter.java:36)
[junit4:junit4]    > 	at org.apache.lucene.util.TestRuleAssertionsRequired$1.evaluate(TestRuleAssertionsRequired.java:43)
[junit4:junit4]    > 	at org.apache.lucene.util.TestRuleMarkFailure$1.evaluate(TestRuleMarkFailure.java:48)
[junit4:junit4]    > 	at org.apache.lucene.util.TestRuleIgnoreAfterMaxFailures$1.evaluate(TestRuleIgnoreAfterMaxFailures.java:70)
[junit4:junit4]    > 	at org.apache.lucene.util.TestRuleIgnoreTestSuites$1.evaluate(TestRuleIgnoreTestSuites.java:55)
[junit4:junit4]    > 	at com.carrotsearch.randomizedtesting.rules.StatementAdapter.evaluate(StatementAdapter.java:36)
[junit4:junit4]    > 	at com.carrotsearch.randomizedtesting.ThreadLeakControl$StatementRunner.run(ThreadLeakControl.java:358)
[junit4:junit4]    > 	at java.lang.Thread.run(Thread.java:679)
[junit4:junit4]   2> 150580 T30 oas.SolrTestCaseJ4.deleteCore ###deleteCore
[junit4:junit4]   2> NOTE: test params are: codec=Asserting, sim=RandomSimilarityProvider(queryNorm=true,coord=crazy): {}, locale=hu_HU, timezone=GMT
[junit4:junit4]   2> NOTE: FreeBSD 9.0-RELEASE amd64/Sun Microsystems Inc. 1.6.0_32 (64-bit)/cpus=16,threads=2,free=366744456,total=430768128
[junit4:junit4]   2> NOTE: All tests run in this JVM: [WordBreakSolrSpellCheckerTest, RequestHandlersTest, NumericFieldsTest, TestCollationField, TestLFUCache, TestPostingsSolrHighlighter, ScriptEngineTest, SyncSliceTest]
[junit4:junit4] Completed on J0 in 150.61s, 1 test, 1 failure <<< FAILURES!

[...truncated 593 lines...]
BUILD FAILED
/usr/home/hudson/hudson-slave/workspace/Lucene-Solr-Tests-4.x-Java6/build.xml:346: The following error occurred while executing this line:
/usr/home/hudson/hudson-slave/workspace/Lucene-Solr-Tests-4.x-Java6/build.xml:39: The following error occurred while executing this line:
/usr/home/hudson/hudson-slave/workspace/Lucene-Solr-Tests-4.x-Java6/solr/build.xml:178: The following error occurred while executing this line:
/usr/home/hudson/hudson-slave/workspace/Lucene-Solr-Tests-4.x-Java6/solr/common-build.xml:428: The following error occurred while executing this line:
/usr/home/hudson/hudson-slave/workspace/Lucene-Solr-Tests-4.x-Java6/lucene/common-build.xml:1176: The following error occurred while executing this line:
/usr/home/hudson/hudson-slave/workspace/Lucene-Solr-Tests-4.x-Java6/lucene/common-build.xml:841: There were test failures: 249 suites, 1040 tests, 1 failure, 24 ignored (6 assumptions)

Total time: 34 minutes 18 seconds
Build step 'Invoke Ant' marked build as failure
Archiving artifacts
Recording test results
Email was triggered for: Failure
Sending email for trigger: Failure



Mime
View raw message