lucene-dev mailing list archives

Site index · List index
Message view « Date » · « Thread »
Top « Date » · « Thread »
From Apache Jenkins Server <jenk...@builds.apache.org>
Subject [JENKINS] Lucene-Solr-Tests-4.x-java7 - Build # 953 - Still Failing
Date Fri, 01 Feb 2013 08:22:14 GMT
Build: https://builds.apache.org/job/Lucene-Solr-Tests-4.x-java7/953/

1 tests failed.
REGRESSION:  org.apache.solr.cloud.BasicDistributedZkTest.testDistribSearch

Error Message:
IOException occured when talking to server at: http://127.0.0.1:63010/unloadcollection3

Stack Trace:
org.apache.solr.client.solrj.SolrServerException: IOException occured when talking to server at: http://127.0.0.1:63010/unloadcollection3
	at __randomizedtesting.SeedInfo.seed([39D2DCB1BD0E13EC:B83452A9CA5173D0]:0)
	at org.apache.solr.client.solrj.impl.HttpSolrServer.request(HttpSolrServer.java:416)
	at org.apache.solr.client.solrj.impl.HttpSolrServer.request(HttpSolrServer.java:181)
	at org.apache.solr.client.solrj.request.AbstractUpdateRequest.process(AbstractUpdateRequest.java:117)
	at org.apache.solr.client.solrj.SolrServer.add(SolrServer.java:116)
	at org.apache.solr.client.solrj.SolrServer.add(SolrServer.java:102)
	at org.apache.solr.cloud.BasicDistributedZkTest.testCoreUnloadAndLeaders(BasicDistributedZkTest.java:502)
	at org.apache.solr.cloud.BasicDistributedZkTest.doTest(BasicDistributedZkTest.java:337)
	at org.apache.solr.BaseDistributedSearchTestCase.testDistribSearch(BaseDistributedSearchTestCase.java:794)
	at sun.reflect.NativeMethodAccessorImpl.invoke0(Native Method)
	at sun.reflect.NativeMethodAccessorImpl.invoke(NativeMethodAccessorImpl.java:57)
	at sun.reflect.DelegatingMethodAccessorImpl.invoke(DelegatingMethodAccessorImpl.java:43)
	at java.lang.reflect.Method.invoke(Method.java:601)
	at com.carrotsearch.randomizedtesting.RandomizedRunner.invoke(RandomizedRunner.java:1559)
	at com.carrotsearch.randomizedtesting.RandomizedRunner.access$600(RandomizedRunner.java:79)
	at com.carrotsearch.randomizedtesting.RandomizedRunner$6.evaluate(RandomizedRunner.java:737)
	at com.carrotsearch.randomizedtesting.RandomizedRunner$7.evaluate(RandomizedRunner.java:773)
	at com.carrotsearch.randomizedtesting.RandomizedRunner$8.evaluate(RandomizedRunner.java:787)
	at com.carrotsearch.randomizedtesting.rules.SystemPropertiesRestoreRule$1.evaluate(SystemPropertiesRestoreRule.java:53)
	at org.apache.lucene.util.TestRuleSetupTeardownChained$1.evaluate(TestRuleSetupTeardownChained.java:50)
	at org.apache.lucene.util.TestRuleFieldCacheSanity$1.evaluate(TestRuleFieldCacheSanity.java:51)
	at org.apache.lucene.util.AbstractBeforeAfterRule$1.evaluate(AbstractBeforeAfterRule.java:46)
	at com.carrotsearch.randomizedtesting.rules.SystemPropertiesInvariantRule$1.evaluate(SystemPropertiesInvariantRule.java:55)
	at org.apache.lucene.util.TestRuleThreadAndTestName$1.evaluate(TestRuleThreadAndTestName.java:49)
	at org.apache.lucene.util.TestRuleIgnoreAfterMaxFailures$1.evaluate(TestRuleIgnoreAfterMaxFailures.java:70)
	at org.apache.lucene.util.TestRuleMarkFailure$1.evaluate(TestRuleMarkFailure.java:48)
	at com.carrotsearch.randomizedtesting.rules.StatementAdapter.evaluate(StatementAdapter.java:36)
	at com.carrotsearch.randomizedtesting.ThreadLeakControl$StatementRunner.run(ThreadLeakControl.java:358)
	at com.carrotsearch.randomizedtesting.ThreadLeakControl.forkTimeoutingTask(ThreadLeakControl.java:782)
	at com.carrotsearch.randomizedtesting.ThreadLeakControl$3.evaluate(ThreadLeakControl.java:442)
	at com.carrotsearch.randomizedtesting.RandomizedRunner.runSingleTest(RandomizedRunner.java:746)
	at com.carrotsearch.randomizedtesting.RandomizedRunner$3.evaluate(RandomizedRunner.java:648)
	at com.carrotsearch.randomizedtesting.RandomizedRunner$4.evaluate(RandomizedRunner.java:682)
	at com.carrotsearch.randomizedtesting.RandomizedRunner$5.evaluate(RandomizedRunner.java:693)
	at com.carrotsearch.randomizedtesting.rules.StatementAdapter.evaluate(StatementAdapter.java:36)
	at com.carrotsearch.randomizedtesting.rules.SystemPropertiesRestoreRule$1.evaluate(SystemPropertiesRestoreRule.java:53)
	at org.apache.lucene.util.AbstractBeforeAfterRule$1.evaluate(AbstractBeforeAfterRule.java:46)
	at org.apache.lucene.util.TestRuleStoreClassName$1.evaluate(TestRuleStoreClassName.java:42)
	at com.carrotsearch.randomizedtesting.rules.SystemPropertiesInvariantRule$1.evaluate(SystemPropertiesInvariantRule.java:55)
	at com.carrotsearch.randomizedtesting.rules.NoShadowingOrOverridesOnMethodsRule$1.evaluate(NoShadowingOrOverridesOnMethodsRule.java:39)
	at com.carrotsearch.randomizedtesting.rules.NoShadowingOrOverridesOnMethodsRule$1.evaluate(NoShadowingOrOverridesOnMethodsRule.java:39)
	at com.carrotsearch.randomizedtesting.rules.StatementAdapter.evaluate(StatementAdapter.java:36)
	at org.apache.lucene.util.TestRuleAssertionsRequired$1.evaluate(TestRuleAssertionsRequired.java:43)
	at org.apache.lucene.util.TestRuleMarkFailure$1.evaluate(TestRuleMarkFailure.java:48)
	at org.apache.lucene.util.TestRuleIgnoreAfterMaxFailures$1.evaluate(TestRuleIgnoreAfterMaxFailures.java:70)
	at org.apache.lucene.util.TestRuleIgnoreTestSuites$1.evaluate(TestRuleIgnoreTestSuites.java:55)
	at com.carrotsearch.randomizedtesting.rules.StatementAdapter.evaluate(StatementAdapter.java:36)
	at com.carrotsearch.randomizedtesting.ThreadLeakControl$StatementRunner.run(ThreadLeakControl.java:358)
	at java.lang.Thread.run(Thread.java:722)
Caused by: org.apache.http.NoHttpResponseException: The target server failed to respond
	at org.apache.http.impl.conn.DefaultResponseParser.parseHead(DefaultResponseParser.java:101)
	at org.apache.http.impl.io.AbstractMessageParser.parse(AbstractMessageParser.java:252)
	at org.apache.http.impl.AbstractHttpClientConnection.receiveResponseHeader(AbstractHttpClientConnection.java:282)
	at org.apache.http.impl.conn.DefaultClientConnection.receiveResponseHeader(DefaultClientConnection.java:247)
	at org.apache.http.impl.conn.AbstractClientConnAdapter.receiveResponseHeader(AbstractClientConnAdapter.java:216)
	at org.apache.http.protocol.HttpRequestExecutor.doReceiveResponse(HttpRequestExecutor.java:298)
	at org.apache.http.protocol.HttpRequestExecutor.execute(HttpRequestExecutor.java:125)
	at org.apache.http.impl.client.DefaultRequestDirector.tryExecute(DefaultRequestDirector.java:647)
	at org.apache.http.impl.client.DefaultRequestDirector.execute(DefaultRequestDirector.java:464)
	at org.apache.http.impl.client.AbstractHttpClient.execute(AbstractHttpClient.java:820)
	at org.apache.http.impl.client.AbstractHttpClient.execute(AbstractHttpClient.java:754)
	at org.apache.http.impl.client.AbstractHttpClient.execute(AbstractHttpClient.java:732)
	at org.apache.solr.client.solrj.impl.HttpSolrServer.request(HttpSolrServer.java:353)
	... 47 more




Build Log:
[...truncated 8799 lines...]
[junit4:junit4] Suite: org.apache.solr.cloud.BasicDistributedZkTest
[junit4:junit4]   2> 1 T554 oas.BaseDistributedSearchTestCase.initHostContext Setting hostContext system property: /
[junit4:junit4]   2> 7 T554 oas.SolrTestCaseJ4.setUp ###Starting testDistribSearch
[junit4:junit4]   2> Creating dataDir: /usr/home/hudson/hudson-slave/workspace/Lucene-Solr-Tests-4.x-java7/solr/build/solr-core/test/J0/./solrtest-BasicDistributedZkTest-1359705998839
[junit4:junit4]   2> 8 T554 oasc.ZkTestServer.run STARTING ZK TEST SERVER
[junit4:junit4]   2> 9 T555 oasc.ZkTestServer$ZKServerMain.runFromConfig Starting server
[junit4:junit4]   2> 12 T555 oazs.ZooKeeperServer.setTickTime tickTime set to 1000
[junit4:junit4]   2> 12 T555 oazs.ZooKeeperServer.setMinSessionTimeout minSessionTimeout set to -1
[junit4:junit4]   2> 12 T555 oazs.ZooKeeperServer.setMaxSessionTimeout maxSessionTimeout set to -1
[junit4:junit4]   2> 12 T555 oazs.NIOServerCnxnFactory.configure binding to port 0.0.0.0/0.0.0.0:0
[junit4:junit4]   2> 13 T555 oazsp.FileTxnSnapLog.save Snapshotting: 0x0 to /usr/home/hudson/hudson-slave/workspace/Lucene-Solr-Tests-4.x-java7/solr/build/solr-core/test/J0/./org.apache.solr.cloud.BasicDistributedZkTest-1359705998839/zookeeper/server1/data/version-2/snapshot.0
[junit4:junit4]   2> 109 T554 oasc.ZkTestServer.run start zk server on port:62978
[junit4:junit4]   2> 109 T554 oaz.ZooKeeper.<init> Initiating client connection, connectString=127.0.0.1:62978 sessionTimeout=10000 watcher=org.apache.solr.common.cloud.ConnectionManager@24429290
[junit4:junit4]   2> 110 T554 oascc.ConnectionManager.waitForConnected Waiting for client to connect to ZooKeeper
[junit4:junit4]   2> 111 T560 oaz.ClientCnxn$SendThread.logStartConnect Opening socket connection to server localhost/127.0.0.1:62978. Will not attempt to authenticate using SASL (access denied ("javax.security.auth.AuthPermission" "getLoginConfiguration"))
[junit4:junit4]   2> 111 T560 oaz.ClientCnxn$SendThread.primeConnection Socket connection established to localhost/127.0.0.1:62978, initiating session
[junit4:junit4]   2> 112 T556 oazs.NIOServerCnxnFactory.run Accepted socket connection from /140.211.11.196:62979
[junit4:junit4]   2> 112 T556 oazs.ZooKeeperServer.processConnectRequest Client attempting to establish new session at /140.211.11.196:62979
[junit4:junit4]   2> 113 T558 oazsp.FileTxnLog.append Creating new log file: log.1
[junit4:junit4]   2> 140 T558 oazs.ZooKeeperServer.finishSessionInit Established session 0x13c94cb05fe0000 with negotiated timeout 10000 for client /140.211.11.196:62979
[junit4:junit4]   2> 141 T560 oaz.ClientCnxn$SendThread.onConnected Session establishment complete on server localhost/127.0.0.1:62978, sessionid = 0x13c94cb05fe0000, negotiated timeout = 10000
[junit4:junit4]   2> 141 T561 oascc.ConnectionManager.process Watcher org.apache.solr.common.cloud.ConnectionManager@24429290 name:ZooKeeperConnection Watcher:127.0.0.1:62978 got event WatchedEvent state:SyncConnected type:None path:null path:null type:None
[junit4:junit4]   2> 141 T554 oascc.ConnectionManager.waitForConnected Client is connected to ZooKeeper
[junit4:junit4]   2> 142 T554 oascc.SolrZkClient.makePath makePath: /solr
[junit4:junit4]   2> 145 T559 oazs.PrepRequestProcessor.pRequest2Txn Processed session termination for sessionid: 0x13c94cb05fe0000
[junit4:junit4]   2> 154 T561 oaz.ClientCnxn$EventThread.run EventThread shut down
[junit4:junit4]   2> 154 T556 oazs.NIOServerCnxn.closeSock Closed socket connection for client /140.211.11.196:62979 which had sessionid 0x13c94cb05fe0000
[junit4:junit4]   2> 154 T554 oaz.ZooKeeper.close Session: 0x13c94cb05fe0000 closed
[junit4:junit4]   2> 154 T554 oaz.ZooKeeper.<init> Initiating client connection, connectString=127.0.0.1:62978/solr sessionTimeout=10000 watcher=org.apache.solr.common.cloud.ConnectionManager@4f733919
[junit4:junit4]   2> 155 T554 oascc.ConnectionManager.waitForConnected Waiting for client to connect to ZooKeeper
[junit4:junit4]   2> 156 T562 oaz.ClientCnxn$SendThread.logStartConnect Opening socket connection to server localhost/127.0.0.1:62978. Will not attempt to authenticate using SASL (access denied ("javax.security.auth.AuthPermission" "getLoginConfiguration"))
[junit4:junit4]   2> 156 T562 oaz.ClientCnxn$SendThread.primeConnection Socket connection established to localhost/127.0.0.1:62978, initiating session
[junit4:junit4]   2> 156 T556 oazs.NIOServerCnxnFactory.run Accepted socket connection from /140.211.11.196:62980
[junit4:junit4]   2> 157 T556 oazs.ZooKeeperServer.processConnectRequest Client attempting to establish new session at /140.211.11.196:62980
[junit4:junit4]   2> 158 T558 oazs.ZooKeeperServer.finishSessionInit Established session 0x13c94cb05fe0001 with negotiated timeout 10000 for client /140.211.11.196:62980
[junit4:junit4]   2> 158 T562 oaz.ClientCnxn$SendThread.onConnected Session establishment complete on server localhost/127.0.0.1:62978, sessionid = 0x13c94cb05fe0001, negotiated timeout = 10000
[junit4:junit4]   2> 158 T563 oascc.ConnectionManager.process Watcher org.apache.solr.common.cloud.ConnectionManager@4f733919 name:ZooKeeperConnection Watcher:127.0.0.1:62978/solr got event WatchedEvent state:SyncConnected type:None path:null path:null type:None
[junit4:junit4]   2> 158 T554 oascc.ConnectionManager.waitForConnected Client is connected to ZooKeeper
[junit4:junit4]   2> 159 T554 oascc.SolrZkClient.makePath makePath: /collections/collection1
[junit4:junit4]   2> 164 T554 oascc.SolrZkClient.makePath makePath: /collections/collection1/shards
[junit4:junit4]   2> 173 T554 oascc.SolrZkClient.makePath makePath: /collections/control_collection
[junit4:junit4]   2> 176 T554 oascc.SolrZkClient.makePath makePath: /collections/control_collection/shards
[junit4:junit4]   2> 180 T554 oasc.AbstractZkTestCase.putConfig put /usr/home/hudson/hudson-slave/workspace/Lucene-Solr-Tests-4.x-java7/solr/build/solr-core/test-files/solr/collection1/conf/solrconfig.xml to /configs/conf1/solrconfig.xml
[junit4:junit4]   2> 181 T554 oascc.SolrZkClient.makePath makePath: /configs/conf1/solrconfig.xml
[junit4:junit4]   2> 194 T554 oasc.AbstractZkTestCase.putConfig put /usr/home/hudson/hudson-slave/workspace/Lucene-Solr-Tests-4.x-java7/solr/build/solr-core/test-files/solr/collection1/conf/schema.xml to /configs/conf1/schema.xml
[junit4:junit4]   2> 195 T554 oascc.SolrZkClient.makePath makePath: /configs/conf1/schema.xml
[junit4:junit4]   2> 301 T554 oasc.AbstractZkTestCase.putConfig put /usr/home/hudson/hudson-slave/workspace/Lucene-Solr-Tests-4.x-java7/solr/build/solr-core/test-files/solr/collection1/conf/stopwords.txt to /configs/conf1/stopwords.txt
[junit4:junit4]   2> 302 T554 oascc.SolrZkClient.makePath makePath: /configs/conf1/stopwords.txt
[junit4:junit4]   2> 307 T554 oasc.AbstractZkTestCase.putConfig put /usr/home/hudson/hudson-slave/workspace/Lucene-Solr-Tests-4.x-java7/solr/build/solr-core/test-files/solr/collection1/conf/protwords.txt to /configs/conf1/protwords.txt
[junit4:junit4]   2> 307 T554 oascc.SolrZkClient.makePath makePath: /configs/conf1/protwords.txt
[junit4:junit4]   2> 312 T554 oasc.AbstractZkTestCase.putConfig put /usr/home/hudson/hudson-slave/workspace/Lucene-Solr-Tests-4.x-java7/solr/build/solr-core/test-files/solr/collection1/conf/currency.xml to /configs/conf1/currency.xml
[junit4:junit4]   2> 312 T554 oascc.SolrZkClient.makePath makePath: /configs/conf1/currency.xml
[junit4:junit4]   2> 317 T554 oasc.AbstractZkTestCase.putConfig put /usr/home/hudson/hudson-slave/workspace/Lucene-Solr-Tests-4.x-java7/solr/build/solr-core/test-files/solr/collection1/conf/open-exchange-rates.json to /configs/conf1/open-exchange-rates.json
[junit4:junit4]   2> 317 T554 oascc.SolrZkClient.makePath makePath: /configs/conf1/open-exchange-rates.json
[junit4:junit4]   2> 322 T554 oasc.AbstractZkTestCase.putConfig put /usr/home/hudson/hudson-slave/workspace/Lucene-Solr-Tests-4.x-java7/solr/build/solr-core/test-files/solr/collection1/conf/mapping-ISOLatin1Accent.txt to /configs/conf1/mapping-ISOLatin1Accent.txt
[junit4:junit4]   2> 322 T554 oascc.SolrZkClient.makePath makePath: /configs/conf1/mapping-ISOLatin1Accent.txt
[junit4:junit4]   2> 327 T554 oasc.AbstractZkTestCase.putConfig put /usr/home/hudson/hudson-slave/workspace/Lucene-Solr-Tests-4.x-java7/solr/build/solr-core/test-files/solr/collection1/conf/old_synonyms.txt to /configs/conf1/old_synonyms.txt
[junit4:junit4]   2> 327 T554 oascc.SolrZkClient.makePath makePath: /configs/conf1/old_synonyms.txt
[junit4:junit4]   2> 331 T554 oasc.AbstractZkTestCase.putConfig put /usr/home/hudson/hudson-slave/workspace/Lucene-Solr-Tests-4.x-java7/solr/build/solr-core/test-files/solr/collection1/conf/synonyms.txt to /configs/conf1/synonyms.txt
[junit4:junit4]   2> 332 T554 oascc.SolrZkClient.makePath makePath: /configs/conf1/synonyms.txt
[junit4:junit4]   2> 336 T559 oazs.PrepRequestProcessor.pRequest2Txn Processed session termination for sessionid: 0x13c94cb05fe0001
[junit4:junit4]   2> 337 T563 oaz.ClientCnxn$EventThread.run EventThread shut down
[junit4:junit4]   2> 337 T556 oazs.NIOServerCnxn.closeSock Closed socket connection for client /140.211.11.196:62980 which had sessionid 0x13c94cb05fe0001
[junit4:junit4]   2> 337 T554 oaz.ZooKeeper.close Session: 0x13c94cb05fe0001 closed
[junit4:junit4]   2> 506 T554 oejs.Server.doStart jetty-8.1.8.v20121106
[junit4:junit4]   2> 517 T554 oejs.AbstractConnector.doStart Started SocketConnector@127.0.0.1:62981
[junit4:junit4]   2> 518 T554 oass.SolrDispatchFilter.init SolrDispatchFilter.init()
[junit4:junit4]   2> 519 T554 oasc.SolrResourceLoader.locateSolrHome JNDI not configured for solr (NoInitialContextEx)
[junit4:junit4]   2> 519 T554 oasc.SolrResourceLoader.locateSolrHome using system property solr.solr.home: /usr/home/hudson/hudson-slave/workspace/Lucene-Solr-Tests-4.x-java7/solr/build/solr-core/test/J0/./org.apache.solr.cloud.BasicDistributedZkTest-controljetty-1359705999170
[junit4:junit4]   2> 519 T554 oasc.CoreContainer$Initializer.initialize looking for solr.xml: /usr/home/hudson/hudson-slave/workspace/Lucene-Solr-Tests-4.x-java7/solr/build/solr-core/test/J0/./org.apache.solr.cloud.BasicDistributedZkTest-controljetty-1359705999170/solr.xml
[junit4:junit4]   2> 520 T554 oasc.CoreContainer.<init> New CoreContainer 1830370815
[junit4:junit4]   2> 520 T554 oasc.CoreContainer.load Loading CoreContainer using Solr Home: '/usr/home/hudson/hudson-slave/workspace/Lucene-Solr-Tests-4.x-java7/solr/build/solr-core/test/J0/./org.apache.solr.cloud.BasicDistributedZkTest-controljetty-1359705999170/'
[junit4:junit4]   2> 521 T554 oasc.SolrResourceLoader.<init> new SolrResourceLoader for directory: '/usr/home/hudson/hudson-slave/workspace/Lucene-Solr-Tests-4.x-java7/solr/build/solr-core/test/J0/./org.apache.solr.cloud.BasicDistributedZkTest-controljetty-1359705999170/'
[junit4:junit4]   2> 576 T554 oashc.HttpShardHandlerFactory.getParameter Setting socketTimeout to: 60000
[junit4:junit4]   2> 577 T554 oashc.HttpShardHandlerFactory.getParameter Setting urlScheme to: http://
[junit4:junit4]   2> 577 T554 oashc.HttpShardHandlerFactory.getParameter Setting connTimeout to: 15000
[junit4:junit4]   2> 578 T554 oashc.HttpShardHandlerFactory.getParameter Setting maxConnectionsPerHost to: 20
[junit4:junit4]   2> 578 T554 oashc.HttpShardHandlerFactory.getParameter Setting corePoolSize to: 0
[junit4:junit4]   2> 579 T554 oashc.HttpShardHandlerFactory.getParameter Setting maximumPoolSize to: 2147483647
[junit4:junit4]   2> 579 T554 oashc.HttpShardHandlerFactory.getParameter Setting maxThreadIdleTime to: 5
[junit4:junit4]   2> 580 T554 oashc.HttpShardHandlerFactory.getParameter Setting sizeOfQueue to: -1
[junit4:junit4]   2> 580 T554 oashc.HttpShardHandlerFactory.getParameter Setting fairnessPolicy to: false
[junit4:junit4]   2> 581 T554 oascsi.HttpClientUtil.createClient Creating new http client, config:maxConnectionsPerHost=20&maxConnections=10000&socketTimeout=60000&connTimeout=15000&retry=false
[junit4:junit4]   2> 604 T554 oasc.CoreContainer.load Registering Log Listener
[junit4:junit4]   2> 624 T554 oasc.CoreContainer.initZooKeeper Zookeeper client=127.0.0.1:62978/solr
[junit4:junit4]   2> 625 T554 oasc.ZkController.checkChrootPath zkHost includes chroot
[junit4:junit4]   2> 625 T554 oaz.ZooKeeper.<init> Initiating client connection, connectString=127.0.0.1:62978 sessionTimeout=60000 watcher=org.apache.solr.common.cloud.ConnectionManager@9e6a7bb
[junit4:junit4]   2> 626 T554 oascc.ConnectionManager.waitForConnected Waiting for client to connect to ZooKeeper
[junit4:junit4]   2> 627 T573 oaz.ClientCnxn$SendThread.logStartConnect Opening socket connection to server localhost/127.0.0.1:62978. Will not attempt to authenticate using SASL (access denied ("javax.security.auth.AuthPermission" "getLoginConfiguration"))
[junit4:junit4]   2> 627 T573 oaz.ClientCnxn$SendThread.primeConnection Socket connection established to localhost/127.0.0.1:62978, initiating session
[junit4:junit4]   2> 628 T556 oazs.NIOServerCnxnFactory.run Accepted socket connection from /140.211.11.196:62982
[junit4:junit4]   2> 628 T556 oazs.ZooKeeperServer.processConnectRequest Client attempting to establish new session at /140.211.11.196:62982
[junit4:junit4]   2> 630 T558 oazs.ZooKeeperServer.finishSessionInit Established session 0x13c94cb05fe0002 with negotiated timeout 20000 for client /140.211.11.196:62982
[junit4:junit4]   2> 630 T573 oaz.ClientCnxn$SendThread.onConnected Session establishment complete on server localhost/127.0.0.1:62978, sessionid = 0x13c94cb05fe0002, negotiated timeout = 20000
[junit4:junit4]   2> 630 T574 oascc.ConnectionManager.process Watcher org.apache.solr.common.cloud.ConnectionManager@9e6a7bb name:ZooKeeperConnection Watcher:127.0.0.1:62978 got event WatchedEvent state:SyncConnected type:None path:null path:null type:None
[junit4:junit4]   2> 631 T554 oascc.ConnectionManager.waitForConnected Client is connected to ZooKeeper
[junit4:junit4]   2> 632 T559 oazs.PrepRequestProcessor.pRequest2Txn Processed session termination for sessionid: 0x13c94cb05fe0002
[junit4:junit4]   2> 634 T574 oaz.ClientCnxn$EventThread.run EventThread shut down
[junit4:junit4]   2> 634 T556 oazs.NIOServerCnxn.closeSock Closed socket connection for client /140.211.11.196:62982 which had sessionid 0x13c94cb05fe0002
[junit4:junit4]   2> 634 T554 oaz.ZooKeeper.close Session: 0x13c94cb05fe0002 closed
[junit4:junit4]   2> 634 T554 oascsi.HttpClientUtil.createClient Creating new http client, config:maxConnections=500&maxConnectionsPerHost=16&socketTimeout=60000&connTimeout=15000
[junit4:junit4]   2> 648 T554 oaz.ZooKeeper.<init> Initiating client connection, connectString=127.0.0.1:62978/solr sessionTimeout=30000 watcher=org.apache.solr.common.cloud.ConnectionManager@3e58acf3
[junit4:junit4]   2> 649 T554 oascc.ConnectionManager.waitForConnected Waiting for client to connect to ZooKeeper
[junit4:junit4]   2> 649 T575 oaz.ClientCnxn$SendThread.logStartConnect Opening socket connection to server localhost/127.0.0.1:62978. Will not attempt to authenticate using SASL (access denied ("javax.security.auth.AuthPermission" "getLoginConfiguration"))
[junit4:junit4]   2> 650 T575 oaz.ClientCnxn$SendThread.primeConnection Socket connection established to localhost/127.0.0.1:62978, initiating session
[junit4:junit4]   2> 650 T556 oazs.NIOServerCnxnFactory.run Accepted socket connection from /140.211.11.196:62983
[junit4:junit4]   2> 651 T556 oazs.ZooKeeperServer.processConnectRequest Client attempting to establish new session at /140.211.11.196:62983
[junit4:junit4]   2> 652 T558 oazs.ZooKeeperServer.finishSessionInit Established session 0x13c94cb05fe0003 with negotiated timeout 20000 for client /140.211.11.196:62983
[junit4:junit4]   2> 652 T575 oaz.ClientCnxn$SendThread.onConnected Session establishment complete on server localhost/127.0.0.1:62978, sessionid = 0x13c94cb05fe0003, negotiated timeout = 20000
[junit4:junit4]   2> 652 T576 oascc.ConnectionManager.process Watcher org.apache.solr.common.cloud.ConnectionManager@3e58acf3 name:ZooKeeperConnection Watcher:127.0.0.1:62978/solr got event WatchedEvent state:SyncConnected type:None path:null path:null type:None
[junit4:junit4]   2> 653 T554 oascc.ConnectionManager.waitForConnected Client is connected to ZooKeeper
[junit4:junit4]   2> 655 T559 oazs.PrepRequestProcessor.pRequest Got user-level KeeperException when processing sessionid:0x13c94cb05fe0003 type:create cxid:0x2 zxid:0x1a txntype:-1 reqpath:n/a Error Path:/solr/overseer Error:KeeperErrorCode = NodeExists for /solr/overseer
[junit4:junit4]   2> 663 T554 oascc.SolrZkClient.makePath makePath: /live_nodes
[junit4:junit4]   2> 666 T554 oasc.ZkController.createEphemeralLiveNode Register node as live in ZooKeeper:/live_nodes/127.0.0.1:62981_
[junit4:junit4]   2> 667 T559 oazs.PrepRequestProcessor.pRequest Got user-level KeeperException when processing sessionid:0x13c94cb05fe0003 type:delete cxid:0x7 zxid:0x1c txntype:-1 reqpath:n/a Error Path:/solr/live_nodes/127.0.0.1:62981_ Error:KeeperErrorCode = NoNode for /solr/live_nodes/127.0.0.1:62981_
[junit4:junit4]   2> 668 T554 oascc.SolrZkClient.makePath makePath: /live_nodes/127.0.0.1:62981_
[junit4:junit4]   2> 677 T554 oascc.SolrZkClient.makePath makePath: /overseer_elect/election
[junit4:junit4]   2> 691 T559 oazs.PrepRequestProcessor.pRequest Got user-level KeeperException when processing sessionid:0x13c94cb05fe0003 type:delete cxid:0x15 zxid:0x21 txntype:-1 reqpath:n/a Error Path:/solr/overseer_elect/leader Error:KeeperErrorCode = NoNode for /solr/overseer_elect/leader
[junit4:junit4]   2> 692 T554 oascc.SolrZkClient.makePath makePath: /overseer_elect/leader
[junit4:junit4]   2> 697 T554 oasc.Overseer.start Overseer (id=89109692340371459-127.0.0.1:62981_-n_0000000000) starting
[junit4:junit4]   2> 698 T559 oazs.PrepRequestProcessor.pRequest Got user-level KeeperException when processing sessionid:0x13c94cb05fe0003 type:create cxid:0x1a zxid:0x23 txntype:-1 reqpath:n/a Error Path:/solr/overseer Error:KeeperErrorCode = NodeExists for /solr/overseer
[junit4:junit4]   2> 699 T559 oazs.PrepRequestProcessor.pRequest Got user-level KeeperException when processing sessionid:0x13c94cb05fe0003 type:create cxid:0x1b zxid:0x24 txntype:-1 reqpath:n/a Error Path:/solr/overseer Error:KeeperErrorCode = NodeExists for /solr/overseer
[junit4:junit4]   2> 707 T559 oazs.PrepRequestProcessor.pRequest Got user-level KeeperException when processing sessionid:0x13c94cb05fe0003 type:create cxid:0x1c zxid:0x25 txntype:-1 reqpath:n/a Error Path:/solr/overseer Error:KeeperErrorCode = NodeExists for /solr/overseer
[junit4:junit4]   2> 708 T559 oazs.PrepRequestProcessor.pRequest Got user-level KeeperException when processing sessionid:0x13c94cb05fe0003 type:create cxid:0x1d zxid:0x26 txntype:-1 reqpath:n/a Error Path:/solr/overseer Error:KeeperErrorCode = NodeExists for /solr/overseer
[junit4:junit4]   2> 714 T578 oasc.OverseerCollectionProcessor.run Process current queue of collection creations
[junit4:junit4]   2> 715 T554 oascc.SolrZkClient.makePath makePath: /clusterstate.json
[junit4:junit4]   2> 727 T554 oascc.ZkStateReader.createClusterStateWatchersAndUpdate Updating cluster state from ZooKeeper... 
[junit4:junit4]   2> 730 T577 oasc.Overseer$ClusterStateUpdater.run Starting to work on the main queue
[junit4:junit4]   2> 740 T579 oasc.CoreContainer.create Creating SolrCore 'collection1' using instanceDir: /usr/home/hudson/hudson-slave/workspace/Lucene-Solr-Tests-4.x-java7/solr/build/solr-core/test/J0/./org.apache.solr.cloud.BasicDistributedZkTest-controljetty-1359705999170/collection1
[junit4:junit4]   2> 740 T579 oasc.ZkController.createCollectionZkNode Check for collection zkNode:control_collection
[junit4:junit4]   2> 741 T579 oasc.ZkController.createCollectionZkNode Collection zkNode exists
[junit4:junit4]   2> 741 T579 oasc.ZkController.readConfigName Load collection config from:/collections/control_collection
[junit4:junit4]   2> 743 T579 oasc.SolrResourceLoader.<init> new SolrResourceLoader for directory: '/usr/home/hudson/hudson-slave/workspace/Lucene-Solr-Tests-4.x-java7/solr/build/solr-core/test/J0/./org.apache.solr.cloud.BasicDistributedZkTest-controljetty-1359705999170/collection1/'
[junit4:junit4]   2> 745 T579 oasc.SolrResourceLoader.replaceClassLoader Adding 'file:/usr/home/hudson/hudson-slave/workspace/Lucene-Solr-Tests-4.x-java7/solr/build/solr-core/test/J0/org.apache.solr.cloud.BasicDistributedZkTest-controljetty-1359705999170/collection1/lib/README' to classloader
[junit4:junit4]   2> 745 T579 oasc.SolrResourceLoader.replaceClassLoader Adding 'file:/usr/home/hudson/hudson-slave/workspace/Lucene-Solr-Tests-4.x-java7/solr/build/solr-core/test/J0/org.apache.solr.cloud.BasicDistributedZkTest-controljetty-1359705999170/collection1/lib/classes/' to classloader
[junit4:junit4]   2> 798 T579 oasc.SolrConfig.<init> Using Lucene MatchVersion: LUCENE_42
[junit4:junit4]   2> 882 T579 oasc.SolrConfig.<init> Loaded SolrConfig: solrconfig.xml
[junit4:junit4]   2> 983 T579 oass.IndexSchema.readSchema Reading Solr Schema
[junit4:junit4]   2> 990 T579 oass.IndexSchema.readSchema Schema name=test
[junit4:junit4]   2> 1596 T579 oass.OpenExchangeRatesOrgProvider.init Initialized with rates=open-exchange-rates.json, refreshInterval=1440.
[junit4:junit4]   2> 1608 T579 oass.IndexSchema.readSchema default search field in schema is text
[junit4:junit4]   2> 1612 T579 oass.IndexSchema.readSchema unique key field: id
[junit4:junit4]   2> 1633 T579 oass.FileExchangeRateProvider.reload Reloading exchange rates from file currency.xml
[junit4:junit4]   2> 1649 T579 oass.FileExchangeRateProvider.reload Reloading exchange rates from file currency.xml
[junit4:junit4]   2> 1655 T579 oass.OpenExchangeRatesOrgProvider.reload Reloading exchange rates from open-exchange-rates.json
[junit4:junit4]   2> 1656 T579 oass.OpenExchangeRatesOrgProvider.reload Reloading exchange rates from open-exchange-rates.json
[junit4:junit4]   2> 1658 T579 oasc.SolrCore.<init> [collection1] Opening new SolrCore at /usr/home/hudson/hudson-slave/workspace/Lucene-Solr-Tests-4.x-java7/solr/build/solr-core/test/J0/./org.apache.solr.cloud.BasicDistributedZkTest-controljetty-1359705999170/collection1/, dataDir=./org.apache.solr.cloud.BasicDistributedZkTest-1359705998839/control/data/
[junit4:junit4]   2> 1659 T579 oasc.JmxMonitoredMap.<init> JMX monitoring is enabled. Adding Solr mbeans to JMX Server: com.sun.jmx.mbeanserver.JmxMBeanServer@76d26a
[junit4:junit4]   2> 1659 T579 oasc.SolrCore.initDirectoryFactory solr.NRTCachingDirectoryFactory
[junit4:junit4]   2> 1695 T579 oasc.CachingDirectoryFactory.get return new directory for /usr/home/hudson/hudson-slave/workspace/Lucene-Solr-Tests-4.x-java7/solr/build/solr-core/test/J0/./org.apache.solr.cloud.BasicDistributedZkTest-1359705998839/control/data forceNew:false
[junit4:junit4]   2> 1696 T579 oasc.CachingDirectoryFactory.close Releasing directory:/usr/home/hudson/hudson-slave/workspace/Lucene-Solr-Tests-4.x-java7/solr/build/solr-core/test/J0/./org.apache.solr.cloud.BasicDistributedZkTest-1359705998839/control/data
[junit4:junit4]   2> 1696 T579 oasc.SolrCore.getNewIndexDir New index directory detected: old=null new=./org.apache.solr.cloud.BasicDistributedZkTest-1359705998839/control/data/index/
[junit4:junit4]   2> 1697 T579 oasc.SolrCore.initIndex WARNING [collection1] Solr index directory './org.apache.solr.cloud.BasicDistributedZkTest-1359705998839/control/data/index' doesn't exist. Creating new index...
[junit4:junit4]   2> 1698 T579 oasc.CachingDirectoryFactory.get return new directory for /usr/home/hudson/hudson-slave/workspace/Lucene-Solr-Tests-4.x-java7/solr/build/solr-core/test/J0/./org.apache.solr.cloud.BasicDistributedZkTest-1359705998839/control/data/index forceNew:false
[junit4:junit4]   2> 1710 T579 oasc.SolrDeletionPolicy.onCommit SolrDeletionPolicy.onCommit: commits:num=1
[junit4:junit4]   2> 		commit{dir=RateLimitedDirectoryWrapper(NRTCachingDirectory(org.apache.lucene.store.NIOFSDirectory@/usr/home/hudson/hudson-slave/workspace/Lucene-Solr-Tests-4.x-java7/solr/build/solr-core/test/J0/org.apache.solr.cloud.BasicDistributedZkTest-1359705998839/control/data/index lockFactory=org.apache.lucene.store.NativeFSLockFactory@19597933; maxCacheMB=48.0 maxMergeSizeMB=4.0)),segFN=segments_1,generation=1,filenames=[segments_1]
[junit4:junit4]   2> 1710 T579 oasc.SolrDeletionPolicy.updateCommits newest commit = 1[segments_1]
[junit4:junit4]   2> 1711 T579 oasc.CachingDirectoryFactory.close Releasing directory:/usr/home/hudson/hudson-slave/workspace/Lucene-Solr-Tests-4.x-java7/solr/build/solr-core/test/J0/./org.apache.solr.cloud.BasicDistributedZkTest-1359705998839/control/data/index
[junit4:junit4]   2> 1712 T579 oasc.SolrCore.initWriters created xml: solr.XMLResponseWriter
[junit4:junit4]   2> 1714 T579 oasup.UpdateRequestProcessorChain.init inserting DistributedUpdateProcessorFactory into updateRequestProcessorChain "dedupe"
[junit4:junit4]   2> 1714 T579 oasup.UpdateRequestProcessorChain.init inserting DistributedUpdateProcessorFactory into updateRequestProcessorChain "dedupe-allfields"
[junit4:junit4]   2> 1715 T579 oasup.UpdateRequestProcessorChain.init inserting DistributedUpdateProcessorFactory into updateRequestProcessorChain "stored_sig"
[junit4:junit4]   2> 1715 T579 oasup.UpdateRequestProcessorChain.init inserting DistributedUpdateProcessorFactory into updateRequestProcessorChain "uniq-fields"
[junit4:junit4]   2> 1716 T579 oasup.UpdateRequestProcessorChain.init inserting DistributedUpdateProcessorFactory into updateRequestProcessorChain "distrib-dup-test-chain-implicit"
[junit4:junit4]   2> 1716 T579 oasc.RequestHandlers.initHandlersFromConfig adding lazy requestHandler: solr.ReplicationHandler
[junit4:junit4]   2> 1716 T579 oasc.RequestHandlers.initHandlersFromConfig created /replication: solr.ReplicationHandler
[junit4:junit4]   2> 1717 T579 oasc.RequestHandlers.initHandlersFromConfig created standard: solr.StandardRequestHandler
[junit4:junit4]   2> 1717 T579 oasc.RequestHandlers.initHandlersFromConfig created /get: solr.RealTimeGetHandler
[junit4:junit4]   2> 1718 T579 oasc.RequestHandlers.initHandlersFromConfig created dismax: solr.SearchHandler
[junit4:junit4]   2> 1719 T579 oasc.RequestHandlers.initHandlersFromConfig created mock: org.apache.solr.core.MockQuerySenderListenerReqHandler
[junit4:junit4]   2> 1719 T579 oasc.RequestHandlers.initHandlersFromConfig created /admin/: org.apache.solr.handler.admin.AdminHandlers
[junit4:junit4]   2> 1720 T579 oasc.RequestHandlers.initHandlersFromConfig created defaults: solr.StandardRequestHandler
[junit4:junit4]   2> 1720 T579 oasc.RequestHandlers.initHandlersFromConfig adding lazy requestHandler: solr.StandardRequestHandler
[junit4:junit4]   2> 1720 T579 oasc.RequestHandlers.initHandlersFromConfig created lazy: solr.StandardRequestHandler
[junit4:junit4]   2> 1721 T579 oasc.RequestHandlers.initHandlersFromConfig created /update: solr.UpdateRequestHandler
[junit4:junit4]   2> 1721 T579 oasc.RequestHandlers.initHandlersFromConfig created /terms: org.apache.solr.handler.component.SearchHandler
[junit4:junit4]   2> 1722 T579 oasc.RequestHandlers.initHandlersFromConfig created spellCheckCompRH: org.apache.solr.handler.component.SearchHandler
[junit4:junit4]   2> 1722 T579 oasc.RequestHandlers.initHandlersFromConfig created spellCheckCompRH_Direct: org.apache.solr.handler.component.SearchHandler
[junit4:junit4]   2> 1723 T579 oasc.RequestHandlers.initHandlersFromConfig created spellCheckWithWordbreak: org.apache.solr.handler.component.SearchHandler
[junit4:junit4]   2> 1723 T579 oasc.RequestHandlers.initHandlersFromConfig created spellCheckWithWordbreak_Direct: org.apache.solr.handler.component.SearchHandler
[junit4:junit4]   2> 1724 T579 oasc.RequestHandlers.initHandlersFromConfig created spellCheckCompRH1: org.apache.solr.handler.component.SearchHandler
[junit4:junit4]   2> 1724 T579 oasc.RequestHandlers.initHandlersFromConfig created mltrh: org.apache.solr.handler.component.SearchHandler
[junit4:junit4]   2> 1725 T579 oasc.RequestHandlers.initHandlersFromConfig created tvrh: org.apache.solr.handler.component.SearchHandler
[junit4:junit4]   2> 1725 T579 oasc.RequestHandlers.initHandlersFromConfig created /mlt: solr.MoreLikeThisHandler
[junit4:junit4]   2> 1726 T579 oasc.RequestHandlers.initHandlersFromConfig created /debug/dump: solr.DumpRequestHandler
[junit4:junit4]   2> 1739 T579 oashl.XMLLoader.init xsltCacheLifetimeSeconds=60
[junit4:junit4]   2> 1744 T579 oasc.SolrCore.initDeprecatedSupport WARNING solrconfig.xml uses deprecated <admin/gettableFiles>, Please update your config to use the ShowFileRequestHandler.
[junit4:junit4]   2> 1746 T579 oasc.SolrCore.initDeprecatedSupport WARNING adding ShowFileRequestHandler with hidden files: [SCHEMA.XML, OLD_SYNONYMS.TXT, STOPWORDS.TXT, PROTWORDS.TXT, OPEN-EXCHANGE-RATES.JSON, SYNONYMS.TXT, CURRENCY.XML, MAPPING-ISOLATIN1ACCENT.TXT]
[junit4:junit4]   2> 1748 T579 oasc.CachingDirectoryFactory.close Releasing directory:/usr/home/hudson/hudson-slave/workspace/Lucene-Solr-Tests-4.x-java7/solr/build/solr-core/test/J0/./org.apache.solr.cloud.BasicDistributedZkTest-1359705998839/control/data
[junit4:junit4]   2> 1750 T579 oass.SolrIndexSearcher.<init> Opening Searcher@260c2911 main
[junit4:junit4]   2> 1751 T579 oasu.CommitTracker.<init> Hard AutoCommit: disabled
[junit4:junit4]   2> 1752 T579 oasu.CommitTracker.<init> Soft AutoCommit: disabled
[junit4:junit4]   2> 1752 T579 oashc.SpellCheckComponent.inform Initializing spell checkers
[junit4:junit4]   2> 1768 T579 oass.DirectSolrSpellChecker.init init: {name=direct,classname=DirectSolrSpellChecker,field=lowerfilt,minQueryLength=3}
[junit4:junit4]   2> 1823 T580 oasc.SolrCore.registerSearcher [collection1] Registered new searcher Searcher@260c2911 main{StandardDirectoryReader(segments_1:1)}
[junit4:junit4]   2> 1829 T579 oasc.ZkController.publish publishing core=collection1 state=down
[junit4:junit4]   2> 1829 T579 oasc.ZkController.publish numShards not found on descriptor - reading it from system property
[junit4:junit4]   2> 1830 T559 oazs.PrepRequestProcessor.pRequest Got user-level KeeperException when processing sessionid:0x13c94cb05fe0003 type:create cxid:0x50 zxid:0x29 txntype:-1 reqpath:n/a Error Path:/solr/overseer/queue Error:KeeperErrorCode = NoNode for /solr/overseer/queue
[junit4:junit4]   2> 2240 T577 oascc.ZkStateReader.updateClusterState Updating cloud state from ZooKeeper... 
[junit4:junit4]   2> 2241 T577 oasc.Overseer$ClusterStateUpdater.updateState Update state numShards=1 message={
[junit4:junit4]   2> 	  "operation":"state",
[junit4:junit4]   2> 	  "numShards":"1",
[junit4:junit4]   2> 	  "shard":null,
[junit4:junit4]   2> 	  "roles":null,
[junit4:junit4]   2> 	  "state":"down",
[junit4:junit4]   2> 	  "core":"collection1",
[junit4:junit4]   2> 	  "collection":"control_collection",
[junit4:junit4]   2> 	  "node_name":"127.0.0.1:62981_",
[junit4:junit4]   2> 	  "base_url":"http://127.0.0.1:62981"}
[junit4:junit4]   2> 2242 T577 oasc.Overseer$ClusterStateUpdater.createCollection Create collection control_collection with numShards 1
[junit4:junit4]   2> 2278 T577 oasc.Overseer$ClusterStateUpdater.updateState Assigning new node to shard shard=shard1
[junit4:junit4]   2> 2279 T559 oazs.PrepRequestProcessor.pRequest Got user-level KeeperException when processing sessionid:0x13c94cb05fe0003 type:create cxid:0x58 zxid:0x2c txntype:-1 reqpath:n/a Error Path:/solr/overseer/queue-work Error:KeeperErrorCode = NoNode for /solr/overseer/queue-work
[junit4:junit4]   2> 2298 T576 oascc.ZkStateReader$2.process A cluster state change: WatchedEvent state:SyncConnected type:NodeDataChanged path:/clusterstate.json, has occurred - updating... (live nodes size: 1)
[junit4:junit4]   2> 2836 T579 oasc.CoreContainer.registerCore registering core: collection1
[junit4:junit4]   2> 2836 T579 oasc.ZkController.register Register replica - core:collection1 address:http://127.0.0.1:62981 collection:control_collection shard:shard1
[junit4:junit4]   2> 2845 T579 oascsi.HttpClientUtil.createClient Creating new http client, config:maxConnections=10000&maxConnectionsPerHost=20&connTimeout=30000&socketTimeout=30000&retry=false
[junit4:junit4]   2> 2864 T579 oascc.SolrZkClient.makePath makePath: /collections/control_collection/leader_elect/shard1/election
[junit4:junit4]   2> 2887 T559 oazs.PrepRequestProcessor.pRequest Got user-level KeeperException when processing sessionid:0x13c94cb05fe0003 type:delete cxid:0x72 zxid:0x36 txntype:-1 reqpath:n/a Error Path:/solr/collections/control_collection/leaders Error:KeeperErrorCode = NoNode for /solr/collections/control_collection/leaders
[junit4:junit4]   2> 2888 T579 oasc.ShardLeaderElectionContext.runLeaderProcess Running the leader process.
[junit4:junit4]   2> 2888 T559 oazs.PrepRequestProcessor.pRequest Got user-level KeeperException when processing sessionid:0x13c94cb05fe0003 type:create cxid:0x73 zxid:0x37 txntype:-1 reqpath:n/a Error Path:/solr/overseer Error:KeeperErrorCode = NodeExists for /solr/overseer
[junit4:junit4]   2> 2891 T579 oasc.ShardLeaderElectionContext.waitForReplicasToComeUp Enough replicas found to continue.
[junit4:junit4]   2> 2891 T579 oasc.ShardLeaderElectionContext.runLeaderProcess I may be the new leader - try and sync
[junit4:junit4]   2> 2892 T579 oasc.SyncStrategy.sync Sync replicas to http://127.0.0.1:62981/collection1/
[junit4:junit4]   2> 2892 T579 oasc.SyncStrategy.syncReplicas Sync Success - now sync replicas to me
[junit4:junit4]   2> 2893 T579 oasc.SyncStrategy.syncToMe http://127.0.0.1:62981/collection1/ has no replicas
[junit4:junit4]   2> 2893 T579 oasc.ShardLeaderElectionContext.runLeaderProcess I am the new leader: http://127.0.0.1:62981/collection1/
[junit4:junit4]   2> 2893 T579 oascc.SolrZkClient.makePath makePath: /collections/control_collection/leaders/shard1
[junit4:junit4]   2> 2899 T559 oazs.PrepRequestProcessor.pRequest Got user-level KeeperException when processing sessionid:0x13c94cb05fe0003 type:create cxid:0x7d zxid:0x3b txntype:-1 reqpath:n/a Error Path:/solr/overseer Error:KeeperErrorCode = NodeExists for /solr/overseer
[junit4:junit4]   2> 3805 T577 oascc.ZkStateReader.updateClusterState Updating cloud state from ZooKeeper... 
[junit4:junit4]   2> 3831 T576 oascc.ZkStateReader$2.process A cluster state change: WatchedEvent state:SyncConnected type:NodeDataChanged path:/clusterstate.json, has occurred - updating... (live nodes size: 1)
[junit4:junit4]   2> 3871 T579 oasc.ZkController.register We are http://127.0.0.1:62981/collection1/ and leader is http://127.0.0.1:62981/collection1/
[junit4:junit4]   2> 3871 T579 oasc.ZkController.register No LogReplay needed for core=collection1 baseURL=http://127.0.0.1:62981
[junit4:junit4]   2> 3871 T579 oasc.ZkController.checkRecovery I am the leader, no recovery necessary
[junit4:junit4]   2> 3872 T579 oasc.ZkController.publish publishing core=collection1 state=active
[junit4:junit4]   2> 3872 T579 oasc.ZkController.publish numShards not found on descriptor - reading it from system property
[junit4:junit4]   2> 3875 T579 oascc.ZkStateReader.updateClusterState Updating cloud state from ZooKeeper... 
[junit4:junit4]   2> 3877 T554 oass.SolrDispatchFilter.init user.dir=/usr/home/hudson/hudson-slave/workspace/Lucene-Solr-Tests-4.x-java7/solr/build/solr-core/test/J0
[junit4:junit4]   2> 3877 T554 oass.SolrDispatchFilter.init SolrDispatchFilter.init() done
[junit4:junit4]   2> 3878 T554 oascsi.HttpClientUtil.createClient Creating new http client, config:maxConnections=128&maxConnectionsPerHost=32&followRedirects=false
[junit4:junit4]   2> 3894 T554 oascsi.HttpClientUtil.createClient Creating new http client, config:
[junit4:junit4]   2> 3911 T554 oaz.ZooKeeper.<init> Initiating client connection, connectString=127.0.0.1:62978/solr sessionTimeout=10000 watcher=org.apache.solr.common.cloud.ConnectionManager@5d261bae
[junit4:junit4]   2> 3912 T554 oascc.ConnectionManager.waitForConnected Waiting for client to connect to ZooKeeper
[junit4:junit4]   2> 3912 T581 oaz.ClientCnxn$SendThread.logStartConnect Opening socket connection to server localhost/127.0.0.1:62978. Will not attempt to authenticate using SASL (access denied ("javax.security.auth.AuthPermission" "getLoginConfiguration"))
[junit4:junit4]   2> 3912 T581 oaz.ClientCnxn$SendThread.primeConnection Socket connection established to localhost/127.0.0.1:62978, initiating session
[junit4:junit4]   2> 3913 T556 oazs.NIOServerCnxnFactory.run Accepted socket connection from /140.211.11.196:62991
[junit4:junit4]   2> 3913 T556 oazs.ZooKeeperServer.processConnectRequest Client attempting to establish new session at /140.211.11.196:62991
[junit4:junit4]   2> 3915 T558 oazs.ZooKeeperServer.finishSessionInit Established session 0x13c94cb05fe0004 with negotiated timeout 10000 for client /140.211.11.196:62991
[junit4:junit4]   2> 3915 T581 oaz.ClientCnxn$SendThread.onConnected Session establishment complete on server localhost/127.0.0.1:62978, sessionid = 0x13c94cb05fe0004, negotiated timeout = 10000
[junit4:junit4]   2> 3915 T582 oascc.ConnectionManager.process Watcher org.apache.solr.common.cloud.ConnectionManager@5d261bae name:ZooKeeperConnection Watcher:127.0.0.1:62978/solr got event WatchedEvent state:SyncConnected type:None path:null path:null type:None
[junit4:junit4]   2> 3915 T554 oascc.ConnectionManager.waitForConnected Client is connected to ZooKeeper
[junit4:junit4]   2> 3917 T554 oascc.ZkStateReader.createClusterStateWatchersAndUpdate Updating cluster state from ZooKeeper... 
[junit4:junit4]   2> 3922 T554 oasc.ChaosMonkey.monkeyLog monkey: init - expire sessions:true cause connection loss:true
[junit4:junit4]   2> 4093 T554 oejs.Server.doStart jetty-8.1.8.v20121106
[junit4:junit4]   2> 4096 T554 oejs.AbstractConnector.doStart Started SocketConnector@127.0.0.1:62992
[junit4:junit4]   2> 4097 T554 oass.SolrDispatchFilter.init SolrDispatchFilter.init()
[junit4:junit4]   2> 4098 T554 oasc.SolrResourceLoader.locateSolrHome JNDI not configured for solr (NoInitialContextEx)
[junit4:junit4]   2> 4098 T554 oasc.SolrResourceLoader.locateSolrHome using system property solr.solr.home: /usr/home/hudson/hudson-slave/workspace/Lucene-Solr-Tests-4.x-java7/solr/build/solr-core/test/J0/./org.apache.solr.cloud.BasicDistributedZkTest-jetty1-1359706002754
[junit4:junit4]   2> 4098 T554 oasc.CoreContainer$Initializer.initialize looking for solr.xml: /usr/home/hudson/hudson-slave/workspace/Lucene-Solr-Tests-4.x-java7/solr/build/solr-core/test/J0/./org.apache.solr.cloud.BasicDistributedZkTest-jetty1-1359706002754/solr.xml
[junit4:junit4]   2> 4099 T554 oasc.CoreContainer.<init> New CoreContainer 743095051
[junit4:junit4]   2> 4100 T554 oasc.CoreContainer.load Loading CoreContainer using Solr Home: '/usr/home/hudson/hudson-slave/workspace/Lucene-Solr-Tests-4.x-java7/solr/build/solr-core/test/J0/./org.apache.solr.cloud.BasicDistributedZkTest-jetty1-1359706002754/'
[junit4:junit4]   2> 4100 T554 oasc.SolrResourceLoader.<init> new SolrResourceLoader for directory: '/usr/home/hudson/hudson-slave/workspace/Lucene-Solr-Tests-4.x-java7/solr/build/solr-core/test/J0/./org.apache.solr.cloud.BasicDistributedZkTest-jetty1-1359706002754/'
[junit4:junit4]   2> 4156 T554 oashc.HttpShardHandlerFactory.getParameter Setting socketTimeout to: 60000
[junit4:junit4]   2> 4156 T554 oashc.HttpShardHandlerFactory.getParameter Setting urlScheme to: http://
[junit4:junit4]   2> 4157 T554 oashc.HttpShardHandlerFactory.getParameter Setting connTimeout to: 15000
[junit4:junit4]   2> 4157 T554 oashc.HttpShardHandlerFactory.getParameter Setting maxConnectionsPerHost to: 20
[junit4:junit4]   2> 4157 T554 oashc.HttpShardHandlerFactory.getParameter Setting corePoolSize to: 0
[junit4:junit4]   2> 4158 T554 oashc.HttpShardHandlerFactory.getParameter Setting maximumPoolSize to: 2147483647
[junit4:junit4]   2> 4158 T554 oashc.HttpShardHandlerFactory.getParameter Setting maxThreadIdleTime to: 5
[junit4:junit4]   2> 4159 T554 oashc.HttpShardHandlerFactory.getParameter Setting sizeOfQueue to: -1
[junit4:junit4]   2> 4159 T554 oashc.HttpShardHandlerFactory.getParameter Setting fairnessPolicy to: false
[junit4:junit4]   2> 4160 T554 oascsi.HttpClientUtil.createClient Creating new http client, config:maxConnectionsPerHost=20&maxConnections=10000&socketTimeout=60000&connTimeout=15000&retry=false
[junit4:junit4]   2> 4181 T554 oasc.CoreContainer.load Registering Log Listener
[junit4:junit4]   2> 4201 T554 oasc.CoreContainer.initZooKeeper Zookeeper client=127.0.0.1:62978/solr
[junit4:junit4]   2> 4201 T554 oasc.ZkController.checkChrootPath zkHost includes chroot
[junit4:junit4]   2> 4202 T554 oaz.ZooKeeper.<init> Initiating client connection, connectString=127.0.0.1:62978 sessionTimeout=60000 watcher=org.apache.solr.common.cloud.ConnectionManager@99f805f
[junit4:junit4]   2> 4203 T554 oascc.ConnectionManager.waitForConnected Waiting for client to connect to ZooKeeper
[junit4:junit4]   2> 4203 T592 oaz.ClientCnxn$SendThread.logStartConnect Opening socket connection to server localhost/127.0.0.1:62978. Will not attempt to authenticate using SASL (access denied ("javax.security.auth.AuthPermission" "getLoginConfiguration"))
[junit4:junit4]   2> 4204 T592 oaz.ClientCnxn$SendThread.primeConnection Socket connection established to localhost/127.0.0.1:62978, initiating session
[junit4:junit4]   2> 4204 T556 oazs.NIOServerCnxnFactory.run Accepted socket connection from /140.211.11.196:62993
[junit4:junit4]   2> 4205 T556 oazs.ZooKeeperServer.processConnectRequest Client attempting to establish new session at /140.211.11.196:62993
[junit4:junit4]   2> 4207 T558 oazs.ZooKeeperServer.finishSessionInit Established session 0x13c94cb05fe0005 with negotiated timeout 20000 for client /140.211.11.196:62993
[junit4:junit4]   2> 4207 T592 oaz.ClientCnxn$SendThread.onConnected Session establishment complete on server localhost/127.0.0.1:62978, sessionid = 0x13c94cb05fe0005, negotiated timeout = 20000
[junit4:junit4]   2> 4207 T593 oascc.ConnectionManager.process Watcher org.apache.solr.common.cloud.ConnectionManager@99f805f name:ZooKeeperConnection Watcher:127.0.0.1:62978 got event WatchedEvent state:SyncConnected type:None path:null path:null type:None
[junit4:junit4]   2> 4208 T554 oascc.ConnectionManager.waitForConnected Client is connected to ZooKeeper
[junit4:junit4]   2> 4209 T559 oazs.PrepRequestProcessor.pRequest2Txn Processed session termination for sessionid: 0x13c94cb05fe0005
[junit4:junit4]   2> 4211 T593 oaz.ClientCnxn$EventThread.run EventThread shut down
[junit4:junit4]   2> 4211 T556 oazs.NIOServerCnxn.closeSock Closed socket connection for client /140.211.11.196:62993 which had sessionid 0x13c94cb05fe0005
[junit4:junit4]   2> 4211 T554 oaz.ZooKeeper.close Session: 0x13c94cb05fe0005 closed
[junit4:junit4]   2> 4211 T554 oascsi.HttpClientUtil.createClient Creating new http client, config:maxConnections=500&maxConnectionsPerHost=16&socketTimeout=60000&connTimeout=15000
[junit4:junit4]   2> 4223 T554 oaz.ZooKeeper.<init> Initiating client connection, connectString=127.0.0.1:62978/solr sessionTimeout=30000 watcher=org.apache.solr.common.cloud.ConnectionManager@1609c3fd
[junit4:junit4]   2> 4224 T554 oascc.ConnectionManager.waitForConnected Waiting for client to connect to ZooKeeper
[junit4:junit4]   2> 4225 T594 oaz.ClientCnxn$SendThread.logStartConnect Opening socket connection to server localhost/127.0.0.1:62978. Will not attempt to authenticate using SASL (access denied ("javax.security.auth.AuthPermission" "getLoginConfiguration"))
[junit4:junit4]   2> 4225 T594 oaz.ClientCnxn$SendThread.primeConnection Socket connection established to localhost/127.0.0.1:62978, initiating session
[junit4:junit4]   2> 4225 T556 oazs.NIOServerCnxnFactory.run Accepted socket connection from /140.211.11.196:62994
[junit4:junit4]   2> 4226 T556 oazs.ZooKeeperServer.processConnectRequest Client attempting to establish new session at /140.211.11.196:62994
[junit4:junit4]   2> 4227 T558 oazs.ZooKeeperServer.finishSessionInit Established session 0x13c94cb05fe0006 with negotiated timeout 20000 for client /140.211.11.196:62994
[junit4:junit4]   2> 4227 T594 oaz.ClientCnxn$SendThread.onConnected Session establishment complete on server localhost/127.0.0.1:62978, sessionid = 0x13c94cb05fe0006, negotiated timeout = 20000
[junit4:junit4]   2> 4228 T595 oascc.ConnectionManager.process Watcher org.apache.solr.common.cloud.ConnectionManager@1609c3fd name:ZooKeeperConnection Watcher:127.0.0.1:62978/solr got event WatchedEvent state:SyncConnected type:None path:null path:null type:None
[junit4:junit4]   2> 4228 T554 oascc.ConnectionManager.waitForConnected Client is connected to ZooKeeper
[junit4:junit4]   2> 4229 T559 oazs.PrepRequestProcessor.pRequest Got user-level KeeperException when processing sessionid:0x13c94cb05fe0006 type:create cxid:0x1 zxid:0x49 txntype:-1 reqpath:n/a Error Path:/solr/overseer Error:KeeperErrorCode = NodeExists for /solr/overseer
[junit4:junit4]   2> 4231 T559 oazs.PrepRequestProcessor.pRequest Got user-level KeeperException when processing sessionid:0x13c94cb05fe0006 type:create cxid:0x2 zxid:0x4a txntype:-1 reqpath:n/a Error Path:/solr/overseer Error:KeeperErrorCode = NodeExists for /solr/overseer
[junit4:junit4]   2> 4239 T554 oasc.ZkController.createEphemeralLiveNode Register node as live in ZooKeeper:/live_nodes/127.0.0.1:62992_
[junit4:junit4]   2> 4240 T559 oazs.PrepRequestProcessor.pRequest Got user-level KeeperException when processing sessionid:0x13c94cb05fe0006 type:delete cxid:0x4 zxid:0x4b txntype:-1 reqpath:n/a Error Path:/solr/live_nodes/127.0.0.1:62992_ Error:KeeperErrorCode = NoNode for /solr/live_nodes/127.0.0.1:62992_
[junit4:junit4]   2> 4241 T554 oascc.SolrZkClient.makePath makePath: /live_nodes/127.0.0.1:62992_
[junit4:junit4]   2> 4245 T576 oascc.ZkStateReader$2.process A cluster state change: WatchedEvent state:SyncConnected type:NodeChildrenChanged path:/live_nodes, has occurred - updating... (live nodes size: 1)
[junit4:junit4]   2> 4245 T582 oascc.ZkStateReader$3.process Updating live nodes... (2)
[junit4:junit4]   2> 4247 T576 oascc.ZkStateReader$3.process Updating live nodes... (2)
[junit4:junit4]   2> 4254 T554 oascc.ZkStateReader.createClusterStateWatchersAndUpdate Updating cluster state from ZooKeeper... 
[junit4:junit4]   2> 4262 T596 oasc.CoreContainer.create Creating SolrCore 'collection1' using instanceDir: /usr/home/hudson/hudson-slave/workspace/Lucene-Solr-Tests-4.x-java7/solr/build/solr-core/test/J0/./org.apache.solr.cloud.BasicDistributedZkTest-jetty1-1359706002754/collection1
[junit4:junit4]   2> 4262 T596 oasc.ZkController.createCollectionZkNode Check for collection zkNode:collection1
[junit4:junit4]   2> 4263 T596 oasc.ZkController.createCollectionZkNode Collection zkNode exists
[junit4:junit4]   2> 4263 T596 oasc.ZkController.readConfigName Load collection config from:/collections/collection1
[junit4:junit4]   2> 4265 T596 oasc.SolrResourceLoader.<init> new SolrResourceLoader for directory: '/usr/home/hudson/hudson-slave/workspace/Lucene-Solr-Tests-4.x-java7/solr/build/solr-core/test/J0/./org.apache.solr.cloud.BasicDistributedZkTest-jetty1-1359706002754/collection1/'
[junit4:junit4]   2> 4266 T596 oasc.SolrResourceLoader.replaceClassLoader Adding 'file:/usr/home/hudson/hudson-slave/workspace/Lucene-Solr-Tests-4.x-java7/solr/build/solr-core/test/J0/org.apache.solr.cloud.BasicDistributedZkTest-jetty1-1359706002754/collection1/lib/classes/' to classloader
[junit4:junit4]   2> 4267 T596 oasc.SolrResourceLoader.replaceClassLoader Adding 'file:/usr/home/hudson/hudson-slave/workspace/Lucene-Solr-Tests-4.x-java7/solr/build/solr-core/test/J0/org.apache.solr.cloud.BasicDistributedZkTest-jetty1-1359706002754/collection1/lib/README' to classloader
[junit4:junit4]   2> 4320 T596 oasc.SolrConfig.<init> Using Lucene MatchVersion: LUCENE_42
[junit4:junit4]   2> 4391 T596 oasc.SolrConfig.<init> Loaded SolrConfig: solrconfig.xml
[junit4:junit4]   2> 4492 T596 oass.IndexSchema.readSchema Reading Solr Schema
[junit4:junit4]   2> 4498 T596 oass.IndexSchema.readSchema Schema name=test
[junit4:junit4]   2> 5116 T596 oass.OpenExchangeRatesOrgProvider.init Initialized with rates=open-exchange-rates.json, refreshInterval=1440.
[junit4:junit4]   2> 5128 T596 oass.IndexSchema.readSchema default search field in schema is text
[junit4:junit4]   2> 5132 T596 oass.IndexSchema.readSchema unique key field: id
[junit4:junit4]   2> 5152 T596 oass.FileExchangeRateProvider.reload Reloading exchange rates from file currency.xml
[junit4:junit4]   2> 5158 T596 oass.FileExchangeRateProvider.reload Reloading exchange rates from file currency.xml
[junit4:junit4]   2> 5163 T596 oass.OpenExchangeRatesOrgProvider.reload Reloading exchange rates from open-exchange-rates.json
[junit4:junit4]   2> 5165 T596 oass.OpenExchangeRatesOrgProvider.reload Reloading exchange rates from open-exchange-rates.json
[junit4:junit4]   2> 5167 T596 oasc.SolrCore.<init> [collection1] Opening new SolrCore at /usr/home/hudson/hudson-slave/workspace/Lucene-Solr-Tests-4.x-java7/solr/build/solr-core/test/J0/./org.apache.solr.cloud.BasicDistributedZkTest-jetty1-1359706002754/collection1/, dataDir=./org.apache.solr.cloud.BasicDistributedZkTest-1359705998839/jetty1/
[junit4:junit4]   2> 5167 T596 oasc.JmxMonitoredMap.<init> JMX monitoring is enabled. Adding Solr mbeans to JMX Server: com.sun.jmx.mbeanserver.JmxMBeanServer@76d26a
[junit4:junit4]   2> 5168 T596 oasc.SolrCore.initDirectoryFactory solr.NRTCachingDirectoryFactory
[junit4:junit4]   2> 5169 T596 oasc.CachingDirectoryFactory.get return new directory for /usr/home/hudson/hudson-slave/workspace/Lucene-Solr-Tests-4.x-java7/solr/build/solr-core/test/J0/./org.apache.solr.cloud.BasicDistributedZkTest-1359705998839/jetty1 forceNew:false
[junit4:junit4]   2> 5169 T596 oasc.CachingDirectoryFactory.close Releasing directory:/usr/home/hudson/hudson-slave/workspace/Lucene-Solr-Tests-4.x-java7/solr/build/solr-core/test/J0/./org.apache.solr.cloud.BasicDistributedZkTest-1359705998839/jetty1
[junit4:junit4]   2> 5170 T596 oasc.SolrCore.getNewIndexDir New index directory detected: old=null new=./org.apache.solr.cloud.BasicDistributedZkTest-1359705998839/jetty1/index/
[junit4:junit4]   2> 5170 T596 oasc.SolrCore.initIndex WARNING [collection1] Solr index directory './org.apache.solr.cloud.BasicDistributedZkTest-1359705998839/jetty1/index' doesn't exist. Creating new index...
[junit4:junit4]   2> 5171 T596 oasc.CachingDirectoryFactory.get return new directory for /usr/home/hudson/hudson-slave/workspace/Lucene-Solr-Tests-4.x-java7/solr/build/solr-core/test/J0/./org.apache.solr.cloud.BasicDistributedZkTest-1359705998839/jetty1/index forceNew:false
[junit4:junit4]   2> 5177 T596 oasc.SolrDeletionPolicy.onCommit SolrDeletionPolicy.onCommit: commits:num=1
[junit4:junit4]   2> 		commit{dir=RateLimitedDirectoryWrapper(NRTCachingDirectory(org.apache.lucene.store.NIOFSDirectory@/usr/home/hudson/hudson-slave/workspace/Lucene-Solr-Tests-4.x-java7/solr/build/solr-core/test/J0/org.apache.solr.cloud.BasicDistributedZkTest-1359705998839/jetty1/index lockFactory=org.apache.lucene.store.NativeFSLockFactory@28ba5be1; maxCacheMB=48.0 maxMergeSizeMB=4.0)),segFN=segments_1,generation=1,filenames=[segments_1]
[junit4:junit4]   2> 5177 T596 oasc.SolrDeletionPolicy.updateCommits newest commit = 1[segments_1]
[junit4:junit4]   2> 5178 T596 oasc.CachingDirectoryFactory.close Releasing directory:/usr/home/hudson/hudson-slave/workspace/Lucene-Solr-Tests-4.x-java7/solr/build/solr-core/test/J0/./org.apache.solr.cloud.BasicDistributedZkTest-1359705998839/jetty1/index
[junit4:junit4]   2> 5179 T596 oasc.SolrCore.initWriters created xml: solr.XMLResponseWriter
[junit4:junit4]   2> 5182 T596 oasup.UpdateRequestProcessorChain.init inserting DistributedUpdateProcessorFactory into updateRequestProcessorChain "dedupe"
[junit4:junit4]   2> 5182 T596 oasup.UpdateRequestProcessorChain.init inserting DistributedUpdateProcessorFactory into updateRequestProcessorChain "dedupe-allfields"
[junit4:junit4]   2> 5182 T596 oasup.UpdateRequestProcessorChain.init inserting DistributedUpdateProcessorFactory into updateRequestProcessorChain "stored_sig"
[junit4:junit4]   2> 5183 T596 oasup.UpdateRequestProcessorChain.init inserting DistributedUpdateProcessorFactory into updateRequestProcessorChain "uniq-fields"
[junit4:junit4]   2> 5183 T596 oasup.UpdateRequestProcessorChain.init inserting DistributedUpdateProcessorFactory into updateRequestProcessorChain "distrib-dup-test-chain-implicit"
[junit4:junit4]   2> 5183 T596 oasc.RequestHandlers.initHandlersFromConfig adding lazy requestHandler: solr.ReplicationHandler
[junit4:junit4]   2> 5184 T596 oasc.RequestHandlers.initHandlersFromConfig created /replication: solr.ReplicationHandler
[junit4:junit4]   2> 5185 T596 oasc.RequestHandlers.initHandlersFromConfig created standard: solr.StandardRequestHandler
[junit4:junit4]   2> 5185 T596 oasc.RequestHandlers.initHandlersFromConfig created /get: solr.RealTimeGetHandler
[junit4:junit4]   2> 5186 T596 oasc.RequestHandlers.initHandlersFromConfig created dismax: solr.SearchHandler
[junit4:junit4]   2> 5186 T596 oasc.RequestHandlers.initHandlersFromConfig created mock: org.apache.solr.core.MockQuerySenderListenerReqHandler
[junit4:junit4]   2> 5187 T596 oasc.RequestHandlers.initHandlersFromConfig created /admin/: org.apache.solr.handler.admin.AdminHandlers
[junit4:junit4]   2> 5188 T596 oasc.RequestHandlers.initHandlersFromConfig created defaults: solr.StandardRequestHandler
[junit4:junit4]   2> 5188 T596 oasc.RequestHandlers.initHandlersFromConfig adding lazy requestHandler: solr.StandardRequestHandler
[junit4:junit4]   2> 5188 T596 oasc.RequestHandlers.initHandlersFromConfig created lazy: solr.StandardRequestHandler
[junit4:junit4]   2> 5189 T596 oasc.RequestHandlers.initHandlersFromConfig created /update: solr.UpdateRequestHandler
[junit4:junit4]   2> 5189 T596 oasc.RequestHandlers.initHandlersFromConfig created /terms: org.apache.solr.handler.component.SearchHandler
[junit4:junit4]   2> 5190 T596 oasc.RequestHandlers.initHandlersFromConfig created spellCheckCompRH: org.apache.solr.handler.component.SearchHandler
[junit4:junit4]   2> 5191 T596 oasc.RequestHandlers.initHandlersFromConfig created spellCheckCompRH_Direct: org.apache.solr.handler.component.SearchHandler
[junit4:junit4]   2> 5191 T596 oasc.RequestHandlers.initHandlersFromConfig created spellCheckWithWordbreak: org.apache.solr.handler.component.SearchHandler
[junit4:junit4]   2> 5192 T596 oasc.RequestHandlers.initHandlersFromConfig created spellCheckWithWordbreak_Direct: org.apache.solr.handler.component.SearchHandler
[junit4:junit4]   2> 5192 T596 oasc.RequestHandlers.initHandlersFromConfig created spellCheckCompRH1: org.apache.solr.handler.component.SearchHandler
[junit4:junit4]   2> 5193 T596 oasc.RequestHandlers.initHandlersFromConfig created mltrh: org.apache.solr.handler.component.SearchHandler
[junit4:junit4]   2> 5194 T596 oasc.RequestHandlers.initHandlersFromConfig created tvrh: org.apache.solr.handler.component.SearchHandler
[junit4:junit4]   2> 5194 T596 oasc.RequestHandlers.initHandlersFromConfig created /mlt: solr.MoreLikeThisHandler
[junit4:junit4]   2> 5195 T596 oasc.RequestHandlers.initHandlersFromConfig created /debug/dump: solr.DumpRequestHandler
[junit4:junit4]   2> 5208 T596 oashl.XMLLoader.init xsltCacheLifetimeSeconds=60
[junit4:junit4]   2> 5212 T596 oasc.SolrCore.initDeprecatedSupport WARNING solrconfig.xml uses deprecated <admin/gettableFiles>, Please update your config to use the ShowFileRequestHandler.
[junit4:junit4]   2> 5214 T596 oasc.SolrCore.initDeprecatedSupport WARNING adding ShowFileRequestHandler with hidden files: [SCHEMA.XML, OLD_SYNONYMS.TXT, STOPWORDS.TXT, PROTWORDS.TXT, OPEN-EXCHANGE-RATES.JSON, SYNONYMS.TXT, CURRENCY.XML, MAPPING-ISOLATIN1ACCENT.TXT]
[junit4:junit4]   2> 5217 T596 oasc.CachingDirectoryFactory.close Releasing directory:/usr/home/hudson/hudson-slave/workspace/Lucene-Solr-Tests-4.x-java7/solr/build/solr-core/test/J0/./org.apache.solr.cloud.BasicDistributedZkTest-1359705998839/jetty1
[junit4:junit4]   2> 5219 T596 oass.SolrIndexSearcher.<init> Opening Searcher@2216c97f main
[junit4:junit4]   2> 5220 T596 oasu.CommitTracker.<init> Hard AutoCommit: disabled
[junit4:junit4]   2> 5220 T596 oasu.CommitTracker.<init> Soft AutoCommit: disabled
[junit4:junit4]   2> 5221 T596 oashc.SpellCheckComponent.inform Initializing spell checkers
[junit4:junit4]   2> 5237 T596 oass.DirectSolrSpellChecker.init init: {name=direct,classname=DirectSolrSpellChecker,field=lowerfilt,minQueryLength=3}
[junit4:junit4]   2> 5295 T597 oasc.SolrCore.registerSearcher [collection1] Registered new searcher Searcher@2216c97f main{StandardDirectoryReader(segments_1:1)}
[junit4:junit4]   2> 5302 T596 oasc.ZkController.publish publishing core=collection1 state=down
[junit4:junit4]   2> 5303 T596 oasc.ZkController.publish numShards not found on descriptor - reading it from system property
[junit4:junit4]   2> 5370 T577 oascc.ZkStateReader.updateClusterState Updating cloud state from ZooKeeper... 
[junit4:junit4]   2> 5372 T577 oasc.Overseer$ClusterStateUpdater.updateState Update state numShards=1 message={
[junit4:junit4]   2> 	  "operation":"state",
[junit4:junit4]   2> 	  "numShards":"1",
[junit4:junit4]   2> 	  "shard":"shard1",
[junit4:junit4]   2> 	  "roles":null,
[junit4:junit4]   2> 	  "state":"active",
[junit4:junit4]   2> 	  "core":"collection1",
[junit4:junit4]   2> 	  "collection":"control_collection",
[junit4:junit4]   2> 	  "node_name":"127.0.0.1:62981_",
[junit4:junit4]   2> 	  "base_url":"http://127.0.0.1:62981"}
[junit4:junit4]   2> 5379 T577 oasc.Overseer$ClusterStateUpdater.updateState Update state numShards=2 message={
[junit4:junit4]   2> 	  "operation":"state",
[junit4:junit4]   2> 	  "numShards":"2",
[junit4:junit4]   2> 	  "shard":null,
[junit4:junit4]   2> 	  "roles":null,
[junit4:junit4]   2> 	  "state":"down",
[junit4:junit4]   2> 	  "core":"collection1",
[junit4:junit4]   2> 	  "collection":"collection1",
[junit4:junit4]   2> 	  "node_name":"127.0.0.1:62992_",
[junit4:junit4]   2> 	  "base_url":"http://127.0.0.1:62992"}
[junit4:junit4]   2> 5379 T577 oasc.Overseer$ClusterStateUpdater.createCollection Create collection collection1 with numShards 2
[junit4:junit4]   2> 5379 T577 oasc.Overseer$ClusterStateUpdater.updateState Assigning new node to shard shard=shard1
[junit4:junit4]   2> 5386 T595 oascc.ZkStateReader$2.process A cluster state change: WatchedEvent state:SyncConnected type:NodeDataChanged path:/clusterstate.json, has occurred - updating... (live nodes size: 2)
[junit4:junit4]   2> 5386 T582 oascc.ZkStateReader$2.process A cluster state change: WatchedEvent state:SyncConnected type:NodeDataChanged path:/clusterstate.json, has occurred - updating... (live nodes size: 2)
[junit4:junit4]   2> 5386 T576 oascc.ZkStateReader$2.process A cluster state change: WatchedEvent state:SyncConnected type:NodeDataChanged path:/clusterstate.json, has occurred - updating... (live nodes size: 2)
[junit4:junit4]   2> 6306 T596 oasc.CoreContainer.registerCore registering core: collection1
[junit4:junit4]   2> 6306 T596 oasc.ZkController.register Register replica - core:collection1 address:http://127.0.0.1:62992 collection:collection1 shard:shard1
[junit4:junit4]   2> 6307 T596 oascc.SolrZkClient.makePath makePath: /collections/collection1/leader_elect/shard1/election
[junit4:junit4]   2> 6340 T559 oazs.PrepRequestProcessor.pRequest Got user-level KeeperException when processing sessionid:0x13c94cb05fe0006 type:delete cxid:0x43 zxid:0x5a txntype:-1 reqpath:n/a Error Path:/solr/collections/collection1/leaders Error:KeeperErrorCode = NoNode for /solr/collections/collection1/leaders
[junit4:junit4]   2> 6349 T596 oasc.ShardLeaderElectionContext.runLeaderProcess Running the leader process.
[junit4:junit4]   2> 6350 T559 oazs.PrepRequestProcessor.pRequest Got user-level KeeperException when processing sessionid:0x13c94cb05fe0006 type:create cxid:0x44 zxid:0x5b txntype:-1 reqpath:n/a Error Path:/solr/overseer Error:KeeperErrorCode = NodeExists for /solr/overseer
[junit4:junit4]   2> 6353 T596 oasc.ShardLeaderElectionContext.waitForReplicasToComeUp Enough replicas found to continue.
[junit4:junit4]   2> 6353 T596 oasc.ShardLeaderElectionContext.runLeaderProcess I may be the new leader - try and sync
[junit4:junit4]   2> 6353 T596 oasc.SyncStrategy.sync Sync replicas to http://127.0.0.1:62992/collection1/
[junit4:junit4]   2> 6354 T596 oasc.SyncStrategy.syncReplicas Sync Success - now sync replicas to me
[junit4:junit4]   2> 6354 T596 oasc.SyncStrategy.syncToMe http://127.0.0.1:62992/collection1/ has no replicas
[junit4:junit4]   2> 6354 T596 oasc.ShardLeaderElectionContext.runLeaderProcess I am the new leader: http://127.0.0.1:62992/collection1/
[junit4:junit4]   2> 6355 T596 oascc.SolrZkClient.makePath makePath: /collections/collection1/leaders/shard1
[junit4:junit4]   2> 6361 T559 oazs.PrepRequestProcessor.pRequest Got user-level KeeperException when processing sessionid:0x13c94cb05fe0006 type:create cxid:0x4e zxid:0x5f txntype:-1 reqpath:n/a Error Path:/solr/overseer Error:KeeperErrorCode = NodeExists for /solr/overseer
[junit4:junit4]   2> 6905 T577 oascc.ZkStateReader.updateClusterState Updating cloud state from ZooKeeper... 
[junit4:junit4]   2> 6916 T582 oascc.ZkStateReader$2.process A cluster state change: WatchedEvent state:SyncConnected type:NodeDataChanged path:/clusterstate.json, has occurred - updating... (live nodes size: 2)
[junit4:junit4]   2> 6916 T576 oascc.ZkStateReader$2.process A cluster state change: WatchedEvent state:SyncConnected type:NodeDataChanged path:/clusterstate.json, has occurred - updating... (live nodes size: 2)
[junit4:junit4]   2> 6916 T595 oascc.ZkStateReader$2.process A cluster state change: WatchedEvent state:SyncConnected type:NodeDataChanged path:/clusterstate.json, has occurred - updating... (live nodes size: 2)
[junit4:junit4]   2> 6925 T596 oasc.ZkController.register We are http://127.0.0.1:62992/collection1/ and leader is http://127.0.0.1:62992/collection1/
[junit4:junit4]   2> 6925 T596 oasc.ZkController.register No LogReplay needed for core=collection1 baseURL=http://127.0.0.1:62992
[junit4:junit4]   2> 6925 T596 oasc.ZkController.checkRecovery I am the leader, no recovery necessary
[junit4:junit4]   2> 6925 T596 oasc.ZkController.publish publishing core=collection1 state=active
[junit4:junit4]   2> 6925 T596 oasc.ZkController.publish numShards not found on descriptor - reading it from system property
[junit4:junit4]   2> 6928 T596 oascc.ZkStateReader.updateClusterState Updating cloud state from ZooKeeper... 
[junit4:junit4]   2> 6929 T554 oass.SolrDispatchFilter.init user.dir=/usr/home/hudson/hudson-slave/workspace/Lucene-Solr-Tests-4.x-java7/solr/build/solr-core/test/J0
[junit4:junit4]   2> 6930 T554 oass.SolrDispatchFilter.init SolrDispatchFilter.init() done
[junit4:junit4]   2> 6930 T554 oascsi.HttpClientUtil.createClient Creating new http client, config:maxConnections=128&maxConnectionsPerHost=32&followRedirects=false
[junit4:junit4]   2> 7115 T554 oejs.Server.doStart jetty-8.1.8.v20121106
[junit4:junit4]   2> 7118 T554 oejs.AbstractConnector.doStart Started SocketConnector@127.0.0.1:63007
[junit4:junit4]   2> 7119 T554 oass.SolrDispatchFilter.init SolrDispatchFilter.init()
[junit4:junit4]   2> 7119 T554 oasc.SolrResourceLoader.locateSolrHome JNDI not configured for solr (NoInitialContextEx)
[junit4:junit4]   2> 7120 T554 oasc.SolrResourceLoader.locateSolrHome using system property solr.solr.home: /usr/home/hudson/hudson-slave/workspace/Lucene-Solr-Tests-4.x-java7/solr/build/solr-core/test/J0/./org.apache.solr.cloud.BasicDistributedZkTest-jetty2-1359706005778
[junit4:junit4]   2> 7120 T554 oasc.CoreContainer$Initializer.initialize looking for solr.xml: /usr/home/hudson/hudson-slave/workspace/Lucene-Solr-Tests-4.x-java7/solr/build/solr-core/test/J0/./org.apache.solr.cloud.BasicDistributedZkTest-jetty2-1359706005778/solr.xml
[junit4:junit4]   2> 7121 T554 oasc.CoreContainer.<init> New CoreContainer 140403856
[junit4:junit4]   2> 7121 T554 oasc.CoreContainer.load Loading CoreContainer using Solr Home: '/usr/home/hudson/hudson-slave/workspace/Lucene-Solr-Tests-4.x-java7/solr/build/solr-core/test/J0/./org.apache.solr.cloud.BasicDistributedZkTest-jetty2-1359706005778/'
[junit4:junit4]   2> 7122 T554 oasc.SolrResourceLoader.<init> new SolrResourceLoader for directory: '/usr/home/hudson/hudson-slave/workspace/Lucene-Solr-Tests-4.x-java7/solr/build/solr-core/test/J0/./org.apache.solr.cloud.BasicDistributedZkTest-jetty2-1359706005778/'
[junit4:junit4]   2> 7177 T554 oashc.HttpShardHandlerFactory.getParameter Setting socketTimeout to: 60000
[junit4:junit4]   2> 7177 T554 oashc.HttpShardHandlerFactory.getParameter Setting urlScheme to: http://
[junit4:junit4]   2> 7178 T554 oashc.HttpShardHandlerFactory.getParameter Setting connTimeout to: 15000
[junit4:junit4]   2> 7178 T554 oashc.HttpShardHandlerFactory.getParameter Setting maxConnectionsPerHost to: 20
[junit4:junit4]   2> 7178 T554 oashc.HttpShardHandlerFactory.getParameter Setting corePoolSize to: 0
[junit4:junit4]   2> 7179 T554 oashc.HttpShardHandlerFactory.getParameter Setting maximumPoolSize to: 2147483647
[junit4:junit4]   2> 7179 T554 oashc.HttpShardHandlerFactory.getParameter Setting maxThreadIdleTime to: 5
[junit4:junit4]   2> 7180 T554 oashc.HttpShardHandlerFactory.getParameter Setting sizeOfQueue to: -1
[junit4:junit4]   2> 7180 T554 oashc.HttpShardHandlerFactory.getParameter Setting fairnessPolicy to: false
[junit4:junit4]   2> 7181 T554 oascsi.HttpClientUtil.createClient Creating new http client, config:maxConnectionsPerHost=20&maxConnections=10000&socketTimeout=60000&connTimeout=15000&retry=false
[junit4:junit4]   2> 7202 T554 oasc.CoreContainer.load Registering Log Listener
[junit4:junit4]   2> 7221 T554 oasc.CoreContainer.initZooKeeper Zookeeper client=127.0.0.1:62978/solr
[junit4:junit4]   2> 7222 T554 oasc.ZkController.checkChrootPath zkHost includes chroot
[junit4:junit4]   2> 7222 T554 oaz.ZooKeeper.<init> Initiating client connection, connectString=127.0.0.1:62978 sessionTimeout=60000 watcher=org.apache.solr.common.cloud.ConnectionManager@39dbba7
[junit4:junit4]   2> 7223 T554 oascc.ConnectionManager.waitForConnected Waiting for client to connect to ZooKeeper
[junit4:junit4]   2> 7224 T607 oaz.ClientCnxn$SendThread.logStartConnect Opening socket connection to server localhost/127.0.0.1:62978. Will not attempt to authenticate using SASL (access denied ("javax.security.auth.AuthPermission" "getLoginConfiguration"))
[junit4:junit4]   2> 7224 T607 oaz.ClientCnxn$SendThread.primeConnection Socket connection established to localhost/127.0.0.1:62978, initiating session
[junit4:junit4]   2> 7225 T556 oazs.NIOServerCnxnFactory.run Accepted socket connection from /140.211.11.196:63008
[junit4:junit4]   2> 7225 T556 oazs.ZooKeeperServer.processConnectRequest Client attempting to establish new session at /140.211.11.196:63008
[junit4:junit4]   2> 7227 T558 oazs.ZooKeeperServer.finishSessionInit Established session 0x13c94cb05fe0007 with negotiated timeout 20000 for client /140.211.11.196:63008
[junit4:junit4]   2> 7227 T607 oaz.ClientCnxn$SendThread.onConnected Session establishment complete on server localhost/127.0.0.1:62978, sessionid = 0x13c94cb05fe0007, negotiated timeout = 20000
[junit4:junit4]   2> 7228 T608 oascc.ConnectionManager.process Watcher org.apache.solr.common.cloud.ConnectionManager@39dbba7 name:ZooKeeperConnection Watcher:127.0.0.1:62978 got event WatchedEvent state:SyncConnected type:None path:null path:null type:None
[junit4:junit4]   2> 7228 T554 oascc.ConnectionManager.waitForConnected Client is connected to ZooKeeper
[junit4:junit4]   2> 7230 T559 oazs.PrepRequestProcessor.pRequest2Txn Processed session termination for sessionid: 0x13c94cb05fe0007
[junit4:junit4]   2> 7241 T608 oaz.ClientCnxn$EventThread.run EventThread shut down
[junit4:junit4]   2> 7241 T556 oazs.NIOServerCnxn.closeSock Closed socket connection for client /140.211.11.196:63008 which had sessionid 0x13c94cb05fe0007
[junit4:junit4]   2> 7241 T554 oaz.ZooKeeper.close Session: 0x13c94cb05fe0007 closed
[junit4:junit4]   2> 7242 T554 oascsi.HttpClientUtil.createClient Creating new http client, config:maxConnections=500&maxConnectionsPerHost=16&socketTimeout=60000&connTimeout=15000
[junit4:junit4]   2> 7253 T554 oaz.ZooKeeper.<init> Initiating client connection, connectString=127.0.0.1:62978/solr sessionTimeout=30000 watcher=org.apache.solr.common.cloud.ConnectionManager@675b8797
[junit4:junit4]   2> 7254 T554 oascc.ConnectionManager.waitForConnected Waiting for client to connect to ZooKeeper
[junit4:junit4]   2> 7255 T609 oaz.ClientCnxn$SendThread.logStartConnect Opening socket connection to server localhost/127.0.0.1:62978. Will not attempt to authenticate using SASL (access denied ("javax.security.auth.AuthPermission" "getLoginConfiguration"))
[junit4:junit4]   2> 7255 T609 oaz.ClientCnxn$SendThread.primeConnection Socket connection established to localhost/127.0.0.1:62978, initiating session
[junit4:junit4]   2> 7255 T556 oazs.NIOServerCnxnFactory.run Accepted socket connection from /140.211.11.196:63009
[junit4:junit4]   2> 7256 T556 oazs.ZooKeeperServer.processConnectRequest Client attempting to establish new session at /140.211.11.196:63009
[junit4:junit4]   2> 7257 T558 oazs.ZooKeeperServer.finishSessionInit Established session 0x13c94cb05fe0008 with negotiated timeout 20000 for client /140.211.11.196:63009
[junit4:junit4]   2> 7257 T609 oaz.ClientCnxn$SendThread.onConnected Session establishment complete on server localhost/127.0.0.1:62978, sessionid = 0x13c94cb05fe0008, negotiated timeout = 20000
[junit4:junit4]   2> 7257 T610 oascc.ConnectionManager.process Watcher org.apache.solr.common.cloud.ConnectionManager@675b8797 name:ZooKeeperConnection Watcher:127.0.0.1:62978/solr got event WatchedEvent state:SyncConnected type:None path:null path:null type:None
[junit4:junit4]   2> 7258 T554 oascc.ConnectionManager.waitForConnected Client is connected to ZooKeeper
[junit4:junit4]   2> 7259 T559 oazs.PrepRequestProcessor.pRequest Got user-level KeeperException when processing sessionid:0x13c94cb05fe0008 type:create cxid:0x1 zxid:0x6c txntype:-1 reqpath:n/a Error Path:/solr/overseer Error:KeeperErrorCode = NodeExists for /solr/overseer
[junit4:junit4]   2> 7261 T559 oazs.PrepRequestProcessor.pRequest Got user-level KeeperException when processing sessionid:0x13c94cb05fe0008 type:create cxid:0x2 zxid:0x6d txntype:-1 reqpath:n/a Error Path:/solr/overseer Error:KeeperErrorCode = NodeExists for /solr/overseer
[junit4:junit4]   2> 7262 T554 oasc.ZkController.createEphemeralLiveNode Register node as live in ZooKeeper:/live_nodes/127.0.0.1:63007_
[junit4:junit4]   2> 7263 T559 oazs.PrepRequestProcessor.pRequest Got user-level KeeperException when processing sessionid:0x13c94cb05fe0008 type:delete cxid:0x4 zxid:0x6e txntype:-1 reqpath:n/a Error Path:/solr/live_nodes/127.0.0.1:63007_ Error:KeeperErrorCode = NoNode for /solr/live_nodes/127.0.0.1:63007_
[junit4:junit4]   2> 7272 T554 oascc.SolrZkClient.makePath makePath: /live_nodes/127.0.0.1:63007_
[junit4:junit4]   2> 7275 T595 oascc.ZkStateReader$2.process A cluster state change: WatchedEvent state:SyncConnected type:NodeChildrenChanged path:/live_nodes, has occurred - updating... (live nodes size: 2)
[junit4:junit4]   2> 7275 T576 oascc.ZkStateReader$2.process A cluster state change: WatchedEvent state:SyncConnected type:NodeChildrenChanged path:/live_nodes, has occurred - updating... (live nodes size: 2)
[junit4:junit4]   2> 7276 T582 oascc.ZkStateReader$3.process Updating live nodes... (3)
[junit4:junit4]   2> 7276 T582 oascc.ZkStateReader$2.process A cluster state change: WatchedEvent state:SyncConnected type:NodeChildrenChanged path:/live_nodes, has occurred - updating... (live nodes size: 3)
[junit4:junit4]   2> 7278 T595 oascc.ZkStateReader$3.process Updating live nodes... (3)
[junit4:junit4]   2> 7278 T576 oascc.ZkStateReader$3.process Updating live nodes... (3)
[junit4:junit4]   2> 7282 T554 oascc.ZkStateReader.createClusterStateWatchersAndUpdate Updating cluster state from ZooKeeper... 
[junit4:junit4]   2> 7290 T611 oasc.CoreContainer.create Creating SolrCore 'collection1' using instanceDir: /usr/home/hudson/hudson-slave/workspace/Lucene-Solr-Tests-4.x-java7/solr/build/solr-core/test/J0/./org.apache.solr.cloud.BasicDistributedZkTest-jetty2-1359706005778/collection1
[junit4:junit4]   2> 7290 T611 oasc.ZkController.createCollectionZkNode Check for collection zkNode:collection1
[junit4:junit4]   2> 7291 T611 oasc.ZkController.createCollectionZkNode Collection zkNode exists
[junit4:junit4]   2> 7291 T611 oasc.ZkController.readConfigName Load collection config from:/collections/collection1
[junit4:junit4]   2> 7293 T611 oasc.SolrResourceLoader.<init> new SolrResourceLoader for directory: '/usr/home/hudson/hudson-slave/workspace/Lucene-Solr-Tests-4.x-java7/solr/build/solr-core/test/J0/./org.apache.solr.cloud.BasicDistributedZkTest-jetty2-1359706005778/collection1/'
[junit4:junit4]   2> 7294 T611 oasc.SolrResourceLoader.replaceClassLoader Adding 'file:/usr/home/hudson/hudson-slave/workspace/Lucene-Solr-Tests-4.x-java7/solr/build/solr-core/test/J0/org.apache.solr.cloud.BasicDistributedZkTest-jetty2-1359706005778/collection1/lib/classes/' to classloader
[junit4:junit4]   2> 7295 T611 oasc.SolrResourceLoader.replaceClassLoader Adding 'file:/usr/home/hudson/hudson-slave/workspace/Lucene-Solr-Tests-4.x-java7/solr/build/solr-core/test/J0/org.apache.solr.cloud.BasicDistributedZkTest-jetty2-1359706005778/collection1/lib/README' to classloader
[junit4:junit4]   2> 7349 T611 oasc.SolrConfig.<init> Using Lucene MatchVersion: LUCENE_42
[junit4:junit4]   2> 7420 T611 oasc.SolrConfig.<init> Loaded SolrConfig: solrconfig.xml
[junit4:junit4]   2> 7521 T611 oass.IndexSchema.readSchema Reading Solr Schema
[junit4:junit4]   2> 7527 T611 oass.IndexSchema.readSchema Schema name=test
[junit4:junit4]   2> 8141 T611 oass.OpenExchangeRatesOrgProvider.init Initialized with rates=open-exchange-rates.json, refreshInterval=1440.
[junit4:junit4]   2> 8152 T611 oass.IndexSchema.readSchema default search field in schema is text
[junit4:junit4]   2> 8156 T611 oass.IndexSchema.readSchema unique key field: id
[junit4:junit4]   2> 8176 T611 oass.FileExchangeRateProvider.reload Reloading exchange rates from file currency.xml
[junit4:junit4]   2> 8181 T611 oass.FileExchangeRateProvider.reload Reloading exchange rates from file currency.xml
[junit4:junit4]   2> 8186 T611 oass.OpenExchangeRatesOrgProvider.reload Reloading exchange rates from open-exchange-rates.json
[junit4:junit4]   2> 8188 T611 oass.OpenExchangeRatesOrgProvider.reload Reloading exchange rates from open-exchange-rates.json
[junit4:junit4]   2> 8190 T611 oasc.SolrCore.<init> [collection1] Opening new SolrCore at /usr/home/hudson/hudson-slave/workspace/Lucene-Solr-Tests-4.x-java7/solr/build/solr-core/test/J0/./org.apache.solr.cloud.BasicDistributedZkTest-jetty2-1359706005778/collection1/, dataDir=./org.apache.solr.cloud.BasicDistributedZkTest-1359705998839/jetty2/
[junit4:junit4]   2> 8190 T611 oasc.JmxMonitoredMap.<init> JMX monitoring is enabled. Adding Solr mbeans to JMX Server: com.sun.jmx.mbeanserver.JmxMBeanServer@76d26a
[junit4:junit4]   2> 8191 T611 oasc.SolrCore.initDirectoryFactory solr.NRTCachingDirectoryFactory
[junit4:junit4]   2> 8192 T611 oasc.CachingDirectoryFactory.get return new directory for /usr/home/hudson/hudson-slave/workspace/Lucene-Solr-Tests-4.x-java7/solr/build/solr-core/test/J0/./org.apache.solr.cloud.BasicDistributedZkTest-1359705998839/jetty2 forceNew:false
[junit4:junit4]   2> 8192 T611 oasc.CachingDirectoryFactory.close Releasing directory:/usr/home/hudson/hudson-slave/workspace/Lucene-Solr-Tests-4.x-java7/solr/build/solr-core/test/J0/./org.apache.solr.cloud.BasicDistributedZkTest-1359705998839/jetty2
[junit4:junit4]   2> 8193 T611 oasc.SolrCore.getNewIndexDir New index directory detected: old=null new=./org.apache.solr.cloud.BasicDistributedZkTest-1359705998839/jetty2/index/
[junit4:junit4]   2> 8193 T611 oasc.SolrCore.initIndex WARNING [collection1] Solr index directory './org.apache.solr.cloud.BasicDistributedZkTest-1359705998839/jetty2/index' doesn't exist. Creating new index...
[junit4:junit4]   2> 8194 T611 oasc.CachingDirectoryFactory.get return new directory for /usr/home/hudson/hudson-slave/workspace/Lucene-Solr-Tests-4.x-java7/solr/build/solr-core/test/J0/./org.apache.solr.cloud.BasicDistributedZkTest-1359705998839/jetty2/index forceNew:false
[junit4:junit4]   2> 8201 T611 oasc.SolrDeletionPolicy.onCommit SolrDeletionPolicy.onCommit: commits:num=1
[junit4:junit4]   2> 		commit{dir=RateLimitedDirectoryWrapper(NRTCachingDirectory(org.apache.lucene.store.NIOFSDirectory@/usr/home/hudson/hudson-slave/workspace/Lucene-Solr-Tests-4.x-java7/solr/build/solr-core/test/J0/org.apache.solr.cloud.BasicDistributedZkTest-1359705998839/jetty2/index lockFactory=org.apache.lucene.store.NativeFSLockFactory@48f6d2ba; maxCacheMB=48.0 maxMergeSizeMB=4.0)),segFN=segments_1,generation=1,filenames=[segments_1]
[junit4:junit4]   2> 8201 T611 oasc.SolrDeletionPolicy.updateCommits newest commit = 1[segments_1]
[junit4:junit4]   2> 8202 T611 oasc.CachingDirectoryFactory.close Releasing directory:/usr/home/hudson/hudson-slave/workspace/Lucene-Solr-Tests-4.x-java7/solr/build/solr-core/test/J0/./org.apache.solr.cloud.BasicDistributedZkTest-1359705998839/jetty2/index
[junit4:junit4]   2> 8203 T611 oasc.SolrCore.initWriters created xml: solr.XMLResponseWriter
[junit4:junit4]   2> 8205 T611 oasup.UpdateRequestProcessorChain.init inserting DistributedUpdateProcessorFactory into updateRequestProcessorChain "dedupe"
[junit4:junit4]   2> 8205 T611 oasup.UpdateRequestProcessorChain.init inserting DistributedUpdateProcessorFactory into updateRequestProcessorChain "dedupe-allfields"
[junit4:junit4]   2> 8206 T611 oasup.UpdateRequestProcessorChain.init inserting DistributedUpdateProcessorFactory into updateRequestProcessorChain "stored_sig"
[junit4:junit4]   2> 8206 T611 oasup.UpdateRequestProcessorChain.init inserting DistributedUpdateProcessorFactory into updateRequestProcessorChain "uniq-fields"
[junit4:junit4]   2> 8207 T611 oasup.UpdateRequestProcessorChain.init inserting DistributedUpdateProcessorFactory into updateRequestProcessorChain "distrib-dup-test-chain-implicit"
[junit4:junit4]   2> 8207 T611 oasc.RequestHandlers.initHandlersFromConfig adding lazy requestHandler: solr.ReplicationHandler
[junit4:junit4]   2> 8207 T611 oasc.RequestHandlers.initHandlersFromConfig created /replication: solr.ReplicationHandler
[junit4:junit4]   2> 8208 T611 oasc.RequestHandlers.initHandlersFromConfig created standard: solr.StandardRequestHandler
[junit4:junit4]   2> 8209 T611 oasc.RequestHandlers.initHandlersFromConfig created /get: solr.RealTimeGetHandler
[junit4:junit4]   2> 8209 T611 oasc.RequestHandlers.initHandlersFromConfig created dismax: solr.SearchHandler
[junit4:junit4]   2> 8210 T611 oasc.RequestHandlers.initHandlersFromConfig created mock: org.apache.solr.core.MockQuerySenderListenerReqHandler
[junit4:junit4]   2> 8210 T611 oasc.RequestHandlers.initHandlersFromConfig created /admin/: org.apache.solr.handler.admin.AdminHandlers
[junit4:junit4]   2> 8211 T611 oasc.RequestHandlers.initHandlersFromConfig created defaults: solr.StandardRequestHandler
[junit4:junit4]   2> 8211 T611 oasc.RequestHandlers.initHandlersFromConfig adding lazy requestHandler: solr.StandardRequestHandler
[junit4:junit4]   2> 8212 T611 oasc.RequestHandlers.initHandlersFromConfig created lazy: solr.StandardRequestHandler
[junit4:junit4]   2> 8212 T611 oasc.RequestHandlers.initHandlersFromConfig created /update: solr.UpdateRequestHandler
[junit4:junit4]   2> 8213 T611 oasc.RequestHandlers.initHandlersFromConfig created /terms: org.apache.solr.handler.component.SearchHandler
[junit4:junit4]   2> 8214 T611 oasc.RequestHandlers.initHandlersFromConfig created spellCheckCompRH: org.apache.solr.handler.component.SearchHandler
[junit4:junit4]   2> 8214 T611 oasc.RequestHandlers.initHandlersFromConfig created spellCheckCompRH_Direct: org.apache.solr.handler.component.SearchHandler
[junit4:junit4]   2> 8215 T611 oasc.RequestHandlers.initHandlersFromConfig created spellCheckWithWordbreak: org.apache.solr.handler.component.SearchHandler
[junit4:junit4]   2> 8215 T611 oasc.RequestHandlers.initHandlersFromConfig created spellCheckWithWordbreak_Direct: org.apache.solr.handler.component.SearchHandler
[junit4:junit4]   2> 8216 T611 oasc.RequestHandlers.initHandlersFromConfig created spellCheckCompRH1: org.apache.solr.handler.component.SearchHandler
[junit4:junit4]   2> 8217 T611 oasc.RequestHandlers.initHandlersFromConfig created mltrh: org.apache.solr.handler.component.SearchHandler
[junit4:junit4]   2> 8217 T611 oasc.RequestHandlers.initHandlersFromConfig created tvrh: org.apache.solr.handler.component.SearchHandler
[junit4:junit4]   2> 8218 T611 oasc.RequestHandlers.initHandlersFromConfig created /mlt: solr.MoreLikeThisHandler
[junit4:junit4]   2> 8219 T611 oasc.RequestHandlers.initHandlersFromConfig created /debug/dump: solr.DumpRequestHandler
[junit4:junit4]   2> 8232 T611 oashl.XMLLoader.init xsltCacheLifetimeSeconds=60
[junit4:junit4]   2> 8237 T611 oasc.SolrCore.initDeprecatedSupport WARNING solrconfig.xml uses deprecated <admin/gettableFiles>, Please update your config to use the ShowFileRequestHandler.
[junit4:junit4]   2> 8238 T611 oasc.SolrCore.initDeprecatedSupport WARNING adding ShowFileRequestHandler with hidden files: [SCHEMA.XML, OLD_SYNONYMS.TXT, STOPWORDS.TXT, PROTWORDS.TXT, OPEN-EXCHANGE-RATES.JSON, SYNONYMS.TXT, CURRENCY.XML, MAPPING-ISOLATIN1ACCENT.TXT]
[junit4:junit4]   2> 8241 T611 oasc.CachingDirectoryFactory.close Releasing directory:/usr/home/hudson/hudson-slave/workspace/Lucene-Solr-Tests-4.x-java7/solr/build/solr-core/test/J0/./org.apache.solr.cloud.BasicDistributedZkTest-1359705998839/jetty2
[junit4:junit4]   2> 8243 T611 oass.SolrIndexSearcher.<init> Opening Searcher@d319980 main
[junit4:junit4]   2> 8244 T611 oasu.CommitTracker.<init> Hard AutoCommit: disabled
[junit4:junit4]   2> 8244 T611 oasu.CommitTracker.<init> Soft AutoCommit: disabled
[junit4:junit4]   2> 8245 T611 oashc.SpellCheckComponent.inform Initializing spell checkers
[junit4:junit4]   2> 8252 T611 oass.DirectSolrSpellChecker.init init: {name=direct,classname=DirectSolrSpellChecker,field=lowerfilt,minQueryLength=3}
[junit4:junit4]   2> 8312 T612 oasc.SolrCore.registerSearcher [collection1] Registered new searcher Searcher@d319980 main{StandardDirectoryReader(segments_1:1)}
[junit4:junit4]   2> 8319 T611 oasc.ZkController.publish publishing core=collection1 state=down
[junit4:junit4]   2> 8320 T611 oasc.ZkController.publish numShards not found on descriptor - reading it from system property
[junit4:junit4]   2> 8425 T577 oascc.ZkStateReader.updateClusterState Updating cloud state from ZooKeeper... 
[junit4:junit4]   2> 8426 T577 oasc.Overseer$ClusterStateUpdater.updateState Update state numShards=2 message={
[junit4:junit4]   2> 	  "operation":"state",
[junit4:junit4]   2> 	  "numShards":"2",
[junit4:junit4]   2> 	  "shard":"shard1",
[junit4:junit4]   2> 	  "roles":null,
[junit4:junit4]   2> 	  "state":"active",
[junit4:junit4]   2> 	  "core":"collection1",
[junit4:junit4]   2> 	  "collection":"collection1",
[junit4:junit4]   2> 	  "node_name":"127.0.0.1:62992_",
[junit4:junit4]   2> 	  "base_url":"http://127.0.0.1:62992"}
[junit4:junit4]   2> 8443 T577 oasc.Overseer$ClusterStateUpdater.updateState Update state numShards=2 message={
[junit4:junit4]   2> 	  "operation":"state",
[junit4:junit4]   2> 	  "numShards":"2",
[junit4:junit4]   2> 	  "shard":null,
[junit4:junit4]   2> 	  "roles":null,
[junit4:junit4]   2> 	  "state":"down",
[junit4:junit4]   2> 	  "core":"collection1",
[junit4:junit4]   2> 	  "collection":"collection1",
[junit4:junit4]   2> 	  "node_name":"127.0.0.1:63007_",
[junit4:junit4]   2> 	  "base_url":"http://127.0.0.1:63007"}
[junit4:junit4]   2> 8443 T577 oasc.Overseer$ClusterStateUpdater.updateState Collection already exists with numShards=2
[junit4:junit4]   2> 8443 T577 oasc.Overseer$ClusterStateUpdater.updateState Assigning new node to shard shard=shard2
[junit4:junit4]   2> 8449 T595 oascc.ZkStateReader$2.process A cluster state change: WatchedEvent state:SyncConnected type:NodeDataChanged path:/clusterstate.json, has occurred - updating... (live nodes size: 3)
[junit4:junit4]   2> 8449 T610 oascc.ZkStateReader$2.process A cluster state change: WatchedEvent state:SyncConnected type:NodeDataChanged path:/clusterstate.json, has occurred - updating... (live nodes size: 3)
[junit4:junit4]   2> 8449 T582 oascc.ZkStateReader$2.process A cluster state change: WatchedEvent state:SyncConnected type:NodeDataChanged path:/clusterstate.json, has occurred - updating... (live nodes size: 3)
[junit4:junit4]   2> 8449 T576 oascc.ZkStateReader$2.process A cluster state change: WatchedEvent state:SyncConnected type:NodeDataChanged path:/clusterstate.json, has occurred - updating... (live nodes size: 3)
[junit4:junit4]   2> 9323 T611 oasc.CoreContainer.registerCore registering core: collection1
[junit4:junit4]   2> 9323 T611 oasc.ZkController.register Register replica - core:collection1 address:http://127.0.0.1:63007 collection:collection1 shard:shard2
[junit4:junit4]   2> 9325 T611 oascc.SolrZkClient.makePath makePath: /collections/collection1/leader_elect/shard2/election
[junit4:junit4]   2> 9348 T559 oazs.PrepRequestProcessor.pRequest Got user-level KeeperException when processing sessionid:0x13c94cb05fe0008 type:delete cxid:0x42 zxid:0x7c txntype:-1 reqpath:n/a Error Path:/solr/collections/collection1/leaders/shard2 Error:KeeperErrorCode = NoNode for /solr/collections/collection1/leaders/shard2
[junit4:junit4]   2> 9349 T611 oasc.ShardLeaderElectionContext.runLeaderProcess Running the leader process.
[junit4:junit4]   2> 9349 T559 oazs.PrepRequestProcessor.pRequest Got user-level KeeperException when processing sessionid:0x13c94cb05fe0008 type:create cxid:0x43 zxid:0x7d txntype:-1 reqpath:n/a Error Path:/solr/overseer Error:KeeperErrorCode = NodeExists for /solr/overseer
[junit4:junit4]   2> 9360 T611 oasc.ShardLeaderElectionContext.waitForReplicasToComeUp Enough replicas found to continue.
[junit4:junit4]   2> 9360 T611 oasc.ShardLeaderElectionContext.runLeaderProcess I may be the new leader - try and sync
[junit4:junit4]   2> 9360 T611 oasc.SyncStrategy.sync Sync replicas to http://127.0.0.1:63007/collection1/
[junit4:junit4]   2> 9360 T611 oasc.SyncStrategy.syncReplicas Sync Success - now sync replicas to me
[junit4:junit4]   2> 9361 T611 oasc.SyncStrategy.syncToMe http://127.0.0.1:63007/collection1/ has no replicas
[junit4:junit4]   2> 9361 T611 oasc.ShardLeaderElectionContext.runLeaderProcess I am the new leader: http://127.0.0.1:63007/collection1/
[junit4:junit4]   2> 9361 T611 oascc.SolrZkClient.makePath makePath: /collections/collection1/leaders/shard2
[junit4:junit4]   2> 9365 T559 oazs.PrepRequestProcessor.pRequest Got user-level KeeperException when processing sessionid:0x13c94cb05fe0008 type:create cxid:0x4c zxid:0x80 txntype:-1 reqpath:n/a Error Path:/solr/overseer Error:KeeperErrorCode = NodeExists for /solr/overseer
[junit4:junit4]   2> 9959 T577 oascc.ZkStateReader.updateClusterState Updating cloud state from ZooKeeper... 
[junit4:junit4]   2> 9975 T610 oascc.ZkStateReader$2.process A cluster state change: WatchedEvent state:SyncConnected type:NodeDataChanged path:/clusterstate.json, has occurred - updating... (live nodes size: 3)
[junit4:junit4]   2> 9975 T582 oascc.ZkStateReader$2.process A cluster state change: WatchedEvent state:SyncConnected type:NodeDataChanged path:/clusterstate.json, has occurred - updating... (live nodes size: 3)
[junit4:junit4]   2> 9975 T576 oascc.ZkStateReader$2.process A cluster state change: WatchedEvent state:SyncConnected type:NodeDataChanged path:/clusterstate.json, has occurred - updating... (live nodes size: 3)
[junit4:junit4]   2> 9975 T595 oascc.ZkStateReader$2.process A cluster state change: WatchedEvent state:SyncConnected type:NodeDataChanged path:/clusterstate.json, has occurred - updating... (live nodes size: 3)
[junit4:junit4]   2> 9981 T611 oasc.ZkController.register We are http://127.0.0.1:63007/collection1/ and leader is http://127.0.0.1:63007/collection1/
[junit4:junit4]   2> 9981 T611 oasc.ZkController.register No LogReplay needed for core=collection1 baseURL=http://127.0.0.1:63007
[junit4:junit4]   2> 9981 T611 oasc.ZkController.checkRecovery I am the leader, no recovery necessary
[junit4:junit4]   2> 9981 T611 oasc.ZkController.publish publishing core=collection1 state=active
[junit4:junit4]   2> 9981 T611 oasc.ZkController.publish numShards not found on descriptor - reading it from system property
[junit4:junit4]   2> 9987 T611 oascc.ZkStateReader.updateClusterState Updating cloud state from ZooKeeper... 
[junit4:junit4]   2> 9989 T554 oass.SolrDispatchFilter.init user.dir=/usr/home/hudson/hudson-slave/workspace/Lucene-Solr-Tests-4.x-java7/solr/build/solr-core/test/J0
[junit4:junit4]   2> 9989 T554 oass.SolrDispatchFilter.init SolrDispatchFilter.init() done
[junit4:junit4]   2> 9990 T554 oascsi.HttpClientUtil.createClient Creating new http client, config:maxConnections=128&maxConnectionsPerHost=32&followRedirects=false
[junit4:junit4]   2> 10146 T554 oejs.Server.doStart jetty-8.1.8.v20121106
[junit4:junit4]   2> 10149 T554 oejs.AbstractConnector.doStart Started SocketConnector@127.0.0.1:63010
[junit4:junit4]   2> 10150 T554 oass.SolrDispatchFilter.init SolrDispatchFilter.init()
[junit4:junit4]   2> 10150 T554 oasc.SolrResourceLoader.locateSolrHome JNDI not configured for solr (NoInitialContextEx)
[junit4:junit4]   2> 10150 T554 oasc.SolrResourceLoader.locateSolrHome using system property solr.solr.home: /usr/home/hudson/hudson-slave/workspace/Lucene-Solr-Tests-4.x-java7/solr/build/solr-core/test/J0/./org.apache.solr.cloud.BasicDistributedZkTest-jetty3-1359706008837
[junit4:junit4]   2> 10151 T554 oasc.CoreContainer$Initializer.initialize looking for solr.xml: /usr/home/hudson/hudson-slave/workspace/Lucene-Solr-Tests-4.x-java7/solr/build/solr-core/test/J0/./org.apache.solr.cloud.BasicDistributedZkTest-jetty3-1359706008837/solr.xml
[junit4:junit4]   2> 10151 T554 oasc.CoreContainer.<init> New CoreContainer 1571910860
[junit4:junit4]   2> 10151 T554 oasc.CoreContainer.load Loading CoreContainer using Solr Home: '/usr/home/hudson/hudson-slave/workspace/Lucene-Solr-Tests-4.x-java7/solr/build/solr-core/test/J0/./org.apache.solr.cloud.BasicDistributedZkTest-jetty3-1359706008837/'
[junit4:junit4]   2> 10152 T554 oasc.SolrResourceLoader.<init> new SolrResourceLoader for directory: '/usr/home/hudson/hudson-slave/workspace/Lucene-Solr-Tests-4.x-java7/solr/build/solr-core/test/J0/./org.apache.solr.cloud.BasicDistributedZkTest-jetty3-1359706008837/'
[junit4:junit4]   2> 10188 T554 oashc.HttpShardHandlerFactory.getParameter Setting socketTimeout to: 60000
[junit4:junit4]   2> 10189 T554 oashc.HttpShardHandlerFactory.getParameter Setting urlScheme to: http://
[junit4:junit4]   2> 10189 T554 oashc.HttpShardHandlerFactory.getParameter Setting connTimeout to: 15000
[junit4:junit4]   2> 10189 T554 oashc.HttpShardHandlerFactory.getParameter Setting maxConnectionsPerHost to: 20
[junit4:junit4]   2> 10190 T554 oashc.HttpShardHandlerFactory.getParameter Setting corePoolSize to: 0
[junit4:junit4]   2> 10190 T554 oashc.HttpShardHandlerFactory.getParameter Setting maximumPoolSize to: 2147483647
[junit4:junit4]   2> 10190 T554 oashc.HttpShardHandlerFactory.getParameter Setting maxThreadIdleTime to: 5
[junit4:junit4]   2> 10191 T554 oashc.HttpShardHandlerFactory.getParameter Setting sizeOfQueue to: -1
[junit4:junit4]   2> 10191 T554 oashc.HttpShardHandlerFactory.getParameter Setting fairnessPolicy to: false
[junit4:junit4]   2> 10191 T554 oascsi.HttpClientUtil.createClient Creating new http client, config:maxConnectionsPerHost=20&maxConnections=10000&socketTimeout=60000&connTimeout=15000&retry=false
[junit4:junit4]   2> 10206 T554 oasc.CoreContainer.load Registering Log Listener
[junit4:junit4]   2> 10220 T554 oasc.CoreContainer.initZooKeeper Zookeeper client=127.0.0.1:62978/solr
[junit4:junit4]   2> 10220 T554 oasc.ZkController.checkChrootPath zkHost includes chroot
[junit4:junit4]   2> 10220 T554 oaz.ZooKeeper.<init> Initiating client connection, connectString=127.0.0.1:62978 sessionTimeout=60000 watcher=org.apache.solr.common.cloud.ConnectionManager@40f9328a
[junit4:junit4]   2> 10221 T554 oascc.ConnectionManager.waitForConnected Waiting for client to connect to ZooKeeper
[junit4:junit4]   2> 10222 T622 oaz.ClientCnxn$SendThread.logStartConnect Opening socket connection to server localhost/127.0.0.1:62978. Will not attempt to authenticate using SASL (access denied ("javax.security.auth.AuthPermission" "getLoginConfiguration"))
[junit4:junit4]   2> 10223 T622 oaz.ClientCnxn$SendThread.primeConnection Socket connection established to localhost/127.0.0.1:62978, initiating session
[junit4:junit4]   2> 10223 T556 oazs.NIOServerCnxnFactory.run Accepted socket connection from /140.211.11.196:63011
[junit4:junit4]   2> 10223 T556 oazs.ZooKeeperServer.processConnectRequest Client attempting to establish new session at /140.211.11.196:63011
[junit4:junit4]   2> 10225 T558 oazs.ZooKeeperServer.finishSessionInit Established session 0x13c94cb05fe0009 with negotiated timeout 20000 for client /140.211.11.196:63011
[junit4:junit4]   2> 10225 T622 oaz.ClientCnxn$SendThread.onConnected Session establishment complete on server localhost/127.0.0.1:62978, sessionid = 0x13c94cb05fe0009, negotiated timeout = 20000
[junit4:junit4]   2> 10226 T623 oascc.ConnectionManager.process Watcher org.apache.solr.common.cloud.ConnectionManager@40f9328a name:ZooKeeperConnection Watcher:127.0.0.1:62978 got event WatchedEvent state:SyncConnected type:None path:null path:null type:None
[junit4:junit4]   2> 10226 T554 oascc.ConnectionManager.waitForConnected Client is connected to ZooKeeper
[junit4:junit4]   2> 10227 T559 oazs.PrepRequestProcessor.pRequest2Txn Processed session termination for sessionid: 0x13c94cb05fe0009
[junit4:junit4]   2> 10241 T623 oaz.ClientCnxn$EventThread.run EventThread shut down
[junit4:junit4]   2> 10241 T556 oazs.NIOServerCnxn.closeSock Closed socket connection for client /140.211.11.196:63011 which had sessionid 0x13c94cb05fe0009
[junit4:junit4]   2> 10241 T554 oaz.ZooKeeper.close Session: 0x13c94cb05fe0009 closed
[junit4:junit4]   2> 10241 T554 oascsi.HttpClientUtil.createClient Creating new http client, config:maxConnections=500&maxConnectionsPerHost=16&socketTimeout=60000&connTimeout=15000
[junit4:junit4]   2> 10250 T554 oaz.ZooKeeper.<init> Initiating client connection, connectString=127.0.0.1:62978/solr sessionTimeout=30000 watcher=org.apache.solr.common.cloud.ConnectionManager@7d77db66
[junit4:junit4]   2> 10251 T554 oascc.ConnectionManager.waitForConnected Waiting for client to connect to ZooKeeper
[junit4:junit4]   2> 10251 T624 oaz.ClientCnxn$SendThread.logStartConnect Opening socket connection to server localhost/127.0.0.1:62978. Will not attempt to authenticate using SASL (access denied ("javax.security.auth.AuthPermission" "getLoginConfiguration"))
[junit4:junit4]   2> 10252 T624 oaz.ClientCnxn$SendThread.primeConnection Socket connection established to localhost/127.0.0.1:62978, initiating session
[junit4:junit4]   2> 10252 T556 oazs.NIOServerCnxnFactory.run Accepted socket connection from /140.211.11.196:63012
[junit4:junit4]   2> 10252 T556 oazs.ZooKeeperServer.processConnectRequest Client attempting to establish new session at /140.211.11.196:63012
[junit4:junit4]   2> 10254 T558 oazs.ZooKeeperServer.finishSessionInit Established session 0x13c94cb05fe000a with negotiated timeout 20000 for client /140.211.11.196:63012
[junit4:junit4]   2> 10254 T624 oaz.ClientCnxn$SendThread.onConnected Session establishment complete on server localhost/127.0.0.1:62978, sessionid = 0x13c94cb05fe000a, negotiated timeout = 20000
[junit4:junit4]   2> 10254 T625 oascc.ConnectionManager.process Watcher org.apache.solr.common.cloud.ConnectionManager@7d77db66 name:ZooKeeperConnection Watcher:127.0.0.1:62978/solr got event WatchedEvent state:SyncConnected type:None path:null path:null type:None
[junit4:junit4]   2> 10254 T554 oascc.ConnectionManager.waitForConnected Client is connected to ZooKeeper
[junit4:junit4]   2> 10256 T559 oazs.PrepRequestProcessor.pRequest Got user-level KeeperException when processing sessionid:0x13c94cb05fe000a type:create cxid:0x1 zxid:0x8d txntype:-1 reqpath:n/a Error Path:/solr/overseer Error:KeeperErrorCode = NodeExists for /solr/overseer
[junit4:junit4]   2> 10257 T559 oazs.PrepRequestProcessor.pRequest Got user-level KeeperException when processing sessionid:0x13c94cb05fe000a type:create cxid:0x2 zxid:0x8e txntype:-1 reqpath:n/a Error Path:/solr/overseer Error:KeeperErrorCode = NodeExists for /solr/overseer
[junit4:junit4]   2> 10265 T554 oasc.ZkController.createEphemeralLiveNode Register node as live in ZooKeeper:/live_nodes/127.0.0.1:63010_
[junit4:junit4]   2> 10266 T559 oazs.PrepRequestProcessor.pRequest Got user-level KeeperException when processing sessionid:0x13c94cb05fe000a type:delete cxid:0x4 zxid:0x8f txntype:-1 reqpath:n/a Error Path:/solr/live_nodes/127.0.0.1:63010_ Error:KeeperErrorCode = NoNode for /solr/live_nodes/127.0.0.1:63010_
[junit4:junit4]   2> 10267 T554 oascc.SolrZkClient.makePath makePath: /live_nodes/127.0.0.1:63010_
[junit4:junit4]   2> 10269 T595 oascc.ZkStateReader$2.process A cluster state change: WatchedEvent state:SyncConnected type:NodeChildrenChanged path:/live_nodes, has occurred - updating... (live nodes size: 3)
[junit4:junit4]   2> 10269 T576 oascc.ZkStateReader$2.process A cluster state change: WatchedEvent state:SyncConnected type:NodeChildrenChanged path:/live_nodes, has occurred - updating... (live nodes size: 3)
[junit4:junit4]   2> 10269 T610 oascc.ZkStateReader$2.process A cluster state change: WatchedEvent state:SyncConnected type:NodeChildrenChanged path:/live_nodes, has occurred - updating... (live nodes size: 3)
[junit4:junit4]   2> 10270 T582 oascc.ZkStateReader$3.process Updating live nodes... (4)
[junit4:junit4]   2> 10270 T582 oascc.ZkStateReader$2.process A cluster state change: WatchedEvent state:SyncConnected type:NodeChildrenChanged path:/live_nodes, has occurred - updating... (live nodes size: 4)
[junit4:junit4]   2> 10277 T595 oascc.ZkStateReader$3.process Updating live nodes... (4)
[junit4:junit4]   2> 10277 T576 oascc.ZkStateReader$3.process Updating live nodes... (4)
[junit4:junit4]   2> 10277 T610 oascc.ZkStateReader$3.process Updating live nodes... (4)
[junit4:junit4]   2> 10278 T554 oascc.ZkStateReader.createClusterStateWatchersAndUpdate Updating cluster state from ZooKeeper... 
[junit4:junit4]   2> 10284 T626 oasc.CoreContainer.create Creating SolrCore 'collection1' using instanceDir: /usr/home/hudson/hudson-slave/workspace/Lucene-Solr-Tests-4.x-java7/solr/build/solr-core/test/J0/./org.apache.solr.cloud.BasicDistributedZkTest-jetty3-1359706008837/collection1
[junit4:junit4]   2> 10284 T626 oasc.ZkController.createCollectionZkNode Check for collection zkNode:collection1
[junit4:junit4]   2> 10285 T626 oasc.ZkController.createCollectionZkNode Collection zkNode exists
[junit4:junit4]   2> 10285 T626 oasc.ZkController.readConfigName Load collection config from:/collections/collection1
[junit4:junit4]   2> 10287 T626 oasc.SolrResourceLoader.<init> new SolrResourceLoader for directory: '/usr/home/hudson/hudson-slave/workspace/Lucene-Solr-Tests-4.x-java7/solr/build/solr-core/test/J0/./org.apache.solr.cloud.BasicDistributedZkTest-jetty3-1359706008837/collection1/'
[junit4:junit4]   2> 10288 T626 oasc.SolrResourceLoader.replaceClassLoader Adding 'file:/usr/home/hudson/hudson-slave/workspace/Lucene-Solr-Tests-4.x-java7/solr/build/solr-core/test/J0/org.apache.solr.cloud.BasicDistributedZkTest-jetty3-1359706008837/collection1/lib/README' to classloader
[junit4:junit4]   2> 10289 T626 oasc.SolrResourceLoader.replaceClassLoader Adding 'file:/usr/home/hudson/hudson-slave/workspace/Lucene-Solr-Tests-4.x-java7/solr/build/solr-core/test/J0/org.apache.solr.cloud.BasicDistributedZkTest-jetty3-1359706008837/collection1/lib/classes/' to classloader
[junit4:junit4]   2> 10341 T626 oasc.SolrConfig.<init> Using Lucene MatchVersion: LUCENE_42
[junit4:junit4]   2> 10410 T626 oasc.SolrConfig.<init> Loaded SolrConfig: solrconfig.xml
[junit4:junit4]   2> 10511 T626 oass.IndexSchema.readSchema Reading Solr Schema
[junit4:junit4]   2> 10517 T626 oass.IndexSchema.readSchema Schema name=test
[junit4:junit4]   2> 11130 T626 oass.OpenExchangeRatesOrgProvider.init Initialized with rates=open-exchange-rates.json, refreshInterval=1440.
[junit4:junit4]   2> 11142 T626 oass.IndexSchema.readSchema default search field in schema is text
[junit4:junit4]   2> 11146 T626 oass.IndexSchema.readSchema unique key field: id
[junit4:junit4]   2> 11168 T626 oass.FileExchangeRateProvider.reload Reloading exchange rates from file currency.xml
[junit4:junit4]   2> 11176 T626 oass.FileExchangeRateProvider.reload Reloading exchange rates from file currency.xml
[junit4:junit4]   2> 11183 T626 oass.OpenExchangeRatesOrgProvider.reload Reloading exchange rates from open-exchange-rates.json
[junit4:junit4]   2> 11185 T626 oass.OpenExchangeRatesOrgProvider.reload Reloading exchange rates from open-exchange-rates.json
[junit4:junit4]   2> 11187 T626 oasc.SolrCore.<init> [collection1] Opening new SolrCore at /usr/home/hudson/hudson-slave/workspace/Lucene-Solr-Tests-4.x-java7/solr/build/solr-core/test/J0/./org.apache.solr.cloud.BasicDistributedZkTest-jetty3-1359706008837/collection1/, dataDir=./org.apache.solr.cloud.BasicDistributedZkTest-1359705998839/jetty3/
[junit4:junit4]   2> 11187 T626 oasc.JmxMonitoredMap.<init> JMX monitoring is enabled. Adding Solr mbeans to JMX Server: com.sun.jmx.mbeanserver.JmxMBeanServer@76d26a
[junit4:junit4]   2> 11188 T626 oasc.SolrCore.initDirectoryFactory solr.NRTCachingDirectoryFactory
[junit4:junit4]   2> 11189 T626 oasc.CachingDirectoryFactory.get return new directory for /usr/home/hudson/hudson-slave/workspace/Lucene-Solr-Tests-4.x-java7/solr/build/solr-core/test/J0/./org.apache.solr.cloud.BasicDistributedZkTest-1359705998839/jetty3 forceNew:false
[junit4:junit4]   2> 11190 T626 oasc.CachingDirectoryFactory.close Releasing directory:/usr/home/hudson/hudson-slave/workspace/Lucene-Solr-Tests-4.x-java7/solr/build/solr-core/test/J0/./org.apache.solr.cloud.BasicDistributedZkTest-1359705998839/jetty3
[junit4:junit4]   2> 11190 T626 oasc.SolrCore.getNewIndexDir New index directory detected: old=null new=./org.apache.solr.cloud.BasicDistributedZkTest-1359705998839/jetty3/index/
[junit4:junit4]   2> 11191 T626 oasc.SolrCore.initIndex WARNING [collection1] Solr index directory './org.apache.solr.cloud.BasicDistributedZkTest-1359705998839/jetty3/index' doesn't exist. Creating new index...
[junit4:junit4]   2> 11193 T626 oasc.CachingDirectoryFactory.get return new directory for /usr/home/hudson/hudson-slave/workspace/Lucene-Solr-Tests-4.x-java7/solr/build/solr-core/test/J0/./org.apache.solr.cloud.BasicDistributedZkTest-1359705998839/jetty3/index forceNew:false
[junit4:junit4]   2> 11201 T626 oasc.SolrDeletionPolicy.onCommit SolrDeletionPolicy.onCommit: commits:num=1
[junit4:junit4]   2> 		commit{dir=RateLimitedDirectoryWrapper(NRTCachingDirectory(org.apache.lucene.store.NIOFSDirectory@/usr/home/hudson/hudson-slave/workspace/Lucene-Solr-Tests-4.x-java7/solr/build/solr-core/test/J0/org.apache.solr.cloud.BasicDistributedZkTest-1359705998839/jetty3/index lockFactory=org.apache.lucene.store.NativeFSLockFactory@2fd09f81; maxCacheMB=48.0 maxMergeSizeMB=4.0)),segFN=segments_1,generation=1,filenames=[segments_1]
[junit4:junit4]   2> 11202 T626 oasc.SolrDeletionPolicy.updateCommits newest commit = 1[segments_1]
[junit4:junit4]   2> 11203 T626 oasc.CachingDirectoryFactory.close Releasing directory:/usr/home/hudson/hudson-slave/workspace/Lucene-Solr-Tests-4.x-java7/solr/build/solr-core/test/J0/./org.apache.solr.cloud.BasicDistributedZkTest-1359705998839/jetty3/index
[junit4:junit4]   2> 11204 T626 oasc.SolrCore.initWriters created xml: solr.XMLResponseWriter
[junit4:junit4]   2> 11207 T626 oasup.UpdateRequestProcessorChain.init inserting DistributedUpdateProcessorFactory into updateRequestProcessorChain "dedupe"
[junit4:junit4]   2> 11208 T626 oasup.UpdateRequestProcessorChain.init inserting DistributedUpdateProcessorFactory into updateRequestProcessorChain "dedupe-allfields"
[junit4:junit4]   2> 11208 T626 oasup.UpdateRequestProcessorChain.init inserting DistributedUpdateProcessorFactory into updateRequestProcessorChain "stored_sig"
[junit4:junit4]   2> 11209 T626 oasup.UpdateRequestProcessorChain.init inserting DistributedUpdateProcessorFactory into updateRequestProcessorChain "uniq-fields"
[junit4:junit4]   2> 11210 T626 oasup.UpdateRequestProcessorChain.init inserting DistributedUpdateProcessorFactory into updateRequestProcessorChain "distrib-dup-test-chain-implicit"
[junit4:junit4]   2> 11210 T626 oasc.RequestHandlers.initHandlersFromConfig adding lazy requestHandler: solr.ReplicationHandler
[junit4:junit4]   2> 11211 T626 oasc.RequestHandlers.initHandlersFromConfig created /replication: solr.ReplicationHandler
[junit4:junit4]   2> 11212 T626 oasc.RequestHandlers.initHandlersFromConfig created standard: solr.StandardRequestHandler
[junit4:junit4]   2> 11213 T626 oasc.RequestHandlers.initHandlersFromConfig created /get: solr.RealTimeGetHandler
[junit4:junit4]   2> 11213 T626 oasc.RequestHandlers.initHandlersFromConfig created dismax: solr.SearchHandler
[junit4:junit4]   2> 11214 T626 oasc.RequestHandlers.initHandlersFromConfig created mock: org.apache.solr.core.MockQuerySenderListenerReqHandler
[junit4:junit4]   2> 11215 T626 oasc.RequestHandlers.initHandlersFromConfig created /admin/: org.apache.solr.handler.admin.AdminHandlers
[junit4:junit4]   2> 11216 T626 oasc.RequestHandlers.initHandlersFromConfig created defaults: solr.StandardRequestHandler
[junit4:junit4]   2> 11216 T626 oasc.RequestHandlers.initHandlersFromConfig adding lazy requestHandler: solr.StandardRequestHandler
[junit4:junit4]   2> 11217 T626 oasc.RequestHandlers.initHandlersFromConfig created lazy: solr.StandardRequestHandler
[junit4:junit4]   2> 11218 T626 oasc.RequestHandlers.initHandlersFromConfig created /update: solr.UpdateRequestHandler
[junit4:junit4]   2> 11219 T626 oasc.RequestHandlers.initHandlersFromConfig created /terms: org.apache.solr.handler.component.SearchHandler
[junit4:junit4]   2> 11220 T626 oasc.RequestHandlers.initHandlersFromConfig created spellCheckCompRH: org.apache.solr.handler.component.SearchHandler
[junit4:junit4]   2> 11221 T626 oasc.RequestHandlers.initHandlersFromConfig created spellCheckCompRH_Direct: org.apache.solr.handler.component.SearchHandler
[junit4:junit4]   2> 11221 T626 oasc.RequestHandlers.initHandlersFromConfig created spellCheckWithWordbreak: org.apache.solr.handler.component.SearchHandler
[junit4:junit4]   2> 11222 T626 oasc.RequestHandlers.initHandlersFromConfig created spellCheckWithWordbreak_Direct: org.apache.solr.handler.component.SearchHandler
[junit4:junit4]   2> 11223 T626 oasc.RequestHandlers.initHandlersFromConfig created spellCheckCompRH1: org.apache.solr.handler.component.SearchHandler
[junit4:junit4]   2> 11224 T626 oasc.RequestHandlers.initHandlersFromConfig created mltrh: org.apache.solr.handler.component.SearchHandler
[junit4:junit4]   2> 11225 T626 oasc.RequestHandlers.initHandlersFromConfig created tvrh: org.apache.solr.handler.component.SearchHandler
[junit4:junit4]   2> 11225 T626 oasc.RequestHandlers.initHandlersFromConfig created /mlt: solr.MoreLikeThisHandler
[junit4:junit4]   2> 11226 T626 oasc.RequestHandlers.initHandlersFromConfig created /debug/dump: solr.DumpRequestHandler
[junit4:junit4]   2> 11244 T626 oashl.XMLLoader.init xsltCacheLifetimeSeconds=60
[junit4:junit4]   2> 11251 T626 oasc.SolrCore.initDeprecatedSupport WARNING solrconfig.xml uses deprecated <admin/gettableFiles>, Please update your config to use the ShowFileRequestHandler.
[junit4:junit4]   2> 11252 T626 oasc.SolrCore.initDeprecatedSupport WARNING adding ShowFileRequestHandler with hidden files: [SCHEMA.XML, OLD_SYNONYMS.TXT, STOPWORDS.TXT, PROTWORDS.TXT, OPEN-EXCHANGE-RATES.JSON, SYNONYMS.TXT, CURRENCY.XML, MAPPING-ISOLATIN1ACCENT.TXT]
[junit4:junit4]   2> 11256 T626 oasc.CachingDirectoryFactory.close Releasing directory:/usr/home/hudson/hudson-slave/workspace/Lucene-Solr-Tests-4.x-java7/solr/build/solr-core/test/J0/./org.apache.solr.cloud.BasicDistributedZkTest-1359705998839/jetty3
[junit4:junit4]   2> 11259 T626 oass.SolrIndexSearcher.<init> Opening Searcher@6a3d610d main
[junit4:junit4]   2> 11260 T626 oasu.CommitTracker.<init> Hard AutoCommit: disabled
[junit4:junit4]   2> 11260 T626 oasu.CommitTracker.<init> Soft AutoCommit: disabled
[junit4:junit4]   2> 11261 T626 oashc.SpellCheckComponent.inform Initializing spell checkers
[junit4:junit4]   2> 11281 T626 oass.DirectSolrSpellChecker.init init: {name=direct,classname=DirectSolrSpellChecker,field=lowerfilt,minQueryLength=3}
[junit4:junit4]   2> 11332 T627 oasc.SolrCore.registerSearcher [collection1] Registered new searcher Searcher@6a3d610d main{StandardDirectoryReader(segments_1:1)}
[junit4:junit4]   2> 11339 T626 oasc.ZkController.publish publishing core=collection1 state=down
[junit4:junit4]   2> 11339 T626 oasc.ZkController.publish numShards not found on descriptor - reading it from system property
[junit4:junit4]   2> 11490 T577 oascc.ZkStateReader.updateClusterState Updating cloud state from ZooKeeper... 
[junit4:junit4]   2> 11491 T577 oasc.Overseer$ClusterStateUpdater.updateState Update state numShards=2 message={
[junit4:junit4]   2> 	  "operation":"state",
[junit4:junit4]   2> 	  "numShards":"2",
[junit4:junit4]   2> 	  "shard":"shard2",
[junit4:junit4]   2> 	  "roles":null,
[junit4:junit4]   2> 	  "state":"active",
[junit4:junit4]   2> 	  "core":"collection1",
[junit4:junit4]   2> 	  "collection":"collection1",
[junit4:junit4]   2> 	  "node_name":"127.0.0.1:63007_",
[junit4:junit4]   2> 	  "base_url":"http://127.0.0.1:63007"}
[junit4:junit4]   2> 11530 T577 oasc.Overseer$ClusterStateUpdater.updateState Update state numShards=2 message={
[junit4:junit4]   2> 	  "operation":"state",
[junit4:junit4]   2> 	  "numShards":"2",
[junit4:junit4]   2> 	  "shard":null,
[junit4:junit4]   2> 	  "roles":null,
[junit4:junit4]   2> 	  "state":"down",
[junit4:junit4]   2> 	  "core":"collection1",
[junit4:junit4]   2> 	  "collection":"collection1",
[junit4:junit4]   2> 	  "node_name":"127.0.0.1:63010_",
[junit4:junit4]   2> 	  "base_url":"http://127.0.0.1:63010"}
[junit4:junit4]   2> 11531 T577 oasc.Overseer$ClusterStateUpdater.updateState Collection already exists with numShards=2
[junit4:junit4]   2> 11531 T577 oasc.Overseer$ClusterStateUpdater.updateState Assigning new node to shard shard=shard1
[junit4:junit4]   2> 11548 T625 oascc.ZkStateReader$2.process A cluster state change: WatchedEvent state:SyncConnected type:NodeDataChanged path:/clusterstate.json, has occurred - updating... (live nodes size: 4)
[junit4:junit4]   2> 11548 T576 oascc.ZkStateReader$2.process A cluster state change: WatchedEvent state:SyncConnected type:NodeDataChanged path:/clusterstate.json, has occurred - updating... (live nodes size: 4)
[junit4:junit4]   2> 11548 T610 oascc.ZkStateReader$2.process A cluster state change: WatchedEvent state:SyncConnected type:NodeDataChanged path:/clusterstate.json, has occurred - updating... (live nodes size: 4)
[junit4:junit4]   2> 11548 T582 oascc.ZkStateReader$2.process A cluster state change: WatchedEvent state:SyncConnected type:NodeDataChanged path:/clusterstate.json, has occurred - updating... (live nodes size: 4)
[junit4:junit4]   2> 11548 T595 oascc.ZkStateReader$2.process A cluster state change: WatchedEvent state:SyncConnected type:NodeDataChanged path:/clusterstate.json, has occurred - updating... (live nodes size: 4)
[junit4:junit4]   2> 12342 T626 oasc.CoreContainer.registerCore registering core: collection1
[junit4:junit4]   2> 12342 T626 oasc.ZkController.register Register replica - core:collection1 address:http://127.0.0.1:63010 collection:collection1 shard:shard1
[junit4:junit4]   2> 12372 T626 oasc.ZkController.register We are http://127.0.0.1:63010/collection1/ and leader is http://127.0.0.1:62992/collection1/
[junit4:junit4]   2> 12372 T626 oasc.ZkController.register No LogReplay needed for core=collection1 baseURL=http://127.0.0.1:63010
[junit4:junit4]   2> 12372 T626 oasc.ZkController.checkRecovery Core needs to recover:collection1
[junit4:junit4]   2> 12373 T626 oasu.DefaultSolrCoreState.doRecovery Running recovery - first canceling any ongoing recovery
[junit4:junit4]   2> ASYNC  NEW_CORE C74 name=collection1 org.apache.solr.core.SolrCore@366e2b8e url=http://127.0.0.1:63010/collection1 node=127.0.0.1:63010_ C74_STATE=coll:collection1 core:collection1 props:{shard=null, roles=null, state=down, core=collection1, collection=collection1, node_name=127.0.0.1:63010_, base_url=http://127.0.0.1:63010}
[junit4:junit4]   2> 12380 T628 C74 P63010 oasc.RecoveryStrategy.run Starting recovery process.  core=collection1 recoveringAfterStartup=true
[junit4:junit4]   2> 12380 T626 oascc.ZkStateReader.updateClusterState Updating cloud state from ZooKeeper... 
[junit4:junit4]   2> 12381 T628 C74 P63010 oasc.RecoveryStrategy.doRecovery ###### startupVersions=[]
[junit4:junit4]   2> 12381 T628 C74 P63010 oasc.ZkController.publish publishing core=collection1 state=recovering
[junit4:junit4]   2> 12381 T628 C74 P63010 oasc.ZkController.publish numShards not found on descriptor - reading it from system property
[junit4:junit4]   2> 12382 T554 oass.SolrDispatchFilter.init user.dir=/usr/home/hudson/hudson-slave/workspace/Lucene-Solr-Tests-4.x-java7/solr/build/solr-core/test/J0
[junit4:junit4]   2> 12382 T554 oass.SolrDispatchFilter.init SolrDispatchFilter.init() done
[junit4:junit4]   2> 12383 T554 oascsi.HttpClientUtil.createClient Creating new http client, config:maxConnections=128&maxConnectionsPerHost=32&followRedirects=false
[junit4:junit4]   2> 12383 T628 C74 P63010 oascsi.HttpClientUtil.createClient Creating new http client, config:maxConnections=128&maxConnectionsPerHost=32&followRedirects=false
[junit4:junit4]   2> 12563 T554 oejs.Server.doStart jetty-8.1.8.v20121106
[junit4:junit4]   2> 12566 T554 oejs.AbstractConnector.doStart Started SocketConnector@127.0.0.1:63015
[junit4:junit4]   2> 12566 T554 oass.SolrDispatchFilter.init SolrDispatchFilter.init()
[junit4:junit4]   2> 12567 T554 oasc.SolrResourceLoader.locateSolrHome JNDI not configured for solr (NoInitialContextEx)
[junit4:junit4]   2> 12567 T554 oasc.SolrResourceLoader.locateSolrHome using system property solr.solr.home: /usr/home/hudson/hudson-slave/workspace/Lucene-Solr-Tests-4.x-java7/solr/build/solr-core/test/J0/./org.apache.solr.cloud.BasicDistributedZkTest-jetty4-1359706011228
[junit4:junit4]   2> 12567 T554 oasc.CoreContainer$Initializer.initialize looking for solr.xml: /usr/home/hudson/hudson-slave/workspace/Lucene-Solr-Tests-4.x-java7/solr/build/solr-core/test/J0/./org.apache.solr.cloud.BasicDistributedZkTest-jetty4-1359706011228/solr.xml
[junit4:junit4]   2> 12568 T554 oasc.CoreContainer.<init> New CoreContainer 1317118115
[junit4:junit4]   2> 12568 T554 oasc.CoreContainer.load Loading CoreContainer using Solr Home: '/usr/home/hudson/hudson-slave/workspace/Lucene-Solr-Tests-4.x-java7/solr/build/solr-core/test/J0/./org.apache.solr.cloud.BasicDistributedZkTest-jetty4-1359706011228/'
[junit4:junit4]   2> 12568 T554 oasc.SolrResourceLoader.<init> new SolrResourceLoader for directory: '/usr/home/hudson/hudson-slave/workspace/Lucene-Solr-Tests-4.x-java7/solr/build/solr-core/test/J0/./org.apache.solr.cloud.BasicDistributedZkTest-jetty4-1359706011228/'
[junit4:junit4]   2> 12605 T554 oashc.HttpShardHandlerFactory.getParameter Setting socketTimeout to: 60000
[junit4:junit4]   2> 12605 T554 oashc.HttpShardHandlerFactory.getParameter Setting urlScheme to: http://
[junit4:junit4]   2> 12606 T554 oashc.HttpShardHandlerFactory.getParameter Setting connTimeout to: 15000
[junit4:junit4]   2> 12606 T554 oashc.HttpShardHandlerFactory.getParameter Setting maxConnectionsPerHost to: 20
[junit4:junit4]   2> 12606 T554 oashc.HttpShardHandlerFactory.getParameter Setting corePoolSize to: 0
[junit4:junit4]   2> 12606 T554 oashc.HttpShardHandlerFactory.getParameter Setting maximumPoolSize to: 2147483647
[junit4:junit4]   2> 12607 T554 oashc.HttpShardHandlerFactory.getParameter Setting maxThreadIdleTime to: 5
[junit4:junit4]   2> 12607 T554 oashc.HttpShardHandlerFactory.getParameter Setting sizeOfQueue to: -1
[junit4:junit4]   2> 12607 T554 oashc.HttpShardHandlerFactory.getParameter Setting fairnessPolicy to: false
[junit4:junit4]   2> 12608 T554 oascsi.HttpClientUtil.createClient Creating new http client, config:maxConnectionsPerHost=20&maxConnections=10000&socketTimeout=60000&connTimeout=15000&retry=false
[junit4:junit4]   2> 12623 T554 oasc.CoreContainer.load Registering Log Listener
[junit4:junit4]   2> 12636 T554 oasc.CoreContainer.initZooKeeper Zookeeper client=127.0.0.1:62978/solr
[junit4:junit4]   2> 12637 T554 oasc.ZkController.checkChrootPath zkHost includes chroot
[junit4:junit4]   2> 12637 T554 oaz.ZooKeeper.<init> Initiating client connection, connectString=127.0.0.1:62978 sessionTimeout=60000 watcher=org.apache.solr.common.cloud.ConnectionManager@4173c4ef
[junit4:junit4]   2> 12638 T554 oascc.ConnectionManager.waitForConnected Waiting for client to connect to ZooKeeper
[junit4:junit4]   2> 12638 T638 oaz.ClientCnxn$SendThread.logStartConnect Opening socket connection to server localhost/127.0.0.1:62978. Will not attempt to authenticate using SASL (access denied ("javax.security.auth.AuthPermission" "getLoginConfiguration"))
[junit4:junit4]   2> 12639 T638 oaz.ClientCnxn$SendThread.primeConnection Socket connection established to localhost/127.0.0.1:62978, initiating session
[junit4:junit4]   2> 12639 T556 oazs.NIOServerCnxnFactory.run Accepted socket connection from /140.211.11.196:63016
[junit4:junit4]   2> 12640 T556 oazs.ZooKeeperServer.processConnectRequest Client attempting to establish new session at /140.211.11.196:63016
[junit4:junit4]   2> 12642 T558 oazs.ZooKeeperServer.finishSessionInit Established session 0x13c94cb05fe000b with negotiated timeout 20000 for client /140.211.11.196:63016
[junit4:junit4]   2> 12643 T638 oaz.ClientCnxn$SendThread.onConnected Session establishment complete on server localhost/127.0.0.1:62978, sessionid = 0x13c94cb05fe000b, negotiated timeout = 20000
[junit4:junit4]   2> 12643 T639 oascc.ConnectionManager.process Watcher org.apache.solr.common.cloud.ConnectionManager@4173c4ef name:ZooKeeperConnection Watcher:127.0.0.1:62978 got event WatchedEvent state:SyncConnected type:None path:null path:null type:None
[junit4:junit4]   2> 12643 T554 oascc.ConnectionManager.waitForConnected Client is connected to ZooKeeper
[junit4:junit4]   2> 12645 T559 oazs.PrepRequestProcessor.pRequest2Txn Processed session termination for sessionid: 0x13c94cb05fe000b
[junit4:junit4]   2> 12650 T639 oaz.ClientCnxn$EventThread.run EventThread shut down
[junit4:junit4]   2> 12650 T556 oazs.NIOServerCnxn.closeSock Closed socket connection for client /140.211.11.196:63016 which had sessionid 0x13c94cb05fe000b
[junit4:junit4]   2> 12650 T554 oaz.ZooKeeper.close Session: 0x13c94cb05fe000b closed
[junit4:junit4]   2> 12651 T554 oascsi.HttpClientUtil.createClient Creating new http client, config:maxConnections=500&maxConnectionsPerHost=16&socketTimeout=60000&connTimeout=15000
[junit4:junit4]   2> 12660 T554 oaz.ZooKeeper.<init> Initiating client connection, connectString=127.0.0.1:62978/solr sessionTimeout=30000 watcher=org.apache.solr.common.cloud.ConnectionManager@25416990
[junit4:junit4]   2> 12661 T554 oascc.ConnectionManager.waitForConnected Waiting for client to connect to ZooKeeper
[junit4:junit4]   2> 12662 T640 oaz.ClientCnxn$SendThread.logStartConnect Opening socket connection to server localhost/127.0.0.1:62978. Will not attempt to authenticate using SASL (access denied ("javax.security.auth.AuthPermission" "getLoginConfiguration"))
[junit4:junit4]   2> 12662 T640 oaz.ClientCnxn$SendThread.primeConnection Socket connection established to localhost/127.0.0.1:62978, initiating session
[junit4:junit4]   2> 12662 T556 oazs.NIOServerCnxnFactory.run Accepted socket connection from /140.211.11.196:63017
[junit4:junit4]   2> 12663 T556 oazs.ZooKeeperServer.processConnectRequest Client attempting to establish new session at /140.211.11.196:63017
[junit4:junit4]   2> 12669 T558 oazs.ZooKeeperServer.finishSessionInit Established session 0x13c94cb05fe000c with negotiated timeout 20000 for client /140.211.11.196:63017
[junit4:junit4]   2> 12669 T640 oaz.ClientCnxn$SendThread.onConnected Session establishment complete on server localhost/127.0.0.1:62978, sessionid = 0x13c94cb05fe000c, negotiated timeout = 20000
[junit4:junit4]   2> 12670 T641 oascc.ConnectionManager.process Watcher org.apache.solr.common.cloud.ConnectionManager@25416990 name:ZooKeeperConnection Watcher:127.0.0.1:62978/solr got event WatchedEvent state:SyncConnected type:None path:null path:null type:None
[junit4:junit4]   2> 12670 T554 oascc.ConnectionManager.waitForConnected Client is connected to ZooKeeper
[junit4:junit4]   2> 12671 T559 oazs.PrepRequestProcessor.pRequest Got user-level KeeperException when processing sessionid:0x13c94cb05fe000c type:create cxid:0x1 zxid:0x9f txntype:-1 reqpath:n/a Error Path:/solr/overseer Error:KeeperErrorCode = NodeExists for /solr/overseer
[junit4:junit4]   2> 12677 T559 oazs.PrepRequestProcessor.pRequest Got user-level KeeperException when processing sessionid:0x13c94cb05fe000c type:create cxid:0x2 zxid:0xa0 txntype:-1 reqpath:n/a Error Path:/solr/overseer Error:KeeperErrorCode = NodeExists for /solr/overseer
[junit4:junit4]   2> 12687 T554 oasc.ZkController.createEphemeralLiveNode Register node as live in ZooKeeper:/live_nodes/127.0.0.1:63015_
[junit4:junit4]   2> 12688 T559 oazs.PrepRequestProcessor.pRequest Got user-level KeeperException when processing sessionid:0x13c94cb05fe000c type:delete cxid:0x4 zxid:0xa1 txntype:-1 reqpath:n/a Error Path:/solr/live_nodes/127.0.0.1:63015_ Error:KeeperErrorCode = NoNode for /solr/live_nodes/127.0.0.1:63015_
[junit4:junit4]   2> 12698 T554 oascc.SolrZkClient.makePath makePath: /live_nodes/127.0.0.1:63015_
[junit4:junit4]   2> 12701 T595 oascc.ZkStateReader$2.process A cluster state change: WatchedEvent state:SyncConnected type:NodeChildrenChanged path:/live_nodes, has occurred - updating... (live nodes size: 4)
[junit4:junit4]   2> 12701 T576 oascc.ZkStateReader$2.process A cluster state change: WatchedEvent state:SyncConnected type:NodeChildrenChanged path:/live_nodes, has occurred - updating... (live nodes size: 4)
[junit4:junit4]   2> 12701 T610 oascc.ZkStateReader$2.process A cluster state change: WatchedEvent state:SyncConnected type:NodeChildrenChanged path:/live_nodes, has occurred - updating... (live nodes size: 4)
[junit4:junit4]   2> 12702 T582 oascc.ZkStateReader$3.process Updating live nodes... (5)
[junit4:junit4]   2> 12702 T582 oascc.ZkStateReader$2.process A cluster state change: WatchedEvent state:SyncConnected type:NodeChildrenChanged path:/live_nodes, has occurred - updating... (live nodes size: 5)
[junit4:junit4]   2> 12702 T625 oascc.ZkStateReader$3.process Updating live nodes... (5)
[junit4:junit4]   2> 12702 T625 oascc.ZkStateReader$2.process A cluster state change: WatchedEvent state:SyncConnected type:NodeChildrenChanged path:/live_nodes, has occurred - updating... (live nodes size: 5)
[junit4:junit4]   2> 12704 T595 oascc.ZkStateReader$3.process Updating live nodes... (5)
[junit4:junit4]   2> 12704 T576 oascc.ZkStateReader$3.process Updating live nodes... (5)
[junit4:junit4]   2> 12704 T610 oascc.ZkStateReader$3.process Updating live nodes... (5)
[junit4:junit4]   2> 12707 T554 oascc.ZkStateReader.createClusterStateWatchersAndUpdate Updating cluster state from ZooKeeper... 
[junit4:junit4]   2> 12713 T642 oasc.CoreContainer.create Creating SolrCore 'collection1' using instanceDir: /usr/home/hudson/hudson-slave/workspace/Lucene-Solr-Tests-4.x-java7/solr/build/solr-core/test/J0/./org.apache.solr.cloud.BasicDistributedZkTest-jetty4-1359706011228/collection1
[junit4:junit4]   2> 12713 T642 oasc.ZkController.createCollectionZkNode Check for collection zkNode:collection1
[junit4:junit4]   2> 12714 T642 oasc.ZkController.createCollectionZkNode Collection zkNode exists
[junit4:junit4]   2> 12714 T642 oasc.ZkController.readConfigName Load collection config from:/collections/collection1
[junit4:junit4]   2> 12716 T642 oasc.SolrResourceLoader.<init> new SolrResourceLoader for directory: '/usr/home/hudson/hudson-slave/workspace/Lucene-Solr-Tests-4.x-java7/solr/build/solr-core/test/J0/./org.apache.solr.cloud.BasicDistributedZkTest-jetty4-1359706011228/collection1/'
[junit4:junit4]   2> 12717 T642 oasc.SolrResourceLoader.replaceClassLoader Adding 'file:/usr/home/hudson/hudson-slave/workspace/Lucene-Solr-Tests-4.x-java7/solr/build/solr-core/test/J0/org.apache.solr.cloud.BasicDistributedZkTest-jetty4-1359706011228/collection1/lib/classes/' to classloader
[junit4:junit4]   2> 12718 T642 oasc.SolrResourceLoader.replaceClassLoader Adding 'file:/usr/home/hudson/hudson-slave/workspace/Lucene-Solr-Tests-4.x-java7/solr/build/solr-core/test/J0/org.apache.solr.cloud.BasicDistributedZkTest-jetty4-1359706011228/collection1/lib/README' to classloader
[junit4:junit4]   2> 12770 T642 oasc.SolrConfig.<init> Using Lucene MatchVersion: LUCENE_42
[junit4:junit4]   2> 12852 T642 oasc.SolrConfig.<init> Loaded SolrConfig: solrconfig.xml
[junit4:junit4]   2> 12953 T642 oass.IndexSchema.readSchema Reading Solr Schema
[junit4:junit4]   2> 12959 T642 oass.IndexSchema.readSchema Schema name=test
[junit4:junit4]   2> 13063 T577 oascc.ZkStateReader.updateClusterState Updating cloud state from ZooKeeper... 
[junit4:junit4]   2> 13064 T577 oasc.Overseer$ClusterStateUpdater.updateState Update state numShards=2 message={
[junit4:junit4]   2> 	  "operation":"state",
[junit4:junit4]   2> 	  "numShards":"2",
[junit4:junit4]   2> 	  "shard":"shard1",
[junit4:junit4]   2> 	  "roles":null,
[junit4:junit4]   2> 	  "state":"recovering",
[junit4:junit4]   2> 	  "core":"collection1",
[junit4:junit4]   2> 	  "collection":"collection1",
[junit4:junit4]   2> 	  "node_name":"127.0.0.1:63010_",
[junit4:junit4]   2> 	  "base_url":"http://127.0.0.1:63010"}
[junit4:junit4]   2> 13078 T595 oascc.ZkStateReader$2.process A cluster state change: WatchedEvent state:SyncConnected type:NodeDataChanged path:/clusterstate.json, has occurred - updating... (live nodes size: 5)
[junit4:junit4]   2> 13078 T582 oascc.ZkStateReader$2.process A cluster state change: WatchedEvent state:SyncConnected type:NodeDataChanged path:/clusterstate.json, has occurred - updating... (live nodes size: 5)
[junit4:junit4]   2> 13078 T610 oascc.ZkStateReader$2.process A cluster state change: WatchedEvent state:SyncConnected type:NodeDataChanged path:/clusterstate.json, has occurred - updating... (live nodes size: 5)
[junit4:junit4]   2> 13078 T576 oascc.ZkStateReader$2.process A cluster state change: WatchedEvent state:SyncConnected type:NodeDataChanged path:/clusterstate.json, has occurred - updating... (live nodes size: 5)
[junit4:junit4]   2> 13078 T641 oascc.ZkStateReader$2.process A cluster state change: WatchedEvent state:SyncConnected type:NodeDataChanged path:/clusterstate.json, has occurred - updating... (live nodes size: 5)
[junit4:junit4]   2> 13078 T625 oascc.ZkStateReader$2.process A cluster state change: WatchedEvent state:SyncConnected type:NodeDataChanged path:/clusterstate.json, has occurred - updating... (live nodes size: 5)
[junit4:junit4]   2> 13579 T642 oass.OpenExchangeRatesOrgProvider.init Initialized with rates=open-exchange-rates.json, refreshInterval=1440.
[junit4:junit4]   2> 13591 T642 oass.IndexSchema.readSchema default search field in schema is text
[junit4:junit4]   2> 13595 T642 oass.IndexSchema.readSchema unique key field: id
[junit4:junit4]   2> 13614 T642 oass.FileExchangeRateProvider.reload Reloading exchange rates from file currency.xml
[junit4:junit4]   2> 13620 T642 oass.FileExchangeRateProvider.reload Reloading exchange rates from file currency.xml
[junit4:junit4]   2> 13625 T642 oass.OpenExchangeRatesOrgProvider.reload Reloading exchange rates from open-exchange-rates.json
[junit4:junit4]   2> 13627 T642 oass.OpenExchangeRatesOrgProvider.reload Reloading exchange rates from open-exchange-rates.json
[junit4:junit4]   2> 13628 T642 oasc.SolrCore.<init> [collection1] Opening new SolrCore at /usr/home/hudson/hudson-slave/workspace/Lucene-Solr-Tests-4.x-java7/solr/build/solr-core/test/J0/./org.apache.solr.cloud.BasicDistributedZkTest-jetty4-1359706011228/collection1/, dataDir=./org.apache.solr.cloud.BasicDistributedZkTest-1359705998839/jetty4/
[junit4:junit4]   2> 13629 T642 oasc.JmxMonitoredMap.<init> JMX monitoring is enabled. Adding Solr mbeans to JMX Server: com.sun.jmx.mbeanserver.JmxMBeanServer@76d26a
[junit4:junit4]   2> 13629 T642 oasc.SolrCore.initDirectoryFactory solr.NRTCachingDirectoryFactory
[junit4:junit4]   2> 13630 T642 oasc.CachingDirectoryFactory.get return new directory for /usr/home/hudson/hudson-slave/workspace/Lucene-Solr-Tests-4.x-java7/solr/build/solr-core/test/J0/./org.apache.solr.cloud.BasicDistributedZkTest-1359705998839/jetty4 forceNew:false
[junit4:junit4]   2> 13631 T642 oasc.CachingDirectoryFactory.close Releasing directory:/usr/home/hudson/hudson-slave/workspace/Lucene-Solr-Tests-4.x-java7/solr/build/solr-core/test/J0/./org.apache.solr.cloud.BasicDistributedZkTest-1359705998839/jetty4
[junit4:junit4]   2> 13631 T642 oasc.SolrCore.getNewIndexDir New index directory detected: old=null new=./org.apache.solr.cloud.BasicDistributedZkTest-1359705998839/jetty4/index/
[junit4:junit4]   2> 13632 T642 oasc.SolrCore.initIndex WARNING [collection1] Solr index directory './org.apache.solr.cloud.BasicDistributedZkTest-1359705998839/jetty4/index' doesn't exist. Creating new index...
[junit4:junit4]   2> 13633 T642 oasc.CachingDirectoryFactory.get return new directory for /usr/home/hudson/hudson-slave/workspace/Lucene-Solr-Tests-4.x-java7/solr/build/solr-core/test/J0/./org.apache.solr.cloud.BasicDistributedZkTest-1359705998839/jetty4/index forceNew:false
[junit4:junit4]   2> 13639 T642 oasc.SolrDeletionPolicy.onCommit SolrDeletionPolicy.onCommit: commits:num=1
[junit4:junit4]   2> 		commit{dir=RateLimitedDirectoryWrapper(NRTCachingDirectory(org.apache.lucene.store.NIOFSDirectory@/usr/home/hudson/hudson-slave/workspace/Lucene-Solr-Tests-4.x-java7/solr/build/solr-core/test/J0/org.apache.solr.cloud.BasicDistributedZkTest-1359705998839/jetty4/index lockFactory=org.apache.lucene.store.NativeFSLockFactory@45433f10; maxCacheMB=48.0 maxMergeSizeMB=4.0)),segFN=segments_1,generation=1,filenames=[segments_1]
[junit4:junit4]   2> 13640 T642 oasc.SolrDeletionPolicy.updateCommits newest commit = 1[segments_1]
[junit4:junit4]   2> 13641 T642 oasc.CachingDirectoryFactory.close Releasing directory:/usr/home/hudson/hudson-slave/workspace/Lucene-Solr-Tests-4.x-java7/solr/build/solr-core/test/J0/./org.apache.solr.cloud.BasicDistributedZkTest-1359705998839/jetty4/index
[junit4:junit4]   2> 13641 T642 oasc.SolrCore.initWriters created xml: solr.XMLResponseWriter
[junit4:junit4]   2> 13644 T642 oasup.UpdateRequestProcessorChain.init inserting DistributedUpdateProcessorFactory into updateRequestProcessorChain "dedupe"
[junit4:junit4]   2> 13644 T642 oasup.UpdateRequestProcessorChain.init inserting DistributedUpdateProcessorFactory into updateRequestProcessorChain "dedupe-allfields"
[junit4:junit4]   2> 13644 T642 oasup.UpdateRequestProcessorChain.init inserting DistributedUpdateProcessorFactory into updateRequestProcessorChain "stored_sig"
[junit4:junit4]   2> 13645 T642 oasup.UpdateRequestProcessorChain.init inserting DistributedUpdateProcessorFactory into updateRequestProcessorChain "uniq-fields"
[junit4:junit4]   2> 13645 T642 oasup.UpdateRequestProcessorChain.init inserting DistributedUpdateProcessorFactory into updateRequestProcessorChain "distrib-dup-test-chain-implicit"
[junit4:junit4]   2> 13645 T642 oasc.RequestHandlers.initHandlersFromConfig adding lazy requestHandler: solr.ReplicationHandler
[junit4:junit4]   2> 13646 T642 oasc.RequestHandlers.initHandlersFromConfig created /replication: solr.ReplicationHandler
[junit4:junit4]   2> 13647 T642 oasc.RequestHandlers.initHandlersFromConfig created standard: solr.StandardRequestHandler
[junit4:junit4]   2> 13647 T642 oasc.RequestHandlers.initHandlersFromConfig created /get: solr.RealTimeGetHandler
[junit4:junit4]   2> 13648 T642 oasc.RequestHandlers.initHandlersFromConfig created dismax: solr.SearchHandler
[junit4:junit4]   2> 13649 T642 oasc.RequestHandlers.initHandlersFromConfig created mock: org.apache.solr.core.MockQuerySenderListenerReqHandler
[junit4:junit4]   2> 13649 T642 oasc.RequestHandlers.initHandlersFromConfig created /admin/: org.apache.solr.handler.admin.AdminHandlers
[junit4:junit4]   2> 13650 T642 oasc.RequestHandlers.initHandlersFromConfig created defaults: solr.StandardRequestHandler
[junit4:junit4]   2> 13650 T642 oasc.RequestHandlers.initHandlersFromConfig adding lazy requestHandler: solr.StandardRequestHandler
[junit4:junit4]   2> 13650 T642 oasc.RequestHandlers.initHandlersFromConfig created lazy: solr.StandardRequestHandler
[junit4:junit4]   2> 13651 T642 oasc.RequestHandlers.initHandlersFromConfig created /update: solr.UpdateRequestHandler
[junit4:junit4]   2> 13652 T642 oasc.RequestHandlers.initHandlersFromConfig created /terms: org.apache.solr.handler.component.SearchHandler
[junit4:junit4]   2> 13652 T642 oasc.RequestHandlers.initHandlersFromConfig created spellCheckCompRH: org.apache.solr.handler.component.SearchHandler
[junit4:junit4]   2> 13653 T642 oasc.RequestHandlers.initHandlersFromConfig created spellCheckCompRH_Direct: org.apache.solr.handler.component.SearchHandler
[junit4:junit4]   2> 13653 T642 oasc.RequestHandlers.initHandlersFromConfig created spellCheckWithWordbreak: org.apache.solr.handler.component.SearchHandler
[junit4:junit4]   2> 13654 T642 oasc.RequestHandlers.initHandlersFromConfig created spellCheckWithWordbreak_Direct: org.apache.solr.handler.component.SearchHandler
[junit4:junit4]   2> 13655 T642 oasc.RequestHandlers.initHandlersFromConfig created spellCheckCompRH1: org.apache.solr.handler.component.SearchHandler
[junit4:junit4]   2> 13655 T642 oasc.RequestHandlers.initHandlersFromConfig created mltrh: org.apache.solr.handler.component.SearchHandler
[junit4:junit4]   2> 13656 T642 oasc.RequestHandlers.initHandlersFromConfig created tvrh: org.apache.solr.handler.component.SearchHandler
[junit4:junit4]   2> 13656 T642 oasc.RequestHandlers.initHandlersFromConfig created /mlt: solr.MoreLikeThisHandler
[junit4:junit4]   2> 13657 T642 oasc.RequestHandlers.initHandlersFromConfig created /debug/dump: solr.DumpRequestHandler
[junit4:junit4]   2> 13670 T642 oashl.XMLLoader.init xsltCacheLifetimeSeconds=60
[junit4:junit4]   2> 13674 T642 oasc.SolrCore.initDeprecatedSupport WARNING solrconfig.xml uses deprecated <admin/gettableFiles>, Please update your config to use the ShowFileRequestHandler.
[junit4:junit4]   2> 13676 T642 oasc.SolrCore.initDeprecatedSupport WARNING adding ShowFileRequestHandler with hidden files: [SCHEMA.XML, OLD_SYNONYMS.TXT, STOPWORDS.TXT, PROTWORDS.TXT, OPEN-EXCHANGE-RATES.JSON, SYNONYMS.TXT, CURRENCY.XML, MAPPING-ISOLATIN1ACCENT.TXT]
[junit4:junit4]   2> 13679 T642 oasc.CachingDirectoryFactory.close Releasing directory:/usr/home/hudson/hudson-slave/workspace/Lucene-Solr-Tests-4.x-java7/solr/build/solr-core/test/J0/./org.apache.solr.cloud.BasicDistributedZkTest-1359705998839/jetty4
[junit4:junit4]   2> 13680 T642 oass.SolrIndexSearcher.<init> Opening Searcher@139112a2 main
[junit4:junit4]   2> 13681 T642 oasu.CommitTracker.<init> Hard AutoCommit: disabled
[junit4:junit4]   2> 13682 T642 oasu.CommitTracker.<init> Soft AutoCommit: disabled
[junit4:junit4]   2> 13682 T642 oashc.SpellCheckComponent.inform Initializing spell checkers
[junit4:junit4]   2> 13718 T642 oass.DirectSolrSpellChecker.init init: {name=direct,classname=DirectSolrSpellChecker,field=lowerfilt,minQueryLength=3}
[junit4:junit4]   2> 13975 T643 oasc.SolrCore.registerSearcher [collection1] Registered new searcher Searcher@139112a2 main{StandardDirectoryReader(segments_1:1)}
[junit4:junit4]   2> 13983 T642 oasc.ZkController.publish publishing core=collection1 state=down
[junit4:junit4]   2> 13983 T642 oasc.ZkController.publish numShards not found on descriptor - reading it from system property
[junit4:junit4]   2> 14585 T577 oascc.ZkStateReader.updateClusterState Updating cloud state from ZooKeeper... 
[junit4:junit4]   2> 14586 T577 oasc.Overseer$ClusterStateUpdater.updateState Update state numShards=2 message={
[junit4:junit4]   2> 	  "operation":"state",
[junit4:junit4]   2> 	  "numShards":"2",
[junit4:junit4]   2> 	  "shard":null,
[junit4:junit4]   2> 	  "roles":null,
[junit4:junit4]   2> 	  "state":"down",
[junit4:junit4]   2> 	  "core":"collection1",
[junit4:junit4]   2> 	  "collection":"collection1",
[junit4:junit4]   2> 	  "node_name":"127.0.0.1:63015_",
[junit4:junit4]   2> 	  "base_url":"http://127.0.0.1:63015"}
[junit4:junit4]   2> 14587 T577 oasc.Overseer$ClusterStateUpdater.updateState Collection already exists with numShards=2
[junit4:junit4]   2> 14587 T577 oasc.Overseer$ClusterStateUpdater.updateState Assigning new node to shard shard=shard2
[junit4:junit4]   2> 14592 T595 oascc.ZkStateReader$2.process A cluster state change: WatchedEvent state:SyncConnected type:NodeDataChanged path:/clusterstate.json, has occurred - updating... (live nodes size: 5)
[junit4:junit4]   2> 14592 T610 oascc.ZkStateReader$2.process A cluster state change: WatchedEvent state:SyncConnected type:NodeDataChanged path:/clusterstate.json, has occurred - updating... (live nodes size: 5)
[junit4:junit4]   2> 14592 T625 oascc.ZkStateReader$2.process A cluster state change: WatchedEvent state:SyncConnected type:NodeDataChanged path:/clusterstate.json, has occurred - updating... (live nodes size: 5)
[junit4:junit4]   2> 14592 T576 oascc.ZkStateReader$2.process A cluster state change: WatchedEvent state:SyncConnected type:NodeDataChanged path:/clusterstate.json, has occurred - updating... (live nodes size: 5)
[junit4:junit4]   2> 14592 T641 oascc.ZkStateReader$2.process A cluster state change: WatchedEvent state:SyncConnected type:NodeDataChanged path:/clusterstate.json, has occurred - updating... (live nodes size: 5)
[junit4:junit4]   2> 14592 T582 oascc.ZkStateReader$2.process A cluster state change: WatchedEvent state:SyncConnected type:NodeDataChanged path:/clusterstate.json, has occurred - updating... (live nodes size: 5)
[junit4:junit4]   2> 14986 T642 oasc.CoreContainer.registerCore registering core: collection1
[junit4:junit4]   2> 14986 T642 oasc.ZkController.register Register replica - core:collection1 address:http://127.0.0.1:63015 collection:collection1 shard:shard2
[junit4:junit4]   2> 14990 T642 oasc.ZkController.register We are http://127.0.0.1:63015/collection1/ and leader is http://127.0.0.1:63007/collection1/
[junit4:junit4]   2> 14991 T642 oasc.ZkController.register No LogReplay needed for core=collection1 baseURL=http://127.0.0.1:63015
[junit4:junit4]   2> 14991 T642 oasc.ZkController.checkRecovery Core needs to recover:collection1
[junit4:junit4]   2> 14991 T642 oasu.DefaultSolrCoreState.doRecovery Running recovery - first canceling any ongoing recovery
[junit4:junit4]   2> ASYNC  NEW_CORE C75 name=collection1 org.apache.solr.core.SolrCore@119cf7d2 url=http://127.0.0.1:63015/collection1 node=127.0.0.1:63015_ C75_STATE=coll:collection1 core:collection1 props:{shard=null, roles=null, state=down, core=collection1, collection=collection1, node_name=127.0.0.1:63015_, base_url=http://127.0.0.1:63015}
[junit4:junit4]   2> 14992 T644 C75 P63015 oasc.RecoveryStrategy.run Starting recovery process.  core=collection1 recoveringAfterStartup=true
[junit4:junit4]   2> 14992 T644 C75 P63015 oasc.RecoveryStrategy.doRecovery ###### startupVersions=[]
[junit4:junit4]   2> 14992 T642 oascc.ZkStateReader.updateClusterState Updating cloud state from ZooKeeper... 
[junit4:junit4]   2> 14993 T644 C75 P63015 oasc.ZkController.publish publishing core=collection1 state=recovering
[junit4:junit4]   2> 14993 T644 C75 P63015 oasc.ZkController.publish numShards not found on descriptor - reading it from system property
[junit4:junit4]   2> 14994 T554 oass.SolrDispatchFilter.init user.dir=/usr/home/hudson/hudson-slave/workspace/Lucene-Solr-Tests-4.x-java7/solr/build/solr-core/test/J0
[junit4:junit4]   2> 14994 T554 oass.SolrDispatchFilter.init SolrDispatchFilter.init() done
[junit4:junit4]   2> 14995 T554 oascsi.HttpClientUtil.createClient Creating new http client, config:maxConnections=128&maxConnectionsPerHost=32&followRedirects=false
[junit4:junit4]   2> 15006 T644 C75 P63015 oascsi.HttpClientUtil.createClient Creating new http client, config:maxConnections=128&maxConnectionsPerHost=32&followRedirects=false
[junit4:junit4]   2> 15014 T554 oascc.ZkStateReader.updateClusterState Updating cloud state from ZooKeeper... 
[junit4:junit4]   2> 15016 T554 oasc.AbstractDistribZkTestBase.waitForRecoveriesToFinish Wait for recoveries to finish - collection: collection1 failOnTimeout:true timeout (sec):230
[junit4:junit4]   2> 15017 T554 oascc.ZkStateReader.updateClusterState Updating cloud state from ZooKeeper... 
[junit4:junit4]   2>  C74_STATE=coll:collection1 core:collection1 props:{shard=shard1, roles=null, state=recovering, core=collection1, collection=collection1, node_name=127.0.0.1:63010_, base_url=http://127.0.0.1:63010}
[junit4:junit4]   2> 15406 T628 C74 P63010 oasc.RecoveryStrategy.doRecovery Attempting to PeerSync from http://127.0.0.1:62992/collection1/ core=collection1 - recoveringAfterStartup=true
[junit4:junit4]   2> 15416 T628 C74 P63010 oascsi.HttpClientUtil.createClient Creating new http client, config:maxConnectionsPerHost=20&maxConnections=10000&connTimeout=30000&socketTimeout=30000&retry=false
[junit4:junit4]   2> 15436 T628 C74 P63010 oasu.PeerSync.sync PeerSync: core=collection1 url=http://127.0.0.1:63010 START replicas=[http://127.0.0.1:62992/collection1/] nUpdates=100
[junit4:junit4]   2> 15436 T628 C74 P63010 oasu.PeerSync.sync WARNING no frame of reference to tell of we've missed updates
[junit4:junit4]   2> 15437 T628 C74 P63010 oasc.RecoveryStrategy.doRecovery PeerSync Recovery was not successful - trying replication. core=collection1
[junit4:junit4]   2> 15437 T628 C74 P63010 oasc.RecoveryStrategy.doRecovery Starting Replication Recovery. core=collection1
[junit4:junit4]   2> 15437 T628 C74 P63010 oasc.RecoveryStrategy.doRecovery Begin buffering updates. core=collection1
[junit4:junit4]   2> 15438 T628 C74 P63010 oasu.UpdateLog.bufferUpdates Starting to buffer updates. FSUpdateLog{state=ACTIVE, tlog=null}
[junit4:junit4]   2> 15438 T628 C74 P63010 oasc.RecoveryStrategy.replicate Attempting to replicate from http://127.0.0.1:62992/collection1/. core=collection1
[junit4:junit4]   2> 15438 T628 C74 P63010 oascsi.HttpClientUtil.createClient Creating new http client, config:maxConnections=128&maxConnectionsPerHost=32&followRedirects=false
[junit4:junit4]   2> ASYNC  NEW_CORE C76 name=collection1 org.apache.solr.core.SolrCore@7b2ecde9 url=http://127.0.0.1:62992/collection1 node=127.0.0.1:62992_ C76_STATE=coll:collection1 core:collection1 props:{shard=shard1, roles=null, state=active, core=collection1, collection=collection1, node_name=127.0.0.1:62992_, base_url=http://127.0.0.1:62992, leader=true}
[junit4:junit4]   2> 15450 T586 C76 P62992 REQ /get {getVersions=100&distrib=false&wt=javabin&qt=/get&version=2} status=0 QTime=1 
[junit4:junit4]   2> 15471 T587 C76 P62992 oasu.DirectUpdateHandler2.commit start commit{,optimize=false,openSearcher=false,waitSearcher=true,expungeDeletes=false,softCommit=false}
[junit4:junit4]   2> 15472 T587 C76 P62992 oasc.CachingDirectoryFactory.close Releasing directory:/usr/home/hudson/hudson-slave/workspace/Lucene-Solr-Tests-4.x-java7/solr/build/solr-core/test/J0/./org.apache.solr.cloud.BasicDistributedZkTest-1359705998839/jetty1
[junit4:junit4]   2> 15476 T587 C76 P62992 oasc.SolrDeletionPolicy.onInit SolrDeletionPolicy.onInit: commits:num=1
[junit4:junit4]   2> 		commit{dir=RateLimitedDirectoryWrapper(NRTCachingDirectory(org.apache.lucene.store.NIOFSDirectory@/usr/home/hudson/hudson-slave/workspace/Lucene-Solr-Tests-4.x-java7/solr/build/solr-core/test/J0/org.apache.solr.cloud.BasicDistributedZkTest-1359705998839/jetty1/index lockFactory=org.apache.lucene.store.NativeFSLockFactory@28ba5be1; maxCacheMB=48.0 maxMergeSizeMB=4.0)),segFN=segments_1,generation=1,filenames=[segments_1]
[junit4:junit4]   2> 15477 T587 C76 P62992 oasc.SolrDeletionPolicy.updateCommits newest commit = 1[segments_1]
[junit4:junit4]   2> 15481 T587 C76 P62992 oasc.SolrDeletionPolicy.onCommit SolrDeletionPolicy.onCommit: commits:num=2
[junit4:junit4]   2> 		commit{dir=RateLimitedDirectoryWrapper(NRTCachingDirectory(org.apache.lucene.store.NIOFSDirectory@/usr/home/hudson/hudson-slave/workspace/Lucene-Solr-Tests-4.x-java7/solr/build/solr-core/test/J0/org.apache.solr.cloud.BasicDistributedZkTest-1359705998839/jetty1/index lockFactory=org.apache.lucene.store.NativeFSLockFactory@28ba5be1; maxCacheMB=48.0 maxMergeSizeMB=4.0)),segFN=segments_1,generation=1,filenames=[segments_1]
[junit4:junit4]   2> 		commit{dir=RateLimitedDirectoryWrapper(NRTCachingDirectory(org.apache.lucene.store.NIOFSDirectory@/usr/home/hudson/hudson-slave/workspace/Lucene-Solr-Tests-4.x-java7/solr/build/solr-core/test/J0/org.apache.solr.cloud.BasicDistributedZkTest-1359705998839/jetty1/index lockFactory=org.apache.lucene.store.NativeFSLockFactory@28ba5be1; maxCacheMB=48.0 maxMergeSizeMB=4.0)),segFN=segments_2,generation=2,filenames=[segments_2]
[junit4:junit4]   2> 15481 T587 C76 P62992 oasc.SolrDeletionPolicy.updateCommits newest commit = 2[segments_2]
[junit4:junit4]   2> 15483 T587 C76 P62992 oasc.CachingDirectoryFactory.close Releasing directory:/usr/home/hudson/hudson-slave/workspace/Lucene-Solr-Tests-4.x-java7/solr/build/solr-core/test/J0/./org.apache.solr.cloud.BasicDistributedZkTest-1359705998839/jetty1
[junit4:junit4]   2> 15483 T587 C76 P62992 oass.SolrIndexSearcher.<init> Opening Searcher@7d8fd3f7 realtime
[junit4:junit4]   2> 15483 T587 C76 P62992 oasu.DirectUpdateHandler2.commit end_commit_flush
[junit4:junit4]   2> 15484 T587 C76 P62992 /update {waitSearcher=true&openSearcher=false&commit=true&wt=javabin&commit_end_point=true&version=2&softCommit=false} {commit=} 0 30
[junit4:junit4]   2> 15485 T628 C74 P63010 oash.ReplicationHandler.inform Commits will be reserved for  10000
[junit4:junit4]   2> 15486 T628 C74 P63010 oascsi.HttpClientUtil.createClient Creating new http client, config:connTimeout=5000&socketTimeout=20000&allowCompression=false&maxConnections=10000&maxConnectionsPerHost=10000
[junit4:junit4]   2> 15513 T628 C74 P63010 oash.SnapPuller.<init>  No value set for 'pollInterval'. Timer Task not started.
[junit4:junit4]   2> 15516 T588 C76 P62992 oash.ReplicationHandler.inform Commits will be reserved for  10000
[junit4:junit4]   2> 15517 T588 C76 P62992 REQ /replication {command=indexversion&qt=/replication&wt=javabin&version=2} status=0 QTime=2 
[junit4:junit4]   2> 15518 T628 C74 P63010 oash.SnapPuller.fetchLatestIndex Master's generation: 2
[junit4:junit4]   2> 15518 T628 C74 P63010 oash.SnapPuller.fetchLatestIndex Slave's generation: 1
[junit4:junit4]   2> 15519 T628 C74 P63010 oash.SnapPuller.fetchLatestIndex Starting replication process
[junit4:junit4]   2> 15522 T588 C76 P62992 oasc.CachingDirectoryFactory.close Releasing directory:/usr/home/hudson/hudson-slave/workspace/Lucene-Solr-Tests-4.x-java7/solr/build/solr-core/test/J0/./org.apache.solr.cloud.BasicDistributedZkTest-1359705998839/jetty1
[junit4:junit4]   2> 15522 T588 C76 P62992 oasc.CachingDirectoryFactory.close Releasing directory:/usr/home/hudson/hudson-slave/workspace/Lucene-Solr-Tests-4.x-java7/solr/build/solr-core/test/J0/./org.apache.solr.cloud.BasicDistributedZkTest-1359705998839/jetty1/index
[junit4:junit4]   2> 15523 T588 C76 P62992 REQ /replication {command=filelist&qt=/replication&wt=javabin&generation=2&version=2} status=0 QTime=2 
[junit4:junit4]   2> 15524 T628 C74 P63010 oash.SnapPuller.fetchLatestIndex Number of files in latest index in master: 1
[junit4:junit4]   2> 15525 T628 C74 P63010 oasc.CachingDirectoryFactory.get return new directory for /usr/home/hudson/hudson-slave/workspace/Lucene-Solr-Tests-4.x-java7/solr/build/solr-core/test/J0/./org.apache.solr.cloud.BasicDistributedZkTest-1359705998839/jetty3/index.20130201130654356 forceNew:false
[junit4:junit4]   2> 15526 T628 C74 P63010 oasc.CachingDirectoryFactory.close Releasing directory:/usr/home/hudson/hudson-slave/workspace/Lucene-Solr-Tests-4.x-java7/solr/build/solr-core/test/J0/./org.apache.solr.cloud.BasicDistributedZkTest-1359705998839/jetty3
[junit4:junit4]   2> 15527 T628 C74 P63010 oash.SnapPuller.fetchLatestIndex Starting download to RateLimitedDirectoryWrapper(NRTCachingDirectory(org.apache.lucene.store.NIOFSDirectory@/usr/home/hudson/hudson-slave/workspace/Lucene-Solr-Tests-4.x-java7/solr/build/solr-core/test/J0/org.apache.solr.cloud.BasicDistributedZkTest-1359705998839/jetty3/index.20130201130654356 lockFactory=org.apache.lucene.store.NativeFSLockFactory@4441c76e; maxCacheMB=48.0 maxMergeSizeMB=4.0)) fullCopy=true
[junit4:junit4]   2> 15540 T588 C76 P62992 REQ /replication {file=segments_2&command=filecontent&checksum=true&wt=filestream&qt=/replication&generation=2} status=0 QTime=5 
[junit4:junit4]   2> 15554 T628 C74 P63010 oasc.CachingDirectoryFactory.close Releasing directory:/usr/home/hudson/hudson-slave/workspace/Lucene-Solr-Tests-4.x-java7/solr/build/solr-core/test/J0/./org.apache.solr.cloud.BasicDistributedZkTest-1359705998839/jetty3/index
[junit4:junit4]   2> 15554 T628 C74 P63010 oash.SnapPuller.fetchLatestIndex Total time taken for download : 0 secs
[junit4:junit4]   2> 15555 T628 C74 P63010 oash.SnapPuller.modifyIndexProps New index installed. Updating index properties... index=index.20130201130654356
[junit4:junit4]   2> 15562 T628 C74 P63010 oasc.CachingDirectoryFactory.close Releasing directory:/usr/home/hudson/hudson-slave/workspace/Lucene-Solr-Tests-4.x-java7/solr/build/solr-core/test/J0/./org.apache.solr.cloud.BasicDistributedZkTest-1359705998839/jetty3
[junit4:junit4]   2> 15563 T628 C74 P63010 oasc.CachingDirectoryFactory.close Releasing directory:/usr/home/hudson/hudson-slave/workspace/Lucene-Solr-Tests-4.x-java7/solr/build/solr-core/test/J0/./org.apache.solr.cloud.BasicDistributedZkTest-1359705998839/jetty3
[junit4:junit4]   2> 15563 T628 C74 P63010 oasc.SolrCore.getNewIndexDir New index directory detected: old=./org.apache.solr.cloud.BasicDistributedZkTest-1359705998839/jetty3/index/ new=./org.apache.solr.cloud.BasicDistributedZkTest-1359705998839/jetty3/index.20130201130654356
[junit4:junit4]   2> 15567 T628 C74 P63010 oasc.SolrDeletionPolicy.onInit SolrDeletionPolicy.onInit: commits:num=1
[junit4:junit4]   2> 		commit{dir=RateLimitedDirectoryWrapper(NRTCachingDirectory(org.apache.lucene.store.NIOFSDirectory@/usr/home/hudson/hudson-slave/workspace/Lucene-Solr-Tests-4.x-java7/solr/build/solr-core/test/J0/org.apache.solr.cloud.BasicDistributedZkTest-1359705998839/jetty3/index.20130201130654356 lockFactory=org.apache.lucene.store.NativeFSLockFactory@4441c76e; maxCacheMB=48.0 maxMergeSizeMB=4.0)),segFN=segments_2,generation=2,filenames=[segments_2]
[junit4:junit4]   2> 15568 T628 C74 P63010 oasc.SolrDeletionPolicy.updateCommits newest commit = 2[segments_2]
[junit4:junit4]   2> 15569 T628 C74 P63010 oasc.CachingDirectoryFactory.close Releasing directory:/usr/home/hudson/hudson-slave/workspace/Lucene-Solr-Tests-4.x-java7/solr/build/solr-core/test/J0/./org.apache.solr.cloud.BasicDistributedZkTest-1359705998839/jetty3
[junit4:junit4]   2> 15574 T628 C74 P63010 oasu.DefaultSolrCoreState.newIndexWriter Creating new IndexWriter...
[junit4:junit4]   2> 15574 T628 C74 P63010 oasu.DefaultSolrCoreState.newIndexWriter Waiting until IndexWriter is unused... core=collection1
[junit4:junit4]   2> 15574 T628 C74 P63010 oasu.DefaultSolrCoreState.newIndexWriter Rollback old IndexWriter... core=collection1
[junit4:junit4]   2> 15575 T628 C74 P63010 oasc.CachingDirectoryFactory.close Releasing directory:/usr/home/hudson/hudson-slave/workspace/Lucene-Solr-Tests-4.x-java7/solr/build/solr-core/test/J0/./org.apache.solr.cloud.BasicDistributedZkTest-1359705998839/jetty3/index.20130201130654356
[junit4:junit4]   2> 15576 T628 C74 P63010 oasc.CachingDirectoryFactory.close Releasing directory:/usr/home/hudson/hudson-slave/workspace/Lucene-Solr-Tests-4.x-java7/solr/build/solr-core/test/J0/./org.apache.solr.cloud.BasicDistributedZkTest-1359705998839/jetty3
[junit4:junit4]   2> 15580 T628 C74 P63010 oasc.SolrDeletionPolicy.onInit SolrDeletionPolicy.onInit: commits:num=1
[junit4:junit4]   2> 		commit{dir=RateLimitedDirectoryWrapper(NRTCachingDirectory(org.apache.lucene.store.NIOFSDirectory@/usr/home/hudson/hudson-slave/workspace/Lucene-Solr-Tests-4.x-java7/solr/build/solr-core/test/J0/org.apache.solr.cloud.BasicDistributedZkTest-1359705998839/jetty3/index.20130201130654356 lockFactory=org.apache.lucene.store.NativeFSLockFactory@4441c76e; maxCacheMB=48.0 maxMergeSizeMB=4.0)),segFN=segments_2,generation=2,filenames=[segments_2]
[junit4:junit4]   2> 15581 T628 C74 P63010 oasc.SolrDeletionPolicy.updateCommits newest commit = 2[segments_2]
[junit4:junit4]   2> 15582 T628 C74 P63010 oasu.DefaultSolrCoreState.newIndexWriter New IndexWriter is ready to be used.
[junit4:junit4]   2> 15582 T628 C74 P63010 oasc.CachingDirectoryFactory.close Releasing directory:/usr/home/hudson/hudson-slave/workspace/Lucene-Solr-Tests-4.x-java7/solr/build/solr-core/test/J0/./org.apache.solr.cloud.BasicDistributedZkTest-1359705998839/jetty3
[junit4:junit4]   2> 15583 T628 C74 P63010 oass.SolrIndexSearcher.<init> Opening Searcher@7e4aa23d main
[junit4:junit4]   2> 15585 T627 oasc.SolrCore.registerSearcher [collection1] Registered new searcher Searcher@7e4aa23d main{StandardDirectoryReader(segments_2:1:nrt)}
[junit4:junit4]   2> 15586 T627 oasc.CachingDirectoryFactory.close Releasing directory:/usr/home/hudson/hudson-slave/workspace/Lucene-Solr-Tests-4.x-java7/solr/build/solr-core/test/J0/./org.apache.solr.cloud.BasicDistributedZkTest-1359705998839/jetty3/index
[junit4:junit4]   2> 15586 T628 C74 P63010 oasu.DirectUpdateHandler2.commit start commit{,optimize=false,openSearcher=false,waitSearcher=false,expungeDeletes=false,softCommit=false}
[junit4:junit4]   2> 15589 T628 C74 P63010 oasc.SolrDeletionPolicy.onCommit SolrDeletionPolicy.onCommit: commits:num=2
[junit4:junit4]   2> 		commit{dir=RateLimitedDirectoryWrapper(NRTCachingDirectory(org.apache.lucene.store.NIOFSDirectory@/usr/home/hudson/hudson-slave/workspace/Lucene-Solr-Tests-4.x-java7/solr/build/solr-core/test/J0/org.apache.solr.cloud.BasicDistributedZkTest-1359705998839/jetty3/index.20130201130654356 lockFactory=org.apache.lucene.store.NativeFSLockFactory@4441c76e; maxCacheMB=48.0 maxMergeSizeMB=4.0)),segFN=segments_2,generation=2,filenames=[segments_2]
[junit4:junit4]   2> 		commit{dir=RateLimitedDirectoryWrapper(NRTCachingDirectory(org.apache.lucene.store.NIOFSDirectory@/usr/home/hudson/hudson-slave/workspace/Lucene-Solr-Tests-4.x-java7/solr/build/solr-core/test/J0/org.apache.solr.cloud.BasicDistributedZkTest-1359705998839/jetty3/index.20130201130654356 lockFactory=org.apache.lucene.store.NativeFSLockFactory@4441c76e; maxCacheMB=48.0 maxMergeSizeMB=4.0)),segFN=segments_3,generation=3,filenames=[segments_3]
[junit4:junit4]   2> 15590 T628 C74 P63010 oasc.SolrDeletionPolicy.updateCommits newest commit = 3[segments_3]
[junit4:junit4]   2> 15591 T628 C74 P63010 oasc.CachingDirectoryFactory.close Releasing directory:/usr/home/hudson/hudson-slave/workspace/Lucene-Solr-Tests-4.x-java7/solr/build/solr-core/test/J0/./org.apache.solr.cloud.BasicDistributedZkTest-1359705998839/jetty3
[junit4:junit4]   2> 15592 T628 C74 P63010 oasu.DirectUpdateHandler2.commit end_commit_flush
[junit4:junit4]   2> 15592 T628 C74 P63010 oasc.CachingDirectoryFactory.close Releasing directory:/usr/home/hudson/hudson-slave/workspace/Lucene-Solr-Tests-4.x-java7/solr/build/solr-core/test/J0/./org.apache.solr.cloud.BasicDistributedZkTest-1359705998839/jetty3/index.20130201130654356
[junit4:junit4]   2> 15592 T628 C74 P63010 oasc.CachingDirectoryFactory.close Releasing directory:/usr/home/hudson/hudson-slave/workspace/Lucene-Solr-Tests-4.x-java7/solr/build/solr-core/test/J0/./org.apache.solr.cloud.BasicDistributedZkTest-1359705998839/jetty3/index
[junit4:junit4]   2> 15593 T628 C74 P63010 oasc.RecoveryStrategy.replay No replay needed. core=collection1
[junit4:junit4]   2> 15593 T628 C74 P63010 oasc.RecoveryStrategy.doRecovery Replication Recovery was successful - registering as Active. core=collection1
[junit4:junit4]   2> 15593 T628 C74 P63010 oasc.ZkController.publish publishing core=collection1 state=active
[junit4:junit4]   2> 15593 T628 C74 P63010 oasc.ZkController.publish numShards not found on descriptor - reading it from system property
[junit4:junit4]   2> 15600 T628 C74 P63010 oasc.RecoveryStrategy.doRecovery Finished recovery process. core=collection1
[junit4:junit4]   2> 16021 T554 oascc.ZkStateReader.updateClusterState Updating cloud state from ZooKeeper... 
[junit4:junit4]   2> 16099 T577 oascc.ZkStateReader.updateClusterState Updating cloud state from ZooKeeper... 
[junit4:junit4]   2> 16100 T577 oasc.Overseer$ClusterStateUpdater.updateState Update state numShards=2 message={
[junit4:junit4]   2> 	  "operation":"state",
[junit4:junit4]   2> 	  "numShards":"2",
[junit4:junit4]   2> 	  "shard":"shard2",
[junit4:junit4]   2> 	  "roles":null,
[junit4:junit4]   2> 	  "state":"recovering",
[junit4:junit4]   2> 	  "core":"collection1",
[junit4:junit4]   2> 	  "collection":"collection1",
[junit4:junit4]   2> 	  "node_name":"127.0.0.1:63015_",
[junit4:junit4]   2> 	  "base_url":"http://127.0.0.1:63015"}
[junit4:junit4]   2> 16105 T577 oasc.Overseer$ClusterStateUpdater.updateState Update state numShards=2 message={
[junit4:junit4]   2> 	  "operation":"state",
[junit4:junit4]   2> 	  "numShards":"2",
[junit4:junit4]   2> 	  "shard":"shard1",
[junit4:junit4]   2> 	  "roles":null,
[junit4:junit4]   2> 	  "state":"active",
[junit4:junit4]   2> 	  "core":"collection1",
[junit4:junit4]   2> 	  "collection":"collection1",
[junit4:junit4]   2> 	  "node_name":"127.0.0.1:63010_",
[junit4:junit4]   2> 	  "base_url":"http://127.0.0.1:63010"}
[junit4:junit4]   2> 16116 T595 oascc.ZkStateReader$2.process A cluster state change: WatchedEvent state:SyncConnected type:NodeDataChanged path:/clusterstate.json, has occurred - updating... (live nodes size: 5)
[junit4:junit4]   2> 16116 T610 oascc.ZkStateReader$2.process A cluster state change: WatchedEvent state:SyncConnected type:NodeDataChanged path:/clusterstate.json, has occurred - updating... (live nodes size: 5)
[junit4:junit4]   2> 16116 T576 oascc.ZkStateReader$2.process A cluster state change: WatchedEvent state:SyncConnected type:NodeDataChanged path:/clusterstate.json, has occurred - updating... (live nodes size: 5)
[junit4:junit4]   2> 16116 T641 oascc.ZkStateReader$2.process A cluster state change: WatchedEvent state:SyncConnected type:NodeDataChanged path:/clusterstate.json, has occurred - updating... (live nodes size: 5)
[junit4:junit4]   2> 16116 T625 oascc.ZkStateReader$2.process A cluster state change: WatchedEvent state:SyncConnected type:NodeDataChanged path:/clusterstate.json, has occurred - updating... (live nodes size: 5)
[junit4:junit4]   2> 16116 T582 oascc.ZkStateReader$2.process A cluster state change: WatchedEvent state:SyncConnected type:NodeDataChanged path:/clusterstate.json, has occurred - updating... (live nodes size: 5)
[junit4:junit4]   2> 17024 T554 oascc.ZkStateReader.updateClusterState Updating cloud state from ZooKeeper... 
[junit4:junit4]   2> 18027 T554 oascc.ZkStateReader.updateClusterState Updating cloud state from ZooKeeper... 
[junit4:junit4]   2>  C75_STATE=coll:collection1 core:collection1 props:{shard=shard2, roles=null, state=recovering, core=collection1, collection=collection1, node_name=127.0.0.1:63015_, base_url=http://127.0.0.1:63015}
[junit4:junit4]   2> 19026 T644 C75 P63015 oasc.RecoveryStrategy.doRecovery Attempting to PeerSync from http://127.0.0.1:63007/collection1/ core=collection1 - recoveringAfterStartup=true
[junit4:junit4]   2> 19026 T644 C75 P63015 oasu.PeerSync.sync PeerSync: core=collection1 url=http://127.0.0.1:63015 START replicas=[http://127.0.0.1:63007/collection1/] nUpdates=100
[junit4:junit4]   2> 19027 T644 C75 P63015 oasu.PeerSync.sync WARNING no frame of reference to tell of we've missed updates
[junit4:junit4]   2> 19027 T644 C75 P63015 oasc.RecoveryStrategy.doRecovery PeerSync Recovery was not successful - trying replication. core=collection1
[junit4:junit4]   2> 19027 T644 C75 P63015 oasc.RecoveryStrategy.doRecovery Starting Replication Recovery. core=collection1
[junit4:junit4]   2> 19027 T644 C75 P63015 oasc.RecoveryStrategy.doRecovery Begin buffering updates. core=collection1
[junit4:junit4]   2> 19028 T644 C75 P63015 oasu.UpdateLog.bufferUpdates Starting to buffer updates. FSUpdateLog{state=ACTIVE, tlog=null}
[junit4:junit4]   2> 19028 T644 C75 P63015 oasc.RecoveryStrategy.replicate Attempting to replicate from http://127.0.0.1:63007/collection1/. core=collection1
[junit4:junit4]   2> 19029 T644 C75 P63015 oascsi.HttpClientUtil.createClient Creating new http client, config:maxConnections=128&maxConnectionsPerHost=32&followRedirects=false
[junit4:junit4]   2> 19030 T554 oascc.ZkStateReader.updateClusterState Updating cloud state from ZooKeeper... 
[junit4:junit4]   2> ASYNC  NEW_CORE C77 name=collection1 org.apache.solr.core.SolrCore@64eb05bd url=http://127.0.0.1:63007/collection1 node=127.0.0.1:63007_ C77_STATE=coll:collection1 core:collection1 props:{shard=shard2, roles=null, state=active, core=collection1, collection=collection1, node_name=127.0.0.1:63007_, base_url=http://127.0.0.1:63007, leader=true}
[junit4:junit4]   2> 19040 T601 C77 P63007 REQ /get {getVersions=100&distrib=false&wt=javabin&qt=/get&version=2} status=0 QTime=1 
[junit4:junit4]   2> 19047 T602 C77 P63007 oasu.DirectUpdateHandler2.commit start commit{,optimize=false,openSearcher=false,waitSearcher=true,expungeDeletes=false,softCommit=false}
[junit4:junit4]   2> 19048 T602 C77 P63007 oasc.CachingDirectoryFactory.close Releasing directory:/usr/home/hudson/hudson-slave/workspace/Lucene-Solr-Tests-4.x-java7/solr/build/solr-core/test/J0/./org.apache.solr.cloud.BasicDistributedZkTest-1359705998839/jetty2
[junit4:junit4]   2> 19053 T602 C77 P63007 oasc.SolrDeletionPolicy.onInit SolrDeletionPolicy.onInit: commits:num=1
[junit4:junit4]   2> 		commit{dir=RateLimitedDirectoryWrapper(NRTCachingDirectory(org.apache.lucene.store.NIOFSDirectory@/usr/home/hudson/hudson-slave/workspace/Lucene-Solr-Tests-4.x-java7/solr/build/solr-core/test/J0/org.apache.solr.cloud.BasicDistributedZkTest-1359705998839/jetty2/index lockFactory=org.apache.lucene.store.NativeFSLockFactory@48f6d2ba; maxCacheMB=48.0 maxMergeSizeMB=4.0)),segFN=segments_1,generation=1,filenames=[segments_1]
[junit4:junit4]   2> 19053 T602 C77 P63007 oasc.SolrDeletionPolicy.updateCommits newest commit = 1[segments_1]
[junit4:junit4]   2> 19067 T602 C77 P63007 oasc.SolrDeletionPolicy.onCommit SolrDeletionPolicy.onCommit: commits:num=2
[junit4:junit4]   2> 		commit{dir=RateLimitedDirectoryWrapper(NRTCachingDirectory(org.apache.lucene.store.NIOFSDirectory@/usr/home/hudson/hudson-slave/workspace/Lucene-Solr-Tests-4.x-java7/solr/build/solr-core/test/J0/org.apache.solr.cloud.BasicDistributedZkTest-1359705998839/jetty2/index lockFactory=org.apache.lucene.store.NativeFSLockFactory@48f6d2ba; maxCacheMB=48.0 maxMergeSizeMB=4.0)),segFN=segments_1,generation=1,filenames=[segments_1]
[junit4:junit4]   2> 		commit{dir=RateLimitedDirectoryWrapper(NRTCachingDirectory(org.apache.lucene.store.NIOFSDirectory@/usr/home/hudson/hudson-slave/workspace/Lucene-Solr-Tests-4.x-java7/solr/build/solr-core/test/J0/org.apache.solr.cloud.BasicDistributedZkTest-1359705998839/jetty2/index lockFactory=org.apache.lucene.store.NativeFSLockFactory@48f6d2ba; maxCacheMB=48.0 maxMergeSizeMB=4.0)),segFN=segments_2,generation=2,filenames=[segments_2]
[junit4:junit4]   2> 19067 T602 C77 P63007 oasc.SolrDeletionPolicy.updateCommits newest commit = 2[segments_2]
[junit4:junit4]   2> 19068 T602 C77 P63007 oasc.CachingDirectoryFactory.close Releasing directory:/usr/home/hudson/hudson-slave/workspace/Lucene-Solr-Tests-4.x-java7/solr/build/solr-core/test/J0/./org.apache.solr.cloud.BasicDistributedZkTest-1359705998839/jetty2
[junit4:junit4]   2> 19069 T602 C77 P63007 oass.SolrIndexSearcher.<init> Opening Searcher@2a30a4b realtime
[junit4:junit4]   2> 19069 T602 C77 P63007 oasu.DirectUpdateHandler2.commit end_commit_flush
[junit4:junit4]   2> 19070 T602 C77 P63007 /update {waitSearcher=true&openSearcher=false&commit=true&wt=javabin&commit_end_point=true&version=2&softCommit=false} {commit=} 0 23
[junit4:junit4]   2> 19071 T644 C75 P63015 oash.ReplicationHandler.inform Commits will be reserved for  10000
[junit4:junit4]   2> 19071 T644 C75 P63015 oash.SnapPuller.<init>  No value set for 'pollInterval'. Timer Task not started.
[junit4:junit4]   2> 19074 T603 C77 P63007 oash.ReplicationHandler.inform Commits will be reserved for  10000
[junit4:junit4]   2> 19074 T603 C77 P63007 REQ /replication {command=indexversion&qt=/replication&wt=javabin&version=2} status=0 QTime=1 
[junit4:junit4]   2> 19075 T644 C75 P63015 oash.SnapPuller.fetchLatestIndex Master's generation: 2
[junit4:junit4]   2> 19075 T644 C75 P63015 oash.SnapPuller.fetchLatestIndex Slave's generation: 1
[junit4:junit4]   2> 19076 T644 C75 P63015 oash.SnapPuller.fetchLatestIndex Starting replication process
[junit4:junit4]   2> 19079 T603 C77 P63007 oasc.CachingDirectoryFactory.close Releasing directory:/usr/home/hudson/hudson-slave/workspace/Lucene-Solr-Tests-4.x-java7/solr/build/solr-core/test/J0/./org.apache.solr.cloud.BasicDistributedZkTest-1359705998839/jetty2
[junit4:junit4]   2> 19079 T603 C77 P63007 oasc.CachingDirectoryFactory.close Releasing directory:/usr/home/hudson/hudson-slave/workspace/Lucene-Solr-Tests-4.x-java7/solr/build/solr-core/test/J0/./org.apache.solr.cloud.BasicDistributedZkTest-1359705998839/jetty2/index
[junit4:junit4]   2> 19080 T603 C77 P63007 REQ /replication {command=filelist&qt=/replication&wt=javabin&generation=2&version=2} status=0 QTime=2 
[junit4:junit4]   2> 19081 T644 C75 P63015 oash.SnapPuller.fetchLatestIndex Number of files in latest index in master: 1
[junit4:junit4]   2> 19082 T644 C75 P63015 oasc.CachingDirectoryFactory.get return new directory for /usr/home/hudson/hudson-slave/workspace/Lucene-Solr-Tests-4.x-java7/solr/build/solr-core/test/J0/./org.apache.solr.cloud.BasicDistributedZkTest-1359705998839/jetty4/index.20130201130657913 forceNew:false
[junit4:junit4]   2> 19083 T644 C75 P63015 oasc.CachingDirectoryFactory.close Releasing directory:/usr/home/hudson/hudson-slave/workspace/Lucene-Solr-Tests-4.x-java7/solr/build/solr-core/test/J0/./org.apache.solr.cloud.BasicDistributedZkTest-1359705998839/jetty4
[junit4:junit4]   2> 19083 T644 C75 P63015 oash.SnapPuller.fetchLatestIndex Starting download to RateLimitedDirectoryWrapper(NRTCachingDirectory(org.apache.lucene.store.NIOFSDirectory@/usr/home/hudson/hudson-slave/workspace/Lucene-Solr-Tests-4.x-java7/solr/build/solr-core/test/J0/org.apache.solr.cloud.BasicDistributedZkTest-1359705998839/jetty4/index.20130201130657913 lockFactory=org.apache.lucene.store.NativeFSLockFactory@3449ec4e; maxCacheMB=48.0 maxMergeSizeMB=4.0)) fullCopy=true
[junit4:junit4]   2> 19087 T603 C77 P63007 REQ /replication {file=segments_2&command=filecontent&checksum=true&wt=filestream&qt=/replication&generation=2} status=0 QTime=0 
[junit4:junit4]   2> 19089 T644 C75 P63015 oasc.CachingDirectoryFactory.close Releasing directory:/usr/home/hudson/hudson-slave/workspace/Lucene-Solr-Tests-4.x-java7/solr/build/solr-core/test/J0/./org.apache.solr.cloud.BasicDistributedZkTest-1359705998839/jetty4/index
[junit4:junit4]   2> 19089 T644 C75 P63015 oash.SnapPuller.fetchLatestIndex Total time taken for download : 0 secs
[junit4:junit4]   2> 19090 T644 C75 P63015 oash.SnapPuller.modifyIndexProps New index installed. Updating index properties... index=index.20130201130657913
[junit4:junit4]   2> 19091 T644 C75 P63015 oasc.CachingDirectoryFactory.close Releasing directory:/usr/home/hudson/hudson-slave/workspace/Lucene-Solr-Tests-4.x-java7/solr/build/solr-core/test/J0/./org.apache.solr.cloud.BasicDistributedZkTest-1359705998839/jetty4
[junit4:junit4]   2> 19092 T644 C75 P63015 oasc.CachingDirectoryFactory.close Releasing directory:/usr/home/hudson/hudson-slave/workspace/Lucene-Solr-Tests-4.x-java7/solr/build/solr-core/test/J0/./org.apache.solr.cloud.BasicDistributedZkTest-1359705998839/jetty4
[junit4:junit4]   2> 19092 T644 C75 P63015 oasc.SolrCore.getNewIndexDir New index directory detected: old=./org.apache.solr.cloud.BasicDistributedZkTest-1359705998839/jetty4/index/ new=./org.apache.solr.cloud.BasicDistributedZkTest-1359705998839/jetty4/index.20130201130657913
[junit4:junit4]   2> 19096 T644 C75 P63015 oasc.SolrDeletionPolicy.onInit SolrDeletionPolicy.onInit: commits:num=1
[junit4:junit4]   2> 		commit{dir=RateLimitedDirectoryWrapper(NRTCachingDirectory(org.apache.lucene.store.NIOFSDirectory@/usr/home/hudson/hudson-slave/workspace/Lucene-Solr-Tests-4.x-java7/solr/build/solr-core/test/J0/org.apache.solr.cloud.BasicDistributedZkTest-1359705998839/jetty4/index.20130201130657913 lockFactory=org.apache.lucene.store.NativeFSLockFactory@3449ec4e; maxCacheMB=48.0 maxMergeSizeMB=4.0)),segFN=segments_2,generation=2,filenames=[segments_2]
[junit4:junit4]   2> 19096 T644 C75 P63015 oasc.SolrDeletionPolicy.updateCommits newest commit = 2[segments_2]
[junit4:junit4]   2> 19098 T644 C75 P63015 oasc.CachingDirectoryFactory.close Releasing directory:/usr/home/hudson/hudson-slave/workspace/Lucene-Solr-Tests-4.x-java7/solr/build/solr-core/test/J0/./org.apache.solr.cloud.BasicDistributedZkTest-1359705998839/jetty4
[junit4:junit4]   2> 19098 T644 C75 P63015 oasu.DefaultSolrCoreState.newIndexWriter Creating new IndexWriter...
[junit4:junit4]   2> 19098 T644 C75 P63015 oasu.DefaultSolrCoreState.newIndexWriter Waiting until IndexWriter is unused... core=collection1
[junit4:junit4]   2> 19098 T644 C75 P63015 oasu.DefaultSolrCoreState.newIndexWriter Rollback old IndexWriter... core=collection1
[junit4:junit4]   2> 19099 T644 C75 P63015 oasc.CachingDirectoryFactory.close Releasing directory:/usr/home/hudson/hudson-slave/workspace/Lucene-Solr-Tests-4.x-java7/solr/build/solr-core/test/J0/./org.apache.solr.cloud.BasicDistributedZkTest-1359705998839/jetty4/index.20130201130657913
[junit4:junit4]   2> 19100 T644 C75 P63015 oasc.CachingDirectoryFactory.close Releasing directory:/usr/home/hudson/hudson-slave/workspace/Lucene-Solr-Tests-4.x-java7/solr/build/solr-core/test/J0/./org.apache.solr.cloud.BasicDistributedZkTest-1359705998839/jetty4
[junit4:junit4]   2> 19103 T644 C75 P63015 oasc.SolrDeletionPolicy.onInit SolrDeletionPolicy.onInit: commits:num=1
[junit4:junit4]   2> 		commit{dir=RateLimitedDirectoryWrapper(NRTCachingDirectory(org.apache.lucene.store.NIOFSDirectory@/usr/home/hudson/hudson-slave/workspace/Lucene-Solr-Tests-4.x-java7/solr/build/solr-core/test/J0/org.apache.solr.cloud.BasicDistributedZkTest-1359705998839/jetty4/index.20130201130657913 lockFactory=org.apache.lucene.store.NativeFSLockFactory@3449ec4e; maxCacheMB=48.0 maxMergeSizeMB=4.0)),segFN=segments_2,generation=2,filenames=[segments_2]
[junit4:junit4]   2> 19104 T644 C75 P63015 oasc.SolrDeletionPolicy.updateCommits newest commit = 2[segments_2]
[junit4:junit4]   2> 19104 T644 C75 P63015 oasu.DefaultSolrCoreState.newIndexWriter New IndexWriter is ready to be used.
[junit4:junit4]   2> 19105 T644 C75 P63015 oasc.CachingDirectoryFactory.close Releasing directory:/usr/home/hudson/hudson-slave/workspace/Lucene-Solr-Tests-4.x-java7/solr/build/solr-core/test/J0/./org.apache.solr.cloud.BasicDistributedZkTest-1359705998839/jetty4
[junit4:junit4]   2> 19105 T644 C75 P63015 oass.SolrIndexSearcher.<init> Opening Searcher@136e6221 main
[junit4:junit4]   2> 19107 T643 oasc.SolrCore.registerSearcher [collection1] Registered new searcher Searcher@136e6221 main{StandardDirectoryReader(segments_2:1:nrt)}
[junit4:junit4]   2> 19108 T643 oasc.CachingDirectoryFactory.close Releasing directory:/usr/home/hudson/hudson-slave/workspace/Lucene-Solr-Tests-4.x-java7/solr/build/solr-core/test/J0/./org.apache.solr.cloud.BasicDistributedZkTest-1359705998839/jetty4/index
[junit4:junit4]   2> 19108 T644 C75 P63015 oasu.DirectUpdateHandler2.commit start commit{,optimize=false,openSearcher=false,waitSearcher=false,expungeDeletes=false,softCommit=false}
[junit4:junit4]   2> 19111 T644 C75 P63015 oasc.SolrDeletionPolicy.onCommit SolrDeletionPolicy.onCommit: commits:num=2
[junit4:junit4]   2> 		commit{dir=RateLimitedDirectoryWrapper(NRTCachingDirectory(org.apache.lucene.store.NIOFSDirectory@/usr/home/hudson/hudson-slave/workspace/Lucene-Solr-Tests-4.x-java7/solr/build/solr-core/test/J0/org.apache.solr.cloud.BasicDistributedZkTest-1359705998839/jetty4/index.20130201130657913 lockFactory=org.apache.lucene.store.NativeFSLockFactory@3449ec4e; maxCacheMB=48.0 maxMergeSizeMB=4.0)),segFN=segments_2,generation=2,filenames=[segments_2]
[junit4:junit4]   2> 		commit{dir=RateLimitedDirectoryWrapper(NRTCachingDirectory(org.apache.lucene.store.NIOFSDirectory@/usr/home/hudson/hudson-slave/workspace/Lucene-Solr-Tests-4.x-java7/solr/build/solr-core/test/J0/org.apache.solr.cloud.BasicDistributedZkTest-1359705998839/jetty4/index.20130201130657913 lockFactory=org.apache.lucene.store.NativeFSLockFactory@3449ec4e; maxCacheMB=48.0 maxMergeSizeMB=4.0)),segFN=segments_3,generation=3,filenames=[segments_3]
[junit4:junit4]   2> 19111 T644 C75 P63015 oasc.SolrDeletionPolicy.updateCommits newest commit = 3[segments_3]
[junit4:junit4]   2> 19113 T644 C75 P63015 oasc.CachingDirectoryFactory.close Releasing directory:/usr/home/hudson/hudson-slave/workspace/Lucene-Solr-Tests-4.x-java7/solr/build/solr-core/test/J0/./org.apache.solr.cloud.BasicDistributedZkTest-1359705998839/jetty4
[junit4:junit4]   2> 19113 T644 C75 P63015 oasu.DirectUpdateHandler2.commit end_commit_flush
[junit4:junit4]   2> 19113 T644 C75 P63015 oasc.CachingDirectoryFactory.close Releasing directory:/usr/home/hudson/hudson-slave/workspace/Lucene-Solr-Tests-4.x-java7/solr/build/solr-core/test/J0/./org.apache.solr.cloud.BasicDistributedZkTest-1359705998839/jetty4/index.20130201130657913
[junit4:junit4]   2> 19113 T644 C75 P63015 oasc.CachingDirectoryFactory.close Releasing directory:/usr/home/hudson/hudson-slave/workspace/Lucene-Solr-Tests-4.x-java7/solr/build/solr-core/test/J0/./org.apache.solr.cloud.BasicDistributedZkTest-1359705998839/jetty4/index
[junit4:junit4]   2> 19113 T644 C75 P63015 oasc.RecoveryStrategy.replay No replay needed. core=collection1
[junit4:junit4]   2> 19114 T644 C75 P63015 oasc.RecoveryStrategy.doRecovery Replication Recovery was successful - registering as Active. core=collection1
[junit4:junit4]   2> 19114 T644 C75 P63015 oasc.ZkController.publish publishing core=collection1 state=active
[junit4:junit4]   2> 19114 T644 C75 P63015 oasc.ZkController.publish numShards not found on descriptor - reading it from system property
[junit4:junit4]   2> 19116 T644 C75 P63015 oasc.RecoveryStrategy.doRecovery Finished recovery process. core=collection1
[junit4:junit4]   2> 19127 T577 oascc.ZkStateReader.updateClusterState Updating cloud state from ZooKeeper... 
[junit4:junit4]   2> 19128 T577 oasc.Overseer$ClusterStateUpdater.updateState Update state numShards=2 message={
[junit4:junit4]   2> 	  "operation":"state",
[junit4:junit4]   2> 	  "numShards":"2",
[junit4:junit4]   2> 	  "shard":"shard2",
[junit4:junit4]   2> 	  "roles":null,
[junit4:junit4]   2> 	  "state":"active",
[junit4:junit4]   2> 	  "core":"collection1",
[junit4:junit4]   2> 	  "collection":"collection1",
[junit4:junit4]   2> 	  "node_name":"127.0.0.1:63015_",
[junit4:junit4]   2> 	  "base_url":"http://127.0.0.1:63015"}
[junit4:junit4]   2> 19134 T595 oascc.ZkStateReader$2.process A cluster state change: WatchedEvent state:SyncConnected type:NodeDataChanged path:/clusterstate.json, has occurred - updating... (live nodes size: 5)
[junit4:junit4]   2> 19134 T625 oascc.ZkStateReader$2.process A cluster state change: WatchedEvent state:SyncConnected type:NodeDataChanged path:/clusterstate.json, has occurred - updating... (live nodes size: 5)
[junit4:junit4]   2> 19134 T576 oascc.ZkStateReader$2.process A cluster state change: WatchedEvent state:SyncConnected type:NodeDataChanged path:/clusterstate.json, has occurred - updating... (live nodes size: 5)
[junit4:junit4]   2> 19134 T610 oascc.ZkStateReader$2.process A cluster state change: WatchedEvent state:SyncConnected type:NodeDataChanged path:/clusterstate.json, has occurred - updating... (live nodes size: 5)
[junit4:junit4]   2> 19134 T582 oascc.ZkStateReader$2.process A cluster state change: WatchedEvent state:SyncConnected type:NodeDataChanged path:/clusterstate.json, has occurred - updating... (live nodes size: 5)
[junit4:junit4]   2> 19134 T641 oascc.ZkStateReader$2.process A cluster state change: WatchedEvent state:SyncConnected type:NodeDataChanged path:/clusterstate.json, has occurred - updating... (live nodes size: 5)
[junit4:junit4]   2> 20033 T554 oascc.ZkStateReader.updateClusterState Updating cloud state from ZooKeeper... 
[junit4:junit4]   2> 20034 T554 oasc.AbstractDistribZkTestBase.waitForRecoveriesToFinish Recoveries finished - collection: collection1
[junit4:junit4]   2> ASYNC  NEW_CORE C78 name=collection1 org.apache.solr.core.SolrCore@7627432c url=http://127.0.0.1:62981/collection1 node=127.0.0.1:62981_ C78_STATE=coll:control_collection core:collection1 props:{shard=shard1, roles=null, state=active, core=collection1, collection=control_collection, node_name=127.0.0.1:62981_, base_url=http://127.0.0.1:62981, leader=true}
[junit4:junit4]   2> 20051 T566 C78 P62981 oasc.CachingDirectoryFactory.close Releasing directory:/usr/home/hudson/hudson-slave/workspace/Lucene-Solr-Tests-4.x-java7/solr/build/solr-core/test/J0/./org.apache.solr.cloud.BasicDistributedZkTest-1359705998839/control/data
[junit4:junit4]   2> 20056 T566 C78 P62981 oasc.SolrDeletionPolicy.onInit SolrDeletionPolicy.onInit: commits:num=1
[junit4:junit4]   2> 		commit{dir=RateLimitedDirectoryWrapper(NRTCachingDirectory(org.apache.lucene.store.NIOFSDirectory@/usr/home/hudson/hudson-slave/workspace/Lucene-Solr-Tests-4.x-java7/solr/build/solr-core/test/J0/org.apache.solr.cloud.BasicDistributedZkTest-1359705998839/control/data/index lockFactory=org.apache.lucene.store.NativeFSLockFactory@19597933; maxCacheMB=48.0 maxMergeSizeMB=4.0)),segFN=segments_1,generation=1,filenames=[segments_1]
[junit4:junit4]   2> 20056 T566 C78 P62981 oasc.SolrDeletionPolicy.updateCommits newest commit = 1[segments_1]
[junit4:junit4]   2> 20058 T566 C78 P62981 oasc.CachingDirectoryFactory.close Releasing directory:/usr/home/hudson/hudson-slave/workspace/Lucene-Solr-Tests-4.x-java7/solr/build/solr-core/test/J0/./org.apache.solr.cloud.BasicDistributedZkTest-1359705998839/control/data
[junit4:junit4]   2> 20058 T566 C78 P62981 oass.SolrIndexSearcher.<init> Opening Searcher@43668653 realtime
[junit4:junit4]   2> 20059 T566 C78 P62981 /update {wt=javabin&version=2} {deleteByQuery=*:* (-1425755098456260608)} 0 13
[junit4:junit4]   2> 20072 T604 C77 P63007 oasc.CachingDirectoryFactory.close Releasing directory:/usr/home/hudson/hudson-slave/workspace/Lucene-Solr-Tests-4.x-java7/solr/build/solr-core/test/J0/./org.apache.solr.cloud.BasicDistributedZkTest-1359705998839/jetty2
[junit4:junit4]   2> 20093 T589 C76 P62992 oasc.CachingDirectoryFactory.close Releasing directory:/usr/home/hudson/hudson-slave/workspace/Lucene-Solr-Tests-4.x-java7/solr/build/solr-core/test/J0/./org.apache.solr.cloud.BasicDistributedZkTest-1359705998839/jetty1
[junit4:junit4]   2>  C75_STATE=coll:collection1 core:collection1 props:{shard=shard2, roles=null, state=active, core=collection1, collection=collection1, node_name=127.0.0.1:63015_, base_url=http://127.0.0.1:63015}
[junit4:junit4]   2> 20101 T631 C75 P63015 oasc.CachingDirectoryFactory.close Releasing directory:/usr/home/hudson/hudson-slave/workspace/Lucene-Solr-Tests-4.x-java7/solr/build/solr-core/test/J0/./org.apache.solr.cloud.BasicDistributedZkTest-1359705998839/jetty4
[junit4:junit4]   2> 20102 T631 C75 P63015 /update {update.distrib=FROMLEADER&_version_=-1425755098476183552&update.from=http://127.0.0.1:63007/collection1/&wt=javabin&version=2} {deleteByQuery=*:* (-1425755098476183552)} 0 3
[junit4:junit4]   2>  C74_STATE=coll:collection1 core:collection1 props:{shard=shard1, roles=null, state=active, core=collection1, collection=collection1, node_name=127.0.0.1:63010_, base_url=http://127.0.0.1:63010}
[junit4:junit4]   2> 20105 T615 C74 P63010 oasc.CachingDirectoryFactory.close Releasing directory:/usr/home/hudson/hudson-slave/workspace/Lucene-Solr-Tests-4.x-java7/solr/build/solr-core/test/J0/./org.apache.solr.cloud.BasicDistributedZkTest-1359705998839/jetty3
[junit4:junit4]   2> 20106 T615 C74 P63010 /update {update.distrib=FROMLEADER&_version_=-1425755098499252224&update.from=http://127.0.0.1:62992/collection1/&wt=javabin&version=2} {deleteByQuery=*:* (-1425755098499252224)} 0 3
[junit4:junit4]   2> 20107 T589 C76 P62992 /update {update.distrib=TOLEADER&wt=javabin&version=2} {deleteByQuery=*:* (-1425755098499252224)} 0 16
[junit4:junit4]   2> 20108 T604 C77 P63007 /update {wt=javabin&version=2} {deleteByQuery=*:* (-1425755098476183552)} 0 46
[junit4:junit4]   2> 20120 T566 C78 P62981 /update {wt=javabin&version=2} {add=[1 (1425755098524418048)]} 0 5
[junit4:junit4]   2> 20143 T615 C74 P63010 /update {distrib.from=http://127.0.0.1:62992/collection1/&update.distrib=FROMLEADER&wt=javabin&version=2} {add=[1 (1425755098531758080)]} 0 5
[junit4:junit4]   2> 20143 T590 C76 P62992 /update {wt=javabin&version=2} {add=[1 (1425755098531758080)]} 0 20
[junit4:junit4]   2> 20150 T566 C78 P62981 /update {wt=javabin&version=2} {add=[2 (1425755098557972480)]} 0 3
[junit4:junit4]   2> 20164 T631 C75 P63015 /update {distrib.from=http://127.0.0.1:63007/collection1/&update.distrib=FROMLEADER&wt=javabin&version=2} {add=[2 (1425755098564263936)]} 0 4
[junit4:junit4]   2> 20165 T604 C77 P63007 /update {wt=javabin&version=2} {add=[2 (1425755098564263936)]} 0 12
[junit4:junit4]   2> 20171 T566 C78 P62981 /update {wt=javabin&version=2} {add=[3 (1425755098579992576)]} 0 3
[junit4:junit4]   2> 20189 T631 C75 P63015 /update {distrib.from=http://127.0.0.1:63007/collection1/&update.distrib=FROMLEADER&wt=javabin&version=2} {add=[3 (1425755098593624064)]} 0

[...truncated too long message...]

]    > 	at org.apache.solr.client.solrj.impl.HttpSolrServer.request(HttpSolrServer.java:416)
[junit4:junit4]    > 	at org.apache.solr.client.solrj.impl.HttpSolrServer.request(HttpSolrServer.java:181)
[junit4:junit4]    > 	at org.apache.solr.client.solrj.request.AbstractUpdateRequest.process(AbstractUpdateRequest.java:117)
[junit4:junit4]    > 	at org.apache.solr.client.solrj.SolrServer.add(SolrServer.java:116)
[junit4:junit4]    > 	at org.apache.solr.client.solrj.SolrServer.add(SolrServer.java:102)
[junit4:junit4]    > 	at org.apache.solr.cloud.BasicDistributedZkTest.testCoreUnloadAndLeaders(BasicDistributedZkTest.java:502)
[junit4:junit4]    > 	at org.apache.solr.cloud.BasicDistributedZkTest.doTest(BasicDistributedZkTest.java:337)
[junit4:junit4]    > 	at org.apache.solr.BaseDistributedSearchTestCase.testDistribSearch(BaseDistributedSearchTestCase.java:794)
[junit4:junit4]    > 	at sun.reflect.NativeMethodAccessorImpl.invoke0(Native Method)
[junit4:junit4]    > 	at sun.reflect.NativeMethodAccessorImpl.invoke(NativeMethodAccessorImpl.java:57)
[junit4:junit4]    > 	at sun.reflect.DelegatingMethodAccessorImpl.invoke(DelegatingMethodAccessorImpl.java:43)
[junit4:junit4]    > 	at java.lang.reflect.Method.invoke(Method.java:601)
[junit4:junit4]    > 	at com.carrotsearch.randomizedtesting.RandomizedRunner.invoke(RandomizedRunner.java:1559)
[junit4:junit4]    > 	at com.carrotsearch.randomizedtesting.RandomizedRunner.access$600(RandomizedRunner.java:79)
[junit4:junit4]    > 	at com.carrotsearch.randomizedtesting.RandomizedRunner$6.evaluate(RandomizedRunner.java:737)
[junit4:junit4]    > 	at com.carrotsearch.randomizedtesting.RandomizedRunner$7.evaluate(RandomizedRunner.java:773)
[junit4:junit4]    > 	at com.carrotsearch.randomizedtesting.RandomizedRunner$8.evaluate(RandomizedRunner.java:787)
[junit4:junit4]    > 	at com.carrotsearch.randomizedtesting.rules.SystemPropertiesRestoreRule$1.evaluate(SystemPropertiesRestoreRule.java:53)
[junit4:junit4]    > 	at org.apache.lucene.util.TestRuleSetupTeardownChained$1.evaluate(TestRuleSetupTeardownChained.java:50)
[junit4:junit4]    > 	at org.apache.lucene.util.TestRuleFieldCacheSanity$1.evaluate(TestRuleFieldCacheSanity.java:51)
[junit4:junit4]    > 	at org.apache.lucene.util.AbstractBeforeAfterRule$1.evaluate(AbstractBeforeAfterRule.java:46)
[junit4:junit4]    > 	at com.carrotsearch.randomizedtesting.rules.SystemPropertiesInvariantRule$1.evaluate(SystemPropertiesInvariantRule.java:55)
[junit4:junit4]    > 	at org.apache.lucene.util.TestRuleThreadAndTestName$1.evaluate(TestRuleThreadAndTestName.java:49)
[junit4:junit4]    > 	at org.apache.lucene.util.TestRuleIgnoreAfterMaxFailures$1.evaluate(TestRuleIgnoreAfterMaxFailures.java:70)
[junit4:junit4]    > 	at org.apache.lucene.util.TestRuleMarkFailure$1.evaluate(TestRuleMarkFailure.java:48)
[junit4:junit4]    > 	at com.carrotsearch.randomizedtesting.rules.StatementAdapter.evaluate(StatementAdapter.java:36)
[junit4:junit4]    > 	at com.carrotsearch.randomizedtesting.ThreadLeakControl$StatementRunner.run(ThreadLeakControl.java:358)
[junit4:junit4]    > 	at com.carrotsearch.randomizedtesting.ThreadLeakControl.forkTimeoutingTask(ThreadLeakControl.java:782)
[junit4:junit4]    > 	at com.carrotsearch.randomizedtesting.ThreadLeakControl$3.evaluate(ThreadLeakControl.java:442)
[junit4:junit4]    > 	at com.carrotsearch.randomizedtesting.RandomizedRunner.runSingleTest(RandomizedRunner.java:746)
[junit4:junit4]    > 	at com.carrotsearch.randomizedtesting.RandomizedRunner$3.evaluate(RandomizedRunner.java:648)
[junit4:junit4]    > 	at com.carrotsearch.randomizedtesting.RandomizedRunner$4.evaluate(RandomizedRunner.java:682)
[junit4:junit4]    > 	at com.carrotsearch.randomizedtesting.RandomizedRunner$5.evaluate(RandomizedRunner.java:693)
[junit4:junit4]    > 	at com.carrotsearch.randomizedtesting.rules.StatementAdapter.evaluate(StatementAdapter.java:36)
[junit4:junit4]    > 	at com.carrotsearch.randomizedtesting.rules.SystemPropertiesRestoreRule$1.evaluate(SystemPropertiesRestoreRule.java:53)
[junit4:junit4]    > 	at org.apache.lucene.util.AbstractBeforeAfterRule$1.evaluate(AbstractBeforeAfterRule.java:46)
[junit4:junit4]    > 	at org.apache.lucene.util.TestRuleStoreClassName$1.evaluate(TestRuleStoreClassName.java:42)
[junit4:junit4]    > 	at com.carrotsearch.randomizedtesting.rules.SystemPropertiesInvariantRule$1.evaluate(SystemPropertiesInvariantRule.java:55)
[junit4:junit4]    > 	at com.carrotsearch.randomizedtesting.rules.NoShadowingOrOverridesOnMethodsRule$1.evaluate(NoShadowingOrOverridesOnMethodsRule.java:39)
[junit4:junit4]    > 	at com.carrotsearch.randomizedtesting.rules.NoShadowingOrOverridesOnMethodsRule$1.evaluate(NoShadowingOrOverridesOnMethodsRule.java:39)
[junit4:junit4]    > 	at com.carrotsearch.randomizedtesting.rules.StatementAdapter.evaluate(StatementAdapter.java:36)
[junit4:junit4]    > 	at org.apache.lucene.util.TestRuleAssertionsRequired$1.evaluate(TestRuleAssertionsRequired.java:43)
[junit4:junit4]    > 	at org.apache.lucene.util.TestRuleMarkFailure$1.evaluate(TestRuleMarkFailure.java:48)
[junit4:junit4]    > 	at org.apache.lucene.util.TestRuleIgnoreAfterMaxFailures$1.evaluate(TestRuleIgnoreAfterMaxFailures.java:70)
[junit4:junit4]    > 	at org.apache.lucene.util.TestRuleIgnoreTestSuites$1.evaluate(TestRuleIgnoreTestSuites.java:55)
[junit4:junit4]    > 	at com.carrotsearch.randomizedtesting.rules.StatementAdapter.evaluate(StatementAdapter.java:36)
[junit4:junit4]    > 	at com.carrotsearch.randomizedtesting.ThreadLeakControl$StatementRunner.run(ThreadLeakControl.java:358)
[junit4:junit4]    > 	at java.lang.Thread.run(Thread.java:722)
[junit4:junit4]    > Caused by: org.apache.http.NoHttpResponseException: The target server failed to respond
[junit4:junit4]    > 	at org.apache.http.impl.conn.DefaultResponseParser.parseHead(DefaultResponseParser.java:101)
[junit4:junit4]    > 	at org.apache.http.impl.io.AbstractMessageParser.parse(AbstractMessageParser.java:252)
[junit4:junit4]    > 	at org.apache.http.impl.AbstractHttpClientConnection.receiveResponseHeader(AbstractHttpClientConnection.java:282)
[junit4:junit4]    > 	at org.apache.http.impl.conn.DefaultClientConnection.receiveResponseHeader(DefaultClientConnection.java:247)
[junit4:junit4]    > 	at org.apache.http.impl.conn.AbstractClientConnAdapter.receiveResponseHeader(AbstractClientConnAdapter.java:216)
[junit4:junit4]    > 	at org.apache.http.protocol.HttpRequestExecutor.doReceiveResponse(HttpRequestExecutor.java:298)
[junit4:junit4]    > 	at org.apache.http.protocol.HttpRequestExecutor.execute(HttpRequestExecutor.java:125)
[junit4:junit4]    > 	at org.apache.http.impl.client.DefaultRequestDirector.tryExecute(DefaultRequestDirector.java:647)
[junit4:junit4]    > 	at org.apache.http.impl.client.DefaultRequestDirector.execute(DefaultRequestDirector.java:464)
[junit4:junit4]    > 	at org.apache.http.impl.client.AbstractHttpClient.execute(AbstractHttpClient.java:820)
[junit4:junit4]    > 	at org.apache.http.impl.client.AbstractHttpClient.execute(AbstractHttpClient.java:754)
[junit4:junit4]    > 	at org.apache.http.impl.client.AbstractHttpClient.execute(AbstractHttpClient.java:732)
[junit4:junit4]    > 	at org.apache.solr.client.solrj.impl.HttpSolrServer.request(HttpSolrServer.java:353)
[junit4:junit4]    > 	... 47 more
[junit4:junit4]   2> 390317 T554 oas.SolrTestCaseJ4.deleteCore ###deleteCore
[junit4:junit4]   2> NOTE: test params are: codec=Appending, sim=RandomSimilarityProvider(queryNorm=false,coord=no): {}, locale=ar_MA, timezone=Asia/Ashgabat
[junit4:junit4]   2> NOTE: FreeBSD 9.0-RELEASE amd64/Oracle Corporation 1.7.0_09 (64-bit)/cpus=16,threads=1,free=136778608,total=332398592
[junit4:junit4]   2> NOTE: All tests run in this JVM: [FieldAnalysisRequestHandlerTest, CircularListTest, TestStressVersions, TestFuzzyAnalyzedSuggestions, ChaosMonkeySafeLeaderTest, SOLR749Test, TestFastWriter, TestReload, TestPostingsSolrHighlighter, CoreAdminHandlerTest, NumericFieldsTest, WordBreakSolrSpellCheckerTest, MoreLikeThisHandlerTest, TestStressReorder, DirectUpdateHandlerOptimizeTest, TestBadConfig, SpellCheckComponentTest, TestIndexingPerformance, TermsComponentTest, TestPerFieldSimilarity, SpellCheckCollatorTest, TestIBSimilarityFactory, FileBasedSpellCheckerTest, DirectSolrConnectionTest, ScriptEngineTest, TestNumberUtils, DistributedTermsComponentTest, ZkControllerTest, DefaultValueUpdateProcessorTest, JsonLoaderTest, DistanceFunctionTest, AlternateDirectoryTest, UniqFieldsUpdateProcessorFactoryTest, ResponseLogComponentTest, CopyFieldTest, SolrPluginUtilsTest, PreAnalyzedFieldTest, ResourceLoaderTest, NotRequiredUniqueKeyTest, SolrCoreCheckLockOnStartupTest, TestPHPSerializedResponseWriter, LoggingHandlerTest, TestWordDelimiterFilterFactory, TestLFUCache, BasicDistributedZkTest]
[junit4:junit4] Completed on J0 in 390.66s, 1 test, 1 error <<< FAILURES!

[...truncated 426 lines...]
BUILD FAILED
/usr/home/hudson/hudson-slave/workspace/Lucene-Solr-Tests-4.x-java7/build.xml:346: The following error occurred while executing this line:
/usr/home/hudson/hudson-slave/workspace/Lucene-Solr-Tests-4.x-java7/build.xml:39: The following error occurred while executing this line:
/usr/home/hudson/hudson-slave/workspace/Lucene-Solr-Tests-4.x-java7/solr/build.xml:178: The following error occurred while executing this line:
/usr/home/hudson/hudson-slave/workspace/Lucene-Solr-Tests-4.x-java7/solr/common-build.xml:428: The following error occurred while executing this line:
/usr/home/hudson/hudson-slave/workspace/Lucene-Solr-Tests-4.x-java7/lucene/common-build.xml:1176: The following error occurred while executing this line:
/usr/home/hudson/hudson-slave/workspace/Lucene-Solr-Tests-4.x-java7/lucene/common-build.xml:841: There were test failures: 249 suites, 1040 tests, 1 error, 23 ignored (5 assumptions)

Total time: 36 minutes 39 seconds
Build step 'Invoke Ant' marked build as failure
Archiving artifacts
Recording test results
Email was triggered for: Failure
Sending email for trigger: Failure



Mime
View raw message