lucene-dev mailing list archives

Site index · List index
Message view « Date » · « Thread »
Top « Date » · « Thread »
From Apache Jenkins Server <jenk...@builds.apache.org>
Subject [JENKINS] Lucene-Solr-Tests-trunk-java7 - Build # 3703 - Still Failing
Date Sun, 03 Feb 2013 00:27:55 GMT
Build: https://builds.apache.org/job/Lucene-Solr-Tests-trunk-java7/3703/

3 tests failed.
REGRESSION:  org.apache.solr.cloud.BasicDistributedZkTest.testDistribSearch

Error Message:
Test abandoned because suite timeout was reached.

Stack Trace:
java.lang.Exception: Test abandoned because suite timeout was reached.
	at __randomizedtesting.SeedInfo.seed([68A457610324D72F]:0)


FAILED:  junit.framework.TestSuite.org.apache.solr.cloud.BasicDistributedZkTest

Error Message:
Suite timeout exceeded (>= 7200000 msec).

Stack Trace:
java.lang.Exception: Suite timeout exceeded (>= 7200000 msec).
	at __randomizedtesting.SeedInfo.seed([68A457610324D72F]:0)


FAILED:  org.apache.solr.cloud.SyncSliceTest.testDistribSearch

Error Message:
shard1 should have just been set up to be inconsistent - but it's still consistent

Stack Trace:
java.lang.AssertionError: shard1 should have just been set up to be inconsistent - but it's still consistent
	at __randomizedtesting.SeedInfo.seed([68A457610324D72F:E942D979747BB713]:0)
	at org.junit.Assert.fail(Assert.java:93)
	at org.junit.Assert.assertTrue(Assert.java:43)
	at org.junit.Assert.assertNotNull(Assert.java:526)
	at org.apache.solr.cloud.SyncSliceTest.doTest(SyncSliceTest.java:214)
	at org.apache.solr.BaseDistributedSearchTestCase.testDistribSearch(BaseDistributedSearchTestCase.java:794)
	at sun.reflect.NativeMethodAccessorImpl.invoke0(Native Method)
	at sun.reflect.NativeMethodAccessorImpl.invoke(NativeMethodAccessorImpl.java:57)
	at sun.reflect.DelegatingMethodAccessorImpl.invoke(DelegatingMethodAccessorImpl.java:43)
	at java.lang.reflect.Method.invoke(Method.java:601)
	at com.carrotsearch.randomizedtesting.RandomizedRunner.invoke(RandomizedRunner.java:1559)
	at com.carrotsearch.randomizedtesting.RandomizedRunner.access$600(RandomizedRunner.java:79)
	at com.carrotsearch.randomizedtesting.RandomizedRunner$6.evaluate(RandomizedRunner.java:737)
	at com.carrotsearch.randomizedtesting.RandomizedRunner$7.evaluate(RandomizedRunner.java:773)
	at com.carrotsearch.randomizedtesting.RandomizedRunner$8.evaluate(RandomizedRunner.java:787)
	at com.carrotsearch.randomizedtesting.rules.SystemPropertiesRestoreRule$1.evaluate(SystemPropertiesRestoreRule.java:53)
	at org.apache.lucene.util.TestRuleSetupTeardownChained$1.evaluate(TestRuleSetupTeardownChained.java:50)
	at org.apache.lucene.util.TestRuleFieldCacheSanity$1.evaluate(TestRuleFieldCacheSanity.java:51)
	at org.apache.lucene.util.AbstractBeforeAfterRule$1.evaluate(AbstractBeforeAfterRule.java:46)
	at com.carrotsearch.randomizedtesting.rules.SystemPropertiesInvariantRule$1.evaluate(SystemPropertiesInvariantRule.java:55)
	at org.apache.lucene.util.TestRuleThreadAndTestName$1.evaluate(TestRuleThreadAndTestName.java:49)
	at org.apache.lucene.util.TestRuleIgnoreAfterMaxFailures$1.evaluate(TestRuleIgnoreAfterMaxFailures.java:70)
	at org.apache.lucene.util.TestRuleMarkFailure$1.evaluate(TestRuleMarkFailure.java:48)
	at com.carrotsearch.randomizedtesting.rules.StatementAdapter.evaluate(StatementAdapter.java:36)
	at com.carrotsearch.randomizedtesting.ThreadLeakControl$StatementRunner.run(ThreadLeakControl.java:358)
	at com.carrotsearch.randomizedtesting.ThreadLeakControl.forkTimeoutingTask(ThreadLeakControl.java:782)
	at com.carrotsearch.randomizedtesting.ThreadLeakControl$3.evaluate(ThreadLeakControl.java:442)
	at com.carrotsearch.randomizedtesting.RandomizedRunner.runSingleTest(RandomizedRunner.java:746)
	at com.carrotsearch.randomizedtesting.RandomizedRunner$3.evaluate(RandomizedRunner.java:648)
	at com.carrotsearch.randomizedtesting.RandomizedRunner$4.evaluate(RandomizedRunner.java:682)
	at com.carrotsearch.randomizedtesting.RandomizedRunner$5.evaluate(RandomizedRunner.java:693)
	at com.carrotsearch.randomizedtesting.rules.StatementAdapter.evaluate(StatementAdapter.java:36)
	at com.carrotsearch.randomizedtesting.rules.SystemPropertiesRestoreRule$1.evaluate(SystemPropertiesRestoreRule.java:53)
	at org.apache.lucene.util.AbstractBeforeAfterRule$1.evaluate(AbstractBeforeAfterRule.java:46)
	at org.apache.lucene.util.TestRuleStoreClassName$1.evaluate(TestRuleStoreClassName.java:42)
	at com.carrotsearch.randomizedtesting.rules.SystemPropertiesInvariantRule$1.evaluate(SystemPropertiesInvariantRule.java:55)
	at com.carrotsearch.randomizedtesting.rules.NoShadowingOrOverridesOnMethodsRule$1.evaluate(NoShadowingOrOverridesOnMethodsRule.java:39)
	at com.carrotsearch.randomizedtesting.rules.NoShadowingOrOverridesOnMethodsRule$1.evaluate(NoShadowingOrOverridesOnMethodsRule.java:39)
	at com.carrotsearch.randomizedtesting.rules.StatementAdapter.evaluate(StatementAdapter.java:36)
	at org.apache.lucene.util.TestRuleAssertionsRequired$1.evaluate(TestRuleAssertionsRequired.java:43)
	at org.apache.lucene.util.TestRuleMarkFailure$1.evaluate(TestRuleMarkFailure.java:48)
	at org.apache.lucene.util.TestRuleIgnoreAfterMaxFailures$1.evaluate(TestRuleIgnoreAfterMaxFailures.java:70)
	at org.apache.lucene.util.TestRuleIgnoreTestSuites$1.evaluate(TestRuleIgnoreTestSuites.java:55)
	at com.carrotsearch.randomizedtesting.rules.StatementAdapter.evaluate(StatementAdapter.java:36)
	at com.carrotsearch.randomizedtesting.ThreadLeakControl$StatementRunner.run(ThreadLeakControl.java:358)
	at java.lang.Thread.run(Thread.java:722)




Build Log:
[...truncated 8820 lines...]
[junit4:junit4] Suite: org.apache.solr.cloud.SyncSliceTest
[junit4:junit4]   2> 1 T68 oas.BaseDistributedSearchTestCase.initHostContext Setting hostContext system property: /_pq/
[junit4:junit4]   2> 6 T68 oas.SolrTestCaseJ4.setUp ###Starting testDistribSearch
[junit4:junit4]   2> Creating dataDir: /usr/home/hudson/hudson-slave/workspace/Lucene-Solr-Tests-trunk-java7/solr/build/solr-core/test/J1/./solrtest-SyncSliceTest-1359843844230
[junit4:junit4]   2> 13 T68 oasc.ZkTestServer.run STARTING ZK TEST SERVER
[junit4:junit4]   2> 19 T69 oasc.ZkTestServer$ZKServerMain.runFromConfig Starting server
[junit4:junit4]   2> 91 T69 oaz.Environment.logEnv Server environment:zookeeper.version=3.4.5-1392090, built on 09/30/2012 17:52 GMT
[junit4:junit4]   2> 92 T69 oaz.Environment.logEnv Server environment:host.name=lucene.zones.apache.org
[junit4:junit4]   2> 92 T69 oaz.Environment.logEnv Server environment:java.version=1.7.0_09
[junit4:junit4]   2> 92 T69 oaz.Environment.logEnv Server environment:java.vendor=Oracle Corporation
[junit4:junit4]   2> 92 T69 oaz.Environment.logEnv Server environment:java.home=/usr/local/openjdk7/jre
[junit4:junit4]   2> 92 T69 oaz.Environment.logEnv Server environment:java.class.path=/usr/home/hudson/hudson-slave/workspace/Lucene-Solr-Tests-trunk-java7/solr/build/solr-core/classes/test:/usr/home/hudson/hudson-slave/workspace/Lucene-Solr-Tests-trunk-java7/solr/build/solr-test-framework/classes/java:/usr/home/hudson/hudson-slave/workspace/Lucene-Solr-Tests-trunk-java7/solr/build/solr-core/test-files:/usr/home/hudson/hudson-slave/workspace/Lucene-Solr-Tests-trunk-java7/lucene/build/test-framework/classes/java:/usr/home/hudson/hudson-slave/workspace/Lucene-Solr-Tests-trunk-java7/lucene/build/codecs/classes/java:/usr/home/hudson/hudson-slave/workspace/Lucene-Solr-Tests-trunk-java7/solr/build/solr-solrj/classes/java:/usr/home/hudson/hudson-slave/workspace/Lucene-Solr-Tests-trunk-java7/solr/build/solr-core/classes/java:/usr/home/hudson/hudson-slave/workspace/Lucene-Solr-Tests-trunk-java7/lucene/build/analysis/common/lucene-analyzers-common-5.0-SNAPSHOT.jar:/usr/home/hudson/hudson-slave/workspace/Lucene-Solr-Tests-trunk-java7/lucene/build/analysis/kuromoji/lucene-analyzers-kuromoji-5.0-SNAPSHOT.jar:/usr/home/hudson/hudson-slave/workspace/Lucene-Solr-Tests-trunk-java7/lucene/build/analysis/phonetic/lucene-analyzers-phonetic-5.0-SNAPSHOT.jar:/usr/home/hudson/hudson-slave/workspace/Lucene-Solr-Tests-trunk-java7/lucene/build/highlighter/lucene-highlighter-5.0-SNAPSHOT.jar:/usr/home/hudson/hudson-slave/workspace/Lucene-Solr-Tests-trunk-java7/lucene/build/memory/lucene-memory-5.0-SNAPSHOT.jar:/usr/home/hudson/hudson-slave/workspace/Lucene-Solr-Tests-trunk-java7/lucene/build/misc/lucene-misc-5.0-SNAPSHOT.jar:/usr/home/hudson/hudson-slave/workspace/Lucene-Solr-Tests-trunk-java7/lucene/build/spatial/lucene-spatial-5.0-SNAPSHOT.jar:/usr/home/hudson/hudson-slave/workspace/Lucene-Solr-Tests-trunk-java7/lucene/build/suggest/lucene-suggest-5.0-SNAPSHOT.jar:/usr/home/hudson/hudson-slave/workspace/Lucene-Solr-Tests-trunk-java7/lucene/build/grouping/lucene-grouping-5.0-SNAPSHOT.jar:/usr/home/hudson/hudson-slave/workspace/Lucene-Solr-Tests-trunk-java7/lucene/build/queries/lucene-queries-5.0-SNAPSHOT.jar:/usr/home/hudson/hudson-slave/workspace/Lucene-Solr-Tests-trunk-java7/lucene/build/queryparser/lucene-queryparser-5.0-SNAPSHOT.jar:/usr/home/hudson/hudson-slave/workspace/Lucene-Solr-Tests-trunk-java7/solr/core/lib/cglib-nodep-2.2.jar:/usr/home/hudson/hudson-slave/workspace/Lucene-Solr-Tests-trunk-java7/solr/core/lib/commons-cli-1.2.jar:/usr/home/hudson/hudson-slave/workspace/Lucene-Solr-Tests-trunk-java7/solr/core/lib/commons-codec-1.7.jar:/usr/home/hudson/hudson-slave/workspace/Lucene-Solr-Tests-trunk-java7/solr/core/lib/commons-fileupload-1.2.1.jar:/usr/home/hudson/hudson-slave/workspace/Lucene-Solr-Tests-trunk-java7/solr/core/lib/commons-lang-2.6.jar:/usr/home/hudson/hudson-slave/workspace/Lucene-Solr-Tests-trunk-java7/solr/core/lib/easymock-3.0.jar:/usr/home/hudson/hudson-slave/workspace/Lucene-Solr-Tests-trunk-java7/solr/core/lib/guava-13.0.1.jar:/usr/home/hudson/hudson-slave/workspace/Lucene-Solr-Tests-trunk-java7/solr/core/lib/javax.servlet-api-3.0.1.jar:/usr/home/hudson/hudson-slave/workspace/Lucene-Solr-Tests-trunk-java7/solr/core/lib/objenesis-1.2.jar:/usr/home/hudson/hudson-slave/workspace/Lucene-Solr-Tests-trunk-java7/solr/core/lib/spatial4j-0.3.jar:/usr/home/hudson/hudson-slave/workspace/Lucene-Solr-Tests-trunk-java7/solr/solrj/lib/commons-io-2.1.jar:/usr/home/hudson/hudson-slave/workspace/Lucene-Solr-Tests-trunk-java7/solr/solrj/lib/httpclient-4.1.3.jar:/usr/home/hudson/hudson-slave/workspace/Lucene-Solr-Tests-trunk-java7/solr/solrj/lib/httpcore-4.1.4.jar:/usr/home/hudson/hudson-slave/workspace/Lucene-Solr-Tests-trunk-java7/solr/solrj/lib/httpmime-4.1.3.jar:/usr/home/hudson/hudson-slave/workspace/Lucene-Solr-Tests-trunk-java7/solr/solrj/lib/jcl-over-slf4j-1.6.4.jar:/usr/home/hudson/hudson-slave/workspace/Lucene-Solr-Tests-trunk-java7/solr/solrj/lib/slf4j-api-1.6.4.jar:/usr/home/hudson/hudson-slave/workspace/Lucene-Solr-Tests-trunk-java7/solr/solrj/lib/slf4j-jdk14-1.6.4.jar:/usr/home/hudson/hudson-slave/workspace/Lucene-Solr-Tests-trunk-java7/solr/solrj/lib/wstx-asl-3.2.7.jar:/usr/home/hudson/hudson-slave/workspace/Lucene-Solr-Tests-trunk-java7/solr/solrj/lib/zookeeper-3.4.5.jar:/usr/home/hudson/hudson-slave/workspace/Lucene-Solr-Tests-trunk-java7/solr/example/lib/jetty-continuation-8.1.8.v20121106.jar:/usr/home/hudson/hudson-slave/workspace/Lucene-Solr-Tests-trunk-java7/solr/example/lib/jetty-deploy-8.1.8.v20121106.jar:/usr/home/hudson/hudson-slave/workspace/Lucene-Solr-Tests-trunk-java7/solr/example/lib/jetty-http-8.1.8.v20121106.jar:/usr/home/hudson/hudson-slave/workspace/Lucene-Solr-Tests-trunk-java7/solr/example/lib/jetty-io-8.1.8.v20121106.jar:/usr/home/hudson/hudson-slave/workspace/Lucene-Solr-Tests-trunk-java7/solr/example/lib/jetty-jmx-8.1.8.v20121106.jar:/usr/home/hudson/hudson-slave/workspace/Lucene-Solr-Tests-trunk-java7/solr/example/lib/jetty-security-8.1.8.v20121106.jar:/usr/home/hudson/hudson-slave/workspace/Lucene-Solr-Tests-trunk-java7/solr/example/lib/jetty-server-8.1.8.v20121106.jar:/usr/home/hudson/hudson-slave/workspace/Lucene-Solr-Tests-trunk-java7/solr/example/lib/jetty-servlet-8.1.8.v20121106.jar:/usr/home/hudson/hudson-slave/workspace/Lucene-Solr-Tests-trunk-java7/solr/example/lib/jetty-util-8.1.8.v20121106.jar:/usr/home/hudson/hudson-slave/workspace/Lucene-Solr-Tests-trunk-java7/solr/example/lib/jetty-webapp-8.1.8.v20121106.jar:/usr/home/hudson/hudson-slave/workspace/Lucene-Solr-Tests-trunk-java7/solr/example/lib/jetty-xml-8.1.8.v20121106.jar:/usr/home/hudson/hudson-slave/workspace/Lucene-Solr-Tests-trunk-java7/solr/example/lib/servlet-api-3.0.jar:/usr/home/hudson/hudson-slave/workspace/Lucene-Solr-Tests-trunk-java7/solr/example/example-DIH/solr/db/lib/derby-10.9.1.0.jar:/usr/home/hudson/hudson-slave/workspace/Lucene-Solr-Tests-trunk-java7/solr/example/example-DIH/solr/db/lib/hsqldb-1.8.0.10.jar:/usr/home/hudson/hudson-slave/workspace/Lucene-Solr-Tests-trunk-java7/lucene/build/core/classes/java:/usr/home/hudson/hudson-slave/workspace/Lucene-Solr-Tests-trunk-java7/lucene/test-framework/lib/junit-4.10.jar:/usr/home/hudson/hudson-slave/workspace/Lucene-Solr-Tests-trunk-java7/lucene/test-framework/lib/randomizedtesting-runner-2.0.8.jar:/home/hudson/hudson-slave/tools/hudson.tasks.Ant_AntInstallation/ant-1.8.2/lib/ant-launcher.jar:/home/hudson/.ant/lib/ivy-2.2.0.jar:/home/hudson/hudson-slave/tools/hudson.tasks.Ant_AntInstallation/ant-1.8.2/lib/ant-commons-logging.jar:/home/hudson/hudson-slave/tools/hudson.tasks.Ant_AntInstallation/ant-1.8.2/lib/ant-apache-regexp.jar:/home/hudson/hudson-slave/tools/hudson.tasks.Ant_AntInstallation/ant-1.8.2/lib/ant-apache-oro.jar:/home/hudson/hudson-slave/tools/hudson.tasks.Ant_AntInstallation/ant-1.8.2/lib/ant-swing.jar:/home/hudson/hudson-slave/tools/hudson.tasks.Ant_AntInstallation/ant-1.8.2/lib/ant-jdepend.jar:/home/hudson/hudson-slave/tools/hudson.tasks.Ant_AntInstallation/ant-1.8.2/lib/ant-apache-xalan2.jar:/home/hudson/hudson-slave/tools/hudson.tasks.Ant_AntInstallation/ant-1.8.2/lib/ant-apache-bsf.jar:/home/hudson/hudson-slave/tools/hudson.tasks.Ant_AntInstallation/ant-1.8.2/lib/ant-junit4.jar:/home/hudson/hudson-slave/tools/hudson.tasks.Ant_AntInstallation/ant-1.8.2/lib/ant-commons-net.jar:/home/hudson/hudson-slave/tools/hudson.tasks.Ant_AntInstallation/ant-1.8.2/lib/ant-antlr.jar:/home/hudson/hudson-slave/tools/hudson.tasks.Ant_AntInstallation/ant-1.8.2/lib/ant-junit.jar:/home/hudson/hudson-slave/tools/hudson.tasks.Ant_AntInstallation/ant-1.8.2/lib/ant-jmf.jar:/home/hudson/hudson-slave/tools/hudson.tasks.Ant_AntInstallation/ant-1.8.2/lib/ant-netrexx.jar:/home/hudson/hudson-slave/tools/hudson.tasks.Ant_AntInstallation/ant-1.8.2/lib/ant-apache-log4j.jar:/home/hudson/hudson-slave/tools/hudson.tasks.Ant_AntInstallation/ant-1.8.2/lib/ant-apache-resolver.jar:/home/hudson/hudson-slave/tools/hudson.tasks.Ant_AntInstallation/ant-1.8.2/lib/ant.jar:/home/hudson/hudson-slave/tools/hudson.tasks.Ant_AntInstallation/ant-1.8.2/lib/ant-jsch.jar:/home/hudson/hudson-slave/tools/hudson.tasks.Ant_AntInstallation/ant-1.8.2/lib/ant-testutil.jar:/home/hudson/hudson-slave/tools/hudson.tasks.Ant_AntInstallation/ant-1.8.2/lib/ant-apache-bcel.jar:/home/hudson/hudson-slave/tools/hudson.tasks.Ant_AntInstallation/ant-1.8.2/lib/ant-jai.jar:/home/hudson/hudson-slave/tools/hudson.tasks.Ant_AntInstallation/ant-1.8.2/lib/ant-javamail.jar:/usr/local/openjdk7/lib/tools.jar:/home/hudson/.ivy2/cache/com.carrotsearch.randomizedtesting/junit4-ant/jars/junit4-ant-2.0.8.jar
[junit4:junit4]   2> 94 T69 oaz.Environment.logEnv Server environment:java.library.path=/usr/local/openjdk7/jre/lib/amd64/server:/usr/local/openjdk7/jre/lib/amd64:/usr/local/openjdk7/jre/../lib/amd64:/usr/local/openjdk6/jre/lib/amd64/server:/usr/local/openjdk6/jre/lib/amd64:/usr/local/openjdk6/jre/../lib/amd64:/usr/java/packages/lib/amd64:/lib:/usr/lib:/usr/local/lib
[junit4:junit4]   2> 94 T69 oaz.Environment.logEnv Server environment:java.io.tmpdir=.
[junit4:junit4]   2> 94 T69 oaz.Environment.logEnv Server environment:java.compiler=<NA>
[junit4:junit4]   2> 94 T69 oaz.Environment.logEnv Server environment:os.name=FreeBSD
[junit4:junit4]   2> 95 T69 oaz.Environment.logEnv Server environment:os.arch=amd64
[junit4:junit4]   2> 95 T69 oaz.Environment.logEnv Server environment:os.version=9.0-RELEASE
[junit4:junit4]   2> 95 T69 oaz.Environment.logEnv Server environment:user.name=hudson
[junit4:junit4]   2> 95 T69 oaz.Environment.logEnv Server environment:user.home=/home/hudson
[junit4:junit4]   2> 95 T69 oaz.Environment.logEnv Server environment:user.dir=/usr/home/hudson/hudson-slave/workspace/Lucene-Solr-Tests-trunk-java7/solr/build/solr-core/test/J1
[junit4:junit4]   2> 139 T69 oazs.ZooKeeperServer.setTickTime tickTime set to 1000
[junit4:junit4]   2> 140 T69 oazs.ZooKeeperServer.setMinSessionTimeout minSessionTimeout set to -1
[junit4:junit4]   2> 140 T69 oazs.ZooKeeperServer.setMaxSessionTimeout maxSessionTimeout set to -1
[junit4:junit4]   2> 146 T69 oazs.NIOServerCnxnFactory.configure binding to port 0.0.0.0/0.0.0.0:0
[junit4:junit4]   2> 219 T69 oazsp.FileTxnSnapLog.save Snapshotting: 0x0 to /usr/home/hudson/hudson-slave/workspace/Lucene-Solr-Tests-trunk-java7/solr/build/solr-core/test/J1/./org.apache.solr.cloud.SyncSliceTest-1359843844230/zookeeper/server1/data/version-2/snapshot.0
[junit4:junit4]   2> 220 T68 oasc.ZkTestServer.run start zk server on port:16522
[junit4:junit4]   2> 290 T68 oaz.Environment.logEnv Client environment:zookeeper.version=3.4.5-1392090, built on 09/30/2012 17:52 GMT
[junit4:junit4]   2> 291 T68 oaz.Environment.logEnv Client environment:host.name=lucene.zones.apache.org
[junit4:junit4]   2> 291 T68 oaz.Environment.logEnv Client environment:java.version=1.7.0_09
[junit4:junit4]   2> 292 T68 oaz.Environment.logEnv Client environment:java.vendor=Oracle Corporation
[junit4:junit4]   2> 292 T68 oaz.Environment.logEnv Client environment:java.home=/usr/local/openjdk7/jre
[junit4:junit4]   2> 292 T68 oaz.Environment.logEnv Client environment:java.class.path=/usr/home/hudson/hudson-slave/workspace/Lucene-Solr-Tests-trunk-java7/solr/build/solr-core/classes/test:/usr/home/hudson/hudson-slave/workspace/Lucene-Solr-Tests-trunk-java7/solr/build/solr-test-framework/classes/java:/usr/home/hudson/hudson-slave/workspace/Lucene-Solr-Tests-trunk-java7/solr/build/solr-core/test-files:/usr/home/hudson/hudson-slave/workspace/Lucene-Solr-Tests-trunk-java7/lucene/build/test-framework/classes/java:/usr/home/hudson/hudson-slave/workspace/Lucene-Solr-Tests-trunk-java7/lucene/build/codecs/classes/java:/usr/home/hudson/hudson-slave/workspace/Lucene-Solr-Tests-trunk-java7/solr/build/solr-solrj/classes/java:/usr/home/hudson/hudson-slave/workspace/Lucene-Solr-Tests-trunk-java7/solr/build/solr-core/classes/java:/usr/home/hudson/hudson-slave/workspace/Lucene-Solr-Tests-trunk-java7/lucene/build/analysis/common/lucene-analyzers-common-5.0-SNAPSHOT.jar:/usr/home/hudson/hudson-slave/workspace/Lucene-Solr-Tests-trunk-java7/lucene/build/analysis/kuromoji/lucene-analyzers-kuromoji-5.0-SNAPSHOT.jar:/usr/home/hudson/hudson-slave/workspace/Lucene-Solr-Tests-trunk-java7/lucene/build/analysis/phonetic/lucene-analyzers-phonetic-5.0-SNAPSHOT.jar:/usr/home/hudson/hudson-slave/workspace/Lucene-Solr-Tests-trunk-java7/lucene/build/highlighter/lucene-highlighter-5.0-SNAPSHOT.jar:/usr/home/hudson/hudson-slave/workspace/Lucene-Solr-Tests-trunk-java7/lucene/build/memory/lucene-memory-5.0-SNAPSHOT.jar:/usr/home/hudson/hudson-slave/workspace/Lucene-Solr-Tests-trunk-java7/lucene/build/misc/lucene-misc-5.0-SNAPSHOT.jar:/usr/home/hudson/hudson-slave/workspace/Lucene-Solr-Tests-trunk-java7/lucene/build/spatial/lucene-spatial-5.0-SNAPSHOT.jar:/usr/home/hudson/hudson-slave/workspace/Lucene-Solr-Tests-trunk-java7/lucene/build/suggest/lucene-suggest-5.0-SNAPSHOT.jar:/usr/home/hudson/hudson-slave/workspace/Lucene-Solr-Tests-trunk-java7/lucene/build/grouping/lucene-grouping-5.0-SNAPSHOT.jar:/usr/home/hudson/hudson-slave/workspace/Lucene-Solr-Tests-trunk-java7/lucene/build/queries/lucene-queries-5.0-SNAPSHOT.jar:/usr/home/hudson/hudson-slave/workspace/Lucene-Solr-Tests-trunk-java7/lucene/build/queryparser/lucene-queryparser-5.0-SNAPSHOT.jar:/usr/home/hudson/hudson-slave/workspace/Lucene-Solr-Tests-trunk-java7/solr/core/lib/cglib-nodep-2.2.jar:/usr/home/hudson/hudson-slave/workspace/Lucene-Solr-Tests-trunk-java7/solr/core/lib/commons-cli-1.2.jar:/usr/home/hudson/hudson-slave/workspace/Lucene-Solr-Tests-trunk-java7/solr/core/lib/commons-codec-1.7.jar:/usr/home/hudson/hudson-slave/workspace/Lucene-Solr-Tests-trunk-java7/solr/core/lib/commons-fileupload-1.2.1.jar:/usr/home/hudson/hudson-slave/workspace/Lucene-Solr-Tests-trunk-java7/solr/core/lib/commons-lang-2.6.jar:/usr/home/hudson/hudson-slave/workspace/Lucene-Solr-Tests-trunk-java7/solr/core/lib/easymock-3.0.jar:/usr/home/hudson/hudson-slave/workspace/Lucene-Solr-Tests-trunk-java7/solr/core/lib/guava-13.0.1.jar:/usr/home/hudson/hudson-slave/workspace/Lucene-Solr-Tests-trunk-java7/solr/core/lib/javax.servlet-api-3.0.1.jar:/usr/home/hudson/hudson-slave/workspace/Lucene-Solr-Tests-trunk-java7/solr/core/lib/objenesis-1.2.jar:/usr/home/hudson/hudson-slave/workspace/Lucene-Solr-Tests-trunk-java7/solr/core/lib/spatial4j-0.3.jar:/usr/home/hudson/hudson-slave/workspace/Lucene-Solr-Tests-trunk-java7/solr/solrj/lib/commons-io-2.1.jar:/usr/home/hudson/hudson-slave/workspace/Lucene-Solr-Tests-trunk-java7/solr/solrj/lib/httpclient-4.1.3.jar:/usr/home/hudson/hudson-slave/workspace/Lucene-Solr-Tests-trunk-java7/solr/solrj/lib/httpcore-4.1.4.jar:/usr/home/hudson/hudson-slave/workspace/Lucene-Solr-Tests-trunk-java7/solr/solrj/lib/httpmime-4.1.3.jar:/usr/home/hudson/hudson-slave/workspace/Lucene-Solr-Tests-trunk-java7/solr/solrj/lib/jcl-over-slf4j-1.6.4.jar:/usr/home/hudson/hudson-slave/workspace/Lucene-Solr-Tests-trunk-java7/solr/solrj/lib/slf4j-api-1.6.4.jar:/usr/home/hudson/hudson-slave/workspace/Lucene-Solr-Tests-trunk-java7/solr/solrj/lib/slf4j-jdk14-1.6.4.jar:/usr/home/hudson/hudson-slave/workspace/Lucene-Solr-Tests-trunk-java7/solr/solrj/lib/wstx-asl-3.2.7.jar:/usr/home/hudson/hudson-slave/workspace/Lucene-Solr-Tests-trunk-java7/solr/solrj/lib/zookeeper-3.4.5.jar:/usr/home/hudson/hudson-slave/workspace/Lucene-Solr-Tests-trunk-java7/solr/example/lib/jetty-continuation-8.1.8.v20121106.jar:/usr/home/hudson/hudson-slave/workspace/Lucene-Solr-Tests-trunk-java7/solr/example/lib/jetty-deploy-8.1.8.v20121106.jar:/usr/home/hudson/hudson-slave/workspace/Lucene-Solr-Tests-trunk-java7/solr/example/lib/jetty-http-8.1.8.v20121106.jar:/usr/home/hudson/hudson-slave/workspace/Lucene-Solr-Tests-trunk-java7/solr/example/lib/jetty-io-8.1.8.v20121106.jar:/usr/home/hudson/hudson-slave/workspace/Lucene-Solr-Tests-trunk-java7/solr/example/lib/jetty-jmx-8.1.8.v20121106.jar:/usr/home/hudson/hudson-slave/workspace/Lucene-Solr-Tests-trunk-java7/solr/example/lib/jetty-security-8.1.8.v20121106.jar:/usr/home/hudson/hudson-slave/workspace/Lucene-Solr-Tests-trunk-java7/solr/example/lib/jetty-server-8.1.8.v20121106.jar:/usr/home/hudson/hudson-slave/workspace/Lucene-Solr-Tests-trunk-java7/solr/example/lib/jetty-servlet-8.1.8.v20121106.jar:/usr/home/hudson/hudson-slave/workspace/Lucene-Solr-Tests-trunk-java7/solr/example/lib/jetty-util-8.1.8.v20121106.jar:/usr/home/hudson/hudson-slave/workspace/Lucene-Solr-Tests-trunk-java7/solr/example/lib/jetty-webapp-8.1.8.v20121106.jar:/usr/home/hudson/hudson-slave/workspace/Lucene-Solr-Tests-trunk-java7/solr/example/lib/jetty-xml-8.1.8.v20121106.jar:/usr/home/hudson/hudson-slave/workspace/Lucene-Solr-Tests-trunk-java7/solr/example/lib/servlet-api-3.0.jar:/usr/home/hudson/hudson-slave/workspace/Lucene-Solr-Tests-trunk-java7/solr/example/example-DIH/solr/db/lib/derby-10.9.1.0.jar:/usr/home/hudson/hudson-slave/workspace/Lucene-Solr-Tests-trunk-java7/solr/example/example-DIH/solr/db/lib/hsqldb-1.8.0.10.jar:/usr/home/hudson/hudson-slave/workspace/Lucene-Solr-Tests-trunk-java7/lucene/build/core/classes/java:/usr/home/hudson/hudson-slave/workspace/Lucene-Solr-Tests-trunk-java7/lucene/test-framework/lib/junit-4.10.jar:/usr/home/hudson/hudson-slave/workspace/Lucene-Solr-Tests-trunk-java7/lucene/test-framework/lib/randomizedtesting-runner-2.0.8.jar:/home/hudson/hudson-slave/tools/hudson.tasks.Ant_AntInstallation/ant-1.8.2/lib/ant-launcher.jar:/home/hudson/.ant/lib/ivy-2.2.0.jar:/home/hudson/hudson-slave/tools/hudson.tasks.Ant_AntInstallation/ant-1.8.2/lib/ant-commons-logging.jar:/home/hudson/hudson-slave/tools/hudson.tasks.Ant_AntInstallation/ant-1.8.2/lib/ant-apache-regexp.jar:/home/hudson/hudson-slave/tools/hudson.tasks.Ant_AntInstallation/ant-1.8.2/lib/ant-apache-oro.jar:/home/hudson/hudson-slave/tools/hudson.tasks.Ant_AntInstallation/ant-1.8.2/lib/ant-swing.jar:/home/hudson/hudson-slave/tools/hudson.tasks.Ant_AntInstallation/ant-1.8.2/lib/ant-jdepend.jar:/home/hudson/hudson-slave/tools/hudson.tasks.Ant_AntInstallation/ant-1.8.2/lib/ant-apache-xalan2.jar:/home/hudson/hudson-slave/tools/hudson.tasks.Ant_AntInstallation/ant-1.8.2/lib/ant-apache-bsf.jar:/home/hudson/hudson-slave/tools/hudson.tasks.Ant_AntInstallation/ant-1.8.2/lib/ant-junit4.jar:/home/hudson/hudson-slave/tools/hudson.tasks.Ant_AntInstallation/ant-1.8.2/lib/ant-commons-net.jar:/home/hudson/hudson-slave/tools/hudson.tasks.Ant_AntInstallation/ant-1.8.2/lib/ant-antlr.jar:/home/hudson/hudson-slave/tools/hudson.tasks.Ant_AntInstallation/ant-1.8.2/lib/ant-junit.jar:/home/hudson/hudson-slave/tools/hudson.tasks.Ant_AntInstallation/ant-1.8.2/lib/ant-jmf.jar:/home/hudson/hudson-slave/tools/hudson.tasks.Ant_AntInstallation/ant-1.8.2/lib/ant-netrexx.jar:/home/hudson/hudson-slave/tools/hudson.tasks.Ant_AntInstallation/ant-1.8.2/lib/ant-apache-log4j.jar:/home/hudson/hudson-slave/tools/hudson.tasks.Ant_AntInstallation/ant-1.8.2/lib/ant-apache-resolver.jar:/home/hudson/hudson-slave/tools/hudson.tasks.Ant_AntInstallation/ant-1.8.2/lib/ant.jar:/home/hudson/hudson-slave/tools/hudson.tasks.Ant_AntInstallation/ant-1.8.2/lib/ant-jsch.jar:/home/hudson/hudson-slave/tools/hudson.tasks.Ant_AntInstallation/ant-1.8.2/lib/ant-testutil.jar:/home/hudson/hudson-slave/tools/hudson.tasks.Ant_AntInstallation/ant-1.8.2/lib/ant-apache-bcel.jar:/home/hudson/hudson-slave/tools/hudson.tasks.Ant_AntInstallation/ant-1.8.2/lib/ant-jai.jar:/home/hudson/hudson-slave/tools/hudson.tasks.Ant_AntInstallation/ant-1.8.2/lib/ant-javamail.jar:/usr/local/openjdk7/lib/tools.jar:/home/hudson/.ivy2/cache/com.carrotsearch.randomizedtesting/junit4-ant/jars/junit4-ant-2.0.8.jar
[junit4:junit4]   2> 294 T68 oaz.Environment.logEnv Client environment:java.library.path=/usr/local/openjdk7/jre/lib/amd64/server:/usr/local/openjdk7/jre/lib/amd64:/usr/local/openjdk7/jre/../lib/amd64:/usr/local/openjdk6/jre/lib/amd64/server:/usr/local/openjdk6/jre/lib/amd64:/usr/local/openjdk6/jre/../lib/amd64:/usr/java/packages/lib/amd64:/lib:/usr/lib:/usr/local/lib
[junit4:junit4]   2> 294 T68 oaz.Environment.logEnv Client environment:java.io.tmpdir=.
[junit4:junit4]   2> 294 T68 oaz.Environment.logEnv Client environment:java.compiler=<NA>
[junit4:junit4]   2> 295 T68 oaz.Environment.logEnv Client environment:os.name=FreeBSD
[junit4:junit4]   2> 295 T68 oaz.Environment.logEnv Client environment:os.arch=amd64
[junit4:junit4]   2> 296 T68 oaz.Environment.logEnv Client environment:os.version=9.0-RELEASE
[junit4:junit4]   2> 296 T68 oaz.Environment.logEnv Client environment:user.name=hudson
[junit4:junit4]   2> 296 T68 oaz.Environment.logEnv Client environment:user.home=/home/hudson
[junit4:junit4]   2> 297 T68 oaz.Environment.logEnv Client environment:user.dir=/usr/home/hudson/hudson-slave/workspace/Lucene-Solr-Tests-trunk-java7/solr/build/solr-core/test/J1
[junit4:junit4]   2> 301 T68 oaz.ZooKeeper.<init> Initiating client connection, connectString=127.0.0.1:16522 sessionTimeout=10000 watcher=org.apache.solr.common.cloud.ConnectionManager@5cccc9d8
[junit4:junit4]   2> 366 T68 oascc.ConnectionManager.waitForConnected Waiting for client to connect to ZooKeeper
[junit4:junit4]   2> 376 T74 oaz.ClientCnxn$SendThread.logStartConnect Opening socket connection to server localhost/127.0.0.1:16522. Will not attempt to authenticate using SASL (access denied ("javax.security.auth.AuthPermission" "getLoginConfiguration"))
[junit4:junit4]   2> 379 T74 oaz.ClientCnxn$SendThread.primeConnection Socket connection established to localhost/127.0.0.1:16522, initiating session
[junit4:junit4]   2> 380 T70 oazs.NIOServerCnxnFactory.run Accepted socket connection from /140.211.11.196:35339
[junit4:junit4]   2> 412 T70 oazs.ZooKeeperServer.processConnectRequest Client attempting to establish new session at /140.211.11.196:35339
[junit4:junit4]   2> 428 T72 oazsp.FileTxnLog.append Creating new log file: log.1
[junit4:junit4]   2> 462 T72 oazs.ZooKeeperServer.finishSessionInit Established session 0x13c9d02617d0000 with negotiated timeout 10000 for client /140.211.11.196:35339
[junit4:junit4]   2> 462 T74 oaz.ClientCnxn$SendThread.onConnected Session establishment complete on server localhost/127.0.0.1:16522, sessionid = 0x13c9d02617d0000, negotiated timeout = 10000
[junit4:junit4]   2> 468 T75 oascc.ConnectionManager.process Watcher org.apache.solr.common.cloud.ConnectionManager@5cccc9d8 name:ZooKeeperConnection Watcher:127.0.0.1:16522 got event WatchedEvent state:SyncConnected type:None path:null path:null type:None
[junit4:junit4]   2> 469 T68 oascc.ConnectionManager.waitForConnected Client is connected to ZooKeeper
[junit4:junit4]   2> 470 T68 oascc.SolrZkClient.makePath makePath: /solr
[junit4:junit4]   2> 530 T73 oazs.PrepRequestProcessor.pRequest2Txn Processed session termination for sessionid: 0x13c9d02617d0000
[junit4:junit4]   2> 531 T75 oaz.ClientCnxn$EventThread.run EventThread shut down
[junit4:junit4]   2> 531 T68 oaz.ZooKeeper.close Session: 0x13c9d02617d0000 closed
[junit4:junit4]   2> 532 T70 oazs.NIOServerCnxn.closeSock Closed socket connection for client /140.211.11.196:35339 which had sessionid 0x13c9d02617d0000
[junit4:junit4]   2> 532 T68 oaz.ZooKeeper.<init> Initiating client connection, connectString=127.0.0.1:16522/solr sessionTimeout=10000 watcher=org.apache.solr.common.cloud.ConnectionManager@f2d5171
[junit4:junit4]   2> 533 T68 oascc.ConnectionManager.waitForConnected Waiting for client to connect to ZooKeeper
[junit4:junit4]   2> 533 T76 oaz.ClientCnxn$SendThread.logStartConnect Opening socket connection to server localhost/127.0.0.1:16522. Will not attempt to authenticate using SASL (access denied ("javax.security.auth.AuthPermission" "getLoginConfiguration"))
[junit4:junit4]   2> 534 T76 oaz.ClientCnxn$SendThread.primeConnection Socket connection established to localhost/127.0.0.1:16522, initiating session
[junit4:junit4]   2> 534 T70 oazs.NIOServerCnxnFactory.run Accepted socket connection from /140.211.11.196:44969
[junit4:junit4]   2> 535 T70 oazs.ZooKeeperServer.processConnectRequest Client attempting to establish new session at /140.211.11.196:44969
[junit4:junit4]   2> 543 T72 oazs.ZooKeeperServer.finishSessionInit Established session 0x13c9d02617d0001 with negotiated timeout 10000 for client /140.211.11.196:44969
[junit4:junit4]   2> 543 T76 oaz.ClientCnxn$SendThread.onConnected Session establishment complete on server localhost/127.0.0.1:16522, sessionid = 0x13c9d02617d0001, negotiated timeout = 10000
[junit4:junit4]   2> 544 T77 oascc.ConnectionManager.process Watcher org.apache.solr.common.cloud.ConnectionManager@f2d5171 name:ZooKeeperConnection Watcher:127.0.0.1:16522/solr got event WatchedEvent state:SyncConnected type:None path:null path:null type:None
[junit4:junit4]   2> 544 T68 oascc.ConnectionManager.waitForConnected Client is connected to ZooKeeper
[junit4:junit4]   2> 544 T68 oascc.SolrZkClient.makePath makePath: /collections/collection1
[junit4:junit4]   2> 550 T68 oascc.SolrZkClient.makePath makePath: /collections/collection1/shards
[junit4:junit4]   2> 555 T68 oascc.SolrZkClient.makePath makePath: /collections/control_collection
[junit4:junit4]   2> 558 T68 oascc.SolrZkClient.makePath makePath: /collections/control_collection/shards
[junit4:junit4]   2> 565 T68 oasc.AbstractZkTestCase.putConfig put /usr/home/hudson/hudson-slave/workspace/Lucene-Solr-Tests-trunk-java7/solr/build/solr-core/test-files/solr/collection1/conf/solrconfig.xml to /configs/conf1/solrconfig.xml
[junit4:junit4]   2> 588 T68 oascc.SolrZkClient.makePath makePath: /configs/conf1/solrconfig.xml
[junit4:junit4]   2> 602 T68 oasc.AbstractZkTestCase.putConfig put /usr/home/hudson/hudson-slave/workspace/Lucene-Solr-Tests-trunk-java7/solr/build/solr-core/test-files/solr/collection1/conf/schema.xml to /configs/conf1/schema.xml
[junit4:junit4]   2> 611 T68 oascc.SolrZkClient.makePath makePath: /configs/conf1/schema.xml
[junit4:junit4]   2> 717 T68 oasc.AbstractZkTestCase.putConfig put /usr/home/hudson/hudson-slave/workspace/Lucene-Solr-Tests-trunk-java7/solr/build/solr-core/test-files/solr/collection1/conf/stopwords.txt to /configs/conf1/stopwords.txt
[junit4:junit4]   2> 718 T68 oascc.SolrZkClient.makePath makePath: /configs/conf1/stopwords.txt
[junit4:junit4]   2> 723 T68 oasc.AbstractZkTestCase.putConfig put /usr/home/hudson/hudson-slave/workspace/Lucene-Solr-Tests-trunk-java7/solr/build/solr-core/test-files/solr/collection1/conf/protwords.txt to /configs/conf1/protwords.txt
[junit4:junit4]   2> 723 T68 oascc.SolrZkClient.makePath makePath: /configs/conf1/protwords.txt
[junit4:junit4]   2> 728 T68 oasc.AbstractZkTestCase.putConfig put /usr/home/hudson/hudson-slave/workspace/Lucene-Solr-Tests-trunk-java7/solr/build/solr-core/test-files/solr/collection1/conf/currency.xml to /configs/conf1/currency.xml
[junit4:junit4]   2> 728 T68 oascc.SolrZkClient.makePath makePath: /configs/conf1/currency.xml
[junit4:junit4]   2> 732 T68 oasc.AbstractZkTestCase.putConfig put /usr/home/hudson/hudson-slave/workspace/Lucene-Solr-Tests-trunk-java7/solr/build/solr-core/test-files/solr/collection1/conf/open-exchange-rates.json to /configs/conf1/open-exchange-rates.json
[junit4:junit4]   2> 733 T68 oascc.SolrZkClient.makePath makePath: /configs/conf1/open-exchange-rates.json
[junit4:junit4]   2> 737 T68 oasc.AbstractZkTestCase.putConfig put /usr/home/hudson/hudson-slave/workspace/Lucene-Solr-Tests-trunk-java7/solr/build/solr-core/test-files/solr/collection1/conf/mapping-ISOLatin1Accent.txt to /configs/conf1/mapping-ISOLatin1Accent.txt
[junit4:junit4]   2> 738 T68 oascc.SolrZkClient.makePath makePath: /configs/conf1/mapping-ISOLatin1Accent.txt
[junit4:junit4]   2> 743 T68 oasc.AbstractZkTestCase.putConfig put /usr/home/hudson/hudson-slave/workspace/Lucene-Solr-Tests-trunk-java7/solr/build/solr-core/test-files/solr/collection1/conf/old_synonyms.txt to /configs/conf1/old_synonyms.txt
[junit4:junit4]   2> 743 T68 oascc.SolrZkClient.makePath makePath: /configs/conf1/old_synonyms.txt
[junit4:junit4]   2> 747 T68 oasc.AbstractZkTestCase.putConfig put /usr/home/hudson/hudson-slave/workspace/Lucene-Solr-Tests-trunk-java7/solr/build/solr-core/test-files/solr/collection1/conf/synonyms.txt to /configs/conf1/synonyms.txt
[junit4:junit4]   2> 748 T68 oascc.SolrZkClient.makePath makePath: /configs/conf1/synonyms.txt
[junit4:junit4]   2> 752 T73 oazs.PrepRequestProcessor.pRequest2Txn Processed session termination for sessionid: 0x13c9d02617d0001
[junit4:junit4]   2> 753 T77 oaz.ClientCnxn$EventThread.run EventThread shut down
[junit4:junit4]   2> 753 T70 oazs.NIOServerCnxn.closeSock Closed socket connection for client /140.211.11.196:44969 which had sessionid 0x13c9d02617d0001
[junit4:junit4]   2> 753 T68 oaz.ZooKeeper.close Session: 0x13c9d02617d0001 closed
[junit4:junit4]   2> 893 T68 oejs.Server.doStart jetty-8.1.8.v20121106
[junit4:junit4]   2> 897 T68 oejs.AbstractConnector.doStart Started SocketConnector@127.0.0.1:15097
[junit4:junit4]   2> 897 T68 oass.SolrDispatchFilter.init SolrDispatchFilter.init()
[junit4:junit4]   2> 898 T68 oasc.SolrResourceLoader.locateSolrHome JNDI not configured for solr (NoInitialContextEx)
[junit4:junit4]   2> 898 T68 oasc.SolrResourceLoader.locateSolrHome using system property solr.solr.home: /usr/home/hudson/hudson-slave/workspace/Lucene-Solr-Tests-trunk-java7/solr/build/solr-core/test/J1/./org.apache.solr.cloud.SyncSliceTest-controljetty-1359843844978
[junit4:junit4]   2> 899 T68 oasc.CoreContainer$Initializer.initialize looking for solr.xml: /usr/home/hudson/hudson-slave/workspace/Lucene-Solr-Tests-trunk-java7/solr/build/solr-core/test/J1/./org.apache.solr.cloud.SyncSliceTest-controljetty-1359843844978/solr.xml
[junit4:junit4]   2> 899 T68 oasc.CoreContainer.<init> New CoreContainer 196684649
[junit4:junit4]   2> 900 T68 oasc.CoreContainer.load Loading CoreContainer using Solr Home: '/usr/home/hudson/hudson-slave/workspace/Lucene-Solr-Tests-trunk-java7/solr/build/solr-core/test/J1/./org.apache.solr.cloud.SyncSliceTest-controljetty-1359843844978/'
[junit4:junit4]   2> 900 T68 oasc.SolrResourceLoader.<init> new SolrResourceLoader for directory: '/usr/home/hudson/hudson-slave/workspace/Lucene-Solr-Tests-trunk-java7/solr/build/solr-core/test/J1/./org.apache.solr.cloud.SyncSliceTest-controljetty-1359843844978/'
[junit4:junit4]   2> 960 T68 oashc.HttpShardHandlerFactory.getParameter Setting socketTimeout to: 60000
[junit4:junit4]   2> 960 T68 oashc.HttpShardHandlerFactory.getParameter Setting urlScheme to: http://
[junit4:junit4]   2> 961 T68 oashc.HttpShardHandlerFactory.getParameter Setting connTimeout to: 15000
[junit4:junit4]   2> 962 T68 oashc.HttpShardHandlerFactory.getParameter Setting maxConnectionsPerHost to: 20
[junit4:junit4]   2> 962 T68 oashc.HttpShardHandlerFactory.getParameter Setting corePoolSize to: 0
[junit4:junit4]   2> 963 T68 oashc.HttpShardHandlerFactory.getParameter Setting maximumPoolSize to: 2147483647
[junit4:junit4]   2> 963 T68 oashc.HttpShardHandlerFactory.getParameter Setting maxThreadIdleTime to: 5
[junit4:junit4]   2> 964 T68 oashc.HttpShardHandlerFactory.getParameter Setting sizeOfQueue to: -1
[junit4:junit4]   2> 964 T68 oashc.HttpShardHandlerFactory.getParameter Setting fairnessPolicy to: false
[junit4:junit4]   2> 965 T68 oascsi.HttpClientUtil.createClient Creating new http client, config:maxConnectionsPerHost=20&maxConnections=10000&socketTimeout=60000&connTimeout=15000&retry=false
[junit4:junit4]   2> 994 T68 oasc.CoreContainer.load Registering Log Listener
[junit4:junit4]   2> 1021 T68 oasc.CoreContainer.initZooKeeper Zookeeper client=127.0.0.1:16522/solr
[junit4:junit4]   2> 1056 T68 oasc.ZkController.checkChrootPath zkHost includes chroot
[junit4:junit4]   2> 1057 T68 oaz.ZooKeeper.<init> Initiating client connection, connectString=127.0.0.1:16522 sessionTimeout=60000 watcher=org.apache.solr.common.cloud.ConnectionManager@71f1ce16
[junit4:junit4]   2> 1058 T68 oascc.ConnectionManager.waitForConnected Waiting for client to connect to ZooKeeper
[junit4:junit4]   2> 1059 T87 oaz.ClientCnxn$SendThread.logStartConnect Opening socket connection to server localhost/127.0.0.1:16522. Will not attempt to authenticate using SASL (access denied ("javax.security.auth.AuthPermission" "getLoginConfiguration"))
[junit4:junit4]   2> 1059 T87 oaz.ClientCnxn$SendThread.primeConnection Socket connection established to localhost/127.0.0.1:16522, initiating session
[junit4:junit4]   2> 1060 T70 oazs.NIOServerCnxnFactory.run Accepted socket connection from /140.211.11.196:15129
[junit4:junit4]   2> 1060 T70 oazs.ZooKeeperServer.processConnectRequest Client attempting to establish new session at /140.211.11.196:15129
[junit4:junit4]   2> 1062 T72 oazs.ZooKeeperServer.finishSessionInit Established session 0x13c9d02617d0002 with negotiated timeout 20000 for client /140.211.11.196:15129
[junit4:junit4]   2> 1062 T87 oaz.ClientCnxn$SendThread.onConnected Session establishment complete on server localhost/127.0.0.1:16522, sessionid = 0x13c9d02617d0002, negotiated timeout = 20000
[junit4:junit4]   2> 1063 T88 oascc.ConnectionManager.process Watcher org.apache.solr.common.cloud.ConnectionManager@71f1ce16 name:ZooKeeperConnection Watcher:127.0.0.1:16522 got event WatchedEvent state:SyncConnected type:None path:null path:null type:None
[junit4:junit4]   2> 1063 T68 oascc.ConnectionManager.waitForConnected Client is connected to ZooKeeper
[junit4:junit4]   2> 1065 T73 oazs.PrepRequestProcessor.pRequest2Txn Processed session termination for sessionid: 0x13c9d02617d0002
[junit4:junit4]   2> 1067 T88 oaz.ClientCnxn$EventThread.run EventThread shut down
[junit4:junit4]   2> 1067 T70 oazs.NIOServerCnxn.closeSock Closed socket connection for client /140.211.11.196:15129 which had sessionid 0x13c9d02617d0002
[junit4:junit4]   2> 1067 T68 oaz.ZooKeeper.close Session: 0x13c9d02617d0002 closed
[junit4:junit4]   2> 1072 T68 oascsi.HttpClientUtil.createClient Creating new http client, config:maxConnections=500&maxConnectionsPerHost=16&socketTimeout=60000&connTimeout=15000
[junit4:junit4]   2> 1092 T68 oaz.ZooKeeper.<init> Initiating client connection, connectString=127.0.0.1:16522/solr sessionTimeout=30000 watcher=org.apache.solr.common.cloud.ConnectionManager@3add6825
[junit4:junit4]   2> 1093 T68 oascc.ConnectionManager.waitForConnected Waiting for client to connect to ZooKeeper
[junit4:junit4]   2> 1094 T89 oaz.ClientCnxn$SendThread.logStartConnect Opening socket connection to server localhost/127.0.0.1:16522. Will not attempt to authenticate using SASL (access denied ("javax.security.auth.AuthPermission" "getLoginConfiguration"))
[junit4:junit4]   2> 1095 T89 oaz.ClientCnxn$SendThread.primeConnection Socket connection established to localhost/127.0.0.1:16522, initiating session
[junit4:junit4]   2> 1095 T70 oazs.NIOServerCnxnFactory.run Accepted socket connection from /140.211.11.196:11596
[junit4:junit4]   2> 1095 T70 oazs.ZooKeeperServer.processConnectRequest Client attempting to establish new session at /140.211.11.196:11596
[junit4:junit4]   2> 1097 T72 oazs.ZooKeeperServer.finishSessionInit Established session 0x13c9d02617d0003 with negotiated timeout 20000 for client /140.211.11.196:11596
[junit4:junit4]   2> 1097 T89 oaz.ClientCnxn$SendThread.onConnected Session establishment complete on server localhost/127.0.0.1:16522, sessionid = 0x13c9d02617d0003, negotiated timeout = 20000
[junit4:junit4]   2> 1098 T90 oascc.ConnectionManager.process Watcher org.apache.solr.common.cloud.ConnectionManager@3add6825 name:ZooKeeperConnection Watcher:127.0.0.1:16522/solr got event WatchedEvent state:SyncConnected type:None path:null path:null type:None
[junit4:junit4]   2> 1099 T68 oascc.ConnectionManager.waitForConnected Client is connected to ZooKeeper
[junit4:junit4]   2> 1117 T73 oazs.PrepRequestProcessor.pRequest Got user-level KeeperException when processing sessionid:0x13c9d02617d0003 type:create cxid:0x2 zxid:0x1a txntype:-1 reqpath:n/a Error Path:/solr/overseer Error:KeeperErrorCode = NodeExists for /solr/overseer
[junit4:junit4]   2> 1130 T68 oascc.SolrZkClient.makePath makePath: /live_nodes
[junit4:junit4]   2> 1133 T68 oasc.ZkController.createEphemeralLiveNode Register node as live in ZooKeeper:/live_nodes/127.0.0.1:15097__pq
[junit4:junit4]   2> 1141 T73 oazs.PrepRequestProcessor.pRequest Got user-level KeeperException when processing sessionid:0x13c9d02617d0003 type:delete cxid:0x7 zxid:0x1c txntype:-1 reqpath:n/a Error Path:/solr/live_nodes/127.0.0.1:15097__pq Error:KeeperErrorCode = NoNode for /solr/live_nodes/127.0.0.1:15097__pq
[junit4:junit4]   2> 1142 T68 oascc.SolrZkClient.makePath makePath: /live_nodes/127.0.0.1:15097__pq
[junit4:junit4]   2> 1148 T68 oascc.SolrZkClient.makePath makePath: /overseer_elect/election
[junit4:junit4]   2> 1179 T73 oazs.PrepRequestProcessor.pRequest Got user-level KeeperException when processing sessionid:0x13c9d02617d0003 type:delete cxid:0x15 zxid:0x21 txntype:-1 reqpath:n/a Error Path:/solr/overseer_elect/leader Error:KeeperErrorCode = NoNode for /solr/overseer_elect/leader
[junit4:junit4]   2> 1181 T68 oascc.SolrZkClient.makePath makePath: /overseer_elect/leader
[junit4:junit4]   2> 1184 T68 oasc.Overseer.start Overseer (id=89118726191644675-127.0.0.1:15097__pq-n_0000000000) starting
[junit4:junit4]   2> 1185 T73 oazs.PrepRequestProcessor.pRequest Got user-level KeeperException when processing sessionid:0x13c9d02617d0003 type:create cxid:0x1a zxid:0x23 txntype:-1 reqpath:n/a Error Path:/solr/overseer Error:KeeperErrorCode = NodeExists for /solr/overseer
[junit4:junit4]   2> 1212 T73 oazs.PrepRequestProcessor.pRequest Got user-level KeeperException when processing sessionid:0x13c9d02617d0003 type:create cxid:0x1b zxid:0x24 txntype:-1 reqpath:n/a Error Path:/solr/overseer Error:KeeperErrorCode = NodeExists for /solr/overseer
[junit4:junit4]   2> 1214 T73 oazs.PrepRequestProcessor.pRequest Got user-level KeeperException when processing sessionid:0x13c9d02617d0003 type:create cxid:0x1c zxid:0x25 txntype:-1 reqpath:n/a Error Path:/solr/overseer Error:KeeperErrorCode = NodeExists for /solr/overseer
[junit4:junit4]   2> 1216 T73 oazs.PrepRequestProcessor.pRequest Got user-level KeeperException when processing sessionid:0x13c9d02617d0003 type:create cxid:0x1d zxid:0x26 txntype:-1 reqpath:n/a Error Path:/solr/overseer Error:KeeperErrorCode = NodeExists for /solr/overseer
[junit4:junit4]   2> 1224 T92 oasc.OverseerCollectionProcessor.run Process current queue of collection creations
[junit4:junit4]   2> 1225 T68 oascc.SolrZkClient.makePath makePath: /clusterstate.json
[junit4:junit4]   2> 1229 T68 oascc.ZkStateReader.createClusterStateWatchersAndUpdate Updating cluster state from ZooKeeper... 
[junit4:junit4]   2> 1250 T91 oasc.Overseer$ClusterStateUpdater.run Starting to work on the main queue
[junit4:junit4]   2> 1264 T93 oasc.CoreContainer.create Creating SolrCore 'collection1' using instanceDir: /usr/home/hudson/hudson-slave/workspace/Lucene-Solr-Tests-trunk-java7/solr/build/solr-core/test/J1/./org.apache.solr.cloud.SyncSliceTest-controljetty-1359843844978/collection1
[junit4:junit4]   2> 1265 T93 oasc.ZkController.createCollectionZkNode Check for collection zkNode:control_collection
[junit4:junit4]   2> 1266 T93 oasc.ZkController.createCollectionZkNode Collection zkNode exists
[junit4:junit4]   2> 1266 T93 oasc.ZkController.readConfigName Load collection config from:/collections/control_collection
[junit4:junit4]   2> 1268 T93 oasc.SolrResourceLoader.<init> new SolrResourceLoader for directory: '/usr/home/hudson/hudson-slave/workspace/Lucene-Solr-Tests-trunk-java7/solr/build/solr-core/test/J1/./org.apache.solr.cloud.SyncSliceTest-controljetty-1359843844978/collection1/'
[junit4:junit4]   2> 1270 T93 oasc.SolrResourceLoader.replaceClassLoader Adding 'file:/usr/home/hudson/hudson-slave/workspace/Lucene-Solr-Tests-trunk-java7/solr/build/solr-core/test/J1/org.apache.solr.cloud.SyncSliceTest-controljetty-1359843844978/collection1/lib/README' to classloader
[junit4:junit4]   2> 1270 T93 oasc.SolrResourceLoader.replaceClassLoader Adding 'file:/usr/home/hudson/hudson-slave/workspace/Lucene-Solr-Tests-trunk-java7/solr/build/solr-core/test/J1/org.apache.solr.cloud.SyncSliceTest-controljetty-1359843844978/collection1/lib/classes/' to classloader
[junit4:junit4]   2> 1345 T93 oasc.SolrConfig.<init> Using Lucene MatchVersion: LUCENE_50
[junit4:junit4]   2> 1410 T93 oasc.SolrConfig.<init> Loaded SolrConfig: solrconfig.xml
[junit4:junit4]   2> 1512 T93 oass.IndexSchema.readSchema Reading Solr Schema
[junit4:junit4]   2> 1530 T93 oass.IndexSchema.readSchema Schema name=test
[junit4:junit4]   2> 2106 T93 oass.OpenExchangeRatesOrgProvider.init Initialized with rates=open-exchange-rates.json, refreshInterval=1440.
[junit4:junit4]   2> 2119 T93 oass.IndexSchema.readSchema default search field in schema is text
[junit4:junit4]   2> 2122 T93 oass.IndexSchema.readSchema unique key field: id
[junit4:junit4]   2> 2152 T93 oass.FileExchangeRateProvider.reload Reloading exchange rates from file currency.xml
[junit4:junit4]   2> 2158 T93 oass.FileExchangeRateProvider.reload Reloading exchange rates from file currency.xml
[junit4:junit4]   2> 2163 T93 oass.OpenExchangeRatesOrgProvider.reload Reloading exchange rates from open-exchange-rates.json
[junit4:junit4]   2> 2167 T93 oass.OpenExchangeRatesOrgProvider.reload Reloading exchange rates from open-exchange-rates.json
[junit4:junit4]   2> 2170 T93 oasc.SolrCore.<init> [collection1] Opening new SolrCore at /usr/home/hudson/hudson-slave/workspace/Lucene-Solr-Tests-trunk-java7/solr/build/solr-core/test/J1/./org.apache.solr.cloud.SyncSliceTest-controljetty-1359843844978/collection1/, dataDir=./org.apache.solr.cloud.SyncSliceTest-1359843844230/control/data/
[junit4:junit4]   2> 2174 T93 oasc.JmxMonitoredMap.<init> JMX monitoring is enabled. Adding Solr mbeans to JMX Server: com.sun.jmx.mbeanserver.JmxMBeanServer@71ac4afb
[junit4:junit4]   2> 2175 T93 oasc.SolrCore.initDirectoryFactory solr.NRTCachingDirectoryFactory
[junit4:junit4]   2> 2201 T93 oasc.CachingDirectoryFactory.get return new directory for /usr/home/hudson/hudson-slave/workspace/Lucene-Solr-Tests-trunk-java7/solr/build/solr-core/test/J1/./org.apache.solr.cloud.SyncSliceTest-1359843844230/control/data forceNew:false
[junit4:junit4]   2> 2202 T93 oasc.CachingDirectoryFactory.close Releasing directory:/usr/home/hudson/hudson-slave/workspace/Lucene-Solr-Tests-trunk-java7/solr/build/solr-core/test/J1/./org.apache.solr.cloud.SyncSliceTest-1359843844230/control/data
[junit4:junit4]   2> 2202 T93 oasc.SolrCore.getNewIndexDir New index directory detected: old=null new=./org.apache.solr.cloud.SyncSliceTest-1359843844230/control/data/index/
[junit4:junit4]   2> 2202 T93 oasc.SolrCore.initIndex WARNING [collection1] Solr index directory './org.apache.solr.cloud.SyncSliceTest-1359843844230/control/data/index' doesn't exist. Creating new index...
[junit4:junit4]   2> 2203 T93 oasc.CachingDirectoryFactory.get return new directory for /usr/home/hudson/hudson-slave/workspace/Lucene-Solr-Tests-trunk-java7/solr/build/solr-core/test/J1/./org.apache.solr.cloud.SyncSliceTest-1359843844230/control/data/index forceNew:false
[junit4:junit4]   2> 2237 T93 oasc.SolrDeletionPolicy.onCommit SolrDeletionPolicy.onCommit: commits:num=1
[junit4:junit4]   2> 		commit{dir=RateLimitedDirectoryWrapper(NRTCachingDirectory(org.apache.lucene.store.NIOFSDirectory@/usr/home/hudson/hudson-slave/workspace/Lucene-Solr-Tests-trunk-java7/solr/build/solr-core/test/J1/org.apache.solr.cloud.SyncSliceTest-1359843844230/control/data/index lockFactory=org.apache.lucene.store.NativeFSLockFactory@3a56ad08; maxCacheMB=48.0 maxMergeSizeMB=4.0)),segFN=segments_1,generation=1,filenames=[segments_1]
[junit4:junit4]   2> 2238 T93 oasc.SolrDeletionPolicy.updateCommits newest commit = 1[segments_1]
[junit4:junit4]   2> 2239 T93 oasc.CachingDirectoryFactory.close Releasing directory:/usr/home/hudson/hudson-slave/workspace/Lucene-Solr-Tests-trunk-java7/solr/build/solr-core/test/J1/./org.apache.solr.cloud.SyncSliceTest-1359843844230/control/data/index
[junit4:junit4]   2> 2239 T93 oasc.SolrCore.initWriters created xml: solr.XMLResponseWriter
[junit4:junit4]   2> 2242 T93 oasup.UpdateRequestProcessorChain.init inserting DistributedUpdateProcessorFactory into updateRequestProcessorChain "dedupe"
[junit4:junit4]   2> 2243 T93 oasup.UpdateRequestProcessorChain.init inserting DistributedUpdateProcessorFactory into updateRequestProcessorChain "dedupe-allfields"
[junit4:junit4]   2> 2244 T93 oasup.UpdateRequestProcessorChain.init inserting DistributedUpdateProcessorFactory into updateRequestProcessorChain "stored_sig"
[junit4:junit4]   2> 2244 T93 oasup.UpdateRequestProcessorChain.init inserting DistributedUpdateProcessorFactory into updateRequestProcessorChain "uniq-fields"
[junit4:junit4]   2> 2245 T93 oasup.UpdateRequestProcessorChain.init inserting DistributedUpdateProcessorFactory into updateRequestProcessorChain "distrib-dup-test-chain-implicit"
[junit4:junit4]   2> 2246 T93 oasc.RequestHandlers.initHandlersFromConfig adding lazy requestHandler: solr.ReplicationHandler
[junit4:junit4]   2> 2246 T93 oasc.RequestHandlers.initHandlersFromConfig created /replication: solr.ReplicationHandler
[junit4:junit4]   2> 2247 T93 oasc.RequestHandlers.initHandlersFromConfig created standard: solr.StandardRequestHandler
[junit4:junit4]   2> 2248 T93 oasc.RequestHandlers.initHandlersFromConfig created /get: solr.RealTimeGetHandler
[junit4:junit4]   2> 2248 T93 oasc.RequestHandlers.initHandlersFromConfig created dismax: solr.SearchHandler
[junit4:junit4]   2> 2249 T93 oasc.RequestHandlers.initHandlersFromConfig created mock: org.apache.solr.core.MockQuerySenderListenerReqHandler
[junit4:junit4]   2> 2250 T93 oasc.RequestHandlers.initHandlersFromConfig created /admin/: org.apache.solr.handler.admin.AdminHandlers
[junit4:junit4]   2> 2250 T93 oasc.RequestHandlers.initHandlersFromConfig created defaults: solr.StandardRequestHandler
[junit4:junit4]   2> 2250 T93 oasc.RequestHandlers.initHandlersFromConfig adding lazy requestHandler: solr.StandardRequestHandler
[junit4:junit4]   2> 2251 T93 oasc.RequestHandlers.initHandlersFromConfig created lazy: solr.StandardRequestHandler
[junit4:junit4]   2> 2251 T93 oasc.RequestHandlers.initHandlersFromConfig created /update: solr.UpdateRequestHandler
[junit4:junit4]   2> 2252 T93 oasc.RequestHandlers.initHandlersFromConfig created /terms: org.apache.solr.handler.component.SearchHandler
[junit4:junit4]   2> 2252 T93 oasc.RequestHandlers.initHandlersFromConfig created spellCheckCompRH: org.apache.solr.handler.component.SearchHandler
[junit4:junit4]   2> 2253 T93 oasc.RequestHandlers.initHandlersFromConfig created spellCheckCompRH_Direct: org.apache.solr.handler.component.SearchHandler
[junit4:junit4]   2> 2253 T93 oasc.RequestHandlers.initHandlersFromConfig created spellCheckWithWordbreak: org.apache.solr.handler.component.SearchHandler
[junit4:junit4]   2> 2254 T93 oasc.RequestHandlers.initHandlersFromConfig created spellCheckWithWordbreak_Direct: org.apache.solr.handler.component.SearchHandler
[junit4:junit4]   2> 2254 T93 oasc.RequestHandlers.initHandlersFromConfig created spellCheckCompRH1: org.apache.solr.handler.component.SearchHandler
[junit4:junit4]   2> 2255 T93 oasc.RequestHandlers.initHandlersFromConfig created mltrh: org.apache.solr.handler.component.SearchHandler
[junit4:junit4]   2> 2255 T93 oasc.RequestHandlers.initHandlersFromConfig created tvrh: org.apache.solr.handler.component.SearchHandler
[junit4:junit4]   2> 2256 T93 oasc.RequestHandlers.initHandlersFromConfig created /mlt: solr.MoreLikeThisHandler
[junit4:junit4]   2> 2256 T93 oasc.RequestHandlers.initHandlersFromConfig created /debug/dump: solr.DumpRequestHandler
[junit4:junit4]   2> 2266 T93 oashl.XMLLoader.init xsltCacheLifetimeSeconds=60
[junit4:junit4]   2> 2269 T93 oasc.SolrCore.initDeprecatedSupport WARNING solrconfig.xml uses deprecated <admin/gettableFiles>, Please update your config to use the ShowFileRequestHandler.
[junit4:junit4]   2> 2271 T93 oasc.SolrCore.initDeprecatedSupport WARNING adding ShowFileRequestHandler with hidden files: [SCHEMA.XML, OLD_SYNONYMS.TXT, STOPWORDS.TXT, PROTWORDS.TXT, OPEN-EXCHANGE-RATES.JSON, SYNONYMS.TXT, CURRENCY.XML, MAPPING-ISOLATIN1ACCENT.TXT]
[junit4:junit4]   2> 2273 T93 oasc.CachingDirectoryFactory.close Releasing directory:/usr/home/hudson/hudson-slave/workspace/Lucene-Solr-Tests-trunk-java7/solr/build/solr-core/test/J1/./org.apache.solr.cloud.SyncSliceTest-1359843844230/control/data
[junit4:junit4]   2> 2275 T93 oass.SolrIndexSearcher.<init> Opening Searcher@13f0d199 main
[junit4:junit4]   2> 2293 T93 oasu.CommitTracker.<init> Hard AutoCommit: disabled
[junit4:junit4]   2> 2294 T93 oasu.CommitTracker.<init> Soft AutoCommit: disabled
[junit4:junit4]   2> 2294 T93 oashc.SpellCheckComponent.inform Initializing spell checkers
[junit4:junit4]   2> 2301 T93 oass.DirectSolrSpellChecker.init init: {name=direct,classname=DirectSolrSpellChecker,field=lowerfilt,minQueryLength=3}
[junit4:junit4]   2> 2351 T94 oasc.SolrCore.registerSearcher [collection1] Registered new searcher Searcher@13f0d199 main{StandardDirectoryReader(segments_1:1)}
[junit4:junit4]   2> 2356 T93 oasc.ZkController.publish publishing core=collection1 state=down
[junit4:junit4]   2> 2356 T93 oasc.ZkController.publish numShards not found on descriptor - reading it from system property
[junit4:junit4]   2> 2357 T73 oazs.PrepRequestProcessor.pRequest Got user-level KeeperException when processing sessionid:0x13c9d02617d0003 type:create cxid:0x50 zxid:0x29 txntype:-1 reqpath:n/a Error Path:/solr/overseer/queue Error:KeeperErrorCode = NoNode for /solr/overseer/queue
[junit4:junit4]   2> 2756 T91 oascc.ZkStateReader.updateClusterState Updating cloud state from ZooKeeper... 
[junit4:junit4]   2> 2758 T91 oasc.Overseer$ClusterStateUpdater.updateState Update state numShards=1 message={
[junit4:junit4]   2> 	  "operation":"state",
[junit4:junit4]   2> 	  "numShards":"1",
[junit4:junit4]   2> 	  "shard":null,
[junit4:junit4]   2> 	  "roles":null,
[junit4:junit4]   2> 	  "state":"down",
[junit4:junit4]   2> 	  "core":"collection1",
[junit4:junit4]   2> 	  "collection":"control_collection",
[junit4:junit4]   2> 	  "node_name":"127.0.0.1:15097__pq",
[junit4:junit4]   2> 	  "base_url":"http://127.0.0.1:15097/_pq"}
[junit4:junit4]   2> 2758 T91 oasc.Overseer$ClusterStateUpdater.createCollection Create collection control_collection with numShards 1
[junit4:junit4]   2> 2778 T91 oasc.Overseer$ClusterStateUpdater.updateState Assigning new node to shard shard=shard1
[junit4:junit4]   2> 2779 T73 oazs.PrepRequestProcessor.pRequest Got user-level KeeperException when processing sessionid:0x13c9d02617d0003 type:create cxid:0x58 zxid:0x2c txntype:-1 reqpath:n/a Error Path:/solr/overseer/queue-work Error:KeeperErrorCode = NoNode for /solr/overseer/queue-work
[junit4:junit4]   2> 2822 T90 oascc.ZkStateReader$2.process A cluster state change: WatchedEvent state:SyncConnected type:NodeDataChanged path:/clusterstate.json, has occurred - updating... (live nodes size: 1)
[junit4:junit4]   2> 3371 T93 oasc.CoreContainer.registerCore registering core: collection1
[junit4:junit4]   2> 3371 T93 oasc.ZkController.register Register replica - core:collection1 address:http://127.0.0.1:15097/_pq collection:control_collection shard:shard1
[junit4:junit4]   2> 3379 T93 oascsi.HttpClientUtil.createClient Creating new http client, config:maxConnections=10000&maxConnectionsPerHost=20&connTimeout=30000&socketTimeout=30000&retry=false
[junit4:junit4]   2> 3393 T93 oascc.SolrZkClient.makePath makePath: /collections/control_collection/leader_elect/shard1/election
[junit4:junit4]   2> 3412 T73 oazs.PrepRequestProcessor.pRequest Got user-level KeeperException when processing sessionid:0x13c9d02617d0003 type:delete cxid:0x72 zxid:0x36 txntype:-1 reqpath:n/a Error Path:/solr/collections/control_collection/leaders Error:KeeperErrorCode = NoNode for /solr/collections/control_collection/leaders
[junit4:junit4]   2> 3414 T93 oasc.ShardLeaderElectionContext.runLeaderProcess Running the leader process.
[junit4:junit4]   2> 3415 T73 oazs.PrepRequestProcessor.pRequest Got user-level KeeperException when processing sessionid:0x13c9d02617d0003 type:create cxid:0x73 zxid:0x37 txntype:-1 reqpath:n/a Error Path:/solr/overseer Error:KeeperErrorCode = NodeExists for /solr/overseer
[junit4:junit4]   2> 3424 T93 oasc.ShardLeaderElectionContext.waitForReplicasToComeUp Enough replicas found to continue.
[junit4:junit4]   2> 3424 T93 oasc.ShardLeaderElectionContext.runLeaderProcess I may be the new leader - try and sync
[junit4:junit4]   2> 3431 T93 oasc.SyncStrategy.sync Sync replicas to http://127.0.0.1:15097/_pq/collection1/
[junit4:junit4]   2> 3432 T93 oasc.SyncStrategy.syncReplicas Sync Success - now sync replicas to me
[junit4:junit4]   2> 3432 T93 oasc.SyncStrategy.syncToMe http://127.0.0.1:15097/_pq/collection1/ has no replicas
[junit4:junit4]   2> 3433 T93 oasc.ShardLeaderElectionContext.runLeaderProcess I am the new leader: http://127.0.0.1:15097/_pq/collection1/
[junit4:junit4]   2> 3433 T93 oascc.SolrZkClient.makePath makePath: /collections/control_collection/leaders/shard1
[junit4:junit4]   2> 3441 T73 oazs.PrepRequestProcessor.pRequest Got user-level KeeperException when processing sessionid:0x13c9d02617d0003 type:create cxid:0x7d zxid:0x3b txntype:-1 reqpath:n/a Error Path:/solr/overseer Error:KeeperErrorCode = NodeExists for /solr/overseer
[junit4:junit4]   2> 4331 T91 oascc.ZkStateReader.updateClusterState Updating cloud state from ZooKeeper... 
[junit4:junit4]   2> 4350 T90 oascc.ZkStateReader$2.process A cluster state change: WatchedEvent state:SyncConnected type:NodeDataChanged path:/clusterstate.json, has occurred - updating... (live nodes size: 1)
[junit4:junit4]   2> 4369 T93 oasc.ZkController.register We are http://127.0.0.1:15097/_pq/collection1/ and leader is http://127.0.0.1:15097/_pq/collection1/
[junit4:junit4]   2> 4372 T93 oasc.ZkController.register No LogReplay needed for core=collection1 baseURL=http://127.0.0.1:15097/_pq
[junit4:junit4]   2> 4372 T93 oasc.ZkController.checkRecovery I am the leader, no recovery necessary
[junit4:junit4]   2> 4372 T93 oasc.ZkController.publish publishing core=collection1 state=active
[junit4:junit4]   2> 4372 T93 oasc.ZkController.publish numShards not found on descriptor - reading it from system property
[junit4:junit4]   2> 4375 T93 oascc.ZkStateReader.updateClusterState Updating cloud state from ZooKeeper... 
[junit4:junit4]   2> 4376 T68 oass.SolrDispatchFilter.init user.dir=/usr/home/hudson/hudson-slave/workspace/Lucene-Solr-Tests-trunk-java7/solr/build/solr-core/test/J1
[junit4:junit4]   2> 4377 T68 oass.SolrDispatchFilter.init SolrDispatchFilter.init() done
[junit4:junit4]   2> 4377 T68 oascsi.HttpClientUtil.createClient Creating new http client, config:maxConnections=128&maxConnectionsPerHost=32&followRedirects=false
[junit4:junit4]   2> 4387 T68 oascsi.HttpClientUtil.createClient Creating new http client, config:
[junit4:junit4]   2> 4398 T68 oaz.ZooKeeper.<init> Initiating client connection, connectString=127.0.0.1:16522/solr sessionTimeout=10000 watcher=org.apache.solr.common.cloud.ConnectionManager@39e8b722
[junit4:junit4]   2> 4399 T68 oascc.ConnectionManager.waitForConnected Waiting for client to connect to ZooKeeper
[junit4:junit4]   2> 4400 T95 oaz.ClientCnxn$SendThread.logStartConnect Opening socket connection to server localhost/127.0.0.1:16522. Will not attempt to authenticate using SASL (access denied ("javax.security.auth.AuthPermission" "getLoginConfiguration"))
[junit4:junit4]   2> 4400 T95 oaz.ClientCnxn$SendThread.primeConnection Socket connection established to localhost/127.0.0.1:16522, initiating session
[junit4:junit4]   2> 4401 T70 oazs.NIOServerCnxnFactory.run Accepted socket connection from /140.211.11.196:22895
[junit4:junit4]   2> 4401 T70 oazs.ZooKeeperServer.processConnectRequest Client attempting to establish new session at /140.211.11.196:22895
[junit4:junit4]   2> 4403 T72 oazs.ZooKeeperServer.finishSessionInit Established session 0x13c9d02617d0004 with negotiated timeout 10000 for client /140.211.11.196:22895
[junit4:junit4]   2> 4403 T95 oaz.ClientCnxn$SendThread.onConnected Session establishment complete on server localhost/127.0.0.1:16522, sessionid = 0x13c9d02617d0004, negotiated timeout = 10000
[junit4:junit4]   2> 4404 T96 oascc.ConnectionManager.process Watcher org.apache.solr.common.cloud.ConnectionManager@39e8b722 name:ZooKeeperConnection Watcher:127.0.0.1:16522/solr got event WatchedEvent state:SyncConnected type:None path:null path:null type:None
[junit4:junit4]   2> 4404 T68 oascc.ConnectionManager.waitForConnected Client is connected to ZooKeeper
[junit4:junit4]   2> 4405 T68 oascc.ZkStateReader.createClusterStateWatchersAndUpdate Updating cluster state from ZooKeeper... 
[junit4:junit4]   2> 4409 T68 oasc.ChaosMonkey.monkeyLog monkey: init - expire sessions:true cause connection loss:true
[junit4:junit4]   2> 4525 T68 oejs.Server.doStart jetty-8.1.8.v20121106
[junit4:junit4]   2> 4527 T68 oejs.AbstractConnector.doStart Started SocketConnector@127.0.0.1:34013
[junit4:junit4]   2> 4528 T68 oass.SolrDispatchFilter.init SolrDispatchFilter.init()
[junit4:junit4]   2> 4528 T68 oasc.SolrResourceLoader.locateSolrHome JNDI not configured for solr (NoInitialContextEx)
[junit4:junit4]   2> 4529 T68 oasc.SolrResourceLoader.locateSolrHome using system property solr.solr.home: /usr/home/hudson/hudson-slave/workspace/Lucene-Solr-Tests-trunk-java7/solr/build/solr-core/test/J1/./org.apache.solr.cloud.SyncSliceTest-jetty1-1359843848634
[junit4:junit4]   2> 4529 T68 oasc.CoreContainer$Initializer.initialize looking for solr.xml: /usr/home/hudson/hudson-slave/workspace/Lucene-Solr-Tests-trunk-java7/solr/build/solr-core/test/J1/./org.apache.solr.cloud.SyncSliceTest-jetty1-1359843848634/solr.xml
[junit4:junit4]   2> 4530 T68 oasc.CoreContainer.<init> New CoreContainer 71691097
[junit4:junit4]   2> 4530 T68 oasc.CoreContainer.load Loading CoreContainer using Solr Home: '/usr/home/hudson/hudson-slave/workspace/Lucene-Solr-Tests-trunk-java7/solr/build/solr-core/test/J1/./org.apache.solr.cloud.SyncSliceTest-jetty1-1359843848634/'
[junit4:junit4]   2> 4531 T68 oasc.SolrResourceLoader.<init> new SolrResourceLoader for directory: '/usr/home/hudson/hudson-slave/workspace/Lucene-Solr-Tests-trunk-java7/solr/build/solr-core/test/J1/./org.apache.solr.cloud.SyncSliceTest-jetty1-1359843848634/'
[junit4:junit4]   2> 4568 T68 oashc.HttpShardHandlerFactory.getParameter Setting socketTimeout to: 60000
[junit4:junit4]   2> 4569 T68 oashc.HttpShardHandlerFactory.getParameter Setting urlScheme to: http://
[junit4:junit4]   2> 4569 T68 oashc.HttpShardHandlerFactory.getParameter Setting connTimeout to: 15000
[junit4:junit4]   2> 4569 T68 oashc.HttpShardHandlerFactory.getParameter Setting maxConnectionsPerHost to: 20
[junit4:junit4]   2> 4570 T68 oashc.HttpShardHandlerFactory.getParameter Setting corePoolSize to: 0
[junit4:junit4]   2> 4570 T68 oashc.HttpShardHandlerFactory.getParameter Setting maximumPoolSize to: 2147483647
[junit4:junit4]   2> 4571 T68 oashc.HttpShardHandlerFactory.getParameter Setting maxThreadIdleTime to: 5
[junit4:junit4]   2> 4571 T68 oashc.HttpShardHandlerFactory.getParameter Setting sizeOfQueue to: -1
[junit4:junit4]   2> 4571 T68 oashc.HttpShardHandlerFactory.getParameter Setting fairnessPolicy to: false
[junit4:junit4]   2> 4572 T68 oascsi.HttpClientUtil.createClient Creating new http client, config:maxConnectionsPerHost=20&maxConnections=10000&socketTimeout=60000&connTimeout=15000&retry=false
[junit4:junit4]   2> 4590 T68 oasc.CoreContainer.load Registering Log Listener
[junit4:junit4]   2> 4608 T68 oasc.CoreContainer.initZooKeeper Zookeeper client=127.0.0.1:16522/solr
[junit4:junit4]   2> 4609 T68 oasc.ZkController.checkChrootPath zkHost includes chroot
[junit4:junit4]   2> 4609 T68 oaz.ZooKeeper.<init> Initiating client connection, connectString=127.0.0.1:16522 sessionTimeout=60000 watcher=org.apache.solr.common.cloud.ConnectionManager@350aa5bc
[junit4:junit4]   2> 4610 T68 oascc.ConnectionManager.waitForConnected Waiting for client to connect to ZooKeeper
[junit4:junit4]   2> 4611 T106 oaz.ClientCnxn$SendThread.logStartConnect Opening socket connection to server localhost/127.0.0.1:16522. Will not attempt to authenticate using SASL (access denied ("javax.security.auth.AuthPermission" "getLoginConfiguration"))
[junit4:junit4]   2> 4612 T106 oaz.ClientCnxn$SendThread.primeConnection Socket connection established to localhost/127.0.0.1:16522, initiating session
[junit4:junit4]   2> 4612 T70 oazs.NIOServerCnxnFactory.run Accepted socket connection from /140.211.11.196:15084
[junit4:junit4]   2> 4613 T70 oazs.ZooKeeperServer.processConnectRequest Client attempting to establish new session at /140.211.11.196:15084
[junit4:junit4]   2> 4625 T72 oazs.ZooKeeperServer.finishSessionInit Established session 0x13c9d02617d0005 with negotiated timeout 20000 for client /140.211.11.196:15084
[junit4:junit4]   2> 4625 T106 oaz.ClientCnxn$SendThread.onConnected Session establishment complete on server localhost/127.0.0.1:16522, sessionid = 0x13c9d02617d0005, negotiated timeout = 20000
[junit4:junit4]   2> 4626 T107 oascc.ConnectionManager.process Watcher org.apache.solr.common.cloud.ConnectionManager@350aa5bc name:ZooKeeperConnection Watcher:127.0.0.1:16522 got event WatchedEvent state:SyncConnected type:None path:null path:null type:None
[junit4:junit4]   2> 4626 T68 oascc.ConnectionManager.waitForConnected Client is connected to ZooKeeper
[junit4:junit4]   2> 4628 T73 oazs.PrepRequestProcessor.pRequest2Txn Processed session termination for sessionid: 0x13c9d02617d0005
[junit4:junit4]   2> 4631 T107 oaz.ClientCnxn$EventThread.run EventThread shut down
[junit4:junit4]   2> 4631 T70 oazs.NIOServerCnxn.closeSock Closed socket connection for client /140.211.11.196:15084 which had sessionid 0x13c9d02617d0005
[junit4:junit4]   2> 4631 T68 oaz.ZooKeeper.close Session: 0x13c9d02617d0005 closed
[junit4:junit4]   2> 4632 T68 oascsi.HttpClientUtil.createClient Creating new http client, config:maxConnections=500&maxConnectionsPerHost=16&socketTimeout=60000&connTimeout=15000
[junit4:junit4]   2> 4642 T68 oaz.ZooKeeper.<init> Initiating client connection, connectString=127.0.0.1:16522/solr sessionTimeout=30000 watcher=org.apache.solr.common.cloud.ConnectionManager@4c53953f
[junit4:junit4]   2> 4643 T68 oascc.ConnectionManager.waitForConnected Waiting for client to connect to ZooKeeper
[junit4:junit4]   2> 4643 T108 oaz.ClientCnxn$SendThread.logStartConnect Opening socket connection to server localhost/127.0.0.1:16522. Will not attempt to authenticate using SASL (access denied ("javax.security.auth.AuthPermission" "getLoginConfiguration"))
[junit4:junit4]   2> 4644 T108 oaz.ClientCnxn$SendThread.primeConnection Socket connection established to localhost/127.0.0.1:16522, initiating session
[junit4:junit4]   2> 4644 T70 oazs.NIOServerCnxnFactory.run Accepted socket connection from /140.211.11.196:57541
[junit4:junit4]   2> 4645 T70 oazs.ZooKeeperServer.processConnectRequest Client attempting to establish new session at /140.211.11.196:57541
[junit4:junit4]   2> 4651 T72 oazs.ZooKeeperServer.finishSessionInit Established session 0x13c9d02617d0006 with negotiated timeout 20000 for client /140.211.11.196:57541
[junit4:junit4]   2> 4651 T108 oaz.ClientCnxn$SendThread.onConnected Session establishment complete on server localhost/127.0.0.1:16522, sessionid = 0x13c9d02617d0006, negotiated timeout = 20000
[junit4:junit4]   2> 4652 T109 oascc.ConnectionManager.process Watcher org.apache.solr.common.cloud.ConnectionManager@4c53953f name:ZooKeeperConnection Watcher:127.0.0.1:16522/solr got event WatchedEvent state:SyncConnected type:None path:null path:null type:None
[junit4:junit4]   2> 4652 T68 oascc.ConnectionManager.waitForConnected Client is connected to ZooKeeper
[junit4:junit4]   2> 4653 T73 oazs.PrepRequestProcessor.pRequest Got user-level KeeperException when processing sessionid:0x13c9d02617d0006 type:create cxid:0x1 zxid:0x49 txntype:-1 reqpath:n/a Error Path:/solr/overseer Error:KeeperErrorCode = NodeExists for /solr/overseer
[junit4:junit4]   2> 4660 T73 oazs.PrepRequestProcessor.pRequest Got user-level KeeperException when processing sessionid:0x13c9d02617d0006 type:create cxid:0x2 zxid:0x4a txntype:-1 reqpath:n/a Error Path:/solr/overseer Error:KeeperErrorCode = NodeExists for /solr/overseer
[junit4:junit4]   2> 4668 T68 oasc.ZkController.createEphemeralLiveNode Register node as live in ZooKeeper:/live_nodes/127.0.0.1:34013__pq
[junit4:junit4]   2> 4669 T73 oazs.PrepRequestProcessor.pRequest Got user-level KeeperException when processing sessionid:0x13c9d02617d0006 type:delete cxid:0x4 zxid:0x4b txntype:-1 reqpath:n/a Error Path:/solr/live_nodes/127.0.0.1:34013__pq Error:KeeperErrorCode = NoNode for /solr/live_nodes/127.0.0.1:34013__pq
[junit4:junit4]   2> 4675 T68 oascc.SolrZkClient.makePath makePath: /live_nodes/127.0.0.1:34013__pq
[junit4:junit4]   2> 4682 T90 oascc.ZkStateReader$2.process A cluster state change: WatchedEvent state:SyncConnected type:NodeChildrenChanged path:/live_nodes, has occurred - updating... (live nodes size: 1)
[junit4:junit4]   2> 4684 T96 oascc.ZkStateReader$3.process Updating live nodes... (2)
[junit4:junit4]   2> 4686 T90 oascc.ZkStateReader$3.process Updating live nodes... (2)
[junit4:junit4]   2> 4691 T68 oascc.ZkStateReader.createClusterStateWatchersAndUpdate Updating cluster state from ZooKeeper... 
[junit4:junit4]   2> 4698 T110 oasc.CoreContainer.create Creating SolrCore 'collection1' using instanceDir: /usr/home/hudson/hudson-slave/workspace/Lucene-Solr-Tests-trunk-java7/solr/build/solr-core/test/J1/./org.apache.solr.cloud.SyncSliceTest-jetty1-1359843848634/collection1
[junit4:junit4]   2> 4698 T110 oasc.ZkController.createCollectionZkNode Check for collection zkNode:collection1
[junit4:junit4]   2> 4699 T110 oasc.ZkController.createCollectionZkNode Collection zkNode exists
[junit4:junit4]   2> 4700 T110 oasc.ZkController.readConfigName Load collection config from:/collections/collection1
[junit4:junit4]   2> 4702 T110 oasc.SolrResourceLoader.<init> new SolrResourceLoader for directory: '/usr/home/hudson/hudson-slave/workspace/Lucene-Solr-Tests-trunk-java7/solr/build/solr-core/test/J1/./org.apache.solr.cloud.SyncSliceTest-jetty1-1359843848634/collection1/'
[junit4:junit4]   2> 4703 T110 oasc.SolrResourceLoader.replaceClassLoader Adding 'file:/usr/home/hudson/hudson-slave/workspace/Lucene-Solr-Tests-trunk-java7/solr/build/solr-core/test/J1/org.apache.solr.cloud.SyncSliceTest-jetty1-1359843848634/collection1/lib/README' to classloader
[junit4:junit4]   2> 4704 T110 oasc.SolrResourceLoader.replaceClassLoader Adding 'file:/usr/home/hudson/hudson-slave/workspace/Lucene-Solr-Tests-trunk-java7/solr/build/solr-core/test/J1/org.apache.solr.cloud.SyncSliceTest-jetty1-1359843848634/collection1/lib/classes/' to classloader
[junit4:junit4]   2> 4769 T110 oasc.SolrConfig.<init> Using Lucene MatchVersion: LUCENE_50
[junit4:junit4]   2> 4850 T110 oasc.SolrConfig.<init> Loaded SolrConfig: solrconfig.xml
[junit4:junit4]   2> 4952 T110 oass.IndexSchema.readSchema Reading Solr Schema
[junit4:junit4]   2> 4975 T110 oass.IndexSchema.readSchema Schema name=test
[junit4:junit4]   2> 5703 T110 oass.OpenExchangeRatesOrgProvider.init Initialized with rates=open-exchange-rates.json, refreshInterval=1440.
[junit4:junit4]   2> 5720 T110 oass.IndexSchema.readSchema default search field in schema is text
[junit4:junit4]   2> 5725 T110 oass.IndexSchema.readSchema unique key field: id
[junit4:junit4]   2> 5763 T110 oass.FileExchangeRateProvider.reload Reloading exchange rates from file currency.xml
[junit4:junit4]   2> 5770 T110 oass.FileExchangeRateProvider.reload Reloading exchange rates from file currency.xml
[junit4:junit4]   2> 5778 T110 oass.OpenExchangeRatesOrgProvider.reload Reloading exchange rates from open-exchange-rates.json
[junit4:junit4]   2> 5782 T110 oass.OpenExchangeRatesOrgProvider.reload Reloading exchange rates from open-exchange-rates.json
[junit4:junit4]   2> 5786 T110 oasc.SolrCore.<init> [collection1] Opening new SolrCore at /usr/home/hudson/hudson-slave/workspace/Lucene-Solr-Tests-trunk-java7/solr/build/solr-core/test/J1/./org.apache.solr.cloud.SyncSliceTest-jetty1-1359843848634/collection1/, dataDir=./org.apache.solr.cloud.SyncSliceTest-1359843844230/jetty1/
[junit4:junit4]   2> 5787 T110 oasc.JmxMonitoredMap.<init> JMX monitoring is enabled. Adding Solr mbeans to JMX Server: com.sun.jmx.mbeanserver.JmxMBeanServer@71ac4afb
[junit4:junit4]   2> 5787 T110 oasc.SolrCore.initDirectoryFactory solr.NRTCachingDirectoryFactory
[junit4:junit4]   2> 5789 T110 oasc.CachingDirectoryFactory.get return new directory for /usr/home/hudson/hudson-slave/workspace/Lucene-Solr-Tests-trunk-java7/solr/build/solr-core/test/J1/./org.apache.solr.cloud.SyncSliceTest-1359843844230/jetty1 forceNew:false
[junit4:junit4]   2> 5789 T110 oasc.CachingDirectoryFactory.close Releasing directory:/usr/home/hudson/hudson-slave/workspace/Lucene-Solr-Tests-trunk-java7/solr/build/solr-core/test/J1/./org.apache.solr.cloud.SyncSliceTest-1359843844230/jetty1
[junit4:junit4]   2> 5790 T110 oasc.SolrCore.getNewIndexDir New index directory detected: old=null new=./org.apache.solr.cloud.SyncSliceTest-1359843844230/jetty1/index/
[junit4:junit4]   2> 5791 T110 oasc.SolrCore.initIndex WARNING [collection1] Solr index directory './org.apache.solr.cloud.SyncSliceTest-1359843844230/jetty1/index' doesn't exist. Creating new index...
[junit4:junit4]   2> 5792 T110 oasc.CachingDirectoryFactory.get return new directory for /usr/home/hudson/hudson-slave/workspace/Lucene-Solr-Tests-trunk-java7/solr/build/solr-core/test/J1/./org.apache.solr.cloud.SyncSliceTest-1359843844230/jetty1/index forceNew:false
[junit4:junit4]   2> 5805 T110 oasc.SolrDeletionPolicy.onCommit SolrDeletionPolicy.onCommit: commits:num=1
[junit4:junit4]   2> 		commit{dir=RateLimitedDirectoryWrapper(NRTCachingDirectory(org.apache.lucene.store.NIOFSDirectory@/usr/home/hudson/hudson-slave/workspace/Lucene-Solr-Tests-trunk-java7/solr/build/solr-core/test/J1/org.apache.solr.cloud.SyncSliceTest-1359843844230/jetty1/index lockFactory=org.apache.lucene.store.NativeFSLockFactory@50eaa935; maxCacheMB=48.0 maxMergeSizeMB=4.0)),segFN=segments_1,generation=1,filenames=[segments_1]
[junit4:junit4]   2> 5806 T110 oasc.SolrDeletionPolicy.updateCommits newest commit = 1[segments_1]
[junit4:junit4]   2> 5807 T110 oasc.CachingDirectoryFactory.close Releasing directory:/usr/home/hudson/hudson-slave/workspace/Lucene-Solr-Tests-trunk-java7/solr/build/solr-core/test/J1/./org.apache.solr.cloud.SyncSliceTest-1359843844230/jetty1/index
[junit4:junit4]   2> 5808 T110 oasc.SolrCore.initWriters created xml: solr.XMLResponseWriter
[junit4:junit4]   2> 5811 T110 oasup.UpdateRequestProcessorChain.init inserting DistributedUpdateProcessorFactory into updateRequestProcessorChain "dedupe"
[junit4:junit4]   2> 5812 T110 oasup.UpdateRequestProcessorChain.init inserting DistributedUpdateProcessorFactory into updateRequestProcessorChain "dedupe-allfields"
[junit4:junit4]   2> 5813 T110 oasup.UpdateRequestProcessorChain.init inserting DistributedUpdateProcessorFactory into updateRequestProcessorChain "stored_sig"
[junit4:junit4]   2> 5813 T110 oasup.UpdateRequestProcessorChain.init inserting DistributedUpdateProcessorFactory into updateRequestProcessorChain "uniq-fields"
[junit4:junit4]   2> 5814 T110 oasup.UpdateRequestProcessorChain.init inserting DistributedUpdateProcessorFactory into updateRequestProcessorChain "distrib-dup-test-chain-implicit"
[junit4:junit4]   2> 5815 T110 oasc.RequestHandlers.initHandlersFromConfig adding lazy requestHandler: solr.ReplicationHandler
[junit4:junit4]   2> 5815 T110 oasc.RequestHandlers.initHandlersFromConfig created /replication: solr.ReplicationHandler
[junit4:junit4]   2> 5817 T110 oasc.RequestHandlers.initHandlersFromConfig created standard: solr.StandardRequestHandler
[junit4:junit4]   2> 5818 T110 oasc.RequestHandlers.initHandlersFromConfig created /get: solr.RealTimeGetHandler
[junit4:junit4]   2> 5819 T110 oasc.RequestHandlers.initHandlersFromConfig created dismax: solr.SearchHandler
[junit4:junit4]   2> 5820 T110 oasc.RequestHandlers.initHandlersFromConfig created mock: org.apache.solr.core.MockQuerySenderListenerReqHandler
[junit4:junit4]   2> 5820 T110 oasc.RequestHandlers.initHandlersFromConfig created /admin/: org.apache.solr.handler.admin.AdminHandlers
[junit4:junit4]   2> 5822 T110 oasc.RequestHandlers.initHandlersFromConfig created defaults: solr.StandardRequestHandler
[junit4:junit4]   2> 5822 T110 oasc.RequestHandlers.initHandlersFromConfig adding lazy requestHandler: solr.StandardRequestHandler
[junit4:junit4]   2> 5823 T110 oasc.RequestHandlers.initHandlersFromConfig created lazy: solr.StandardRequestHandler
[junit4:junit4]   2> 5824 T110 oasc.RequestHandlers.initHandlersFromConfig created /update: solr.UpdateRequestHandler
[junit4:junit4]   2> 5825 T110 oasc.RequestHandlers.initHandlersFromConfig created /terms: org.apache.solr.handler.component.SearchHandler
[junit4:junit4]   2> 5826 T110 oasc.RequestHandlers.initHandlersFromConfig created spellCheckCompRH: org.apache.solr.handler.component.SearchHandler
[junit4:junit4]   2> 5827 T110 oasc.RequestHandlers.initHandlersFromConfig created spellCheckCompRH_Direct: org.apache.solr.handler.component.SearchHandler
[junit4:junit4]   2> 5828 T110 oasc.RequestHandlers.initHandlersFromConfig created spellCheckWithWordbreak: org.apache.solr.handler.component.SearchHandler
[junit4:junit4]   2> 5829 T110 oasc.RequestHandlers.initHandlersFromConfig created spellCheckWithWordbreak_Direct: org.apache.solr.handler.component.SearchHandler
[junit4:junit4]   2> 5830 T110 oasc.RequestHandlers.initHandlersFromConfig created spellCheckCompRH1: org.apache.solr.handler.component.SearchHandler
[junit4:junit4]   2> 5831 T110 oasc.RequestHandlers.initHandlersFromConfig created mltrh: org.apache.solr.handler.component.SearchHandler
[junit4:junit4]   2> 5832 T110 oasc.RequestHandlers.initHandlersFromConfig created tvrh: org.apache.solr.handler.component.SearchHandler
[junit4:junit4]   2> 5832 T110 oasc.RequestHandlers.initHandlersFromConfig created /mlt: solr.MoreLikeThisHandler
[junit4:junit4]   2> 5833 T110 oasc.RequestHandlers.initHandlersFromConfig created /debug/dump: solr.DumpRequestHandler
[junit4:junit4]   2> 5848 T110 oashl.XMLLoader.init xsltCacheLifetimeSeconds=60
[junit4:junit4]   2> 5853 T110 oasc.SolrCore.initDeprecatedSupport WARNING solrconfig.xml uses deprecated <admin/gettableFiles>, Please update your config to use the ShowFileRequestHandler.
[junit4:junit4]   2> 5855 T110 oasc.SolrCore.initDeprecatedSupport WARNING adding ShowFileRequestHandler with hidden files: [SCHEMA.XML, OLD_SYNONYMS.TXT, STOPWORDS.TXT, PROTWORDS.TXT, OPEN-EXCHANGE-RATES.JSON, SYNONYMS.TXT, CURRENCY.XML, MAPPING-ISOLATIN1ACCENT.TXT]
[junit4:junit4]   2> 5859 T110 oasc.CachingDirectoryFactory.close Releasing directory:/usr/home/hudson/hudson-slave/workspace/Lucene-Solr-Tests-trunk-java7/solr/build/solr-core/test/J1/./org.apache.solr.cloud.SyncSliceTest-1359843844230/jetty1
[junit4:junit4]   2> 5860 T91 oascc.ZkStateReader.updateClusterState Updating cloud state from ZooKeeper... 
[junit4:junit4]   2> 5861 T110 oass.SolrIndexSearcher.<init> Opening Searcher@5005d047 main
[junit4:junit4]   2> 5862 T91 oasc.Overseer$ClusterStateUpdater.updateState Update state numShards=1 message={
[junit4:junit4]   2> 	  "operation":"state",
[junit4:junit4]   2> 	  "numShards":"1",
[junit4:junit4]   2> 	  "shard":"shard1",
[junit4:junit4]   2> 	  "roles":null,
[junit4:junit4]   2> 	  "state":"active",
[junit4:junit4]   2> 	  "core":"collection1",
[junit4:junit4]   2> 	  "collection":"control_collection",
[junit4:junit4]   2> 	  "node_name":"127.0.0.1:15097__pq",
[junit4:junit4]   2> 	  "base_url":"http://127.0.0.1:15097/_pq"}
[junit4:junit4]   2> 5862 T110 oasu.CommitTracker.<init> Hard AutoCommit: disabled
[junit4:junit4]   2> 5863 T110 oasu.CommitTracker.<init> Soft AutoCommit: disabled
[junit4:junit4]   2> 5864 T110 oashc.SpellCheckComponent.inform Initializing spell checkers
[junit4:junit4]   2> 5882 T90 oascc.ZkStateReader$2.process A cluster state change: WatchedEvent state:SyncConnected type:NodeDataChanged path:/clusterstate.json, has occurred - updating... (live nodes size: 2)
[junit4:junit4]   2> 5882 T96 oascc.ZkStateReader$2.process A cluster state change: WatchedEvent state:SyncConnected type:NodeDataChanged path:/clusterstate.json, has occurred - updating... (live nodes size: 2)
[junit4:junit4]   2> 5882 T109 oascc.ZkStateReader$2.process A cluster state change: WatchedEvent state:SyncConnected type:NodeDataChanged path:/clusterstate.json, has occurred - updating... (live nodes size: 2)
[junit4:junit4]   2> 5883 T110 oass.DirectSolrSpellChecker.init init: {name=direct,classname=DirectSolrSpellChecker,field=lowerfilt,minQueryLength=3}
[junit4:junit4]   2> 5947 T111 oasc.SolrCore.registerSearcher [collection1] Registered new searcher Searcher@5005d047 main{StandardDirectoryReader(segments_1:1)}
[junit4:junit4]   2> 5956 T110 oasc.ZkController.publish publishing core=collection1 state=down
[junit4:junit4]   2> 5957 T110 oasc.ZkController.publish numShards not found on descriptor - reading it from system property
[junit4:junit4]   2> 7389 T91 oascc.ZkStateReader.updateClusterState Updating cloud state from ZooKeeper... 
[junit4:junit4]   2> 7390 T91 oasc.Overseer$ClusterStateUpdater.updateState Update state numShards=1 message={
[junit4:junit4]   2> 	  "operation":"state",
[junit4:junit4]   2> 	  "numShards":"1",
[junit4:junit4]   2> 	  "shard":null,
[junit4:junit4]   2> 	  "roles":null,
[junit4:junit4]   2> 	  "state":"down",
[junit4:junit4]   2> 	  "core":"collection1",
[junit4:junit4]   2> 	  "collection":"collection1",
[junit4:junit4]   2> 	  "node_name":"127.0.0.1:34013__pq",
[junit4:junit4]   2> 	  "base_url":"http://127.0.0.1:34013/_pq"}
[junit4:junit4]   2> 7391 T91 oasc.Overseer$ClusterStateUpdater.createCollection Create collection collection1 with numShards 1
[junit4:junit4]   2> 7391 T91 oasc.Overseer$ClusterStateUpdater.updateState Assigning new node to shard shard=shard1
[junit4:junit4]   2> 7397 T90 oascc.ZkStateReader$2.process A cluster state change: WatchedEvent state:SyncConnected type:NodeDataChanged path:/clusterstate.json, has occurred - updating... (live nodes size: 2)
[junit4:junit4]   2> 7398 T109 oascc.ZkStateReader$2.process A cluster state change: WatchedEvent state:SyncConnected type:NodeDataChanged path:/clusterstate.json, has occurred - updating... (live nodes size: 2)
[junit4:junit4]   2> 7398 T96 oascc.ZkStateReader$2.process A cluster state change: WatchedEvent state:SyncConnected type:NodeDataChanged path:/clusterstate.json, has occurred - updating... (live nodes size: 2)
[junit4:junit4]   2> 7961 T110 oasc.CoreContainer.registerCore registering core: collection1
[junit4:junit4]   2> 7961 T110 oasc.ZkController.register Register replica - core:collection1 address:http://127.0.0.1:34013/_pq collection:collection1 shard:shard1
[junit4:junit4]   2> 7963 T110 oascc.SolrZkClient.makePath makePath: /collections/collection1/leader_elect/shard1/election
[junit4:junit4]   2> 7981 T73 oazs.PrepRequestProcessor.pRequest Got user-level KeeperException when processing sessionid:0x13c9d02617d0006 type:delete cxid:0x45 zxid:0x5b txntype:-1 reqpath:n/a Error Path:/solr/collections/collection1/leaders Error:KeeperErrorCode = NoNode for /solr/collections/collection1/leaders
[junit4:junit4]   2> 7983 T110 oasc.ShardLeaderElectionContext.runLeaderProcess Running the leader process.
[junit4:junit4]   2> 7984 T73 oazs.PrepRequestProcessor.pRequest Got user-level KeeperException when processing sessionid:0x13c9d02617d0006 type:create cxid:0x46 zxid:0x5c txntype:-1 reqpath:n/a Error Path:/solr/overseer Error:KeeperErrorCode = NodeExists for /solr/overseer
[junit4:junit4]   2> 7993 T110 oasc.ShardLeaderElectionContext.waitForReplicasToComeUp Enough replicas found to continue.
[junit4:junit4]   2> 7993 T110 oasc.ShardLeaderElectionContext.runLeaderProcess I may be the new leader - try and sync
[junit4:junit4]   2> 7994 T110 oasc.SyncStrategy.sync Sync replicas to http://127.0.0.1:34013/_pq/collection1/
[junit4:junit4]   2> 7994 T110 oasc.SyncStrategy.syncReplicas Sync Success - now sync replicas to me
[junit4:junit4]   2> 7994 T110 oasc.SyncStrategy.syncToMe http://127.0.0.1:34013/_pq/collection1/ has no replicas
[junit4:junit4]   2> 7995 T110 oasc.ShardLeaderElectionContext.runLeaderProcess I am the new leader: http://127.0.0.1:34013/_pq/collection1/
[junit4:junit4]   2> 7995 T110 oascc.SolrZkClient.makePath makePath: /collections/collection1/leaders/shard1
[junit4:junit4]   2> 8002 T73 oazs.PrepRequestProcessor.pRequest Got user-level KeeperException when processing sessionid:0x13c9d02617d0006 type:create cxid:0x50 zxid:0x60 txntype:-1 reqpath:n/a Error Path:/solr/overseer Error:KeeperErrorCode = NodeExists for /solr/overseer
[junit4:junit4]   2> 8905 T91 oascc.ZkStateReader.updateClusterState Updating cloud state from ZooKeeper... 
[junit4:junit4]   2> 8927 T96 oascc.ZkStateReader$2.process A cluster state change: WatchedEvent state:SyncConnected type:NodeDataChanged path:/clusterstate.json, has occurred - updating... (live nodes size: 2)
[junit4:junit4]   2> 8927 T90 oascc.ZkStateReader$2.process A cluster state change: WatchedEvent state:SyncConnected type:NodeDataChanged path:/clusterstate.json, has occurred - updating... (live nodes size: 2)
[junit4:junit4]   2> 8927 T109 oascc.ZkStateReader$2.process A cluster state change: WatchedEvent state:SyncConnected type:NodeDataChanged path:/clusterstate.json, has occurred - updating... (live nodes size: 2)
[junit4:junit4]   2> 8975 T110 oasc.ZkController.register We are http://127.0.0.1:34013/_pq/collection1/ and leader is http://127.0.0.1:34013/_pq/collection1/
[junit4:junit4]   2> 8975 T110 oasc.ZkController.register No LogReplay needed for core=collection1 baseURL=http://127.0.0.1:34013/_pq
[junit4:junit4]   2> 8975 T110 oasc.ZkController.checkRecovery I am the leader, no recovery necessary
[junit4:junit4]   2> 8976 T110 oasc.ZkController.publish publishing core=collection1 state=active
[junit4:junit4]   2> 8976 T110 oasc.ZkController.publish numShards not found on descriptor - reading it from system property
[junit4:junit4]   2> 8979 T110 oascc.ZkStateReader.updateClusterState Updating cloud state from ZooKeeper... 
[junit4:junit4]   2> 8981 T68 oass.SolrDispatchFilter.init user.dir=/usr/home/hudson/hudson-slave/workspace/Lucene-Solr-Tests-trunk-java7/solr/build/solr-core/test/J1
[junit4:junit4]   2> 8982 T68 oass.SolrDispatchFilter.init SolrDispatchFilter.init() done
[junit4:junit4]   2> 8982 T68 oascsi.HttpClientUtil.createClient Creating new http client, config:maxConnections=128&maxConnectionsPerHost=32&followRedirects=false
[junit4:junit4]   2> 9187 T68 oejs.Server.doStart jetty-8.1.8.v20121106
[junit4:junit4]   2> 9191 T68 oejs.AbstractConnector.doStart Started SocketConnector@127.0.0.1:30729
[junit4:junit4]   2> 9192 T68 oass.SolrDispatchFilter.init SolrDispatchFilter.init()
[junit4:junit4]   2> 9192 T68 oasc.SolrResourceLoader.locateSolrHome JNDI not configured for solr (NoInitialContextEx)
[junit4:junit4]   2> 9193 T68 oasc.SolrResourceLoader.locateSolrHome using system property solr.solr.home: /usr/home/hudson/hudson-slave/workspace/Lucene-Solr-Tests-trunk-java7/solr/build/solr-core/test/J1/./org.apache.solr.cloud.SyncSliceTest-jetty2-1359843853223
[junit4:junit4]   2> 9194 T68 oasc.CoreContainer$Initializer.initialize looking for solr.xml: /usr/home/hudson/hudson-slave/workspace/Lucene-Solr-Tests-trunk-java7/solr/build/solr-core/test/J1/./org.apache.solr.cloud.SyncSliceTest-jetty2-1359843853223/solr.xml
[junit4:junit4]   2> 9194 T68 oasc.CoreContainer.<init> New CoreContainer 811270547
[junit4:junit4]   2> 9195 T68 oasc.CoreContainer.load Loading CoreContainer using Solr Home: '/usr/home/hudson/hudson-slave/workspace/Lucene-Solr-Tests-trunk-java7/solr/build/solr-core/test/J1/./org.apache.solr.cloud.SyncSliceTest-jetty2-1359843853223/'
[junit4:junit4]   2> 9196 T68 oasc.SolrResourceLoader.<init> new SolrResourceLoader for directory: '/usr/home/hudson/hudson-slave/workspace/Lucene-Solr-Tests-trunk-java7/solr/build/solr-core/test/J1/./org.apache.solr.cloud.SyncSliceTest-jetty2-1359843853223/'
[junit4:junit4]   2> 9259 T68 oashc.HttpShardHandlerFactory.getParameter Setting socketTimeout to: 60000
[junit4:junit4]   2> 9260 T68 oashc.HttpShardHandlerFactory.getParameter Setting urlScheme to: http://
[junit4:junit4]   2> 9261 T68 oashc.HttpShardHandlerFactory.getParameter Setting connTimeout to: 15000
[junit4:junit4]   2> 9261 T68 oashc.HttpShardHandlerFactory.getParameter Setting maxConnectionsPerHost to: 20
[junit4:junit4]   2> 9262 T68 oashc.HttpShardHandlerFactory.getParameter Setting corePoolSize to: 0
[junit4:junit4]   2> 9262 T68 oashc.HttpShardHandlerFactory.getParameter Setting maximumPoolSize to: 2147483647
[junit4:junit4]   2> 9263 T68 oashc.HttpShardHandlerFactory.getParameter Setting maxThreadIdleTime to: 5
[junit4:junit4]   2> 9264 T68 oashc.HttpShardHandlerFactory.getParameter Setting sizeOfQueue to: -1
[junit4:junit4]   2> 9264 T68 oashc.HttpShardHandlerFactory.getParameter Setting fairnessPolicy to: false
[junit4:junit4]   2> 9265 T68 oascsi.HttpClientUtil.createClient Creating new http client, config:maxConnectionsPerHost=20&maxConnections=10000&socketTimeout=60000&connTimeout=15000&retry=false
[junit4:junit4]   2> 9289 T68 oasc.CoreContainer.load Registering Log Listener
[junit4:junit4]   2> 9313 T68 oasc.CoreContainer.initZooKeeper Zookeeper client=127.0.0.1:16522/solr
[junit4:junit4]   2> 9314 T68 oasc.ZkController.checkChrootPath zkHost includes chroot
[junit4:junit4]   2> 9314 T68 oaz.ZooKeeper.<init> Initiating client connection, connectString=127.0.0.1:16522 sessionTimeout=60000 watcher=org.apache.solr.common.cloud.ConnectionManager@5e84b982
[junit4:junit4]   2> 9316 T68 oascc.ConnectionManager.waitForConnected Waiting for client to connect to ZooKeeper
[junit4:junit4]   2> 9316 T121 oaz.ClientCnxn$SendThread.logStartConnect Opening socket connection to server localhost/127.0.0.1:16522. Will not attempt to authenticate using SASL (access denied ("javax.security.auth.AuthPermission" "getLoginConfiguration"))
[junit4:junit4]   2> 9317 T121 oaz.ClientCnxn$SendThread.primeConnection Socket connection established to localhost/127.0.0.1:16522, initiating session
[junit4:junit4]   2> 9317 T70 oazs.NIOServerCnxnFactory.run Accepted socket connection from /140.211.11.196:39639
[junit4:junit4]   2> 9318 T70 oazs.ZooKeeperServer.processConnectRequest Client attempting to establish new session at /140.211.11.196:39639
[junit4:junit4]   2> 9320 T72 oazs.ZooKeeperServer.finishSessionInit Established session 0x13c9d02617d0007 with negotiated timeout 20000 for client /140.211.11.196:39639
[junit4:junit4]   2> 9320 T121 oaz.ClientCnxn$SendThread.onConnected Session establishment complete on server localhost/127.0.0.1:16522, sessionid = 0x13c9d02617d0007, negotiated timeout = 20000
[junit4:junit4]   2> 9321 T122 oascc.ConnectionManager.process Watcher org.apache.solr.common.cloud.ConnectionManager@5e84b982 name:ZooKeeperConnection Watcher:127.0.0.1:16522 got event WatchedEvent state:SyncConnected type:None path:null path:null type:None
[junit4:junit4]   2> 9322 T68 oascc.ConnectionManager.waitForConnected Client is connected to ZooKeeper
[junit4:junit4]   2> 9324 T73 oazs.PrepRequestProcessor.pRequest2Txn Processed session termination for sessionid: 0x13c9d02617d0007
[junit4:junit4]   2> 9326 T70 oazs.NIOServerCnxn.closeSock Closed socket connection for client /140.211.11.196:39639 which had sessionid 0x13c9d02617d0007
[junit4:junit4]   2> 9326 T68 oaz.ZooKeeper.close Session: 0x13c9d02617d0007 closed
[junit4:junit4]   2> 9326 T122 oaz.ClientCnxn$EventThread.run EventThread shut down
[junit4:junit4]   2> 9327 T68 oascsi.HttpClientUtil.createClient Creating new http client, config:maxConnections=500&maxConnectionsPerHost=16&socketTimeout=60000&connTimeout=15000
[junit4:junit4]   2> 9341 T68 oaz.ZooKeeper.<init> Initiating client connection, connectString=127.0.0.1:16522/solr sessionTimeout=30000 watcher=org.apache.solr.common.cloud.ConnectionManager@49fa82ea
[junit4:junit4]   2> 9342 T68 oascc.ConnectionManager.waitForConnected Waiting for client to connect to ZooKeeper
[junit4:junit4]   2> 9343 T123 oaz.ClientCnxn$SendThread.logStartConnect Opening socket connection to server localhost/127.0.0.1:16522. Will not attempt to authenticate using SASL (access denied ("javax.security.auth.AuthPermission" "getLoginConfiguration"))
[junit4:junit4]   2> 9343 T123 oaz.ClientCnxn$SendThread.primeConnection Socket connection established to localhost/127.0.0.1:16522, initiating session
[junit4:junit4]   2> 9344 T70 oazs.NIOServerCnxnFactory.run Accepted socket connection from /140.211.11.196:19957
[junit4:junit4]   2> 9344 T70 oazs.ZooKeeperServer.processConnectRequest Client attempting to establish new session at /140.211.11.196:19957
[junit4:junit4]   2> 9346 T72 oazs.ZooKeeperServer.finishSessionInit Established session 0x13c9d02617d0008 with negotiated timeout 20000 for client /140.211.11.196:19957
[junit4:junit4]   2> 9346 T123 oaz.ClientCnxn$SendThread.onConnected Session establishment complete on server localhost/127.0.0.1:16522, sessionid = 0x13c9d02617d0008, negotiated timeout = 20000
[junit4:junit4]   2> 9347 T124 oascc.ConnectionManager.process Watcher org.apache.solr.common.cloud.ConnectionManager@49fa82ea name:ZooKeeperConnection Watcher:127.0.0.1:16522/solr got event WatchedEvent state:SyncConnected type:None path:null path:null type:None
[junit4:junit4]   2> 9348 T68 oascc.ConnectionManager.waitForConnected Client is connected to ZooKeeper
[junit4:junit4]   2> 9349 T73 oazs.PrepRequestProcessor.pRequest Got user-level KeeperException when processing sessionid:0x13c9d02617d0008 type:create cxid:0x1 zxid:0x6d txntype:-1 reqpath:n/a Error Path:/solr/overseer Error:KeeperErrorCode = NodeExists for /solr/overseer
[junit4:junit4]   2> 9351 T73 oazs.PrepRequestProcessor.pRequest Got user-level KeeperException when processing sessionid:0x13c9d02617d0008 type:create cxid:0x2 zxid:0x6e txntype:-1 reqpath:n/a Error Path:/solr/overseer Error:KeeperErrorCode = NodeExists for /solr/overseer
[junit4:junit4]   2> 9353 T68 oasc.ZkController.createEphemeralLiveNode Register node as live in ZooKeeper:/live_nodes/127.0.0.1:30729__pq
[junit4:junit4]   2> 9354 T73 oazs.PrepRequestProcessor.pRequest Got user-level KeeperException when processing sessionid:0x13c9d02617d0008 type:delete cxid:0x4 zxid:0x6f txntype:-1 reqpath:n/a Error Path:/solr/live_nodes/127.0.0.1:30729__pq Error:KeeperErrorCode = NoNode for /solr/live_nodes/127.0.0.1:30729__pq
[junit4:junit4]   2> 9361 T68 oascc.SolrZkClient.makePath makePath: /live_nodes/127.0.0.1:30729__pq
[junit4:junit4]   2> 9365 T90 oascc.ZkStateReader$2.process A cluster state change: WatchedEvent state:SyncConnected type:NodeChildrenChanged path:/live_nodes, has occurred - updating... (live nodes size: 2)
[junit4:junit4]   2> 9366 T109 oascc.ZkStateReader$2.process A cluster state change: WatchedEvent state:SyncConnected type:NodeChildrenChanged path:/live_nodes, has occurred - updating... (live nodes size: 2)
[junit4:junit4]   2> 9366 T96 oascc.ZkStateReader$3.process Updating live nodes... (3)
[junit4:junit4]   2> 9367 T96 oascc.ZkStateReader$2.process A cluster state change: WatchedEvent state:SyncConnected type:NodeChildrenChanged path:/live_nodes, has occurred - updating... (live nodes size: 3)
[junit4:junit4]   2> 9370 T90 oascc.ZkStateReader$3.process Updating live nodes... (3)
[junit4:junit4]   2> 9370 T109 oascc.ZkStateReader$3.process Updating live nodes... (3)
[junit4:junit4]   2> 9372 T68 oascc.ZkStateReader.createClusterStateWatchersAndUpdate Updating cluster state from ZooKeeper... 
[junit4:junit4]   2> 9382 T125 oasc.CoreContainer.create Creating SolrCore 'collection1' using instanceDir: /usr/home/hudson/hudson-slave/workspace/Lucene-Solr-Tests-trunk-java7/solr/build/solr-core/test/J1/./org.apache.solr.cloud.SyncSliceTest-jetty2-1359843853223/collection1
[junit4:junit4]   2> 9383 T125 oasc.ZkController.createCollectionZkNode Check for collection zkNode:collection1
[junit4:junit4]   2> 9384 T125 oasc.ZkController.createCollectionZkNode Collection zkNode exists
[junit4:junit4]   2> 9384 T125 oasc.ZkController.readConfigName Load collection config from:/collections/collection1
[junit4:junit4]   2> 9386 T125 oasc.SolrResourceLoader.<init> new SolrResourceLoader for directory: '/usr/home/hudson/hudson-slave/workspace/Lucene-Solr-Tests-trunk-java7/solr/build/solr-core/test/J1/./org.apache.solr.cloud.SyncSliceTest-jetty2-1359843853223/collection1/'
[junit4:junit4]   2> 9388 T125 oasc.SolrResourceLoader.replaceClassLoader Adding 'file:/usr/home/hudson/hudson-slave/workspace/Lucene-Solr-Tests-trunk-java7/solr/build/solr-core/test/J1/org.apache.solr.cloud.SyncSliceTest-jetty2-1359843853223/collection1/lib/README' to classloader
[junit4:junit4]   2> 9389 T125 oasc.SolrResourceLoader.replaceClassLoader Adding 'file:/usr/home/hudson/hudson-slave/workspace/Lucene-Solr-Tests-trunk-java7/solr/build/solr-core/test/J1/org.apache.solr.cloud.SyncSliceTest-jetty2-1359843853223/collection1/lib/classes/' to classloader
[junit4:junit4]   2> 9453 T125 oasc.SolrConfig.<init> Using Lucene MatchVersion: LUCENE_50
[junit4:junit4]   2> 9554 T125 oasc.SolrConfig.<init> Loaded SolrConfig: solrconfig.xml
[junit4:junit4]   2> 9655 T125 oass.IndexSchema.readSchema Reading Solr Schema
[junit4:junit4]   2> 9678 T125 oass.IndexSchema.readSchema Schema name=test
[junit4:junit4]   2> 10430 T125 oass.OpenExchangeRatesOrgProvider.init Initialized with rates=open-exchange-rates.json, refreshInterval=1440.
[junit4:junit4]   2> 10441 T125 oass.IndexSchema.readSchema default search field in schema is text
[junit4:junit4]   2> 10443 T91 oascc.ZkStateReader.updateClusterState Updating cloud state from ZooKeeper... 
[junit4:junit4]   2> 10444 T91 oasc.Overseer$ClusterStateUpdater.updateState Update state numShards=1 message={
[junit4:junit4]   2> 	  "operation":"state",
[junit4:junit4]   2> 	  "numShards":"1",
[junit4:junit4]   2> 	  "shard":"shard1",
[junit4:junit4]   2> 	  "roles":null,
[junit4:junit4]   2> 	  "state":"active",
[junit4:junit4]   2> 	  "core":"collection1",
[junit4:junit4]   2> 	  "collection":"collection1",
[junit4:junit4]   2> 	  "node_name":"127.0.0.1:34013__pq",
[junit4:junit4]   2> 	  "base_url":"http://127.0.0.1:34013/_pq"}
[junit4:junit4]   2> 10445 T125 oass.IndexSchema.readSchema unique key field: id
[junit4:junit4]   2> 10479 T96 oascc.ZkStateReader$2.process A cluster state change: WatchedEvent state:SyncConnected type:NodeDataChanged path:/clusterstate.json, has occurred - updating... (live nodes size: 3)
[junit4:junit4]   2> 10479 T109 oascc.ZkStateReader$2.process A cluster state change: WatchedEvent state:SyncConnected type:NodeDataChanged path:/clusterstate.json, has occurred - updating... (live nodes size: 3)
[junit4:junit4]   2> 10479 T124 oascc.ZkStateReader$2.process A cluster state change: WatchedEvent state:SyncConnected type:NodeDataChanged path:/clusterstate.json, has occurred - updating... (live nodes size: 3)
[junit4:junit4]   2> 10479 T90 oascc.ZkStateReader$2.process A cluster state change: WatchedEvent state:SyncConnected type:NodeDataChanged path:/clusterstate.json, has occurred - updating... (live nodes size: 3)
[junit4:junit4]   2> 10501 T125 oass.FileExchangeRateProvider.reload Reloading exchange rates from file currency.xml
[junit4:junit4]   2> 10506 T125 oass.FileExchangeRateProvider.reload Reloading exchange rates from file currency.xml
[junit4:junit4]   2> 10511 T125 oass.OpenExchangeRatesOrgProvider.reload Reloading exchange rates from open-exchange-rates.json
[junit4:junit4]   2> 10513 T125 oass.OpenExchangeRatesOrgProvider.reload Reloading exchange rates from open-exchange-rates.json
[junit4:junit4]   2> 10516 T125 oasc.SolrCore.<init> [collection1] Opening new SolrCore at /usr/home/hudson/hudson-slave/workspace/Lucene-Solr-Tests-trunk-java7/solr/build/solr-core/test/J1/./org.apache.solr.cloud.SyncSliceTest-jetty2-1359843853223/collection1/, dataDir=./org.apache.solr.cloud.SyncSliceTest-1359843844230/jetty2/
[junit4:junit4]   2> 10516 T125 oasc.JmxMonitoredMap.<init> JMX monitoring is enabled. Adding Solr mbeans to JMX Server: com.sun.jmx.mbeanserver.JmxMBeanServer@71ac4afb
[junit4:junit4]   2> 10517 T125 oasc.SolrCore.initDirectoryFactory solr.NRTCachingDirectoryFactory
[junit4:junit4]   2> 10518 T125 oasc.CachingDirectoryFactory.get return new directory for /usr/home/hudson/hudson-slave/workspace/Lucene-Solr-Tests-trunk-java7/solr/build/solr-core/test/J1/./org.apache.solr.cloud.SyncSliceTest-1359843844230/jetty2 forceNew:false
[junit4:junit4]   2> 10518 T125 oasc.CachingDirectoryFactory.close Releasing directory:/usr/home/hudson/hudson-slave/workspace/Lucene-Solr-Tests-trunk-java7/solr/build/solr-core/test/J1/./org.apache.solr.cloud.SyncSliceTest-1359843844230/jetty2
[junit4:junit4]   2> 10518 T125 oasc.SolrCore.getNewIndexDir New index directory detected: old=null new=./org.apache.solr.cloud.SyncSliceTest-1359843844230/jetty2/index/
[junit4:junit4]   2> 10519 T125 oasc.SolrCore.initIndex WARNING [collection1] Solr index directory './org.apache.solr.cloud.SyncSliceTest-1359843844230/jetty2/index' doesn't exist. Creating new index...
[junit4:junit4]   2> 10520 T125 oasc.CachingDirectoryFactory.get return new directory for /usr/home/hudson/hudson-slave/workspace/Lucene-Solr-Tests-trunk-java7/solr/build/solr-core/test/J1/./org.apache.solr.cloud.SyncSliceTest-1359843844230/jetty2/index forceNew:false
[junit4:junit4]   2> 10526 T125 oasc.SolrDeletionPolicy.onCommit SolrDeletionPolicy.onCommit: commits:num=1
[junit4:junit4]   2> 		commit{dir=RateLimitedDirectoryWrapper(NRTCachingDirectory(org.apache.lucene.store.NIOFSDirectory@/usr/home/hudson/hudson-slave/workspace/Lucene-Solr-Tests-trunk-java7/solr/build/solr-core/test/J1/org.apache.solr.cloud.SyncSliceTest-1359843844230/jetty2/index lockFactory=org.apache.lucene.store.NativeFSLockFactory@4984e7c9; maxCacheMB=48.0 maxMergeSizeMB=4.0)),segFN=segments_1,generation=1,filenames=[segments_1]
[junit4:junit4]   2> 10526 T125 oasc.SolrDeletionPolicy.updateCommits newest commit = 1[segments_1]
[junit4:junit4]   2> 10527 T125 oasc.CachingDirectoryFactory.close Releasing directory:/usr/home/hudson/hudson-slave/workspace/Lucene-Solr-Tests-trunk-java7/solr/build/solr-core/test/J1/./org.apache.solr.cloud.SyncSliceTest-1359843844230/jetty2/index
[junit4:junit4]   2> 10527 T125 oasc.SolrCore.initWriters created xml: solr.XMLResponseWriter
[junit4:junit4]   2> 10529 T125 oasup.UpdateRequestProcessorChain.init inserting DistributedUpdateProcessorFactory into updateRequestProcessorChain "dedupe"
[junit4:junit4]   2> 10530 T125 oasup.UpdateRequestProcessorChain.init inserting DistributedUpdateProcessorFactory into updateRequestProcessorChain "dedupe-allfields"
[junit4:junit4]   2> 10530 T125 oasup.UpdateRequestProcessorChain.init inserting DistributedUpdateProcessorFactory into updateRequestProcessorChain "stored_sig"
[junit4:junit4]   2> 10531 T125 oasup.UpdateRequestProcessorChain.init inserting DistributedUpdateProcessorFactory into updateRequestProcessorChain "uniq-fields"
[junit4:junit4]   2> 10531 T125 oasup.UpdateRequestProcessorChain.init inserting DistributedUpdateProcessorFactory into updateRequestProcessorChain "distrib-dup-test-chain-implicit"
[junit4:junit4]   2> 10532 T125 oasc.RequestHandlers.initHandlersFromConfig adding lazy requestHandler: solr.ReplicationHandler
[junit4:junit4]   2> 10532 T125 oasc.RequestHandlers.initHandlersFromConfig created /replication: solr.ReplicationHandler
[junit4:junit4]   2> 10533 T125 oasc.RequestHandlers.initHandlersFromConfig created standard: solr.StandardRequestHandler
[junit4:junit4]   2> 10534 T125 oasc.RequestHandlers.initHandlersFromConfig created /get: solr.RealTimeGetHandler
[junit4:junit4]   2> 10534 T125 oasc.RequestHandlers.initHandlersFromConfig created dismax: solr.SearchHandler
[junit4:junit4]   2> 10535 T125 oasc.RequestHandlers.initHandlersFromConfig created mock: org.apache.solr.core.MockQuerySenderListenerReqHandler
[junit4:junit4]   2> 10535 T125 oasc.RequestHandlers.initHandlersFromConfig created /admin/: org.apache.solr.handler.admin.AdminHandlers
[junit4:junit4]   2> 10536 T125 oasc.RequestHandlers.initHandlersFromConfig created defaults: solr.StandardRequestHandler
[junit4:junit4]   2> 10536 T125 oasc.RequestHandlers.initHandlersFromConfig adding lazy requestHandler: solr.StandardRequestHandler
[junit4:junit4]   2> 10537 T125 oasc.RequestHandlers.initHandlersFromConfig created lazy: solr.StandardRequestHandler
[junit4:junit4]   2> 10537 T125 oasc.RequestHandlers.initHandlersFromConfig created /update: solr.UpdateRequestHandler
[junit4:junit4]   2> 10538 T125 oasc.RequestHandlers.initHandlersFromConfig created /terms: org.apache.solr.handler.component.SearchHandler
[junit4:junit4]   2> 10538 T125 oasc.RequestHandlers.initHandlersFromConfig created spellCheckCompRH: org.apache.solr.handler.component.SearchHandler
[junit4:junit4]   2> 10539 T125 oasc.RequestHandlers.initHandlersFromConfig created spellCheckCompRH_Direct: org.apache.solr.handler.component.SearchHandler
[junit4:junit4]   2> 10539 T125 oasc.RequestHandlers.initHandlersFromConfig created spellCheckWithWordbreak: org.apache.solr.handler.component.SearchHandler
[junit4:junit4]   2> 10540 T125 oasc.RequestHandlers.initHandlersFromConfig created spellCheckWithWordbreak_Direct: org.apache.solr.handler.component.SearchHandler
[junit4:junit4]   2> 10541 T125 oasc.RequestHandlers.initHandlersFromConfig created spellCheckCompRH1: org.apache.solr.handler.component.SearchHandler
[junit4:junit4]   2> 10541 T125 oasc.RequestHandlers.initHandlersFromConfig created mltrh: org.apache.solr.handler.component.SearchHandler
[junit4:junit4]   2> 10542 T125 oasc.RequestHandlers.initHandlersFromConfig created tvrh: org.apache.solr.handler.component.SearchHandler
[junit4:junit4]   2> 10542 T125 oasc.RequestHandlers.initHandlersFromConfig created /mlt: solr.MoreLikeThisHandler
[junit4:junit4]   2> 10543 T125 oasc.RequestHandlers.initHandlersFromConfig created /debug/dump: solr.DumpRequestHandler
[junit4:junit4]   2> 10553 T125 oashl.XMLLoader.init xsltCacheLifetimeSeconds=60
[junit4:junit4]   2> 10557 T125 oasc.SolrCore.initDeprecatedSupport WARNING solrconfig.xml uses deprecated <admin/gettableFiles>, Please update your config to use the ShowFileRequestHandler.
[junit4:junit4]   2> 10559 T125 oasc.SolrCore.initDeprecatedSupport WARNING adding ShowFileRequestHandler with hidden files: [SCHEMA.XML, OLD_SYNONYMS.TXT, STOPWORDS.TXT, PROTWORDS.TXT, OPEN-EXCHANGE-RATES.JSON, SYNONYMS.TXT, CURRENCY.XML, MAPPING-ISOLATIN1ACCENT.TXT]
[junit4:junit4]   2> 10562 T125 oasc.CachingDirectoryFactory.close Releasing directory:/usr/home/hudson/hudson-slave/workspace/Lucene-Solr-Tests-trunk-java7/solr/build/solr-core/test/J1/./org.apache.solr.cloud.SyncSliceTest-1359843844230/jetty2
[junit4:junit4]   2> 10563 T125 oass.SolrIndexSearcher.<init> Opening Searcher@1d531b10 main
[junit4:junit4]   2> 10564 T125 oasu.CommitTracker.<init> Hard AutoCommit: disabled
[junit4:junit4]   2> 10565 T125 oasu.CommitTracker.<init> Soft AutoCommit: disabled
[junit4:junit4]   2> 10565 T125 oashc.SpellCheckComponent.inform Initializing spell checkers
[junit4:junit4]   2> 10582 T125 oass.DirectSolrSpellChecker.init init: {name=direct,classname=DirectSolrSpellChecker,field=lowerfilt,minQueryLength=3}
[junit4:junit4]   2> 10643 T126 oasc.SolrCore.registerSearcher [collection1] Registered new searcher Searcher@1d531b10 main{StandardDirectoryReader(segments_1:1)}
[junit4:junit4]   2> 10648 T125 oasc.ZkController.publish publishing core=collection1 state=down
[junit4:junit4]   2> 10648 T125 oasc.ZkController.publish numShards not found on descriptor - reading it from system property
[junit4:junit4]   2> 11989 T91 oascc.ZkStateReader.updateClusterState Updating cloud state from ZooKeeper... 
[junit4:junit4]   2> 11991 T91 oasc.Overseer$ClusterStateUpdater.updateState Update state numShards=1 message={
[junit4:junit4]   2> 	  "operation":"state",
[junit4:junit4]   2> 	  "numShards":"1",
[junit4:junit4]   2> 	  "shard":null,
[junit4:junit4]   2> 	  "roles":null,
[junit4:junit4]   2> 	  "state":"down",
[junit4:junit4]   2> 	  "core":"collection1",
[junit4:junit4]   2> 	  "collection":"collection1",
[junit4:junit4]   2> 	  "node_name":"127.0.0.1:30729__pq",
[junit4:junit4]   2> 	  "base_url":"http://127.0.0.1:30729/_pq"}
[junit4:junit4]   2> 11991 T91 oasc.Overseer$ClusterStateUpdater.updateState Collection already exists with numShards=1
[junit4:junit4]   2> 11991 T91 oasc.Overseer$ClusterStateUpdater.updateState Assigning new node to shard shard=shard1
[junit4:junit4]   2> 12003 T90 oascc.ZkStateReader$2.process A cluster state change: WatchedEvent state:SyncConnected type:NodeDataChanged path:/clusterstate.json, has occurred - updating... (live nodes size: 3)
[junit4:junit4]   2> 12003 T109 oascc.ZkStateReader$2.process A cluster state change: WatchedEvent state:SyncConnected type:NodeDataChanged path:/clusterstate.json, has occurred - updating... (live nodes size: 3)
[junit4:junit4]   2> 12003 T96 oascc.ZkStateReader$2.process A cluster state change: WatchedEvent state:SyncConnected type:NodeDataChanged path:/clusterstate.json, has occurred - updating... (live nodes size: 3)
[junit4:junit4]   2> 12003 T124 oascc.ZkStateReader$2.process A cluster state change: WatchedEvent state:SyncConnected type:NodeDataChanged path:/clusterstate.json, has occurred - updating... (live nodes size: 3)
[junit4:junit4]   2> 12653 T125 oasc.CoreContainer.registerCore registering core: collection1
[junit4:junit4]   2> 12653 T125 oasc.ZkController.register Register replica - core:collection1 address:http://127.0.0.1:30729/_pq collection:collection1 shard:shard1
[junit4:junit4]   2> 12659 T125 oasc.ZkController.register We are http://127.0.0.1:30729/_pq/collection1/ and leader is http://127.0.0.1:34013/_pq/collection1/
[junit4:junit4]   2> 12659 T125 oasc.ZkController.register No LogReplay needed for core=collection1 baseURL=http://127.0.0.1:30729/_pq
[junit4:junit4]   2> 12660 T125 oasc.ZkController.checkRecovery Core needs to recover:collection1
[junit4:junit4]   2> 12660 T125 oasu.DefaultSolrCoreState.doRecovery Running recovery - first canceling any ongoing recovery
[junit4:junit4]   2> ASYNC  NEW_CORE C4 name=collection1 org.apache.solr.core.SolrCore@110bc24b url=http://127.0.0.1:30729/_pq/collection1 node=127.0.0.1:30729__pq C4_STATE=coll:collection1 core:collection1 props:{shard=null, roles=null, state=down, core=collection1, collection=collection1, node_name=127.0.0.1:30729__pq, base_url=http://127.0.0.1:30729/_pq}
[junit4:junit4]   2> 12666 T127 C4 P30729 oasc.RecoveryStrategy.run Starting recovery process.  core=collection1 recoveringAfterStartup=true
[junit4:junit4]   2> 12667 T125 oascc.ZkStateReader.updateClusterState Updating cloud state from ZooKeeper... 
[junit4:junit4]   2> 12668 T127 C4 P30729 oasc.RecoveryStrategy.doRecovery ###### startupVersions=[]
[junit4:junit4]   2> 12668 T127 C4 P30729 oasc.ZkController.publish publishing core=collection1 state=recovering
[junit4:junit4]   2> 12669 T127 C4 P30729 oasc.ZkController.publish numShards not found on descriptor - reading it from system property
[junit4:junit4]   2> 12669 T68 oass.SolrDispatchFilter.init user.dir=/usr/home/hudson/hudson-slave/workspace/Lucene-Solr-Tests-trunk-java7/solr/build/solr-core/test/J1
[junit4:junit4]   2> 12670 T68 oass.SolrDispatchFilter.init SolrDispatchFilter.init() done
[junit4:junit4]   2> 12670 T68 oascsi.HttpClientUtil.createClient Creating new http client, config:maxConnections=128&maxConnectionsPerHost=32&followRedirects=false
[junit4:junit4]   2> 12671 T127 C4 P30729 oascsi.HttpClientUtil.createClient Creating new http client, config:maxConnections=128&maxConnectionsPerHost=32&followRedirects=false
[junit4:junit4]   2> 12858 T68 oejs.Server.doStart jetty-8.1.8.v20121106
[junit4:junit4]   2> 12861 T68 oejs.AbstractConnector.doStart Started SocketConnector@127.0.0.1:32616
[junit4:junit4]   2> 12862 T68 oass.SolrDispatchFilter.init SolrDispatchFilter.init()
[junit4:junit4]   2> 12862 T68 oasc.SolrResourceLoader.locateSolrHome JNDI not configured for solr (NoInitialContextEx)
[junit4:junit4]   2> 12863 T68 oasc.SolrResourceLoader.locateSolrHome using system property solr.solr.home: /usr/home/hudson/hudson-slave/workspace/Lucene-Solr-Tests-trunk-java7/solr/build/solr-core/test/J1/./org.apache.solr.cloud.SyncSliceTest-jetty3-1359843856916
[junit4:junit4]   2> 12863 T68 oasc.CoreContainer$Initializer.initialize looking for solr.xml: /usr/home/hudson/hudson-slave/workspace/Lucene-Solr-Tests-trunk-java7/solr/build/solr-core/test/J1/./org.apache.solr.cloud.SyncSliceTest-jetty3-1359843856916/solr.xml
[junit4:junit4]   2> 12864 T68 oasc.CoreContainer.<init> New CoreContainer 1935102971
[junit4:junit4]   2> 12865 T68 oasc.CoreContainer.load Loading CoreContainer using Solr Home: '/usr/home/hudson/hudson-slave/workspace/Lucene-Solr-Tests-trunk-java7/solr/build/solr-core/test/J1/./org.apache.solr.cloud.SyncSliceTest-jetty3-1359843856916/'
[junit4:junit4]   2> 12865 T68 oasc.SolrResourceLoader.<init> new SolrResourceLoader for directory: '/usr/home/hudson/hudson-slave/workspace/Lucene-Solr-Tests-trunk-java7/solr/build/solr-core/test/J1/./org.apache.solr.cloud.SyncSliceTest-jetty3-1359843856916/'
[junit4:junit4]   2> 12918 T68 oashc.HttpShardHandlerFactory.getParameter Setting socketTimeout to: 60000
[junit4:junit4]   2> 12919 T68 oashc.HttpShardHandlerFactory.getParameter Setting urlScheme to: http://
[junit4:junit4]   2> 12920 T68 oashc.HttpShardHandlerFactory.getParameter Setting connTimeout to: 15000
[junit4:junit4]   2> 12920 T68 oashc.HttpShardHandlerFactory.getParameter Setting maxConnectionsPerHost to: 20
[junit4:junit4]   2> 12921 T68 oashc.HttpShardHandlerFactory.getParameter Setting corePoolSize to: 0
[junit4:junit4]   2> 12921 T68 oashc.HttpShardHandlerFactory.getParameter Setting maximumPoolSize to: 2147483647
[junit4:junit4]   2> 12922 T68 oashc.HttpShardHandlerFactory.getParameter Setting maxThreadIdleTime to: 5
[junit4:junit4]   2> 12922 T68 oashc.HttpShardHandlerFactory.getParameter Setting sizeOfQueue to: -1
[junit4:junit4]   2> 12923 T68 oashc.HttpShardHandlerFactory.getParameter Setting fairnessPolicy to: false
[junit4:junit4]   2> 12924 T68 oascsi.HttpClientUtil.createClient Creating new http client, config:maxConnectionsPerHost=20&maxConnections=10000&socketTimeout=60000&connTimeout=15000&retry=false
[junit4:junit4]   2> 12948 T68 oasc.CoreContainer.load Registering Log Listener
[junit4:junit4]   2> 12970 T68 oasc.CoreContainer.initZooKeeper Zookeeper client=127.0.0.1:16522/solr
[junit4:junit4]   2> 12971 T68 oasc.ZkController.checkChrootPath zkHost includes chroot
[junit4:junit4]   2> 12971 T68 oaz.ZooKeeper.<init> Initiating client connection, connectString=127.0.0.1:16522 sessionTimeout=60000 watcher=org.apache.solr.common.cloud.ConnectionManager@1169d3a
[junit4:junit4]   2> 12972 T68 oascc.ConnectionManager.waitForConnected Waiting for client to connect to ZooKeeper
[junit4:junit4]   2> 12973 T137 oaz.ClientCnxn$SendThread.logStartConnect Opening socket connection to server localhost/127.0.0.1:16522. Will not attempt to authenticate using SASL (access denied ("javax.security.auth.AuthPermission" "getLoginConfiguration"))
[junit4:junit4]   2> 12974 T137 oaz.ClientCnxn$SendThread.primeConnection Socket connection established to localhost/127.0.0.1:16522, initiating session
[junit4:junit4]   2> 12974 T70 oazs.NIOServerCnxnFactory.run Accepted socket connection from /140.211.11.196:20328
[junit4:junit4]   2> 12975 T70 oazs.ZooKeeperServer.processConnectRequest Client attempting to establish new session at /140.211.11.196:20328
[junit4:junit4]   2> 12977 T72 oazs.ZooKeeperServer.finishSessionInit Established session 0x13c9d02617d0009 with negotiated timeout 20000 for client /140.211.11.196:20328
[junit4:junit4]   2> 12977 T137 oaz.ClientCnxn$SendThread.onConnected Session establishment complete on server localhost/127.0.0.1:16522, sessionid = 0x13c9d02617d0009, negotiated timeout = 20000
[junit4:junit4]   2> 12978 T138 oascc.ConnectionManager.process Watcher org.apache.solr.common.cloud.ConnectionManager@1169d3a name:ZooKeeperConnection Watcher:127.0.0.1:16522 got event WatchedEvent state:SyncConnected type:None path:null path:null type:None
[junit4:junit4]   2> 12978 T68 oascc.ConnectionManager.waitForConnected Client is connected to ZooKeeper
[junit4:junit4]   2> 12980 T73 oazs.PrepRequestProcessor.pRequest2Txn Processed session termination for sessionid: 0x13c9d02617d0009
[junit4:junit4]   2> 12981 T138 oaz.ClientCnxn$EventThread.run EventThread shut down
[junit4:junit4]   2> 12981 T68 oaz.ZooKeeper.close Session: 0x13c9d02617d0009 closed
[junit4:junit4]   2> 12981 T70 oazs.NIOServerCnxn.closeSock Closed socket connection for client /140.211.11.196:20328 which had sessionid 0x13c9d02617d0009
[junit4:junit4]   2> 12982 T68 oascsi.HttpClientUtil.createClient Creating new http client, config:maxConnections=500&maxConnectionsPerHost=16&socketTimeout=60000&connTimeout=15000
[junit4:junit4]   2> 12996 T68 oaz.ZooKeeper.<init> Initiating client connection, connectString=127.0.0.1:16522/solr sessionTimeout=30000 watcher=org.apache.solr.common.cloud.ConnectionManager@af90d11
[junit4:junit4]   2> 12997 T68 oascc.ConnectionManager.waitForConnected Waiting for client to connect to ZooKeeper
[junit4:junit4]   2> 12998 T139 oaz.ClientCnxn$SendThread.logStartConnect Opening socket connection to server localhost/127.0.0.1:16522. Will not attempt to authenticate using SASL (access denied ("javax.security.auth.AuthPermission" "getLoginConfiguration"))
[junit4:junit4]   2> 12999 T139 oaz.ClientCnxn$SendThread.primeConnection Socket connection established to localhost/127.0.0.1:16522, initiating session
[junit4:junit4]   2> 12999 T70 oazs.NIOServerCnxnFactory.run Accepted socket connection from /140.211.11.196:16080
[junit4:junit4]   2> 13000 T70 oazs.ZooKeeperServer.processConnectRequest Client attempting to establish new session at /140.211.11.196:16080
[junit4:junit4]   2> 13002 T72 oazs.ZooKeeperServer.finishSessionInit Established session 0x13c9d02617d000a with negotiated timeout 20000 for client /140.211.11.196:16080
[junit4:junit4]   2> 13002 T139 oaz.ClientCnxn$SendThread.onConnected Session establishment complete on server localhost/127.0.0.1:16522, sessionid = 0x13c9d02617d000a, negotiated timeout = 20000
[junit4:junit4]   2> 13002 T140 oascc.ConnectionManager.process Watcher org.apache.solr.common.cloud.ConnectionManager@af90d11 name:ZooKeeperConnection Watcher:127.0.0.1:16522/solr got event WatchedEvent state:SyncConnected type:None path:null path:null type:None
[junit4:junit4]   2> 13003 T68 oascc.ConnectionManager.waitForConnected Client is connected to ZooKeeper
[junit4:junit4]   2> 13004 T73 oazs.PrepRequestProcessor.pRequest Got user-level KeeperException when processing sessionid:0x13c9d02617d000a type:create cxid:0x1 zxid:0x80 txntype:-1 reqpath:n/a Error Path:/solr/overseer Error:KeeperErrorCode = NodeExists for /solr/overseer
[junit4:junit4]   2> 13006 T73 oazs.PrepRequestProcessor.pRequest Got user-level KeeperException when processing sessionid:0x13c9d02617d000a type:create cxid:0x2 zxid:0x81 txntype:-1 reqpath:n/a Error Path:/solr/overseer Error:KeeperErrorCode = NodeExists for /solr/overseer
[junit4:junit4]   2> 13009 T68 oasc.ZkController.createEphemeralLiveNode Register node as live in ZooKeeper:/live_nodes/127.0.0.1:32616__pq
[junit4:junit4]   2> 13010 T73 oazs.PrepRequestProcessor.pRequest Got user-level KeeperException when processing sessionid:0x13c9d02617d000a type:delete cxid:0x4 zxid:0x82 txntype:-1 reqpath:n/a Error Path:/solr/live_nodes/127.0.0.1:32616__pq Error:KeeperErrorCode = NoNode for /solr/live_nodes/127.0.0.1:32616__pq
[junit4:junit4]   2> 13016 T68 oascc.SolrZkClient.makePath makePath: /live_nodes/127.0.0.1:32616__pq
[junit4:junit4]   2> 13020 T90 oascc.ZkStateReader$2.process A cluster state change: WatchedEvent state:SyncConnected type:NodeChildrenChanged path:/live_nodes, has occurred - updating... (live nodes size: 3)
[junit4:junit4]   2> 13020 T109 oascc.ZkStateReader$2.process A cluster state change: WatchedEvent state:SyncConnected type:NodeChildrenChanged path:/live_nodes, has occurred - updating... (live nodes size: 3)
[junit4:junit4]   2> 13021 T96 oascc.ZkStateReader$3.process Updating live nodes... (4)
[junit4:junit4]   2> 13021 T124 oascc.ZkStateReader$3.process Updating live nodes... (4)
[junit4:junit4]   2> 13022 T96 oascc.ZkStateReader$2.process A cluster state change: WatchedEvent state:SyncConnected type:NodeChildrenChanged path:/live_nodes, has occurred - updating... (live nodes size: 4)
[junit4:junit4]   2> 13022 T124 oascc.ZkStateReader$2.process A cluster state change: WatchedEvent state:SyncConnected type:NodeChildrenChanged path:/live_nodes, has occurred - updating... (live nodes size: 4)
[junit4:junit4]   2> 13024 T90 oascc.ZkStateReader$3.process Updating live nodes... (4)
[junit4:junit4]   2> 13024 T109 oascc.ZkStateReader$3.process Updating live nodes... (4)
[junit4:junit4]   2> 13028 T68 oascc.ZkStateReader.createClusterStateWatchersAndUpdate Updating cluster state from ZooKeeper... 
[junit4:junit4]   2> 13038 T141 oasc.CoreContainer.create Creating SolrCore 'collection1' using instanceDir: /usr/home/hudson/hudson-slave/workspace/Lucene-Solr-Tests-trunk-java7/solr/build/solr-core/test/J1/./org.apache.solr.cloud.SyncSliceTest-jetty3-1359843856916/collection1
[junit4:junit4]   2> 13038 T141 oasc.ZkController.createCollectionZkNode Check for collection zkNode:collection1
[junit4:junit4]   2> 13040 T141 oasc.ZkController.createCollectionZkNode Collection zkNode exists
[junit4:junit4]   2> 13040 T141 oasc.ZkController.readConfigName Load collection config from:/collections/collection1
[junit4:junit4]   2> 13042 T141 oasc.SolrResourceLoader.<init> new SolrResourceLoader for directory: '/usr/home/hudson/hudson-slave/workspace/Lucene-Solr-Tests-trunk-java7/solr/build/solr-core/test/J1/./org.apache.solr.cloud.SyncSliceTest-jetty3-1359843856916/collection1/'
[junit4:junit4]   2> 13044 T141 oasc.SolrResourceLoader.replaceClassLoader Adding 'file:/usr/home/hudson/hudson-slave/workspace/Lucene-Solr-Tests-trunk-java7/solr/build/solr-core/test/J1/org.apache.solr.cloud.SyncSliceTest-jetty3-1359843856916/collection1/lib/README' to classloader
[junit4:junit4]   2> 13045 T141 oasc.SolrResourceLoader.replaceClassLoader Adding 'file:/usr/home/hudson/hudson-slave/workspace/Lucene-Solr-Tests-trunk-java7/solr/build/solr-core/test/J1/org.apache.solr.cloud.SyncSliceTest-jetty3-1359843856916/collection1/lib/classes/' to classloader
[junit4:junit4]   2> 13119 T141 oasc.SolrConfig.<init> Using Lucene MatchVersion: LUCENE_50
[junit4:junit4]   2> 13200 T141 oasc.SolrConfig.<init> Loaded SolrConfig: solrconfig.xml
[junit4:junit4]   2> 13301 T141 oass.IndexSchema.readSchema Reading Solr Schema
[junit4:junit4]   2> 13318 T141 oass.IndexSchema.readSchema Schema name=test
[junit4:junit4]   2> 13516 T91 oascc.ZkStateReader.updateClusterState Updating cloud state from ZooKeeper... 
[junit4:junit4]   2> 13518 T91 oasc.Overseer$ClusterStateUpdater.updateState Update state numShards=1 message={
[junit4:junit4]   2> 	  "operation":"state",
[junit4:junit4]   2> 	  "numShards":"1",
[junit4:junit4]   2> 	  "shard":"shard1",
[junit4:junit4]   2> 	  "roles":null,
[junit4:junit4]   2> 	  "state":"recovering",
[junit4:junit4]   2> 	  "core":"collection1",
[junit4:junit4]   2> 	  "collection":"collection1",
[junit4:junit4]   2> 	  "node_name":"127.0.0.1:30729__pq",
[junit4:junit4]   2> 	  "base_url":"http://127.0.0.1:30729/_pq"}
[junit4:junit4]   2> 13531 T90 oascc.ZkStateReader$2.process A cluster state change: WatchedEvent state:SyncConnected type:NodeDataChanged path:/clusterstate.json, has occurred - updating... (live nodes size: 4)
[junit4:junit4]   2> 13531 T109 oascc.ZkStateReader$2.process A cluster state change: WatchedEvent state:SyncConnected type:NodeDataChanged path:/clusterstate.json, has occurred - updating... (live nodes size: 4)
[junit4:junit4]   2> 13531 T140 oascc.ZkStateReader$2.process A cluster state change: WatchedEvent state:SyncConnected type:NodeDataChanged path:/clusterstate.json, has occurred - updating... (live nodes size: 4)
[junit4:junit4]   2> 13531 T96 oascc.ZkStateReader$2.process A cluster state change: WatchedEvent state:SyncConnected type:NodeDataChanged path:/clusterstate.json, has occurred - updating... (live nodes size: 4)
[junit4:junit4]   2> 13531 T124 oascc.ZkStateReader$2.process A cluster state change: WatchedEvent state:SyncConnected type:NodeDataChanged path:/clusterstate.json, has occurred - updating... (live nodes size: 4)
[junit4:junit4]   2> 13986 T141 oass.OpenExchangeRatesOrgProvider.init Initialized with rates=open-exchange-rates.json, refreshInterval=1440.
[junit4:junit4]   2> 13997 T141 oass.IndexSchema.readSchema default search field in schema is text
[junit4:junit4]   2> 14000 T141 oass.IndexSchema.readSchema unique key field: id
[junit4:junit4]   2> 14027 T141 oass.FileExchangeRateProvider.reload Reloading exchange rates from file currency.xml
[junit4:junit4]   2> 14032 T141 oass.FileExchangeRateProvider.reload Reloading exchange rates from file currency.xml
[junit4:junit4]   2> 14036 T141 oass.OpenExchangeRatesOrgProvider.reload Reloading exchange rates from open-exchange-rates.json
[junit4:junit4]   2> 14039 T141 oass.OpenExchangeRatesOrgProvider.reload Reloading exchange rates from open-exchange-rates.json
[junit4:junit4]   2> 14041 T141 oasc.SolrCore.<init> [collection1] Opening new SolrCore at /usr/home/hudson/hudson-slave/workspace/Lucene-Solr-Tests-trunk-java7/solr/build/solr-core/test/J1/./org.apache.solr.cloud.SyncSliceTest-jetty3-1359843856916/collection1/, dataDir=./org.apache.solr.cloud.SyncSliceTest-1359843844230/jetty3/
[junit4:junit4]   2> 14041 T141 oasc.JmxMonitoredMap.<init> JMX monitoring is enabled. Adding Solr mbeans to JMX Server: com.sun.jmx.mbeanserver.JmxMBeanServer@71ac4afb
[junit4:junit4]   2> 14042 T141 oasc.SolrCore.initDirectoryFactory solr.NRTCachingDirectoryFactory
[junit4:junit4]   2> 14043 T141 oasc.CachingDirectoryFactory.get return new directory for /usr/home/hudson/hudson-slave/workspace/Lucene-Solr-Tests-trunk-java7/solr/build/solr-core/test/J1/./org.apache.solr.cloud.SyncSliceTest-1359843844230/jetty3 forceNew:false
[junit4:junit4]   2> 14043 T141 oasc.CachingDirectoryFactory.close Releasing directory:/usr/home/hudson/hudson-slave/workspace/Lucene-Solr-Tests-trunk-java7/solr/build/solr-core/test/J1/./org.apache.solr.cloud.SyncSliceTest-1359843844230/jetty3
[junit4:junit4]   2> 14044 T141 oasc.SolrCore.getNewIndexDir New index directory detected: old=null new=./org.apache.solr.cloud.SyncSliceTest-1359843844230/jetty3/index/
[junit4:junit4]   2> 14044 T141 oasc.SolrCore.initIndex WARNING [collection1] Solr index directory './org.apache.solr.cloud.SyncSliceTest-1359843844230/jetty3/index' doesn't exist. Creating new index...
[junit4:junit4]   2> 14045 T141 oasc.CachingDirectoryFactory.get return new directory for /usr/home/hudson/hudson-slave/workspace/Lucene-Solr-Tests-trunk-java7/solr/build/solr-core/test/J1/./org.apache.solr.cloud.SyncSliceTest-1359843844230/jetty3/index forceNew:false
[junit4:junit4]   2> 14049 T141 oasc.SolrDeletionPolicy.onCommit SolrDeletionPolicy.onCommit: commits:num=1
[junit4:junit4]   2> 		commit{dir=RateLimitedDirectoryWrapper(NRTCachingDirectory(org.apache.lucene.store.NIOFSDirectory@/usr/home/hudson/hudson-slave/workspace/Lucene-Solr-Tests-trunk-java7/solr/build/solr-core/test/J1/org.apache.solr.cloud.SyncSliceTest-1359843844230/jetty3/index lockFactory=org.apache.lucene.store.NativeFSLockFactory@1b8fc338; maxCacheMB=48.0 maxMergeSizeMB=4.0)),segFN=segments_1,generation=1,filenames=[segments_1]
[junit4:junit4]   2> 14050 T141 oasc.SolrDeletionPolicy.updateCommits newest commit = 1[segments_1]
[junit4:junit4]   2> 14051 T141 oasc.CachingDirectoryFactory.close Releasing directory:/usr/home/hudson/hudson-slave/workspace/Lucene-Solr-Tests-trunk-java7/solr/build/solr-core/test/J1/./org.apache.solr.cloud.SyncSliceTest-1359843844230/jetty3/index
[junit4:junit4]   2> 14051 T141 oasc.SolrCore.initWriters created xml: solr.XMLResponseWriter
[junit4:junit4]   2> 14053 T141 oasup.UpdateRequestProcessorChain.init inserting DistributedUpdateProcessorFactory into updateRequestProcessorChain "dedupe"
[junit4:junit4]   2> 14053 T141 oasup.UpdateRequestProcessorChain.init inserting DistributedUpdateProcessorFactory into updateRequestProcessorChain "dedupe-allfields"
[junit4:junit4]   2> 14054 T141 oasup.UpdateRequestProcessorChain.init inserting DistributedUpdateProcessorFactory into updateRequestProcessorChain "stored_sig"
[junit4:junit4]   2> 14054 T141 oasup.UpdateRequestProcessorChain.init inserting DistributedUpdateProcessorFactory into updateRequestProcessorChain "uniq-fields"
[junit4:junit4]   2> 14055 T141 oasup.UpdateRequestProcessorChain.init inserting DistributedUpdateProcessorFactory into updateRequestProcessorChain "distrib-dup-test-chain-implicit"
[junit4:junit4]   2> 14055 T141 oasc.RequestHandlers.initHandlersFromConfig adding lazy requestHandler: solr.ReplicationHandler
[junit4:junit4]   2> 14055 T141 oasc.RequestHandlers.initHandlersFromConfig created /replication: solr.ReplicationHandler
[junit4:junit4]   2> 14056 T141 oasc.RequestHandlers.initHandlersFromConfig created standard: solr.StandardRequestHandler
[junit4:junit4]   2> 14056 T141 oasc.RequestHandlers.initHandlersFromConfig created /get: solr.RealTimeGetHandler
[junit4:junit4]   2> 14057 T141 oasc.RequestHandlers.initHandlersFromConfig created dismax: solr.SearchHandler
[junit4:junit4]   2> 14058 T141 oasc.RequestHandlers.initHandlersFromConfig created mock: org.apache.solr.core.MockQuerySenderListenerReqHandler
[junit4:junit4]   2> 14058 T141 oasc.RequestHandlers.initHandlersFromConfig created /admin/: org.apache.solr.handler.admin.AdminHandlers
[junit4:junit4]   2> 14059 T141 oasc.RequestHandlers.initHandlersFromConfig created defaults: solr.StandardRequestHandler
[junit4:junit4]   2> 14059 T141 oasc.RequestHandlers.initHandlersFromConfig adding lazy requestHandler: solr.StandardRequestHandler
[junit4:junit4]   2> 14059 T141 oasc.RequestHandlers.initHandlersFromConfig created lazy: solr.StandardRequestHandler
[junit4:junit4]   2> 14060 T141 oasc.RequestHandlers.initHandlersFromConfig created /update: solr.UpdateRequestHandler
[junit4:junit4]   2> 14060 T141 oasc.RequestHandlers.initHandlersFromConfig created /terms: org.apache.solr.handler.component.SearchHandler
[junit4:junit4]   2> 14061 T141 oasc.RequestHandlers.initHandlersFromConfig created spellCheckCompRH: org.apache.solr.handler.component.SearchHandler
[junit4:junit4]   2> 14062 T141 oasc.RequestHandlers.initHandlersFromConfig created spellCheckCompRH_Direct: org.apache.solr.handler.component.SearchHandler
[junit4:junit4]   2> 14062 T141 oasc.RequestHandlers.initHandlersFromConfig created spellCheckWithWordbreak: org.apache.solr.handler.component.SearchHandler
[junit4:junit4]   2> 14063 T141 oasc.RequestHandlers.initHandlersFromConfig created spellCheckWithWordbreak_Direct: org.apache.solr.handler.component.SearchHandler
[junit4:junit4]   2> 14063 T141 oasc.RequestHandlers.initHandlersFromConfig created spellCheckCompRH1: org.apache.solr.handler.component.SearchHandler
[junit4:junit4]   2> 14064 T141 oasc.RequestHandlers.initHandlersFromConfig created mltrh: org.apache.solr.handler.component.SearchHandler
[junit4:junit4]   2> 14064 T141 oasc.RequestHandlers.initHandlersFromConfig created tvrh: org.apache.solr.handler.component.SearchHandler
[junit4:junit4]   2> 14065 T141 oasc.RequestHandlers.initHandlersFromConfig created /mlt: solr.MoreLikeThisHandler
[junit4:junit4]   2> 14066 T141 oasc.RequestHandlers.initHandlersFromConfig created /debug/dump: solr.DumpRequestHandler
[junit4:junit4]   2> 14074 T141 oashl.XMLLoader.init xsltCacheLifetimeSeconds=60
[junit4:junit4]   2> 14077 T141 oasc.SolrCore.initDeprecatedSupport WARNING solrconfig.xml uses deprecated <admin/gettableFiles>, Please update your config to use the ShowFileRequestHandler.
[junit4:junit4]   2> 14079 T141 oasc.SolrCore.initDeprecatedSupport WARNING adding ShowFileRequestHandler with hidden files: [SCHEMA.XML, OLD_SYNONYMS.TXT, STOPWORDS.TXT, PROTWORDS.TXT, OPEN-EXCHANGE-RATES.JSON, SYNONYMS.TXT, CURRENCY.XML, MAPPING-ISOLATIN1ACCENT.TXT]
[junit4:junit4]   2> 14081 T141 oasc.CachingDirectoryFactory.close Releasing directory:/usr/home/hudson/hudson-slave/workspace/Lucene-Solr-Tests-trunk-java7/solr/build/solr-core/test/J1/./org.apache.solr.cloud.SyncSliceTest-1359843844230/jetty3
[junit4:junit4]   2> 14082 T141 oass.SolrIndexSearcher.<init> Opening Searcher@1b16b24f main
[junit4:junit4]   2> 14083 T141 oasu.CommitTracker.<init> Hard AutoCommit: disabled
[junit4:junit4]   2> 14083 T141 oasu.CommitTracker.<init> Soft AutoCommit: disabled
[junit4:junit4]   2> 14084 T141 oashc.SpellCheckComponent.inform Initializing spell checkers
[junit4:junit4]   2> 14099 T141 oass.DirectSolrSpellChecker.init init: {name=direct,classname=DirectSolrSpellChecker,field=lowerfilt,minQueryLength=3}
[junit4:junit4]   2> 14141 T142 oasc.SolrCore.registerSearcher [collection1] Registered new searcher Searcher@1b16b24f main{StandardDirectoryReader(segments_1:1)}
[junit4:junit4]   2> 14147 T141 oasc.ZkController.publish publishing core=collection1 state=down
[junit4:junit4]   2> 14147 T141 oasc.ZkController.publish numShards not found on descriptor - reading it from system property
[junit4:junit4]   2> 15040 T91 oascc.ZkStateReader.updateClusterState Updating cloud state from ZooKeeper... 
[junit4:junit4]   2> 15042 T91 oasc.Overseer$ClusterStateUpdater.updateState Update state numShards=1 message={
[junit4:junit4]   2> 	  "operation":"state",
[junit4:junit4]   2> 	  "numShards":"1",
[junit4:junit4]   2> 	  "shard":null,
[junit4:junit4]   2> 	  "roles":null,
[junit4:junit4]   2> 	  "state":"down",
[junit4:junit4]   2> 	  "core":"collection1",
[junit4:junit4]   2> 	  "collection":"collection1",
[junit4:junit4]   2> 	  "node_name":"127.0.0.1:32616__pq",
[junit4:junit4]   2> 	  "base_url":"http://127.0.0.1:32616/_pq"}
[junit4:junit4]   2> 15042 T91 oasc.Overseer$ClusterStateUpdater.updateState Collection already exists with numShards=1
[junit4:junit4]   2> 15042 T91 oasc.Overseer$ClusterStateUpdater.updateState Assigning new node to shard shard=shard1
[junit4:junit4]   2> 15091 T90 oascc.ZkStateReader$2.process A cluster state change: WatchedEvent state:SyncConnected type:NodeDataChanged path:/clusterstate.json, has occurred - updating... (live nodes size: 4)
[junit4:junit4]   2> 15091 T124 oascc.ZkStateReader$2.process A cluster state change: WatchedEvent state:SyncConnected type:NodeDataChanged path:/clusterstate.json, has occurred - updating... (live nodes size: 4)
[junit4:junit4]   2> 15091 T140 oascc.ZkStateReader$2.process A cluster state change: WatchedEvent state:SyncConnected type:NodeDataChanged path:/clusterstate.json, has occurred - updating... (live nodes size: 4)
[junit4:junit4]   2> 15091 T109 oascc.ZkStateReader$2.process A cluster state change: WatchedEvent state:SyncConnected type:NodeDataChanged path:/clusterstate.json, has occurred - updating... (live nodes size: 4)
[junit4:junit4]   2> 15091 T96 oascc.ZkStateReader$2.process A cluster state change: WatchedEvent state:SyncConnected type:NodeDataChanged path:/clusterstate.json, has occurred - updating... (live nodes size: 4)
[junit4:junit4]   2> 15150 T141 oasc.CoreContainer.registerCore registering core: collection1
[junit4:junit4]   2> 15150 T141 oasc.ZkController.register Register replica - core:collection1 address:http://127.0.0.1:32616/_pq collection:collection1 shard:shard1
[junit4:junit4]   2> 15155 T141 oasc.ZkController.register We are http://127.0.0.1:32616/_pq/collection1/ and leader is http://127.0.0.1:34013/_pq/collection1/
[junit4:junit4]   2> 15156 T141 oasc.ZkController.register No LogReplay needed for core=collection1 baseURL=http://127.0.0.1:32616/_pq
[junit4:junit4]   2> 15156 T141 oasc.ZkController.checkRecovery Core needs to recover:collection1
[junit4:junit4]   2> 15156 T141 oasu.DefaultSolrCoreState.doRecovery Running recovery - first canceling any ongoing recovery
[junit4:junit4]   2> ASYNC  NEW_CORE C5 name=collection1 org.apache.solr.core.SolrCore@622daa46 url=http://127.0.0.1:32616/_pq/collection1 node=127.0.0.1:32616__pq C5_STATE=coll:collection1 core:collection1 props:{shard=null, roles=null, state=down, core=collection1, collection=collection1, node_name=127.0.0.1:32616__pq, base_url=http://127.0.0.1:32616/_pq}
[junit4:junit4]   2> 15157 T143 C5 P32616 oasc.RecoveryStrategy.run Starting recovery process.  core=collection1 recoveringAfterStartup=true
[junit4:junit4]   2> 15158 T143 C5 P32616 oasc.RecoveryStrategy.doRecovery ###### startupVersions=[]
[junit4:junit4]   2> 15158 T141 oascc.ZkStateReader.updateClusterState Updating cloud state from ZooKeeper... 
[junit4:junit4]   2> 15158 T143 C5 P32616 oasc.ZkController.publish publishing core=collection1 state=recovering
[junit4:junit4]   2> 15159 T143 C5 P32616 oasc.ZkController.publish numShards not found on descriptor - reading it from system property
[junit4:junit4]   2> 15160 T68 oass.SolrDispatchFilter.init user.dir=/usr/home/hudson/hudson-slave/workspace/Lucene-Solr-Tests-trunk-java7/solr/build/solr-core/test/J1
[junit4:junit4]   2> 15161 T68 oass.SolrDispatchFilter.init SolrDispatchFilter.init() done
[junit4:junit4]   2> 15161 T68 oascsi.HttpClientUtil.createClient Creating new http client, config:maxConnections=128&maxConnectionsPerHost=32&followRedirects=false
[junit4:junit4]   2> 15191 T143 C5 P32616 oascsi.HttpClientUtil.createClient Creating new http client, config:maxConnections=128&maxConnectionsPerHost=32&followRedirects=false
[junit4:junit4]   2> 15355 T68 oejs.Server.doStart jetty-8.1.8.v20121106
[junit4:junit4]   2> 15358 T68 oejs.AbstractConnector.doStart Started SocketConnector@127.0.0.1:35524
[junit4:junit4]   2> 15359 T68 oass.SolrDispatchFilter.init SolrDispatchFilter.init()
[junit4:junit4]   2> 15360 T68 oasc.SolrResourceLoader.locateSolrHome JNDI not configured for solr (NoInitialContextEx)
[junit4:junit4]   2> 15360 T68 oasc.SolrResourceLoader.locateSolrHome using system property solr.solr.home: /usr/home/hudson/hudson-slave/workspace/Lucene-Solr-Tests-trunk-java7/solr/build/solr-core/test/J1/./org.apache.solr.cloud.SyncSliceTest-jetty4-1359843859401
[junit4:junit4]   2> 15361 T68 oasc.CoreContainer$Initializer.initialize looking for solr.xml: /usr/home/hudson/hudson-slave/workspace/Lucene-Solr-Tests-trunk-java7/solr/build/solr-core/test/J1/./org.apache.solr.cloud.SyncSliceTest-jetty4-1359843859401/solr.xml
[junit4:junit4]   2> 15361 T68 oasc.CoreContainer.<init> New CoreContainer 901305989
[junit4:junit4]   2> 15362 T68 oasc.CoreContainer.load Loading CoreContainer using Solr Home: '/usr/home/hudson/hudson-slave/workspace/Lucene-Solr-Tests-trunk-java7/solr/build/solr-core/test/J1/./org.apache.solr.cloud.SyncSliceTest-jetty4-1359843859401/'
[junit4:junit4]   2> 15363 T68 oasc.SolrResourceLoader.<init> new SolrResourceLoader for directory: '/usr/home/hudson/hudson-slave/workspace/Lucene-Solr-Tests-trunk-java7/solr/build/solr-core/test/J1/./org.apache.solr.cloud.SyncSliceTest-jetty4-1359843859401/'
[junit4:junit4]   2> 15418 T68 oashc.HttpShardHandlerFactory.getParameter Setting socketTimeout to: 60000
[junit4:junit4]   2> 15419 T68 oashc.HttpShardHandlerFactory.getParameter Setting urlScheme to: http://
[junit4:junit4]   2> 15420 T68 oashc.HttpShardHandlerFactory.getParameter Setting connTimeout to: 15000
[junit4:junit4]   2> 15420 T68 oashc.HttpShardHandlerFactory.getParameter Setting maxConnectionsPerHost to: 20
[junit4:junit4]   2> 15421 T68 oashc.HttpShardHandlerFactory.getParameter Setting corePoolSize to: 0
[junit4:junit4]   2> 15421 T68 oashc.HttpShardHandlerFactory.getParameter Setting maximumPoolSize to: 2147483647
[junit4:junit4]   2> 15422 T68 oashc.HttpShardHandlerFactory.getParameter Setting maxThreadIdleTime to: 5
[junit4:junit4]   2> 15423 T68 oashc.HttpShardHandlerFactory.getParameter Setting sizeOfQueue to: -1
[junit4:junit4]   2> 15423 T68 oashc.HttpShardHandlerFactory.getParameter Setting fairnessPolicy to: false
[junit4:junit4]   2> 15424 T68 oascsi.HttpClientUtil.createClient Creating new http client, config:maxConnectionsPerHost=20&maxConnections=10000&socketTimeout=60000&connTimeout=15000&retry=false
[junit4:junit4]   2> 15446 T68 oasc.CoreContainer.load Registering Log Listener
[junit4:junit4]   2> 15466 T68 oasc.CoreContainer.initZooKeeper Zookeeper client=127.0.0.1:16522/solr
[junit4:junit4]   2> 15467 T68 oasc.ZkController.checkChrootPath zkHost includes chroot
[junit4:junit4]   2> 15468 T68 oaz.ZooKeeper.<init> Initiating client connection, connectString=127.0.0.1:16522 sessionTimeout=60000 watcher=org.apache.solr.common.cloud.ConnectionManager@2b13e30a
[junit4:junit4]   2> 15469 T68 oascc.ConnectionManager.waitForConnected Waiting for client to connect to ZooKeeper
[junit4:junit4]   2> 15469 T153 oaz.ClientCnxn$SendThread.logStartConnect Opening socket connection to server localhost/127.0.0.1:16522. Will not attempt to authenticate using SASL (access denied ("javax.security.auth.AuthPermission" "getLoginConfiguration"))
[junit4:junit4]   2> 15470 T153 oaz.ClientCnxn$SendThread.primeConnection Socket connection established to localhost/127.0.0.1:16522, initiating session
[junit4:junit4]   2> 15471 T70 oazs.NIOServerCnxnFactory.run Accepted socket connection from /140.211.11.196:25257
[junit4:junit4]   2> 15471 T70 oazs.ZooKeeperServer.processConnectRequest Client attempting to establish new session at /140.211.11.196:25257
[junit4:junit4]   2> 15474 T72 oazs.ZooKeeperServer.finishSessionInit Established session 0x13c9d02617d000b with negotiated timeout 20000 for client /140.211.11.196:25257
[junit4:junit4]   2> 15474 T153 oaz.ClientCnxn$SendThread.onConnected Session establishment complete on server localhost/127.0.0.1:16522, sessionid = 0x13c9d02617d000b, negotiated timeout = 20000
[junit4:junit4]   2> 15474 T154 oascc.ConnectionManager.process Watcher org.apache.solr.common.cloud.ConnectionManager@2b13e30a name:ZooKeeperConnection Watcher:127.0.0.1:16522 got event WatchedEvent state:SyncConnected type:None path:null path:null type:None
[junit4:junit4]   2> 15475 T68 oascc.ConnectionManager.waitForConnected Client is connected to ZooKeeper
[junit4:junit4]   2> 15477 T73 oazs.PrepRequestProcessor.pRequest2Txn Processed session termination for sessionid: 0x13c9d02617d000b
[junit4:junit4]   2> 15497 T154 oaz.ClientCnxn$EventThread.run EventThread shut down
[junit4:junit4]   2> 15497 T68 oaz.ZooKeeper.close Session: 0x13c9d02617d000b closed
[junit4:junit4]   2> 15497 T70 oazs.NIOServerCnxn.closeSock Closed socket connection for client /140.211.11.196:25257 which had sessionid 0x13c9d02617d000b
[junit4:junit4]   2> 15498 T68 oascsi.HttpClientUtil.createClient Creating new http client, config:maxConnections=500&maxConnectionsPerHost=16&socketTimeout=60000&connTimeout=15000
[junit4:junit4]   2> 15510 T68 oaz.ZooKeeper.<init> Initiating client connection, connectString=127.0.0.1:16522/solr sessionTimeout=30000 watcher=org.apache.solr.common.cloud.ConnectionManager@7c7d3eb3
[junit4:junit4]   2> 15511 T68 oascc.ConnectionManager.waitForConnected Waiting for client to connect to ZooKeeper
[junit4:junit4]   2> 15511 T155 oaz.ClientCnxn$SendThread.logStartConnect Opening socket connection to server localhost/127.0.0.1:16522. Will not attempt to authenticate using SASL (access denied ("javax.security.auth.AuthPermission" "getLoginConfiguration"))
[junit4:junit4]   2> 15512 T155 oaz.ClientCnxn$SendThread.primeConnection Socket connection established to localhost/127.0.0.1:16522, initiating session
[junit4:junit4]   2> 15512 T70 oazs.NIOServerCnxnFactory.run Accepted socket connection from /140.211.11.196:31821
[junit4:junit4]   2> 15513 T70 oazs.ZooKeeperServer.processConnectRequest Client attempting to establish new session at /140.211.11.196:31821
[junit4:junit4]   2> 15515 T72 oazs.ZooKeeperServer.finishSessionInit Established session 0x13c9d02617d000c with negotiated timeout 20000 for client /140.211.11.196:31821
[junit4:junit4]   2> 15515 T155 oaz.ClientCnxn$SendThread.onConnected Session establishment complete on server localhost/127.0.0.1:16522, sessionid = 0x13c9d02617d000c, negotiated timeout = 20000
[junit4:junit4]   2> 15515 T156 oascc.ConnectionManager.process Watcher org.apache.solr.common.cloud.ConnectionManager@7c7d3eb3 name:ZooKeeperConnection Watcher:127.0.0.1:16522/solr got event WatchedEvent state:SyncConnected type:None path:null path:null type:None
[junit4:junit4]   2> 15516 T68 oascc.ConnectionManager.waitForConnected Client is connected to ZooKeeper
[junit4:junit4]   2> 15517 T73 oazs.PrepRequestProcessor.pRequest Got user-level KeeperException when processing sessionid:0x13c9d02617d000c type:create cxid:0x1 zxid:0x93 txntype:-1 reqpath:n/a Error Path:/solr/overseer Error:KeeperErrorCode = NodeExists for /solr/overseer
[junit4:junit4]   2> 15519 T73 oazs.PrepRequestProcessor.pRequest Got user-level KeeperException when processing sessionid:0x13c9d02617d000c type:create cxid:0x2 zxid:0x94 txntype:-1 reqpath:n/a Error Path:/solr/overseer Error:KeeperErrorCode = NodeExists for /solr/overseer
[junit4:junit4]   2> 15521 T68 oasc.ZkController.createEphemeralLiveNode Register node as live in ZooKeeper:/live_nodes/127.0.0.1:35524__pq
[junit4:junit4]   2> 15522 T73 oazs.PrepRequestProcessor.pRequest Got user-level KeeperException when processing sessionid:0x13c9d02617d000c type:delete cxid:0x4 zxid:0x95 txntype:-1 reqpath:n/a Error Path:/solr/live_nodes/127.0.0.1:35524__pq Error:KeeperErrorCode = NoNode for /solr/live_nodes/127.0.0.1:35524__pq
[junit4:junit4]   2> 15530 T68 oascc.SolrZkClient.makePath makePath: /live_nodes/127.0.0.1:35524__pq
[junit4:junit4]   2> 15533 T90 oascc.ZkStateReader$2.process A cluster state change: WatchedEvent state:SyncConnected type:NodeChildrenChanged path:/live_nodes, has occurred - updating... (live nodes size: 4)
[junit4:junit4]   2> 15533 T140 oascc.ZkStateReader$2.process A cluster state change: WatchedEvent state:SyncConnected type:NodeChildrenChanged path:/live_nodes, has occurred - updating... (live nodes size: 4)
[junit4:junit4]   2> 15533 T109 oascc.ZkStateReader$2.process A cluster state change: WatchedEvent state:SyncConnected type:NodeChildrenChanged path:/live_nodes, has occurred - updating... (live nodes size: 4)
[junit4:junit4]   2> 15534 T124 oascc.ZkStateReader$3.process Updating live nodes... (5)
[junit4:junit4]   2> 15534 T96 oascc.ZkStateReader$3.process Updating live nodes... (5)
[junit4:junit4]   2> 15535 T124 oascc.ZkStateReader$2.process A cluster state change: WatchedEvent state:SyncConnected type:NodeChildrenChanged path:/live_nodes, has occurred - updating... (live nodes size: 5)
[junit4:junit4]   2> 15535 T96 oascc.ZkStateReader$2.process A cluster state change: WatchedEvent state:SyncConnected type:NodeChildrenChanged path:/live_nodes, has occurred - updating... (live nodes size: 5)
[junit4:junit4]   2> 15537 T90 oascc.ZkStateReader$3.process Updating live nodes... (5)
[junit4:junit4]   2> 15537 T140 oascc.ZkStateReader$3.process Updating live nodes... (5)
[junit4:junit4]   2> 15539 T109 oascc.ZkStateReader$3.process Updating live nodes... (5)
[junit4:junit4]   2> 15541 T68 oascc.ZkStateReader.createClusterStateWatchersAndUpdate Updating cluster state from ZooKeeper... 
[junit4:junit4]   2> 15551 T157 oasc.CoreContainer.create Creating SolrCore 'collection1' using instanceDir: /usr/home/hudson/hudson-slave/workspace/Lucene-Solr-Tests-trunk-java7/solr/build/solr-core/test/J1/./org.apache.solr.cloud.SyncSliceTest-jetty4-1359843859401/collection1
[junit4:junit4]   2> 15551 T157 oasc.ZkController.createCollectionZkNode Check for collection zkNode:collection1
[junit4:junit4]   2> 15552 T157 oasc.ZkController.createCollectionZkNode Collection zkNode exists
[junit4:junit4]   2> 15552 T157 oasc.ZkController.readConfigName Load collection config from:/collections/collection1
[junit4:junit4]   2> 15555 T157 oasc.SolrResourceLoader.<init> new SolrResourceLoader for directory: '/usr/home/hudson/hudson-slave/workspace/Lucene-Solr-Tests-trunk-java7/solr/build/solr-core/test/J1/./org.apache.solr.cloud.SyncSliceTest-jetty4-1359843859401/collection1/'
[junit4:junit4]   2> 15556 T157 oasc.SolrResourceLoader.replaceClassLoader Adding 'file:/usr/home/hudson/hudson-slave/workspace/Lucene-Solr-Tests-trunk-java7/solr/build/solr-core/test/J1/org.apache.solr.cloud.SyncSliceTest-jetty4-1359843859401/collection1/lib/classes/' to classloader
[junit4:junit4]   2> 15557 T157 oasc.SolrResourceLoader.replaceClassLoader Adding 'file:/usr/home/hudson/hudson-slave/workspace/Lucene-Solr-Tests-trunk-java7/solr/build/solr-core/test/J1/org.apache.solr.cloud.SyncSliceTest-jetty4-1359843859401/collection1/lib/README' to classloader
[junit4:junit4]   2> 15616 T157 oasc.SolrConfig.<init> Using Lucene MatchVersion: LUCENE_50
[junit4:junit4]   2> 15694 T157 oasc.SolrConfig.<init> Loaded SolrConfig: solrconfig.xml
[junit4:junit4]   2>  C4_STATE=coll:collection1 core:collection1 props:{shard=shard1, roles=null, state=recovering, core=collection1, collection=collection1, node_name=127.0.0.1:30729__pq, base_url=http://127.0.0.1:30729/_pq}
[junit4:junit4]   2> 15715 T127 C4 P30729 oasc.RecoveryStrategy.doRecovery Attempting to PeerSync from http://127.0.0.1:34013/_pq/collection1/ core=collection1 - recoveringAfterStartup=true
[junit4:junit4]   2> 15725 T127 C4 P30729 oascsi.HttpClientUtil.createClient Creating new http client, config:maxConnectionsPerHost=20&maxConnections=10000&connTimeout=30000&socketTimeout=30000&retry=false
[junit4:junit4]   2> 15743 T127 C4 P30729 oasu.PeerSync.sync PeerSync: core=collection1 url=http://127.0.0.1:30729/_pq START replicas=[http://127.0.0.1:34013/_pq/collection1/] nUpdates=100
[junit4:junit4]   2> 15754 T127 C4 P30729 oasu.PeerSync.sync WARNING no frame of reference to tell of we've missed updates
[junit4:junit4]   2> 15755 T127 C4 P30729 oasc.RecoveryStrategy.doRecovery PeerSync Recovery was not successful - trying replication. core=collection1
[junit4:junit4]   2> 15755 T127 C4 P30729 oasc.RecoveryStrategy.doRecovery Starting Replication Recovery. core=collection1
[junit4:junit4]   2> 15755 T127 C4 P30729 oasc.RecoveryStrategy.doRecovery Begin buffering updates. core=collection1
[junit4:junit4]   2> 15756 T127 C4 P30729 oasu.UpdateLog.bufferUpdates Starting to buffer updates. FSUpdateLog{state=ACTIVE, tlog=null}
[junit4:junit4]   2> 15756 T127 C4 P30729 oasc.RecoveryStrategy.replicate Attempting to replicate from http://127.0.0.1:34013/_pq/collection1/. core=collection1
[junit4:junit4]   2> 15757 T127 C4 P30729 oascsi.HttpClientUtil.createClient Creating new http client, config:maxConnections=128&maxConnectionsPerHost=32&followRedirects=false
[junit4:junit4]   2> ASYNC  NEW_CORE C6 name=collection1 org.apache.solr.core.SolrCore@4dc7bae0 url=http://127.0.0.1:34013/_pq/collection1 node=127.0.0.1:34013__pq C6_STATE=coll:collection1 core:collection1 props:{shard=shard1, roles=null, state=active, core=collection1, collection=collection1, node_name=127.0.0.1:34013__pq, base_url=http://127.0.0.1:34013/_pq, leader=true}
[junit4:junit4]   2> 15765 T101 C6 P34013 REQ /get {getVersions=100&distrib=false&wt=javabin&qt=/get&version=2} status=0 QTime=1 
[junit4:junit4]   2> 15787 T102 C6 P34013 oasu.DirectUpdateHandler2.commit start commit{,optimize=false,openSearcher=false,waitSearcher=true,expungeDeletes=false,softCommit=false}
[junit4:junit4]   2> 15788 T102 C6 P34013 oasc.CachingDirectoryFactory.close Releasing directory:/usr/home/hudson/hudson-slave/workspace/Lucene-Solr-Tests-trunk-java7/solr/build/solr-core/test/J1/./org.apache.solr.cloud.SyncSliceTest-1359843844230/jetty1
[junit4:junit4]   2> 15793 T102 C6 P34013 oasc.SolrDeletionPolicy.onInit SolrDeletionPolicy.onInit: commits:num=1
[junit4:junit4]   2> 		commit{dir=RateLimitedDirectoryWrapper(NRTCachingDirectory(org.apache.lucene.store.NIOFSDirectory@/usr/home/hudson/hudson-slave/workspace/Lucene-Solr-Tests-trunk-java7/solr/build/solr-core/test/J1/org.apache.solr.cloud.SyncSliceTest-1359843844230/jetty1/index lockFactory=org.apache.lucene.store.NativeFSLockFactory@50eaa935; maxCacheMB=48.0 maxMergeSizeMB=4.0)),segFN=segments_1,generation=1,filenames=[segments_1]
[junit4:junit4]   2> 15794 T102 C6 P34013 oasc.SolrDeletionPolicy.updateCommits newest commit = 1[segments_1]
[junit4:junit4]   2> 15795 T157 oass.IndexSchema.readSchema Reading Solr Schema
[junit4:junit4]   2> 15800 T102 C6 P34013 oasc.SolrDeletionPolicy.onCommit SolrDeletionPolicy.onCommit: commits:num=2
[junit4:junit4]   2> 		commit{dir=RateLimitedDirectoryWrapper(NRTCachingDirectory(org.apache.lucene.store.NIOFSDirectory@/usr/home/hudson/hudson-slave/workspace/Lucene-Solr-Tests-trunk-java7/solr/build/solr-core/test/J1/org.apache.solr.cloud.SyncSliceTest-1359843844230/jetty1/index lockFactory=org.apache.lucene.store.NativeFSLockFactory@50eaa935; maxCacheMB=48.0 maxMergeSizeMB=4.0)),segFN=segments_1,generation=1,filenames=[segments_1]
[junit4:junit4]   2> 		commit{dir=RateLimitedDirectoryWrapper(NRTCachingDirectory(org.apache.lucene.store.NIOFSDirectory@/usr/home/hudson/hudson-slave/workspace/Lucene-Solr-Tests-trunk-java7/solr/build/solr-core/test/J1/org.apache.solr.cloud.SyncSliceTest-1359843844230/jetty1/index lockFactory=org.apache.lucene.store.NativeFSLockFactory@50eaa935; maxCacheMB=48.0 maxMergeSizeMB=4.0)),segFN=segments_2,generation=2,filenames=[segments_2]
[junit4:junit4]   2> 15800 T102 C6 P34013 oasc.SolrDeletionPolicy.updateCommits newest commit = 2[segments_2]
[junit4:junit4]   2> 15802 T102 C6 P34013 oasc.CachingDirectoryFactory.close Releasing directory:/usr/home/hudson/hudson-slave/workspace/Lucene-Solr-Tests-trunk-java7/solr/build/solr-core/test/J1/./org.apache.solr.cloud.SyncSliceTest-1359843844230/jetty1
[junit4:junit4]   2> 15803 T102 C6 P34013 oass.SolrIndexSearcher.<init> Opening Searcher@36160b84 realtime
[junit4:junit4]   2> 15803 T102 C6 P34013 oasu.DirectUpdateHandler2.commit end_commit_flush
[junit4:junit4]   2> 15804 T102 C6 P34013 /update {waitSearcher=true&openSearcher=false&commit=true&wt=javabin&commit_end_point=true&version=2&softCommit=false} {commit=} 0 34
[junit4:junit4]   2> 15805 T127 C4 P30729 oash.ReplicationHandler.inform Commits will be reserved for  10000
[junit4:junit4]   2> 15806 T127 C4 P30729 oascsi.HttpClientUtil.createClient Creating new http client, config:connTimeout=5000&socketTimeout=20000&allowCompression=false&maxConnections=10000&maxConnectionsPerHost=10000
[junit4:junit4]   2> 15817 T157 oass.IndexSchema.readSchema Schema name=test
[junit4:junit4]   2> 15834 T127 C4 P30729 oash.SnapPuller.<init>  No value set for 'pollInterval'. Timer Task not started.
[junit4:junit4]   2> 15838 T103 C6 P34013 oash.ReplicationHandler.inform Commits will be reserved for  10000
[junit4:junit4]   2> 15839 T103 C6 P34013 REQ /replication {command=indexversion&qt=/replication&wt=javabin&version=2} status=0 QTime=3 
[junit4:junit4]   2> 15841 T127 C4 P30729 oash.SnapPuller.fetchLatestIndex Master's generation: 2
[junit4:junit4]   2> 15841 T127 C4 P30729 oash.SnapPuller.fetchLatestIndex Slave's generation: 1
[junit4:junit4]   2> 15841 T127 C4 P30729 oash.SnapPuller.fetchLatestIndex Starting replication process
[junit4:junit4]   2> 15845 T103 C6 P34013 oasc.CachingDirectoryFactory.close Releasing directory:/usr/home/hudson/hudson-slave/workspace/Lucene-Solr-Tests-trunk-java7/solr/build/solr-core/test/J1/./org.apache.solr.cloud.SyncSliceTest-1359843844230/jetty1
[junit4:junit4]   2> 15846 T103 C6 P34013 oasc.CachingDirectoryFactory.close Releasing directory:/usr/home/hudson/hudson-slave/workspace/Lucene-Solr-Tests-trunk-java7/solr/build/solr-core/test/J1/./org.apache.solr.cloud.SyncSliceTest-1359843844230/jetty1/index
[junit4:junit4]   2> 15846 T103 C6 P34013 REQ /replication {command=filelist&qt=/replication&wt=javabin&generation=2&version=2} status=0 QTime=2 
[junit4:junit4]   2> 15848 T127 C4 P30729 oash.SnapPuller.fetchLatestIndex Number of files in latest index in master: 1
[junit4:junit4]   2> 15850 T127 C4 P30729 oasc.CachingDirectoryFactory.get return new directory for /usr/home/hudson/hudson-slave/workspace/Lucene-Solr-Tests-trunk-java7/solr/build/solr-core/test/J1/./org.apache.solr.cloud.SyncSliceTest-1359843844230/jetty2/index.20130202162420072 forceNew:false
[junit4:junit4]   2> 15851 T127 C4 P30729 oasc.CachingDirectoryFactory.close Releasing directory:/usr/home/hudson/hudson-slave/workspace/Lucene-Solr-Tests-trunk-java7/solr/build/solr-core/test/J1/./org.apache.solr.cloud.SyncSliceTest-1359843844230/jetty2
[junit4:junit4]   2> 15852 T127 C4 P30729 oash.SnapPuller.fetchLatestIndex Starting download to RateLimitedDirectoryWrapper(NRTCachingDirectory(org.apache.lucene.store.NIOFSDirectory@/usr/home/hudson/hudson-slave/workspace/Lucene-Solr-Tests-trunk-java7/solr/build/solr-core/test/J1/org.apache.solr.cloud.SyncSliceTest-1359843844230/jetty2/index.20130202162420072 lockFactory=org.apache.lucene.store.NativeFSLockFactory@3566416b; maxCacheMB=48.0 maxMergeSizeMB=4.0)) fullCopy=true
[junit4:junit4]   2> 15868 T103 C6 P34013 REQ /replication {file=segments_2&command=filecontent&checksum=true&wt=filestream&qt=/replication&generation=2} status=0 QTime=5 
[junit4:junit4]   2> 15884 T127 C4 P30729 oasc.CachingDirectoryFactory.close Releasing directory:/usr/home/hudson/hudson-slave/workspace/Lucene-Solr-Tests-trunk-java7/solr/build/solr-core/test/J1/./org.apache.solr.cloud.SyncSliceTest-1359843844230/jetty2/index
[junit4:junit4]   2> 15885 T127 C4 P30729 oash.SnapPuller.fetchLatestIndex Total time taken for download : 0 secs
[junit4:junit4]   2> 15885 T127 C4 P30729 oash.SnapPuller.modifyIndexProps New index installed. Updating index properties... index=index.20130202162420072
[junit4:junit4]   2> 15892 T127 C4 P30729 oasc.CachingDirectoryFactory.close Releasing directory:/usr/home/hudson/hudson-slave/workspace/Lucene-Solr-Tests-trunk-java7/solr/build/solr-core/test/J1/./org.apache.solr.cloud.SyncSliceTest-1359843844230/jetty2
[junit4:junit4]   2> 15904 T127 C4 P30729 oasc.CachingDirectoryFactory.close Releasing directory:/usr/home/hudson/hudson-slave/workspace/Lucene-Solr-Tests-trunk-java7/solr/build/solr-core/test/J1/./org.apache.solr.cloud.SyncSliceTest-1359843844230/jetty2
[junit4:junit4]   2> 15905 T127 C4 P30729 oasc.SolrCore.getNewIndexDir New index directory detected: old=./org.apache.solr.cloud.SyncSliceTest-1359843844230/jetty2/index/ new=./org.apache.solr.cloud.SyncSliceTest-1359843844230/jetty2/index.20130202162420072
[junit4:junit4]   2> 15910 T127 C4 P30729 oasc.SolrDeletionPolicy.onInit SolrDeletionPolicy.onInit: commits:num=1
[junit4:junit4]   2> 		commit{dir=RateLimitedDirectoryWrapper(NRTCachingDirectory(org.apache.lucene.store.NIOFSDirectory@/usr/home/hudson/hudson-slave/workspace/Lucene-Solr-Tests-trunk-java7/solr/build/solr-core/test/J1/org.apache.solr.cloud.SyncSliceTest-1359843844230/jetty2/index.20130202162420072 lockFactory=org.apache.lucene.store.NativeFSLockFactory@3566416b; maxCacheMB=48.0 maxMergeSizeMB=4.0)),segFN=segments_2,generation=2,filenames=[segments_2]
[junit4:junit4]   2> 15911 T127 C4 P30729 oasc.SolrDeletionPolicy.updateCommits newest commit = 2[segments_2]
[junit4:junit4]   2> 15912 T127 C4 P30729 oasc.CachingDirectoryFactory.close Releasing directory:/usr/home/hudson/hudson-slave/workspace/Lucene-Solr-Tests-trunk-java7/solr/build/solr-core/test/J1/./org.apache.solr.cloud.SyncSliceTest-1359843844230/jetty2
[junit4:junit4]   2> 15918 T127 C4 P30729 oasu.DefaultSolrCoreState.newIndexWriter Creating new IndexWriter...
[junit4:junit4]   2> 15918 T127 C4 P30729 oasu.DefaultSolrCoreState.newIndexWriter Waiting until IndexWriter is unused... core=collection1
[junit4:junit4]   2> 15918 T127 C4 P30729 oasu.DefaultSolrCoreState.newIndexWriter Rollback old IndexWriter... core=collection1
[junit4:junit4]   2> 15920 T127 C4 P30729 oasc.CachingDirectoryFactory.close Releasing directory:/usr/home/hudson/hudson-slave/workspace/Lucene-Solr-Tests-trunk-java7/solr/build/solr-core/test/J1/./org.apache.solr.cloud.SyncSliceTest-1359843844230/jetty2/index.20130202162420072
[junit4:junit4]   2> 15921 T127 C4 P30729 oasc.CachingDirectoryFactory.close Releasing directory:/usr/home/hudson/hudson-slave/workspace/Lucene-Solr-Tests-trunk-java7/solr/build/solr-core/test/J1/./org.apache.solr.cloud.SyncSliceTest-1359843844230/jetty2
[junit4:junit4]   2> 15925 T127 C4 P30729 oasc.SolrDeletionPolicy.onInit SolrDeletionPolicy.onInit: commits:num=1
[junit4:junit4]   2> 		commit{dir=RateLimitedDirectoryWrapper(NRTCachingDirectory(org.apache.lucene.store.NIOFSDirectory@/usr/home/hudson/hudson-slave/workspace/Lucene-Solr-Tests-trunk-java7/solr/build/solr-core/test/J1/org.apache.solr.cloud.SyncSliceTest-1359843844230/jetty2/index.20130202162420072 lockFactory=org.apache.lucene.store.NativeFSLockFactory@3566416b; maxCacheMB=48.0 maxMergeSizeMB=4.0)),segFN=segments_2,generation=2,filenames=[segments_2]
[junit4:junit4]   2> 15926 T127 C4 P30729 oasc.SolrDeletionPolicy.updateCommits newest commit = 2[segments_2]
[junit4:junit4]   2> 15926 T127 C4 P30729 oasu.DefaultSolrCoreState.newIndexWriter New IndexWriter is ready to be used.
[junit4:junit4]   2> 15927 T127 C4 P30729 oasc.CachingDirectoryFactory.close Releasing directory:/usr/home/hudson/hudson-slave/workspace/Lucene-Solr-Tests-trunk-java7/solr/build/solr-core/test/J1/./org.apache.solr.cloud.SyncSliceTest-1359843844230/jetty2
[junit4:junit4]   2> 15928 T127 C4 P30729 oass.SolrIndexSearcher.<init> Opening Searcher@a5bc74f main
[junit4:junit4]   2> 15930 T126 oasc.SolrCore.registerSearcher [collection1] Registered new searcher Searcher@a5bc74f main{StandardDirectoryReader(segments_2:1:nrt)}
[junit4:junit4]   2> 15931 T126 oasc.CachingDirectoryFactory.close Releasing directory:/usr/home/hudson/hudson-slave/workspace/Lucene-Solr-Tests-trunk-java7/solr/build/solr-core/test/J1/./org.apache.solr.cloud.SyncSliceTest-1359843844230/jetty2/index
[junit4:junit4]   2> 15931 T127 C4 P30729 oasu.DirectUpdateHandler2.commit start commit{,optimize=false,openSearcher=false,waitSearcher=false,expungeDeletes=false,softCommit=false}
[junit4:junit4]   2> 15936 T127 C4 P30729 oasc.SolrDeletionPolicy.onCommit SolrDeletionPolicy.onCommit: commits:num=2
[junit4:junit4]   2> 		commit{dir=RateLimitedDirectoryWrapper(NRTCachingDirectory(org.apache.lucene.store.NIOFSDirectory@/usr/home/hudson/hudson-slave/workspace/Lucene-Solr-Tests-trunk-java7/solr/build/solr-core/test/J1/org.apache.solr.cloud.SyncSliceTest-1359843844230/jetty2/index.20130202162420072 lockFactory=org.apache.lucene.store.NativeFSLockFactory@3566416b; maxCacheMB=48.0 maxMergeSizeMB=4.0)),segFN=segments_2,generation=2,filenames=[segments_2]
[junit4:junit4]   2> 		commit{dir=RateLimitedDirectoryWrapper(NRTCachingDirectory(org.apache.lucene.store.NIOFSDirectory@/usr/home/hudson/hudson-slave/workspace/Lucene-Solr-Tests-trunk-java7/solr/build/solr-core/test/J1/org.apache.solr.cloud.SyncSliceTest-1359843844230/jetty2/index.20130202162420072 lockFactory=org.apache.lucene.store.NativeFSLockFactory@3566416b; maxCacheMB=48.0 maxMergeSizeMB=4.0)),segFN=segments_3,generation=3,filenames=[segments_3]
[junit4:junit4]   2> 15936 T127 C4 P30729 oasc.SolrDeletionPolicy.updateCommits newest commit = 3[segments_3]
[junit4:junit4]   2> 15938 T127 C4 P30729 oasc.CachingDirectoryFactory.close Releasing directory:/usr/home/hudson/hudson-slave/workspace/Lucene-Solr-Tests-trunk-java7/solr/build/solr-core/test/J1/./org.apache.solr.cloud.SyncSliceTest-1359843844230/jetty2
[junit4:junit4]   2> 15938 T127 C4 P30729 oasu.DirectUpdateHandler2.commit end_commit_flush
[junit4:junit4]   2> 15938 T127 C4 P30729 oasc.CachingDirectoryFactory.close Releasing directory:/usr/home/hudson/hudson-slave/workspace/Lucene-Solr-Tests-trunk-java7/solr/build/solr-core/test/J1/./org.apache.solr.cloud.SyncSliceTest-1359843844230/jetty2/index.20130202162420072
[junit4:junit4]   2> 15939 T127 C4 P30729 oasc.CachingDirectoryFactory.close Releasing directory:/usr/home/hudson/hudson-slave/workspace/Lucene-Solr-Tests-trunk-java7/solr/build/solr-core/test/J1/./org.apache.solr.cloud.SyncSliceTest-1359843844230/jetty2/index
[junit4:junit4]   2> 15939 T127 C4 P30729 oasc.RecoveryStrategy.replay No replay needed. core=collection1
[junit4:junit4]   2> 15939 T127 C4 P30729 oasc.RecoveryStrategy.doRecovery Replication Recovery was successful - registering as Active. core=collection1
[junit4:junit4]   2> 15940 T127 C4 P30729 oasc.ZkController.publish publishing core=collection1 state=active
[junit4:junit4]   2> 15940 T127 C4 P30729 oasc.ZkController.publish numShards not found on descriptor - reading it from system property
[junit4:junit4]   2> 15942 T127 C4 P30729 oasc.RecoveryStrategy.doRecovery Finished recovery process. core=collection1
[junit4:junit4]   2> 16481 T157 oass.OpenExchangeRatesOrgProvider.init Initialized with rates=open-exchange-rates.json, refreshInterval=1440.
[junit4:junit4]   2> 16491 T157 oass.IndexSchema.readSchema default search field in schema is text
[junit4:junit4]   2> 16494 T157 oass.IndexSchema.readSchema unique key field: id
[junit4:junit4]   2> 16520 T157 oass.FileExchangeRateProvider.reload Reloading exchange rates from file currency.xml
[junit4:junit4]   2> 16532 T157 oass.FileExchangeRateProvider.reload Reloading exchange rates from file currency.xml
[junit4:junit4]   2> 16536 T157 oass.OpenExchangeRatesOrgProvider.reload Reloading exchange rates from open-exchange-rates.json
[junit4:junit4]   2> 16538 T157 oass.OpenExchangeRatesOrgProvider.reload Reloading exchange rates from open-exchange-rates.json
[junit4:junit4]   2> 16541 T157 oasc.SolrCore.<init> [collection1] Opening new SolrCore at /usr/home/hudson/hudson-slave/workspace/Lucene-Solr-Tests-trunk-java7/solr/build/solr-core/test/J1/./org.apache.solr.cloud.SyncSliceTest-jetty4-1359843859401/collection1/, dataDir=./org.apache.solr.cloud.SyncSliceTest-1359843844230/jetty4/
[junit4:junit4]   2> 16541 T157 oasc.JmxMonitoredMap.<init> JMX monitoring is enabled. Adding Solr mbeans to JMX Server: com.sun.jmx.mbeanserver.JmxMBeanServer@71ac4afb
[junit4:junit4]   2> 16542 T157 oasc.SolrCore.initDirectoryFactory solr.NRTCachingDirectoryFactory
[junit4:junit4]   2> 16542 T157 oasc.CachingDirectoryFactory.get return new directory for /usr/home/hudson/hudson-slave/workspace/Lucene-Solr-Tests-trunk-java7/solr/build/solr-core/test/J1/./org.apache.solr.cloud.SyncSliceTest-1359843844230/jetty4 forceNew:false
[junit4:junit4]   2> 16543 T157 oasc.CachingDirectoryFactory.close Releasing directory:/usr/home/hudson/hudson-slave/workspace/Lucene-Solr-Tests-trunk-java7/solr/build/solr-core/test/J1/./org.apache.solr.cloud.SyncSliceTest-1359843844230/jetty4
[junit4:junit4]   2> 16543 T157 oasc.SolrCore.getNewIndexDir New index directory detected: old=null new=./org.apache.solr.cloud.SyncSliceTest-1359843844230/jetty4/index/
[junit4:junit4]   2> 16543 T157 oasc.SolrCore.initIndex WARNING [collection1] Solr index directory './org.apache.solr.cloud.SyncSliceTest-1359843844230/jetty4/index' doesn't exist. Creating new index...
[junit4:junit4]   2> 16544 T157 oasc.CachingDirectoryFactory.get return new directory for /usr/home/hudson/hudson-slave/workspace/Lucene-Solr-Tests-trunk-java7/solr/build/solr-core/test/J1/./org.apache.solr.cloud.SyncSliceTest-1359843844230/jetty4/index forceNew:false
[junit4:junit4]   2> 16552 T157 oasc.SolrDeletionPolicy.onCommit SolrDeletionPolicy.onCommit: commits:num=1
[junit4:junit4]   2> 		commit{dir=RateLimitedDirectoryWrapper(NRTCachingDirectory(org.apache.lucene.store.NIOFSDirectory@/usr/home/hudson/hudson-slave/workspace/Lucene-Solr-Tests-trunk-java7/solr/build/solr-core/test/J1/org.apache.solr.cloud.SyncSliceTest-1359843844230/jetty4/index lockFactory=org.apache.lucene.store.NativeFSLockFactory@4b4f536b; maxCacheMB=48.0 maxMergeSizeMB=4.0)),segFN=segments_1,generation=1,filenames=[segments_1]
[junit4:junit4]   2> 16553 T157 oasc.SolrDeletionPolicy.updateCommits newest commit = 1[segments_1]
[junit4:junit4]   2> 16554 T157 oasc.CachingDirectoryFactory.close Releasing directory:/usr/home/hudson/hudson-slave/workspace/Lucene-Solr-Tests-trunk-java7/solr/build/solr-core/test/J1/./org.apache.solr.cloud.SyncSliceTest-1359843844230/jetty4/index
[junit4:junit4]   2> 16554 T157 oasc.SolrCore.initWriters created xml: solr.XMLResponseWriter
[junit4:junit4]   2> 16556 T157 oasup.UpdateRequestProcessorChain.init inserting DistributedUpdateProcessorFactory into updateRequestProcessorChain "dedupe"
[junit4:junit4]   2> 16556 T157 oasup.UpdateRequestProcessorChain.init inserting DistributedUpdateProcessorFactory into updateRequestProcessorChain "dedupe-allfields"
[junit4:junit4]   2> 16557 T157 oasup.UpdateRequestProcessorChain.init inserting DistributedUpdateProcessorFactory into updateRequestProcessorChain "stored_sig"
[junit4:junit4]   2> 16557 T157 oasup.UpdateRequestProcessorChain.init inserting DistributedUpdateProcessorFactory into updateRequestProcessorChain "uniq-fields"
[junit4:junit4]   2> 16558 T157 oasup.UpdateRequestProcessorChain.init inserting DistributedUpdateProcessorFactory into updateRequestProcessorChain "distrib-dup-test-chain-implicit"
[junit4:junit4]   2> 16558 T157 oasc.RequestHandlers.initHandlersFromConfig adding lazy requestHandler: solr.ReplicationHandler
[junit4:junit4]   2> 16558 T157 oasc.RequestHandlers.initHandlersFromConfig created /replication: solr.ReplicationHandler
[junit4:junit4]   2> 16559 T157 oasc.RequestHandlers.initHandlersFromConfig created standard: solr.StandardRequestHandler
[junit4:junit4]   2> 16559 T157 oasc.RequestHandlers.initHandlersFromConfig created /get: solr.RealTimeGetHandler
[junit4:junit4]   2> 16560 T157 oasc.RequestHandlers.initHandlersFromConfig created dismax: solr.SearchHandler
[junit4:junit4]   2> 16561 T157 oasc.RequestHandlers.initHandlersFromConfig created mock: org.apache.solr.core.MockQuerySenderListenerReqHandler
[junit4:junit4]   2> 16561 T157 oasc.RequestHandlers.initHandlersFromConfig created /admin/: org.apache.solr.handler.admin.AdminHandlers
[junit4:junit4]   2> 16562 T157 oasc.RequestHandlers.initHandlersFromConfig created defaults: solr.StandardRequestHandler
[junit4:junit4]   2> 16562 T157 oasc.RequestHandlers.initHandlersFromConfig adding lazy requestHandler: solr.StandardRequestHandler
[junit4:junit4]   2> 16562 T157 oasc.RequestHandlers.initHandlersFromConfig created lazy: solr.StandardRequestHandler
[junit4:junit4]   2> 16563 T157 oasc.RequestHandlers.initHandlersFromConfig created /update: solr.UpdateRequestHandler
[junit4:junit4]   2> 16563 T157 oasc.RequestHandlers.initHandlersFromConfig created /terms: org.apache.solr.handler.component.SearchHandler
[junit4:junit4]   2> 16564 T157 oasc.RequestHandlers.initHandlersFromConfig created spellCheckCompRH: org.apache.solr.handler.component.SearchHandler
[junit4:junit4]   2> 16565 T157 oasc.RequestHandlers.initHandlersFromConfig created spellCheckCompRH_Direct: org.apache.solr.handler.component.SearchHandler
[junit4:junit4]   2> 16565 T157 oasc.RequestHandlers.initHandlersFromConfig created spellCheckWithWordbreak: org.apache.solr.handler.component.SearchHandler
[junit4:junit4]   2> 16566 T157 oasc.RequestHandlers.initHandlersFromConfig created spellCheckWithWordbreak_Direct: org.apache.solr.handler.component.SearchHandler
[junit4:junit4]   2> 16566 T157 oasc.RequestHandlers.initHandlersFromConfig created spellCheckCompRH1: org.apache.solr.handler.component.SearchHandler
[junit4:junit4]   2> 16567 T157 oasc.RequestHandlers.initHandlersFromConfig created mltrh: org.apache.solr.handler.component.SearchHandler
[junit4:junit4]   2> 16567 T157 oasc.RequestHandlers.initHandlersFromConfig created tvrh: org.apache.solr.handler.component.SearchHandler
[junit4:junit4]   2> 16568 T157 oasc.RequestHandlers.initHandlersFromConfig created /mlt: solr.MoreLikeThisHandler
[junit4:junit4]   2> 16569 T157 oasc.RequestHandlers.initHandlersFromConfig created /debug/dump: solr.DumpRequestHandler
[junit4:junit4]   2> 16577 T157 oashl.XMLLoader.init xsltCacheLifetimeSeconds=60
[junit4:junit4]   2> 16580 T157 oasc.SolrCore.initDeprecatedSupport WARNING solrconfig.xml uses deprecated <admin/gettableFiles>, Please update your config to use the ShowFileRequestHandler.
[junit4:junit4]   2> 16582 T157 oasc.SolrCore.initDeprecatedSupport WARNING adding ShowFileRequestHandler with hidden files: [SCHEMA.XML, OLD_SYNONYMS.TXT, STOPWORDS.TXT, PROTWORDS.TXT, OPEN-EXCHANGE-RATES.JSON, SYNONYMS.TXT, CURRENCY.XML, MAPPING-ISOLATIN1ACCENT.TXT]
[junit4:junit4]   2> 16584 T157 oasc.CachingDirectoryFactory.close Releasing directory:/usr/home/hudson/hudson-slave/workspace/Lucene-Solr-Tests-trunk-java7/solr/build/solr-core/test/J1/./org.apache.solr.cloud.SyncSliceTest-1359843844230/jetty4
[junit4:junit4]   2> 16585 T157 oass.SolrIndexSearcher.<init> Opening Searcher@4474ce1f main
[junit4:junit4]   2> 16586 T157 oasu.CommitTracker.<init> Hard AutoCommit: disabled
[junit4:junit4]   2> 16587 T157 oasu.CommitTracker.<init> Soft AutoCommit: disabled
[junit4:junit4]   2> 16587 T157 oashc.SpellCheckComponent.inform Initializing spell checkers
[junit4:junit4]   2> 16593 T157 oass.DirectSolrSpellChecker.init init: {name=direct,classname=DirectSolrSpellChecker,field=lowerfilt,minQueryLength=3}
[junit4:junit4]   2> 16615 T91 oascc.ZkStateReader.updateClusterState Updating cloud state from ZooKeeper... 
[junit4:junit4]   2> 16616 T91 oasc.Overseer$ClusterStateUpdater.updateState Update state numShards=1 message={
[junit4:junit4]   2> 	  "operation":"state",
[junit4:junit4]   2> 	  "numShards":"1",
[junit4:junit4]   2> 	  "shard":"shard1",
[junit4:junit4]   2> 	  "roles":null,
[junit4:junit4]   2> 	  "state":"recovering",
[junit4:junit4]   2> 	  "core":"collection1",
[junit4:junit4]   2> 	  "collection":"collection1",
[junit4:junit4]   2> 	  "node_name":"127.0.0.1:32616__pq",
[junit4:junit4]   2> 	  "base_url":"http://127.0.0.1:32616/_pq"}
[junit4:junit4]   2> 16629 T91 oasc.Overseer$ClusterStateUpdater.updateState Update state numShards=1 message={
[junit4:junit4]   2> 	  "operation":"state",
[junit4:junit4]   2> 	  "numShards":"1",
[junit4:junit4]   2> 	  "shard":"shard1",
[junit4:junit4]   2> 	  "roles":null,
[junit4:junit4]   2> 	  "state":"active",
[junit4:junit4]   2> 	  "core":"collection1",
[junit4:junit4]   2> 	  "collection":"collection1",
[junit4:junit4]   2> 	  "node_name":"127.0.0.1:30729__pq",
[junit4:junit4]   2> 	  "base_url":"http://127.0.0.1:30729/_pq"}
[junit4:junit4]   2> 16644 T160 oasc.SolrCore.registerSearcher [collection1] Registered new searcher Searcher@4474ce1f main{StandardDirectoryReader(segments_1:1)}
[junit4:junit4]   2> 16646 T156 oascc.ZkStateReader$2.process A cluster state change: WatchedEvent state:SyncConnected type:NodeDataChanged path:/clusterstate.json, has occurred - updating... (live nodes size: 5)
[junit4:junit4]   2> 16646 T124 oascc.ZkStateReader$2.process A cluster state change: WatchedEvent state:SyncConnected type:NodeDataChanged path:/clusterstate.json, has occurred - updating... (live nodes size: 5)
[junit4:junit4]   2> 16646 T96 oascc.ZkStateReader$2.process A cluster state change: WatchedEvent state:SyncConnected type:NodeDataChanged path:/clusterstate.json, has occurred - updating... (live nodes size: 5)
[junit4:junit4]   2> 16646 T109 oascc.ZkStateReader$2.process A cluster state change: WatchedEvent state:SyncConnected type:NodeDataChanged path:/clusterstate.json, has occurred - updating... (live nodes size: 5)
[junit4:junit4]   2> 16646 T140 oascc.ZkStateReader$2.process A cluster state change: WatchedEvent state:SyncConnected type:NodeDataChanged path:/clusterstate.json, has occurred - updating... (live nodes size: 5)
[junit4:junit4]   2> 16646 T90 oascc.ZkStateReader$2.process A cluster state change: WatchedEvent state:SyncConnected type:NodeDataChanged path:/clusterstate.json, has occurred - updating... (live nodes size: 5)
[junit4:junit4]   2> 16651 T157 oasc.ZkController.publish publishing core=collection1 state=down
[junit4:junit4]   2> 16652 T157 oasc.ZkController.publish numShards not found on descriptor - reading it from system property
[junit4:junit4]   2> 18162 T91 oascc.ZkStateReader.updateClusterState Updating cloud state from ZooKeeper... 
[junit4:junit4]   2> 18163 T91 oasc.Overseer$ClusterStateUpdater.updateState Update state numShards=1 message={
[junit4:junit4]   2> 	  "operation":"state",
[junit4:junit4]   2> 	  "numShards":"1",
[junit4:junit4]   2> 	  "shard":null,
[junit4:junit4]   2> 	  "roles":null,
[junit4:junit4]   2> 	  "state":"down",
[junit4:junit4]   2> 	  "core":"collection1",
[junit4:junit4]   2> 	  "collection":"collection1",
[junit4:junit4]   2> 	  "node_name":"127.0.0.1:35524__pq",
[junit4:junit4]   2> 	  "base_url":"http://127.0.0.1:35524/_pq"}
[junit4:junit4]   2> 18164 T91 oasc.Overseer$ClusterStateUpdater.updateState Collection already exists with numShards=1
[junit4:junit4]   2> 18164 T91 oasc.Overseer$ClusterStateUpdater.updateState Assigning new node to shard shard=shard1
[junit4:junit4]   2> 18201 T90 oascc.ZkStateReader$2.process A cluster state change: WatchedEvent state:SyncConnected type:NodeDataChanged path:/clusterstate.json, has occurred - updating... (live nodes size: 5)
[junit4:junit4]   2> 18201 T156 oascc.ZkStateReader$2.process A cluster state change: WatchedEvent state:SyncConnected type:NodeDataChanged path:/clusterstate.json, has occurred - updating... (live nodes size: 5)
[junit4:junit4]   2> 18201 T109 oascc.ZkStateReader$2.process A cluster state change: WatchedEvent state:SyncConnected type:NodeDataChanged path:/clusterstate.json, has occurred - updating... (live nodes size: 5)
[junit4:junit4]   2> 18201 T140 oascc.ZkStateReader$2.process A cluster state change: WatchedEvent state:SyncConnected type:NodeDataChanged path:/clusterstate.json, has occurred - updating... (live nodes size: 5)
[junit4:junit4]   2> 18201 T96 oascc.ZkStateReader$2.process A cluster state change: WatchedEvent state:SyncConnected type:NodeDataChanged path:/clusterstate.json, has occurred - updating... (live nodes size: 5)
[junit4:junit4]   2> 18201 T124 oascc.ZkStateReader$2.process A cluster state change: WatchedEvent state:SyncConnected type:NodeDataChanged path:/clusterstate.json, has occurred - updating... (live nodes size: 5)
[junit4:junit4]   2> 18660 T157 oasc.CoreContainer.registerCore registering core: collection1
[junit4:junit4]   2> 18660 T157 oasc.ZkController.register Register replica - core:collection1 address:http://127.0.0.1:35524/_pq collection:collection1 shard:shard1
[junit4:junit4]   2> 18666 T157 oasc.ZkController.register We are http://127.0.0.1:35524/_pq/collection1/ and leader is http://127.0.0.1:34013/_pq/collection1/
[junit4:junit4]   2> 18666 T157 oasc.ZkController.register No LogReplay needed for core=collection1 baseURL=http://127.0.0.1:35524/_pq
[junit4:junit4]   2> 18667 T157 oasc.ZkController.checkRecovery Core needs to recover:collection1
[junit4:junit4]   2> 18667 T157 oasu.DefaultSolrCoreState.doRecovery Running recovery - first canceling any ongoing recovery
[junit4:junit4]   2> ASYNC  NEW_CORE C7 name=collection1 org.apache.solr.core.SolrCore@484bedfb url=http://127.0.0.1:35524/_pq/collection1 node=127.0.0.1:35524__pq C7_STATE=coll:collection1 core:collection1 props:{shard=null, roles=null, state=down, core=collection1, collection=collection1, node_name=127.0.0.1:35524__pq, base_url=http://127.0.0.1:35524/_pq}
[junit4:junit4]   2> 18668 T161 C7 P35524 oasc.RecoveryStrategy.run Starting recovery process.  core=collection1 recoveringAfterStartup=true
[junit4:junit4]   2> 18669 T161 C7 P35524 oasc.RecoveryStrategy.doRecovery ###### startupVersions=[]
[junit4:junit4]   2> 18669 T157 oascc.ZkStateReader.updateClusterState Updating cloud state from ZooKeeper... 
[junit4:junit4]   2> 18669 T161 C7 P35524 oasc.ZkController.publish publishing core=collection1 state=recovering
[junit4:junit4]   2> 18669 T161 C7 P35524 oasc.ZkController.publish numShards not found on descriptor - reading it from system property
[junit4:junit4]   2> 18670 T68 oass.SolrDispatchFilter.init user.dir=/usr/home/hudson/hudson-slave/workspace/Lucene-Solr-Tests-trunk-java7/solr/build/solr-core/test/J1
[junit4:junit4]   2> 18671 T68 oass.SolrDispatchFilter.init SolrDispatchFilter.init() done
[junit4:junit4]   2> 18672 T161 C7 P35524 oascsi.HttpClientUtil.createClient Creating new http client, config:maxConnections=128&maxConnectionsPerHost=32&followRedirects=false
[junit4:junit4]   2> 18672 T68 oascsi.HttpClientUtil.createClient Creating new http client, config:maxConnections=128&maxConnectionsPerHost=32&followRedirects=false
[junit4:junit4]   2> 18691 T68 oascc.ZkStateReader.updateClusterState Updating cloud state from ZooKeeper... 
[junit4:junit4]   2> 18694 T68 oasc.AbstractFullDistribZkTestBase.waitForThingsToLevelOut Wait for recoveries to finish - wait 15 for each attempt
[junit4:junit4]   2> 18694 T68 oasc.AbstractDistribZkTestBase.waitForRecoveriesToFinish Wait for recoveries to finish - collection: collection1 failOnTimeout:true timeout (sec):15
[junit4:junit4]   2> 18696 T68 oascc.ZkStateReader.updateClusterState Updating cloud state from ZooKeeper... 
[junit4:junit4]   2>  C5_STATE=coll:collection1 core:collection1 props:{shard=shard1, roles=null, state=recovering, core=collection1, collection=collection1, node_name=127.0.0.1:32616__pq, base_url=http://127.0.0.1:32616/_pq}
[junit4:junit4]   2> 19218 T143 C5 P32616 oasc.RecoveryStrategy.doRecovery Attempting to PeerSync from http://127.0.0.1:34013/_pq/collection1/ core=collection1 - recoveringAfterStartup=true
[junit4:junit4]   2> 19218 T143 C5 P32616 oasu.PeerSync.sync PeerSync: core=collection1 url=http://127.0.0.1:32616/_pq START replicas=[http://127.0.0.1:34013/_pq/collection1/] nUpdates=100
[junit4:junit4]   2> 19219 T143 C5 P32616 oasu.PeerSync.sync WARNING no frame of reference to tell of we've missed updates
[junit4:junit4]   2> 19219 T143 C5 P32616 oasc.RecoveryStrategy.doRecovery PeerSync Recovery was not successful - trying replication. core=collection1
[junit4:junit4]   2> 19220 T143 C5 P32616 oasc.RecoveryStrategy.doRecovery Starting Replication Recovery. core=collection1
[junit4:junit4]   2> 19220 T143 C5 P32616 oasc.RecoveryStrategy.doRecovery Begin buffering updates. core=collection1
[junit4:junit4]   2> 19220 T143 C5 P32616 oasu.UpdateLog.bufferUpdates Starting to buffer updates. FSUpdateLog{state=ACTIVE, tlog=null}
[junit4:junit4]   2> 19221 T143 C5 P32616 oasc.RecoveryStrategy.replicate Attempting to replicate from http://127.0.0.1:34013/_pq/collection1/. core=collection1
[junit4:junit4]   2> 19221 T143 C5 P32616 oascsi.HttpClientUtil.createClient Creating new http client, config:maxConnections=128&maxConnectionsPerHost=32&followRedirects=false
[junit4:junit4]   2> 19223 T101 C6 P34013 REQ /get {getVersions=100&distrib=false&wt=javabin&qt=/get&version=2} status=0 QTime=0 
[junit4:junit4]   2> 19235 T105 C6 P34013 oasu.DirectUpdateHandler2.commit start commit{,optimize=false,openSearcher=false,waitSearcher=true,expungeDeletes=false,softCommit=false}
[junit4:junit4]   2> 19243 T105 C6 P34013 oasc.SolrDeletionPolicy.onCommit SolrDeletionPolicy.onCommit: commits:num=2
[junit4:junit4]   2> 		commit{dir=RateLimitedDirectoryWrapper(NRTCachingDirectory(org.apache.lucene.store.NIOFSDirectory@/usr/home/hudson/hudson-slave/workspace/Lucene-Solr-Tests-trunk-java7/solr/build/solr-core/test/J1/org.apache.solr.cloud.SyncSliceTest-1359843844230/jetty1/index lockFactory=org.apache.lucene.store.NativeFSLockFactory@50eaa935; maxCacheMB=48.0 maxMergeSizeMB=4.0)),segFN=segments_2,generation=2,filenames=[segments_2]
[junit4:junit4]   2> 		commit{dir=RateLimitedDirectoryWrapper(NRTCachingDirectory(org.apache.lucene.store.NIOFSDirectory@/usr/home/hudson/hudson-slave/workspace/Lucene-Solr-Tests-trunk-java7/solr/build/solr-core/test/J1/org.apache.solr.cloud.SyncSliceTest-1359843844230/jetty1/index lockFactory=org.apache.lucene.store.NativeFSLockFactory@50eaa935; maxCacheMB=48.0 maxMergeSizeMB=4.0)),segFN=segments_3,generation=3,filenames=[segments_3]
[junit4:junit4]   2> 19244 T105 C6 P34013 oasc.SolrDeletionPolicy.updateCommits newest commit = 3[segments_3]
[junit4:junit4]   2> 19245 T105 C6 P34013 oasc.CachingDirectoryFactory.close Releasing directory:/usr/home/hudson/hudson-slave/workspace/Lucene-Solr-Tests-trunk-java7/solr/build/solr-core/test/J1/./org.apache.solr.cloud.SyncSliceTest-1359843844230/jetty1
[junit4:junit4]   2> 19245 T105 C6 P34013 oasu.DirectUpdateHandler2.commit end_commit_flush
[junit4:junit4]   2> 19246 T105 C6 P34013 /update {waitSearcher=true&openSearcher=false&commit=true&wt=javabin&commit_end_point=true&version=2&softCommit=false} {commit=} 0 11
[junit4:junit4]   2> 19247 T143 C5 P32616 oash.ReplicationHandler.inform Commits will be reserved for  10000
[junit4:junit4]   2> 19247 T143 C5 P32616 oash.SnapPuller.<init>  No value set for 'pollInterval'. Timer Task not started.
[junit4:junit4]   2> 19251 T103 C6 P34013 REQ /replication {command=indexversion&qt=/replication&wt=javabin&version=2} status=0 QTime=0 
[junit4:junit4]   2> 19252 T143 C5 P32616 oash.SnapPuller.fetchLatestIndex Master's generation: 3
[junit4:junit4]   2> 19252 T143 C5 P32616 oash.SnapPuller.fetchLatestIndex Slave's generation: 1
[junit4:junit4]   2> 19253 T143 C5 P32616 oash.SnapPuller.fetchLatestIndex Starting replication process
[junit4:junit4]   2> 19256 T103 C6 P34013 oasc.CachingDirectoryFactory.close Releasing directory:/usr/home/hudson/hudson-slave/workspace/Lucene-Solr-Tests-trunk-java7/solr/build/solr-core/test/J1/./org.apache.solr.cloud.SyncSliceTest-1359843844230/jetty1
[junit4:junit4]   2> 19257 T103 C6 P34013 oasc.CachingDirectoryFactory.close Releasing directory:/usr/home/hudson/hudson-slave/workspace/Lucene-Solr-Tests-trunk-java7/solr/build/solr-core/test/J1/./org.apache.solr.cloud.SyncSliceTest-1359843844230/jetty1/index
[junit4:junit4]   2> 19257 T103 C6 P34013 REQ /replication {command=filelist&qt=/replication&wt=javabin&generation=3&version=2} status=0 QTime=2 
[junit4:junit4]   2> 19258 T143 C5 P32616 oash.SnapPuller.fetchLatestIndex Number of files in latest index in master: 1
[junit4:junit4]   2> 19260 T143 C5 P32616 oasc.CachingDirectoryFactory.get return new directory for /usr/home/hudson/hudson-slave/workspace/Lucene-Solr-Tests-trunk-java7/solr/build/solr-core/test/J1/./org.apache.solr.cloud.SyncSliceTest-1359843844230/jetty3/index.20130202162423483 forceNew:false
[junit4:junit4]   2> 19260 T143 C5 P32616 oasc.CachingDirectoryFactory.close Releasing directory:/usr/home/hudson/hudson-slave/workspace/Lucene-Solr-Tests-trunk-java7/solr/build/solr-core/test/J1/./org.apache.solr.cloud.SyncSliceTest-1359843844230/jetty3
[junit4:junit4]   2> 19261 T143 C5 P32616 oash.SnapPuller.fetchLatestIndex Starting download to RateLimitedDirectoryWrapper(NRTCachingDirectory(org.apache.lucene.store.NIOFSDirectory@/usr/home/hudson/hudson-slave/workspace/Lu

[...truncated too long message...]

)
[junit4:junit4]   2> 	        at org.apache.lucene.util.TestRuleFieldCacheSanity$1.evaluate(TestRuleFieldCacheSanity.java:51)
[junit4:junit4]   2> 	        at org.apache.lucene.util.AbstractBeforeAfterRule$1.evaluate(AbstractBeforeAfterRule.java:46)
[junit4:junit4]   2> 	        at com.carrotsearch.randomizedtesting.rules.SystemPropertiesInvariantRule$1.evaluate(SystemPropertiesInvariantRule.java:55)
[junit4:junit4]   2> 	        at org.apache.lucene.util.TestRuleThreadAndTestName$1.evaluate(TestRuleThreadAndTestName.java:49)
[junit4:junit4]   2> 	        at org.apache.lucene.util.TestRuleIgnoreAfterMaxFailures$1.evaluate(TestRuleIgnoreAfterMaxFailures.java:70)
[junit4:junit4]   2> 	        at org.apache.lucene.util.TestRuleMarkFailure$1.evaluate(TestRuleMarkFailure.java:48)
[junit4:junit4]   2> 	        at com.carrotsearch.randomizedtesting.rules.StatementAdapter.evaluate(StatementAdapter.java:36)
[junit4:junit4]   2> 	        at com.carrotsearch.randomizedtesting.ThreadLeakControl$StatementRunner.run(ThreadLeakControl.java:358)
[junit4:junit4]   2> 	        at com.carrotsearch.randomizedtesting.ThreadLeakControl.forkTimeoutingTask(ThreadLeakControl.java:782)
[junit4:junit4]   2> 	        at com.carrotsearch.randomizedtesting.ThreadLeakControl$3.evaluate(ThreadLeakControl.java:442)
[junit4:junit4]   2> 	        at com.carrotsearch.randomizedtesting.RandomizedRunner.runSingleTest(RandomizedRunner.java:746)
[junit4:junit4]   2> 	        at com.carrotsearch.randomizedtesting.RandomizedRunner$3.evaluate(RandomizedRunner.java:648)
[junit4:junit4]   2> 	        at com.carrotsearch.randomizedtesting.RandomizedRunner$4.evaluate(RandomizedRunner.java:682)
[junit4:junit4]   2> 	        at com.carrotsearch.randomizedtesting.RandomizedRunner$5.evaluate(RandomizedRunner.java:693)
[junit4:junit4]   2> 	        at com.carrotsearch.randomizedtesting.rules.StatementAdapter.evaluate(StatementAdapter.java:36)
[junit4:junit4]   2> 	        at com.carrotsearch.randomizedtesting.rules.SystemPropertiesRestoreRule$1.evaluate(SystemPropertiesRestoreRule.java:53)
[junit4:junit4]   2> 	        at org.apache.lucene.util.AbstractBeforeAfterRule$1.evaluate(AbstractBeforeAfterRule.java:46)
[junit4:junit4]   2> 	        at org.apache.lucene.util.TestRuleStoreClassName$1.evaluate(TestRuleStoreClassName.java:42)
[junit4:junit4]   2> 	        at com.carrotsearch.randomizedtesting.rules.SystemPropertiesInvariantRule$1.evaluate(SystemPropertiesInvariantRule.java:55)
[junit4:junit4]   2> 	        at com.carrotsearch.randomizedtesting.rules.NoShadowingOrOverridesOnMethodsRule$1.evaluate(NoShadowingOrOverridesOnMethodsRule.java:39)
[junit4:junit4]   2> 	        at com.carrotsearch.randomizedtesting.rules.NoShadowingOrOverridesOnMethodsRule$1.evaluate(NoShadowingOrOverridesOnMethodsRule.java:39)
[junit4:junit4]   2> 	        at com.carrotsearch.randomizedtesting.rules.StatementAdapter.evaluate(StatementAdapter.java:36)
[junit4:junit4]   2> 	        at org.apache.lucene.util.TestRuleAssertionsRequired$1.evaluate(TestRuleAssertionsRequired.java:43)
[junit4:junit4]   2> 	        at org.apache.lucene.util.TestRuleMarkFailure$1.evaluate(TestRuleMarkFailure.java:48)
[junit4:junit4]   2> 	        at org.apache.lucene.util.TestRuleIgnoreAfterMaxFailures$1.evaluate(TestRuleIgnoreAfterMaxFailures.java:70)
[junit4:junit4]   2> 	        at org.apache.lucene.util.TestRuleIgnoreTestSuites$1.evaluate(TestRuleIgnoreTestSuites.java:55)
[junit4:junit4]   2> 	        at com.carrotsearch.randomizedtesting.rules.StatementAdapter.evaluate(StatementAdapter.java:36)
[junit4:junit4]   2> 	        at com.carrotsearch.randomizedtesting.ThreadLeakControl$StatementRunner.run(ThreadLeakControl.java:358)
[junit4:junit4]   2> 	        at java.lang.Thread.run(Thread.java:722)
[junit4:junit4]   2> 	  25) Thread[id=980, name=HashSessionScavenger-26, state=TIMED_WAITING, group=TGRP-BasicDistributedZkTest]
[junit4:junit4]   2> 	        at java.lang.Object.wait(Native Method)
[junit4:junit4]   2> 	        at java.util.TimerThread.mainLoop(Timer.java:552)
[junit4:junit4]   2> 	        at java.util.TimerThread.run(Timer.java:505)
[junit4:junit4]   2> 	  26) Thread[id=991, name=TEST-BasicDistributedZkTest.testDistribSearch-seed#[68A457610324D72F]-SendThread(localhost:59545), state=RUNNABLE, group=TGRP-BasicDistributedZkTest]
[junit4:junit4]   2> 	        at sun.nio.ch.KQueueArrayWrapper.interrupt(Native Method)
[junit4:junit4]   2> 	        at sun.nio.ch.KQueueArrayWrapper.interrupt(KQueueArrayWrapper.java:164)
[junit4:junit4]   2> 	        at sun.nio.ch.KQueueSelectorImpl.wakeup(KQueueSelectorImpl.java:245)
[junit4:junit4]   2> 	        at java.nio.channels.spi.AbstractSelector$1.interrupt(AbstractSelector.java:210)
[junit4:junit4]   2> 	        at java.nio.channels.spi.AbstractSelector.begin(AbstractSelector.java:216)
[junit4:junit4]   2> 	        at sun.nio.ch.KQueueSelectorImpl.doSelect(KQueueSelectorImpl.java:102)
[junit4:junit4]   2> 	        at sun.nio.ch.SelectorImpl.lockAndDoSelect(SelectorImpl.java:87)
[junit4:junit4]   2> 	        at sun.nio.ch.SelectorImpl.select(SelectorImpl.java:98)
[junit4:junit4]   2> 	        at org.apache.zookeeper.ClientCnxnSocketNIO.doTransport(ClientCnxnSocketNIO.java:338)
[junit4:junit4]   2> 	        at org.apache.zookeeper.ClientCnxn$SendThread.run(ClientCnxn.java:1068)
[junit4:junit4]   2> 	  27) Thread[id=994, name=searcherExecutor-775-thread-1, state=WAITING, group=TGRP-BasicDistributedZkTest]
[junit4:junit4]   2> 	        at sun.misc.Unsafe.park(Native Method)
[junit4:junit4]   2> 	        at java.util.concurrent.locks.LockSupport.park(LockSupport.java:186)
[junit4:junit4]   2> 	        at java.util.concurrent.locks.AbstractQueuedSynchronizer$ConditionObject.await(AbstractQueuedSynchronizer.java:2043)
[junit4:junit4]   2> 	        at java.util.concurrent.LinkedBlockingQueue.take(LinkedBlockingQueue.java:442)
[junit4:junit4]   2> 	        at java.util.concurrent.ThreadPoolExecutor.getTask(ThreadPoolExecutor.java:1043)
[junit4:junit4]   2> 	        at java.util.concurrent.ThreadPoolExecutor.runWorker(ThreadPoolExecutor.java:1103)
[junit4:junit4]   2> 	        at java.util.concurrent.ThreadPoolExecutor$Worker.run(ThreadPoolExecutor.java:603)
[junit4:junit4]   2> 	        at java.lang.Thread.run(Thread.java:722)
[junit4:junit4]   2> NOTE: test params are: codec=DummyCompressingStoredFields(storedFieldsFormat=CompressingStoredFieldsFormat(compressionMode=DUMMY, chunkSize=63), termVectorsFormat=CompressingTermVectorsFormat(compressionMode=DUMMY, chunkSize=63)), sim=RandomSimilarityProvider(queryNorm=true,coord=crazy): {}, locale=el_CY, timezone=Etc/GMT-9
[junit4:junit4]   2> NOTE: FreeBSD 9.0-RELEASE amd64/Oracle Corporation 1.7.0_09 (64-bit)/cpus=16,threads=28,free=48050376,total=284164096
[junit4:junit4]   2> NOTE: All tests run in this JVM: [FastVectorHighlighterTest, DistanceFunctionTest, TestQuerySenderNoQuery, CircularListTest, ExternalFileFieldSortTest, ZkControllerTest, MBeansHandlerTest, DateMathParserTest, UpdateRequestProcessorFactoryTest, SampleTest, TestAtomicUpdateErrorCases, FieldAnalysisRequestHandlerTest, TestLFUCache, SolrCoreCheckLockOnStartupTest, LeaderElectionIntegrationTest, SuggesterFSTTest, TestFastOutputStream, MinimalSchemaTest, NumericFieldsTest, SpellPossibilityIteratorTest, FileBasedSpellCheckerTest, CopyFieldTest, TestBinaryResponseWriter, TestSearchPerf, TestNumberUtils, SolrRequestParserTest, RequestHandlersTest, SortByFunctionTest, SuggesterWFSTTest, AutoCommitTest, TestLMDirichletSimilarityFactory, TestLazyCores, ChaosMonkeySafeLeaderTest, SolrCmdDistributorTest, TermsComponentTest, TestFuzzyAnalyzedSuggestions, TestDocumentBuilder, TestCoreContainer, PreAnalyzedFieldTest, TestQueryTypes, PluginInfoTest, DateFieldTest, ChaosMonkeyNothingIsSafeTest, TestZkChroot, DirectSolrConnectionTest, DistributedSpellCheckComponentTest, TestJmxMonitoredMap, AnalysisAfterCoreReloadTest, DefaultValueUpdateProcessorTest, DistributedTermsComponentTest, TestReload, TestCharFilters, BinaryUpdateRequestHandlerTest, TestLMJelinekMercerSimilarityFactory, SpatialFilterTest, TestLuceneMatchVersion, TestPartialUpdateDeduplication, TestSuggestSpellingConverter, NotRequiredUniqueKeyTest, TestFaceting, BasicDistributedZkTest]
[junit4:junit4]   2> NOTE: reproduce with: ant test  -Dtestcase=BasicDistributedZkTest -Dtests.seed=68A457610324D72F -Dtests.multiplier=3 -Dtests.slow=true -Dtests.locale=el_CY -Dtests.timezone=Etc/GMT-9 -Dtests.file.encoding=US-ASCII
[junit4:junit4] ERROR   0.00s J0 | BasicDistributedZkTest (suite) <<<
[junit4:junit4]    > Throwable #1: java.lang.Exception: Suite timeout exceeded (>= 7200000 msec).
[junit4:junit4]    > 	at __randomizedtesting.SeedInfo.seed([68A457610324D72F]:0)
[junit4:junit4] Completed on J0 in 7223.62s, 1 test, 2 errors <<< FAILURES!

[...truncated 12 lines...]
BUILD FAILED
/usr/home/hudson/hudson-slave/workspace/Lucene-Solr-Tests-trunk-java7/build.xml:346: The following error occurred while executing this line:
/usr/home/hudson/hudson-slave/workspace/Lucene-Solr-Tests-trunk-java7/build.xml:39: The following error occurred while executing this line:
/usr/home/hudson/hudson-slave/workspace/Lucene-Solr-Tests-trunk-java7/solr/build.xml:178: The following error occurred while executing this line:
/usr/home/hudson/hudson-slave/workspace/Lucene-Solr-Tests-trunk-java7/solr/common-build.xml:428: The following error occurred while executing this line:
/usr/home/hudson/hudson-slave/workspace/Lucene-Solr-Tests-trunk-java7/lucene/common-build.xml:1176: The following error occurred while executing this line:
/usr/home/hudson/hudson-slave/workspace/Lucene-Solr-Tests-trunk-java7/lucene/common-build.xml:841: There were test failures: 249 suites, 1038 tests, 1 suite-level error, 1 error, 1 failure, 23 ignored (5 assumptions)

Total time: 149 minutes 16 seconds
Build step 'Invoke Ant' marked build as failure
Archiving artifacts
Recording test results
Email was triggered for: Failure
Sending email for trigger: Failure



Mime
View raw message