lucene-dev mailing list archives

Site index · List index
Message view « Date » · « Thread »
Top « Date » · « Thread »
From Charlie Cron <hudsonsevilt...@gmail.com>
Subject Build failed in Jenkins: the 4547 machine gun #941
Date Mon, 28 Jan 2013 02:55:20 GMT
See <http://fortyounce.servebeer.com/job/the%204547%20machine%20gun/941/>

------------------------------------------
[...truncated 42585 lines...]
[junit4:junit4]    > 	at com.carrotsearch.randomizedtesting.ThreadLeakControl.forkTimeoutingTask(ThreadLeakControl.java:782)
[junit4:junit4]    > 	at com.carrotsearch.randomizedtesting.ThreadLeakControl$3.evaluate(ThreadLeakControl.java:442)
[junit4:junit4]    > 	at com.carrotsearch.randomizedtesting.RandomizedRunner.runSingleTest(RandomizedRunner.java:746)
[junit4:junit4]    > 	at com.carrotsearch.randomizedtesting.RandomizedRunner$3.evaluate(RandomizedRunner.java:648)
[junit4:junit4]    > 	at com.carrotsearch.randomizedtesting.RandomizedRunner$4.evaluate(RandomizedRunner.java:682)
[junit4:junit4]    > 	at com.carrotsearch.randomizedtesting.RandomizedRunner$5.evaluate(RandomizedRunner.java:693)
[junit4:junit4]    > 	at org.apache.lucene.util.AbstractBeforeAfterRule$1.evaluate(AbstractBeforeAfterRule.java:46)
[junit4:junit4]    > 	at org.apache.lucene.util.TestRuleStoreClassName$1.evaluate(TestRuleStoreClassName.java:42)
[junit4:junit4]    > 	at com.carrotsearch.randomizedtesting.rules.SystemPropertiesInvariantRule$1.evaluate(SystemPropertiesInvariantRule.java:55)
[junit4:junit4]    > 	at com.carrotsearch.randomizedtesting.rules.NoShadowingOrOverridesOnMethodsRule$1.evaluate(NoShadowingOrOverridesOnMethodsRule.java:39)
[junit4:junit4]    > 	at com.carrotsearch.randomizedtesting.rules.NoShadowingOrOverridesOnMethodsRule$1.evaluate(NoShadowingOrOverridesOnMethodsRule.java:39)
[junit4:junit4]    > 	at com.carrotsearch.randomizedtesting.rules.StatementAdapter.evaluate(StatementAdapter.java:36)
[junit4:junit4]    > 	at org.apache.lucene.util.TestRuleAssertionsRequired$1.evaluate(TestRuleAssertionsRequired.java:43)
[junit4:junit4]    > 	at org.apache.lucene.util.TestRuleMarkFailure$1.evaluate(TestRuleMarkFailure.java:48)
[junit4:junit4]    > 	at org.apache.lucene.util.TestRuleIgnoreAfterMaxFailures$1.evaluate(TestRuleIgnoreAfterMaxFailures.java:70)
[junit4:junit4]    > 	at org.apache.lucene.util.TestRuleIgnoreTestSuites$1.evaluate(TestRuleIgnoreTestSuites.java:55)
[junit4:junit4]    > 	at com.carrotsearch.randomizedtesting.rules.StatementAdapter.evaluate(StatementAdapter.java:36)
[junit4:junit4]    > 	at com.carrotsearch.randomizedtesting.ThreadLeakControl$StatementRunner.run(ThreadLeakControl.java:358)
[junit4:junit4]    > 	at java.lang.Thread.run(Thread.java:722)
[junit4:junit4]   2> NOTE: reproduce with: ant test  -Dtestcase=TestBooleanQueryVisitSubscorers
-Dtests.method=testConjunctions -Dtests.seed=9EB188AB86F016A1 -Dtests.slow=true -Dtests.locale=pl
-Dtests.timezone=US/Pacific-New -Dtests.file.encoding=UTF-8
[junit4:junit4] ERROR   0.01s J2 | TestBooleanQueryVisitSubscorers.testConjunctions <<<
[junit4:junit4]    > Throwable #1: java.lang.NoSuchMethodError: org.apache.lucene.util.ByteBlockPool.setBytesRef(Lorg/apache/lucene/util/BytesRef;I)Lorg/apache/lucene/util/BytesRef;
[junit4:junit4]    > 	at org.apache.lucene.index.FreqProxTermsWriterPerField.flush(FreqProxTermsWriterPerField.java:386)
[junit4:junit4]    > 	at org.apache.lucene.index.FreqProxTermsWriter.flush(FreqProxTermsWriter.java:85)
[junit4:junit4]    > 	at org.apache.lucene.index.TermsHash.flush(TermsHash.java:116)
[junit4:junit4]    > 	at org.apache.lucene.index.DocInverter.flush(DocInverter.java:53)
[junit4:junit4]    > 	at org.apache.lucene.index.DocFieldProcessor.flush(DocFieldProcessor.java:81)
[junit4:junit4]    > 	at org.apache.lucene.index.DocumentsWriterPerThread.flush(DocumentsWriterPerThread.java:494)
[junit4:junit4]    > 	at org.apache.lucene.index.DocumentsWriter.doFlush(DocumentsWriter.java:422)
[junit4:junit4]    > 	at org.apache.lucene.index.DocumentsWriter.flushAllThreads(DocumentsWriter.java:559)
[junit4:junit4]    > 	at org.apache.lucene.index.IndexWriter.prepareCommitInternal(IndexWriter.java:2638)
[junit4:junit4]    > 	at org.apache.lucene.index.IndexWriter.commitInternal(IndexWriter.java:2782)
[junit4:junit4]    > 	at org.apache.lucene.index.IndexWriter.commit(IndexWriter.java:2762)
[junit4:junit4]    > 	at org.apache.lucene.index.RandomIndexWriter.getReader(RandomIndexWriter.java:403)
[junit4:junit4]    > 	at org.apache.lucene.index.RandomIndexWriter.getReader(RandomIndexWriter.java:342)
[junit4:junit4]    > 	at org.apache.lucene.search.TestBooleanQueryVisitSubscorers.setUp(TestBooleanQueryVisitSubscorers.java:62)
[junit4:junit4]    > 	at sun.reflect.GeneratedMethodAccessor6.invoke(Unknown Source)
[junit4:junit4]    > 	at sun.reflect.DelegatingMethodAccessorImpl.invoke(DelegatingMethodAccessorImpl.java:43)
[junit4:junit4]    > 	at java.lang.reflect.Method.invoke(Method.java:601)
[junit4:junit4]    > 	at com.carrotsearch.randomizedtesting.RandomizedRunner.invoke(RandomizedRunner.java:1559)
[junit4:junit4]    > 	at com.carrotsearch.randomizedtesting.RandomizedRunner.access$600(RandomizedRunner.java:79)
[junit4:junit4]    > 	at com.carrotsearch.randomizedtesting.RandomizedRunner$7.evaluate(RandomizedRunner.java:771)
[junit4:junit4]    > 	at com.carrotsearch.randomizedtesting.RandomizedRunner$8.evaluate(RandomizedRunner.java:787)
[junit4:junit4]    > 	at org.apache.lucene.util.TestRuleSetupTeardownChained$1.evaluate(TestRuleSetupTeardownChained.java:50)
[junit4:junit4]    > 	at org.apache.lucene.util.TestRuleFieldCacheSanity$1.evaluate(TestRuleFieldCacheSanity.java:51)
[junit4:junit4]    > 	at org.apache.lucene.util.AbstractBeforeAfterRule$1.evaluate(AbstractBeforeAfterRule.java:46)
[junit4:junit4]    > 	at com.carrotsearch.randomizedtesting.rules.SystemPropertiesInvariantRule$1.evaluate(SystemPropertiesInvariantRule.java:55)
[junit4:junit4]    > 	at org.apache.lucene.util.TestRuleThreadAndTestName$1.evaluate(TestRuleThreadAndTestName.java:49)
[junit4:junit4]    > 	at org.apache.lucene.util.TestRuleIgnoreAfterMaxFailures$1.evaluate(TestRuleIgnoreAfterMaxFailures.java:70)
[junit4:junit4]    > 	at org.apache.lucene.util.TestRuleMarkFailure$1.evaluate(TestRuleMarkFailure.java:48)
[junit4:junit4]    > 	at com.carrotsearch.randomizedtesting.rules.StatementAdapter.evaluate(StatementAdapter.java:36)
[junit4:junit4]    > 	at com.carrotsearch.randomizedtesting.ThreadLeakControl$StatementRunner.run(ThreadLeakControl.java:358)
[junit4:junit4]    > 	at com.carrotsearch.randomizedtesting.ThreadLeakControl.forkTimeoutingTask(ThreadLeakControl.java:782)
[junit4:junit4]    > 	at com.carrotsearch.randomizedtesting.ThreadLeakControl$3.evaluate(ThreadLeakControl.java:442)
[junit4:junit4]    > 	at com.carrotsearch.randomizedtesting.RandomizedRunner.runSingleTest(RandomizedRunner.java:746)
[junit4:junit4]    > 	at com.carrotsearch.randomizedtesting.RandomizedRunner$3.evaluate(RandomizedRunner.java:648)
[junit4:junit4]    > 	at com.carrotsearch.randomizedtesting.RandomizedRunner$4.evaluate(RandomizedRunner.java:682)
[junit4:junit4]    > 	at com.carrotsearch.randomizedtesting.RandomizedRunner$5.evaluate(RandomizedRunner.java:693)
[junit4:junit4]    > 	at org.apache.lucene.util.AbstractBeforeAfterRule$1.evaluate(AbstractBeforeAfterRule.java:46)
[junit4:junit4]    > 	at org.apache.lucene.util.TestRuleStoreClassName$1.evaluate(TestRuleStoreClassName.java:42)
[junit4:junit4]    > 	at com.carrotsearch.randomizedtesting.rules.SystemPropertiesInvariantRule$1.evaluate(SystemPropertiesInvariantRule.java:55)
[junit4:junit4]    > 	at com.carrotsearch.randomizedtesting.rules.NoShadowingOrOverridesOnMethodsRule$1.evaluate(NoShadowingOrOverridesOnMethodsRule.java:39)
[junit4:junit4]    > 	at com.carrotsearch.randomizedtesting.rules.NoShadowingOrOverridesOnMethodsRule$1.evaluate(NoShadowingOrOverridesOnMethodsRule.java:39)
[junit4:junit4]    > 	at com.carrotsearch.randomizedtesting.rules.StatementAdapter.evaluate(StatementAdapter.java:36)
[junit4:junit4]    > 	at org.apache.lucene.util.TestRuleAssertionsRequired$1.evaluate(TestRuleAssertionsRequired.java:43)
[junit4:junit4]    > 	at org.apache.lucene.util.TestRuleMarkFailure$1.evaluate(TestRuleMarkFailure.java:48)
[junit4:junit4]    > 	at org.apache.lucene.util.TestRuleIgnoreAfterMaxFailures$1.evaluate(TestRuleIgnoreAfterMaxFailures.java:70)
[junit4:junit4]    > 	at org.apache.lucene.util.TestRuleIgnoreTestSuites$1.evaluate(TestRuleIgnoreTestSuites.java:55)
[junit4:junit4]    > 	at com.carrotsearch.randomizedtesting.rules.StatementAdapter.evaluate(StatementAdapter.java:36)
[junit4:junit4]    > 	at com.carrotsearch.randomizedtesting.ThreadLeakControl$StatementRunner.run(ThreadLeakControl.java:358)
[junit4:junit4]    > 	at java.lang.Thread.run(Thread.java:722)
[junit4:junit4]    > Throwable #2: java.lang.NullPointerException
[junit4:junit4]    > 	at org.apache.lucene.search.TestBooleanQueryVisitSubscorers.tearDown(TestBooleanQueryVisitSubscorers.java:69)
[junit4:junit4]    > 	at sun.reflect.GeneratedMethodAccessor7.invoke(Unknown Source)
[junit4:junit4]    > 	at sun.reflect.DelegatingMethodAccessorImpl.invoke(DelegatingMethodAccessorImpl.java:43)
[junit4:junit4]    > 	at java.lang.reflect.Method.invoke(Method.java:601)
[junit4:junit4]    > 	at com.carrotsearch.randomizedtesting.RandomizedRunner.invoke(RandomizedRunner.java:1559)
[junit4:junit4]    > 	at com.carrotsearch.randomizedtesting.RandomizedRunner.access$600(RandomizedRunner.java:79)
[junit4:junit4]    > 	at com.carrotsearch.randomizedtesting.RandomizedRunner$8.evaluate(RandomizedRunner.java:795)
[junit4:junit4]    > 	at org.apache.lucene.util.TestRuleSetupTeardownChained$1.evaluate(TestRuleSetupTeardownChained.java:50)
[junit4:junit4]    > 	at org.apache.lucene.util.TestRuleFieldCacheSanity$1.evaluate(TestRuleFieldCacheSanity.java:51)
[junit4:junit4]    > 	at org.apache.lucene.util.AbstractBeforeAfterRule$1.evaluate(AbstractBeforeAfterRule.java:46)
[junit4:junit4]    > 	at com.carrotsearch.randomizedtesting.rules.SystemPropertiesInvariantRule$1.evaluate(SystemPropertiesInvariantRule.java:55)
[junit4:junit4]    > 	at org.apache.lucene.util.TestRuleThreadAndTestName$1.evaluate(TestRuleThreadAndTestName.java:49)
[junit4:junit4]    > 	at org.apache.lucene.util.TestRuleIgnoreAfterMaxFailures$1.evaluate(TestRuleIgnoreAfterMaxFailures.java:70)
[junit4:junit4]    > 	at org.apache.lucene.util.TestRuleMarkFailure$1.evaluate(TestRuleMarkFailure.java:48)
[junit4:junit4]    > 	at com.carrotsearch.randomizedtesting.rules.StatementAdapter.evaluate(StatementAdapter.java:36)
[junit4:junit4]    > 	at com.carrotsearch.randomizedtesting.ThreadLeakControl$StatementRunner.run(ThreadLeakControl.java:358)
[junit4:junit4]    > 	at com.carrotsearch.randomizedtesting.ThreadLeakControl.forkTimeoutingTask(ThreadLeakControl.java:782)
[junit4:junit4]    > 	at com.carrotsearch.randomizedtesting.ThreadLeakControl$3.evaluate(ThreadLeakControl.java:442)
[junit4:junit4]    > 	at com.carrotsearch.randomizedtesting.RandomizedRunner.runSingleTest(RandomizedRunner.java:746)
[junit4:junit4]    > 	at com.carrotsearch.randomizedtesting.RandomizedRunner$3.evaluate(RandomizedRunner.java:648)
[junit4:junit4]    > 	at com.carrotsearch.randomizedtesting.RandomizedRunner$4.evaluate(RandomizedRunner.java:682)
[junit4:junit4]    > 	at com.carrotsearch.randomizedtesting.RandomizedRunner$5.evaluate(RandomizedRunner.java:693)
[junit4:junit4]    > 	at org.apache.lucene.util.AbstractBeforeAfterRule$1.evaluate(AbstractBeforeAfterRule.java:46)
[junit4:junit4]    > 	at org.apache.lucene.util.TestRuleStoreClassName$1.evaluate(TestRuleStoreClassName.java:42)
[junit4:junit4]    > 	at com.carrotsearch.randomizedtesting.rules.SystemPropertiesInvariantRule$1.evaluate(SystemPropertiesInvariantRule.java:55)
[junit4:junit4]    > 	at com.carrotsearch.randomizedtesting.rules.NoShadowingOrOverridesOnMethodsRule$1.evaluate(NoShadowingOrOverridesOnMethodsRule.java:39)
[junit4:junit4]    > 	at com.carrotsearch.randomizedtesting.rules.NoShadowingOrOverridesOnMethodsRule$1.evaluate(NoShadowingOrOverridesOnMethodsRule.java:39)
[junit4:junit4]    > 	at com.carrotsearch.randomizedtesting.rules.StatementAdapter.evaluate(StatementAdapter.java:36)
[junit4:junit4]    > 	at org.apache.lucene.util.TestRuleAssertionsRequired$1.evaluate(TestRuleAssertionsRequired.java:43)
[junit4:junit4]    > 	at org.apache.lucene.util.TestRuleMarkFailure$1.evaluate(TestRuleMarkFailure.java:48)
[junit4:junit4]    > 	at org.apache.lucene.util.TestRuleIgnoreAfterMaxFailures$1.evaluate(TestRuleIgnoreAfterMaxFailures.java:70)
[junit4:junit4]    > 	at org.apache.lucene.util.TestRuleIgnoreTestSuites$1.evaluate(TestRuleIgnoreTestSuites.java:55)
[junit4:junit4]    > 	at com.carrotsearch.randomizedtesting.rules.StatementAdapter.evaluate(StatementAdapter.java:36)
[junit4:junit4]    > 	at com.carrotsearch.randomizedtesting.ThreadLeakControl$StatementRunner.run(ThreadLeakControl.java:358)
[junit4:junit4]    > 	at java.lang.Thread.run(Thread.java:722)
[junit4:junit4]   2> NOTE: test params are: codec=Lucene42: {body=PostingsFormat(name=MockRandom)},
docValues:{}, sim=RandomSimilarityProvider(queryNorm=false,coord=crazy): {body=DFR I(ne)3(800.0),
title=IB SPL-D1}, locale=pl, timezone=US/Pacific-New
[junit4:junit4]   2> NOTE: Linux 3.2.0-24-generic amd64/Oracle Corporation 1.7.0_09 (64-bit)/cpus=8,threads=1,free=211467408,total=331743232
[junit4:junit4]   2> NOTE: All tests run in this JVM: [TestRamUsageEstimator, TestCopyBytes,
TestTermdocPerf, TestSegmentTermDocs, TestWindowsMMap, TestPayloadNearQuery, TestMultiTermConstantScore,
TestNearSpansOrdered, TestFSTs, TestTermRangeQuery, TestCollectionUtil, TestMinimize, TestBitVector,
TestIndexableField, TestMergeSchedulerExternal, TestSimpleExplanationsOfNonMatches, TestNamedSPILoader,
TestLucene40PostingsFormat, TestLazyProxSkipping, TestSameScoresWithThreads, TestByteBlockPool,
Before3, Before3, TestNeverDelete, TestCloseableThreadLocal, TestStressAdvance, TestReuseDocsEnum,
TestCompoundFile, TestVersion, TestFastCompressionMode, TestVirtualMethod, TestIndexWriterNRTIsCurrent,
TestPrefixCodedTerms, TestLucene40PostingsReader, TestNRTCachingDirectory, TestWorstCaseTestBehavior,
TestComplexExplanationsOfNonMatches, TestDirectoryReader, TestHugeRamFile, TestFieldCacheRangeFilter,
TestBytesRefHash, TestFlushByRamOrCountsPolicy, TestPersistentSnapshotDeletionPolicy, TestNRTManager,
TestCachingTokenFilter, TestForUtil, Test2BPositions, TestBagOfPositions, TestBooleanQueryVisitSubscorers]
[junit4:junit4] Completed on J2 in 0.03s, 3 tests, 3 errors <<< FAILURES!
[junit4:junit4] 
[junit4:junit4] Suite: org.apache.lucene.search.TestLiveFieldValues
[junit4:junit4]   2> Jan 27, 2013 7:55:18 PM com.carrotsearch.randomizedtesting.RandomizedRunner$QueueUncaughtExceptionsHandler
uncaughtException
[junit4:junit4]   2> WARNING: Uncaught exception in thread: Thread[Thread-132,5,TGRP-TestLiveFieldValues]
[junit4:junit4]   2> java.lang.RuntimeException: java.lang.NoSuchMethodError: org.apache.lucene.util.ByteBlockPool.setBytesRef(Lorg/apache/lucene/util/BytesRef;I)Lorg/apache/lucene/util/BytesRef;
[junit4:junit4]   2> 	at __randomizedtesting.SeedInfo.seed([9EB188AB86F016A1]:0)
[junit4:junit4]   2> 	at org.apache.lucene.search.TestLiveFieldValues$3.run(TestLiveFieldValues.java:159)
[junit4:junit4]   2> Caused by: java.lang.NoSuchMethodError: org.apache.lucene.util.ByteBlockPool.setBytesRef(Lorg/apache/lucene/util/BytesRef;I)Lorg/apache/lucene/util/BytesRef;
[junit4:junit4]   2> 	at org.apache.lucene.index.FreqProxTermsWriterPerField.flush(FreqProxTermsWriterPerField.java:386)
[junit4:junit4]   2> 	at org.apache.lucene.index.FreqProxTermsWriter.flush(FreqProxTermsWriter.java:85)
[junit4:junit4]   2> 	at org.apache.lucene.index.TermsHash.flush(TermsHash.java:116)
[junit4:junit4]   2> 	at org.apache.lucene.index.DocInverter.flush(DocInverter.java:53)
[junit4:junit4]   2> 	at org.apache.lucene.index.DocFieldProcessor.flush(DocFieldProcessor.java:81)
[junit4:junit4]   2> 	at org.apache.lucene.index.DocumentsWriterPerThread.flush(DocumentsWriterPerThread.java:494)
[junit4:junit4]   2> 	at org.apache.lucene.index.DocumentsWriter.doFlush(DocumentsWriter.java:422)
[junit4:junit4]   2> 	at org.apache.lucene.index.DocumentsWriter.preUpdate(DocumentsWriter.java:292)
[junit4:junit4]   2> 	at org.apache.lucene.index.DocumentsWriter.updateDocument(DocumentsWriter.java:361)
[junit4:junit4]   2> 	at org.apache.lucene.index.IndexWriter.updateDocument(IndexWriter.java:1471)
[junit4:junit4]   2> 	at org.apache.lucene.index.IndexWriter.updateDocument(IndexWriter.java:1443)
[junit4:junit4]   2> 	at org.apache.lucene.search.NRTManager$TrackingIndexWriter.updateDocument(NRTManager.java:163)
[junit4:junit4]   2> 	at org.apache.lucene.search.TestLiveFieldValues$3.run(TestLiveFieldValues.java:117)
[junit4:junit4]   2> 
[junit4:junit4]   2> Jan 27, 2013 7:55:18 PM com.carrotsearch.randomizedtesting.RandomizedRunner$QueueUncaughtExceptionsHandler
uncaughtException
[junit4:junit4]   2> WARNING: Uncaught exception in thread: Thread[Thread-131,5,TGRP-TestLiveFieldValues]
[junit4:junit4]   2> java.lang.RuntimeException: java.lang.NoSuchMethodError: org.apache.lucene.util.ByteBlockPool.setBytesRef(Lorg/apache/lucene/util/BytesRef;I)Lorg/apache/lucene/util/BytesRef;
[junit4:junit4]   2> 	at __randomizedtesting.SeedInfo.seed([9EB188AB86F016A1]:0)
[junit4:junit4]   2> 	at org.apache.lucene.search.TestLiveFieldValues$3.run(TestLiveFieldValues.java:159)
[junit4:junit4]   2> Caused by: java.lang.NoSuchMethodError: org.apache.lucene.util.ByteBlockPool.setBytesRef(Lorg/apache/lucene/util/BytesRef;I)Lorg/apache/lucene/util/BytesRef;
[junit4:junit4]   2> 	at org.apache.lucene.index.FreqProxTermsWriterPerField.flush(FreqProxTermsWriterPerField.java:386)
[junit4:junit4]   2> 	at org.apache.lucene.index.FreqProxTermsWriter.flush(FreqProxTermsWriter.java:85)
[junit4:junit4]   2> 	at org.apache.lucene.index.TermsHash.flush(TermsHash.java:116)
[junit4:junit4]   2> 	at org.apache.lucene.index.DocInverter.flush(DocInverter.java:53)
[junit4:junit4]   2> 	at org.apache.lucene.index.DocFieldProcessor.flush(DocFieldProcessor.java:81)
[junit4:junit4]   2> 	at org.apache.lucene.index.DocumentsWriterPerThread.flush(DocumentsWriterPerThread.java:494)
[junit4:junit4]   2> 	at org.apache.lucene.index.DocumentsWriter.doFlush(DocumentsWriter.java:422)
[junit4:junit4]   2> 	at org.apache.lucene.index.DocumentsWriter.flushAllThreads(DocumentsWriter.java:559)
[junit4:junit4]   2> 	at org.apache.lucene.index.IndexWriter.getReader(IndexWriter.java:355)
[junit4:junit4]   2> 	at org.apache.lucene.index.StandardDirectoryReader.doOpenFromWriter(StandardDirectoryReader.java:270)
[junit4:junit4]   2> 	at org.apache.lucene.index.StandardDirectoryReader.doOpenIfChanged(StandardDirectoryReader.java:245)
[junit4:junit4]   2> 	at org.apache.lucene.index.StandardDirectoryReader.doOpenIfChanged(StandardDirectoryReader.java:235)
[junit4:junit4]   2> 	at org.apache.lucene.index.DirectoryReader.openIfChanged(DirectoryReader.java:169)
[junit4:junit4]   2> 	at org.apache.lucene.search.NRTManager.refreshIfNeeded(NRTManager.java:352)
[junit4:junit4]   2> 	at org.apache.lucene.search.NRTManager.refreshIfNeeded(NRTManager.java:71)
[junit4:junit4]   2> 	at org.apache.lucene.search.ReferenceManager.doMaybeRefresh(ReferenceManager.java:155)
[junit4:junit4]   2> 	at org.apache.lucene.search.ReferenceManager.maybeRefresh(ReferenceManager.java:204)
[junit4:junit4]   2> 	at org.apache.lucene.search.TestLiveFieldValues$3.run(TestLiveFieldValues.java:133)
[junit4:junit4]   2> 
[junit4:junit4]   2> NOTE: reproduce with: ant test  -Dtestcase=TestLiveFieldValues -Dtests.method=test
-Dtests.seed=9EB188AB86F016A1 -Dtests.slow=true -Dtests.locale=de_CH -Dtests.timezone=America/Denver
-Dtests.file.encoding=UTF-8
[junit4:junit4] ERROR   0.03s J1 | TestLiveFieldValues.test <<<
[junit4:junit4]    > Throwable #1: com.carrotsearch.randomizedtesting.UncaughtExceptionError:
Captured an uncaught exception in thread: Thread[id=280, name=Thread-132, state=RUNNABLE,
group=TGRP-TestLiveFieldValues]
[junit4:junit4]    > Caused by: java.lang.RuntimeException: java.lang.NoSuchMethodError:
org.apache.lucene.util.ByteBlockPool.setBytesRef(Lorg/apache/lucene/util/BytesRef;I)Lorg/apache/lucene/util/BytesRef;
[junit4:junit4]    > 	at __randomizedtesting.SeedInfo.seed([9EB188AB86F016A1]:0)
[junit4:junit4]    > 	at org.apache.lucene.search.TestLiveFieldValues$3.run(TestLiveFieldValues.java:159)
[junit4:junit4]    > Caused by: java.lang.NoSuchMethodError: org.apache.lucene.util.ByteBlockPool.setBytesRef(Lorg/apache/lucene/util/BytesRef;I)Lorg/apache/lucene/util/BytesRef;
[junit4:junit4]    > 	at org.apache.lucene.index.FreqProxTermsWriterPerField.flush(FreqProxTermsWriterPerField.java:386)
[junit4:junit4]    > 	at org.apache.lucene.index.FreqProxTermsWriter.flush(FreqProxTermsWriter.java:85)
[junit4:junit4]    > 	at org.apache.lucene.index.TermsHash.flush(TermsHash.java:116)
[junit4:junit4]    > 	at org.apache.lucene.index.DocInverter.flush(DocInverter.java:53)
[junit4:junit4]    > 	at org.apache.lucene.index.DocFieldProcessor.flush(DocFieldProcessor.java:81)
[junit4:junit4]    > 	at org.apache.lucene.index.DocumentsWriterPerThread.flush(DocumentsWriterPerThread.java:494)
[junit4:junit4]    > 	at org.apache.lucene.index.DocumentsWriter.doFlush(DocumentsWriter.java:422)
[junit4:junit4]    > 	at org.apache.lucene.index.DocumentsWriter.preUpdate(DocumentsWriter.java:292)
[junit4:junit4]    > 	at org.apache.lucene.index.DocumentsWriter.updateDocument(DocumentsWriter.java:361)
[junit4:junit4]    > 	at org.apache.lucene.index.IndexWriter.updateDocument(IndexWriter.java:1471)
[junit4:junit4]    > 	at org.apache.lucene.index.IndexWriter.updateDocument(IndexWriter.java:1443)
[junit4:junit4]    > 	at org.apache.lucene.search.NRTManager$TrackingIndexWriter.updateDocument(NRTManager.java:163)
[junit4:junit4]    > 	at org.apache.lucene.search.TestLiveFieldValues$3.run(TestLiveFieldValues.java:117)
[junit4:junit4]    > Throwable #2: com.carrotsearch.randomizedtesting.UncaughtExceptionError:
Captured an uncaught exception in thread: Thread[id=279, name=Thread-131, state=RUNNABLE,
group=TGRP-TestLiveFieldValues]
[junit4:junit4]    > Caused by: java.lang.RuntimeException: java.lang.NoSuchMethodError:
org.apache.lucene.util.ByteBlockPool.setBytesRef(Lorg/apache/lucene/util/BytesRef;I)Lorg/apache/lucene/util/BytesRef;
[junit4:junit4]    > 	at __randomizedtesting.SeedInfo.seed([9EB188AB86F016A1]:0)
[junit4:junit4]    > 	at org.apache.lucene.search.TestLiveFieldValues$3.run(TestLiveFieldValues.java:159)
[junit4:junit4]    > Caused by: java.lang.NoSuchMethodError: org.apache.lucene.util.ByteBlockPool.setBytesRef(Lorg/apache/lucene/util/BytesRef;I)Lorg/apache/lucene/util/BytesRef;
[junit4:junit4]    > 	at org.apache.lucene.index.FreqProxTermsWriterPerField.flush(FreqProxTermsWriterPerField.java:386)
[junit4:junit4]    > 	at org.apache.lucene.index.FreqProxTermsWriter.flush(FreqProxTermsWriter.java:85)
[junit4:junit4]    > 	at org.apache.lucene.index.TermsHash.flush(TermsHash.java:116)
[junit4:junit4]    > 	at org.apache.lucene.index.DocInverter.flush(DocInverter.java:53)
[junit4:junit4]    > 	at org.apache.lucene.index.DocFieldProcessor.flush(DocFieldProcessor.java:81)
[junit4:junit4]    > 	at org.apache.lucene.index.DocumentsWriterPerThread.flush(DocumentsWriterPerThread.java:494)
[junit4:junit4]    > 	at org.apache.lucene.index.DocumentsWriter.doFlush(DocumentsWriter.java:422)
[junit4:junit4]    > 	at org.apache.lucene.index.DocumentsWriter.flushAllThreads(DocumentsWriter.java:559)
[junit4:junit4]    > 	at org.apache.lucene.index.IndexWriter.getReader(IndexWriter.java:355)
[junit4:junit4]    > 	at org.apache.lucene.index.StandardDirectoryReader.doOpenFromWriter(StandardDirectoryReader.java:270)
[junit4:junit4]    > 	at org.apache.lucene.index.StandardDirectoryReader.doOpenIfChanged(StandardDirectoryReader.java:245)
[junit4:junit4]    > 	at org.apache.lucene.index.StandardDirectoryReader.doOpenIfChanged(StandardDirectoryReader.java:235)
[junit4:junit4]    > 	at org.apache.lucene.index.DirectoryReader.openIfChanged(DirectoryReader.java:169)
[junit4:junit4]    > 	at org.apache.lucene.search.NRTManager.refreshIfNeeded(NRTManager.java:352)
[junit4:junit4]    > 	at org.apache.lucene.search.NRTManager.refreshIfNeeded(NRTManager.java:71)
[junit4:junit4]    > 	at org.apache.lucene.search.ReferenceManager.doMaybeRefresh(ReferenceManager.java:155)
[junit4:junit4]    > 	at org.apache.lucene.search.ReferenceManager.maybeRefresh(ReferenceManager.java:204)
[junit4:junit4]    > 	at org.apache.lucene.search.TestLiveFieldValues$3.run(TestLiveFieldValues.java:133)
[junit4:junit4]   2> NOTE: test params are: codec=Asserting, sim=DefaultSimilarity, locale=de_CH,
timezone=America/Denver
[junit4:junit4]   2> NOTE: Linux 3.2.0-24-generic amd64/Oracle Corporation 1.7.0_09 (64-bit)/cpus=8,threads=1,free=186535288,total=338558976
[junit4:junit4]   2> NOTE: All tests run in this JVM: [TestRAMDirectory, TestTopDocsMerge,
TestNoDeletionPolicy, TestIndexWriterOnJRECrash, TestBasics, TestPrefixQuery, TestCustomSearcherSort,
TestPrefixRandom, InBeforeClass, InAfterClass, InTestMethod, NonStringProperties, TestPhraseQuery,
TestFileSwitchDirectory, Nested1, TestSimpleAttributeImpl, TestCodecs, TestDemoDocValue, TestNGramPhraseQuery,
TestLockFactory, TestCompressingStoredFieldsFormat, TestCustomNorms, TestMultiPhraseQuery,
TestFieldMaskingSpanQuery, TestPackedInts, TestDocValuesIndexing, TestBufferedIndexInput,
TestLongPostings, TestBlockPostingsFormat2, Test2BPostings, TestBytesRef, TestToken, TestNumericUtils,
Nested1, TestBinaryTerms, TestIndexWriterMerging, TestBlockPostingsFormat, TestSimilarityBase,
TestLookaheadTokenFilter, TestSizeBoundedForceMerge, Test2BTerms, TestPayloadExplanations,
TestBooleanMinShouldMatch, TestSpans, TestTermsEnum, TestIndexWriterMergePolicy, TestTimeLimitingCollector,
Nested, Nested, ThrowInUncaught, TestBooleanScorer, TestPositionIncrement, Nested, TestParallelTermEnum,
TestElevationComparator, TestMatchAllDocsQuery, TestSimilarityProvider, TestDateSort, TestTopScoreDocCollector,
TestNoMergePolicy, TestPrefixFilter, TestIndexWriterLockRelease, TestCharFilter, TestPerFieldPostingsFormat2,
Test4GBStoredFields, TestCodecHoldsOpenFiles, TestLiveFieldValues]
[junit4:junit4] Completed on J1 in 0.03s, 1 test, 1 error <<< FAILURES!
[junit4:junit4] 
[junit4:junit4] Suite: org.apache.lucene.util.Test2BPagedBytes
[junit4:junit4] Completed on J3 in 0.00s, 0 tests
[junit4:junit4] 
[junit4:junit4] Suite: org.apache.lucene.util.TestRecyclingIntBlockAllocator
[junit4:junit4] Completed on J1 in 0.02s, 3 tests
[junit4:junit4] 
[junit4:junit4] Suite: org.apache.lucene.util.fst.TestBytesStore
[junit4:junit4] Completed on J3 in 0.00s, 1 test, 1 skipped
[junit4:junit4] 
[junit4:junit4] Suite: org.apache.lucene.util.TestMaxFailuresRule
[junit4:junit4] Completed on J2 in 0.44s, 1 test
[junit4:junit4] 
[junit4:junit4] Suite: org.apache.lucene.codecs.compressing.TestHighCompressionMode
[junit4:junit4] Completed on J0 in 2.21s, 5 tests
[junit4:junit4] 
[junit4:junit4] 
[junit4:junit4] Tests with failures (first 10 out of 585):
[junit4:junit4]   - org.apache.lucene.store.TestRAMDirectory.testIllegalEOF
[junit4:junit4]   - org.apache.lucene.store.TestRAMDirectory.testRAMDirectorySize
[junit4:junit4]   - org.apache.lucene.store.TestRAMDirectory.testRAMDirectory
[junit4:junit4]   - org.apache.lucene.store.TestRAMDirectory.testSeekToEOFThenBack
[junit4:junit4]   - org.apache.lucene.search.spans.TestSpanExplanations (suite)
[junit4:junit4]   - org.apache.lucene.search.TestTopDocsMerge.testSort
[junit4:junit4]   - org.apache.lucene.index.TestStressIndexing.testStressIndexAndSearching
[junit4:junit4]   - org.apache.lucene.index.TestNoDeletionPolicy.testAllCommitsRemain
[junit4:junit4]   - org.apache.lucene.search.TestFieldValueFilter.testFieldValueFilter
[junit4:junit4]   - org.apache.lucene.search.TestFieldValueFilter.testFieldValueFilterNoValue
[junit4:junit4] 
[junit4:junit4] 
[junit4:junit4] JVM J0:     0.71 ..    47.13 =    46.42s
[junit4:junit4] JVM J1:     0.72 ..    46.19 =    45.47s
[junit4:junit4] JVM J2:     0.72 ..    46.41 =    45.69s
[junit4:junit4] JVM J3:     0.71 ..    46.27 =    45.56s
[junit4:junit4] Execution time total: 47 seconds
[junit4:junit4] Tests summary: 330 suites, 1529 tests, 43 suite-level errors, 545 errors,
18 failures, 489 ignored (10 assumptions)

BUILD FAILED
<http://fortyounce.servebeer.com/job/the%204547%20machine%20gun/ws/build.xml>:50: The
following error occurred while executing this line:
<http://fortyounce.servebeer.com/job/the%204547%20machine%20gun/ws/common-build.xml>:1179:
The following error occurred while executing this line:
<http://fortyounce.servebeer.com/job/the%204547%20machine%20gun/ws/common-build.xml>:842:
There were test failures: 330 suites, 1529 tests, 43 suite-level errors, 545 errors, 18 failures,
489 ignored (10 assumptions)

Total time: 48 seconds
Build step 'Invoke Ant' marked build as failure

---------------------------------------------------------------------
To unsubscribe, e-mail: dev-unsubscribe@lucene.apache.org
For additional commands, e-mail: dev-help@lucene.apache.org


Mime
View raw message