lucene-dev mailing list archives

Site index · List index
Message view « Date » · « Thread »
Top « Date » · « Thread »
From Apache Jenkins Server <jenk...@builds.apache.org>
Subject [JENKINS] Lucene-Solr-Tests-4.x-Java6 - Build # 1209 - Failure
Date Tue, 08 Jan 2013 01:14:56 GMT
Build: https://builds.apache.org/job/Lucene-Solr-Tests-4.x-Java6/1209/

1 tests failed.
REGRESSION:  org.apache.solr.cloud.SyncSliceTest.testDistribSearch

Error Message:
shard1 should have just been set up to be inconsistent - but it's still consistent

Stack Trace:
java.lang.AssertionError: shard1 should have just been set up to be inconsistent - but it's still consistent
	at __randomizedtesting.SeedInfo.seed([B636BE65C4A8809F:37D0307DB3F7E0A3]:0)
	at org.junit.Assert.fail(Assert.java:93)
	at org.junit.Assert.assertTrue(Assert.java:43)
	at org.junit.Assert.assertNotNull(Assert.java:526)
	at org.apache.solr.cloud.SyncSliceTest.doTest(SyncSliceTest.java:214)
	at org.apache.solr.BaseDistributedSearchTestCase.testDistribSearch(BaseDistributedSearchTestCase.java:794)
	at sun.reflect.NativeMethodAccessorImpl.invoke0(Native Method)
	at sun.reflect.NativeMethodAccessorImpl.invoke(NativeMethodAccessorImpl.java:57)
	at sun.reflect.DelegatingMethodAccessorImpl.invoke(DelegatingMethodAccessorImpl.java:43)
	at java.lang.reflect.Method.invoke(Method.java:616)
	at com.carrotsearch.randomizedtesting.RandomizedRunner.invoke(RandomizedRunner.java:1559)
	at com.carrotsearch.randomizedtesting.RandomizedRunner.access$600(RandomizedRunner.java:79)
	at com.carrotsearch.randomizedtesting.RandomizedRunner$6.evaluate(RandomizedRunner.java:737)
	at com.carrotsearch.randomizedtesting.RandomizedRunner$7.evaluate(RandomizedRunner.java:773)
	at com.carrotsearch.randomizedtesting.RandomizedRunner$8.evaluate(RandomizedRunner.java:787)
	at com.carrotsearch.randomizedtesting.rules.SystemPropertiesRestoreRule$1.evaluate(SystemPropertiesRestoreRule.java:53)
	at org.apache.lucene.util.TestRuleSetupTeardownChained$1.evaluate(TestRuleSetupTeardownChained.java:50)
	at org.apache.lucene.util.TestRuleFieldCacheSanity$1.evaluate(TestRuleFieldCacheSanity.java:51)
	at org.apache.lucene.util.AbstractBeforeAfterRule$1.evaluate(AbstractBeforeAfterRule.java:46)
	at com.carrotsearch.randomizedtesting.rules.SystemPropertiesInvariantRule$1.evaluate(SystemPropertiesInvariantRule.java:55)
	at org.apache.lucene.util.TestRuleThreadAndTestName$1.evaluate(TestRuleThreadAndTestName.java:49)
	at org.apache.lucene.util.TestRuleIgnoreAfterMaxFailures$1.evaluate(TestRuleIgnoreAfterMaxFailures.java:70)
	at org.apache.lucene.util.TestRuleMarkFailure$1.evaluate(TestRuleMarkFailure.java:48)
	at com.carrotsearch.randomizedtesting.rules.StatementAdapter.evaluate(StatementAdapter.java:36)
	at com.carrotsearch.randomizedtesting.ThreadLeakControl$StatementRunner.run(ThreadLeakControl.java:358)
	at com.carrotsearch.randomizedtesting.ThreadLeakControl.forkTimeoutingTask(ThreadLeakControl.java:782)
	at com.carrotsearch.randomizedtesting.ThreadLeakControl$3.evaluate(ThreadLeakControl.java:442)
	at com.carrotsearch.randomizedtesting.RandomizedRunner.runSingleTest(RandomizedRunner.java:746)
	at com.carrotsearch.randomizedtesting.RandomizedRunner$3.evaluate(RandomizedRunner.java:648)
	at com.carrotsearch.randomizedtesting.RandomizedRunner$4.evaluate(RandomizedRunner.java:682)
	at com.carrotsearch.randomizedtesting.RandomizedRunner$5.evaluate(RandomizedRunner.java:693)
	at com.carrotsearch.randomizedtesting.rules.StatementAdapter.evaluate(StatementAdapter.java:36)
	at com.carrotsearch.randomizedtesting.rules.SystemPropertiesRestoreRule$1.evaluate(SystemPropertiesRestoreRule.java:53)
	at org.apache.lucene.util.AbstractBeforeAfterRule$1.evaluate(AbstractBeforeAfterRule.java:46)
	at org.apache.lucene.util.TestRuleStoreClassName$1.evaluate(TestRuleStoreClassName.java:42)
	at com.carrotsearch.randomizedtesting.rules.SystemPropertiesInvariantRule$1.evaluate(SystemPropertiesInvariantRule.java:55)
	at com.carrotsearch.randomizedtesting.rules.NoShadowingOrOverridesOnMethodsRule$1.evaluate(NoShadowingOrOverridesOnMethodsRule.java:39)
	at com.carrotsearch.randomizedtesting.rules.NoShadowingOrOverridesOnMethodsRule$1.evaluate(NoShadowingOrOverridesOnMethodsRule.java:39)
	at com.carrotsearch.randomizedtesting.rules.StatementAdapter.evaluate(StatementAdapter.java:36)
	at org.apache.lucene.util.TestRuleAssertionsRequired$1.evaluate(TestRuleAssertionsRequired.java:43)
	at org.apache.lucene.util.TestRuleMarkFailure$1.evaluate(TestRuleMarkFailure.java:48)
	at org.apache.lucene.util.TestRuleIgnoreAfterMaxFailures$1.evaluate(TestRuleIgnoreAfterMaxFailures.java:70)
	at org.apache.lucene.util.TestRuleIgnoreTestSuites$1.evaluate(TestRuleIgnoreTestSuites.java:55)
	at com.carrotsearch.randomizedtesting.rules.StatementAdapter.evaluate(StatementAdapter.java:36)
	at com.carrotsearch.randomizedtesting.ThreadLeakControl$StatementRunner.run(ThreadLeakControl.java:358)
	at java.lang.Thread.run(Thread.java:679)




Build Log:
[...truncated 8670 lines...]
[junit4:junit4] Suite: org.apache.solr.cloud.SyncSliceTest
[junit4:junit4]   2> 0 T2832 oas.BaseDistributedSearchTestCase.initHostContext Setting hostContext system property: /_i/
[junit4:junit4]   2> 4 T2832 oas.SolrTestCaseJ4.setUp ###Starting testDistribSearch
[junit4:junit4]   2> Creating dataDir: /usr/home/hudson/hudson-slave/workspace/Lucene-Solr-Tests-4.x-Java6/solr/build/solr-core/test/J0/./solrtest-SyncSliceTest-1357607540511
[junit4:junit4]   2> 5 T2832 oasc.ZkTestServer.run STARTING ZK TEST SERVER
[junit4:junit4]   2> 6 T2833 oasc.ZkTestServer$ZKServerMain.runFromConfig Starting server
[junit4:junit4]   2> 8 T2833 oazs.ZooKeeperServer.setTickTime tickTime set to 1000
[junit4:junit4]   2> 8 T2833 oazs.ZooKeeperServer.setMinSessionTimeout minSessionTimeout set to -1
[junit4:junit4]   2> 8 T2833 oazs.ZooKeeperServer.setMaxSessionTimeout maxSessionTimeout set to -1
[junit4:junit4]   2> 8 T2833 oazs.NIOServerCnxnFactory.configure binding to port 0.0.0.0/0.0.0.0:0
[junit4:junit4]   2> 9 T2833 oazsp.FileTxnSnapLog.save Snapshotting: 0x0 to /usr/home/hudson/hudson-slave/workspace/Lucene-Solr-Tests-4.x-Java6/solr/build/solr-core/test/J0/./org.apache.solr.cloud.SyncSliceTest-1357607540510/zookeeper/server1/data/version-2/snapshot.0
[junit4:junit4]   2> 107 T2832 oasc.ZkTestServer.run start zk server on port:10161
[junit4:junit4]   2> 107 T2832 oaz.ZooKeeper.<init> Initiating client connection, connectString=127.0.0.1:10161 sessionTimeout=10000 watcher=org.apache.solr.common.cloud.ConnectionManager@72dac7ee
[junit4:junit4]   2> 108 T2832 oascc.ConnectionManager.waitForConnected Waiting for client to connect to ZooKeeper
[junit4:junit4]   2> 108 T2838 oaz.ClientCnxn$SendThread.logStartConnect Opening socket connection to server localhost/127.0.0.1:10161. Will not attempt to authenticate using SASL (access denied (javax.security.auth.AuthPermission getLoginConfiguration))
[junit4:junit4]   2> 108 T2838 oaz.ClientCnxn$SendThread.primeConnection Socket connection established to localhost/127.0.0.1:10161, initiating session
[junit4:junit4]   2> 109 T2834 oazs.NIOServerCnxnFactory.run Accepted socket connection from /140.211.11.196:12834
[junit4:junit4]   2> 109 T2834 oazs.ZooKeeperServer.processConnectRequest Client attempting to establish new session at /140.211.11.196:12834
[junit4:junit4]   2> 110 T2836 oazsp.FileTxnLog.append Creating new log file: log.1
[junit4:junit4]   2> 111 T2836 oazs.ZooKeeperServer.finishSessionInit Established session 0x13c17b717240000 with negotiated timeout 10000 for client /140.211.11.196:12834
[junit4:junit4]   2> 111 T2838 oaz.ClientCnxn$SendThread.onConnected Session establishment complete on server localhost/127.0.0.1:10161, sessionid = 0x13c17b717240000, negotiated timeout = 10000
[junit4:junit4]   2> 112 T2839 oascc.ConnectionManager.process Watcher org.apache.solr.common.cloud.ConnectionManager@72dac7ee name:ZooKeeperConnection Watcher:127.0.0.1:10161 got event WatchedEvent state:SyncConnected type:None path:null path:null type:None
[junit4:junit4]   2> 112 T2832 oascc.ConnectionManager.waitForConnected Client is connected to ZooKeeper
[junit4:junit4]   2> 112 T2832 oascc.SolrZkClient.makePath makePath: /solr
[junit4:junit4]   2> 115 T2837 oazs.PrepRequestProcessor.pRequest2Txn Processed session termination for sessionid: 0x13c17b717240000
[junit4:junit4]   2> 125 T2839 oaz.ClientCnxn$EventThread.run EventThread shut down
[junit4:junit4]   2> 125 T2832 oaz.ZooKeeper.close Session: 0x13c17b717240000 closed
[junit4:junit4]   2> 125 T2834 oazs.NIOServerCnxn.closeSock Closed socket connection for client /140.211.11.196:12834 which had sessionid 0x13c17b717240000
[junit4:junit4]   2> 125 T2832 oaz.ZooKeeper.<init> Initiating client connection, connectString=127.0.0.1:10161/solr sessionTimeout=10000 watcher=org.apache.solr.common.cloud.ConnectionManager@68e47bd4
[junit4:junit4]   2> 126 T2832 oascc.ConnectionManager.waitForConnected Waiting for client to connect to ZooKeeper
[junit4:junit4]   2> 126 T2840 oaz.ClientCnxn$SendThread.logStartConnect Opening socket connection to server localhost/127.0.0.1:10161. Will not attempt to authenticate using SASL (access denied (javax.security.auth.AuthPermission getLoginConfiguration))
[junit4:junit4]   2> 127 T2840 oaz.ClientCnxn$SendThread.primeConnection Socket connection established to localhost/127.0.0.1:10161, initiating session
[junit4:junit4]   2> 127 T2834 oazs.NIOServerCnxnFactory.run Accepted socket connection from /140.211.11.196:34275
[junit4:junit4]   2> 127 T2834 oazs.ZooKeeperServer.processConnectRequest Client attempting to establish new session at /140.211.11.196:34275
[junit4:junit4]   2> 128 T2836 oazs.ZooKeeperServer.finishSessionInit Established session 0x13c17b717240001 with negotiated timeout 10000 for client /140.211.11.196:34275
[junit4:junit4]   2> 128 T2840 oaz.ClientCnxn$SendThread.onConnected Session establishment complete on server localhost/127.0.0.1:10161, sessionid = 0x13c17b717240001, negotiated timeout = 10000
[junit4:junit4]   2> 128 T2841 oascc.ConnectionManager.process Watcher org.apache.solr.common.cloud.ConnectionManager@68e47bd4 name:ZooKeeperConnection Watcher:127.0.0.1:10161/solr got event WatchedEvent state:SyncConnected type:None path:null path:null type:None
[junit4:junit4]   2> 128 T2832 oascc.ConnectionManager.waitForConnected Client is connected to ZooKeeper
[junit4:junit4]   2> 129 T2832 oascc.SolrZkClient.makePath makePath: /collections/collection1
[junit4:junit4]   2> 138 T2832 oascc.SolrZkClient.makePath makePath: /collections/collection1/shards
[junit4:junit4]   2> 139 T2832 oascc.SolrZkClient.makePath makePath: /collections/control_collection
[junit4:junit4]   2> 146 T2832 oascc.SolrZkClient.makePath makePath: /collections/control_collection/shards
[junit4:junit4]   2> 148 T2832 oasc.AbstractZkTestCase.putConfig put /usr/home/hudson/hudson-slave/workspace/Lucene-Solr-Tests-4.x-Java6/solr/build/solr-core/test-files/solr/collection1/conf/solrconfig.xml to /configs/conf1/solrconfig.xml
[junit4:junit4]   2> 148 T2832 oascc.SolrZkClient.makePath makePath: /configs/conf1/solrconfig.xml
[junit4:junit4]   2> 160 T2832 oasc.AbstractZkTestCase.putConfig put /usr/home/hudson/hudson-slave/workspace/Lucene-Solr-Tests-4.x-Java6/solr/build/solr-core/test-files/solr/collection1/conf/schema.xml to /configs/conf1/schema.xml
[junit4:junit4]   2> 161 T2832 oascc.SolrZkClient.makePath makePath: /configs/conf1/schema.xml
[junit4:junit4]   2> 264 T2832 oasc.AbstractZkTestCase.putConfig put /usr/home/hudson/hudson-slave/workspace/Lucene-Solr-Tests-4.x-Java6/solr/build/solr-core/test-files/solr/collection1/conf/stopwords.txt to /configs/conf1/stopwords.txt
[junit4:junit4]   2> 264 T2832 oascc.SolrZkClient.makePath makePath: /configs/conf1/stopwords.txt
[junit4:junit4]   2> 266 T2832 oasc.AbstractZkTestCase.putConfig put /usr/home/hudson/hudson-slave/workspace/Lucene-Solr-Tests-4.x-Java6/solr/build/solr-core/test-files/solr/collection1/conf/protwords.txt to /configs/conf1/protwords.txt
[junit4:junit4]   2> 267 T2832 oascc.SolrZkClient.makePath makePath: /configs/conf1/protwords.txt
[junit4:junit4]   2> 277 T2832 oasc.AbstractZkTestCase.putConfig put /usr/home/hudson/hudson-slave/workspace/Lucene-Solr-Tests-4.x-Java6/solr/build/solr-core/test-files/solr/collection1/conf/currency.xml to /configs/conf1/currency.xml
[junit4:junit4]   2> 278 T2832 oascc.SolrZkClient.makePath makePath: /configs/conf1/currency.xml
[junit4:junit4]   2> 280 T2832 oasc.AbstractZkTestCase.putConfig put /usr/home/hudson/hudson-slave/workspace/Lucene-Solr-Tests-4.x-Java6/solr/build/solr-core/test-files/solr/collection1/conf/open-exchange-rates.json to /configs/conf1/open-exchange-rates.json
[junit4:junit4]   2> 281 T2832 oascc.SolrZkClient.makePath makePath: /configs/conf1/open-exchange-rates.json
[junit4:junit4]   2> 283 T2832 oasc.AbstractZkTestCase.putConfig put /usr/home/hudson/hudson-slave/workspace/Lucene-Solr-Tests-4.x-Java6/solr/build/solr-core/test-files/solr/collection1/conf/mapping-ISOLatin1Accent.txt to /configs/conf1/mapping-ISOLatin1Accent.txt
[junit4:junit4]   2> 283 T2832 oascc.SolrZkClient.makePath makePath: /configs/conf1/mapping-ISOLatin1Accent.txt
[junit4:junit4]   2> 285 T2832 oasc.AbstractZkTestCase.putConfig put /usr/home/hudson/hudson-slave/workspace/Lucene-Solr-Tests-4.x-Java6/solr/build/solr-core/test-files/solr/collection1/conf/old_synonyms.txt to /configs/conf1/old_synonyms.txt
[junit4:junit4]   2> 286 T2832 oascc.SolrZkClient.makePath makePath: /configs/conf1/old_synonyms.txt
[junit4:junit4]   2> 289 T2832 oasc.AbstractZkTestCase.putConfig put /usr/home/hudson/hudson-slave/workspace/Lucene-Solr-Tests-4.x-Java6/solr/build/solr-core/test-files/solr/collection1/conf/synonyms.txt to /configs/conf1/synonyms.txt
[junit4:junit4]   2> 289 T2832 oascc.SolrZkClient.makePath makePath: /configs/conf1/synonyms.txt
[junit4:junit4]   2> 291 T2837 oazs.PrepRequestProcessor.pRequest2Txn Processed session termination for sessionid: 0x13c17b717240001
[junit4:junit4]   2> 299 T2841 oaz.ClientCnxn$EventThread.run EventThread shut down
[junit4:junit4]   2> 299 T2832 oaz.ZooKeeper.close Session: 0x13c17b717240001 closed
[junit4:junit4]   2> 299 T2834 oazs.NIOServerCnxn.closeSock Closed socket connection for client /140.211.11.196:34275 which had sessionid 0x13c17b717240001
[junit4:junit4]   2> 406 T2832 oejs.Server.doStart jetty-8.1.8.v20121106
[junit4:junit4]   2> 413 T2832 oejs.AbstractConnector.doStart Started SocketConnector@127.0.0.1:47675
[junit4:junit4]   2> 414 T2832 oass.SolrDispatchFilter.init SolrDispatchFilter.init()
[junit4:junit4]   2> 414 T2832 oasc.SolrResourceLoader.locateSolrHome JNDI not configured for solr (NoInitialContextEx)
[junit4:junit4]   2> 415 T2832 oasc.SolrResourceLoader.locateSolrHome using system property solr.solr.home: /usr/home/hudson/hudson-slave/workspace/Lucene-Solr-Tests-4.x-Java6/solr/build/solr-core/test/J0/./org.apache.solr.cloud.SyncSliceTest-controljetty-1357607540805
[junit4:junit4]   2> 415 T2832 oasc.CoreContainer$Initializer.initialize looking for solr.xml: /usr/home/hudson/hudson-slave/workspace/Lucene-Solr-Tests-4.x-Java6/solr/build/solr-core/test/J0/./org.apache.solr.cloud.SyncSliceTest-controljetty-1357607540805/solr.xml
[junit4:junit4]   2> 415 T2832 oasc.CoreContainer.<init> New CoreContainer 898445765
[junit4:junit4]   2> 416 T2832 oasc.CoreContainer.load Loading CoreContainer using Solr Home: '/usr/home/hudson/hudson-slave/workspace/Lucene-Solr-Tests-4.x-Java6/solr/build/solr-core/test/J0/./org.apache.solr.cloud.SyncSliceTest-controljetty-1357607540805/'
[junit4:junit4]   2> 416 T2832 oasc.SolrResourceLoader.<init> new SolrResourceLoader for directory: '/usr/home/hudson/hudson-slave/workspace/Lucene-Solr-Tests-4.x-Java6/solr/build/solr-core/test/J0/./org.apache.solr.cloud.SyncSliceTest-controljetty-1357607540805/'
[junit4:junit4]   2> 450 T2832 oashc.HttpShardHandlerFactory.getParameter Setting socketTimeout to: 60000
[junit4:junit4]   2> 451 T2832 oashc.HttpShardHandlerFactory.getParameter Setting urlScheme to: http://
[junit4:junit4]   2> 451 T2832 oashc.HttpShardHandlerFactory.getParameter Setting connTimeout to: 15000
[junit4:junit4]   2> 451 T2832 oashc.HttpShardHandlerFactory.getParameter Setting maxConnectionsPerHost to: 20
[junit4:junit4]   2> 451 T2832 oashc.HttpShardHandlerFactory.getParameter Setting corePoolSize to: 0
[junit4:junit4]   2> 452 T2832 oashc.HttpShardHandlerFactory.getParameter Setting maximumPoolSize to: 2147483647
[junit4:junit4]   2> 452 T2832 oashc.HttpShardHandlerFactory.getParameter Setting maxThreadIdleTime to: 5
[junit4:junit4]   2> 452 T2832 oashc.HttpShardHandlerFactory.getParameter Setting sizeOfQueue to: -1
[junit4:junit4]   2> 453 T2832 oashc.HttpShardHandlerFactory.getParameter Setting fairnessPolicy to: false
[junit4:junit4]   2> 453 T2832 oascsi.HttpClientUtil.createClient Creating new http client, config:maxConnectionsPerHost=20&maxConnections=10000&socketTimeout=60000&connTimeout=15000&retry=false
[junit4:junit4]   2> 466 T2832 oasc.CoreContainer.load Registering Log Listener
[junit4:junit4]   2> 479 T2832 oasc.CoreContainer.initZooKeeper Zookeeper client=127.0.0.1:10161/solr
[junit4:junit4]   2> 479 T2832 oasc.ZkController.checkChrootPath zkHost includes chroot
[junit4:junit4]   2> 480 T2832 oaz.ZooKeeper.<init> Initiating client connection, connectString=127.0.0.1:10161 sessionTimeout=60000 watcher=org.apache.solr.common.cloud.ConnectionManager@1c5fdc11
[junit4:junit4]   2> 480 T2832 oascc.ConnectionManager.waitForConnected Waiting for client to connect to ZooKeeper
[junit4:junit4]   2> 481 T2851 oaz.ClientCnxn$SendThread.logStartConnect Opening socket connection to server localhost/127.0.0.1:10161. Will not attempt to authenticate using SASL (access denied (javax.security.auth.AuthPermission getLoginConfiguration))
[junit4:junit4]   2> 481 T2851 oaz.ClientCnxn$SendThread.primeConnection Socket connection established to localhost/127.0.0.1:10161, initiating session
[junit4:junit4]   2> 481 T2834 oazs.NIOServerCnxnFactory.run Accepted socket connection from /140.211.11.196:43498
[junit4:junit4]   2> 482 T2834 oazs.ZooKeeperServer.processConnectRequest Client attempting to establish new session at /140.211.11.196:43498
[junit4:junit4]   2> 483 T2836 oazs.ZooKeeperServer.finishSessionInit Established session 0x13c17b717240002 with negotiated timeout 20000 for client /140.211.11.196:43498
[junit4:junit4]   2> 483 T2851 oaz.ClientCnxn$SendThread.onConnected Session establishment complete on server localhost/127.0.0.1:10161, sessionid = 0x13c17b717240002, negotiated timeout = 20000
[junit4:junit4]   2> 483 T2852 oascc.ConnectionManager.process Watcher org.apache.solr.common.cloud.ConnectionManager@1c5fdc11 name:ZooKeeperConnection Watcher:127.0.0.1:10161 got event WatchedEvent state:SyncConnected type:None path:null path:null type:None
[junit4:junit4]   2> 484 T2832 oascc.ConnectionManager.waitForConnected Client is connected to ZooKeeper
[junit4:junit4]   2> 484 T2837 oazs.PrepRequestProcessor.pRequest2Txn Processed session termination for sessionid: 0x13c17b717240002
[junit4:junit4]   2> 485 T2852 oaz.ClientCnxn$EventThread.run EventThread shut down
[junit4:junit4]   2> 486 T2834 oazs.NIOServerCnxn.closeSock Closed socket connection for client /140.211.11.196:43498 which had sessionid 0x13c17b717240002
[junit4:junit4]   2> 485 T2832 oaz.ZooKeeper.close Session: 0x13c17b717240002 closed
[junit4:junit4]   2> 486 T2832 oascsi.HttpClientUtil.createClient Creating new http client, config:maxConnections=500&maxConnectionsPerHost=16&socketTimeout=60000&connTimeout=15000
[junit4:junit4]   2> 494 T2832 oaz.ZooKeeper.<init> Initiating client connection, connectString=127.0.0.1:10161/solr sessionTimeout=30000 watcher=org.apache.solr.common.cloud.ConnectionManager@2a511f70
[junit4:junit4]   2> 495 T2832 oascc.ConnectionManager.waitForConnected Waiting for client to connect to ZooKeeper
[junit4:junit4]   2> 496 T2853 oaz.ClientCnxn$SendThread.logStartConnect Opening socket connection to server localhost/127.0.0.1:10161. Will not attempt to authenticate using SASL (access denied (javax.security.auth.AuthPermission getLoginConfiguration))
[junit4:junit4]   2> 496 T2853 oaz.ClientCnxn$SendThread.primeConnection Socket connection established to localhost/127.0.0.1:10161, initiating session
[junit4:junit4]   2> 496 T2834 oazs.NIOServerCnxnFactory.run Accepted socket connection from /140.211.11.196:28653
[junit4:junit4]   2> 497 T2834 oazs.ZooKeeperServer.processConnectRequest Client attempting to establish new session at /140.211.11.196:28653
[junit4:junit4]   2> 498 T2836 oazs.ZooKeeperServer.finishSessionInit Established session 0x13c17b717240003 with negotiated timeout 20000 for client /140.211.11.196:28653
[junit4:junit4]   2> 498 T2853 oaz.ClientCnxn$SendThread.onConnected Session establishment complete on server localhost/127.0.0.1:10161, sessionid = 0x13c17b717240003, negotiated timeout = 20000
[junit4:junit4]   2> 498 T2854 oascc.ConnectionManager.process Watcher org.apache.solr.common.cloud.ConnectionManager@2a511f70 name:ZooKeeperConnection Watcher:127.0.0.1:10161/solr got event WatchedEvent state:SyncConnected type:None path:null path:null type:None
[junit4:junit4]   2> 498 T2832 oascc.ConnectionManager.waitForConnected Client is connected to ZooKeeper
[junit4:junit4]   2> 500 T2837 oazs.PrepRequestProcessor.pRequest Got user-level KeeperException when processing sessionid:0x13c17b717240003 type:create cxid:0x2 zxid:0x1a txntype:-1 reqpath:n/a Error Path:/solr/overseer Error:KeeperErrorCode = NodeExists for /solr/overseer
[junit4:junit4]   2> 509 T2832 oascc.SolrZkClient.makePath makePath: /live_nodes
[junit4:junit4]   2> 516 T2832 oasc.ZkController.createEphemeralLiveNode Register node as live in ZooKeeper:/live_nodes/127.0.0.1:47675__i
[junit4:junit4]   2> 517 T2837 oazs.PrepRequestProcessor.pRequest Got user-level KeeperException when processing sessionid:0x13c17b717240003 type:delete cxid:0x7 zxid:0x1c txntype:-1 reqpath:n/a Error Path:/solr/live_nodes/127.0.0.1:47675__i Error:KeeperErrorCode = NoNode for /solr/live_nodes/127.0.0.1:47675__i
[junit4:junit4]   2> 524 T2832 oascc.SolrZkClient.makePath makePath: /live_nodes/127.0.0.1:47675__i
[junit4:junit4]   2> 527 T2832 oascc.SolrZkClient.makePath makePath: /overseer_elect/election
[junit4:junit4]   2> 537 T2837 oazs.PrepRequestProcessor.pRequest Got user-level KeeperException when processing sessionid:0x13c17b717240003 type:delete cxid:0x15 zxid:0x21 txntype:-1 reqpath:n/a Error Path:/solr/overseer_elect/leader Error:KeeperErrorCode = NoNode for /solr/overseer_elect/leader
[junit4:junit4]   2> 543 T2832 oascc.SolrZkClient.makePath makePath: /overseer_elect/leader
[junit4:junit4]   2> 546 T2832 oasc.Overseer.start Overseer (id=88972167775256579-127.0.0.1:47675__i-n_0000000000) starting
[junit4:junit4]   2> 546 T2837 oazs.PrepRequestProcessor.pRequest Got user-level KeeperException when processing sessionid:0x13c17b717240003 type:create cxid:0x1a zxid:0x23 txntype:-1 reqpath:n/a Error Path:/solr/overseer Error:KeeperErrorCode = NodeExists for /solr/overseer
[junit4:junit4]   2> 548 T2837 oazs.PrepRequestProcessor.pRequest Got user-level KeeperException when processing sessionid:0x13c17b717240003 type:create cxid:0x1b zxid:0x24 txntype:-1 reqpath:n/a Error Path:/solr/overseer Error:KeeperErrorCode = NodeExists for /solr/overseer
[junit4:junit4]   2> 556 T2837 oazs.PrepRequestProcessor.pRequest Got user-level KeeperException when processing sessionid:0x13c17b717240003 type:create cxid:0x1c zxid:0x25 txntype:-1 reqpath:n/a Error Path:/solr/overseer Error:KeeperErrorCode = NodeExists for /solr/overseer
[junit4:junit4]   2> 558 T2837 oazs.PrepRequestProcessor.pRequest Got user-level KeeperException when processing sessionid:0x13c17b717240003 type:create cxid:0x1d zxid:0x26 txntype:-1 reqpath:n/a Error Path:/solr/overseer Error:KeeperErrorCode = NodeExists for /solr/overseer
[junit4:junit4]   2> 564 T2856 oasc.OverseerCollectionProcessor.run Process current queue of collection messages
[junit4:junit4]   2> 565 T2832 oascc.SolrZkClient.makePath makePath: /clusterstate.json
[junit4:junit4]   2> 568 T2832 oascc.ZkStateReader.createClusterStateWatchersAndUpdate Updating cluster state from ZooKeeper... 
[junit4:junit4]   2> 570 T2855 oasc.Overseer$ClusterStateUpdater.run Starting to work on the main queue
[junit4:junit4]   2> 578 T2857 oasc.CoreContainer.create Creating SolrCore 'collection1' using instanceDir: /usr/home/hudson/hudson-slave/workspace/Lucene-Solr-Tests-4.x-Java6/solr/build/solr-core/test/J0/./org.apache.solr.cloud.SyncSliceTest-controljetty-1357607540805/collection1
[junit4:junit4]   2> 578 T2857 oasc.ZkController.createCollectionZkNode Check for collection zkNode:control_collection
[junit4:junit4]   2> 578 T2857 oasc.ZkController.createCollectionZkNode Collection zkNode exists
[junit4:junit4]   2> 578 T2857 oasc.ZkController.readConfigName Load collection config from:/collections/control_collection
[junit4:junit4]   2> 580 T2857 oasc.SolrResourceLoader.<init> new SolrResourceLoader for directory: '/usr/home/hudson/hudson-slave/workspace/Lucene-Solr-Tests-4.x-Java6/solr/build/solr-core/test/J0/./org.apache.solr.cloud.SyncSliceTest-controljetty-1357607540805/collection1/'
[junit4:junit4]   2> 581 T2857 oasc.SolrResourceLoader.replaceClassLoader Adding 'file:/usr/home/hudson/hudson-slave/workspace/Lucene-Solr-Tests-4.x-Java6/solr/build/solr-core/test/J0/org.apache.solr.cloud.SyncSliceTest-controljetty-1357607540805/collection1/lib/classes/' to classloader
[junit4:junit4]   2> 582 T2857 oasc.SolrResourceLoader.replaceClassLoader Adding 'file:/usr/home/hudson/hudson-slave/workspace/Lucene-Solr-Tests-4.x-Java6/solr/build/solr-core/test/J0/org.apache.solr.cloud.SyncSliceTest-controljetty-1357607540805/collection1/lib/README' to classloader
[junit4:junit4]   2> 638 T2857 oasc.SolrConfig.<init> Using Lucene MatchVersion: LUCENE_41
[junit4:junit4]   2> 711 T2857 oasc.SolrConfig.<init> Loaded SolrConfig: solrconfig.xml
[junit4:junit4]   2> 812 T2857 oass.IndexSchema.readSchema Reading Solr Schema
[junit4:junit4]   2> 818 T2857 oass.IndexSchema.readSchema Schema name=test
[junit4:junit4]   2> 1326 T2857 oass.OpenExchangeRatesOrgProvider.init Initialized with rates=open-exchange-rates.json, refreshInterval=1440.
[junit4:junit4]   2> 1333 T2857 oass.IndexSchema.readSchema default search field in schema is text
[junit4:junit4]   2> 1337 T2857 oass.IndexSchema.readSchema unique key field: id
[junit4:junit4]   2> 1346 T2857 oass.FileExchangeRateProvider.reload Reloading exchange rates from file currency.xml
[junit4:junit4]   2> 1349 T2857 oass.FileExchangeRateProvider.reload Reloading exchange rates from file currency.xml
[junit4:junit4]   2> 1352 T2857 oass.OpenExchangeRatesOrgProvider.reload Reloading exchange rates from open-exchange-rates.json
[junit4:junit4]   2> 1353 T2857 oass.OpenExchangeRatesOrgProvider.reload Reloading exchange rates from open-exchange-rates.json
[junit4:junit4]   2> 1354 T2857 oasc.SolrCore.<init> [collection1] Opening new SolrCore at /usr/home/hudson/hudson-slave/workspace/Lucene-Solr-Tests-4.x-Java6/solr/build/solr-core/test/J0/./org.apache.solr.cloud.SyncSliceTest-controljetty-1357607540805/collection1/, dataDir=./org.apache.solr.cloud.SyncSliceTest-1357607540510/control/data/
[junit4:junit4]   2> 1354 T2857 oasc.JmxMonitoredMap.<init> JMX monitoring is enabled. Adding Solr mbeans to JMX Server: com.sun.jmx.mbeanserver.JmxMBeanServer@4f4b2f1a
[junit4:junit4]   2> 1355 T2857 oasc.SolrCore.initDirectoryFactory solr.NRTCachingDirectoryFactory
[junit4:junit4]   2> 1355 T2857 oasc.CachingDirectoryFactory.get return new directory for /usr/home/hudson/hudson-slave/workspace/Lucene-Solr-Tests-4.x-Java6/solr/build/solr-core/test/J0/./org.apache.solr.cloud.SyncSliceTest-1357607540510/control/data forceNew:false
[junit4:junit4]   2> 1356 T2857 oasc.CachingDirectoryFactory.close Releasing directory:/usr/home/hudson/hudson-slave/workspace/Lucene-Solr-Tests-4.x-Java6/solr/build/solr-core/test/J0/./org.apache.solr.cloud.SyncSliceTest-1357607540510/control/data
[junit4:junit4]   2> 1356 T2857 oasc.SolrCore.getNewIndexDir New index directory detected: old=null new=./org.apache.solr.cloud.SyncSliceTest-1357607540510/control/data/index/
[junit4:junit4]   2> 1356 T2857 oasc.SolrCore.initIndex WARNING [collection1] Solr index directory './org.apache.solr.cloud.SyncSliceTest-1357607540510/control/data/index' doesn't exist. Creating new index...
[junit4:junit4]   2> 1357 T2857 oasc.CachingDirectoryFactory.get return new directory for /usr/home/hudson/hudson-slave/workspace/Lucene-Solr-Tests-4.x-Java6/solr/build/solr-core/test/J0/./org.apache.solr.cloud.SyncSliceTest-1357607540510/control/data/index forceNew:false
[junit4:junit4]   2> 1361 T2857 oasc.SolrDeletionPolicy.onCommit SolrDeletionPolicy.onCommit: commits:num=1
[junit4:junit4]   2> 		commit{dir=RateLimitedDirectoryWrapper(NRTCachingDirectory(org.apache.lucene.store.NIOFSDirectory@/usr/home/hudson/hudson-slave/workspace/Lucene-Solr-Tests-4.x-Java6/solr/build/solr-core/test/J0/org.apache.solr.cloud.SyncSliceTest-1357607540510/control/data/index lockFactory=org.apache.lucene.store.NativeFSLockFactory@50d87255; maxCacheMB=48.0 maxMergeSizeMB=4.0)),segFN=segments_1,generation=1,filenames=[segments_1]
[junit4:junit4]   2> 1362 T2857 oasc.SolrDeletionPolicy.updateCommits newest commit = 1[segments_1]
[junit4:junit4]   2> 1362 T2857 oasc.CachingDirectoryFactory.close Releasing directory:/usr/home/hudson/hudson-slave/workspace/Lucene-Solr-Tests-4.x-Java6/solr/build/solr-core/test/J0/./org.apache.solr.cloud.SyncSliceTest-1357607540510/control/data/index
[junit4:junit4]   2> 1363 T2857 oasc.SolrCore.initWriters created xml: solr.XMLResponseWriter
[junit4:junit4]   2> 1364 T2857 oasup.UpdateRequestProcessorChain.init inserting DistributedUpdateProcessorFactory into updateRequestProcessorChain "dedupe"
[junit4:junit4]   2> 1364 T2857 oasup.UpdateRequestProcessorChain.init inserting DistributedUpdateProcessorFactory into updateRequestProcessorChain "dedupe-allfields"
[junit4:junit4]   2> 1364 T2857 oasup.UpdateRequestProcessorChain.init inserting DistributedUpdateProcessorFactory into updateRequestProcessorChain "stored_sig"
[junit4:junit4]   2> 1364 T2857 oasup.UpdateRequestProcessorChain.init inserting DistributedUpdateProcessorFactory into updateRequestProcessorChain "uniq-fields"
[junit4:junit4]   2> 1365 T2857 oasup.UpdateRequestProcessorChain.init inserting DistributedUpdateProcessorFactory into updateRequestProcessorChain "distrib-dup-test-chain-implicit"
[junit4:junit4]   2> 1365 T2857 oasc.RequestHandlers.initHandlersFromConfig adding lazy requestHandler: solr.ReplicationHandler
[junit4:junit4]   2> 1365 T2857 oasc.RequestHandlers.initHandlersFromConfig created /replication: solr.ReplicationHandler
[junit4:junit4]   2> 1365 T2857 oasc.RequestHandlers.initHandlersFromConfig created standard: solr.StandardRequestHandler
[junit4:junit4]   2> 1366 T2857 oasc.RequestHandlers.initHandlersFromConfig created /get: solr.RealTimeGetHandler
[junit4:junit4]   2> 1366 T2857 oasc.RequestHandlers.initHandlersFromConfig created dismax: solr.SearchHandler
[junit4:junit4]   2> 1366 T2857 oasc.RequestHandlers.initHandlersFromConfig created mock: org.apache.solr.core.MockQuerySenderListenerReqHandler
[junit4:junit4]   2> 1367 T2857 oasc.RequestHandlers.initHandlersFromConfig created /admin/: org.apache.solr.handler.admin.AdminHandlers
[junit4:junit4]   2> 1367 T2857 oasc.RequestHandlers.initHandlersFromConfig created defaults: solr.StandardRequestHandler
[junit4:junit4]   2> 1367 T2857 oasc.RequestHandlers.initHandlersFromConfig adding lazy requestHandler: solr.StandardRequestHandler
[junit4:junit4]   2> 1367 T2857 oasc.RequestHandlers.initHandlersFromConfig created lazy: solr.StandardRequestHandler
[junit4:junit4]   2> 1367 T2857 oasc.RequestHandlers.initHandlersFromConfig created /update: solr.UpdateRequestHandler
[junit4:junit4]   2> 1368 T2857 oasc.RequestHandlers.initHandlersFromConfig created /terms: org.apache.solr.handler.component.SearchHandler
[junit4:junit4]   2> 1368 T2857 oasc.RequestHandlers.initHandlersFromConfig created spellCheckCompRH: org.apache.solr.handler.component.SearchHandler
[junit4:junit4]   2> 1368 T2857 oasc.RequestHandlers.initHandlersFromConfig created spellCheckCompRH_Direct: org.apache.solr.handler.component.SearchHandler
[junit4:junit4]   2> 1369 T2857 oasc.RequestHandlers.initHandlersFromConfig created spellCheckWithWordbreak: org.apache.solr.handler.component.SearchHandler
[junit4:junit4]   2> 1369 T2857 oasc.RequestHandlers.initHandlersFromConfig created spellCheckWithWordbreak_Direct: org.apache.solr.handler.component.SearchHandler
[junit4:junit4]   2> 1369 T2857 oasc.RequestHandlers.initHandlersFromConfig created spellCheckCompRH1: org.apache.solr.handler.component.SearchHandler
[junit4:junit4]   2> 1369 T2857 oasc.RequestHandlers.initHandlersFromConfig created mltrh: org.apache.solr.handler.component.SearchHandler
[junit4:junit4]   2> 1370 T2857 oasc.RequestHandlers.initHandlersFromConfig created tvrh: org.apache.solr.handler.component.SearchHandler
[junit4:junit4]   2> 1370 T2857 oasc.RequestHandlers.initHandlersFromConfig created /mlt: solr.MoreLikeThisHandler
[junit4:junit4]   2> 1370 T2857 oasc.RequestHandlers.initHandlersFromConfig created /debug/dump: solr.DumpRequestHandler
[junit4:junit4]   2> 1375 T2857 oashl.XMLLoader.init xsltCacheLifetimeSeconds=60
[junit4:junit4]   2> 1378 T2857 oasc.SolrCore.initDeprecatedSupport WARNING solrconfig.xml uses deprecated <admin/gettableFiles>, Please update your config to use the ShowFileRequestHandler.
[junit4:junit4]   2> 1379 T2857 oasc.SolrCore.initDeprecatedSupport WARNING adding ShowFileRequestHandler with hidden files: [SCHEMA.XML, OLD_SYNONYMS.TXT, STOPWORDS.TXT, PROTWORDS.TXT, OPEN-EXCHANGE-RATES.JSON, SYNONYMS.TXT, CURRENCY.XML, MAPPING-ISOLATIN1ACCENT.TXT]
[junit4:junit4]   2> 1380 T2857 oasc.CachingDirectoryFactory.close Releasing directory:/usr/home/hudson/hudson-slave/workspace/Lucene-Solr-Tests-4.x-Java6/solr/build/solr-core/test/J0/./org.apache.solr.cloud.SyncSliceTest-1357607540510/control/data
[junit4:junit4]   2> 1381 T2857 oass.SolrIndexSearcher.<init> Opening Searcher@795f8d12 main
[junit4:junit4]   2> 1382 T2857 oasu.CommitTracker.<init> Hard AutoCommit: disabled
[junit4:junit4]   2> 1382 T2857 oasu.CommitTracker.<init> Soft AutoCommit: disabled
[junit4:junit4]   2> 1383 T2857 oashc.SpellCheckComponent.inform Initializing spell checkers
[junit4:junit4]   2> 1387 T2857 oass.DirectSolrSpellChecker.init init: {name=direct,classname=DirectSolrSpellChecker,field=lowerfilt,minQueryLength=3}
[junit4:junit4]   2> 1444 T2858 oasc.SolrCore.registerSearcher [collection1] Registered new searcher Searcher@795f8d12 main{StandardDirectoryReader(segments_1:1)}
[junit4:junit4]   2> 1447 T2857 oasc.ZkController.publish publishing core=collection1 state=down
[junit4:junit4]   2> 1447 T2857 oasc.ZkController.publish numShards not found on descriptor - reading it from system property
[junit4:junit4]   2> 1447 T2837 oazs.PrepRequestProcessor.pRequest Got user-level KeeperException when processing sessionid:0x13c17b717240003 type:create cxid:0x50 zxid:0x29 txntype:-1 reqpath:n/a Error Path:/solr/overseer/queue Error:KeeperErrorCode = NoNode for /solr/overseer/queue
[junit4:junit4]   2> 2073 T2855 oascc.ZkStateReader.updateClusterState Updating cloud state from ZooKeeper... 
[junit4:junit4]   2> 2074 T2855 oasc.Overseer$ClusterStateUpdater.updateState Update state numShards=1 message={
[junit4:junit4]   2> 	  "operation":"state",
[junit4:junit4]   2> 	  "numShards":"1",
[junit4:junit4]   2> 	  "shard":null,
[junit4:junit4]   2> 	  "roles":null,
[junit4:junit4]   2> 	  "state":"down",
[junit4:junit4]   2> 	  "core":"collection1",
[junit4:junit4]   2> 	  "collection":"control_collection",
[junit4:junit4]   2> 	  "node_name":"127.0.0.1:47675__i",
[junit4:junit4]   2> 	  "base_url":"http://127.0.0.1:47675/_i"}
[junit4:junit4]   2> 2074 T2855 oasc.Overseer$ClusterStateUpdater.createCollection Create collection control_collection with numShards 1
[junit4:junit4]   2> 2074 T2855 oasc.Overseer$ClusterStateUpdater.updateState Assigning new node to shard shard=shard1
[junit4:junit4]   2> 2075 T2837 oazs.PrepRequestProcessor.pRequest Got user-level KeeperException when processing sessionid:0x13c17b717240003 type:create cxid:0x58 zxid:0x2c txntype:-1 reqpath:n/a Error Path:/solr/overseer/queue-work Error:KeeperErrorCode = NoNode for /solr/overseer/queue-work
[junit4:junit4]   2> 2098 T2854 oascc.ZkStateReader$2.process A cluster state change: WatchedEvent state:SyncConnected type:NodeDataChanged path:/clusterstate.json, has occurred - updating... (live nodes size: 1)
[junit4:junit4]   2> 2459 T2857 oasc.CoreContainer.registerCore registering core: collection1
[junit4:junit4]   2> 2459 T2857 oasc.ZkController.register Register replica - core:collection1 address:http://127.0.0.1:47675/_i collection:control_collection shard:shard1
[junit4:junit4]   2> 2460 T2857 oascc.SolrZkClient.makePath makePath: /collections/control_collection/leader_elect/shard1/election
[junit4:junit4]   2> 2486 T2837 oazs.PrepRequestProcessor.pRequest Got user-level KeeperException when processing sessionid:0x13c17b717240003 type:delete cxid:0x72 zxid:0x36 txntype:-1 reqpath:n/a Error Path:/solr/collections/control_collection/leaders Error:KeeperErrorCode = NoNode for /solr/collections/control_collection/leaders
[junit4:junit4]   2> 2495 T2857 oasc.ShardLeaderElectionContext.runLeaderProcess Running the leader process.
[junit4:junit4]   2> 2495 T2837 oazs.PrepRequestProcessor.pRequest Got user-level KeeperException when processing sessionid:0x13c17b717240003 type:create cxid:0x73 zxid:0x37 txntype:-1 reqpath:n/a Error Path:/solr/overseer Error:KeeperErrorCode = NodeExists for /solr/overseer
[junit4:junit4]   2> 2503 T2857 oasc.ShardLeaderElectionContext.waitForReplicasToComeUp Enough replicas found to continue.
[junit4:junit4]   2> 2503 T2857 oasc.ShardLeaderElectionContext.runLeaderProcess I may be the new leader - try and sync
[junit4:junit4]   2> 2503 T2857 oasc.SyncStrategy.sync Sync replicas to http://127.0.0.1:47675/_i/collection1/
[junit4:junit4]   2> 2504 T2857 oasc.SyncStrategy.syncReplicas Sync Success - now sync replicas to me
[junit4:junit4]   2> 2504 T2857 oasc.SyncStrategy.syncToMe http://127.0.0.1:47675/_i/collection1/ has no replicas
[junit4:junit4]   2> 2504 T2857 oasc.ShardLeaderElectionContext.runLeaderProcess I am the new leader: http://127.0.0.1:47675/_i/collection1/
[junit4:junit4]   2> 2504 T2857 oascc.SolrZkClient.makePath makePath: /collections/control_collection/leaders/shard1
[junit4:junit4]   2> 2508 T2837 oazs.PrepRequestProcessor.pRequest Got user-level KeeperException when processing sessionid:0x13c17b717240003 type:create cxid:0x7d zxid:0x3b txntype:-1 reqpath:n/a Error Path:/solr/overseer Error:KeeperErrorCode = NodeExists for /solr/overseer
[junit4:junit4]   2> 3602 T2855 oascc.ZkStateReader.updateClusterState Updating cloud state from ZooKeeper... 
[junit4:junit4]   2> 3621 T2854 oascc.ZkStateReader$2.process A cluster state change: WatchedEvent state:SyncConnected type:NodeDataChanged path:/clusterstate.json, has occurred - updating... (live nodes size: 1)
[junit4:junit4]   2> 3640 T2857 oasc.ZkController.register We are http://127.0.0.1:47675/_i/collection1/ and leader is http://127.0.0.1:47675/_i/collection1/
[junit4:junit4]   2> 3640 T2857 oasc.ZkController.register No LogReplay needed for core=collection1 baseURL=http://127.0.0.1:47675/_i
[junit4:junit4]   2> 3640 T2857 oasc.ZkController.checkRecovery I am the leader, no recovery necessary
[junit4:junit4]   2> 3640 T2857 oasc.ZkController.publish publishing core=collection1 state=active
[junit4:junit4]   2> 3640 T2857 oasc.ZkController.publish numShards not found on descriptor - reading it from system property
[junit4:junit4]   2> 3642 T2857 oascc.ZkStateReader.updateClusterState Updating cloud state from ZooKeeper... 
[junit4:junit4]   2> 3642 T2832 oass.SolrDispatchFilter.init user.dir=/usr/home/hudson/hudson-slave/workspace/Lucene-Solr-Tests-4.x-Java6/solr/build/solr-core/test/J0
[junit4:junit4]   2> 3643 T2832 oass.SolrDispatchFilter.init SolrDispatchFilter.init() done
[junit4:junit4]   2> 3643 T2832 oascsi.HttpClientUtil.createClient Creating new http client, config:maxConnections=128&maxConnectionsPerHost=32&followRedirects=false
[junit4:junit4]   2> 3654 T2832 oascsi.HttpClientUtil.createClient Creating new http client, config:
[junit4:junit4]   2> 3661 T2832 oaz.ZooKeeper.<init> Initiating client connection, connectString=127.0.0.1:10161/solr sessionTimeout=10000 watcher=org.apache.solr.common.cloud.ConnectionManager@7836ab4d
[junit4:junit4]   2> 3662 T2832 oascc.ConnectionManager.waitForConnected Waiting for client to connect to ZooKeeper
[junit4:junit4]   2> 3662 T2859 oaz.ClientCnxn$SendThread.logStartConnect Opening socket connection to server localhost/127.0.0.1:10161. Will not attempt to authenticate using SASL (access denied (javax.security.auth.AuthPermission getLoginConfiguration))
[junit4:junit4]   2> 3662 T2859 oaz.ClientCnxn$SendThread.primeConnection Socket connection established to localhost/127.0.0.1:10161, initiating session
[junit4:junit4]   2> 3663 T2834 oazs.NIOServerCnxnFactory.run Accepted socket connection from /140.211.11.196:25388
[junit4:junit4]   2> 3663 T2834 oazs.ZooKeeperServer.processConnectRequest Client attempting to establish new session at /140.211.11.196:25388
[junit4:junit4]   2> 3664 T2836 oazs.ZooKeeperServer.finishSessionInit Established session 0x13c17b717240004 with negotiated timeout 10000 for client /140.211.11.196:25388
[junit4:junit4]   2> 3664 T2859 oaz.ClientCnxn$SendThread.onConnected Session establishment complete on server localhost/127.0.0.1:10161, sessionid = 0x13c17b717240004, negotiated timeout = 10000
[junit4:junit4]   2> 3665 T2860 oascc.ConnectionManager.process Watcher org.apache.solr.common.cloud.ConnectionManager@7836ab4d name:ZooKeeperConnection Watcher:127.0.0.1:10161/solr got event WatchedEvent state:SyncConnected type:None path:null path:null type:None
[junit4:junit4]   2> 3665 T2832 oascc.ConnectionManager.waitForConnected Client is connected to ZooKeeper
[junit4:junit4]   2> 3665 T2832 oascc.ZkStateReader.createClusterStateWatchersAndUpdate Updating cluster state from ZooKeeper... 
[junit4:junit4]   2> 3666 T2832 oasc.ChaosMonkey.monkeyLog monkey: init - expire sessions:true cause connection loss:true
[junit4:junit4]   2> 3792 T2832 oejs.Server.doStart jetty-8.1.8.v20121106
[junit4:junit4]   2> 3795 T2832 oejs.AbstractConnector.doStart Started SocketConnector@127.0.0.1:23568
[junit4:junit4]   2> 3796 T2832 oass.SolrDispatchFilter.init SolrDispatchFilter.init()
[junit4:junit4]   2> 3797 T2832 oasc.SolrResourceLoader.locateSolrHome JNDI not configured for solr (NoInitialContextEx)
[junit4:junit4]   2> 3797 T2832 oasc.SolrResourceLoader.locateSolrHome using system property solr.solr.home: /usr/home/hudson/hudson-slave/workspace/Lucene-Solr-Tests-4.x-Java6/solr/build/solr-core/test/J0/./org.apache.solr.cloud.SyncSliceTest-jetty1-1357607544172
[junit4:junit4]   2> 3797 T2832 oasc.CoreContainer$Initializer.initialize looking for solr.xml: /usr/home/hudson/hudson-slave/workspace/Lucene-Solr-Tests-4.x-Java6/solr/build/solr-core/test/J0/./org.apache.solr.cloud.SyncSliceTest-jetty1-1357607544172/solr.xml
[junit4:junit4]   2> 3798 T2832 oasc.CoreContainer.<init> New CoreContainer 53783998
[junit4:junit4]   2> 3798 T2832 oasc.CoreContainer.load Loading CoreContainer using Solr Home: '/usr/home/hudson/hudson-slave/workspace/Lucene-Solr-Tests-4.x-Java6/solr/build/solr-core/test/J0/./org.apache.solr.cloud.SyncSliceTest-jetty1-1357607544172/'
[junit4:junit4]   2> 3798 T2832 oasc.SolrResourceLoader.<init> new SolrResourceLoader for directory: '/usr/home/hudson/hudson-slave/workspace/Lucene-Solr-Tests-4.x-Java6/solr/build/solr-core/test/J0/./org.apache.solr.cloud.SyncSliceTest-jetty1-1357607544172/'
[junit4:junit4]   2> 3830 T2832 oashc.HttpShardHandlerFactory.getParameter Setting socketTimeout to: 60000
[junit4:junit4]   2> 3830 T2832 oashc.HttpShardHandlerFactory.getParameter Setting urlScheme to: http://
[junit4:junit4]   2> 3831 T2832 oashc.HttpShardHandlerFactory.getParameter Setting connTimeout to: 15000
[junit4:junit4]   2> 3831 T2832 oashc.HttpShardHandlerFactory.getParameter Setting maxConnectionsPerHost to: 20
[junit4:junit4]   2> 3831 T2832 oashc.HttpShardHandlerFactory.getParameter Setting corePoolSize to: 0
[junit4:junit4]   2> 3831 T2832 oashc.HttpShardHandlerFactory.getParameter Setting maximumPoolSize to: 2147483647
[junit4:junit4]   2> 3832 T2832 oashc.HttpShardHandlerFactory.getParameter Setting maxThreadIdleTime to: 5
[junit4:junit4]   2> 3832 T2832 oashc.HttpShardHandlerFactory.getParameter Setting sizeOfQueue to: -1
[junit4:junit4]   2> 3832 T2832 oashc.HttpShardHandlerFactory.getParameter Setting fairnessPolicy to: false
[junit4:junit4]   2> 3833 T2832 oascsi.HttpClientUtil.createClient Creating new http client, config:maxConnectionsPerHost=20&maxConnections=10000&socketTimeout=60000&connTimeout=15000&retry=false
[junit4:junit4]   2> 3846 T2832 oasc.CoreContainer.load Registering Log Listener
[junit4:junit4]   2> 3858 T2832 oasc.CoreContainer.initZooKeeper Zookeeper client=127.0.0.1:10161/solr
[junit4:junit4]   2> 3859 T2832 oasc.ZkController.checkChrootPath zkHost includes chroot
[junit4:junit4]   2> 3859 T2832 oaz.ZooKeeper.<init> Initiating client connection, connectString=127.0.0.1:10161 sessionTimeout=60000 watcher=org.apache.solr.common.cloud.ConnectionManager@11348f22
[junit4:junit4]   2> 3860 T2832 oascc.ConnectionManager.waitForConnected Waiting for client to connect to ZooKeeper
[junit4:junit4]   2> 3860 T2870 oaz.ClientCnxn$SendThread.logStartConnect Opening socket connection to server localhost/127.0.0.1:10161. Will not attempt to authenticate using SASL (access denied (javax.security.auth.AuthPermission getLoginConfiguration))
[junit4:junit4]   2> 3861 T2870 oaz.ClientCnxn$SendThread.primeConnection Socket connection established to localhost/127.0.0.1:10161, initiating session
[junit4:junit4]   2> 3861 T2834 oazs.NIOServerCnxnFactory.run Accepted socket connection from /140.211.11.196:25482
[junit4:junit4]   2> 3861 T2834 oazs.ZooKeeperServer.processConnectRequest Client attempting to establish new session at /140.211.11.196:25482
[junit4:junit4]   2> 3863 T2836 oazs.ZooKeeperServer.finishSessionInit Established session 0x13c17b717240005 with negotiated timeout 20000 for client /140.211.11.196:25482
[junit4:junit4]   2> 3863 T2870 oaz.ClientCnxn$SendThread.onConnected Session establishment complete on server localhost/127.0.0.1:10161, sessionid = 0x13c17b717240005, negotiated timeout = 20000
[junit4:junit4]   2> 3863 T2871 oascc.ConnectionManager.process Watcher org.apache.solr.common.cloud.ConnectionManager@11348f22 name:ZooKeeperConnection Watcher:127.0.0.1:10161 got event WatchedEvent state:SyncConnected type:None path:null path:null type:None
[junit4:junit4]   2> 3864 T2832 oascc.ConnectionManager.waitForConnected Client is connected to ZooKeeper
[junit4:junit4]   2> 3864 T2837 oazs.PrepRequestProcessor.pRequest2Txn Processed session termination for sessionid: 0x13c17b717240005
[junit4:junit4]   2> 3876 T2871 oaz.ClientCnxn$EventThread.run EventThread shut down
[junit4:junit4]   2> 3876 T2834 oazs.NIOServerCnxn.closeSock Closed socket connection for client /140.211.11.196:25482 which had sessionid 0x13c17b717240005
[junit4:junit4]   2> 3876 T2832 oaz.ZooKeeper.close Session: 0x13c17b717240005 closed
[junit4:junit4]   2> 3876 T2832 oascsi.HttpClientUtil.createClient Creating new http client, config:maxConnections=500&maxConnectionsPerHost=16&socketTimeout=60000&connTimeout=15000
[junit4:junit4]   2> 3883 T2832 oaz.ZooKeeper.<init> Initiating client connection, connectString=127.0.0.1:10161/solr sessionTimeout=30000 watcher=org.apache.solr.common.cloud.ConnectionManager@6c464f46
[junit4:junit4]   2> 3884 T2832 oascc.ConnectionManager.waitForConnected Waiting for client to connect to ZooKeeper
[junit4:junit4]   2> 3884 T2872 oaz.ClientCnxn$SendThread.logStartConnect Opening socket connection to server localhost/127.0.0.1:10161. Will not attempt to authenticate using SASL (access denied (javax.security.auth.AuthPermission getLoginConfiguration))
[junit4:junit4]   2> 3884 T2872 oaz.ClientCnxn$SendThread.primeConnection Socket connection established to localhost/127.0.0.1:10161, initiating session
[junit4:junit4]   2> 3885 T2834 oazs.NIOServerCnxnFactory.run Accepted socket connection from /140.211.11.196:56730
[junit4:junit4]   2> 3885 T2834 oazs.ZooKeeperServer.processConnectRequest Client attempting to establish new session at /140.211.11.196:56730
[junit4:junit4]   2> 3886 T2836 oazs.ZooKeeperServer.finishSessionInit Established session 0x13c17b717240006 with negotiated timeout 20000 for client /140.211.11.196:56730
[junit4:junit4]   2> 3886 T2872 oaz.ClientCnxn$SendThread.onConnected Session establishment complete on server localhost/127.0.0.1:10161, sessionid = 0x13c17b717240006, negotiated timeout = 20000
[junit4:junit4]   2> 3886 T2873 oascc.ConnectionManager.process Watcher org.apache.solr.common.cloud.ConnectionManager@6c464f46 name:ZooKeeperConnection Watcher:127.0.0.1:10161/solr got event WatchedEvent state:SyncConnected type:None path:null path:null type:None
[junit4:junit4]   2> 3886 T2832 oascc.ConnectionManager.waitForConnected Client is connected to ZooKeeper
[junit4:junit4]   2> 3887 T2837 oazs.PrepRequestProcessor.pRequest Got user-level KeeperException when processing sessionid:0x13c17b717240006 type:create cxid:0x1 zxid:0x49 txntype:-1 reqpath:n/a Error Path:/solr/overseer Error:KeeperErrorCode = NodeExists for /solr/overseer
[junit4:junit4]   2> 3893 T2837 oazs.PrepRequestProcessor.pRequest Got user-level KeeperException when processing sessionid:0x13c17b717240006 type:create cxid:0x2 zxid:0x4a txntype:-1 reqpath:n/a Error Path:/solr/overseer Error:KeeperErrorCode = NodeExists for /solr/overseer
[junit4:junit4]   2> 3894 T2832 oasc.ZkController.createEphemeralLiveNode Register node as live in ZooKeeper:/live_nodes/127.0.0.1:23568__i
[junit4:junit4]   2> 3894 T2837 oazs.PrepRequestProcessor.pRequest Got user-level KeeperException when processing sessionid:0x13c17b717240006 type:delete cxid:0x4 zxid:0x4b txntype:-1 reqpath:n/a Error Path:/solr/live_nodes/127.0.0.1:23568__i Error:KeeperErrorCode = NoNode for /solr/live_nodes/127.0.0.1:23568__i
[junit4:junit4]   2> 3901 T2832 oascc.SolrZkClient.makePath makePath: /live_nodes/127.0.0.1:23568__i
[junit4:junit4]   2> 3902 T2854 oascc.ZkStateReader$2.process A cluster state change: WatchedEvent state:SyncConnected type:NodeChildrenChanged path:/live_nodes, has occurred - updating... (live nodes size: 1)
[junit4:junit4]   2> 3903 T2860 oascc.ZkStateReader$3.process Updating live nodes... (2)
[junit4:junit4]   2> 3903 T2854 oascc.ZkStateReader$3.process Updating live nodes... (2)
[junit4:junit4]   2> 3909 T2832 oascc.ZkStateReader.createClusterStateWatchersAndUpdate Updating cluster state from ZooKeeper... 
[junit4:junit4]   2> 3914 T2874 oasc.CoreContainer.create Creating SolrCore 'collection1' using instanceDir: /usr/home/hudson/hudson-slave/workspace/Lucene-Solr-Tests-4.x-Java6/solr/build/solr-core/test/J0/./org.apache.solr.cloud.SyncSliceTest-jetty1-1357607544172/collection1
[junit4:junit4]   2> 3914 T2874 oasc.ZkController.createCollectionZkNode Check for collection zkNode:collection1
[junit4:junit4]   2> 3914 T2874 oasc.ZkController.createCollectionZkNode Collection zkNode exists
[junit4:junit4]   2> 3915 T2874 oasc.ZkController.readConfigName Load collection config from:/collections/collection1
[junit4:junit4]   2> 3915 T2874 oasc.SolrResourceLoader.<init> new SolrResourceLoader for directory: '/usr/home/hudson/hudson-slave/workspace/Lucene-Solr-Tests-4.x-Java6/solr/build/solr-core/test/J0/./org.apache.solr.cloud.SyncSliceTest-jetty1-1357607544172/collection1/'
[junit4:junit4]   2> 3916 T2874 oasc.SolrResourceLoader.replaceClassLoader Adding 'file:/usr/home/hudson/hudson-slave/workspace/Lucene-Solr-Tests-4.x-Java6/solr/build/solr-core/test/J0/org.apache.solr.cloud.SyncSliceTest-jetty1-1357607544172/collection1/lib/classes/' to classloader
[junit4:junit4]   2> 3916 T2874 oasc.SolrResourceLoader.replaceClassLoader Adding 'file:/usr/home/hudson/hudson-slave/workspace/Lucene-Solr-Tests-4.x-Java6/solr/build/solr-core/test/J0/org.apache.solr.cloud.SyncSliceTest-jetty1-1357607544172/collection1/lib/README' to classloader
[junit4:junit4]   2> 3951 T2874 oasc.SolrConfig.<init> Using Lucene MatchVersion: LUCENE_41
[junit4:junit4]   2> 4003 T2874 oasc.SolrConfig.<init> Loaded SolrConfig: solrconfig.xml
[junit4:junit4]   2> 4104 T2874 oass.IndexSchema.readSchema Reading Solr Schema
[junit4:junit4]   2> 4108 T2874 oass.IndexSchema.readSchema Schema name=test
[junit4:junit4]   2> 4541 T2874 oass.OpenExchangeRatesOrgProvider.init Initialized with rates=open-exchange-rates.json, refreshInterval=1440.
[junit4:junit4]   2> 4548 T2874 oass.IndexSchema.readSchema default search field in schema is text
[junit4:junit4]   2> 4550 T2874 oass.IndexSchema.readSchema unique key field: id
[junit4:junit4]   2> 4560 T2874 oass.FileExchangeRateProvider.reload Reloading exchange rates from file currency.xml
[junit4:junit4]   2> 4563 T2874 oass.FileExchangeRateProvider.reload Reloading exchange rates from file currency.xml
[junit4:junit4]   2> 4566 T2874 oass.OpenExchangeRatesOrgProvider.reload Reloading exchange rates from open-exchange-rates.json
[junit4:junit4]   2> 4567 T2874 oass.OpenExchangeRatesOrgProvider.reload Reloading exchange rates from open-exchange-rates.json
[junit4:junit4]   2> 4568 T2874 oasc.SolrCore.<init> [collection1] Opening new SolrCore at /usr/home/hudson/hudson-slave/workspace/Lucene-Solr-Tests-4.x-Java6/solr/build/solr-core/test/J0/./org.apache.solr.cloud.SyncSliceTest-jetty1-1357607544172/collection1/, dataDir=./org.apache.solr.cloud.SyncSliceTest-1357607540510/jetty1/
[junit4:junit4]   2> 4568 T2874 oasc.JmxMonitoredMap.<init> JMX monitoring is enabled. Adding Solr mbeans to JMX Server: com.sun.jmx.mbeanserver.JmxMBeanServer@4f4b2f1a
[junit4:junit4]   2> 4568 T2874 oasc.SolrCore.initDirectoryFactory solr.NRTCachingDirectoryFactory
[junit4:junit4]   2> 4569 T2874 oasc.CachingDirectoryFactory.get return new directory for /usr/home/hudson/hudson-slave/workspace/Lucene-Solr-Tests-4.x-Java6/solr/build/solr-core/test/J0/./org.apache.solr.cloud.SyncSliceTest-1357607540510/jetty1 forceNew:false
[junit4:junit4]   2> 4569 T2874 oasc.CachingDirectoryFactory.close Releasing directory:/usr/home/hudson/hudson-slave/workspace/Lucene-Solr-Tests-4.x-Java6/solr/build/solr-core/test/J0/./org.apache.solr.cloud.SyncSliceTest-1357607540510/jetty1
[junit4:junit4]   2> 4569 T2874 oasc.SolrCore.getNewIndexDir New index directory detected: old=null new=./org.apache.solr.cloud.SyncSliceTest-1357607540510/jetty1/index/
[junit4:junit4]   2> 4570 T2874 oasc.SolrCore.initIndex WARNING [collection1] Solr index directory './org.apache.solr.cloud.SyncSliceTest-1357607540510/jetty1/index' doesn't exist. Creating new index...
[junit4:junit4]   2> 4570 T2874 oasc.CachingDirectoryFactory.get return new directory for /usr/home/hudson/hudson-slave/workspace/Lucene-Solr-Tests-4.x-Java6/solr/build/solr-core/test/J0/./org.apache.solr.cloud.SyncSliceTest-1357607540510/jetty1/index forceNew:false
[junit4:junit4]   2> 4574 T2874 oasc.SolrDeletionPolicy.onCommit SolrDeletionPolicy.onCommit: commits:num=1
[junit4:junit4]   2> 		commit{dir=RateLimitedDirectoryWrapper(NRTCachingDirectory(org.apache.lucene.store.NIOFSDirectory@/usr/home/hudson/hudson-slave/workspace/Lucene-Solr-Tests-4.x-Java6/solr/build/solr-core/test/J0/org.apache.solr.cloud.SyncSliceTest-1357607540510/jetty1/index lockFactory=org.apache.lucene.store.NativeFSLockFactory@37898c18; maxCacheMB=48.0 maxMergeSizeMB=4.0)),segFN=segments_1,generation=1,filenames=[segments_1]
[junit4:junit4]   2> 4574 T2874 oasc.SolrDeletionPolicy.updateCommits newest commit = 1[segments_1]
[junit4:junit4]   2> 4575 T2874 oasc.CachingDirectoryFactory.close Releasing directory:/usr/home/hudson/hudson-slave/workspace/Lucene-Solr-Tests-4.x-Java6/solr/build/solr-core/test/J0/./org.apache.solr.cloud.SyncSliceTest-1357607540510/jetty1/index
[junit4:junit4]   2> 4575 T2874 oasc.SolrCore.initWriters created xml: solr.XMLResponseWriter
[junit4:junit4]   2> 4577 T2874 oasup.UpdateRequestProcessorChain.init inserting DistributedUpdateProcessorFactory into updateRequestProcessorChain "dedupe"
[junit4:junit4]   2> 4577 T2874 oasup.UpdateRequestProcessorChain.init inserting DistributedUpdateProcessorFactory into updateRequestProcessorChain "dedupe-allfields"
[junit4:junit4]   2> 4577 T2874 oasup.UpdateRequestProcessorChain.init inserting DistributedUpdateProcessorFactory into updateRequestProcessorChain "stored_sig"
[junit4:junit4]   2> 4577 T2874 oasup.UpdateRequestProcessorChain.init inserting DistributedUpdateProcessorFactory into updateRequestProcessorChain "uniq-fields"
[junit4:junit4]   2> 4578 T2874 oasup.UpdateRequestProcessorChain.init inserting DistributedUpdateProcessorFactory into updateRequestProcessorChain "distrib-dup-test-chain-implicit"
[junit4:junit4]   2> 4578 T2874 oasc.RequestHandlers.initHandlersFromConfig adding lazy requestHandler: solr.ReplicationHandler
[junit4:junit4]   2> 4578 T2874 oasc.RequestHandlers.initHandlersFromConfig created /replication: solr.ReplicationHandler
[junit4:junit4]   2> 4578 T2874 oasc.RequestHandlers.initHandlersFromConfig created standard: solr.StandardRequestHandler
[junit4:junit4]   2> 4579 T2874 oasc.RequestHandlers.initHandlersFromConfig created /get: solr.RealTimeGetHandler
[junit4:junit4]   2> 4579 T2874 oasc.RequestHandlers.initHandlersFromConfig created dismax: solr.SearchHandler
[junit4:junit4]   2> 4579 T2874 oasc.RequestHandlers.initHandlersFromConfig created mock: org.apache.solr.core.MockQuerySenderListenerReqHandler
[junit4:junit4]   2> 4580 T2874 oasc.RequestHandlers.initHandlersFromConfig created /admin/: org.apache.solr.handler.admin.AdminHandlers
[junit4:junit4]   2> 4580 T2874 oasc.RequestHandlers.initHandlersFromConfig created defaults: solr.StandardRequestHandler
[junit4:junit4]   2> 4580 T2874 oasc.RequestHandlers.initHandlersFromConfig adding lazy requestHandler: solr.StandardRequestHandler
[junit4:junit4]   2> 4580 T2874 oasc.RequestHandlers.initHandlersFromConfig created lazy: solr.StandardRequestHandler
[junit4:junit4]   2> 4581 T2874 oasc.RequestHandlers.initHandlersFromConfig created /update: solr.UpdateRequestHandler
[junit4:junit4]   2> 4581 T2874 oasc.RequestHandlers.initHandlersFromConfig created /terms: org.apache.solr.handler.component.SearchHandler
[junit4:junit4]   2> 4581 T2874 oasc.RequestHandlers.initHandlersFromConfig created spellCheckCompRH: org.apache.solr.handler.component.SearchHandler
[junit4:junit4]   2> 4582 T2874 oasc.RequestHandlers.initHandlersFromConfig created spellCheckCompRH_Direct: org.apache.solr.handler.component.SearchHandler
[junit4:junit4]   2> 4582 T2874 oasc.RequestHandlers.initHandlersFromConfig created spellCheckWithWordbreak: org.apache.solr.handler.component.SearchHandler
[junit4:junit4]   2> 4582 T2874 oasc.RequestHandlers.initHandlersFromConfig created spellCheckWithWordbreak_Direct: org.apache.solr.handler.component.SearchHandler
[junit4:junit4]   2> 4583 T2874 oasc.RequestHandlers.initHandlersFromConfig created spellCheckCompRH1: org.apache.solr.handler.component.SearchHandler
[junit4:junit4]   2> 4583 T2874 oasc.RequestHandlers.initHandlersFromConfig created mltrh: org.apache.solr.handler.component.SearchHandler
[junit4:junit4]   2> 4583 T2874 oasc.RequestHandlers.initHandlersFromConfig created tvrh: org.apache.solr.handler.component.SearchHandler
[junit4:junit4]   2> 4584 T2874 oasc.RequestHandlers.initHandlersFromConfig created /mlt: solr.MoreLikeThisHandler
[junit4:junit4]   2> 4584 T2874 oasc.RequestHandlers.initHandlersFromConfig created /debug/dump: solr.DumpRequestHandler
[junit4:junit4]   2> 4589 T2874 oashl.XMLLoader.init xsltCacheLifetimeSeconds=60
[junit4:junit4]   2> 4592 T2874 oasc.SolrCore.initDeprecatedSupport WARNING solrconfig.xml uses deprecated <admin/gettableFiles>, Please update your config to use the ShowFileRequestHandler.
[junit4:junit4]   2> 4592 T2874 oasc.SolrCore.initDeprecatedSupport WARNING adding ShowFileRequestHandler with hidden files: [SCHEMA.XML, OLD_SYNONYMS.TXT, STOPWORDS.TXT, PROTWORDS.TXT, OPEN-EXCHANGE-RATES.JSON, SYNONYMS.TXT, CURRENCY.XML, MAPPING-ISOLATIN1ACCENT.TXT]
[junit4:junit4]   2> 4594 T2874 oasc.CachingDirectoryFactory.close Releasing directory:/usr/home/hudson/hudson-slave/workspace/Lucene-Solr-Tests-4.x-Java6/solr/build/solr-core/test/J0/./org.apache.solr.cloud.SyncSliceTest-1357607540510/jetty1
[junit4:junit4]   2> 4595 T2874 oass.SolrIndexSearcher.<init> Opening Searcher@7f0b4330 main
[junit4:junit4]   2> 4596 T2874 oasu.CommitTracker.<init> Hard AutoCommit: disabled
[junit4:junit4]   2> 4596 T2874 oasu.CommitTracker.<init> Soft AutoCommit: disabled
[junit4:junit4]   2> 4597 T2874 oashc.SpellCheckComponent.inform Initializing spell checkers
[junit4:junit4]   2> 4601 T2874 oass.DirectSolrSpellChecker.init init: {name=direct,classname=DirectSolrSpellChecker,field=lowerfilt,minQueryLength=3}
[junit4:junit4]   2> 4646 T2875 oasc.SolrCore.registerSearcher [collection1] Registered new searcher Searcher@7f0b4330 main{StandardDirectoryReader(segments_1:1)}
[junit4:junit4]   2> 4649 T2874 oasc.ZkController.publish publishing core=collection1 state=down
[junit4:junit4]   2> 4649 T2874 oasc.ZkController.publish numShards not found on descriptor - reading it from system property
[junit4:junit4]   2> 5132 T2855 oascc.ZkStateReader.updateClusterState Updating cloud state from ZooKeeper... 
[junit4:junit4]   2> 5133 T2855 oasc.Overseer$ClusterStateUpdater.updateState Update state numShards=1 message={
[junit4:junit4]   2> 	  "operation":"state",
[junit4:junit4]   2> 	  "numShards":"1",
[junit4:junit4]   2> 	  "shard":"shard1",
[junit4:junit4]   2> 	  "roles":null,
[junit4:junit4]   2> 	  "state":"active",
[junit4:junit4]   2> 	  "core":"collection1",
[junit4:junit4]   2> 	  "collection":"control_collection",
[junit4:junit4]   2> 	  "node_name":"127.0.0.1:47675__i",
[junit4:junit4]   2> 	  "base_url":"http://127.0.0.1:47675/_i"}
[junit4:junit4]   2> 5136 T2855 oasc.Overseer$ClusterStateUpdater.updateState Update state numShards=1 message={
[junit4:junit4]   2> 	  "operation":"state",
[junit4:junit4]   2> 	  "numShards":"1",
[junit4:junit4]   2> 	  "shard":null,
[junit4:junit4]   2> 	  "roles":null,
[junit4:junit4]   2> 	  "state":"down",
[junit4:junit4]   2> 	  "core":"collection1",
[junit4:junit4]   2> 	  "collection":"collection1",
[junit4:junit4]   2> 	  "node_name":"127.0.0.1:23568__i",
[junit4:junit4]   2> 	  "base_url":"http://127.0.0.1:23568/_i"}
[junit4:junit4]   2> 5136 T2855 oasc.Overseer$ClusterStateUpdater.createCollection Create collection collection1 with numShards 1
[junit4:junit4]   2> 5136 T2855 oasc.Overseer$ClusterStateUpdater.updateState Assigning new node to shard shard=shard1
[junit4:junit4]   2> 5151 T2854 oascc.ZkStateReader$2.process A cluster state change: WatchedEvent state:SyncConnected type:NodeDataChanged path:/clusterstate.json, has occurred - updating... (live nodes size: 2)
[junit4:junit4]   2> 5155 T2860 oascc.ZkStateReader$2.process A cluster state change: WatchedEvent state:SyncConnected type:NodeDataChanged path:/clusterstate.json, has occurred - updating... (live nodes size: 2)
[junit4:junit4]   2> 5151 T2873 oascc.ZkStateReader$2.process A cluster state change: WatchedEvent state:SyncConnected type:NodeDataChanged path:/clusterstate.json, has occurred - updating... (live nodes size: 2)
[junit4:junit4]   2> 5652 T2874 oasc.CoreContainer.registerCore registering core: collection1
[junit4:junit4]   2> 5652 T2874 oasc.ZkController.register Register replica - core:collection1 address:http://127.0.0.1:23568/_i collection:collection1 shard:shard1
[junit4:junit4]   2> 5653 T2874 oascc.SolrZkClient.makePath makePath: /collections/collection1/leader_elect/shard1/election
[junit4:junit4]   2> 5682 T2837 oazs.PrepRequestProcessor.pRequest Got user-level KeeperException when processing sessionid:0x13c17b717240006 type:delete cxid:0x43 zxid:0x5a txntype:-1 reqpath:n/a Error Path:/solr/collections/collection1/leaders Error:KeeperErrorCode = NoNode for /solr/collections/collection1/leaders
[junit4:junit4]   2> 5685 T2874 oasc.ShardLeaderElectionContext.runLeaderProcess Running the leader process.
[junit4:junit4]   2> 5686 T2837 oazs.PrepRequestProcessor.pRequest Got user-level KeeperException when processing sessionid:0x13c17b717240006 type:create cxid:0x44 zxid:0x5b txntype:-1 reqpath:n/a Error Path:/solr/overseer Error:KeeperErrorCode = NodeExists for /solr/overseer
[junit4:junit4]   2> 5697 T2874 oasc.ShardLeaderElectionContext.waitForReplicasToComeUp Enough replicas found to continue.
[junit4:junit4]   2> 5698 T2874 oasc.ShardLeaderElectionContext.runLeaderProcess I may be the new leader - try and sync
[junit4:junit4]   2> 5698 T2874 oasc.SyncStrategy.sync Sync replicas to http://127.0.0.1:23568/_i/collection1/
[junit4:junit4]   2> 5698 T2874 oasc.SyncStrategy.syncReplicas Sync Success - now sync replicas to me
[junit4:junit4]   2> 5698 T2874 oasc.SyncStrategy.syncToMe http://127.0.0.1:23568/_i/collection1/ has no replicas
[junit4:junit4]   2> 5698 T2874 oasc.ShardLeaderElectionContext.runLeaderProcess I am the new leader: http://127.0.0.1:23568/_i/collection1/
[junit4:junit4]   2> 5699 T2874 oascc.SolrZkClient.makePath makePath: /collections/collection1/leaders/shard1
[junit4:junit4]   2> 5702 T2837 oazs.PrepRequestProcessor.pRequest Got user-level KeeperException when processing sessionid:0x13c17b717240006 type:create cxid:0x4e zxid:0x5f txntype:-1 reqpath:n/a Error Path:/solr/overseer Error:KeeperErrorCode = NodeExists for /solr/overseer
[junit4:junit4]   2> 6675 T2855 oascc.ZkStateReader.updateClusterState Updating cloud state from ZooKeeper... 
[junit4:junit4]   2> 6728 T2873 oascc.ZkStateReader$2.process A cluster state change: WatchedEvent state:SyncConnected type:NodeDataChanged path:/clusterstate.json, has occurred - updating... (live nodes size: 2)
[junit4:junit4]   2> 6728 T2854 oascc.ZkStateReader$2.process A cluster state change: WatchedEvent state:SyncConnected type:NodeDataChanged path:/clusterstate.json, has occurred - updating... (live nodes size: 2)
[junit4:junit4]   2> 6728 T2860 oascc.ZkStateReader$2.process A cluster state change: WatchedEvent state:SyncConnected type:NodeDataChanged path:/clusterstate.json, has occurred - updating... (live nodes size: 2)
[junit4:junit4]   2> 6730 T2874 oasc.ZkController.register We are http://127.0.0.1:23568/_i/collection1/ and leader is http://127.0.0.1:23568/_i/collection1/
[junit4:junit4]   2> 6730 T2874 oasc.ZkController.register No LogReplay needed for core=collection1 baseURL=http://127.0.0.1:23568/_i
[junit4:junit4]   2> 6730 T2874 oasc.ZkController.checkRecovery I am the leader, no recovery necessary
[junit4:junit4]   2> 6730 T2874 oasc.ZkController.publish publishing core=collection1 state=active
[junit4:junit4]   2> 6730 T2874 oasc.ZkController.publish numShards not found on descriptor - reading it from system property
[junit4:junit4]   2> 6736 T2874 oascc.ZkStateReader.updateClusterState Updating cloud state from ZooKeeper... 
[junit4:junit4]   2> 6737 T2832 oass.SolrDispatchFilter.init user.dir=/usr/home/hudson/hudson-slave/workspace/Lucene-Solr-Tests-4.x-Java6/solr/build/solr-core/test/J0
[junit4:junit4]   2> 6737 T2832 oass.SolrDispatchFilter.init SolrDispatchFilter.init() done
[junit4:junit4]   2> 6738 T2832 oascsi.HttpClientUtil.createClient Creating new http client, config:maxConnections=128&maxConnectionsPerHost=32&followRedirects=false
[junit4:junit4]   2> 6865 T2832 oejs.Server.doStart jetty-8.1.8.v20121106
[junit4:junit4]   2> 6868 T2832 oejs.AbstractConnector.doStart Started SocketConnector@127.0.0.1:65097
[junit4:junit4]   2> 6868 T2832 oass.SolrDispatchFilter.init SolrDispatchFilter.init()
[junit4:junit4]   2> 6868 T2832 oasc.SolrResourceLoader.locateSolrHome JNDI not configured for solr (NoInitialContextEx)
[junit4:junit4]   2> 6869 T2832 oasc.SolrResourceLoader.locateSolrHome using system property solr.solr.home: /usr/home/hudson/hudson-slave/workspace/Lucene-Solr-Tests-4.x-Java6/solr/build/solr-core/test/J0/./org.apache.solr.cloud.SyncSliceTest-jetty2-1357607547254
[junit4:junit4]   2> 6869 T2832 oasc.CoreContainer$Initializer.initialize looking for solr.xml: /usr/home/hudson/hudson-slave/workspace/Lucene-Solr-Tests-4.x-Java6/solr/build/solr-core/test/J0/./org.apache.solr.cloud.SyncSliceTest-jetty2-1357607547254/solr.xml
[junit4:junit4]   2> 6869 T2832 oasc.CoreContainer.<init> New CoreContainer 1359141514
[junit4:junit4]   2> 6870 T2832 oasc.CoreContainer.load Loading CoreContainer using Solr Home: '/usr/home/hudson/hudson-slave/workspace/Lucene-Solr-Tests-4.x-Java6/solr/build/solr-core/test/J0/./org.apache.solr.cloud.SyncSliceTest-jetty2-1357607547254/'
[junit4:junit4]   2> 6870 T2832 oasc.SolrResourceLoader.<init> new SolrResourceLoader for directory: '/usr/home/hudson/hudson-slave/workspace/Lucene-Solr-Tests-4.x-Java6/solr/build/solr-core/test/J0/./org.apache.solr.cloud.SyncSliceTest-jetty2-1357607547254/'
[junit4:junit4]   2> 6900 T2832 oashc.HttpShardHandlerFactory.getParameter Setting socketTimeout to: 60000
[junit4:junit4]   2> 6900 T2832 oashc.HttpShardHandlerFactory.getParameter Setting urlScheme to: http://
[junit4:junit4]   2> 6900 T2832 oashc.HttpShardHandlerFactory.getParameter Setting connTimeout to: 15000
[junit4:junit4]   2> 6901 T2832 oashc.HttpShardHandlerFactory.getParameter Setting maxConnectionsPerHost to: 20
[junit4:junit4]   2> 6901 T2832 oashc.HttpShardHandlerFactory.getParameter Setting corePoolSize to: 0
[junit4:junit4]   2> 6901 T2832 oashc.HttpShardHandlerFactory.getParameter Setting maximumPoolSize to: 2147483647
[junit4:junit4]   2> 6902 T2832 oashc.HttpShardHandlerFactory.getParameter Setting maxThreadIdleTime to: 5
[junit4:junit4]   2> 6902 T2832 oashc.HttpShardHandlerFactory.getParameter Setting sizeOfQueue to: -1
[junit4:junit4]   2> 6902 T2832 oashc.HttpShardHandlerFactory.getParameter Setting fairnessPolicy to: false
[junit4:junit4]   2> 6902 T2832 oascsi.HttpClientUtil.createClient Creating new http client, config:maxConnectionsPerHost=20&maxConnections=10000&socketTimeout=60000&connTimeout=15000&retry=false
[junit4:junit4]   2> 6916 T2832 oasc.CoreContainer.load Registering Log Listener
[junit4:junit4]   2> 6929 T2832 oasc.CoreContainer.initZooKeeper Zookeeper client=127.0.0.1:10161/solr
[junit4:junit4]   2> 6929 T2832 oasc.ZkController.checkChrootPath zkHost includes chroot
[junit4:junit4]   2> 6930 T2832 oaz.ZooKeeper.<init> Initiating client connection, connectString=127.0.0.1:10161 sessionTimeout=60000 watcher=org.apache.solr.common.cloud.ConnectionManager@4336f14e
[junit4:junit4]   2> 6930 T2832 oascc.ConnectionManager.waitForConnected Waiting for client to connect to ZooKeeper
[junit4:junit4]   2> 6931 T2885 oaz.ClientCnxn$SendThread.logStartConnect Opening socket connection to server localhost/127.0.0.1:10161. Will not attempt to authenticate using SASL (access denied (javax.security.auth.AuthPermission getLoginConfiguration))
[junit4:junit4]   2> 6931 T2885 oaz.ClientCnxn$SendThread.primeConnection Socket connection established to localhost/127.0.0.1:10161, initiating session
[junit4:junit4]   2> 6931 T2834 oazs.NIOServerCnxnFactory.run Accepted socket connection from /140.211.11.196:26014
[junit4:junit4]   2> 6932 T2834 oazs.ZooKeeperServer.processConnectRequest Client attempting to establish new session at /140.211.11.196:26014
[junit4:junit4]   2> 6933 T2836 oazs.ZooKeeperServer.finishSessionInit Established session 0x13c17b717240007 with negotiated timeout 20000 for client /140.211.11.196:26014
[junit4:junit4]   2> 6933 T2885 oaz.ClientCnxn$SendThread.onConnected Session establishment complete on server localhost/127.0.0.1:10161, sessionid = 0x13c17b717240007, negotiated timeout = 20000
[junit4:junit4]   2> 6934 T2886 oascc.ConnectionManager.process Watcher org.apache.solr.common.cloud.ConnectionManager@4336f14e name:ZooKeeperConnection Watcher:127.0.0.1:10161 got event WatchedEvent state:SyncConnected type:None path:null path:null type:None
[junit4:junit4]   2> 6934 T2832 oascc.ConnectionManager.waitForConnected Client is connected to ZooKeeper
[junit4:junit4]   2> 6935 T2837 oazs.PrepRequestProcessor.pRequest2Txn Processed session termination for sessionid: 0x13c17b717240007
[junit4:junit4]   2> 6936 T2886 oaz.ClientCnxn$EventThread.run EventThread shut down
[junit4:junit4]   2> 6936 T2834 oazs.NIOServerCnxn.closeSock Closed socket connection for client /140.211.11.196:26014 which had sessionid 0x13c17b717240007
[junit4:junit4]   2> 6936 T2832 oaz.ZooKeeper.close Session: 0x13c17b717240007 closed
[junit4:junit4]   2> 6937 T2832 oascsi.HttpClientUtil.createClient Creating new http client, config:maxConnections=500&maxConnectionsPerHost=16&socketTimeout=60000&connTimeout=15000
[junit4:junit4]   2> 6948 T2832 oaz.ZooKeeper.<init> Initiating client connection, connectString=127.0.0.1:10161/solr sessionTimeout=30000 watcher=org.apache.solr.common.cloud.ConnectionManager@5b66590f
[junit4:junit4]   2> 6949 T2832 oascc.ConnectionManager.waitForConnected Waiting for client to connect to ZooKeeper
[junit4:junit4]   2> 6949 T2887 oaz.ClientCnxn$SendThread.logStartConnect Opening socket connection to server localhost/127.0.0.1:10161. Will not attempt to authenticate using SASL (access denied (javax.security.auth.AuthPermission getLoginConfiguration))
[junit4:junit4]   2> 6950 T2887 oaz.ClientCnxn$SendThread.primeConnection Socket connection established to localhost/127.0.0.1:10161, initiating session
[junit4:junit4]   2> 6950 T2834 oazs.NIOServerCnxnFactory.run Accepted socket connection from /140.211.11.196:21395
[junit4:junit4]   2> 6950 T2834 oazs.ZooKeeperServer.processConnectRequest Client attempting to establish new session at /140.211.11.196:21395
[junit4:junit4]   2> 6951 T2836 oazs.ZooKeeperServer.finishSessionInit Established session 0x13c17b717240008 with negotiated timeout 20000 for client /140.211.11.196:21395
[junit4:junit4]   2> 6951 T2887 oaz.ClientCnxn$SendThread.onConnected Session establishment complete on server localhost/127.0.0.1:10161, sessionid = 0x13c17b717240008, negotiated timeout = 20000
[junit4:junit4]   2> 6952 T2888 oascc.ConnectionManager.process Watcher org.apache.solr.common.cloud.ConnectionManager@5b66590f name:ZooKeeperConnection Watcher:127.0.0.1:10161/solr got event WatchedEvent state:SyncConnected type:None path:null path:null type:None
[junit4:junit4]   2> 6952 T2832 oascc.ConnectionManager.waitForConnected Client is connected to ZooKeeper
[junit4:junit4]   2> 6953 T2837 oazs.PrepRequestProcessor.pRequest Got user-level KeeperException when processing sessionid:0x13c17b717240008 type:create cxid:0x1 zxid:0x6c txntype:-1 reqpath:n/a Error Path:/solr/overseer Error:KeeperErrorCode = NodeExists for /solr/overseer
[junit4:junit4]   2> 6954 T2837 oazs.PrepRequestProcessor.pRequest Got user-level KeeperException when processing sessionid:0x13c17b717240008 type:create cxid:0x2 zxid:0x6d txntype:-1 reqpath:n/a Error Path:/solr/overseer Error:KeeperErrorCode = NodeExists for /solr/overseer
[junit4:junit4]   2> 6962 T2832 oasc.ZkController.createEphemeralLiveNode Register node as live in ZooKeeper:/live_nodes/127.0.0.1:65097__i
[junit4:junit4]   2> 6963 T2837 oazs.PrepRequestProcessor.pRequest Got user-level KeeperException when processing sessionid:0x13c17b717240008 type:delete cxid:0x4 zxid:0x6e txntype:-1 reqpath:n/a Error Path:/solr/live_nodes/127.0.0.1:65097__i Error:KeeperErrorCode = NoNode for /solr/live_nodes/127.0.0.1:65097__i
[junit4:junit4]   2> 6964 T2832 oascc.SolrZkClient.makePath makePath: /live_nodes/127.0.0.1:65097__i
[junit4:junit4]   2> 6966 T2860 oascc.ZkStateReader$2.process A cluster state change: WatchedEvent state:SyncConnected type:NodeChildrenChanged path:/live_nodes, has occurred - updating... (live nodes size: 2)
[junit4:junit4]   2> 6966 T2854 oascc.ZkStateReader$2.process A cluster state change: WatchedEvent state:SyncConnected type:NodeChildrenChanged path:/live_nodes, has occurred - updating... (live nodes size: 2)
[junit4:junit4]   2> 6967 T2873 oascc.ZkStateReader$3.process Updating live nodes... (3)
[junit4:junit4]   2> 6967 T2873 oascc.ZkStateReader$2.process A cluster state change: WatchedEvent state:SyncConnected type:NodeChildrenChanged path:/live_nodes, has occurred - updating... (live nodes size: 3)
[junit4:junit4]   2> 6967 T2860 oascc.ZkStateReader$3.process Updating live nodes... (3)
[junit4:junit4]   2> 6975 T2854 oascc.ZkStateReader$3.process Updating live nodes... (3)
[junit4:junit4]   2> 6976 T2832 oascc.ZkStateReader.createClusterStateWatchersAndUpdate Updating cluster state from ZooKeeper... 
[junit4:junit4]   2> 6982 T2889 oasc.CoreContainer.create Creating SolrCore 'collection1' using instanceDir: /usr/home/hudson/hudson-slave/workspace/Lucene-Solr-Tests-4.x-Java6/solr/build/solr-core/test/J0/./org.apache.solr.cloud.SyncSliceTest-jetty2-1357607547254/collection1
[junit4:junit4]   2> 6983 T2889 oasc.ZkController.createCollectionZkNode Check for collection zkNode:collection1
[junit4:junit4]   2> 6983 T2889 oasc.ZkController.createCollectionZkNode Collection zkNode exists
[junit4:junit4]   2> 6983 T2889 oasc.ZkController.readConfigName Load collection config from:/collections/collection1
[junit4:junit4]   2> 6984 T2889 oasc.SolrResourceLoader.<init> new SolrResourceLoader for directory: '/usr/home/hudson/hudson-slave/workspace/Lucene-Solr-Tests-4.x-Java6/solr/build/solr-core/test/J0/./org.apache.solr.cloud.SyncSliceTest-jetty2-1357607547254/collection1/'
[junit4:junit4]   2> 6985 T2889 oasc.SolrResourceLoader.replaceClassLoader Adding 'file:/usr/home/hudson/hudson-slave/workspace/Lucene-Solr-Tests-4.x-Java6/solr/build/solr-core/test/J0/org.apache.solr.cloud.SyncSliceTest-jetty2-1357607547254/collection1/lib/README' to classloader
[junit4:junit4]   2> 6985 T2889 oasc.SolrResourceLoader.replaceClassLoader Adding 'file:/usr/home/hudson/hudson-slave/workspace/Lucene-Solr-Tests-4.x-Java6/solr/build/solr-core/test/J0/org.apache.solr.cloud.SyncSliceTest-jetty2-1357607547254/collection1/lib/classes/' to classloader
[junit4:junit4]   2> 7034 T2889 oasc.SolrConfig.<init> Using Lucene MatchVersion: LUCENE_41
[junit4:junit4]   2> 7106 T2889 oasc.SolrConfig.<init> Loaded SolrConfig: solrconfig.xml
[junit4:junit4]   2> 7207 T2889 oass.IndexSchema.readSchema Reading Solr Schema
[junit4:junit4]   2> 7213 T2889 oass.IndexSchema.readSchema Schema name=test
[junit4:junit4]   2> 7835 T2889 oass.OpenExchangeRatesOrgProvider.init Initialized with rates=open-exchange-rates.json, refreshInterval=1440.
[junit4:junit4]   2> 7846 T2889 oass.IndexSchema.readSchema default search field in schema is text
[junit4:junit4]   2> 7850 T2889 oass.IndexSchema.readSchema unique key field: id
[junit4:junit4]   2> 7862 T2889 oass.FileExchangeRateProvider.reload Reloading exchange rates from file currency.xml
[junit4:junit4]   2> 7867 T2889 oass.FileExchangeRateProvider.reload Reloading exchange rates from file currency.xml
[junit4:junit4]   2> 7871 T2889 oass.OpenExchangeRatesOrgProvider.reload Reloading exchange rates from open-exchange-rates.json
[junit4:junit4]   2> 7873 T2889 oass.OpenExchangeRatesOrgProvider.reload Reloading exchange rates from open-exchange-rates.json
[junit4:junit4]   2> 7874 T2889 oasc.SolrCore.<init> [collection1] Opening new SolrCore at /usr/home/hudson/hudson-slave/workspace/Lucene-Solr-Tests-4.x-Java6/solr/build/solr-core/test/J0/./org.apache.solr.cloud.SyncSliceTest-jetty2-1357607547254/collection1/, dataDir=./org.apache.solr.cloud.SyncSliceTest-1357607540510/jetty2/
[junit4:junit4]   2> 7874 T2889 oasc.JmxMonitoredMap.<init> JMX monitoring is enabled. Adding Solr mbeans to JMX Server: com.sun.jmx.mbeanserver.JmxMBeanServer@4f4b2f1a
[junit4:junit4]   2> 7875 T2889 oasc.SolrCore.initDirectoryFactory solr.NRTCachingDirectoryFactory
[junit4:junit4]   2> 7876 T2889 oasc.CachingDirectoryFactory.get return new directory for /usr/home/hudson/hudson-slave/workspace/Lucene-Solr-Tests-4.x-Java6/solr/build/solr-core/test/J0/./org.apache.solr.cloud.SyncSliceTest-1357607540510/jetty2 forceNew:false
[junit4:junit4]   2> 7876 T2889 oasc.CachingDirectoryFactory.close Releasing directory:/usr/home/hudson/hudson-slave/workspace/Lucene-Solr-Tests-4.x-Java6/solr/build/solr-core/test/J0/./org.apache.solr.cloud.SyncSliceTest-1357607540510/jetty2
[junit4:junit4]   2> 7877 T2889 oasc.SolrCore.getNewIndexDir New index directory detected: old=null new=./org.apache.solr.cloud.SyncSliceTest-1357607540510/jetty2/index/
[junit4:junit4]   2> 7877 T2889 oasc.SolrCore.initIndex WARNING [collection1] Solr index directory './org.apache.solr.cloud.SyncSliceTest-1357607540510/jetty2/index' doesn't exist. Creating new index...
[junit4:junit4]   2> 7878 T2889 oasc.CachingDirectoryFactory.get return new directory for /usr/home/hudson/hudson-slave/workspace/Lucene-Solr-Tests-4.x-Java6/solr/build/solr-core/test/J0/./org.apache.solr.cloud.SyncSliceTest-1357607540510/jetty2/index forceNew:false
[junit4:junit4]   2> 7884 T2889 oasc.SolrDeletionPolicy.onCommit SolrDeletionPolicy.onCommit: commits:num=1
[junit4:junit4]   2> 		commit{dir=RateLimitedDirectoryWrapper(NRTCachingDirectory(org.apache.lucene.store.NIOFSDirectory@/usr/home/hudson/hudson-slave/workspace/Lucene-Solr-Tests-4.x-Java6/solr/build/solr-core/test/J0/org.apache.solr.cloud.SyncSliceTest-1357607540510/jetty2/index lockFactory=org.apache.lucene.store.NativeFSLockFactory@73644333; maxCacheMB=48.0 maxMergeSizeMB=4.0)),segFN=segments_1,generation=1,filenames=[segments_1]
[junit4:junit4]   2> 7884 T2889 oasc.SolrDeletionPolicy.updateCommits newest commit = 1[segments_1]
[junit4:junit4]   2> 7885 T2889 oasc.CachingDirectoryFactory.close Releasing directory:/usr/home/hudson/hudson-slave/workspace/Lucene-Solr-Tests-4.x-Java6/solr/build/solr-core/test/J0/./org.apache.solr.cloud.SyncSliceTest-1357607540510/jetty2/index
[junit4:junit4]   2> 7886 T2889 oasc.SolrCore.initWriters created xml: solr.XMLResponseWriter
[junit4:junit4]   2> 7887 T2889 oasup.UpdateRequestProcessorChain.init inserting DistributedUpdateProcessorFactory into updateRequestProcessorChain "dedupe"
[junit4:junit4]   2> 7888 T2889 oasup.UpdateRequestProcessorChain.init inserting DistributedUpdateProcessorFactory into updateRequestProcessorChain "dedupe-allfields"
[junit4:junit4]   2> 7888 T2889 oasup.UpdateRequestProcessorChain.init inserting DistributedUpdateProcessorFactory into updateRequestProcessorChain "stored_sig"
[junit4:junit4]   2> 7888 T2889 oasup.UpdateRequestProcessorChain.init inserting DistributedUpdateProcessorFactory into updateRequestProcessorChain "uniq-fields"
[junit4:junit4]   2> 7889 T2889 oasup.UpdateRequestProcessorChain.init inserting DistributedUpdateProcessorFactory into updateRequestProcessorChain "distrib-dup-test-chain-implicit"
[junit4:junit4]   2> 7889 T2889 oasc.RequestHandlers.initHandlersFromConfig adding lazy requestHandler: solr.ReplicationHandler
[junit4:junit4]   2> 7889 T2889 oasc.RequestHandlers.initHandlersFromConfig created /replication: solr.ReplicationHandler
[junit4:junit4]   2> 7890 T2889 oasc.RequestHandlers.initHandlersFromConfig created standard: solr.StandardRequestHandler
[junit4:junit4]   2> 7890 T2889 oasc.RequestHandlers.initHandlersFromConfig created /get: solr.RealTimeGetHandler
[junit4:junit4]   2> 7891 T2889 oasc.RequestHandlers.initHandlersFromConfig created dismax: solr.SearchHandler
[junit4:junit4]   2> 7891 T2889 oasc.RequestHandlers.initHandlersFromConfig created mock: org.apache.solr.core.MockQuerySenderListenerReqHandler
[junit4:junit4]   2> 7892 T2889 oasc.RequestHandlers.initHandlersFromConfig created /admin/: org.apache.solr.handler.admin.AdminHandlers
[junit4:junit4]   2> 7892 T2889 oasc.RequestHandlers.initHandlersFromConfig created defaults: solr.StandardRequestHandler
[junit4:junit4]   2> 7893 T2889 oasc.RequestHandlers.initHandlersFromConfig adding lazy requestHandler: solr.StandardRequestHandler
[junit4:junit4]   2> 7893 T2889 oasc.RequestHandlers.initHandlersFromConfig created lazy: solr.StandardRequestHandler
[junit4:junit4]   2> 7893 T2889 oasc.RequestHandlers.initHandlersFromConfig created /update: solr.UpdateRequestHandler
[junit4:junit4]   2> 7894 T2889 oasc.RequestHandlers.initHandlersFromConfig created /terms: org.apache.solr.handler.component.SearchHandler
[junit4:junit4]   2> 7894 T2889 oasc.RequestHandlers.initHandlersFromConfig created spellCheckCompRH: org.apache.solr.handler.component.SearchHandler
[junit4:junit4]   2> 7895 T2889 oasc.RequestHandlers.initHandlersFromConfig created spellCheckCompRH_Direct: org.apache.solr.handler.component.SearchHandler
[junit4:junit4]   2> 7895 T2889 oasc.RequestHandlers.initHandlersFromConfig created spellCheckWithWordbreak: org.apache.solr.handler.component.SearchHandler
[junit4:junit4]   2> 7896 T2889 oasc.RequestHandlers.initHandlersFromConfig created spellCheckWithWordbreak_Direct: org.apache.solr.handler.component.SearchHandler
[junit4:junit4]   2> 7896 T2889 oasc.RequestHandlers.initHandlersFromConfig created spellCheckCompRH1: org.apache.solr.handler.component.SearchHandler
[junit4:junit4]   2> 7897 T2889 oasc.RequestHandlers.initHandlersFromConfig created mltrh: org.apache.solr.handler.component.SearchHandler
[junit4:junit4]   2> 7897 T2889 oasc.RequestHandlers.initHandlersFromConfig created tvrh: org.apache.solr.handler.component.SearchHandler
[junit4:junit4]   2> 7898 T2889 oasc.RequestHandlers.initHandlersFromConfig created /mlt: solr.MoreLikeThisHandler
[junit4:junit4]   2> 7898 T2889 oasc.RequestHandlers.initHandlersFromConfig created /debug/dump: solr.DumpRequestHandler
[junit4:junit4]   2> 7907 T2889 oashl.XMLLoader.init xsltCacheLifetimeSeconds=60
[junit4:junit4]   2> 7914 T2889 oasc.SolrCore.initDeprecatedSupport WARNING solrconfig.xml uses deprecated <admin/gettableFiles>, Please update your config to use the ShowFileRequestHandler.
[junit4:junit4]   2> 7918 T2889 oasc.SolrCore.initDeprecatedSupport WARNING adding ShowFileRequestHandler with hidden files: [SCHEMA.XML, OLD_SYNONYMS.TXT, STOPWORDS.TXT, PROTWORDS.TXT, OPEN-EXCHANGE-RATES.JSON, SYNONYMS.TXT, CURRENCY.XML, MAPPING-ISOLATIN1ACCENT.TXT]
[junit4:junit4]   2> 7922 T2889 oasc.CachingDirectoryFactory.close Releasing directory:/usr/home/hudson/hudson-slave/workspace/Lucene-Solr-Tests-4.x-Java6/solr/build/solr-core/test/J0/./org.apache.solr.cloud.SyncSliceTest-1357607540510/jetty2
[junit4:junit4]   2> 7923 T2889 oass.SolrIndexSearcher.<init> Opening Searcher@61f80d7f main
[junit4:junit4]   2> 7924 T2889 oasu.CommitTracker.<init> Hard AutoCommit: disabled
[junit4:junit4]   2> 7924 T2889 oasu.CommitTracker.<init> Soft AutoCommit: disabled
[junit4:junit4]   2> 7925 T2889 oashc.SpellCheckComponent.inform Initializing spell checkers
[junit4:junit4]   2> 8000 T2889 oass.DirectSolrSpellChecker.init init: {name=direct,classname=DirectSolrSpellChecker,field=lowerfilt,minQueryLength=3}
[junit4:junit4]   2> 8239 T2855 oascc.ZkStateReader.updateClusterState Updating cloud state from ZooKeeper... 
[junit4:junit4]   2> 8240 T2855 oasc.Overseer$ClusterStateUpdater.updateState Update state numShards=1 message={
[junit4:junit4]   2> 	  "operation":"state",
[junit4:junit4]   2> 	  "numShards":"1",
[junit4:junit4]   2> 	  "shard":"shard1",
[junit4:junit4]   2> 	  "roles":null,
[junit4:junit4]   2> 	  "state":"active",
[junit4:junit4]   2> 	  "core":"collection1",
[junit4:junit4]   2> 	  "collection":"collection1",
[junit4:junit4]   2> 	  "node_name":"127.0.0.1:23568__i",
[junit4:junit4]   2> 	  "base_url":"http://127.0.0.1:23568/_i"}
[junit4:junit4]   2> 8293 T2890 oasc.SolrCore.registerSearcher [collection1] Registered new searcher Searcher@61f80d7f main{StandardDirectoryReader(segments_1:1)}
[junit4:junit4]   2> 8299 T2889 oasc.ZkController.publish publishing core=collection1 state=down
[junit4:junit4]   2> 8299 T2889 oasc.ZkController.publish numShards not found on descriptor - reading it from system property
[junit4:junit4]   2> 8301 T2855 oasc.Overseer$ClusterStateUpdater.updateState Update state numShards=1 message={
[junit4:junit4]   2> 	  "operation":"state",
[junit4:junit4]   2> 	  "numShards":"1",
[junit4:junit4]   2> 	  "shard":null,
[junit4:junit4]   2> 	  "roles":null,
[junit4:junit4]   2> 	  "state":"down",
[junit4:junit4]   2> 	  "core":"collection1",
[junit4:junit4]   2> 	  "collection":"collection1",
[junit4:junit4]   2> 	  "node_name":"127.0.0.1:65097__i",
[junit4:junit4]   2> 	  "base_url":"http://127.0.0.1:65097/_i"}
[junit4:junit4]   2> 8301 T2855 oasc.Overseer$ClusterStateUpdater.updateState Collection already exists with numShards=1
[junit4:junit4]   2> 8302 T2855 oasc.Overseer$ClusterStateUpdater.updateState Assigning new node to shard shard=shard1
[junit4:junit4]   2> 8319 T2873 oascc.ZkStateReader$2.process A cluster state change: WatchedEvent state:SyncConnected type:NodeDataChanged path:/clusterstate.json, has occurred - updating... (live nodes size: 3)
[junit4:junit4]   2> 8319 T2854 oascc.ZkStateReader$2.process A cluster state change: WatchedEvent state:SyncConnected type:NodeDataChanged path:/clusterstate.json, has occurred - updating... (live nodes size: 3)
[junit4:junit4]   2> 8319 T2860 oascc.ZkStateReader$2.process A cluster state change: WatchedEvent state:SyncConnected type:NodeDataChanged path:/clusterstate.json, has occurred - updating... (live nodes size: 3)
[junit4:junit4]   2> 8320 T2888 oascc.ZkStateReader$2.process A cluster state change: WatchedEvent state:SyncConnected type:NodeDataChanged path:/clusterstate.json, has occurred - updating... (live nodes size: 3)
[junit4:junit4]   2> 9301 T2889 oasc.CoreContainer.registerCore registering core: collection1
[junit4:junit4]   2> 9301 T2889 oasc.ZkController.register Register replica - core:collection1 address:http://127.0.0.1:65097/_i collection:collection1 shard:shard1
[junit4:junit4]   2> 9304 T2889 oasc.ZkController.register We are http://127.0.0.1:65097/_i/collection1/ and leader is http://127.0.0.1:23568/_i/collection1/
[junit4:junit4]   2> 9304 T2889 oasc.ZkController.register No LogReplay needed for core=collection1 baseURL=http://127.0.0.1:65097/_i
[junit4:junit4]   2> 9305 T2889 oasc.ZkController.checkRecovery Core needs to recover:collection1
[junit4:junit4]   2> 9305 T2889 oasu.DefaultSolrCoreState.doRecovery Running recovery - first canceling any ongoing recovery
[junit4:junit4]   2> ASYNC  NEW_CORE C192 name=collection1 org.apache.solr.core.SolrCore@16db2838 url=http://127.0.0.1:65097/_i/collection1 node=127.0.0.1:65097__i C192_STATE=coll:collection1 core:collection1 props:{shard=null, roles=null, state=down, core=collection1, collection=collection1, node_name=127.0.0.1:65097__i, base_url=http://127.0.0.1:65097/_i}
[junit4:junit4]   2> 9305 T2891 C192 P65097 oasc.RecoveryStrategy.run Starting recovery process.  core=collection1 recoveringAfterStartup=true
[junit4:junit4]   2> 9306 T2889 oascc.ZkStateReader.updateClusterState Updating cloud state from ZooKeeper... 
[junit4:junit4]   2> 9306 T2891 C192 P65097 oasc.RecoveryStrategy.doRecovery ###### startupVersions=[]
[junit4:junit4]   2> 9306 T2891 C192 P65097 oasc.ZkController.publish publishing core=collection1 state=recovering
[junit4:junit4]   2> 9306 T2891 C192 P65097 oasc.ZkController.publish numShards not found on descriptor - reading it from system property
[junit4:junit4]   2> 9306 T2832 oass.SolrDispatchFilter.init user.dir=/usr/home/hudson/hudson-slave/workspace/Lucene-Solr-Tests-4.x-Java6/solr/build/solr-core/test/J0
[junit4:junit4]   2> 9307 T2832 oass.SolrDispatchFilter.init SolrDispatchFilter.init() done
[junit4:junit4]   2> 9308 T2832 oascsi.HttpClientUtil.createClient Creating new http client, config:maxConnections=128&maxConnectionsPerHost=32&followRedirects=false
[junit4:junit4]   2> 9309 T2891 C192 P65097 oascsi.HttpClientUtil.createClient Creating new http client, config:maxConnections=128&maxConnectionsPerHost=32&followRedirects=false
[junit4:junit4]   2> 9491 T2832 oejs.Server.doStart jetty-8.1.8.v20121106
[junit4:junit4]   2> 9495 T2832 oejs.AbstractConnector.doStart Started SocketConnector@127.0.0.1:30066
[junit4:junit4]   2> 9495 T2832 oass.SolrDispatchFilter.init SolrDispatchFilter.init()
[junit4:junit4]   2> 9496 T2832 oasc.SolrResourceLoader.locateSolrHome JNDI not configured for solr (NoInitialContextEx)
[junit4:junit4]   2> 9496 T2832 oasc.SolrResourceLoader.locateSolrHome using system property solr.solr.home: /usr/home/hudson/hudson-slave/workspace/Lucene-Solr-Tests-4.x-Java6/solr/build/solr-core/test/J0/./org.apache.solr.cloud.SyncSliceTest-jetty3-1357607549834
[junit4:junit4]   2> 9496 T2832 oasc.CoreContainer$Initializer.initialize looking for solr.xml: /usr/home/hudson/hudson-slave/workspace/Lucene-Solr-Tests-4.x-Java6/solr/build/solr-core/test/J0/./org.apache.solr.cloud.SyncSliceTest-jetty3-1357607549834/solr.xml
[junit4:junit4]   2> 9497 T2832 oasc.CoreContainer.<init> New CoreContainer 805079258
[junit4:junit4]   2> 9497 T2832 oasc.CoreContainer.load Loading CoreContainer using Solr Home: '/usr/home/hudson/hudson-slave/workspace/Lucene-Solr-Tests-4.x-Java6/solr/build/solr-core/test/J0/./org.apache.solr.cloud.SyncSliceTest-jetty3-1357607549834/'
[junit4:junit4]   2> 9497 T2832 oasc.SolrResourceLoader.<init> new SolrResourceLoader for directory: '/usr/home/hudson/hudson-slave/workspace/Lucene-Solr-Tests-4.x-Java6/solr/build/solr-core/test/J0/./org.apache.solr.cloud.SyncSliceTest-jetty3-1357607549834/'
[junit4:junit4]   2> 9526 T2832 oashc.HttpShardHandlerFactory.getParameter Setting socketTimeout to: 60000
[junit4:junit4]   2> 9526 T2832 oashc.HttpShardHandlerFactory.getParameter Setting urlScheme to: http://
[junit4:junit4]   2> 9527 T2832 oashc.HttpShardHandlerFactory.getParameter Setting connTimeout to: 15000
[junit4:junit4]   2> 9527 T2832 oashc.HttpShardHandlerFactory.getParameter Setting maxConnectionsPerHost to: 20
[junit4:junit4]   2> 9527 T2832 oashc.HttpShardHandlerFactory.getParameter Setting corePoolSize to: 0
[junit4:junit4]   2> 9527 T2832 oashc.HttpShardHandlerFactory.getParameter Setting maximumPoolSize to: 2147483647
[junit4:junit4]   2> 9528 T2832 oashc.HttpShardHandlerFactory.getParameter Setting maxThreadIdleTime to: 5
[junit4:junit4]   2> 9528 T2832 oashc.HttpShardHandlerFactory.getParameter Setting sizeOfQueue to: -1
[junit4:junit4]   2> 9528 T2832 oashc.HttpShardHandlerFactory.getParameter Setting fairnessPolicy to: false
[junit4:junit4]   2> 9529 T2832 oascsi.HttpClientUtil.createClient Creating new http client, config:maxConnectionsPerHost=20&maxConnections=10000&socketTimeout=60000&connTimeout=15000&retry=false
[junit4:junit4]   2> 9542 T2832 oasc.CoreContainer.load Registering Log Listener
[junit4:junit4]   2> 9555 T2832 oasc.CoreContainer.initZooKeeper Zookeeper client=127.0.0.1:10161/solr
[junit4:junit4]   2> 9555 T2832 oasc.ZkController.checkChrootPath zkHost includes chroot
[junit4:junit4]   2> 9555 T2832 oaz.ZooKeeper.<init> Initiating client connection, connectString=127.0.0.1:10161 sessionTimeout=60000 watcher=org.apache.solr.common.cloud.ConnectionManager@704a1aa2
[junit4:junit4]   2> 9556 T2832 oascc.ConnectionManager.waitForConnected Waiting for client to connect to ZooKeeper
[junit4:junit4]   2> 9557 T2901 oaz.ClientCnxn$SendThread.logStartConnect Opening socket connection to server localhost/127.0.0.1:10161. Will not attempt to authenticate using SASL (access denied (javax.security.auth.AuthPermission getLoginConfiguration))
[junit4:junit4]   2> 9557 T2901 oaz.ClientCnxn$SendThread.primeConnection Socket connection established to localhost/127.0.0.1:10161, initiating session
[junit4:junit4]   2> 9558 T2834 oazs.NIOServerCnxnFactory.run Accepted socket connection from /140.211.11.196:26667
[junit4:junit4]   2> 9558 T2834 oazs.ZooKeeperServer.processConnectRequest Client attempting to establish new session at /140.211.11.196:26667
[junit4:junit4]   2> 9560 T2836 oazs.ZooKeeperServer.finishSessionInit Established session 0x13c17b717240009 with negotiated timeout 20000 for client /140.211.11.196:26667
[junit4:junit4]   2> 9560 T2901 oaz.ClientCnxn$SendThread.onConnected Session establishment complete on server localhost/127.0.0.1:10161, sessionid = 0x13c17b717240009, negotiated timeout = 20000
[junit4:junit4]   2> 9560 T2902 oascc.ConnectionManager.process Watcher org.apache.solr.common.cloud.ConnectionManager@704a1aa2 name:ZooKeeperConnection Watcher:127.0.0.1:10161 got event WatchedEvent state:SyncConnected type:None path:null path:null type:None
[junit4:junit4]   2> 9561 T2832 oascc.ConnectionManager.waitForConnected Client is connected to ZooKeeper
[junit4:junit4]   2> 9561 T2837 oazs.PrepRequestProcessor.pRequest2Txn Processed session termination for sessionid: 0x13c17b717240009
[junit4:junit4]   2> 9563 T2902 oaz.ClientCnxn$EventThread.run EventThread shut down
[junit4:junit4]   2> 9563 T2832 oaz.ZooKeeper.close Session: 0x13c17b717240009 closed
[junit4:junit4]   2> 9563 T2834 oazs.NIOServerCnxn.closeSock Closed socket connection for client /140.211.11.196:26667 which had sessionid 0x13c17b717240009
[junit4:junit4]   2> 9563 T2832 oascsi.HttpClientUtil.createClient Creating new http client, config:maxConnections=500&maxConnectionsPerHost=16&socketTimeout=60000&connTimeout=15000
[junit4:junit4]   2> 9570 T2832 oaz.ZooKeeper.<init> Initiating client connection, connectString=127.0.0.1:10161/solr sessionTimeout=30000 watcher=org.apache.solr.common.cloud.ConnectionManager@f9ad5f9
[junit4:junit4]   2> 9571 T2832 oascc.ConnectionManager.waitForConnected Waiting for client to connect to ZooKeeper
[junit4:junit4]   2> 9571 T2903 oaz.ClientCnxn$SendThread.logStartConnect Opening socket connection to server localhost/127.0.0.1:10161. Will not attempt to authenticate using SASL (access denied (javax.security.auth.AuthPermission getLoginConfiguration))
[junit4:junit4]   2> 9572 T2903 oaz.ClientCnxn$SendThread.primeConnection Socket connection established to localhost/127.0.0.1:10161, initiating session
[junit4:junit4]   2> 9572 T2834 oazs.NIOServerCnxnFactory.run Accepted socket connection from /140.211.11.196:19882
[junit4:junit4]   2> 9572 T2834 oazs.ZooKeeperServer.processConnectRequest Client attempting to establish new session at /140.211.11.196:19882
[junit4:junit4]   2> 9576 T2836 oazs.ZooKeeperServer.finishSessionInit Established session 0x13c17b71724000a with negotiated timeout 20000 for client /140.211.11.196:19882
[junit4:junit4]   2> 9576 T2903 oaz.ClientCnxn$SendThread.onConnected Session establishment complete on server localhost/127.0.0.1:10161, sessionid = 0x13c17b71724000a, negotiated timeout = 20000
[junit4:junit4]   2> 9577 T2904 oascc.ConnectionManager.process Watcher org.apache.solr.common.cloud.ConnectionManager@f9ad5f9 name:ZooKeeperConnection Watcher:127.0.0.1:10161/solr got event WatchedEvent state:SyncConnected type:None path:null path:null type:None
[junit4:junit4]   2> 9577 T2832 oascc.ConnectionManager.waitForConnected Client is connected to ZooKeeper
[junit4:junit4]   2> 9577 T2837 oazs.PrepRequestProcessor.pRequest Got user-level KeeperException when processing sessionid:0x13c17b71724000a type:create cxid:0x1 zxid:0x7e txntype:-1 reqpath:n/a Error Path:/solr/overseer Error:KeeperErrorCode = NodeExists for /solr/overseer
[junit4:junit4]   2> 9579 T2837 oazs.PrepRequestProcessor.pRequest Got user-level KeeperException when processing sessionid:0x13c17b71724000a type:create cxid:0x2 zxid:0x7f txntype:-1 reqpath:n/a Error Path:/solr/overseer Error:KeeperErrorCode = NodeExists for /solr/overseer
[junit4:junit4]   2> 9586 T2832 oasc.ZkController.createEphemeralLiveNode Register node as live in ZooKeeper:/live_nodes/127.0.0.1:30066__i
[junit4:junit4]   2> 9586 T2837 oazs.PrepRequestProcessor.pRequest Got user-level KeeperException when processing sessionid:0x13c17b71724000a type:delete cxid:0x4 zxid:0x80 txntype:-1 reqpath:n/a Error Path:/solr/live_nodes/127.0.0.1:30066__i Error:KeeperErrorCode = NoNode for /solr/live_nodes/127.0.0.1:30066__i
[junit4:junit4]   2> 9593 T2832 oascc.SolrZkClient.makePath makePath: /live_nodes/127.0.0.1:30066__i
[junit4:junit4]   2> 9595 T2854 oascc.ZkStateReader$2.process A cluster state change: WatchedEvent state:SyncConnected type:NodeChildrenChanged path:/live_nodes, has occurred - updating... (live nodes size: 3)
[junit4:junit4]   2> 9595 T2888 oascc.ZkStateReader$2.process A cluster state change: WatchedEvent state:SyncConnected type:NodeChildrenChanged path:/live_nodes, has occurred - updating... (live nodes size: 3)
[junit4:junit4]   2> 9595 T2860 oascc.ZkStateReader$2.process A cluster state change: WatchedEvent state:SyncConnected type:NodeChildrenChanged path:/live_nodes, has occurred - updating... (live nodes size: 3)
[junit4:junit4]   2> 9595 T2873 oascc.ZkStateReader$3.process Updating live nodes... (4)
[junit4:junit4]   2> 9596 T2873 oascc.ZkStateReader$2.process A cluster state change: WatchedEvent state:SyncConnected type:NodeChildrenChanged path:/live_nodes, has occurred - updating... (live nodes size: 4)
[junit4:junit4]   2> 9596 T2854 oascc.ZkStateReader$3.process Updating live nodes... (4)
[junit4:junit4]   2> 9602 T2888 oascc.ZkStateReader$3.process Updating live nodes... (4)
[junit4:junit4]   2> 9602 T2860 oascc.ZkStateReader$3.process Updating live nodes... (4)
[junit4:junit4]   2> 9603 T2832 oascc.ZkStateReader.createClusterStateWatchersAndUpdate Updating cluster state from ZooKeeper... 
[junit4:junit4]   2> 9608 T2905 oasc.CoreContainer.create Creating SolrCore 'collection1' using instanceDir: /usr/home/hudson/hudson-slave/workspace/Lucene-Solr-Tests-4.x-Java6/solr/build/solr-core/test/J0/./org.apache.solr.cloud.SyncSliceTest-jetty3-1357607549834/collection1
[junit4:junit4]   2> 9608 T2905 oasc.ZkController.createCollectionZkNode Check for collection zkNode:collection1
[junit4:junit4]   2> 9608 T2905 oasc.ZkController.createCollectionZkNode Collection zkNode exists
[junit4:junit4]   2> 9609 T2905 oasc.ZkController.readConfigName Load collection config from:/collections/collection1
[junit4:junit4]   2> 9610 T2905 oasc.SolrResourceLoader.<init> new SolrResourceLoader for directory: '/usr/home/hudson/hudson-slave/workspace/Lucene-Solr-Tests-4.x-Java6/solr/build/solr-core/test/J0/./org.apache.solr.cloud.SyncSliceTest-jetty3-1357607549834/collection1/'
[junit4:junit4]   2> 9611 T2905 oasc.SolrResourceLoader.replaceClassLoader Adding 'file:/usr/home/hudson/hudson-slave/workspace/Lucene-Solr-Tests-4.x-Java6/solr/build/solr-core/test/J0/org.apache.solr.cloud.SyncSliceTest-jetty3-1357607549834/collection1/lib/classes/' to classloader
[junit4:junit4]   2> 9611 T2905 oasc.SolrResourceLoader.replaceClassLoader Adding 'file:/usr/home/hudson/hudson-slave/workspace/Lucene-Solr-Tests-4.x-Java6/solr/build/solr-core/test/J0/org.apache.solr.cloud.SyncSliceTest-jetty3-1357607549834/collection1/lib/README' to classloader
[junit4:junit4]   2> 9650 T2905 oasc.SolrConfig.<init> Using Lucene MatchVersion: LUCENE_41
[junit4:junit4]   2> 9698 T2905 oasc.SolrConfig.<init> Loaded SolrConfig: solrconfig.xml
[junit4:junit4]   2> 9799 T2905 oass.IndexSchema.readSchema Reading Solr Schema
[junit4:junit4]   2> 9803 T2905 oass.IndexSchema.readSchema Schema name=test
[junit4:junit4]   2> 9826 T2855 oascc.ZkStateReader.updateClusterState Updating cloud state from ZooKeeper... 
[junit4:junit4]   2> 9827 T2855 oasc.Overseer$ClusterStateUpdater.updateState Update state numShards=1 message={
[junit4:junit4]   2> 	  "operation":"state",
[junit4:junit4]   2> 	  "numShards":"1",
[junit4:junit4]   2> 	  "shard":"shard1",
[junit4:junit4]   2> 	  "roles":null,
[junit4:junit4]   2> 	  "state":"recovering",
[junit4:junit4]   2> 	  "core":"collection1",
[junit4:junit4]   2> 	  "collection":"collection1",
[junit4:junit4]   2> 	  "node_name":"127.0.0.1:65097__i",
[junit4:junit4]   2> 	  "base_url":"http://127.0.0.1:65097/_i"}
[junit4:junit4]   2> 9840 T2860 oascc.ZkStateReader$2.process A cluster state change: WatchedEvent state:SyncConnected type:NodeDataChanged path:/clusterstate.json, has occurred - updating... (live nodes size: 4)
[junit4:junit4]   2> 9840 T2904 oascc.ZkStateReader$2.process A cluster state change: WatchedEvent state:SyncConnected type:NodeDataChanged path:/clusterstate.json, has occurred - updating... (live nodes size: 4)
[junit4:junit4]   2> 9840 T2873 oascc.ZkStateReader$2.process A cluster state change: WatchedEvent state:SyncConnected type:NodeDataChanged path:/clusterstate.json, has occurred - updating... (live nodes size: 4)
[junit4:junit4]   2> 9840 T2888 oascc.ZkStateReader$2.process A cluster state change: WatchedEvent state:SyncConnected type:NodeDataChanged path:/clusterstate.json, has occurred - updating... (live nodes size: 4)
[junit4:junit4]   2> 9840 T2854 oascc.ZkStateReader$2.process A cluster state change: WatchedEvent state:SyncConnected type:NodeDataChanged path:/clusterstate.json, has occurred - updating... (live nodes size: 4)
[junit4:junit4]   2> 10219 T2905 oass.OpenExchangeRatesOrgProvider.init Initialized with rates=open-exchange-rates.json, refreshInterval=1440.
[junit4:junit4]   2> 10226 T2905 oass.IndexSchema.readSchema default search field in schema is text
[junit4:junit4]   2> 10229 T2905 oass.IndexSchema.readSchema unique key field: id
[junit4:junit4]   2> 10237 T2905 oass.FileExchangeRateProvider.reload Reloading exchange rates from file currency.xml
[junit4:junit4]   2> 10240 T2905 oass.FileExchangeRateProvider.reload Reloading exchange rates from file currency.xml
[junit4:junit4]   2> 10243 T2905 oass.OpenExchangeRatesOrgProvider.reload Reloading exchange rates from open-exchange-rates.json
[junit4:junit4]   2> 10244 T2905 oass.OpenExchangeRatesOrgProvider.reload Reloading exchange rates from open-exchange-rates.json
[junit4:junit4]   2> 10245 T2905 oasc.SolrCore.<init> [collection1] Opening new SolrCore at /usr/home/hudson/hudson-slave/workspace/Lucene-Solr-Tests-4.x-Java6/solr/build/solr-core/test/J0/./org.apache.solr.cloud.SyncSliceTest-jetty3-1357607549834/collection1/, dataDir=./org.apache.solr.cloud.SyncSliceTest-1357607540510/jetty3/
[junit4:junit4]   2> 10245 T2905 oasc.JmxMonitoredMap.<init> JMX monitoring is enabled. Adding Solr mbeans to JMX Server: com.sun.jmx.mbeanserver.JmxMBeanServer@4f4b2f1a
[junit4:junit4]   2> 10245 T2905 oasc.SolrCore.initDirectoryFactory solr.NRTCachingDirectoryFactory
[junit4:junit4]   2> 10246 T2905 oasc.CachingDirectoryFactory.get return new directory for /usr/home/hudson/hudson-slave/workspace/Lucene-Solr-Tests-4.x-Java6/solr/build/solr-core/test/J0/./org.apache.solr.cloud.SyncSliceTest-1357607540510/jetty3 forceNew:false
[junit4:junit4]   2> 10246 T2905 oasc.CachingDirectoryFactory.close Releasing directory:/usr/home/hudson/hudson-slave/workspace/Lucene-Solr-Tests-4.x-Java6/solr/build/solr-core/test/J0/./org.apache.solr.cloud.SyncSliceTest-1357607540510/jetty3
[junit4:junit4]   2> 10246 T2905 oasc.SolrCore.getNewIndexDir New index directory detected: old=null new=./org.apache.solr.cloud.SyncSliceTest-1357607540510/jetty3/index/
[junit4:junit4]   2> 10247 T2905 oasc.SolrCore.initIndex WARNING [collection1] Solr index directory './org.apache.solr.cloud.SyncSliceTest-1357607540510/jetty3/index' doesn't exist. Creating new index...
[junit4:junit4]   2> 10247 T2905 oasc.CachingDirectoryFactory.get return new directory for /usr/home/hudson/hudson-slave/workspace/Lucene-Solr-Tests-4.x-Java6/solr/build/solr-core/test/J0/./org.apache.solr.cloud.SyncSliceTest-1357607540510/jetty3/index forceNew:false
[junit4:junit4]   2> 10258 T2905 oasc.SolrDeletionPolicy.onCommit SolrDeletionPolicy.onCommit: commits:num=1
[junit4:junit4]   2> 		commit{dir=RateLimitedDirectoryWrapper(NRTCachingDirectory(org.apache.lucene.store.NIOFSDirectory@/usr/home/hudson/hudson-slave/workspace/Lucene-Solr-Tests-4.x-Java6/solr/build/solr-core/test/J0/org.apache.solr.cloud.SyncSliceTest-1357607540510/jetty3/index lockFactory=org.apache.lucene.store.NativeFSLockFactory@156a8d37; maxCacheMB=48.0 maxMergeSizeMB=4.0)),segFN=segments_1,generation=1,filenames=[segments_1]
[junit4:junit4]   2> 10258 T2905 oasc.SolrDeletionPolicy.updateCommits newest commit = 1[segments_1]
[junit4:junit4]   2> 10259 T2905 oasc.CachingDirectoryFactory.close Releasing directory:/usr/home/hudson/hudson-slave/workspace/Lucene-Solr-Tests-4.x-Java6/solr/build/solr-core/test/J0/./org.apache.solr.cloud.SyncSliceTest-1357607540510/jetty3/index
[junit4:junit4]   2> 10259 T2905 oasc.SolrCore.initWriters created xml: solr.XMLResponseWriter
[junit4:junit4]   2> 10260 T2905 oasup.UpdateRequestProcessorChain.init inserting DistributedUpdateProcessorFactory into updateRequestProcessorChain "dedupe"
[junit4:junit4]   2> 10260 T2905 oasup.UpdateRequestProcessorChain.init inserting DistributedUpdateProcessorFactory into updateRequestProcessorChain "dedupe-allfields"
[junit4:junit4]   2> 10261 T2905 oasup.UpdateRequestProcessorChain.init inserting DistributedUpdateProcessorFactory into updateRequestProcessorChain "stored_sig"
[junit4:junit4]   2> 10261 T2905 oasup.UpdateRequestProcessorChain.init inserting DistributedUpdateProcessorFactory into updateRequestProcessorChain "uniq-fields"
[junit4:junit4]   2> 10261 T2905 oasup.UpdateRequestProcessorChain.init inserting DistributedUpdateProcessorFactory into updateRequestProcessorChain "distrib-dup-test-chain-implicit"
[junit4:junit4]   2> 10261 T2905 oasc.RequestHandlers.initHandlersFromConfig adding lazy requestHandler: solr.ReplicationHandler
[junit4:junit4]   2> 10262 T2905 oasc.RequestHandlers.initHandlersFromConfig created /replication: solr.ReplicationHandler
[junit4:junit4]   2> 10262 T2905 oasc.RequestHandlers.initHandlersFromConfig created standard: solr.StandardRequestHandler
[junit4:junit4]   2> 10262 T2905 oasc.RequestHandlers.initHandlersFromConfig created /get: solr.RealTimeGetHandler
[junit4:junit4]   2> 10263 T2905 oasc.RequestHandlers.initHandlersFromConfig created dismax: solr.SearchHandler
[junit4:junit4]   2> 10263 T2905 oasc.RequestHandlers.initHandlersFromConfig created mock: org.apache.solr.core.MockQuerySenderListenerReqHandler
[junit4:junit4]   2> 10263 T2905 oasc.RequestHandlers.initHandlersFromConfig created /admin/: org.apache.solr.handler.admin.AdminHandlers
[junit4:junit4]   2> 10264 T2905 oasc.RequestHandlers.initHandlersFromConfig created defaults: solr.StandardRequestHandler
[junit4:junit4]   2> 10264 T2905 oasc.RequestHandlers.initHandlersFromConfig adding lazy requestHandler: solr.StandardRequestHandler
[junit4:junit4]   2> 10264 T2905 oasc.RequestHandlers.initHandlersFromConfig created lazy: solr.StandardRequestHandler
[junit4:junit4]   2> 10264 T2905 oasc.RequestHandlers.initHandlersFromConfig created /update: solr.UpdateRequestHandler
[junit4:junit4]   2> 10265 T2905 oasc.RequestHandlers.initHandlersFromConfig created /terms: org.apache.solr.handler.component.SearchHandler
[junit4:junit4]   2> 10265 T2905 oasc.RequestHandlers.initHandlersFromConfig created spellCheckCompRH: org.apache.solr.handler.component.SearchHandler
[junit4:junit4]   2> 10265 T2905 oasc.RequestHandlers.initHandlersFromConfig created spellCheckCompRH_Direct: org.apache.solr.handler.component.SearchHandler
[junit4:junit4]   2> 10266 T2905 oasc.RequestHandlers.initHandlersFromConfig created spellCheckWithWordbreak: org.apache.solr.handler.component.SearchHandler
[junit4:junit4]   2> 10266 T2905 oasc.RequestHandlers.initHandlersFromConfig created spellCheckWithWordbreak_Direct: org.apache.solr.handler.component.SearchHandler
[junit4:junit4]   2> 10266 T2905 oasc.RequestHandlers.initHandlersFromConfig created spellCheckCompRH1: org.apache.solr.handler.component.SearchHandler
[junit4:junit4]   2> 10267 T2905 oasc.RequestHandlers.initHandlersFromConfig created mltrh: org.apache.solr.handler.component.SearchHandler
[junit4:junit4]   2> 10267 T2905 oasc.RequestHandlers.initHandlersFromConfig created tvrh: org.apache.solr.handler.component.SearchHandler
[junit4:junit4]   2> 10267 T2905 oasc.RequestHandlers.initHandlersFromConfig created /mlt: solr.MoreLikeThisHandler
[junit4:junit4]   2> 10268 T2905 oasc.RequestHandlers.initHandlersFromConfig created /debug/dump: solr.DumpRequestHandler
[junit4:junit4]   2> 10272 T2905 oashl.XMLLoader.init xsltCacheLifetimeSeconds=60
[junit4:junit4]   2> 10275 T2905 oasc.SolrCore.initDeprecatedSupport WARNING solrconfig.xml uses deprecated <admin/gettableFiles>, Please update your config to use the ShowFileRequestHandler.
[junit4:junit4]   2> 10276 T2905 oasc.SolrCore.initDeprecatedSupport WARNING adding ShowFileRequestHandler with hidden files: [SCHEMA.XML, OLD_SYNONYMS.TXT, STOPWORDS.TXT, PROTWORDS.TXT, OPEN-EXCHANGE-RATES.JSON, SYNONYMS.TXT, CURRENCY.XML, MAPPING-ISOLATIN1ACCENT.TXT]
[junit4:junit4]   2> 10277 T2905 oasc.CachingDirectoryFactory.close Releasing directory:/usr/home/hudson/hudson-slave/workspace/Lucene-Solr-Tests-4.x-Java6/solr/build/solr-core/test/J0/./org.apache.solr.cloud.SyncSliceTest-1357607540510/jetty3
[junit4:junit4]   2> 10279 T2905 oass.SolrIndexSearcher.<init> Opening Searcher@64d703e main
[junit4:junit4]   2> 10279 T2905 oasu.CommitTracker.<init> Hard AutoCommit: disabled
[junit4:junit4]   2> 10279 T2905 oasu.CommitTracker.<init> Soft AutoCommit: disabled
[junit4:junit4]   2> 10280 T2905 oashc.SpellCheckComponent.inform Initializing spell checkers
[junit4:junit4]   2> 10297 T2905 oass.DirectSolrSpellChecker.init init: {name=direct,classname=DirectSolrSpellChecker,field=lowerfilt,minQueryLength=3}
[junit4:junit4]   2> 10361 T2906 oasc.SolrCore.registerSearcher [collection1] Registered new searcher Searcher@64d703e main{StandardDirectoryReader(segments_1:1)}
[junit4:junit4]   2> 10365 T2905 oasc.ZkController.publish publishing core=collection1 state=down
[junit4:junit4]   2> 10365 T2905 oasc.ZkController.publish numShards not found on descriptor - reading it from system property
[junit4:junit4]   2> 11344 T2855 oascc.ZkStateReader.updateClusterState Updating cloud state from ZooKeeper... 
[junit4:junit4]   2> 11345 T2855 oasc.Overseer$ClusterStateUpdater.updateState Update state numShards=1 message={
[junit4:junit4]   2> 	  "operation":"state",
[junit4:junit4]   2> 	  "numShards":"1",
[junit4:junit4]   2> 	  "shard":null,
[junit4:junit4]   2> 	  "roles":null,
[junit4:junit4]   2> 	  "state":"down",
[junit4:junit4]   2> 	  "core":"collection1",
[junit4:junit4]   2> 	  "collection":"collection1",
[junit4:junit4]   2> 	  "node_name":"127.0.0.1:30066__i",
[junit4:junit4]   2> 	  "base_url":"http://127.0.0.1:30066/_i"}
[junit4:junit4]   2> 11345 T2855 oasc.Overseer$ClusterStateUpdater.updateState Collection already exists with numShards=1
[junit4:junit4]   2> 11345 T2855 oasc.Overseer$ClusterStateUpdater.updateState Assigning new node to shard shard=shard1
[junit4:junit4]   2> 11361 T2873 oascc.ZkStateReader$2.process A cluster state change: WatchedEvent state:SyncConnected type:NodeDataChanged path:/clusterstate.json, has occurred - updating... (live nodes size: 4)
[junit4:junit4]   2> 11361 T2904 oascc.ZkStateReader$2.process A cluster state change: WatchedEvent state:SyncConnected type:NodeDataChanged path:/clusterstate.json, has occurred - updating... (live nodes size: 4)
[junit4:junit4]   2> 11361 T2888 oascc.ZkStateReader$2.process A cluster state change: WatchedEvent state:SyncConnected type:NodeDataChanged path:/clusterstate.json, has occurred - updating... (live nodes size: 4)
[junit4:junit4]   2> 11361 T2854 oascc.ZkStateReader$2.process A cluster state change: WatchedEvent state:SyncConnected type:NodeDataChanged path:/clusterstate.json, has occurred - updating... (live nodes size: 4)
[junit4:junit4]   2> 11361 T2860 oascc.ZkStateReader$2.process A cluster state change: WatchedEvent state:SyncConnected type:NodeDataChanged path:/clusterstate.json, has occurred - updating... (live nodes size: 4)
[junit4:junit4]   2> 11372 T2905 oasc.CoreContainer.registerCore registering core: collection1
[junit4:junit4]   2> 11372 T2905 oasc.ZkController.register Register replica - core:collection1 address:http://127.0.0.1:30066/_i collection:collection1 shard:shard1
[junit4:junit4]   2> 11374 T2905 oasc.ZkController.register We are http://127.0.0.1:30066/_i/collection1/ and leader is http://127.0.0.1:23568/_i/collection1/
[junit4:junit4]   2> 11374 T2905 oasc.ZkController.register No LogReplay needed for core=collection1 baseURL=http://127.0.0.1:30066/_i
[junit4:junit4]   2> 11374 T2905 oasc.ZkController.checkRecovery Core needs to recover:collection1
[junit4:junit4]   2> 11374 T2905 oasu.DefaultSolrCoreState.doRecovery Running recovery - first canceling any ongoing recovery
[junit4:junit4]   2> ASYNC  NEW_CORE C193 name=collection1 org.apache.solr.core.SolrCore@1101a3b0 url=http://127.0.0.1:30066/_i/collection1 node=127.0.0.1:30066__i C193_STATE=coll:collection1 core:collection1 props:{shard=null, roles=null, state=down, core=collection1, collection=collection1, node_name=127.0.0.1:30066__i, base_url=http://127.0.0.1:30066/_i}
[junit4:junit4]   2> 11375 T2907 C193 P30066 oasc.RecoveryStrategy.run Starting recovery process.  core=collection1 recoveringAfterStartup=true
[junit4:junit4]   2> 11375 T2905 oascc.ZkStateReader.updateClusterState Updating cloud state from ZooKeeper... 
[junit4:junit4]   2> 11375 T2907 C193 P30066 oasc.RecoveryStrategy.doRecovery ###### startupVersions=[]
[junit4:junit4]   2> 11376 T2907 C193 P30066 oasc.ZkController.publish publishing core=collection1 state=recovering
[junit4:junit4]   2> 11376 T2907 C193 P30066 oasc.ZkController.publish numShards not found on descriptor - reading it from system property
[junit4:junit4]   2> 11376 T2832 oass.SolrDispatchFilter.init user.dir=/usr/home/hudson/hudson-slave/workspace/Lucene-Solr-Tests-4.x-Java6/solr/build/solr-core/test/J0
[junit4:junit4]   2> 11377 T2832 oass.SolrDispatchFilter.init SolrDispatchFilter.init() done
[junit4:junit4]   2> 11377 T2907 C193 P30066 oascsi.HttpClientUtil.createClient Creating new http client, config:maxConnections=128&maxConnectionsPerHost=32&followRedirects=false
[junit4:junit4]   2> 11377 T2832 oascsi.HttpClientUtil.createClient Creating new http client, config:maxConnections=128&maxConnectionsPerHost=32&followRedirects=false
[junit4:junit4]   2> 11562 T2832 oejs.Server.doStart jetty-8.1.8.v20121106
[junit4:junit4]   2> 11565 T2832 oejs.AbstractConnector.doStart Started SocketConnector@127.0.0.1:28439
[junit4:junit4]   2> 11566 T2832 oass.SolrDispatchFilter.init SolrDispatchFilter.init()
[junit4:junit4]   2> 11567 T2832 oasc.SolrResourceLoader.locateSolrHome JNDI not configured for solr (NoInitialContextEx)
[junit4:junit4]   2> 11568 T2832 oasc.SolrResourceLoader.locateSolrHome using system property solr.solr.home: /usr/home/hudson/hudson-slave/workspace/Lucene-Solr-Tests-4.x-Java6/solr/build/solr-core/test/J0/./org.apache.solr.cloud.SyncSliceTest-jetty4-1357607551906
[junit4:junit4]   2> 11568 T2832 oasc.CoreContainer$Initializer.initialize looking for solr.xml: /usr/home/hudson/hudson-slave/workspace/Lucene-Solr-Tests-4.x-Java6/solr/build/solr-core/test/J0/./org.apache.solr.cloud.SyncSliceTest-jetty4-1357607551906/solr.xml
[junit4:junit4]   2> 11569 T2832 oasc.CoreContainer.<init> New CoreContainer 1031973601
[junit4:junit4]   2> 11570 T2832 oasc.CoreContainer.load Loading CoreContainer using Solr Home: '/usr/home/hudson/hudson-slave/workspace/Lucene-Solr-Tests-4.x-Java6/solr/build/solr-core/test/J0/./org.apache.solr.cloud.SyncSliceTest-jetty4-1357607551906/'
[junit4:junit4]   2> 11571 T2832 oasc.SolrResourceLoader.<init> new SolrResourceLoader for directory: '/usr/home/hudson/hudson-slave/workspace/Lucene-Solr-Tests-4.x-Java6/solr/build/solr-core/test/J0/./org.apache.solr.cloud.SyncSliceTest-jetty4-1357607551906/'
[junit4:junit4]   2> 11638 T2832 oashc.HttpShardHandlerFactory.getParameter Setting socketTimeout to: 60000
[junit4:junit4]   2> 11639 T2832 oashc.HttpShardHandlerFactory.getParameter Setting urlScheme to: http://
[junit4:junit4]   2> 11640 T2832 oashc.HttpShardHandlerFactory.getParameter Setting connTimeout to: 15000
[junit4:junit4]   2> 11640 T2832 oashc.HttpShardHandlerFactory.getParameter Setting maxConnectionsPerHost to: 20
[junit4:junit4]   2> 11641 T2832 oashc.HttpShardHandlerFactory.getParameter Setting corePoolSize to: 0
[junit4:junit4]   2> 11642 T2832 oashc.HttpShardHandlerFactory.getParameter Setting maximumPoolSize to: 2147483647
[junit4:junit4]   2> 11642 T2832 oashc.HttpShardHandlerFactory.getParameter Setting maxThreadIdleTime to: 5
[junit4:junit4]   2> 11643 T2832 oashc.HttpShardHandlerFactory.getParameter Setting sizeOfQueue to: -1
[junit4:junit4]   2> 11644 T2832 oashc.HttpShardHandlerFactory.getParameter Setting fairnessPolicy to: false
[junit4:junit4]   2> 11644 T2832 oascsi.HttpClientUtil.createClient Creating new http client, config:maxConnectionsPerHost=20&maxConnections=10000&socketTimeout=60000&connTimeout=15000&retry=false
[junit4:junit4]   2> 11677 T2832 oasc.CoreContainer.load Registering Log Listener
[junit4:junit4]   2> 11707 T2832 oasc.CoreContainer.initZooKeeper Zookeeper client=127.0.0.1:10161/solr
[junit4:junit4]   2> 11708 T2832 oasc.ZkController.checkChrootPath zkHost includes chroot
[junit4:junit4]   2> 11708 T2832 oaz.ZooKeeper.<init> Initiating client connection, connectString=127.0.0.1:10161 sessionTimeout=60000 watcher=org.apache.solr.common.cloud.ConnectionManager@72e71ff5
[junit4:junit4]   2> 11710 T2832 oascc.ConnectionManager.waitForConnected Waiting for client to connect to ZooKeeper
[junit4:junit4]   2> 11710 T2917 oaz.ClientCnxn$SendThread.logStartConnect Opening socket connection to server localhost/127.0.0.1:10161. Will not attempt to authenticate using SASL (access denied (javax.security.auth.AuthPermission getLoginConfiguration))
[junit4:junit4]   2> 11711 T2917 oaz.ClientCnxn$SendThread.primeConnection Socket connection established to localhost/127.0.0.1:10161, initiating session
[junit4:junit4]   2> 11711 T2834 oazs.NIOServerCnxnFactory.run Accepted socket connection from /140.211.11.196:28440
[junit4:junit4]   2> 11711 T2834 oazs.ZooKeeperServer.processConnectRequest Client attempting to establish new session at /140.211.11.196:28440
[junit4:junit4]   2> 11715 T2836 oazs.ZooKeeperServer.finishSessionInit Established session 0x13c17b71724000b with negotiated timeout 20000 for client /140.211.11.196:28440
[junit4:junit4]   2> 11715 T2917 oaz.ClientCnxn$SendThread.onConnected Session establishment complete on server localhost/127.0.0.1:10161, sessionid = 0x13c17b71724000b, negotiated timeout = 20000
[junit4:junit4]   2> 11715 T2918 oascc.ConnectionManager.process Watcher org.apache.solr.common.cloud.ConnectionManager@72e71ff5 name:ZooKeeperConnection Watcher:127.0.0.1:10161 got event WatchedEvent state:SyncConnected type:None path:null path:null type:None
[junit4:junit4]   2> 11715 T2832 oascc.ConnectionManager.waitForConnected Client is connected to ZooKeeper
[junit4:junit4]   2> 11717 T2837 oazs.PrepRequestProcessor.pRequest2Txn Processed session termination for sessionid: 0x13c17b71724000b
[junit4:junit4]   2> 11729 T2918 oaz.ClientCnxn$EventThread.run EventThread shut down
[junit4:junit4]   2> 11729 T2834 oazs.NIOServerCnxn.closeSock Closed socket connection for client /140.211.11.196:28440 which had sessionid 0x13c17b71724000b
[junit4:junit4]   2> 11729 T2832 oaz.ZooKeeper.close Session: 0x13c17b71724000b closed
[junit4:junit4]   2> 11730 T2832 oascsi.HttpClientUtil.createClient Creating new http client, config:maxConnections=500&maxConnectionsPerHost=16&socketTimeout=60000&connTimeout=15000
[junit4:junit4]   2> 11746 T2832 oaz.ZooKeeper.<init> Initiating client connection, connectString=127.0.0.1:10161/solr sessionTimeout=30000 watcher=org.apache.solr.common.cloud.ConnectionManager@539b3606
[junit4:junit4]   2> 11748 T2832 oascc.ConnectionManager.waitForConnected Waiting for client to connect to ZooKeeper
[junit4:junit4]   2> 11748 T2919 oaz.ClientCnxn$SendThread.logStartConnect Opening socket connection to server localhost/127.0.0.1:10161. Will not attempt to authenticate using SASL (access denied (javax.security.auth.AuthPermission getLoginConfiguration))
[junit4:junit4]   2> 11749 T2919 oaz.ClientCnxn$SendThread.primeConnection Socket connection established to localhost/127.0.0.1:10161, initiating session
[junit4:junit4]   2> 11749 T2834 oazs.NIOServerCnxnFactory.run Accepted socket connection from /140.211.11.196:28441
[junit4:junit4]   2> 11750 T2834 oazs.ZooKeeperServer.processConnectRequest Client attempting to establish new session at /140.211.11.196:28441
[junit4:junit4]   2> 11751 T2836 oazs.ZooKeeperServer.finishSessionInit Established session 0x13c17b71724000c with negotiated timeout 20000 for client /140.211.11.196:28441
[junit4:junit4]   2> 11751 T2919 oaz.ClientCnxn$SendThread.onConnected Session establishment complete on server localhost/127.0.0.1:10161, sessionid = 0x13c17b71724000c, negotiated timeout = 20000
[junit4:junit4]   2> 11751 T2920 oascc.ConnectionManager.process Watcher org.apache.solr.common.cloud.ConnectionManager@539b3606 name:ZooKeeperConnection Watcher:127.0.0.1:10161/solr got event WatchedEvent state:SyncConnected type:None path:null path:null type:None
[junit4:junit4]   2> 11751 T2832 oascc.ConnectionManager.waitForConnected Client is connected to ZooKeeper
[junit4:junit4]   2> 11752 T2837 oazs.PrepRequestProcessor.pRequest Got user-level KeeperException when processing sessionid:0x13c17b71724000c type:create cxid:0x1 zxid:0x91 txntype:-1 reqpath:n/a Error Path:/solr/overseer Error:KeeperErrorCode = NodeExists for /solr/overseer
[junit4:junit4]   2> 11758 T2837 oazs.PrepRequestProcessor.pRequest Got user-level KeeperException when processing sessionid:0x13c17b71724000c type:create cxid:0x2 zxid:0x92 txntype:-1 reqpath:n/a Error Path:/solr/overseer Error:KeeperErrorCode = NodeExists for /solr/overseer
[junit4:junit4]   2> 11760 T2832 oasc.ZkController.createEphemeralLiveNode Register node as live in ZooKeeper:/live_nodes/127.0.0.1:28439__i
[junit4:junit4]   2> 11761 T2837 oazs.PrepRequestProcessor.pRequest Got user-level KeeperException when processing sessionid:0x13c17b71724000c type:delete cxid:0x4 zxid:0x93 txntype:-1 reqpath:n/a Error Path:/solr/live_nodes/127.0.0.1:28439__i Error:KeeperErrorCode = NoNode for /solr/live_nodes/127.0.0.1:28439__i
[junit4:junit4]   2> 11762 T2832 oascc.SolrZkClient.makePath makePath: /live_nodes/127.0.0.1:28439__i
[junit4:junit4]   2> 11770 T2854 oascc.ZkStateReader$2.process A cluster state change: WatchedEvent state:SyncConnected type:NodeChildrenChanged path:/live_nodes, has occurred - updating... (live nodes size: 4)
[junit4:junit4]   2> 11770 T2888 oascc.ZkStateReader$2.process A cluster state change: WatchedEvent state:SyncConnected type:NodeChildrenChanged path:/live_nodes, has occurred - updating... (live nodes size: 4)
[junit4:junit4]   2> 11770 T2860 oascc.ZkStateReader$2.process A cluster state change: WatchedEvent state:SyncConnected type:NodeChildrenChanged path:/live_nodes, has occurred - updating... (live nodes size: 4)
[junit4:junit4]   2> 11770 T2904 oascc.ZkStateReader$3.process Updating live nodes... (5)
[junit4:junit4]   2> 11770 T2873 oascc.ZkStateReader$3.process Updating live nodes... (5)
[junit4:junit4]   2> 11770 T2904 oascc.ZkStateReader$2.process A cluster state change: WatchedEvent state:SyncConnected type:NodeChildrenChanged path:/live_nodes, has occurred - updating... (live nodes size: 5)
[junit4:junit4]   2> 11771 T2873 oascc.ZkStateReader$2.process A cluster state change: WatchedEvent state:SyncConnected type:NodeChildrenChanged path:/live_nodes, has occurred - updating... (live nodes size: 5)
[junit4:junit4]   2> 11772 T2888 oascc.ZkStateReader$3.process Updating live nodes... (5)
[junit4:junit4]   2> 11772 T2854 oascc.ZkStateReader$3.process Updating live nodes... (5)
[junit4:junit4]   2> 11772 T2860 oascc.ZkStateReader$3.process Updating live nodes... (5)
[junit4:junit4]   2> 11773 T2832 oascc.ZkStateReader.createClusterStateWatchersAndUpdate Updating cluster state from ZooKeeper... 
[junit4:junit4]   2> 11783 T2921 oasc.CoreContainer.create Creating SolrCore 'collection1' using instanceDir: /usr/home/hudson/hudson-slave/workspace/Lucene-Solr-Tests-4.x-Java6/solr/build/solr-core/test/J0/./org.apache.solr.cloud.SyncSliceTest-jetty4-1357607551906/collection1
[junit4:junit4]   2> 11783 T2921 oasc.ZkController.createCollectionZkNode Check for collection zkNode:collection1
[junit4:junit4]   2> 11784 T2921 oasc.ZkController.createCollectionZkNode Collection zkNode exists
[junit4:junit4]   2> 11784 T2921 oasc.ZkController.readConfigName Load collection config from:/collections/collection1
[junit4:junit4]   2> 11785 T2921 oasc.SolrResourceLoader.<init> new SolrResourceLoader for directory: '/usr/home/hudson/hudson-slave/workspace/Lucene-Solr-Tests-4.x-Java6/solr/build/solr-core/test/J0/./org.apache.solr.cloud.SyncSliceTest-jetty4-1357607551906/collection1/'
[junit4:junit4]   2> 11786 T2921 oasc.SolrResourceLoader.replaceClassLoader Adding 'file:/usr/home/hudson/hudson-slave/workspace/Lucene-Solr-Tests-4.x-Java6/solr/build/solr-core/test/J0/org.apache.solr.cloud.SyncSliceTest-jetty4-1357607551906/collection1/lib/classes/' to classloader
[junit4:junit4]   2> 11786 T2921 oasc.SolrResourceLoader.replaceClassLoader Adding 'file:/usr/home/hudson/hudson-slave/workspace/Lucene-Solr-Tests-4.x-Java6/solr/build/solr-core/test/J0/org.apache.solr.cloud.SyncSliceTest-jetty4-1357607551906/collection1/lib/README' to classloader
[junit4:junit4]   2> 11825 T2921 oasc.SolrConfig.<init> Using Lucene MatchVersion: LUCENE_41
[junit4:junit4]   2> 11886 T2921 oasc.SolrConfig.<init> Loaded SolrConfig: solrconfig.xml
[junit4:junit4]   2> 11986 T2921 oass.IndexSchema.readSchema Reading Solr Schema
[junit4:junit4]   2> 11990 T2921 oass.IndexSchema.readSchema Schema name=test
[junit4:junit4]   2>  C192_STATE=coll:collection1 core:collection1 props:{shard=shard1, roles=null, state=recovering, core=collection1, collection=collection1, node_name=127.0.0.1:65097__i, base_url=http://127.0.0.1:65097/_i}
[junit4:junit4]   2> 12332 T2891 C192 P65097 oasc.RecoveryStrategy.doRecovery Attempting to PeerSync from http://127.0.0.1:23568/_i/collection1/ core=collection1 - recoveringAfterStartup=true
[junit4:junit4]   2> 12332 T2891 C192 P65097 oasu.PeerSync.sync PeerSync: core=collection1 url=http://127.0.0.1:65097/_i START replicas=[http://127.0.0.1:23568/_i/collection1/] nUpdates=100
[junit4:junit4]   2> 12332 T2891 C192 P65097 oasu.PeerSync.sync WARNING no frame of reference to tell of we've missed updates
[junit4:junit4]   2> 12332 T2891 C192 P65097 oasc.RecoveryStrategy.doRecovery PeerSync Recovery was not successful - trying replication. core=collection1
[junit4:junit4]   2> 12333 T2891 C192 P65097 oasc.RecoveryStrategy.doRecovery Starting Replication Recovery. core=collection1
[junit4:junit4]   2> 12333 T2891 C192 P65097 oasc.RecoveryStrategy.doRecovery Begin buffering updates. core=collection1
[junit4:junit4]   2> 12333 T2891 C192 P65097 oasu.UpdateLog.bufferUpdates Starting to buffer updates. FSUpdateLog{state=ACTIVE, tlog=null}
[junit4:junit4]   2> 12333 T2891 C192 P65097 oasc.RecoveryStrategy.replicate Attempting to replicate from http://127.0.0.1:23568/_i/collection1/. core=collection1
[junit4:junit4]   2> 12333 T2891 C192 P65097 oascsi.HttpClientUtil.createClient Creating new http client, config:maxConnections=128&maxConnectionsPerHost=32&followRedirects=false
[junit4:junit4]   2> ASYNC  NEW_CORE C194 name=collection1 org.apache.solr.core.SolrCore@76eb46d4 url=http://127.0.0.1:23568/_i/collection1 node=127.0.0.1:23568__i C194_STATE=coll:collection1 core:collection1 props:{shard=shard1, roles=null, state=active, core=collection1, collection=collection1, node_name=127.0.0.1:23568__i, base_url=http://127.0.0.1:23568/_i, leader=true}
[junit4:junit4]   2> 12340 T2865 C194 P23568 REQ /get {getVersions=100&distrib=false&wt=javabin&qt=/get&version=2} status=0 QTime=0 
[junit4:junit4]   2> 12341 T2866 C194 P23568 oasu.DirectUpdateHandler2.commit start commit{,optimize=false,openSearcher=false,waitSearcher=true,expungeDeletes=false,softCommit=false}
[junit4:junit4]   2> 12342 T2866 C194 P23568 oasc.CachingDirectoryFactory.close Releasing directory:/usr/home/hudson/hudson-slave/workspace/Lucene-Solr-Tests-4.x-Java6/solr/build/solr-core/test/J0/./org.apache.solr.cloud.SyncSliceTest-1357607540510/jetty1
[junit4:junit4]   2> 12345 T2866 C194 P23568 oasc.SolrDeletionPolicy.onInit SolrDeletionPolicy.onInit: commits:num=1
[junit4:junit4]   2> 		commit{dir=RateLimitedDirectoryWrapper(NRTCachingDirectory(org.apache.lucene.store.NIOFSDirectory@/usr/home/hudson/hudson-slave/workspace/Lucene-Solr-Tests-4.x-Java6/solr/build/solr-core/test/J0/org.apache.solr.cloud.SyncSliceTest-1357607540510/jetty1/index lockFactory=org.apache.lucene.store.NativeFSLockFactory@37898c18; maxCacheMB=48.0 maxMergeSizeMB=4.0)),segFN=segments_1,generation=1,filenames=[segments_1]
[junit4:junit4]   2> 12346 T2866 C194 P23568 oasc.SolrDeletionPolicy.updateCommits newest commit = 1[segments_1]
[junit4:junit4]   2> 12350 T2866 C194 P23568 oasc.SolrDeletionPolicy.onCommit SolrDeletionPolicy.onCommit: commits:num=2
[junit4:junit4]   2> 		commit{dir=RateLimitedDirectoryWrapper(NRTCachingDirectory(org.apache.lucene.store.NIOFSDirectory@/usr/home/hudson/hudson-slave/workspace/Lucene-Solr-Tests-4.x-Java6/solr/build/solr-core/test/J0/org.apache.solr.cloud.SyncSliceTest-1357607540510/jetty1/index lockFactory=org.apache.lucene.store.NativeFSLockFactory@37898c18; maxCacheMB=48.0 maxMergeSizeMB=4.0)),segFN=segments_1,generation=1,filenames=[segments_1]
[junit4:junit4]   2> 		commit{dir=RateLimitedDirectoryWrapper(NRTCachingDirectory(org.apache.lucene.store.NIOFSDirectory@/usr/home/hudson/hudson-slave/workspace/Lucene-Solr-Tests-4.x-Java6/solr/build/solr-core/test/J0/org.apache.solr.cloud.SyncSliceTest-1357607540510/jetty1/index lockFactory=org.apache.lucene.store.NativeFSLockFactory@37898c18; maxCacheMB=48.0 maxMergeSizeMB=4.0)),segFN=segments_2,generation=2,filenames=[segments_2]
[junit4:junit4]   2> 12350 T2866 C194 P23568 oasc.SolrDeletionPolicy.updateCommits newest commit = 2[segments_2]
[junit4:junit4]   2> 12351 T2866 C194 P23568 oasc.CachingDirectoryFactory.close Releasing directory:/usr/home/hudson/hudson-slave/workspace/Lucene-Solr-Tests-4.x-Java6/solr/build/solr-core/test/J0/./org.apache.solr.cloud.SyncSliceTest-1357607540510/jetty1
[junit4:junit4]   2> 12351 T2866 C194 P23568 oass.SolrIndexSearcher.<init> Opening Searcher@6c071a4a realtime
[junit4:junit4]   2> 12352 T2866 C194 P23568 oasu.DirectUpdateHandler2.commit end_commit_flush
[junit4:junit4]   2> 12352 T2866 C194 P23568 /update {waitSearcher=true&openSearcher=false&commit=true&wt=javabin&commit_end_point=true&version=2&softCommit=false} {commit=} 0 11
[junit4:junit4]   2> 12353 T2891 C192 P65097 oash.ReplicationHandler.inform Commits will be reserved for  10000
[junit4:junit4]   2> 12353 T2891 C192 P65097 oash.SnapPuller.<init>  No value set for 'pollInterval'. Timer Task not started.
[junit4:junit4]   2> 12356 T2867 C194 P23568 oash.ReplicationHandler.inform Commits will be reserved for  10000
[junit4:junit4]   2> 12356 T2867 C194 P23568 REQ /replication {command=indexversion&qt=/replication&wt=javabin&version=2} status=0 QTime=1 
[junit4:junit4]   2> 12357 T2891 C192 P65097 oash.SnapPuller.fetchLatestIndex Master's generation: 2
[junit4:junit4]   2> 12357 T2891 C192 P65097 oash.SnapPuller.fetchLatestIndex Slave's generation: 1
[junit4:junit4]   2> 12357 T2891 C192 P65097 oash.SnapPuller.fetchLatestIndex Starting replication process
[junit4:junit4]   2> 12359 T2867 C194 P23568 oasc.CachingDirectoryFactory.close Releasing directory:/usr/home/hudson/hudson-slave/workspace/Lucene-Solr-Tests-4.x-Java6/solr/build/solr-core/test/J0/./org.apache.solr.cloud.SyncSliceTest-1357607540510/jetty1
[junit4:junit4]   2> 12360 T2867 C194 P23568 oasc.CachingDirectoryFactory.close Releasing directory:/usr/home/hudson/hudson-slave/workspace/Lucene-Solr-Tests-4.x-Java6/solr/build/solr-core/test/J0/./org.apache.solr.cloud.SyncSliceTest-1357607540510/jetty1/index
[junit4:junit4]   2> 12360 T2867 C194 P23568 REQ /replication {command=filelist&qt=/replication&wt=javabin&generation=2&version=2} status=0 QTime=1 
[junit4:junit4]   2> 12360 T2891 C192 P65097 oash.SnapPuller.fetchLatestIndex Number of files in latest index in master: 1
[junit4:junit4]   2> 12361 T2891 C192 P65097 oasc.CachingDirectoryFactory.get return new directory for /usr/home/hudson/hudson-slave/workspace/Lucene-Solr-Tests-4.x-Java6/solr/build/solr-core/test/J0/./org.apache.solr.cloud.SyncSliceTest-1357607540510/jetty2/index.20130108031232867 forceNew:false
[junit4:junit4]   2> 12361 T2891 C192 P65097 oasc.CachingDirectoryFactory.close Releasing directory:/usr/home/hudson/hudson-slave/workspace/Lucene-Solr-Tests-4.x-Java6/solr/build/solr-core/test/J0/./org.apache.solr.cloud.SyncSliceTest-1357607540510/jetty2
[junit4:junit4]   2> 12362 T2891 C192 P65097 oash.SnapPuller.fetchLatestIndex Starting download to RateLimitedDirectoryWrapper(NRTCachingDirectory(org.apache.lucene.store.NIOFSDirectory@/usr/home/hudson/hudson-slave/workspace/Lucene-Solr-Tests-4.x-Java6/solr/build/solr-core/test/J0/org.apache.solr.cloud.SyncSliceTest-1357607540510/jetty2/index.20130108031232867 lockFactory=org.apache.lucene.store.NativeFSLockFactory@5b1a4080; maxCacheMB=48.0 maxMergeSizeMB=4.0)) fullCopy=true
[junit4:junit4]   2> 12365 T2867 C194 P23568 REQ /replication {file=segments_2&command=filecontent&checksum=true&wt=filestream&qt=/replication&generation=2} status=0 QTime=0 
[junit4:junit4]   2> 12367 T2891 C192 P65097 oasc.CachingDirectoryFactory.close Releasing directory:/usr/home/hudson/hudson-slave/workspace/Lucene-Solr-Tests-4.x-Java6/solr/build/solr-core/test/J0/./org.apache.solr.cloud.SyncSliceTest-1357607540510/jetty2/index
[junit4:junit4]   2> 12367 T2891 C192 P65097 oash.SnapPuller.fetchLatestIndex Total time taken for download : 0 secs
[junit4:junit4]   2> 12375 T2891 C192 P65097 oash.SnapPuller.modifyIndexProps New index installed. Updating index properties... index=index.20130108031232867
[junit4:junit4]   2> 12377 T2891 C192 P65097 oasc.CachingDirectoryFactory.close Releasing directory:/usr/home/hudson/hudson-slave/workspace/Lucene-Solr-Tests-4.x-Java6/solr/build/solr-core/test/J0/./org.apache.solr.cloud.SyncSliceTest-1357607540510/jetty2
[junit4:junit4]   2> 12377 T2891 C192 P65097 oasc.CachingDirectoryFactory.close Releasing directory:/usr/home/hudson/hudson-slave/workspace/Lucene-Solr-Tests-4.x-Java6/solr/build/solr-core/test/J0/./org.apache.solr.cloud.SyncSliceTest-1357607540510/jetty2
[junit4:junit4]   2> 12378 T2891 C192 P65097 oasc.SolrCore.getNewIndexDir New index directory detected: old=./org.apache.solr.cloud.SyncSliceTest-1357607540510/jetty2/index/ new=./org.apache.solr.cloud.SyncSliceTest-1357607540510/jetty2/index.20130108031232867
[junit4:junit4]   2> 12381 T2891 C192 P65097 oasc.SolrDeletionPolicy.onInit SolrDeletionPolicy.onInit: commits:num=1
[junit4:junit4]   2> 		commit{dir=RateLimitedDirectoryWrapper(NRTCachingDirectory(org.apache.lucene.store.NIOFSDirectory@/usr/home/hudson/hudson-slave/workspace/Lucene-Solr-Tests-4.x-Java6/solr/build/solr-core/test/J0/org.apache.solr.cloud.SyncSliceTest-1357607540510/jetty2/index.20130108031232867 lockFactory=org.apache.lucene.store.NativeFSLockFactory@5b1a4080; maxCacheMB=48.0 maxMergeSizeMB=4.0)),segFN=segments_2,generation=2,filenames=[segments_2]
[junit4:junit4]   2> 12382 T2891 C192 P65097 oasc.SolrDeletionPolicy.updateCommits newest commit = 2[segments_2]
[junit4:junit4]   2> 12383 T2891 C192 P65097 oasc.CachingDirectoryFactory.close Releasing directory:/usr/home/hudson/hudson-slave/workspace/Lucene-Solr-Tests-4.x-Java6/solr/build/solr-core/test/J0/./org.apache.solr.cloud.SyncSliceTest-1357607540510/jetty2
[junit4:junit4]   2> 12383 T2891 C192 P65097 oasu.DefaultSolrCoreState.newIndexWriter Creating new IndexWriter...
[junit4:junit4]   2> 12383 T2891 C192 P65097 oasu.DefaultSolrCoreState.newIndexWriter Waiting until IndexWriter is unused... core=collection1
[junit4:junit4]   2> 12384 T2891 C192 P65097 oasu.DefaultSolrCoreState.newIndexWriter Rollback old IndexWriter... core=collection1
[junit4:junit4]   2> 12385 T2891 C192 P65097 oasc.CachingDirectoryFactory.close Releasing directory:/usr/home/hudson/hudson-slave/workspace/Lucene-Solr-Tests-4.x-Java6/solr/build/solr-core/test/J0/./org.apache.solr.cloud.SyncSliceTest-1357607540510/jetty2/index.20130108031232867
[junit4:junit4]   2> 12385 T2891 C192 P65097 oasc.CachingDirectoryFactory.close Releasing directory:/usr/home/hudson/hudson-slave/workspace/Lucene-Solr-Tests-4.x-Java6/solr/build/solr-core/test/J0/./org.apache.solr.cloud.SyncSliceTest-1357607540510/jetty2
[junit4:junit4]   2> 12389 T2891 C192 P65097 oasc.SolrDeletionPolicy.onInit SolrDeletionPolicy.onInit: commits:num=1
[junit4:junit4]   2> 		commit{dir=RateLimitedDirectoryWrapper(NRTCachingDirectory(org.apache.lucene.store.NIOFSDirectory@/usr/home/hudson/hudson-slave/workspace/Lucene-Solr-Tests-4.x-Java6/solr/build/solr-core/test/J0/org.apache.solr.cloud.SyncSliceTest-1357607540510/jetty2/index.20130108031232867 lockFactory=org.apache.lucene.store.NativeFSLockFactory@5b1a4080; maxCacheMB=48.0 maxMergeSizeMB=4.0)),segFN=segments_2,generation=2,filenames=[segments_2]
[junit4:junit4]   2> 12390 T2891 C192 P65097 oasc.SolrDeletionPolicy.updateCommits newest commit = 2[segments_2]
[junit4:junit4]   2> 12390 T2891 C192 P65097 oasu.DefaultSolrCoreState.newIndexWriter New IndexWriter is ready to be used.
[junit4:junit4]   2> 12390 T2891 C192 P65097 oasc.CachingDirectoryFactory.close Releasing directory:/usr/home/hudson/hudson-slave/workspace/Lucene-Solr-Tests-4.x-Java6/solr/build/solr-core/test/J0/./org.apache.solr.cloud.SyncSliceTest-1357607540510/jetty2
[junit4:junit4]   2> 12391 T2891 C192 P65097 oass.SolrIndexSearcher.<init> Opening Searcher@1e62030e main
[junit4:junit4]   2> 12392 T2890 oasc.SolrCore.registerSearcher [collection1] Registered new searcher Searcher@1e62030e main{StandardDirectoryReader(segments_2:1:nrt)}
[junit4:junit4]   2> 12392 T2890 oasc.CachingDirectoryFactory.close Releasing directory:/usr/home/hudson/hudson-slave/workspace/Lucene-Solr-Tests-4.x-Java6/solr/build/solr-core/test/J0/./org.apache.solr.cloud.SyncSliceTest-1357607540510/jetty2/index
[junit4:junit4]   2> 12392 T2891 C192 P65097 oasu.DirectUpdateHandler2.commit start commit{,optimize=false,openSearcher=false,waitSearcher=false,expungeDeletes=false,softCommit=false}
[junit4:junit4]   2> 12404 T2891 C192 P65097 oasc.SolrDeletionPolicy.onCommit SolrDeletionPolicy.onCommit: commits:num=2
[junit4:junit4]   2> 		commit{dir=RateLimitedDirectoryWrapper(NRTCachingDirectory(org.apache.lucene.store.NIOFSDirectory@/usr/home/hudson/hudson-slave/workspace/Lucene-Solr-Tests-4.x-Java6/solr/build/solr-core/test/J0/org.apache.solr.cloud.SyncSliceTest-1357607540510/jetty2/index.20130108031232867 lockFactory=org.apache.lucene.store.NativeFSLockFactory@5b1a4080; maxCacheMB=48.0 maxMergeSizeMB=4.0)),segFN=segments_2,generation=2,filenames=[segments_2]
[junit4:junit4]   2> 		commit{dir=RateLimitedDirectoryWrapper(NRTCachingDirectory(org.apache.lucene.store.NIOFSDirectory@/usr/home/hudson/hudson-slave/workspace/Lucene-Solr-Tests-4.x-Java6/solr/build/solr-core/test/J0/org.apache.solr.cloud.SyncSliceTest-1357607540510/jetty2/index.20130108031232867 lockFactory=org.apache.lucene.store.NativeFSLockFactory@5b1a4080; maxCacheMB=48.0 maxMergeSizeMB=4.0)),segFN=segments_3,generation=3,filenames=[segments_3]
[junit4:junit4]   2> 12405 T2891 C192 P65097 oasc.SolrDeletionPolicy.updateCommits newest commit = 3[segments_3]
[junit4:junit4]   2> 12406 T2891 C192 P65097 oasc.CachingDirectoryFactory.close Releasing directory:/usr/home/hudson/hudson-slave/workspace/Lucene-Solr-Tests-4.x-Java6/solr/build/solr-core/test/J0/./org.apache.solr.cloud.SyncSliceTest-1357607540510/jetty2
[junit4:junit4]   2> 12406 T2891 C192 P65097 oasu.DirectUpdateHandler2.commit end_commit_flush
[junit4:junit4]   2> 12406 T2891 C192 P65097 oasc.CachingDirectoryFactory.close Releasing directory:/usr/home/hudson/hudson-slave/workspace/Lucene-Solr-Tests-4.x-Java6/solr/build/solr-core/test/J0/./org.apache.solr.cloud.SyncSliceTest-1357607540510/jetty2/index.20130108031232867
[junit4:junit4]   2> 12407 T2891 C192 P65097 oasc.CachingDirectoryFactory.close Releasing directory:/usr/home/hudson/hudson-slave/workspace/Lucene-Solr-Tests-4.x-Java6/solr/build/solr-core/test/J0/./org.apache.solr.cloud.SyncSliceTest-1357607540510/jetty2/index
[junit4:junit4]   2> 12407 T2891 C192 P65097 oasc.RecoveryStrategy.replay No replay needed. core=collection1
[junit4:junit4]   2> 12407 T2891 C192 P65097 oasc.RecoveryStrategy.doRecovery Replication Recovery was successful - registering as Active. core=collection1
[junit4:junit4]   2> 12407 T2891 C192 P65097 oasc.ZkController.publish publishing core=collection1 state=active
[junit4:junit4]   2> 12407 T2891 C192 P65097 oasc.ZkController.publish numShards not found on descriptor - reading it from system property
[junit4:junit4]   2> 12415 T2891 C192 P65097 oasc.RecoveryStrategy.doRecovery Finished recovery process. core=collection1
[junit4:junit4]   2> 12865 T2855 oascc.ZkStateReader.updateClusterState Updating cloud state from ZooKeeper... 
[junit4:junit4]   2> 12866 T2855 oasc.Overseer$ClusterStateUpdater.updateState Update state numShards=1 message={
[junit4:junit4]   2> 	  "operation":"state",
[junit4:junit4]   2> 	  "numShards":"1",
[junit4:junit4]   2> 	  "shard":"shard1",
[junit4:junit4]   2> 	  "roles":null,
[junit4:junit4]   2> 	  "state":"recovering",
[junit4:junit4]   2> 	  "core":"collection1",
[junit4:junit4]   2> 	  "collection":"collection1",
[junit4:junit4]   2> 	  "node_name":"127.0.0.1:30066__i",
[junit4:junit4]   2> 	  "base_url":"http://127.0.0.1:30066/_i"}
[junit4:junit4]   2> 12877 T2855 oasc.Overseer$ClusterStateUpdater.updateState Update state numShards=1 message={
[junit4:junit4]   2> 	  "operation":"state",
[junit4:junit4]   2> 	  "numShards":"1",
[junit4:junit4]   2> 	  "shard":"shard1",
[junit4:junit4]   2> 	  "roles":null,
[junit4:junit4]   2> 	  "state":"active",
[junit4:junit4]   2> 	  "core":"collection1",
[junit4:junit4]   2> 	  "collection":"collection1",
[junit4:junit4]   2> 	  "node_name":"127.0.0.1:65097__i",
[junit4:junit4]   2> 	  "base_url":"http://127.0.0.1:65097/_i"}
[junit4:junit4]   2> 12913 T2904 oascc.ZkStateReader$2.process A cluster state change: WatchedEvent state:SyncConnected type:NodeDataChanged path:/clusterstate.json, has occurred - updating... (live nodes size: 5)
[junit4:junit4]   2> 12914 T2860 oascc.ZkStateReader$2.process A cluster state change: WatchedEvent state:SyncConnected type:NodeDataChanged path:/clusterstate.json, has occurred - updating... (live nodes size: 5)
[junit4:junit4]   2> 12914 T2888 oascc.ZkStateReader$2.process A cluster state change: WatchedEvent state:SyncConnected type:NodeDataChanged path:/clusterstate.json, has occurred - updating... (live nodes size: 5)
[junit4:junit4]   2> 12914 T2920 oascc.ZkStateReader$2.process A cluster state change: WatchedEvent state:SyncConnected type:NodeDataChanged path:/clusterstate.json, has occurred - updating... (live nodes size: 5)
[junit4:junit4]   2> 12914 T2854 oascc.ZkStateReader$2.process A cluster state change: WatchedEvent state:SyncConnected type:NodeDataChanged path:/clusterstate.json, has occurred - updating... (live nodes size: 5)
[junit4:junit4]   2> 12914 T2873 oascc.ZkStateReader$2.process A cluster state change: WatchedEvent state:SyncConnected type:NodeDataChanged path:/clusterstate.json, has occurred - updating... (live nodes size: 5)
[junit4:junit4]   2> 13047 T2921 oass.OpenExchangeRatesOrgProvider.init Initialized with rates=open-exchange-rates.json, refreshInterval=1440.
[junit4:junit4]   2> 13061 T2921 oass.IndexSchema.readSchema default search field in schema is text
[junit4:junit4]   2> 13067 T2921 oass.IndexSchema.readSchema unique key field: id
[junit4:junit4]   2> 13079 T2921 oass.FileExchangeRateProvider.reload Reloading exchange rates from file currency.xml
[junit4:junit4]   2> 13092 T2921 oass.FileExchangeRateProvider.reload Reloading exchange rates from file currency.xml
[junit4:junit4]   2> 13128 T2921 oass.OpenExchangeRatesOrgProvider.reload Reloading exchange rates from open-exchange-rates.json
[junit4:junit4]   2> 13129 T2921 oass.OpenExchangeRatesOrgProvider.reload Reloading exchange rates from open-exchange-rates.json
[junit4:junit4]   2> 13130 T2921 oasc.SolrCore.<init> [collection1] Opening new SolrCore at /usr/home/hudson/hudson-slave/workspace/Lucene-Solr-Tests-4.x-Java6/solr/build/solr-core/test/J0/./org.apache.solr.cloud.SyncSliceTest-jetty4-1357607551906/collection1/, dataDir=./org.apache.solr.cloud.SyncSliceTest-1357607540510/jetty4/
[junit4:junit4]   2> 13130 T2921 oasc.JmxMonitoredMap.<init> JMX monitoring is enabled. Adding Solr mbeans to JMX Server: com.sun.jmx.mbeanserver.JmxMBeanServer@4f4b2f1a
[junit4:junit4]   2> 13130 T2921 oasc.SolrCore.initDirectoryFactory solr.NRTCachingDirectoryFactory
[junit4:junit4]   2> 13131 T2921 oasc.CachingDirectoryFactory.get return new directory for /usr/home/hudson/hudson-slave/workspace/Lucene-Solr-Tests-4.x-Java6/solr/build/solr-core/test/J0/./org.apache.solr.cloud.SyncSliceTest-1357607540510/jetty4 forceNew:false
[junit4:junit4]   2> 13132 T2921 oasc.CachingDirectoryFactory.close Releasing directory:/usr/home/hudson/hudson-slave/workspace/Lucene-Solr-Tests-4.x-Java6/solr/build/solr-core/test/J0/./org.apache.solr.cloud.SyncSliceTest-1357607540510/jetty4
[junit4:junit4]   2> 13132 T2921 oasc.SolrCore.getNewIndexDir New index directory detected: old=null new=./org.apache.solr.cloud.SyncSliceTest-1357607540510/jetty4/index/
[junit4:junit4]   2> 13133 T2921 oasc.SolrCore.initIndex WARNING [collection1] Solr index directory './org.apache.solr.cloud.SyncSliceTest-1357607540510/jetty4/index' doesn't exist. Creating new index...
[junit4:junit4]   2> 13133 T2921 oasc.CachingDirectoryFactory.get return new directory for /usr/home/hudson/hudson-slave/workspace/Lucene-Solr-Tests-4.x-Java6/solr/build/solr-core/test/J0/./org.apache.solr.cloud.SyncSliceTest-1357607540510/jetty4/index forceNew:false
[junit4:junit4]   2> 13139 T2921 oasc.SolrDeletionPolicy.onCommit SolrDeletionPolicy.onCommit: commits:num=1
[junit4:junit4]   2> 		commit{dir=RateLimitedDirectoryWrapper(NRTCachingDirectory(org.apache.lucene.store.NIOFSDirectory@/usr/home/hudson/hudson-slave/workspace/Lucene-Solr-Tests-4.x-Java6/solr/build/solr-core/test/J0/org.apache.solr.cloud.SyncSliceTest-1357607540510/jetty4/index lockFactory=org.apache.lucene.store.NativeFSLockFactory@6692c750; maxCacheMB=48.0 maxMergeSizeMB=4.0)),segFN=segments_1,generation=1,filenames=[segments_1]
[junit4:junit4]   2> 13140 T2921 oasc.SolrDeletionPolicy.updateCommits newest commit = 1[segments_1]
[junit4:junit4]   2> 13140 T2921 oasc.CachingDirectoryFactory.close Releasing directory:/usr/home/hudson/hudson-slave/workspace/Lucene-Solr-Tests-4.x-Java6/solr/build/solr-core/test/J0/./org.apache.solr.cloud.SyncSliceTest-1357607540510/jetty4/index
[junit4:junit4]   2> 13141 T2921 oasc.SolrCore.initWriters created xml: solr.XMLResponseWriter
[junit4:junit4]   2> 13142 T2921 oasup.UpdateRequestProcessorChain.init inserting DistributedUpdateProcessorFactory into updateRequestProcessorChain "dedupe"
[junit4:junit4]   2> 13142 T2921 oasup.UpdateRequestProcessorChain.init inserting DistributedUpdateProcessorFactory into updateRequestProcessorChain "dedupe-allfields"
[junit4:junit4]   2> 13143 T2921 oasup.UpdateRequestProcessorChain.init inserting DistributedUpdateProcessorFactory into updateRequestProcessorChain "stored_sig"
[junit4:junit4]   2> 13143 T2921 oasup.UpdateRequestProcessorChain.init inserting DistributedUpdateProcessorFactory into updateRequestProcessorChain "uniq-fields"
[junit4:junit4]   2> 13143 T2921 oasup.UpdateRequestProcessorChain.init inserting DistributedUpdateProcessorFactory into updateRequestProcessorChain "distrib-dup-test-chain-implicit"
[junit4:junit4]   2> 13143 T2921 oasc.RequestHandlers.initHandlersFromConfig adding lazy requestHandler: solr.ReplicationHandler
[junit4:junit4]   2> 13144 T2921 oasc.RequestHandlers.initHandlersFromConfig created /replication: solr.ReplicationHandler
[junit4:junit4]   2> 13144 T2921 oasc.RequestHandlers.initHandlersFromConfig created standard: solr.StandardRequestHandler
[junit4:junit4]   2> 13145 T2921 oasc.RequestHandlers.initHandlersFromConfig created /get: solr.RealTimeGetHandler
[junit4:junit4]   2> 13145 T2921 oasc.RequestHandlers.initHandlersFromConfig created dismax: solr.SearchHandler
[junit4:junit4]   2> 13145 T2921 oasc.RequestHandlers.initHandlersFromConfig created mock: org.apache.solr.core.MockQuerySenderListenerReqHandler
[junit4:junit4]   2> 13146 T2921 oasc.RequestHandlers.initHandlersFromConfig created /admin/: org.apache.solr.handler.admin.AdminHandlers
[junit4:junit4]   2> 13146 T2921 oasc.RequestHandlers.initHandlersFromConfig created defaults: solr.StandardRequestHandler
[junit4:junit4]   2> 13146 T2921 oasc.RequestHandlers.initHandlersFromConfig adding lazy requestHandler: solr.StandardRequestHandler
[junit4:junit4]   2> 13146 T2921 oasc.RequestHandlers.initHandlersFromConfig created lazy: solr.StandardRequestHandler
[junit4:junit4]   2> 13147 T2921 oasc.RequestHandlers.initHandlersFromConfig created /update: solr.UpdateRequestHandler
[junit4:junit4]   2> 13147 T2921 oasc.RequestHandlers.initHandlersFromConfig created /terms: org.apache.solr.handler.component.SearchHandler
[junit4:junit4]   2> 13148 T2921 oasc.RequestHandlers.initHandlersFromConfig created spellCheckCompRH: org.apache.solr.handler.component.SearchHandler
[junit4:junit4]   2> 13148 T2921 oasc.RequestHandlers.initHandlersFromConfig created spellCheckCompRH_Direct: org.apache.solr.handler.component.SearchHandler
[junit4:junit4]   2> 13148 T2921 oasc.RequestHandlers.initHandlersFromConfig created spellCheckWithWordbreak: org.apache.solr.handler.component.SearchHandler
[junit4:junit4]   2> 13149 T2921 oasc.RequestHandlers.initHandlersFromConfig created spellCheckWithWordbreak_Direct: org.apache.solr.handler.component.SearchHandler
[junit4:junit4]   2> 13149 T2921 oasc.RequestHandlers.initHandlersFromConfig created spellCheckCompRH1: org.apache.solr.handler.component.SearchHandler
[junit4:junit4]   2> 13149 T2921 oasc.RequestHandlers.initHandlersFromConfig created mltrh: org.apache.solr.handler.component.SearchHandler
[junit4:junit4]   2> 13150 T2921 oasc.RequestHandlers.initHandlersFromConfig created tvrh: org.apache.solr.handler.component.SearchHandler
[junit4:junit4]   2> 13150 T2921 oasc.RequestHandlers.initHandlersFromConfig created /mlt: solr.MoreLikeThisHandler
[junit4:junit4]   2> 13151 T2921 oasc.RequestHandlers.initHandlersFromConfig created /debug/dump: solr.DumpRequestHandler
[junit4:junit4]   2> 13158 T2921 oashl.XMLLoader.init xsltCacheLifetimeSeconds=60
[junit4:junit4]   2> 13163 T2921 oasc.SolrCore.initDeprecatedSupport WARNING solrconfig.xml uses deprecated <admin/gettableFiles>, Please update your config to use the ShowFileRequestHandler.
[junit4:junit4]   2> 13164 T2921 oasc.SolrCore.initDeprecatedSupport WARNING adding ShowFileRequestHandler with hidden files: [SCHEMA.XML, OLD_SYNONYMS.TXT, STOPWORDS.TXT, PROTWORDS.TXT, OPEN-EXCHANGE-RATES.JSON, SYNONYMS.TXT, CURRENCY.XML, MAPPING-ISOLATIN1ACCENT.TXT]
[junit4:junit4]   2> 13166 T2921 oasc.CachingDirectoryFactory.close Releasing directory:/usr/home/hudson/hudson-slave/workspace/Lucene-Solr-Tests-4.x-Java6/solr/build/solr-core/test/J0/./org.apache.solr.cloud.SyncSliceTest-1357607540510/jetty4
[junit4:junit4]   2> 13168 T2921 oass.SolrIndexSearcher.<init> Opening Searcher@5dd729b main
[junit4:junit4]   2> 13169 T2921 oasu.CommitTracker.<init> Hard AutoCommit: disabled
[junit4:junit4]   2> 13169 T2921 oasu.CommitTracker.<init> Soft AutoCommit: disabled
[junit4:junit4]   2> 13169 T2921 oashc.SpellCheckComponent.inform Initializing spell checkers
[junit4:junit4]   2> 13225 T2921 oass.DirectSolrSpellChecker.init init: {name=direct,classname=DirectSolrSpellChecker,field=lowerfilt,minQueryLength=3}
[junit4:junit4]   2> 13432 T2924 oasc.SolrCore.registerSearcher [collection1] Registered new searcher Searcher@5dd729b main{StandardDirectoryReader(segments_1:1)}
[junit4:junit4]   2> 13436 T2921 oasc.ZkController.publish publishing core=collection1 state=down
[junit4:junit4]   2> 13436 T2921 oasc.ZkController.publish numShards not found on descriptor - reading it from system property
[junit4:junit4]   2> 14486 T2855 oascc.ZkStateReader.updateClusterState Updating cloud state from ZooKeeper... 
[junit4:junit4]   2> 14486 T2855 oasc.Overseer$ClusterStateUpdater.updateState Update state numShards=1 message={
[junit4:junit4]   2> 	  "operation":"state",
[junit4:junit4]   2> 	  "numShards":"1",
[junit4:junit4]   2> 	  "shard":null,
[junit4:junit4]   2> 	  "roles":null,
[junit4:junit4]   2> 	  "state":"down",
[junit4:junit4]   2> 	  "core":"collection1",
[junit4:junit4]   2> 	  "collection":"collection1",
[junit4:junit4]   2> 	  "node_name":"127.0.0.1:28439__i",
[junit4:junit4]   2> 	  "base_url":"http://127.0.0.1:28439/_i"}
[junit4:junit4]   2> 14487 T2855 oasc.Overseer$ClusterStateUpdater.updateState Collection already exists with numShards=1
[junit4:junit4]   2> 14487 T2855 oasc.Overseer$ClusterStateUpdater.updateState Assigning new node to shard shard=shard1
[junit4:junit4]   2> 14501 T2873 oascc.ZkStateReader$2.process A cluster state change: WatchedEvent state:SyncConnected type:NodeDataChanged path:/clusterstate.json, has occurred - updating... (live nodes size: 5)
[junit4:junit4]   2> 14501 T2860 oascc.ZkStateReader$2.process A cluster state change: WatchedEvent state:SyncConnected type:NodeDataChanged path:/clusterstate.json, has occurred - updating... (live nodes size: 5)
[junit4:junit4]   2> 14501 T2920 oascc.ZkStateReader$2.process A cluster state change: WatchedEvent state:SyncConnected type:NodeDataChanged path:/clusterstate.json, has occurred - updating... (live nodes size: 5)
[junit4:junit4]   2> 14501 T2888 oascc.ZkStateReader$2.process A cluster state change: WatchedEvent state:SyncConnected type:NodeDataChanged path:/clusterstate.json, has occurred - updating... (live nodes size: 5)
[junit4:junit4]   2> 14501 T2904 oascc.ZkStateReader$2.process A cluster state change: WatchedEvent state:SyncConnected type:NodeDataChanged path:/clusterstate.json, has occurred - updating... (live nodes size: 5)
[junit4:junit4]   2> 14501 T2854 oascc.ZkStateReader$2.process A cluster state change: WatchedEvent state:SyncConnected type:NodeDataChanged path:/clusterstate.json, has occurred - updating... (live nodes size: 5)
[junit4:junit4]   2>  C193_STATE=coll:collection1 core:collection1 props:{shard=shard1, roles=null, state=recovering, core=collection1, collection=collection1, node_name=127.0.0.1:30066__i, base_url=http://127.0.0.1:30066/_i}
[junit4:junit4]   2> 15405 T2907 C193 P30066 oasc.RecoveryStrategy.doRecovery Attempting to PeerSync from http://127.0.0.1:23568/_i/collection1/ core=collection1 - recoveringAfterStartup=true
[junit4:junit4]   2> 15405 T2907 C193 P30066 oasu.PeerSync.sync PeerSync: core=collection1 url=http://127.0.0.1:30066/_i START replicas=[http://127.0.0.1:23568/_i/collection1/] nUpdates=100
[junit4:junit4]   2> 15405 T2907 C193 P30066 oasu.PeerSync.sync WARNING no frame of reference to tell of we've missed updates
[junit4:junit4]   2> 15406 T2907 C193 P30066 oasc.RecoveryStrategy.doRecovery PeerSync Recovery was not successful - trying replication. core=collection1
[junit4:junit4]   2> 15406 T2907 C193 P30066 oasc.RecoveryStrategy.doRecovery Starting Replication Recovery. core=collection1
[junit4:junit4]   2> 15406 T2907 C193 P30066 oasc.RecoveryStrategy.doRecovery Begin buffering updates. core=collection1
[junit4:junit4]   2> 15406 T2907 C193 P30066 oasu.UpdateLog.bufferUpdates Starting to buffer updates. FSUpdateLog{state=ACTIVE, tlog=null}
[junit4:junit4]   2> 15406 T2907 C193 P30066 oasc.RecoveryStrategy.replicate Attempting to replicate from http://127.0.0.1:23568/_i/collection1/. core=collection1
[junit4:junit4]   2> 15406 T2907 C193 P30066 oascsi.HttpClientUtil.createClient Creating new http client, config:maxConnections=128&maxConnectionsPerHost=32&followRedirects=false
[junit4:junit4]   2> 15408 T2865 C194 P23568 REQ /get {getVersions=100&distrib=false&wt=javabin&qt=/get&version=2} status=0 QTime=0 
[junit4:junit4]   2> 15419 T2868 C194 P23568 oasu.DirectUpdateHandler2.commit start commit{,optimize=false,openSearcher=false,waitSearcher=true,expungeDeletes=false,softCommit=false}
[junit4:junit4]   2> 15432 T2868 C194 P23568 oasc.SolrDeletionPolicy.onCommit SolrDeletionPolicy.onCommit: commits:num=2
[junit4:junit4]   2> 		commit{dir=RateLimitedDirectoryWrapper(NRTCachingDirectory(org.apache.lucene.store.NIOFSDirectory@/usr/home/hudson/hudson-slave/workspace/Lucene-Solr-Tests-4.x-Java6/solr/build/solr-core/test/J0/org.apache.solr.cloud.SyncSliceTest-1357607540510/jetty1/index lockFactory=org.apache.lucene.store.NativeFSLockFactory@37898c18; maxCacheMB=48.0 maxMergeSizeMB=4.0)),segFN=segments_2,generation=2,filenames=[segments_2]
[junit4:junit4]   2> 		commit{dir=RateLimitedDirectoryWrapper(NRTCachingDirectory(org.apache.lucene.store.NIOFSDirectory@/usr/home/hudson/hudson-slave/workspace/Lucene-Solr-Tests-4.x-Java6/solr/build/solr-core/test/J0/org.apache.solr.cloud.SyncSliceTest-1357607540510/jetty1/index lockFactory=org.apache.lucene.store.NativeFSLockFactory@37898c18; maxCacheMB=48.0 maxMergeSizeMB=4.0)),segFN=segments_3,generation=3,filenames=[segments_3]
[junit4:junit4]   2> 15432 T2868 C194 P23568 oasc.SolrDeletionPolicy.updateCommits newest commit = 3[segments_3]
[junit4:junit4]   2> 15433 T2868 C194 P23568 oasc.CachingDirectoryFactory.close Releasing directory:/usr/home/hudson/hudson-slave/workspace/Lucene-Solr-Tests-4.x-Java6/solr/build/solr-core/test/J0/./org.apache.solr.cloud.SyncSliceTest-1357607540510/jetty1
[junit4:junit4]   2> 15433 T2868 C194 P23568 oasu.DirectUpdateHandler2.commit end_commit_flush
[junit4:junit4]   2> 15433 T2868 C194 P23568 /update {waitSearcher=true&openSearcher=false&commit=true&wt=javabin&commit_end_point=true&version=2&softCommit=false} {commit=} 0 14
[junit4:junit4]   2> 15434 T2907 C193 P30066 oash.ReplicationHandler.inform Commits will be reserved for  10000
[junit4:junit4]   2> 15434 T2907 C193 P30066 oash.SnapPuller.<init>  No value set for 'pollInterval'. Timer Task not started.
[junit4:junit4]   2> 15437 T2867 C194 P23568 REQ /replication {command=indexversion&qt=/replication&wt=javabin&version=2} status=0 QTime=0 
[junit4:junit4]   2> 15438 T2907 C193 P30066 oash.SnapPuller.fetchLatestIndex Master's generation: 3
[junit4:junit4]   2> 15438 T2907 C193 P30066 oash.SnapPuller.fetchLatestIndex Slave's generation: 1
[junit4:junit4]   2> 15438 T2907 C193 P30066 oash.SnapPuller.fetchLatestIndex Starting replication process
[junit4:junit4]   2> 15440 T2867 C194 P23568 oasc.CachingDirectoryFactory.close Releasing directory:/usr/home/hudson/hudson-slave/workspace/Lucene-Solr-Tests-4.x-Java6/solr/build/solr-core/test/J0/./org.apache.solr.cloud.SyncSliceTest-1357607540510/jetty1
[junit4:junit4]   2> 15441 T2867 C194 P23568 oasc.CachingDirectoryFactory.close Releasing directory:/usr/home/hudson/hudson-slave/workspace/Lucene-Solr-Tests-4.x-Java6/solr/build/solr-core/test/J0/./org.apache.solr.cloud.SyncSliceTest-1357607540510/jetty1/index
[junit4:junit4]   2> 15441 T2867 C194 P23568 REQ /replication {command=filelist&qt=/replication&wt=javabin&generation=3&version=2} status=0 QTime=1 
[junit4:junit4]   2> 15441 T2907 C193 P30066 oash.SnapPuller.fetchLatestIndex Number of files in latest index in master: 1
[junit4:junit4]   2> 15442 T2907 C193 P30066 oasc.CachingDirectoryFactory.get return new directory for /usr/home/hudson/hudson-slave/workspace/Lucene-Solr-Tests-4.x-Java6/solr/build/solr-core/test/J0/./org.apache.solr.cloud.SyncSliceTest-1357607540510/jetty3/index.20130108031235948 forceNew:false
[junit4:junit4]   2> 15442 T2907 C193 P30066 oasc.CachingDirectoryFactory.close Releasing directory:/usr/home/hudson/hudson-slave/workspace/Lucene-Solr-Tests-4.x-Java6/solr/build/solr-core/test/J0/./org.apache.solr.cloud.SyncSliceTest-1357607540510/jetty3
[junit4:junit4]   2> 15443 T2907 C193 P30066 oash.SnapPuller.fetchLatestIndex Starting download to RateLimitedDirectoryWrapper(NRTCachingDirectory(org.apache.lucene.store.NIOFSDirectory@/usr/home/hudson/hudson-slave/workspace/Lucene-Solr-Tests-4.x-Java6/solr/build/solr-core/test/J0/org.apache.solr.cloud.SyncSliceTest-1357607540510/jetty3/index.20130108031235948 lockFactory=org.apache.lucene.store.NativeFSLockFactory@65338601; maxCacheMB=48.0 maxMergeSizeMB=4.0)) fullCopy=true
[junit4:junit4]   2> 15446 T2867 C194 P23568 REQ /replication {file=segments_3&command=filecontent&checksum=true&wt=filestream&qt=/replication&generation=3} status=0 QTime=0 
[junit4:junit4]   2> 15447 T2921 oasc.CoreContainer.registerCore registering core: collection1
[junit4:junit4]   2> 15447 T2921 oasc.ZkController.register Register replica - core:collection1 address:http://127.0.0.1:28439/_i collection:collection1 shard:shard1
[junit4:junit4]   2> 15447 T2907 C193 P30066 oasc.CachingDirectoryFactory.close Releasing directory:/usr/home/hudson/hudson-slave/workspace/Lucene-Solr-Tests-4.x-Java6/solr/build/solr-core/test/J0/./org.apache.solr.cloud.SyncSliceTest-1357607540510/jetty3/index
[junit4:junit4]   2> 15447 T2907 C193 P30066 oash.SnapPuller.fetchLatestIndex Total time taken for download : 0 secs
[junit4:junit4]   2> 15448 T2907 C193 P30066 oash.SnapPuller.modifyIndexProps New index installed. Updating index properties... index=index.20130108031235948
[junit4:junit4]   2> 15449 T2907 C193 P30066 oasc.CachingDirectoryFactory.close Releasing directory:/usr/home/hudson/hudson-slave/workspace/Lucene-Solr-Tests-4.x-Java6/solr/build/solr-core/test/J0/./org.apache.solr.cloud.SyncSliceTest-1357607540510/jetty3
[junit4:junit4]   2> 15449 T2907 C193 P30066 oasc.CachingDirectoryFactory.close Releasing directory:/usr/home/hudson/hudson-slave/workspace/Lucene-Solr-Tests-4.x-Java6/solr/build/solr-core/test/J0/./org.apache.solr.cloud.SyncSliceTest-1357607540510/jetty3
[junit4:junit4]   2> 15449 T2907 C193 P30066 oasc.SolrCore.getNewIndexDir New index directory detected: old=./org.apache.solr.cloud.SyncSliceTest-1357607540510/jetty3/index/ new=./org.apache.solr.cloud.SyncSliceTest-1357607540510/jetty3/index.20130108031235948
[junit4:junit4]   2> 15451 T2907 C193 P30066 oasc.SolrDeletionPolicy.onInit SolrDeletionPolicy.onInit: commits:num=1
[junit4:junit4]   2> 		commit{dir=RateLimitedDirectoryWrapper(NRTCachingDirectory(org.apache.lucene.store.NIOFSDirectory@/usr/home/hudson/hudson-slave/workspace/Lucene-Solr-Tests-4.x-Java6/solr/build/solr-core/test/J0/org.apache.solr.cloud.SyncSliceTest-1357607540510/jetty3/index.20130108031235948 lockFactory=org.apache.lucene.store.NativeFSLockFactory@65338601; maxCacheMB=48.0 maxMergeSizeMB=4.0)),segFN=segments_3,generation=3,filenames=[segments_3]
[junit4:junit4]   2> 15452 T2907 C193 P30066 oasc.SolrDeletionPolicy.updateCommits newest commit = 3[segments_3]
[junit4:junit4]   2> 15453 T2907 C193 P30066 oasc.CachingDirectoryFactory.close Releasing directory:/usr/home/hudson/hudson-slave/workspace/Lucene-Solr-Tests-4.x-Java6/solr/build/solr-core/test/J0/./org.apache.solr.cloud.SyncSliceTest-1357607540510/jetty3
[junit4:junit4]   2> 15453 T2907 C193 P30066 oasu.DefaultSolrCoreState.newIndexWriter Creating new IndexWriter...
[junit4:junit4]   2> 15453 T2907 C193 P30066 oasu.DefaultSolrCoreState.newIndexWriter Waiting until IndexWriter is unused... core=collection1
[junit4:junit4]   2> 15453 T2907 C193 P30066 oasu.DefaultSolrCoreState.newIndexWriter Rollback old IndexWriter... core=collection1
[junit4:junit4]   2> 15454 T2907 C193 P30066 oasc.CachingDirectoryFactory.close Releasing directory:/usr/home/hudson/hudson-slave/workspace/Lucene-Solr-Tests-4.x-Java6/solr/build/solr-core/test/J0/./org.apache.solr.cloud.SyncSliceTest-1357607540510/jetty3/index.20130108031235948
[junit4:junit4]   2> 15454 T2907 C193 P30066 oasc.CachingDirectoryFactory.close Releasing directory:/usr/home/hudson/hudson-slave/workspace/Lucene-Solr-Tests-4.x-Java6/solr/build/solr-core/test/J0/./org.apache.solr.cloud.SyncSliceTest-1357607540510/jetty3
[junit4:junit4]   2> 15455 T2921 oasc.ZkController.register We are http://127.0.0.1:28439/_i/collection1/ and leader is http://127.0.0.1:23568/_i/collection1/
[junit4:junit4]   2> 15455 T2921 oasc.ZkController.register No LogReplay needed for core=collection1 baseURL=http://127.0.0.1:28439/_i
[junit4:junit4]   2> 15456 T2921 oasc.ZkController.checkRecovery Core needs to recover:collection1
[junit4:junit4]   2> 15456 T2921 oasu.DefaultSolrCoreState.doRecovery Running recovery - first canceling any ongoing recovery
[junit4:junit4]   2> ASYNC  NEW_CORE C195 name=collection1 org.apache.solr.core.SolrCore@169347e0 url=http://127.0.0.1:28439/_i/collection1 node=127.0.0.1:28439__i C195_STATE=coll:collection1 core:collection1 props:{shard=null, roles=null, state=down, core=collection1, collection=collection1, node_name=127.0.0.1:28439__i, base_url=http://127.0.0.1:28439/_i}
[junit4:junit4]   2> 15456 T2927 C195 P28439 oasc.RecoveryStrategy.run Starting recovery process.  core=collection1 recoveringAfterStartup=true
[junit4:junit4]   2> 15456 T2921 oascc.ZkStateReader.updateClusterState Updating cloud state from ZooKeeper... 
[junit4:junit4]   2> 15456 T2927 C195 P28439 oasc.RecoveryStrategy.doRecovery ###### startupVersions=[]
[junit4:junit4]   2> 15456 T2907 C193 P30066 oasc.SolrDeletionPolicy.onInit SolrDeletionPolicy.onInit: commits:num=1
[junit4:junit4]   2> 		commit{dir=RateLimitedDirectoryWrapper(NRTCachingDirectory(org.apache.lucene.store.NIOFSDirectory@/usr/home/hudson/hudson-slave/workspace/Lucene-Solr-Tests-4.x-Java6/solr/build/solr-core/test/J0/org.apache.solr.cloud.SyncSliceTest-1357607540510/jetty3/index.20130108031235948 lockFactory=org.apache.lucene.store.NativeFSLockFactory@65338601; maxCacheMB=48.0 maxMergeSizeMB=4.0)),segFN=segments_3,generation=3,filenames=[segments_3]
[junit4:junit4]   2> 15457 T2907 C193 P30066 oasc.SolrDeletionPolicy.updateCommits newest commit = 3[segments_3]
[junit4:junit4]   2> 15457 T2927 C195 P28439 oasc.ZkController.publish publishing core=collection1 state=recovering
[junit4:junit4]   2> 15457 T2907 C193 P30066 oasu.DefaultSolrCoreState.newIndexWriter New IndexWriter is ready to be used.
[junit4:junit4]   2> 15457 T2927 C195 P28439 oasc.ZkController.publish numShards not found on descriptor - reading it from system property
[junit4:junit4]   2> 15457 T2907 C193 P30066 oasc.CachingDirectoryFactory.close Releasing directory:/usr/home/hudson/hudson-slave/workspace/Lucene-Solr-Tests-4.x-Java6/solr/build/solr-core/test/J0/./org.apache.solr.cloud.SyncSliceTest-1357607540510/jetty3
[junit4:junit4]   2> 15457 T2832 oass.SolrDispatchFilter.init user.dir=/usr/home/hudson/hudson-slave/workspace/Lucene-Solr-Tests-4.x-Java6/solr/build/solr-core/test/J0
[junit4:junit4]   2> 15457 T2907 C193 P30066 oass.SolrIndexSearcher.<init> Opening Searcher@20956e13 main
[junit4:junit4]   2> 15457 T2832 oass.SolrDispatchFilter.init SolrDispatchFilter.init() done
[junit4:junit4]   2> 15458 T2832 oascsi.HttpClientUtil.createClient Creating new http client, config:maxConnections=128&maxConnectionsPerHost=32&followRedirects=false
[junit4:junit4]   2> 15459 T2906 oasc.SolrCore.registerSearcher [collection1] Registered new searcher Searcher@20956e13 main{StandardDirectoryReader(segments_3:1:nrt)}
[junit4:junit4]   2> 15459 T2906 oasc.CachingDirectoryFactory.close Releasing directory:/usr/home/hudson/hudson-slave/workspace/Lucene-Solr-Tests-4.x-Java6/solr/build/solr-core/test/J0/./org.apache.solr.cloud.SyncSliceTest-1357607540510/jetty3/index
[junit4:junit4]   2> 15459 T2907 C193 P30066 oasu.DirectUpdateHandler2.commit start commit{,optimize=false,openSearcher=false,waitSearcher=false,expungeDeletes=false,softCommit=false}
[junit4:junit4]   2> 15460 T2927 C195 P28439 oascsi.HttpClientUtil.createClient Creating new http client, config:maxConnections=128&maxConnectionsPerHost=32&followRedirects=false
[junit4:junit4]   2> 15463 T2907 C193 P30066 oasc.SolrDeletionPolicy.onCommit SolrDeletionPolicy.onCommit: commits:num=2
[junit4:junit4]   2> 		commit{dir=RateLimitedDirectoryWrapper(NRTCachingDirectory(org.apache.lucene.store.NIOFSDirectory@/usr/home/hudson/hudson-slave/workspace/Lucene-Solr-Tests-4.x-Java6/solr/build/solr-core/test/J0/org.apache.solr.cloud.SyncSliceTest-1357607540510/jetty3/index.20130108031235948 lockFactory=org.apache.lucene.store.NativeFSLockFactory@65338601; maxCacheMB=48.0 maxMergeSizeMB=4.0)),segFN=segments_3,generation=3,filenames=[segments_3]
[junit4:junit4]   2> 		commit{dir=RateLimitedDirectoryWrapper(NRTCachingDirectory(org.apache.lucene.store.NIOFSDirectory@/usr/home/hudson/hudson-slave/workspace/Lucene-Solr-Tests-4.x-Java6/solr/build/solr-core/test/J0/org.apache.solr.cloud.SyncSliceTest-1357607540510/jetty3/index.20130108031235948 lockFactory=org.apache.lucene.store.NativeFSLockFactory@65338601; maxCacheMB=48.0 maxMergeSizeMB=4.0)),segFN=segments_4,generation=4,filenames=[segments_4]
[junit4:junit4]   2> 15463 T2907 C193 P30066 oasc.SolrDeletionPolicy.updateCommits newest commit = 4[segments_4]
[junit4:junit4]   2> 15464 T2907 C193 P30066 oasc.CachingDirectoryFactory.close Releasing directory:/usr/home/hudson/hudson-slave/workspace/Lucene-Solr-Tests-4.x-Java6/solr/build/solr-core/test/J0/./org.apache.solr.cloud.SyncSliceTest-1357607540510/jetty3
[junit4:junit4]   2> 15464 T2907 C193 P30066 oasu.DirectUpdateHandler2.commit end_commit_flush
[junit4:junit4]   2> 15464 T2907 C193 P30066 oasc.CachingDirectoryFactory.close Releasing directory:/usr/home/hudson/hudson-slave/workspace/Lucene-Solr-Tests-4.x-Java6/solr/build/solr-core/test/J0/./org.apache.solr.cloud.SyncSliceTest-1357607540510/jetty3/index.20130108031235948
[junit4:junit4]   2> 15464 T2907 C193 P30066 oasc.CachingDirectoryFactory.close Releasing directory:/usr/home/hudson/hudson-slave/workspace/Lucene-Solr-Tests-4.x-Java6/solr/build/solr-core/test/J0/./org.apache.solr.cloud.SyncSliceTest-1357607540510/jetty3/index
[junit4:junit4]   2> 15464 T2907 C193 P30066 oasc.RecoveryStrategy.replay No replay needed. core=collection1
[junit4:junit4]   2> 15465 T2907 C193 P30066 oasc.RecoveryStrategy.doRecovery Replication Recovery was successful - registering as Active. core=collection1
[junit4:junit4]   2> 15465 T2907 C193 P30066 oasc.ZkController.publish publishing core=collection1 state=active
[junit4:junit4]   2> 15465 T2907 C193 P30066 oasc.ZkController.publish numShards not found on descriptor - reading it from system property
[junit4:junit4]   2> 15471 T2907 C193 P30066 oasc.RecoveryStrategy.doRecovery Finished recovery process. core=collection1
[junit4:junit4]   2> 15478 T2832 oascc.ZkStateReader.updateClusterState Updating cloud state from ZooKeeper... 
[junit4:junit4]   2> 15479 T2832 oasc.AbstractFullDistribZkTestBase.waitForThingsToLevelOut Wait for recoveries to finish - wait 15 for each attempt
[junit4:junit4]   2> 15479 T2832 oasc.AbstractDistribZkTestBase.waitForRecoveriesToFinish Wait for recoveries to finish - collection: collection1 failOnTimeout:true timeout (sec):15
[junit4:junit4]   2> 15479 T2832 oascc.ZkStateReader.updateClusterState Updating cloud state from ZooKeeper... 
[junit4:junit4]   2> 16005 T2855 oascc.ZkStateReader.updateClusterState Updating cloud state from ZooKeeper... 
[junit4:junit4]   2> 16006 T2855 oasc.Overseer$ClusterStateUpdater.updateState Update state numShards=1 message={
[junit4:junit4]   2> 	  "operation":"state",
[junit4:junit4]   2> 	  "numShards":"1",
[junit4:junit4]   2> 	  "shard":"shard1",
[junit4:junit4]   2> 	  "roles":null,
[junit4:junit4]   2> 	  "state":"recovering",
[junit4:junit4]   2> 	  "core":"collection1",
[junit4:junit4]   2> 	  "collection":"collection1",
[junit4:junit4]   2> 	  "node_name":"127.0.0.1:28439__i",
[junit4:junit4]   2> 	  "base_url":"http://127.0.0.1:28439/_i"}
[junit4:junit4]   2> 16010 T2855 oasc.Overseer$ClusterStateUpdater.updateState Update state numShards=1 message={
[junit4:junit4]   2> 	  "operation":"state",
[junit4:junit4]   2> 	  "numShards":"1",
[junit4:junit4]   2> 	  "shard":"shard1",
[junit4:junit4]   2> 	  "roles":null,
[junit4:junit4]   2> 	  "state":"active",
[junit4:junit4]   2> 	  "core":"collection1",
[junit4:junit4]   2> 	  "collection":"collection1",
[junit4:junit4]   2> 	  "node_name":"127.0.0.1:30066__i",
[junit4:junit4]   2> 	  "base_url":"http://127.0.0.1:30066/_i"}
[junit4:junit4]   2> 16030 T2920 oascc.ZkStateReader$2.process A cluster state change: WatchedEvent state:SyncConnected type:NodeDataChanged path:/clusterstate.json, has occurred - updating... (live nodes size: 5)
[junit4:junit4]   2> 16030 T2904 oascc.ZkStateReader$2.process A cluster state change: WatchedEvent state:SyncConnected type:NodeDataChanged path:/clusterstate.json, has occurred - updating... (live nodes size: 5)
[junit4:junit4]   2> 16030 T2873 oascc.ZkStateReader$2.process A cluster state change: WatchedEvent state:SyncConnected type:NodeDataChanged path:/clusterstate.json, has occurred - updating... (live nodes size: 5)
[junit4:junit4]   2> 16030 T2860 oascc.ZkStateReader$2.process A cluster state change: WatchedEvent state:SyncConnected type:NodeDataChanged path:/clusterstate.json, has occurred - updating... (live nodes size: 5)
[junit4:junit4]   2> 16030 T2854 oascc.ZkStateReader$2.process A cluster state change: WatchedEvent state:SyncConnected type:NodeDataChanged path:/clusterstate.json, has occurred - updating... (live nodes size: 5)
[junit4:junit4]   2> 16030 T2888 oascc.ZkStateReader$2.process A cluster state change: WatchedEvent state:SyncConnected type:NodeDataChanged path:/clusterstate.json, has occurred - updating... (live nodes size: 5)
[junit4:junit4]   2> 16481 T2832 oascc.ZkStateReader.updateClusterState Updating cloud state from ZooKeeper... 
[junit4:junit4]   2> 17483 T2832 oascc.ZkStateReader.updateClusterState Updating cloud state from ZooKeeper... 
[junit4:junit4]   2>  C195_STATE=coll:collection1 core:collection1 props:{shard=shard1, roles=null, state=recovering, core=collection1, collection=collection1, node_name=127.0.0.1:28439__i, base_url=http://127.0.0.1:28439/_i}
[junit4:junit4]   2> 18480 T2927 C195 P28439 oasc.RecoveryStrategy.doRecovery Attempting to PeerSync from http://127.0.0.1:23568/_i/collection1/ core=collection1 - recoveringAfterStartup=true
[junit4:junit4]   2> 18480 T2927 C195 P28439 oasu.PeerSync.sync PeerSync: core=collection1 url=http://127.0.0.1:28439/_i START replicas=[http://127.0.0.1:23568/_i/collection1/] nUpdates=100
[junit4:junit4]   2> 18481 T2927 C195 P28439 oasu.PeerSync.sync WARNING no frame of reference to tell of we've missed updates
[junit4:junit4]   2> 18481 T2927 C195 P28439 oasc.RecoveryStrategy.doRecovery PeerSync Recovery was not successful - trying replication. core=collection1
[junit4:junit4]   2> 18481 T2927 C195 P28439 oasc.RecoveryStrategy.doRecovery Starting Replication Recovery. core=collection1
[junit4:junit4]   2> 18481 T2927 C195 P28439 oasc.RecoveryStrategy.doRecovery Begin buffering updates. core=collection1
[junit4:junit4]   2> 18481 T2927 C195 P28439 oasu.UpdateLog.bufferUpdates Starting to buffer updates. FSUpdateLog{state=ACTIVE, tlog=null}
[junit4:junit4]   2> 18481 T2927 C195 P28439 oasc.RecoveryStrategy.replicate Attempting to replicate from http://127.0.0.1:23568/_i/collection1/. core=collection1
[junit4:junit4]   2> 18482 T2927 C195 P28439 oascsi.HttpClientUtil.createClient Creating new http client, config:maxConnections=128&maxConnectionsPerHost=32&followRedirects=false
[junit4:junit4]   2> 18483 T2865 C194 P23568 REQ /get {getVersions=100&distrib=false&wt=javabin&qt=/get&version=2} status=0 QTime=0 
[junit4:junit4]   2> 18485 T2832 oascc.ZkStateReader.updateClusterState Updating cloud state from ZooKeeper... 
[junit4:junit4]   2> 18494 T2863 C194 P23568 oasu.DirectUpdateHandler2.commit start commit{,optimize=false,openSearcher=false,waitSearcher=true,expungeDeletes=false,softCommit=false}
[junit4:junit4]   2> 18498 T2863 C194 P23568 oasc.SolrDeletionPolicy.onCommit SolrDeletionPolicy.onCommit: commits:num=3
[junit4:junit4]   2> 		commit{dir=RateLimitedDirectoryWrapper(NRTCachingDirectory(org.apache.lucene.store.NIOFSDirectory@/usr/home/hudson/hudson-slave/workspace/Lucene-Solr-Tests-4.x-Java6/solr/build/solr-core/test/J0/org.apache.solr.cloud.SyncSliceTest-1357607540510/jetty1/index lockFactory=org.apache.lucene.store.NativeFSLockFactory@37898c18; maxCacheMB=48.0 maxMergeSizeMB=4.0)),segFN=segments_2,generation=2,filenames=[segments_2]
[junit4:junit4]   2> 		commit{dir=RateLimitedDirectoryWrapper(NRTCachingDirectory(org.apache.lucene.store.NIOFSDirectory@/usr/home/hudson/hudson-slave/workspace/Lucene-Solr-Tests-4.x-Java6/solr/build/solr-core/test/J0/org.apache.solr.cloud.SyncSliceTest-1357607540510/jetty1/index lockFactory=org.apache.lucene.store.NativeFSLockFactory@37898c18; maxCacheMB=48.0 maxMergeSizeMB=4.0)),segFN=segments_3,generation=3,filenames=[segments_3]
[junit4:junit4]   2> 		commit{dir=RateLimitedDirectoryWrapper(NRTCachingDirectory(org.apache.lucene.store.NIOFSDirectory@/usr/home/hudson/hudson-slave/workspace/Lucene-Solr-Tests-4.x-Java6/solr/build/solr-core/test/J0/org.apache.solr.cloud.SyncSliceTest-1357607540510/jetty1/index lockFactory=org.apache.lucene.store.NativeFSLockFactory@37898c18; maxCacheMB=48.0 maxMergeSizeMB=4.0)),segFN=segments_4,generation=4,filenames=[segments_4]
[junit4:junit4]   2> 18498 T2863 C194 P23568 oasc.SolrDeletionPolicy.updateCommits newest commit = 4[segments_4]
[junit4:junit4]   2> 18499 T2863 C194 P23568 oasc.CachingDirectoryFactory.close Releasing directory:/usr/home/hudson/hudson-slave/workspace/Lucene-Solr-Tests-4.x-Java6/solr/build/solr-core/test/J0/./org.apache.solr.cloud.SyncSliceTest-1357607540510/jetty1
[junit4:junit4]   2> 18499 T2863 C194 P23568 oasu.DirectUpdateHandler2.commit end_commit_flush
[junit4:junit4]   2> 18500 T2863 C194 P23568 /update {waitSearcher=true&openSearcher=false&commit=true&wt=javabin&commit_end_point=true&version=2&softCommit=false} {commit=} 0 7
[junit4:junit4]   2> 18500 T2927 C195 P28439 oash.ReplicationHandler.inform Commits will be reserved for  10000
[junit4:junit4]   2> 18501 T2927 C195 P28439 oash.SnapPuller.<init>  No value set for 'pollInterval'. Timer Task not started.
[junit4:junit4]   2> 18503 T2867 C194 P23568 REQ /replication {command=indexversion&qt=/replication&wt=javabin&version=2} status=0 QTime=0 
[junit4:junit4]   2> 18504 T2927 C195 P28439 oash.SnapPuller.fetchLatestIndex Master's generation: 4
[junit4:junit4]   2> 18504 T2927 C195 P28439 oash.SnapPuller.fetchLatestIndex Slave's generation: 1
[junit4:junit4]   2> 18504 T2927 C195 P28439 oash.SnapPuller.fetchLatestIndex Starting replication process
[junit4:junit4]   2> 18506 T2867 C194 P23568 oasc.CachingDirectoryFactory.close Releasing directory:/usr/home/hudson/hudson-slave/workspace/Lucene-Solr-Tests-4.x-Java6/solr/build/solr-core/test/J0/./org.apache.solr.cloud.SyncSliceTest-1357607540510/jetty1
[junit4:junit4]   2> 18507 T2867 C194 P23568 oasc.CachingDirectoryFactory.close Releasing directory:/usr/home/hudson/hudson-slave/workspace/Lucene-Solr-Tests-4.x-Java6/solr/build/solr-core/test/J0/./org.apache.solr.cloud.SyncSliceTest-1357607540510/jetty1/index
[junit4:junit4]   2> 18507 T2867 C194 P23568 REQ /replication {command=filelist&qt=/replication&wt=javabin&generation=4&version=2} status=0 QTime=1 
[junit4:junit4]   2> 18508 T2927 C195 P28439 oash.SnapPuller.fetchLatestIndex Number of files in latest index in master: 1
[junit4:junit4]   2> 18509 T2927 C195 P28439 oasc.CachingDirectoryFactory.get return new directory for /usr/home/hudson/hudson-slave/workspace/Lucene-Solr-Tests-4.x-Java6/solr/build/solr-core/test/J0/./org.apache.solr.cloud.SyncSliceTest-1357607540510/jetty4/index.20130108031239014 forceNew:false
[junit4:junit4]   2> 18509 T2927 C195 P28439 oasc.CachingDirectoryFactory.close Releasing directory:/usr/home/hudson/hudson-slave/workspace/Lucene-Solr-Tests-4.x-Java6/solr/build/solr-core/test/J0/./org.apache.solr.cloud.SyncSliceTest-1357607540510/jetty4
[junit4:junit4]   2> 18510 T2927 C195 P28439 oash.SnapPuller.fetchLatestIndex Starting download to RateLimitedDirectoryWrapper(NRTCachingDirectory(org.apache.lucene.store.NIOFSDirectory@/usr/home/hudson/hudson-slave/workspace/Lucene-Solr-Tests-4.x-Java6/solr/build/solr-core/test/J0/org.apache.solr.cloud.SyncSliceTest-1357607540510/jetty4/index.20130108031239014 lockFactory=org.apache.lucene.store.NativeFSLockFactory@496ff8d6; maxCacheMB=48.0 maxMergeSizeMB=4.0)) fullCopy=true
[junit4:junit4]   2> 18518 T2867 C194 P23568 REQ /replication {file=segments_4&command=filecontent&checksum=true&wt=filestream&qt=/replication&generation=4} status=0 QTime=0 
[junit4:junit4]   2> 18519 T2927 C195 P28439 oasc.CachingDirectoryFactory.close Releasing directory:/usr/home/hudson/hudson-slave/workspace/Lucene-Solr-Tests-4.x-Java6/solr/build/solr-core/test/J0/./org.apache.solr.cloud.SyncSliceTest-1357607540510/jetty4/index
[junit4:junit4]   2> 18519 T2927 C195 P28439 oash.SnapPuller.fetchLatestIndex Total time taken for download : 0 secs
[junit4:junit4]   2> 18520 T2927 C195 P28439 oash.SnapPuller.modifyIndexProps New index installed. Updating index properties... index=index.20130108031239014
[junit4:junit4]   2> 18521 T2927 C195 P28439 oasc.CachingDirectoryFactory.close Releasing directory:/usr/home/hudson/hudson-slave/workspace/Lucene-Solr-Tests-4.x-Java6/solr/build/solr-core/test/J0/./org.apache.solr.cloud.SyncSliceTest-1357607540510/jetty4
[junit4:junit4]   2> 18522 T2927 C195 P28439 oasc.CachingDirectoryFactory.close Releasing directory:/usr/home/hudson/hudson-slave/workspace/Lucene-Solr-Tests-4.x-Java6/solr/build/solr-core/test/J0/./org.apache.solr.cloud.SyncSliceTest-1357607540510/jetty4
[junit4:junit4]   2> 18522 T2927 C195 P28439 oasc.SolrCore.getNewIndexDir New index directory detected: old=./org.apache.solr.cloud.SyncSliceTest-1357607540510/jetty4/index/ new=./org.apache.solr.cloud.SyncSliceTest-1357607540510/jetty4/index.20130108031239014
[junit4:junit4]   2> 18525 T2927 C195 P28439 oasc.SolrDeletionPolicy.onInit SolrDeletionPolicy.onInit: commits:num=1
[junit4:junit4]   2> 		commit{dir=RateLimitedDirectoryWrapper(NRTCachingDirectory(org.apache.lucene.store.NIOFSDirectory@/usr/home/hudson/hudson-slave/workspace/Lucene-Solr-Tests-4.x-Java6/solr/build/solr-core/test/J0/org.apache.solr.cloud.SyncSliceTest-1357607540510/jetty4/index.20130108031239014 lockFactory=org.apache.lucene.store.NativeFSLockFactory@496ff8d6; maxCacheMB=48.0 maxMergeSizeMB=4.0)),segFN=segments_4,generation=4,filenames=[segments_4]
[junit4:junit4]   2> 18527 T2927 C195 P28439 oasc.SolrDeletionPolicy.updateCommits newest commit = 4[segments_4]
[junit4:junit4]   2> 18528 T2927 C195 P28439 oasc.CachingDirectoryFactory.close Releasing directory:/usr/home/hudson/hudson-slave/workspace/Lucene-Solr-Tests-4.x-Java6/solr/build/solr-core/test/J0/./org.apache.solr.cloud.SyncSliceTest-1357607540510/jetty4
[junit4:junit4]   2> 18528 T2927 C195 P28439 oasu.DefaultSolrCoreState.newIndexWriter Creating new IndexWriter...
[junit4:junit4]   2> 18528 T2927 C195 P28439 oasu.DefaultSolrCoreState.newIndexWriter Waiting until IndexWriter is unused... core=collection1
[junit4:junit4]   2> 18528 T2927 C195 P28439 oasu.DefaultSolrCoreState.newIndexWriter Rollback old IndexWriter... core=collection1
[junit4:junit4]   2> 18529 T2927 C195 P28439 oasc.CachingDirectoryFactory.close Releasing directory:/usr/home/hudson/hudson-slave/workspace/Lucene-Solr-Tests-4.x-Java6/solr/build/solr-core/test/J0/./org.apache.solr.cloud.SyncSliceTest-1357607540510/jetty4/index.20130108031239014
[junit4:junit4]   2> 18530 T2927 C195 P28439 oasc.CachingDirectoryFactory.close Releasing directory:/usr/home/hudson/hudson-slave/workspace/Lucene-Solr-Tests-4.x-Java6/solr/build/solr-core/test/J0/./org.apache.solr.cloud.SyncSliceTest-1357607540510/jetty4
[junit4:junit4]   2> 18533 T2927 C195 P28439 oasc.SolrDeletionPolicy.onInit SolrDeletionPolicy.onInit: commits:num=1
[junit4:junit4]   2> 		commit{dir=RateLimitedDirectoryWrapper(NRTCachingDirectory(org.apache.lucene.store.NIOFSDirectory@/usr/home/hudson/hudson-slave/workspace/Lucene-Solr-Tests-4.x-Java6/solr/build/solr-core/test/J0/org.apache.solr.cloud.SyncSliceTest-1357607540510/jetty4/index.20130108031239014 lockFactory=org.apache.lucene.store.NativeFSLockFactory@496ff8d6; maxCacheMB=48.0 maxMergeSizeMB=4.0)),segFN=segments_4,generation=4,filenames=[segments_4]
[junit4:junit4]   2> 18533 T2927 C195 P28439 oasc.SolrDeletionPolicy.updateCommits newest commit = 4[segments_4]
[junit4:junit4]   2> 18534 T2927 C195 P28439 oasu.DefaultSolrCoreState.newIndexWriter New IndexWriter is ready to be used.
[junit4:junit4]   2> 18534 T2927 C195 P28439 oasc.CachingDirectoryFactory.close Releasing directory:/usr/home/hudson/hudson-slave/workspace/Lucene-Solr-Tests-4.x-Java6/solr/build/solr-core/test/J0/./org.apache.solr.cloud.SyncSliceTest-1357607540510/jetty4
[junit4:junit4]   2> 18534 T2927 C195 P28439 oass.SolrIndexSearcher.<init> Opening Searcher@75d35903 main
[junit4:junit4]   2> 18536 T2924 oasc.SolrCore.registerSearcher [collection1] Registered new searcher Searcher@75d35903 main{StandardDirectoryReader(segments_4:1:nrt)}
[junit4:junit4]   2> 18536 T2924 oasc.CachingDirectoryFactory.close Releasing directory:/usr/home/hudson/hudson-slave/workspace/Lucene-Solr-Tests-4.x-Java6/solr/build/solr-core/test/J0/./org.apache.solr.cloud.SyncSliceTest-1357607540510/jetty4/in

[...truncated too long message...]

rDown ###Ending testDistribSearch
[junit4:junit4]   1> client port:0.0.0.0/0.0.0.0:0
[junit4:junit4]   2> NOTE: reproduce with: ant test  -Dtestcase=SyncSliceTest -Dtests.method=testDistribSearch -Dtests.seed=B636BE65C4A8809F -Dtests.multiplier=3 -Dtests.slow=true -Dtests.locale=zh_HK -Dtests.timezone=Europe/Helsinki -Dtests.file.encoding=UTF-8
[junit4:junit4] FAILURE  141s J0 | SyncSliceTest.testDistribSearch <<<
[junit4:junit4]    > Throwable #1: java.lang.AssertionError: shard1 should have just been set up to be inconsistent - but it's still consistent
[junit4:junit4]    > 	at __randomizedtesting.SeedInfo.seed([B636BE65C4A8809F:37D0307DB3F7E0A3]:0)
[junit4:junit4]    > 	at org.junit.Assert.fail(Assert.java:93)
[junit4:junit4]    > 	at org.junit.Assert.assertTrue(Assert.java:43)
[junit4:junit4]    > 	at org.junit.Assert.assertNotNull(Assert.java:526)
[junit4:junit4]    > 	at org.apache.solr.cloud.SyncSliceTest.doTest(SyncSliceTest.java:214)
[junit4:junit4]    > 	at org.apache.solr.BaseDistributedSearchTestCase.testDistribSearch(BaseDistributedSearchTestCase.java:794)
[junit4:junit4]    > 	at sun.reflect.NativeMethodAccessorImpl.invoke0(Native Method)
[junit4:junit4]    > 	at sun.reflect.NativeMethodAccessorImpl.invoke(NativeMethodAccessorImpl.java:57)
[junit4:junit4]    > 	at sun.reflect.DelegatingMethodAccessorImpl.invoke(DelegatingMethodAccessorImpl.java:43)
[junit4:junit4]    > 	at java.lang.reflect.Method.invoke(Method.java:616)
[junit4:junit4]    > 	at com.carrotsearch.randomizedtesting.RandomizedRunner.invoke(RandomizedRunner.java:1559)
[junit4:junit4]    > 	at com.carrotsearch.randomizedtesting.RandomizedRunner.access$600(RandomizedRunner.java:79)
[junit4:junit4]    > 	at com.carrotsearch.randomizedtesting.RandomizedRunner$6.evaluate(RandomizedRunner.java:737)
[junit4:junit4]    > 	at com.carrotsearch.randomizedtesting.RandomizedRunner$7.evaluate(RandomizedRunner.java:773)
[junit4:junit4]    > 	at com.carrotsearch.randomizedtesting.RandomizedRunner$8.evaluate(RandomizedRunner.java:787)
[junit4:junit4]    > 	at com.carrotsearch.randomizedtesting.rules.SystemPropertiesRestoreRule$1.evaluate(SystemPropertiesRestoreRule.java:53)
[junit4:junit4]    > 	at org.apache.lucene.util.TestRuleSetupTeardownChained$1.evaluate(TestRuleSetupTeardownChained.java:50)
[junit4:junit4]    > 	at org.apache.lucene.util.TestRuleFieldCacheSanity$1.evaluate(TestRuleFieldCacheSanity.java:51)
[junit4:junit4]    > 	at org.apache.lucene.util.AbstractBeforeAfterRule$1.evaluate(AbstractBeforeAfterRule.java:46)
[junit4:junit4]    > 	at com.carrotsearch.randomizedtesting.rules.SystemPropertiesInvariantRule$1.evaluate(SystemPropertiesInvariantRule.java:55)
[junit4:junit4]    > 	at org.apache.lucene.util.TestRuleThreadAndTestName$1.evaluate(TestRuleThreadAndTestName.java:49)
[junit4:junit4]    > 	at org.apache.lucene.util.TestRuleIgnoreAfterMaxFailures$1.evaluate(TestRuleIgnoreAfterMaxFailures.java:70)
[junit4:junit4]    > 	at org.apache.lucene.util.TestRuleMarkFailure$1.evaluate(TestRuleMarkFailure.java:48)
[junit4:junit4]    > 	at com.carrotsearch.randomizedtesting.rules.StatementAdapter.evaluate(StatementAdapter.java:36)
[junit4:junit4]    > 	at com.carrotsearch.randomizedtesting.ThreadLeakControl$StatementRunner.run(ThreadLeakControl.java:358)
[junit4:junit4]    > 	at com.carrotsearch.randomizedtesting.ThreadLeakControl.forkTimeoutingTask(ThreadLeakControl.java:782)
[junit4:junit4]    > 	at com.carrotsearch.randomizedtesting.ThreadLeakControl$3.evaluate(ThreadLeakControl.java:442)
[junit4:junit4]    > 	at com.carrotsearch.randomizedtesting.RandomizedRunner.runSingleTest(RandomizedRunner.java:746)
[junit4:junit4]    > 	at com.carrotsearch.randomizedtesting.RandomizedRunner$3.evaluate(RandomizedRunner.java:648)
[junit4:junit4]    > 	at com.carrotsearch.randomizedtesting.RandomizedRunner$4.evaluate(RandomizedRunner.java:682)
[junit4:junit4]    > 	at com.carrotsearch.randomizedtesting.RandomizedRunner$5.evaluate(RandomizedRunner.java:693)
[junit4:junit4]    > 	at com.carrotsearch.randomizedtesting.rules.StatementAdapter.evaluate(StatementAdapter.java:36)
[junit4:junit4]    > 	at com.carrotsearch.randomizedtesting.rules.SystemPropertiesRestoreRule$1.evaluate(SystemPropertiesRestoreRule.java:53)
[junit4:junit4]    > 	at org.apache.lucene.util.AbstractBeforeAfterRule$1.evaluate(AbstractBeforeAfterRule.java:46)
[junit4:junit4]    > 	at org.apache.lucene.util.TestRuleStoreClassName$1.evaluate(TestRuleStoreClassName.java:42)
[junit4:junit4]    > 	at com.carrotsearch.randomizedtesting.rules.SystemPropertiesInvariantRule$1.evaluate(SystemPropertiesInvariantRule.java:55)
[junit4:junit4]    > 	at com.carrotsearch.randomizedtesting.rules.NoShadowingOrOverridesOnMethodsRule$1.evaluate(NoShadowingOrOverridesOnMethodsRule.java:39)
[junit4:junit4]    > 	at com.carrotsearch.randomizedtesting.rules.NoShadowingOrOverridesOnMethodsRule$1.evaluate(NoShadowingOrOverridesOnMethodsRule.java:39)
[junit4:junit4]    > 	at com.carrotsearch.randomizedtesting.rules.StatementAdapter.evaluate(StatementAdapter.java:36)
[junit4:junit4]    > 	at org.apache.lucene.util.TestRuleAssertionsRequired$1.evaluate(TestRuleAssertionsRequired.java:43)
[junit4:junit4]    > 	at org.apache.lucene.util.TestRuleMarkFailure$1.evaluate(TestRuleMarkFailure.java:48)
[junit4:junit4]    > 	at org.apache.lucene.util.TestRuleIgnoreAfterMaxFailures$1.evaluate(TestRuleIgnoreAfterMaxFailures.java:70)
[junit4:junit4]    > 	at org.apache.lucene.util.TestRuleIgnoreTestSuites$1.evaluate(TestRuleIgnoreTestSuites.java:55)
[junit4:junit4]    > 	at com.carrotsearch.randomizedtesting.rules.StatementAdapter.evaluate(StatementAdapter.java:36)
[junit4:junit4]    > 	at com.carrotsearch.randomizedtesting.ThreadLeakControl$StatementRunner.run(ThreadLeakControl.java:358)
[junit4:junit4]    > 	at java.lang.Thread.run(Thread.java:679)
[junit4:junit4]   2> 140951 T2832 oas.SolrTestCaseJ4.deleteCore ###deleteCore
[junit4:junit4]   2> NOTE: test params are: codec=Lucene3x, sim=RandomSimilarityProvider(queryNorm=true,coord=no): {}, locale=zh_HK, timezone=Europe/Helsinki
[junit4:junit4]   2> NOTE: FreeBSD 9.0-RELEASE amd64/Sun Microsystems Inc. 1.6.0_32 (64-bit)/cpus=16,threads=2,free=222219664,total=441122816
[junit4:junit4]   2> NOTE: All tests run in this JVM: [TermVectorComponentDistributedTest, TestLMDirichletSimilarityFactory, TestReload, CacheHeaderTest, ChaosMonkeyNothingIsSafeTest, ScriptEngineTest, TestFastOutputStream, TestBadConfig, TestAtomicUpdateErrorCases, SOLR749Test, TestNumberUtils, TestDefaultSimilarityFactory, NoCacheHeaderTest, BadComponentTest, AlternateDirectoryTest, SpellCheckCollatorTest, SolrCmdDistributorTest, MoreLikeThisHandlerTest, CircularListTest, LoggingHandlerTest, TestPostingsSolrHighlighter, ResponseLogComponentTest, OverseerCollectionProcessorTest, SimpleFacetsTest, DefaultValueUpdateProcessorTest, ClusterStateUpdateTest, TestXIncludeConfig, DirectSolrConnectionTest, TestJoin, SystemInfoHandlerTest, JSONWriterTest, DateMathParserTest, BinaryUpdateRequestHandlerTest, TestIndexingPerformance, UniqFieldsUpdateProcessorFactoryTest, SpellPossibilityIteratorTest, DirectUpdateHandlerOptimizeTest, DistributedTermsComponentTest, TestCoreContainer, DistanceFunctionTest, TestDocumentBuilder, TestGroupingSearch, TestPerFieldSimilarity, PluginInfoTest, UpdateRequestProcessorFactoryTest, LeaderElectionIntegrationTest, TestSolrIndexConfig, SampleTest, TestStressVersions, CopyFieldTest, DistributedSpellCheckComponentTest, SortByFunctionTest, TestLuceneMatchVersion, CurrencyFieldTest, TestPseudoReturnFields, NumericFieldsTest, DateFieldTest, TestRangeQuery, OverseerTest, SpellCheckComponentTest, FullSolrCloudDistribCmdsTest, TestReplicationHandler, ZkControllerTest, TestDistributedGrouping, TestRandomFaceting, WordBreakSolrSpellCheckerTest, TestHashPartitioner, TestMultiCoreConfBootstrap, DirectSolrSpellCheckerTest, TestFiltering, TestRemoteStreaming, SpatialFilterTest, MBeansHandlerTest, QueryParsingTest, MinimalSchemaTest, TestPHPSerializedResponseWriter, FieldAnalysisRequestHandlerTest, SuggesterWFSTTest, TestSolrQueryParser, TestValueSourceCache, RequestHandlersTest, SuggesterFSTTest, UpdateParamsTest, CSVRequestHandlerTest, TestSearchPerf, NotRequiredUniqueKeyTest, SolrCoreCheckLockOnStartupTest, PrimitiveFieldTypeTest, FieldMutatingUpdateProcessorTest, TestSolrDeletionPolicy2, TestLFUCache, TestQuerySenderNoQuery, MultiTermTest, TestSolrCoreProperties, TestConfig, TestLMJelinekMercerSimilarityFactory, TestIBSimilarityFactory, TestFastLRUCache, PrimUtilsTest, OpenExchangeRatesOrgProviderTest, ResourceLoaderTest, FileUtilsTest, TestSolrXMLSerializer, TestLRUCache, UUIDFieldTest, AnalysisAfterCoreReloadTest, ClusterStateTest, CollectionsAPIDistributedZkTest, ShardRoutingCustomTest, SyncSliceTest]
[junit4:junit4] Completed on J0 in 140.98s, 1 test, 1 failure <<< FAILURES!

[...truncated 10 lines...]
BUILD FAILED
/usr/home/hudson/hudson-slave/workspace/Lucene-Solr-Tests-4.x-Java6/build.xml:353: The following error occurred while executing this line:
/usr/home/hudson/hudson-slave/workspace/Lucene-Solr-Tests-4.x-Java6/build.xml:39: The following error occurred while executing this line:
/usr/home/hudson/hudson-slave/workspace/Lucene-Solr-Tests-4.x-Java6/solr/build.xml:178: The following error occurred while executing this line:
/usr/home/hudson/hudson-slave/workspace/Lucene-Solr-Tests-4.x-Java6/solr/common-build.xml:428: The following error occurred while executing this line:
/usr/home/hudson/hudson-slave/workspace/Lucene-Solr-Tests-4.x-Java6/lucene/common-build.xml:1176: The following error occurred while executing this line:
/usr/home/hudson/hudson-slave/workspace/Lucene-Solr-Tests-4.x-Java6/lucene/common-build.xml:841: There were test failures: 247 suites, 1031 tests, 1 failure, 24 ignored (6 assumptions)

Total time: 34 minutes 7 seconds
Build step 'Invoke Ant' marked build as failure
Archiving artifacts
Recording test results
Email was triggered for: Failure
Sending email for trigger: Failure



Mime
View raw message