lucene-dev mailing list archives

Site index · List index
Message view « Date » · « Thread »
Top « Date » · « Thread »
From Apache Jenkins Server <jenk...@builds.apache.org>
Subject [JENKINS] Lucene-Solr-Tests-trunk-Java6 - Build # 15828 - Failure
Date Fri, 18 Jan 2013 02:53:41 GMT
Build: https://builds.apache.org/job/Lucene-Solr-Tests-trunk-Java6/15828/

1 tests failed.
REGRESSION:  org.apache.solr.cloud.SyncSliceTest.testDistribSearch

Error Message:
shard1 should have just been set up to be inconsistent - but it's still consistent

Stack Trace:
java.lang.AssertionError: shard1 should have just been set up to be inconsistent - but it's still consistent
	at __randomizedtesting.SeedInfo.seed([4A986B98D126401B:CB7EE580A6792027]:0)
	at org.junit.Assert.fail(Assert.java:93)
	at org.junit.Assert.assertTrue(Assert.java:43)
	at org.junit.Assert.assertNotNull(Assert.java:526)
	at org.apache.solr.cloud.SyncSliceTest.doTest(SyncSliceTest.java:214)
	at org.apache.solr.BaseDistributedSearchTestCase.testDistribSearch(BaseDistributedSearchTestCase.java:794)
	at sun.reflect.NativeMethodAccessorImpl.invoke0(Native Method)
	at sun.reflect.NativeMethodAccessorImpl.invoke(NativeMethodAccessorImpl.java:57)
	at sun.reflect.DelegatingMethodAccessorImpl.invoke(DelegatingMethodAccessorImpl.java:43)
	at java.lang.reflect.Method.invoke(Method.java:616)
	at com.carrotsearch.randomizedtesting.RandomizedRunner.invoke(RandomizedRunner.java:1559)
	at com.carrotsearch.randomizedtesting.RandomizedRunner.access$600(RandomizedRunner.java:79)
	at com.carrotsearch.randomizedtesting.RandomizedRunner$6.evaluate(RandomizedRunner.java:737)
	at com.carrotsearch.randomizedtesting.RandomizedRunner$7.evaluate(RandomizedRunner.java:773)
	at com.carrotsearch.randomizedtesting.RandomizedRunner$8.evaluate(RandomizedRunner.java:787)
	at com.carrotsearch.randomizedtesting.rules.SystemPropertiesRestoreRule$1.evaluate(SystemPropertiesRestoreRule.java:53)
	at org.apache.lucene.util.TestRuleSetupTeardownChained$1.evaluate(TestRuleSetupTeardownChained.java:50)
	at org.apache.lucene.util.TestRuleFieldCacheSanity$1.evaluate(TestRuleFieldCacheSanity.java:51)
	at org.apache.lucene.util.AbstractBeforeAfterRule$1.evaluate(AbstractBeforeAfterRule.java:46)
	at com.carrotsearch.randomizedtesting.rules.SystemPropertiesInvariantRule$1.evaluate(SystemPropertiesInvariantRule.java:55)
	at org.apache.lucene.util.TestRuleThreadAndTestName$1.evaluate(TestRuleThreadAndTestName.java:49)
	at org.apache.lucene.util.TestRuleIgnoreAfterMaxFailures$1.evaluate(TestRuleIgnoreAfterMaxFailures.java:70)
	at org.apache.lucene.util.TestRuleMarkFailure$1.evaluate(TestRuleMarkFailure.java:48)
	at com.carrotsearch.randomizedtesting.rules.StatementAdapter.evaluate(StatementAdapter.java:36)
	at com.carrotsearch.randomizedtesting.ThreadLeakControl$StatementRunner.run(ThreadLeakControl.java:358)
	at com.carrotsearch.randomizedtesting.ThreadLeakControl.forkTimeoutingTask(ThreadLeakControl.java:782)
	at com.carrotsearch.randomizedtesting.ThreadLeakControl$3.evaluate(ThreadLeakControl.java:442)
	at com.carrotsearch.randomizedtesting.RandomizedRunner.runSingleTest(RandomizedRunner.java:746)
	at com.carrotsearch.randomizedtesting.RandomizedRunner$3.evaluate(RandomizedRunner.java:648)
	at com.carrotsearch.randomizedtesting.RandomizedRunner$4.evaluate(RandomizedRunner.java:682)
	at com.carrotsearch.randomizedtesting.RandomizedRunner$5.evaluate(RandomizedRunner.java:693)
	at com.carrotsearch.randomizedtesting.rules.StatementAdapter.evaluate(StatementAdapter.java:36)
	at com.carrotsearch.randomizedtesting.rules.SystemPropertiesRestoreRule$1.evaluate(SystemPropertiesRestoreRule.java:53)
	at org.apache.lucene.util.AbstractBeforeAfterRule$1.evaluate(AbstractBeforeAfterRule.java:46)
	at org.apache.lucene.util.TestRuleStoreClassName$1.evaluate(TestRuleStoreClassName.java:42)
	at com.carrotsearch.randomizedtesting.rules.SystemPropertiesInvariantRule$1.evaluate(SystemPropertiesInvariantRule.java:55)
	at com.carrotsearch.randomizedtesting.rules.NoShadowingOrOverridesOnMethodsRule$1.evaluate(NoShadowingOrOverridesOnMethodsRule.java:39)
	at com.carrotsearch.randomizedtesting.rules.NoShadowingOrOverridesOnMethodsRule$1.evaluate(NoShadowingOrOverridesOnMethodsRule.java:39)
	at com.carrotsearch.randomizedtesting.rules.StatementAdapter.evaluate(StatementAdapter.java:36)
	at org.apache.lucene.util.TestRuleAssertionsRequired$1.evaluate(TestRuleAssertionsRequired.java:43)
	at org.apache.lucene.util.TestRuleMarkFailure$1.evaluate(TestRuleMarkFailure.java:48)
	at org.apache.lucene.util.TestRuleIgnoreAfterMaxFailures$1.evaluate(TestRuleIgnoreAfterMaxFailures.java:70)
	at org.apache.lucene.util.TestRuleIgnoreTestSuites$1.evaluate(TestRuleIgnoreTestSuites.java:55)
	at com.carrotsearch.randomizedtesting.rules.StatementAdapter.evaluate(StatementAdapter.java:36)
	at com.carrotsearch.randomizedtesting.ThreadLeakControl$StatementRunner.run(ThreadLeakControl.java:358)
	at java.lang.Thread.run(Thread.java:679)




Build Log:
[...truncated 8277 lines...]
[junit4:junit4] Suite: org.apache.solr.cloud.SyncSliceTest
[junit4:junit4]   2> 0 T777 oas.BaseDistributedSearchTestCase.initHostContext Setting hostContext system property: /krmpo/rv
[junit4:junit4]   2> 3 T777 oas.SolrTestCaseJ4.setUp ###Starting testDistribSearch
[junit4:junit4]   2> Creating dataDir: /usr/home/hudson/hudson-slave/workspace/Lucene-Solr-Tests-trunk-Java6/solr/build/solr-core/test/J0/./solrtest-SyncSliceTest-1358476876319
[junit4:junit4]   2> 4 T777 oasc.ZkTestServer.run STARTING ZK TEST SERVER
[junit4:junit4]   2> 4 T778 oasc.ZkTestServer$ZKServerMain.runFromConfig Starting server
[junit4:junit4]   2> 6 T778 oazs.ZooKeeperServer.setTickTime tickTime set to 1000
[junit4:junit4]   2> 6 T778 oazs.ZooKeeperServer.setMinSessionTimeout minSessionTimeout set to -1
[junit4:junit4]   2> 7 T778 oazs.ZooKeeperServer.setMaxSessionTimeout maxSessionTimeout set to -1
[junit4:junit4]   2> 7 T778 oazs.NIOServerCnxnFactory.configure binding to port 0.0.0.0/0.0.0.0:0
[junit4:junit4]   2> 8 T778 oazsp.FileTxnSnapLog.save Snapshotting: 0x0 to /usr/home/hudson/hudson-slave/workspace/Lucene-Solr-Tests-trunk-Java6/solr/build/solr-core/test/J0/./org.apache.solr.cloud.SyncSliceTest-1358476876318/zookeeper/server1/data/version-2/snapshot.0
[junit4:junit4]   2> 105 T777 oasc.ZkTestServer.run start zk server on port:65441
[junit4:junit4]   2> 105 T777 oaz.ZooKeeper.<init> Initiating client connection, connectString=127.0.0.1:65441 sessionTimeout=10000 watcher=org.apache.solr.common.cloud.ConnectionManager@231b20df
[junit4:junit4]   2> 106 T777 oascc.ConnectionManager.waitForConnected Waiting for client to connect to ZooKeeper
[junit4:junit4]   2> 106 T783 oaz.ClientCnxn$SendThread.logStartConnect Opening socket connection to server localhost/127.0.0.1:65441. Will not attempt to authenticate using SASL (access denied (javax.security.auth.AuthPermission getLoginConfiguration))
[junit4:junit4]   2> 107 T783 oaz.ClientCnxn$SendThread.primeConnection Socket connection established to localhost/127.0.0.1:65441, initiating session
[junit4:junit4]   2> 107 T779 oazs.NIOServerCnxnFactory.run Accepted socket connection from /140.211.11.196:13951
[junit4:junit4]   2> 107 T779 oazs.ZooKeeperServer.processConnectRequest Client attempting to establish new session at /140.211.11.196:13951
[junit4:junit4]   2> 108 T781 oazsp.FileTxnLog.append Creating new log file: log.1
[junit4:junit4]   2> 109 T781 oazs.ZooKeeperServer.finishSessionInit Established session 0x13c4b881a230000 with negotiated timeout 10000 for client /140.211.11.196:13951
[junit4:junit4]   2> 110 T783 oaz.ClientCnxn$SendThread.onConnected Session establishment complete on server localhost/127.0.0.1:65441, sessionid = 0x13c4b881a230000, negotiated timeout = 10000
[junit4:junit4]   2> 110 T784 oascc.ConnectionManager.process Watcher org.apache.solr.common.cloud.ConnectionManager@231b20df name:ZooKeeperConnection Watcher:127.0.0.1:65441 got event WatchedEvent state:SyncConnected type:None path:null path:null type:None
[junit4:junit4]   2> 110 T777 oascc.ConnectionManager.waitForConnected Client is connected to ZooKeeper
[junit4:junit4]   2> 110 T777 oascc.SolrZkClient.makePath makePath: /solr
[junit4:junit4]   2> 121 T782 oazs.PrepRequestProcessor.pRequest2Txn Processed session termination for sessionid: 0x13c4b881a230000
[junit4:junit4]   2> 122 T784 oaz.ClientCnxn$EventThread.run EventThread shut down
[junit4:junit4]   2> 122 T777 oaz.ZooKeeper.close Session: 0x13c4b881a230000 closed
[junit4:junit4]   2> 123 T779 oazs.NIOServerCnxn.closeSock Closed socket connection for client /140.211.11.196:13951 which had sessionid 0x13c4b881a230000
[junit4:junit4]   2> 123 T777 oaz.ZooKeeper.<init> Initiating client connection, connectString=127.0.0.1:65441/solr sessionTimeout=10000 watcher=org.apache.solr.common.cloud.ConnectionManager@7adce305
[junit4:junit4]   2> 124 T777 oascc.ConnectionManager.waitForConnected Waiting for client to connect to ZooKeeper
[junit4:junit4]   2> 124 T785 oaz.ClientCnxn$SendThread.logStartConnect Opening socket connection to server localhost/127.0.0.1:65441. Will not attempt to authenticate using SASL (access denied (javax.security.auth.AuthPermission getLoginConfiguration))
[junit4:junit4]   2> 124 T785 oaz.ClientCnxn$SendThread.primeConnection Socket connection established to localhost/127.0.0.1:65441, initiating session
[junit4:junit4]   2> 124 T779 oazs.NIOServerCnxnFactory.run Accepted socket connection from /140.211.11.196:28026
[junit4:junit4]   2> 124 T779 oazs.ZooKeeperServer.processConnectRequest Client attempting to establish new session at /140.211.11.196:28026
[junit4:junit4]   2> 126 T781 oazs.ZooKeeperServer.finishSessionInit Established session 0x13c4b881a230001 with negotiated timeout 10000 for client /140.211.11.196:28026
[junit4:junit4]   2> 126 T785 oaz.ClientCnxn$SendThread.onConnected Session establishment complete on server localhost/127.0.0.1:65441, sessionid = 0x13c4b881a230001, negotiated timeout = 10000
[junit4:junit4]   2> 126 T786 oascc.ConnectionManager.process Watcher org.apache.solr.common.cloud.ConnectionManager@7adce305 name:ZooKeeperConnection Watcher:127.0.0.1:65441/solr got event WatchedEvent state:SyncConnected type:None path:null path:null type:None
[junit4:junit4]   2> 126 T777 oascc.ConnectionManager.waitForConnected Client is connected to ZooKeeper
[junit4:junit4]   2> 126 T777 oascc.SolrZkClient.makePath makePath: /collections/collection1
[junit4:junit4]   2> 137 T777 oascc.SolrZkClient.makePath makePath: /collections/collection1/shards
[junit4:junit4]   2> 140 T777 oascc.SolrZkClient.makePath makePath: /collections/control_collection
[junit4:junit4]   2> 142 T777 oascc.SolrZkClient.makePath makePath: /collections/control_collection/shards
[junit4:junit4]   2> 150 T777 oasc.AbstractZkTestCase.putConfig put /usr/home/hudson/hudson-slave/workspace/Lucene-Solr-Tests-trunk-Java6/solr/build/solr-core/test-files/solr/collection1/conf/solrconfig.xml to /configs/conf1/solrconfig.xml
[junit4:junit4]   2> 151 T777 oascc.SolrZkClient.makePath makePath: /configs/conf1/solrconfig.xml
[junit4:junit4]   2> 158 T777 oasc.AbstractZkTestCase.putConfig put /usr/home/hudson/hudson-slave/workspace/Lucene-Solr-Tests-trunk-Java6/solr/build/solr-core/test-files/solr/collection1/conf/schema.xml to /configs/conf1/schema.xml
[junit4:junit4]   2> 158 T777 oascc.SolrZkClient.makePath makePath: /configs/conf1/schema.xml
[junit4:junit4]   2> 264 T777 oasc.AbstractZkTestCase.putConfig put /usr/home/hudson/hudson-slave/workspace/Lucene-Solr-Tests-trunk-Java6/solr/build/solr-core/test-files/solr/collection1/conf/stopwords.txt to /configs/conf1/stopwords.txt
[junit4:junit4]   2> 273 T777 oascc.SolrZkClient.makePath makePath: /configs/conf1/stopwords.txt
[junit4:junit4]   2> 276 T777 oasc.AbstractZkTestCase.putConfig put /usr/home/hudson/hudson-slave/workspace/Lucene-Solr-Tests-trunk-Java6/solr/build/solr-core/test-files/solr/collection1/conf/protwords.txt to /configs/conf1/protwords.txt
[junit4:junit4]   2> 276 T777 oascc.SolrZkClient.makePath makePath: /configs/conf1/protwords.txt
[junit4:junit4]   2> 279 T777 oasc.AbstractZkTestCase.putConfig put /usr/home/hudson/hudson-slave/workspace/Lucene-Solr-Tests-trunk-Java6/solr/build/solr-core/test-files/solr/collection1/conf/currency.xml to /configs/conf1/currency.xml
[junit4:junit4]   2> 280 T777 oascc.SolrZkClient.makePath makePath: /configs/conf1/currency.xml
[junit4:junit4]   2> 288 T777 oasc.AbstractZkTestCase.putConfig put /usr/home/hudson/hudson-slave/workspace/Lucene-Solr-Tests-trunk-Java6/solr/build/solr-core/test-files/solr/collection1/conf/open-exchange-rates.json to /configs/conf1/open-exchange-rates.json
[junit4:junit4]   2> 289 T777 oascc.SolrZkClient.makePath makePath: /configs/conf1/open-exchange-rates.json
[junit4:junit4]   2> 292 T777 oasc.AbstractZkTestCase.putConfig put /usr/home/hudson/hudson-slave/workspace/Lucene-Solr-Tests-trunk-Java6/solr/build/solr-core/test-files/solr/collection1/conf/mapping-ISOLatin1Accent.txt to /configs/conf1/mapping-ISOLatin1Accent.txt
[junit4:junit4]   2> 292 T777 oascc.SolrZkClient.makePath makePath: /configs/conf1/mapping-ISOLatin1Accent.txt
[junit4:junit4]   2> 295 T777 oasc.AbstractZkTestCase.putConfig put /usr/home/hudson/hudson-slave/workspace/Lucene-Solr-Tests-trunk-Java6/solr/build/solr-core/test-files/solr/collection1/conf/old_synonyms.txt to /configs/conf1/old_synonyms.txt
[junit4:junit4]   2> 296 T777 oascc.SolrZkClient.makePath makePath: /configs/conf1/old_synonyms.txt
[junit4:junit4]   2> 299 T777 oasc.AbstractZkTestCase.putConfig put /usr/home/hudson/hudson-slave/workspace/Lucene-Solr-Tests-trunk-Java6/solr/build/solr-core/test-files/solr/collection1/conf/synonyms.txt to /configs/conf1/synonyms.txt
[junit4:junit4]   2> 299 T777 oascc.SolrZkClient.makePath makePath: /configs/conf1/synonyms.txt
[junit4:junit4]   2> 302 T782 oazs.PrepRequestProcessor.pRequest2Txn Processed session termination for sessionid: 0x13c4b881a230001
[junit4:junit4]   2> 304 T786 oaz.ClientCnxn$EventThread.run EventThread shut down
[junit4:junit4]   2> 304 T777 oaz.ZooKeeper.close Session: 0x13c4b881a230001 closed
[junit4:junit4]   2> 304 T779 oazs.NIOServerCnxn.closeSock Closed socket connection for client /140.211.11.196:28026 which had sessionid 0x13c4b881a230001
[junit4:junit4]   2> 409 T777 oejs.Server.doStart jetty-8.1.8.v20121106
[junit4:junit4]   2> 414 T777 oejs.AbstractConnector.doStart Started SocketConnector@127.0.0.1:61208
[junit4:junit4]   2> 414 T777 oass.SolrDispatchFilter.init SolrDispatchFilter.init()
[junit4:junit4]   2> 415 T777 oasc.SolrResourceLoader.locateSolrHome JNDI not configured for solr (NoInitialContextEx)
[junit4:junit4]   2> 415 T777 oasc.SolrResourceLoader.locateSolrHome using system property solr.solr.home: /usr/home/hudson/hudson-slave/workspace/Lucene-Solr-Tests-trunk-Java6/solr/build/solr-core/test/J0/./org.apache.solr.cloud.SyncSliceTest-controljetty-1358476876619
[junit4:junit4]   2> 415 T777 oasc.CoreContainer$Initializer.initialize looking for solr.xml: /usr/home/hudson/hudson-slave/workspace/Lucene-Solr-Tests-trunk-Java6/solr/build/solr-core/test/J0/./org.apache.solr.cloud.SyncSliceTest-controljetty-1358476876619/solr.xml
[junit4:junit4]   2> 416 T777 oasc.CoreContainer.<init> New CoreContainer 491356597
[junit4:junit4]   2> 416 T777 oasc.CoreContainer.load Loading CoreContainer using Solr Home: '/usr/home/hudson/hudson-slave/workspace/Lucene-Solr-Tests-trunk-Java6/solr/build/solr-core/test/J0/./org.apache.solr.cloud.SyncSliceTest-controljetty-1358476876619/'
[junit4:junit4]   2> 416 T777 oasc.SolrResourceLoader.<init> new SolrResourceLoader for directory: '/usr/home/hudson/hudson-slave/workspace/Lucene-Solr-Tests-trunk-Java6/solr/build/solr-core/test/J0/./org.apache.solr.cloud.SyncSliceTest-controljetty-1358476876619/'
[junit4:junit4]   2> 443 T777 oashc.HttpShardHandlerFactory.getParameter Setting socketTimeout to: 60000
[junit4:junit4]   2> 444 T777 oashc.HttpShardHandlerFactory.getParameter Setting urlScheme to: http://
[junit4:junit4]   2> 444 T777 oashc.HttpShardHandlerFactory.getParameter Setting connTimeout to: 15000
[junit4:junit4]   2> 444 T777 oashc.HttpShardHandlerFactory.getParameter Setting maxConnectionsPerHost to: 20
[junit4:junit4]   2> 444 T777 oashc.HttpShardHandlerFactory.getParameter Setting corePoolSize to: 0
[junit4:junit4]   2> 445 T777 oashc.HttpShardHandlerFactory.getParameter Setting maximumPoolSize to: 2147483647
[junit4:junit4]   2> 445 T777 oashc.HttpShardHandlerFactory.getParameter Setting maxThreadIdleTime to: 5
[junit4:junit4]   2> 445 T777 oashc.HttpShardHandlerFactory.getParameter Setting sizeOfQueue to: -1
[junit4:junit4]   2> 445 T777 oashc.HttpShardHandlerFactory.getParameter Setting fairnessPolicy to: false
[junit4:junit4]   2> 446 T777 oascsi.HttpClientUtil.createClient Creating new http client, config:maxConnectionsPerHost=20&maxConnections=10000&socketTimeout=60000&connTimeout=15000&retry=false
[junit4:junit4]   2> 460 T777 oasc.CoreContainer.load Registering Log Listener
[junit4:junit4]   2> 472 T777 oasc.CoreContainer.initZooKeeper Zookeeper client=127.0.0.1:65441/solr
[junit4:junit4]   2> 472 T777 oasc.ZkController.checkChrootPath zkHost includes chroot
[junit4:junit4]   2> 473 T777 oaz.ZooKeeper.<init> Initiating client connection, connectString=127.0.0.1:65441 sessionTimeout=60000 watcher=org.apache.solr.common.cloud.ConnectionManager@7abe51fc
[junit4:junit4]   2> 473 T777 oascc.ConnectionManager.waitForConnected Waiting for client to connect to ZooKeeper
[junit4:junit4]   2> 474 T796 oaz.ClientCnxn$SendThread.logStartConnect Opening socket connection to server localhost/127.0.0.1:65441. Will not attempt to authenticate using SASL (access denied (javax.security.auth.AuthPermission getLoginConfiguration))
[junit4:junit4]   2> 474 T796 oaz.ClientCnxn$SendThread.primeConnection Socket connection established to localhost/127.0.0.1:65441, initiating session
[junit4:junit4]   2> 474 T779 oazs.NIOServerCnxnFactory.run Accepted socket connection from /140.211.11.196:37738
[junit4:junit4]   2> 475 T779 oazs.ZooKeeperServer.processConnectRequest Client attempting to establish new session at /140.211.11.196:37738
[junit4:junit4]   2> 476 T781 oazs.ZooKeeperServer.finishSessionInit Established session 0x13c4b881a230002 with negotiated timeout 20000 for client /140.211.11.196:37738
[junit4:junit4]   2> 476 T796 oaz.ClientCnxn$SendThread.onConnected Session establishment complete on server localhost/127.0.0.1:65441, sessionid = 0x13c4b881a230002, negotiated timeout = 20000
[junit4:junit4]   2> 476 T797 oascc.ConnectionManager.process Watcher org.apache.solr.common.cloud.ConnectionManager@7abe51fc name:ZooKeeperConnection Watcher:127.0.0.1:65441 got event WatchedEvent state:SyncConnected type:None path:null path:null type:None
[junit4:junit4]   2> 476 T777 oascc.ConnectionManager.waitForConnected Client is connected to ZooKeeper
[junit4:junit4]   2> 478 T782 oazs.PrepRequestProcessor.pRequest2Txn Processed session termination for sessionid: 0x13c4b881a230002
[junit4:junit4]   2> 479 T797 oaz.ClientCnxn$EventThread.run EventThread shut down
[junit4:junit4]   2> 479 T779 oazs.NIOServerCnxn.closeSock Closed socket connection for client /140.211.11.196:37738 which had sessionid 0x13c4b881a230002
[junit4:junit4]   2> 479 T777 oaz.ZooKeeper.close Session: 0x13c4b881a230002 closed
[junit4:junit4]   2> 479 T777 oascsi.HttpClientUtil.createClient Creating new http client, config:maxConnections=500&maxConnectionsPerHost=16&socketTimeout=60000&connTimeout=15000
[junit4:junit4]   2> 487 T777 oaz.ZooKeeper.<init> Initiating client connection, connectString=127.0.0.1:65441/solr sessionTimeout=30000 watcher=org.apache.solr.common.cloud.ConnectionManager@86369c6
[junit4:junit4]   2> 488 T777 oascc.ConnectionManager.waitForConnected Waiting for client to connect to ZooKeeper
[junit4:junit4]   2> 488 T798 oaz.ClientCnxn$SendThread.logStartConnect Opening socket connection to server localhost/127.0.0.1:65441. Will not attempt to authenticate using SASL (access denied (javax.security.auth.AuthPermission getLoginConfiguration))
[junit4:junit4]   2> 488 T798 oaz.ClientCnxn$SendThread.primeConnection Socket connection established to localhost/127.0.0.1:65441, initiating session
[junit4:junit4]   2> 489 T779 oazs.NIOServerCnxnFactory.run Accepted socket connection from /140.211.11.196:61959
[junit4:junit4]   2> 489 T779 oazs.ZooKeeperServer.processConnectRequest Client attempting to establish new session at /140.211.11.196:61959
[junit4:junit4]   2> 490 T781 oazs.ZooKeeperServer.finishSessionInit Established session 0x13c4b881a230003 with negotiated timeout 20000 for client /140.211.11.196:61959
[junit4:junit4]   2> 490 T798 oaz.ClientCnxn$SendThread.onConnected Session establishment complete on server localhost/127.0.0.1:65441, sessionid = 0x13c4b881a230003, negotiated timeout = 20000
[junit4:junit4]   2> 490 T799 oascc.ConnectionManager.process Watcher org.apache.solr.common.cloud.ConnectionManager@86369c6 name:ZooKeeperConnection Watcher:127.0.0.1:65441/solr got event WatchedEvent state:SyncConnected type:None path:null path:null type:None
[junit4:junit4]   2> 490 T777 oascc.ConnectionManager.waitForConnected Client is connected to ZooKeeper
[junit4:junit4]   2> 492 T782 oazs.PrepRequestProcessor.pRequest Got user-level KeeperException when processing sessionid:0x13c4b881a230003 type:create cxid:0x2 zxid:0x1a txntype:-1 reqpath:n/a Error Path:/solr/overseer Error:KeeperErrorCode = NodeExists for /solr/overseer
[junit4:junit4]   2> 501 T777 oascc.SolrZkClient.makePath makePath: /live_nodes
[junit4:junit4]   2> 503 T777 oasc.ZkController.createEphemeralLiveNode Register node as live in ZooKeeper:/live_nodes/127.0.0.1:61208_krmpo%2Frv
[junit4:junit4]   2> 503 T782 oazs.PrepRequestProcessor.pRequest Got user-level KeeperException when processing sessionid:0x13c4b881a230003 type:delete cxid:0x7 zxid:0x1c txntype:-1 reqpath:n/a Error Path:/solr/live_nodes/127.0.0.1:61208_krmpo%2Frv Error:KeeperErrorCode = NoNode for /solr/live_nodes/127.0.0.1:61208_krmpo%2Frv
[junit4:junit4]   2> 505 T777 oascc.SolrZkClient.makePath makePath: /live_nodes/127.0.0.1:61208_krmpo%2Frv
[junit4:junit4]   2> 514 T777 oascc.SolrZkClient.makePath makePath: /overseer_elect/election
[junit4:junit4]   2> 527 T782 oazs.PrepRequestProcessor.pRequest Got user-level KeeperException when processing sessionid:0x13c4b881a230003 type:delete cxid:0x15 zxid:0x21 txntype:-1 reqpath:n/a Error Path:/solr/overseer_elect/leader Error:KeeperErrorCode = NoNode for /solr/overseer_elect/leader
[junit4:junit4]   2> 528 T777 oascc.SolrZkClient.makePath makePath: /overseer_elect/leader
[junit4:junit4]   2> 532 T777 oasc.Overseer.start Overseer (id=89029140566704131-127.0.0.1:61208_krmpo%2Frv-n_0000000000) starting
[junit4:junit4]   2> 533 T782 oazs.PrepRequestProcessor.pRequest Got user-level KeeperException when processing sessionid:0x13c4b881a230003 type:create cxid:0x1a zxid:0x23 txntype:-1 reqpath:n/a Error Path:/solr/overseer Error:KeeperErrorCode = NodeExists for /solr/overseer
[junit4:junit4]   2> 534 T782 oazs.PrepRequestProcessor.pRequest Got user-level KeeperException when processing sessionid:0x13c4b881a230003 type:create cxid:0x1b zxid:0x24 txntype:-1 reqpath:n/a Error Path:/solr/overseer Error:KeeperErrorCode = NodeExists for /solr/overseer
[junit4:junit4]   2> 535 T782 oazs.PrepRequestProcessor.pRequest Got user-level KeeperException when processing sessionid:0x13c4b881a230003 type:create cxid:0x1c zxid:0x25 txntype:-1 reqpath:n/a Error Path:/solr/overseer Error:KeeperErrorCode = NodeExists for /solr/overseer
[junit4:junit4]   2> 546 T782 oazs.PrepRequestProcessor.pRequest Got user-level KeeperException when processing sessionid:0x13c4b881a230003 type:create cxid:0x1d zxid:0x26 txntype:-1 reqpath:n/a Error Path:/solr/overseer Error:KeeperErrorCode = NodeExists for /solr/overseer
[junit4:junit4]   2> 547 T801 oasc.OverseerCollectionProcessor.run Process current queue of collection messages
[junit4:junit4]   2> 548 T777 oascc.SolrZkClient.makePath makePath: /clusterstate.json
[junit4:junit4]   2> 552 T777 oascc.ZkStateReader.createClusterStateWatchersAndUpdate Updating cluster state from ZooKeeper... 
[junit4:junit4]   2> 555 T800 oasc.Overseer$ClusterStateUpdater.run Starting to work on the main queue
[junit4:junit4]   2> 558 T802 oasc.CoreContainer.create Creating SolrCore 'collection1' using instanceDir: /usr/home/hudson/hudson-slave/workspace/Lucene-Solr-Tests-trunk-Java6/solr/build/solr-core/test/J0/./org.apache.solr.cloud.SyncSliceTest-controljetty-1358476876619/collection1
[junit4:junit4]   2> 558 T802 oasc.ZkController.createCollectionZkNode Check for collection zkNode:control_collection
[junit4:junit4]   2> 559 T802 oasc.ZkController.createCollectionZkNode Collection zkNode exists
[junit4:junit4]   2> 559 T802 oasc.ZkController.readConfigName Load collection config from:/collections/control_collection
[junit4:junit4]   2> 561 T802 oasc.SolrResourceLoader.<init> new SolrResourceLoader for directory: '/usr/home/hudson/hudson-slave/workspace/Lucene-Solr-Tests-trunk-Java6/solr/build/solr-core/test/J0/./org.apache.solr.cloud.SyncSliceTest-controljetty-1358476876619/collection1/'
[junit4:junit4]   2> 562 T802 oasc.SolrResourceLoader.replaceClassLoader Adding 'file:/usr/home/hudson/hudson-slave/workspace/Lucene-Solr-Tests-trunk-Java6/solr/build/solr-core/test/J0/org.apache.solr.cloud.SyncSliceTest-controljetty-1358476876619/collection1/lib/README' to classloader
[junit4:junit4]   2> 562 T802 oasc.SolrResourceLoader.replaceClassLoader Adding 'file:/usr/home/hudson/hudson-slave/workspace/Lucene-Solr-Tests-trunk-Java6/solr/build/solr-core/test/J0/org.apache.solr.cloud.SyncSliceTest-controljetty-1358476876619/collection1/lib/classes/' to classloader
[junit4:junit4]   2> 613 T802 oasc.SolrConfig.<init> Using Lucene MatchVersion: LUCENE_50
[junit4:junit4]   2> 682 T802 oasc.SolrConfig.<init> Loaded SolrConfig: solrconfig.xml
[junit4:junit4]   2> 783 T802 oass.IndexSchema.readSchema Reading Solr Schema
[junit4:junit4]   2> 790 T802 oass.IndexSchema.readSchema Schema name=test
[junit4:junit4]   2> 1401 T802 oass.OpenExchangeRatesOrgProvider.init Initialized with rates=open-exchange-rates.json, refreshInterval=1440.
[junit4:junit4]   2> 1412 T802 oass.IndexSchema.readSchema default search field in schema is text
[junit4:junit4]   2> 1417 T802 oass.IndexSchema.readSchema unique key field: id
[junit4:junit4]   2> 1435 T802 oass.FileExchangeRateProvider.reload Reloading exchange rates from file currency.xml
[junit4:junit4]   2> 1440 T802 oass.FileExchangeRateProvider.reload Reloading exchange rates from file currency.xml
[junit4:junit4]   2> 1445 T802 oass.OpenExchangeRatesOrgProvider.reload Reloading exchange rates from open-exchange-rates.json
[junit4:junit4]   2> 1446 T802 oass.OpenExchangeRatesOrgProvider.reload Reloading exchange rates from open-exchange-rates.json
[junit4:junit4]   2> 1448 T802 oasc.SolrCore.<init> [collection1] Opening new SolrCore at /usr/home/hudson/hudson-slave/workspace/Lucene-Solr-Tests-trunk-Java6/solr/build/solr-core/test/J0/./org.apache.solr.cloud.SyncSliceTest-controljetty-1358476876619/collection1/, dataDir=./org.apache.solr.cloud.SyncSliceTest-1358476876318/control/data/
[junit4:junit4]   2> 1448 T802 oasc.JmxMonitoredMap.<init> JMX monitoring is enabled. Adding Solr mbeans to JMX Server: com.sun.jmx.mbeanserver.JmxMBeanServer@9818f80
[junit4:junit4]   2> 1448 T802 oasc.SolrCore.initDirectoryFactory solr.StandardDirectoryFactory
[junit4:junit4]   2> 1490 T802 oasc.CachingDirectoryFactory.get return new directory for /usr/home/hudson/hudson-slave/workspace/Lucene-Solr-Tests-trunk-Java6/solr/build/solr-core/test/J0/./org.apache.solr.cloud.SyncSliceTest-1358476876318/control/data forceNew:false
[junit4:junit4]   2> 1491 T802 oasc.CachingDirectoryFactory.close Releasing directory:/usr/home/hudson/hudson-slave/workspace/Lucene-Solr-Tests-trunk-Java6/solr/build/solr-core/test/J0/./org.apache.solr.cloud.SyncSliceTest-1358476876318/control/data
[junit4:junit4]   2> 1491 T802 oasc.SolrCore.getNewIndexDir New index directory detected: old=null new=./org.apache.solr.cloud.SyncSliceTest-1358476876318/control/data/index/
[junit4:junit4]   2> 1492 T802 oasc.SolrCore.initIndex WARNING [collection1] Solr index directory './org.apache.solr.cloud.SyncSliceTest-1358476876318/control/data/index' doesn't exist. Creating new index...
[junit4:junit4]   2> 1493 T802 oasc.CachingDirectoryFactory.get return new directory for /usr/home/hudson/hudson-slave/workspace/Lucene-Solr-Tests-trunk-Java6/solr/build/solr-core/test/J0/./org.apache.solr.cloud.SyncSliceTest-1358476876318/control/data/index forceNew:false
[junit4:junit4]   2> 1498 T802 oasc.SolrDeletionPolicy.onCommit SolrDeletionPolicy.onCommit: commits:num=1
[junit4:junit4]   2> 		commit{dir=RateLimitedDirectoryWrapper(org.apache.lucene.store.NIOFSDirectory@/usr/home/hudson/hudson-slave/workspace/Lucene-Solr-Tests-trunk-Java6/solr/build/solr-core/test/J0/org.apache.solr.cloud.SyncSliceTest-1358476876318/control/data/index lockFactory=org.apache.lucene.store.NativeFSLockFactory@282d0fef),segFN=segments_1,generation=1,filenames=[segments_1]
[junit4:junit4]   2> 1499 T802 oasc.SolrDeletionPolicy.updateCommits newest commit = 1[segments_1]
[junit4:junit4]   2> 1499 T802 oasc.CachingDirectoryFactory.close Releasing directory:/usr/home/hudson/hudson-slave/workspace/Lucene-Solr-Tests-trunk-Java6/solr/build/solr-core/test/J0/./org.apache.solr.cloud.SyncSliceTest-1358476876318/control/data/index
[junit4:junit4]   2> 1500 T802 oasc.SolrCore.initWriters created xml: solr.XMLResponseWriter
[junit4:junit4]   2> 1501 T802 oasup.UpdateRequestProcessorChain.init inserting DistributedUpdateProcessorFactory into updateRequestProcessorChain "dedupe"
[junit4:junit4]   2> 1502 T802 oasup.UpdateRequestProcessorChain.init inserting DistributedUpdateProcessorFactory into updateRequestProcessorChain "dedupe-allfields"
[junit4:junit4]   2> 1502 T802 oasup.UpdateRequestProcessorChain.init inserting DistributedUpdateProcessorFactory into updateRequestProcessorChain "stored_sig"
[junit4:junit4]   2> 1502 T802 oasup.UpdateRequestProcessorChain.init inserting DistributedUpdateProcessorFactory into updateRequestProcessorChain "uniq-fields"
[junit4:junit4]   2> 1503 T802 oasup.UpdateRequestProcessorChain.init inserting DistributedUpdateProcessorFactory into updateRequestProcessorChain "distrib-dup-test-chain-implicit"
[junit4:junit4]   2> 1503 T802 oasc.RequestHandlers.initHandlersFromConfig adding lazy requestHandler: solr.ReplicationHandler
[junit4:junit4]   2> 1504 T802 oasc.RequestHandlers.initHandlersFromConfig created /replication: solr.ReplicationHandler
[junit4:junit4]   2> 1504 T802 oasc.RequestHandlers.initHandlersFromConfig created standard: solr.StandardRequestHandler
[junit4:junit4]   2> 1504 T802 oasc.RequestHandlers.initHandlersFromConfig created /get: solr.RealTimeGetHandler
[junit4:junit4]   2> 1505 T802 oasc.RequestHandlers.initHandlersFromConfig created dismax: solr.SearchHandler
[junit4:junit4]   2> 1505 T802 oasc.RequestHandlers.initHandlersFromConfig created mock: org.apache.solr.core.MockQuerySenderListenerReqHandler
[junit4:junit4]   2> 1506 T802 oasc.RequestHandlers.initHandlersFromConfig created /admin/: org.apache.solr.handler.admin.AdminHandlers
[junit4:junit4]   2> 1506 T802 oasc.RequestHandlers.initHandlersFromConfig created defaults: solr.StandardRequestHandler
[junit4:junit4]   2> 1506 T802 oasc.RequestHandlers.initHandlersFromConfig adding lazy requestHandler: solr.StandardRequestHandler
[junit4:junit4]   2> 1507 T802 oasc.RequestHandlers.initHandlersFromConfig created lazy: solr.StandardRequestHandler
[junit4:junit4]   2> 1507 T802 oasc.RequestHandlers.initHandlersFromConfig created /update: solr.UpdateRequestHandler
[junit4:junit4]   2> 1508 T802 oasc.RequestHandlers.initHandlersFromConfig created /terms: org.apache.solr.handler.component.SearchHandler
[junit4:junit4]   2> 1508 T802 oasc.RequestHandlers.initHandlersFromConfig created spellCheckCompRH: org.apache.solr.handler.component.SearchHandler
[junit4:junit4]   2> 1508 T802 oasc.RequestHandlers.initHandlersFromConfig created spellCheckCompRH_Direct: org.apache.solr.handler.component.SearchHandler
[junit4:junit4]   2> 1509 T802 oasc.RequestHandlers.initHandlersFromConfig created spellCheckWithWordbreak: org.apache.solr.handler.component.SearchHandler
[junit4:junit4]   2> 1509 T802 oasc.RequestHandlers.initHandlersFromConfig created spellCheckWithWordbreak_Direct: org.apache.solr.handler.component.SearchHandler
[junit4:junit4]   2> 1510 T802 oasc.RequestHandlers.initHandlersFromConfig created spellCheckCompRH1: org.apache.solr.handler.component.SearchHandler
[junit4:junit4]   2> 1510 T802 oasc.RequestHandlers.initHandlersFromConfig created mltrh: org.apache.solr.handler.component.SearchHandler
[junit4:junit4]   2> 1511 T802 oasc.RequestHandlers.initHandlersFromConfig created tvrh: org.apache.solr.handler.component.SearchHandler
[junit4:junit4]   2> 1511 T802 oasc.RequestHandlers.initHandlersFromConfig created /mlt: solr.MoreLikeThisHandler
[junit4:junit4]   2> 1511 T802 oasc.RequestHandlers.initHandlersFromConfig created /debug/dump: solr.DumpRequestHandler
[junit4:junit4]   2> 1518 T802 oashl.XMLLoader.init xsltCacheLifetimeSeconds=60
[junit4:junit4]   2> 1523 T802 oasc.SolrCore.initDeprecatedSupport WARNING solrconfig.xml uses deprecated <admin/gettableFiles>, Please update your config to use the ShowFileRequestHandler.
[junit4:junit4]   2> 1524 T802 oasc.SolrCore.initDeprecatedSupport WARNING adding ShowFileRequestHandler with hidden files: [SCHEMA.XML, OLD_SYNONYMS.TXT, STOPWORDS.TXT, PROTWORDS.TXT, OPEN-EXCHANGE-RATES.JSON, SYNONYMS.TXT, CURRENCY.XML, MAPPING-ISOLATIN1ACCENT.TXT]
[junit4:junit4]   2> 1527 T802 oasc.CachingDirectoryFactory.close Releasing directory:/usr/home/hudson/hudson-slave/workspace/Lucene-Solr-Tests-trunk-Java6/solr/build/solr-core/test/J0/./org.apache.solr.cloud.SyncSliceTest-1358476876318/control/data
[junit4:junit4]   2> 1528 T802 oass.SolrIndexSearcher.<init> Opening Searcher@7d5a0936 main
[junit4:junit4]   2> 1529 T802 oasu.CommitTracker.<init> Hard AutoCommit: disabled
[junit4:junit4]   2> 1530 T802 oasu.CommitTracker.<init> Soft AutoCommit: disabled
[junit4:junit4]   2> 1530 T802 oashc.SpellCheckComponent.inform Initializing spell checkers
[junit4:junit4]   2> 1537 T802 oass.DirectSolrSpellChecker.init init: {name=direct,classname=DirectSolrSpellChecker,field=lowerfilt,minQueryLength=3}
[junit4:junit4]   2> 1593 T803 oasc.SolrCore.registerSearcher [collection1] Registered new searcher Searcher@7d5a0936 main{StandardDirectoryReader(segments_1:1)}
[junit4:junit4]   2> 1600 T802 oasc.ZkController.publish publishing core=collection1 state=down
[junit4:junit4]   2> 1601 T802 oasc.ZkController.publish numShards not found on descriptor - reading it from system property
[junit4:junit4]   2> 1602 T782 oazs.PrepRequestProcessor.pRequest Got user-level KeeperException when processing sessionid:0x13c4b881a230003 type:create cxid:0x50 zxid:0x29 txntype:-1 reqpath:n/a Error Path:/solr/overseer/queue Error:KeeperErrorCode = NoNode for /solr/overseer/queue
[junit4:junit4]   2> 2060 T800 oascc.ZkStateReader.updateClusterState Updating cloud state from ZooKeeper... 
[junit4:junit4]   2> 2061 T800 oasc.Overseer$ClusterStateUpdater.updateState Update state numShards=1 message={
[junit4:junit4]   2> 	  "operation":"state",
[junit4:junit4]   2> 	  "numShards":"1",
[junit4:junit4]   2> 	  "shard":null,
[junit4:junit4]   2> 	  "roles":null,
[junit4:junit4]   2> 	  "state":"down",
[junit4:junit4]   2> 	  "core":"collection1",
[junit4:junit4]   2> 	  "collection":"control_collection",
[junit4:junit4]   2> 	  "node_name":"127.0.0.1:61208_krmpo%2Frv",
[junit4:junit4]   2> 	  "base_url":"http://127.0.0.1:61208/krmpo/rv"}
[junit4:junit4]   2> 2061 T800 oasc.Overseer$ClusterStateUpdater.createCollection Create collection control_collection with numShards 1
[junit4:junit4]   2> 2061 T800 oasc.Overseer$ClusterStateUpdater.updateState Assigning new node to shard shard=shard1
[junit4:junit4]   2> 2062 T782 oazs.PrepRequestProcessor.pRequest Got user-level KeeperException when processing sessionid:0x13c4b881a230003 type:create cxid:0x58 zxid:0x2c txntype:-1 reqpath:n/a Error Path:/solr/overseer/queue-work Error:KeeperErrorCode = NoNode for /solr/overseer/queue-work
[junit4:junit4]   2> 2084 T799 oascc.ZkStateReader$2.process A cluster state change: WatchedEvent state:SyncConnected type:NodeDataChanged path:/clusterstate.json, has occurred - updating... (live nodes size: 1)
[junit4:junit4]   2> 2619 T802 oasc.CoreContainer.registerCore registering core: collection1
[junit4:junit4]   2> 2619 T802 oasc.ZkController.register Register replica - core:collection1 address:http://127.0.0.1:61208/krmpo/rv collection:control_collection shard:shard1
[junit4:junit4]   2> 2620 T802 oascc.SolrZkClient.makePath makePath: /collections/control_collection/leader_elect/shard1/election
[junit4:junit4]   2> 2639 T782 oazs.PrepRequestProcessor.pRequest Got user-level KeeperException when processing sessionid:0x13c4b881a230003 type:delete cxid:0x72 zxid:0x36 txntype:-1 reqpath:n/a Error Path:/solr/collections/control_collection/leaders Error:KeeperErrorCode = NoNode for /solr/collections/control_collection/leaders
[junit4:junit4]   2> 2640 T802 oasc.ShardLeaderElectionContext.runLeaderProcess Running the leader process.
[junit4:junit4]   2> 2641 T782 oazs.PrepRequestProcessor.pRequest Got user-level KeeperException when processing sessionid:0x13c4b881a230003 type:create cxid:0x73 zxid:0x37 txntype:-1 reqpath:n/a Error Path:/solr/overseer Error:KeeperErrorCode = NodeExists for /solr/overseer
[junit4:junit4]   2> 2651 T802 oasc.ShardLeaderElectionContext.waitForReplicasToComeUp Enough replicas found to continue.
[junit4:junit4]   2> 2652 T802 oasc.ShardLeaderElectionContext.runLeaderProcess I may be the new leader - try and sync
[junit4:junit4]   2> 2652 T802 oasc.SyncStrategy.sync Sync replicas to http://127.0.0.1:61208/krmpo/rv/collection1/
[junit4:junit4]   2> 2652 T802 oasc.SyncStrategy.syncReplicas Sync Success - now sync replicas to me
[junit4:junit4]   2> 2652 T802 oasc.SyncStrategy.syncToMe http://127.0.0.1:61208/krmpo/rv/collection1/ has no replicas
[junit4:junit4]   2> 2652 T802 oasc.ShardLeaderElectionContext.runLeaderProcess I am the new leader: http://127.0.0.1:61208/krmpo/rv/collection1/
[junit4:junit4]   2> 2653 T802 oascc.SolrZkClient.makePath makePath: /collections/control_collection/leaders/shard1
[junit4:junit4]   2> 2659 T782 oazs.PrepRequestProcessor.pRequest Got user-level KeeperException when processing sessionid:0x13c4b881a230003 type:create cxid:0x7d zxid:0x3b txntype:-1 reqpath:n/a Error Path:/solr/overseer Error:KeeperErrorCode = NodeExists for /solr/overseer
[junit4:junit4]   2> 3591 T800 oascc.ZkStateReader.updateClusterState Updating cloud state from ZooKeeper... 
[junit4:junit4]   2> 3613 T799 oascc.ZkStateReader$2.process A cluster state change: WatchedEvent state:SyncConnected type:NodeDataChanged path:/clusterstate.json, has occurred - updating... (live nodes size: 1)
[junit4:junit4]   2> 3637 T802 oasc.ZkController.register We are http://127.0.0.1:61208/krmpo/rv/collection1/ and leader is http://127.0.0.1:61208/krmpo/rv/collection1/
[junit4:junit4]   2> 3637 T802 oasc.ZkController.register No LogReplay needed for core=collection1 baseURL=http://127.0.0.1:61208/krmpo/rv
[junit4:junit4]   2> 3637 T802 oasc.ZkController.checkRecovery I am the leader, no recovery necessary
[junit4:junit4]   2> 3637 T802 oasc.ZkController.publish publishing core=collection1 state=active
[junit4:junit4]   2> 3637 T802 oasc.ZkController.publish numShards not found on descriptor - reading it from system property
[junit4:junit4]   2> 3640 T802 oascc.ZkStateReader.updateClusterState Updating cloud state from ZooKeeper... 
[junit4:junit4]   2> 3641 T777 oass.SolrDispatchFilter.init user.dir=/usr/home/hudson/hudson-slave/workspace/Lucene-Solr-Tests-trunk-Java6/solr/build/solr-core/test/J0
[junit4:junit4]   2> 3641 T777 oass.SolrDispatchFilter.init SolrDispatchFilter.init() done
[junit4:junit4]   2> 3642 T777 oascsi.HttpClientUtil.createClient Creating new http client, config:maxConnections=128&maxConnectionsPerHost=32&followRedirects=false
[junit4:junit4]   2> 3659 T777 oascsi.HttpClientUtil.createClient Creating new http client, config:
[junit4:junit4]   2> 3671 T777 oaz.ZooKeeper.<init> Initiating client connection, connectString=127.0.0.1:65441/solr sessionTimeout=10000 watcher=org.apache.solr.common.cloud.ConnectionManager@102e2488
[junit4:junit4]   2> 3672 T777 oascc.ConnectionManager.waitForConnected Waiting for client to connect to ZooKeeper
[junit4:junit4]   2> 3672 T804 oaz.ClientCnxn$SendThread.logStartConnect Opening socket connection to server localhost/127.0.0.1:65441. Will not attempt to authenticate using SASL (access denied (javax.security.auth.AuthPermission getLoginConfiguration))
[junit4:junit4]   2> 3673 T804 oaz.ClientCnxn$SendThread.primeConnection Socket connection established to localhost/127.0.0.1:65441, initiating session
[junit4:junit4]   2> 3673 T779 oazs.NIOServerCnxnFactory.run Accepted socket connection from /140.211.11.196:30550
[junit4:junit4]   2> 3673 T779 oazs.ZooKeeperServer.processConnectRequest Client attempting to establish new session at /140.211.11.196:30550
[junit4:junit4]   2> 3674 T781 oazs.ZooKeeperServer.finishSessionInit Established session 0x13c4b881a230004 with negotiated timeout 10000 for client /140.211.11.196:30550
[junit4:junit4]   2> 3674 T804 oaz.ClientCnxn$SendThread.onConnected Session establishment complete on server localhost/127.0.0.1:65441, sessionid = 0x13c4b881a230004, negotiated timeout = 10000
[junit4:junit4]   2> 3675 T805 oascc.ConnectionManager.process Watcher org.apache.solr.common.cloud.ConnectionManager@102e2488 name:ZooKeeperConnection Watcher:127.0.0.1:65441/solr got event WatchedEvent state:SyncConnected type:None path:null path:null type:None
[junit4:junit4]   2> 3675 T777 oascc.ConnectionManager.waitForConnected Client is connected to ZooKeeper
[junit4:junit4]   2> 3676 T777 oascc.ZkStateReader.createClusterStateWatchersAndUpdate Updating cluster state from ZooKeeper... 
[junit4:junit4]   2> 3679 T777 oasc.ChaosMonkey.monkeyLog monkey: init - expire sessions:true cause connection loss:true
[junit4:junit4]   2> 3842 T777 oejs.Server.doStart jetty-8.1.8.v20121106
[junit4:junit4]   2> 3845 T777 oejs.AbstractConnector.doStart Started SocketConnector@127.0.0.1:50527
[junit4:junit4]   2> 3845 T777 oass.SolrDispatchFilter.init SolrDispatchFilter.init()
[junit4:junit4]   2> 3846 T777 oasc.SolrResourceLoader.locateSolrHome JNDI not configured for solr (NoInitialContextEx)
[junit4:junit4]   2> 3846 T777 oasc.SolrResourceLoader.locateSolrHome using system property solr.solr.home: /usr/home/hudson/hudson-slave/workspace/Lucene-Solr-Tests-trunk-Java6/solr/build/solr-core/test/J0/./org.apache.solr.cloud.SyncSliceTest-jetty1-1358476879994
[junit4:junit4]   2> 3847 T777 oasc.CoreContainer$Initializer.initialize looking for solr.xml: /usr/home/hudson/hudson-slave/workspace/Lucene-Solr-Tests-trunk-Java6/solr/build/solr-core/test/J0/./org.apache.solr.cloud.SyncSliceTest-jetty1-1358476879994/solr.xml
[junit4:junit4]   2> 3847 T777 oasc.CoreContainer.<init> New CoreContainer 1996674606
[junit4:junit4]   2> 3848 T777 oasc.CoreContainer.load Loading CoreContainer using Solr Home: '/usr/home/hudson/hudson-slave/workspace/Lucene-Solr-Tests-trunk-Java6/solr/build/solr-core/test/J0/./org.apache.solr.cloud.SyncSliceTest-jetty1-1358476879994/'
[junit4:junit4]   2> 3848 T777 oasc.SolrResourceLoader.<init> new SolrResourceLoader for directory: '/usr/home/hudson/hudson-slave/workspace/Lucene-Solr-Tests-trunk-Java6/solr/build/solr-core/test/J0/./org.apache.solr.cloud.SyncSliceTest-jetty1-1358476879994/'
[junit4:junit4]   2> 3901 T777 oashc.HttpShardHandlerFactory.getParameter Setting socketTimeout to: 60000
[junit4:junit4]   2> 3902 T777 oashc.HttpShardHandlerFactory.getParameter Setting urlScheme to: http://
[junit4:junit4]   2> 3902 T777 oashc.HttpShardHandlerFactory.getParameter Setting connTimeout to: 15000
[junit4:junit4]   2> 3903 T777 oashc.HttpShardHandlerFactory.getParameter Setting maxConnectionsPerHost to: 20
[junit4:junit4]   2> 3903 T777 oashc.HttpShardHandlerFactory.getParameter Setting corePoolSize to: 0
[junit4:junit4]   2> 3903 T777 oashc.HttpShardHandlerFactory.getParameter Setting maximumPoolSize to: 2147483647
[junit4:junit4]   2> 3904 T777 oashc.HttpShardHandlerFactory.getParameter Setting maxThreadIdleTime to: 5
[junit4:junit4]   2> 3904 T777 oashc.HttpShardHandlerFactory.getParameter Setting sizeOfQueue to: -1
[junit4:junit4]   2> 3905 T777 oashc.HttpShardHandlerFactory.getParameter Setting fairnessPolicy to: false
[junit4:junit4]   2> 3905 T777 oascsi.HttpClientUtil.createClient Creating new http client, config:maxConnectionsPerHost=20&maxConnections=10000&socketTimeout=60000&connTimeout=15000&retry=false
[junit4:junit4]   2> 3929 T777 oasc.CoreContainer.load Registering Log Listener
[junit4:junit4]   2> 3949 T777 oasc.CoreContainer.initZooKeeper Zookeeper client=127.0.0.1:65441/solr
[junit4:junit4]   2> 3949 T777 oasc.ZkController.checkChrootPath zkHost includes chroot
[junit4:junit4]   2> 3950 T777 oaz.ZooKeeper.<init> Initiating client connection, connectString=127.0.0.1:65441 sessionTimeout=60000 watcher=org.apache.solr.common.cloud.ConnectionManager@7e1d5c64
[junit4:junit4]   2> 3951 T777 oascc.ConnectionManager.waitForConnected Waiting for client to connect to ZooKeeper
[junit4:junit4]   2> 3951 T815 oaz.ClientCnxn$SendThread.logStartConnect Opening socket connection to server localhost/127.0.0.1:65441. Will not attempt to authenticate using SASL (access denied (javax.security.auth.AuthPermission getLoginConfiguration))
[junit4:junit4]   2> 3952 T815 oaz.ClientCnxn$SendThread.primeConnection Socket connection established to localhost/127.0.0.1:65441, initiating session
[junit4:junit4]   2> 3952 T779 oazs.NIOServerCnxnFactory.run Accepted socket connection from /140.211.11.196:25703
[junit4:junit4]   2> 3953 T779 oazs.ZooKeeperServer.processConnectRequest Client attempting to establish new session at /140.211.11.196:25703
[junit4:junit4]   2> 3956 T781 oazs.ZooKeeperServer.finishSessionInit Established session 0x13c4b881a230005 with negotiated timeout 20000 for client /140.211.11.196:25703
[junit4:junit4]   2> 3956 T815 oaz.ClientCnxn$SendThread.onConnected Session establishment complete on server localhost/127.0.0.1:65441, sessionid = 0x13c4b881a230005, negotiated timeout = 20000
[junit4:junit4]   2> 3956 T816 oascc.ConnectionManager.process Watcher org.apache.solr.common.cloud.ConnectionManager@7e1d5c64 name:ZooKeeperConnection Watcher:127.0.0.1:65441 got event WatchedEvent state:SyncConnected type:None path:null path:null type:None
[junit4:junit4]   2> 3956 T777 oascc.ConnectionManager.waitForConnected Client is connected to ZooKeeper
[junit4:junit4]   2> 3958 T782 oazs.PrepRequestProcessor.pRequest2Txn Processed session termination for sessionid: 0x13c4b881a230005
[junit4:junit4]   2> 3987 T816 oaz.ClientCnxn$EventThread.run EventThread shut down
[junit4:junit4]   2> 3987 T779 oazs.NIOServerCnxn.closeSock Closed socket connection for client /140.211.11.196:25703 which had sessionid 0x13c4b881a230005
[junit4:junit4]   2> 3987 T777 oaz.ZooKeeper.close Session: 0x13c4b881a230005 closed
[junit4:junit4]   2> 3988 T777 oascsi.HttpClientUtil.createClient Creating new http client, config:maxConnections=500&maxConnectionsPerHost=16&socketTimeout=60000&connTimeout=15000
[junit4:junit4]   2> 4000 T777 oaz.ZooKeeper.<init> Initiating client connection, connectString=127.0.0.1:65441/solr sessionTimeout=30000 watcher=org.apache.solr.common.cloud.ConnectionManager@153fbc23
[junit4:junit4]   2> 4002 T777 oascc.ConnectionManager.waitForConnected Waiting for client to connect to ZooKeeper
[junit4:junit4]   2> 4002 T817 oaz.ClientCnxn$SendThread.logStartConnect Opening socket connection to server localhost/127.0.0.1:65441. Will not attempt to authenticate using SASL (access denied (javax.security.auth.AuthPermission getLoginConfiguration))
[junit4:junit4]   2> 4003 T817 oaz.ClientCnxn$SendThread.primeConnection Socket connection established to localhost/127.0.0.1:65441, initiating session
[junit4:junit4]   2> 4003 T779 oazs.NIOServerCnxnFactory.run Accepted socket connection from /140.211.11.196:14299
[junit4:junit4]   2> 4003 T779 oazs.ZooKeeperServer.processConnectRequest Client attempting to establish new session at /140.211.11.196:14299
[junit4:junit4]   2> 4005 T781 oazs.ZooKeeperServer.finishSessionInit Established session 0x13c4b881a230006 with negotiated timeout 20000 for client /140.211.11.196:14299
[junit4:junit4]   2> 4005 T817 oaz.ClientCnxn$SendThread.onConnected Session establishment complete on server localhost/127.0.0.1:65441, sessionid = 0x13c4b881a230006, negotiated timeout = 20000
[junit4:junit4]   2> 4005 T818 oascc.ConnectionManager.process Watcher org.apache.solr.common.cloud.ConnectionManager@153fbc23 name:ZooKeeperConnection Watcher:127.0.0.1:65441/solr got event WatchedEvent state:SyncConnected type:None path:null path:null type:None
[junit4:junit4]   2> 4005 T777 oascc.ConnectionManager.waitForConnected Client is connected to ZooKeeper
[junit4:junit4]   2> 4007 T782 oazs.PrepRequestProcessor.pRequest Got user-level KeeperException when processing sessionid:0x13c4b881a230006 type:create cxid:0x1 zxid:0x49 txntype:-1 reqpath:n/a Error Path:/solr/overseer Error:KeeperErrorCode = NodeExists for /solr/overseer
[junit4:junit4]   2> 4066 T782 oazs.PrepRequestProcessor.pRequest Got user-level KeeperException when processing sessionid:0x13c4b881a230006 type:create cxid:0x2 zxid:0x4a txntype:-1 reqpath:n/a Error Path:/solr/overseer Error:KeeperErrorCode = NodeExists for /solr/overseer
[junit4:junit4]   2> 4076 T777 oasc.ZkController.createEphemeralLiveNode Register node as live in ZooKeeper:/live_nodes/127.0.0.1:50527_krmpo%2Frv
[junit4:junit4]   2> 4076 T782 oazs.PrepRequestProcessor.pRequest Got user-level KeeperException when processing sessionid:0x13c4b881a230006 type:delete cxid:0x4 zxid:0x4b txntype:-1 reqpath:n/a Error Path:/solr/live_nodes/127.0.0.1:50527_krmpo%2Frv Error:KeeperErrorCode = NoNode for /solr/live_nodes/127.0.0.1:50527_krmpo%2Frv
[junit4:junit4]   2> 4088 T777 oascc.SolrZkClient.makePath makePath: /live_nodes/127.0.0.1:50527_krmpo%2Frv
[junit4:junit4]   2> 4092 T805 oascc.ZkStateReader$3.process Updating live nodes... (2)
[junit4:junit4]   2> 4092 T799 oascc.ZkStateReader$3.process Updating live nodes... (2)
[junit4:junit4]   2> 4092 T799 oascc.ZkStateReader$2.process A cluster state change: WatchedEvent state:SyncConnected type:NodeChildrenChanged path:/live_nodes, has occurred - updating... (live nodes size: 2)
[junit4:junit4]   2> 4139 T777 oascc.ZkStateReader.createClusterStateWatchersAndUpdate Updating cluster state from ZooKeeper... 
[junit4:junit4]   2> 4148 T819 oasc.CoreContainer.create Creating SolrCore 'collection1' using instanceDir: /usr/home/hudson/hudson-slave/workspace/Lucene-Solr-Tests-trunk-Java6/solr/build/solr-core/test/J0/./org.apache.solr.cloud.SyncSliceTest-jetty1-1358476879994/collection1
[junit4:junit4]   2> 4148 T819 oasc.ZkController.createCollectionZkNode Check for collection zkNode:collection1
[junit4:junit4]   2> 4149 T819 oasc.ZkController.createCollectionZkNode Collection zkNode exists
[junit4:junit4]   2> 4150 T819 oasc.ZkController.readConfigName Load collection config from:/collections/collection1
[junit4:junit4]   2> 4151 T819 oasc.SolrResourceLoader.<init> new SolrResourceLoader for directory: '/usr/home/hudson/hudson-slave/workspace/Lucene-Solr-Tests-trunk-Java6/solr/build/solr-core/test/J0/./org.apache.solr.cloud.SyncSliceTest-jetty1-1358476879994/collection1/'
[junit4:junit4]   2> 4152 T819 oasc.SolrResourceLoader.replaceClassLoader Adding 'file:/usr/home/hudson/hudson-slave/workspace/Lucene-Solr-Tests-trunk-Java6/solr/build/solr-core/test/J0/org.apache.solr.cloud.SyncSliceTest-jetty1-1358476879994/collection1/lib/README' to classloader
[junit4:junit4]   2> 4153 T819 oasc.SolrResourceLoader.replaceClassLoader Adding 'file:/usr/home/hudson/hudson-slave/workspace/Lucene-Solr-Tests-trunk-Java6/solr/build/solr-core/test/J0/org.apache.solr.cloud.SyncSliceTest-jetty1-1358476879994/collection1/lib/classes/' to classloader
[junit4:junit4]   2> 4205 T819 oasc.SolrConfig.<init> Using Lucene MatchVersion: LUCENE_50
[junit4:junit4]   2> 4276 T819 oasc.SolrConfig.<init> Loaded SolrConfig: solrconfig.xml
[junit4:junit4]   2> 4378 T819 oass.IndexSchema.readSchema Reading Solr Schema
[junit4:junit4]   2> 4385 T819 oass.IndexSchema.readSchema Schema name=test
[junit4:junit4]   2> 4981 T819 oass.OpenExchangeRatesOrgProvider.init Initialized with rates=open-exchange-rates.json, refreshInterval=1440.
[junit4:junit4]   2> 4992 T819 oass.IndexSchema.readSchema default search field in schema is text
[junit4:junit4]   2> 4996 T819 oass.IndexSchema.readSchema unique key field: id
[junit4:junit4]   2> 5014 T819 oass.FileExchangeRateProvider.reload Reloading exchange rates from file currency.xml
[junit4:junit4]   2> 5019 T819 oass.FileExchangeRateProvider.reload Reloading exchange rates from file currency.xml
[junit4:junit4]   2> 5024 T819 oass.OpenExchangeRatesOrgProvider.reload Reloading exchange rates from open-exchange-rates.json
[junit4:junit4]   2> 5026 T819 oass.OpenExchangeRatesOrgProvider.reload Reloading exchange rates from open-exchange-rates.json
[junit4:junit4]   2> 5028 T819 oasc.SolrCore.<init> [collection1] Opening new SolrCore at /usr/home/hudson/hudson-slave/workspace/Lucene-Solr-Tests-trunk-Java6/solr/build/solr-core/test/J0/./org.apache.solr.cloud.SyncSliceTest-jetty1-1358476879994/collection1/, dataDir=./org.apache.solr.cloud.SyncSliceTest-1358476876318/jetty1/
[junit4:junit4]   2> 5028 T819 oasc.JmxMonitoredMap.<init> JMX monitoring is enabled. Adding Solr mbeans to JMX Server: com.sun.jmx.mbeanserver.JmxMBeanServer@9818f80
[junit4:junit4]   2> 5028 T819 oasc.SolrCore.initDirectoryFactory solr.StandardDirectoryFactory
[junit4:junit4]   2> 5029 T819 oasc.CachingDirectoryFactory.get return new directory for /usr/home/hudson/hudson-slave/workspace/Lucene-Solr-Tests-trunk-Java6/solr/build/solr-core/test/J0/./org.apache.solr.cloud.SyncSliceTest-1358476876318/jetty1 forceNew:false
[junit4:junit4]   2> 5030 T819 oasc.CachingDirectoryFactory.close Releasing directory:/usr/home/hudson/hudson-slave/workspace/Lucene-Solr-Tests-trunk-Java6/solr/build/solr-core/test/J0/./org.apache.solr.cloud.SyncSliceTest-1358476876318/jetty1
[junit4:junit4]   2> 5030 T819 oasc.SolrCore.getNewIndexDir New index directory detected: old=null new=./org.apache.solr.cloud.SyncSliceTest-1358476876318/jetty1/index/
[junit4:junit4]   2> 5030 T819 oasc.SolrCore.initIndex WARNING [collection1] Solr index directory './org.apache.solr.cloud.SyncSliceTest-1358476876318/jetty1/index' doesn't exist. Creating new index...
[junit4:junit4]   2> 5031 T819 oasc.CachingDirectoryFactory.get return new directory for /usr/home/hudson/hudson-slave/workspace/Lucene-Solr-Tests-trunk-Java6/solr/build/solr-core/test/J0/./org.apache.solr.cloud.SyncSliceTest-1358476876318/jetty1/index forceNew:false
[junit4:junit4]   2> 5039 T819 oasc.SolrDeletionPolicy.onCommit SolrDeletionPolicy.onCommit: commits:num=1
[junit4:junit4]   2> 		commit{dir=RateLimitedDirectoryWrapper(org.apache.lucene.store.NIOFSDirectory@/usr/home/hudson/hudson-slave/workspace/Lucene-Solr-Tests-trunk-Java6/solr/build/solr-core/test/J0/org.apache.solr.cloud.SyncSliceTest-1358476876318/jetty1/index lockFactory=org.apache.lucene.store.NativeFSLockFactory@237dabb0),segFN=segments_1,generation=1,filenames=[segments_1]
[junit4:junit4]   2> 5039 T819 oasc.SolrDeletionPolicy.updateCommits newest commit = 1[segments_1]
[junit4:junit4]   2> 5040 T819 oasc.CachingDirectoryFactory.close Releasing directory:/usr/home/hudson/hudson-slave/workspace/Lucene-Solr-Tests-trunk-Java6/solr/build/solr-core/test/J0/./org.apache.solr.cloud.SyncSliceTest-1358476876318/jetty1/index
[junit4:junit4]   2> 5040 T819 oasc.SolrCore.initWriters created xml: solr.XMLResponseWriter
[junit4:junit4]   2> 5042 T819 oasup.UpdateRequestProcessorChain.init inserting DistributedUpdateProcessorFactory into updateRequestProcessorChain "dedupe"
[junit4:junit4]   2> 5043 T819 oasup.UpdateRequestProcessorChain.init inserting DistributedUpdateProcessorFactory into updateRequestProcessorChain "dedupe-allfields"
[junit4:junit4]   2> 5043 T819 oasup.UpdateRequestProcessorChain.init inserting DistributedUpdateProcessorFactory into updateRequestProcessorChain "stored_sig"
[junit4:junit4]   2> 5043 T819 oasup.UpdateRequestProcessorChain.init inserting DistributedUpdateProcessorFactory into updateRequestProcessorChain "uniq-fields"
[junit4:junit4]   2> 5044 T819 oasup.UpdateRequestProcessorChain.init inserting DistributedUpdateProcessorFactory into updateRequestProcessorChain "distrib-dup-test-chain-implicit"
[junit4:junit4]   2> 5044 T819 oasc.RequestHandlers.initHandlersFromConfig adding lazy requestHandler: solr.ReplicationHandler
[junit4:junit4]   2> 5044 T819 oasc.RequestHandlers.initHandlersFromConfig created /replication: solr.ReplicationHandler
[junit4:junit4]   2> 5045 T819 oasc.RequestHandlers.initHandlersFromConfig created standard: solr.StandardRequestHandler
[junit4:junit4]   2> 5045 T819 oasc.RequestHandlers.initHandlersFromConfig created /get: solr.RealTimeGetHandler
[junit4:junit4]   2> 5046 T819 oasc.RequestHandlers.initHandlersFromConfig created dismax: solr.SearchHandler
[junit4:junit4]   2> 5046 T819 oasc.RequestHandlers.initHandlersFromConfig created mock: org.apache.solr.core.MockQuerySenderListenerReqHandler
[junit4:junit4]   2> 5047 T819 oasc.RequestHandlers.initHandlersFromConfig created /admin/: org.apache.solr.handler.admin.AdminHandlers
[junit4:junit4]   2> 5047 T819 oasc.RequestHandlers.initHandlersFromConfig created defaults: solr.StandardRequestHandler
[junit4:junit4]   2> 5048 T819 oasc.RequestHandlers.initHandlersFromConfig adding lazy requestHandler: solr.StandardRequestHandler
[junit4:junit4]   2> 5048 T819 oasc.RequestHandlers.initHandlersFromConfig created lazy: solr.StandardRequestHandler
[junit4:junit4]   2> 5048 T819 oasc.RequestHandlers.initHandlersFromConfig created /update: solr.UpdateRequestHandler
[junit4:junit4]   2> 5049 T819 oasc.RequestHandlers.initHandlersFromConfig created /terms: org.apache.solr.handler.component.SearchHandler
[junit4:junit4]   2> 5049 T819 oasc.RequestHandlers.initHandlersFromConfig created spellCheckCompRH: org.apache.solr.handler.component.SearchHandler
[junit4:junit4]   2> 5050 T819 oasc.RequestHandlers.initHandlersFromConfig created spellCheckCompRH_Direct: org.apache.solr.handler.component.SearchHandler
[junit4:junit4]   2> 5050 T819 oasc.RequestHandlers.initHandlersFromConfig created spellCheckWithWordbreak: org.apache.solr.handler.component.SearchHandler
[junit4:junit4]   2> 5051 T819 oasc.RequestHandlers.initHandlersFromConfig created spellCheckWithWordbreak_Direct: org.apache.solr.handler.component.SearchHandler
[junit4:junit4]   2> 5051 T819 oasc.RequestHandlers.initHandlersFromConfig created spellCheckCompRH1: org.apache.solr.handler.component.SearchHandler
[junit4:junit4]   2> 5052 T819 oasc.RequestHandlers.initHandlersFromConfig created mltrh: org.apache.solr.handler.component.SearchHandler
[junit4:junit4]   2> 5052 T819 oasc.RequestHandlers.initHandlersFromConfig created tvrh: org.apache.solr.handler.component.SearchHandler
[junit4:junit4]   2> 5053 T819 oasc.RequestHandlers.initHandlersFromConfig created /mlt: solr.MoreLikeThisHandler
[junit4:junit4]   2> 5053 T819 oasc.RequestHandlers.initHandlersFromConfig created /debug/dump: solr.DumpRequestHandler
[junit4:junit4]   2> 5060 T819 oashl.XMLLoader.init xsltCacheLifetimeSeconds=60
[junit4:junit4]   2> 5064 T819 oasc.SolrCore.initDeprecatedSupport WARNING solrconfig.xml uses deprecated <admin/gettableFiles>, Please update your config to use the ShowFileRequestHandler.
[junit4:junit4]   2> 5065 T819 oasc.SolrCore.initDeprecatedSupport WARNING adding ShowFileRequestHandler with hidden files: [SCHEMA.XML, OLD_SYNONYMS.TXT, STOPWORDS.TXT, PROTWORDS.TXT, OPEN-EXCHANGE-RATES.JSON, SYNONYMS.TXT, CURRENCY.XML, MAPPING-ISOLATIN1ACCENT.TXT]
[junit4:junit4]   2> 5067 T819 oasc.CachingDirectoryFactory.close Releasing directory:/usr/home/hudson/hudson-slave/workspace/Lucene-Solr-Tests-trunk-Java6/solr/build/solr-core/test/J0/./org.apache.solr.cloud.SyncSliceTest-1358476876318/jetty1
[junit4:junit4]   2> 5069 T819 oass.SolrIndexSearcher.<init> Opening Searcher@181362e2 main
[junit4:junit4]   2> 5070 T819 oasu.CommitTracker.<init> Hard AutoCommit: disabled
[junit4:junit4]   2> 5070 T819 oasu.CommitTracker.<init> Soft AutoCommit: disabled
[junit4:junit4]   2> 5070 T819 oashc.SpellCheckComponent.inform Initializing spell checkers
[junit4:junit4]   2> 5077 T819 oass.DirectSolrSpellChecker.init init: {name=direct,classname=DirectSolrSpellChecker,field=lowerfilt,minQueryLength=3}
[junit4:junit4]   2> 5123 T820 oasc.SolrCore.registerSearcher [collection1] Registered new searcher Searcher@181362e2 main{StandardDirectoryReader(segments_1:1)}
[junit4:junit4]   2> 5127 T800 oascc.ZkStateReader.updateClusterState Updating cloud state from ZooKeeper... 
[junit4:junit4]   2> 5128 T800 oasc.Overseer$ClusterStateUpdater.updateState Update state numShards=1 message={
[junit4:junit4]   2> 	  "operation":"state",
[junit4:junit4]   2> 	  "numShards":"1",
[junit4:junit4]   2> 	  "shard":"shard1",
[junit4:junit4]   2> 	  "roles":null,
[junit4:junit4]   2> 	  "state":"active",
[junit4:junit4]   2> 	  "core":"collection1",
[junit4:junit4]   2> 	  "collection":"control_collection",
[junit4:junit4]   2> 	  "node_name":"127.0.0.1:61208_krmpo%2Frv",
[junit4:junit4]   2> 	  "base_url":"http://127.0.0.1:61208/krmpo/rv"}
[junit4:junit4]   2> 5128 T819 oasc.ZkController.publish publishing core=collection1 state=down
[junit4:junit4]   2> 5128 T819 oasc.ZkController.publish numShards not found on descriptor - reading it from system property
[junit4:junit4]   2> 5142 T800 oasc.Overseer$ClusterStateUpdater.updateState Update state numShards=1 message={
[junit4:junit4]   2> 	  "operation":"state",
[junit4:junit4]   2> 	  "numShards":"1",
[junit4:junit4]   2> 	  "shard":null,
[junit4:junit4]   2> 	  "roles":null,
[junit4:junit4]   2> 	  "state":"down",
[junit4:junit4]   2> 	  "core":"collection1",
[junit4:junit4]   2> 	  "collection":"collection1",
[junit4:junit4]   2> 	  "node_name":"127.0.0.1:50527_krmpo%2Frv",
[junit4:junit4]   2> 	  "base_url":"http://127.0.0.1:50527/krmpo/rv"}
[junit4:junit4]   2> 5142 T800 oasc.Overseer$ClusterStateUpdater.createCollection Create collection collection1 with numShards 1
[junit4:junit4]   2> 5142 T800 oasc.Overseer$ClusterStateUpdater.updateState Assigning new node to shard shard=shard1
[junit4:junit4]   2> 5149 T818 oascc.ZkStateReader$2.process A cluster state change: WatchedEvent state:SyncConnected type:NodeDataChanged path:/clusterstate.json, has occurred - updating... (live nodes size: 2)
[junit4:junit4]   2> 5149 T799 oascc.ZkStateReader$2.process A cluster state change: WatchedEvent state:SyncConnected type:NodeDataChanged path:/clusterstate.json, has occurred - updating... (live nodes size: 2)
[junit4:junit4]   2> 5149 T805 oascc.ZkStateReader$2.process A cluster state change: WatchedEvent state:SyncConnected type:NodeDataChanged path:/clusterstate.json, has occurred - updating... (live nodes size: 2)
[junit4:junit4]   2> 6131 T819 oasc.CoreContainer.registerCore registering core: collection1
[junit4:junit4]   2> 6131 T819 oasc.ZkController.register Register replica - core:collection1 address:http://127.0.0.1:50527/krmpo/rv collection:collection1 shard:shard1
[junit4:junit4]   2> 6132 T819 oascc.SolrZkClient.makePath makePath: /collections/collection1/leader_elect/shard1/election
[junit4:junit4]   2> 6151 T782 oazs.PrepRequestProcessor.pRequest Got user-level KeeperException when processing sessionid:0x13c4b881a230006 type:delete cxid:0x43 zxid:0x5a txntype:-1 reqpath:n/a Error Path:/solr/collections/collection1/leaders Error:KeeperErrorCode = NoNode for /solr/collections/collection1/leaders
[junit4:junit4]   2> 6158 T819 oasc.ShardLeaderElectionContext.runLeaderProcess Running the leader process.
[junit4:junit4]   2> 6159 T782 oazs.PrepRequestProcessor.pRequest Got user-level KeeperException when processing sessionid:0x13c4b881a230006 type:create cxid:0x44 zxid:0x5b txntype:-1 reqpath:n/a Error Path:/solr/overseer Error:KeeperErrorCode = NodeExists for /solr/overseer
[junit4:junit4]   2> 6162 T819 oasc.ShardLeaderElectionContext.waitForReplicasToComeUp Enough replicas found to continue.
[junit4:junit4]   2> 6162 T819 oasc.ShardLeaderElectionContext.runLeaderProcess I may be the new leader - try and sync
[junit4:junit4]   2> 6162 T819 oasc.SyncStrategy.sync Sync replicas to http://127.0.0.1:50527/krmpo/rv/collection1/
[junit4:junit4]   2> 6162 T819 oasc.SyncStrategy.syncReplicas Sync Success - now sync replicas to me
[junit4:junit4]   2> 6162 T819 oasc.SyncStrategy.syncToMe http://127.0.0.1:50527/krmpo/rv/collection1/ has no replicas
[junit4:junit4]   2> 6163 T819 oasc.ShardLeaderElectionContext.runLeaderProcess I am the new leader: http://127.0.0.1:50527/krmpo/rv/collection1/
[junit4:junit4]   2> 6163 T819 oascc.SolrZkClient.makePath makePath: /collections/collection1/leaders/shard1
[junit4:junit4]   2> 6175 T782 oazs.PrepRequestProcessor.pRequest Got user-level KeeperException when processing sessionid:0x13c4b881a230006 type:create cxid:0x4e zxid:0x5f txntype:-1 reqpath:n/a Error Path:/solr/overseer Error:KeeperErrorCode = NodeExists for /solr/overseer
[junit4:junit4]   2> 6663 T800 oascc.ZkStateReader.updateClusterState Updating cloud state from ZooKeeper... 
[junit4:junit4]   2> 6683 T805 oascc.ZkStateReader$2.process A cluster state change: WatchedEvent state:SyncConnected type:NodeDataChanged path:/clusterstate.json, has occurred - updating... (live nodes size: 2)
[junit4:junit4]   2> 6683 T799 oascc.ZkStateReader$2.process A cluster state change: WatchedEvent state:SyncConnected type:NodeDataChanged path:/clusterstate.json, has occurred - updating... (live nodes size: 2)
[junit4:junit4]   2> 6683 T818 oascc.ZkStateReader$2.process A cluster state change: WatchedEvent state:SyncConnected type:NodeDataChanged path:/clusterstate.json, has occurred - updating... (live nodes size: 2)
[junit4:junit4]   2> 6688 T819 oasc.ZkController.register We are http://127.0.0.1:50527/krmpo/rv/collection1/ and leader is http://127.0.0.1:50527/krmpo/rv/collection1/
[junit4:junit4]   2> 6688 T819 oasc.ZkController.register No LogReplay needed for core=collection1 baseURL=http://127.0.0.1:50527/krmpo/rv
[junit4:junit4]   2> 6688 T819 oasc.ZkController.checkRecovery I am the leader, no recovery necessary
[junit4:junit4]   2> 6688 T819 oasc.ZkController.publish publishing core=collection1 state=active
[junit4:junit4]   2> 6688 T819 oasc.ZkController.publish numShards not found on descriptor - reading it from system property
[junit4:junit4]   2> 6694 T819 oascc.ZkStateReader.updateClusterState Updating cloud state from ZooKeeper... 
[junit4:junit4]   2> 6695 T777 oass.SolrDispatchFilter.init user.dir=/usr/home/hudson/hudson-slave/workspace/Lucene-Solr-Tests-trunk-Java6/solr/build/solr-core/test/J0
[junit4:junit4]   2> 6696 T777 oass.SolrDispatchFilter.init SolrDispatchFilter.init() done
[junit4:junit4]   2> 6696 T777 oascsi.HttpClientUtil.createClient Creating new http client, config:maxConnections=128&maxConnectionsPerHost=32&followRedirects=false
[junit4:junit4]   2> 6856 T777 oejs.Server.doStart jetty-8.1.8.v20121106
[junit4:junit4]   2> 6940 T777 oejs.AbstractConnector.doStart Started SocketConnector@127.0.0.1:48990
[junit4:junit4]   2> 6941 T777 oass.SolrDispatchFilter.init SolrDispatchFilter.init()
[junit4:junit4]   2> 6942 T777 oasc.SolrResourceLoader.locateSolrHome JNDI not configured for solr (NoInitialContextEx)
[junit4:junit4]   2> 6942 T777 oasc.SolrResourceLoader.locateSolrHome using system property solr.solr.home: /usr/home/hudson/hudson-slave/workspace/Lucene-Solr-Tests-trunk-Java6/solr/build/solr-core/test/J0/./org.apache.solr.cloud.SyncSliceTest-jetty2-1358476883024
[junit4:junit4]   2> 6943 T777 oasc.CoreContainer$Initializer.initialize looking for solr.xml: /usr/home/hudson/hudson-slave/workspace/Lucene-Solr-Tests-trunk-Java6/solr/build/solr-core/test/J0/./org.apache.solr.cloud.SyncSliceTest-jetty2-1358476883024/solr.xml
[junit4:junit4]   2> 6944 T777 oasc.CoreContainer.<init> New CoreContainer 1804538872
[junit4:junit4]   2> 6945 T777 oasc.CoreContainer.load Loading CoreContainer using Solr Home: '/usr/home/hudson/hudson-slave/workspace/Lucene-Solr-Tests-trunk-Java6/solr/build/solr-core/test/J0/./org.apache.solr.cloud.SyncSliceTest-jetty2-1358476883024/'
[junit4:junit4]   2> 6945 T777 oasc.SolrResourceLoader.<init> new SolrResourceLoader for directory: '/usr/home/hudson/hudson-slave/workspace/Lucene-Solr-Tests-trunk-Java6/solr/build/solr-core/test/J0/./org.apache.solr.cloud.SyncSliceTest-jetty2-1358476883024/'
[junit4:junit4]   2> 7005 T777 oashc.HttpShardHandlerFactory.getParameter Setting socketTimeout to: 60000
[junit4:junit4]   2> 7006 T777 oashc.HttpShardHandlerFactory.getParameter Setting urlScheme to: http://
[junit4:junit4]   2> 7007 T777 oashc.HttpShardHandlerFactory.getParameter Setting connTimeout to: 15000
[junit4:junit4]   2> 7007 T777 oashc.HttpShardHandlerFactory.getParameter Setting maxConnectionsPerHost to: 20
[junit4:junit4]   2> 7008 T777 oashc.HttpShardHandlerFactory.getParameter Setting corePoolSize to: 0
[junit4:junit4]   2> 7009 T777 oashc.HttpShardHandlerFactory.getParameter Setting maximumPoolSize to: 2147483647
[junit4:junit4]   2> 7009 T777 oashc.HttpShardHandlerFactory.getParameter Setting maxThreadIdleTime to: 5
[junit4:junit4]   2> 7010 T777 oashc.HttpShardHandlerFactory.getParameter Setting sizeOfQueue to: -1
[junit4:junit4]   2> 7010 T777 oashc.HttpShardHandlerFactory.getParameter Setting fairnessPolicy to: false
[junit4:junit4]   2> 7011 T777 oascsi.HttpClientUtil.createClient Creating new http client, config:maxConnectionsPerHost=20&maxConnections=10000&socketTimeout=60000&connTimeout=15000&retry=false
[junit4:junit4]   2> 7038 T777 oasc.CoreContainer.load Registering Log Listener
[junit4:junit4]   2> 7062 T777 oasc.CoreContainer.initZooKeeper Zookeeper client=127.0.0.1:65441/solr
[junit4:junit4]   2> 7062 T777 oasc.ZkController.checkChrootPath zkHost includes chroot
[junit4:junit4]   2> 7063 T777 oaz.ZooKeeper.<init> Initiating client connection, connectString=127.0.0.1:65441 sessionTimeout=60000 watcher=org.apache.solr.common.cloud.ConnectionManager@6bade3b3
[junit4:junit4]   2> 7064 T777 oascc.ConnectionManager.waitForConnected Waiting for client to connect to ZooKeeper
[junit4:junit4]   2> 7065 T830 oaz.ClientCnxn$SendThread.logStartConnect Opening socket connection to server localhost/127.0.0.1:65441. Will not attempt to authenticate using SASL (access denied (javax.security.auth.AuthPermission getLoginConfiguration))
[junit4:junit4]   2> 7065 T830 oaz.ClientCnxn$SendThread.primeConnection Socket connection established to localhost/127.0.0.1:65441, initiating session
[junit4:junit4]   2> 7066 T779 oazs.NIOServerCnxnFactory.run Accepted socket connection from /140.211.11.196:40071
[junit4:junit4]   2> 7066 T779 oazs.ZooKeeperServer.processConnectRequest Client attempting to establish new session at /140.211.11.196:40071
[junit4:junit4]   2> 7067 T781 oazs.ZooKeeperServer.finishSessionInit Established session 0x13c4b881a230007 with negotiated timeout 20000 for client /140.211.11.196:40071
[junit4:junit4]   2> 7068 T830 oaz.ClientCnxn$SendThread.onConnected Session establishment complete on server localhost/127.0.0.1:65441, sessionid = 0x13c4b881a230007, negotiated timeout = 20000
[junit4:junit4]   2> 7068 T831 oascc.ConnectionManager.process Watcher org.apache.solr.common.cloud.ConnectionManager@6bade3b3 name:ZooKeeperConnection Watcher:127.0.0.1:65441 got event WatchedEvent state:SyncConnected type:None path:null path:null type:None
[junit4:junit4]   2> 7068 T777 oascc.ConnectionManager.waitForConnected Client is connected to ZooKeeper
[junit4:junit4]   2> 7070 T782 oazs.PrepRequestProcessor.pRequest2Txn Processed session termination for sessionid: 0x13c4b881a230007
[junit4:junit4]   2> 7071 T831 oaz.ClientCnxn$EventThread.run EventThread shut down
[junit4:junit4]   2> 7071 T779 oazs.NIOServerCnxn.closeSock Closed socket connection for client /140.211.11.196:40071 which had sessionid 0x13c4b881a230007
[junit4:junit4]   2> 7071 T777 oaz.ZooKeeper.close Session: 0x13c4b881a230007 closed
[junit4:junit4]   2> 7072 T777 oascsi.HttpClientUtil.createClient Creating new http client, config:maxConnections=500&maxConnectionsPerHost=16&socketTimeout=60000&connTimeout=15000
[junit4:junit4]   2> 7085 T777 oaz.ZooKeeper.<init> Initiating client connection, connectString=127.0.0.1:65441/solr sessionTimeout=30000 watcher=org.apache.solr.common.cloud.ConnectionManager@2c1f0db4
[junit4:junit4]   2> 7086 T777 oascc.ConnectionManager.waitForConnected Waiting for client to connect to ZooKeeper
[junit4:junit4]   2> 7087 T832 oaz.ClientCnxn$SendThread.logStartConnect Opening socket connection to server localhost/127.0.0.1:65441. Will not attempt to authenticate using SASL (access denied (javax.security.auth.AuthPermission getLoginConfiguration))
[junit4:junit4]   2> 7087 T832 oaz.ClientCnxn$SendThread.primeConnection Socket connection established to localhost/127.0.0.1:65441, initiating session
[junit4:junit4]   2> 7087 T779 oazs.NIOServerCnxnFactory.run Accepted socket connection from /140.211.11.196:21434
[junit4:junit4]   2> 7088 T779 oazs.ZooKeeperServer.processConnectRequest Client attempting to establish new session at /140.211.11.196:21434
[junit4:junit4]   2> 7089 T781 oazs.ZooKeeperServer.finishSessionInit Established session 0x13c4b881a230008 with negotiated timeout 20000 for client /140.211.11.196:21434
[junit4:junit4]   2> 7089 T832 oaz.ClientCnxn$SendThread.onConnected Session establishment complete on server localhost/127.0.0.1:65441, sessionid = 0x13c4b881a230008, negotiated timeout = 20000
[junit4:junit4]   2> 7089 T833 oascc.ConnectionManager.process Watcher org.apache.solr.common.cloud.ConnectionManager@2c1f0db4 name:ZooKeeperConnection Watcher:127.0.0.1:65441/solr got event WatchedEvent state:SyncConnected type:None path:null path:null type:None
[junit4:junit4]   2> 7089 T777 oascc.ConnectionManager.waitForConnected Client is connected to ZooKeeper
[junit4:junit4]   2> 7091 T782 oazs.PrepRequestProcessor.pRequest Got user-level KeeperException when processing sessionid:0x13c4b881a230008 type:create cxid:0x1 zxid:0x6c txntype:-1 reqpath:n/a Error Path:/solr/overseer Error:KeeperErrorCode = NodeExists for /solr/overseer
[junit4:junit4]   2> 7093 T782 oazs.PrepRequestProcessor.pRequest Got user-level KeeperException when processing sessionid:0x13c4b881a230008 type:create cxid:0x2 zxid:0x6d txntype:-1 reqpath:n/a Error Path:/solr/overseer Error:KeeperErrorCode = NodeExists for /solr/overseer
[junit4:junit4]   2> 7101 T777 oasc.ZkController.createEphemeralLiveNode Register node as live in ZooKeeper:/live_nodes/127.0.0.1:48990_krmpo%2Frv
[junit4:junit4]   2> 7102 T782 oazs.PrepRequestProcessor.pRequest Got user-level KeeperException when processing sessionid:0x13c4b881a230008 type:delete cxid:0x4 zxid:0x6e txntype:-1 reqpath:n/a Error Path:/solr/live_nodes/127.0.0.1:48990_krmpo%2Frv Error:KeeperErrorCode = NoNode for /solr/live_nodes/127.0.0.1:48990_krmpo%2Frv
[junit4:junit4]   2> 7103 T777 oascc.SolrZkClient.makePath makePath: /live_nodes/127.0.0.1:48990_krmpo%2Frv
[junit4:junit4]   2> 7107 T818 oascc.ZkStateReader$3.process Updating live nodes... (3)
[junit4:junit4]   2> 7107 T805 oascc.ZkStateReader$3.process Updating live nodes... (3)
[junit4:junit4]   2> 7107 T799 oascc.ZkStateReader$3.process Updating live nodes... (3)
[junit4:junit4]   2> 7107 T818 oascc.ZkStateReader$2.process A cluster state change: WatchedEvent state:SyncConnected type:NodeChildrenChanged path:/live_nodes, has occurred - updating... (live nodes size: 3)
[junit4:junit4]   2> 7107 T799 oascc.ZkStateReader$2.process A cluster state change: WatchedEvent state:SyncConnected type:NodeChildrenChanged path:/live_nodes, has occurred - updating... (live nodes size: 3)
[junit4:junit4]   2> 7107 T805 oascc.ZkStateReader$2.process A cluster state change: WatchedEvent state:SyncConnected type:NodeChildrenChanged path:/live_nodes, has occurred - updating... (live nodes size: 3)
[junit4:junit4]   2> 7111 T777 oascc.ZkStateReader.createClusterStateWatchersAndUpdate Updating cluster state from ZooKeeper... 
[junit4:junit4]   2> 7120 T834 oasc.CoreContainer.create Creating SolrCore 'collection1' using instanceDir: /usr/home/hudson/hudson-slave/workspace/Lucene-Solr-Tests-trunk-Java6/solr/build/solr-core/test/J0/./org.apache.solr.cloud.SyncSliceTest-jetty2-1358476883024/collection1
[junit4:junit4]   2> 7120 T834 oasc.ZkController.createCollectionZkNode Check for collection zkNode:collection1
[junit4:junit4]   2> 7121 T834 oasc.ZkController.createCollectionZkNode Collection zkNode exists
[junit4:junit4]   2> 7121 T834 oasc.ZkController.readConfigName Load collection config from:/collections/collection1
[junit4:junit4]   2> 7123 T834 oasc.SolrResourceLoader.<init> new SolrResourceLoader for directory: '/usr/home/hudson/hudson-slave/workspace/Lucene-Solr-Tests-trunk-Java6/solr/build/solr-core/test/J0/./org.apache.solr.cloud.SyncSliceTest-jetty2-1358476883024/collection1/'
[junit4:junit4]   2> 7124 T834 oasc.SolrResourceLoader.replaceClassLoader Adding 'file:/usr/home/hudson/hudson-slave/workspace/Lucene-Solr-Tests-trunk-Java6/solr/build/solr-core/test/J0/org.apache.solr.cloud.SyncSliceTest-jetty2-1358476883024/collection1/lib/classes/' to classloader
[junit4:junit4]   2> 7125 T834 oasc.SolrResourceLoader.replaceClassLoader Adding 'file:/usr/home/hudson/hudson-slave/workspace/Lucene-Solr-Tests-trunk-Java6/solr/build/solr-core/test/J0/org.apache.solr.cloud.SyncSliceTest-jetty2-1358476883024/collection1/lib/README' to classloader
[junit4:junit4]   2> 7179 T834 oasc.SolrConfig.<init> Using Lucene MatchVersion: LUCENE_50
[junit4:junit4]   2> 7252 T834 oasc.SolrConfig.<init> Loaded SolrConfig: solrconfig.xml
[junit4:junit4]   2> 7353 T834 oass.IndexSchema.readSchema Reading Solr Schema
[junit4:junit4]   2> 7360 T834 oass.IndexSchema.readSchema Schema name=test
[junit4:junit4]   2> 7960 T834 oass.OpenExchangeRatesOrgProvider.init Initialized with rates=open-exchange-rates.json, refreshInterval=1440.
[junit4:junit4]   2> 7971 T834 oass.IndexSchema.readSchema default search field in schema is text
[junit4:junit4]   2> 7975 T834 oass.IndexSchema.readSchema unique key field: id
[junit4:junit4]   2> 7993 T834 oass.FileExchangeRateProvider.reload Reloading exchange rates from file currency.xml
[junit4:junit4]   2> 7998 T834 oass.FileExchangeRateProvider.reload Reloading exchange rates from file currency.xml
[junit4:junit4]   2> 8003 T834 oass.OpenExchangeRatesOrgProvider.reload Reloading exchange rates from open-exchange-rates.json
[junit4:junit4]   2> 8004 T834 oass.OpenExchangeRatesOrgProvider.reload Reloading exchange rates from open-exchange-rates.json
[junit4:junit4]   2> 8006 T834 oasc.SolrCore.<init> [collection1] Opening new SolrCore at /usr/home/hudson/hudson-slave/workspace/Lucene-Solr-Tests-trunk-Java6/solr/build/solr-core/test/J0/./org.apache.solr.cloud.SyncSliceTest-jetty2-1358476883024/collection1/, dataDir=./org.apache.solr.cloud.SyncSliceTest-1358476876318/jetty2/
[junit4:junit4]   2> 8006 T834 oasc.JmxMonitoredMap.<init> JMX monitoring is enabled. Adding Solr mbeans to JMX Server: com.sun.jmx.mbeanserver.JmxMBeanServer@9818f80
[junit4:junit4]   2> 8007 T834 oasc.SolrCore.initDirectoryFactory solr.StandardDirectoryFactory
[junit4:junit4]   2> 8007 T834 oasc.CachingDirectoryFactory.get return new directory for /usr/home/hudson/hudson-slave/workspace/Lucene-Solr-Tests-trunk-Java6/solr/build/solr-core/test/J0/./org.apache.solr.cloud.SyncSliceTest-1358476876318/jetty2 forceNew:false
[junit4:junit4]   2> 8008 T834 oasc.CachingDirectoryFactory.close Releasing directory:/usr/home/hudson/hudson-slave/workspace/Lucene-Solr-Tests-trunk-Java6/solr/build/solr-core/test/J0/./org.apache.solr.cloud.SyncSliceTest-1358476876318/jetty2
[junit4:junit4]   2> 8008 T834 oasc.SolrCore.getNewIndexDir New index directory detected: old=null new=./org.apache.solr.cloud.SyncSliceTest-1358476876318/jetty2/index/
[junit4:junit4]   2> 8009 T834 oasc.SolrCore.initIndex WARNING [collection1] Solr index directory './org.apache.solr.cloud.SyncSliceTest-1358476876318/jetty2/index' doesn't exist. Creating new index...
[junit4:junit4]   2> 8010 T834 oasc.CachingDirectoryFactory.get return new directory for /usr/home/hudson/hudson-slave/workspace/Lucene-Solr-Tests-trunk-Java6/solr/build/solr-core/test/J0/./org.apache.solr.cloud.SyncSliceTest-1358476876318/jetty2/index forceNew:false
[junit4:junit4]   2> 8015 T834 oasc.SolrDeletionPolicy.onCommit SolrDeletionPolicy.onCommit: commits:num=1
[junit4:junit4]   2> 		commit{dir=RateLimitedDirectoryWrapper(org.apache.lucene.store.NIOFSDirectory@/usr/home/hudson/hudson-slave/workspace/Lucene-Solr-Tests-trunk-Java6/solr/build/solr-core/test/J0/org.apache.solr.cloud.SyncSliceTest-1358476876318/jetty2/index lockFactory=org.apache.lucene.store.NativeFSLockFactory@13a8b2e2),segFN=segments_1,generation=1,filenames=[segments_1]
[junit4:junit4]   2> 8015 T834 oasc.SolrDeletionPolicy.updateCommits newest commit = 1[segments_1]
[junit4:junit4]   2> 8016 T834 oasc.CachingDirectoryFactory.close Releasing directory:/usr/home/hudson/hudson-slave/workspace/Lucene-Solr-Tests-trunk-Java6/solr/build/solr-core/test/J0/./org.apache.solr.cloud.SyncSliceTest-1358476876318/jetty2/index
[junit4:junit4]   2> 8016 T834 oasc.SolrCore.initWriters created xml: solr.XMLResponseWriter
[junit4:junit4]   2> 8018 T834 oasup.UpdateRequestProcessorChain.init inserting DistributedUpdateProcessorFactory into updateRequestProcessorChain "dedupe"
[junit4:junit4]   2> 8019 T834 oasup.UpdateRequestProcessorChain.init inserting DistributedUpdateProcessorFactory into updateRequestProcessorChain "dedupe-allfields"
[junit4:junit4]   2> 8019 T834 oasup.UpdateRequestProcessorChain.init inserting DistributedUpdateProcessorFactory into updateRequestProcessorChain "stored_sig"
[junit4:junit4]   2> 8019 T834 oasup.UpdateRequestProcessorChain.init inserting DistributedUpdateProcessorFactory into updateRequestProcessorChain "uniq-fields"
[junit4:junit4]   2> 8020 T834 oasup.UpdateRequestProcessorChain.init inserting DistributedUpdateProcessorFactory into updateRequestProcessorChain "distrib-dup-test-chain-implicit"
[junit4:junit4]   2> 8020 T834 oasc.RequestHandlers.initHandlersFromConfig adding lazy requestHandler: solr.ReplicationHandler
[junit4:junit4]   2> 8020 T834 oasc.RequestHandlers.initHandlersFromConfig created /replication: solr.ReplicationHandler
[junit4:junit4]   2> 8021 T834 oasc.RequestHandlers.initHandlersFromConfig created standard: solr.StandardRequestHandler
[junit4:junit4]   2> 8022 T834 oasc.RequestHandlers.initHandlersFromConfig created /get: solr.RealTimeGetHandler
[junit4:junit4]   2> 8022 T834 oasc.RequestHandlers.initHandlersFromConfig created dismax: solr.SearchHandler
[junit4:junit4]   2> 8023 T834 oasc.RequestHandlers.initHandlersFromConfig created mock: org.apache.solr.core.MockQuerySenderListenerReqHandler
[junit4:junit4]   2> 8023 T834 oasc.RequestHandlers.initHandlersFromConfig created /admin/: org.apache.solr.handler.admin.AdminHandlers
[junit4:junit4]   2> 8024 T834 oasc.RequestHandlers.initHandlersFromConfig created defaults: solr.StandardRequestHandler
[junit4:junit4]   2> 8024 T834 oasc.RequestHandlers.initHandlersFromConfig adding lazy requestHandler: solr.StandardRequestHandler
[junit4:junit4]   2> 8024 T834 oasc.RequestHandlers.initHandlersFromConfig created lazy: solr.StandardRequestHandler
[junit4:junit4]   2> 8025 T834 oasc.RequestHandlers.initHandlersFromConfig created /update: solr.UpdateRequestHandler
[junit4:junit4]   2> 8025 T834 oasc.RequestHandlers.initHandlersFromConfig created /terms: org.apache.solr.handler.component.SearchHandler
[junit4:junit4]   2> 8026 T834 oasc.RequestHandlers.initHandlersFromConfig created spellCheckCompRH: org.apache.solr.handler.component.SearchHandler
[junit4:junit4]   2> 8026 T834 oasc.RequestHandlers.initHandlersFromConfig created spellCheckCompRH_Direct: org.apache.solr.handler.component.SearchHandler
[junit4:junit4]   2> 8027 T834 oasc.RequestHandlers.initHandlersFromConfig created spellCheckWithWordbreak: org.apache.solr.handler.component.SearchHandler
[junit4:junit4]   2> 8027 T834 oasc.RequestHandlers.initHandlersFromConfig created spellCheckWithWordbreak_Direct: org.apache.solr.handler.component.SearchHandler
[junit4:junit4]   2> 8028 T834 oasc.RequestHandlers.initHandlersFromConfig created spellCheckCompRH1: org.apache.solr.handler.component.SearchHandler
[junit4:junit4]   2> 8028 T834 oasc.RequestHandlers.initHandlersFromConfig created mltrh: org.apache.solr.handler.component.SearchHandler
[junit4:junit4]   2> 8028 T834 oasc.RequestHandlers.initHandlersFromConfig created tvrh: org.apache.solr.handler.component.SearchHandler
[junit4:junit4]   2> 8029 T834 oasc.RequestHandlers.initHandlersFromConfig created /mlt: solr.MoreLikeThisHandler
[junit4:junit4]   2> 8029 T834 oasc.RequestHandlers.initHandlersFromConfig created /debug/dump: solr.DumpRequestHandler
[junit4:junit4]   2> 8034 T834 oashl.XMLLoader.init xsltCacheLifetimeSeconds=60
[junit4:junit4]   2> 8037 T834 oasc.SolrCore.initDeprecatedSupport WARNING solrconfig.xml uses deprecated <admin/gettableFiles>, Please update your config to use the ShowFileRequestHandler.
[junit4:junit4]   2> 8038 T834 oasc.SolrCore.initDeprecatedSupport WARNING adding ShowFileRequestHandler with hidden files: [SCHEMA.XML, OLD_SYNONYMS.TXT, STOPWORDS.TXT, PROTWORDS.TXT, OPEN-EXCHANGE-RATES.JSON, SYNONYMS.TXT, CURRENCY.XML, MAPPING-ISOLATIN1ACCENT.TXT]
[junit4:junit4]   2> 8039 T834 oasc.CachingDirectoryFactory.close Releasing directory:/usr/home/hudson/hudson-slave/workspace/Lucene-Solr-Tests-trunk-Java6/solr/build/solr-core/test/J0/./org.apache.solr.cloud.SyncSliceTest-1358476876318/jetty2
[junit4:junit4]   2> 8041 T834 oass.SolrIndexSearcher.<init> Opening Searcher@514e2278 main
[junit4:junit4]   2> 8041 T834 oasu.CommitTracker.<init> Hard AutoCommit: disabled
[junit4:junit4]   2> 8041 T834 oasu.CommitTracker.<init> Soft AutoCommit: disabled
[junit4:junit4]   2> 8042 T834 oashc.SpellCheckComponent.inform Initializing spell checkers
[junit4:junit4]   2> 8047 T834 oass.DirectSolrSpellChecker.init init: {name=direct,classname=DirectSolrSpellChecker,field=lowerfilt,minQueryLength=3}
[junit4:junit4]   2> 8097 T835 oasc.SolrCore.registerSearcher [collection1] Registered new searcher Searcher@514e2278 main{StandardDirectoryReader(segments_1:1)}
[junit4:junit4]   2> 8100 T834 oasc.ZkController.publish publishing core=collection1 state=down
[junit4:junit4]   2> 8100 T834 oasc.ZkController.publish numShards not found on descriptor - reading it from system property
[junit4:junit4]   2> 8199 T800 oascc.ZkStateReader.updateClusterState Updating cloud state from ZooKeeper... 
[junit4:junit4]   2> 8200 T800 oasc.Overseer$ClusterStateUpdater.updateState Update state numShards=1 message={
[junit4:junit4]   2> 	  "operation":"state",
[junit4:junit4]   2> 	  "numShards":"1",
[junit4:junit4]   2> 	  "shard":"shard1",
[junit4:junit4]   2> 	  "roles":null,
[junit4:junit4]   2> 	  "state":"active",
[junit4:junit4]   2> 	  "core":"collection1",
[junit4:junit4]   2> 	  "collection":"collection1",
[junit4:junit4]   2> 	  "node_name":"127.0.0.1:50527_krmpo%2Frv",
[junit4:junit4]   2> 	  "base_url":"http://127.0.0.1:50527/krmpo/rv"}
[junit4:junit4]   2> 8205 T800 oasc.Overseer$ClusterStateUpdater.updateState Update state numShards=1 message={
[junit4:junit4]   2> 	  "operation":"state",
[junit4:junit4]   2> 	  "numShards":"1",
[junit4:junit4]   2> 	  "shard":null,
[junit4:junit4]   2> 	  "roles":null,
[junit4:junit4]   2> 	  "state":"down",
[junit4:junit4]   2> 	  "core":"collection1",
[junit4:junit4]   2> 	  "collection":"collection1",
[junit4:junit4]   2> 	  "node_name":"127.0.0.1:48990_krmpo%2Frv",
[junit4:junit4]   2> 	  "base_url":"http://127.0.0.1:48990/krmpo/rv"}
[junit4:junit4]   2> 8205 T800 oasc.Overseer$ClusterStateUpdater.updateState Collection already exists with numShards=1
[junit4:junit4]   2> 8205 T800 oasc.Overseer$ClusterStateUpdater.updateState Assigning new node to shard shard=shard1
[junit4:junit4]   2> 8220 T833 oascc.ZkStateReader$2.process A cluster state change: WatchedEvent state:SyncConnected type:NodeDataChanged path:/clusterstate.json, has occurred - updating... (live nodes size: 3)
[junit4:junit4]   2> 8220 T805 oascc.ZkStateReader$2.process A cluster state change: WatchedEvent state:SyncConnected type:NodeDataChanged path:/clusterstate.json, has occurred - updating... (live nodes size: 3)
[junit4:junit4]   2> 8220 T818 oascc.ZkStateReader$2.process A cluster state change: WatchedEvent state:SyncConnected type:NodeDataChanged path:/clusterstate.json, has occurred - updating... (live nodes size: 3)
[junit4:junit4]   2> 8220 T799 oascc.ZkStateReader$2.process A cluster state change: WatchedEvent state:SyncConnected type:NodeDataChanged path:/clusterstate.json, has occurred - updating... (live nodes size: 3)
[junit4:junit4]   2> 9102 T834 oasc.CoreContainer.registerCore registering core: collection1
[junit4:junit4]   2> 9102 T834 oasc.ZkController.register Register replica - core:collection1 address:http://127.0.0.1:48990/krmpo/rv collection:collection1 shard:shard1
[junit4:junit4]   2> 9106 T834 oasc.ZkController.register We are http://127.0.0.1:48990/krmpo/rv/collection1/ and leader is http://127.0.0.1:50527/krmpo/rv/collection1/
[junit4:junit4]   2> 9107 T834 oasc.ZkController.register No LogReplay needed for core=collection1 baseURL=http://127.0.0.1:48990/krmpo/rv
[junit4:junit4]   2> 9107 T834 oasc.ZkController.checkRecovery Core needs to recover:collection1
[junit4:junit4]   2> 9107 T834 oasu.DefaultSolrCoreState.doRecovery Running recovery - first canceling any ongoing recovery
[junit4:junit4]   2> ASYNC  NEW_CORE C42 name=collection1 org.apache.solr.core.SolrCore@4f0e94db url=http://127.0.0.1:48990/krmpo/rv/collection1 node=127.0.0.1:48990_krmpo%2Frv C42_STATE=coll:collection1 core:collection1 props:{shard=null, roles=null, state=down, core=collection1, collection=collection1, node_name=127.0.0.1:48990_krmpo%2Frv, base_url=http://127.0.0.1:48990/krmpo/rv}
[junit4:junit4]   2> 9114 T836 C42 P48990 oasc.RecoveryStrategy.run Starting recovery process.  core=collection1 recoveringAfterStartup=true
[junit4:junit4]   2> 9114 T834 oascc.ZkStateReader.updateClusterState Updating cloud state from ZooKeeper... 
[junit4:junit4]   2> 9115 T836 C42 P48990 oasc.RecoveryStrategy.doRecovery ###### startupVersions=[]
[junit4:junit4]   2> 9115 T836 C42 P48990 oasc.ZkController.publish publishing core=collection1 state=recovering
[junit4:junit4]   2> 9115 T836 C42 P48990 oasc.ZkController.publish numShards not found on descriptor - reading it from system property
[junit4:junit4]   2> 9116 T777 oass.SolrDispatchFilter.init user.dir=/usr/home/hudson/hudson-slave/workspace/Lucene-Solr-Tests-trunk-Java6/solr/build/solr-core/test/J0
[junit4:junit4]   2> 9116 T777 oass.SolrDispatchFilter.init SolrDispatchFilter.init() done
[junit4:junit4]   2> 9117 T777 oascsi.HttpClientUtil.createClient Creating new http client, config:maxConnections=128&maxConnectionsPerHost=32&followRedirects=false
[junit4:junit4]   2> 9171 T836 C42 P48990 oascsi.HttpClientUtil.createClient Creating new http client, config:maxConnections=128&maxConnectionsPerHost=32&followRedirects=false
[junit4:junit4]   2> 9304 T777 oejs.Server.doStart jetty-8.1.8.v20121106
[junit4:junit4]   2> 9307 T777 oejs.AbstractConnector.doStart Started SocketConnector@127.0.0.1:59838
[junit4:junit4]   2> 9308 T777 oass.SolrDispatchFilter.init SolrDispatchFilter.init()
[junit4:junit4]   2> 9308 T777 oasc.SolrResourceLoader.locateSolrHome JNDI not configured for solr (NoInitialContextEx)
[junit4:junit4]   2> 9309 T777 oasc.SolrResourceLoader.locateSolrHome using system property solr.solr.home: /usr/home/hudson/hudson-slave/workspace/Lucene-Solr-Tests-trunk-Java6/solr/build/solr-core/test/J0/./org.apache.solr.cloud.SyncSliceTest-jetty3-1358476885446
[junit4:junit4]   2> 9309 T777 oasc.CoreContainer$Initializer.initialize looking for solr.xml: /usr/home/hudson/hudson-slave/workspace/Lucene-Solr-Tests-trunk-Java6/solr/build/solr-core/test/J0/./org.apache.solr.cloud.SyncSliceTest-jetty3-1358476885446/solr.xml
[junit4:junit4]   2> 9310 T777 oasc.CoreContainer.<init> New CoreContainer 1060602156
[junit4:junit4]   2> 9311 T777 oasc.CoreContainer.load Loading CoreContainer using Solr Home: '/usr/home/hudson/hudson-slave/workspace/Lucene-Solr-Tests-trunk-Java6/solr/build/solr-core/test/J0/./org.apache.solr.cloud.SyncSliceTest-jetty3-1358476885446/'
[junit4:junit4]   2> 9311 T777 oasc.SolrResourceLoader.<init> new SolrResourceLoader for directory: '/usr/home/hudson/hudson-slave/workspace/Lucene-Solr-Tests-trunk-Java6/solr/build/solr-core/test/J0/./org.apache.solr.cloud.SyncSliceTest-jetty3-1358476885446/'
[junit4:junit4]   2> 9354 T777 oashc.HttpShardHandlerFactory.getParameter Setting socketTimeout to: 60000
[junit4:junit4]   2> 9354 T777 oashc.HttpShardHandlerFactory.getParameter Setting urlScheme to: http://
[junit4:junit4]   2> 9355 T777 oashc.HttpShardHandlerFactory.getParameter Setting connTimeout to: 15000
[junit4:junit4]   2> 9355 T777 oashc.HttpShardHandlerFactory.getParameter Setting maxConnectionsPerHost to: 20
[junit4:junit4]   2> 9355 T777 oashc.HttpShardHandlerFactory.getParameter Setting corePoolSize to: 0
[junit4:junit4]   2> 9356 T777 oashc.HttpShardHandlerFactory.getParameter Setting maximumPoolSize to: 2147483647
[junit4:junit4]   2> 9356 T777 oashc.HttpShardHandlerFactory.getParameter Setting maxThreadIdleTime to: 5
[junit4:junit4]   2> 9357 T777 oashc.HttpShardHandlerFactory.getParameter Setting sizeOfQueue to: -1
[junit4:junit4]   2> 9357 T777 oashc.HttpShardHandlerFactory.getParameter Setting fairnessPolicy to: false
[junit4:junit4]   2> 9358 T777 oascsi.HttpClientUtil.createClient Creating new http client, config:maxConnectionsPerHost=20&maxConnections=10000&socketTimeout=60000&connTimeout=15000&retry=false
[junit4:junit4]   2> 9380 T777 oasc.CoreContainer.load Registering Log Listener
[junit4:junit4]   2> 9398 T777 oasc.CoreContainer.initZooKeeper Zookeeper client=127.0.0.1:65441/solr
[junit4:junit4]   2> 9399 T777 oasc.ZkController.checkChrootPath zkHost includes chroot
[junit4:junit4]   2> 9399 T777 oaz.ZooKeeper.<init> Initiating client connection, connectString=127.0.0.1:65441 sessionTimeout=60000 watcher=org.apache.solr.common.cloud.ConnectionManager@599d5079
[junit4:junit4]   2> 9401 T777 oascc.ConnectionManager.waitForConnected Waiting for client to connect to ZooKeeper
[junit4:junit4]   2> 9401 T846 oaz.ClientCnxn$SendThread.logStartConnect Opening socket connection to server localhost/127.0.0.1:65441. Will not attempt to authenticate using SASL (access denied (javax.security.auth.AuthPermission getLoginConfiguration))
[junit4:junit4]   2> 9402 T846 oaz.ClientCnxn$SendThread.primeConnection Socket connection established to localhost/127.0.0.1:65441, initiating session
[junit4:junit4]   2> 9402 T779 oazs.NIOServerCnxnFactory.run Accepted socket connection from /140.211.11.196:39034
[junit4:junit4]   2> 9402 T779 oazs.ZooKeeperServer.processConnectRequest Client attempting to establish new session at /140.211.11.196:39034
[junit4:junit4]   2> 9404 T781 oazs.ZooKeeperServer.finishSessionInit Established session 0x13c4b881a230009 with negotiated timeout 20000 for client /140.211.11.196:39034
[junit4:junit4]   2> 9404 T846 oaz.ClientCnxn$SendThread.onConnected Session establishment complete on server localhost/127.0.0.1:65441, sessionid = 0x13c4b881a230009, negotiated timeout = 20000
[junit4:junit4]   2> 9405 T847 oascc.ConnectionManager.process Watcher org.apache.solr.common.cloud.ConnectionManager@599d5079 name:ZooKeeperConnection Watcher:127.0.0.1:65441 got event WatchedEvent state:SyncConnected type:None path:null path:null type:None
[junit4:junit4]   2> 9405 T777 oascc.ConnectionManager.waitForConnected Client is connected to ZooKeeper
[junit4:junit4]   2> 9406 T782 oazs.PrepRequestProcessor.pRequest2Txn Processed session termination for sessionid: 0x13c4b881a230009
[junit4:junit4]   2> 9426 T847 oaz.ClientCnxn$EventThread.run EventThread shut down
[junit4:junit4]   2> 9426 T779 oazs.NIOServerCnxn.closeSock Closed socket connection for client /140.211.11.196:39034 which had sessionid 0x13c4b881a230009
[junit4:junit4]   2> 9426 T777 oaz.ZooKeeper.close Session: 0x13c4b881a230009 closed
[junit4:junit4]   2> 9426 T777 oascsi.HttpClientUtil.createClient Creating new http client, config:maxConnections=500&maxConnectionsPerHost=16&socketTimeout=60000&connTimeout=15000
[junit4:junit4]   2> 9439 T777 oaz.ZooKeeper.<init> Initiating client connection, connectString=127.0.0.1:65441/solr sessionTimeout=30000 watcher=org.apache.solr.common.cloud.ConnectionManager@7b402c4e
[junit4:junit4]   2> 9440 T777 oascc.ConnectionManager.waitForConnected Waiting for client to connect to ZooKeeper
[junit4:junit4]   2> 9440 T848 oaz.ClientCnxn$SendThread.logStartConnect Opening socket connection to server localhost/127.0.0.1:65441. Will not attempt to authenticate using SASL (access denied (javax.security.auth.AuthPermission getLoginConfiguration))
[junit4:junit4]   2> 9441 T848 oaz.ClientCnxn$SendThread.primeConnection Socket connection established to localhost/127.0.0.1:65441, initiating session
[junit4:junit4]   2> 9441 T779 oazs.NIOServerCnxnFactory.run Accepted socket connection from /140.211.11.196:59404
[junit4:junit4]   2> 9441 T779 oazs.ZooKeeperServer.processConnectRequest Client attempting to establish new session at /140.211.11.196:59404
[junit4:junit4]   2> 9442 T781 oazs.ZooKeeperServer.finishSessionInit Established session 0x13c4b881a23000a with negotiated timeout 20000 for client /140.211.11.196:59404
[junit4:junit4]   2> 9443 T848 oaz.ClientCnxn$SendThread.onConnected Session establishment complete on server localhost/127.0.0.1:65441, sessionid = 0x13c4b881a23000a, negotiated timeout = 20000
[junit4:junit4]   2> 9443 T849 oascc.ConnectionManager.process Watcher org.apache.solr.common.cloud.ConnectionManager@7b402c4e name:ZooKeeperConnection Watcher:127.0.0.1:65441/solr got event WatchedEvent state:SyncConnected type:None path:null path:null type:None
[junit4:junit4]   2> 9443 T777 oascc.ConnectionManager.waitForConnected Client is connected to ZooKeeper
[junit4:junit4]   2> 9445 T782 oazs.PrepRequestProcessor.pRequest Got user-level KeeperException when processing sessionid:0x13c4b881a23000a type:create cxid:0x1 zxid:0x7e txntype:-1 reqpath:n/a Error Path:/solr/overseer Error:KeeperErrorCode = NodeExists for /solr/overseer
[junit4:junit4]   2> 9446 T782 oazs.PrepRequestProcessor.pRequest Got user-level KeeperException when processing sessionid:0x13c4b881a23000a type:create cxid:0x2 zxid:0x7f txntype:-1 reqpath:n/a Error Path:/solr/overseer Error:KeeperErrorCode = NodeExists for /solr/overseer
[junit4:junit4]   2> 9448 T777 oasc.ZkController.createEphemeralLiveNode Register node as live in ZooKeeper:/live_nodes/127.0.0.1:59838_krmpo%2Frv
[junit4:junit4]   2> 9449 T782 oazs.PrepRequestProcessor.pRequest Got user-level KeeperException when processing sessionid:0x13c4b881a23000a type:delete cxid:0x4 zxid:0x80 txntype:-1 reqpath:n/a Error Path:/solr/live_nodes/127.0.0.1:59838_krmpo%2Frv Error:KeeperErrorCode = NoNode for /solr/live_nodes/127.0.0.1:59838_krmpo%2Frv
[junit4:junit4]   2> 9455 T777 oascc.SolrZkClient.makePath makePath: /live_nodes/127.0.0.1:59838_krmpo%2Frv
[junit4:junit4]   2> 9459 T799 oascc.ZkStateReader$3.process Updating live nodes... (4)
[junit4:junit4]   2> 9459 T833 oascc.ZkStateReader$3.process Updating live nodes... (4)
[junit4:junit4]   2> 9459 T799 oascc.ZkStateReader$2.process A cluster state change: WatchedEvent state:SyncConnected type:NodeChildrenChanged path:/live_nodes, has occurred - updating... (live nodes size: 4)
[junit4:junit4]   2> 9459 T833 oascc.ZkStateReader$2.process A cluster state change: WatchedEvent state:SyncConnected type:NodeChildrenChanged path:/live_nodes, has occurred - updating... (live nodes size: 4)
[junit4:junit4]   2> 9459 T805 oascc.ZkStateReader$3.process Updating live nodes... (4)
[junit4:junit4]   2> 9459 T818 oascc.ZkStateReader$3.process Updating live nodes... (4)
[junit4:junit4]   2> 9460 T818 oascc.ZkStateReader$2.process A cluster state change: WatchedEvent state:SyncConnected type:NodeChildrenChanged path:/live_nodes, has occurred - updating... (live nodes size: 4)
[junit4:junit4]   2> 9460 T805 oascc.ZkStateReader$2.process A cluster state change: WatchedEvent state:SyncConnected type:NodeChildrenChanged path:/live_nodes, has occurred - updating... (live nodes size: 4)
[junit4:junit4]   2> 9464 T777 oascc.ZkStateReader.createClusterStateWatchersAndUpdate Updating cluster state from ZooKeeper... 
[junit4:junit4]   2> 9473 T850 oasc.CoreContainer.create Creating SolrCore 'collection1' using instanceDir: /usr/home/hudson/hudson-slave/workspace/Lucene-Solr-Tests-trunk-Java6/solr/build/solr-core/test/J0/./org.apache.solr.cloud.SyncSliceTest-jetty3-1358476885446/collection1
[junit4:junit4]   2> 9473 T850 oasc.ZkController.createCollectionZkNode Check for collection zkNode:collection1
[junit4:junit4]   2> 9474 T850 oasc.ZkController.createCollectionZkNode Collection zkNode exists
[junit4:junit4]   2> 9474 T850 oasc.ZkController.readConfigName Load collection config from:/collections/collection1
[junit4:junit4]   2> 9476 T850 oasc.SolrResourceLoader.<init> new SolrResourceLoader for directory: '/usr/home/hudson/hudson-slave/workspace/Lucene-Solr-Tests-trunk-Java6/solr/build/solr-core/test/J0/./org.apache.solr.cloud.SyncSliceTest-jetty3-1358476885446/collection1/'
[junit4:junit4]   2> 9477 T850 oasc.SolrResourceLoader.replaceClassLoader Adding 'file:/usr/home/hudson/hudson-slave/workspace/Lucene-Solr-Tests-trunk-Java6/solr/build/solr-core/test/J0/org.apache.solr.cloud.SyncSliceTest-jetty3-1358476885446/collection1/lib/README' to classloader
[junit4:junit4]   2> 9477 T850 oasc.SolrResourceLoader.replaceClassLoader Adding 'file:/usr/home/hudson/hudson-slave/workspace/Lucene-Solr-Tests-trunk-Java6/solr/build/solr-core/test/J0/org.apache.solr.cloud.SyncSliceTest-jetty3-1358476885446/collection1/lib/classes/' to classloader
[junit4:junit4]   2> 9535 T850 oasc.SolrConfig.<init> Using Lucene MatchVersion: LUCENE_50
[junit4:junit4]   2> 9604 T850 oasc.SolrConfig.<init> Loaded SolrConfig: solrconfig.xml
[junit4:junit4]   2> 9706 T850 oass.IndexSchema.readSchema Reading Solr Schema
[junit4:junit4]   2> 9713 T850 oass.IndexSchema.readSchema Schema name=test
[junit4:junit4]   2> 9734 T800 oascc.ZkStateReader.updateClusterState Updating cloud state from ZooKeeper... 
[junit4:junit4]   2> 9735 T800 oasc.Overseer$ClusterStateUpdater.updateState Update state numShards=1 message={
[junit4:junit4]   2> 	  "operation":"state",
[junit4:junit4]   2> 	  "numShards":"1",
[junit4:junit4]   2> 	  "shard":"shard1",
[junit4:junit4]   2> 	  "roles":null,
[junit4:junit4]   2> 	  "state":"recovering",
[junit4:junit4]   2> 	  "core":"collection1",
[junit4:junit4]   2> 	  "collection":"collection1",
[junit4:junit4]   2> 	  "node_name":"127.0.0.1:48990_krmpo%2Frv",
[junit4:junit4]   2> 	  "base_url":"http://127.0.0.1:48990/krmpo/rv"}
[junit4:junit4]   2> 9750 T833 oascc.ZkStateReader$2.process A cluster state change: WatchedEvent state:SyncConnected type:NodeDataChanged path:/clusterstate.json, has occurred - updating... (live nodes size: 4)
[junit4:junit4]   2> 9750 T799 oascc.ZkStateReader$2.process A cluster state change: WatchedEvent state:SyncConnected type:NodeDataChanged path:/clusterstate.json, has occurred - updating... (live nodes size: 4)
[junit4:junit4]   2> 9750 T818 oascc.ZkStateReader$2.process A cluster state change: WatchedEvent state:SyncConnected type:NodeDataChanged path:/clusterstate.json, has occurred - updating... (live nodes size: 4)
[junit4:junit4]   2> 9750 T849 oascc.ZkStateReader$2.process A cluster state change: WatchedEvent state:SyncConnected type:NodeDataChanged path:/clusterstate.json, has occurred - updating... (live nodes size: 4)
[junit4:junit4]   2> 9750 T805 oascc.ZkStateReader$2.process A cluster state change: WatchedEvent state:SyncConnected type:NodeDataChanged path:/clusterstate.json, has occurred - updating... (live nodes size: 4)
[junit4:junit4]   2> 10301 T850 oass.OpenExchangeRatesOrgProvider.init Initialized with rates=open-exchange-rates.json, refreshInterval=1440.
[junit4:junit4]   2> 10312 T850 oass.IndexSchema.readSchema default search field in schema is text
[junit4:junit4]   2> 10316 T850 oass.IndexSchema.readSchema unique key field: id
[junit4:junit4]   2> 10335 T850 oass.FileExchangeRateProvider.reload Reloading exchange rates from file currency.xml
[junit4:junit4]   2> 10340 T850 oass.FileExchangeRateProvider.reload Reloading exchange rates from file currency.xml
[junit4:junit4]   2> 10345 T850 oass.OpenExchangeRatesOrgProvider.reload Reloading exchange rates from open-exchange-rates.json
[junit4:junit4]   2> 10347 T850 oass.OpenExchangeRatesOrgProvider.reload Reloading exchange rates from open-exchange-rates.json
[junit4:junit4]   2> 10348 T850 oasc.SolrCore.<init> [collection1] Opening new SolrCore at /usr/home/hudson/hudson-slave/workspace/Lucene-Solr-Tests-trunk-Java6/solr/build/solr-core/test/J0/./org.apache.solr.cloud.SyncSliceTest-jetty3-1358476885446/collection1/, dataDir=./org.apache.solr.cloud.SyncSliceTest-1358476876318/jetty3/
[junit4:junit4]   2> 10348 T850 oasc.JmxMonitoredMap.<init> JMX monitoring is enabled. Adding Solr mbeans to JMX Server: com.sun.jmx.mbeanserver.JmxMBeanServer@9818f80
[junit4:junit4]   2> 10349 T850 oasc.SolrCore.initDirectoryFactory solr.StandardDirectoryFactory
[junit4:junit4]   2> 10350 T850 oasc.CachingDirectoryFactory.get return new directory for /usr/home/hudson/hudson-slave/workspace/Lucene-Solr-Tests-trunk-Java6/solr/build/solr-core/test/J0/./org.apache.solr.cloud.SyncSliceTest-1358476876318/jetty3 forceNew:false
[junit4:junit4]   2> 10350 T850 oasc.CachingDirectoryFactory.close Releasing directory:/usr/home/hudson/hudson-slave/workspace/Lucene-Solr-Tests-trunk-Java6/solr/build/solr-core/test/J0/./org.apache.solr.cloud.SyncSliceTest-1358476876318/jetty3
[junit4:junit4]   2> 10350 T850 oasc.SolrCore.getNewIndexDir New index directory detected: old=null new=./org.apache.solr.cloud.SyncSliceTest-1358476876318/jetty3/index/
[junit4:junit4]   2> 10351 T850 oasc.SolrCore.initIndex WARNING [collection1] Solr index directory './org.apache.solr.cloud.SyncSliceTest-1358476876318/jetty3/index' doesn't exist. Creating new index...
[junit4:junit4]   2> 10352 T850 oasc.CachingDirectoryFactory.get return new directory for /usr/home/hudson/hudson-slave/workspace/Lucene-Solr-Tests-trunk-Java6/solr/build/solr-core/test/J0/./org.apache.solr.cloud.SyncSliceTest-1358476876318/jetty3/index forceNew:false
[junit4:junit4]   2> 10358 T850 oasc.SolrDeletionPolicy.onCommit SolrDeletionPolicy.onCommit: commits:num=1
[junit4:junit4]   2> 		commit{dir=RateLimitedDirectoryWrapper(org.apache.lucene.store.NIOFSDirectory@/usr/home/hudson/hudson-slave/workspace/Lucene-Solr-Tests-trunk-Java6/solr/build/solr-core/test/J0/org.apache.solr.cloud.SyncSliceTest-1358476876318/jetty3/index lockFactory=org.apache.lucene.store.NativeFSLockFactory@3642ab71),segFN=segments_1,generation=1,filenames=[segments_1]
[junit4:junit4]   2> 10358 T850 oasc.SolrDeletionPolicy.updateCommits newest commit = 1[segments_1]
[junit4:junit4]   2> 10359 T850 oasc.CachingDirectoryFactory.close Releasing directory:/usr/home/hudson/hudson-slave/workspace/Lucene-Solr-Tests-trunk-Java6/solr/build/solr-core/test/J0/./org.apache.solr.cloud.SyncSliceTest-1358476876318/jetty3/index
[junit4:junit4]   2> 10359 T850 oasc.SolrCore.initWriters created xml: solr.XMLResponseWriter
[junit4:junit4]   2> 10361 T850 oasup.UpdateRequestProcessorChain.init inserting DistributedUpdateProcessorFactory into updateRequestProcessorChain "dedupe"
[junit4:junit4]   2> 10362 T850 oasup.UpdateRequestProcessorChain.init inserting DistributedUpdateProcessorFactory into updateRequestProcessorChain "dedupe-allfields"
[junit4:junit4]   2> 10362 T850 oasup.UpdateRequestProcessorChain.init inserting DistributedUpdateProcessorFactory into updateRequestProcessorChain "stored_sig"
[junit4:junit4]   2> 10362 T850 oasup.UpdateRequestProcessorChain.init inserting DistributedUpdateProcessorFactory into updateRequestProcessorChain "uniq-fields"
[junit4:junit4]   2> 10363 T850 oasup.UpdateRequestProcessorChain.init inserting DistributedUpdateProcessorFactory into updateRequestProcessorChain "distrib-dup-test-chain-implicit"
[junit4:junit4]   2> 10363 T850 oasc.RequestHandlers.initHandlersFromConfig adding lazy requestHandler: solr.ReplicationHandler
[junit4:junit4]   2> 10364 T850 oasc.RequestHandlers.initHandlersFromConfig created /replication: solr.ReplicationHandler
[junit4:junit4]   2> 10364 T850 oasc.RequestHandlers.initHandlersFromConfig created standard: solr.StandardRequestHandler
[junit4:junit4]   2> 10365 T850 oasc.RequestHandlers.initHandlersFromConfig created /get: solr.RealTimeGetHandler
[junit4:junit4]   2> 10365 T850 oasc.RequestHandlers.initHandlersFromConfig created dismax: solr.SearchHandler
[junit4:junit4]   2> 10366 T850 oasc.RequestHandlers.initHandlersFromConfig created mock: org.apache.solr.core.MockQuerySenderListenerReqHandler
[junit4:junit4]   2> 10366 T850 oasc.RequestHandlers.initHandlersFromConfig created /admin/: org.apache.solr.handler.admin.AdminHandlers
[junit4:junit4]   2> 10367 T850 oasc.RequestHandlers.initHandlersFromConfig created defaults: solr.StandardRequestHandler
[junit4:junit4]   2> 10367 T850 oasc.RequestHandlers.initHandlersFromConfig adding lazy requestHandler: solr.StandardRequestHandler
[junit4:junit4]   2> 10367 T850 oasc.RequestHandlers.initHandlersFromConfig created lazy: solr.StandardRequestHandler
[junit4:junit4]   2> 10368 T850 oasc.RequestHandlers.initHandlersFromConfig created /update: solr.UpdateRequestHandler
[junit4:junit4]   2> 10368 T850 oasc.RequestHandlers.initHandlersFromConfig created /terms: org.apache.solr.handler.component.SearchHandler
[junit4:junit4]   2> 10369 T850 oasc.RequestHandlers.initHandlersFromConfig created spellCheckCompRH: org.apache.solr.handler.component.SearchHandler
[junit4:junit4]   2> 10369 T850 oasc.RequestHandlers.initHandlersFromConfig created spellCheckCompRH_Direct: org.apache.solr.handler.component.SearchHandler
[junit4:junit4]   2> 10370 T850 oasc.RequestHandlers.initHandlersFromConfig created spellCheckWithWordbreak: org.apache.solr.handler.component.SearchHandler
[junit4:junit4]   2> 10371 T850 oasc.RequestHandlers.initHandlersFromConfig created spellCheckWithWordbreak_Direct: org.apache.solr.handler.component.SearchHandler
[junit4:junit4]   2> 10371 T850 oasc.RequestHandlers.initHandlersFromConfig created spellCheckCompRH1: org.apache.solr.handler.component.SearchHandler
[junit4:junit4]   2> 10372 T850 oasc.RequestHandlers.initHandlersFromConfig created mltrh: org.apache.solr.handler.component.SearchHandler
[junit4:junit4]   2> 10372 T850 oasc.RequestHandlers.initHandlersFromConfig created tvrh: org.apache.solr.handler.component.SearchHandler
[junit4:junit4]   2> 10373 T850 oasc.RequestHandlers.initHandlersFromConfig created /mlt: solr.MoreLikeThisHandler
[junit4:junit4]   2> 10373 T850 oasc.RequestHandlers.initHandlersFromConfig created /debug/dump: solr.DumpRequestHandler
[junit4:junit4]   2> 10380 T850 oashl.XMLLoader.init xsltCacheLifetimeSeconds=60
[junit4:junit4]   2> 10385 T850 oasc.SolrCore.initDeprecatedSupport WARNING solrconfig.xml uses deprecated <admin/gettableFiles>, Please update your config to use the ShowFileRequestHandler.
[junit4:junit4]   2> 10386 T850 oasc.SolrCore.initDeprecatedSupport WARNING adding ShowFileRequestHandler with hidden files: [SCHEMA.XML, OLD_SYNONYMS.TXT, STOPWORDS.TXT, PROTWORDS.TXT, OPEN-EXCHANGE-RATES.JSON, SYNONYMS.TXT, CURRENCY.XML, MAPPING-ISOLATIN1ACCENT.TXT]
[junit4:junit4]   2> 10389 T850 oasc.CachingDirectoryFactory.close Releasing directory:/usr/home/hudson/hudson-slave/workspace/Lucene-Solr-Tests-trunk-Java6/solr/build/solr-core/test/J0/./org.apache.solr.cloud.SyncSliceTest-1358476876318/jetty3
[junit4:junit4]   2> 10391 T850 oass.SolrIndexSearcher.<init> Opening Searcher@6e2fd3fc main
[junit4:junit4]   2> 10392 T850 oasu.CommitTracker.<init> Hard AutoCommit: disabled
[junit4:junit4]   2> 10392 T850 oasu.CommitTracker.<init> Soft AutoCommit: disabled
[junit4:junit4]   2> 10392 T850 oashc.SpellCheckComponent.inform Initializing spell checkers
[junit4:junit4]   2> 10410 T850 oass.DirectSolrSpellChecker.init init: {name=direct,classname=DirectSolrSpellChecker,field=lowerfilt,minQueryLength=3}
[junit4:junit4]   2> 10466 T851 oasc.SolrCore.registerSearcher [collection1] Registered new searcher Searcher@6e2fd3fc main{StandardDirectoryReader(segments_1:1)}
[junit4:junit4]   2> 10472 T850 oasc.ZkController.publish publishing core=collection1 state=down
[junit4:junit4]   2> 10472 T850 oasc.ZkController.publish numShards not found on descriptor - reading it from system property
[junit4:junit4]   2> 11258 T800 oascc.ZkStateReader.updateClusterState Updating cloud state from ZooKeeper... 
[junit4:junit4]   2> 11259 T800 oasc.Overseer$ClusterStateUpdater.updateState Update state numShards=1 message={
[junit4:junit4]   2> 	  "operation":"state",
[junit4:junit4]   2> 	  "numShards":"1",
[junit4:junit4]   2> 	  "shard":null,
[junit4:junit4]   2> 	  "roles":null,
[junit4:junit4]   2> 	  "state":"down",
[junit4:junit4]   2> 	  "core":"collection1",
[junit4:junit4]   2> 	  "collection":"collection1",
[junit4:junit4]   2> 	  "node_name":"127.0.0.1:59838_krmpo%2Frv",
[junit4:junit4]   2> 	  "base_url":"http://127.0.0.1:59838/krmpo/rv"}
[junit4:junit4]   2> 11259 T800 oasc.Overseer$ClusterStateUpdater.updateState Collection already exists with numShards=1
[junit4:junit4]   2> 11259 T800 oasc.Overseer$ClusterStateUpdater.updateState Assigning new node to shard shard=shard1
[junit4:junit4]   2> 11273 T833 oascc.ZkStateReader$2.process A cluster state change: WatchedEvent state:SyncConnected type:NodeDataChanged path:/clusterstate.json, has occurred - updating... (live nodes size: 4)
[junit4:junit4]   2> 11273 T799 oascc.ZkStateReader$2.process A cluster state change: WatchedEvent state:SyncConnected type:NodeDataChanged path:/clusterstate.json, has occurred - updating... (live nodes size: 4)
[junit4:junit4]   2> 11273 T849 oascc.ZkStateReader$2.process A cluster state change: WatchedEvent state:SyncConnected type:NodeDataChanged path:/clusterstate.json, has occurred - updating... (live nodes size: 4)
[junit4:junit4]   2> 11273 T818 oascc.ZkStateReader$2.process A cluster state change: WatchedEvent state:SyncConnected type:NodeDataChanged path:/clusterstate.json, has occurred - updating... (live nodes size: 4)
[junit4:junit4]   2> 11273 T805 oascc.ZkStateReader$2.process A cluster state change: WatchedEvent state:SyncConnected type:NodeDataChanged path:/clusterstate.json, has occurred - updating... (live nodes size: 4)
[junit4:junit4]   2> 11475 T850 oasc.CoreContainer.registerCore registering core: collection1
[junit4:junit4]   2> 11475 T850 oasc.ZkController.register Register replica - core:collection1 address:http://127.0.0.1:59838/krmpo/rv collection:collection1 shard:shard1
[junit4:junit4]   2> 11479 T850 oasc.ZkController.register We are http://127.0.0.1:59838/krmpo/rv/collection1/ and leader is http://127.0.0.1:50527/krmpo/rv/collection1/
[junit4:junit4]   2> 11479 T850 oasc.ZkController.register No LogReplay needed for core=collection1 baseURL=http://127.0.0.1:59838/krmpo/rv
[junit4:junit4]   2> 11479 T850 oasc.ZkController.checkRecovery Core needs to recover:collection1
[junit4:junit4]   2> 11479 T850 oasu.DefaultSolrCoreState.doRecovery Running recovery - first canceling any ongoing recovery
[junit4:junit4]   2> ASYNC  NEW_CORE C43 name=collection1 org.apache.solr.core.SolrCore@db020ad url=http://127.0.0.1:59838/krmpo/rv/collection1 node=127.0.0.1:59838_krmpo%2Frv C43_STATE=coll:collection1 core:collection1 props:{shard=null, roles=null, state=down, core=collection1, collection=collection1, node_name=127.0.0.1:59838_krmpo%2Frv, base_url=http://127.0.0.1:59838/krmpo/rv}
[junit4:junit4]   2> 11480 T852 C43 P59838 oasc.RecoveryStrategy.run Starting recovery process.  core=collection1 recoveringAfterStartup=true
[junit4:junit4]   2> 11481 T852 C43 P59838 oasc.RecoveryStrategy.doRecovery ###### startupVersions=[]
[junit4:junit4]   2> 11481 T850 oascc.ZkStateReader.updateClusterState Updating cloud state from ZooKeeper... 
[junit4:junit4]   2> 11481 T852 C43 P59838 oasc.ZkController.publish publishing core=collection1 state=recovering
[junit4:junit4]   2> 11481 T852 C43 P59838 oasc.ZkController.publish numShards not found on descriptor - reading it from system property
[junit4:junit4]   2> 11482 T777 oass.SolrDispatchFilter.init user.dir=/usr/home/hudson/hudson-slave/workspace/Lucene-Solr-Tests-trunk-Java6/solr/build/solr-core/test/J0
[junit4:junit4]   2> 11483 T777 oass.SolrDispatchFilter.init SolrDispatchFilter.init() done
[junit4:junit4]   2> 11483 T777 oascsi.HttpClientUtil.createClient Creating new http client, config:maxConnections=128&maxConnectionsPerHost=32&followRedirects=false
[junit4:junit4]   2> 11485 T852 C43 P59838 oascsi.HttpClientUtil.createClient Creating new http client, config:maxConnections=128&maxConnectionsPerHost=32&followRedirects=false
[junit4:junit4]   2> 11601 T777 oejs.Server.doStart jetty-8.1.8.v20121106
[junit4:junit4]   2> 11603 T777 oejs.AbstractConnector.doStart Started SocketConnector@127.0.0.1:22092
[junit4:junit4]   2> 11604 T777 oass.SolrDispatchFilter.init SolrDispatchFilter.init()
[junit4:junit4]   2> 11604 T777 oasc.SolrResourceLoader.locateSolrHome JNDI not configured for solr (NoInitialContextEx)
[junit4:junit4]   2> 11604 T777 oasc.SolrResourceLoader.locateSolrHome using system property solr.solr.home: /usr/home/hudson/hudson-slave/workspace/Lucene-Solr-Tests-trunk-Java6/solr/build/solr-core/test/J0/./org.apache.solr.cloud.SyncSliceTest-jetty4-1358476887810
[junit4:junit4]   2> 11604 T777 oasc.CoreContainer$Initializer.initialize looking for solr.xml: /usr/home/hudson/hudson-slave/workspace/Lucene-Solr-Tests-trunk-Java6/solr/build/solr-core/test/J0/./org.apache.solr.cloud.SyncSliceTest-jetty4-1358476887810/solr.xml
[junit4:junit4]   2> 11605 T777 oasc.CoreContainer.<init> New CoreContainer 1846801300
[junit4:junit4]   2> 11605 T777 oasc.CoreContainer.load Loading CoreContainer using Solr Home: '/usr/home/hudson/hudson-slave/workspace/Lucene-Solr-Tests-trunk-Java6/solr/build/solr-core/test/J0/./org.apache.solr.cloud.SyncSliceTest-jetty4-1358476887810/'
[junit4:junit4]   2> 11605 T777 oasc.SolrResourceLoader.<init> new SolrResourceLoader for directory: '/usr/home/hudson/hudson-slave/workspace/Lucene-Solr-Tests-trunk-Java6/solr/build/solr-core/test/J0/./org.apache.solr.cloud.SyncSliceTest-jetty4-1358476887810/'
[junit4:junit4]   2> 11633 T777 oashc.HttpShardHandlerFactory.getParameter Setting socketTimeout to: 60000
[junit4:junit4]   2> 11633 T777 oashc.HttpShardHandlerFactory.getParameter Setting urlScheme to: http://
[junit4:junit4]   2> 11634 T777 oashc.HttpShardHandlerFactory.getParameter Setting connTimeout to: 15000
[junit4:junit4]   2> 11634 T777 oashc.HttpShardHandlerFactory.getParameter Setting maxConnectionsPerHost to: 20
[junit4:junit4]   2> 11634 T777 oashc.HttpShardHandlerFactory.getParameter Setting corePoolSize to: 0
[junit4:junit4]   2> 11634 T777 oashc.HttpShardHandlerFactory.getParameter Setting maximumPoolSize to: 2147483647
[junit4:junit4]   2> 11635 T777 oashc.HttpShardHandlerFactory.getParameter Setting maxThreadIdleTime to: 5
[junit4:junit4]   2> 11635 T777 oashc.HttpShardHandlerFactory.getParameter Setting sizeOfQueue to: -1
[junit4:junit4]   2> 11635 T777 oashc.HttpShardHandlerFactory.getParameter Setting fairnessPolicy to: false
[junit4:junit4]   2> 11635 T777 oascsi.HttpClientUtil.createClient Creating new http client, config:maxConnectionsPerHost=20&maxConnections=10000&socketTimeout=60000&connTimeout=15000&retry=false
[junit4:junit4]   2> 11648 T777 oasc.CoreContainer.load Registering Log Listener
[junit4:junit4]   2> 11660 T777 oasc.CoreContainer.initZooKeeper Zookeeper client=127.0.0.1:65441/solr
[junit4:junit4]   2> 11661 T777 oasc.ZkController.checkChrootPath zkHost includes chroot
[junit4:junit4]   2> 11661 T777 oaz.ZooKeeper.<init> Initiating client connection, connectString=127.0.0.1:65441 sessionTimeout=60000 watcher=org.apache.solr.common.cloud.ConnectionManager@122a90d2
[junit4:junit4]   2> 11662 T777 oascc.ConnectionManager.waitForConnected Waiting for client to connect to ZooKeeper
[junit4:junit4]   2> 11662 T862 oaz.ClientCnxn$SendThread.logStartConnect Opening socket connection to server localhost/127.0.0.1:65441. Will not attempt to authenticate using SASL (access denied (javax.security.auth.AuthPermission getLoginConfiguration))
[junit4:junit4]   2> 11663 T862 oaz.ClientCnxn$SendThread.primeConnection Socket connection established to localhost/127.0.0.1:65441, initiating session
[junit4:junit4]   2> 11663 T779 oazs.NIOServerCnxnFactory.run Accepted socket connection from /140.211.11.196:14085
[junit4:junit4]   2> 11664 T779 oazs.ZooKeeperServer.processConnectRequest Client attempting to establish new session at /140.211.11.196:14085
[junit4:junit4]   2> 11665 T781 oazs.ZooKeeperServer.finishSessionInit Established session 0x13c4b881a23000b with negotiated timeout 20000 for client /140.211.11.196:14085
[junit4:junit4]   2> 11666 T862 oaz.ClientCnxn$SendThread.onConnected Session establishment complete on server localhost/127.0.0.1:65441, sessionid = 0x13c4b881a23000b, negotiated timeout = 20000
[junit4:junit4]   2> 11666 T863 oascc.ConnectionManager.process Watcher org.apache.solr.common.cloud.ConnectionManager@122a90d2 name:ZooKeeperConnection Watcher:127.0.0.1:65441 got event WatchedEvent state:SyncConnected type:None path:null path:null type:None
[junit4:junit4]   2> 11666 T777 oascc.ConnectionManager.waitForConnected Client is connected to ZooKeeper
[junit4:junit4]   2> 11667 T782 oazs.PrepRequestProcessor.pRequest2Txn Processed session termination for sessionid: 0x13c4b881a23000b
[junit4:junit4]   2> 11683 T863 oaz.ClientCnxn$EventThread.run EventThread shut down
[junit4:junit4]   2> 11683 T777 oaz.ZooKeeper.close Session: 0x13c4b881a23000b closed
[junit4:junit4]   2> 11683 T779 oazs.NIOServerCnxn.closeSock Closed socket connection for client /140.211.11.196:14085 which had sessionid 0x13c4b881a23000b
[junit4:junit4]   2> 11683 T777 oascsi.HttpClientUtil.createClient Creating new http client, config:maxConnections=500&maxConnectionsPerHost=16&socketTimeout=60000&connTimeout=15000
[junit4:junit4]   2> 11690 T777 oaz.ZooKeeper.<init> Initiating client connection, connectString=127.0.0.1:65441/solr sessionTimeout=30000 watcher=org.apache.solr.common.cloud.ConnectionManager@3a462d19
[junit4:junit4]   2> 11691 T777 oascc.ConnectionManager.waitForConnected Waiting for client to connect to ZooKeeper
[junit4:junit4]   2> 11691 T864 oaz.ClientCnxn$SendThread.logStartConnect Opening socket connection to server localhost/127.0.0.1:65441. Will not attempt to authenticate using SASL (access denied (javax.security.auth.AuthPermission getLoginConfiguration))
[junit4:junit4]   2> 11692 T864 oaz.ClientCnxn$SendThread.primeConnection Socket connection established to localhost/127.0.0.1:65441, initiating session
[junit4:junit4]   2> 11692 T779 oazs.NIOServerCnxnFactory.run Accepted socket connection from /140.211.11.196:64976
[junit4:junit4]   2> 11692 T779 oazs.ZooKeeperServer.processConnectRequest Client attempting to establish new session at /140.211.11.196:64976
[junit4:junit4]   2> 11693 T781 oazs.ZooKeeperServer.finishSessionInit Established session 0x13c4b881a23000c with negotiated timeout 20000 for client /140.211.11.196:64976
[junit4:junit4]   2> 11694 T864 oaz.ClientCnxn$SendThread.onConnected Session establishment complete on server localhost/127.0.0.1:65441, sessionid = 0x13c4b881a23000c, negotiated timeout = 20000
[junit4:junit4]   2> 11694 T865 oascc.ConnectionManager.process Watcher org.apache.solr.common.cloud.ConnectionManager@3a462d19 name:ZooKeeperConnection Watcher:127.0.0.1:65441/solr got event WatchedEvent state:SyncConnected type:None path:null path:null type:None
[junit4:junit4]   2> 11694 T777 oascc.ConnectionManager.waitForConnected Client is connected to ZooKeeper
[junit4:junit4]   2> 11695 T782 oazs.PrepRequestProcessor.pRequest Got user-level KeeperException when processing sessionid:0x13c4b881a23000c type:create cxid:0x1 zxid:0x91 txntype:-1 reqpath:n/a Error Path:/solr/overseer Error:KeeperErrorCode = NodeExists for /solr/overseer
[junit4:junit4]   2> 11697 T782 oazs.PrepRequestProcessor.pRequest Got user-level KeeperException when processing sessionid:0x13c4b881a23000c type:create cxid:0x2 zxid:0x92 txntype:-1 reqpath:n/a Error Path:/solr/overseer Error:KeeperErrorCode = NodeExists for /solr/overseer
[junit4:junit4]   2> 11707 T777 oasc.ZkController.createEphemeralLiveNode Register node as live in ZooKeeper:/live_nodes/127.0.0.1:22092_krmpo%2Frv
[junit4:junit4]   2> 11708 T782 oazs.PrepRequestProcessor.pRequest Got user-level KeeperException when processing sessionid:0x13c4b881a23000c type:delete cxid:0x4 zxid:0x93 txntype:-1 reqpath:n/a Error Path:/solr/live_nodes/127.0.0.1:22092_krmpo%2Frv Error:KeeperErrorCode = NoNode for /solr/live_nodes/127.0.0.1:22092_krmpo%2Frv
[junit4:junit4]   2> 11709 T777 oascc.SolrZkClient.makePath makePath: /live_nodes/127.0.0.1:22092_krmpo%2Frv
[junit4:junit4]   2> 11719 T849 oascc.ZkStateReader$2.process A cluster state change: WatchedEvent state:SyncConnected type:NodeChildrenChanged path:/live_nodes, has occurred - updating... (live nodes size: 4)
[junit4:junit4]   2> 11719 T818 oascc.ZkStateReader$3.process Updating live nodes... (5)
[junit4:junit4]   2> 11719 T833 oascc.ZkStateReader$3.process Updating live nodes... (5)
[junit4:junit4]   2> 11720 T818 oascc.ZkStateReader$2.process A cluster state change: WatchedEvent state:SyncConnected type:NodeChildrenChanged path:/live_nodes, has occurred - updating... (live nodes size: 5)
[junit4:junit4]   2> 11720 T799 oascc.ZkStateReader$3.process Updating live nodes... (5)
[junit4:junit4]   2> 11720 T833 oascc.ZkStateReader$2.process A cluster state change: WatchedEvent state:SyncConnected type:NodeChildrenChanged path:/live_nodes, has occurred - updating... (live nodes size: 5)
[junit4:junit4]   2> 11720 T799 oascc.ZkStateReader$2.process A cluster state change: WatchedEvent state:SyncConnected type:NodeChildrenChanged path:/live_nodes, has occurred - updating... (live nodes size: 5)
[junit4:junit4]   2> 11720 T805 oascc.ZkStateReader$3.process Updating live nodes... (5)
[junit4:junit4]   2> 11721 T805 oascc.ZkStateReader$2.process A cluster state change: WatchedEvent state:SyncConnected type:NodeChildrenChanged path:/live_nodes, has occurred - updating... (live nodes size: 5)
[junit4:junit4]   2> 11722 T849 oascc.ZkStateReader$3.process Updating live nodes... (5)
[junit4:junit4]   2> 11724 T777 oascc.ZkStateReader.createClusterStateWatchersAndUpdate Updating cluster state from ZooKeeper... 
[junit4:junit4]   2> 11729 T866 oasc.CoreContainer.create Creating SolrCore 'collection1' using instanceDir: /usr/home/hudson/hudson-slave/workspace/Lucene-Solr-Tests-trunk-Java6/solr/build/solr-core/test/J0/./org.apache.solr.cloud.SyncSliceTest-jetty4-1358476887810/collection1
[junit4:junit4]   2> 11729 T866 oasc.ZkController.createCollectionZkNode Check for collection zkNode:collection1
[junit4:junit4]   2> 11730 T866 oasc.ZkController.createCollectionZkNode Collection zkNode exists
[junit4:junit4]   2> 11730 T866 oasc.ZkController.readConfigName Load collection config from:/collections/collection1
[junit4:junit4]   2> 11731 T866 oasc.SolrResourceLoader.<init> new SolrResourceLoader for directory: '/usr/home/hudson/hudson-slave/workspace/Lucene-Solr-Tests-trunk-Java6/solr/build/solr-core/test/J0/./org.apache.solr.cloud.SyncSliceTest-jetty4-1358476887810/collection1/'
[junit4:junit4]   2> 11732 T866 oasc.SolrResourceLoader.replaceClassLoader Adding 'file:/usr/home/hudson/hudson-slave/workspace/Lucene-Solr-Tests-trunk-Java6/solr/build/solr-core/test/J0/org.apache.solr.cloud.SyncSliceTest-jetty4-1358476887810/collection1/lib/README' to classloader
[junit4:junit4]   2> 11733 T866 oasc.SolrResourceLoader.replaceClassLoader Adding 'file:/usr/home/hudson/hudson-slave/workspace/Lucene-Solr-Tests-trunk-Java6/solr/build/solr-core/test/J0/org.apache.solr.cloud.SyncSliceTest-jetty4-1358476887810/collection1/lib/classes/' to classloader
[junit4:junit4]   2> 11783 T866 oasc.SolrConfig.<init> Using Lucene MatchVersion: LUCENE_50
[junit4:junit4]   2> 11853 T866 oasc.SolrConfig.<init> Loaded SolrConfig: solrconfig.xml
[junit4:junit4]   2> 11954 T866 oass.IndexSchema.readSchema Reading Solr Schema
[junit4:junit4]   2> 11960 T866 oass.IndexSchema.readSchema Schema name=test
[junit4:junit4]   2>  C42_STATE=coll:collection1 core:collection1 props:{shard=shard1, roles=null, state=recovering, core=collection1, collection=collection1, node_name=127.0.0.1:48990_krmpo%2Frv, base_url=http://127.0.0.1:48990/krmpo/rv}
[junit4:junit4]   2> 12204 T836 C42 P48990 oasc.RecoveryStrategy.doRecovery Attempting to PeerSync from http://127.0.0.1:50527/krmpo/rv/collection1/ core=collection1 - recoveringAfterStartup=true
[junit4:junit4]   2> 12214 T836 C42 P48990 oascsi.HttpClientUtil.createClient Creating new http client, config:maxConnectionsPerHost=20&maxConnections=10000&connTimeout=30000&socketTimeout=30000&retry=false
[junit4:junit4]   2> 12231 T836 C42 P48990 oasu.PeerSync.sync PeerSync: core=collection1 url=http://127.0.0.1:48990/krmpo/rv START replicas=[http://127.0.0.1:50527/krmpo/rv/collection1/] nUpdates=100
[junit4:junit4]   2> 12232 T836 C42 P48990 oasu.PeerSync.sync WARNING no frame of reference to tell of we've missed updates
[junit4:junit4]   2> 12232 T836 C42 P48990 oasc.RecoveryStrategy.doRecovery PeerSync Recovery was not successful - trying replication. core=collection1
[junit4:junit4]   2> 12233 T836 C42 P48990 oasc.RecoveryStrategy.doRecovery Starting Replication Recovery. core=collection1
[junit4:junit4]   2> 12233 T836 C42 P48990 oasc.RecoveryStrategy.doRecovery Begin buffering updates. core=collection1
[junit4:junit4]   2> 12233 T836 C42 P48990 oasu.UpdateLog.bufferUpdates Starting to buffer updates. FSUpdateLog{state=ACTIVE, tlog=null}
[junit4:junit4]   2> 12233 T836 C42 P48990 oasc.RecoveryStrategy.replicate Attempting to replicate from http://127.0.0.1:50527/krmpo/rv/collection1/. core=collection1
[junit4:junit4]   2> 12233 T836 C42 P48990 oascsi.HttpClientUtil.createClient Creating new http client, config:maxConnections=128&maxConnectionsPerHost=32&followRedirects=false
[junit4:junit4]   2> ASYNC  NEW_CORE C44 name=collection1 org.apache.solr.core.SolrCore@c28c75 url=http://127.0.0.1:50527/krmpo/rv/collection1 node=127.0.0.1:50527_krmpo%2Frv C44_STATE=coll:collection1 core:collection1 props:{shard=shard1, roles=null, state=active, core=collection1, collection=collection1, node_name=127.0.0.1:50527_krmpo%2Frv, base_url=http://127.0.0.1:50527/krmpo/rv, leader=true}
[junit4:junit4]   2> 12241 T810 C44 P50527 REQ /get {getVersions=100&distrib=false&wt=javabin&qt=/get&version=2} status=0 QTime=0 
[junit4:junit4]   2> 12245 T811 C44 P50527 oasu.DirectUpdateHandler2.commit start commit{,optimize=false,openSearcher=false,waitSearcher=true,expungeDeletes=false,softCommit=false}
[junit4:junit4]   2> 12246 T811 C44 P50527 oasc.CachingDirectoryFactory.close Releasing directory:/usr/home/hudson/hudson-slave/workspace/Lucene-Solr-Tests-trunk-Java6/solr/build/solr-core/test/J0/./org.apache.solr.cloud.SyncSliceTest-1358476876318/jetty1
[junit4:junit4]   2> 12250 T811 C44 P50527 oasc.SolrDeletionPolicy.onInit SolrDeletionPolicy.onInit: commits:num=1
[junit4:junit4]   2> 		commit{dir=RateLimitedDirectoryWrapper(org.apache.lucene.store.NIOFSDirectory@/usr/home/hudson/hudson-slave/workspace/Lucene-Solr-Tests-trunk-Java6/solr/build/solr-core/test/J0/org.apache.solr.cloud.SyncSliceTest-1358476876318/jetty1/index lockFactory=org.apache.lucene.store.NativeFSLockFactory@237dabb0),segFN=segments_1,generation=1,filenames=[segments_1]
[junit4:junit4]   2> 12250 T811 C44 P50527 oasc.SolrDeletionPolicy.updateCommits newest commit = 1[segments_1]
[junit4:junit4]   2> 12254 T811 C44 P50527 oasc.SolrDeletionPolicy.onCommit SolrDeletionPolicy.onCommit: commits:num=2
[junit4:junit4]   2> 		commit{dir=RateLimitedDirectoryWrapper(org.apache.lucene.store.NIOFSDirectory@/usr/home/hudson/hudson-slave/workspace/Lucene-Solr-Tests-trunk-Java6/solr/build/solr-core/test/J0/org.apache.solr.cloud.SyncSliceTest-1358476876318/jetty1/index lockFactory=org.apache.lucene.store.NativeFSLockFactory@237dabb0),segFN=segments_1,generation=1,filenames=[segments_1]
[junit4:junit4]   2> 		commit{dir=RateLimitedDirectoryWrapper(org.apache.lucene.store.NIOFSDirectory@/usr/home/hudson/hudson-slave/workspace/Lucene-Solr-Tests-trunk-Java6/solr/build/solr-core/test/J0/org.apache.solr.cloud.SyncSliceTest-1358476876318/jetty1/index lockFactory=org.apache.lucene.store.NativeFSLockFactory@237dabb0),segFN=segments_2,generation=2,filenames=[segments_2]
[junit4:junit4]   2> 12254 T811 C44 P50527 oasc.SolrDeletionPolicy.updateCommits newest commit = 2[segments_2]
[junit4:junit4]   2> 12256 T811 C44 P50527 oasc.CachingDirectoryFactory.close Releasing directory:/usr/home/hudson/hudson-slave/workspace/Lucene-Solr-Tests-trunk-Java6/solr/build/solr-core/test/J0/./org.apache.solr.cloud.SyncSliceTest-1358476876318/jetty1
[junit4:junit4]   2> 12256 T811 C44 P50527 oass.SolrIndexSearcher.<init> Opening Searcher@5276be0c realtime
[junit4:junit4]   2> 12256 T811 C44 P50527 oasu.DirectUpdateHandler2.commit end_commit_flush
[junit4:junit4]   2> 12257 T811 C44 P50527 /update {waitSearcher=true&openSearcher=false&commit=true&wt=javabin&commit_end_point=true&version=2&softCommit=false} {commit=} 0 12
[junit4:junit4]   2> 12318 T836 C42 P48990 oash.ReplicationHandler.inform Commits will be reserved for  10000
[junit4:junit4]   2> 12318 T836 C42 P48990 oascsi.HttpClientUtil.createClient Creating new http client, config:connTimeout=5000&socketTimeout=20000&allowCompression=false&maxConnections=10000&maxConnectionsPerHost=10000
[junit4:junit4]   2> 12344 T836 C42 P48990 oash.SnapPuller.<init>  No value set for 'pollInterval'. Timer Task not started.
[junit4:junit4]   2> 12347 T812 C44 P50527 oash.ReplicationHandler.inform Commits will be reserved for  10000
[junit4:junit4]   2> 12348 T812 C44 P50527 REQ /replication {command=indexversion&qt=/replication&wt=javabin&version=2} status=0 QTime=2 
[junit4:junit4]   2> 12349 T836 C42 P48990 oash.SnapPuller.fetchLatestIndex Master's generation: 2
[junit4:junit4]   2> 12350 T836 C42 P48990 oash.SnapPuller.fetchLatestIndex Slave's generation: 1
[junit4:junit4]   2> 12350 T836 C42 P48990 oash.SnapPuller.fetchLatestIndex Starting replication process
[junit4:junit4]   2> 12353 T812 C44 P50527 oasc.CachingDirectoryFactory.close Releasing directory:/usr/home/hudson/hudson-slave/workspace/Lucene-Solr-Tests-trunk-Java6/solr/build/solr-core/test/J0/./org.apache.solr.cloud.SyncSliceTest-1358476876318/jetty1
[junit4:junit4]   2> 12353 T812 C44 P50527 oasc.CachingDirectoryFactory.close Releasing directory:/usr/home/hudson/hudson-slave/workspace/Lucene-Solr-Tests-trunk-Java6/solr/build/solr-core/test/J0/./org.apache.solr.cloud.SyncSliceTest-1358476876318/jetty1/index
[junit4:junit4]   2> 12354 T812 C44 P50527 REQ /replication {command=filelist&qt=/replication&wt=javabin&generation=2&version=2} status=0 QTime=2 
[junit4:junit4]   2> 12355 T836 C42 P48990 oash.SnapPuller.fetchLatestIndex Number of files in latest index in master: 1
[junit4:junit4]   2> 12356 T836 C42 P48990 oasc.CachingDirectoryFactory.get return new directory for /usr/home/hudson/hudson-slave/workspace/Lucene-Solr-Tests-trunk-Java6/solr/build/solr-core/test/J0/./org.apache.solr.cloud.SyncSliceTest-1358476876318/jetty2/index.20130118004128670 forceNew:false
[junit4:junit4]   2> 12357 T836 C42 P48990 oasc.CachingDirectoryFactory.close Releasing directory:/usr/home/hudson/hudson-slave/workspace/Lucene-Solr-Tests-trunk-Java6/solr/build/solr-core/test/J0/./org.apache.solr.cloud.SyncSliceTest-1358476876318/jetty2
[junit4:junit4]   2> 12357 T836 C42 P48990 oash.SnapPuller.fetchLatestIndex Starting download to RateLimitedDirectoryWrapper(org.apache.lucene.store.NIOFSDirectory@/usr/home/hudson/hudson-slave/workspace/Lucene-Solr-Tests-trunk-Java6/solr/build/solr-core/test/J0/org.apache.solr.cloud.SyncSliceTest-1358476876318/jetty2/index.20130118004128670 lockFactory=org.apache.lucene.store.NativeFSLockFactory@2281d198) fullCopy=true
[junit4:junit4]   2> 12372 T812 C44 P50527 REQ /replication {file=segments_2&command=filecontent&checksum=true&wt=filestream&qt=/replication&generation=2} status=0 QTime=6 
[junit4:junit4]   2> 12376 T836 C42 P48990 oasc.CachingDirectoryFactory.close Releasing directory:/usr/home/hudson/hudson-slave/workspace/Lucene-Solr-Tests-trunk-Java6/solr/build/solr-core/test/J0/./org.apache.solr.cloud.SyncSliceTest-1358476876318/jetty2/index
[junit4:junit4]   2> 12377 T836 C42 P48990 oash.SnapPuller.fetchLatestIndex Total time taken for download : 0 secs
[junit4:junit4]   2> 12377 T836 C42 P48990 oash.SnapPuller.modifyIndexProps New index installed. Updating index properties... index=index.20130118004128670
[junit4:junit4]   2> 12379 T836 C42 P48990 oasc.CachingDirectoryFactory.close Releasing directory:/usr/home/hudson/hudson-slave/workspace/Lucene-Solr-Tests-trunk-Java6/solr/build/solr-core/test/J0/./org.apache.solr.cloud.SyncSliceTest-1358476876318/jetty2
[junit4:junit4]   2> 12380 T836 C42 P48990 oasc.CachingDirectoryFactory.close Releasing directory:/usr/home/hudson/hudson-slave/workspace/Lucene-Solr-Tests-trunk-Java6/solr/build/solr-core/test/J0/./org.apache.solr.cloud.SyncSliceTest-1358476876318/jetty2
[junit4:junit4]   2> 12380 T836 C42 P48990 oasc.SolrCore.getNewIndexDir New index directory detected: old=./org.apache.solr.cloud.SyncSliceTest-1358476876318/jetty2/index/ new=./org.apache.solr.cloud.SyncSliceTest-1358476876318/jetty2/index.20130118004128670
[junit4:junit4]   2> 12383 T836 C42 P48990 oasc.SolrDeletionPolicy.onInit SolrDeletionPolicy.onInit: commits:num=1
[junit4:junit4]   2> 		commit{dir=RateLimitedDirectoryWrapper(org.apache.lucene.store.NIOFSDirectory@/usr/home/hudson/hudson-slave/workspace/Lucene-Solr-Tests-trunk-Java6/solr/build/solr-core/test/J0/org.apache.solr.cloud.SyncSliceTest-1358476876318/jetty2/index.20130118004128670 lockFactory=org.apache.lucene.store.NativeFSLockFactory@2281d198),segFN=segments_2,generation=2,filenames=[segments_2]
[junit4:junit4]   2> 12383 T836 C42 P48990 oasc.SolrDeletionPolicy.updateCommits newest commit = 2[segments_2]
[junit4:junit4]   2> 12385 T836 C42 P48990 oasc.CachingDirectoryFactory.close Releasing directory:/usr/home/hudson/hudson-slave/workspace/Lucene-Solr-Tests-trunk-Java6/solr/build/solr-core/test/J0/./org.apache.solr.cloud.SyncSliceTest-1358476876318/jetty2
[junit4:junit4]   2> 12388 T836 C42 P48990 oasu.DefaultSolrCoreState.newIndexWriter Creating new IndexWriter...
[junit4:junit4]   2> 12388 T836 C42 P48990 oasu.DefaultSolrCoreState.newIndexWriter Waiting until IndexWriter is unused... core=collection1
[junit4:junit4]   2> 12388 T836 C42 P48990 oasu.DefaultSolrCoreState.newIndexWriter Rollback old IndexWriter... core=collection1
[junit4:junit4]   2> 12389 T836 C42 P48990 oasc.CachingDirectoryFactory.close Releasing directory:/usr/home/hudson/hudson-slave/workspace/Lucene-Solr-Tests-trunk-Java6/solr/build/solr-core/test/J0/./org.apache.solr.cloud.SyncSliceTest-1358476876318/jetty2/index.20130118004128670
[junit4:junit4]   2> 12389 T836 C42 P48990 oasc.CachingDirectoryFactory.close Releasing directory:/usr/home/hudson/hudson-slave/workspace/Lucene-Solr-Tests-trunk-Java6/solr/build/solr-core/test/J0/./org.apache.solr.cloud.SyncSliceTest-1358476876318/jetty2
[junit4:junit4]   2> 12394 T836 C42 P48990 oasc.SolrDeletionPolicy.onInit SolrDeletionPolicy.onInit: commits:num=1
[junit4:junit4]   2> 		commit{dir=RateLimitedDirectoryWrapper(org.apache.lucene.store.NIOFSDirectory@/usr/home/hudson/hudson-slave/workspace/Lucene-Solr-Tests-trunk-Java6/solr/build/solr-core/test/J0/org.apache.solr.cloud.SyncSliceTest-1358476876318/jetty2/index.20130118004128670 lockFactory=org.apache.lucene.store.NativeFSLockFactory@2281d198),segFN=segments_2,generation=2,filenames=[segments_2]
[junit4:junit4]   2> 12394 T836 C42 P48990 oasc.SolrDeletionPolicy.updateCommits newest commit = 2[segments_2]
[junit4:junit4]   2> 12394 T836 C42 P48990 oasu.DefaultSolrCoreState.newIndexWriter New IndexWriter is ready to be used.
[junit4:junit4]   2> 12395 T836 C42 P48990 oasc.CachingDirectoryFactory.close Releasing directory:/usr/home/hudson/hudson-slave/workspace/Lucene-Solr-Tests-trunk-Java6/solr/build/solr-core/test/J0/./org.apache.solr.cloud.SyncSliceTest-1358476876318/jetty2
[junit4:junit4]   2> 12395 T836 C42 P48990 oass.SolrIndexSearcher.<init> Opening Searcher@39d27bef main
[junit4:junit4]   2> 12398 T835 oasc.SolrCore.registerSearcher [collection1] Registered new searcher Searcher@39d27bef main{StandardDirectoryReader(segments_2:1:nrt)}
[junit4:junit4]   2> 12399 T835 oasc.CachingDirectoryFactory.close Releasing directory:/usr/home/hudson/hudson-slave/workspace/Lucene-Solr-Tests-trunk-Java6/solr/build/solr-core/test/J0/./org.apache.solr.cloud.SyncSliceTest-1358476876318/jetty2/index
[junit4:junit4]   2> 12399 T836 C42 P48990 oasu.DirectUpdateHandler2.commit start commit{,optimize=false,openSearcher=false,waitSearcher=false,expungeDeletes=false,softCommit=false}
[junit4:junit4]   2> 12402 T836 C42 P48990 oasc.SolrDeletionPolicy.onCommit SolrDeletionPolicy.onCommit: commits:num=2
[junit4:junit4]   2> 		commit{dir=RateLimitedDirectoryWrapper(org.apache.lucene.store.NIOFSDirectory@/usr/home/hudson/hudson-slave/workspace/Lucene-Solr-Tests-trunk-Java6/solr/build/solr-core/test/J0/org.apache.solr.cloud.SyncSliceTest-1358476876318/jetty2/index.20130118004128670 lockFactory=org.apache.lucene.store.NativeFSLockFactory@2281d198),segFN=segments_2,generation=2,filenames=[segments_2]
[junit4:junit4]   2> 		commit{dir=RateLimitedDirectoryWrapper(org.apache.lucene.store.NIOFSDirectory@/usr/home/hudson/hudson-slave/workspace/Lucene-Solr-Tests-trunk-Java6/solr/build/solr-core/test/J0/org.apache.solr.cloud.SyncSliceTest-1358476876318/jetty2/index.20130118004128670 lockFactory=org.apache.lucene.store.NativeFSLockFactory@2281d198),segFN=segments_3,generation=3,filenames=[segments_3]
[junit4:junit4]   2> 12402 T836 C42 P48990 oasc.SolrDeletionPolicy.updateCommits newest commit = 3[segments_3]
[junit4:junit4]   2> 12403 T836 C42 P48990 oasc.CachingDirectoryFactory.close Releasing directory:/usr/home/hudson/hudson-slave/workspace/Lucene-Solr-Tests-trunk-Java6/solr/build/solr-core/test/J0/./org.apache.solr.cloud.SyncSliceTest-1358476876318/jetty2
[junit4:junit4]   2> 12403 T836 C42 P48990 oasu.DirectUpdateHandler2.commit end_commit_flush
[junit4:junit4]   2> 12403 T836 C42 P48990 oasc.CachingDirectoryFactory.close Releasing directory:/usr/home/hudson/hudson-slave/workspace/Lucene-Solr-Tests-trunk-Java6/solr/build/solr-core/test/J0/./org.apache.solr.cloud.SyncSliceTest-1358476876318/jetty2/index.20130118004128670
[junit4:junit4]   2> 12403 T836 C42 P48990 oasc.CachingDirectoryFactory.close Releasing directory:/usr/home/hudson/hudson-slave/workspace/Lucene-Solr-Tests-trunk-Java6/solr/build/solr-core/test/J0/./org.apache.solr.cloud.SyncSliceTest-1358476876318/jetty2/index
[junit4:junit4]   2> 12403 T836 C42 P48990 oasc.RecoveryStrategy.replay No replay needed. core=collection1
[junit4:junit4]   2> 12403 T836 C42 P48990 oasc.RecoveryStrategy.doRecovery Replication Recovery was successful - registering as Active. core=collection1
[junit4:junit4]   2> 12403 T836 C42 P48990 oasc.ZkController.publish publishing core=collection1 state=active
[junit4:junit4]   2> 12403 T836 C42 P48990 oasc.ZkController.publish numShards not found on descriptor - reading it from system property
[junit4:junit4]   2> 12406 T836 C42 P48990 oasc.RecoveryStrategy.doRecovery Finished recovery process. core=collection1
[junit4:junit4]   2> 12659 T866 oass.OpenExchangeRatesOrgProvider.init Initialized with rates=open-exchange-rates.json, refreshInterval=1440.
[junit4:junit4]   2> 12670 T866 oass.IndexSchema.readSchema default search field in schema is text
[junit4:junit4]   2> 12674 T866 oass.IndexSchema.readSchema unique key field: id
[junit4:junit4]   2> 12692 T866 oass.FileExchangeRateProvider.reload Reloading exchange rates from file currency.xml
[junit4:junit4]   2> 12703 T866 oass.FileExchangeRateProvider.reload Reloading exchange rates from file currency.xml
[junit4:junit4]   2> 12708 T866 oass.OpenExchangeRatesOrgProvider.reload Reloading exchange rates from open-exchange-rates.json
[junit4:junit4]   2> 12710 T866 oass.OpenExchangeRatesOrgProvider.reload Reloading exchange rates from open-exchange-rates.json
[junit4:junit4]   2> 12712 T866 oasc.SolrCore.<init> [collection1] Opening new SolrCore at /usr/home/hudson/hudson-slave/workspace/Lucene-Solr-Tests-trunk-Java6/solr/build/solr-core/test/J0/./org.apache.solr.cloud.SyncSliceTest-jetty4-1358476887810/collection1/, dataDir=./org.apache.solr.cloud.SyncSliceTest-1358476876318/jetty4/
[junit4:junit4]   2> 12712 T866 oasc.JmxMonitoredMap.<init> JMX monitoring is enabled. Adding Solr mbeans to JMX Server: com.sun.jmx.mbeanserver.JmxMBeanServer@9818f80
[junit4:junit4]   2> 12712 T866 oasc.SolrCore.initDirectoryFactory solr.StandardDirectoryFactory
[junit4:junit4]   2> 12713 T866 oasc.CachingDirectoryFactory.get return new directory for /usr/home/hudson/hudson-slave/workspace/Lucene-Solr-Tests-trunk-Java6/solr/build/solr-core/test/J0/./org.apache.solr.cloud.SyncSliceTest-1358476876318/jetty4 forceNew:false
[junit4:junit4]   2> 12714 T866 oasc.CachingDirectoryFactory.close Releasing directory:/usr/home/hudson/hudson-slave/workspace/Lucene-Solr-Tests-trunk-Java6/solr/build/solr-core/test/J0/./org.apache.solr.cloud.SyncSliceTest-1358476876318/jetty4
[junit4:junit4]   2> 12714 T866 oasc.SolrCore.getNewIndexDir New index directory detected: old=null new=./org.apache.solr.cloud.SyncSliceTest-1358476876318/jetty4/index/
[junit4:junit4]   2> 12715 T866 oasc.SolrCore.initIndex WARNING [collection1] Solr index directory './org.apache.solr.cloud.SyncSliceTest-1358476876318/jetty4/index' doesn't exist. Creating new index...
[junit4:junit4]   2> 12716 T866 oasc.CachingDirectoryFactory.get return new directory for /usr/home/hudson/hudson-slave/workspace/Lucene-Solr-Tests-trunk-Java6/solr/build/solr-core/test/J0/./org.apache.solr.cloud.SyncSliceTest-1358476876318/jetty4/index forceNew:false
[junit4:junit4]   2> 12733 T866 oasc.SolrDeletionPolicy.onCommit SolrDeletionPolicy.onCommit: commits:num=1
[junit4:junit4]   2> 		commit{dir=RateLimitedDirectoryWrapper(org.apache.lucene.store.NIOFSDirectory@/usr/home/hudson/hudson-slave/workspace/Lucene-Solr-Tests-trunk-Java6/solr/build/solr-core/test/J0/org.apache.solr.cloud.SyncSliceTest-1358476876318/jetty4/index lockFactory=org.apache.lucene.store.NativeFSLockFactory@5bfb96c2),segFN=segments_1,generation=1,filenames=[segments_1]
[junit4:junit4]   2> 12734 T866 oasc.SolrDeletionPolicy.updateCommits newest commit = 1[segments_1]
[junit4:junit4]   2> 12734 T866 oasc.CachingDirectoryFactory.close Releasing directory:/usr/home/hudson/hudson-slave/workspace/Lucene-Solr-Tests-trunk-Java6/solr/build/solr-core/test/J0/./org.apache.solr.cloud.SyncSliceTest-1358476876318/jetty4/index
[junit4:junit4]   2> 12735 T866 oasc.SolrCore.initWriters created xml: solr.XMLResponseWriter
[junit4:junit4]   2> 12737 T866 oasup.UpdateRequestProcessorChain.init inserting DistributedUpdateProcessorFactory into updateRequestProcessorChain "dedupe"
[junit4:junit4]   2> 12737 T866 oasup.UpdateRequestProcessorChain.init inserting DistributedUpdateProcessorFactory into updateRequestProcessorChain "dedupe-allfields"
[junit4:junit4]   2> 12738 T866 oasup.UpdateRequestProcessorChain.init inserting DistributedUpdateProcessorFactory into updateRequestProcessorChain "stored_sig"
[junit4:junit4]   2> 12738 T866 oasup.UpdateRequestProcessorChain.init inserting DistributedUpdateProcessorFactory into updateRequestProcessorChain "uniq-fields"
[junit4:junit4]   2> 12739 T866 oasup.UpdateRequestProcessorChain.init inserting DistributedUpdateProcessorFactory into updateRequestProcessorChain "distrib-dup-test-chain-implicit"
[junit4:junit4]   2> 12739 T866 oasc.RequestHandlers.initHandlersFromConfig adding lazy requestHandler: solr.ReplicationHandler
[junit4:junit4]   2> 12739 T866 oasc.RequestHandlers.initHandlersFromConfig created /replication: solr.ReplicationHandler
[junit4:junit4]   2> 12740 T866 oasc.RequestHandlers.initHandlersFromConfig created standard: solr.StandardRequestHandler
[junit4:junit4]   2> 12740 T866 oasc.RequestHandlers.initHandlersFromConfig created /get: solr.RealTimeGetHandler
[junit4:junit4]   2> 12741 T866 oasc.RequestHandlers.initHandlersFromConfig created dismax: solr.SearchHandler
[junit4:junit4]   2> 12741 T866 oasc.RequestHandlers.initHandlersFromConfig created mock: org.apache.solr.core.MockQuerySenderListenerReqHandler
[junit4:junit4]   2> 12742 T866 oasc.RequestHandlers.initHandlersFromConfig created /admin/: org.apache.solr.handler.admin.AdminHandlers
[junit4:junit4]   2> 12742 T866 oasc.RequestHandlers.initHandlersFromConfig created defaults: solr.StandardRequestHandler
[junit4:junit4]   2> 12743 T866 oasc.RequestHandlers.initHandlersFromConfig adding lazy requestHandler: solr.StandardRequestHandler
[junit4:junit4]   2> 12743 T866 oasc.RequestHandlers.initHandlersFromConfig created lazy: solr.StandardRequestHandler
[junit4:junit4]   2> 12743 T866 oasc.RequestHandlers.initHandlersFromConfig created /update: solr.UpdateRequestHandler
[junit4:junit4]   2> 12744 T866 oasc.RequestHandlers.initHandlersFromConfig created /terms: org.apache.solr.handler.component.SearchHandler
[junit4:junit4]   2> 12744 T866 oasc.RequestHandlers.initHandlersFromConfig created spellCheckCompRH: org.apache.solr.handler.component.SearchHandler
[junit4:junit4]   2> 12745 T866 oasc.RequestHandlers.initHandlersFromConfig created spellCheckCompRH_Direct: org.apache.solr.handler.component.SearchHandler
[junit4:junit4]   2> 12746 T866 oasc.RequestHandlers.initHandlersFromConfig created spellCheckWithWordbreak: org.apache.solr.handler.component.SearchHandler
[junit4:junit4]   2> 12746 T866 oasc.RequestHandlers.initHandlersFromConfig created spellCheckWithWordbreak_Direct: org.apache.solr.handler.component.SearchHandler
[junit4:junit4]   2> 12747 T866 oasc.RequestHandlers.initHandlersFromConfig created spellCheckCompRH1: org.apache.solr.handler.component.SearchHandler
[junit4:junit4]   2> 12747 T866 oasc.RequestHandlers.initHandlersFromConfig created mltrh: org.apache.solr.handler.component.SearchHandler
[junit4:junit4]   2> 12748 T866 oasc.RequestHandlers.initHandlersFromConfig created tvrh: org.apache.solr.handler.component.SearchHandler
[junit4:junit4]   2> 12748 T866 oasc.RequestHandlers.initHandlersFromConfig created /mlt: solr.MoreLikeThisHandler
[junit4:junit4]   2> 12749 T866 oasc.RequestHandlers.initHandlersFromConfig created /debug/dump: solr.DumpRequestHandler
[junit4:junit4]   2> 12756 T866 oashl.XMLLoader.init xsltCacheLifetimeSeconds=60
[junit4:junit4]   2> 12763 T866 oasc.SolrCore.initDeprecatedSupport WARNING solrconfig.xml uses deprecated <admin/gettableFiles>, Please update your config to use the ShowFileRequestHandler.
[junit4:junit4]   2> 12765 T866 oasc.SolrCore.initDeprecatedSupport WARNING adding ShowFileRequestHandler with hidden files: [SCHEMA.XML, OLD_SYNONYMS.TXT, STOPWORDS.TXT, PROTWORDS.TXT, OPEN-EXCHANGE-RATES.JSON, SYNONYMS.TXT, CURRENCY.XML, MAPPING-ISOLATIN1ACCENT.TXT]
[junit4:junit4]   2> 12767 T866 oasc.CachingDirectoryFactory.close Releasing directory:/usr/home/hudson/hudson-slave/workspace/Lucene-Solr-Tests-trunk-Java6/solr/build/solr-core/test/J0/./org.apache.solr.cloud.SyncSliceTest-1358476876318/jetty4
[junit4:junit4]   2> 12769 T866 oass.SolrIndexSearcher.<init> Opening Searcher@6da0e758 main
[junit4:junit4]   2> 12770 T866 oasu.CommitTracker.<init> Hard AutoCommit: disabled
[junit4:junit4]   2> 12771 T866 oasu.CommitTracker.<init> Soft AutoCommit: disabled
[junit4:junit4]   2> 12771 T866 oashc.SpellCheckComponent.inform Initializing spell checkers
[junit4:junit4]   2> 12779 T800 oascc.ZkStateReader.updateClusterState Updating cloud state from ZooKeeper... 
[junit4:junit4]   2> 12779 T866 oass.DirectSolrSpellChecker.init init: {name=direct,classname=DirectSolrSpellChecker,field=lowerfilt,minQueryLength=3}
[junit4:junit4]   2> 12780 T800 oasc.Overseer$ClusterStateUpdater.updateState Update state numShards=1 message={
[junit4:junit4]   2> 	  "operation":"state",
[junit4:junit4]   2> 	  "numShards":"1",
[junit4:junit4]   2> 	  "shard":"shard1",
[junit4:junit4]   2> 	  "roles":null,
[junit4:junit4]   2> 	  "state":"recovering",
[junit4:junit4]   2> 	  "core":"collection1",
[junit4:junit4]   2> 	  "collection":"collection1",
[junit4:junit4]   2> 	  "node_name":"127.0.0.1:59838_krmpo%2Frv",
[junit4:junit4]   2> 	  "base_url":"http://127.0.0.1:59838/krmpo/rv"}
[junit4:junit4]   2> 12791 T800 oasc.Overseer$ClusterStateUpdater.updateState Update state numShards=1 message={
[junit4:junit4]   2> 	  "operation":"state",
[junit4:junit4]   2> 	  "numShards":"1",
[junit4:junit4]   2> 	  "shard":"shard1",
[junit4:junit4]   2> 	  "roles":null,
[junit4:junit4]   2> 	  "state":"active",
[junit4:junit4]   2> 	  "core":"collection1",
[junit4:junit4]   2> 	  "collection":"collection1",
[junit4:junit4]   2> 	  "node_name":"127.0.0.1:48990_krmpo%2Frv",
[junit4:junit4]   2> 	  "base_url":"http://127.0.0.1:48990/krmpo/rv"}
[junit4:junit4]   2> 12818 T799 oascc.ZkStateReader$2.process A cluster state change: WatchedEvent state:SyncConnected type:NodeDataChanged path:/clusterstate.json, has occurred - updating... (live nodes size: 5)
[junit4:junit4]   2> 12818 T865 oascc.ZkStateReader$2.process A cluster state change: WatchedEvent state:SyncConnected type:NodeDataChanged path:/clusterstate.json, has occurred - updating... (live nodes size: 5)
[junit4:junit4]   2> 12818 T849 oascc.ZkStateReader$2.process A cluster state change: WatchedEvent state:SyncConnected type:NodeDataChanged path:/clusterstate.json, has occurred - updating... (live nodes size: 5)
[junit4:junit4]   2> 12818 T833 oascc.ZkStateReader$2.process A cluster state change: WatchedEvent state:SyncConnected type:NodeDataChanged path:/clusterstate.json, has occurred - updating... (live nodes size: 5)
[junit4:junit4]   2> 12818 T805 oascc.ZkStateReader$2.process A cluster state change: WatchedEvent state:SyncConnected type:NodeDataChanged path:/clusterstate.json, has occurred - updating... (live nodes size: 5)
[junit4:junit4]   2> 12818 T818 oascc.ZkStateReader$2.process A cluster state change: WatchedEvent state:SyncConnected type:NodeDataChanged path:/clusterstate.json, has occurred - updating... (live nodes size: 5)
[junit4:junit4]   2> 12873 T869 oasc.SolrCore.registerSearcher [collection1] Registered new searcher Searcher@6da0e758 main{StandardDirectoryReader(segments_1:1)}
[junit4:junit4]   2> 12876 T866 oasc.ZkController.publish publishing core=collection1 state=down
[junit4:junit4]   2> 12876 T866 oasc.ZkController.publish numShards not found on descriptor - reading it from system property
[junit4:junit4]   2> 14332 T800 oascc.ZkStateReader.updateClusterState Updating cloud state from ZooKeeper... 
[junit4:junit4]   2> 14333 T800 oasc.Overseer$ClusterStateUpdater.updateState Update state numShards=1 message={
[junit4:junit4]   2> 	  "operation":"state",
[junit4:junit4]   2> 	  "numShards":"1",
[junit4:junit4]   2> 	  "shard":null,
[junit4:junit4]   2> 	  "roles":null,
[junit4:junit4]   2> 	  "state":"down",
[junit4:junit4]   2> 	  "core":"collection1",
[junit4:junit4]   2> 	  "collection":"collection1",
[junit4:junit4]   2> 	  "node_name":"127.0.0.1:22092_krmpo%2Frv",
[junit4:junit4]   2> 	  "base_url":"http://127.0.0.1:22092/krmpo/rv"}
[junit4:junit4]   2> 14333 T800 oasc.Overseer$ClusterStateUpdater.updateState Collection already exists with numShards=1
[junit4:junit4]   2> 14333 T800 oasc.Overseer$ClusterStateUpdater.updateState Assigning new node to shard shard=shard1
[junit4:junit4]   2> 14406 T865 oascc.ZkStateReader$2.process A cluster state change: WatchedEvent state:SyncConnected type:NodeDataChanged path:/clusterstate.json, has occurred - updating... (live nodes size: 5)
[junit4:junit4]   2> 14406 T833 oascc.ZkStateReader$2.process A cluster state change: WatchedEvent state:SyncConnected type:NodeDataChanged path:/clusterstate.json, has occurred - updating... (live nodes size: 5)
[junit4:junit4]   2> 14406 T849 oascc.ZkStateReader$2.process A cluster state change: WatchedEvent state:SyncConnected type:NodeDataChanged path:/clusterstate.json, has occurred - updating... (live nodes size: 5)
[junit4:junit4]   2> 14406 T799 oascc.ZkStateReader$2.process A cluster state change: WatchedEvent state:SyncConnected type:NodeDataChanged path:/clusterstate.json, has occurred - updating... (live nodes size: 5)
[junit4:junit4]   2> 14406 T805 oascc.ZkStateReader$2.process A cluster state change: WatchedEvent state:SyncConnected type:NodeDataChanged path:/clusterstate.json, has occurred - updating... (live nodes size: 5)
[junit4:junit4]   2> 14406 T818 oascc.ZkStateReader$2.process A cluster state change: WatchedEvent state:SyncConnected type:NodeDataChanged path:/clusterstate.json, has occurred - updating... (live nodes size: 5)
[junit4:junit4]   2> 14882 T866 oasc.CoreContainer.registerCore registering core: collection1
[junit4:junit4]   2> 14882 T866 oasc.ZkController.register Register replica - core:collection1 address:http://127.0.0.1:22092/krmpo/rv collection:collection1 shard:shard1
[junit4:junit4]   2> 14894 T866 oasc.ZkController.register We are http://127.0.0.1:22092/krmpo/rv/collection1/ and leader is http://127.0.0.1:50527/krmpo/rv/collection1/
[junit4:junit4]   2> 14894 T866 oasc.ZkController.register No LogReplay needed for core=collection1 baseURL=http://127.0.0.1:22092/krmpo/rv
[junit4:junit4]   2> 14894 T866 oasc.ZkController.checkRecovery Core needs to recover:collection1
[junit4:junit4]   2> 14895 T866 oasu.DefaultSolrCoreState.doRecovery Running recovery - first canceling any ongoing recovery
[junit4:junit4]   2> ASYNC  NEW_CORE C45 name=collection1 org.apache.solr.core.SolrCore@23d7c87 url=http://127.0.0.1:22092/krmpo/rv/collection1 node=127.0.0.1:22092_krmpo%2Frv C45_STATE=coll:collection1 core:collection1 props:{shard=null, roles=null, state=down, core=collection1, collection=collection1, node_name=127.0.0.1:22092_krmpo%2Frv, base_url=http://127.0.0.1:22092/krmpo/rv}
[junit4:junit4]   2> 14895 T870 C45 P22092 oasc.RecoveryStrategy.run Starting recovery process.  core=collection1 recoveringAfterStartup=true
[junit4:junit4]   2> 14896 T870 C45 P22092 oasc.RecoveryStrategy.doRecovery ###### startupVersions=[]
[junit4:junit4]   2> 14896 T866 oascc.ZkStateReader.updateClusterState Updating cloud state from ZooKeeper... 
[junit4:junit4]   2> 14896 T870 C45 P22092 oasc.ZkController.publish publishing core=collection1 state=recovering
[junit4:junit4]   2> 14896 T870 C45 P22092 oasc.ZkController.publish numShards not found on descriptor - reading it from system property
[junit4:junit4]   2> 14898 T777 oass.SolrDispatchFilter.init user.dir=/usr/home/hudson/hudson-slave/workspace/Lucene-Solr-Tests-trunk-Java6/solr/build/solr-core/test/J0
[junit4:junit4]   2> 14898 T777 oass.SolrDispatchFilter.init SolrDispatchFilter.init() done
[junit4:junit4]   2> 14898 T870 C45 P22092 oascsi.HttpClientUtil.createClient Creating new http client, config:maxConnections=128&maxConnectionsPerHost=32&followRedirects=false
[junit4:junit4]   2> 14899 T777 oascsi.HttpClientUtil.createClient Creating new http client, config:maxConnections=128&maxConnectionsPerHost=32&followRedirects=false
[junit4:junit4]   2> 14924 T777 oascc.ZkStateReader.updateClusterState Updating cloud state from ZooKeeper... 
[junit4:junit4]   2> 14948 T777 oasc.AbstractFullDistribZkTestBase.waitForThingsToLevelOut Wait for recoveries to finish - wait 15 for each attempt
[junit4:junit4]   2> 14948 T777 oasc.AbstractDistribZkTestBase.waitForRecoveriesToFinish Wait for recoveries to finish - collection: collection1 failOnTimeout:true timeout (sec):15
[junit4:junit4]   2> 14949 T777 oascc.ZkStateReader.updateClusterState Updating cloud state from ZooKeeper... 
[junit4:junit4]   2>  C43_STATE=coll:collection1 core:collection1 props:{shard=shard1, roles=null, state=recovering, core=collection1, collection=collection1, node_name=127.0.0.1:59838_krmpo%2Frv, base_url=http://127.0.0.1:59838/krmpo/rv}
[junit4:junit4]   2> 15502 T852 C43 P59838 oasc.RecoveryStrategy.doRecovery Attempting to PeerSync from http://127.0.0.1:50527/krmpo/rv/collection1/ core=collection1 - recoveringAfterStartup=true
[junit4:junit4]   2> 15502 T852 C43 P59838 oasu.PeerSync.sync PeerSync: core=collection1 url=http://127.0.0.1:59838/krmpo/rv START replicas=[http://127.0.0.1:50527/krmpo/rv/collection1/] nUpdates=100
[junit4:junit4]   2> 15503 T852 C43 P59838 oasu.PeerSync.sync WARNING no frame of reference to tell of we've missed updates
[junit4:junit4]   2> 15503 T852 C43 P59838 oasc.RecoveryStrategy.doRecovery PeerSync Recovery was not successful - trying replication. core=collection1
[junit4:junit4]   2> 15503 T852 C43 P59838 oasc.RecoveryStrategy.doRecovery Starting Replication Recovery. core=collection1
[junit4:junit4]   2> 15504 T852 C43 P59838 oasc.RecoveryStrategy.doRecovery Begin buffering updates. core=collection1
[junit4:junit4]   2> 15504 T852 C43 P59838 oasu.UpdateLog.bufferUpdates Starting to buffer updates. FSUpdateLog{state=ACTIVE, tlog=null}
[junit4:junit4]   2> 15504 T852 C43 P59838 oasc.RecoveryStrategy.replicate Attempting to replicate from http://127.0.0.1:50527/krmpo/rv/collection1/. core=collection1
[junit4:junit4]   2> 15504 T852 C43 P59838 oascsi.HttpClientUtil.createClient Creating new http client, config:maxConnections=128&maxConnectionsPerHost=32&followRedirects=false
[junit4:junit4]   2> 15506 T810 C44 P50527 REQ /get {getVersions=100&distrib=false&wt=javabin&qt=/get&version=2} status=0 QTime=0 
[junit4:junit4]   2> 15516 T814 C44 P50527 oasu.DirectUpdateHandler2.commit start commit{,optimize=false,openSearcher=false,waitSearcher=true,expungeDeletes=false,softCommit=false}
[junit4:junit4]   2> 15525 T814 C44 P50527 oasc.SolrDeletionPolicy.onCommit SolrDeletionPolicy.onCommit: commits:num=2
[junit4:junit4]   2> 		commit{dir=RateLimitedDirectoryWrapper(org.apache.lucene.store.NIOFSDirectory@/usr/home/hudson/hudson-slave/workspace/Lucene-Solr-Tests-trunk-Java6/solr/build/solr-core/test/J0/org.apache.solr.cloud.SyncSliceTest-1358476876318/jetty1/index lockFactory=org.apache.lucene.store.NativeFSLockFactory@237dabb0),segFN=segments_2,generation=2,filenames=[segments_2]
[junit4:junit4]   2> 		commit{dir=RateLimitedDirectoryWrapper(org.apache.lucene.store.NIOFSDirectory@/usr/home/hudson/hudson-slave/workspace/Lucene-Solr-Tests-trunk-Java6/solr/build/solr-core/test/J0/org.apache.solr.cloud.SyncSliceTest-1358476876318/jetty1/index lockFactory=org.apache.lucene.store.NativeFSLockFactory@237dabb0),segFN=segments_3,generation=3,filenames=[segments_3]
[junit4:junit4]   2> 15525 T814 C44 P50527 oasc.SolrDeletionPolicy.updateCommits newest commit = 3[segments_3]
[junit4:junit4]   2> 15526 T814 C44 P50527 oasc.CachingDirectoryFactory.close Releasing directory:/usr/home/hudson/hudson-slave/workspace/Lucene-Solr-Tests-trunk-Java6/solr/build/solr-core/test/J0/./org.apache.solr.cloud.SyncSliceTest-1358476876318/jetty1
[junit4:junit4]   2> 15526 T814 C44 P50527 oasu.DirectUpdateHandler2.commit end_commit_flush
[junit4:junit4]   2> 15527 T814 C44 P50527 /update {waitSearcher=true&openSearcher=false&commit=true&wt=javabin&commit_end_point=true&version=2&softCommit=false} {commit=} 0 11
[junit4:junit4]   2> 15528 T852 C43 P59838 oash.ReplicationHandler.inform Commits will be reserved for  10000
[junit4:junit4]   2> 15528 T852 C43 P59838 oash.SnapPuller.<init>  No value set for 'pollInterval'. Timer Task not started.
[junit4:junit4]   2> 15539 T812 C44 P50527 REQ /replication {command=indexversion&qt=/replication&wt=javabin&version=2} status=0 QTime=0 
[junit4:junit4]   2> 15540 T852 C43 P59838 oash.SnapPuller.fetchLatestIndex Master's generation: 3
[junit4:junit4]   2> 15540 T852 C43 P59838 oash.SnapPuller.fetchLatestIndex Slave's generation: 1
[junit4:junit4]   2> 15546 T852 C43 P59838 oash.SnapPuller.fetchLatestIndex Starting replication process
[junit4:junit4]   2> 15549 T812 C44 P50527 oasc.CachingDirectoryFactory.close Releasing directory:/usr/home/hudson/hudson-slave/workspace/Lucene-Solr-Tests-trunk-Java6/solr/build/solr-core/test/J0/./org.apache.solr.cloud.SyncSliceTest-1358476876318/jetty1
[junit4:junit4]   2> 15549 T812 C44 P50527 oasc.CachingDirectoryFactory.close Releasing directory:/usr/home/hudson/hudson-slave/workspace/Lucene-Solr-Tests-trunk-Java6/solr/build/solr-core/test/J0/./org.apache.solr.cloud.SyncSliceTest-1358476876318/jetty1/index
[junit4:junit4]   2> 15550 T812 C44 P50527 REQ /replication {command=filelist&qt=/replication&wt=javabin&generation=3&version=2} status=0 QTime=2 
[junit4:junit4]   2> 15550 T852 C43 P59838 oash.SnapPuller.fetchLatestIndex Number of files in latest index in master: 1
[junit4:junit4]   2> 15552 T852 C43 P59838 oasc.CachingDirectoryFactory.get return new directory for /usr/home/hudson/hudson-slave/workspace/Lucene-Solr-Tests-trunk-Java6/solr/build/solr-core/test/J0/./org.apache.solr.cloud.SyncSliceTest-1358476876318/jetty3/index.20130118004131866 forceNew:false
[junit4:junit4]   2> 15552 T852 C43 P59838 oasc.CachingDirectoryFactory.close Releasing directory:/usr/home/hudson/hudson-slave/workspace/Lucene-Solr-Tests-trunk-Java6/solr/build/solr-core/test/J0/./org.apache.solr.cloud.SyncSliceTest-1358476876318/jetty3
[junit4:junit4]   2> 15553 T852 C43 P59838 oash.SnapPuller.fetchLatestIndex Starting download to RateLimitedDirectoryWrapper(org.apache.lucene.store.NIOFSDirectory@/usr/home/hudson/hudson-slave/workspace/Lucene-Solr-Tests-trunk-Java6/solr/build/solr-core/test/J0/org.apache.solr.cloud.SyncSliceTest-1358476876318/jetty3/index.20130118004131866 lockFactory=org.apache.lucene.store.NativeFSLockFactory@3eb407cc) fullCopy=true
[junit4:junit4]   2> 15556 T812 C44 P50527 REQ /replication {file=segments_3&command=filecontent&checksum=true&wt=filestream&qt=/replication&generation=3} status=0 QTime=0 
[junit4:junit4]   2> 15558 T852 C43 P59838 oasc.CachingDirectoryFactory.close Releasing directory:/usr/home/hudson/hudson-slave/workspace/Lucene-Solr-Tests-trunk-Java6/solr/build/solr-core/test/J0/./org.apache.solr.cloud.SyncSliceTest-1358476876318/jetty3/index
[junit4:junit4]   2> 15558 T852 C43 P59838 oash.SnapPuller.fetchLatestIndex Total time taken for download : 0 secs
[junit4:junit4]   2> 15560 T852 C43 P59838 oash.SnapPuller.modifyIndexProps New index installed. Updating index properties... index=index.20130118004131866
[junit4:junit4]   2> 15561 T852 C43 P59838 oasc.CachingDirectoryFactory.close Releasing directory:/usr/home/hudson/hudson-slave/workspace/Lucene-Solr-Tests-trunk-Java6/solr/build/solr-core/test/J0/./org.apache.solr.cloud.SyncSliceTest-1358476876318/jetty3
[junit4:junit4]   2> 15562 T852 C43 P59838 oasc.CachingDirectoryFactory.close Releasing directory:/usr/home/hudson/hudson-slave/workspace/Lucene-Solr-Tests-trunk-Java6/solr/build/solr-core/test/J0/./org.apache.solr.cloud.SyncSliceTest-1358476876318/jetty3
[junit4:junit4]   2> 15562 T852 C43 P59838 oasc.SolrCore.getNewIndexDir New index directory detected: old=./org.apache.solr.cloud.SyncSliceTest-1358476876318/jetty3/index/ new=./org.apache.solr.cloud.SyncSliceTest-1358476876318/jetty3/index.20130118004131866
[junit4:junit4]   2> 15565 T852 C43 P59838 oasc.SolrDeletionPolicy.onInit SolrDeletionPolicy.onInit: commits:num=1
[junit4:junit4]   2> 		commit{dir=RateLimitedDirectoryWrapper(org.apache.lucene.store.NIOFSDirectory@/usr/home/hudson/hudson-slave/workspace/Lucene-Solr-Tests-trunk-Java6/solr/build/solr-core/test/J0/org.apache.solr.cloud.SyncSliceTest-1358476876318/jetty3/index.20130118004131866 lockFactory=org.apache.lucene.store.NativeFSLockFactory@3eb407cc),segFN=segments_3,generation=3,filenames=[segments_3]
[junit4:junit4]   2> 15566 T852 C43 P59838 oasc.SolrDeletionPolicy.updateCommits newest commit = 3[segments_3]
[junit4:junit4]   2> 15567 T852 C43 P59838 oasc.CachingDirectoryFactory.close Releasing directory:/usr/home/hudson/hudson-slave/workspace/Lucene-Solr-Tests-trunk-Java6/solr/build/solr-core/test/J0/./org.apache.solr.cloud.SyncSliceTest-1358476876318/jetty3
[junit4:junit4]   2> 15567 T852 C43 P59838 oasu.DefaultSolrCoreState.newIndexWriter Creating new IndexWriter...
[junit4:junit4]   2> 15567 T852 C43 P59838 oasu.DefaultSolrCoreState.newIndexWriter Waiting until IndexWriter is unused... core=collection1
[junit4:junit4]   2> 15567 T852 C43 P59838 oasu.DefaultSolrCoreState.newIndexWriter Rollback old IndexWriter... core=collection1
[junit4:junit4]   2> 15568 T852 C43 P59838 oasc.CachingDirectoryFactory.close Releasing directory:/usr/home/hudson/hudson-slave/workspace/Lucene-Solr-Tests-trunk-Java6/solr/build/solr-core/test/J0/./org.apache.solr.cloud.SyncSliceTest-1358476876318/jetty3/index.20130118004131866
[junit4:junit4]   2> 15569 T852 C43 P59838 oasc.CachingDirectoryFactory.close Releasing directory:/usr/home/hudson/hudson-slave/workspace/Lucene-Solr-Tests-trunk-Java6/solr/build/solr-core/test/J0/./org.apache.solr.cloud.SyncSliceTest-1358476876318/jetty3
[junit4:junit4]   2> 15572 T852 C43 P59838 oasc.SolrDeletionPolicy.onInit SolrDeletionPolicy.onInit: commits:num=1
[junit4:junit4]   2> 		commit{dir=RateLimitedDirectoryWrapper(org.apache.lucene.store.NIOFSDirectory@/usr/home/hudson/hudson-slave/workspace/Lucene-Solr-Tests-trunk-Java6/solr/build/solr-core/test/J0/org.apache.solr.cloud.SyncSliceTest-1358476876318/jetty3/index.20130118004131866 lockFactory=org.apache.lucene.store.NativeFSLockFactory@3eb407cc),segFN=segments_3,generation=3,filenames=[segments_3]
[junit4:junit4]   2> 15572 T852 C43 P59838 oasc.SolrDeletionPolicy.updateCommits newest commit = 3[segments_3]
[junit4:junit4]   2> 15572 T852 C43 P59838 oasu.DefaultSolrCoreState.newIndexWriter New IndexWriter is ready to be used.
[junit4:junit4]   2> 15573 T852 C43 P59838 oasc.CachingDirectoryFactory.close Releasing directory:/usr/home/hudson/hudson-slave/workspace/Lucene-Solr-Tests-trunk-Java6/solr/build/solr-core/test/J0/./org.apache.solr.cloud.SyncSliceTest-1358476876318/jetty3
[junit4:junit4]   2> 15573 T852 C43 P59838 oass.SolrIndexSearcher.<init> Opening Searcher@5872c88c main
[junit4:junit4]   2> 15576 T851 oasc.SolrCore.registerSearcher [collection1] Registered new searcher Searcher@5872c88c main{StandardDirectoryReader(segments_3:1:nrt)}
[junit4:junit4]   2> 15576 T851 oasc.CachingDirectoryFactory.close Releasing directory:/usr/home/hudson/hudson-slave/workspace/Lucene-Solr-Tests-trunk-Java6/solr/build/solr-core/test/J0/./org.apache.solr.cloud.SyncSliceTest-1358476876318/jetty3/index
[junit4:junit4]   2> 15577 T852 C43 P59838 oasu.DirectUpdateHandler2.commit start commit{,optimize=false,openSearcher=false,waitSearcher=false,expungeDeletes=false,softCommit=false}
[junit4:junit4]   2> 15602 T852 C43 P59838 oasc.SolrDeletionPolicy.onCommit SolrDeletionPolicy.onCommit: commits:num=2
[junit4:junit4]   2> 		commit{dir=RateLimitedDirectoryWrapper(org.apache.lucene.store.NIOFSDirectory@/usr/home/hudson/hudson-slave/workspace/Lucene-Solr-Tests-trunk-Java6/solr/build/solr-core/test/J0/org.apache.solr.cloud.SyncSliceTest-1358476876318/jetty3/index.20130118004131866 lockFactory=org.apache.lucene.store.NativeFSLockFactory@3eb407cc),segFN=segments_3,generation=3,filenames=[segments_3]
[junit4:junit4]   2> 		commit{dir=RateLimitedDirectoryWrapper(org.apache.lucene.store.NIOFSDirectory@/usr/home/hudson/hudson-slave/workspace/Lucene-Solr-Tests-trunk-Java6/solr/build/solr-core/test/J0/org.apache.solr.cloud.SyncSliceTest-1358476876318/jetty3/index.20130118004131866 lockFactory=org.apache.lucene.store.NativeFSLockFactory@3eb407cc),segFN=segments_4,generation=4,filenames=[segments_4]
[junit4:junit4]   2> 15603 T852 C43 P59838 oasc.SolrDeletionPolicy.updateCommits newest commit = 4[segments_4]
[junit4:junit4]   2> 15605 T852 C43 P59838 oasc.CachingDirectoryFactory.close Releasing directory:/usr/home/hudson/hudson-slave/workspace/Lucene-Solr-Tests-trunk-Java6/solr/build/solr-core/test/J0/./org.apache.solr.cloud.SyncSliceTest-1358476876318/jetty3
[junit4:junit4]   2> 15606 T852 C43 P59838 oasu.DirectUpdateHandler2.commit end_commit_flush
[junit4:junit4]   2> 15606 T852 C43 P59838 oasc.CachingDirectoryFactory.close Releasing directory:/usr/home/hudson/hudson-slave/workspace/Lucene-Solr-Tests-trunk-Java6/solr/build/solr-core/test/J0/./org.apache.solr.cloud.SyncSliceTest-1358476876318/jetty3/index.20130118004131866
[junit4:junit4]   2> 15606 T852 C43 P59838 oasc.CachingDirectoryFactory.close Releasing directory:/usr/home/hudson/hudson-slave/workspace/Lucene-Solr-Tests-trunk-Java6/solr/build/solr-core/test/J0/./org.apache.solr.cloud.SyncSliceTest-1358476876318/jetty3/index
[junit4:junit4]   2> 15607 T852 C43 P59838 oasc.RecoveryStrategy.replay No replay needed. core=collection1
[junit4:junit4]   2> 15607 T852 C43 P59838 oasc.RecoveryStrategy.doRecovery Replication Recovery was successful - registering as Active. core=collection1
[junit4:junit4]   2> 15608 T852 C43 P59838 oasc.ZkController.publish publishing core=collection1 state=active
[junit4:junit4]   2> 15608 T852 C43 P59838 oasc.ZkController.publish numShards not found on descriptor - reading it from system property
[junit4:junit4]   2> 15621 T852 C43 P59838 oasc.RecoveryStrategy.doRecovery Finished recovery process. core=collection1
[junit4:junit4]   2> 15943 T800 oascc.ZkStateReader.updateClusterState Updating cloud state from ZooKeeper... 
[junit4:junit4]   2> 15945 T800 oasc.Overseer$ClusterStateUpdater.updateState Update state numShards=1 message={
[junit4:junit4]   2> 	  "operation":"state",
[junit4:junit4]   2> 	  "numShards":"1",
[junit4:junit4]   2> 	  "shard":"shard1",
[junit4:junit4]   2> 	  "roles":null,
[junit4:junit4]   2> 	  "state":"recovering",
[junit4:junit4]   2> 	  "core":"collection1",
[junit4:junit4]   2> 	  "collection":"collection1",
[junit4:junit4]   2> 	  "node_name":"127.0.0.1:22092_krmpo%2Frv",
[junit4:junit4]   2> 	  "base_url":"http://127.0.0.1:22092/krmpo/rv"}
[junit4:junit4]   2> 15950 T800 oasc.Overseer$ClusterStateUpdater.updateState Update state numShards=1 message={
[junit4:junit4]   2> 	  "operation":"state",
[junit4:junit4]   2> 	  "numShards":"1",
[junit4:junit4]   2> 	  "shard":"shard1",
[junit4:junit4]   2> 	  "roles":null,
[junit4:junit4]   2> 	  "state":"active",
[junit4:junit4]   2> 	  "core":"collection1",
[junit4:junit4]   2> 	  "collection":"collection1",
[junit4:junit4]   2> 	  "node_name":"127.0.0.1:59838_krmpo%2Frv",
[junit4:junit4]   2> 	  "base_url":"http://127.0.0.1:59838/krmpo/rv"}
[junit4:junit4]   2> 15953 T777 oascc.ZkStateReader.updateClusterState Updating cloud state from ZooKeeper... 
[junit4:junit4]   2> 15965 T865 oascc.ZkStateReader$2.process A cluster state change: WatchedEvent state:SyncConnected type:NodeDataChanged path:/clusterstate.json, has occurred - updating... (live nodes size: 5)
[junit4:junit4]   2> 15965 T833 oascc.ZkStateReader$2.process A cluster state change: WatchedEvent state:SyncConnected type:NodeDataChanged path:/clusterstate.json, has occurred - updating... (live nodes size: 5)
[junit4:junit4]   2> 15965 T799 oascc.ZkStateReader$2.process A cluster state change: WatchedEvent state:SyncConnected type:NodeDataChanged path:/clusterstate.json, has occurred - updating... (live nodes size: 5)
[junit4:junit4]   2> 15965 T805 oascc.ZkStateReader$2.process A cluster state change: WatchedEvent state:SyncConnected type:NodeDataChanged path:/clusterstate.json, has occurred - updating... (live nodes size: 5)
[junit4:junit4]   2> 15965 T849 oascc.ZkStateReader$2.process A cluster state change: WatchedEvent state:SyncConnected type:NodeDataChanged path:/clusterstate.json, has occurred - updating... (live nodes size: 5)
[junit4:junit4]   2> 15965 T818 oascc.ZkStateReader$2.process A cluster state change: WatchedEvent state:SyncConnected type:NodeDataChanged path:/clusterstate.json, has occurred - updating... (live nodes size: 5)
[junit4:junit4]   2> 16956 T777 oascc.ZkStateReader.updateClusterState Updating cloud state from ZooKeeper... 
[junit4:junit4]   2> 17959 T777 oascc.ZkStateReader.updateClusterState Updating cloud state from ZooKeeper... 
[junit4:junit4]   2>  C45_STATE=coll:collection1 core:collection1 props:{shard=shard1, roles=null, state=recovering, core=collection1, collection=collection1, node_name=127.0.0.1:22092_krmpo%2Frv, base_url=http://127.0.0.1:22092/krmpo/rv}
[junit4:junit4]   2> 18927 T870 C45 P22092 oasc.RecoveryStrategy.doRecovery Attempting to PeerSync from http://127.0.0.1:50527/krmpo/rv/collection1/ core=collection1 - recoveringAfterStartup=true
[junit4:junit4]   2> 18927 T870 C45 P22092 oasu.PeerSync.sync PeerSync: core=collection1 url=http://127.0.0.1:22092/krmpo/rv START replicas=[http://127.0.0.1:50527/krmpo/rv/collection1/] nUpdates=100
[junit4:junit4]   2> 18927 T870 C45 P22092 oasu.PeerSync.sync WARNING no frame of reference to tell of we've missed updates
[junit4:junit4]   2> 18928 T870 C45 P22092 oasc.RecoveryStrategy.doRecovery PeerSync Recovery was not successful - trying replication. core=collection1
[junit4:junit4]   2> 18928 T870 C45 P22092 oasc.RecoveryStrategy.doRecovery Starting Replication Recovery. core=collection1
[junit4:junit4]   2> 18928 T870 C45 P22092 oasc.RecoveryStrategy.doRecovery Begin buffering updates. core=collection1
[junit4:junit4]   2> 18928 T870 C45 P22092 oasu.UpdateLog.bufferUpdates Starting to buffer updates. FSUpdateLog{state=ACTIVE, tlog=null}
[junit4:junit4]   2> 18928 T870 C45 P22092 oasc.RecoveryStrategy.replicate Attempting to replicate from http://127.0.0.1:50527/krmpo/rv/collection1/. core=collection1
[junit4:junit4]   2> 18928 T870 C45 P22092 oascsi.HttpClientUtil.createClient Creating new http client, config:maxConnections=128&maxConnectionsPerHost=32&followRedirects=false
[junit4:junit4]   2> 18931 T810 C44 P50527 REQ /get {getVersions=100&distrib=false&wt=javabin&qt=/get&version=2} status=0 QTime=1 
[junit4:junit4]   2> 18941 T808 C44 P50527 oasu.DirectUpdateHandler2.commit start commit{,optimize=false,openSearcher=false,waitSearcher=true,expungeDeletes=false,softCommit=false}
[junit4:junit4]   2> 18961 T777 oascc.ZkStateReader.updateClusterState Updating cloud state from ZooKeeper... 
[junit4:junit4]   2> 18973 T808 C44 P50527 oasc.SolrDeletionPolicy.onCommit SolrDeletionPolicy.onCommit: commits:num=3
[junit4:junit4]   2> 		commit{dir=RateLimitedDirectoryWrapper(org.apache.lucene.store.NIOFSDirectory@/usr/home/hudson/hudson-slave/workspace/Lucene-Solr-Tests-trunk-Java6/solr/build/solr-core/test/J0/org.apache.solr.cloud.SyncSliceTest-1358476876318/jetty1/index lockFactory=org.apache.lucene.store.NativeFSLockFactory@237dabb0),segFN=segments_2,generation=2,filenames=[segments_2]
[junit4:junit4]   2> 		commit{dir=RateLimitedDirectoryWrapper(org.apache.lucene.store.NIOFSDirectory@/usr/home/hudson/hudson-slave/workspace/Lucene-Solr-Tests-trunk-Java6/solr/build/solr-core/test/J0/org.apache.solr.cloud.SyncSliceTest-1358476876318/jetty1/index lockFactory=org.apache.lucene.store.NativeFSLockFactory@237dabb0),segFN=segments_3,generation=3,filenames=[segments_3]
[junit4:junit4]   2> 		commit{dir=RateLimitedDirectoryWrapper(org.apache.lucene.store.NIOFSDirectory@/usr/home/hudson/hudson-slave/workspace/Lucene-Solr-Tests-trunk-Java6/solr/build/solr-core/test/J0/org.apache.solr.cloud.SyncSliceTest-1358476876318/jetty1/index lockFactory=org.apache.lucene.store.NativeFSLockFactory@237dabb0),segFN=segments_4,generation=4,filenames=[segments_4]
[junit4:junit4]   2> 18973 T808 C44 P50527 oasc.SolrDeletionPolicy.updateCommits newest commit = 4[segments_4]
[junit4:junit4]   2> 18974 T808 C44 P50527 oasc.CachingDirectoryFactory.close Releasing directory:/usr/home/hudson/hudson-slave/workspace/Lucene-Solr-Tests-trunk-Java6/solr/build/solr-core/test/J0/./org.apache.solr.cloud.SyncSliceTest-1358476876318/jetty1
[junit4:junit4]   2> 18974 T808 C44 P50527 oasu.DirectUpdateHandler2.commit end_commit_flush
[junit4:junit4]   2> 18974 T808 C44 P50527 /update {waitSearcher=true&openSearcher=false&commit=true&wt=javabin&commit_end_point=true&version=2&softCommit=false} {commit=} 0 33
[junit4:junit4]   2> 18975 T870 C45 P22092 oash.ReplicationHandler.inform Commits will be reserved for  10000
[junit4:junit4]   2> 18976 T870 C45 P22092 oash.SnapPuller.<init>  No value set for 'pollInterval'. Timer Task not started.
[junit4:junit4]   2> 18978 T812 C44 P50527 REQ /replication {command=indexversion&qt=/replication&wt=javabin&version=2} status=0 QTime=0 
[junit4:junit4]   2> 18979 T870 C45 P22092 oash.SnapPuller.fetchLatestIndex Master's generation: 4
[junit4:junit4]   2> 18979 T870 C45 P22092 oash.SnapPuller.fetchLatestIndex Slave's generation: 1
[junit4:junit4]   2> 18979 T870 C45 P22092 oash.SnapPuller.fetchLatestIndex Starting replication process
[junit4:junit4]   2> 18982 T812 C44 P50527 oasc.CachingDirectoryFactory.close Releasing directory:/usr/home/hudson/hudson-slave/workspace/Lucene-Solr-Tests-trunk-Java6/solr/build/solr-core/test/J0/./org.apache.solr.cloud.SyncSliceTest-1358476876318/jetty1
[junit4:junit4]   2> 18983 T812 C44 P50527 oasc.CachingDirectoryFactory.close Releasing directory:/usr/home/hudson/hudson-slave/workspace/Lucene-Solr-Tests-trunk-Java6/solr/build/solr-core/test/J0/./org.apache.solr.cloud.SyncSliceTest-1358476876318/jetty1/index
[junit4:junit4]   2> 18983 T812 C44 P50527 REQ /replication {command=filelist&qt=/replication&wt=javabin&generation=4&version=2} status=0 QTime=1 
[junit4:junit4]   2> 18983 T870 C45 P22092 oash.SnapPuller.fetchLatestIndex Number of files in latest index in master: 1
[junit4:junit4]   2> 18985 T870 C45 P22092 oasc.CachingDirectoryFactory.get return new directory for /usr/home/hudson/hudson-slave/workspace/Lucene-Solr-Tests-trunk-Java6/solr/build/solr-core/test/J0/./org.apache.solr.cloud.SyncSliceTest-1358476876318/jetty4/index.20130118004135299 forceNew:false
[junit4:junit4]   2> 18985 T870 C45 P22092 oasc.CachingDirectoryFactory.close Releasing directory:/usr/home/hudson/hudson-slave/workspace/Lucene-Solr-Tests-trunk-Java6/solr/build/solr-core/test/J0/./org.apache.solr.cloud.SyncSliceTest-1358476876318/jetty4
[junit4:junit4]   2> 18985 T870 C45 P22092 oash.SnapPuller.fetchLatestIndex Starting download to RateLimitedDirectoryWrapper(org.apache.lucene.store.NIOFSDirectory@/usr/home/hudson/hudson-slave/workspace/Lucene-Solr-Tests-trunk-Java6/solr/build/solr-core/test/J0/org.apache.solr.cloud.SyncSliceTest-1358476876318/jetty4/index.20130118004135299 lockFactory=org.apache.lucene.store.NativeFSLockFactory@59d559f3) fullCopy=true
[junit4:junit4]   2> 18988 T812 C44 P50527 REQ /replication {file=segments_4&command=filecontent&checksum=true&wt=filestream&qt=/replication&generation=4} status=0 QTime=0 
[junit4:junit4]   2> 18990 T870 C45 P22092 oasc.CachingDirectoryFactory.close Releasing directory:/usr/home/hudson/hudson-slave/workspace/Lucene-Solr-Tests-trunk-Java6/solr/build/solr-core/test/J0/./org.apache.solr.cloud.SyncSliceTest-1358476876318/jetty4/index
[junit4:junit4]   2> 18990 T870 C45 P22092 oash.SnapPuller.fetchLatestIndex Total time taken for download : 0 secs
[junit4:junit4]   2> 18995 T870 C45 P22092 oash.SnapPuller.modifyIndexProps New index installed. Updating index properties... index=index.20130118004135299
[junit4:junit4]   2> 18996 T870 C45 P22092 oasc.CachingDirectoryFactory.close Releasing directory:/usr/home/hudson/hudson-slave/workspace/Lucene-Solr-Tests-trunk-Java6/solr/build/solr-core/test/J0/./org.apache.solr.cloud.SyncSliceTest-1358476876318/jetty4
[junit4:junit4]   2> 18997 T870 C45 P22092 oasc.CachingDirectoryFactory.close Releasing directory:/usr/home/hudson/hudson-slave/workspace/Lucene-Solr-Tests-trunk-Java6/solr/build/solr-core/test/J0/./org.apache.solr.cloud.SyncSliceTest-1358476876318/jetty4
[junit4:junit4]   2> 18997 T870 C45 P22092 oasc.SolrCore.getNewIndexDir New index directory detected: old=./org.apache.solr.cloud.SyncSliceTest-1358476876318/jetty4/index/ new=./org.apache.solr.cloud.SyncSliceTest-1358476876318/jetty4/index.20130118004135299
[junit4:junit4]   2> 19001 T870 C45 P22092 oasc.SolrDeletionPolicy.onInit SolrDeletionPolicy.onInit: commits:num=1
[junit4:junit4]   2> 		commit{dir=RateLimitedDirectoryWrapper(org.apache.lucene.store.NIOFSDirectory@/usr/home/hudson/hudson-slave/workspace/Lucene-Solr-Tests-trunk-Java6/solr/build/solr-core/test/J0/org.apache.solr.cloud.SyncSliceTest-1358476876318/jetty4/index.20130118004135299 lockFactory=org.apache.lucene.store.NativeFSLockFactory@59d559f3),segFN=segments_4,generation=4,filenames=[segments_4]
[junit4:junit4]   2> 19001 T870 C45 P22092 oasc.SolrDeletionPolicy.updateCommits newest commit = 4[segments_4]
[junit4:junit4]   2> 19002 T870 C45 P22092 oasc.CachingDirectoryFactory.close Releasing directory:/usr/home/hudson/hudson-slave/workspace/Lucene-Solr-Tests-trunk-Java6/solr/build/solr-core/test/J0/./org.apache.solr.cloud.SyncSliceTest-1358476876318/jetty4
[junit4:junit4]   2> 19002 T870 C45 P22092 oasu.DefaultSolrCoreState.newIndexWriter Creating new IndexWriter...
[junit4:junit4]   2> 19003 T870 C45 P22092 oasu.DefaultSolrCoreState.newIndexWriter Waiting until IndexWriter is unused... core=collection1
[junit4:junit4]   2> 19003 T870 C45 P22092 oasu.DefaultSolrCoreState.newIndexWriter Rollback old IndexWriter... core=collection1
[junit4:junit4]   2> 19004 T870 C45 P22092 oasc.CachingDirectoryFactory.close Releasing directory:/usr/home/hudson/hudson-slave/workspace/Lucene-Solr-Tests-trunk-Java6/solr/build/solr-core/test/J0/./org.apache.solr.cloud.SyncSliceTest-1358476876318/jetty4/index.20130118004135299
[junit4:junit4]   2> 19004 T870 C45 P22092 oasc.CachingDirectoryFactory.close Releasing directory:/usr/home/hudson/hudson-slave/workspace/Lucene-Solr-Tests-trunk-Java6/solr/build/solr-core/test/J0/./org.apache.solr.cloud.SyncSliceTest-1358476876318/jetty4
[junit4:junit4]   2> 19008 T870 C45 P22092 oasc.SolrDeletionPolicy.onInit SolrDeletionPolicy.onInit: commits:num=1
[junit4:junit4]   2> 		commit{dir=RateLimitedDirectoryWrapper(org.apache.lucene.store.NIOFSDirectory@/usr/home/hudson/hudson-slave/workspace/Lucene-Solr-Tests-trunk-Java6/solr/build/solr-core/test/J0/org.apache.solr.cloud.SyncSliceTest-1358476876318/jetty4/index.20130118004135299 lockFactory=org.apache.lucene.store.NativeFSLockFactory@59d559f3),segFN=segments_4,generation=4,filenames=[segments_4]
[junit4:junit4]   2> 19008 T870 C45 P22092 oasc.SolrDeletionPolicy.updateCommits newest commit = 4[segments_4]
[junit4:junit4]   2> 19008 T870 C45 P22092 oasu.DefaultSolrCoreState.newIndexWriter New IndexWriter is ready to be used.
[junit4:junit4]   2> 19009 T870 C45 P22092 oasc.CachingDirectoryFactory.close Releasing directory:/usr/home/hudson/hudson-slave/workspace/Lucene-Solr-Tests-trunk-Java6/solr/build/solr-core/test/J0/./org.apache.solr.cloud.SyncSliceTest-1358476876318/jetty4
[junit4:junit4]   2> 19009 T870 C45 P22092 oass.SolrIndexSearcher.<init> Opening Searcher@15039ea6 main
[junit4:junit4]   2> 19010 T869 oasc.SolrCore.registerSearcher [collection1] Registered new searcher Searcher@15039ea6 main{StandardDirectoryReader(segments_4:1:nrt)}
[junit4:junit4]   2> 19011 T869 oasc.CachingDirectoryFactory.close Releasing directory:/usr/home/hudson/hudson-slave/workspace/Lucene-Solr-Tests-trunk-Java6/solr/build/solr-core/test/J0/./org.apache.solr.cloud.SyncSliceTest-1358476876318/jetty4/index
[junit4:junit4]   2> 19011 T870 C45 P22092 oasu.DirectUpdateHandler2.commit start commit{,optimize=false,openSearcher=false,waitSearcher=false,expungeDeletes=false,softCommit=false}
[junit4:junit4]   2> 19038 T870 C45 P22092 oasc.SolrDeletionPolicy.onCommit SolrDeletionPolicy.onCommit: commits:num=2
[junit4:junit4]   2> 		commit{dir=RateLimitedDirectoryWrapper(org.apache.lucene.store.NIOFSDirectory@/usr/home/hudson/hudson-slave/workspace/Lucene-Solr-Tests-trunk-Java6/solr/build/solr-core/test/J0/org.apache.solr.cloud.SyncSliceTest-1358476876318/jetty4/index.20130118004135299 lockFactory=org.apache.lucene.store.NativeFSLockFactory@59d559f3),segFN=segments_4,generation=4,filenames=[segments_4]
[junit4:junit4]   2> 		commit{dir=RateLimitedDirectoryWrapper(org.apache.lucene.store.NIOFSDirectory@/usr/home/hudson/hudson-slave/workspace/Lucene-Solr-Tests-trunk-Java6/solr/build/solr-core/test/J0/org.apache.solr.cloud.SyncSliceTest-1358476876318/jetty4/index.20130118004135299 lockFactory=org.apache.lucene.store.NativeFSLockFactory@59d559f3),segFN=segments_5,generation=5,filenames=[segments_5]
[junit4:junit4]   2> 19038 T870 C45 P22092 oasc.SolrDeletionPolicy.updateCommits n

[...truncated too long message...]

unit4:junit4]   2> 149578 T777 oasc.CachingDirectoryFactory.closeDirectory Closing directory:/usr/home/hudson/hudson-slave/workspace/Lucene-Solr-Tests-trunk-Java6/solr/build/solr-core/test/J0/./org.apache.solr.cloud.SyncSliceTest-1358476876318/jetty4/index
[junit4:junit4]   2> 150434 T865 oaz.ClientCnxn$EventThread.run EventThread shut down
[junit4:junit4]   2> 150434 T777 oaz.ZooKeeper.close Session: 0x13c4b881a23000c closed
[junit4:junit4]   2> 150435 T777 oejsh.ContextHandler.doStop stopped o.e.j.s.ServletContextHandler{/krmpo/rv,null}
[junit4:junit4]   2> 150844 T777 oas.SolrTestCaseJ4.tearDown ###Ending testDistribSearch
[junit4:junit4]   1> client port:0.0.0.0/0.0.0.0:0
[junit4:junit4]   2> NOTE: reproduce with: ant test  -Dtestcase=SyncSliceTest -Dtests.method=testDistribSearch -Dtests.seed=4A986B98D126401B -Dtests.multiplier=3 -Dtests.slow=true -Dtests.locale=ar_IQ -Dtests.timezone=Etc/GMT+2 -Dtests.file.encoding=US-ASCII
[junit4:junit4] FAILURE  151s J0 | SyncSliceTest.testDistribSearch <<<
[junit4:junit4]    > Throwable #1: java.lang.AssertionError: shard1 should have just been set up to be inconsistent - but it's still consistent
[junit4:junit4]    > 	at __randomizedtesting.SeedInfo.seed([4A986B98D126401B:CB7EE580A6792027]:0)
[junit4:junit4]    > 	at org.junit.Assert.fail(Assert.java:93)
[junit4:junit4]    > 	at org.junit.Assert.assertTrue(Assert.java:43)
[junit4:junit4]    > 	at org.junit.Assert.assertNotNull(Assert.java:526)
[junit4:junit4]    > 	at org.apache.solr.cloud.SyncSliceTest.doTest(SyncSliceTest.java:214)
[junit4:junit4]    > 	at org.apache.solr.BaseDistributedSearchTestCase.testDistribSearch(BaseDistributedSearchTestCase.java:794)
[junit4:junit4]    > 	at sun.reflect.NativeMethodAccessorImpl.invoke0(Native Method)
[junit4:junit4]    > 	at sun.reflect.NativeMethodAccessorImpl.invoke(NativeMethodAccessorImpl.java:57)
[junit4:junit4]    > 	at sun.reflect.DelegatingMethodAccessorImpl.invoke(DelegatingMethodAccessorImpl.java:43)
[junit4:junit4]    > 	at java.lang.reflect.Method.invoke(Method.java:616)
[junit4:junit4]    > 	at com.carrotsearch.randomizedtesting.RandomizedRunner.invoke(RandomizedRunner.java:1559)
[junit4:junit4]    > 	at com.carrotsearch.randomizedtesting.RandomizedRunner.access$600(RandomizedRunner.java:79)
[junit4:junit4]    > 	at com.carrotsearch.randomizedtesting.RandomizedRunner$6.evaluate(RandomizedRunner.java:737)
[junit4:junit4]    > 	at com.carrotsearch.randomizedtesting.RandomizedRunner$7.evaluate(RandomizedRunner.java:773)
[junit4:junit4]    > 	at com.carrotsearch.randomizedtesting.RandomizedRunner$8.evaluate(RandomizedRunner.java:787)
[junit4:junit4]    > 	at com.carrotsearch.randomizedtesting.rules.SystemPropertiesRestoreRule$1.evaluate(SystemPropertiesRestoreRule.java:53)
[junit4:junit4]    > 	at org.apache.lucene.util.TestRuleSetupTeardownChained$1.evaluate(TestRuleSetupTeardownChained.java:50)
[junit4:junit4]    > 	at org.apache.lucene.util.TestRuleFieldCacheSanity$1.evaluate(TestRuleFieldCacheSanity.java:51)
[junit4:junit4]    > 	at org.apache.lucene.util.AbstractBeforeAfterRule$1.evaluate(AbstractBeforeAfterRule.java:46)
[junit4:junit4]    > 	at com.carrotsearch.randomizedtesting.rules.SystemPropertiesInvariantRule$1.evaluate(SystemPropertiesInvariantRule.java:55)
[junit4:junit4]    > 	at org.apache.lucene.util.TestRuleThreadAndTestName$1.evaluate(TestRuleThreadAndTestName.java:49)
[junit4:junit4]    > 	at org.apache.lucene.util.TestRuleIgnoreAfterMaxFailures$1.evaluate(TestRuleIgnoreAfterMaxFailures.java:70)
[junit4:junit4]    > 	at org.apache.lucene.util.TestRuleMarkFailure$1.evaluate(TestRuleMarkFailure.java:48)
[junit4:junit4]    > 	at com.carrotsearch.randomizedtesting.rules.StatementAdapter.evaluate(StatementAdapter.java:36)
[junit4:junit4]    > 	at com.carrotsearch.randomizedtesting.ThreadLeakControl$StatementRunner.run(ThreadLeakControl.java:358)
[junit4:junit4]    > 	at com.carrotsearch.randomizedtesting.ThreadLeakControl.forkTimeoutingTask(ThreadLeakControl.java:782)
[junit4:junit4]    > 	at com.carrotsearch.randomizedtesting.ThreadLeakControl$3.evaluate(ThreadLeakControl.java:442)
[junit4:junit4]    > 	at com.carrotsearch.randomizedtesting.RandomizedRunner.runSingleTest(RandomizedRunner.java:746)
[junit4:junit4]    > 	at com.carrotsearch.randomizedtesting.RandomizedRunner$3.evaluate(RandomizedRunner.java:648)
[junit4:junit4]    > 	at com.carrotsearch.randomizedtesting.RandomizedRunner$4.evaluate(RandomizedRunner.java:682)
[junit4:junit4]    > 	at com.carrotsearch.randomizedtesting.RandomizedRunner$5.evaluate(RandomizedRunner.java:693)
[junit4:junit4]    > 	at com.carrotsearch.randomizedtesting.rules.StatementAdapter.evaluate(StatementAdapter.java:36)
[junit4:junit4]    > 	at com.carrotsearch.randomizedtesting.rules.SystemPropertiesRestoreRule$1.evaluate(SystemPropertiesRestoreRule.java:53)
[junit4:junit4]    > 	at org.apache.lucene.util.AbstractBeforeAfterRule$1.evaluate(AbstractBeforeAfterRule.java:46)
[junit4:junit4]    > 	at org.apache.lucene.util.TestRuleStoreClassName$1.evaluate(TestRuleStoreClassName.java:42)
[junit4:junit4]    > 	at com.carrotsearch.randomizedtesting.rules.SystemPropertiesInvariantRule$1.evaluate(SystemPropertiesInvariantRule.java:55)
[junit4:junit4]    > 	at com.carrotsearch.randomizedtesting.rules.NoShadowingOrOverridesOnMethodsRule$1.evaluate(NoShadowingOrOverridesOnMethodsRule.java:39)
[junit4:junit4]    > 	at com.carrotsearch.randomizedtesting.rules.NoShadowingOrOverridesOnMethodsRule$1.evaluate(NoShadowingOrOverridesOnMethodsRule.java:39)
[junit4:junit4]    > 	at com.carrotsearch.randomizedtesting.rules.StatementAdapter.evaluate(StatementAdapter.java:36)
[junit4:junit4]    > 	at org.apache.lucene.util.TestRuleAssertionsRequired$1.evaluate(TestRuleAssertionsRequired.java:43)
[junit4:junit4]    > 	at org.apache.lucene.util.TestRuleMarkFailure$1.evaluate(TestRuleMarkFailure.java:48)
[junit4:junit4]    > 	at org.apache.lucene.util.TestRuleIgnoreAfterMaxFailures$1.evaluate(TestRuleIgnoreAfterMaxFailures.java:70)
[junit4:junit4]    > 	at org.apache.lucene.util.TestRuleIgnoreTestSuites$1.evaluate(TestRuleIgnoreTestSuites.java:55)
[junit4:junit4]    > 	at com.carrotsearch.randomizedtesting.rules.StatementAdapter.evaluate(StatementAdapter.java:36)
[junit4:junit4]    > 	at com.carrotsearch.randomizedtesting.ThreadLeakControl$StatementRunner.run(ThreadLeakControl.java:358)
[junit4:junit4]    > 	at java.lang.Thread.run(Thread.java:679)
[junit4:junit4]   2> 150864 T777 oas.SolrTestCaseJ4.deleteCore ###deleteCore
[junit4:junit4]   2> NOTE: test params are: codec=Lucene41: {range_facet_l=PostingsFormat(name=TestBloomFilteredLucene41Postings), text=PostingsFormat(name=MockSep), _version_=MockFixedIntBlock(blockSize=1676), rnd_b=PostingsFormat(name=NestedPulsing), intDefault=MockFixedIntBlock(blockSize=1676), id=PostingsFormat(name=NestedPulsing), timestamp=PostingsFormat(name=TestBloomFilteredLucene41Postings), a_t=PostingsFormat(name=TestBloomFilteredLucene41Postings), range_facet_sl=PostingsFormat(name=NestedPulsing), range_facet_si=PostingsFormat(name=TestBloomFilteredLucene41Postings), other_tl1=MockFixedIntBlock(blockSize=1676), multiDefault=PostingsFormat(name=TestBloomFilteredLucene41Postings), a_si=MockFixedIntBlock(blockSize=1676)}, sim=DefaultSimilarity, locale=ar_IQ, timezone=Etc/GMT+2
[junit4:junit4]   2> NOTE: FreeBSD 9.0-RELEASE amd64/Sun Microsystems Inc. 1.6.0_32 (64-bit)/cpus=16,threads=2,free=92223632,total=478937088
[junit4:junit4]   2> NOTE: All tests run in this JVM: [TestCollationField, TestSolrIndexConfig, TermsComponentTest, WordBreakSolrSpellCheckerTest, FileBasedSpellCheckerTest, TestDefaultSimilarityFactory, TestGroupingSearch, TestIBSimilarityFactory, TestCharFilters, TestXIncludeConfig, TestFaceting, SolrCmdDistributorTest, TestFuzzyAnalyzedSuggestions, ChaosMonkeyNothingIsSafeTest, TestSuggestSpellingConverter, SuggesterWFSTTest, UpdateRequestProcessorFactoryTest, TestFastOutputStream, TestPHPSerializedResponseWriter, TestPostingsSolrHighlighter, CoreAdminHandlerTest, TestElisionMultitermQuery, TestLMDirichletSimilarityFactory, AlternateDirectoryTest, TestBadConfig, FieldAnalysisRequestHandlerTest, DistributedSpellCheckComponentTest, SOLR749Test, LoggingHandlerTest, CurrencyFieldTest, PreAnalyzedFieldTest, BinaryUpdateRequestHandlerTest, SuggesterFSTTest, SystemInfoHandlerTest, JSONWriterTest, TestStressReorder, DirectUpdateHandlerOptimizeTest, DirectSolrConnectionTest, CacheHeaderTest, TestBinaryResponseWriter, ScriptEngineTest, ShardRoutingCustomTest, TestPerFieldSimilarity, TestFiltering, TestIndexSearcher, TestSystemIdResolver, ResourceLoaderTest, TestAtomicUpdateErrorCases, TestStressVersions, TestLMJelinekMercerSimilarityFactory, NoCacheHeaderTest, TestLuceneMatchVersion, SyncSliceTest]
[junit4:junit4] Completed on J0 in 150.88s, 1 test, 1 failure <<< FAILURES!

[...truncated 510 lines...]
BUILD FAILED
/usr/home/hudson/hudson-slave/workspace/Lucene-Solr-Tests-trunk-Java6/build.xml:344: The following error occurred while executing this line:
/usr/home/hudson/hudson-slave/workspace/Lucene-Solr-Tests-trunk-Java6/build.xml:39: The following error occurred while executing this line:
/usr/home/hudson/hudson-slave/workspace/Lucene-Solr-Tests-trunk-Java6/solr/build.xml:178: The following error occurred while executing this line:
/usr/home/hudson/hudson-slave/workspace/Lucene-Solr-Tests-trunk-Java6/solr/common-build.xml:428: The following error occurred while executing this line:
/usr/home/hudson/hudson-slave/workspace/Lucene-Solr-Tests-trunk-Java6/lucene/common-build.xml:1176: The following error occurred while executing this line:
/usr/home/hudson/hudson-slave/workspace/Lucene-Solr-Tests-trunk-Java6/lucene/common-build.xml:841: There were test failures: 247 suites, 1031 tests, 1 failure, 23 ignored (5 assumptions)

Total time: 33 minutes 4 seconds
Build step 'Invoke Ant' marked build as failure
Archiving artifacts
Recording test results
Email was triggered for: Failure
Sending email for trigger: Failure



Mime
View raw message