lucene-dev mailing list archives

Site index · List index
Message view « Date » · « Thread »
Top « Date » · « Thread »
From Apache Jenkins Server <jenk...@builds.apache.org>
Subject [JENKINS] Lucene-Solr-Tests-4.x-java7 - Build # 847 - Still Failing
Date Tue, 01 Jan 2013 08:08:15 GMT
Build: https://builds.apache.org/job/Lucene-Solr-Tests-4.x-java7/847/

1 tests failed.
FAILED:  org.apache.solr.cloud.SyncSliceTest.testDistribSearch

Error Message:
shard1 should have just been set up to be inconsistent - but it's still consistent

Stack Trace:
java.lang.AssertionError: shard1 should have just been set up to be inconsistent - but it's still consistent
	at __randomizedtesting.SeedInfo.seed([2AE5D85AAD84E9B1:AB035642DADB898D]:0)
	at org.junit.Assert.fail(Assert.java:93)
	at org.junit.Assert.assertTrue(Assert.java:43)
	at org.junit.Assert.assertNotNull(Assert.java:526)
	at org.apache.solr.cloud.SyncSliceTest.doTest(SyncSliceTest.java:214)
	at org.apache.solr.BaseDistributedSearchTestCase.testDistribSearch(BaseDistributedSearchTestCase.java:794)
	at sun.reflect.NativeMethodAccessorImpl.invoke0(Native Method)
	at sun.reflect.NativeMethodAccessorImpl.invoke(NativeMethodAccessorImpl.java:57)
	at sun.reflect.DelegatingMethodAccessorImpl.invoke(DelegatingMethodAccessorImpl.java:43)
	at java.lang.reflect.Method.invoke(Method.java:601)
	at com.carrotsearch.randomizedtesting.RandomizedRunner.invoke(RandomizedRunner.java:1559)
	at com.carrotsearch.randomizedtesting.RandomizedRunner.access$600(RandomizedRunner.java:79)
	at com.carrotsearch.randomizedtesting.RandomizedRunner$6.evaluate(RandomizedRunner.java:737)
	at com.carrotsearch.randomizedtesting.RandomizedRunner$7.evaluate(RandomizedRunner.java:773)
	at com.carrotsearch.randomizedtesting.RandomizedRunner$8.evaluate(RandomizedRunner.java:787)
	at com.carrotsearch.randomizedtesting.rules.SystemPropertiesRestoreRule$1.evaluate(SystemPropertiesRestoreRule.java:53)
	at org.apache.lucene.util.TestRuleSetupTeardownChained$1.evaluate(TestRuleSetupTeardownChained.java:50)
	at org.apache.lucene.util.TestRuleFieldCacheSanity$1.evaluate(TestRuleFieldCacheSanity.java:51)
	at org.apache.lucene.util.AbstractBeforeAfterRule$1.evaluate(AbstractBeforeAfterRule.java:46)
	at com.carrotsearch.randomizedtesting.rules.SystemPropertiesInvariantRule$1.evaluate(SystemPropertiesInvariantRule.java:55)
	at org.apache.lucene.util.TestRuleThreadAndTestName$1.evaluate(TestRuleThreadAndTestName.java:49)
	at org.apache.lucene.util.TestRuleIgnoreAfterMaxFailures$1.evaluate(TestRuleIgnoreAfterMaxFailures.java:70)
	at org.apache.lucene.util.TestRuleMarkFailure$1.evaluate(TestRuleMarkFailure.java:48)
	at com.carrotsearch.randomizedtesting.rules.StatementAdapter.evaluate(StatementAdapter.java:36)
	at com.carrotsearch.randomizedtesting.ThreadLeakControl$StatementRunner.run(ThreadLeakControl.java:358)
	at com.carrotsearch.randomizedtesting.ThreadLeakControl.forkTimeoutingTask(ThreadLeakControl.java:782)
	at com.carrotsearch.randomizedtesting.ThreadLeakControl$3.evaluate(ThreadLeakControl.java:442)
	at com.carrotsearch.randomizedtesting.RandomizedRunner.runSingleTest(RandomizedRunner.java:746)
	at com.carrotsearch.randomizedtesting.RandomizedRunner$3.evaluate(RandomizedRunner.java:648)
	at com.carrotsearch.randomizedtesting.RandomizedRunner$4.evaluate(RandomizedRunner.java:682)
	at com.carrotsearch.randomizedtesting.RandomizedRunner$5.evaluate(RandomizedRunner.java:693)
	at com.carrotsearch.randomizedtesting.rules.StatementAdapter.evaluate(StatementAdapter.java:36)
	at com.carrotsearch.randomizedtesting.rules.SystemPropertiesRestoreRule$1.evaluate(SystemPropertiesRestoreRule.java:53)
	at org.apache.lucene.util.AbstractBeforeAfterRule$1.evaluate(AbstractBeforeAfterRule.java:46)
	at org.apache.lucene.util.TestRuleStoreClassName$1.evaluate(TestRuleStoreClassName.java:42)
	at com.carrotsearch.randomizedtesting.rules.SystemPropertiesInvariantRule$1.evaluate(SystemPropertiesInvariantRule.java:55)
	at com.carrotsearch.randomizedtesting.rules.NoShadowingOrOverridesOnMethodsRule$1.evaluate(NoShadowingOrOverridesOnMethodsRule.java:39)
	at com.carrotsearch.randomizedtesting.rules.NoShadowingOrOverridesOnMethodsRule$1.evaluate(NoShadowingOrOverridesOnMethodsRule.java:39)
	at com.carrotsearch.randomizedtesting.rules.StatementAdapter.evaluate(StatementAdapter.java:36)
	at org.apache.lucene.util.TestRuleAssertionsRequired$1.evaluate(TestRuleAssertionsRequired.java:43)
	at org.apache.lucene.util.TestRuleMarkFailure$1.evaluate(TestRuleMarkFailure.java:48)
	at org.apache.lucene.util.TestRuleIgnoreAfterMaxFailures$1.evaluate(TestRuleIgnoreAfterMaxFailures.java:70)
	at org.apache.lucene.util.TestRuleIgnoreTestSuites$1.evaluate(TestRuleIgnoreTestSuites.java:55)
	at com.carrotsearch.randomizedtesting.rules.StatementAdapter.evaluate(StatementAdapter.java:36)
	at com.carrotsearch.randomizedtesting.ThreadLeakControl$StatementRunner.run(ThreadLeakControl.java:358)
	at java.lang.Thread.run(Thread.java:722)




Build Log:
[...truncated 8977 lines...]
[junit4:junit4] Suite: org.apache.solr.cloud.SyncSliceTest
[junit4:junit4]   2> 0 T1190 oas.BaseDistributedSearchTestCase.initHostContext Setting hostContext system property: /
[junit4:junit4]   2> 4 T1190 oas.SolrTestCaseJ4.setUp ###Starting testDistribSearch
[junit4:junit4]   2> Creating dataDir: /usr/home/hudson/hudson-slave/workspace/Lucene-Solr-Tests-4.x-java7/solr/build/solr-core/test/J0/./solrtest-SyncSliceTest-1357026660116
[junit4:junit4]   2> 5 T1190 oasc.ZkTestServer.run STARTING ZK TEST SERVER
[junit4:junit4]   2> 6 T1191 oasc.ZkTestServer$ZKServerMain.runFromConfig Starting server
[junit4:junit4]   2> 9 T1191 oazs.ZooKeeperServer.setTickTime tickTime set to 1000
[junit4:junit4]   2> 9 T1191 oazs.ZooKeeperServer.setMinSessionTimeout minSessionTimeout set to -1
[junit4:junit4]   2> 9 T1191 oazs.ZooKeeperServer.setMaxSessionTimeout maxSessionTimeout set to -1
[junit4:junit4]   2> 10 T1191 oazs.NIOServerCnxnFactory.configure binding to port 0.0.0.0/0.0.0.0:0
[junit4:junit4]   2> 11 T1191 oazsp.FileTxnSnapLog.save Snapshotting: 0x0 to /usr/home/hudson/hudson-slave/workspace/Lucene-Solr-Tests-4.x-java7/solr/build/solr-core/test/J0/./org.apache.solr.cloud.SyncSliceTest-1357026660116/zookeeper/server1/data/version-2/snapshot.0
[junit4:junit4]   2> 107 T1190 oasc.ZkTestServer.run start zk server on port:55150
[junit4:junit4]   2> 107 T1190 oaz.ZooKeeper.<init> Initiating client connection, connectString=127.0.0.1:55150 sessionTimeout=10000 watcher=org.apache.solr.common.cloud.ConnectionManager@1c25995f
[junit4:junit4]   2> 108 T1190 oascc.ConnectionManager.waitForConnected Waiting for client to connect to ZooKeeper
[junit4:junit4]   2> 108 T1196 oaz.ClientCnxn$SendThread.logStartConnect Opening socket connection to server localhost/127.0.0.1:55150. Will not attempt to authenticate using SASL (access denied ("javax.security.auth.AuthPermission" "getLoginConfiguration"))
[junit4:junit4]   2> 109 T1196 oaz.ClientCnxn$SendThread.primeConnection Socket connection established to localhost/127.0.0.1:55150, initiating session
[junit4:junit4]   2> 109 T1192 oazs.NIOServerCnxnFactory.run Accepted socket connection from /140.211.11.196:55151
[junit4:junit4]   2> 109 T1192 oazs.ZooKeeperServer.processConnectRequest Client attempting to establish new session at /140.211.11.196:55151
[junit4:junit4]   2> 109 T1194 oazsp.FileTxnLog.append Creating new log file: log.1
[junit4:junit4]   2> 114 T1194 oazs.ZooKeeperServer.finishSessionInit Established session 0x13bf5178f1b0000 with negotiated timeout 10000 for client /140.211.11.196:55151
[junit4:junit4]   2> 114 T1196 oaz.ClientCnxn$SendThread.onConnected Session establishment complete on server localhost/127.0.0.1:55150, sessionid = 0x13bf5178f1b0000, negotiated timeout = 10000
[junit4:junit4]   2> 114 T1197 oascc.ConnectionManager.process Watcher org.apache.solr.common.cloud.ConnectionManager@1c25995f name:ZooKeeperConnection Watcher:127.0.0.1:55150 got event WatchedEvent state:SyncConnected type:None path:null path:null type:None
[junit4:junit4]   2> 115 T1190 oascc.ConnectionManager.waitForConnected Client is connected to ZooKeeper
[junit4:junit4]   2> 115 T1190 oascc.SolrZkClient.makePath makePath: /solr
[junit4:junit4]   2> 118 T1195 oazs.PrepRequestProcessor.pRequest2Txn Processed session termination for sessionid: 0x13bf5178f1b0000
[junit4:junit4]   2> 119 T1197 oaz.ClientCnxn$EventThread.run EventThread shut down
[junit4:junit4]   2> 119 T1190 oaz.ZooKeeper.close Session: 0x13bf5178f1b0000 closed
[junit4:junit4]   2> 119 T1192 oazs.NIOServerCnxn.closeSock Closed socket connection for client /140.211.11.196:55151 which had sessionid 0x13bf5178f1b0000
[junit4:junit4]   2> 120 T1190 oaz.ZooKeeper.<init> Initiating client connection, connectString=127.0.0.1:55150/solr sessionTimeout=10000 watcher=org.apache.solr.common.cloud.ConnectionManager@233a7853
[junit4:junit4]   2> 121 T1190 oascc.ConnectionManager.waitForConnected Waiting for client to connect to ZooKeeper
[junit4:junit4]   2> 121 T1198 oaz.ClientCnxn$SendThread.logStartConnect Opening socket connection to server localhost/127.0.0.1:55150. Will not attempt to authenticate using SASL (access denied ("javax.security.auth.AuthPermission" "getLoginConfiguration"))
[junit4:junit4]   2> 121 T1198 oaz.ClientCnxn$SendThread.primeConnection Socket connection established to localhost/127.0.0.1:55150, initiating session
[junit4:junit4]   2> 121 T1192 oazs.NIOServerCnxnFactory.run Accepted socket connection from /140.211.11.196:55152
[junit4:junit4]   2> 122 T1192 oazs.ZooKeeperServer.processConnectRequest Client attempting to establish new session at /140.211.11.196:55152
[junit4:junit4]   2> 128 T1194 oazs.ZooKeeperServer.finishSessionInit Established session 0x13bf5178f1b0001 with negotiated timeout 10000 for client /140.211.11.196:55152
[junit4:junit4]   2> 128 T1198 oaz.ClientCnxn$SendThread.onConnected Session establishment complete on server localhost/127.0.0.1:55150, sessionid = 0x13bf5178f1b0001, negotiated timeout = 10000
[junit4:junit4]   2> 128 T1199 oascc.ConnectionManager.process Watcher org.apache.solr.common.cloud.ConnectionManager@233a7853 name:ZooKeeperConnection Watcher:127.0.0.1:55150/solr got event WatchedEvent state:SyncConnected type:None path:null path:null type:None
[junit4:junit4]   2> 129 T1190 oascc.ConnectionManager.waitForConnected Client is connected to ZooKeeper
[junit4:junit4]   2> 129 T1190 oascc.SolrZkClient.makePath makePath: /collections/collection1
[junit4:junit4]   2> 133 T1190 oascc.SolrZkClient.makePath makePath: /collections/collection1/shards
[junit4:junit4]   2> 142 T1190 oascc.SolrZkClient.makePath makePath: /collections/control_collection
[junit4:junit4]   2> 144 T1190 oascc.SolrZkClient.makePath makePath: /collections/control_collection/shards
[junit4:junit4]   2> 146 T1190 oasc.AbstractZkTestCase.putConfig put /usr/home/hudson/hudson-slave/workspace/Lucene-Solr-Tests-4.x-java7/solr/build/solr-core/test-files/solr/collection1/conf/solrconfig.xml to /configs/conf1/solrconfig.xml
[junit4:junit4]   2> 147 T1190 oascc.SolrZkClient.makePath makePath: /configs/conf1/solrconfig.xml
[junit4:junit4]   2> 159 T1190 oasc.AbstractZkTestCase.putConfig put /usr/home/hudson/hudson-slave/workspace/Lucene-Solr-Tests-4.x-java7/solr/build/solr-core/test-files/solr/collection1/conf/schema.xml to /configs/conf1/schema.xml
[junit4:junit4]   2> 159 T1190 oascc.SolrZkClient.makePath makePath: /configs/conf1/schema.xml
[junit4:junit4]   2> 168 T1190 oasc.AbstractZkTestCase.putConfig put /usr/home/hudson/hudson-slave/workspace/Lucene-Solr-Tests-4.x-java7/solr/build/solr-core/test-files/solr/collection1/conf/stopwords.txt to /configs/conf1/stopwords.txt
[junit4:junit4]   2> 169 T1190 oascc.SolrZkClient.makePath makePath: /configs/conf1/stopwords.txt
[junit4:junit4]   2> 172 T1190 oasc.AbstractZkTestCase.putConfig put /usr/home/hudson/hudson-slave/workspace/Lucene-Solr-Tests-4.x-java7/solr/build/solr-core/test-files/solr/collection1/conf/protwords.txt to /configs/conf1/protwords.txt
[junit4:junit4]   2> 173 T1190 oascc.SolrZkClient.makePath makePath: /configs/conf1/protwords.txt
[junit4:junit4]   2> 176 T1190 oasc.AbstractZkTestCase.putConfig put /usr/home/hudson/hudson-slave/workspace/Lucene-Solr-Tests-4.x-java7/solr/build/solr-core/test-files/solr/collection1/conf/currency.xml to /configs/conf1/currency.xml
[junit4:junit4]   2> 176 T1190 oascc.SolrZkClient.makePath makePath: /configs/conf1/currency.xml
[junit4:junit4]   2> 184 T1190 oasc.AbstractZkTestCase.putConfig put /usr/home/hudson/hudson-slave/workspace/Lucene-Solr-Tests-4.x-java7/solr/build/solr-core/test-files/solr/collection1/conf/open-exchange-rates.json to /configs/conf1/open-exchange-rates.json
[junit4:junit4]   2> 185 T1190 oascc.SolrZkClient.makePath makePath: /configs/conf1/open-exchange-rates.json
[junit4:junit4]   2> 188 T1190 oasc.AbstractZkTestCase.putConfig put /usr/home/hudson/hudson-slave/workspace/Lucene-Solr-Tests-4.x-java7/solr/build/solr-core/test-files/solr/collection1/conf/mapping-ISOLatin1Accent.txt to /configs/conf1/mapping-ISOLatin1Accent.txt
[junit4:junit4]   2> 188 T1190 oascc.SolrZkClient.makePath makePath: /configs/conf1/mapping-ISOLatin1Accent.txt
[junit4:junit4]   2> 192 T1190 oasc.AbstractZkTestCase.putConfig put /usr/home/hudson/hudson-slave/workspace/Lucene-Solr-Tests-4.x-java7/solr/build/solr-core/test-files/solr/collection1/conf/old_synonyms.txt to /configs/conf1/old_synonyms.txt
[junit4:junit4]   2> 192 T1190 oascc.SolrZkClient.makePath makePath: /configs/conf1/old_synonyms.txt
[junit4:junit4]   2> 195 T1190 oasc.AbstractZkTestCase.putConfig put /usr/home/hudson/hudson-slave/workspace/Lucene-Solr-Tests-4.x-java7/solr/build/solr-core/test-files/solr/collection1/conf/synonyms.txt to /configs/conf1/synonyms.txt
[junit4:junit4]   2> 196 T1190 oascc.SolrZkClient.makePath makePath: /configs/conf1/synonyms.txt
[junit4:junit4]   2> 199 T1195 oazs.PrepRequestProcessor.pRequest2Txn Processed session termination for sessionid: 0x13bf5178f1b0001
[junit4:junit4]   2> 206 T1199 oaz.ClientCnxn$EventThread.run EventThread shut down
[junit4:junit4]   2> 205 T1190 oaz.ZooKeeper.close Session: 0x13bf5178f1b0001 closed
[junit4:junit4]   2> 206 T1192 oazs.NIOServerCnxn.closeSock Closed socket connection for client /140.211.11.196:55152 which had sessionid 0x13bf5178f1b0001
[junit4:junit4]   2> 317 T1190 oejs.Server.doStart jetty-8.1.8.v20121106
[junit4:junit4]   2> 320 T1190 oejs.AbstractConnector.doStart Started SocketConnector@127.0.0.1:55153
[junit4:junit4]   2> 321 T1190 oasc.SolrResourceLoader.locateSolrHome JNDI not configured for solr (NoInitialContextEx)
[junit4:junit4]   2> 321 T1190 oasc.SolrResourceLoader.locateSolrHome using system property solr.solr.home: /usr/home/hudson/hudson-slave/workspace/Lucene-Solr-Tests-4.x-java7/solr/build/solr-core/test/J0/./org.apache.solr.cloud.SyncSliceTest-controljetty-1357026660317
[junit4:junit4]   2> 322 T1190 oasc.SolrResourceLoader.<init> new SolrResourceLoader for deduced Solr Home: '/usr/home/hudson/hudson-slave/workspace/Lucene-Solr-Tests-4.x-java7/solr/build/solr-core/test/J0/./org.apache.solr.cloud.SyncSliceTest-controljetty-1357026660317/'
[junit4:junit4]   2> 351 T1190 oass.SolrDispatchFilter.init SolrDispatchFilter.init()
[junit4:junit4]   2> 351 T1190 oasc.SolrResourceLoader.locateSolrHome JNDI not configured for solr (NoInitialContextEx)
[junit4:junit4]   2> 352 T1190 oasc.SolrResourceLoader.locateSolrHome using system property solr.solr.home: /usr/home/hudson/hudson-slave/workspace/Lucene-Solr-Tests-4.x-java7/solr/build/solr-core/test/J0/./org.apache.solr.cloud.SyncSliceTest-controljetty-1357026660317
[junit4:junit4]   2> 352 T1190 oasc.CoreContainer$Initializer.initialize looking for solr.xml: /usr/home/hudson/hudson-slave/workspace/Lucene-Solr-Tests-4.x-java7/solr/build/solr-core/test/J0/./org.apache.solr.cloud.SyncSliceTest-controljetty-1357026660317/solr.xml
[junit4:junit4]   2> 352 T1190 oasc.CoreContainer.<init> New CoreContainer 583592988
[junit4:junit4]   2> 353 T1190 oasc.CoreContainer.load Loading CoreContainer using Solr Home: '/usr/home/hudson/hudson-slave/workspace/Lucene-Solr-Tests-4.x-java7/solr/build/solr-core/test/J0/./org.apache.solr.cloud.SyncSliceTest-controljetty-1357026660317/'
[junit4:junit4]   2> 353 T1190 oasc.SolrResourceLoader.<init> new SolrResourceLoader for directory: '/usr/home/hudson/hudson-slave/workspace/Lucene-Solr-Tests-4.x-java7/solr/build/solr-core/test/J0/./org.apache.solr.cloud.SyncSliceTest-controljetty-1357026660317/'
[junit4:junit4]   2> 375 T1190 oashc.HttpShardHandlerFactory.getParameter Setting socketTimeout to: 30000
[junit4:junit4]   2> 375 T1190 oashc.HttpShardHandlerFactory.getParameter Setting urlScheme to: http://
[junit4:junit4]   2> 376 T1190 oashc.HttpShardHandlerFactory.getParameter Setting connTimeout to: 15000
[junit4:junit4]   2> 376 T1190 oashc.HttpShardHandlerFactory.getParameter Setting maxConnectionsPerHost to: 20
[junit4:junit4]   2> 376 T1190 oashc.HttpShardHandlerFactory.getParameter Setting corePoolSize to: 0
[junit4:junit4]   2> 376 T1190 oashc.HttpShardHandlerFactory.getParameter Setting maximumPoolSize to: 2147483647
[junit4:junit4]   2> 377 T1190 oashc.HttpShardHandlerFactory.getParameter Setting maxThreadIdleTime to: 5
[junit4:junit4]   2> 377 T1190 oashc.HttpShardHandlerFactory.getParameter Setting sizeOfQueue to: -1
[junit4:junit4]   2> 377 T1190 oashc.HttpShardHandlerFactory.getParameter Setting fairnessPolicy to: false
[junit4:junit4]   2> 378 T1190 oascsi.HttpClientUtil.createClient Creating new http client, config:maxConnectionsPerHost=20&maxConnections=10000&socketTimeout=30000&connTimeout=15000&retry=false
[junit4:junit4]   2> 393 T1190 oasc.CoreContainer.load Registering Log Listener
[junit4:junit4]   2> 408 T1190 oasc.CoreContainer.initZooKeeper Zookeeper client=127.0.0.1:55150/solr
[junit4:junit4]   2> 409 T1190 oasc.ZkController.checkChrootPath zkHost includes chroot
[junit4:junit4]   2> 409 T1190 oaz.ZooKeeper.<init> Initiating client connection, connectString=127.0.0.1:55150 sessionTimeout=60000 watcher=org.apache.solr.common.cloud.ConnectionManager@3f1f571b
[junit4:junit4]   2> 410 T1190 oascc.ConnectionManager.waitForConnected Waiting for client to connect to ZooKeeper
[junit4:junit4]   2> 410 T1209 oaz.ClientCnxn$SendThread.logStartConnect Opening socket connection to server localhost/127.0.0.1:55150. Will not attempt to authenticate using SASL (access denied ("javax.security.auth.AuthPermission" "getLoginConfiguration"))
[junit4:junit4]   2> 411 T1209 oaz.ClientCnxn$SendThread.primeConnection Socket connection established to localhost/127.0.0.1:55150, initiating session
[junit4:junit4]   2> 411 T1192 oazs.NIOServerCnxnFactory.run Accepted socket connection from /140.211.11.196:55154
[junit4:junit4]   2> 412 T1192 oazs.ZooKeeperServer.processConnectRequest Client attempting to establish new session at /140.211.11.196:55154
[junit4:junit4]   2> 413 T1194 oazs.ZooKeeperServer.finishSessionInit Established session 0x13bf5178f1b0002 with negotiated timeout 20000 for client /140.211.11.196:55154
[junit4:junit4]   2> 413 T1209 oaz.ClientCnxn$SendThread.onConnected Session establishment complete on server localhost/127.0.0.1:55150, sessionid = 0x13bf5178f1b0002, negotiated timeout = 20000
[junit4:junit4]   2> 414 T1210 oascc.ConnectionManager.process Watcher org.apache.solr.common.cloud.ConnectionManager@3f1f571b name:ZooKeeperConnection Watcher:127.0.0.1:55150 got event WatchedEvent state:SyncConnected type:None path:null path:null type:None
[junit4:junit4]   2> 414 T1190 oascc.ConnectionManager.waitForConnected Client is connected to ZooKeeper
[junit4:junit4]   2> 415 T1195 oazs.PrepRequestProcessor.pRequest2Txn Processed session termination for sessionid: 0x13bf5178f1b0002
[junit4:junit4]   2> 417 T1210 oaz.ClientCnxn$EventThread.run EventThread shut down
[junit4:junit4]   2> 417 T1190 oaz.ZooKeeper.close Session: 0x13bf5178f1b0002 closed
[junit4:junit4]   2> 417 T1192 oazs.NIOServerCnxn.doIO WARNING caught end of stream exception EndOfStreamException: Unable to read additional data from client sessionid 0x13bf5178f1b0002, likely client has closed socket
[junit4:junit4]   2> 	at org.apache.zookeeper.server.NIOServerCnxn.doIO(NIOServerCnxn.java:220)
[junit4:junit4]   2> 	at org.apache.zookeeper.server.NIOServerCnxnFactory.run(NIOServerCnxnFactory.java:208)
[junit4:junit4]   2> 	at java.lang.Thread.run(Thread.java:722)
[junit4:junit4]   2> 
[junit4:junit4]   2> 417 T1190 oascsi.HttpClientUtil.createClient Creating new http client, config:maxConnections=500&maxConnectionsPerHost=16&socketTimeout=15000&connTimeout=30000
[junit4:junit4]   2> 418 T1192 oazs.NIOServerCnxn.closeSock Closed socket connection for client /140.211.11.196:55154 which had sessionid 0x13bf5178f1b0002
[junit4:junit4]   2> 425 T1190 oaz.ZooKeeper.<init> Initiating client connection, connectString=127.0.0.1:55150/solr sessionTimeout=30000 watcher=org.apache.solr.common.cloud.ConnectionManager@5922439
[junit4:junit4]   2> 426 T1190 oascc.ConnectionManager.waitForConnected Waiting for client to connect to ZooKeeper
[junit4:junit4]   2> 426 T1211 oaz.ClientCnxn$SendThread.logStartConnect Opening socket connection to server localhost/127.0.0.1:55150. Will not attempt to authenticate using SASL (access denied ("javax.security.auth.AuthPermission" "getLoginConfiguration"))
[junit4:junit4]   2> 427 T1211 oaz.ClientCnxn$SendThread.primeConnection Socket connection established to localhost/127.0.0.1:55150, initiating session
[junit4:junit4]   2> 427 T1192 oazs.NIOServerCnxnFactory.run Accepted socket connection from /140.211.11.196:55155
[junit4:junit4]   2> 428 T1192 oazs.ZooKeeperServer.processConnectRequest Client attempting to establish new session at /140.211.11.196:55155
[junit4:junit4]   2> 429 T1194 oazs.ZooKeeperServer.finishSessionInit Established session 0x13bf5178f1b0003 with negotiated timeout 20000 for client /140.211.11.196:55155
[junit4:junit4]   2> 429 T1211 oaz.ClientCnxn$SendThread.onConnected Session establishment complete on server localhost/127.0.0.1:55150, sessionid = 0x13bf5178f1b0003, negotiated timeout = 20000
[junit4:junit4]   2> 429 T1212 oascc.ConnectionManager.process Watcher org.apache.solr.common.cloud.ConnectionManager@5922439 name:ZooKeeperConnection Watcher:127.0.0.1:55150/solr got event WatchedEvent state:SyncConnected type:None path:null path:null type:None
[junit4:junit4]   2> 429 T1190 oascc.ConnectionManager.waitForConnected Client is connected to ZooKeeper
[junit4:junit4]   2> 431 T1195 oazs.PrepRequestProcessor.pRequest Got user-level KeeperException when processing sessionid:0x13bf5178f1b0003 type:create cxid:0x2 zxid:0x1a txntype:-1 reqpath:n/a Error Path:/solr/overseer Error:KeeperErrorCode = NodeExists for /solr/overseer
[junit4:junit4]   2> 440 T1190 oascc.SolrZkClient.makePath makePath: /live_nodes
[junit4:junit4]   2> 442 T1190 oasc.ZkController.createEphemeralLiveNode Register node as live in ZooKeeper:/live_nodes/127.0.0.1:55153_
[junit4:junit4]   2> 443 T1195 oazs.PrepRequestProcessor.pRequest Got user-level KeeperException when processing sessionid:0x13bf5178f1b0003 type:delete cxid:0x7 zxid:0x1c txntype:-1 reqpath:n/a Error Path:/solr/live_nodes/127.0.0.1:55153_ Error:KeeperErrorCode = NoNode for /solr/live_nodes/127.0.0.1:55153_
[junit4:junit4]   2> 444 T1190 oascc.SolrZkClient.makePath makePath: /live_nodes/127.0.0.1:55153_
[junit4:junit4]   2> 454 T1190 oascc.SolrZkClient.makePath makePath: /overseer_elect/election
[junit4:junit4]   2> 466 T1195 oazs.PrepRequestProcessor.pRequest Got user-level KeeperException when processing sessionid:0x13bf5178f1b0003 type:delete cxid:0x15 zxid:0x21 txntype:-1 reqpath:n/a Error Path:/solr/overseer_elect/leader Error:KeeperErrorCode = NoNode for /solr/overseer_elect/leader
[junit4:junit4]   2> 467 T1190 oascc.SolrZkClient.makePath makePath: /overseer_elect/leader
[junit4:junit4]   2> 469 T1190 oasc.Overseer.start Overseer (id=88934099197820931-127.0.0.1:55153_-n_0000000000) starting
[junit4:junit4]   2> 470 T1195 oazs.PrepRequestProcessor.pRequest Got user-level KeeperException when processing sessionid:0x13bf5178f1b0003 type:create cxid:0x1a zxid:0x23 txntype:-1 reqpath:n/a Error Path:/solr/overseer Error:KeeperErrorCode = NodeExists for /solr/overseer
[junit4:junit4]   2> 471 T1195 oazs.PrepRequestProcessor.pRequest Got user-level KeeperException when processing sessionid:0x13bf5178f1b0003 type:create cxid:0x1b zxid:0x24 txntype:-1 reqpath:n/a Error Path:/solr/overseer Error:KeeperErrorCode = NodeExists for /solr/overseer
[junit4:junit4]   2> 480 T1195 oazs.PrepRequestProcessor.pRequest Got user-level KeeperException when processing sessionid:0x13bf5178f1b0003 type:create cxid:0x1c zxid:0x25 txntype:-1 reqpath:n/a Error Path:/solr/overseer Error:KeeperErrorCode = NodeExists for /solr/overseer
[junit4:junit4]   2> 481 T1195 oazs.PrepRequestProcessor.pRequest Got user-level KeeperException when processing sessionid:0x13bf5178f1b0003 type:create cxid:0x1d zxid:0x26 txntype:-1 reqpath:n/a Error Path:/solr/overseer Error:KeeperErrorCode = NodeExists for /solr/overseer
[junit4:junit4]   2> 482 T1214 oasc.OverseerCollectionProcessor.run Process current queue of collection messages
[junit4:junit4]   2> 483 T1190 oascc.SolrZkClient.makePath makePath: /clusterstate.json
[junit4:junit4]   2> 491 T1190 oascc.ZkStateReader.createClusterStateWatchersAndUpdate Updating cluster state from ZooKeeper... 
[junit4:junit4]   2> 496 T1215 oasc.CoreContainer.create Creating SolrCore 'collection1' using instanceDir: /usr/home/hudson/hudson-slave/workspace/Lucene-Solr-Tests-4.x-java7/solr/build/solr-core/test/J0/./org.apache.solr.cloud.SyncSliceTest-controljetty-1357026660317/collection1
[junit4:junit4]   2> 496 T1213 oasc.Overseer$ClusterStateUpdater.run Starting to work on the main queue
[junit4:junit4]   2> 496 T1215 oasc.ZkController.createCollectionZkNode Check for collection zkNode:control_collection
[junit4:junit4]   2> 497 T1215 oasc.ZkController.createCollectionZkNode Collection zkNode exists
[junit4:junit4]   2> 497 T1215 oasc.ZkController.readConfigName Load collection config from:/collections/control_collection
[junit4:junit4]   2> 498 T1215 oasc.SolrResourceLoader.<init> new SolrResourceLoader for directory: '/usr/home/hudson/hudson-slave/workspace/Lucene-Solr-Tests-4.x-java7/solr/build/solr-core/test/J0/./org.apache.solr.cloud.SyncSliceTest-controljetty-1357026660317/collection1/'
[junit4:junit4]   2> 500 T1215 oasc.SolrResourceLoader.replaceClassLoader Adding 'file:/usr/home/hudson/hudson-slave/workspace/Lucene-Solr-Tests-4.x-java7/solr/build/solr-core/test/J0/org.apache.solr.cloud.SyncSliceTest-controljetty-1357026660317/collection1/lib/classes/' to classloader
[junit4:junit4]   2> 500 T1215 oasc.SolrResourceLoader.replaceClassLoader Adding 'file:/usr/home/hudson/hudson-slave/workspace/Lucene-Solr-Tests-4.x-java7/solr/build/solr-core/test/J0/org.apache.solr.cloud.SyncSliceTest-controljetty-1357026660317/collection1/lib/README' to classloader
[junit4:junit4]   2> 553 T1215 oasc.SolrConfig.<init> Using Lucene MatchVersion: LUCENE_41
[junit4:junit4]   2> 623 T1215 oasc.SolrConfig.<init> Loaded SolrConfig: solrconfig.xml
[junit4:junit4]   2> 624 T1215 oass.IndexSchema.readSchema Reading Solr Schema
[junit4:junit4]   2> 630 T1215 oass.IndexSchema.readSchema Schema name=test
[junit4:junit4]   2> 1256 T1215 oass.OpenExchangeRatesOrgProvider.init Initialized with rates=open-exchange-rates.json, refreshInterval=1440.
[junit4:junit4]   2> 1266 T1215 oass.IndexSchema.readSchema default search field in schema is text
[junit4:junit4]   2> 1270 T1215 oass.IndexSchema.readSchema unique key field: id
[junit4:junit4]   2> 1284 T1215 oass.FileExchangeRateProvider.reload Reloading exchange rates from file currency.xml
[junit4:junit4]   2> 1289 T1215 oass.FileExchangeRateProvider.reload Reloading exchange rates from file currency.xml
[junit4:junit4]   2> 1293 T1215 oass.OpenExchangeRatesOrgProvider.reload Reloading exchange rates from open-exchange-rates.json
[junit4:junit4]   2> 1294 T1215 oass.OpenExchangeRatesOrgProvider.reload Reloading exchange rates from open-exchange-rates.json
[junit4:junit4]   2> 1296 T1215 oasc.SolrCore.<init> [collection1] Opening new SolrCore at /usr/home/hudson/hudson-slave/workspace/Lucene-Solr-Tests-4.x-java7/solr/build/solr-core/test/J0/./org.apache.solr.cloud.SyncSliceTest-controljetty-1357026660317/collection1/, dataDir=./org.apache.solr.cloud.SyncSliceTest-1357026660116/control/data/
[junit4:junit4]   2> 1296 T1215 oasc.JmxMonitoredMap.<init> JMX monitoring is enabled. Adding Solr mbeans to JMX Server: com.sun.jmx.mbeanserver.JmxMBeanServer@4e810bca
[junit4:junit4]   2> 1297 T1215 oasc.SolrCore.initDirectoryFactory solr.NRTCachingDirectoryFactory
[junit4:junit4]   2> 1298 T1215 oasc.CachingDirectoryFactory.get return new directory for /usr/home/hudson/hudson-slave/workspace/Lucene-Solr-Tests-4.x-java7/solr/build/solr-core/test/J0/./org.apache.solr.cloud.SyncSliceTest-1357026660116/control/data forceNew:false
[junit4:junit4]   2> 1298 T1215 oasc.CachingDirectoryFactory.close Releasing directory:/usr/home/hudson/hudson-slave/workspace/Lucene-Solr-Tests-4.x-java7/solr/build/solr-core/test/J0/./org.apache.solr.cloud.SyncSliceTest-1357026660116/control/data
[junit4:junit4]   2> 1299 T1215 oasc.SolrCore.getNewIndexDir New index directory detected: old=null new=./org.apache.solr.cloud.SyncSliceTest-1357026660116/control/data/index/
[junit4:junit4]   2> 1299 T1215 oasc.SolrCore.initIndex WARNING [collection1] Solr index directory './org.apache.solr.cloud.SyncSliceTest-1357026660116/control/data/index' doesn't exist. Creating new index...
[junit4:junit4]   2> 1301 T1215 oasc.CachingDirectoryFactory.get return new directory for /usr/home/hudson/hudson-slave/workspace/Lucene-Solr-Tests-4.x-java7/solr/build/solr-core/test/J0/./org.apache.solr.cloud.SyncSliceTest-1357026660116/control/data/index forceNew:false
[junit4:junit4]   2> 1333 T1215 oasc.SolrDeletionPolicy.onCommit SolrDeletionPolicy.onCommit: commits:num=1
[junit4:junit4]   2> 		commit{dir=RateLimitedDirectoryWrapper(NRTCachingDirectory(org.apache.lucene.store.NIOFSDirectory@/usr/home/hudson/hudson-slave/workspace/Lucene-Solr-Tests-4.x-java7/solr/build/solr-core/test/J0/org.apache.solr.cloud.SyncSliceTest-1357026660116/control/data/index lockFactory=org.apache.lucene.store.NativeFSLockFactory@42f5874c; maxCacheMB=48.0 maxMergeSizeMB=4.0)),segFN=segments_1,generation=1,filenames=[segments_1]
[junit4:junit4]   2> 1333 T1215 oasc.SolrDeletionPolicy.updateCommits newest commit = 1[segments_1]
[junit4:junit4]   2> 1334 T1215 oasc.CachingDirectoryFactory.close Releasing directory:/usr/home/hudson/hudson-slave/workspace/Lucene-Solr-Tests-4.x-java7/solr/build/solr-core/test/J0/./org.apache.solr.cloud.SyncSliceTest-1357026660116/control/data/index
[junit4:junit4]   2> 1334 T1215 oasc.SolrCore.initWriters created xml: solr.XMLResponseWriter
[junit4:junit4]   2> 1336 T1215 oasup.UpdateRequestProcessorChain.init inserting DistributedUpdateProcessorFactory into updateRequestProcessorChain "dedupe"
[junit4:junit4]   2> 1337 T1215 oasup.UpdateRequestProcessorChain.init inserting DistributedUpdateProcessorFactory into updateRequestProcessorChain "dedupe-allfields"
[junit4:junit4]   2> 1337 T1215 oasup.UpdateRequestProcessorChain.init inserting DistributedUpdateProcessorFactory into updateRequestProcessorChain "stored_sig"
[junit4:junit4]   2> 1337 T1215 oasup.UpdateRequestProcessorChain.init inserting DistributedUpdateProcessorFactory into updateRequestProcessorChain "uniq-fields"
[junit4:junit4]   2> 1338 T1215 oasup.UpdateRequestProcessorChain.init inserting DistributedUpdateProcessorFactory into updateRequestProcessorChain "distrib-dup-test-chain-implicit"
[junit4:junit4]   2> 1338 T1215 oasc.RequestHandlers.initHandlersFromConfig adding lazy requestHandler: solr.ReplicationHandler
[junit4:junit4]   2> 1339 T1215 oasc.RequestHandlers.initHandlersFromConfig created /replication: solr.ReplicationHandler
[junit4:junit4]   2> 1339 T1215 oasc.RequestHandlers.initHandlersFromConfig created standard: solr.StandardRequestHandler
[junit4:junit4]   2> 1339 T1215 oasc.RequestHandlers.initHandlersFromConfig created /get: solr.RealTimeGetHandler
[junit4:junit4]   2> 1340 T1215 oasc.RequestHandlers.initHandlersFromConfig created dismax: solr.SearchHandler
[junit4:junit4]   2> 1340 T1215 oasc.RequestHandlers.initHandlersFromConfig created mock: org.apache.solr.core.MockQuerySenderListenerReqHandler
[junit4:junit4]   2> 1341 T1215 oasc.RequestHandlers.initHandlersFromConfig created /admin/: org.apache.solr.handler.admin.AdminHandlers
[junit4:junit4]   2> 1341 T1215 oasc.RequestHandlers.initHandlersFromConfig created defaults: solr.StandardRequestHandler
[junit4:junit4]   2> 1341 T1215 oasc.RequestHandlers.initHandlersFromConfig adding lazy requestHandler: solr.StandardRequestHandler
[junit4:junit4]   2> 1342 T1215 oasc.RequestHandlers.initHandlersFromConfig created lazy: solr.StandardRequestHandler
[junit4:junit4]   2> 1342 T1215 oasc.RequestHandlers.initHandlersFromConfig created /update: solr.UpdateRequestHandler
[junit4:junit4]   2> 1342 T1215 oasc.RequestHandlers.initHandlersFromConfig created /terms: org.apache.solr.handler.component.SearchHandler
[junit4:junit4]   2> 1343 T1215 oasc.RequestHandlers.initHandlersFromConfig created spellCheckCompRH: org.apache.solr.handler.component.SearchHandler
[junit4:junit4]   2> 1343 T1215 oasc.RequestHandlers.initHandlersFromConfig created spellCheckCompRH_Direct: org.apache.solr.handler.component.SearchHandler
[junit4:junit4]   2> 1344 T1215 oasc.RequestHandlers.initHandlersFromConfig created spellCheckWithWordbreak: org.apache.solr.handler.component.SearchHandler
[junit4:junit4]   2> 1344 T1215 oasc.RequestHandlers.initHandlersFromConfig created spellCheckWithWordbreak_Direct: org.apache.solr.handler.component.SearchHandler
[junit4:junit4]   2> 1344 T1215 oasc.RequestHandlers.initHandlersFromConfig created spellCheckCompRH1: org.apache.solr.handler.component.SearchHandler
[junit4:junit4]   2> 1345 T1215 oasc.RequestHandlers.initHandlersFromConfig created mltrh: org.apache.solr.handler.component.SearchHandler
[junit4:junit4]   2> 1345 T1215 oasc.RequestHandlers.initHandlersFromConfig created tvrh: org.apache.solr.handler.component.SearchHandler
[junit4:junit4]   2> 1346 T1215 oasc.RequestHandlers.initHandlersFromConfig created /mlt: solr.MoreLikeThisHandler
[junit4:junit4]   2> 1346 T1215 oasc.RequestHandlers.initHandlersFromConfig created /debug/dump: solr.DumpRequestHandler
[junit4:junit4]   2> 1358 T1215 oashl.XMLLoader.init xsltCacheLifetimeSeconds=60
[junit4:junit4]   2> 1362 T1215 oasc.SolrCore.initDeprecatedSupport WARNING solrconfig.xml uses deprecated <admin/gettableFiles>, Please update your config to use the ShowFileRequestHandler.
[junit4:junit4]   2> 1363 T1215 oasc.SolrCore.initDeprecatedSupport WARNING adding ShowFileRequestHandler with hidden files: [SCHEMA.XML, OLD_SYNONYMS.TXT, STOPWORDS.TXT, PROTWORDS.TXT, OPEN-EXCHANGE-RATES.JSON, SYNONYMS.TXT, CURRENCY.XML, MAPPING-ISOLATIN1ACCENT.TXT]
[junit4:junit4]   2> 1366 T1215 oasc.CachingDirectoryFactory.close Releasing directory:/usr/home/hudson/hudson-slave/workspace/Lucene-Solr-Tests-4.x-java7/solr/build/solr-core/test/J0/./org.apache.solr.cloud.SyncSliceTest-1357026660116/control/data
[junit4:junit4]   2> 1367 T1215 oass.SolrIndexSearcher.<init> Opening Searcher@1d7143fa main
[junit4:junit4]   2> 1368 T1215 oasu.CommitTracker.<init> Hard AutoCommit: disabled
[junit4:junit4]   2> 1369 T1215 oasu.CommitTracker.<init> Soft AutoCommit: disabled
[junit4:junit4]   2> 1369 T1215 oashc.SpellCheckComponent.inform Initializing spell checkers
[junit4:junit4]   2> 1382 T1215 oass.DirectSolrSpellChecker.init init: {name=direct,classname=DirectSolrSpellChecker,field=lowerfilt,minQueryLength=3}
[junit4:junit4]   2> 1423 T1216 oasc.SolrCore.registerSearcher [collection1] Registered new searcher Searcher@1d7143fa main{StandardDirectoryReader(segments_1:1)}
[junit4:junit4]   2> 1426 T1215 oasc.ZkController.publish publishing core=collection1 state=down
[junit4:junit4]   2> 1426 T1215 oasc.ZkController.publish numShards not found on descriptor - reading it from system property
[junit4:junit4]   2> 1427 T1195 oazs.PrepRequestProcessor.pRequest Got user-level KeeperException when processing sessionid:0x13bf5178f1b0003 type:create cxid:0x50 zxid:0x29 txntype:-1 reqpath:n/a Error Path:/solr/overseer/queue Error:KeeperErrorCode = NoNode for /solr/overseer/queue
[junit4:junit4]   2> 2000 T1213 oascc.ZkStateReader.updateClusterState Updating cloud state from ZooKeeper... 
[junit4:junit4]   2> 2000 T1213 oasc.Overseer$ClusterStateUpdater.updateState Update state numShards=1 message={
[junit4:junit4]   2> 	  "operation":"state",
[junit4:junit4]   2> 	  "numShards":"1",
[junit4:junit4]   2> 	  "shard":null,
[junit4:junit4]   2> 	  "roles":null,
[junit4:junit4]   2> 	  "state":"down",
[junit4:junit4]   2> 	  "core":"collection1",
[junit4:junit4]   2> 	  "collection":"control_collection",
[junit4:junit4]   2> 	  "node_name":"127.0.0.1:55153_",
[junit4:junit4]   2> 	  "base_url":"http://127.0.0.1:55153"}
[junit4:junit4]   2> 2001 T1213 oasc.Overseer$ClusterStateUpdater.createCollection Create collection control_collection with numShards 1
[junit4:junit4]   2> 2001 T1213 oasc.Overseer$ClusterStateUpdater.updateState Assigning new node to shard shard=shard1
[junit4:junit4]   2> 2002 T1195 oazs.PrepRequestProcessor.pRequest Got user-level KeeperException when processing sessionid:0x13bf5178f1b0003 type:create cxid:0x58 zxid:0x2c txntype:-1 reqpath:n/a Error Path:/solr/overseer/queue-work Error:KeeperErrorCode = NoNode for /solr/overseer/queue-work
[junit4:junit4]   2> 2024 T1212 oascc.ZkStateReader$2.process A cluster state change: WatchedEvent state:SyncConnected type:NodeDataChanged path:/clusterstate.json, has occurred - updating... (live nodes size: 1)
[junit4:junit4]   2> 2431 T1215 oasc.CoreContainer.registerCore registering core: collection1
[junit4:junit4]   2> 2431 T1215 oasc.ZkController.register Register replica - core:collection1 address:http://127.0.0.1:55153 collection:control_collection shard:shard1
[junit4:junit4]   2> 2432 T1215 oascc.SolrZkClient.makePath makePath: /collections/control_collection/leader_elect/shard1/election
[junit4:junit4]   2> 2449 T1195 oazs.PrepRequestProcessor.pRequest Got user-level KeeperException when processing sessionid:0x13bf5178f1b0003 type:delete cxid:0x72 zxid:0x36 txntype:-1 reqpath:n/a Error Path:/solr/collections/control_collection/leaders Error:KeeperErrorCode = NoNode for /solr/collections/control_collection/leaders
[junit4:junit4]   2> 2450 T1215 oasc.ShardLeaderElectionContext.runLeaderProcess Running the leader process.
[junit4:junit4]   2> 2451 T1195 oazs.PrepRequestProcessor.pRequest Got user-level KeeperException when processing sessionid:0x13bf5178f1b0003 type:create cxid:0x73 zxid:0x37 txntype:-1 reqpath:n/a Error Path:/solr/overseer Error:KeeperErrorCode = NodeExists for /solr/overseer
[junit4:junit4]   2> 2462 T1215 oasc.ShardLeaderElectionContext.waitForReplicasToComeUp Enough replicas found to continue.
[junit4:junit4]   2> 2462 T1215 oasc.ShardLeaderElectionContext.runLeaderProcess I may be the new leader - try and sync
[junit4:junit4]   2> 2462 T1215 oasc.SyncStrategy.sync Sync replicas to http://127.0.0.1:55153/collection1/
[junit4:junit4]   2> 2463 T1215 oasc.SyncStrategy.syncReplicas Sync Success - now sync replicas to me
[junit4:junit4]   2> 2463 T1215 oasc.SyncStrategy.syncToMe http://127.0.0.1:55153/collection1/ has no replicas
[junit4:junit4]   2> 2463 T1215 oasc.ShardLeaderElectionContext.runLeaderProcess I am the new leader: http://127.0.0.1:55153/collection1/
[junit4:junit4]   2> 2463 T1215 oascc.SolrZkClient.makePath makePath: /collections/control_collection/leaders/shard1
[junit4:junit4]   2> 2468 T1195 oazs.PrepRequestProcessor.pRequest Got user-level KeeperException when processing sessionid:0x13bf5178f1b0003 type:create cxid:0x7d zxid:0x3b txntype:-1 reqpath:n/a Error Path:/solr/overseer Error:KeeperErrorCode = NodeExists for /solr/overseer
[junit4:junit4]   2> 3537 T1213 oascc.ZkStateReader.updateClusterState Updating cloud state from ZooKeeper... 
[junit4:junit4]   2> 3644 T1212 oascc.ZkStateReader$2.process A cluster state change: WatchedEvent state:SyncConnected type:NodeDataChanged path:/clusterstate.json, has occurred - updating... (live nodes size: 1)
[junit4:junit4]   2> 3753 T1215 oasc.ZkController.register We are http://127.0.0.1:55153/collection1/ and leader is http://127.0.0.1:55153/collection1/
[junit4:junit4]   2> 3753 T1215 oasc.ZkController.register No LogReplay needed for core=collection1 baseURL=http://127.0.0.1:55153
[junit4:junit4]   2> 3753 T1215 oasc.ZkController.checkRecovery I am the leader, no recovery necessary
[junit4:junit4]   2> 3753 T1215 oasc.ZkController.publish publishing core=collection1 state=active
[junit4:junit4]   2> 3754 T1215 oasc.ZkController.publish numShards not found on descriptor - reading it from system property
[junit4:junit4]   2> 3756 T1215 oascc.ZkStateReader.updateClusterState Updating cloud state from ZooKeeper... 
[junit4:junit4]   2> 3757 T1190 oass.SolrDispatchFilter.init user.dir=/usr/home/hudson/hudson-slave/workspace/Lucene-Solr-Tests-4.x-java7/solr/build/solr-core/test/J0
[junit4:junit4]   2> 3757 T1190 oass.SolrDispatchFilter.init SolrDispatchFilter.init() done
[junit4:junit4]   2> 3758 T1190 oascsi.HttpClientUtil.createClient Creating new http client, config:maxConnections=128&maxConnectionsPerHost=32&followRedirects=false
[junit4:junit4]   2> 3772 T1190 oascsi.HttpClientUtil.createClient Creating new http client, config:
[junit4:junit4]   2> 3781 T1190 oaz.ZooKeeper.<init> Initiating client connection, connectString=127.0.0.1:55150/solr sessionTimeout=10000 watcher=org.apache.solr.common.cloud.ConnectionManager@11534466
[junit4:junit4]   2> 3782 T1190 oascc.ConnectionManager.waitForConnected Waiting for client to connect to ZooKeeper
[junit4:junit4]   2> 3783 T1217 oaz.ClientCnxn$SendThread.logStartConnect Opening socket connection to server localhost/127.0.0.1:55150. Will not attempt to authenticate using SASL (access denied ("javax.security.auth.AuthPermission" "getLoginConfiguration"))
[junit4:junit4]   2> 3783 T1217 oaz.ClientCnxn$SendThread.primeConnection Socket connection established to localhost/127.0.0.1:55150, initiating session
[junit4:junit4]   2> 3783 T1192 oazs.NIOServerCnxnFactory.run Accepted socket connection from /140.211.11.196:55162
[junit4:junit4]   2> 3784 T1192 oazs.ZooKeeperServer.processConnectRequest Client attempting to establish new session at /140.211.11.196:55162
[junit4:junit4]   2> 3785 T1194 oazs.ZooKeeperServer.finishSessionInit Established session 0x13bf5178f1b0004 with negotiated timeout 10000 for client /140.211.11.196:55162
[junit4:junit4]   2> 3785 T1217 oaz.ClientCnxn$SendThread.onConnected Session establishment complete on server localhost/127.0.0.1:55150, sessionid = 0x13bf5178f1b0004, negotiated timeout = 10000
[junit4:junit4]   2> 3786 T1218 oascc.ConnectionManager.process Watcher org.apache.solr.common.cloud.ConnectionManager@11534466 name:ZooKeeperConnection Watcher:127.0.0.1:55150/solr got event WatchedEvent state:SyncConnected type:None path:null path:null type:None
[junit4:junit4]   2> 3786 T1190 oascc.ConnectionManager.waitForConnected Client is connected to ZooKeeper
[junit4:junit4]   2> 3787 T1190 oascc.ZkStateReader.createClusterStateWatchersAndUpdate Updating cluster state from ZooKeeper... 
[junit4:junit4]   2> 3789 T1190 oasc.ChaosMonkey.monkeyLog monkey: init - expire sessions:true cause connection loss:true
[junit4:junit4]   2> 3962 T1190 oejs.Server.doStart jetty-8.1.8.v20121106
[junit4:junit4]   2> 3965 T1190 oejs.AbstractConnector.doStart Started SocketConnector@127.0.0.1:55163
[junit4:junit4]   2> 3966 T1190 oasc.SolrResourceLoader.locateSolrHome JNDI not configured for solr (NoInitialContextEx)
[junit4:junit4]   2> 3966 T1190 oasc.SolrResourceLoader.locateSolrHome using system property solr.solr.home: /usr/home/hudson/hudson-slave/workspace/Lucene-Solr-Tests-4.x-java7/solr/build/solr-core/test/J0/./org.apache.solr.cloud.SyncSliceTest-jetty1-1357026663901
[junit4:junit4]   2> 3967 T1190 oasc.SolrResourceLoader.<init> new SolrResourceLoader for deduced Solr Home: '/usr/home/hudson/hudson-slave/workspace/Lucene-Solr-Tests-4.x-java7/solr/build/solr-core/test/J0/./org.apache.solr.cloud.SyncSliceTest-jetty1-1357026663901/'
[junit4:junit4]   2> 4009 T1190 oass.SolrDispatchFilter.init SolrDispatchFilter.init()
[junit4:junit4]   2> 4010 T1190 oasc.SolrResourceLoader.locateSolrHome JNDI not configured for solr (NoInitialContextEx)
[junit4:junit4]   2> 4010 T1190 oasc.SolrResourceLoader.locateSolrHome using system property solr.solr.home: /usr/home/hudson/hudson-slave/workspace/Lucene-Solr-Tests-4.x-java7/solr/build/solr-core/test/J0/./org.apache.solr.cloud.SyncSliceTest-jetty1-1357026663901
[junit4:junit4]   2> 4011 T1190 oasc.CoreContainer$Initializer.initialize looking for solr.xml: /usr/home/hudson/hudson-slave/workspace/Lucene-Solr-Tests-4.x-java7/solr/build/solr-core/test/J0/./org.apache.solr.cloud.SyncSliceTest-jetty1-1357026663901/solr.xml
[junit4:junit4]   2> 4011 T1190 oasc.CoreContainer.<init> New CoreContainer 263035167
[junit4:junit4]   2> 4012 T1190 oasc.CoreContainer.load Loading CoreContainer using Solr Home: '/usr/home/hudson/hudson-slave/workspace/Lucene-Solr-Tests-4.x-java7/solr/build/solr-core/test/J0/./org.apache.solr.cloud.SyncSliceTest-jetty1-1357026663901/'
[junit4:junit4]   2> 4013 T1190 oasc.SolrResourceLoader.<init> new SolrResourceLoader for directory: '/usr/home/hudson/hudson-slave/workspace/Lucene-Solr-Tests-4.x-java7/solr/build/solr-core/test/J0/./org.apache.solr.cloud.SyncSliceTest-jetty1-1357026663901/'
[junit4:junit4]   2> 4043 T1190 oashc.HttpShardHandlerFactory.getParameter Setting socketTimeout to: 30000
[junit4:junit4]   2> 4043 T1190 oashc.HttpShardHandlerFactory.getParameter Setting urlScheme to: http://
[junit4:junit4]   2> 4044 T1190 oashc.HttpShardHandlerFactory.getParameter Setting connTimeout to: 15000
[junit4:junit4]   2> 4044 T1190 oashc.HttpShardHandlerFactory.getParameter Setting maxConnectionsPerHost to: 20
[junit4:junit4]   2> 4045 T1190 oashc.HttpShardHandlerFactory.getParameter Setting corePoolSize to: 0
[junit4:junit4]   2> 4045 T1190 oashc.HttpShardHandlerFactory.getParameter Setting maximumPoolSize to: 2147483647
[junit4:junit4]   2> 4046 T1190 oashc.HttpShardHandlerFactory.getParameter Setting maxThreadIdleTime to: 5
[junit4:junit4]   2> 4046 T1190 oashc.HttpShardHandlerFactory.getParameter Setting sizeOfQueue to: -1
[junit4:junit4]   2> 4047 T1190 oashc.HttpShardHandlerFactory.getParameter Setting fairnessPolicy to: false
[junit4:junit4]   2> 4047 T1190 oascsi.HttpClientUtil.createClient Creating new http client, config:maxConnectionsPerHost=20&maxConnections=10000&socketTimeout=30000&connTimeout=15000&retry=false
[junit4:junit4]   2> 4067 T1190 oasc.CoreContainer.load Registering Log Listener
[junit4:junit4]   2> 4087 T1190 oasc.CoreContainer.initZooKeeper Zookeeper client=127.0.0.1:55150/solr
[junit4:junit4]   2> 4087 T1190 oasc.ZkController.checkChrootPath zkHost includes chroot
[junit4:junit4]   2> 4088 T1190 oaz.ZooKeeper.<init> Initiating client connection, connectString=127.0.0.1:55150 sessionTimeout=60000 watcher=org.apache.solr.common.cloud.ConnectionManager@590aefcc
[junit4:junit4]   2> 4089 T1190 oascc.ConnectionManager.waitForConnected Waiting for client to connect to ZooKeeper
[junit4:junit4]   2> 4089 T1228 oaz.ClientCnxn$SendThread.logStartConnect Opening socket connection to server localhost/127.0.0.1:55150. Will not attempt to authenticate using SASL (access denied ("javax.security.auth.AuthPermission" "getLoginConfiguration"))
[junit4:junit4]   2> 4090 T1228 oaz.ClientCnxn$SendThread.primeConnection Socket connection established to localhost/127.0.0.1:55150, initiating session
[junit4:junit4]   2> 4091 T1192 oazs.NIOServerCnxnFactory.run Accepted socket connection from /140.211.11.196:55164
[junit4:junit4]   2> 4091 T1192 oazs.ZooKeeperServer.processConnectRequest Client attempting to establish new session at /140.211.11.196:55164
[junit4:junit4]   2> 4096 T1194 oazs.ZooKeeperServer.finishSessionInit Established session 0x13bf5178f1b0005 with negotiated timeout 20000 for client /140.211.11.196:55164
[junit4:junit4]   2> 4096 T1228 oaz.ClientCnxn$SendThread.onConnected Session establishment complete on server localhost/127.0.0.1:55150, sessionid = 0x13bf5178f1b0005, negotiated timeout = 20000
[junit4:junit4]   2> 4096 T1229 oascc.ConnectionManager.process Watcher org.apache.solr.common.cloud.ConnectionManager@590aefcc name:ZooKeeperConnection Watcher:127.0.0.1:55150 got event WatchedEvent state:SyncConnected type:None path:null path:null type:None
[junit4:junit4]   2> 4096 T1190 oascc.ConnectionManager.waitForConnected Client is connected to ZooKeeper
[junit4:junit4]   2> 4098 T1195 oazs.PrepRequestProcessor.pRequest2Txn Processed session termination for sessionid: 0x13bf5178f1b0005
[junit4:junit4]   2> 4109 T1229 oaz.ClientCnxn$EventThread.run EventThread shut down
[junit4:junit4]   2> 4109 T1192 oazs.NIOServerCnxn.closeSock Closed socket connection for client /140.211.11.196:55164 which had sessionid 0x13bf5178f1b0005
[junit4:junit4]   2> 4109 T1190 oaz.ZooKeeper.close Session: 0x13bf5178f1b0005 closed
[junit4:junit4]   2> 4110 T1190 oascsi.HttpClientUtil.createClient Creating new http client, config:maxConnections=500&maxConnectionsPerHost=16&socketTimeout=15000&connTimeout=30000
[junit4:junit4]   2> 4120 T1190 oaz.ZooKeeper.<init> Initiating client connection, connectString=127.0.0.1:55150/solr sessionTimeout=30000 watcher=org.apache.solr.common.cloud.ConnectionManager@3e1c3357
[junit4:junit4]   2> 4121 T1190 oascc.ConnectionManager.waitForConnected Waiting for client to connect to ZooKeeper
[junit4:junit4]   2> 4121 T1230 oaz.ClientCnxn$SendThread.logStartConnect Opening socket connection to server localhost/127.0.0.1:55150. Will not attempt to authenticate using SASL (access denied ("javax.security.auth.AuthPermission" "getLoginConfiguration"))
[junit4:junit4]   2> 4122 T1230 oaz.ClientCnxn$SendThread.primeConnection Socket connection established to localhost/127.0.0.1:55150, initiating session
[junit4:junit4]   2> 4122 T1192 oazs.NIOServerCnxnFactory.run Accepted socket connection from /140.211.11.196:55165
[junit4:junit4]   2> 4122 T1192 oazs.ZooKeeperServer.processConnectRequest Client attempting to establish new session at /140.211.11.196:55165
[junit4:junit4]   2> 4124 T1194 oazs.ZooKeeperServer.finishSessionInit Established session 0x13bf5178f1b0006 with negotiated timeout 20000 for client /140.211.11.196:55165
[junit4:junit4]   2> 4124 T1230 oaz.ClientCnxn$SendThread.onConnected Session establishment complete on server localhost/127.0.0.1:55150, sessionid = 0x13bf5178f1b0006, negotiated timeout = 20000
[junit4:junit4]   2> 4124 T1231 oascc.ConnectionManager.process Watcher org.apache.solr.common.cloud.ConnectionManager@3e1c3357 name:ZooKeeperConnection Watcher:127.0.0.1:55150/solr got event WatchedEvent state:SyncConnected type:None path:null path:null type:None
[junit4:junit4]   2> 4124 T1190 oascc.ConnectionManager.waitForConnected Client is connected to ZooKeeper
[junit4:junit4]   2> 4126 T1195 oazs.PrepRequestProcessor.pRequest Got user-level KeeperException when processing sessionid:0x13bf5178f1b0006 type:create cxid:0x1 zxid:0x49 txntype:-1 reqpath:n/a Error Path:/solr/overseer Error:KeeperErrorCode = NodeExists for /solr/overseer
[junit4:junit4]   2> 4127 T1195 oazs.PrepRequestProcessor.pRequest Got user-level KeeperException when processing sessionid:0x13bf5178f1b0006 type:create cxid:0x2 zxid:0x4a txntype:-1 reqpath:n/a Error Path:/solr/overseer Error:KeeperErrorCode = NodeExists for /solr/overseer
[junit4:junit4]   2> 4129 T1190 oasc.ZkController.createEphemeralLiveNode Register node as live in ZooKeeper:/live_nodes/127.0.0.1:55163_
[junit4:junit4]   2> 4130 T1195 oazs.PrepRequestProcessor.pRequest Got user-level KeeperException when processing sessionid:0x13bf5178f1b0006 type:delete cxid:0x4 zxid:0x4b txntype:-1 reqpath:n/a Error Path:/solr/live_nodes/127.0.0.1:55163_ Error:KeeperErrorCode = NoNode for /solr/live_nodes/127.0.0.1:55163_
[junit4:junit4]   2> 4137 T1190 oascc.SolrZkClient.makePath makePath: /live_nodes/127.0.0.1:55163_
[junit4:junit4]   2> 4140 T1212 oascc.ZkStateReader$2.process A cluster state change: WatchedEvent state:SyncConnected type:NodeChildrenChanged path:/live_nodes, has occurred - updating... (live nodes size: 1)
[junit4:junit4]   2> 4141 T1218 oascc.ZkStateReader$3.process Updating live nodes... (2)
[junit4:junit4]   2> 4142 T1212 oascc.ZkStateReader$3.process Updating live nodes... (2)
[junit4:junit4]   2> 4144 T1190 oascc.ZkStateReader.createClusterStateWatchersAndUpdate Updating cluster state from ZooKeeper... 
[junit4:junit4]   2> 4151 T1232 oasc.CoreContainer.create Creating SolrCore 'collection1' using instanceDir: /usr/home/hudson/hudson-slave/workspace/Lucene-Solr-Tests-4.x-java7/solr/build/solr-core/test/J0/./org.apache.solr.cloud.SyncSliceTest-jetty1-1357026663901/collection1
[junit4:junit4]   2> 4152 T1232 oasc.ZkController.createCollectionZkNode Check for collection zkNode:collection1
[junit4:junit4]   2> 4152 T1232 oasc.ZkController.createCollectionZkNode Collection zkNode exists
[junit4:junit4]   2> 4153 T1232 oasc.ZkController.readConfigName Load collection config from:/collections/collection1
[junit4:junit4]   2> 4154 T1232 oasc.SolrResourceLoader.<init> new SolrResourceLoader for directory: '/usr/home/hudson/hudson-slave/workspace/Lucene-Solr-Tests-4.x-java7/solr/build/solr-core/test/J0/./org.apache.solr.cloud.SyncSliceTest-jetty1-1357026663901/collection1/'
[junit4:junit4]   2> 4155 T1232 oasc.SolrResourceLoader.replaceClassLoader Adding 'file:/usr/home/hudson/hudson-slave/workspace/Lucene-Solr-Tests-4.x-java7/solr/build/solr-core/test/J0/org.apache.solr.cloud.SyncSliceTest-jetty1-1357026663901/collection1/lib/README' to classloader
[junit4:junit4]   2> 4156 T1232 oasc.SolrResourceLoader.replaceClassLoader Adding 'file:/usr/home/hudson/hudson-slave/workspace/Lucene-Solr-Tests-4.x-java7/solr/build/solr-core/test/J0/org.apache.solr.cloud.SyncSliceTest-jetty1-1357026663901/collection1/lib/classes/' to classloader
[junit4:junit4]   2> 4208 T1232 oasc.SolrConfig.<init> Using Lucene MatchVersion: LUCENE_41
[junit4:junit4]   2> 4279 T1232 oasc.SolrConfig.<init> Loaded SolrConfig: solrconfig.xml
[junit4:junit4]   2> 4280 T1232 oass.IndexSchema.readSchema Reading Solr Schema
[junit4:junit4]   2> 4286 T1232 oass.IndexSchema.readSchema Schema name=test
[junit4:junit4]   2> 4861 T1232 oass.OpenExchangeRatesOrgProvider.init Initialized with rates=open-exchange-rates.json, refreshInterval=1440.
[junit4:junit4]   2> 4868 T1232 oass.IndexSchema.readSchema default search field in schema is text
[junit4:junit4]   2> 4871 T1232 oass.IndexSchema.readSchema unique key field: id
[junit4:junit4]   2> 4884 T1232 oass.FileExchangeRateProvider.reload Reloading exchange rates from file currency.xml
[junit4:junit4]   2> 4888 T1232 oass.FileExchangeRateProvider.reload Reloading exchange rates from file currency.xml
[junit4:junit4]   2> 4892 T1232 oass.OpenExchangeRatesOrgProvider.reload Reloading exchange rates from open-exchange-rates.json
[junit4:junit4]   2> 4893 T1232 oass.OpenExchangeRatesOrgProvider.reload Reloading exchange rates from open-exchange-rates.json
[junit4:junit4]   2> 4895 T1232 oasc.SolrCore.<init> [collection1] Opening new SolrCore at /usr/home/hudson/hudson-slave/workspace/Lucene-Solr-Tests-4.x-java7/solr/build/solr-core/test/J0/./org.apache.solr.cloud.SyncSliceTest-jetty1-1357026663901/collection1/, dataDir=./org.apache.solr.cloud.SyncSliceTest-1357026660116/jetty1/
[junit4:junit4]   2> 4895 T1232 oasc.JmxMonitoredMap.<init> JMX monitoring is enabled. Adding Solr mbeans to JMX Server: com.sun.jmx.mbeanserver.JmxMBeanServer@4e810bca
[junit4:junit4]   2> 4895 T1232 oasc.SolrCore.initDirectoryFactory solr.NRTCachingDirectoryFactory
[junit4:junit4]   2> 4896 T1232 oasc.CachingDirectoryFactory.get return new directory for /usr/home/hudson/hudson-slave/workspace/Lucene-Solr-Tests-4.x-java7/solr/build/solr-core/test/J0/./org.apache.solr.cloud.SyncSliceTest-1357026660116/jetty1 forceNew:false
[junit4:junit4]   2> 4896 T1232 oasc.CachingDirectoryFactory.close Releasing directory:/usr/home/hudson/hudson-slave/workspace/Lucene-Solr-Tests-4.x-java7/solr/build/solr-core/test/J0/./org.apache.solr.cloud.SyncSliceTest-1357026660116/jetty1
[junit4:junit4]   2> 4897 T1232 oasc.SolrCore.getNewIndexDir New index directory detected: old=null new=./org.apache.solr.cloud.SyncSliceTest-1357026660116/jetty1/index/
[junit4:junit4]   2> 4897 T1232 oasc.SolrCore.initIndex WARNING [collection1] Solr index directory './org.apache.solr.cloud.SyncSliceTest-1357026660116/jetty1/index' doesn't exist. Creating new index...
[junit4:junit4]   2> 4898 T1232 oasc.CachingDirectoryFactory.get return new directory for /usr/home/hudson/hudson-slave/workspace/Lucene-Solr-Tests-4.x-java7/solr/build/solr-core/test/J0/./org.apache.solr.cloud.SyncSliceTest-1357026660116/jetty1/index forceNew:false
[junit4:junit4]   2> 4905 T1232 oasc.SolrDeletionPolicy.onCommit SolrDeletionPolicy.onCommit: commits:num=1
[junit4:junit4]   2> 		commit{dir=RateLimitedDirectoryWrapper(NRTCachingDirectory(org.apache.lucene.store.NIOFSDirectory@/usr/home/hudson/hudson-slave/workspace/Lucene-Solr-Tests-4.x-java7/solr/build/solr-core/test/J0/org.apache.solr.cloud.SyncSliceTest-1357026660116/jetty1/index lockFactory=org.apache.lucene.store.NativeFSLockFactory@1bfbc3a9; maxCacheMB=48.0 maxMergeSizeMB=4.0)),segFN=segments_1,generation=1,filenames=[segments_1]
[junit4:junit4]   2> 4906 T1232 oasc.SolrDeletionPolicy.updateCommits newest commit = 1[segments_1]
[junit4:junit4]   2> 4906 T1232 oasc.CachingDirectoryFactory.close Releasing directory:/usr/home/hudson/hudson-slave/workspace/Lucene-Solr-Tests-4.x-java7/solr/build/solr-core/test/J0/./org.apache.solr.cloud.SyncSliceTest-1357026660116/jetty1/index
[junit4:junit4]   2> 4907 T1232 oasc.SolrCore.initWriters created xml: solr.XMLResponseWriter
[junit4:junit4]   2> 4908 T1232 oasup.UpdateRequestProcessorChain.init inserting DistributedUpdateProcessorFactory into updateRequestProcessorChain "dedupe"
[junit4:junit4]   2> 4908 T1232 oasup.UpdateRequestProcessorChain.init inserting DistributedUpdateProcessorFactory into updateRequestProcessorChain "dedupe-allfields"
[junit4:junit4]   2> 4909 T1232 oasup.UpdateRequestProcessorChain.init inserting DistributedUpdateProcessorFactory into updateRequestProcessorChain "stored_sig"
[junit4:junit4]   2> 4909 T1232 oasup.UpdateRequestProcessorChain.init inserting DistributedUpdateProcessorFactory into updateRequestProcessorChain "uniq-fields"
[junit4:junit4]   2> 4909 T1232 oasup.UpdateRequestProcessorChain.init inserting DistributedUpdateProcessorFactory into updateRequestProcessorChain "distrib-dup-test-chain-implicit"
[junit4:junit4]   2> 4909 T1232 oasc.RequestHandlers.initHandlersFromConfig adding lazy requestHandler: solr.ReplicationHandler
[junit4:junit4]   2> 4910 T1232 oasc.RequestHandlers.initHandlersFromConfig created /replication: solr.ReplicationHandler
[junit4:junit4]   2> 4910 T1232 oasc.RequestHandlers.initHandlersFromConfig created standard: solr.StandardRequestHandler
[junit4:junit4]   2> 4910 T1232 oasc.RequestHandlers.initHandlersFromConfig created /get: solr.RealTimeGetHandler
[junit4:junit4]   2> 4911 T1232 oasc.RequestHandlers.initHandlersFromConfig created dismax: solr.SearchHandler
[junit4:junit4]   2> 4911 T1232 oasc.RequestHandlers.initHandlersFromConfig created mock: org.apache.solr.core.MockQuerySenderListenerReqHandler
[junit4:junit4]   2> 4912 T1232 oasc.RequestHandlers.initHandlersFromConfig created /admin/: org.apache.solr.handler.admin.AdminHandlers
[junit4:junit4]   2> 4912 T1232 oasc.RequestHandlers.initHandlersFromConfig created defaults: solr.StandardRequestHandler
[junit4:junit4]   2> 4912 T1232 oasc.RequestHandlers.initHandlersFromConfig adding lazy requestHandler: solr.StandardRequestHandler
[junit4:junit4]   2> 4912 T1232 oasc.RequestHandlers.initHandlersFromConfig created lazy: solr.StandardRequestHandler
[junit4:junit4]   2> 4913 T1232 oasc.RequestHandlers.initHandlersFromConfig created /update: solr.UpdateRequestHandler
[junit4:junit4]   2> 4913 T1232 oasc.RequestHandlers.initHandlersFromConfig created /terms: org.apache.solr.handler.component.SearchHandler
[junit4:junit4]   2> 4913 T1232 oasc.RequestHandlers.initHandlersFromConfig created spellCheckCompRH: org.apache.solr.handler.component.SearchHandler
[junit4:junit4]   2> 4914 T1232 oasc.RequestHandlers.initHandlersFromConfig created spellCheckCompRH_Direct: org.apache.solr.handler.component.SearchHandler
[junit4:junit4]   2> 4914 T1232 oasc.RequestHandlers.initHandlersFromConfig created spellCheckWithWordbreak: org.apache.solr.handler.component.SearchHandler
[junit4:junit4]   2> 4914 T1232 oasc.RequestHandlers.initHandlersFromConfig created spellCheckWithWordbreak_Direct: org.apache.solr.handler.component.SearchHandler
[junit4:junit4]   2> 4915 T1232 oasc.RequestHandlers.initHandlersFromConfig created spellCheckCompRH1: org.apache.solr.handler.component.SearchHandler
[junit4:junit4]   2> 4915 T1232 oasc.RequestHandlers.initHandlersFromConfig created mltrh: org.apache.solr.handler.component.SearchHandler
[junit4:junit4]   2> 4915 T1232 oasc.RequestHandlers.initHandlersFromConfig created tvrh: org.apache.solr.handler.component.SearchHandler
[junit4:junit4]   2> 4916 T1232 oasc.RequestHandlers.initHandlersFromConfig created /mlt: solr.MoreLikeThisHandler
[junit4:junit4]   2> 4916 T1232 oasc.RequestHandlers.initHandlersFromConfig created /debug/dump: solr.DumpRequestHandler
[junit4:junit4]   2> 4924 T1232 oashl.XMLLoader.init xsltCacheLifetimeSeconds=60
[junit4:junit4]   2> 4927 T1232 oasc.SolrCore.initDeprecatedSupport WARNING solrconfig.xml uses deprecated <admin/gettableFiles>, Please update your config to use the ShowFileRequestHandler.
[junit4:junit4]   2> 4928 T1232 oasc.SolrCore.initDeprecatedSupport WARNING adding ShowFileRequestHandler with hidden files: [SCHEMA.XML, OLD_SYNONYMS.TXT, STOPWORDS.TXT, PROTWORDS.TXT, OPEN-EXCHANGE-RATES.JSON, SYNONYMS.TXT, CURRENCY.XML, MAPPING-ISOLATIN1ACCENT.TXT]
[junit4:junit4]   2> 4930 T1232 oasc.CachingDirectoryFactory.close Releasing directory:/usr/home/hudson/hudson-slave/workspace/Lucene-Solr-Tests-4.x-java7/solr/build/solr-core/test/J0/./org.apache.solr.cloud.SyncSliceTest-1357026660116/jetty1
[junit4:junit4]   2> 4931 T1232 oass.SolrIndexSearcher.<init> Opening Searcher@6672c139 main
[junit4:junit4]   2> 4932 T1232 oasu.CommitTracker.<init> Hard AutoCommit: disabled
[junit4:junit4]   2> 4932 T1232 oasu.CommitTracker.<init> Soft AutoCommit: disabled
[junit4:junit4]   2> 4932 T1232 oashc.SpellCheckComponent.inform Initializing spell checkers
[junit4:junit4]   2> 4937 T1232 oass.DirectSolrSpellChecker.init init: {name=direct,classname=DirectSolrSpellChecker,field=lowerfilt,minQueryLength=3}
[junit4:junit4]   2> 4991 T1233 oasc.SolrCore.registerSearcher [collection1] Registered new searcher Searcher@6672c139 main{StandardDirectoryReader(segments_1:1)}
[junit4:junit4]   2> 4995 T1232 oasc.ZkController.publish publishing core=collection1 state=down
[junit4:junit4]   2> 4995 T1232 oasc.ZkController.publish numShards not found on descriptor - reading it from system property
[junit4:junit4]   2> 5214 T1213 oascc.ZkStateReader.updateClusterState Updating cloud state from ZooKeeper... 
[junit4:junit4]   2> 5214 T1213 oasc.Overseer$ClusterStateUpdater.updateState Update state numShards=1 message={
[junit4:junit4]   2> 	  "operation":"state",
[junit4:junit4]   2> 	  "numShards":"1",
[junit4:junit4]   2> 	  "shard":"shard1",
[junit4:junit4]   2> 	  "roles":null,
[junit4:junit4]   2> 	  "state":"active",
[junit4:junit4]   2> 	  "core":"collection1",
[junit4:junit4]   2> 	  "collection":"control_collection",
[junit4:junit4]   2> 	  "node_name":"127.0.0.1:55153_",
[junit4:junit4]   2> 	  "base_url":"http://127.0.0.1:55153"}
[junit4:junit4]   2> 5218 T1213 oasc.Overseer$ClusterStateUpdater.updateState Update state numShards=1 message={
[junit4:junit4]   2> 	  "operation":"state",
[junit4:junit4]   2> 	  "numShards":"1",
[junit4:junit4]   2> 	  "shard":null,
[junit4:junit4]   2> 	  "roles":null,
[junit4:junit4]   2> 	  "state":"down",
[junit4:junit4]   2> 	  "core":"collection1",
[junit4:junit4]   2> 	  "collection":"collection1",
[junit4:junit4]   2> 	  "node_name":"127.0.0.1:55163_",
[junit4:junit4]   2> 	  "base_url":"http://127.0.0.1:55163"}
[junit4:junit4]   2> 5219 T1213 oasc.Overseer$ClusterStateUpdater.createCollection Create collection collection1 with numShards 1
[junit4:junit4]   2> 5219 T1213 oasc.Overseer$ClusterStateUpdater.updateState Assigning new node to shard shard=shard1
[junit4:junit4]   2> 5230 T1212 oascc.ZkStateReader$2.process A cluster state change: WatchedEvent state:SyncConnected type:NodeDataChanged path:/clusterstate.json, has occurred - updating... (live nodes size: 2)
[junit4:junit4]   2> 5230 T1218 oascc.ZkStateReader$2.process A cluster state change: WatchedEvent state:SyncConnected type:NodeDataChanged path:/clusterstate.json, has occurred - updating... (live nodes size: 2)
[junit4:junit4]   2> 5230 T1231 oascc.ZkStateReader$2.process A cluster state change: WatchedEvent state:SyncConnected type:NodeDataChanged path:/clusterstate.json, has occurred - updating... (live nodes size: 2)
[junit4:junit4]   2> 5998 T1232 oasc.CoreContainer.registerCore registering core: collection1
[junit4:junit4]   2> 5998 T1232 oasc.ZkController.register Register replica - core:collection1 address:http://127.0.0.1:55163 collection:collection1 shard:shard1
[junit4:junit4]   2> 5999 T1232 oascc.SolrZkClient.makePath makePath: /collections/collection1/leader_elect/shard1/election
[junit4:junit4]   2> 6048 T1195 oazs.PrepRequestProcessor.pRequest Got user-level KeeperException when processing sessionid:0x13bf5178f1b0006 type:delete cxid:0x43 zxid:0x5a txntype:-1 reqpath:n/a Error Path:/solr/collections/collection1/leaders Error:KeeperErrorCode = NoNode for /solr/collections/collection1/leaders
[junit4:junit4]   2> 6049 T1232 oasc.ShardLeaderElectionContext.runLeaderProcess Running the leader process.
[junit4:junit4]   2> 6050 T1195 oazs.PrepRequestProcessor.pRequest Got user-level KeeperException when processing sessionid:0x13bf5178f1b0006 type:create cxid:0x44 zxid:0x5b txntype:-1 reqpath:n/a Error Path:/solr/overseer Error:KeeperErrorCode = NodeExists for /solr/overseer
[junit4:junit4]   2> 6060 T1232 oasc.ShardLeaderElectionContext.waitForReplicasToComeUp Enough replicas found to continue.
[junit4:junit4]   2> 6060 T1232 oasc.ShardLeaderElectionContext.runLeaderProcess I may be the new leader - try and sync
[junit4:junit4]   2> 6060 T1232 oasc.SyncStrategy.sync Sync replicas to http://127.0.0.1:55163/collection1/
[junit4:junit4]   2> 6061 T1232 oasc.SyncStrategy.syncReplicas Sync Success - now sync replicas to me
[junit4:junit4]   2> 6061 T1232 oasc.SyncStrategy.syncToMe http://127.0.0.1:55163/collection1/ has no replicas
[junit4:junit4]   2> 6061 T1232 oasc.ShardLeaderElectionContext.runLeaderProcess I am the new leader: http://127.0.0.1:55163/collection1/
[junit4:junit4]   2> 6061 T1232 oascc.SolrZkClient.makePath makePath: /collections/collection1/leaders/shard1
[junit4:junit4]   2> 6066 T1195 oazs.PrepRequestProcessor.pRequest Got user-level KeeperException when processing sessionid:0x13bf5178f1b0006 type:create cxid:0x4e zxid:0x5f txntype:-1 reqpath:n/a Error Path:/solr/overseer Error:KeeperErrorCode = NodeExists for /solr/overseer
[junit4:junit4]   2> 6745 T1213 oascc.ZkStateReader.updateClusterState Updating cloud state from ZooKeeper... 
[junit4:junit4]   2> 6762 T1212 oascc.ZkStateReader$2.process A cluster state change: WatchedEvent state:SyncConnected type:NodeDataChanged path:/clusterstate.json, has occurred - updating... (live nodes size: 2)
[junit4:junit4]   2> 6762 T1231 oascc.ZkStateReader$2.process A cluster state change: WatchedEvent state:SyncConnected type:NodeDataChanged path:/clusterstate.json, has occurred - updating... (live nodes size: 2)
[junit4:junit4]   2> 6762 T1218 oascc.ZkStateReader$2.process A cluster state change: WatchedEvent state:SyncConnected type:NodeDataChanged path:/clusterstate.json, has occurred - updating... (live nodes size: 2)
[junit4:junit4]   2> 6790 T1232 oasc.ZkController.register We are http://127.0.0.1:55163/collection1/ and leader is http://127.0.0.1:55163/collection1/
[junit4:junit4]   2> 6790 T1232 oasc.ZkController.register No LogReplay needed for core=collection1 baseURL=http://127.0.0.1:55163
[junit4:junit4]   2> 6790 T1232 oasc.ZkController.checkRecovery I am the leader, no recovery necessary
[junit4:junit4]   2> 6791 T1232 oasc.ZkController.publish publishing core=collection1 state=active
[junit4:junit4]   2> 6791 T1232 oasc.ZkController.publish numShards not found on descriptor - reading it from system property
[junit4:junit4]   2> 6793 T1232 oascc.ZkStateReader.updateClusterState Updating cloud state from ZooKeeper... 
[junit4:junit4]   2> 6794 T1190 oass.SolrDispatchFilter.init user.dir=/usr/home/hudson/hudson-slave/workspace/Lucene-Solr-Tests-4.x-java7/solr/build/solr-core/test/J0
[junit4:junit4]   2> 6794 T1190 oass.SolrDispatchFilter.init SolrDispatchFilter.init() done
[junit4:junit4]   2> 6795 T1190 oascsi.HttpClientUtil.createClient Creating new http client, config:maxConnections=128&maxConnectionsPerHost=32&followRedirects=false
[junit4:junit4]   2> 6973 T1190 oejs.Server.doStart jetty-8.1.8.v20121106
[junit4:junit4]   2> 6976 T1190 oejs.AbstractConnector.doStart Started SocketConnector@127.0.0.1:55172
[junit4:junit4]   2> 6977 T1190 oasc.SolrResourceLoader.locateSolrHome JNDI not configured for solr (NoInitialContextEx)
[junit4:junit4]   2> 6978 T1190 oasc.SolrResourceLoader.locateSolrHome using system property solr.solr.home: /usr/home/hudson/hudson-slave/workspace/Lucene-Solr-Tests-4.x-java7/solr/build/solr-core/test/J0/./org.apache.solr.cloud.SyncSliceTest-jetty2-1357026666920
[junit4:junit4]   2> 6978 T1190 oasc.SolrResourceLoader.<init> new SolrResourceLoader for deduced Solr Home: '/usr/home/hudson/hudson-slave/workspace/Lucene-Solr-Tests-4.x-java7/solr/build/solr-core/test/J0/./org.apache.solr.cloud.SyncSliceTest-jetty2-1357026666920/'
[junit4:junit4]   2> 7020 T1190 oass.SolrDispatchFilter.init SolrDispatchFilter.init()
[junit4:junit4]   2> 7021 T1190 oasc.SolrResourceLoader.locateSolrHome JNDI not configured for solr (NoInitialContextEx)
[junit4:junit4]   2> 7021 T1190 oasc.SolrResourceLoader.locateSolrHome using system property solr.solr.home: /usr/home/hudson/hudson-slave/workspace/Lucene-Solr-Tests-4.x-java7/solr/build/solr-core/test/J0/./org.apache.solr.cloud.SyncSliceTest-jetty2-1357026666920
[junit4:junit4]   2> 7022 T1190 oasc.CoreContainer$Initializer.initialize looking for solr.xml: /usr/home/hudson/hudson-slave/workspace/Lucene-Solr-Tests-4.x-java7/solr/build/solr-core/test/J0/./org.apache.solr.cloud.SyncSliceTest-jetty2-1357026666920/solr.xml
[junit4:junit4]   2> 7022 T1190 oasc.CoreContainer.<init> New CoreContainer 1315965574
[junit4:junit4]   2> 7023 T1190 oasc.CoreContainer.load Loading CoreContainer using Solr Home: '/usr/home/hudson/hudson-slave/workspace/Lucene-Solr-Tests-4.x-java7/solr/build/solr-core/test/J0/./org.apache.solr.cloud.SyncSliceTest-jetty2-1357026666920/'
[junit4:junit4]   2> 7023 T1190 oasc.SolrResourceLoader.<init> new SolrResourceLoader for directory: '/usr/home/hudson/hudson-slave/workspace/Lucene-Solr-Tests-4.x-java7/solr/build/solr-core/test/J0/./org.apache.solr.cloud.SyncSliceTest-jetty2-1357026666920/'
[junit4:junit4]   2> 7053 T1190 oashc.HttpShardHandlerFactory.getParameter Setting socketTimeout to: 30000
[junit4:junit4]   2> 7054 T1190 oashc.HttpShardHandlerFactory.getParameter Setting urlScheme to: http://
[junit4:junit4]   2> 7054 T1190 oashc.HttpShardHandlerFactory.getParameter Setting connTimeout to: 15000
[junit4:junit4]   2> 7055 T1190 oashc.HttpShardHandlerFactory.getParameter Setting maxConnectionsPerHost to: 20
[junit4:junit4]   2> 7055 T1190 oashc.HttpShardHandlerFactory.getParameter Setting corePoolSize to: 0
[junit4:junit4]   2> 7056 T1190 oashc.HttpShardHandlerFactory.getParameter Setting maximumPoolSize to: 2147483647
[junit4:junit4]   2> 7056 T1190 oashc.HttpShardHandlerFactory.getParameter Setting maxThreadIdleTime to: 5
[junit4:junit4]   2> 7057 T1190 oashc.HttpShardHandlerFactory.getParameter Setting sizeOfQueue to: -1
[junit4:junit4]   2> 7057 T1190 oashc.HttpShardHandlerFactory.getParameter Setting fairnessPolicy to: false
[junit4:junit4]   2> 7058 T1190 oascsi.HttpClientUtil.createClient Creating new http client, config:maxConnectionsPerHost=20&maxConnections=10000&socketTimeout=30000&connTimeout=15000&retry=false
[junit4:junit4]   2> 7079 T1190 oasc.CoreContainer.load Registering Log Listener
[junit4:junit4]   2> 7099 T1190 oasc.CoreContainer.initZooKeeper Zookeeper client=127.0.0.1:55150/solr
[junit4:junit4]   2> 7099 T1190 oasc.ZkController.checkChrootPath zkHost includes chroot
[junit4:junit4]   2> 7100 T1190 oaz.ZooKeeper.<init> Initiating client connection, connectString=127.0.0.1:55150 sessionTimeout=60000 watcher=org.apache.solr.common.cloud.ConnectionManager@49f4d5a
[junit4:junit4]   2> 7101 T1190 oascc.ConnectionManager.waitForConnected Waiting for client to connect to ZooKeeper
[junit4:junit4]   2> 7101 T1243 oaz.ClientCnxn$SendThread.logStartConnect Opening socket connection to server localhost/127.0.0.1:55150. Will not attempt to authenticate using SASL (access denied ("javax.security.auth.AuthPermission" "getLoginConfiguration"))
[junit4:junit4]   2> 7102 T1243 oaz.ClientCnxn$SendThread.primeConnection Socket connection established to localhost/127.0.0.1:55150, initiating session
[junit4:junit4]   2> 7103 T1192 oazs.NIOServerCnxnFactory.run Accepted socket connection from /140.211.11.196:55173
[junit4:junit4]   2> 7103 T1192 oazs.ZooKeeperServer.processConnectRequest Client attempting to establish new session at /140.211.11.196:55173
[junit4:junit4]   2> 7105 T1194 oazs.ZooKeeperServer.finishSessionInit Established session 0x13bf5178f1b0007 with negotiated timeout 20000 for client /140.211.11.196:55173
[junit4:junit4]   2> 7105 T1243 oaz.ClientCnxn$SendThread.onConnected Session establishment complete on server localhost/127.0.0.1:55150, sessionid = 0x13bf5178f1b0007, negotiated timeout = 20000
[junit4:junit4]   2> 7106 T1244 oascc.ConnectionManager.process Watcher org.apache.solr.common.cloud.ConnectionManager@49f4d5a name:ZooKeeperConnection Watcher:127.0.0.1:55150 got event WatchedEvent state:SyncConnected type:None path:null path:null type:None
[junit4:junit4]   2> 7106 T1190 oascc.ConnectionManager.waitForConnected Client is connected to ZooKeeper
[junit4:junit4]   2> 7107 T1195 oazs.PrepRequestProcessor.pRequest2Txn Processed session termination for sessionid: 0x13bf5178f1b0007
[junit4:junit4]   2> 7119 T1244 oaz.ClientCnxn$EventThread.run EventThread shut down
[junit4:junit4]   2> 7120 T1192 oazs.NIOServerCnxn.closeSock Closed socket connection for client /140.211.11.196:55173 which had sessionid 0x13bf5178f1b0007
[junit4:junit4]   2> 7119 T1190 oaz.ZooKeeper.close Session: 0x13bf5178f1b0007 closed
[junit4:junit4]   2> 7120 T1190 oascsi.HttpClientUtil.createClient Creating new http client, config:maxConnections=500&maxConnectionsPerHost=16&socketTimeout=15000&connTimeout=30000
[junit4:junit4]   2> 7132 T1190 oaz.ZooKeeper.<init> Initiating client connection, connectString=127.0.0.1:55150/solr sessionTimeout=30000 watcher=org.apache.solr.common.cloud.ConnectionManager@3519594
[junit4:junit4]   2> 7133 T1190 oascc.ConnectionManager.waitForConnected Waiting for client to connect to ZooKeeper
[junit4:junit4]   2> 7133 T1245 oaz.ClientCnxn$SendThread.logStartConnect Opening socket connection to server localhost/127.0.0.1:55150. Will not attempt to authenticate using SASL (access denied ("javax.security.auth.AuthPermission" "getLoginConfiguration"))
[junit4:junit4]   2> 7134 T1245 oaz.ClientCnxn$SendThread.primeConnection Socket connection established to localhost/127.0.0.1:55150, initiating session
[junit4:junit4]   2> 7134 T1192 oazs.NIOServerCnxnFactory.run Accepted socket connection from /140.211.11.196:55174
[junit4:junit4]   2> 7135 T1192 oazs.ZooKeeperServer.processConnectRequest Client attempting to establish new session at /140.211.11.196:55174
[junit4:junit4]   2> 7136 T1194 oazs.ZooKeeperServer.finishSessionInit Established session 0x13bf5178f1b0008 with negotiated timeout 20000 for client /140.211.11.196:55174
[junit4:junit4]   2> 7136 T1245 oaz.ClientCnxn$SendThread.onConnected Session establishment complete on server localhost/127.0.0.1:55150, sessionid = 0x13bf5178f1b0008, negotiated timeout = 20000
[junit4:junit4]   2> 7136 T1246 oascc.ConnectionManager.process Watcher org.apache.solr.common.cloud.ConnectionManager@3519594 name:ZooKeeperConnection Watcher:127.0.0.1:55150/solr got event WatchedEvent state:SyncConnected type:None path:null path:null type:None
[junit4:junit4]   2> 7137 T1190 oascc.ConnectionManager.waitForConnected Client is connected to ZooKeeper
[junit4:junit4]   2> 7138 T1195 oazs.PrepRequestProcessor.pRequest Got user-level KeeperException when processing sessionid:0x13bf5178f1b0008 type:create cxid:0x1 zxid:0x6c txntype:-1 reqpath:n/a Error Path:/solr/overseer Error:KeeperErrorCode = NodeExists for /solr/overseer
[junit4:junit4]   2> 7140 T1195 oazs.PrepRequestProcessor.pRequest Got user-level KeeperException when processing sessionid:0x13bf5178f1b0008 type:create cxid:0x2 zxid:0x6d txntype:-1 reqpath:n/a Error Path:/solr/overseer Error:KeeperErrorCode = NodeExists for /solr/overseer
[junit4:junit4]   2> 7147 T1190 oasc.ZkController.createEphemeralLiveNode Register node as live in ZooKeeper:/live_nodes/127.0.0.1:55172_
[junit4:junit4]   2> 7147 T1195 oazs.PrepRequestProcessor.pRequest Got user-level KeeperException when processing sessionid:0x13bf5178f1b0008 type:delete cxid:0x4 zxid:0x6e txntype:-1 reqpath:n/a Error Path:/solr/live_nodes/127.0.0.1:55172_ Error:KeeperErrorCode = NoNode for /solr/live_nodes/127.0.0.1:55172_
[junit4:junit4]   2> 7148 T1190 oascc.SolrZkClient.makePath makePath: /live_nodes/127.0.0.1:55172_
[junit4:junit4]   2> 7151 T1212 oascc.ZkStateReader$2.process A cluster state change: WatchedEvent state:SyncConnected type:NodeChildrenChanged path:/live_nodes, has occurred - updating... (live nodes size: 2)
[junit4:junit4]   2> 7151 T1231 oascc.ZkStateReader$2.process A cluster state change: WatchedEvent state:SyncConnected type:NodeChildrenChanged path:/live_nodes, has occurred - updating... (live nodes size: 2)
[junit4:junit4]   2> 7151 T1218 oascc.ZkStateReader$3.process Updating live nodes... (3)
[junit4:junit4]   2> 7152 T1218 oascc.ZkStateReader$2.process A cluster state change: WatchedEvent state:SyncConnected type:NodeChildrenChanged path:/live_nodes, has occurred - updating... (live nodes size: 3)
[junit4:junit4]   2> 7153 T1212 oascc.ZkStateReader$3.process Updating live nodes... (3)
[junit4:junit4]   2> 7159 T1231 oascc.ZkStateReader$3.process Updating live nodes... (3)
[junit4:junit4]   2> 7161 T1190 oascc.ZkStateReader.createClusterStateWatchersAndUpdate Updating cluster state from ZooKeeper... 
[junit4:junit4]   2> 7168 T1247 oasc.CoreContainer.create Creating SolrCore 'collection1' using instanceDir: /usr/home/hudson/hudson-slave/workspace/Lucene-Solr-Tests-4.x-java7/solr/build/solr-core/test/J0/./org.apache.solr.cloud.SyncSliceTest-jetty2-1357026666920/collection1
[junit4:junit4]   2> 7168 T1247 oasc.ZkController.createCollectionZkNode Check for collection zkNode:collection1
[junit4:junit4]   2> 7169 T1247 oasc.ZkController.createCollectionZkNode Collection zkNode exists
[junit4:junit4]   2> 7169 T1247 oasc.ZkController.readConfigName Load collection config from:/collections/collection1
[junit4:junit4]   2> 7170 T1247 oasc.SolrResourceLoader.<init> new SolrResourceLoader for directory: '/usr/home/hudson/hudson-slave/workspace/Lucene-Solr-Tests-4.x-java7/solr/build/solr-core/test/J0/./org.apache.solr.cloud.SyncSliceTest-jetty2-1357026666920/collection1/'
[junit4:junit4]   2> 7172 T1247 oasc.SolrResourceLoader.replaceClassLoader Adding 'file:/usr/home/hudson/hudson-slave/workspace/Lucene-Solr-Tests-4.x-java7/solr/build/solr-core/test/J0/org.apache.solr.cloud.SyncSliceTest-jetty2-1357026666920/collection1/lib/README' to classloader
[junit4:junit4]   2> 7172 T1247 oasc.SolrResourceLoader.replaceClassLoader Adding 'file:/usr/home/hudson/hudson-slave/workspace/Lucene-Solr-Tests-4.x-java7/solr/build/solr-core/test/J0/org.apache.solr.cloud.SyncSliceTest-jetty2-1357026666920/collection1/lib/classes/' to classloader
[junit4:junit4]   2> 7225 T1247 oasc.SolrConfig.<init> Using Lucene MatchVersion: LUCENE_41
[junit4:junit4]   2> 7296 T1247 oasc.SolrConfig.<init> Loaded SolrConfig: solrconfig.xml
[junit4:junit4]   2> 7297 T1247 oass.IndexSchema.readSchema Reading Solr Schema
[junit4:junit4]   2> 7303 T1247 oass.IndexSchema.readSchema Schema name=test
[junit4:junit4]   2> 7873 T1247 oass.OpenExchangeRatesOrgProvider.init Initialized with rates=open-exchange-rates.json, refreshInterval=1440.
[junit4:junit4]   2> 7880 T1247 oass.IndexSchema.readSchema default search field in schema is text
[junit4:junit4]   2> 7883 T1247 oass.IndexSchema.readSchema unique key field: id
[junit4:junit4]   2> 7894 T1247 oass.FileExchangeRateProvider.reload Reloading exchange rates from file currency.xml
[junit4:junit4]   2> 7898 T1247 oass.FileExchangeRateProvider.reload Reloading exchange rates from file currency.xml
[junit4:junit4]   2> 7902 T1247 oass.OpenExchangeRatesOrgProvider.reload Reloading exchange rates from open-exchange-rates.json
[junit4:junit4]   2> 7903 T1247 oass.OpenExchangeRatesOrgProvider.reload Reloading exchange rates from open-exchange-rates.json
[junit4:junit4]   2> 7904 T1247 oasc.SolrCore.<init> [collection1] Opening new SolrCore at /usr/home/hudson/hudson-slave/workspace/Lucene-Solr-Tests-4.x-java7/solr/build/solr-core/test/J0/./org.apache.solr.cloud.SyncSliceTest-jetty2-1357026666920/collection1/, dataDir=./org.apache.solr.cloud.SyncSliceTest-1357026660116/jetty2/
[junit4:junit4]   2> 7904 T1247 oasc.JmxMonitoredMap.<init> JMX monitoring is enabled. Adding Solr mbeans to JMX Server: com.sun.jmx.mbeanserver.JmxMBeanServer@4e810bca
[junit4:junit4]   2> 7904 T1247 oasc.SolrCore.initDirectoryFactory solr.NRTCachingDirectoryFactory
[junit4:junit4]   2> 7905 T1247 oasc.CachingDirectoryFactory.get return new directory for /usr/home/hudson/hudson-slave/workspace/Lucene-Solr-Tests-4.x-java7/solr/build/solr-core/test/J0/./org.apache.solr.cloud.SyncSliceTest-1357026660116/jetty2 forceNew:false
[junit4:junit4]   2> 7905 T1247 oasc.CachingDirectoryFactory.close Releasing directory:/usr/home/hudson/hudson-slave/workspace/Lucene-Solr-Tests-4.x-java7/solr/build/solr-core/test/J0/./org.apache.solr.cloud.SyncSliceTest-1357026660116/jetty2
[junit4:junit4]   2> 7906 T1247 oasc.SolrCore.getNewIndexDir New index directory detected: old=null new=./org.apache.solr.cloud.SyncSliceTest-1357026660116/jetty2/index/
[junit4:junit4]   2> 7906 T1247 oasc.SolrCore.initIndex WARNING [collection1] Solr index directory './org.apache.solr.cloud.SyncSliceTest-1357026660116/jetty2/index' doesn't exist. Creating new index...
[junit4:junit4]   2> 7907 T1247 oasc.CachingDirectoryFactory.get return new directory for /usr/home/hudson/hudson-slave/workspace/Lucene-Solr-Tests-4.x-java7/solr/build/solr-core/test/J0/./org.apache.solr.cloud.SyncSliceTest-1357026660116/jetty2/index forceNew:false
[junit4:junit4]   2> 7938 T1247 oasc.SolrDeletionPolicy.onCommit SolrDeletionPolicy.onCommit: commits:num=1
[junit4:junit4]   2> 		commit{dir=RateLimitedDirectoryWrapper(NRTCachingDirectory(org.apache.lucene.store.NIOFSDirectory@/usr/home/hudson/hudson-slave/workspace/Lucene-Solr-Tests-4.x-java7/solr/build/solr-core/test/J0/org.apache.solr.cloud.SyncSliceTest-1357026660116/jetty2/index lockFactory=org.apache.lucene.store.NativeFSLockFactory@22d5fdd7; maxCacheMB=48.0 maxMergeSizeMB=4.0)),segFN=segments_1,generation=1,filenames=[segments_1]
[junit4:junit4]   2> 7939 T1247 oasc.SolrDeletionPolicy.updateCommits newest commit = 1[segments_1]
[junit4:junit4]   2> 7939 T1247 oasc.CachingDirectoryFactory.close Releasing directory:/usr/home/hudson/hudson-slave/workspace/Lucene-Solr-Tests-4.x-java7/solr/build/solr-core/test/J0/./org.apache.solr.cloud.SyncSliceTest-1357026660116/jetty2/index
[junit4:junit4]   2> 7940 T1247 oasc.SolrCore.initWriters created xml: solr.XMLResponseWriter
[junit4:junit4]   2> 7941 T1247 oasup.UpdateRequestProcessorChain.init inserting DistributedUpdateProcessorFactory into updateRequestProcessorChain "dedupe"
[junit4:junit4]   2> 7941 T1247 oasup.UpdateRequestProcessorChain.init inserting DistributedUpdateProcessorFactory into updateRequestProcessorChain "dedupe-allfields"
[junit4:junit4]   2> 7942 T1247 oasup.UpdateRequestProcessorChain.init inserting DistributedUpdateProcessorFactory into updateRequestProcessorChain "stored_sig"
[junit4:junit4]   2> 7942 T1247 oasup.UpdateRequestProcessorChain.init inserting DistributedUpdateProcessorFactory into updateRequestProcessorChain "uniq-fields"
[junit4:junit4]   2> 7942 T1247 oasup.UpdateRequestProcessorChain.init inserting DistributedUpdateProcessorFactory into updateRequestProcessorChain "distrib-dup-test-chain-implicit"
[junit4:junit4]   2> 7943 T1247 oasc.RequestHandlers.initHandlersFromConfig adding lazy requestHandler: solr.ReplicationHandler
[junit4:junit4]   2> 7943 T1247 oasc.RequestHandlers.initHandlersFromConfig created /replication: solr.ReplicationHandler
[junit4:junit4]   2> 7943 T1247 oasc.RequestHandlers.initHandlersFromConfig created standard: solr.StandardRequestHandler
[junit4:junit4]   2> 7944 T1247 oasc.RequestHandlers.initHandlersFromConfig created /get: solr.RealTimeGetHandler
[junit4:junit4]   2> 7944 T1247 oasc.RequestHandlers.initHandlersFromConfig created dismax: solr.SearchHandler
[junit4:junit4]   2> 7944 T1247 oasc.RequestHandlers.initHandlersFromConfig created mock: org.apache.solr.core.MockQuerySenderListenerReqHandler
[junit4:junit4]   2> 7945 T1247 oasc.RequestHandlers.initHandlersFromConfig created /admin/: org.apache.solr.handler.admin.AdminHandlers
[junit4:junit4]   2> 7945 T1247 oasc.RequestHandlers.initHandlersFromConfig created defaults: solr.StandardRequestHandler
[junit4:junit4]   2> 7945 T1247 oasc.RequestHandlers.initHandlersFromConfig adding lazy requestHandler: solr.StandardRequestHandler
[junit4:junit4]   2> 7946 T1247 oasc.RequestHandlers.initHandlersFromConfig created lazy: solr.StandardRequestHandler
[junit4:junit4]   2> 7946 T1247 oasc.RequestHandlers.initHandlersFromConfig created /update: solr.UpdateRequestHandler
[junit4:junit4]   2> 7946 T1247 oasc.RequestHandlers.initHandlersFromConfig created /terms: org.apache.solr.handler.component.SearchHandler
[junit4:junit4]   2> 7947 T1247 oasc.RequestHandlers.initHandlersFromConfig created spellCheckCompRH: org.apache.solr.handler.component.SearchHandler
[junit4:junit4]   2> 7947 T1247 oasc.RequestHandlers.initHandlersFromConfig created spellCheckCompRH_Direct: org.apache.solr.handler.component.SearchHandler
[junit4:junit4]   2> 7947 T1247 oasc.RequestHandlers.initHandlersFromConfig created spellCheckWithWordbreak: org.apache.solr.handler.component.SearchHandler
[junit4:junit4]   2> 7948 T1247 oasc.RequestHandlers.initHandlersFromConfig created spellCheckWithWordbreak_Direct: org.apache.solr.handler.component.SearchHandler
[junit4:junit4]   2> 7948 T1247 oasc.RequestHandlers.initHandlersFromConfig created spellCheckCompRH1: org.apache.solr.handler.component.SearchHandler
[junit4:junit4]   2> 7948 T1247 oasc.RequestHandlers.initHandlersFromConfig created mltrh: org.apache.solr.handler.component.SearchHandler
[junit4:junit4]   2> 7949 T1247 oasc.RequestHandlers.initHandlersFromConfig created tvrh: org.apache.solr.handler.component.SearchHandler
[junit4:junit4]   2> 7949 T1247 oasc.RequestHandlers.initHandlersFromConfig created /mlt: solr.MoreLikeThisHandler
[junit4:junit4]   2> 7949 T1247 oasc.RequestHandlers.initHandlersFromConfig created /debug/dump: solr.DumpRequestHandler
[junit4:junit4]   2> 7958 T1247 oashl.XMLLoader.init xsltCacheLifetimeSeconds=60
[junit4:junit4]   2> 7961 T1247 oasc.SolrCore.initDeprecatedSupport WARNING solrconfig.xml uses deprecated <admin/gettableFiles>, Please update your config to use the ShowFileRequestHandler.
[junit4:junit4]   2> 7962 T1247 oasc.SolrCore.initDeprecatedSupport WARNING adding ShowFileRequestHandler with hidden files: [SCHEMA.XML, OLD_SYNONYMS.TXT, STOPWORDS.TXT, PROTWORDS.TXT, OPEN-EXCHANGE-RATES.JSON, SYNONYMS.TXT, CURRENCY.XML, MAPPING-ISOLATIN1ACCENT.TXT]
[junit4:junit4]   2> 7963 T1247 oasc.CachingDirectoryFactory.close Releasing directory:/usr/home/hudson/hudson-slave/workspace/Lucene-Solr-Tests-4.x-java7/solr/build/solr-core/test/J0/./org.apache.solr.cloud.SyncSliceTest-1357026660116/jetty2
[junit4:junit4]   2> 7965 T1247 oass.SolrIndexSearcher.<init> Opening Searcher@7b01943e main
[junit4:junit4]   2> 7965 T1247 oasu.CommitTracker.<init> Hard AutoCommit: disabled
[junit4:junit4]   2> 7966 T1247 oasu.CommitTracker.<init> Soft AutoCommit: disabled
[junit4:junit4]   2> 7966 T1247 oashc.SpellCheckComponent.inform Initializing spell checkers
[junit4:junit4]   2> 7971 T1247 oass.DirectSolrSpellChecker.init init: {name=direct,classname=DirectSolrSpellChecker,field=lowerfilt,minQueryLength=3}
[junit4:junit4]   2> 8027 T1248 oasc.SolrCore.registerSearcher [collection1] Registered new searcher Searcher@7b01943e main{StandardDirectoryReader(segments_1:1)}
[junit4:junit4]   2> 8029 T1247 oasc.ZkController.publish publishing core=collection1 state=down
[junit4:junit4]   2> 8029 T1247 oasc.ZkController.publish numShards not found on descriptor - reading it from system property
[junit4:junit4]   2> 8275 T1213 oascc.ZkStateReader.updateClusterState Updating cloud state from ZooKeeper... 
[junit4:junit4]   2> 8276 T1213 oasc.Overseer$ClusterStateUpdater.updateState Update state numShards=1 message={
[junit4:junit4]   2> 	  "operation":"state",
[junit4:junit4]   2> 	  "numShards":"1",
[junit4:junit4]   2> 	  "shard":"shard1",
[junit4:junit4]   2> 	  "roles":null,
[junit4:junit4]   2> 	  "state":"active",
[junit4:junit4]   2> 	  "core":"collection1",
[junit4:junit4]   2> 	  "collection":"collection1",
[junit4:junit4]   2> 	  "node_name":"127.0.0.1:55163_",
[junit4:junit4]   2> 	  "base_url":"http://127.0.0.1:55163"}
[junit4:junit4]   2> 8280 T1213 oasc.Overseer$ClusterStateUpdater.updateState Update state numShards=1 message={
[junit4:junit4]   2> 	  "operation":"state",
[junit4:junit4]   2> 	  "numShards":"1",
[junit4:junit4]   2> 	  "shard":null,
[junit4:junit4]   2> 	  "roles":null,
[junit4:junit4]   2> 	  "state":"down",
[junit4:junit4]   2> 	  "core":"collection1",
[junit4:junit4]   2> 	  "collection":"collection1",
[junit4:junit4]   2> 	  "node_name":"127.0.0.1:55172_",
[junit4:junit4]   2> 	  "base_url":"http://127.0.0.1:55172"}
[junit4:junit4]   2> 8280 T1213 oasc.Overseer$ClusterStateUpdater.updateState Collection already exists with numShards=1
[junit4:junit4]   2> 8280 T1213 oasc.Overseer$ClusterStateUpdater.updateState Assigning new node to shard shard=shard1
[junit4:junit4]   2> 8292 T1212 oascc.ZkStateReader$2.process A cluster state change: WatchedEvent state:SyncConnected type:NodeDataChanged path:/clusterstate.json, has occurred - updating... (live nodes size: 3)
[junit4:junit4]   2> 8292 T1231 oascc.ZkStateReader$2.process A cluster state change: WatchedEvent state:SyncConnected type:NodeDataChanged path:/clusterstate.json, has occurred - updating... (live nodes size: 3)
[junit4:junit4]   2> 8292 T1246 oascc.ZkStateReader$2.process A cluster state change: WatchedEvent state:SyncConnected type:NodeDataChanged path:/clusterstate.json, has occurred - updating... (live nodes size: 3)
[junit4:junit4]   2> 8292 T1218 oascc.ZkStateReader$2.process A cluster state change: WatchedEvent state:SyncConnected type:NodeDataChanged path:/clusterstate.json, has occurred - updating... (live nodes size: 3)
[junit4:junit4]   2> 9032 T1247 oasc.CoreContainer.registerCore registering core: collection1
[junit4:junit4]   2> 9032 T1247 oasc.ZkController.register Register replica - core:collection1 address:http://127.0.0.1:55172 collection:collection1 shard:shard1
[junit4:junit4]   2> 9039 T1247 oasc.ZkController.register We are http://127.0.0.1:55172/collection1/ and leader is http://127.0.0.1:55163/collection1/
[junit4:junit4]   2> 9040 T1247 oasc.ZkController.register No LogReplay needed for core=collection1 baseURL=http://127.0.0.1:55172
[junit4:junit4]   2> 9040 T1247 oasc.ZkController.checkRecovery Core needs to recover:collection1
[junit4:junit4]   2> 9040 T1247 oasu.DefaultSolrCoreState.doRecovery Running recovery - first canceling any ongoing recovery
[junit4:junit4]   2> ASYNC  NEW_CORE C74 name=collection1 org.apache.solr.core.SolrCore@563d853d url=http://127.0.0.1:55172/collection1 node=127.0.0.1:55172_ C74_STATE=coll:collection1 core:collection1 props:{shard=null, roles=null, state=down, core=collection1, collection=collection1, node_name=127.0.0.1:55172_, base_url=http://127.0.0.1:55172}
[junit4:junit4]   2> 9041 T1249 C74 P55172 oasc.RecoveryStrategy.run Starting recovery process.  core=collection1 recoveringAfterStartup=true
[junit4:junit4]   2> 9041 T1247 oascc.ZkStateReader.updateClusterState Updating cloud state from ZooKeeper... 
[junit4:junit4]   2> 9042 T1249 C74 P55172 oasc.RecoveryStrategy.doRecovery ###### startupVersions=[]
[junit4:junit4]   2> 9042 T1249 C74 P55172 oasc.ZkController.publish publishing core=collection1 state=recovering
[junit4:junit4]   2> 9042 T1249 C74 P55172 oasc.ZkController.publish numShards not found on descriptor - reading it from system property
[junit4:junit4]   2> 9043 T1190 oass.SolrDispatchFilter.init user.dir=/usr/home/hudson/hudson-slave/workspace/Lucene-Solr-Tests-4.x-java7/solr/build/solr-core/test/J0
[junit4:junit4]   2> 9043 T1190 oass.SolrDispatchFilter.init SolrDispatchFilter.init() done
[junit4:junit4]   2> 9044 T1249 C74 P55172 oascsi.HttpClientUtil.createClient Creating new http client, config:maxConnections=128&maxConnectionsPerHost=32&followRedirects=false
[junit4:junit4]   2> 9044 T1190 oascsi.HttpClientUtil.createClient Creating new http client, config:maxConnections=128&maxConnectionsPerHost=32&followRedirects=false
[junit4:junit4]   2> 9236 T1190 oejs.Server.doStart jetty-8.1.8.v20121106
[junit4:junit4]   2> 9239 T1190 oejs.AbstractConnector.doStart Started SocketConnector@127.0.0.1:55179
[junit4:junit4]   2> 9240 T1190 oasc.SolrResourceLoader.locateSolrHome JNDI not configured for solr (NoInitialContextEx)
[junit4:junit4]   2> 9241 T1190 oasc.SolrResourceLoader.locateSolrHome using system property solr.solr.home: /usr/home/hudson/hudson-slave/workspace/Lucene-Solr-Tests-4.x-java7/solr/build/solr-core/test/J0/./org.apache.solr.cloud.SyncSliceTest-jetty3-1357026669178
[junit4:junit4]   2> 9241 T1190 oasc.SolrResourceLoader.<init> new SolrResourceLoader for deduced Solr Home: '/usr/home/hudson/hudson-slave/workspace/Lucene-Solr-Tests-4.x-java7/solr/build/solr-core/test/J0/./org.apache.solr.cloud.SyncSliceTest-jetty3-1357026669178/'
[junit4:junit4]   2> 9283 T1190 oass.SolrDispatchFilter.init SolrDispatchFilter.init()
[junit4:junit4]   2> 9284 T1190 oasc.SolrResourceLoader.locateSolrHome JNDI not configured for solr (NoInitialContextEx)
[junit4:junit4]   2> 9284 T1190 oasc.SolrResourceLoader.locateSolrHome using system property solr.solr.home: /usr/home/hudson/hudson-slave/workspace/Lucene-Solr-Tests-4.x-java7/solr/build/solr-core/test/J0/./org.apache.solr.cloud.SyncSliceTest-jetty3-1357026669178
[junit4:junit4]   2> 9285 T1190 oasc.CoreContainer$Initializer.initialize looking for solr.xml: /usr/home/hudson/hudson-slave/workspace/Lucene-Solr-Tests-4.x-java7/solr/build/solr-core/test/J0/./org.apache.solr.cloud.SyncSliceTest-jetty3-1357026669178/solr.xml
[junit4:junit4]   2> 9285 T1190 oasc.CoreContainer.<init> New CoreContainer 1056869452
[junit4:junit4]   2> 9286 T1190 oasc.CoreContainer.load Loading CoreContainer using Solr Home: '/usr/home/hudson/hudson-slave/workspace/Lucene-Solr-Tests-4.x-java7/solr/build/solr-core/test/J0/./org.apache.solr.cloud.SyncSliceTest-jetty3-1357026669178/'
[junit4:junit4]   2> 9287 T1190 oasc.SolrResourceLoader.<init> new SolrResourceLoader for directory: '/usr/home/hudson/hudson-slave/workspace/Lucene-Solr-Tests-4.x-java7/solr/build/solr-core/test/J0/./org.apache.solr.cloud.SyncSliceTest-jetty3-1357026669178/'
[junit4:junit4]   2> 9316 T1190 oashc.HttpShardHandlerFactory.getParameter Setting socketTimeout to: 30000
[junit4:junit4]   2> 9317 T1190 oashc.HttpShardHandlerFactory.getParameter Setting urlScheme to: http://
[junit4:junit4]   2> 9317 T1190 oashc.HttpShardHandlerFactory.getParameter Setting connTimeout to: 15000
[junit4:junit4]   2> 9318 T1190 oashc.HttpShardHandlerFactory.getParameter Setting maxConnectionsPerHost to: 20
[junit4:junit4]   2> 9318 T1190 oashc.HttpShardHandlerFactory.getParameter Setting corePoolSize to: 0
[junit4:junit4]   2> 9319 T1190 oashc.HttpShardHandlerFactory.getParameter Setting maximumPoolSize to: 2147483647
[junit4:junit4]   2> 9319 T1190 oashc.HttpShardHandlerFactory.getParameter Setting maxThreadIdleTime to: 5
[junit4:junit4]   2> 9320 T1190 oashc.HttpShardHandlerFactory.getParameter Setting sizeOfQueue to: -1
[junit4:junit4]   2> 9320 T1190 oashc.HttpShardHandlerFactory.getParameter Setting fairnessPolicy to: false
[junit4:junit4]   2> 9321 T1190 oascsi.HttpClientUtil.createClient Creating new http client, config:maxConnectionsPerHost=20&maxConnections=10000&socketTimeout=30000&connTimeout=15000&retry=false
[junit4:junit4]   2> 9342 T1190 oasc.CoreContainer.load Registering Log Listener
[junit4:junit4]   2> 9362 T1190 oasc.CoreContainer.initZooKeeper Zookeeper client=127.0.0.1:55150/solr
[junit4:junit4]   2> 9363 T1190 oasc.ZkController.checkChrootPath zkHost includes chroot
[junit4:junit4]   2> 9363 T1190 oaz.ZooKeeper.<init> Initiating client connection, connectString=127.0.0.1:55150 sessionTimeout=60000 watcher=org.apache.solr.common.cloud.ConnectionManager@6bd2c235
[junit4:junit4]   2> 9364 T1190 oascc.ConnectionManager.waitForConnected Waiting for client to connect to ZooKeeper
[junit4:junit4]   2> 9365 T1259 oaz.ClientCnxn$SendThread.logStartConnect Opening socket connection to server localhost/127.0.0.1:55150. Will not attempt to authenticate using SASL (access denied ("javax.security.auth.AuthPermission" "getLoginConfiguration"))
[junit4:junit4]   2> 9366 T1259 oaz.ClientCnxn$SendThread.primeConnection Socket connection established to localhost/127.0.0.1:55150, initiating session
[junit4:junit4]   2> 9366 T1192 oazs.NIOServerCnxnFactory.run Accepted socket connection from /140.211.11.196:55180
[junit4:junit4]   2> 9366 T1192 oazs.ZooKeeperServer.processConnectRequest Client attempting to establish new session at /140.211.11.196:55180
[junit4:junit4]   2> 9368 T1194 oazs.ZooKeeperServer.finishSessionInit Established session 0x13bf5178f1b0009 with negotiated timeout 20000 for client /140.211.11.196:55180
[junit4:junit4]   2> 9368 T1259 oaz.ClientCnxn$SendThread.onConnected Session establishment complete on server localhost/127.0.0.1:55150, sessionid = 0x13bf5178f1b0009, negotiated timeout = 20000
[junit4:junit4]   2> 9369 T1260 oascc.ConnectionManager.process Watcher org.apache.solr.common.cloud.ConnectionManager@6bd2c235 name:ZooKeeperConnection Watcher:127.0.0.1:55150 got event WatchedEvent state:SyncConnected type:None path:null path:null type:None
[junit4:junit4]   2> 9369 T1190 oascc.ConnectionManager.waitForConnected Client is connected to ZooKeeper
[junit4:junit4]   2> 9371 T1195 oazs.PrepRequestProcessor.pRequest2Txn Processed session termination for sessionid: 0x13bf5178f1b0009
[junit4:junit4]   2> 9388 T1260 oaz.ClientCnxn$EventThread.run EventThread shut down
[junit4:junit4]   2> 9388 T1192 oazs.NIOServerCnxn.closeSock Closed socket connection for client /140.211.11.196:55180 which had sessionid 0x13bf5178f1b0009
[junit4:junit4]   2> 9388 T1190 oaz.ZooKeeper.close Session: 0x13bf5178f1b0009 closed
[junit4:junit4]   2> 9389 T1190 oascsi.HttpClientUtil.createClient Creating new http client, config:maxConnections=500&maxConnectionsPerHost=16&socketTimeout=15000&connTimeout=30000
[junit4:junit4]   2> 9401 T1190 oaz.ZooKeeper.<init> Initiating client connection, connectString=127.0.0.1:55150/solr sessionTimeout=30000 watcher=org.apache.solr.common.cloud.ConnectionManager@594ed842
[junit4:junit4]   2> 9402 T1190 oascc.ConnectionManager.waitForConnected Waiting for client to connect to ZooKeeper
[junit4:junit4]   2> 9402 T1261 oaz.ClientCnxn$SendThread.logStartConnect Opening socket connection to server localhost/127.0.0.1:55150. Will not attempt to authenticate using SASL (access denied ("javax.security.auth.AuthPermission" "getLoginConfiguration"))
[junit4:junit4]   2> 9403 T1261 oaz.ClientCnxn$SendThread.primeConnection Socket connection established to localhost/127.0.0.1:55150, initiating session
[junit4:junit4]   2> 9403 T1192 oazs.NIOServerCnxnFactory.run Accepted socket connection from /140.211.11.196:55181
[junit4:junit4]   2> 9403 T1192 oazs.ZooKeeperServer.processConnectRequest Client attempting to establish new session at /140.211.11.196:55181
[junit4:junit4]   2> 9405 T1194 oazs.ZooKeeperServer.finishSessionInit Established session 0x13bf5178f1b000a with negotiated timeout 20000 for client /140.211.11.196:55181
[junit4:junit4]   2> 9405 T1261 oaz.ClientCnxn$SendThread.onConnected Session establishment complete on server localhost/127.0.0.1:55150, sessionid = 0x13bf5178f1b000a, negotiated timeout = 20000
[junit4:junit4]   2> 9405 T1262 oascc.ConnectionManager.process Watcher org.apache.solr.common.cloud.ConnectionManager@594ed842 name:ZooKeeperConnection Watcher:127.0.0.1:55150/solr got event WatchedEvent state:SyncConnected type:None path:null path:null type:None
[junit4:junit4]   2> 9405 T1190 oascc.ConnectionManager.waitForConnected Client is connected to ZooKeeper
[junit4:junit4]   2> 9407 T1195 oazs.PrepRequestProcessor.pRequest Got user-level KeeperException when processing sessionid:0x13bf5178f1b000a type:create cxid:0x1 zxid:0x7e txntype:-1 reqpath:n/a Error Path:/solr/overseer Error:KeeperErrorCode = NodeExists for /solr/overseer
[junit4:junit4]   2> 9408 T1195 oazs.PrepRequestProcessor.pRequest Got user-level KeeperException when processing sessionid:0x13bf5178f1b000a type:create cxid:0x2 zxid:0x7f txntype:-1 reqpath:n/a Error Path:/solr/overseer Error:KeeperErrorCode = NodeExists for /solr/overseer
[junit4:junit4]   2> 9410 T1190 oasc.ZkController.createEphemeralLiveNode Register node as live in ZooKeeper:/live_nodes/127.0.0.1:55179_
[junit4:junit4]   2> 9410 T1195 oazs.PrepRequestProcessor.pRequest Got user-level KeeperException when processing sessionid:0x13bf5178f1b000a type:delete cxid:0x4 zxid:0x80 txntype:-1 reqpath:n/a Error Path:/solr/live_nodes/127.0.0.1:55179_ Error:KeeperErrorCode = NoNode for /solr/live_nodes/127.0.0.1:55179_
[junit4:junit4]   2> 9419 T1190 oascc.SolrZkClient.makePath makePath: /live_nodes/127.0.0.1:55179_
[junit4:junit4]   2> 9422 T1212 oascc.ZkStateReader$2.process A cluster state change: WatchedEvent state:SyncConnected type:NodeChildrenChanged path:/live_nodes, has occurred - updating... (live nodes size: 3)
[junit4:junit4]   2> 9422 T1231 oascc.ZkStateReader$2.process A cluster state change: WatchedEvent state:SyncConnected type:NodeChildrenChanged path:/live_nodes, has occurred - updating... (live nodes size: 3)
[junit4:junit4]   2> 9422 T1246 oascc.ZkStateReader$3.process Updating live nodes... (4)
[junit4:junit4]   2> 9423 T1218 oascc.ZkStateReader$3.process Updating live nodes... (4)
[junit4:junit4]   2> 9423 T1246 oascc.ZkStateReader$2.process A cluster state change: WatchedEvent state:SyncConnected type:NodeChildrenChanged path:/live_nodes, has occurred - updating... (live nodes size: 4)
[junit4:junit4]   2> 9423 T1218 oascc.ZkStateReader$2.process A cluster state change: WatchedEvent state:SyncConnected type:NodeChildrenChanged path:/live_nodes, has occurred - updating... (live nodes size: 4)
[junit4:junit4]   2> 9424 T1212 oascc.ZkStateReader$3.process Updating live nodes... (4)
[junit4:junit4]   2> 9429 T1231 oascc.ZkStateReader$3.process Updating live nodes... (4)
[junit4:junit4]   2> 9430 T1190 oascc.ZkStateReader.createClusterStateWatchersAndUpdate Updating cluster state from ZooKeeper... 
[junit4:junit4]   2> 9438 T1263 oasc.CoreContainer.create Creating SolrCore 'collection1' using instanceDir: /usr/home/hudson/hudson-slave/workspace/Lucene-Solr-Tests-4.x-java7/solr/build/solr-core/test/J0/./org.apache.solr.cloud.SyncSliceTest-jetty3-1357026669178/collection1
[junit4:junit4]   2> 9438 T1263 oasc.ZkController.createCollectionZkNode Check for collection zkNode:collection1
[junit4:junit4]   2> 9439 T1263 oasc.ZkController.createCollectionZkNode Collection zkNode exists
[junit4:junit4]   2> 9439 T1263 oasc.ZkController.readConfigName Load collection config from:/collections/collection1
[junit4:junit4]   2> 9440 T1263 oasc.SolrResourceLoader.<init> new SolrResourceLoader for directory: '/usr/home/hudson/hudson-slave/workspace/Lucene-Solr-Tests-4.x-java7/solr/build/solr-core/test/J0/./org.apache.solr.cloud.SyncSliceTest-jetty3-1357026669178/collection1/'
[junit4:junit4]   2> 9441 T1263 oasc.SolrResourceLoader.replaceClassLoader Adding 'file:/usr/home/hudson/hudson-slave/workspace/Lucene-Solr-Tests-4.x-java7/solr/build/solr-core/test/J0/org.apache.solr.cloud.SyncSliceTest-jetty3-1357026669178/collection1/lib/README' to classloader
[junit4:junit4]   2> 9442 T1263 oasc.SolrResourceLoader.replaceClassLoader Adding 'file:/usr/home/hudson/hudson-slave/workspace/Lucene-Solr-Tests-4.x-java7/solr/build/solr-core/test/J0/org.apache.solr.cloud.SyncSliceTest-jetty3-1357026669178/collection1/lib/classes/' to classloader
[junit4:junit4]   2> 9494 T1263 oasc.SolrConfig.<init> Using Lucene MatchVersion: LUCENE_41
[junit4:junit4]   2> 9564 T1263 oasc.SolrConfig.<init> Loaded SolrConfig: solrconfig.xml
[junit4:junit4]   2> 9566 T1263 oass.IndexSchema.readSchema Reading Solr Schema
[junit4:junit4]   2> 9572 T1263 oass.IndexSchema.readSchema Schema name=test
[junit4:junit4]   2> 9799 T1213 oascc.ZkStateReader.updateClusterState Updating cloud state from ZooKeeper... 
[junit4:junit4]   2> 9799 T1213 oasc.Overseer$ClusterStateUpdater.updateState Update state numShards=1 message={
[junit4:junit4]   2> 	  "operation":"state",
[junit4:junit4]   2> 	  "numShards":"1",
[junit4:junit4]   2> 	  "shard":"shard1",
[junit4:junit4]   2> 	  "roles":null,
[junit4:junit4]   2> 	  "state":"recovering",
[junit4:junit4]   2> 	  "core":"collection1",
[junit4:junit4]   2> 	  "collection":"collection1",
[junit4:junit4]   2> 	  "node_name":"127.0.0.1:55172_",
[junit4:junit4]   2> 	  "base_url":"http://127.0.0.1:55172"}
[junit4:junit4]   2> 9820 T1218 oascc.ZkStateReader$2.process A cluster state change: WatchedEvent state:SyncConnected type:NodeDataChanged path:/clusterstate.json, has occurred - updating... (live nodes size: 4)
[junit4:junit4]   2> 9820 T1262 oascc.ZkStateReader$2.process A cluster state change: WatchedEvent state:SyncConnected type:NodeDataChanged path:/clusterstate.json, has occurred - updating... (live nodes size: 4)
[junit4:junit4]   2> 9820 T1212 oascc.ZkStateReader$2.process A cluster state change: WatchedEvent state:SyncConnected type:NodeDataChanged path:/clusterstate.json, has occurred - updating... (live nodes size: 4)
[junit4:junit4]   2> 9820 T1246 oascc.ZkStateReader$2.process A cluster state change: WatchedEvent state:SyncConnected type:NodeDataChanged path:/clusterstate.json, has occurred - updating... (live nodes size: 4)
[junit4:junit4]   2> 9820 T1231 oascc.ZkStateReader$2.process A cluster state change: WatchedEvent state:SyncConnected type:NodeDataChanged path:/clusterstate.json, has occurred - updating... (live nodes size: 4)
[junit4:junit4]   2> 10205 T1263 oass.OpenExchangeRatesOrgProvider.init Initialized with rates=open-exchange-rates.json, refreshInterval=1440.
[junit4:junit4]   2> 10215 T1263 oass.IndexSchema.readSchema default search field in schema is text
[junit4:junit4]   2> 10220 T1263 oass.IndexSchema.readSchema unique key field: id
[junit4:junit4]   2> 10234 T1263 oass.FileExchangeRateProvider.reload Reloading exchange rates from file currency.xml
[junit4:junit4]   2> 10239 T1263 oass.FileExchangeRateProvider.reload Reloading exchange rates from file currency.xml
[junit4:junit4]   2> 10243 T1263 oass.OpenExchangeRatesOrgProvider.reload Reloading exchange rates from open-exchange-rates.json
[junit4:junit4]   2> 10245 T1263 oass.OpenExchangeRatesOrgProvider.reload Reloading exchange rates from open-exchange-rates.json
[junit4:junit4]   2> 10246 T1263 oasc.SolrCore.<init> [collection1] Opening new SolrCore at /usr/home/hudson/hudson-slave/workspace/Lucene-Solr-Tests-4.x-java7/solr/build/solr-core/test/J0/./org.apache.solr.cloud.SyncSliceTest-jetty3-1357026669178/collection1/, dataDir=./org.apache.solr.cloud.SyncSliceTest-1357026660116/jetty3/
[junit4:junit4]   2> 10246 T1263 oasc.JmxMonitoredMap.<init> JMX monitoring is enabled. Adding Solr mbeans to JMX Server: com.sun.jmx.mbeanserver.JmxMBeanServer@4e810bca
[junit4:junit4]   2> 10247 T1263 oasc.SolrCore.initDirectoryFactory solr.NRTCachingDirectoryFactory
[junit4:junit4]   2> 10248 T1263 oasc.CachingDirectoryFactory.get return new directory for /usr/home/hudson/hudson-slave/workspace/Lucene-Solr-Tests-4.x-java7/solr/build/solr-core/test/J0/./org.apache.solr.cloud.SyncSliceTest-1357026660116/jetty3 forceNew:false
[junit4:junit4]   2> 10248 T1263 oasc.CachingDirectoryFactory.close Releasing directory:/usr/home/hudson/hudson-slave/workspace/Lucene-Solr-Tests-4.x-java7/solr/build/solr-core/test/J0/./org.apache.solr.cloud.SyncSliceTest-1357026660116/jetty3
[junit4:junit4]   2> 10249 T1263 oasc.SolrCore.getNewIndexDir New index directory detected: old=null new=./org.apache.solr.cloud.SyncSliceTest-1357026660116/jetty3/index/
[junit4:junit4]   2> 10249 T1263 oasc.SolrCore.initIndex WARNING [collection1] Solr index directory './org.apache.solr.cloud.SyncSliceTest-1357026660116/jetty3/index' doesn't exist. Creating new index...
[junit4:junit4]   2> 10250 T1263 oasc.CachingDirectoryFactory.get return new directory for /usr/home/hudson/hudson-slave/workspace/Lucene-Solr-Tests-4.x-java7/solr/build/solr-core/test/J0/./org.apache.solr.cloud.SyncSliceTest-1357026660116/jetty3/index forceNew:false
[junit4:junit4]   2> 10256 T1263 oasc.SolrDeletionPolicy.onCommit SolrDeletionPolicy.onCommit: commits:num=1
[junit4:junit4]   2> 		commit{dir=RateLimitedDirectoryWrapper(NRTCachingDirectory(org.apache.lucene.store.NIOFSDirectory@/usr/home/hudson/hudson-slave/workspace/Lucene-Solr-Tests-4.x-java7/solr/build/solr-core/test/J0/org.apache.solr.cloud.SyncSliceTest-1357026660116/jetty3/index lockFactory=org.apache.lucene.store.NativeFSLockFactory@1e57f85b; maxCacheMB=48.0 maxMergeSizeMB=4.0)),segFN=segments_1,generation=1,filenames=[segments_1]
[junit4:junit4]   2> 10257 T1263 oasc.SolrDeletionPolicy.updateCommits newest commit = 1[segments_1]
[junit4:junit4]   2> 10258 T1263 oasc.CachingDirectoryFactory.close Releasing directory:/usr/home/hudson/hudson-slave/workspace/Lucene-Solr-Tests-4.x-java7/solr/build/solr-core/test/J0/./org.apache.solr.cloud.SyncSliceTest-1357026660116/jetty3/index
[junit4:junit4]   2> 10258 T1263 oasc.SolrCore.initWriters created xml: solr.XMLResponseWriter
[junit4:junit4]   2> 10260 T1263 oasup.UpdateRequestProcessorChain.init inserting DistributedUpdateProcessorFactory into updateRequestProcessorChain "dedupe"
[junit4:junit4]   2> 10260 T1263 oasup.UpdateRequestProcessorChain.init inserting DistributedUpdateProcessorFactory into updateRequestProcessorChain "dedupe-allfields"
[junit4:junit4]   2> 10261 T1263 oasup.UpdateRequestProcessorChain.init inserting DistributedUpdateProcessorFactory into updateRequestProcessorChain "stored_sig"
[junit4:junit4]   2> 10261 T1263 oasup.UpdateRequestProcessorChain.init inserting DistributedUpdateProcessorFactory into updateRequestProcessorChain "uniq-fields"
[junit4:junit4]   2> 10262 T1263 oasup.UpdateRequestProcessorChain.init inserting DistributedUpdateProcessorFactory into updateRequestProcessorChain "distrib-dup-test-chain-implicit"
[junit4:junit4]   2> 10262 T1263 oasc.RequestHandlers.initHandlersFromConfig adding lazy requestHandler: solr.ReplicationHandler
[junit4:junit4]   2> 10262 T1263 oasc.RequestHandlers.initHandlersFromConfig created /replication: solr.ReplicationHandler
[junit4:junit4]   2> 10263 T1263 oasc.RequestHandlers.initHandlersFromConfig created standard: solr.StandardRequestHandler
[junit4:junit4]   2> 10263 T1263 oasc.RequestHandlers.initHandlersFromConfig created /get: solr.RealTimeGetHandler
[junit4:junit4]   2> 10264 T1263 oasc.RequestHandlers.initHandlersFromConfig created dismax: solr.SearchHandler
[junit4:junit4]   2> 10264 T1263 oasc.RequestHandlers.initHandlersFromConfig created mock: org.apache.solr.core.MockQuerySenderListenerReqHandler
[junit4:junit4]   2> 10265 T1263 oasc.RequestHandlers.initHandlersFromConfig created /admin/: org.apache.solr.handler.admin.AdminHandlers
[junit4:junit4]   2> 10265 T1263 oasc.RequestHandlers.initHandlersFromConfig created defaults: solr.StandardRequestHandler
[junit4:junit4]   2> 10265 T1263 oasc.RequestHandlers.initHandlersFromConfig adding lazy requestHandler: solr.StandardRequestHandler
[junit4:junit4]   2> 10266 T1263 oasc.RequestHandlers.initHandlersFromConfig created lazy: solr.StandardRequestHandler
[junit4:junit4]   2> 10266 T1263 oasc.RequestHandlers.initHandlersFromConfig created /update: solr.UpdateRequestHandler
[junit4:junit4]   2> 10267 T1263 oasc.RequestHandlers.initHandlersFromConfig created /terms: org.apache.solr.handler.component.SearchHandler
[junit4:junit4]   2> 10267 T1263 oasc.RequestHandlers.initHandlersFromConfig created spellCheckCompRH: org.apache.solr.handler.component.SearchHandler
[junit4:junit4]   2> 10268 T1263 oasc.RequestHandlers.initHandlersFromConfig created spellCheckCompRH_Direct: org.apache.solr.handler.component.SearchHandler
[junit4:junit4]   2> 10268 T1263 oasc.RequestHandlers.initHandlersFromConfig created spellCheckWithWordbreak: org.apache.solr.handler.component.SearchHandler
[junit4:junit4]   2> 10269 T1263 oasc.RequestHandlers.initHandlersFromConfig created spellCheckWithWordbreak_Direct: org.apache.solr.handler.component.SearchHandler
[junit4:junit4]   2> 10269 T1263 oasc.RequestHandlers.initHandlersFromConfig created spellCheckCompRH1: org.apache.solr.handler.component.SearchHandler
[junit4:junit4]   2> 10269 T1263 oasc.RequestHandlers.initHandlersFromConfig created mltrh: org.apache.solr.handler.component.SearchHandler
[junit4:junit4]   2> 10270 T1263 oasc.RequestHandlers.initHandlersFromConfig created tvrh: org.apache.solr.handler.component.SearchHandler
[junit4:junit4]   2> 10270 T1263 oasc.RequestHandlers.initHandlersFromConfig created /mlt: solr.MoreLikeThisHandler
[junit4:junit4]   2> 10271 T1263 oasc.RequestHandlers.initHandlersFromConfig created /debug/dump: solr.DumpRequestHandler
[junit4:junit4]   2> 10283 T1263 oashl.XMLLoader.init xsltCacheLifetimeSeconds=60
[junit4:junit4]   2> 10287 T1263 oasc.SolrCore.initDeprecatedSupport WARNING solrconfig.xml uses deprecated <admin/gettableFiles>, Please update your config to use the ShowFileRequestHandler.
[junit4:junit4]   2> 10288 T1263 oasc.SolrCore.initDeprecatedSupport WARNING adding ShowFileRequestHandler with hidden files: [SCHEMA.XML, OLD_SYNONYMS.TXT, STOPWORDS.TXT, PROTWORDS.TXT, OPEN-EXCHANGE-RATES.JSON, SYNONYMS.TXT, CURRENCY.XML, MAPPING-ISOLATIN1ACCENT.TXT]
[junit4:junit4]   2> 10291 T1263 oasc.CachingDirectoryFactory.close Releasing directory:/usr/home/hudson/hudson-slave/workspace/Lucene-Solr-Tests-4.x-java7/solr/build/solr-core/test/J0/./org.apache.solr.cloud.SyncSliceTest-1357026660116/jetty3
[junit4:junit4]   2> 10292 T1263 oass.SolrIndexSearcher.<init> Opening Searcher@cbc0a73 main
[junit4:junit4]   2> 10293 T1263 oasu.CommitTracker.<init> Hard AutoCommit: disabled
[junit4:junit4]   2> 10293 T1263 oasu.CommitTracker.<init> Soft AutoCommit: disabled
[junit4:junit4]   2> 10294 T1263 oashc.SpellCheckComponent.inform Initializing spell checkers
[junit4:junit4]   2> 10300 T1263 oass.DirectSolrSpellChecker.init init: {name=direct,classname=DirectSolrSpellChecker,field=lowerfilt,minQueryLength=3}
[junit4:junit4]   2> 10350 T1264 oasc.SolrCore.registerSearcher [collection1] Registered new searcher Searcher@cbc0a73 main{StandardDirectoryReader(segments_1:1)}
[junit4:junit4]   2> 10355 T1263 oasc.ZkController.publish publishing core=collection1 state=down
[junit4:junit4]   2> 10355 T1263 oasc.ZkController.publish numShards not found on descriptor - reading it from system property
[junit4:junit4]   2> 11333 T1213 oascc.ZkStateReader.updateClusterState Updating cloud state from ZooKeeper... 
[junit4:junit4]   2> 11334 T1213 oasc.Overseer$ClusterStateUpdater.updateState Update state numShards=1 message={
[junit4:junit4]   2> 	  "operation":"state",
[junit4:junit4]   2> 	  "numShards":"1",
[junit4:junit4]   2> 	  "shard":null,
[junit4:junit4]   2> 	  "roles":null,
[junit4:junit4]   2> 	  "state":"down",
[junit4:junit4]   2> 	  "core":"collection1",
[junit4:junit4]   2> 	  "collection":"collection1",
[junit4:junit4]   2> 	  "node_name":"127.0.0.1:55179_",
[junit4:junit4]   2> 	  "base_url":"http://127.0.0.1:55179"}
[junit4:junit4]   2> 11334 T1213 oasc.Overseer$ClusterStateUpdater.updateState Collection already exists with numShards=1
[junit4:junit4]   2> 11334 T1213 oasc.Overseer$ClusterStateUpdater.updateState Assigning new node to shard shard=shard1
[junit4:junit4]   2> 11356 T1262 oascc.ZkStateReader$2.process A cluster state change: WatchedEvent state:SyncConnected type:NodeDataChanged path:/clusterstate.json, has occurred - updating... (live nodes size: 4)
[junit4:junit4]   2> 11356 T1212 oascc.ZkStateReader$2.process A cluster state change: WatchedEvent state:SyncConnected type:NodeDataChanged path:/clusterstate.json, has occurred - updating... (live nodes size: 4)
[junit4:junit4]   2> 11356 T1218 oascc.ZkStateReader$2.process A cluster state change: WatchedEvent state:SyncConnected type:NodeDataChanged path:/clusterstate.json, has occurred - updating... (live nodes size: 4)
[junit4:junit4]   2> 11356 T1246 oascc.ZkStateReader$2.process A cluster state change: WatchedEvent state:SyncConnected type:NodeDataChanged path:/clusterstate.json, has occurred - updating... (live nodes size: 4)
[junit4:junit4]   2> 11356 T1231 oascc.ZkStateReader$2.process A cluster state change: WatchedEvent state:SyncConnected type:NodeDataChanged path:/clusterstate.json, has occurred - updating... (live nodes size: 4)
[junit4:junit4]   2>  C74_STATE=coll:collection1 core:collection1 props:{shard=shard1, roles=null, state=recovering, core=collection1, collection=collection1, node_name=127.0.0.1:55172_, base_url=http://127.0.0.1:55172}
[junit4:junit4]   2> 12070 T1249 C74 P55172 oasc.RecoveryStrategy.doRecovery Attempting to PeerSync from http://127.0.0.1:55163/collection1/ core=collection1 - recoveringAfterStartup=true
[junit4:junit4]   2> 12070 T1249 C74 P55172 oasu.PeerSync.sync PeerSync: core=collection1 url=http://127.0.0.1:55172 START replicas=[http://127.0.0.1:55163/collection1/] nUpdates=100
[junit4:junit4]   2> 12071 T1249 C74 P55172 oasu.PeerSync.sync WARNING no frame of reference to tell of we've missed updates
[junit4:junit4]   2> 12072 T1249 C74 P55172 oasc.RecoveryStrategy.doRecovery PeerSync Recovery was not successful - trying replication. core=collection1
[junit4:junit4]   2> 12072 T1249 C74 P55172 oasc.RecoveryStrategy.doRecovery Starting Replication Recovery. core=collection1
[junit4:junit4]   2> 12072 T1249 C74 P55172 oasc.RecoveryStrategy.doRecovery Begin buffering updates. core=collection1
[junit4:junit4]   2> 12073 T1249 C74 P55172 oasu.UpdateLog.bufferUpdates Starting to buffer updates. FSUpdateLog{state=ACTIVE, tlog=null}
[junit4:junit4]   2> 12073 T1249 C74 P55172 oasc.RecoveryStrategy.replicate Attempting to replicate from http://127.0.0.1:55163/collection1/. core=collection1
[junit4:junit4]   2> 12073 T1249 C74 P55172 oascsi.HttpClientUtil.createClient Creating new http client, config:maxConnections=128&maxConnectionsPerHost=32&followRedirects=false
[junit4:junit4]   2> ASYNC  NEW_CORE C75 name=collection1 org.apache.solr.core.SolrCore@152e3602 url=http://127.0.0.1:55163/collection1 node=127.0.0.1:55163_ C75_STATE=coll:collection1 core:collection1 props:{shard=shard1, roles=null, state=active, core=collection1, collection=collection1, node_name=127.0.0.1:55163_, base_url=http://127.0.0.1:55163, leader=true}
[junit4:junit4]   2> 12081 T1222 C75 P55163 REQ /get {distrib=false&qt=/get&wt=javabin&version=2&getVersions=100} status=0 QTime=0 
[junit4:junit4]   2> 12088 T1223 C75 P55163 oasu.DirectUpdateHandler2.commit start commit{flags=0,_version_=0,optimize=false,openSearcher=false,waitSearcher=true,expungeDeletes=false,softCommit=false}
[junit4:junit4]   2> 12089 T1223 C75 P55163 oasc.CachingDirectoryFactory.close Releasing directory:/usr/home/hudson/hudson-slave/workspace/Lucene-Solr-Tests-4.x-java7/solr/build/solr-core/test/J0/./org.apache.solr.cloud.SyncSliceTest-1357026660116/jetty1
[junit4:junit4]   2> 12094 T1223 C75 P55163 oasc.SolrDeletionPolicy.onInit SolrDeletionPolicy.onInit: commits:num=1
[junit4:junit4]   2> 		commit{dir=RateLimitedDirectoryWrapper(NRTCachingDirectory(org.apache.lucene.store.NIOFSDirectory@/usr/home/hudson/hudson-slave/workspace/Lucene-Solr-Tests-4.x-java7/solr/build/solr-core/test/J0/org.apache.solr.cloud.SyncSliceTest-1357026660116/jetty1/index lockFactory=org.apache.lucene.store.NativeFSLockFactory@1bfbc3a9; maxCacheMB=48.0 maxMergeSizeMB=4.0)),segFN=segments_1,generation=1,filenames=[segments_1]
[junit4:junit4]   2> 12094 T1223 C75 P55163 oasc.SolrDeletionPolicy.updateCommits newest commit = 1[segments_1]
[junit4:junit4]   2> 12098 T1223 C75 P55163 oasc.SolrDeletionPolicy.onCommit SolrDeletionPolicy.onCommit: commits:num=2
[junit4:junit4]   2> 		commit{dir=RateLimitedDirectoryWrapper(NRTCachingDirectory(org.apache.lucene.store.NIOFSDirectory@/usr/home/hudson/hudson-slave/workspace/Lucene-Solr-Tests-4.x-java7/solr/build/solr-core/test/J0/org.apache.solr.cloud.SyncSliceTest-1357026660116/jetty1/index lockFactory=org.apache.lucene.store.NativeFSLockFactory@1bfbc3a9; maxCacheMB=48.0 maxMergeSizeMB=4.0)),segFN=segments_1,generation=1,filenames=[segments_1]
[junit4:junit4]   2> 		commit{dir=RateLimitedDirectoryWrapper(NRTCachingDirectory(org.apache.lucene.store.NIOFSDirectory@/usr/home/hudson/hudson-slave/workspace/Lucene-Solr-Tests-4.x-java7/solr/build/solr-core/test/J0/org.apache.solr.cloud.SyncSliceTest-1357026660116/jetty1/index lockFactory=org.apache.lucene.store.NativeFSLockFactory@1bfbc3a9; maxCacheMB=48.0 maxMergeSizeMB=4.0)),segFN=segments_2,generation=2,filenames=[segments_2]
[junit4:junit4]   2> 12099 T1223 C75 P55163 oasc.SolrDeletionPolicy.updateCommits newest commit = 2[segments_2]
[junit4:junit4]   2> 12100 T1223 C75 P55163 oasc.CachingDirectoryFactory.close Releasing directory:/usr/home/hudson/hudson-slave/workspace/Lucene-Solr-Tests-4.x-java7/solr/build/solr-core/test/J0/./org.apache.solr.cloud.SyncSliceTest-1357026660116/jetty1
[junit4:junit4]   2> 12100 T1223 C75 P55163 oass.SolrIndexSearcher.<init> Opening Searcher@264db59d realtime
[junit4:junit4]   2> 12101 T1223 C75 P55163 oasu.DirectUpdateHandler2.commit end_commit_flush
[junit4:junit4]   2> 12101 T1223 C75 P55163 /update {waitSearcher=true&openSearcher=false&commit=true&commit_end_point=true&wt=javabin&softCommit=false&version=2} {commit=} 0 13
[junit4:junit4]   2> 12102 T1249 C74 P55172 oash.ReplicationHandler.inform Commits will be reserved for  10000
[junit4:junit4]   2> 12102 T1249 C74 P55172 oash.SnapPuller.<init>  No value set for 'pollInterval'. Timer Task not started.
[junit4:junit4]   2> 12104 T1224 C75 P55163 oash.ReplicationHandler.inform Commits will be reserved for  10000
[junit4:junit4]   2> 12105 T1224 C75 P55163 REQ /replication {command=indexversion&wt=javabin&qt=/replication&version=2} status=0 QTime=2 
[junit4:junit4]   2> 12105 T1249 C74 P55172 oash.SnapPuller.fetchLatestIndex Master's generation: 2
[junit4:junit4]   2> 12106 T1249 C74 P55172 oash.SnapPuller.fetchLatestIndex Slave's generation: 1
[junit4:junit4]   2> 12106 T1249 C74 P55172 oash.SnapPuller.fetchLatestIndex Starting replication process
[junit4:junit4]   2> 12108 T1224 C75 P55163 oasc.CachingDirectoryFactory.close Releasing directory:/usr/home/hudson/hudson-slave/workspace/Lucene-Solr-Tests-4.x-java7/solr/build/solr-core/test/J0/./org.apache.solr.cloud.SyncSliceTest-1357026660116/jetty1
[junit4:junit4]   2> 12109 T1224 C75 P55163 oasc.CachingDirectoryFactory.close Releasing directory:/usr/home/hudson/hudson-slave/workspace/Lucene-Solr-Tests-4.x-java7/solr/build/solr-core/test/J0/./org.apache.solr.cloud.SyncSliceTest-1357026660116/jetty1/index
[junit4:junit4]   2> 12109 T1224 C75 P55163 REQ /replication {command=filelist&generation=2&wt=javabin&qt=/replication&version=2} status=0 QTime=1 
[junit4:junit4]   2> 12110 T1249 C74 P55172 oash.SnapPuller.fetchLatestIndex Number of files in latest index in master: 1
[junit4:junit4]   2> 12111 T1249 C74 P55172 oasc.CachingDirectoryFactory.get return new directory for /usr/home/hudson/hudson-slave/workspace/Lucene-Solr-Tests-4.x-java7/solr/build/solr-core/test/J0/./org.apache.solr.cloud.SyncSliceTest-1357026660116/jetty2/index.20130101025112222 forceNew:false
[junit4:junit4]   2> 12112 T1249 C74 P55172 oasc.CachingDirectoryFactory.close Releasing directory:/usr/home/hudson/hudson-slave/workspace/Lucene-Solr-Tests-4.x-java7/solr/build/solr-core/test/J0/./org.apache.solr.cloud.SyncSliceTest-1357026660116/jetty2
[junit4:junit4]   2> 12112 T1249 C74 P55172 oash.SnapPuller.fetchLatestIndex Starting download to RateLimitedDirectoryWrapper(NRTCachingDirectory(org.apache.lucene.store.NIOFSDirectory@/usr/home/hudson/hudson-slave/workspace/Lucene-Solr-Tests-4.x-java7/solr/build/solr-core/test/J0/org.apache.solr.cloud.SyncSliceTest-1357026660116/jetty2/index.20130101025112222 lockFactory=org.apache.lucene.store.NativeFSLockFactory@339767eb; maxCacheMB=48.0 maxMergeSizeMB=4.0)) fullCopy=true
[junit4:junit4]   2> 12119 T1224 C75 P55163 REQ /replication {file=segments_2&command=filecontent&checksum=true&generation=2&qt=/replication&wt=filestream} status=0 QTime=0 
[junit4:junit4]   2> 12120 T1249 C74 P55172 oasc.CachingDirectoryFactory.close Releasing directory:/usr/home/hudson/hudson-slave/workspace/Lucene-Solr-Tests-4.x-java7/solr/build/solr-core/test/J0/./org.apache.solr.cloud.SyncSliceTest-1357026660116/jetty2/index
[junit4:junit4]   2> 12121 T1249 C74 P55172 oash.SnapPuller.fetchLatestIndex Total time taken for download : 0 secs
[junit4:junit4]   2> 12121 T1249 C74 P55172 oash.SnapPuller.modifyIndexProps New index installed. Updating index properties... index=index.20130101025112222
[junit4:junit4]   2> 12122 T1249 C74 P55172 oasc.CachingDirectoryFactory.close Releasing directory:/usr/home/hudson/hudson-slave/workspace/Lucene-Solr-Tests-4.x-java7/solr/build/solr-core/test/J0/./org.apache.solr.cloud.SyncSliceTest-1357026660116/jetty2
[junit4:junit4]   2> 12123 T1249 C74 P55172 oasc.CachingDirectoryFactory.close Releasing directory:/usr/home/hudson/hudson-slave/workspace/Lucene-Solr-Tests-4.x-java7/solr/build/solr-core/test/J0/./org.apache.solr.cloud.SyncSliceTest-1357026660116/jetty2
[junit4:junit4]   2> 12123 T1249 C74 P55172 oasc.SolrCore.getNewIndexDir New index directory detected: old=./org.apache.solr.cloud.SyncSliceTest-1357026660116/jetty2/index/ new=./org.apache.solr.cloud.SyncSliceTest-1357026660116/jetty2/index.20130101025112222
[junit4:junit4]   2> 12127 T1249 C74 P55172 oasc.SolrDeletionPolicy.onInit SolrDeletionPolicy.onInit: commits:num=1
[junit4:junit4]   2> 		commit{dir=RateLimitedDirectoryWrapper(NRTCachingDirectory(org.apache.lucene.store.NIOFSDirectory@/usr/home/hudson/hudson-slave/workspace/Lucene-Solr-Tests-4.x-java7/solr/build/solr-core/test/J0/org.apache.solr.cloud.SyncSliceTest-1357026660116/jetty2/index.20130101025112222 lockFactory=org.apache.lucene.store.NativeFSLockFactory@339767eb; maxCacheMB=48.0 maxMergeSizeMB=4.0)),segFN=segments_2,generation=2,filenames=[segments_2]
[junit4:junit4]   2> 12127 T1249 C74 P55172 oasc.SolrDeletionPolicy.updateCommits newest commit = 2[segments_2]
[junit4:junit4]   2> 12129 T1249 C74 P55172 oasc.CachingDirectoryFactory.close Releasing directory:/usr/home/hudson/hudson-slave/workspace/Lucene-Solr-Tests-4.x-java7/solr/build/solr-core/test/J0/./org.apache.solr.cloud.SyncSliceTest-1357026660116/jetty2
[junit4:junit4]   2> 12129 T1249 C74 P55172 oasu.DefaultSolrCoreState.newIndexWriter Creating new IndexWriter...
[junit4:junit4]   2> 12129 T1249 C74 P55172 oasu.DefaultSolrCoreState.newIndexWriter Waiting until IndexWriter is unused... core=collection1
[junit4:junit4]   2> 12129 T1249 C74 P55172 oasu.DefaultSolrCoreState.newIndexWriter Rollback old IndexWriter... core=collection1
[junit4:junit4]   2> 12130 T1249 C74 P55172 oasc.CachingDirectoryFactory.close Releasing directory:/usr/home/hudson/hudson-slave/workspace/Lucene-Solr-Tests-4.x-java7/solr/build/solr-core/test/J0/./org.apache.solr.cloud.SyncSliceTest-1357026660116/jetty2/index.20130101025112222
[junit4:junit4]   2> 12131 T1249 C74 P55172 oasc.CachingDirectoryFactory.close Releasing directory:/usr/home/hudson/hudson-slave/workspace/Lucene-Solr-Tests-4.x-java7/solr/build/solr-core/test/J0/./org.apache.solr.cloud.SyncSliceTest-1357026660116/jetty2
[junit4:junit4]   2> 12134 T1249 C74 P55172 oasc.SolrDeletionPolicy.onInit SolrDeletionPolicy.onInit: commits:num=1
[junit4:junit4]   2> 		commit{dir=RateLimitedDirectoryWrapper(NRTCachingDirectory(org.apache.lucene.store.NIOFSDirectory@/usr/home/hudson/hudson-slave/workspace/Lucene-Solr-Tests-4.x-java7/solr/build/solr-core/test/J0/org.apache.solr.cloud.SyncSliceTest-1357026660116/jetty2/index.20130101025112222 lockFactory=org.apache.lucene.store.NativeFSLockFactory@339767eb; maxCacheMB=48.0 maxMergeSizeMB=4.0)),segFN=segments_2,generation=2,filenames=[segments_2]
[junit4:junit4]   2> 12135 T1249 C74 P55172 oasc.SolrDeletionPolicy.updateCommits newest commit = 2[segments_2]
[junit4:junit4]   2> 12135 T1249 C74 P55172 oasu.DefaultSolrCoreState.newIndexWriter New IndexWriter is ready to be used.
[junit4:junit4]   2> 12135 T1249 C74 P55172 oasc.CachingDirectoryFactory.close Releasing directory:/usr/home/hudson/hudson-slave/workspace/Lucene-Solr-Tests-4.x-java7/solr/build/solr-core/test/J0/./org.apache.solr.cloud.SyncSliceTest-1357026660116/jetty2
[junit4:junit4]   2> 12136 T1249 C74 P55172 oass.SolrIndexSearcher.<init> Opening Searcher@59a33b77 main
[junit4:junit4]   2> 12137 T1248 oasc.SolrCore.registerSearcher [collection1] Registered new searcher Searcher@59a33b77 main{StandardDirectoryReader(segments_2:1:nrt)}
[junit4:junit4]   2> 12138 T1248 oasc.CachingDirectoryFactory.close Releasing directory:/usr/home/hudson/hudson-slave/workspace/Lucene-Solr-Tests-4.x-java7/solr/build/solr-core/test/J0/./org.apache.solr.cloud.SyncSliceTest-1357026660116/jetty2/index
[junit4:junit4]   2> 12138 T1249 C74 P55172 oasu.DirectUpdateHandler2.commit start commit{flags=0,_version_=0,optimize=false,openSearcher=false,waitSearcher=false,expungeDeletes=false,softCommit=false}
[junit4:junit4]   2> 12141 T1249 C74 P55172 oasc.SolrDeletionPolicy.onCommit SolrDeletionPolicy.onCommit: commits:num=2
[junit4:junit4]   2> 		commit{dir=RateLimitedDirectoryWrapper(NRTCachingDirectory(org.apache.lucene.store.NIOFSDirectory@/usr/home/hudson/hudson-slave/workspace/Lucene-Solr-Tests-4.x-java7/solr/build/solr-core/test/J0/org.apache.solr.cloud.SyncSliceTest-1357026660116/jetty2/index.20130101025112222 lockFactory=org.apache.lucene.store.NativeFSLockFactory@339767eb; maxCacheMB=48.0 maxMergeSizeMB=4.0)),segFN=segments_2,generation=2,filenames=[segments_2]
[junit4:junit4]   2> 		commit{dir=RateLimitedDirectoryWrapper(NRTCachingDirectory(org.apache.lucene.store.NIOFSDirectory@/usr/home/hudson/hudson-slave/workspace/Lucene-Solr-Tests-4.x-java7/solr/build/solr-core/test/J0/org.apache.solr.cloud.SyncSliceTest-1357026660116/jetty2/index.20130101025112222 lockFactory=org.apache.lucene.store.NativeFSLockFactory@339767eb; maxCacheMB=48.0 maxMergeSizeMB=4.0)),segFN=segments_3,generation=3,filenames=[segments_3]
[junit4:junit4]   2> 12141 T1249 C74 P55172 oasc.SolrDeletionPolicy.updateCommits newest commit = 3[segments_3]
[junit4:junit4]   2> 12143 T1249 C74 P55172 oasc.CachingDirectoryFactory.close Releasing directory:/usr/home/hudson/hudson-slave/workspace/Lucene-Solr-Tests-4.x-java7/solr/build/solr-core/test/J0/./org.apache.solr.cloud.SyncSliceTest-1357026660116/jetty2
[junit4:junit4]   2> 12143 T1249 C74 P55172 oasu.DirectUpdateHandler2.commit end_commit_flush
[junit4:junit4]   2> 12143 T1249 C74 P55172 oasc.CachingDirectoryFactory.close Releasing directory:/usr/home/hudson/hudson-slave/workspace/Lucene-Solr-Tests-4.x-java7/solr/build/solr-core/test/J0/./org.apache.solr.cloud.SyncSliceTest-1357026660116/jetty2/index.20130101025112222
[junit4:junit4]   2> 12143 T1249 C74 P55172 oasc.CachingDirectoryFactory.close Releasing directory:/usr/home/hudson/hudson-slave/workspace/Lucene-Solr-Tests-4.x-java7/solr/build/solr-core/test/J0/./org.apache.solr.cloud.SyncSliceTest-1357026660116/jetty2/index
[junit4:junit4]   2> 12144 T1249 C74 P55172 oasc.RecoveryStrategy.replay No replay needed. core=collection1
[junit4:junit4]   2> 12144 T1249 C74 P55172 oasc.RecoveryStrategy.doRecovery Replication Recovery was successful - registering as Active. core=collection1
[junit4:junit4]   2> 12144 T1249 C74 P55172 oasc.ZkController.publish publishing core=collection1 state=active
[junit4:junit4]   2> 12144 T1249 C74 P55172 oasc.ZkController.publish numShards not found on descriptor - reading it from system property
[junit4:junit4]   2> 12151 T1249 C74 P55172 oasc.RecoveryStrategy.doRecovery Finished recovery process. core=collection1
[junit4:junit4]   2> 12358 T1263 oasc.CoreContainer.registerCore registering core: collection1
[junit4:junit4]   2> 12358 T1263 oasc.ZkController.register Register replica - core:collection1 address:http://127.0.0.1:55179 collection:collection1 shard:shard1
[junit4:junit4]   2> 12361 T1263 oasc.ZkController.register We are http://127.0.0.1:55179/collection1/ and leader is http://127.0.0.1:55163/collection1/
[junit4:junit4]   2> 12362 T1263 oasc.ZkController.register No LogReplay needed for core=collection1 baseURL=http://127.0.0.1:55179
[junit4:junit4]   2> 12362 T1263 oasc.ZkController.checkRecovery Core needs to recover:collection1
[junit4:junit4]   2> 12362 T1263 oasu.DefaultSolrCoreState.doRecovery Running recovery - first canceling any ongoing recovery
[junit4:junit4]   2> ASYNC  NEW_CORE C76 name=collection1 org.apache.solr.core.SolrCore@6469f033 url=http://127.0.0.1:55179/collection1 node=127.0.0.1:55179_ C76_STATE=coll:collection1 core:collection1 props:{shard=null, roles=null, state=down, core=collection1, collection=collection1, node_name=127.0.0.1:55179_, base_url=http://127.0.0.1:55179}
[junit4:junit4]   2> 12363 T1267 C76 P55179 oasc.RecoveryStrategy.run Starting recovery process.  core=collection1 recoveringAfterStartup=true
[junit4:junit4]   2> 12363 T1267 C76 P55179 oasc.RecoveryStrategy.doRecovery ###### startupVersions=[]
[junit4:junit4]   2> 12363 T1263 oascc.ZkStateReader.updateClusterState Updating cloud state from ZooKeeper... 
[junit4:junit4]   2> 12364 T1267 C76 P55179 oasc.ZkController.publish publishing core=collection1 state=recovering
[junit4:junit4]   2> 12364 T1267 C76 P55179 oasc.ZkController.publish numShards not found on descriptor - reading it from system property
[junit4:junit4]   2> 12365 T1190 oass.SolrDispatchFilter.init user.dir=/usr/home/hudson/hudson-slave/workspace/Lucene-Solr-Tests-4.x-java7/solr/build/solr-core/test/J0
[junit4:junit4]   2> 12366 T1267 C76 P55179 oascsi.HttpClientUtil.createClient Creating new http client, config:maxConnections=128&maxConnectionsPerHost=32&followRedirects=false
[junit4:junit4]   2> 12365 T1190 oass.SolrDispatchFilter.init SolrDispatchFilter.init() done
[junit4:junit4]   2> 12366 T1190 oascsi.HttpClientUtil.createClient Creating new http client, config:maxConnections=128&maxConnectionsPerHost=32&followRedirects=false
[junit4:junit4]   2> 12547 T1190 oejs.Server.doStart jetty-8.1.8.v20121106
[junit4:junit4]   2> 12550 T1190 oejs.AbstractConnector.doStart Started SocketConnector@127.0.0.1:55192
[junit4:junit4]   2> 12551 T1190 oasc.SolrResourceLoader.locateSolrHome JNDI not configured for solr (NoInitialContextEx)
[junit4:junit4]   2> 12551 T1190 oasc.SolrResourceLoader.locateSolrHome using system property solr.solr.home: /usr/home/hudson/hudson-slave/workspace/Lucene-Solr-Tests-4.x-java7/solr/build/solr-core/test/J0/./org.apache.solr.cloud.SyncSliceTest-jetty4-1357026672492
[junit4:junit4]   2> 12552 T1190 oasc.SolrResourceLoader.<init> new SolrResourceLoader for deduced Solr Home: '/usr/home/hudson/hudson-slave/workspace/Lucene-Solr-Tests-4.x-java7/solr/build/solr-core/test/J0/./org.apache.solr.cloud.SyncSliceTest-jetty4-1357026672492/'
[junit4:junit4]   2> 12594 T1190 oass.SolrDispatchFilter.init SolrDispatchFilter.init()
[junit4:junit4]   2> 12595 T1190 oasc.SolrResourceLoader.locateSolrHome JNDI not configured for solr (NoInitialContextEx)
[junit4:junit4]   2> 12595 T1190 oasc.SolrResourceLoader.locateSolrHome using system property solr.solr.home: /usr/home/hudson/hudson-slave/workspace/Lucene-Solr-Tests-4.x-java7/solr/build/solr-core/test/J0/./org.apache.solr.cloud.SyncSliceTest-jetty4-1357026672492
[junit4:junit4]   2> 12596 T1190 oasc.CoreContainer$Initializer.initialize looking for solr.xml: /usr/home/hudson/hudson-slave/workspace/Lucene-Solr-Tests-4.x-java7/solr/build/solr-core/test/J0/./org.apache.solr.cloud.SyncSliceTest-jetty4-1357026672492/solr.xml
[junit4:junit4]   2> 12596 T1190 oasc.CoreContainer.<init> New CoreContainer 1414293078
[junit4:junit4]   2> 12597 T1190 oasc.CoreContainer.load Loading CoreContainer using Solr Home: '/usr/home/hudson/hudson-slave/workspace/Lucene-Solr-Tests-4.x-java7/solr/build/solr-core/test/J0/./org.apache.solr.cloud.SyncSliceTest-jetty4-1357026672492/'
[junit4:junit4]   2> 12598 T1190 oasc.SolrResourceLoader.<init> new SolrResourceLoader for directory: '/usr/home/hudson/hudson-slave/workspace/Lucene-Solr-Tests-4.x-java7/solr/build/solr-core/test/J0/./org.apache.solr.cloud.SyncSliceTest-jetty4-1357026672492/'
[junit4:junit4]   2> 12627 T1190 oashc.HttpShardHandlerFactory.getParameter Setting socketTimeout to: 30000
[junit4:junit4]   2> 12628 T1190 oashc.HttpShardHandlerFactory.getParameter Setting urlScheme to: http://
[junit4:junit4]   2> 12628 T1190 oashc.HttpShardHandlerFactory.getParameter Setting connTimeout to: 15000
[junit4:junit4]   2> 12629 T1190 oashc.HttpShardHandlerFactory.getParameter Setting maxConnectionsPerHost to: 20
[junit4:junit4]   2> 12629 T1190 oashc.HttpShardHandlerFactory.getParameter Setting corePoolSize to: 0
[junit4:junit4]   2> 12630 T1190 oashc.HttpShardHandlerFactory.getParameter Setting maximumPoolSize to: 2147483647
[junit4:junit4]   2> 12630 T1190 oashc.HttpShardHandlerFactory.getParameter Setting maxThreadIdleTime to: 5
[junit4:junit4]   2> 12631 T1190 oashc.HttpShardHandlerFactory.getParameter Setting sizeOfQueue to: -1
[junit4:junit4]   2> 12631 T1190 oashc.HttpShardHandlerFactory.getParameter Setting fairnessPolicy to: false
[junit4:junit4]   2> 12632 T1190 oascsi.HttpClientUtil.createClient Creating new http client, config:maxConnectionsPerHost=20&maxConnections=10000&socketTimeout=30000&connTimeout=15000&retry=false
[junit4:junit4]   2> 12651 T1190 oasc.CoreContainer.load Registering Log Listener
[junit4:junit4]   2> 12671 T1190 oasc.CoreContainer.initZooKeeper Zookeeper client=127.0.0.1:55150/solr
[junit4:junit4]   2> 12672 T1190 oasc.ZkController.checkChrootPath zkHost includes chroot
[junit4:junit4]   2> 12672 T1190 oaz.ZooKeeper.<init> Initiating client connection, connectString=127.0.0.1:55150 sessionTimeout=60000 watcher=org.apache.solr.common.cloud.ConnectionManager@3c5cc2f9
[junit4:junit4]   2> 12673 T1190 oascc.ConnectionManager.waitForConnected Waiting for client to connect to ZooKeeper
[junit4:junit4]   2> 12674 T1277 oaz.ClientCnxn$SendThread.logStartConnect Opening socket connection to server localhost/127.0.0.1:55150. Will not attempt to authenticate using SASL (access denied ("javax.security.auth.AuthPermission" "getLoginConfiguration"))
[junit4:junit4]   2> 12675 T1277 oaz.ClientCnxn$SendThread.primeConnection Socket connection established to localhost/127.0.0.1:55150, initiating session
[junit4:junit4]   2> 12675 T1192 oazs.NIOServerCnxnFactory.run Accepted socket connection from /140.211.11.196:55193
[junit4:junit4]   2> 12676 T1192 oazs.ZooKeeperServer.processConnectRequest Client attempting to establish new session at /140.211.11.196:55193
[junit4:junit4]   2> 12678 T1194 oazs.ZooKeeperServer.finishSessionInit Established session 0x13bf5178f1b000b with negotiated timeout 20000 for client /140.211.11.196:55193
[junit4:junit4]   2> 12678 T1277 oaz.ClientCnxn$SendThread.onConnected Session establishment complete on server localhost/127.0.0.1:55150, sessionid = 0x13bf5178f1b000b, negotiated timeout = 20000
[junit4:junit4]   2> 12678 T1278 oascc.ConnectionManager.process Watcher org.apache.solr.common.cloud.ConnectionManager@3c5cc2f9 name:ZooKeeperConnection Watcher:127.0.0.1:55150 got event WatchedEvent state:SyncConnected type:None path:null path:null type:None
[junit4:junit4]   2> 12679 T1190 oascc.ConnectionManager.waitForConnected Client is connected to ZooKeeper
[junit4:junit4]   2> 12680 T1195 oazs.PrepRequestProcessor.pRequest2Txn Processed session termination for sessionid: 0x13bf5178f1b000b
[junit4:junit4]   2> 12690 T1278 oaz.ClientCnxn$EventThread.run EventThread shut down
[junit4:junit4]   2> 12690 T1192 oazs.NIOServerCnxn.closeSock Closed socket connection for client /140.211.11.196:55193 which had sessionid 0x13bf5178f1b000b
[junit4:junit4]   2> 12690 T1190 oaz.ZooKeeper.close Session: 0x13bf5178f1b000b closed
[junit4:junit4]   2> 12691 T1190 oascsi.HttpClientUtil.createClient Creating new http client, config:maxConnections=500&maxConnectionsPerHost=16&socketTimeout=15000&connTimeout=30000
[junit4:junit4]   2> 12701 T1190 oaz.ZooKeeper.<init> Initiating client connection, connectString=127.0.0.1:55150/solr sessionTimeout=30000 watcher=org.apache.solr.common.cloud.ConnectionManager@7d3d20d7
[junit4:junit4]   2> 12702 T1190 oascc.ConnectionManager.waitForConnected Waiting for client to connect to ZooKeeper
[junit4:junit4]   2> 12702 T1279 oaz.ClientCnxn$SendThread.logStartConnect Opening socket connection to server localhost/127.0.0.1:55150. Will not attempt to authenticate using SASL (access denied ("javax.security.auth.AuthPermission" "getLoginConfiguration"))
[junit4:junit4]   2> 12703 T1279 oaz.ClientCnxn$SendThread.primeConnection Socket connection established to localhost/127.0.0.1:55150, initiating session
[junit4:junit4]   2> 12703 T1192 oazs.NIOServerCnxnFactory.run Accepted socket connection from /140.211.11.196:55194
[junit4:junit4]   2> 12703 T1192 oazs.ZooKeeperServer.processConnectRequest Client attempting to establish new session at /140.211.11.196:55194
[junit4:junit4]   2> 12705 T1194 oazs.ZooKeeperServer.finishSessionInit Established session 0x13bf5178f1b000c with negotiated timeout 20000 for client /140.211.11.196:55194
[junit4:junit4]   2> 12705 T1279 oaz.ClientCnxn$SendThread.onConnected Session establishment complete on server localhost/127.0.0.1:55150, sessionid = 0x13bf5178f1b000c, negotiated timeout = 20000
[junit4:junit4]   2> 12705 T1280 oascc.ConnectionManager.process Watcher org.apache.solr.common.cloud.ConnectionManager@7d3d20d7 name:ZooKeeperConnection Watcher:127.0.0.1:55150/solr got event WatchedEvent state:SyncConnected type:None path:null path:null type:None
[junit4:junit4]   2> 12706 T1190 oascc.ConnectionManager.waitForConnected Client is connected to ZooKeeper
[junit4:junit4]   2> 12707 T1195 oazs.PrepRequestProcessor.pRequest Got user-level KeeperException when processing sessionid:0x13bf5178f1b000c type:create cxid:0x1 zxid:0x92 txntype:-1 reqpath:n/a Error Path:/solr/overseer Error:KeeperErrorCode = NodeExists for /solr/overseer
[junit4:junit4]   2> 12708 T1195 oazs.PrepRequestProcessor.pRequest Got user-level KeeperException when processing sessionid:0x13bf5178f1b000c type:create cxid:0x2 zxid:0x93 txntype:-1 reqpath:n/a Error Path:/solr/overseer Error:KeeperErrorCode = NodeExists for /solr/overseer
[junit4:junit4]   2> 12716 T1190 oasc.ZkController.createEphemeralLiveNode Register node as live in ZooKeeper:/live_nodes/127.0.0.1:55192_
[junit4:junit4]   2> 12717 T1195 oazs.PrepRequestProcessor.pRequest Got user-level KeeperException when processing sessionid:0x13bf5178f1b000c type:delete cxid:0x4 zxid:0x94 txntype:-1 reqpath:n/a Error Path:/solr/live_nodes/127.0.0.1:55192_ Error:KeeperErrorCode = NoNode for /solr/live_nodes/127.0.0.1:55192_
[junit4:junit4]   2> 12718 T1190 oascc.SolrZkClient.makePath makePath: /live_nodes/127.0.0.1:55192_
[junit4:junit4]   2> 12721 T1262 oascc.ZkStateReader$2.process A cluster state change: WatchedEvent state:SyncConnected type:NodeChildrenChanged path:/live_nodes, has occurred - updating... (live nodes size: 4)
[junit4:junit4]   2> 12721 T1231 oascc.ZkStateReader$2.process A cluster state change: WatchedEvent state:SyncConnected type:NodeChildrenChanged path:/live_nodes, has occurred - updating... (live nodes size: 4)
[junit4:junit4]   2> 12721 T1212 oascc.ZkStateReader$2.process A cluster state change: WatchedEvent state:SyncConnected type:NodeChildrenChanged path:/live_nodes, has occurred - updating... (live nodes size: 4)
[junit4:junit4]   2> 12722 T1246 oascc.ZkStateReader$3.process Updating live nodes... (5)
[junit4:junit4]   2> 12722 T1218 oascc.ZkStateReader$3.process Updating live nodes... (5)
[junit4:junit4]   2> 12722 T1246 oascc.ZkStateReader$2.process A cluster state change: WatchedEvent state:SyncConnected type:NodeChildrenChanged path:/live_nodes, has occurred - updating... (live nodes size: 5)
[junit4:junit4]   2> 12722 T1218 oascc.ZkStateReader$2.process A cluster state change: WatchedEvent state:SyncConnected type:NodeChildrenChanged path:/live_nodes, has occurred - updating... (live nodes size: 5)
[junit4:junit4]   2> 12723 T1262 oascc.ZkStateReader$3.process Updating live nodes... (5)
[junit4:junit4]   2> 12724 T1231 oascc.ZkStateReader$3.process Updating live nodes... (5)
[junit4:junit4]   2> 12725 T1212 oascc.ZkStateReader$3.process Updating live nodes... (5)
[junit4:junit4]   2> 12726 T1190 oascc.ZkStateReader.createClusterStateWatchersAndUpdate Updating cluster state from ZooKeeper... 
[junit4:junit4]   2> 12735 T1281 oasc.CoreContainer.create Creating SolrCore 'collection1' using instanceDir: /usr/home/hudson/hudson-slave/workspace/Lucene-Solr-Tests-4.x-java7/solr/build/solr-core/test/J0/./org.apache.solr.cloud.SyncSliceTest-jetty4-1357026672492/collection1
[junit4:junit4]   2> 12735 T1281 oasc.ZkController.createCollectionZkNode Check for collection zkNode:collection1
[junit4:junit4]   2> 12736 T1281 oasc.ZkController.createCollectionZkNode Collection zkNode exists
[junit4:junit4]   2> 12736 T1281 oasc.ZkController.readConfigName Load collection config from:/collections/collection1
[junit4:junit4]   2> 12738 T1281 oasc.SolrResourceLoader.<init> new SolrResourceLoader for directory: '/usr/home/hudson/hudson-slave/workspace/Lucene-Solr-Tests-4.x-java7/solr/build/solr-core/test/J0/./org.apache.solr.cloud.SyncSliceTest-jetty4-1357026672492/collection1/'
[junit4:junit4]   2> 12739 T1281 oasc.SolrResourceLoader.replaceClassLoader Adding 'file:/usr/home/hudson/hudson-slave/workspace/Lucene-Solr-Tests-4.x-java7/solr/build/solr-core/test/J0/org.apache.solr.cloud.SyncSliceTest-jetty4-1357026672492/collection1/lib/classes/' to classloader
[junit4:junit4]   2> 12740 T1281 oasc.SolrResourceLoader.replaceClassLoader Adding 'file:/usr/home/hudson/hudson-slave/workspace/Lucene-Solr-Tests-4.x-java7/solr/build/solr-core/test/J0/org.apache.solr.cloud.SyncSliceTest-jetty4-1357026672492/collection1/lib/README' to classloader
[junit4:junit4]   2> 12792 T1281 oasc.SolrConfig.<init> Using Lucene MatchVersion: LUCENE_41
[junit4:junit4]   2> 12861 T1213 oascc.ZkStateReader.updateClusterState Updating cloud state from ZooKeeper... 
[junit4:junit4]   2> 12861 T1213 oasc.Overseer$ClusterStateUpdater.updateState Update state numShards=1 message={
[junit4:junit4]   2> 	  "operation":"state",
[junit4:junit4]   2> 	  "numShards":"1",
[junit4:junit4]   2> 	  "shard":"shard1",
[junit4:junit4]   2> 	  "roles":null,
[junit4:junit4]   2> 	  "state":"active",
[junit4:junit4]   2> 	  "core":"collection1",
[junit4:junit4]   2> 	  "collection":"collection1",
[junit4:junit4]   2> 	  "node_name":"127.0.0.1:55172_",
[junit4:junit4]   2> 	  "base_url":"http://127.0.0.1:55172"}
[junit4:junit4]   2> 12862 T1281 oasc.SolrConfig.<init> Loaded SolrConfig: solrconfig.xml
[junit4:junit4]   2> 12865 T1281 oass.IndexSchema.readSchema Reading Solr Schema
[junit4:junit4]   2> 12867 T1213 oasc.Overseer$ClusterStateUpdater.updateState Update state numShards=1 message={
[junit4:junit4]   2> 	  "operation":"state",
[junit4:junit4]   2> 	  "numShards":"1",
[junit4:junit4]   2> 	  "shard":"shard1",
[junit4:junit4]   2> 	  "roles":null,
[junit4:junit4]   2> 	  "state":"recovering",
[junit4:junit4]   2> 	  "core":"collection1",
[junit4:junit4]   2> 	  "collection":"collection1",
[junit4:junit4]   2> 	  "node_name":"127.0.0.1:55179_",
[junit4:junit4]   2> 	  "base_url":"http://127.0.0.1:55179"}
[junit4:junit4]   2> 12871 T1281 oass.IndexSchema.readSchema Schema name=test
[junit4:junit4]   2> 12883 T1231 oascc.ZkStateReader$2.process A cluster state change: WatchedEvent state:SyncConnected type:NodeDataChanged path:/clusterstate.json, has occurred - updating... (live nodes size: 5)
[junit4:junit4]   2> 12883 T1280 oascc.ZkStateReader$2.process A cluster state change: WatchedEvent state:SyncConnected type:NodeDataChanged path:/clusterstate.json, has occurred - updating... (live nodes size: 5)
[junit4:junit4]   2> 12883 T1212 oascc.ZkStateReader$2.process A cluster state change: WatchedEvent state:SyncConnected type:NodeDataChanged path:/clusterstate.json, has occurred - updating... (live nodes size: 5)
[junit4:junit4]   2> 12883 T1218 oascc.ZkStateReader$2.process A cluster state change: WatchedEvent state:SyncConnected type:NodeDataChanged path:/clusterstate.json, has occurred - updating... (live nodes size: 5)
[junit4:junit4]   2> 12883 T1262 oascc.ZkStateReader$2.process A cluster state change: WatchedEvent state:SyncConnected type:NodeDataChanged path:/clusterstate.json, has occurred - updating... (live nodes size: 5)
[junit4:junit4]   2> 12883 T1246 oascc.ZkStateReader$2.process A cluster state change: WatchedEvent state:SyncConnected type:NodeDataChanged path:/clusterstate.json, has occurred - updating... (live nodes size: 5)
[junit4:junit4]   2> 13424 T1281 oass.OpenExchangeRatesOrgProvider.init Initialized with rates=open-exchange-rates.json, refreshInterval=1440.
[junit4:junit4]   2> 13432 T1281 oass.IndexSchema.readSchema default search field in schema is text
[junit4:junit4]   2> 13435 T1281 oass.IndexSchema.readSchema unique key field: id
[junit4:junit4]   2> 13448 T1281 oass.FileExchangeRateProvider.reload Reloading exchange rates from file currency.xml
[junit4:junit4]   2> 13452 T1281 oass.FileExchangeRateProvider.reload Reloading exchange rates from file currency.xml
[junit4:junit4]   2> 13455 T1281 oass.OpenExchangeRatesOrgProvider.reload Reloading exchange rates from open-exchange-rates.json
[junit4:junit4]   2> 13456 T1281 oass.OpenExchangeRatesOrgProvider.reload Reloading exchange rates from open-exchange-rates.json
[junit4:junit4]   2> 13458 T1281 oasc.SolrCore.<init> [collection1] Opening new SolrCore at /usr/home/hudson/hudson-slave/workspace/Lucene-Solr-Tests-4.x-java7/solr/build/solr-core/test/J0/./org.apache.solr.cloud.SyncSliceTest-jetty4-1357026672492/collection1/, dataDir=./org.apache.solr.cloud.SyncSliceTest-1357026660116/jetty4/
[junit4:junit4]   2> 13458 T1281 oasc.JmxMonitoredMap.<init> JMX monitoring is enabled. Adding Solr mbeans to JMX Server: com.sun.jmx.mbeanserver.JmxMBeanServer@4e810bca
[junit4:junit4]   2> 13458 T1281 oasc.SolrCore.initDirectoryFactory solr.NRTCachingDirectoryFactory
[junit4:junit4]   2> 13459 T1281 oasc.CachingDirectoryFactory.get return new directory for /usr/home/hudson/hudson-slave/workspace/Lucene-Solr-Tests-4.x-java7/solr/build/solr-core/test/J0/./org.apache.solr.cloud.SyncSliceTest-1357026660116/jetty4 forceNew:false
[junit4:junit4]   2> 13459 T1281 oasc.CachingDirectoryFactory.close Releasing directory:/usr/home/hudson/hudson-slave/workspace/Lucene-Solr-Tests-4.x-java7/solr/build/solr-core/test/J0/./org.apache.solr.cloud.SyncSliceTest-1357026660116/jetty4
[junit4:junit4]   2> 13459 T1281 oasc.SolrCore.getNewIndexDir New index directory detected: old=null new=./org.apache.solr.cloud.SyncSliceTest-1357026660116/jetty4/index/
[junit4:junit4]   2> 13460 T1281 oasc.SolrCore.initIndex WARNING [collection1] Solr index directory './org.apache.solr.cloud.SyncSliceTest-1357026660116/jetty4/index' doesn't exist. Creating new index...
[junit4:junit4]   2> 13460 T1281 oasc.CachingDirectoryFactory.get return new directory for /usr/home/hudson/hudson-slave/workspace/Lucene-Solr-Tests-4.x-java7/solr/build/solr-core/test/J0/./org.apache.solr.cloud.SyncSliceTest-1357026660116/jetty4/index forceNew:false
[junit4:junit4]   2> 13470 T1281 oasc.SolrDeletionPolicy.onCommit SolrDeletionPolicy.onCommit: commits:num=1
[junit4:junit4]   2> 		commit{dir=RateLimitedDirectoryWrapper(NRTCachingDirectory(org.apache.lucene.store.NIOFSDirectory@/usr/home/hudson/hudson-slave/workspace/Lucene-Solr-Tests-4.x-java7/solr/build/solr-core/test/J0/org.apache.solr.cloud.SyncSliceTest-1357026660116/jetty4/index lockFactory=org.apache.lucene.store.NativeFSLockFactory@1dd658e9; maxCacheMB=48.0 maxMergeSizeMB=4.0)),segFN=segments_1,generation=1,filenames=[segments_1]
[junit4:junit4]   2> 13470 T1281 oasc.SolrDeletionPolicy.updateCommits newest commit = 1[segments_1]
[junit4:junit4]   2> 13471 T1281 oasc.CachingDirectoryFactory.close Releasing directory:/usr/home/hudson/hudson-slave/workspace/Lucene-Solr-Tests-4.x-java7/solr/build/solr-core/test/J0/./org.apache.solr.cloud.SyncSliceTest-1357026660116/jetty4/index
[junit4:junit4]   2> 13471 T1281 oasc.SolrCore.initWriters created xml: solr.XMLResponseWriter
[junit4:junit4]   2> 13473 T1281 oasup.UpdateRequestProcessorChain.init inserting DistributedUpdateProcessorFactory into updateRequestProcessorChain "dedupe"
[junit4:junit4]   2> 13473 T1281 oasup.UpdateRequestProcessorChain.init inserting DistributedUpdateProcessorFactory into updateRequestProcessorChain "dedupe-allfields"
[junit4:junit4]   2> 13473 T1281 oasup.UpdateRequestProcessorChain.init inserting DistributedUpdateProcessorFactory into updateRequestProcessorChain "stored_sig"
[junit4:junit4]   2> 13474 T1281 oasup.UpdateRequestProcessorChain.init inserting DistributedUpdateProcessorFactory into updateRequestProcessorChain "uniq-fields"
[junit4:junit4]   2> 13474 T1281 oasup.UpdateRequestProcessorChain.init inserting DistributedUpdateProcessorFactory into updateRequestProcessorChain "distrib-dup-test-chain-implicit"
[junit4:junit4]   2> 13474 T1281 oasc.RequestHandlers.initHandlersFromConfig adding lazy requestHandler: solr.ReplicationHandler
[junit4:junit4]   2> 13474 T1281 oasc.RequestHandlers.initHandlersFromConfig created /replication: solr.ReplicationHandler
[junit4:junit4]   2> 13475 T1281 oasc.RequestHandlers.initHandlersFromConfig created standard: solr.StandardRequestHandler
[junit4:junit4]   2> 13475 T1281 oasc.RequestHandlers.initHandlersFromConfig created /get: solr.RealTimeGetHandler
[junit4:junit4]   2> 13476 T1281 oasc.RequestHandlers.initHandlersFromConfig created dismax: solr.SearchHandler
[junit4:junit4]   2> 13476 T1281 oasc.RequestHandlers.initHandlersFromConfig created mock: org.apache.solr.core.MockQuerySenderListenerReqHandler
[junit4:junit4]   2> 13476 T1281 oasc.RequestHandlers.initHandlersFromConfig created /admin/: org.apache.solr.handler.admin.AdminHandlers
[junit4:junit4]   2> 13477 T1281 oasc.RequestHandlers.initHandlersFromConfig created defaults: solr.StandardRequestHandler
[junit4:junit4]   2> 13477 T1281 oasc.RequestHandlers.initHandlersFromConfig adding lazy requestHandler: solr.StandardRequestHandler
[junit4:junit4]   2> 13477 T1281 oasc.RequestHandlers.initHandlersFromConfig created lazy: solr.StandardRequestHandler
[junit4:junit4]   2> 13477 T1281 oasc.RequestHandlers.initHandlersFromConfig created /update: solr.UpdateRequestHandler
[junit4:junit4]   2> 13478 T1281 oasc.RequestHandlers.initHandlersFromConfig created /terms: org.apache.solr.handler.component.SearchHandler
[junit4:junit4]   2> 13478 T1281 oasc.RequestHandlers.initHandlersFromConfig created spellCheckCompRH: org.apache.solr.handler.component.SearchHandler
[junit4:junit4]   2> 13478 T1281 oasc.RequestHandlers.initHandlersFromConfig created spellCheckCompRH_Direct: org.apache.solr.handler.component.SearchHandler
[junit4:junit4]   2> 13479 T1281 oasc.RequestHandlers.initHandlersFromConfig created spellCheckWithWordbreak: org.apache.solr.handler.component.SearchHandler
[junit4:junit4]   2> 13479 T1281 oasc.RequestHandlers.initHandlersFromConfig created spellCheckWithWordbreak_Direct: org.apache.solr.handler.component.SearchHandler
[junit4:junit4]   2> 13479 T1281 oasc.RequestHandlers.initHandlersFromConfig created spellCheckCompRH1: org.apache.solr.handler.component.SearchHandler
[junit4:junit4]   2> 13480 T1281 oasc.RequestHandlers.initHandlersFromConfig created mltrh: org.apache.solr.handler.component.SearchHandler
[junit4:junit4]   2> 13480 T1281 oasc.RequestHandlers.initHandlersFromConfig created tvrh: org.apache.solr.handler.component.SearchHandler
[junit4:junit4]   2> 13480 T1281 oasc.RequestHandlers.initHandlersFromConfig created /mlt: solr.MoreLikeThisHandler
[junit4:junit4]   2> 13481 T1281 oasc.RequestHandlers.initHandlersFromConfig created /debug/dump: solr.DumpRequestHandler
[junit4:junit4]   2> 13489 T1281 oashl.XMLLoader.init xsltCacheLifetimeSeconds=60
[junit4:junit4]   2> 13492 T1281 oasc.SolrCore.initDeprecatedSupport WARNING solrconfig.xml uses deprecated <admin/gettableFiles>, Please update your config to use the ShowFileRequestHandler.
[junit4:junit4]   2> 13493 T1281 oasc.SolrCore.initDeprecatedSupport WARNING adding ShowFileRequestHandler with hidden files: [SCHEMA.XML, OLD_SYNONYMS.TXT, STOPWORDS.TXT, PROTWORDS.TXT, OPEN-EXCHANGE-RATES.JSON, SYNONYMS.TXT, CURRENCY.XML, MAPPING-ISOLATIN1ACCENT.TXT]
[junit4:junit4]   2> 13495 T1281 oasc.CachingDirectoryFactory.close Releasing directory:/usr/home/hudson/hudson-slave/workspace/Lucene-Solr-Tests-4.x-java7/solr/build/solr-core/test/J0/./org.apache.solr.cloud.SyncSliceTest-1357026660116/jetty4
[junit4:junit4]   2> 13496 T1281 oass.SolrIndexSearcher.<init> Opening Searcher@6c700816 main
[junit4:junit4]   2> 13497 T1281 oasu.CommitTracker.<init> Hard AutoCommit: disabled
[junit4:junit4]   2> 13498 T1281 oasu.CommitTracker.<init> Soft AutoCommit: disabled
[junit4:junit4]   2> 13498 T1281 oashc.SpellCheckComponent.inform Initializing spell checkers
[junit4:junit4]   2> 13556 T1281 oass.DirectSolrSpellChecker.init init: {name=direct,classname=DirectSolrSpellChecker,field=lowerfilt,minQueryLength=3}
[junit4:junit4]   2> 13781 T1282 oasc.SolrCore.registerSearcher [collection1] Registered new searcher Searcher@6c700816 main{StandardDirectoryReader(segments_1:1)}
[junit4:junit4]   2> 13786 T1281 oasc.ZkController.publish publishing core=collection1 state=down
[junit4:junit4]   2> 13786 T1281 oasc.ZkController.publish numShards not found on descriptor - reading it from system property
[junit4:junit4]   2> 14391 T1213 oascc.ZkStateReader.updateClusterState Updating cloud state from ZooKeeper... 
[junit4:junit4]   2> 14391 T1213 oasc.Overseer$ClusterStateUpdater.updateState Update state numShards=1 message={
[junit4:junit4]   2> 	  "operation":"state",
[junit4:junit4]   2> 	  "numShards":"1",
[junit4:junit4]   2> 	  "shard":null,
[junit4:junit4]   2> 	  "roles":null,
[junit4:junit4]   2> 	  "state":"down",
[junit4:junit4]   2> 	  "core":"collection1",
[junit4:junit4]   2> 	  "collection":"collection1",
[junit4:junit4]   2> 	  "node_name":"127.0.0.1:55192_",
[junit4:junit4]   2> 	  "base_url":"http://127.0.0.1:55192"}
[junit4:junit4]   2> 14392 T1213 oasc.Overseer$ClusterStateUpdater.updateState Collection already exists with numShards=1
[junit4:junit4]   2> 14392 T1213 oasc.Overseer$ClusterStateUpdater.updateState Assigning new node to shard shard=shard1
[junit4:junit4]   2> 14543 T1231 oascc.ZkStateReader$2.process A cluster state change: WatchedEvent state:SyncConnected type:NodeDataChanged path:/clusterstate.json, has occurred - updating... (live nodes size: 5)
[junit4:junit4]   2> 14543 T1246 oascc.ZkStateReader$2.process A cluster state change: WatchedEvent state:SyncConnected type:NodeDataChanged path:/clusterstate.json, has occurred - updating... (live nodes size: 5)
[junit4:junit4]   2> 14543 T1212 oascc.ZkStateReader$2.process A cluster state change: WatchedEvent state:SyncConnected type:NodeDataChanged path:/clusterstate.json, has occurred - updating... (live nodes size: 5)
[junit4:junit4]   2> 14543 T1280 oascc.ZkStateReader$2.process A cluster state change: WatchedEvent state:SyncConnected type:NodeDataChanged path:/clusterstate.json, has occurred - updating... (live nodes size: 5)
[junit4:junit4]   2> 14543 T1218 oascc.ZkStateReader$2.process A cluster state change: WatchedEvent state:SyncConnected type:NodeDataChanged path:/clusterstate.json, has occurred - updating... (live nodes size: 5)
[junit4:junit4]   2> 14543 T1262 oascc.ZkStateReader$2.process A cluster state change: WatchedEvent state:SyncConnected type:NodeDataChanged path:/clusterstate.json, has occurred - updating... (live nodes size: 5)
[junit4:junit4]   2> 14789 T1281 oasc.CoreContainer.registerCore registering core: collection1
[junit4:junit4]   2> 14789 T1281 oasc.ZkController.register Register replica - core:collection1 address:http://127.0.0.1:55192 collection:collection1 shard:shard1
[junit4:junit4]   2> 14793 T1281 oasc.ZkController.register We are http://127.0.0.1:55192/collection1/ and leader is http://127.0.0.1:55163/collection1/
[junit4:junit4]   2> 14793 T1281 oasc.ZkController.register No LogReplay needed for core=collection1 baseURL=http://127.0.0.1:55192
[junit4:junit4]   2> 14793 T1281 oasc.ZkController.checkRecovery Core needs to recover:collection1
[junit4:junit4]   2> 14793 T1281 oasu.DefaultSolrCoreState.doRecovery Running recovery - first canceling any ongoing recovery
[junit4:junit4]   2> ASYNC  NEW_CORE C77 name=collection1 org.apache.solr.core.SolrCore@71162d55 url=http://127.0.0.1:55192/collection1 node=127.0.0.1:55192_ C77_STATE=coll:collection1 core:collection1 props:{shard=null, roles=null, state=down, core=collection1, collection=collection1, node_name=127.0.0.1:55192_, base_url=http://127.0.0.1:55192}
[junit4:junit4]   2> 14794 T1283 C77 P55192 oasc.RecoveryStrategy.run Starting recovery process.  core=collection1 recoveringAfterStartup=true
[junit4:junit4]   2> 14794 T1281 oascc.ZkStateReader.updateClusterState Updating cloud state from ZooKeeper... 
[junit4:junit4]   2> 14795 T1283 C77 P55192 oasc.RecoveryStrategy.doRecovery ###### startupVersions=[]
[junit4:junit4]   2> 14795 T1283 C77 P55192 oasc.ZkController.publish publishing core=collection1 state=recovering
[junit4:junit4]   2> 14795 T1283 C77 P55192 oasc.ZkController.publish numShards not found on descriptor - reading it from system property
[junit4:junit4]   2> 14796 T1190 oass.SolrDispatchFilter.init user.dir=/usr/home/hudson/hudson-slave/workspace/Lucene-Solr-Tests-4.x-java7/solr/build/solr-core/test/J0
[junit4:junit4]   2> 14796 T1190 oass.SolrDispatchFilter.init SolrDispatchFilter.init() done
[junit4:junit4]   2> 14797 T1283 C77 P55192 oascsi.HttpClientUtil.createClient Creating new http client, config:maxConnections=128&maxConnectionsPerHost=32&followRedirects=false
[junit4:junit4]   2> 14797 T1190 oascsi.HttpClientUtil.createClient Creating new http client, config:maxConnections=128&maxConnectionsPerHost=32&followRedirects=false
[junit4:junit4]   2> 14818 T1190 oascc.ZkStateReader.updateClusterState Updating cloud state from ZooKeeper... 
[junit4:junit4]   2> 14820 T1190 oasc.AbstractFullDistribZkTestBase.waitForThingsToLevelOut Wait for recoveries to finish - wait 15 for each attempt
[junit4:junit4]   2> 14820 T1190 oasc.AbstractDistribZkTestBase.waitForRecoveriesToFinish Wait for recoveries to finish - collection: collection1 failOnTimeout:true timeout (sec):15
[junit4:junit4]   2> 14821 T1190 oascc.ZkStateReader.updateClusterState Updating cloud state from ZooKeeper... 
[junit4:junit4]   2>  C76_STATE=coll:collection1 core:collection1 props:{shard=shard1, roles=null, state=recovering, core=collection1, collection=collection1, node_name=127.0.0.1:55179_, base_url=http://127.0.0.1:55179}
[junit4:junit4]   2> 15385 T1267 C76 P55179 oasc.RecoveryStrategy.doRecovery Attempting to PeerSync from http://127.0.0.1:55163/collection1/ core=collection1 - recoveringAfterStartup=true
[junit4:junit4]   2> 15385 T1267 C76 P55179 oasu.PeerSync.sync PeerSync: core=collection1 url=http://127.0.0.1:55179 START replicas=[http://127.0.0.1:55163/collection1/] nUpdates=100
[junit4:junit4]   2> 15386 T1267 C76 P55179 oasu.PeerSync.sync WARNING no frame of reference to tell of we've missed updates
[junit4:junit4]   2> 15387 T1267 C76 P55179 oasc.RecoveryStrategy.doRecovery PeerSync Recovery was not successful - trying replication. core=collection1
[junit4:junit4]   2> 15387 T1267 C76 P55179 oasc.RecoveryStrategy.doRecovery Starting Replication Recovery. core=collection1
[junit4:junit4]   2> 15387 T1267 C76 P55179 oasc.RecoveryStrategy.doRecovery Begin buffering updates. core=collection1
[junit4:junit4]   2> 15387 T1267 C76 P55179 oasu.UpdateLog.bufferUpdates Starting to buffer updates. FSUpdateLog{state=ACTIVE, tlog=null}
[junit4:junit4]   2> 15387 T1267 C76 P55179 oasc.RecoveryStrategy.replicate Attempting to replicate from http://127.0.0.1:55163/collection1/. core=collection1
[junit4:junit4]   2> 15388 T1267 C76 P55179 oascsi.HttpClientUtil.createClient Creating new http client, config:maxConnections=128&maxConnectionsPerHost=32&followRedirects=false
[junit4:junit4]   2> 15388 T1222 C75 P55163 REQ /get {distrib=false&qt=/get&wt=javabin&version=2&getVersions=100} status=0 QTime=0 
[junit4:junit4]   2> 15398 T1227 C75 P55163 oasu.DirectUpdateHandler2.commit start commit{flags=0,_version_=0,optimize=false,openSearcher=false,waitSearcher=true,expungeDeletes=false,softCommit=false}
[junit4:junit4]   2> 15403 T1227 C75 P55163 oasc.SolrDeletionPolicy.onCommit SolrDeletionPolicy.onCommit: commits:num=2
[junit4:junit4]   2> 		commit{dir=RateLimitedDirectoryWrapper(NRTCachingDirectory(org.apache.lucene.store.NIOFSDirectory@/usr/home/hudson/hudson-slave/workspace/Lucene-Solr-Tests-4.x-java7/solr/build/solr-core/test/J0/org.apache.solr.cloud.SyncSliceTest-1357026660116/jetty1/index lockFactory=org.apache.lucene.store.NativeFSLockFactory@1bfbc3a9; maxCacheMB=48.0 maxMergeSizeMB=4.0)),segFN=segments_2,generation=2,filenames=[segments_2]
[junit4:junit4]   2> 		commit{dir=RateLimitedDirectoryWrapper(NRTCachingDirectory(org.apache.lucene.store.NIOFSDirectory@/usr/home/hudson/hudson-slave/workspace/Lucene-Solr-Tests-4.x-java7/solr/build/solr-core/test/J0/org.apache.solr.cloud.SyncSliceTest-1357026660116/jetty1/index lockFactory=org.apache.lucene.store.NativeFSLockFactory@1bfbc3a9; maxCacheMB=48.0 maxMergeSizeMB=4.0)),segFN=segments_3,generation=3,filenames=[segments_3]
[junit4:junit4]   2> 15404 T1227 C75 P55163 oasc.SolrDeletionPolicy.updateCommits newest commit = 3[segments_3]
[junit4:junit4]   2> 15404 T1227 C75 P55163 oasc.CachingDirectoryFactory.close Releasing directory:/usr/home/hudson/hudson-slave/workspace/Lucene-Solr-Tests-4.x-java7/solr/build/solr-core/test/J0/./org.apache.solr.cloud.SyncSliceTest-1357026660116/jetty1
[junit4:junit4]   2> 15405 T1227 C75 P55163 oasu.DirectUpdateHandler2.commit end_commit_flush
[junit4:junit4]   2> 15405 T1227 C75 P55163 /update {waitSearcher=true&openSearcher=false&commit=true&commit_end_point=true&wt=javabin&softCommit=false&version=2} {commit=} 0 7
[junit4:junit4]   2> 15406 T1267 C76 P55179 oash.ReplicationHandler.inform Commits will be reserved for  10000
[junit4:junit4]   2> 15406 T1267 C76 P55179 oash.SnapPuller.<init>  No value set for 'pollInterval'. Timer Task not started.
[junit4:junit4]   2> 15409 T1224 C75 P55163 REQ /replication {command=indexversion&wt=javabin&qt=/replication&version=2} status=0 QTime=0 
[junit4:junit4]   2> 15410 T1267 C76 P55179 oash.SnapPuller.fetchLatestIndex Master's generation: 3
[junit4:junit4]   2> 15410 T1267 C76 P55179 oash.SnapPuller.fetchLatestIndex Slave's generation: 1
[junit4:junit4]   2> 15410 T1267 C76 P55179 oash.SnapPuller.fetchLatestIndex Starting replication process
[junit4:junit4]   2> 15413 T1224 C75 P55163 oasc.CachingDirectoryFactory.close Releasing directory:/usr/home/hudson/hudson-slave/workspace/Lucene-Solr-Tests-4.x-java7/solr/build/solr-core/test/J0/./org.apache.solr.cloud.SyncSliceTest-1357026660116/jetty1
[junit4:junit4]   2> 15414 T1224 C75 P55163 oasc.CachingDirectoryFactory.close Releasing directory:/usr/home/hudson/hudson-slave/workspace/Lucene-Solr-Tests-4.x-java7/solr/build/solr-core/test/J0/./org.apache.solr.cloud.SyncSliceTest-1357026660116/jetty1/index
[junit4:junit4]   2> 15414 T1224 C75 P55163 REQ /replication {command=filelist&generation=3&wt=javabin&qt=/replication&version=2} status=0 QTime=1 
[junit4:junit4]   2> 15415 T1267 C76 P55179 oash.SnapPuller.fetchLatestIndex Number of files in latest index in master: 1
[junit4:junit4]   2> 15416 T1267 C76 P55179 oasc.CachingDirectoryFactory.get return new directory for /usr/home/hudson/hudson-slave/workspace/Lucene-Solr-Tests-4.x-java7/solr/build/solr-core/test/J0/./org.apache.solr.cloud.SyncSliceTest-1357026660116/jetty3/index.20130101025115526 forceNew:false
[junit4:junit4]   2> 15417 T1267 C76 P55179 oasc.CachingDirectoryFactory.close Releasing directory:/usr/home/hudson/hudson-slave/workspace/Lucene-Solr-Tests-4.x-java7/solr/build/solr-core/test/J0/./org.apache.solr.cloud.SyncSliceTest-1357026660116/jetty3
[junit4:junit4]   2> 15417 T1267 C76 P55179 oash.SnapPuller.fetchLatestIndex Starting download to RateLimitedDirectoryWrapper(NRTCachingDirectory(org.apache.lucene.store.NIOFSDirectory@/usr/home/hudson/hudson-slave/workspace/Lucene-Solr-Tests-4.x-java7/solr/build/solr-core/test/J0/org.apache.solr.cloud.SyncSliceTest-1357026660116/jetty3/index.20130101025115526 lockFactory=org.apache.lucene.store.NativeFSLockFactory@45a069fd; maxCacheMB=48.0 maxMergeSizeMB=4.0)) fullCopy=true
[junit4:junit4]   2> 15421 T1224 C75 P55163 REQ /replication {file=segments_3&command=filecontent&checksum=true&generation=3&qt=/replication&wt=filestream} status=0 QTime=0 
[junit4:junit4]   2> 15422 T1267 C76 P55179 oasc.CachingDirectoryFactory.close Releasing directory:/usr/home/hudson/hudson-slave/workspace/Lucene-Solr-Tests-4.x-java7/solr/build/solr-core/test/J0/./org.apache.solr.cloud.SyncSliceTest-1357026660116/jetty3/index
[junit4:junit4]   2> 15423 T1267 C76 P55179 oash.SnapPuller.fetchLatestIndex Total time taken for download : 0 secs
[junit4:junit4]   2> 15423 T1267 C76 P55179 oash.SnapPuller.modifyIndexProps New index installed. Updating index properties... index=index.20130101025115526
[junit4:junit4]   2> 15424 T1267 C76 P55179 oasc.CachingDirectoryFactory.close Releasing directory:/usr/home/hudson/hudson-slave/workspace/Lucene-Solr-Tests-4.x-java7/solr/build/solr-core/test/J0/./org.apache.solr.cloud.SyncSliceTest-1357026660116/jetty3
[junit4:junit4]   2> 15425 T1267 C76 P55179 oasc.CachingDirectoryFactory.close Releasing directory:/usr/home/hudson/hudson-slave/workspace/Lucene-Solr-Tests-4.x-java7/solr/build/solr-core/test/J0/./org.apache.solr.cloud.SyncSliceTest-1357026660116/jetty3
[junit4:junit4]   2> 15425 T1267 C76 P55179 oasc.SolrCore.getNewIndexDir New index directory detected: old=./org.apache.solr.cloud.SyncSliceTest-1357026660116/jetty3/index/ new=./org.apache.solr.cloud.SyncSliceTest-1357026660116/jetty3/index.20130101025115526
[junit4:junit4]   2> 15429 T1267 C76 P55179 oasc.SolrDeletionPolicy.onInit SolrDeletionPolicy.onInit: commits:num=1
[junit4:junit4]   2> 		commit{dir=RateLimitedDirectoryWrapper(NRTCachingDirectory(org.apache.lucene.store.NIOFSDirectory@/usr/home/hudson/hudson-slave/workspace/Lucene-Solr-Tests-4.x-java7/solr/build/solr-core/test/J0/org.apache.solr.cloud.SyncSliceTest-1357026660116/jetty3/index.20130101025115526 lockFactory=org.apache.lucene.store.NativeFSLockFactory@45a069fd; maxCacheMB=48.0 maxMergeSizeMB=4.0)),segFN=segments_3,generation=3,filenames=[segments_3]
[junit4:junit4]   2> 15429 T1267 C76 P55179 oasc.SolrDeletionPolicy.updateCommits newest commit = 3[segments_3]
[junit4:junit4]   2> 15430 T1267 C76 P55179 oasc.CachingDirectoryFactory.close Releasing directory:/usr/home/hudson/hudson-slave/workspace/Lucene-Solr-Tests-4.x-java7/solr/build/solr-core/test/J0/./org.apache.solr.cloud.SyncSliceTest-1357026660116/jetty3
[junit4:junit4]   2> 15430 T1267 C76 P55179 oasu.DefaultSolrCoreState.newIndexWriter Creating new IndexWriter...
[junit4:junit4]   2> 15431 T1267 C76 P55179 oasu.DefaultSolrCoreState.newIndexWriter Waiting until IndexWriter is unused... core=collection1
[junit4:junit4]   2> 15431 T1267 C76 P55179 oasu.DefaultSolrCoreState.newIndexWriter Rollback old IndexWriter... core=collection1
[junit4:junit4]   2> 15432 T1267 C76 P55179 oasc.CachingDirectoryFactory.close Releasing directory:/usr/home/hudson/hudson-slave/workspace/Lucene-Solr-Tests-4.x-java7/solr/build/solr-core/test/J0/./org.apache.solr.cloud.SyncSliceTest-1357026660116/jetty3/index.20130101025115526
[junit4:junit4]   2> 15432 T1267 C76 P55179 oasc.CachingDirectoryFactory.close Releasing directory:/usr/home/hudson/hudson-slave/workspace/Lucene-Solr-Tests-4.x-java7/solr/build/solr-core/test/J0/./org.apache.solr.cloud.SyncSliceTest-1357026660116/jetty3
[junit4:junit4]   2> 15436 T1267 C76 P55179 oasc.SolrDeletionPolicy.onInit SolrDeletionPolicy.onInit: commits:num=1
[junit4:junit4]   2> 		commit{dir=RateLimitedDirectoryWrapper(NRTCachingDirectory(org.apache.lucene.store.NIOFSDirectory@/usr/home/hudson/hudson-slave/workspace/Lucene-Solr-Tests-4.x-java7/solr/build/solr-core/test/J0/org.apache.solr.cloud.SyncSliceTest-1357026660116/jetty3/index.20130101025115526 lockFactory=org.apache.lucene.store.NativeFSLockFactory@45a069fd; maxCacheMB=48.0 maxMergeSizeMB=4.0)),segFN=segments_3,generation=3,filenames=[segments_3]
[junit4:junit4]   2> 15436 T1267 C76 P55179 oasc.SolrDeletionPolicy.updateCommits newest commit = 3[segments_3]
[junit4:junit4]   2> 15436 T1267 C76 P55179 oasu.DefaultSolrCoreState.newIndexWriter New IndexWriter is ready to be used.
[junit4:junit4]   2> 15437 T1267 C76 P55179 oasc.CachingDirectoryFactory.close Releasing directory:/usr/home/hudson/hudson-slave/workspace/Lucene-Solr-Tests-4.x-java7/solr/build/solr-core/test/J0/./org.apache.solr.cloud.SyncSliceTest-1357026660116/jetty3
[junit4:junit4]   2> 15437 T1267 C76 P55179 oass.SolrIndexSearcher.<init> Opening Searcher@53196afc main
[junit4:junit4]   2> 15439 T1264 oasc.SolrCore.registerSearcher [collection1] Registered new searcher Searcher@53196afc main{StandardDirectoryReader(segments_3:1:nrt)}
[junit4:junit4]   2> 15439 T1264 oasc.CachingDirectoryFactory.close Releasing directory:/usr/home/hudson/hudson-slave/workspace/Lucene-Solr-Tests-4.x-java7/solr/build/solr-core/test/J0/./org.apache.solr.cloud.SyncSliceTest-1357026660116/jetty3/index
[junit4:junit4]   2> 15439 T1267 C76 P55179 oasu.DirectUpdateHandler2.commit start commit{flags=0,_version_=0,optimize=false,openSearcher=false,waitSearcher=false,expungeDeletes=false,softCommit=false}
[junit4:junit4]   2> 15442 T1267 C76 P55179 oasc.SolrDeletionPolicy.onCommit SolrDeletionPolicy.onCommit: commits:num=2
[junit4:junit4]   2> 		commit{dir=RateLimitedDirectoryWrapper(NRTCachingDirectory(org.apache.lucene.store.NIOFSDirectory@/usr/home/hudson/hudson-slave/workspace/Lucene-Solr-Tests-4.x-java7/solr/build/solr-core/test/J0/org.apache.solr.cloud.SyncSliceTest-1357026660116/jetty3/index.20130101025115526 lockFactory=org.apache.lucene.store.NativeFSLockFactory@45a069fd; maxCacheMB=48.0 maxMergeSizeMB=4.0)),segFN=segments_3,generation=3,filenames=[segments_3]
[junit4:junit4]   2> 		commit{dir=RateLimitedDirectoryWrapper(NRTCachingDirectory(org.apache.lucene.store.NIOFSDirectory@/usr/home/hudson/hudson-slave/workspace/Lucene-Solr-Tests-4.x-java7/solr/build/solr-core/test/J0/org.apache.solr.cloud.SyncSliceTest-1357026660116/jetty3/index.20130101025115526 lockFactory=org.apache.lucene.store.NativeFSLockFactory@45a069fd; maxCacheMB=48.0 maxMergeSizeMB=4.0)),segFN=segments_4,generation=4,filenames=[segments_4]
[junit4:junit4]   2> 15443 T1267 C76 P55179 oasc.SolrDeletionPolicy.updateCommits newest commit = 4[segments_4]
[junit4:junit4]   2> 15444 T1267 C76 P55179 oasc.CachingDirectoryFactory.close Releasing directory:/usr/home/hudson/hudson-slave/workspace/Lucene-Solr-Tests-4.x-java7/solr/build/solr-core/test/J0/./org.apache.solr.cloud.SyncSliceTest-1357026660116/jetty3
[junit4:junit4]   2> 15444 T1267 C76 P55179 oasu.DirectUpdateHandler2.commit end_commit_flush
[junit4:junit4]   2> 15444 T1267 C76 P55179 oasc.CachingDirectoryFactory.close Releasing directory:/usr/home/hudson/hudson-slave/workspace/Lucene-Solr-Tests-4.x-java7/solr/build/solr-core/test/J0/./org.apache.solr.cloud.SyncSliceTest-1357026660116/jetty3/index.20130101025115526
[junit4:junit4]   2> 15445 T1267 C76 P55179 oasc.CachingDirectoryFactory.close Releasing directory:/usr/home/hudson/hudson-slave/workspace/Lucene-Solr-Tests-4.x-java7/solr/build/solr-core/test/J0/./org.apache.solr.cloud.SyncSliceTest-1357026660116/jetty3/index
[junit4:junit4]   2> 15445 T1267 C76 P55179 oasc.RecoveryStrategy.replay No replay needed. core=collection1
[junit4:junit4]   2> 15445 T1267 C76 P55179 oasc.RecoveryStrategy.doRecovery Replication Recovery was successful - registering as Active. core=collection1
[junit4:junit4]   2> 15445 T1267 C76 P55179 oasc.ZkController.publish publishing core=collection1 state=active
[junit4:junit4]   2> 15445 T1267 C76 P55179 oasc.ZkController.publish numShards not found on descriptor - reading it from system property
[junit4:junit4]   2> 15452 T1267 C76 P55179 oasc.RecoveryStrategy.doRecovery Finished recovery process. core=collection1
[junit4:junit4]   2> 15823 T1190 oascc.ZkStateReader.updateClusterState Updating cloud state from ZooKeeper... 
[junit4:junit4]   2> 16047 T1213 oascc.ZkStateReader.updateClusterState Updating cloud state from ZooKeeper... 
[junit4:junit4]   2> 16048 T1213 oasc.Overseer$ClusterStateUpdater.updateState Update state numShards=1 message={
[junit4:junit4]   2> 	  "operation":"state",
[junit4:junit4]   2> 	  "numShards":"1",
[junit4:junit4]   2> 	  "shard":"shard1",
[junit4:junit4]   2> 	  "roles":null,
[junit4:junit4]   2> 	  "state":"recovering",
[junit4:junit4]   2> 	  "core":"collection1",
[junit4:junit4]   2> 	  "collection":"collection1",
[junit4:junit4]   2> 	  "node_name":"127.0.0.1:55192_",
[junit4:junit4]   2> 	  "base_url":"http://127.0.0.1:55192"}
[junit4:junit4]   2> 16078 T1213 oasc.Overseer$ClusterStateUpdater.updateState Update state numShards=1 message={
[junit4:junit4]   2> 	  "operation":"state",
[junit4:junit4]   2> 	  "numShards":"1",
[junit4:junit4]   2> 	  "shard":"shard1",
[junit4:junit4]   2> 	  "roles":null,
[junit4:junit4]   2> 	  "state":"active",
[junit4:junit4]   2> 	  "core":"collection1",
[junit4:junit4]   2> 	  "collection":"collection1",
[junit4:junit4]   2> 	  "node_name":"127.0.0.1:55179_",
[junit4:junit4]   2> 	  "base_url":"http://127.0.0.1:55179"}
[junit4:junit4]   2> 16093 T1262 oascc.ZkStateReader$2.process A cluster state change: WatchedEvent state:SyncConnected type:NodeDataChanged path:/clusterstate.json, has occurred - updating... (live nodes size: 5)
[junit4:junit4]   2> 16093 T1218 oascc.ZkStateReader$2.process A cluster state change: WatchedEvent state:SyncConnected type:NodeDataChanged path:/clusterstate.json, has occurred - updating... (live nodes size: 5)
[junit4:junit4]   2> 16093 T1212 oascc.ZkStateReader$2.process A cluster state change: WatchedEvent state:SyncConnected type:NodeDataChanged path:/clusterstate.json, has occurred - updating... (live nodes size: 5)
[junit4:junit4]   2> 16094 T1280 oascc.ZkStateReader$2.process A cluster state change: WatchedEvent state:SyncConnected type:NodeDataChanged path:/clusterstate.json, has occurred - updating... (live nodes size: 5)
[junit4:junit4]   2> 16093 T1231 oascc.ZkStateReader$2.process A cluster state change: WatchedEvent state:SyncConnected type:NodeDataChanged path:/clusterstate.json, has occurred - updating... (live nodes size: 5)
[junit4:junit4]   2> 16093 T1246 oascc.ZkStateReader$2.process A cluster state change: WatchedEvent state:SyncConnected type:NodeDataChanged path:/clusterstate.json, has occurred - updating... (live nodes size: 5)
[junit4:junit4]   2> 16826 T1190 oascc.ZkStateReader.updateClusterState Updating cloud state from ZooKeeper... 
[junit4:junit4]   2> 17828 T1190 oascc.ZkStateReader.updateClusterState Updating cloud state from ZooKeeper... 
[junit4:junit4]   2>  C77_STATE=coll:collection1 core:collection1 props:{shard=shard1, roles=null, state=recovering, core=collection1, collection=collection1, node_name=127.0.0.1:55192_, base_url=http://127.0.0.1:55192}
[junit4:junit4]   2> 18822 T1283 C77 P55192 oasc.RecoveryStrategy.doRecovery Attempting to PeerSync from http://127.0.0.1:55163/collection1/ core=collection1 - recoveringAfterStartup=true
[junit4:junit4]   2> 18822 T1283 C77 P55192 oasu.PeerSync.sync PeerSync: core=collection1 url=http://127.0.0.1:55192 START replicas=[http://127.0.0.1:55163/collection1/] nUpdates=100
[junit4:junit4]   2> 18823 T1283 C77 P55192 oasu.PeerSync.sync WARNING no frame of reference to tell of we've missed updates
[junit4:junit4]   2> 18823 T1283 C77 P55192 oasc.RecoveryStrategy.doRecovery PeerSync Recovery was not successful - trying replication. core=collection1
[junit4:junit4]   2> 18823 T1283 C77 P55192 oasc.RecoveryStrategy.doRecovery Starting Replication Recovery. core=collection1
[junit4:junit4]   2> 18823 T1283 C77 P55192 oasc.RecoveryStrategy.doRecovery Begin buffering updates. core=collection1
[junit4:junit4]   2> 18824 T1283 C77 P55192 oasu.UpdateLog.bufferUpdates Starting to buffer updates. FSUpdateLog{state=ACTIVE, tlog=null}
[junit4:junit4]   2> 18824 T1283 C77 P55192 oasc.RecoveryStrategy.replicate Attempting to replicate from http://127.0.0.1:55163/collection1/. core=collection1
[junit4:junit4]   2> 18824 T1283 C77 P55192 oascsi.HttpClientUtil.createClient Creating new http client, config:maxConnections=128&maxConnectionsPerHost=32&followRedirects=false
[junit4:junit4]   2> 18825 T1222 C75 P55163 REQ /get {distrib=false&qt=/get&wt=javabin&version=2&getVersions=100} status=0 QTime=0 
[junit4:junit4]   2> 18830 T1190 oascc.ZkStateReader.updateClusterState Updating cloud state from ZooKeeper... 
[junit4:junit4]   2> 18840 T1221 C75 P55163 oasu.DirectUpdateHandler2.commit start commit{flags=0,_version_=0,optimize=false,openSearcher=false,waitSearcher=true,expungeDeletes=false,softCommit=false}
[junit4:junit4]   2> 18851 T1221 C75 P55163 oasc.SolrDeletionPolicy.onCommit SolrDeletionPolicy.onCommit: commits:num=3
[junit4:junit4]   2> 		commit{dir=RateLimitedDirectoryWrapper(NRTCachingDirectory(org.apache.lucene.store.NIOFSDirectory@/usr/home/hudson/hudson-slave/workspace/Lucene-Solr-Tests-4.x-java7/solr/build/solr-core/test/J0/org.apache.solr.cloud.SyncSliceTest-1357026660116/jetty1/index lockFactory=org.apache.lucene.store.NativeFSLockFactory@1bfbc3a9; maxCacheMB=48.0 maxMergeSizeMB=4.0)),segFN=segments_2,generation=2,filenames=[segments_2]
[junit4:junit4]   2> 		commit{dir=RateLimitedDirectoryWrapper(NRTCachingDirectory(org.apache.lucene.store.NIOFSDirectory@/usr/home/hudson/hudson-slave/workspace/Lucene-Solr-Tests-4.x-java7/solr/build/solr-core/test/J0/org.apache.solr.cloud.SyncSliceTest-1357026660116/jetty1/index lockFactory=org.apache.lucene.store.NativeFSLockFactory@1bfbc3a9; maxCacheMB=48.0 maxMergeSizeMB=4.0)),segFN=segments_3,generation=3,filenames=[segments_3]
[junit4:junit4]   2> 		commit{dir=RateLimitedDirectoryWrapper(NRTCachingDirectory(org.apache.lucene.store.NIOFSDirectory@/usr/home/hudson/hudson-slave/workspace/Lucene-Solr-Tests-4.x-java7/solr/build/solr-core/test/J0/org.apache.solr.cloud.SyncSliceTest-1357026660116/jetty1/index lockFactory=org.apache.lucene.store.NativeFSLockFactory@1bfbc3a9; maxCacheMB=48.0 maxMergeSizeMB=4.0)),segFN=segments_4,generation=4,filenames=[segments_4]
[junit4:junit4]   2> 18852 T1221 C75 P55163 oasc.SolrDeletionPolicy.updateCommits newest commit = 4[segments_4]
[junit4:junit4]   2> 18853 T1221 C75 P55163 oasc.CachingDirectoryFactory.close Releasing directory:/usr/home/hudson/hudson-slave/workspace/Lucene-Solr-Tests-4.x-java7/solr/build/solr-core/test/J0/./org.apache.solr.cloud.SyncSliceTest-1357026660116/jetty1
[junit4:junit4]   2> 18853 T1221 C75 P55163 oasu.DirectUpdateHandler2.commit end_commit_flush
[junit4:junit4]   2> 18853 T1221 C75 P55163 /update {waitSearcher=true&openSearcher=false&commit=true&commit_end_point=true&wt=javabin&softCommit=false&version=2} {commit=} 0 13
[junit4:junit4]   2> 18854 T1283 C77 P55192 oash.ReplicationHandler.inform Commits will be reserved for  10000
[junit4:junit4]   2> 18855 T1283 C77 P55192 oash.SnapPuller.<init>  No value set for 'pollInterval'. Timer Task not started.
[junit4:junit4]   2> 18857 T1224 C75 P55163 REQ /replication {command=indexversion&wt=javabin&qt=/replication&version=2} status=0 QTime=0 
[junit4:junit4]   2> 18858 T1283 C77 P55192 oash.SnapPuller.fetchLatestIndex Master's generation: 4
[junit4:junit4]   2> 18858 T1283 C77 P55192 oash.SnapPuller.fetchLatestIndex Slave's generation: 1
[junit4:junit4]   2> 18858 T1283 C77 P55192 oash.SnapPuller.fetchLatestIndex Starting replication process
[junit4:junit4]   2> 18861 T1224 C75 P55163 oasc.CachingDirectoryFactory.close Releasing directory:/usr/home/hudson/hudson-slave/workspace/Lucene-Solr-Tests-4.x-java7/solr/build/solr-core/test/J0/./org.apache.solr.cloud.SyncSliceTest-1357026660116/jetty1
[junit4:junit4]   2> 18862 T1224 C75 P55163 oasc.CachingDirectoryFactory.close Releasing directory:/usr/home/hudson/hudson-slave/workspace/Lucene-Solr-Tests-4.x-java7/solr/build/solr-core/test/J0/./org.apache.solr.cloud.SyncSliceTest-1357026660116/jetty1/index
[junit4:junit4]   2> 18862 T1224 C75 P55163 REQ /replication {command=filelist&generation=4&wt=javabin&qt=/replication&version=2} status=0 QTime=1 
[junit4:junit4]   2> 18863 T1283 C77 P55192 oash.SnapPuller.fetchLatestIndex Number of files in latest index in master: 1
[junit4:junit4]   2> 18865 T1283 C77 P55192 oasc.CachingDirectoryFactory.get return new directory for /usr/home/hudson/hudson-slave/workspace/Lucene-Solr-Tests-4.x-java7/solr/build/solr-core/test/J0/./org.apache.solr.cloud.SyncSliceTest-1357026660116/jetty4/index.20130101025118974 forceNew:false
[junit4:junit4]   2> 18865 T1283 C77 P55192 oasc.CachingDirectoryFactory.close Releasing directory:/usr/home/hudson/hudson-slave/workspace/Lucene-Solr-Tests-4.x-java7/solr/build/solr-core/test/J0/./org.apache.solr.cloud.SyncSliceTest-1357026660116/jetty4
[junit4:junit4]   2> 18866 T1283 C77 P55192 oash.SnapPuller.fetchLatestIndex Starting download to RateLimitedDirectoryWrapper(NRTCachingDirectory(org.apache.lucene.store.NIOFSDirectory@/usr/home/hudson/hudson-slave/workspace/Lucene-Solr-Tests-4.x-java7/solr/build/solr-core/test/J0/org.apache.solr.cloud.SyncSliceTest-1357026660116/jetty4/index.20130101025118974 lockFactory=org.apache.lucene.store.NativeFSLockFactory@3605b2eb; maxCacheMB=48.0 maxMergeSizeMB=4.0)) fullCopy=true
[junit4:junit4]   2> 18869 T1224 C75 P55163 REQ /replication {file=segments_4&command=filecontent&checksum=true&generation=4&qt=/replication&wt=filestream} status=0 QTime=0 
[junit4:junit4]   2> 18870 T1283 C77 P55192 oasc.CachingDirectoryFactory.close Releasing directory:/usr/home/hudson/hudson-slave/workspace/Lucene-Solr-Tests-4.x-java7/solr/build/solr-core/test/J0/./org.apache.solr.cloud.SyncSliceTest-1357026660116/jetty4/index
[junit4:junit4]   2> 18871 T1283 C77 P55192 oash.SnapPuller.fetchLatestIndex Total time taken for download : 0 secs
[junit4:junit4]   2> 18871 T1283 C77 P55192 oash.SnapPuller.modifyIndexProps New index installed. Updating index properties... index=index.20130101025118974
[junit4:junit4]   2> 18872 T1283 C77 P55192 oasc.CachingDirectoryFactory.close Releasing directory:/usr/home/hudson/hudson-slave/workspace/Lucene-Solr-Tests-4.x-java7/solr/build/solr-core/test/J0/./org.apache.solr.cloud.SyncSliceTest-1357026660116/jetty4
[junit4:junit4]   2> 18873 T1283 C77 P55192 oasc.CachingDirectoryFactory.close Releasing directory:/usr/home/hudson/hudson-slave/workspace/Lucene-Solr-Tests-4.x-java7/solr/build/solr-core/test/J0/./org.apache.solr.cloud.SyncSliceTest-1357026660116/jetty4
[junit4:junit4]   2> 18873 T1283 C77 P55192 oasc.SolrCore.getNewIndexDir New index directory detected: old=./org.apache.sol

[...truncated too long message...]

ry(org.apache.lucene.store.NIOFSDirectory@/usr/home/hudson/hudson-slave/workspace/Lucene-Solr-Tests-4.x-java7/solr/build/solr-core/test/J0/org.apache.solr.cloud.SyncSliceTest-1357026660116/jetty4/index lockFactory=org.apache.lucene.store.NativeFSLockFactory@1dd658e9; maxCacheMB=48.0 maxMergeSizeMB=4.0))
[junit4:junit4]   2> 146089 T1190 oasc.CachingDirectoryFactory.close Closing directory when closing factory:/usr/home/hudson/hudson-slave/workspace/Lucene-Solr-Tests-4.x-java7/solr/build/solr-core/test/J0/./org.apache.solr.cloud.SyncSliceTest-1357026660116/jetty4/index
[junit4:junit4]   2> 146090 T1190 oasc.CachingDirectoryFactory.closeDirectory Closing directory:/usr/home/hudson/hudson-slave/workspace/Lucene-Solr-Tests-4.x-java7/solr/build/solr-core/test/J0/./org.apache.solr.cloud.SyncSliceTest-1357026660116/jetty4/index
[junit4:junit4]   2> 146090 T1190 oasc.CachingDirectoryFactory.close Closing directory when closing factory:/usr/home/hudson/hudson-slave/workspace/Lucene-Solr-Tests-4.x-java7/solr/build/solr-core/test/J0/./org.apache.solr.cloud.SyncSliceTest-1357026660116/jetty4
[junit4:junit4]   2> 146090 T1190 oasc.CachingDirectoryFactory.closeDirectory Closing directory:/usr/home/hudson/hudson-slave/workspace/Lucene-Solr-Tests-4.x-java7/solr/build/solr-core/test/J0/./org.apache.solr.cloud.SyncSliceTest-1357026660116/jetty4
[junit4:junit4]   2> 146192 T1280 oaz.ClientCnxn$EventThread.run EventThread shut down
[junit4:junit4]   2> 146192 T1190 oaz.ZooKeeper.close Session: 0x13bf5178f1b000c closed
[junit4:junit4]   2> 146194 T1190 oejsh.ContextHandler.doStop stopped o.e.j.s.ServletContextHandler{/,null}
[junit4:junit4]   2> 146416 T1190 oas.SolrTestCaseJ4.tearDown ###Ending testDistribSearch
[junit4:junit4]   1> client port:0.0.0.0/0.0.0.0:0
[junit4:junit4]   2> NOTE: reproduce with: ant test  -Dtestcase=SyncSliceTest -Dtests.method=testDistribSearch -Dtests.seed=2AE5D85AAD84E9B1 -Dtests.multiplier=3 -Dtests.slow=true -Dtests.locale=pl -Dtests.timezone=US/Michigan -Dtests.file.encoding=UTF-8
[junit4:junit4] FAILURE  146s J0 | SyncSliceTest.testDistribSearch <<<
[junit4:junit4]    > Throwable #1: java.lang.AssertionError: shard1 should have just been set up to be inconsistent - but it's still consistent
[junit4:junit4]    > 	at __randomizedtesting.SeedInfo.seed([2AE5D85AAD84E9B1:AB035642DADB898D]:0)
[junit4:junit4]    > 	at org.junit.Assert.fail(Assert.java:93)
[junit4:junit4]    > 	at org.junit.Assert.assertTrue(Assert.java:43)
[junit4:junit4]    > 	at org.junit.Assert.assertNotNull(Assert.java:526)
[junit4:junit4]    > 	at org.apache.solr.cloud.SyncSliceTest.doTest(SyncSliceTest.java:214)
[junit4:junit4]    > 	at org.apache.solr.BaseDistributedSearchTestCase.testDistribSearch(BaseDistributedSearchTestCase.java:794)
[junit4:junit4]    > 	at sun.reflect.NativeMethodAccessorImpl.invoke0(Native Method)
[junit4:junit4]    > 	at sun.reflect.NativeMethodAccessorImpl.invoke(NativeMethodAccessorImpl.java:57)
[junit4:junit4]    > 	at sun.reflect.DelegatingMethodAccessorImpl.invoke(DelegatingMethodAccessorImpl.java:43)
[junit4:junit4]    > 	at java.lang.reflect.Method.invoke(Method.java:601)
[junit4:junit4]    > 	at com.carrotsearch.randomizedtesting.RandomizedRunner.invoke(RandomizedRunner.java:1559)
[junit4:junit4]    > 	at com.carrotsearch.randomizedtesting.RandomizedRunner.access$600(RandomizedRunner.java:79)
[junit4:junit4]    > 	at com.carrotsearch.randomizedtesting.RandomizedRunner$6.evaluate(RandomizedRunner.java:737)
[junit4:junit4]    > 	at com.carrotsearch.randomizedtesting.RandomizedRunner$7.evaluate(RandomizedRunner.java:773)
[junit4:junit4]    > 	at com.carrotsearch.randomizedtesting.RandomizedRunner$8.evaluate(RandomizedRunner.java:787)
[junit4:junit4]    > 	at com.carrotsearch.randomizedtesting.rules.SystemPropertiesRestoreRule$1.evaluate(SystemPropertiesRestoreRule.java:53)
[junit4:junit4]    > 	at org.apache.lucene.util.TestRuleSetupTeardownChained$1.evaluate(TestRuleSetupTeardownChained.java:50)
[junit4:junit4]    > 	at org.apache.lucene.util.TestRuleFieldCacheSanity$1.evaluate(TestRuleFieldCacheSanity.java:51)
[junit4:junit4]    > 	at org.apache.lucene.util.AbstractBeforeAfterRule$1.evaluate(AbstractBeforeAfterRule.java:46)
[junit4:junit4]    > 	at com.carrotsearch.randomizedtesting.rules.SystemPropertiesInvariantRule$1.evaluate(SystemPropertiesInvariantRule.java:55)
[junit4:junit4]    > 	at org.apache.lucene.util.TestRuleThreadAndTestName$1.evaluate(TestRuleThreadAndTestName.java:49)
[junit4:junit4]    > 	at org.apache.lucene.util.TestRuleIgnoreAfterMaxFailures$1.evaluate(TestRuleIgnoreAfterMaxFailures.java:70)
[junit4:junit4]    > 	at org.apache.lucene.util.TestRuleMarkFailure$1.evaluate(TestRuleMarkFailure.java:48)
[junit4:junit4]    > 	at com.carrotsearch.randomizedtesting.rules.StatementAdapter.evaluate(StatementAdapter.java:36)
[junit4:junit4]    > 	at com.carrotsearch.randomizedtesting.ThreadLeakControl$StatementRunner.run(ThreadLeakControl.java:358)
[junit4:junit4]    > 	at com.carrotsearch.randomizedtesting.ThreadLeakControl.forkTimeoutingTask(ThreadLeakControl.java:782)
[junit4:junit4]    > 	at com.carrotsearch.randomizedtesting.ThreadLeakControl$3.evaluate(ThreadLeakControl.java:442)
[junit4:junit4]    > 	at com.carrotsearch.randomizedtesting.RandomizedRunner.runSingleTest(RandomizedRunner.java:746)
[junit4:junit4]    > 	at com.carrotsearch.randomizedtesting.RandomizedRunner$3.evaluate(RandomizedRunner.java:648)
[junit4:junit4]    > 	at com.carrotsearch.randomizedtesting.RandomizedRunner$4.evaluate(RandomizedRunner.java:682)
[junit4:junit4]    > 	at com.carrotsearch.randomizedtesting.RandomizedRunner$5.evaluate(RandomizedRunner.java:693)
[junit4:junit4]    > 	at com.carrotsearch.randomizedtesting.rules.StatementAdapter.evaluate(StatementAdapter.java:36)
[junit4:junit4]    > 	at com.carrotsearch.randomizedtesting.rules.SystemPropertiesRestoreRule$1.evaluate(SystemPropertiesRestoreRule.java:53)
[junit4:junit4]    > 	at org.apache.lucene.util.AbstractBeforeAfterRule$1.evaluate(AbstractBeforeAfterRule.java:46)
[junit4:junit4]    > 	at org.apache.lucene.util.TestRuleStoreClassName$1.evaluate(TestRuleStoreClassName.java:42)
[junit4:junit4]    > 	at com.carrotsearch.randomizedtesting.rules.SystemPropertiesInvariantRule$1.evaluate(SystemPropertiesInvariantRule.java:55)
[junit4:junit4]    > 	at com.carrotsearch.randomizedtesting.rules.NoShadowingOrOverridesOnMethodsRule$1.evaluate(NoShadowingOrOverridesOnMethodsRule.java:39)
[junit4:junit4]    > 	at com.carrotsearch.randomizedtesting.rules.NoShadowingOrOverridesOnMethodsRule$1.evaluate(NoShadowingOrOverridesOnMethodsRule.java:39)
[junit4:junit4]    > 	at com.carrotsearch.randomizedtesting.rules.StatementAdapter.evaluate(StatementAdapter.java:36)
[junit4:junit4]    > 	at org.apache.lucene.util.TestRuleAssertionsRequired$1.evaluate(TestRuleAssertionsRequired.java:43)
[junit4:junit4]    > 	at org.apache.lucene.util.TestRuleMarkFailure$1.evaluate(TestRuleMarkFailure.java:48)
[junit4:junit4]    > 	at org.apache.lucene.util.TestRuleIgnoreAfterMaxFailures$1.evaluate(TestRuleIgnoreAfterMaxFailures.java:70)
[junit4:junit4]    > 	at org.apache.lucene.util.TestRuleIgnoreTestSuites$1.evaluate(TestRuleIgnoreTestSuites.java:55)
[junit4:junit4]    > 	at com.carrotsearch.randomizedtesting.rules.StatementAdapter.evaluate(StatementAdapter.java:36)
[junit4:junit4]    > 	at com.carrotsearch.randomizedtesting.ThreadLeakControl$StatementRunner.run(ThreadLeakControl.java:358)
[junit4:junit4]    > 	at java.lang.Thread.run(Thread.java:722)
[junit4:junit4]   2> 146437 T1190 oas.SolrTestCaseJ4.deleteCore ###deleteCore
[junit4:junit4]   2> NOTE: test params are: codec=FastDecompressionCompressingStoredFields(storedFieldsFormat=CompressingStoredFieldsFormat(compressionMode=FAST_DECOMPRESSION, chunkSize=78)), sim=RandomSimilarityProvider(queryNorm=true,coord=no): {}, locale=pl, timezone=US/Michigan
[junit4:junit4]   2> NOTE: FreeBSD 9.0-RELEASE amd64/Oracle Corporation 1.7.0_09 (64-bit)/cpus=16,threads=2,free=188057240,total=398458880
[junit4:junit4]   2> NOTE: All tests run in this JVM: [CoreAdminHandlerTest, TestConfig, TestCollationKeyRangeQueries, SolrCmdDistributorTest, TestCollationField, SpatialFilterTest, TestStressRecovery, TestExtendedDismaxParser, TestSystemIdResolver, TestStressReorder, TestFuzzyAnalyzedSuggestions, IndexBasedSpellCheckerTest, TestCoreContainer, ResourceLoaderTest, TestSuggestSpellingConverter, SuggesterFSTTest, DistributedTermsComponentTest, ChaosMonkeySafeLeaderTest, TestPseudoReturnFields, TestIndexSearcher, SolrRequestParserTest, DateFieldTest, SystemInfoHandlerTest, SortByFunctionTest, CopyFieldTest, NoCacheHeaderTest, BasicDistributedZkTest, JsonLoaderTest, TestPerFieldSimilarity, TestBinaryResponseWriter, MBeansHandlerTest, SyncSliceTest]
[junit4:junit4] Completed on J0 in 146.46s, 1 test, 1 failure <<< FAILURES!

[...truncated 457 lines...]
BUILD FAILED
/usr/home/hudson/hudson-slave/workspace/Lucene-Solr-Tests-4.x-java7/build.xml:353: The following error occurred while executing this line:
/usr/home/hudson/hudson-slave/workspace/Lucene-Solr-Tests-4.x-java7/build.xml:39: The following error occurred while executing this line:
/usr/home/hudson/hudson-slave/workspace/Lucene-Solr-Tests-4.x-java7/solr/build.xml:178: The following error occurred while executing this line:
/usr/home/hudson/hudson-slave/workspace/Lucene-Solr-Tests-4.x-java7/solr/common-build.xml:438: The following error occurred while executing this line:
/usr/home/hudson/hudson-slave/workspace/Lucene-Solr-Tests-4.x-java7/lucene/common-build.xml:1176: The following error occurred while executing this line:
/usr/home/hudson/hudson-slave/workspace/Lucene-Solr-Tests-4.x-java7/lucene/common-build.xml:841: There were test failures: 245 suites, 1013 tests, 1 failure, 22 ignored (4 assumptions)

Total time: 138 minutes 58 seconds
Build step 'Invoke Ant' marked build as failure
Archiving artifacts
Recording test results
Email was triggered for: Failure
Sending email for trigger: Failure



Mime
View raw message