lucene-dev mailing list archives

Site index · List index
Message view « Date » · « Thread »
Top « Date » · « Thread »
From Apache Jenkins Server <jenk...@builds.apache.org>
Subject [JENKINS] Lucene-Solr-Tests-4.x-java7 - Build # 901 - Still Failing
Date Wed, 16 Jan 2013 19:14:12 GMT
Build: https://builds.apache.org/job/Lucene-Solr-Tests-4.x-java7/901/

2 tests failed.
REGRESSION:  org.apache.solr.cloud.BasicDistributedZkTest.testDistribSearch

Error Message:
Test abandoned because suite timeout was reached.

Stack Trace:
java.lang.Exception: Test abandoned because suite timeout was reached.
	at __randomizedtesting.SeedInfo.seed([131F65E17E66C663]:0)


FAILED:  junit.framework.TestSuite.org.apache.solr.cloud.BasicDistributedZkTest

Error Message:
Suite timeout exceeded (>= 7200000 msec).

Stack Trace:
java.lang.Exception: Suite timeout exceeded (>= 7200000 msec).
	at __randomizedtesting.SeedInfo.seed([131F65E17E66C663]:0)




Build Log:
[...truncated 9257 lines...]
[junit4:junit4] Suite: org.apache.solr.cloud.BasicDistributedZkTest
[junit4:junit4]   2> 0 T298 oas.BaseDistributedSearchTestCase.initHostContext Setting hostContext system property: /
[junit4:junit4]   2> 4 T298 oas.SolrTestCaseJ4.setUp ###Starting testDistribSearch
[junit4:junit4]   2> Creating dataDir: /usr/home/hudson/hudson-slave/workspace/Lucene-Solr-Tests-4.x-java7/solr/build/solr-core/test/J0/./solrtest-BasicDistributedZkTest-1358356410118
[junit4:junit4]   2> 11 T298 oasc.ZkTestServer.run STARTING ZK TEST SERVER
[junit4:junit4]   2> 15 T299 oasc.ZkTestServer$ZKServerMain.runFromConfig Starting server
[junit4:junit4]   2> 77 T299 oaz.Environment.logEnv Server environment:zookeeper.version=3.4.5-1392090, built on 09/30/2012 17:52 GMT
[junit4:junit4]   2> 77 T299 oaz.Environment.logEnv Server environment:host.name=lucene.zones.apache.org
[junit4:junit4]   2> 77 T299 oaz.Environment.logEnv Server environment:java.version=1.7.0_09
[junit4:junit4]   2> 77 T299 oaz.Environment.logEnv Server environment:java.vendor=Oracle Corporation
[junit4:junit4]   2> 78 T299 oaz.Environment.logEnv Server environment:java.home=/usr/local/openjdk7/jre
[junit4:junit4]   2> 78 T299 oaz.Environment.logEnv Server environment:java.class.path=/usr/home/hudson/hudson-slave/workspace/Lucene-Solr-Tests-4.x-java7/solr/build/solr-core/classes/test:/usr/home/hudson/hudson-slave/workspace/Lucene-Solr-Tests-4.x-java7/solr/build/solr-test-framework/classes/java:/usr/home/hudson/hudson-slave/workspace/Lucene-Solr-Tests-4.x-java7/solr/build/solr-core/test-files:/usr/home/hudson/hudson-slave/workspace/Lucene-Solr-Tests-4.x-java7/lucene/build/test-framework/classes/java:/usr/home/hudson/hudson-slave/workspace/Lucene-Solr-Tests-4.x-java7/lucene/build/codecs/classes/java:/usr/home/hudson/hudson-slave/workspace/Lucene-Solr-Tests-4.x-java7/solr/build/solr-solrj/classes/java:/usr/home/hudson/hudson-slave/workspace/Lucene-Solr-Tests-4.x-java7/solr/build/solr-core/classes/java:/usr/home/hudson/hudson-slave/workspace/Lucene-Solr-Tests-4.x-java7/lucene/build/analysis/common/lucene-analyzers-common-4.2-SNAPSHOT.jar:/usr/home/hudson/hudson-slave/workspace/Lucene-Solr-Tests-4.x-java7/lucene/build/analysis/kuromoji/lucene-analyzers-kuromoji-4.2-SNAPSHOT.jar:/usr/home/hudson/hudson-slave/workspace/Lucene-Solr-Tests-4.x-java7/lucene/build/analysis/phonetic/lucene-analyzers-phonetic-4.2-SNAPSHOT.jar:/usr/home/hudson/hudson-slave/workspace/Lucene-Solr-Tests-4.x-java7/lucene/build/highlighter/lucene-highlighter-4.2-SNAPSHOT.jar:/usr/home/hudson/hudson-slave/workspace/Lucene-Solr-Tests-4.x-java7/lucene/build/memory/lucene-memory-4.2-SNAPSHOT.jar:/usr/home/hudson/hudson-slave/workspace/Lucene-Solr-Tests-4.x-java7/lucene/build/misc/lucene-misc-4.2-SNAPSHOT.jar:/usr/home/hudson/hudson-slave/workspace/Lucene-Solr-Tests-4.x-java7/lucene/build/spatial/lucene-spatial-4.2-SNAPSHOT.jar:/usr/home/hudson/hudson-slave/workspace/Lucene-Solr-Tests-4.x-java7/lucene/build/suggest/lucene-suggest-4.2-SNAPSHOT.jar:/usr/home/hudson/hudson-slave/workspace/Lucene-Solr-Tests-4.x-java7/lucene/build/grouping/lucene-grouping-4.2-SNAPSHOT.jar:/usr/home/hudson/hudson-slave/workspace/Lucene-Solr-Tests-4.x-java7/lucene/build/queries/lucene-queries-4.2-SNAPSHOT.jar:/usr/home/hudson/hudson-slave/workspace/Lucene-Solr-Tests-4.x-java7/lucene/build/queryparser/lucene-queryparser-4.2-SNAPSHOT.jar:/usr/home/hudson/hudson-slave/workspace/Lucene-Solr-Tests-4.x-java7/solr/core/lib/cglib-nodep-2.2.jar:/usr/home/hudson/hudson-slave/workspace/Lucene-Solr-Tests-4.x-java7/solr/core/lib/commons-cli-1.2.jar:/usr/home/hudson/hudson-slave/workspace/Lucene-Solr-Tests-4.x-java7/solr/core/lib/commons-codec-1.7.jar:/usr/home/hudson/hudson-slave/workspace/Lucene-Solr-Tests-4.x-java7/solr/core/lib/commons-fileupload-1.2.1.jar:/usr/home/hudson/hudson-slave/workspace/Lucene-Solr-Tests-4.x-java7/solr/core/lib/commons-lang-2.6.jar:/usr/home/hudson/hudson-slave/workspace/Lucene-Solr-Tests-4.x-java7/solr/core/lib/easymock-3.0.jar:/usr/home/hudson/hudson-slave/workspace/Lucene-Solr-Tests-4.x-java7/solr/core/lib/guava-13.0.1.jar:/usr/home/hudson/hudson-slave/workspace/Lucene-Solr-Tests-4.x-java7/solr/core/lib/javax.servlet-api-3.0.1.jar:/usr/home/hudson/hudson-slave/workspace/Lucene-Solr-Tests-4.x-java7/solr/core/lib/objenesis-1.2.jar:/usr/home/hudson/hudson-slave/workspace/Lucene-Solr-Tests-4.x-java7/solr/core/lib/spatial4j-0.3.jar:/usr/home/hudson/hudson-slave/workspace/Lucene-Solr-Tests-4.x-java7/solr/solrj/lib/commons-io-2.1.jar:/usr/home/hudson/hudson-slave/workspace/Lucene-Solr-Tests-4.x-java7/solr/solrj/lib/httpclient-4.1.3.jar:/usr/home/hudson/hudson-slave/workspace/Lucene-Solr-Tests-4.x-java7/solr/solrj/lib/httpcore-4.1.4.jar:/usr/home/hudson/hudson-slave/workspace/Lucene-Solr-Tests-4.x-java7/solr/solrj/lib/httpmime-4.1.3.jar:/usr/home/hudson/hudson-slave/workspace/Lucene-Solr-Tests-4.x-java7/solr/solrj/lib/jcl-over-slf4j-1.6.4.jar:/usr/home/hudson/hudson-slave/workspace/Lucene-Solr-Tests-4.x-java7/solr/solrj/lib/slf4j-api-1.6.4.jar:/usr/home/hudson/hudson-slave/workspace/Lucene-Solr-Tests-4.x-java7/solr/solrj/lib/slf4j-jdk14-1.6.4.jar:/usr/home/hudson/hudson-slave/workspace/Lucene-Solr-Tests-4.x-java7/solr/solrj/lib/wstx-asl-3.2.7.jar:/usr/home/hudson/hudson-slave/workspace/Lucene-Solr-Tests-4.x-java7/solr/solrj/lib/zookeeper-3.4.5.jar:/usr/home/hudson/hudson-slave/workspace/Lucene-Solr-Tests-4.x-java7/solr/example/lib/jetty-continuation-8.1.8.v20121106.jar:/usr/home/hudson/hudson-slave/workspace/Lucene-Solr-Tests-4.x-java7/solr/example/lib/jetty-deploy-8.1.8.v20121106.jar:/usr/home/hudson/hudson-slave/workspace/Lucene-Solr-Tests-4.x-java7/solr/example/lib/jetty-http-8.1.8.v20121106.jar:/usr/home/hudson/hudson-slave/workspace/Lucene-Solr-Tests-4.x-java7/solr/example/lib/jetty-io-8.1.8.v20121106.jar:/usr/home/hudson/hudson-slave/workspace/Lucene-Solr-Tests-4.x-java7/solr/example/lib/jetty-jmx-8.1.8.v20121106.jar:/usr/home/hudson/hudson-slave/workspace/Lucene-Solr-Tests-4.x-java7/solr/example/lib/jetty-security-8.1.8.v20121106.jar:/usr/home/hudson/hudson-slave/workspace/Lucene-Solr-Tests-4.x-java7/solr/example/lib/jetty-server-8.1.8.v20121106.jar:/usr/home/hudson/hudson-slave/workspace/Lucene-Solr-Tests-4.x-java7/solr/example/lib/jetty-servlet-8.1.8.v20121106.jar:/usr/home/hudson/hudson-slave/workspace/Lucene-Solr-Tests-4.x-java7/solr/example/lib/jetty-util-8.1.8.v20121106.jar:/usr/home/hudson/hudson-slave/workspace/Lucene-Solr-Tests-4.x-java7/solr/example/lib/jetty-webapp-8.1.8.v20121106.jar:/usr/home/hudson/hudson-slave/workspace/Lucene-Solr-Tests-4.x-java7/solr/example/lib/jetty-xml-8.1.8.v20121106.jar:/usr/home/hudson/hudson-slave/workspace/Lucene-Solr-Tests-4.x-java7/solr/example/lib/servlet-api-3.0.jar:/usr/home/hudson/hudson-slave/workspace/Lucene-Solr-Tests-4.x-java7/solr/example/example-DIH/solr/db/lib/derby-10.9.1.0.jar:/usr/home/hudson/hudson-slave/workspace/Lucene-Solr-Tests-4.x-java7/solr/example/example-DIH/solr/db/lib/hsqldb-1.8.0.10.jar:/usr/home/hudson/hudson-slave/workspace/Lucene-Solr-Tests-4.x-java7/lucene/build/core/classes/java:/usr/home/hudson/hudson-slave/workspace/Lucene-Solr-Tests-4.x-java7/lucene/test-framework/lib/junit-4.10.jar:/usr/home/hudson/hudson-slave/workspace/Lucene-Solr-Tests-4.x-java7/lucene/test-framework/lib/randomizedtesting-runner-2.0.8.jar:/home/hudson/hudson-slave/tools/hudson.tasks.Ant_AntInstallation/ant-1.8.2/lib/ant-launcher.jar:/home/hudson/.ant/lib/ivy-2.2.0.jar:/home/hudson/hudson-slave/tools/hudson.tasks.Ant_AntInstallation/ant-1.8.2/lib/ant-commons-logging.jar:/home/hudson/hudson-slave/tools/hudson.tasks.Ant_AntInstallation/ant-1.8.2/lib/ant-apache-regexp.jar:/home/hudson/hudson-slave/tools/hudson.tasks.Ant_AntInstallation/ant-1.8.2/lib/ant-apache-oro.jar:/home/hudson/hudson-slave/tools/hudson.tasks.Ant_AntInstallation/ant-1.8.2/lib/ant-swing.jar:/home/hudson/hudson-slave/tools/hudson.tasks.Ant_AntInstallation/ant-1.8.2/lib/ant-jdepend.jar:/home/hudson/hudson-slave/tools/hudson.tasks.Ant_AntInstallation/ant-1.8.2/lib/ant-apache-xalan2.jar:/home/hudson/hudson-slave/tools/hudson.tasks.Ant_AntInstallation/ant-1.8.2/lib/ant-apache-bsf.jar:/home/hudson/hudson-slave/tools/hudson.tasks.Ant_AntInstallation/ant-1.8.2/lib/ant-junit4.jar:/home/hudson/hudson-slave/tools/hudson.tasks.Ant_AntInstallation/ant-1.8.2/lib/ant-commons-net.jar:/home/hudson/hudson-slave/tools/hudson.tasks.Ant_AntInstallation/ant-1.8.2/lib/ant-antlr.jar:/home/hudson/hudson-slave/tools/hudson.tasks.Ant_AntInstallation/ant-1.8.2/lib/ant-junit.jar:/home/hudson/hudson-slave/tools/hudson.tasks.Ant_AntInstallation/ant-1.8.2/lib/ant-jmf.jar:/home/hudson/hudson-slave/tools/hudson.tasks.Ant_AntInstallation/ant-1.8.2/lib/ant-netrexx.jar:/home/hudson/hudson-slave/tools/hudson.tasks.Ant_AntInstallation/ant-1.8.2/lib/ant-apache-log4j.jar:/home/hudson/hudson-slave/tools/hudson.tasks.Ant_AntInstallation/ant-1.8.2/lib/ant-apache-resolver.jar:/home/hudson/hudson-slave/tools/hudson.tasks.Ant_AntInstallation/ant-1.8.2/lib/ant.jar:/home/hudson/hudson-slave/tools/hudson.tasks.Ant_AntInstallation/ant-1.8.2/lib/ant-jsch.jar:/home/hudson/hudson-slave/tools/hudson.tasks.Ant_AntInstallation/ant-1.8.2/lib/ant-testutil.jar:/home/hudson/hudson-slave/tools/hudson.tasks.Ant_AntInstallation/ant-1.8.2/lib/ant-apache-bcel.jar:/home/hudson/hudson-slave/tools/hudson.tasks.Ant_AntInstallation/ant-1.8.2/lib/ant-jai.jar:/home/hudson/hudson-slave/tools/hudson.tasks.Ant_AntInstallation/ant-1.8.2/lib/ant-javamail.jar:/usr/local/openjdk7/lib/tools.jar:/home/hudson/.ivy2/cache/com.carrotsearch.randomizedtesting/junit4-ant/jars/junit4-ant-2.0.8.jar
[junit4:junit4]   2> 79 T299 oaz.Environment.logEnv Server environment:java.library.path=/usr/local/openjdk7/jre/lib/amd64/server:/usr/local/openjdk7/jre/lib/amd64:/usr/local/openjdk7/jre/../lib/amd64:/usr/local/openjdk6/jre/lib/amd64/server:/usr/local/openjdk6/jre/lib/amd64:/usr/local/openjdk6/jre/../lib/amd64:/usr/java/packages/lib/amd64:/lib:/usr/lib:/usr/local/lib
[junit4:junit4]   2> 79 T299 oaz.Environment.logEnv Server environment:java.io.tmpdir=.
[junit4:junit4]   2> 79 T299 oaz.Environment.logEnv Server environment:java.compiler=<NA>
[junit4:junit4]   2> 79 T299 oaz.Environment.logEnv Server environment:os.name=FreeBSD
[junit4:junit4]   2> 79 T299 oaz.Environment.logEnv Server environment:os.arch=amd64
[junit4:junit4]   2> 79 T299 oaz.Environment.logEnv Server environment:os.version=9.0-RELEASE
[junit4:junit4]   2> 80 T299 oaz.Environment.logEnv Server environment:user.name=hudson
[junit4:junit4]   2> 80 T299 oaz.Environment.logEnv Server environment:user.home=/home/hudson
[junit4:junit4]   2> 80 T299 oaz.Environment.logEnv Server environment:user.dir=/usr/home/hudson/hudson-slave/workspace/Lucene-Solr-Tests-4.x-java7/solr/build/solr-core/test/J0
[junit4:junit4]   2> 113 T299 oazs.ZooKeeperServer.setTickTime tickTime set to 1000
[junit4:junit4]   2> 114 T299 oazs.ZooKeeperServer.setMinSessionTimeout minSessionTimeout set to -1
[junit4:junit4]   2> 114 T299 oazs.ZooKeeperServer.setMaxSessionTimeout maxSessionTimeout set to -1
[junit4:junit4]   2> 119 T299 oazs.NIOServerCnxnFactory.configure binding to port 0.0.0.0/0.0.0.0:0
[junit4:junit4]   2> 178 T299 oazsp.FileTxnSnapLog.save Snapshotting: 0x0 to /usr/home/hudson/hudson-slave/workspace/Lucene-Solr-Tests-4.x-java7/solr/build/solr-core/test/J0/./org.apache.solr.cloud.BasicDistributedZkTest-1358356410118/zookeeper/server1/data/version-2/snapshot.0
[junit4:junit4]   2> 217 T298 oasc.ZkTestServer.run start zk server on port:24952
[junit4:junit4]   2> 302 T298 oaz.Environment.logEnv Client environment:zookeeper.version=3.4.5-1392090, built on 09/30/2012 17:52 GMT
[junit4:junit4]   2> 303 T298 oaz.Environment.logEnv Client environment:host.name=lucene.zones.apache.org
[junit4:junit4]   2> 303 T298 oaz.Environment.logEnv Client environment:java.version=1.7.0_09
[junit4:junit4]   2> 304 T298 oaz.Environment.logEnv Client environment:java.vendor=Oracle Corporation
[junit4:junit4]   2> 304 T298 oaz.Environment.logEnv Client environment:java.home=/usr/local/openjdk7/jre
[junit4:junit4]   2> 304 T298 oaz.Environment.logEnv Client environment:java.class.path=/usr/home/hudson/hudson-slave/workspace/Lucene-Solr-Tests-4.x-java7/solr/build/solr-core/classes/test:/usr/home/hudson/hudson-slave/workspace/Lucene-Solr-Tests-4.x-java7/solr/build/solr-test-framework/classes/java:/usr/home/hudson/hudson-slave/workspace/Lucene-Solr-Tests-4.x-java7/solr/build/solr-core/test-files:/usr/home/hudson/hudson-slave/workspace/Lucene-Solr-Tests-4.x-java7/lucene/build/test-framework/classes/java:/usr/home/hudson/hudson-slave/workspace/Lucene-Solr-Tests-4.x-java7/lucene/build/codecs/classes/java:/usr/home/hudson/hudson-slave/workspace/Lucene-Solr-Tests-4.x-java7/solr/build/solr-solrj/classes/java:/usr/home/hudson/hudson-slave/workspace/Lucene-Solr-Tests-4.x-java7/solr/build/solr-core/classes/java:/usr/home/hudson/hudson-slave/workspace/Lucene-Solr-Tests-4.x-java7/lucene/build/analysis/common/lucene-analyzers-common-4.2-SNAPSHOT.jar:/usr/home/hudson/hudson-slave/workspace/Lucene-Solr-Tests-4.x-java7/lucene/build/analysis/kuromoji/lucene-analyzers-kuromoji-4.2-SNAPSHOT.jar:/usr/home/hudson/hudson-slave/workspace/Lucene-Solr-Tests-4.x-java7/lucene/build/analysis/phonetic/lucene-analyzers-phonetic-4.2-SNAPSHOT.jar:/usr/home/hudson/hudson-slave/workspace/Lucene-Solr-Tests-4.x-java7/lucene/build/highlighter/lucene-highlighter-4.2-SNAPSHOT.jar:/usr/home/hudson/hudson-slave/workspace/Lucene-Solr-Tests-4.x-java7/lucene/build/memory/lucene-memory-4.2-SNAPSHOT.jar:/usr/home/hudson/hudson-slave/workspace/Lucene-Solr-Tests-4.x-java7/lucene/build/misc/lucene-misc-4.2-SNAPSHOT.jar:/usr/home/hudson/hudson-slave/workspace/Lucene-Solr-Tests-4.x-java7/lucene/build/spatial/lucene-spatial-4.2-SNAPSHOT.jar:/usr/home/hudson/hudson-slave/workspace/Lucene-Solr-Tests-4.x-java7/lucene/build/suggest/lucene-suggest-4.2-SNAPSHOT.jar:/usr/home/hudson/hudson-slave/workspace/Lucene-Solr-Tests-4.x-java7/lucene/build/grouping/lucene-grouping-4.2-SNAPSHOT.jar:/usr/home/hudson/hudson-slave/workspace/Lucene-Solr-Tests-4.x-java7/lucene/build/queries/lucene-queries-4.2-SNAPSHOT.jar:/usr/home/hudson/hudson-slave/workspace/Lucene-Solr-Tests-4.x-java7/lucene/build/queryparser/lucene-queryparser-4.2-SNAPSHOT.jar:/usr/home/hudson/hudson-slave/workspace/Lucene-Solr-Tests-4.x-java7/solr/core/lib/cglib-nodep-2.2.jar:/usr/home/hudson/hudson-slave/workspace/Lucene-Solr-Tests-4.x-java7/solr/core/lib/commons-cli-1.2.jar:/usr/home/hudson/hudson-slave/workspace/Lucene-Solr-Tests-4.x-java7/solr/core/lib/commons-codec-1.7.jar:/usr/home/hudson/hudson-slave/workspace/Lucene-Solr-Tests-4.x-java7/solr/core/lib/commons-fileupload-1.2.1.jar:/usr/home/hudson/hudson-slave/workspace/Lucene-Solr-Tests-4.x-java7/solr/core/lib/commons-lang-2.6.jar:/usr/home/hudson/hudson-slave/workspace/Lucene-Solr-Tests-4.x-java7/solr/core/lib/easymock-3.0.jar:/usr/home/hudson/hudson-slave/workspace/Lucene-Solr-Tests-4.x-java7/solr/core/lib/guava-13.0.1.jar:/usr/home/hudson/hudson-slave/workspace/Lucene-Solr-Tests-4.x-java7/solr/core/lib/javax.servlet-api-3.0.1.jar:/usr/home/hudson/hudson-slave/workspace/Lucene-Solr-Tests-4.x-java7/solr/core/lib/objenesis-1.2.jar:/usr/home/hudson/hudson-slave/workspace/Lucene-Solr-Tests-4.x-java7/solr/core/lib/spatial4j-0.3.jar:/usr/home/hudson/hudson-slave/workspace/Lucene-Solr-Tests-4.x-java7/solr/solrj/lib/commons-io-2.1.jar:/usr/home/hudson/hudson-slave/workspace/Lucene-Solr-Tests-4.x-java7/solr/solrj/lib/httpclient-4.1.3.jar:/usr/home/hudson/hudson-slave/workspace/Lucene-Solr-Tests-4.x-java7/solr/solrj/lib/httpcore-4.1.4.jar:/usr/home/hudson/hudson-slave/workspace/Lucene-Solr-Tests-4.x-java7/solr/solrj/lib/httpmime-4.1.3.jar:/usr/home/hudson/hudson-slave/workspace/Lucene-Solr-Tests-4.x-java7/solr/solrj/lib/jcl-over-slf4j-1.6.4.jar:/usr/home/hudson/hudson-slave/workspace/Lucene-Solr-Tests-4.x-java7/solr/solrj/lib/slf4j-api-1.6.4.jar:/usr/home/hudson/hudson-slave/workspace/Lucene-Solr-Tests-4.x-java7/solr/solrj/lib/slf4j-jdk14-1.6.4.jar:/usr/home/hudson/hudson-slave/workspace/Lucene-Solr-Tests-4.x-java7/solr/solrj/lib/wstx-asl-3.2.7.jar:/usr/home/hudson/hudson-slave/workspace/Lucene-Solr-Tests-4.x-java7/solr/solrj/lib/zookeeper-3.4.5.jar:/usr/home/hudson/hudson-slave/workspace/Lucene-Solr-Tests-4.x-java7/solr/example/lib/jetty-continuation-8.1.8.v20121106.jar:/usr/home/hudson/hudson-slave/workspace/Lucene-Solr-Tests-4.x-java7/solr/example/lib/jetty-deploy-8.1.8.v20121106.jar:/usr/home/hudson/hudson-slave/workspace/Lucene-Solr-Tests-4.x-java7/solr/example/lib/jetty-http-8.1.8.v20121106.jar:/usr/home/hudson/hudson-slave/workspace/Lucene-Solr-Tests-4.x-java7/solr/example/lib/jetty-io-8.1.8.v20121106.jar:/usr/home/hudson/hudson-slave/workspace/Lucene-Solr-Tests-4.x-java7/solr/example/lib/jetty-jmx-8.1.8.v20121106.jar:/usr/home/hudson/hudson-slave/workspace/Lucene-Solr-Tests-4.x-java7/solr/example/lib/jetty-security-8.1.8.v20121106.jar:/usr/home/hudson/hudson-slave/workspace/Lucene-Solr-Tests-4.x-java7/solr/example/lib/jetty-server-8.1.8.v20121106.jar:/usr/home/hudson/hudson-slave/workspace/Lucene-Solr-Tests-4.x-java7/solr/example/lib/jetty-servlet-8.1.8.v20121106.jar:/usr/home/hudson/hudson-slave/workspace/Lucene-Solr-Tests-4.x-java7/solr/example/lib/jetty-util-8.1.8.v20121106.jar:/usr/home/hudson/hudson-slave/workspace/Lucene-Solr-Tests-4.x-java7/solr/example/lib/jetty-webapp-8.1.8.v20121106.jar:/usr/home/hudson/hudson-slave/workspace/Lucene-Solr-Tests-4.x-java7/solr/example/lib/jetty-xml-8.1.8.v20121106.jar:/usr/home/hudson/hudson-slave/workspace/Lucene-Solr-Tests-4.x-java7/solr/example/lib/servlet-api-3.0.jar:/usr/home/hudson/hudson-slave/workspace/Lucene-Solr-Tests-4.x-java7/solr/example/example-DIH/solr/db/lib/derby-10.9.1.0.jar:/usr/home/hudson/hudson-slave/workspace/Lucene-Solr-Tests-4.x-java7/solr/example/example-DIH/solr/db/lib/hsqldb-1.8.0.10.jar:/usr/home/hudson/hudson-slave/workspace/Lucene-Solr-Tests-4.x-java7/lucene/build/core/classes/java:/usr/home/hudson/hudson-slave/workspace/Lucene-Solr-Tests-4.x-java7/lucene/test-framework/lib/junit-4.10.jar:/usr/home/hudson/hudson-slave/workspace/Lucene-Solr-Tests-4.x-java7/lucene/test-framework/lib/randomizedtesting-runner-2.0.8.jar:/home/hudson/hudson-slave/tools/hudson.tasks.Ant_AntInstallation/ant-1.8.2/lib/ant-launcher.jar:/home/hudson/.ant/lib/ivy-2.2.0.jar:/home/hudson/hudson-slave/tools/hudson.tasks.Ant_AntInstallation/ant-1.8.2/lib/ant-commons-logging.jar:/home/hudson/hudson-slave/tools/hudson.tasks.Ant_AntInstallation/ant-1.8.2/lib/ant-apache-regexp.jar:/home/hudson/hudson-slave/tools/hudson.tasks.Ant_AntInstallation/ant-1.8.2/lib/ant-apache-oro.jar:/home/hudson/hudson-slave/tools/hudson.tasks.Ant_AntInstallation/ant-1.8.2/lib/ant-swing.jar:/home/hudson/hudson-slave/tools/hudson.tasks.Ant_AntInstallation/ant-1.8.2/lib/ant-jdepend.jar:/home/hudson/hudson-slave/tools/hudson.tasks.Ant_AntInstallation/ant-1.8.2/lib/ant-apache-xalan2.jar:/home/hudson/hudson-slave/tools/hudson.tasks.Ant_AntInstallation/ant-1.8.2/lib/ant-apache-bsf.jar:/home/hudson/hudson-slave/tools/hudson.tasks.Ant_AntInstallation/ant-1.8.2/lib/ant-junit4.jar:/home/hudson/hudson-slave/tools/hudson.tasks.Ant_AntInstallation/ant-1.8.2/lib/ant-commons-net.jar:/home/hudson/hudson-slave/tools/hudson.tasks.Ant_AntInstallation/ant-1.8.2/lib/ant-antlr.jar:/home/hudson/hudson-slave/tools/hudson.tasks.Ant_AntInstallation/ant-1.8.2/lib/ant-junit.jar:/home/hudson/hudson-slave/tools/hudson.tasks.Ant_AntInstallation/ant-1.8.2/lib/ant-jmf.jar:/home/hudson/hudson-slave/tools/hudson.tasks.Ant_AntInstallation/ant-1.8.2/lib/ant-netrexx.jar:/home/hudson/hudson-slave/tools/hudson.tasks.Ant_AntInstallation/ant-1.8.2/lib/ant-apache-log4j.jar:/home/hudson/hudson-slave/tools/hudson.tasks.Ant_AntInstallation/ant-1.8.2/lib/ant-apache-resolver.jar:/home/hudson/hudson-slave/tools/hudson.tasks.Ant_AntInstallation/ant-1.8.2/lib/ant.jar:/home/hudson/hudson-slave/tools/hudson.tasks.Ant_AntInstallation/ant-1.8.2/lib/ant-jsch.jar:/home/hudson/hudson-slave/tools/hudson.tasks.Ant_AntInstallation/ant-1.8.2/lib/ant-testutil.jar:/home/hudson/hudson-slave/tools/hudson.tasks.Ant_AntInstallation/ant-1.8.2/lib/ant-apache-bcel.jar:/home/hudson/hudson-slave/tools/hudson.tasks.Ant_AntInstallation/ant-1.8.2/lib/ant-jai.jar:/home/hudson/hudson-slave/tools/hudson.tasks.Ant_AntInstallation/ant-1.8.2/lib/ant-javamail.jar:/usr/local/openjdk7/lib/tools.jar:/home/hudson/.ivy2/cache/com.carrotsearch.randomizedtesting/junit4-ant/jars/junit4-ant-2.0.8.jar
[junit4:junit4]   2> 305 T298 oaz.Environment.logEnv Client environment:java.library.path=/usr/local/openjdk7/jre/lib/amd64/server:/usr/local/openjdk7/jre/lib/amd64:/usr/local/openjdk7/jre/../lib/amd64:/usr/local/openjdk6/jre/lib/amd64/server:/usr/local/openjdk6/jre/lib/amd64:/usr/local/openjdk6/jre/../lib/amd64:/usr/java/packages/lib/amd64:/lib:/usr/lib:/usr/local/lib
[junit4:junit4]   2> 306 T298 oaz.Environment.logEnv Client environment:java.io.tmpdir=.
[junit4:junit4]   2> 306 T298 oaz.Environment.logEnv Client environment:java.compiler=<NA>
[junit4:junit4]   2> 306 T298 oaz.Environment.logEnv Client environment:os.name=FreeBSD
[junit4:junit4]   2> 307 T298 oaz.Environment.logEnv Client environment:os.arch=amd64
[junit4:junit4]   2> 307 T298 oaz.Environment.logEnv Client environment:os.version=9.0-RELEASE
[junit4:junit4]   2> 307 T298 oaz.Environment.logEnv Client environment:user.name=hudson
[junit4:junit4]   2> 308 T298 oaz.Environment.logEnv Client environment:user.home=/home/hudson
[junit4:junit4]   2> 308 T298 oaz.Environment.logEnv Client environment:user.dir=/usr/home/hudson/hudson-slave/workspace/Lucene-Solr-Tests-4.x-java7/solr/build/solr-core/test/J0
[junit4:junit4]   2> 313 T298 oaz.ZooKeeper.<init> Initiating client connection, connectString=127.0.0.1:24952 sessionTimeout=10000 watcher=org.apache.solr.common.cloud.ConnectionManager@78713b2
[junit4:junit4]   2> 393 T298 oascc.ConnectionManager.waitForConnected Waiting for client to connect to ZooKeeper
[junit4:junit4]   2> 401 T304 oaz.ClientCnxn$SendThread.logStartConnect Opening socket connection to server localhost/127.0.0.1:24952. Will not attempt to authenticate using SASL (access denied ("javax.security.auth.AuthPermission" "getLoginConfiguration"))
[junit4:junit4]   2> 403 T304 oaz.ClientCnxn$SendThread.primeConnection Socket connection established to localhost/127.0.0.1:24952, initiating session
[junit4:junit4]   2> 404 T300 oazs.NIOServerCnxnFactory.run Accepted socket connection from /140.211.11.196:24953
[junit4:junit4]   2> 426 T300 oazs.ZooKeeperServer.processConnectRequest Client attempting to establish new session at /140.211.11.196:24953
[junit4:junit4]   2> 439 T302 oazsp.FileTxnLog.append Creating new log file: log.1
[junit4:junit4]   2> 492 T302 oazs.ZooKeeperServer.finishSessionInit Established session 0x13c4459efcb0000 with negotiated timeout 10000 for client /140.211.11.196:24953
[junit4:junit4]   2> 492 T304 oaz.ClientCnxn$SendThread.onConnected Session establishment complete on server localhost/127.0.0.1:24952, sessionid = 0x13c4459efcb0000, negotiated timeout = 10000
[junit4:junit4]   2> 498 T305 oascc.ConnectionManager.process Watcher org.apache.solr.common.cloud.ConnectionManager@78713b2 name:ZooKeeperConnection Watcher:127.0.0.1:24952 got event WatchedEvent state:SyncConnected type:None path:null path:null type:None
[junit4:junit4]   2> 498 T298 oascc.ConnectionManager.waitForConnected Client is connected to ZooKeeper
[junit4:junit4]   2> 504 T298 oascc.SolrZkClient.makePath makePath: /solr
[junit4:junit4]   2> 605 T303 oazs.PrepRequestProcessor.pRequest2Txn Processed session termination for sessionid: 0x13c4459efcb0000
[junit4:junit4]   2> 607 T305 oaz.ClientCnxn$EventThread.run EventThread shut down
[junit4:junit4]   2> 607 T298 oaz.ZooKeeper.close Session: 0x13c4459efcb0000 closed
[junit4:junit4]   2> 608 T300 oazs.NIOServerCnxn.closeSock Closed socket connection for client /140.211.11.196:24953 which had sessionid 0x13c4459efcb0000
[junit4:junit4]   2> 608 T298 oaz.ZooKeeper.<init> Initiating client connection, connectString=127.0.0.1:24952/solr sessionTimeout=10000 watcher=org.apache.solr.common.cloud.ConnectionManager@19aa514
[junit4:junit4]   2> 609 T298 oascc.ConnectionManager.waitForConnected Waiting for client to connect to ZooKeeper
[junit4:junit4]   2> 609 T306 oaz.ClientCnxn$SendThread.logStartConnect Opening socket connection to server localhost/127.0.0.1:24952. Will not attempt to authenticate using SASL (access denied ("javax.security.auth.AuthPermission" "getLoginConfiguration"))
[junit4:junit4]   2> 610 T306 oaz.ClientCnxn$SendThread.primeConnection Socket connection established to localhost/127.0.0.1:24952, initiating session
[junit4:junit4]   2> 610 T300 oazs.NIOServerCnxnFactory.run Accepted socket connection from /140.211.11.196:24954
[junit4:junit4]   2> 610 T300 oazs.ZooKeeperServer.processConnectRequest Client attempting to establish new session at /140.211.11.196:24954
[junit4:junit4]   2> 634 T302 oazs.ZooKeeperServer.finishSessionInit Established session 0x13c4459efcb0001 with negotiated timeout 10000 for client /140.211.11.196:24954
[junit4:junit4]   2> 634 T306 oaz.ClientCnxn$SendThread.onConnected Session establishment complete on server localhost/127.0.0.1:24952, sessionid = 0x13c4459efcb0001, negotiated timeout = 10000
[junit4:junit4]   2> 635 T307 oascc.ConnectionManager.process Watcher org.apache.solr.common.cloud.ConnectionManager@19aa514 name:ZooKeeperConnection Watcher:127.0.0.1:24952/solr got event WatchedEvent state:SyncConnected type:None path:null path:null type:None
[junit4:junit4]   2> 635 T298 oascc.ConnectionManager.waitForConnected Client is connected to ZooKeeper
[junit4:junit4]   2> 642 T298 oascc.SolrZkClient.makePath makePath: /collections/collection1
[junit4:junit4]   2> 650 T298 oascc.SolrZkClient.makePath makePath: /collections/collection1/shards
[junit4:junit4]   2> 699 T298 oascc.SolrZkClient.makePath makePath: /collections/control_collection
[junit4:junit4]   2> 702 T298 oascc.SolrZkClient.makePath makePath: /collections/control_collection/shards
[junit4:junit4]   2> 731 T298 oasc.AbstractZkTestCase.putConfig put /usr/home/hudson/hudson-slave/workspace/Lucene-Solr-Tests-4.x-java7/solr/build/solr-core/test-files/solr/collection1/conf/solrconfig.xml to /configs/conf1/solrconfig.xml
[junit4:junit4]   2> 763 T298 oascc.SolrZkClient.makePath makePath: /configs/conf1/solrconfig.xml
[junit4:junit4]   2> 814 T298 oasc.AbstractZkTestCase.putConfig put /usr/home/hudson/hudson-slave/workspace/Lucene-Solr-Tests-4.x-java7/solr/build/solr-core/test-files/solr/collection1/conf/schema.xml to /configs/conf1/schema.xml
[junit4:junit4]   2> 815 T298 oascc.SolrZkClient.makePath makePath: /configs/conf1/schema.xml
[junit4:junit4]   2> 925 T298 oasc.AbstractZkTestCase.putConfig put /usr/home/hudson/hudson-slave/workspace/Lucene-Solr-Tests-4.x-java7/solr/build/solr-core/test-files/solr/collection1/conf/stopwords.txt to /configs/conf1/stopwords.txt
[junit4:junit4]   2> 926 T298 oascc.SolrZkClient.makePath makePath: /configs/conf1/stopwords.txt
[junit4:junit4]   2> 932 T298 oasc.AbstractZkTestCase.putConfig put /usr/home/hudson/hudson-slave/workspace/Lucene-Solr-Tests-4.x-java7/solr/build/solr-core/test-files/solr/collection1/conf/protwords.txt to /configs/conf1/protwords.txt
[junit4:junit4]   2> 933 T298 oascc.SolrZkClient.makePath makePath: /configs/conf1/protwords.txt
[junit4:junit4]   2> 938 T298 oasc.AbstractZkTestCase.putConfig put /usr/home/hudson/hudson-slave/workspace/Lucene-Solr-Tests-4.x-java7/solr/build/solr-core/test-files/solr/collection1/conf/currency.xml to /configs/conf1/currency.xml
[junit4:junit4]   2> 939 T298 oascc.SolrZkClient.makePath makePath: /configs/conf1/currency.xml
[junit4:junit4]   2> 944 T298 oasc.AbstractZkTestCase.putConfig put /usr/home/hudson/hudson-slave/workspace/Lucene-Solr-Tests-4.x-java7/solr/build/solr-core/test-files/solr/collection1/conf/open-exchange-rates.json to /configs/conf1/open-exchange-rates.json
[junit4:junit4]   2> 945 T298 oascc.SolrZkClient.makePath makePath: /configs/conf1/open-exchange-rates.json
[junit4:junit4]   2> 950 T298 oasc.AbstractZkTestCase.putConfig put /usr/home/hudson/hudson-slave/workspace/Lucene-Solr-Tests-4.x-java7/solr/build/solr-core/test-files/solr/collection1/conf/mapping-ISOLatin1Accent.txt to /configs/conf1/mapping-ISOLatin1Accent.txt
[junit4:junit4]   2> 952 T298 oascc.SolrZkClient.makePath makePath: /configs/conf1/mapping-ISOLatin1Accent.txt
[junit4:junit4]   2> 957 T298 oasc.AbstractZkTestCase.putConfig put /usr/home/hudson/hudson-slave/workspace/Lucene-Solr-Tests-4.x-java7/solr/build/solr-core/test-files/solr/collection1/conf/old_synonyms.txt to /configs/conf1/old_synonyms.txt
[junit4:junit4]   2> 958 T298 oascc.SolrZkClient.makePath makePath: /configs/conf1/old_synonyms.txt
[junit4:junit4]   2> 963 T298 oasc.AbstractZkTestCase.putConfig put /usr/home/hudson/hudson-slave/workspace/Lucene-Solr-Tests-4.x-java7/solr/build/solr-core/test-files/solr/collection1/conf/synonyms.txt to /configs/conf1/synonyms.txt
[junit4:junit4]   2> 964 T298 oascc.SolrZkClient.makePath makePath: /configs/conf1/synonyms.txt
[junit4:junit4]   2> 969 T303 oazs.PrepRequestProcessor.pRequest2Txn Processed session termination for sessionid: 0x13c4459efcb0001
[junit4:junit4]   2> 971 T307 oaz.ClientCnxn$EventThread.run EventThread shut down
[junit4:junit4]   2> 971 T300 oazs.NIOServerCnxn.closeSock Closed socket connection for client /140.211.11.196:24954 which had sessionid 0x13c4459efcb0001
[junit4:junit4]   2> 971 T298 oaz.ZooKeeper.close Session: 0x13c4459efcb0001 closed
[junit4:junit4]   2> 1097 T298 oejs.Server.doStart jetty-8.1.8.v20121106
[junit4:junit4]   2> 1100 T298 oejs.AbstractConnector.doStart Started SocketConnector@127.0.0.1:24955
[junit4:junit4]   2> 1100 T298 oass.SolrDispatchFilter.init SolrDispatchFilter.init()
[junit4:junit4]   2> 1101 T298 oasc.SolrResourceLoader.locateSolrHome JNDI not configured for solr (NoInitialContextEx)
[junit4:junit4]   2> 1101 T298 oasc.SolrResourceLoader.locateSolrHome using system property solr.solr.home: /usr/home/hudson/hudson-slave/workspace/Lucene-Solr-Tests-4.x-java7/solr/build/solr-core/test/J0/./org.apache.solr.cloud.BasicDistributedZkTest-controljetty-1358356411085
[junit4:junit4]   2> 1101 T298 oasc.CoreContainer$Initializer.initialize looking for solr.xml: /usr/home/hudson/hudson-slave/workspace/Lucene-Solr-Tests-4.x-java7/solr/build/solr-core/test/J0/./org.apache.solr.cloud.BasicDistributedZkTest-controljetty-1358356411085/solr.xml
[junit4:junit4]   2> 1102 T298 oasc.CoreContainer.<init> New CoreContainer 2127151041
[junit4:junit4]   2> 1102 T298 oasc.CoreContainer.load Loading CoreContainer using Solr Home: '/usr/home/hudson/hudson-slave/workspace/Lucene-Solr-Tests-4.x-java7/solr/build/solr-core/test/J0/./org.apache.solr.cloud.BasicDistributedZkTest-controljetty-1358356411085/'
[junit4:junit4]   2> 1103 T298 oasc.SolrResourceLoader.<init> new SolrResourceLoader for directory: '/usr/home/hudson/hudson-slave/workspace/Lucene-Solr-Tests-4.x-java7/solr/build/solr-core/test/J0/./org.apache.solr.cloud.BasicDistributedZkTest-controljetty-1358356411085/'
[junit4:junit4]   2> 1140 T298 oashc.HttpShardHandlerFactory.getParameter Setting socketTimeout to: 60000
[junit4:junit4]   2> 1140 T298 oashc.HttpShardHandlerFactory.getParameter Setting urlScheme to: http://
[junit4:junit4]   2> 1141 T298 oashc.HttpShardHandlerFactory.getParameter Setting connTimeout to: 15000
[junit4:junit4]   2> 1141 T298 oashc.HttpShardHandlerFactory.getParameter Setting maxConnectionsPerHost to: 20
[junit4:junit4]   2> 1141 T298 oashc.HttpShardHandlerFactory.getParameter Setting corePoolSize to: 0
[junit4:junit4]   2> 1142 T298 oashc.HttpShardHandlerFactory.getParameter Setting maximumPoolSize to: 2147483647
[junit4:junit4]   2> 1142 T298 oashc.HttpShardHandlerFactory.getParameter Setting maxThreadIdleTime to: 5
[junit4:junit4]   2> 1142 T298 oashc.HttpShardHandlerFactory.getParameter Setting sizeOfQueue to: -1
[junit4:junit4]   2> 1143 T298 oashc.HttpShardHandlerFactory.getParameter Setting fairnessPolicy to: false
[junit4:junit4]   2> 1143 T298 oascsi.HttpClientUtil.createClient Creating new http client, config:maxConnectionsPerHost=20&maxConnections=10000&socketTimeout=60000&connTimeout=15000&retry=false
[junit4:junit4]   2> 1159 T298 oasc.CoreContainer.load Registering Log Listener
[junit4:junit4]   2> 1174 T298 oasc.CoreContainer.initZooKeeper Zookeeper client=127.0.0.1:24952/solr
[junit4:junit4]   2> 1190 T298 oasc.ZkController.checkChrootPath zkHost includes chroot
[junit4:junit4]   2> 1190 T298 oaz.ZooKeeper.<init> Initiating client connection, connectString=127.0.0.1:24952 sessionTimeout=60000 watcher=org.apache.solr.common.cloud.ConnectionManager@4c3bbd4e
[junit4:junit4]   2> 1191 T298 oascc.ConnectionManager.waitForConnected Waiting for client to connect to ZooKeeper
[junit4:junit4]   2> 1192 T317 oaz.ClientCnxn$SendThread.logStartConnect Opening socket connection to server localhost/127.0.0.1:24952. Will not attempt to authenticate using SASL (access denied ("javax.security.auth.AuthPermission" "getLoginConfiguration"))
[junit4:junit4]   2> 1193 T317 oaz.ClientCnxn$SendThread.primeConnection Socket connection established to localhost/127.0.0.1:24952, initiating session
[junit4:junit4]   2> 1193 T300 oazs.NIOServerCnxnFactory.run Accepted socket connection from /140.211.11.196:24956
[junit4:junit4]   2> 1194 T300 oazs.ZooKeeperServer.processConnectRequest Client attempting to establish new session at /140.211.11.196:24956
[junit4:junit4]   2> 1196 T302 oazs.ZooKeeperServer.finishSessionInit Established session 0x13c4459efcb0002 with negotiated timeout 20000 for client /140.211.11.196:24956
[junit4:junit4]   2> 1196 T317 oaz.ClientCnxn$SendThread.onConnected Session establishment complete on server localhost/127.0.0.1:24952, sessionid = 0x13c4459efcb0002, negotiated timeout = 20000
[junit4:junit4]   2> 1196 T318 oascc.ConnectionManager.process Watcher org.apache.solr.common.cloud.ConnectionManager@4c3bbd4e name:ZooKeeperConnection Watcher:127.0.0.1:24952 got event WatchedEvent state:SyncConnected type:None path:null path:null type:None
[junit4:junit4]   2> 1196 T298 oascc.ConnectionManager.waitForConnected Client is connected to ZooKeeper
[junit4:junit4]   2> 1199 T303 oazs.PrepRequestProcessor.pRequest2Txn Processed session termination for sessionid: 0x13c4459efcb0002
[junit4:junit4]   2> 1200 T318 oaz.ClientCnxn$EventThread.run EventThread shut down
[junit4:junit4]   2> 1200 T300 oazs.NIOServerCnxn.closeSock Closed socket connection for client /140.211.11.196:24956 which had sessionid 0x13c4459efcb0002
[junit4:junit4]   2> 1200 T298 oaz.ZooKeeper.close Session: 0x13c4459efcb0002 closed
[junit4:junit4]   2> 1201 T298 oascsi.HttpClientUtil.createClient Creating new http client, config:maxConnections=500&maxConnectionsPerHost=16&socketTimeout=60000&connTimeout=15000
[junit4:junit4]   2> 1213 T298 oaz.ZooKeeper.<init> Initiating client connection, connectString=127.0.0.1:24952/solr sessionTimeout=30000 watcher=org.apache.solr.common.cloud.ConnectionManager@2f1d55f
[junit4:junit4]   2> 1214 T298 oascc.ConnectionManager.waitForConnected Waiting for client to connect to ZooKeeper
[junit4:junit4]   2> 1214 T319 oaz.ClientCnxn$SendThread.logStartConnect Opening socket connection to server localhost/127.0.0.1:24952. Will not attempt to authenticate using SASL (access denied ("javax.security.auth.AuthPermission" "getLoginConfiguration"))
[junit4:junit4]   2> 1215 T319 oaz.ClientCnxn$SendThread.primeConnection Socket connection established to localhost/127.0.0.1:24952, initiating session
[junit4:junit4]   2> 1215 T300 oazs.NIOServerCnxnFactory.run Accepted socket connection from /140.211.11.196:24957
[junit4:junit4]   2> 1216 T300 oazs.ZooKeeperServer.processConnectRequest Client attempting to establish new session at /140.211.11.196:24957
[junit4:junit4]   2> 1217 T302 oazs.ZooKeeperServer.finishSessionInit Established session 0x13c4459efcb0003 with negotiated timeout 20000 for client /140.211.11.196:24957
[junit4:junit4]   2> 1217 T319 oaz.ClientCnxn$SendThread.onConnected Session establishment complete on server localhost/127.0.0.1:24952, sessionid = 0x13c4459efcb0003, negotiated timeout = 20000
[junit4:junit4]   2> 1218 T320 oascc.ConnectionManager.process Watcher org.apache.solr.common.cloud.ConnectionManager@2f1d55f name:ZooKeeperConnection Watcher:127.0.0.1:24952/solr got event WatchedEvent state:SyncConnected type:None path:null path:null type:None
[junit4:junit4]   2> 1218 T298 oascc.ConnectionManager.waitForConnected Client is connected to ZooKeeper
[junit4:junit4]   2> 1233 T303 oazs.PrepRequestProcessor.pRequest Got user-level KeeperException when processing sessionid:0x13c4459efcb0003 type:create cxid:0x2 zxid:0x1a txntype:-1 reqpath:n/a Error Path:/solr/overseer Error:KeeperErrorCode = NodeExists for /solr/overseer
[junit4:junit4]   2> 1241 T298 oascc.SolrZkClient.makePath makePath: /live_nodes
[junit4:junit4]   2> 1245 T298 oasc.ZkController.createEphemeralLiveNode Register node as live in ZooKeeper:/live_nodes/127.0.0.1:24955_
[junit4:junit4]   2> 1250 T303 oazs.PrepRequestProcessor.pRequest Got user-level KeeperException when processing sessionid:0x13c4459efcb0003 type:delete cxid:0x7 zxid:0x1c txntype:-1 reqpath:n/a Error Path:/solr/live_nodes/127.0.0.1:24955_ Error:KeeperErrorCode = NoNode for /solr/live_nodes/127.0.0.1:24955_
[junit4:junit4]   2> 1251 T298 oascc.SolrZkClient.makePath makePath: /live_nodes/127.0.0.1:24955_
[junit4:junit4]   2> 1257 T298 oascc.SolrZkClient.makePath makePath: /overseer_elect/election
[junit4:junit4]   2> 1282 T303 oazs.PrepRequestProcessor.pRequest Got user-level KeeperException when processing sessionid:0x13c4459efcb0003 type:delete cxid:0x15 zxid:0x21 txntype:-1 reqpath:n/a Error Path:/solr/overseer_elect/leader Error:KeeperErrorCode = NoNode for /solr/overseer_elect/leader
[junit4:junit4]   2> 1283 T298 oascc.SolrZkClient.makePath makePath: /overseer_elect/leader
[junit4:junit4]   2> 1287 T298 oasc.Overseer.start Overseer (id=89021245706403843-127.0.0.1:24955_-n_0000000000) starting
[junit4:junit4]   2> 1288 T303 oazs.PrepRequestProcessor.pRequest Got user-level KeeperException when processing sessionid:0x13c4459efcb0003 type:create cxid:0x1a zxid:0x23 txntype:-1 reqpath:n/a Error Path:/solr/overseer Error:KeeperErrorCode = NodeExists for /solr/overseer
[junit4:junit4]   2> 1305 T303 oazs.PrepRequestProcessor.pRequest Got user-level KeeperException when processing sessionid:0x13c4459efcb0003 type:create cxid:0x1b zxid:0x24 txntype:-1 reqpath:n/a Error Path:/solr/overseer Error:KeeperErrorCode = NodeExists for /solr/overseer
[junit4:junit4]   2> 1307 T303 oazs.PrepRequestProcessor.pRequest Got user-level KeeperException when processing sessionid:0x13c4459efcb0003 type:create cxid:0x1c zxid:0x25 txntype:-1 reqpath:n/a Error Path:/solr/overseer Error:KeeperErrorCode = NodeExists for /solr/overseer
[junit4:junit4]   2> 1312 T303 oazs.PrepRequestProcessor.pRequest Got user-level KeeperException when processing sessionid:0x13c4459efcb0003 type:create cxid:0x1d zxid:0x26 txntype:-1 reqpath:n/a Error Path:/solr/overseer Error:KeeperErrorCode = NodeExists for /solr/overseer
[junit4:junit4]   2> 1314 T322 oasc.OverseerCollectionProcessor.run Process current queue of collection messages
[junit4:junit4]   2> 1314 T298 oascc.SolrZkClient.makePath makePath: /clusterstate.json
[junit4:junit4]   2> 1319 T298 oascc.ZkStateReader.createClusterStateWatchersAndUpdate Updating cluster state from ZooKeeper... 
[junit4:junit4]   2> 1336 T321 oasc.Overseer$ClusterStateUpdater.run Starting to work on the main queue
[junit4:junit4]   2> 1346 T323 oasc.CoreContainer.create Creating SolrCore 'collection1' using instanceDir: /usr/home/hudson/hudson-slave/workspace/Lucene-Solr-Tests-4.x-java7/solr/build/solr-core/test/J0/./org.apache.solr.cloud.BasicDistributedZkTest-controljetty-1358356411085/collection1
[junit4:junit4]   2> 1347 T323 oasc.ZkController.createCollectionZkNode Check for collection zkNode:control_collection
[junit4:junit4]   2> 1348 T323 oasc.ZkController.createCollectionZkNode Collection zkNode exists
[junit4:junit4]   2> 1348 T323 oasc.ZkController.readConfigName Load collection config from:/collections/control_collection
[junit4:junit4]   2> 1351 T323 oasc.SolrResourceLoader.<init> new SolrResourceLoader for directory: '/usr/home/hudson/hudson-slave/workspace/Lucene-Solr-Tests-4.x-java7/solr/build/solr-core/test/J0/./org.apache.solr.cloud.BasicDistributedZkTest-controljetty-1358356411085/collection1/'
[junit4:junit4]   2> 1352 T323 oasc.SolrResourceLoader.replaceClassLoader Adding 'file:/usr/home/hudson/hudson-slave/workspace/Lucene-Solr-Tests-4.x-java7/solr/build/solr-core/test/J0/org.apache.solr.cloud.BasicDistributedZkTest-controljetty-1358356411085/collection1/lib/classes/' to classloader
[junit4:junit4]   2> 1353 T323 oasc.SolrResourceLoader.replaceClassLoader Adding 'file:/usr/home/hudson/hudson-slave/workspace/Lucene-Solr-Tests-4.x-java7/solr/build/solr-core/test/J0/org.apache.solr.cloud.BasicDistributedZkTest-controljetty-1358356411085/collection1/lib/README' to classloader
[junit4:junit4]   2> 1415 T3 oasu.ConcurrentLRUCache.finalize SEVERE ConcurrentLRUCache was not destroyed prior to finalize(), indicates a bug -- POSSIBLE RESOURCE LEAK!!!
[junit4:junit4]   2> 1450 T323 oasc.SolrConfig.<init> Using Lucene MatchVersion: LUCENE_42
[junit4:junit4]   2> 1529 T323 oasc.SolrConfig.<init> Loaded SolrConfig: solrconfig.xml
[junit4:junit4]   2> 1630 T323 oass.IndexSchema.readSchema Reading Solr Schema
[junit4:junit4]   2> 1639 T323 oass.IndexSchema.readSchema Schema name=test
[junit4:junit4]   2> 2160 T323 oass.OpenExchangeRatesOrgProvider.init Initialized with rates=open-exchange-rates.json, refreshInterval=1440.
[junit4:junit4]   2> 2170 T323 oass.IndexSchema.readSchema default search field in schema is text
[junit4:junit4]   2> 2173 T323 oass.IndexSchema.readSchema unique key field: id
[junit4:junit4]   2> 2200 T323 oass.FileExchangeRateProvider.reload Reloading exchange rates from file currency.xml
[junit4:junit4]   2> 2207 T323 oass.FileExchangeRateProvider.reload Reloading exchange rates from file currency.xml
[junit4:junit4]   2> 2212 T323 oass.OpenExchangeRatesOrgProvider.reload Reloading exchange rates from open-exchange-rates.json
[junit4:junit4]   2> 2214 T323 oass.OpenExchangeRatesOrgProvider.reload Reloading exchange rates from open-exchange-rates.json
[junit4:junit4]   2> 2216 T323 oasc.SolrCore.<init> [collection1] Opening new SolrCore at /usr/home/hudson/hudson-slave/workspace/Lucene-Solr-Tests-4.x-java7/solr/build/solr-core/test/J0/./org.apache.solr.cloud.BasicDistributedZkTest-controljetty-1358356411085/collection1/, dataDir=./org.apache.solr.cloud.BasicDistributedZkTest-1358356410118/control/data/
[junit4:junit4]   2> 2217 T323 oasc.JmxMonitoredMap.<init> JMX monitoring is enabled. Adding Solr mbeans to JMX Server: com.sun.jmx.mbeanserver.JmxMBeanServer@6cd44892
[junit4:junit4]   2> 2217 T323 oasc.SolrCore.initDirectoryFactory solr.NRTCachingDirectoryFactory
[junit4:junit4]   2> 2243 T323 oasc.CachingDirectoryFactory.get return new directory for /usr/home/hudson/hudson-slave/workspace/Lucene-Solr-Tests-4.x-java7/solr/build/solr-core/test/J0/./org.apache.solr.cloud.BasicDistributedZkTest-1358356410118/control/data forceNew:false
[junit4:junit4]   2> 2243 T323 oasc.CachingDirectoryFactory.close Releasing directory:/usr/home/hudson/hudson-slave/workspace/Lucene-Solr-Tests-4.x-java7/solr/build/solr-core/test/J0/./org.apache.solr.cloud.BasicDistributedZkTest-1358356410118/control/data
[junit4:junit4]   2> 2244 T323 oasc.SolrCore.getNewIndexDir New index directory detected: old=null new=./org.apache.solr.cloud.BasicDistributedZkTest-1358356410118/control/data/index/
[junit4:junit4]   2> 2244 T323 oasc.SolrCore.initIndex WARNING [collection1] Solr index directory './org.apache.solr.cloud.BasicDistributedZkTest-1358356410118/control/data/index' doesn't exist. Creating new index...
[junit4:junit4]   2> 2245 T323 oasc.CachingDirectoryFactory.get return new directory for /usr/home/hudson/hudson-slave/workspace/Lucene-Solr-Tests-4.x-java7/solr/build/solr-core/test/J0/./org.apache.solr.cloud.BasicDistributedZkTest-1358356410118/control/data/index forceNew:false
[junit4:junit4]   2> 2255 T323 oasc.SolrDeletionPolicy.onCommit SolrDeletionPolicy.onCommit: commits:num=1
[junit4:junit4]   2> 		commit{dir=RateLimitedDirectoryWrapper(NRTCachingDirectory(org.apache.lucene.store.NIOFSDirectory@/usr/home/hudson/hudson-slave/workspace/Lucene-Solr-Tests-4.x-java7/solr/build/solr-core/test/J0/org.apache.solr.cloud.BasicDistributedZkTest-1358356410118/control/data/index lockFactory=org.apache.lucene.store.NativeFSLockFactory@4428ee2d; maxCacheMB=48.0 maxMergeSizeMB=4.0)),segFN=segments_1,generation=1,filenames=[segments_1]
[junit4:junit4]   2> 2255 T323 oasc.SolrDeletionPolicy.updateCommits newest commit = 1[segments_1]
[junit4:junit4]   2> 2256 T323 oasc.CachingDirectoryFactory.close Releasing directory:/usr/home/hudson/hudson-slave/workspace/Lucene-Solr-Tests-4.x-java7/solr/build/solr-core/test/J0/./org.apache.solr.cloud.BasicDistributedZkTest-1358356410118/control/data/index
[junit4:junit4]   2> 2256 T323 oasc.SolrCore.initWriters created xml: solr.XMLResponseWriter
[junit4:junit4]   2> 2258 T323 oasup.UpdateRequestProcessorChain.init inserting DistributedUpdateProcessorFactory into updateRequestProcessorChain "dedupe"
[junit4:junit4]   2> 2259 T323 oasup.UpdateRequestProcessorChain.init inserting DistributedUpdateProcessorFactory into updateRequestProcessorChain "dedupe-allfields"
[junit4:junit4]   2> 2259 T323 oasup.UpdateRequestProcessorChain.init inserting DistributedUpdateProcessorFactory into updateRequestProcessorChain "stored_sig"
[junit4:junit4]   2> 2259 T323 oasup.UpdateRequestProcessorChain.init inserting DistributedUpdateProcessorFactory into updateRequestProcessorChain "uniq-fields"
[junit4:junit4]   2> 2260 T323 oasup.UpdateRequestProcessorChain.init inserting DistributedUpdateProcessorFactory into updateRequestProcessorChain "distrib-dup-test-chain-implicit"
[junit4:junit4]   2> 2260 T323 oasc.RequestHandlers.initHandlersFromConfig adding lazy requestHandler: solr.ReplicationHandler
[junit4:junit4]   2> 2260 T323 oasc.RequestHandlers.initHandlersFromConfig created /replication: solr.ReplicationHandler
[junit4:junit4]   2> 2261 T323 oasc.RequestHandlers.initHandlersFromConfig created standard: solr.StandardRequestHandler
[junit4:junit4]   2> 2261 T323 oasc.RequestHandlers.initHandlersFromConfig created /get: solr.RealTimeGetHandler
[junit4:junit4]   2> 2262 T323 oasc.RequestHandlers.initHandlersFromConfig created dismax: solr.SearchHandler
[junit4:junit4]   2> 2262 T323 oasc.RequestHandlers.initHandlersFromConfig created mock: org.apache.solr.core.MockQuerySenderListenerReqHandler
[junit4:junit4]   2> 2262 T323 oasc.RequestHandlers.initHandlersFromConfig created /admin/: org.apache.solr.handler.admin.AdminHandlers
[junit4:junit4]   2> 2263 T323 oasc.RequestHandlers.initHandlersFromConfig created defaults: solr.StandardRequestHandler
[junit4:junit4]   2> 2263 T323 oasc.RequestHandlers.initHandlersFromConfig adding lazy requestHandler: solr.StandardRequestHandler
[junit4:junit4]   2> 2263 T323 oasc.RequestHandlers.initHandlersFromConfig created lazy: solr.StandardRequestHandler
[junit4:junit4]   2> 2264 T323 oasc.RequestHandlers.initHandlersFromConfig created /update: solr.UpdateRequestHandler
[junit4:junit4]   2> 2264 T323 oasc.RequestHandlers.initHandlersFromConfig created /terms: org.apache.solr.handler.component.SearchHandler
[junit4:junit4]   2> 2265 T323 oasc.RequestHandlers.initHandlersFromConfig created spellCheckCompRH: org.apache.solr.handler.component.SearchHandler
[junit4:junit4]   2> 2265 T323 oasc.RequestHandlers.initHandlersFromConfig created spellCheckCompRH_Direct: org.apache.solr.handler.component.SearchHandler
[junit4:junit4]   2> 2265 T323 oasc.RequestHandlers.initHandlersFromConfig created spellCheckWithWordbreak: org.apache.solr.handler.component.SearchHandler
[junit4:junit4]   2> 2266 T323 oasc.RequestHandlers.initHandlersFromConfig created spellCheckWithWordbreak_Direct: org.apache.solr.handler.component.SearchHandler
[junit4:junit4]   2> 2266 T323 oasc.RequestHandlers.initHandlersFromConfig created spellCheckCompRH1: org.apache.solr.handler.component.SearchHandler
[junit4:junit4]   2> 2267 T323 oasc.RequestHandlers.initHandlersFromConfig created mltrh: org.apache.solr.handler.component.SearchHandler
[junit4:junit4]   2> 2267 T323 oasc.RequestHandlers.initHandlersFromConfig created tvrh: org.apache.solr.handler.component.SearchHandler
[junit4:junit4]   2> 2267 T323 oasc.RequestHandlers.initHandlersFromConfig created /mlt: solr.MoreLikeThisHandler
[junit4:junit4]   2> 2268 T323 oasc.RequestHandlers.initHandlersFromConfig created /debug/dump: solr.DumpRequestHandler
[junit4:junit4]   2> 2277 T323 oashl.XMLLoader.init xsltCacheLifetimeSeconds=60
[junit4:junit4]   2> 2280 T323 oasc.SolrCore.initDeprecatedSupport WARNING solrconfig.xml uses deprecated <admin/gettableFiles>, Please update your config to use the ShowFileRequestHandler.
[junit4:junit4]   2> 2282 T323 oasc.SolrCore.initDeprecatedSupport WARNING adding ShowFileRequestHandler with hidden files: [SCHEMA.XML, OLD_SYNONYMS.TXT, STOPWORDS.TXT, PROTWORDS.TXT, OPEN-EXCHANGE-RATES.JSON, SYNONYMS.TXT, CURRENCY.XML, MAPPING-ISOLATIN1ACCENT.TXT]
[junit4:junit4]   2> 2284 T323 oasc.CachingDirectoryFactory.close Releasing directory:/usr/home/hudson/hudson-slave/workspace/Lucene-Solr-Tests-4.x-java7/solr/build/solr-core/test/J0/./org.apache.solr.cloud.BasicDistributedZkTest-1358356410118/control/data
[junit4:junit4]   2> 2286 T323 oass.SolrIndexSearcher.<init> Opening Searcher@5b05ea2f main
[junit4:junit4]   2> 2287 T323 oasu.CommitTracker.<init> Hard AutoCommit: disabled
[junit4:junit4]   2> 2287 T323 oasu.CommitTracker.<init> Soft AutoCommit: disabled
[junit4:junit4]   2> 2288 T323 oashc.SpellCheckComponent.inform Initializing spell checkers
[junit4:junit4]   2> 2293 T323 oass.DirectSolrSpellChecker.init init: {name=direct,classname=DirectSolrSpellChecker,field=lowerfilt,minQueryLength=3}
[junit4:junit4]   2> 2346 T324 oasc.SolrCore.registerSearcher [collection1] Registered new searcher Searcher@5b05ea2f main{StandardDirectoryReader(segments_1:1)}
[junit4:junit4]   2> 2353 T323 oasc.ZkController.publish publishing core=collection1 state=down
[junit4:junit4]   2> 2354 T323 oasc.ZkController.publish numShards not found on descriptor - reading it from system property
[junit4:junit4]   2> 2355 T303 oazs.PrepRequestProcessor.pRequest Got user-level KeeperException when processing sessionid:0x13c4459efcb0003 type:create cxid:0x50 zxid:0x29 txntype:-1 reqpath:n/a Error Path:/solr/overseer/queue Error:KeeperErrorCode = NoNode for /solr/overseer/queue
[junit4:junit4]   2> 2842 T321 oascc.ZkStateReader.updateClusterState Updating cloud state from ZooKeeper... 
[junit4:junit4]   2> 2844 T321 oasc.Overseer$ClusterStateUpdater.updateState Update state numShards=1 message={
[junit4:junit4]   2> 	  "operation":"state",
[junit4:junit4]   2> 	  "numShards":"1",
[junit4:junit4]   2> 	  "shard":null,
[junit4:junit4]   2> 	  "roles":null,
[junit4:junit4]   2> 	  "state":"down",
[junit4:junit4]   2> 	  "core":"collection1",
[junit4:junit4]   2> 	  "collection":"control_collection",
[junit4:junit4]   2> 	  "node_name":"127.0.0.1:24955_",
[junit4:junit4]   2> 	  "base_url":"http://127.0.0.1:24955"}
[junit4:junit4]   2> 2844 T321 oasc.Overseer$ClusterStateUpdater.createCollection Create collection control_collection with numShards 1
[junit4:junit4]   2> 2881 T321 oasc.Overseer$ClusterStateUpdater.updateState Assigning new node to shard shard=shard1
[junit4:junit4]   2> 2882 T303 oazs.PrepRequestProcessor.pRequest Got user-level KeeperException when processing sessionid:0x13c4459efcb0003 type:create cxid:0x58 zxid:0x2c txntype:-1 reqpath:n/a Error Path:/solr/overseer/queue-work Error:KeeperErrorCode = NoNode for /solr/overseer/queue-work
[junit4:junit4]   2> 2944 T320 oascc.ZkStateReader$2.process A cluster state change: WatchedEvent state:SyncConnected type:NodeDataChanged path:/clusterstate.json, has occurred - updating... (live nodes size: 1)
[junit4:junit4]   2> 3373 T323 oasc.CoreContainer.registerCore registering core: collection1
[junit4:junit4]   2> 3373 T323 oasc.ZkController.register Register replica - core:collection1 address:http://127.0.0.1:24955 collection:control_collection shard:shard1
[junit4:junit4]   2> 3388 T323 oascsi.HttpClientUtil.createClient Creating new http client, config:maxConnections=10000&maxConnectionsPerHost=20&connTimeout=30000&socketTimeout=30000&retry=false
[junit4:junit4]   2> 3411 T323 oascc.SolrZkClient.makePath makePath: /collections/control_collection/leader_elect/shard1/election
[junit4:junit4]   2> 3439 T303 oazs.PrepRequestProcessor.pRequest Got user-level KeeperException when processing sessionid:0x13c4459efcb0003 type:delete cxid:0x72 zxid:0x36 txntype:-1 reqpath:n/a Error Path:/solr/collections/control_collection/leaders Error:KeeperErrorCode = NoNode for /solr/collections/control_collection/leaders
[junit4:junit4]   2> 3440 T323 oasc.ShardLeaderElectionContext.runLeaderProcess Running the leader process.
[junit4:junit4]   2> 3441 T303 oazs.PrepRequestProcessor.pRequest Got user-level KeeperException when processing sessionid:0x13c4459efcb0003 type:create cxid:0x73 zxid:0x37 txntype:-1 reqpath:n/a Error Path:/solr/overseer Error:KeeperErrorCode = NodeExists for /solr/overseer
[junit4:junit4]   2> 3453 T323 oasc.ShardLeaderElectionContext.waitForReplicasToComeUp Enough replicas found to continue.
[junit4:junit4]   2> 3453 T323 oasc.ShardLeaderElectionContext.runLeaderProcess I may be the new leader - try and sync
[junit4:junit4]   2> 3453 T323 oasc.SyncStrategy.sync Sync replicas to http://127.0.0.1:24955/collection1/
[junit4:junit4]   2> 3454 T323 oasc.SyncStrategy.syncReplicas Sync Success - now sync replicas to me
[junit4:junit4]   2> 3454 T323 oasc.SyncStrategy.syncToMe http://127.0.0.1:24955/collection1/ has no replicas
[junit4:junit4]   2> 3454 T323 oasc.ShardLeaderElectionContext.runLeaderProcess I am the new leader: http://127.0.0.1:24955/collection1/
[junit4:junit4]   2> 3455 T323 oascc.SolrZkClient.makePath makePath: /collections/control_collection/leaders/shard1
[junit4:junit4]   2> 3461 T303 oazs.PrepRequestProcessor.pRequest Got user-level KeeperException when processing sessionid:0x13c4459efcb0003 type:create cxid:0x7d zxid:0x3b txntype:-1 reqpath:n/a Error Path:/solr/overseer Error:KeeperErrorCode = NodeExists for /solr/overseer
[junit4:junit4]   2> 4451 T321 oascc.ZkStateReader.updateClusterState Updating cloud state from ZooKeeper... 
[junit4:junit4]   2> 4473 T320 oascc.ZkStateReader$2.process A cluster state change: WatchedEvent state:SyncConnected type:NodeDataChanged path:/clusterstate.json, has occurred - updating... (live nodes size: 1)
[junit4:junit4]   2> 4490 T323 oasc.ZkController.register We are http://127.0.0.1:24955/collection1/ and leader is http://127.0.0.1:24955/collection1/
[junit4:junit4]   2> 4490 T323 oasc.ZkController.register No LogReplay needed for core=collection1 baseURL=http://127.0.0.1:24955
[junit4:junit4]   2> 4490 T323 oasc.ZkController.checkRecovery I am the leader, no recovery necessary
[junit4:junit4]   2> 4490 T323 oasc.ZkController.publish publishing core=collection1 state=active
[junit4:junit4]   2> 4491 T323 oasc.ZkController.publish numShards not found on descriptor - reading it from system property
[junit4:junit4]   2> 4493 T323 oascc.ZkStateReader.updateClusterState Updating cloud state from ZooKeeper... 
[junit4:junit4]   2> 4494 T298 oass.SolrDispatchFilter.init user.dir=/usr/home/hudson/hudson-slave/workspace/Lucene-Solr-Tests-4.x-java7/solr/build/solr-core/test/J0
[junit4:junit4]   2> 4495 T298 oass.SolrDispatchFilter.init SolrDispatchFilter.init() done
[junit4:junit4]   2> 4496 T298 oascsi.HttpClientUtil.createClient Creating new http client, config:maxConnections=128&maxConnectionsPerHost=32&followRedirects=false
[junit4:junit4]   2> 4508 T298 oascsi.HttpClientUtil.createClient Creating new http client, config:
[junit4:junit4]   2> 4524 T298 oaz.ZooKeeper.<init> Initiating client connection, connectString=127.0.0.1:24952/solr sessionTimeout=10000 watcher=org.apache.solr.common.cloud.ConnectionManager@45515c1d
[junit4:junit4]   2> 4525 T298 oascc.ConnectionManager.waitForConnected Waiting for client to connect to ZooKeeper
[junit4:junit4]   2> 4525 T325 oaz.ClientCnxn$SendThread.logStartConnect Opening socket connection to server localhost/127.0.0.1:24952. Will not attempt to authenticate using SASL (access denied ("javax.security.auth.AuthPermission" "getLoginConfiguration"))
[junit4:junit4]   2> 4526 T325 oaz.ClientCnxn$SendThread.primeConnection Socket connection established to localhost/127.0.0.1:24952, initiating session
[junit4:junit4]   2> 4526 T300 oazs.NIOServerCnxnFactory.run Accepted socket connection from /140.211.11.196:24958
[junit4:junit4]   2> 4527 T300 oazs.ZooKeeperServer.processConnectRequest Client attempting to establish new session at /140.211.11.196:24958
[junit4:junit4]   2> 4528 T302 oazs.ZooKeeperServer.finishSessionInit Established session 0x13c4459efcb0004 with negotiated timeout 10000 for client /140.211.11.196:24958
[junit4:junit4]   2> 4528 T325 oaz.ClientCnxn$SendThread.onConnected Session establishment complete on server localhost/127.0.0.1:24952, sessionid = 0x13c4459efcb0004, negotiated timeout = 10000
[junit4:junit4]   2> 4528 T326 oascc.ConnectionManager.process Watcher org.apache.solr.common.cloud.ConnectionManager@45515c1d name:ZooKeeperConnection Watcher:127.0.0.1:24952/solr got event WatchedEvent state:SyncConnected type:None path:null path:null type:None
[junit4:junit4]   2> 4529 T298 oascc.ConnectionManager.waitForConnected Client is connected to ZooKeeper
[junit4:junit4]   2> 4530 T298 oascc.ZkStateReader.createClusterStateWatchersAndUpdate Updating cluster state from ZooKeeper... 
[junit4:junit4]   2> 4535 T298 oasc.ChaosMonkey.monkeyLog monkey: init - expire sessions:true cause connection loss:true
[junit4:junit4]   2> 4711 T298 oejs.Server.doStart jetty-8.1.8.v20121106
[junit4:junit4]   2> 4714 T298 oejs.AbstractConnector.doStart Started SocketConnector@127.0.0.1:24959
[junit4:junit4]   2> 4715 T298 oass.SolrDispatchFilter.init SolrDispatchFilter.init()
[junit4:junit4]   2> 4716 T298 oasc.SolrResourceLoader.locateSolrHome JNDI not configured for solr (NoInitialContextEx)
[junit4:junit4]   2> 4716 T298 oasc.SolrResourceLoader.locateSolrHome using system property solr.solr.home: /usr/home/hudson/hudson-slave/workspace/Lucene-Solr-Tests-4.x-java7/solr/build/solr-core/test/J0/./org.apache.solr.cloud.BasicDistributedZkTest-jetty1-1358356414649
[junit4:junit4]   2> 4717 T298 oasc.CoreContainer$Initializer.initialize looking for solr.xml: /usr/home/hudson/hudson-slave/workspace/Lucene-Solr-Tests-4.x-java7/solr/build/solr-core/test/J0/./org.apache.solr.cloud.BasicDistributedZkTest-jetty1-1358356414649/solr.xml
[junit4:junit4]   2> 4717 T298 oasc.CoreContainer.<init> New CoreContainer 1342784205
[junit4:junit4]   2> 4718 T298 oasc.CoreContainer.load Loading CoreContainer using Solr Home: '/usr/home/hudson/hudson-slave/workspace/Lucene-Solr-Tests-4.x-java7/solr/build/solr-core/test/J0/./org.apache.solr.cloud.BasicDistributedZkTest-jetty1-1358356414649/'
[junit4:junit4]   2> 4718 T298 oasc.SolrResourceLoader.<init> new SolrResourceLoader for directory: '/usr/home/hudson/hudson-slave/workspace/Lucene-Solr-Tests-4.x-java7/solr/build/solr-core/test/J0/./org.apache.solr.cloud.BasicDistributedZkTest-jetty1-1358356414649/'
[junit4:junit4]   2> 4777 T298 oashc.HttpShardHandlerFactory.getParameter Setting socketTimeout to: 60000
[junit4:junit4]   2> 4778 T298 oashc.HttpShardHandlerFactory.getParameter Setting urlScheme to: http://
[junit4:junit4]   2> 4778 T298 oashc.HttpShardHandlerFactory.getParameter Setting connTimeout to: 15000
[junit4:junit4]   2> 4779 T298 oashc.HttpShardHandlerFactory.getParameter Setting maxConnectionsPerHost to: 20
[junit4:junit4]   2> 4779 T298 oashc.HttpShardHandlerFactory.getParameter Setting corePoolSize to: 0
[junit4:junit4]   2> 4780 T298 oashc.HttpShardHandlerFactory.getParameter Setting maximumPoolSize to: 2147483647
[junit4:junit4]   2> 4780 T298 oashc.HttpShardHandlerFactory.getParameter Setting maxThreadIdleTime to: 5
[junit4:junit4]   2> 4780 T298 oashc.HttpShardHandlerFactory.getParameter Setting sizeOfQueue to: -1
[junit4:junit4]   2> 4781 T298 oashc.HttpShardHandlerFactory.getParameter Setting fairnessPolicy to: false
[junit4:junit4]   2> 4782 T298 oascsi.HttpClientUtil.createClient Creating new http client, config:maxConnectionsPerHost=20&maxConnections=10000&socketTimeout=60000&connTimeout=15000&retry=false
[junit4:junit4]   2> 4803 T298 oasc.CoreContainer.load Registering Log Listener
[junit4:junit4]   2> 4823 T298 oasc.CoreContainer.initZooKeeper Zookeeper client=127.0.0.1:24952/solr
[junit4:junit4]   2> 4824 T298 oasc.ZkController.checkChrootPath zkHost includes chroot
[junit4:junit4]   2> 4825 T298 oaz.ZooKeeper.<init> Initiating client connection, connectString=127.0.0.1:24952 sessionTimeout=60000 watcher=org.apache.solr.common.cloud.ConnectionManager@6cfd3787
[junit4:junit4]   2> 4826 T298 oascc.ConnectionManager.waitForConnected Waiting for client to connect to ZooKeeper
[junit4:junit4]   2> 4826 T336 oaz.ClientCnxn$SendThread.logStartConnect Opening socket connection to server localhost/127.0.0.1:24952. Will not attempt to authenticate using SASL (access denied ("javax.security.auth.AuthPermission" "getLoginConfiguration"))
[junit4:junit4]   2> 4827 T336 oaz.ClientCnxn$SendThread.primeConnection Socket connection established to localhost/127.0.0.1:24952, initiating session
[junit4:junit4]   2> 4828 T300 oazs.NIOServerCnxnFactory.run Accepted socket connection from /140.211.11.196:24960
[junit4:junit4]   2> 4828 T300 oazs.ZooKeeperServer.processConnectRequest Client attempting to establish new session at /140.211.11.196:24960
[junit4:junit4]   2> 4831 T302 oazs.ZooKeeperServer.finishSessionInit Established session 0x13c4459efcb0005 with negotiated timeout 20000 for client /140.211.11.196:24960
[junit4:junit4]   2> 4831 T336 oaz.ClientCnxn$SendThread.onConnected Session establishment complete on server localhost/127.0.0.1:24952, sessionid = 0x13c4459efcb0005, negotiated timeout = 20000
[junit4:junit4]   2> 4831 T337 oascc.ConnectionManager.process Watcher org.apache.solr.common.cloud.ConnectionManager@6cfd3787 name:ZooKeeperConnection Watcher:127.0.0.1:24952 got event WatchedEvent state:SyncConnected type:None path:null path:null type:None
[junit4:junit4]   2> 4832 T298 oascc.ConnectionManager.waitForConnected Client is connected to ZooKeeper
[junit4:junit4]   2> 4834 T303 oazs.PrepRequestProcessor.pRequest2Txn Processed session termination for sessionid: 0x13c4459efcb0005
[junit4:junit4]   2> 4847 T300 oazs.NIOServerCnxn.closeSock Closed socket connection for client /140.211.11.196:24960 which had sessionid 0x13c4459efcb0005
[junit4:junit4]   2> 4847 T337 oaz.ClientCnxn$EventThread.run EventThread shut down
[junit4:junit4]   2> 4847 T298 oaz.ZooKeeper.close Session: 0x13c4459efcb0005 closed
[junit4:junit4]   2> 4848 T298 oascsi.HttpClientUtil.createClient Creating new http client, config:maxConnections=500&maxConnectionsPerHost=16&socketTimeout=60000&connTimeout=15000
[junit4:junit4]   2> 4860 T298 oaz.ZooKeeper.<init> Initiating client connection, connectString=127.0.0.1:24952/solr sessionTimeout=30000 watcher=org.apache.solr.common.cloud.ConnectionManager@62c41cca
[junit4:junit4]   2> 4861 T298 oascc.ConnectionManager.waitForConnected Waiting for client to connect to ZooKeeper
[junit4:junit4]   2> 4861 T338 oaz.ClientCnxn$SendThread.logStartConnect Opening socket connection to server localhost/127.0.0.1:24952. Will not attempt to authenticate using SASL (access denied ("javax.security.auth.AuthPermission" "getLoginConfiguration"))
[junit4:junit4]   2> 4862 T338 oaz.ClientCnxn$SendThread.primeConnection Socket connection established to localhost/127.0.0.1:24952, initiating session
[junit4:junit4]   2> 4862 T300 oazs.NIOServerCnxnFactory.run Accepted socket connection from /140.211.11.196:24961
[junit4:junit4]   2> 4863 T300 oazs.ZooKeeperServer.processConnectRequest Client attempting to establish new session at /140.211.11.196:24961
[junit4:junit4]   2> 4864 T302 oazs.ZooKeeperServer.finishSessionInit Established session 0x13c4459efcb0006 with negotiated timeout 20000 for client /140.211.11.196:24961
[junit4:junit4]   2> 4864 T338 oaz.ClientCnxn$SendThread.onConnected Session establishment complete on server localhost/127.0.0.1:24952, sessionid = 0x13c4459efcb0006, negotiated timeout = 20000
[junit4:junit4]   2> 4865 T339 oascc.ConnectionManager.process Watcher org.apache.solr.common.cloud.ConnectionManager@62c41cca name:ZooKeeperConnection Watcher:127.0.0.1:24952/solr got event WatchedEvent state:SyncConnected type:None path:null path:null type:None
[junit4:junit4]   2> 4865 T298 oascc.ConnectionManager.waitForConnected Client is connected to ZooKeeper
[junit4:junit4]   2> 4866 T303 oazs.PrepRequestProcessor.pRequest Got user-level KeeperException when processing sessionid:0x13c4459efcb0006 type:create cxid:0x1 zxid:0x49 txntype:-1 reqpath:n/a Error Path:/solr/overseer Error:KeeperErrorCode = NodeExists for /solr/overseer
[junit4:junit4]   2> 4868 T303 oazs.PrepRequestProcessor.pRequest Got user-level KeeperException when processing sessionid:0x13c4459efcb0006 type:create cxid:0x2 zxid:0x4a txntype:-1 reqpath:n/a Error Path:/solr/overseer Error:KeeperErrorCode = NodeExists for /solr/overseer
[junit4:junit4]   2> 4876 T298 oasc.ZkController.createEphemeralLiveNode Register node as live in ZooKeeper:/live_nodes/127.0.0.1:24959_
[junit4:junit4]   2> 4877 T303 oazs.PrepRequestProcessor.pRequest Got user-level KeeperException when processing sessionid:0x13c4459efcb0006 type:delete cxid:0x4 zxid:0x4b txntype:-1 reqpath:n/a Error Path:/solr/live_nodes/127.0.0.1:24959_ Error:KeeperErrorCode = NoNode for /solr/live_nodes/127.0.0.1:24959_
[junit4:junit4]   2> 4879 T298 oascc.SolrZkClient.makePath makePath: /live_nodes/127.0.0.1:24959_
[junit4:junit4]   2> 4883 T326 oascc.ZkStateReader$3.process Updating live nodes... (2)
[junit4:junit4]   2> 4883 T320 oascc.ZkStateReader$3.process Updating live nodes... (2)
[junit4:junit4]   2> 4884 T320 oascc.ZkStateReader$2.process A cluster state change: WatchedEvent state:SyncConnected type:NodeChildrenChanged path:/live_nodes, has occurred - updating... (live nodes size: 2)
[junit4:junit4]   2> 4892 T298 oascc.ZkStateReader.createClusterStateWatchersAndUpdate Updating cluster state from ZooKeeper... 
[junit4:junit4]   2> 4900 T340 oasc.CoreContainer.create Creating SolrCore 'collection1' using instanceDir: /usr/home/hudson/hudson-slave/workspace/Lucene-Solr-Tests-4.x-java7/solr/build/solr-core/test/J0/./org.apache.solr.cloud.BasicDistributedZkTest-jetty1-1358356414649/collection1
[junit4:junit4]   2> 4901 T340 oasc.ZkController.createCollectionZkNode Check for collection zkNode:collection1
[junit4:junit4]   2> 4902 T340 oasc.ZkController.createCollectionZkNode Collection zkNode exists
[junit4:junit4]   2> 4902 T340 oasc.ZkController.readConfigName Load collection config from:/collections/collection1
[junit4:junit4]   2> 4905 T340 oasc.SolrResourceLoader.<init> new SolrResourceLoader for directory: '/usr/home/hudson/hudson-slave/workspace/Lucene-Solr-Tests-4.x-java7/solr/build/solr-core/test/J0/./org.apache.solr.cloud.BasicDistributedZkTest-jetty1-1358356414649/collection1/'
[junit4:junit4]   2> 4906 T340 oasc.SolrResourceLoader.replaceClassLoader Adding 'file:/usr/home/hudson/hudson-slave/workspace/Lucene-Solr-Tests-4.x-java7/solr/build/solr-core/test/J0/org.apache.solr.cloud.BasicDistributedZkTest-jetty1-1358356414649/collection1/lib/README' to classloader
[junit4:junit4]   2> 4906 T340 oasc.SolrResourceLoader.replaceClassLoader Adding 'file:/usr/home/hudson/hudson-slave/workspace/Lucene-Solr-Tests-4.x-java7/solr/build/solr-core/test/J0/org.apache.solr.cloud.BasicDistributedZkTest-jetty1-1358356414649/collection1/lib/classes/' to classloader
[junit4:junit4]   2> 4948 T340 oasc.SolrConfig.<init> Using Lucene MatchVersion: LUCENE_42
[junit4:junit4]   2> 4999 T340 oasc.SolrConfig.<init> Loaded SolrConfig: solrconfig.xml
[junit4:junit4]   2> 5100 T340 oass.IndexSchema.readSchema Reading Solr Schema
[junit4:junit4]   2> 5106 T340 oass.IndexSchema.readSchema Schema name=test
[junit4:junit4]   2> 5758 T340 oass.OpenExchangeRatesOrgProvider.init Initialized with rates=open-exchange-rates.json, refreshInterval=1440.
[junit4:junit4]   2> 5771 T340 oass.IndexSchema.readSchema default search field in schema is text
[junit4:junit4]   2> 5775 T340 oass.IndexSchema.readSchema unique key field: id
[junit4:junit4]   2> 5800 T340 oass.FileExchangeRateProvider.reload Reloading exchange rates from file currency.xml
[junit4:junit4]   2> 5806 T340 oass.FileExchangeRateProvider.reload Reloading exchange rates from file currency.xml
[junit4:junit4]   2> 5812 T340 oass.OpenExchangeRatesOrgProvider.reload Reloading exchange rates from open-exchange-rates.json
[junit4:junit4]   2> 5814 T340 oass.OpenExchangeRatesOrgProvider.reload Reloading exchange rates from open-exchange-rates.json
[junit4:junit4]   2> 5816 T340 oasc.SolrCore.<init> [collection1] Opening new SolrCore at /usr/home/hudson/hudson-slave/workspace/Lucene-Solr-Tests-4.x-java7/solr/build/solr-core/test/J0/./org.apache.solr.cloud.BasicDistributedZkTest-jetty1-1358356414649/collection1/, dataDir=./org.apache.solr.cloud.BasicDistributedZkTest-1358356410118/jetty1/
[junit4:junit4]   2> 5816 T340 oasc.JmxMonitoredMap.<init> JMX monitoring is enabled. Adding Solr mbeans to JMX Server: com.sun.jmx.mbeanserver.JmxMBeanServer@6cd44892
[junit4:junit4]   2> 5817 T340 oasc.SolrCore.initDirectoryFactory solr.NRTCachingDirectoryFactory
[junit4:junit4]   2> 5818 T340 oasc.CachingDirectoryFactory.get return new directory for /usr/home/hudson/hudson-slave/workspace/Lucene-Solr-Tests-4.x-java7/solr/build/solr-core/test/J0/./org.apache.solr.cloud.BasicDistributedZkTest-1358356410118/jetty1 forceNew:false
[junit4:junit4]   2> 5819 T340 oasc.CachingDirectoryFactory.close Releasing directory:/usr/home/hudson/hudson-slave/workspace/Lucene-Solr-Tests-4.x-java7/solr/build/solr-core/test/J0/./org.apache.solr.cloud.BasicDistributedZkTest-1358356410118/jetty1
[junit4:junit4]   2> 5819 T340 oasc.SolrCore.getNewIndexDir New index directory detected: old=null new=./org.apache.solr.cloud.BasicDistributedZkTest-1358356410118/jetty1/index/
[junit4:junit4]   2> 5820 T340 oasc.SolrCore.initIndex WARNING [collection1] Solr index directory './org.apache.solr.cloud.BasicDistributedZkTest-1358356410118/jetty1/index' doesn't exist. Creating new index...
[junit4:junit4]   2> 5821 T340 oasc.CachingDirectoryFactory.get return new directory for /usr/home/hudson/hudson-slave/workspace/Lucene-Solr-Tests-4.x-java7/solr/build/solr-core/test/J0/./org.apache.solr.cloud.BasicDistributedZkTest-1358356410118/jetty1/index forceNew:false
[junit4:junit4]   2> 5827 T340 oasc.SolrDeletionPolicy.onCommit SolrDeletionPolicy.onCommit: commits:num=1
[junit4:junit4]   2> 		commit{dir=RateLimitedDirectoryWrapper(NRTCachingDirectory(org.apache.lucene.store.NIOFSDirectory@/usr/home/hudson/hudson-slave/workspace/Lucene-Solr-Tests-4.x-java7/solr/build/solr-core/test/J0/org.apache.solr.cloud.BasicDistributedZkTest-1358356410118/jetty1/index lockFactory=org.apache.lucene.store.NativeFSLockFactory@5aa66dc4; maxCacheMB=48.0 maxMergeSizeMB=4.0)),segFN=segments_1,generation=1,filenames=[segments_1]
[junit4:junit4]   2> 5828 T340 oasc.SolrDeletionPolicy.updateCommits newest commit = 1[segments_1]
[junit4:junit4]   2> 5829 T340 oasc.CachingDirectoryFactory.close Releasing directory:/usr/home/hudson/hudson-slave/workspace/Lucene-Solr-Tests-4.x-java7/solr/build/solr-core/test/J0/./org.apache.solr.cloud.BasicDistributedZkTest-1358356410118/jetty1/index
[junit4:junit4]   2> 5829 T340 oasc.SolrCore.initWriters created xml: solr.XMLResponseWriter
[junit4:junit4]   2> 5839 T340 oasup.UpdateRequestProcessorChain.init inserting DistributedUpdateProcessorFactory into updateRequestProcessorChain "dedupe"
[junit4:junit4]   2> 5840 T340 oasup.UpdateRequestProcessorChain.init inserting DistributedUpdateProcessorFactory into updateRequestProcessorChain "dedupe-allfields"
[junit4:junit4]   2> 5840 T340 oasup.UpdateRequestProcessorChain.init inserting DistributedUpdateProcessorFactory into updateRequestProcessorChain "stored_sig"
[junit4:junit4]   2> 5840 T340 oasup.UpdateRequestProcessorChain.init inserting DistributedUpdateProcessorFactory into updateRequestProcessorChain "uniq-fields"
[junit4:junit4]   2> 5841 T340 oasup.UpdateRequestProcessorChain.init inserting DistributedUpdateProcessorFactory into updateRequestProcessorChain "distrib-dup-test-chain-implicit"
[junit4:junit4]   2> 5841 T340 oasc.RequestHandlers.initHandlersFromConfig adding lazy requestHandler: solr.ReplicationHandler
[junit4:junit4]   2> 5842 T340 oasc.RequestHandlers.initHandlersFromConfig created /replication: solr.ReplicationHandler
[junit4:junit4]   2> 5843 T340 oasc.RequestHandlers.initHandlersFromConfig created standard: solr.StandardRequestHandler
[junit4:junit4]   2> 5844 T340 oasc.RequestHandlers.initHandlersFromConfig created /get: solr.RealTimeGetHandler
[junit4:junit4]   2> 5844 T340 oasc.RequestHandlers.initHandlersFromConfig created dismax: solr.SearchHandler
[junit4:junit4]   2> 5845 T340 oasc.RequestHandlers.initHandlersFromConfig created mock: org.apache.solr.core.MockQuerySenderListenerReqHandler
[junit4:junit4]   2> 5846 T340 oasc.RequestHandlers.initHandlersFromConfig created /admin/: org.apache.solr.handler.admin.AdminHandlers
[junit4:junit4]   2> 5847 T340 oasc.RequestHandlers.initHandlersFromConfig created defaults: solr.StandardRequestHandler
[junit4:junit4]   2> 5847 T340 oasc.RequestHandlers.initHandlersFromConfig adding lazy requestHandler: solr.StandardRequestHandler
[junit4:junit4]   2> 5847 T340 oasc.RequestHandlers.initHandlersFromConfig created lazy: solr.StandardRequestHandler
[junit4:junit4]   2> 5848 T340 oasc.RequestHandlers.initHandlersFromConfig created /update: solr.UpdateRequestHandler
[junit4:junit4]   2> 5849 T340 oasc.RequestHandlers.initHandlersFromConfig created /terms: org.apache.solr.handler.component.SearchHandler
[junit4:junit4]   2> 5850 T340 oasc.RequestHandlers.initHandlersFromConfig created spellCheckCompRH: org.apache.solr.handler.component.SearchHandler
[junit4:junit4]   2> 5850 T340 oasc.RequestHandlers.initHandlersFromConfig created spellCheckCompRH_Direct: org.apache.solr.handler.component.SearchHandler
[junit4:junit4]   2> 5851 T340 oasc.RequestHandlers.initHandlersFromConfig created spellCheckWithWordbreak: org.apache.solr.handler.component.SearchHandler
[junit4:junit4]   2> 5852 T340 oasc.RequestHandlers.initHandlersFromConfig created spellCheckWithWordbreak_Direct: org.apache.solr.handler.component.SearchHandler
[junit4:junit4]   2> 5853 T340 oasc.RequestHandlers.initHandlersFromConfig created spellCheckCompRH1: org.apache.solr.handler.component.SearchHandler
[junit4:junit4]   2> 5853 T340 oasc.RequestHandlers.initHandlersFromConfig created mltrh: org.apache.solr.handler.component.SearchHandler
[junit4:junit4]   2> 5854 T340 oasc.RequestHandlers.initHandlersFromConfig created tvrh: org.apache.solr.handler.component.SearchHandler
[junit4:junit4]   2> 5855 T340 oasc.RequestHandlers.initHandlersFromConfig created /mlt: solr.MoreLikeThisHandler
[junit4:junit4]   2> 5856 T340 oasc.RequestHandlers.initHandlersFromConfig created /debug/dump: solr.DumpRequestHandler
[junit4:junit4]   2> 5869 T340 oashl.XMLLoader.init xsltCacheLifetimeSeconds=60
[junit4:junit4]   2> 5873 T340 oasc.SolrCore.initDeprecatedSupport WARNING solrconfig.xml uses deprecated <admin/gettableFiles>, Please update your config to use the ShowFileRequestHandler.
[junit4:junit4]   2> 5875 T340 oasc.SolrCore.initDeprecatedSupport WARNING adding ShowFileRequestHandler with hidden files: [SCHEMA.XML, OLD_SYNONYMS.TXT, STOPWORDS.TXT, PROTWORDS.TXT, OPEN-EXCHANGE-RATES.JSON, SYNONYMS.TXT, CURRENCY.XML, MAPPING-ISOLATIN1ACCENT.TXT]
[junit4:junit4]   2> 5878 T340 oasc.CachingDirectoryFactory.close Releasing directory:/usr/home/hudson/hudson-slave/workspace/Lucene-Solr-Tests-4.x-java7/solr/build/solr-core/test/J0/./org.apache.solr.cloud.BasicDistributedZkTest-1358356410118/jetty1
[junit4:junit4]   2> 5880 T340 oass.SolrIndexSearcher.<init> Opening Searcher@3771b1e9 main
[junit4:junit4]   2> 5881 T340 oasu.CommitTracker.<init> Hard AutoCommit: disabled
[junit4:junit4]   2> 5882 T340 oasu.CommitTracker.<init> Soft AutoCommit: disabled
[junit4:junit4]   2> 5882 T340 oashc.SpellCheckComponent.inform Initializing spell checkers
[junit4:junit4]   2> 5891 T340 oass.DirectSolrSpellChecker.init init: {name=direct,classname=DirectSolrSpellChecker,field=lowerfilt,minQueryLength=3}
[junit4:junit4]   2> 5950 T341 oasc.SolrCore.registerSearcher [collection1] Registered new searcher Searcher@3771b1e9 main{StandardDirectoryReader(segments_1:1)}
[junit4:junit4]   2> 5959 T340 oasc.ZkController.publish publishing core=collection1 state=down
[junit4:junit4]   2> 5960 T340 oasc.ZkController.publish numShards not found on descriptor - reading it from system property
[junit4:junit4]   2> 5988 T321 oascc.ZkStateReader.updateClusterState Updating cloud state from ZooKeeper... 
[junit4:junit4]   2> 5989 T321 oasc.Overseer$ClusterStateUpdater.updateState Update state numShards=1 message={
[junit4:junit4]   2> 	  "operation":"state",
[junit4:junit4]   2> 	  "numShards":"1",
[junit4:junit4]   2> 	  "shard":"shard1",
[junit4:junit4]   2> 	  "roles":null,
[junit4:junit4]   2> 	  "state":"active",
[junit4:junit4]   2> 	  "core":"collection1",
[junit4:junit4]   2> 	  "collection":"control_collection",
[junit4:junit4]   2> 	  "node_name":"127.0.0.1:24955_",
[junit4:junit4]   2> 	  "base_url":"http://127.0.0.1:24955"}
[junit4:junit4]   2> 5995 T321 oasc.Overseer$ClusterStateUpdater.updateState Update state numShards=2 message={
[junit4:junit4]   2> 	  "operation":"state",
[junit4:junit4]   2> 	  "numShards":"2",
[junit4:junit4]   2> 	  "shard":null,
[junit4:junit4]   2> 	  "roles":null,
[junit4:junit4]   2> 	  "state":"down",
[junit4:junit4]   2> 	  "core":"collection1",
[junit4:junit4]   2> 	  "collection":"collection1",
[junit4:junit4]   2> 	  "node_name":"127.0.0.1:24959_",
[junit4:junit4]   2> 	  "base_url":"http://127.0.0.1:24959"}
[junit4:junit4]   2> 5995 T321 oasc.Overseer$ClusterStateUpdater.createCollection Create collection collection1 with numShards 2
[junit4:junit4]   2> 5995 T321 oasc.Overseer$ClusterStateUpdater.updateState Assigning new node to shard shard=shard1
[junit4:junit4]   2> 6007 T339 oascc.ZkStateReader$2.process A cluster state change: WatchedEvent state:SyncConnected type:NodeDataChanged path:/clusterstate.json, has occurred - updating... (live nodes size: 2)
[junit4:junit4]   2> 6007 T320 oascc.ZkStateReader$2.process A cluster state change: WatchedEvent state:SyncConnected type:NodeDataChanged path:/clusterstate.json, has occurred - updating... (live nodes size: 2)
[junit4:junit4]   2> 6007 T326 oascc.ZkStateReader$2.process A cluster state change: WatchedEvent state:SyncConnected type:NodeDataChanged path:/clusterstate.json, has occurred - updating... (live nodes size: 2)
[junit4:junit4]   2> 6963 T340 oasc.CoreContainer.registerCore registering core: collection1
[junit4:junit4]   2> 6963 T340 oasc.ZkController.register Register replica - core:collection1 address:http://127.0.0.1:24959 collection:collection1 shard:shard1
[junit4:junit4]   2> 6964 T340 oascc.SolrZkClient.makePath makePath: /collections/collection1/leader_elect/shard1/election
[junit4:junit4]   2> 6987 T303 oazs.PrepRequestProcessor.pRequest Got user-level KeeperException when processing sessionid:0x13c4459efcb0006 type:delete cxid:0x43 zxid:0x5a txntype:-1 reqpath:n/a Error Path:/solr/collections/collection1/leaders Error:KeeperErrorCode = NoNode for /solr/collections/collection1/leaders
[junit4:junit4]   2> 6989 T340 oasc.ShardLeaderElectionContext.runLeaderProcess Running the leader process.
[junit4:junit4]   2> 6989 T303 oazs.PrepRequestProcessor.pRequest Got user-level KeeperException when processing sessionid:0x13c4459efcb0006 type:create cxid:0x44 zxid:0x5b txntype:-1 reqpath:n/a Error Path:/solr/overseer Error:KeeperErrorCode = NodeExists for /solr/overseer
[junit4:junit4]   2> 6999 T340 oasc.ShardLeaderElectionContext.waitForReplicasToComeUp Enough replicas found to continue.
[junit4:junit4]   2> 7000 T340 oasc.ShardLeaderElectionContext.runLeaderProcess I may be the new leader - try and sync
[junit4:junit4]   2> 7000 T340 oasc.SyncStrategy.sync Sync replicas to http://127.0.0.1:24959/collection1/
[junit4:junit4]   2> 7000 T340 oasc.SyncStrategy.syncReplicas Sync Success - now sync replicas to me
[junit4:junit4]   2> 7000 T340 oasc.SyncStrategy.syncToMe http://127.0.0.1:24959/collection1/ has no replicas
[junit4:junit4]   2> 7001 T340 oasc.ShardLeaderElectionContext.runLeaderProcess I am the new leader: http://127.0.0.1:24959/collection1/
[junit4:junit4]   2> 7001 T340 oascc.SolrZkClient.makePath makePath: /collections/collection1/leaders/shard1
[junit4:junit4]   2> 7008 T303 oazs.PrepRequestProcessor.pRequest Got user-level KeeperException when processing sessionid:0x13c4459efcb0006 type:create cxid:0x4e zxid:0x5f txntype:-1 reqpath:n/a Error Path:/solr/overseer Error:KeeperErrorCode = NodeExists for /solr/overseer
[junit4:junit4]   2> 7523 T321 oascc.ZkStateReader.updateClusterState Updating cloud state from ZooKeeper... 
[junit4:junit4]   2> 7545 T320 oascc.ZkStateReader$2.process A cluster state change: WatchedEvent state:SyncConnected type:NodeDataChanged path:/clusterstate.json, has occurred - updating... (live nodes size: 2)
[junit4:junit4]   2> 7545 T339 oascc.ZkStateReader$2.process A cluster state change: WatchedEvent state:SyncConnected type:NodeDataChanged path:/clusterstate.json, has occurred - updating... (live nodes size: 2)
[junit4:junit4]   2> 7545 T326 oascc.ZkStateReader$2.process A cluster state change: WatchedEvent state:SyncConnected type:NodeDataChanged path:/clusterstate.json, has occurred - updating... (live nodes size: 2)
[junit4:junit4]   2> 7578 T340 oasc.ZkController.register We are http://127.0.0.1:24959/collection1/ and leader is http://127.0.0.1:24959/collection1/
[junit4:junit4]   2> 7578 T340 oasc.ZkController.register No LogReplay needed for core=collection1 baseURL=http://127.0.0.1:24959
[junit4:junit4]   2> 7578 T340 oasc.ZkController.checkRecovery I am the leader, no recovery necessary
[junit4:junit4]   2> 7579 T340 oasc.ZkController.publish publishing core=collection1 state=active
[junit4:junit4]   2> 7579 T340 oasc.ZkController.publish numShards not found on descriptor - reading it from system property
[junit4:junit4]   2> 7581 T340 oascc.ZkStateReader.updateClusterState Updating cloud state from ZooKeeper... 
[junit4:junit4]   2> 7583 T298 oass.SolrDispatchFilter.init user.dir=/usr/home/hudson/hudson-slave/workspace/Lucene-Solr-Tests-4.x-java7/solr/build/solr-core/test/J0
[junit4:junit4]   2> 7583 T298 oass.SolrDispatchFilter.init SolrDispatchFilter.init() done
[junit4:junit4]   2> 7584 T298 oascsi.HttpClientUtil.createClient Creating new http client, config:maxConnections=128&maxConnectionsPerHost=32&followRedirects=false
[junit4:junit4]   2> 7775 T298 oejs.Server.doStart jetty-8.1.8.v20121106
[junit4:junit4]   2> 7778 T298 oejs.AbstractConnector.doStart Started SocketConnector@127.0.0.1:24962
[junit4:junit4]   2> 7779 T298 oass.SolrDispatchFilter.init SolrDispatchFilter.init()
[junit4:junit4]   2> 7779 T298 oasc.SolrResourceLoader.locateSolrHome JNDI not configured for solr (NoInitialContextEx)
[junit4:junit4]   2> 7780 T298 oasc.SolrResourceLoader.locateSolrHome using system property solr.solr.home: /usr/home/hudson/hudson-slave/workspace/Lucene-Solr-Tests-4.x-java7/solr/build/solr-core/test/J0/./org.apache.solr.cloud.BasicDistributedZkTest-jetty2-1358356417713
[junit4:junit4]   2> 7780 T298 oasc.CoreContainer$Initializer.initialize looking for solr.xml: /usr/home/hudson/hudson-slave/workspace/Lucene-Solr-Tests-4.x-java7/solr/build/solr-core/test/J0/./org.apache.solr.cloud.BasicDistributedZkTest-jetty2-1358356417713/solr.xml
[junit4:junit4]   2> 7781 T298 oasc.CoreContainer.<init> New CoreContainer 1781746754
[junit4:junit4]   2> 7781 T298 oasc.CoreContainer.load Loading CoreContainer using Solr Home: '/usr/home/hudson/hudson-slave/workspace/Lucene-Solr-Tests-4.x-java7/solr/build/solr-core/test/J0/./org.apache.solr.cloud.BasicDistributedZkTest-jetty2-1358356417713/'
[junit4:junit4]   2> 7782 T298 oasc.SolrResourceLoader.<init> new SolrResourceLoader for directory: '/usr/home/hudson/hudson-slave/workspace/Lucene-Solr-Tests-4.x-java7/solr/build/solr-core/test/J0/./org.apache.solr.cloud.BasicDistributedZkTest-jetty2-1358356417713/'
[junit4:junit4]   2> 7840 T298 oashc.HttpShardHandlerFactory.getParameter Setting socketTimeout to: 60000
[junit4:junit4]   2> 7841 T298 oashc.HttpShardHandlerFactory.getParameter Setting urlScheme to: http://
[junit4:junit4]   2> 7841 T298 oashc.HttpShardHandlerFactory.getParameter Setting connTimeout to: 15000
[junit4:junit4]   2> 7842 T298 oashc.HttpShardHandlerFactory.getParameter Setting maxConnectionsPerHost to: 20
[junit4:junit4]   2> 7842 T298 oashc.HttpShardHandlerFactory.getParameter Setting corePoolSize to: 0
[junit4:junit4]   2> 7843 T298 oashc.HttpShardHandlerFactory.getParameter Setting maximumPoolSize to: 2147483647
[junit4:junit4]   2> 7843 T298 oashc.HttpShardHandlerFactory.getParameter Setting maxThreadIdleTime to: 5
[junit4:junit4]   2> 7844 T298 oashc.HttpShardHandlerFactory.getParameter Setting sizeOfQueue to: -1
[junit4:junit4]   2> 7844 T298 oashc.HttpShardHandlerFactory.getParameter Setting fairnessPolicy to: false
[junit4:junit4]   2> 7845 T298 oascsi.HttpClientUtil.createClient Creating new http client, config:maxConnectionsPerHost=20&maxConnections=10000&socketTimeout=60000&connTimeout=15000&retry=false
[junit4:junit4]   2> 7868 T298 oasc.CoreContainer.load Registering Log Listener
[junit4:junit4]   2> 7888 T298 oasc.CoreContainer.initZooKeeper Zookeeper client=127.0.0.1:24952/solr
[junit4:junit4]   2> 7889 T298 oasc.ZkController.checkChrootPath zkHost includes chroot
[junit4:junit4]   2> 7890 T298 oaz.ZooKeeper.<init> Initiating client connection, connectString=127.0.0.1:24952 sessionTimeout=60000 watcher=org.apache.solr.common.cloud.ConnectionManager@258e1d5c
[junit4:junit4]   2> 7891 T298 oascc.ConnectionManager.waitForConnected Waiting for client to connect to ZooKeeper
[junit4:junit4]   2> 7891 T351 oaz.ClientCnxn$SendThread.logStartConnect Opening socket connection to server localhost/127.0.0.1:24952. Will not attempt to authenticate using SASL (access denied ("javax.security.auth.AuthPermission" "getLoginConfiguration"))
[junit4:junit4]   2> 7892 T351 oaz.ClientCnxn$SendThread.primeConnection Socket connection established to localhost/127.0.0.1:24952, initiating session
[junit4:junit4]   2> 7893 T300 oazs.NIOServerCnxnFactory.run Accepted socket connection from /140.211.11.196:24963
[junit4:junit4]   2> 7893 T300 oazs.ZooKeeperServer.processConnectRequest Client attempting to establish new session at /140.211.11.196:24963
[junit4:junit4]   2> 7895 T302 oazs.ZooKeeperServer.finishSessionInit Established session 0x13c4459efcb0007 with negotiated timeout 20000 for client /140.211.11.196:24963
[junit4:junit4]   2> 7895 T351 oaz.ClientCnxn$SendThread.onConnected Session establishment complete on server localhost/127.0.0.1:24952, sessionid = 0x13c4459efcb0007, negotiated timeout = 20000
[junit4:junit4]   2> 7896 T352 oascc.ConnectionManager.process Watcher org.apache.solr.common.cloud.ConnectionManager@258e1d5c name:ZooKeeperConnection Watcher:127.0.0.1:24952 got event WatchedEvent state:SyncConnected type:None path:null path:null type:None
[junit4:junit4]   2> 7896 T298 oascc.ConnectionManager.waitForConnected Client is connected to ZooKeeper
[junit4:junit4]   2> 7898 T303 oazs.PrepRequestProcessor.pRequest2Txn Processed session termination for sessionid: 0x13c4459efcb0007
[junit4:junit4]   2> 7913 T352 oaz.ClientCnxn$EventThread.run EventThread shut down
[junit4:junit4]   2> 7913 T298 oaz.ZooKeeper.close Session: 0x13c4459efcb0007 closed
[junit4:junit4]   2> 7913 T300 oazs.NIOServerCnxn.closeSock Closed socket connection for client /140.211.11.196:24963 which had sessionid 0x13c4459efcb0007
[junit4:junit4]   2> 7914 T298 oascsi.HttpClientUtil.createClient Creating new http client, config:maxConnections=500&maxConnectionsPerHost=16&socketTimeout=60000&connTimeout=15000
[junit4:junit4]   2> 7927 T298 oaz.ZooKeeper.<init> Initiating client connection, connectString=127.0.0.1:24952/solr sessionTimeout=30000 watcher=org.apache.solr.common.cloud.ConnectionManager@eb0008f
[junit4:junit4]   2> 7928 T298 oascc.ConnectionManager.waitForConnected Waiting for client to connect to ZooKeeper
[junit4:junit4]   2> 7929 T353 oaz.ClientCnxn$SendThread.logStartConnect Opening socket connection to server localhost/127.0.0.1:24952. Will not attempt to authenticate using SASL (access denied ("javax.security.auth.AuthPermission" "getLoginConfiguration"))
[junit4:junit4]   2> 7929 T353 oaz.ClientCnxn$SendThread.primeConnection Socket connection established to localhost/127.0.0.1:24952, initiating session
[junit4:junit4]   2> 7930 T300 oazs.NIOServerCnxnFactory.run Accepted socket connection from /140.211.11.196:24964
[junit4:junit4]   2> 7930 T300 oazs.ZooKeeperServer.processConnectRequest Client attempting to establish new session at /140.211.11.196:24964
[junit4:junit4]   2> 7932 T302 oazs.ZooKeeperServer.finishSessionInit Established session 0x13c4459efcb0008 with negotiated timeout 20000 for client /140.211.11.196:24964
[junit4:junit4]   2> 7932 T353 oaz.ClientCnxn$SendThread.onConnected Session establishment complete on server localhost/127.0.0.1:24952, sessionid = 0x13c4459efcb0008, negotiated timeout = 20000
[junit4:junit4]   2> 7932 T354 oascc.ConnectionManager.process Watcher org.apache.solr.common.cloud.ConnectionManager@eb0008f name:ZooKeeperConnection Watcher:127.0.0.1:24952/solr got event WatchedEvent state:SyncConnected type:None path:null path:null type:None
[junit4:junit4]   2> 7932 T298 oascc.ConnectionManager.waitForConnected Client is connected to ZooKeeper
[junit4:junit4]   2> 7934 T303 oazs.PrepRequestProcessor.pRequest Got user-level KeeperException when processing sessionid:0x13c4459efcb0008 type:create cxid:0x1 zxid:0x6c txntype:-1 reqpath:n/a Error Path:/solr/overseer Error:KeeperErrorCode = NodeExists for /solr/overseer
[junit4:junit4]   2> 7936 T303 oazs.PrepRequestProcessor.pRequest Got user-level KeeperException when processing sessionid:0x13c4459efcb0008 type:create cxid:0x2 zxid:0x6d txntype:-1 reqpath:n/a Error Path:/solr/overseer Error:KeeperErrorCode = NodeExists for /solr/overseer
[junit4:junit4]   2> 7938 T298 oasc.ZkController.createEphemeralLiveNode Register node as live in ZooKeeper:/live_nodes/127.0.0.1:24962_
[junit4:junit4]   2> 7939 T303 oazs.PrepRequestProcessor.pRequest Got user-level KeeperException when processing sessionid:0x13c4459efcb0008 type:delete cxid:0x4 zxid:0x6e txntype:-1 reqpath:n/a Error Path:/solr/live_nodes/127.0.0.1:24962_ Error:KeeperErrorCode = NoNode for /solr/live_nodes/127.0.0.1:24962_
[junit4:junit4]   2> 7945 T298 oascc.SolrZkClient.makePath makePath: /live_nodes/127.0.0.1:24962_
[junit4:junit4]   2> 7948 T339 oascc.ZkStateReader$2.process A cluster state change: WatchedEvent state:SyncConnected type:NodeChildrenChanged path:/live_nodes, has occurred - updating... (live nodes size: 2)
[junit4:junit4]   2> 7949 T320 oascc.ZkStateReader$3.process Updating live nodes... (3)
[junit4:junit4]   2> 7949 T326 oascc.ZkStateReader$3.process Updating live nodes... (3)
[junit4:junit4]   2> 7949 T320 oascc.ZkStateReader$2.process A cluster state change: WatchedEvent state:SyncConnected type:NodeChildrenChanged path:/live_nodes, has occurred - updating... (live nodes size: 3)
[junit4:junit4]   2> 7950 T326 oascc.ZkStateReader$2.process A cluster state change: WatchedEvent state:SyncConnected type:NodeChildrenChanged path:/live_nodes, has occurred - updating... (live nodes size: 3)
[junit4:junit4]   2> 7951 T339 oascc.ZkStateReader$3.process Updating live nodes... (3)
[junit4:junit4]   2> 7955 T298 oascc.ZkStateReader.createClusterStateWatchersAndUpdate Updating cluster state from ZooKeeper... 
[junit4:junit4]   2> 7964 T355 oasc.CoreContainer.create Creating SolrCore 'collection1' using instanceDir: /usr/home/hudson/hudson-slave/workspace/Lucene-Solr-Tests-4.x-java7/solr/build/solr-core/test/J0/./org.apache.solr.cloud.BasicDistributedZkTest-jetty2-1358356417713/collection1
[junit4:junit4]   2> 7964 T355 oasc.ZkController.createCollectionZkNode Check for collection zkNode:collection1
[junit4:junit4]   2> 7966 T355 oasc.ZkController.createCollectionZkNode Collection zkNode exists
[junit4:junit4]   2> 7966 T355 oasc.ZkController.readConfigName Load collection config from:/collections/collection1
[junit4:junit4]   2> 7968 T355 oasc.SolrResourceLoader.<init> new SolrResourceLoader for directory: '/usr/home/hudson/hudson-slave/workspace/Lucene-Solr-Tests-4.x-java7/solr/build/solr-core/test/J0/./org.apache.solr.cloud.BasicDistributedZkTest-jetty2-1358356417713/collection1/'
[junit4:junit4]   2> 7969 T355 oasc.SolrResourceLoader.replaceClassLoader Adding 'file:/usr/home/hudson/hudson-slave/workspace/Lucene-Solr-Tests-4.x-java7/solr/build/solr-core/test/J0/org.apache.solr.cloud.BasicDistributedZkTest-jetty2-1358356417713/collection1/lib/classes/' to classloader
[junit4:junit4]   2> 7970 T355 oasc.SolrResourceLoader.replaceClassLoader Adding 'file:/usr/home/hudson/hudson-slave/workspace/Lucene-Solr-Tests-4.x-java7/solr/build/solr-core/test/J0/org.apache.solr.cloud.BasicDistributedZkTest-jetty2-1358356417713/collection1/lib/README' to classloader
[junit4:junit4]   2> 8009 T355 oasc.SolrConfig.<init> Using Lucene MatchVersion: LUCENE_42
[junit4:junit4]   2> 8061 T355 oasc.SolrConfig.<init> Loaded SolrConfig: solrconfig.xml
[junit4:junit4]   2> 8162 T355 oass.IndexSchema.readSchema Reading Solr Schema
[junit4:junit4]   2> 8168 T355 oass.IndexSchema.readSchema Schema name=test
[junit4:junit4]   2> 8639 T355 oass.OpenExchangeRatesOrgProvider.init Initialized with rates=open-exchange-rates.json, refreshInterval=1440.
[junit4:junit4]   2> 8647 T355 oass.IndexSchema.readSchema default search field in schema is text
[junit4:junit4]   2> 8650 T355 oass.IndexSchema.readSchema unique key field: id
[junit4:junit4]   2> 8671 T355 oass.FileExchangeRateProvider.reload Reloading exchange rates from file currency.xml
[junit4:junit4]   2> 8676 T355 oass.FileExchangeRateProvider.reload Reloading exchange rates from file currency.xml
[junit4:junit4]   2> 8681 T355 oass.OpenExchangeRatesOrgProvider.reload Reloading exchange rates from open-exchange-rates.json
[junit4:junit4]   2> 8683 T355 oass.OpenExchangeRatesOrgProvider.reload Reloading exchange rates from open-exchange-rates.json
[junit4:junit4]   2> 8684 T355 oasc.SolrCore.<init> [collection1] Opening new SolrCore at /usr/home/hudson/hudson-slave/workspace/Lucene-Solr-Tests-4.x-java7/solr/build/solr-core/test/J0/./org.apache.solr.cloud.BasicDistributedZkTest-jetty2-1358356417713/collection1/, dataDir=./org.apache.solr.cloud.BasicDistributedZkTest-1358356410118/jetty2/
[junit4:junit4]   2> 8685 T355 oasc.JmxMonitoredMap.<init> JMX monitoring is enabled. Adding Solr mbeans to JMX Server: com.sun.jmx.mbeanserver.JmxMBeanServer@6cd44892
[junit4:junit4]   2> 8685 T355 oasc.SolrCore.initDirectoryFactory solr.NRTCachingDirectoryFactory
[junit4:junit4]   2> 8686 T355 oasc.CachingDirectoryFactory.get return new directory for /usr/home/hudson/hudson-slave/workspace/Lucene-Solr-Tests-4.x-java7/solr/build/solr-core/test/J0/./org.apache.solr.cloud.BasicDistributedZkTest-1358356410118/jetty2 forceNew:false
[junit4:junit4]   2> 8686 T355 oasc.CachingDirectoryFactory.close Releasing directory:/usr/home/hudson/hudson-slave/workspace/Lucene-Solr-Tests-4.x-java7/solr/build/solr-core/test/J0/./org.apache.solr.cloud.BasicDistributedZkTest-1358356410118/jetty2
[junit4:junit4]   2> 8687 T355 oasc.SolrCore.getNewIndexDir New index directory detected: old=null new=./org.apache.solr.cloud.BasicDistributedZkTest-1358356410118/jetty2/index/
[junit4:junit4]   2> 8687 T355 oasc.SolrCore.initIndex WARNING [collection1] Solr index directory './org.apache.solr.cloud.BasicDistributedZkTest-1358356410118/jetty2/index' doesn't exist. Creating new index...
[junit4:junit4]   2> 8688 T355 oasc.CachingDirectoryFactory.get return new directory for /usr/home/hudson/hudson-slave/workspace/Lucene-Solr-Tests-4.x-java7/solr/build/solr-core/test/J0/./org.apache.solr.cloud.BasicDistributedZkTest-1358356410118/jetty2/index forceNew:false
[junit4:junit4]   2> 8723 T355 oasc.SolrDeletionPolicy.onCommit SolrDeletionPolicy.onCommit: commits:num=1
[junit4:junit4]   2> 		commit{dir=RateLimitedDirectoryWrapper(NRTCachingDirectory(org.apache.lucene.store.NIOFSDirectory@/usr/home/hudson/hudson-slave/workspace/Lucene-Solr-Tests-4.x-java7/solr/build/solr-core/test/J0/org.apache.solr.cloud.BasicDistributedZkTest-1358356410118/jetty2/index lockFactory=org.apache.lucene.store.NativeFSLockFactory@367b3d35; maxCacheMB=48.0 maxMergeSizeMB=4.0)),segFN=segments_1,generation=1,filenames=[segments_1]
[junit4:junit4]   2> 8723 T355 oasc.SolrDeletionPolicy.updateCommits newest commit = 1[segments_1]
[junit4:junit4]   2> 8724 T355 oasc.CachingDirectoryFactory.close Releasing directory:/usr/home/hudson/hudson-slave/workspace/Lucene-Solr-Tests-4.x-java7/solr/build/solr-core/test/J0/./org.apache.solr.cloud.BasicDistributedZkTest-1358356410118/jetty2/index
[junit4:junit4]   2> 8724 T355 oasc.SolrCore.initWriters created xml: solr.XMLResponseWriter
[junit4:junit4]   2> 8727 T355 oasup.UpdateRequestProcessorChain.init inserting DistributedUpdateProcessorFactory into updateRequestProcessorChain "dedupe"
[junit4:junit4]   2> 8727 T355 oasup.UpdateRequestProcessorChain.init inserting DistributedUpdateProcessorFactory into updateRequestProcessorChain "dedupe-allfields"
[junit4:junit4]   2> 8727 T355 oasup.UpdateRequestProcessorChain.init inserting DistributedUpdateProcessorFactory into updateRequestProcessorChain "stored_sig"
[junit4:junit4]   2> 8727 T355 oasup.UpdateRequestProcessorChain.init inserting DistributedUpdateProcessorFactory into updateRequestProcessorChain "uniq-fields"
[junit4:junit4]   2> 8728 T355 oasup.UpdateRequestProcessorChain.init inserting DistributedUpdateProcessorFactory into updateRequestProcessorChain "distrib-dup-test-chain-implicit"
[junit4:junit4]   2> 8728 T355 oasc.RequestHandlers.initHandlersFromConfig adding lazy requestHandler: solr.ReplicationHandler
[junit4:junit4]   2> 8729 T355 oasc.RequestHandlers.initHandlersFromConfig created /replication: solr.ReplicationHandler
[junit4:junit4]   2> 8729 T355 oasc.RequestHandlers.initHandlersFromConfig created standard: solr.StandardRequestHandler
[junit4:junit4]   2> 8730 T355 oasc.RequestHandlers.initHandlersFromConfig created /get: solr.RealTimeGetHandler
[junit4:junit4]   2> 8730 T355 oasc.RequestHandlers.initHandlersFromConfig created dismax: solr.SearchHandler
[junit4:junit4]   2> 8731 T355 oasc.RequestHandlers.initHandlersFromConfig created mock: org.apache.solr.core.MockQuerySenderListenerReqHandler
[junit4:junit4]   2> 8731 T355 oasc.RequestHandlers.initHandlersFromConfig created /admin/: org.apache.solr.handler.admin.AdminHandlers
[junit4:junit4]   2> 8732 T355 oasc.RequestHandlers.initHandlersFromConfig created defaults: solr.StandardRequestHandler
[junit4:junit4]   2> 8732 T355 oasc.RequestHandlers.initHandlersFromConfig adding lazy requestHandler: solr.StandardRequestHandler
[junit4:junit4]   2> 8732 T355 oasc.RequestHandlers.initHandlersFromConfig created lazy: solr.StandardRequestHandler
[junit4:junit4]   2> 8733 T355 oasc.RequestHandlers.initHandlersFromConfig created /update: solr.UpdateRequestHandler
[junit4:junit4]   2> 8734 T355 oasc.RequestHandlers.initHandlersFromConfig created /terms: org.apache.solr.handler.component.SearchHandler
[junit4:junit4]   2> 8734 T355 oasc.RequestHandlers.initHandlersFromConfig created spellCheckCompRH: org.apache.solr.handler.component.SearchHandler
[junit4:junit4]   2> 8735 T355 oasc.RequestHandlers.initHandlersFromConfig created spellCheckCompRH_Direct: org.apache.solr.handler.component.SearchHandler
[junit4:junit4]   2> 8735 T355 oasc.RequestHandlers.initHandlersFromConfig created spellCheckWithWordbreak: org.apache.solr.handler.component.SearchHandler
[junit4:junit4]   2> 8736 T355 oasc.RequestHandlers.initHandlersFromConfig created spellCheckWithWordbreak_Direct: org.apache.solr.handler.component.SearchHandler
[junit4:junit4]   2> 8736 T355 oasc.RequestHandlers.initHandlersFromConfig created spellCheckCompRH1: org.apache.solr.handler.component.SearchHandler
[junit4:junit4]   2> 8737 T355 oasc.RequestHandlers.initHandlersFromConfig created mltrh: org.apache.solr.handler.component.SearchHandler
[junit4:junit4]   2> 8737 T355 oasc.RequestHandlers.initHandlersFromConfig created tvrh: org.apache.solr.handler.component.SearchHandler
[junit4:junit4]   2> 8738 T355 oasc.RequestHandlers.initHandlersFromConfig created /mlt: solr.MoreLikeThisHandler
[junit4:junit4]   2> 8738 T355 oasc.RequestHandlers.initHandlersFromConfig created /debug/dump: solr.DumpRequestHandler
[junit4:junit4]   2> 8747 T355 oashl.XMLLoader.init xsltCacheLifetimeSeconds=60
[junit4:junit4]   2> 8751 T355 oasc.SolrCore.initDeprecatedSupport WARNING solrconfig.xml uses deprecated <admin/gettableFiles>, Please update your config to use the ShowFileRequestHandler.
[junit4:junit4]   2> 8752 T355 oasc.SolrCore.initDeprecatedSupport WARNING adding ShowFileRequestHandler with hidden files: [SCHEMA.XML, OLD_SYNONYMS.TXT, STOPWORDS.TXT, PROTWORDS.TXT, OPEN-EXCHANGE-RATES.JSON, SYNONYMS.TXT, CURRENCY.XML, MAPPING-ISOLATIN1ACCENT.TXT]
[junit4:junit4]   2> 8755 T355 oasc.CachingDirectoryFactory.close Releasing directory:/usr/home/hudson/hudson-slave/workspace/Lucene-Solr-Tests-4.x-java7/solr/build/solr-core/test/J0/./org.apache.solr.cloud.BasicDistributedZkTest-1358356410118/jetty2
[junit4:junit4]   2> 8756 T355 oass.SolrIndexSearcher.<init> Opening Searcher@5aa13208 main
[junit4:junit4]   2> 8757 T355 oasu.CommitTracker.<init> Hard AutoCommit: disabled
[junit4:junit4]   2> 8757 T355 oasu.CommitTracker.<init> Soft AutoCommit: disabled
[junit4:junit4]   2> 8758 T355 oashc.SpellCheckComponent.inform Initializing spell checkers
[junit4:junit4]   2> 8764 T355 oass.DirectSolrSpellChecker.init init: {name=direct,classname=DirectSolrSpellChecker,field=lowerfilt,minQueryLength=3}
[junit4:junit4]   2> 8828 T356 oasc.SolrCore.registerSearcher [collection1] Registered new searcher Searcher@5aa13208 main{StandardDirectoryReader(segments_1:1)}
[junit4:junit4]   2> 8833 T355 oasc.ZkController.publish publishing core=collection1 state=down
[junit4:junit4]   2> 8833 T355 oasc.ZkController.publish numShards not found on descriptor - reading it from system property
[junit4:junit4]   2> 9061 T321 oascc.ZkStateReader.updateClusterState Updating cloud state from ZooKeeper... 
[junit4:junit4]   2> 9062 T321 oasc.Overseer$ClusterStateUpdater.updateState Update state numShards=2 message={
[junit4:junit4]   2> 	  "operation":"state",
[junit4:junit4]   2> 	  "numShards":"2",
[junit4:junit4]   2> 	  "shard":"shard1",
[junit4:junit4]   2> 	  "roles":null,
[junit4:junit4]   2> 	  "state":"active",
[junit4:junit4]   2> 	  "core":"collection1",
[junit4:junit4]   2> 	  "collection":"collection1",
[junit4:junit4]   2> 	  "node_name":"127.0.0.1:24959_",
[junit4:junit4]   2> 	  "base_url":"http://127.0.0.1:24959"}
[junit4:junit4]   2> 9068 T321 oasc.Overseer$ClusterStateUpdater.updateState Update state numShards=2 message={
[junit4:junit4]   2> 	  "operation":"state",
[junit4:junit4]   2> 	  "numShards":"2",
[junit4:junit4]   2> 	  "shard":null,
[junit4:junit4]   2> 	  "roles":null,
[junit4:junit4]   2> 	  "state":"down",
[junit4:junit4]   2> 	  "core":"collection1",
[junit4:junit4]   2> 	  "collection":"collection1",
[junit4:junit4]   2> 	  "node_name":"127.0.0.1:24962_",
[junit4:junit4]   2> 	  "base_url":"http://127.0.0.1:24962"}
[junit4:junit4]   2> 9068 T321 oasc.Overseer$ClusterStateUpdater.updateState Collection already exists with numShards=2
[junit4:junit4]   2> 9068 T321 oasc.Overseer$ClusterStateUpdater.updateState Assigning new node to shard shard=shard2
[junit4:junit4]   2> 9081 T339 oascc.ZkStateReader$2.process A cluster state change: WatchedEvent state:SyncConnected type:NodeDataChanged path:/clusterstate.json, has occurred - updating... (live nodes size: 3)
[junit4:junit4]   2> 9081 T320 oascc.ZkStateReader$2.process A cluster state change: WatchedEvent state:SyncConnected type:NodeDataChanged path:/clusterstate.json, has occurred - updating... (live nodes size: 3)
[junit4:junit4]   2> 9081 T326 oascc.ZkStateReader$2.process A cluster state change: WatchedEvent state:SyncConnected type:NodeDataChanged path:/clusterstate.json, has occurred - updating... (live nodes size: 3)
[junit4:junit4]   2> 9081 T354 oascc.ZkStateReader$2.process A cluster state change: WatchedEvent state:SyncConnected type:NodeDataChanged path:/clusterstate.json, has occurred - updating... (live nodes size: 3)
[junit4:junit4]   2> 9836 T355 oasc.CoreContainer.registerCore registering core: collection1
[junit4:junit4]   2> 9836 T355 oasc.ZkController.register Register replica - core:collection1 address:http://127.0.0.1:24962 collection:collection1 shard:shard2
[junit4:junit4]   2> 9837 T355 oascc.SolrZkClient.makePath makePath: /collections/collection1/leader_elect/shard2/election
[junit4:junit4]   2> 9858 T303 oazs.PrepRequestProcessor.pRequest Got user-level KeeperException when processing sessionid:0x13c4459efcb0008 type:delete cxid:0x42 zxid:0x7c txntype:-1 reqpath:n/a Error Path:/solr/collections/collection1/leaders/shard2 Error:KeeperErrorCode = NoNode for /solr/collections/collection1/leaders/shard2
[junit4:junit4]   2> 9859 T355 oasc.ShardLeaderElectionContext.runLeaderProcess Running the leader process.
[junit4:junit4]   2> 9860 T303 oazs.PrepRequestProcessor.pRequest Got user-level KeeperException when processing sessionid:0x13c4459efcb0008 type:create cxid:0x43 zxid:0x7d txntype:-1 reqpath:n/a Error Path:/solr/overseer Error:KeeperErrorCode = NodeExists for /solr/overseer
[junit4:junit4]   2> 9862 T355 oasc.ShardLeaderElectionContext.waitForReplicasToComeUp Enough replicas found to continue.
[junit4:junit4]   2> 9863 T355 oasc.ShardLeaderElectionContext.runLeaderProcess I may be the new leader - try and sync
[junit4:junit4]   2> 9863 T355 oasc.SyncStrategy.sync Sync replicas to http://127.0.0.1:24962/collection1/
[junit4:junit4]   2> 9863 T355 oasc.SyncStrategy.syncReplicas Sync Success - now sync replicas to me
[junit4:junit4]   2> 9864 T355 oasc.SyncStrategy.syncToMe http://127.0.0.1:24962/collection1/ has no replicas
[junit4:junit4]   2> 9864 T355 oasc.ShardLeaderElectionContext.runLeaderProcess I am the new leader: http://127.0.0.1:24962/collection1/
[junit4:junit4]   2> 9864 T355 oascc.SolrZkClient.makePath makePath: /collections/collection1/leaders/shard2
[junit4:junit4]   2> 9869 T303 oazs.PrepRequestProcessor.pRequest Got user-level KeeperException when processing sessionid:0x13c4459efcb0008 type:create cxid:0x4c zxid:0x80 txntype:-1 reqpath:n/a Error Path:/solr/overseer Error:KeeperErrorCode = NodeExists for /solr/overseer
[junit4:junit4]   2> 10595 T321 oascc.ZkStateReader.updateClusterState Updating cloud state from ZooKeeper... 
[junit4:junit4]   2> 10690 T320 oascc.ZkStateReader$2.process A cluster state change: WatchedEvent state:SyncConnected type:NodeDataChanged path:/clusterstate.json, has occurred - updating... (live nodes size: 3)
[junit4:junit4]   2> 10690 T326 oascc.ZkStateReader$2.process A cluster state change: WatchedEvent state:SyncConnected type:NodeDataChanged path:/clusterstate.json, has occurred - updating... (live nodes size: 3)
[junit4:junit4]   2> 10690 T339 oascc.ZkStateReader$2.process A cluster state change: WatchedEvent state:SyncConnected type:NodeDataChanged path:/clusterstate.json, has occurred - updating... (live nodes size: 3)
[junit4:junit4]   2> 10690 T354 oascc.ZkStateReader$2.process A cluster state change: WatchedEvent state:SyncConnected type:NodeDataChanged path:/clusterstate.json, has occurred - updating... (live nodes size: 3)
[junit4:junit4]   2> 10697 T355 oasc.ZkController.register We are http://127.0.0.1:24962/collection1/ and leader is http://127.0.0.1:24962/collection1/
[junit4:junit4]   2> 10697 T355 oasc.ZkController.register No LogReplay needed for core=collection1 baseURL=http://127.0.0.1:24962
[junit4:junit4]   2> 10697 T355 oasc.ZkController.checkRecovery I am the leader, no recovery necessary
[junit4:junit4]   2> 10697 T355 oasc.ZkController.publish publishing core=collection1 state=active
[junit4:junit4]   2> 10698 T355 oasc.ZkController.publish numShards not found on descriptor - reading it from system property
[junit4:junit4]   2> 10743 T355 oascc.ZkStateReader.updateClusterState Updating cloud state from ZooKeeper... 
[junit4:junit4]   2> 10745 T298 oass.SolrDispatchFilter.init user.dir=/usr/home/hudson/hudson-slave/workspace/Lucene-Solr-Tests-4.x-java7/solr/build/solr-core/test/J0
[junit4:junit4]   2> 10745 T298 oass.SolrDispatchFilter.init SolrDispatchFilter.init() done
[junit4:junit4]   2> 10746 T298 oascsi.HttpClientUtil.createClient Creating new http client, config:maxConnections=128&maxConnectionsPerHost=32&followRedirects=false
[junit4:junit4]   2> 10935 T298 oejs.Server.doStart jetty-8.1.8.v20121106
[junit4:junit4]   2> 10938 T298 oejs.AbstractConnector.doStart Started SocketConnector@127.0.0.1:24965
[junit4:junit4]   2> 10939 T298 oass.SolrDispatchFilter.init SolrDispatchFilter.init()
[junit4:junit4]   2> 10939 T298 oasc.SolrResourceLoader.locateSolrHome JNDI not configured for solr (NoInitialContextEx)
[junit4:junit4]   2> 10940 T298 oasc.SolrResourceLoader.locateSolrHome using system property solr.solr.home: /usr/home/hudson/hudson-slave/workspace/Lucene-Solr-Tests-4.x-java7/solr/build/solr-core/test/J0/./org.apache.solr.cloud.BasicDistributedZkTest-jetty3-1358356420875
[junit4:junit4]   2> 10940 T298 oasc.CoreContainer$Initializer.initialize looking for solr.xml: /usr/home/hudson/hudson-slave/workspace/Lucene-Solr-Tests-4.x-java7/solr/build/solr-core/test/J0/./org.apache.solr.cloud.BasicDistributedZkTest-jetty3-1358356420875/solr.xml
[junit4:junit4]   2> 10941 T298 oasc.CoreContainer.<init> New CoreContainer 24314271
[junit4:junit4]   2> 10942 T298 oasc.CoreContainer.load Loading CoreContainer using Solr Home: '/usr/home/hudson/hudson-slave/workspace/Lucene-Solr-Tests-4.x-java7/solr/build/solr-core/test/J0/./org.apache.solr.cloud.BasicDistributedZkTest-jetty3-1358356420875/'
[junit4:junit4]   2> 10942 T298 oasc.SolrResourceLoader.<init> new SolrResourceLoader for directory: '/usr/home/hudson/hudson-slave/workspace/Lucene-Solr-Tests-4.x-java7/solr/build/solr-core/test/J0/./org.apache.solr.cloud.BasicDistributedZkTest-jetty3-1358356420875/'
[junit4:junit4]   2> 11000 T298 oashc.HttpShardHandlerFactory.getParameter Setting socketTimeout to: 60000
[junit4:junit4]   2> 11001 T298 oashc.HttpShardHandlerFactory.getParameter Setting urlScheme to: http://
[junit4:junit4]   2> 11001 T298 oashc.HttpShardHandlerFactory.getParameter Setting connTimeout to: 15000
[junit4:junit4]   2> 11002 T298 oashc.HttpShardHandlerFactory.getParameter Setting maxConnectionsPerHost to: 20
[junit4:junit4]   2> 11002 T298 oashc.HttpShardHandlerFactory.getParameter Setting corePoolSize to: 0
[junit4:junit4]   2> 11003 T298 oashc.HttpShardHandlerFactory.getParameter Setting maximumPoolSize to: 2147483647
[junit4:junit4]   2> 11003 T298 oashc.HttpShardHandlerFactory.getParameter Setting maxThreadIdleTime to: 5
[junit4:junit4]   2> 11004 T298 oashc.HttpShardHandlerFactory.getParameter Setting sizeOfQueue to: -1
[junit4:junit4]   2> 11004 T298 oashc.HttpShardHandlerFactory.getParameter Setting fairnessPolicy to: false
[junit4:junit4]   2> 11005 T298 oascsi.HttpClientUtil.createClient Creating new http client, config:maxConnectionsPerHost=20&maxConnections=10000&socketTimeout=60000&connTimeout=15000&retry=false
[junit4:junit4]   2> 11026 T298 oasc.CoreContainer.load Registering Log Listener
[junit4:junit4]   2> 11046 T298 oasc.CoreContainer.initZooKeeper Zookeeper client=127.0.0.1:24952/solr
[junit4:junit4]   2> 11047 T298 oasc.ZkController.checkChrootPath zkHost includes chroot
[junit4:junit4]   2> 11048 T298 oaz.ZooKeeper.<init> Initiating client connection, connectString=127.0.0.1:24952 sessionTimeout=60000 watcher=org.apache.solr.common.cloud.ConnectionManager@649355b6
[junit4:junit4]   2> 11049 T298 oascc.ConnectionManager.waitForConnected Waiting for client to connect to ZooKeeper
[junit4:junit4]   2> 11050 T366 oaz.ClientCnxn$SendThread.logStartConnect Opening socket connection to server localhost/127.0.0.1:24952. Will not attempt to authenticate using SASL (access denied ("javax.security.auth.AuthPermission" "getLoginConfiguration"))
[junit4:junit4]   2> 11050 T366 oaz.ClientCnxn$SendThread.primeConnection Socket connection established to localhost/127.0.0.1:24952, initiating session
[junit4:junit4]   2> 11051 T300 oazs.NIOServerCnxnFactory.run Accepted socket connection from /140.211.11.196:24966
[junit4:junit4]   2> 11051 T300 oazs.ZooKeeperServer.processConnectRequest Client attempting to establish new session at /140.211.11.196:24966
[junit4:junit4]   2> 11057 T302 oazs.ZooKeeperServer.finishSessionInit Established session 0x13c4459efcb0009 with negotiated timeout 20000 for client /140.211.11.196:24966
[junit4:junit4]   2> 11057 T366 oaz.ClientCnxn$SendThread.onConnected Session establishment complete on server localhost/127.0.0.1:24952, sessionid = 0x13c4459efcb0009, negotiated timeout = 20000
[junit4:junit4]   2> 11057 T367 oascc.ConnectionManager.process Watcher org.apache.solr.common.cloud.ConnectionManager@649355b6 name:ZooKeeperConnection Watcher:127.0.0.1:24952 got event WatchedEvent state:SyncConnected type:None path:null path:null type:None
[junit4:junit4]   2> 11058 T298 oascc.ConnectionManager.waitForConnected Client is connected to ZooKeeper
[junit4:junit4]   2> 11059 T303 oazs.PrepRequestProcessor.pRequest2Txn Processed session termination for sessionid: 0x13c4459efcb0009
[junit4:junit4]   2> 11070 T367 oaz.ClientCnxn$EventThread.run EventThread shut down
[junit4:junit4]   2> 11070 T300 oazs.NIOServerCnxn.closeSock Closed socket connection for client /140.211.11.196:24966 which had sessionid 0x13c4459efcb0009
[junit4:junit4]   2> 11070 T298 oaz.ZooKeeper.close Session: 0x13c4459efcb0009 closed
[junit4:junit4]   2> 11071 T298 oascsi.HttpClientUtil.createClient Creating new http client, config:maxConnections=500&maxConnectionsPerHost=16&socketTimeout=60000&connTimeout=15000
[junit4:junit4]   2> 11079 T298 oaz.ZooKeeper.<init> Initiating client connection, connectString=127.0.0.1:24952/solr sessionTimeout=30000 watcher=org.apache.solr.common.cloud.ConnectionManager@58a6806f
[junit4:junit4]   2> 11081 T298 oascc.ConnectionManager.waitForConnected Waiting for client to connect to ZooKeeper
[junit4:junit4]   2> 11081 T368 oaz.ClientCnxn$SendThread.logStartConnect Opening socket connection to server localhost/127.0.0.1:24952. Will not attempt to authenticate using SASL (access denied ("javax.security.auth.AuthPermission" "getLoginConfiguration"))
[junit4:junit4]   2> 11082 T368 oaz.ClientCnxn$SendThread.primeConnection Socket connection established to localhost/127.0.0.1:24952, initiating session
[junit4:junit4]   2> 11082 T300 oazs.NIOServerCnxnFactory.run Accepted socket connection from /140.211.11.196:24967
[junit4:junit4]   2> 11082 T300 oazs.ZooKeeperServer.processConnectRequest Client attempting to establish new session at /140.211.11.196:24967
[junit4:junit4]   2> 11084 T302 oazs.ZooKeeperServer.finishSessionInit Established session 0x13c4459efcb000a with negotiated timeout 20000 for client /140.211.11.196:24967
[junit4:junit4]   2> 11084 T368 oaz.ClientCnxn$SendThread.onConnected Session establishment complete on server localhost/127.0.0.1:24952, sessionid = 0x13c4459efcb000a, negotiated timeout = 20000
[junit4:junit4]   2> 11084 T369 oascc.ConnectionManager.process Watcher org.apache.solr.common.cloud.ConnectionManager@58a6806f name:ZooKeeperConnection Watcher:127.0.0.1:24952/solr got event WatchedEvent state:SyncConnected type:None path:null path:null type:None
[junit4:junit4]   2> 11084 T298 oascc.ConnectionManager.waitForConnected Client is connected to ZooKeeper
[junit4:junit4]   2> 11086 T303 oazs.PrepRequestProcessor.pRequest Got user-level KeeperException when processing sessionid:0x13c4459efcb000a type:create cxid:0x1 zxid:0x8d txntype:-1 reqpath:n/a Error Path:/solr/overseer Error:KeeperErrorCode = NodeExists for /solr/overseer
[junit4:junit4]   2> 11088 T303 oazs.PrepRequestProcessor.pRequest Got user-level KeeperException when processing sessionid:0x13c4459efcb000a type:create cxid:0x2 zxid:0x8e txntype:-1 reqpath:n/a Error Path:/solr/overseer Error:KeeperErrorCode = NodeExists for /solr/overseer
[junit4:junit4]   2> 11096 T298 oasc.ZkController.createEphemeralLiveNode Register node as live in ZooKeeper:/live_nodes/127.0.0.1:24965_
[junit4:junit4]   2> 11097 T303 oazs.PrepRequestProcessor.pRequest Got user-level KeeperException when processing sessionid:0x13c4459efcb000a type:delete cxid:0x4 zxid:0x8f txntype:-1 reqpath:n/a Error Path:/solr/live_nodes/127.0.0.1:24965_ Error:KeeperErrorCode = NoNode for /solr/live_nodes/127.0.0.1:24965_
[junit4:junit4]   2> 11098 T298 oascc.SolrZkClient.makePath makePath: /live_nodes/127.0.0.1:24965_
[junit4:junit4]   2> 11101 T339 oascc.ZkStateReader$2.process A cluster state change: WatchedEvent state:SyncConnected type:NodeChildrenChanged path:/live_nodes, has occurred - updating... (live nodes size: 3)
[junit4:junit4]   2> 11102 T354 oascc.ZkStateReader$3.process Updating live nodes... (4)
[junit4:junit4]   2> 11102 T320 oascc.ZkStateReader$3.process Updating live nodes... (4)
[junit4:junit4]   2> 11102 T326 oascc.ZkStateReader$3.process Updating live nodes... (4)
[junit4:junit4]   2> 11102 T354 oascc.ZkStateReader$2.process A cluster state change: WatchedEvent state:SyncConnected type:NodeChildrenChanged path:/live_nodes, has occurred - updating... (live nodes size: 4)
[junit4:junit4]   2> 11103 T326 oascc.ZkStateReader$2.process A cluster state change: WatchedEvent state:SyncConnected type:NodeChildrenChanged path:/live_nodes, has occurred - updating... (live nodes size: 4)
[junit4:junit4]   2> 11102 T320 oascc.ZkStateReader$2.process A cluster state change: WatchedEvent state:SyncConnected type:NodeChildrenChanged path:/live_nodes, has occurred - updating... (live nodes size: 4)
[junit4:junit4]   2> 11105 T339 oascc.ZkStateReader$3.process Updating live nodes... (4)
[junit4:junit4]   2> 11107 T298 oascc.ZkStateReader.createClusterStateWatchersAndUpdate Updating cluster state from ZooKeeper... 
[junit4:junit4]   2> 11114 T370 oasc.CoreContainer.create Creating SolrCore 'collection1' using instanceDir: /usr/home/hudson/hudson-slave/workspace/Lucene-Solr-Tests-4.x-java7/solr/build/solr-core/test/J0/./org.apache.solr.cloud.BasicDistributedZkTest-jetty3-1358356420875/collection1
[junit4:junit4]   2> 11115 T370 oasc.ZkController.createCollectionZkNode Check for collection zkNode:collection1
[junit4:junit4]   2> 11116 T370 oasc.ZkController.createCollectionZkNode Collection zkNode exists
[junit4:junit4]   2> 11116 T370 oasc.ZkController.readConfigName Load collection config from:/collections/collection1
[junit4:junit4]   2> 11118 T370 oasc.SolrResourceLoader.<init> new SolrResourceLoader for directory: '/usr/home/hudson/hudson-slave/workspace/Lucene-Solr-Tests-4.x-java7/solr/build/solr-core/test/J0/./org.apache.solr.cloud.BasicDistributedZkTest-jetty3-1358356420875/collection1/'
[junit4:junit4]   2> 11119 T370 oasc.SolrResourceLoader.replaceClassLoader Adding 'file:/usr/home/hudson/hudson-slave/workspace/Lucene-Solr-Tests-4.x-java7/solr/build/solr-core/test/J0/org.apache.solr.cloud.BasicDistributedZkTest-jetty3-1358356420875/collection1/lib/classes/' to classloader
[junit4:junit4]   2> 11120 T370 oasc.SolrResourceLoader.replaceClassLoader Adding 'file:/usr/home/hudson/hudson-slave/workspace/Lucene-Solr-Tests-4.x-java7/solr/build/solr-core/test/J0/org.apache.solr.cloud.BasicDistributedZkTest-jetty3-1358356420875/collection1/lib/README' to classloader
[junit4:junit4]   2> 11177 T370 oasc.SolrConfig.<init> Using Lucene MatchVersion: LUCENE_42
[junit4:junit4]   2> 11250 T370 oasc.SolrConfig.<init> Loaded SolrConfig: solrconfig.xml
[junit4:junit4]   2> 11352 T370 oass.IndexSchema.readSchema Reading Solr Schema
[junit4:junit4]   2> 11361 T370 oass.IndexSchema.readSchema Schema name=test
[junit4:junit4]   2> 12016 T370 oass.OpenExchangeRatesOrgProvider.init Initialized with rates=open-exchange-rates.json, refreshInterval=1440.
[junit4:junit4]   2> 12028 T370 oass.IndexSchema.readSchema default search field in schema is text
[junit4:junit4]   2> 12032 T370 oass.IndexSchema.readSchema unique key field: id
[junit4:junit4]   2> 12055 T370 oass.FileExchangeRateProvider.reload Reloading exchange rates from file currency.xml
[junit4:junit4]   2> 12061 T370 oass.FileExchangeRateProvider.reload Reloading exchange rates from file currency.xml
[junit4:junit4]   2> 12066 T370 oass.OpenExchangeRatesOrgProvider.reload Reloading exchange rates from open-exchange-rates.json
[junit4:junit4]   2> 12068 T370 oass.OpenExchangeRatesOrgProvider.reload Reloading exchange rates from open-exchange-rates.json
[junit4:junit4]   2> 12070 T370 oasc.SolrCore.<init> [collection1] Opening new SolrCore at /usr/home/hudson/hudson-slave/workspace/Lucene-Solr-Tests-4.x-java7/solr/build/solr-core/test/J0/./org.apache.solr.cloud.BasicDistributedZkTest-jetty3-1358356420875/collection1/, dataDir=./org.apache.solr.cloud.BasicDistributedZkTest-1358356410118/jetty3/
[junit4:junit4]   2> 12070 T370 oasc.JmxMonitoredMap.<init> JMX monitoring is enabled. Adding Solr mbeans to JMX Server: com.sun.jmx.mbeanserver.JmxMBeanServer@6cd44892
[junit4:junit4]   2> 12071 T370 oasc.SolrCore.initDirectoryFactory solr.NRTCachingDirectoryFactory
[junit4:junit4]   2> 12072 T370 oasc.CachingDirectoryFactory.get return new directory for /usr/home/hudson/hudson-slave/workspace/Lucene-Solr-Tests-4.x-java7/solr/build/solr-core/test/J0/./org.apache.solr.cloud.BasicDistributedZkTest-1358356410118/jetty3 forceNew:false
[junit4:junit4]   2> 12073 T370 oasc.CachingDirectoryFactory.close Releasing directory:/usr/home/hudson/hudson-slave/workspace/Lucene-Solr-Tests-4.x-java7/solr/build/solr-core/test/J0/./org.apache.solr.cloud.BasicDistributedZkTest-1358356410118/jetty3
[junit4:junit4]   2> 12073 T370 oasc.SolrCore.getNewIndexDir New index directory detected: old=null new=./org.apache.solr.cloud.BasicDistributedZkTest-1358356410118/jetty3/index/
[junit4:junit4]   2> 12074 T370 oasc.SolrCore.initIndex WARNING [collection1] Solr index directory './org.apache.solr.cloud.BasicDistributedZkTest-1358356410118/jetty3/index' doesn't exist. Creating new index...
[junit4:junit4]   2> 12075 T370 oasc.CachingDirectoryFactory.get return new directory for /usr/home/hudson/hudson-slave/workspace/Lucene-Solr-Tests-4.x-java7/solr/build/solr-core/test/J0/./org.apache.solr.cloud.BasicDistributedZkTest-1358356410118/jetty3/index forceNew:false
[junit4:junit4]   2> 12083 T370 oasc.SolrDeletionPolicy.onCommit SolrDeletionPolicy.onCommit: commits:num=1
[junit4:junit4]   2> 		commit{dir=RateLimitedDirectoryWrapper(NRTCachingDirectory(org.apache.lucene.store.NIOFSDirectory@/usr/home/hudson/hudson-slave/workspace/Lucene-Solr-Tests-4.x-java7/solr/build/solr-core/test/J0/org.apache.solr.cloud.BasicDistributedZkTest-1358356410118/jetty3/index lockFactory=org.apache.lucene.store.NativeFSLockFactory@7264c6f7; maxCacheMB=48.0 maxMergeSizeMB=4.0)),segFN=segments_1,generation=1,filenames=[segments_1]
[junit4:junit4]   2> 12083 T370 oasc.SolrDeletionPolicy.updateCommits newest commit = 1[segments_1]
[junit4:junit4]   2> 12084 T370 oasc.CachingDirectoryFactory.close Releasing directory:/usr/home/hudson/hudson-slave/workspace/Lucene-Solr-Tests-4.x-java7/solr/build/solr-core/test/J0/./org.apache.solr.cloud.BasicDistributedZkTest-1358356410118/jetty3/index
[junit4:junit4]   2> 12084 T370 oasc.SolrCore.initWriters created xml: solr.XMLResponseWriter
[junit4:junit4]   2> 12087 T370 oasup.UpdateRequestProcessorChain.init inserting DistributedUpdateProcessorFactory into updateRequestProcessorChain "dedupe"
[junit4:junit4]   2> 12087 T370 oasup.UpdateRequestProcessorChain.init inserting DistributedUpdateProcessorFactory into updateRequestProcessorChain "dedupe-allfields"
[junit4:junit4]   2> 12088 T370 oasup.UpdateRequestProcessorChain.init inserting DistributedUpdateProcessorFactory into updateRequestProcessorChain "stored_sig"
[junit4:junit4]   2> 12088 T370 oasup.UpdateRequestProcessorChain.init inserting DistributedUpdateProcessorFactory into updateRequestProcessorChain "uniq-fields"
[junit4:junit4]   2> 12089 T370 oasup.UpdateRequestProcessorChain.init inserting DistributedUpdateProcessorFactory into updateRequestProcessorChain "distrib-dup-test-chain-implicit"
[junit4:junit4]   2> 12089 T370 oasc.RequestHandlers.initHandlersFromConfig adding lazy requestHandler: solr.ReplicationHandler
[junit4:junit4]   2> 12090 T370 oasc.RequestHandlers.initHandlersFromConfig created /replication: solr.ReplicationHandler
[junit4:junit4]   2> 12091 T370 oasc.RequestHandlers.initHandlersFromConfig created standard: solr.StandardRequestHandler
[junit4:junit4]   2> 12092 T370 oasc.RequestHandlers.initHandlersFromConfig created /get: solr.RealTimeGetHandler
[junit4:junit4]   2> 12093 T370 oasc.RequestHandlers.initHandlersFromConfig created dismax: solr.SearchHandler
[junit4:junit4]   2> 12093 T370 oasc.RequestHandlers.initHandlersFromConfig created mock: org.apache.solr.core.MockQuerySenderListenerReqHandler
[junit4:junit4]   2> 12094 T370 oasc.RequestHandlers.initHandlersFromConfig created /admin/: org.apache.solr.handler.admin.AdminHandlers
[junit4:junit4]   2> 12095 T370 oasc.RequestHandlers.initHandlersFromConfig created defaults: solr.StandardRequestHandler
[junit4:junit4]   2> 12095 T370 oasc.RequestHandlers.initHandlersFromConfig adding lazy requestHandler: solr.StandardRequestHandler
[junit4:junit4]   2> 12096 T370 oasc.RequestHandlers.initHandlersFromConfig created lazy: solr.StandardRequestHandler
[junit4:junit4]   2> 12097 T370 oasc.RequestHandlers.initHandlersFromConfig created /update: solr.UpdateRequestHandler
[junit4:junit4]   2> 12097 T370 oasc.RequestHandlers.initHandlersFromConfig created /terms: org.apache.solr.handler.component.SearchHandler
[junit4:junit4]   2> 12098 T370 oasc.RequestHandlers.initHandlersFromConfig created spellCheckCompRH: org.apache.solr.handler.component.SearchHandler
[junit4:junit4]   2> 12099 T370 oasc.RequestHandlers.initHandlersFromConfig created spellCheckCompRH_Direct: org.apache.solr.handler.component.SearchHandler
[junit4:junit4]   2> 12100 T370 oasc.RequestHandlers.initHandlersFromConfig created spellCheckWithWordbreak: org.apache.solr.handler.component.SearchHandler
[junit4:junit4]   2> 12100 T370 oasc.RequestHandlers.initHandlersFromConfig created spellCheckWithWordbreak_Direct: org.apache.solr.handler.component.SearchHandler
[junit4:junit4]   2> 12101 T370 oasc.RequestHandlers.initHandlersFromConfig created spellCheckCompRH1: org.apache.solr.handler.component.SearchHandler
[junit4:junit4]   2> 12102 T370 oasc.RequestHandlers.initHandlersFromConfig created mltrh: org.apache.solr.handler.component.SearchHandler
[junit4:junit4]   2> 12103 T370 oasc.RequestHandlers.initHandlersFromConfig created tvrh: org.apache.solr.handler.component.SearchHandler
[junit4:junit4]   2> 12103 T370 oasc.RequestHandlers.initHandlersFromConfig created /mlt: solr.MoreLikeThisHandler
[junit4:junit4]   2> 12104 T370 oasc.RequestHandlers.initHandlersFromConfig created /debug/dump: solr.DumpRequestHandler
[junit4:junit4]   2> 12117 T370 oashl.XMLLoader.init xsltCacheLifetimeSeconds=60
[junit4:junit4]   2> 12122 T370 oasc.SolrCore.initDeprecatedSupport WARNING solrconfig.xml uses deprecated <admin/gettableFiles>, Please update your config to use the ShowFileRequestHandler.
[junit4:junit4]   2> 12124 T370 oasc.SolrCore.initDeprecatedSupport WARNING adding ShowFileRequestHandler with hidden files: [SCHEMA.XML, OLD_SYNONYMS.TXT, STOPWORDS.TXT, PROTWORDS.TXT, OPEN-EXCHANGE-RATES.JSON, SYNONYMS.TXT, CURRENCY.XML, MAPPING-ISOLATIN1ACCENT.TXT]
[junit4:junit4]   2> 12126 T370 oasc.CachingDirectoryFactory.close Releasing directory:/usr/home/hudson/hudson-slave/workspace/Lucene-Solr-Tests-4.x-java7/solr/build/solr-core/test/J0/./org.apache.solr.cloud.BasicDistributedZkTest-1358356410118/jetty3
[junit4:junit4]   2> 12128 T370 oass.SolrIndexSearcher.<init> Opening Searcher@6e68f08d main
[junit4:junit4]   2> 12129 T370 oasu.CommitTracker.<init> Hard AutoCommit: disabled
[junit4:junit4]   2> 12130 T370 oasu.CommitTracker.<init> Soft AutoCommit: disabled
[junit4:junit4]   2> 12130 T370 oashc.SpellCheckComponent.inform Initializing spell checkers
[junit4:junit4]   2> 12138 T370 oass.DirectSolrSpellChecker.init init: {name=direct,classname=DirectSolrSpellChecker,field=lowerfilt,minQueryLength=3}
[junit4:junit4]   2> 12198 T371 oasc.SolrCore.registerSearcher [collection1] Registered new searcher Searcher@6e68f08d main{StandardDirectoryReader(segments_1:1)}
[junit4:junit4]   2> 12203 T370 oasc.ZkController.publish publishing core=collection1 state=down
[junit4:junit4]   2> 12204 T370 oasc.ZkController.publish numShards not found on descriptor - reading it from system property
[junit4:junit4]   2> 12246 T321 oascc.ZkStateReader.updateClusterState Updating cloud state from ZooKeeper... 
[junit4:junit4]   2> 12247 T321 oasc.Overseer$ClusterStateUpdater.updateState Update state numShards=2 message={
[junit4:junit4]   2> 	  "operation":"state",
[junit4:junit4]   2> 	  "numShards":"2",
[junit4:junit4]   2> 	  "shard":"shard2",
[junit4:junit4]   2> 	  "roles":null,
[junit4:junit4]   2> 	  "state":"active",
[junit4:junit4]   2> 	  "core":"collection1",
[junit4:junit4]   2> 	  "collection":"collection1",
[junit4:junit4]   2> 	  "node_name":"127.0.0.1:24962_",
[junit4:junit4]   2> 	  "base_url":"http://127.0.0.1:24962"}
[junit4:junit4]   2> 12252 T321 oasc.Overseer$ClusterStateUpdater.updateState Update state numShards=2 message={
[junit4:junit4]   2> 	  "operation":"state",
[junit4:junit4]   2> 	  "numShards":"2",
[junit4:junit4]   2> 	  "shard":null,
[junit4:junit4]   2> 	  "roles":null,
[junit4:junit4]   2> 	  "state":"down",
[junit4:junit4]   2> 	  "core":"collection1",
[junit4:junit4]   2> 	  "collection":"collection1",
[junit4:junit4]   2> 	  "node_name":"127.0.0.1:24965_",
[junit4:junit4]   2> 	  "base_url":"http://127.0.0.1:24965"}
[junit4:junit4]   2> 12252 T321 oasc.Overseer$ClusterStateUpdater.updateState Collection already exists with numShards=2
[junit4:junit4]   2> 12253 T321 oasc.Overseer$ClusterStateUpdater.updateState Assigning new node to shard shard=shard1
[junit4:junit4]   2> 12265 T354 oascc.ZkStateReader$2.process A cluster state change: WatchedEvent state:SyncConnected type:NodeDataChanged path:/clusterstate.json, has occurred - updating... (live nodes size: 4)
[junit4:junit4]   2> 12265 T320 oascc.ZkStateReader$2.process A cluster state change: WatchedEvent state:SyncConnected type:NodeDataChanged path:/clusterstate.json, has occurred - updating... (live nodes size: 4)
[junit4:junit4]   2> 12265 T326 oascc.ZkStateReader$2.process A cluster state change: WatchedEvent state:SyncConnected type:NodeDataChanged path:/clusterstate.json, has occurred - updating... (live nodes size: 4)
[junit4:junit4]   2> 12265 T369 oascc.ZkStateReader$2.process A cluster state change: WatchedEvent state:SyncConnected type:NodeDataChanged path:/clusterstate.json, has occurred - updating... (live nodes size: 4)
[junit4:junit4]   2> 12265 T339 oascc.ZkStateReader$2.process A cluster state change: WatchedEvent state:SyncConnected type:NodeDataChanged path:/clusterstate.json, has occurred - updating... (live nodes size: 4)
[junit4:junit4]   2> 13207 T370 oasc.CoreContainer.registerCore registering core: collection1
[junit4:junit4]   2> 13207 T370 oasc.ZkController.register Register replica - core:collection1 address:http://127.0.0.1:24965 collection:collection1 shard:shard1
[junit4:junit4]   2> 13212 T370 oasc.ZkController.register We are http://127.0.0.1:24965/collection1/ and leader is http://127.0.0.1:24959/collection1/
[junit4:junit4]   2> 13212 T370 oasc.ZkController.register No LogReplay needed for core=collection1 baseURL=http://127.0.0.1:24965
[junit4:junit4]   2> 13212 T370 oasc.ZkController.checkRecovery Core needs to recover:collection1
[junit4:junit4]   2> 13213 T370 oasu.DefaultSolrCoreState.doRecovery Running recovery - first canceling any ongoing recovery
[junit4:junit4]   2> ASYNC  NEW_CORE C12 name=collection1 org.apache.solr.core.SolrCore@132decf2 url=http://127.0.0.1:24965/collection1 node=127.0.0.1:24965_ C12_STATE=coll:collection1 core:collection1 props:{shard=null, roles=null, state=down, core=collection1, collection=collection1, node_name=127.0.0.1:24965_, base_url=http://127.0.0.1:24965}
[junit4:junit4]   2> 13220 T372 C12 P24965 oasc.RecoveryStrategy.run Starting recovery process.  core=collection1 recoveringAfterStartup=true
[junit4:junit4]   2> 13221 T372 C12 P24965 oasc.RecoveryStrategy.doRecovery ###### startupVersions=[]
[junit4:junit4]   2> 13221 T370 oascc.ZkStateReader.updateClusterState Updating cloud state from ZooKeeper... 
[junit4:junit4]   2> 13221 T372 C12 P24965 oasc.ZkController.publish publishing core=collection1 state=recovering
[junit4:junit4]   2> 13221 T372 C12 P24965 oasc.ZkController.publish numShards not found on descriptor - reading it from system property
[junit4:junit4]   2> 13222 T298 oass.SolrDispatchFilter.init user.dir=/usr/home/hudson/hudson-slave/workspace/Lucene-Solr-Tests-4.x-java7/solr/build/solr-core/test/J0
[junit4:junit4]   2> 13223 T298 oass.SolrDispatchFilter.init SolrDispatchFilter.init() done
[junit4:junit4]   2> 13223 T372 C12 P24965 oascsi.HttpClientUtil.createClient Creating new http client, config:maxConnections=128&maxConnectionsPerHost=32&followRedirects=false
[junit4:junit4]   2> 13223 T298 oascsi.HttpClientUtil.createClient Creating new http client, config:maxConnections=128&maxConnectionsPerHost=32&followRedirects=false
[junit4:junit4]   2> 13356 T298 oejs.Server.doStart jetty-8.1.8.v20121106
[junit4:junit4]   2> 13359 T298 oejs.AbstractConnector.doStart Started SocketConnector@127.0.0.1:24969
[junit4:junit4]   2> 13360 T298 oass.SolrDispatchFilter.init SolrDispatchFilter.init()
[junit4:junit4]   2> 13360 T298 oasc.SolrResourceLoader.locateSolrHome JNDI not configured for solr (NoInitialContextEx)
[junit4:junit4]   2> 13361 T298 oasc.SolrResourceLoader.locateSolrHome using system property solr.solr.home: /usr/home/hudson/hudson-slave/workspace/Lucene-Solr-Tests-4.x-java7/solr/build/solr-core/test/J0/./org.apache.solr.cloud.BasicDistributedZkTest-jetty4-1358356423349
[junit4:junit4]   2> 13361 T298 oasc.CoreContainer$Initializer.initialize looking for solr.xml: /usr/home/hudson/hudson-slave/workspace/Lucene-Solr-Tests-4.x-java7/solr/build/solr-core/test/J0/./org.apache.solr.cloud.BasicDistributedZkTest-jetty4-1358356423349/solr.xml
[junit4:junit4]   2> 13361 T298 oasc.CoreContainer.<init> New CoreContainer 1581701273
[junit4:junit4]   2> 13362 T298 oasc.CoreContainer.load Loading CoreContainer using Solr Home: '/usr/home/hudson/hudson-slave/workspace/Lucene-Solr-Tests-4.x-java7/solr/build/solr-core/test/J0/./org.apache.solr.cloud.BasicDistributedZkTest-jetty4-1358356423349/'
[junit4:junit4]   2> 13362 T298 oasc.SolrResourceLoader.<init> new SolrResourceLoader for directory: '/usr/home/hudson/hudson-slave/workspace/Lucene-Solr-Tests-4.x-java7/solr/build/solr-core/test/J0/./org.apache.solr.cloud.BasicDistributedZkTest-jetty4-1358356423349/'
[junit4:junit4]   2> 13401 T298 oashc.HttpShardHandlerFactory.getParameter Setting socketTimeout to: 60000
[junit4:junit4]   2> 13402 T298 oashc.HttpShardHandlerFactory.getParameter Setting urlScheme to: http://
[junit4:junit4]   2> 13402 T298 oashc.HttpShardHandlerFactory.getParameter Setting connTimeout to: 15000
[junit4:junit4]   2> 13402 T298 oashc.HttpShardHandlerFactory.getParameter Setting maxConnectionsPerHost to: 20
[junit4:junit4]   2> 13403 T298 oashc.HttpShardHandlerFactory.getParameter Setting corePoolSize to: 0
[junit4:junit4]   2> 13403 T298 oashc.HttpShardHandlerFactory.getParameter Setting maximumPoolSize to: 2147483647
[junit4:junit4]   2> 13403 T298 oashc.HttpShardHandlerFactory.getParameter Setting maxThreadIdleTime to: 5
[junit4:junit4]   2> 13404 T298 oashc.HttpShardHandlerFactory.getParameter Setting sizeOfQueue to: -1
[junit4:junit4]   2> 13404 T298 oashc.HttpShardHandlerFactory.getParameter Setting fairnessPolicy to: false
[junit4:junit4]   2> 13404 T298 oascsi.HttpClientUtil.createClient Creating new http client, config:maxConnectionsPerHost=20&maxConnections=10000&socketTimeout=60000&connTimeout=15000&retry=false
[junit4:junit4]   2> 13420 T298 oasc.CoreContainer.load Registering Log Listener
[junit4:junit4]   2> 13434 T298 oasc.CoreContainer.initZooKeeper Zookeeper client=127.0.0.1:24952/solr
[junit4:junit4]   2> 13435 T298 oasc.ZkController.checkChrootPath zkHost includes chroot
[junit4:junit4]   2> 13435 T298 oaz.ZooKeeper.<init> Initiating client connection, connectString=127.0.0.1:24952 sessionTimeout=60000 watcher=org.apache.solr.common.cloud.ConnectionManager@7709068f
[junit4:junit4]   2> 13436 T298 oascc.ConnectionManager.waitForConnected Waiting for client to connect to ZooKeeper
[junit4:junit4]   2> 13437 T382 oaz.ClientCnxn$SendThread.logStartConnect Opening socket connection to server localhost/127.0.0.1:24952. Will not attempt to authenticate using SASL (access denied ("javax.security.auth.AuthPermission" "getLoginConfiguration"))
[junit4:junit4]   2> 13438 T382 oaz.ClientCnxn$SendThread.primeConnection Socket connection established to localhost/127.0.0.1:24952, initiating session
[junit4:junit4]   2> 13438 T300 oazs.NIOServerCnxnFactory.run Accepted socket connection from /140.211.11.196:24970
[junit4:junit4]   2> 13438 T300 oazs.ZooKeeperServer.processConnectRequest Client attempting to establish new session at /140.211.11.196:24970
[junit4:junit4]   2> 13441 T302 oazs.ZooKeeperServer.finishSessionInit Established session 0x13c4459efcb000b with negotiated timeout 20000 for client /140.211.11.196:24970
[junit4:junit4]   2> 13441 T382 oaz.ClientCnxn$SendThread.onConnected Session establishment complete on server localhost/127.0.0.1:24952, sessionid = 0x13c4459efcb000b, negotiated timeout = 20000
[junit4:junit4]   2> 13441 T383 oascc.ConnectionManager.process Watcher org.apache.solr.common.cloud.ConnectionManager@7709068f name:ZooKeeperConnection Watcher:127.0.0.1:24952 got event WatchedEvent state:SyncConnected type:None path:null path:null type:None
[junit4:junit4]   2> 13442 T298 oascc.ConnectionManager.waitForConnected Client is connected to ZooKeeper
[junit4:junit4]   2> 13443 T303 oazs.PrepRequestProcessor.pRequest2Txn Processed session termination for sessionid: 0x13c4459efcb000b
[junit4:junit4]   2> 13455 T383 oaz.ClientCnxn$EventThread.run EventThread shut down
[junit4:junit4]   2> 13455 T300 oazs.NIOServerCnxn.closeSock Closed socket connection for client /140.211.11.196:24970 which had sessionid 0x13c4459efcb000b
[junit4:junit4]   2> 13455 T298 oaz.ZooKeeper.close Session: 0x13c4459efcb000b closed
[junit4:junit4]   2> 13456 T298 oascsi.HttpClientUtil.createClient Creating new http client, config:maxConnections=500&maxConnectionsPerHost=16&socketTimeout=60000&connTimeout=15000
[junit4:junit4]   2> 13464 T298 oaz.ZooKeeper.<init> Initiating client connection, connectString=127.0.0.1:24952/solr sessionTimeout=30000 watcher=org.apache.solr.common.cloud.ConnectionManager@17342542
[junit4:junit4]   2> 13466 T298 oascc.ConnectionManager.waitForConnected Waiting for client to connect to ZooKeeper
[junit4:junit4]   2> 13466 T384 oaz.ClientCnxn$SendThread.logStartConnect Opening socket connection to server localhost/127.0.0.1:24952. Will not attempt to authenticate using SASL (access denied ("javax.security.auth.AuthPermission" "getLoginConfiguration"))
[junit4:junit4]   2> 13466 T384 oaz.ClientCnxn$SendThread.primeConnection Socket connection established to localhost/127.0.0.1:24952, initiating session
[junit4:junit4]   2> 13467 T300 oazs.NIOServerCnxnFactory.run Accepted socket connection from /140.211.11.196:24971
[junit4:junit4]   2> 13467 T300 oazs.ZooKeeperServer.processConnectRequest Client attempting to establish new session at /140.211.11.196:24971
[junit4:junit4]   2> 13469 T302 oazs.ZooKeeperServer.finishSessionInit Established session 0x13c4459efcb000c with negotiated timeout 20000 for client /140.211.11.196:24971
[junit4:junit4]   2> 13469 T384 oaz.ClientCnxn$SendThread.onConnected Session establishment complete on server localhost/127.0.0.1:24952, sessionid = 0x13c4459efcb000c, negotiated timeout = 20000
[junit4:junit4]   2> 13469 T385 oascc.ConnectionManager.process Watcher org.apache.solr.common.cloud.ConnectionManager@17342542 name:ZooKeeperConnection Watcher:127.0.0.1:24952/solr got event WatchedEvent state:SyncConnected type:None path:null path:null type:None
[junit4:junit4]   2> 13469 T298 oascc.ConnectionManager.waitForConnected Client is connected to ZooKeeper
[junit4:junit4]   2> 13471 T303 oazs.PrepRequestProcessor.pRequest Got user-level KeeperException when processing sessionid:0x13c4459efcb000c type:create cxid:0x1 zxid:0x9f txntype:-1 reqpath:n/a Error Path:/solr/overseer Error:KeeperErrorCode = NodeExists for /solr/overseer
[junit4:junit4]   2> 13473 T303 oazs.PrepRequestProcessor.pRequest Got user-level KeeperException when processing sessionid:0x13c4459efcb000c type:create cxid:0x2 zxid:0xa0 txntype:-1 reqpath:n/a Error Path:/solr/overseer Error:KeeperErrorCode = NodeExists for /solr/overseer
[junit4:junit4]   2> 13480 T298 oasc.ZkController.createEphemeralLiveNode Register node as live in ZooKeeper:/live_nodes/127.0.0.1:24969_
[junit4:junit4]   2> 13481 T303 oazs.PrepRequestProcessor.pRequest Got user-level KeeperException when processing sessionid:0x13c4459efcb000c type:delete cxid:0x4 zxid:0xa1 txntype:-1 reqpath:n/a Error Path:/solr/live_nodes/127.0.0.1:24969_ Error:KeeperErrorCode = NoNode for /solr/live_nodes/127.0.0.1:24969_
[junit4:junit4]   2> 13482 T298 oascc.SolrZkClient.makePath makePath: /live_nodes/127.0.0.1:24969_
[junit4:junit4]   2> 13485 T339 oascc.ZkStateReader$2.process A cluster state change: WatchedEvent state:SyncConnected type:NodeChildrenChanged path:/live_nodes, has occurred - updating... (live nodes size: 4)
[junit4:junit4]   2> 13486 T354 oascc.ZkStateReader$3.process Updating live nodes... (5)
[junit4:junit4]   2> 13486 T369 oascc.ZkStateReader$3.process Updating live nodes... (5)
[junit4:junit4]   2> 13486 T320 oascc.ZkStateReader$3.process Updating live nodes... (5)
[junit4:junit4]   2> 13486 T354 oascc.ZkStateReader$2.process A cluster state change: WatchedEvent state:SyncConnected type:NodeChildrenChanged path:/live_nodes, has occurred - updating... (live nodes size: 5)
[junit4:junit4]   2> 13486 T326 oascc.ZkStateReader$3.process Updating live nodes... (5)
[junit4:junit4]   2> 13486 T320 oascc.ZkStateReader$2.process A cluster state change: WatchedEvent state:SyncConnected type:NodeChildrenChanged path:/live_nodes, has occurred - updating... (live nodes size: 5)
[junit4:junit4]   2> 13486 T369 oascc.ZkStateReader$2.process A cluster state change: WatchedEvent state:SyncConnected type:NodeChildrenChanged path:/live_nodes, has occurred - updating... (live nodes size: 5)
[junit4:junit4]   2> 13487 T326 oascc.ZkStateReader$2.process A cluster state change: WatchedEvent state:SyncConnected type:NodeChildrenChanged path:/live_nodes, has occurred - updating... (live nodes size: 5)
[junit4:junit4]   2> 13489 T339 oascc.ZkStateReader$3.process Updating live nodes... (5)
[junit4:junit4]   2> 13491 T298 oascc.ZkStateReader.createClusterStateWatchersAndUpdate Updating cluster state from ZooKeeper... 
[junit4:junit4]   2> 13499 T386 oasc.CoreContainer.create Creating SolrCore 'collection1' using instanceDir: /usr/home/hudson/hudson-slave/workspace/Lucene-Solr-Tests-4.x-java7/solr/build/solr-core/test/J0/./org.apache.solr.cloud.BasicDistributedZkTest-jetty4-1358356423349/collection1
[junit4:junit4]   2> 13500 T386 oasc.ZkController.createCollectionZkNode Check for collection zkNode:collection1
[junit4:junit4]   2> 13501 T386 oasc.ZkController.createCollectionZkNode Collection zkNode exists
[junit4:junit4]   2> 13501 T386 oasc.ZkController.readConfigName Load collection config from:/collections/collection1
[junit4:junit4]   2> 13503 T386 oasc.SolrResourceLoader.<init> new SolrResourceLoader for directory: '/usr/home/hudson/hudson-slave/workspace/Lucene-Solr-Tests-4.x-java7/solr/build/solr-core/test/J0/./org.apache.solr.cloud.BasicDistributedZkTest-jetty4-1358356423349/collection1/'
[junit4:junit4]   2> 13504 T386 oasc.SolrResourceLoader.replaceClassLoader Adding 'file:/usr/home/hudson/hudson-slave/workspace/Lucene-Solr-Tests-4.x-java7/solr/build/solr-core/test/J0/org.apache.solr.cloud.BasicDistributedZkTest-jetty4-1358356423349/collection1/lib/README' to classloader
[junit4:junit4]   2> 13505 T386 oasc.SolrResourceLoader.replaceClassLoader Adding 'file:/usr/home/hudson/hudson-slave/workspace/Lucene-Solr-Tests-4.x-java7/solr/build/solr-core/test/J0/org.apache.solr.cloud.BasicDistributedZkTest-jetty4-1358356423349/collection1/lib/classes/' to classloader
[junit4:junit4]   2> 13546 T386 oasc.SolrConfig.<init> Using Lucene MatchVersion: LUCENE_42
[junit4:junit4]   2> 13598 T386 oasc.SolrConfig.<init> Loaded SolrConfig: solrconfig.xml
[junit4:junit4]   2> 13699 T386 oass.IndexSchema.readSchema Reading Solr Schema
[junit4:junit4]   2> 13705 T386 oass.IndexSchema.readSchema Schema name=test
[junit4:junit4]   2> 13779 T321 oascc.ZkStateReader.updateClusterState Updating cloud state from ZooKeeper... 
[junit4:junit4]   2> 13781 T321 oasc.Overseer$ClusterStateUpdater.updateState Update state numShards=2 message={
[junit4:junit4]   2> 	  "operation":"state",
[junit4:junit4]   2> 	  "numShards":"2",
[junit4:junit4]   2> 	  "shard":"shard1",
[junit4:junit4]   2> 	  "roles":null,
[junit4:junit4]   2> 	  "state":"recovering",
[junit4:junit4]   2> 	  "core":"collection1",
[junit4:junit4]   2> 	  "collection":"collection1",
[junit4:junit4]   2> 	  "node_name":"127.0.0.1:24965_",
[junit4:junit4]   2> 	  "base_url":"http://127.0.0.1:24965"}
[junit4:junit4]   2> 13797 T339 oascc.ZkStateReader$2.process A cluster state change: WatchedEvent state:SyncConnected type:NodeDataChanged path:/clusterstate.json, has occurred - updating... (live nodes size: 5)
[junit4:junit4]   2> 13797 T369 oascc.ZkStateReader$2.process A cluster state change: WatchedEvent state:SyncConnected type:NodeDataChanged path:/clusterstate.json, has occurred - updating... (live nodes size: 5)
[junit4:junit4]   2> 13797 T326 oascc.ZkStateReader$2.process A cluster state change: WatchedEvent state:SyncConnected type:NodeDataChanged path:/clusterstate.json, has occurred - updating... (live nodes size: 5)
[junit4:junit4]   2> 13797 T385 oascc.ZkStateReader$2.process A cluster state change: WatchedEvent state:SyncConnected type:NodeDataChanged path:/clusterstate.json, has occurred - updating... (live nodes size: 5)
[junit4:junit4]   2> 13797 T320 oascc.ZkStateReader$2.process A cluster state change: WatchedEvent state:SyncConnected type:NodeDataChanged path:/clusterstate.json, has occurred - updating... (live nodes size: 5)
[junit4:junit4]   2> 13797 T354 oascc.ZkStateReader$2.process A cluster state change: WatchedEvent state:SyncConnected type:NodeDataChanged path:/clusterstate.json, has occurred - updating... (live nodes size: 5)
[junit4:junit4]   2> 14179 T386 oass.OpenExchangeRatesOrgProvider.init Initialized with rates=open-exchange-rates.json, refreshInterval=1440.
[junit4:junit4]   2> 14188 T386 oass.IndexSchema.readSchema default search field in schema is text
[junit4:junit4]   2> 14191 T386 oass.IndexSchema.readSchema unique key field: id
[junit4:junit4]   2> 14212 T386 oass.FileExchangeRateProvider.reload Reloading exchange rates from file currency.xml
[junit4:junit4]   2> 14218 T386 oass.FileExchangeRateProvider.reload Reloading exchange rates from file currency.xml
[junit4:junit4]   2> 14223 T386 oass.OpenExchangeRatesOrgProvider.reload Reloading exchange rates from open-exchange-rates.json
[junit4:junit4]   2> 14225 T386 oass.OpenExchangeRatesOrgProvider.reload Reloading exchange rates from open-exchange-rates.json
[junit4:junit4]   2> 14227 T386 oasc.SolrCore.<init> [collection1] Opening new SolrCore at /usr/home/hudson/hudson-slave/workspace/Lucene-Solr-Tests-4.x-java7/solr/build/solr-core/test/J0/./org.apache.solr.cloud.BasicDistributedZkTest-jetty4-1358356423349/collection1/, dataDir=./org.apache.solr.cloud.BasicDistributedZkTest-1358356410118/jetty4/
[junit4:junit4]   2> 14227 T386 oasc.JmxMonitoredMap.<init> JMX monitoring is enabled. Adding Solr mbeans to JMX Server: com.sun.jmx.mbeanserver.JmxMBeanServer@6cd44892
[junit4:junit4]   2> 14227 T386 oasc.SolrCore.initDirectoryFactory solr.NRTCachingDirectoryFactory
[junit4:junit4]   2> 14228 T386 oasc.CachingDirectoryFactory.get return new directory for /usr/home/hudson/hudson-slave/workspace/Lucene-Solr-Tests-4.x-java7/solr/build/solr-core/test/J0/./org.apache.solr.cloud.BasicDistributedZkTest-1358356410118/jetty4 forceNew:false
[junit4:junit4]   2> 14229 T386 oasc.CachingDirectoryFactory.close Releasing directory:/usr/home/hudson/hudson-slave/workspace/Lucene-Solr-Tests-4.x-java7/solr/build/solr-core/test/J0/./org.apache.solr.cloud.BasicDistributedZkTest-1358356410118/jetty4
[junit4:junit4]   2> 14229 T386 oasc.SolrCore.getNewIndexDir New index directory detected: old=null new=./org.apache.solr.cloud.BasicDistributedZkTest-1358356410118/jetty4/index/
[junit4:junit4]   2> 14229 T386 oasc.SolrCore.initIndex WARNING [collection1] Solr index directory './org.apache.solr.cloud.BasicDistributedZkTest-1358356410118/jetty4/index' doesn't exist. Creating new index...
[junit4:junit4]   2> 14230 T386 oasc.CachingDirectoryFactory.get return new directory for /usr/home/hudson/hudson-slave/workspace/Lucene-Solr-Tests-4.x-java7/solr/build/solr-core/test/J0/./org.apache.solr.cloud.BasicDistributedZkTest-1358356410118/jetty4/index forceNew:false
[junit4:junit4]   2> 14236 T386 oasc.SolrDeletionPolicy.onCommit SolrDeletionPolicy.onCommit: commits:num=1
[junit4:junit4]   2> 		commit{dir=RateLimitedDirectoryWrapper(NRTCachingDirectory(org.apache.lucene.store.NIOFSDirectory@/usr/home/hudson/hudson-slave/workspace/Lucene-Solr-Tests-4.x-java7/solr/build/solr-core/test/J0/org.apache.solr.cloud.BasicDistributedZkTest-1358356410118/jetty4/index lockFactory=org.apache.lucene.store.NativeFSLockFactory@1693b0f3; maxCacheMB=48.0 maxMergeSizeMB=4.0)),segFN=segments_1,generation=1,filenames=[segments_1]
[junit4:junit4]   2> 14236 T386 oasc.SolrDeletionPolicy.updateCommits newest commit = 1[segments_1]
[junit4:junit4]   2> 14237 T386 oasc.CachingDirectoryFactory.close Releasing directory:/usr/home/hudson/hudson-slave/workspace/Lucene-Solr-Tests-4.x-java7/solr/build/solr-core/test/J0/./org.apache.solr.cloud.BasicDistributedZkTest-1358356410118/jetty4/index
[junit4:junit4]   2> 14237 T386 oasc.SolrCore.initWriters created xml: solr.XMLResponseWriter
[junit4:junit4]   2> 14239 T386 oasup.UpdateRequestProcessorChain.init inserting DistributedUpdateProcessorFactory into updateRequestProcessorChain "dedupe"
[junit4:junit4]   2> 14239 T386 oasup.UpdateRequestProcessorChain.init inserting DistributedUpdateProcessorFactory into updateRequestProcessorChain "dedupe-allfields"
[junit4:junit4]   2> 14240 T386 oasup.UpdateRequestProcessorChain.init inserting DistributedUpdateProcessorFactory into updateRequestProcessorChain "stored_sig"
[junit4:junit4]   2> 14240 T386 oasup.UpdateRequestProcessorChain.init inserting DistributedUpdateProcessorFactory into updateRequestProcessorChain "uniq-fields"
[junit4:junit4]   2> 14241 T386 oasup.UpdateRequestProcessorChain.init inserting DistributedUpdateProcessorFactory into updateRequestProcessorChain "distrib-dup-test-chain-implicit"
[junit4:junit4]   2> 14241 T386 oasc.RequestHandlers.initHandlersFromConfig adding lazy requestHandler: solr.ReplicationHandler
[junit4:junit4]   2> 14241 T386 oasc.RequestHandlers.initHandlersFromConfig created /replication: solr.ReplicationHandler
[junit4:junit4]   2> 14242 T386 oasc.RequestHandlers.initHandlersFromConfig created standard: solr.StandardRequestHandler
[junit4:junit4]   2> 14242 T386 oasc.RequestHandlers.initHandlersFromConfig created /get: solr.RealTimeGetHandler
[junit4:junit4]   2> 14243 T386 oasc.RequestHandlers.initHandlersFromConfig created dismax: solr.SearchHandler
[junit4:junit4]   2> 14243 T386 oasc.RequestHandlers.initHandlersFromConfig created mock: org.apache.solr.core.MockQuerySenderListenerReqHandler
[junit4:junit4]   2> 14244 T386 oasc.RequestHandlers.initHandlersFromConfig created /admin/: org.apache.solr.handler.admin.AdminHandlers
[junit4:junit4]   2> 14244 T386 oasc.RequestHandlers.initHandlersFromConfig created defaults: solr.StandardRequestHandler
[junit4:junit4]   2> 14244 T386 oasc.RequestHandlers.initHandlersFromConfig adding lazy requestHandler: solr.StandardRequestHandler
[junit4:junit4]   2> 14245 T386 oasc.RequestHandlers.initHandlersFromConfig created lazy: solr.StandardRequestHandler
[junit4:junit4]   2> 14245 T386 oasc.RequestHandlers.initHandlersFromConfig created /update: solr.UpdateRequestHandler
[junit4:junit4]   2> 14246 T386 oasc.RequestHandlers.initHandlersFromConfig created /terms: org.apache.solr.handler.component.SearchHandler
[junit4:junit4]   2> 14246 T386 oasc.RequestHandlers.initHandlersFromConfig created spellCheckCompRH: org.apache.solr.handler.component.SearchHandler
[junit4:junit4]   2> 14247 T386 oasc.RequestHandlers.initHandlersFromConfig created spellCheckCompRH_Direct: org.apache.solr.handler.component.SearchHandler
[junit4:junit4]   2> 14247 T386 oasc.RequestHandlers.initHandlersFromConfig created spellCheckWithWordbreak: org.apache.solr.handler.component.SearchHandler
[junit4:junit4]   2> 14248 T386 oasc.RequestHandlers.initHandlersFromConfig created spellCheckWithWordbreak_Direct: org.apache.solr.handler.component.SearchHandler
[junit4:junit4]   2> 14248 T386 oasc.RequestHandlers.initHandlersFromConfig created spellCheckCompRH1: org.apache.solr.handler.component.SearchHandler
[junit4:junit4]   2> 14249 T386 oasc.RequestHandlers.initHandlersFromConfig created mltrh: org.apache.solr.handler.component.SearchHandler
[junit4:junit4]   2> 14249 T386 oasc.RequestHandlers.initHandlersFromConfig created tvrh: org.apache.solr.handler.component.SearchHandler
[junit4:junit4]   2> 14250 T386 oasc.RequestHandlers.initHandlersFromConfig created /mlt: solr.MoreLikeThisHandler
[junit4:junit4]   2> 14250 T386 oasc.RequestHandlers.initHandlersFromConfig created /debug/dump: solr.DumpRequestHandler
[junit4:junit4]   2> 14259 T386 oashl.XMLLoader.init xsltCacheLifetimeSeconds=60
[junit4:junit4]   2> 14263 T386 oasc.SolrCore.initDeprecatedSupport WARNING solrconfig.xml uses deprecated <admin/gettableFiles>, Please update your config to use the ShowFileRequestHandler.
[junit4:junit4]   2> 14265 T386 oasc.SolrCore.initDeprecatedSupport WARNING adding ShowFileRequestHandler with hidden files: [SCHEMA.XML, OLD_SYNONYMS.TXT, STOPWORDS.TXT, PROTWORDS.TXT, OPEN-EXCHANGE-RATES.JSON, SYNONYMS.TXT, CURRENCY.XML, MAPPING-ISOLATIN1ACCENT.TXT]
[junit4:junit4]   2> 14267 T386 oasc.CachingDirectoryFactory.close Releasing directory:/usr/home/hudson/hudson-slave/workspace/Lucene-Solr-Tests-4.x-java7/solr/build/solr-core/test/J0/./org.apache.solr.cloud.BasicDistributedZkTest-1358356410118/jetty4
[junit4:junit4]   2> 14268 T386 oass.SolrIndexSearcher.<init> Opening Searcher@79f7efe7 main
[junit4:junit4]   2> 14269 T386 oasu.CommitTracker.<init> Hard AutoCommit: disabled
[junit4:junit4]   2> 14270 T386 oasu.CommitTracker.<init> Soft AutoCommit: disabled
[junit4:junit4]   2> 14270 T386 oashc.SpellCheckComponent.inform Initializing spell checkers
[junit4:junit4]   2> 14276 T386 oass.DirectSolrSpellChecker.init init: {name=direct,classname=DirectSolrSpellChecker,field=lowerfilt,minQueryLength=3}
[junit4:junit4]   2> 14326 T387 oasc.SolrCore.registerSearcher [collection1] Registered new searcher Searcher@79f7efe7 main{StandardDirectoryReader(segments_1:1)}
[junit4:junit4]   2> 14330 T386 oasc.ZkController.publish publishing core=collection1 state=down
[junit4:junit4]   2> 14331 T386 oasc.ZkController.publish numShards not found on descriptor - reading it from system property
[junit4:junit4]   2> 15306 T321 oascc.ZkStateReader.updateClusterState Updating cloud state from ZooKeeper... 
[junit4:junit4]   2> 15307 T321 oasc.Overseer$ClusterStateUpdater.updateState Update state numShards=2 message={
[junit4:junit4]   2> 	  "operation":"state",
[junit4:junit4]   2> 	  "numShards":"2",
[junit4:junit4]   2> 	  "shard":null,
[junit4:junit4]   2> 	  "roles":null,
[junit4:junit4]   2> 	  "state":"down",
[junit4:junit4]   2> 	  "core":"collection1",
[junit4:junit4]   2> 	  "collection":"collection1",
[junit4:junit4]   2> 	  "node_name":"127.0.0.1:24969_",
[junit4:junit4]   2> 	  "base_url":"http://127.0.0.1:24969"}
[junit4:junit4]   2> 15307 T321 oasc.Overseer$ClusterStateUpdater.updateState Collection already exists with numShards=2
[junit4:junit4]   2> 15308 T321 oasc.Overseer$ClusterStateUpdater.updateState Assigning new node to shard shard=shard2
[junit4:junit4]   2> 15323 T339 oascc.ZkStateReader$2.process A cluster state change: WatchedEvent state:SyncConnected type:NodeDataChanged path:/clusterstate.json, has occurred - updating... (live nodes size: 5)
[junit4:junit4]   2> 15323 T320 oascc.ZkStateReader$2.process A cluster state change: WatchedEvent state:SyncConnected type:NodeDataChanged path:/clusterstate.json, has occurred - updating... (live nodes size: 5)
[junit4:junit4]   2> 15323 T369 oascc.ZkStateReader$2.process A cluster state change: WatchedEvent state:SyncConnected type:NodeDataChanged path:/clusterstate.json, has occurred - updating... (live nodes size: 5)
[junit4:junit4]   2> 15323 T326 oascc.ZkStateReader$2.process A cluster state change: WatchedEvent state:SyncConnected type:NodeDataChanged path:/clusterstate.json, has occurred - updating... (live nodes size: 5)
[junit4:junit4]   2> 15323 T385 oascc.ZkStateReader$2.process A cluster state change: WatchedEvent state:SyncConnected type:NodeDataChanged path:/clusterstate.json, has occurred - updating... (live nodes size: 5)
[junit4:junit4]   2> 15323 T354 oascc.ZkStateReader$2.process A cluster state change: WatchedEvent state:SyncConnected type:NodeDataChanged path:/clusterstate.json, has occurred - updating... (live nodes size: 5)
[junit4:junit4]   2> 15334 T386 oasc.CoreContainer.registerCore registering core: collection1
[junit4:junit4]   2> 15334 T386 oasc.ZkController.register Register replica - core:collection1 address:http://127.0.0.1:24969 collection:collection1 shard:shard2
[junit4:junit4]   2> 15339 T386 oasc.ZkController.register We are http://127.0.0.1:24969/collection1/ and leader is http://127.0.0.1:24962/collection1/
[junit4:junit4]   2> 15339 T386 oasc.ZkController.register No LogReplay needed for core=collection1 baseURL=http://127.0.0.1:24969
[junit4:junit4]   2> 15339 T386 oasc.ZkController.checkRecovery Core needs to recover:collection1
[junit4:junit4]   2> 15340 T386 oasu.DefaultSolrCoreState.doRecovery Running recovery - first canceling any ongoing recovery
[junit4:junit4]   2> ASYNC  NEW_CORE C13 name=collection1 org.apache.solr.core.SolrCore@122a90d2 url=http://127.0.0.1:24969/collection1 node=127.0.0.1:24969_ C13_STATE=coll:collection1 core:collection1 props:{shard=null, roles=null, state=down, core=collection1, collection=collection1, node_name=127.0.0.1:24969_, base_url=http://127.0.0.1:24969}
[junit4:junit4]   2> 15340 T388 C13 P24969 oasc.RecoveryStrategy.run Starting recovery process.  core=collection1 recoveringAfterStartup=true
[junit4:junit4]   2> 15341 T388 C13 P24969 oasc.RecoveryStrategy.doRecovery ###### startupVersions=[]
[junit4:junit4]   2> 15341 T388 C13 P24969 oasc.ZkController.publish publishing core=collection1 state=recovering
[junit4:junit4]   2> 15341 T386 oascc.ZkStateReader.updateClusterState Updating cloud state from ZooKeeper... 
[junit4:junit4]   2> 15341 T388 C13 P24969 oasc.ZkController.publish numShards not found on descriptor - reading it from system property
[junit4:junit4]   2> 15343 T298 oass.SolrDispatchFilter.init user.dir=/usr/home/hudson/hudson-slave/workspace/Lucene-Solr-Tests-4.x-java7/solr/build/solr-core/test/J0
[junit4:junit4]   2> 15344 T388 C13 P24969 oascsi.HttpClientUtil.createClient Creating new http client, config:maxConnections=128&maxConnectionsPerHost=32&followRedirects=false
[junit4:junit4]   2> 15344 T298 oass.SolrDispatchFilter.init SolrDispatchFilter.init() done
[junit4:junit4]   2> 15345 T298 oascsi.HttpClientUtil.createClient Creating new http client, config:maxConnections=128&maxConnectionsPerHost=32&followRedirects=false
[junit4:junit4]   2> 15366 T298 oascc.ZkStateReader.updateClusterState Updating cloud state from ZooKeeper... 
[junit4:junit4]   2> 15368 T298 oasc.AbstractDistribZkTestBase.waitForRecoveriesToFinish Wait for recoveries to finish - collection: collection1 failOnTimeout:true timeout (sec):230
[junit4:junit4]   2> 15369 T298 oascc.ZkStateReader.updateClusterState Updating cloud state from ZooKeeper... 
[junit4:junit4]   2>  C12_STATE=coll:collection1 core:collection1 props:{shard=shard1, roles=null, state=recovering, core=collection1, collection=collection1, node_name=127.0.0.1:24965_, base_url=http://127.0.0.1:24965}
[junit4:junit4]   2> 16255 T372 C12 P24965 oasc.RecoveryStrategy.doRecovery Attempting to PeerSync from http://127.0.0.1:24959/collection1/ core=collection1 - recoveringAfterStartup=true
[junit4:junit4]   2> 16265 T372 C12 P24965 oascsi.HttpClientUtil.createClient Creating new http client, config:maxConnectionsPerHost=20&maxConnections=10000&connTimeout=30000&socketTimeout=30000&retry=false
[junit4:junit4]   2> 16287 T372 C12 P24965 oasu.PeerSync.sync PeerSync: core=collection1 url=http://127.0.0.1:24965 START replicas=[http://127.0.0.1:24959/collection1/] nUpdates=100
[junit4:junit4]   2> 16298 T372 C12 P24965 oasu.PeerSync.sync WARNING no frame of reference to tell of we've missed updates
[junit4:junit4]   2> 16299 T372 C12 P24965 oasc.RecoveryStrategy.doRecovery PeerSync Recovery was not successful - trying replication. core=collection1
[junit4:junit4]   2> 16300 T372 C12 P24965 oasc.RecoveryStrategy.doRecovery Starting Replication Recovery. core=collection1
[junit4:junit4]   2> 16300 T372 C12 P24965 oasc.RecoveryStrategy.doRecovery Begin buffering updates. core=collection1
[junit4:junit4]   2> 16300 T372 C12 P24965 oasu.UpdateLog.bufferUpdates Starting to buffer updates. FSUpdateLog{state=ACTIVE, tlog=null}
[junit4:junit4]   2> 16300 T372 C12 P24965 oasc.RecoveryStrategy.replicate Attempting to replicate from http://127.0.0.1:24959/collection1/. core=collection1
[junit4:junit4]   2> 16301 T372 C12 P24965 oascsi.HttpClientUtil.createClient Creating new http client, config:maxConnections=128&maxConnectionsPerHost=32&followRedirects=false
[junit4:junit4]   2> ASYNC  NEW_CORE C14 name=collection1 org.apache.solr.core.SolrCore@75f99865 url=http://127.0.0.1:24959/collection1 node=127.0.0.1:24959_ C14_STATE=coll:collection1 core:collection1 props:{shard=shard1, roles=null, state=active, core=collection1, collection=collection1, node_name=127.0.0.1:24959_, base_url=http://127.0.0.1:24959, leader=true}
[junit4:junit4]   2> 16319 T330 C14 P24959 REQ /get {getVersions=100&distrib=false&wt=javabin&qt=/get&version=2} status=0 QTime=1 
[junit4:junit4]   2> 16323 T331 C14 P24959 oasu.DirectUpdateHandler2.commit start commit{,optimize=false,openSearcher=false,waitSearcher=true,expungeDeletes=false,softCommit=false}
[junit4:junit4]   2> 16324 T331 C14 P24959 oasc.CachingDirectoryFactory.close Releasing directory:/usr/home/hudson/hudson-slave/workspace/Lucene-Solr-Tests-4.x-java7/solr/build/solr-core/test/J0/./org.apache.solr.cloud.BasicDistributedZkTest-1358356410118/jetty1
[junit4:junit4]   2> 16329 T331 C14 P24959 oasc.SolrDeletionPolicy.onInit SolrDeletionPolicy.onInit: commits:num=1
[junit4:junit4]   2> 		commit{dir=RateLimitedDirectoryWrapper(NRTCachingDirectory(org.apache.lucene.store.NIOFSDirectory@/usr/home/hudson/hudson-slave/workspace/Lucene-Solr-Tests-4.x-java7/solr/build/solr-core/test/J0/org.apache.solr.cloud.BasicDistributedZkTest-1358356410118/jetty1/index lockFactory=org.apache.lucene.store.NativeFSLockFactory@5aa66dc4; maxCacheMB=48.0 maxMergeSizeMB=4.0)),segFN=segments_1,generation=1,filenames=[segments_1]
[junit4:junit4]   2> 16330 T331 C14 P24959 oasc.SolrDeletionPolicy.updateCommits newest commit = 1[segments_1]
[junit4:junit4]   2> 16350 T331 C14 P24959 oasc.SolrDeletionPolicy.onCommit SolrDeletionPolicy.onCommit: commits:num=2
[junit4:junit4]   2> 		commit{dir=RateLimitedDirectoryWrapper(NRTCachingDirectory(org.apache.lucene.store.NIOFSDirectory@/usr/home/hudson/hudson-slave/workspace/Lucene-Solr-Tests-4.x-java7/solr/build/solr-core/test/J0/org.apache.solr.cloud.BasicDistributedZkTest-1358356410118/jetty1/index lockFactory=org.apache.lucene.store.NativeFSLockFactory@5aa66dc4; maxCacheMB=48.0 maxMergeSizeMB=4.0)),segFN=segments_1,generation=1,filenames=[segments_1]
[junit4:junit4]   2> 		commit{dir=RateLimitedDirectoryWrapper(NRTCachingDirectory(org.apache.lucene.store.NIOFSDirectory@/usr/home/hudson/hudson-slave/workspace/Lucene-Solr-Tests-4.x-java7/solr/build/solr-core/test/J0/org.apache.solr.cloud.BasicDistributedZkTest-1358356410118/jetty1/index lockFactory=org.apache.lucene.store.NativeFSLockFactory@5aa66dc4; maxCacheMB=48.0 maxMergeSizeMB=4.0)),segFN=segments_2,generation=2,filenames=[segments_2]
[junit4:junit4]   2> 16350 T331 C14 P24959 oasc.SolrDeletionPolicy.updateCommits newest commit = 2[segments_2]
[junit4:junit4]   2> 16352 T331 C14 P24959 oasc.CachingDirectoryFactory.close Releasing directory:/usr/home/hudson/hudson-slave/workspace/Lucene-Solr-Tests-4.x-java7/solr/build/solr-core/test/J0/./org.apache.solr.cloud.BasicDistributedZkTest-1358356410118/jetty1
[junit4:junit4]   2> 16352 T331 C14 P24959 oass.SolrIndexSearcher.<init> Opening Searcher@2651fb6a realtime
[junit4:junit4]   2> 16353 T331 C14 P24959 oasu.DirectUpdateHandler2.commit end_commit_flush
[junit4:junit4]   2> 16353 T331 C14 P24959 /update {waitSearcher=true&openSearcher=false&commit=true&wt=javabin&commit_end_point=true&version=2&softCommit=false} {commit=} 0 30
[junit4:junit4]   2> 16372 T298 oascc.ZkStateReader.updateClusterState Updating cloud state from ZooKeeper... 
[junit4:junit4]   2> 16417 T372 C12 P24965 oash.ReplicationHandler.inform Commits will be reserved for  10000
[junit4:junit4]   2> 16417 T372 C12 P24965 oascsi.HttpClientUtil.createClient Creating new http client, config:connTimeout=5000&socketTimeout=20000&allowCompression=false&maxConnections=10000&maxConnectionsPerHost=10000
[junit4:junit4]   2> 16447 T372 C12 P24965 oash.SnapPuller.<init>  No value set for 'pollInterval'. Timer Task not started.
[junit4:junit4]   2> 16450 T332 C14 P24959 oash.ReplicationHandler.inform Commits will be reserved for  10000
[junit4:junit4]   2> 16451 T332 C14 P24959 REQ /replication {command=indexversion&qt=/replication&wt=javabin&version=2} status=0 QTime=2 
[junit4:junit4]   2> 16452 T372 C12 P24965 oash.SnapPuller.fetchLatestIndex Master's generation: 2
[junit4:junit4]   2> 16452 T372 C12 P24965 oash.SnapPuller.fetchLatestIndex Slave's generation: 1
[junit4:junit4]   2> 16452 T372 C12 P24965 oash.SnapPuller.fetchLatestIndex Starting replication process
[junit4:junit4]   2> 16456 T332 C14 P24959 oasc.CachingDirectoryFactory.close Releasing directory:/usr/home/hudson/hudson-slave/workspace/Lucene-Solr-Tests-4.x-java7/solr/build/solr-core/test/J0/./org.apache.solr.cloud.BasicDistributedZkTest-1358356410118/jetty1
[junit4:junit4]   2> 16457 T332 C14 P24959 oasc.CachingDirectoryFactory.close Releasing directory:/usr/home/hudson/hudson-slave/workspace/Lucene-Solr-Tests-4.x-java7/solr/build/solr-core/test/J0/./org.apache.solr.cloud.BasicDistributedZkTest-1358356410118/jetty1/index
[junit4:junit4]   2> 16457 T332 C14 P24959 REQ /replication {command=filelist&qt=/replication&wt=javabin&generation=2&version=2} status=0 QTime=2 
[junit4:junit4]   2> 16458 T372 C12 P24965 oash.SnapPuller.fetchLatestIndex Number of files in latest index in master: 1
[junit4:junit4]   2> 16460 T372 C12 P24965 oasc.CachingDirectoryFactory.get return new directory for /usr/home/hudson/hudson-slave/workspace/Lucene-Solr-Tests-4.x-java7/solr/build/solr-core/test/J0/./org.apache.solr.cloud.BasicDistributedZkTest-1358356410118/jetty3/index.20130116191346572 forceNew:false
[junit4:junit4]   2> 16461 T372 C12 P24965 oasc.CachingDirectoryFactory.close Releasing directory:/usr/home/hudson/hudson-slave/workspace/Lucene-Solr-Tests-4.x-java7/solr/build/solr-core/test/J0/./org.apache.solr.cloud.BasicDistributedZkTest-1358356410118/jetty3
[junit4:junit4]   2> 16462 T372 C12 P24965 oash.SnapPuller.fetchLatestIndex Starting download to RateLimitedDirectoryWrapper(NRTCachingDirectory(org.apache.lucene.store.NIOFSDirectory@/usr/home/hudson/hudson-slave/workspace/Lucene-Solr-Tests-4.x-java7/solr/build/solr-core/test/J0/org.apache.solr.cloud.BasicDistributedZkTest-1358356410118/jetty3/index.20130116191346572 lockFactory=org.apache.lucene.store.NativeFSLockFactory@3db48d40; maxCacheMB=48.0 maxMergeSizeMB=4.0)) fullCopy=true
[junit4:junit4]   2> 16477 T332 C14 P24959 REQ /replication {file=segments_2&command=filecontent&checksum=true&wt=filestream&qt=/replication&generation=2} status=0 QTime=6 
[junit4:junit4]   2> 16484 T372 C12 P24965 oasc.CachingDirectoryFactory.close Releasing directory:/usr/home/hudson/hudson-slave/workspace/Lucene-Solr-Tests-4.x-java7/solr/build/solr-core/test/J0/./org.apache.solr.cloud.BasicDistributedZkTest-1358356410118/jetty3/index
[junit4:junit4]   2> 16484 T372 C12 P24965 oash.SnapPuller.fetchLatestIndex Total time taken for download : 0 secs
[junit4:junit4]   2> 16485 T372 C12 P24965 oash.SnapPuller.modifyIndexProps New index installed. Updating index properties... index=index.20130116191346572
[junit4:junit4]   2> 16486 T372 C12 P24965 oasc.CachingDirectoryFactory.close Releasing directory:/usr/home/hudson/hudson-slave/workspace/Lucene-Solr-Tests-4.x-java7/solr/build/solr-core/test/J0/./org.apache.solr.cloud.BasicDistributedZkTest-1358356410118/jetty3
[junit4:junit4]   2> 16487 T372 C12 P24965 oasc.CachingDirectoryFactory.close Releasing directory:/usr/home/hudson/hudson-slave/workspace/Lucene-Solr-Tests-4.x-java7/solr/build/solr-core/test/J0/./org.apache.solr.cloud.BasicDistributedZkTest-1358356410118/jetty3
[junit4:junit4]   2> 16488 T372 C12 P24965 oasc.SolrCore.getNewIndexDir New index directory detected: old=./org.apache.solr.cloud.BasicDistributedZkTest-1358356410118/jetty3/index/ new=./org.apache.solr.cloud.BasicDistributedZkTest-1358356410118/jetty3/index.20130116191346572
[junit4:junit4]   2> 16492 T372 C12 P24965 oasc.SolrDeletionPolicy.onInit SolrDeletionPolicy.onInit: commits:num=1
[junit4:junit4]   2> 		commit{dir=RateLimitedDirectoryWrapper(NRTCachingDirectory(org.apache.lucene.store.NIOFSDirectory@/usr/home/hudson/hudson-slave/workspace/Lucene-Solr-Tests-4.x-java7/solr/build/solr-core/test/J0/org.apache.solr.cloud.BasicDistributedZkTest-1358356410118/jetty3/index.20130116191346572 lockFactory=org.apache.lucene.store.NativeFSLockFactory@3db48d40; maxCacheMB=48.0 maxMergeSizeMB=4.0)),segFN=segments_2,generation=2,filenames=[segments_2]
[junit4:junit4]   2> 16492 T372 C12 P24965 oasc.SolrDeletionPolicy.updateCommits newest commit = 2[segments_2]
[junit4:junit4]   2> 16494 T372 C12 P24965 oasc.CachingDirectoryFactory.close Releasing directory:/usr/home/hudson/hudson-slave/workspace/Lucene-Solr-Tests-4.x-java7/solr/build/solr-core/test/J0/./org.apache.solr.cloud.BasicDistributedZkTest-1358356410118/jetty3
[junit4:junit4]   2> 16498 T372 C12 P24965 oasu.DefaultSolrCoreState.newIndexWriter Creating new IndexWriter...
[junit4:junit4]   2> 16499 T372 C12 P24965 oasu.DefaultSolrCoreState.newIndexWriter Waiting until IndexWriter is unused... core=collection1
[junit4:junit4]   2> 16499 T372 C12 P24965 oasu.DefaultSolrCoreState.newIndexWriter Rollback old IndexWriter... core=collection1
[junit4:junit4]   2> 16500 T372 C12 P24965 oasc.CachingDirectoryFactory.close Releasing directory:/usr/home/hudson/hudson-slave/workspace/Lucene-Solr-Tests-4.x-java7/solr/build/solr-core/test/J0/./org.apache.solr.cloud.BasicDistributedZkTest-1358356410118/jetty3/index.20130116191346572
[junit4:junit4]   2> 16501 T372 C12 P24965 oasc.CachingDirectoryFactory.close Releasing directory:/usr/home/hudson/hudson-slave/workspace/Lucene-Solr-Tests-4.x-java7/solr/build/solr-core/test/J0/./org.apache.solr.cloud.BasicDistributedZkTest-1358356410118/jetty3
[junit4:junit4]   2> 16505 T372 C12 P24965 oasc.SolrDeletionPolicy.onInit SolrDeletionPolicy.onInit: commits:num=1
[junit4:junit4]   2> 		commit{dir=RateLimitedDirectoryWrapper(NRTCachingDirectory(org.apache.lucene.store.NIOFSDirectory@/usr/home/hudson/hudson-slave/workspace/Lucene-Solr-Tests-4.x-java7/solr/build/solr-core/test/J0/org.apache.solr.cloud.BasicDistributedZkTest-1358356410118/jetty3/index.20130116191346572 lockFactory=org.apache.lucene.store.NativeFSLockFactory@3db48d40; maxCacheMB=48.0 maxMergeSizeMB=4.0)),segFN=segments_2,generation=2,filenames=[segments_2]
[junit4:junit4]   2> 16505 T372 C12 P24965 oasc.SolrDeletionPolicy.updateCommits newest commit = 2[segments_2]
[junit4:junit4]   2> 16505 T372 C12 P24965 oasu.DefaultSolrCoreState.newIndexWriter New IndexWriter is ready to be used.
[junit4:junit4]   2> 16506 T372 C12 P24965 oasc.CachingDirectoryFactory.close Releasing directory:/usr/home/hudson/hudson-slave/workspace/Lucene-Solr-Tests-4.x-java7/solr/build/solr-core/test/J0/./org.apache.solr.cloud.BasicDistributedZkTest-1358356410118/jetty3
[junit4:junit4]   2> 16506 T372 C12 P24965 oass.SolrIndexSearcher.<init> Opening Searcher@3ce582d3 main
[junit4:junit4]   2> 16509 T371 oasc.SolrCore.registerSearcher [collection1] Registered new searcher Searcher@3ce582d3 main{StandardDirectoryReader(segments_2:1:nrt)}
[junit4:junit4]   2> 16510 T371 oasc.CachingDirectoryFactory.close Releasing directory:/usr/home/hudson/hudson-slave/workspace/Lucene-Solr-Tests-4.x-java7/solr/build/solr-core/test/J0/./org.apache.solr.cloud.BasicDistributedZkTest-1358356410118/jetty3/index
[junit4:junit4]   2> 16510 T372 C12 P24965 oasu.DirectUpdateHandler2.commit start commit{,optimize=false,openSearcher=false,waitSearcher=false,expungeDeletes=false,softCommit=false}
[junit4:junit4]   2> 16514 T372 C12 P24965 oasc.SolrDeletionPolicy.onCommit SolrDeletionPolicy.onCommit: commits:num=2
[junit4:junit4]   2> 		commit{dir=RateLimitedDirectoryWrapper(NRTCachingDirectory(org.apache.lucene.store.NIOFSDirectory@/usr/home/hudson/hudson-slave/workspace/Lucene-Solr-Tests-4.x-java7/solr/build/solr-core/test/J0/org.apache.solr.cloud.BasicDistributedZkTest-1358356410118/jetty3/index.20130116191346572 lockFactory=org.apache.lucene.store.NativeFSLockFactory@3db48d40; maxCacheMB=48.0 maxMergeSizeMB=4.0)),segFN=segments_2,generation=2,filenames=[segments_2]
[junit4:junit4]   2> 		commit{dir=RateLimitedDirectoryWrapper(NRTCachingDirectory(org.apache.lucene.store.NIOFSDirectory@/usr/home/hudson/hudson-slave/workspace/Lucene-Solr-Tests-4.x-java7/solr/build/solr-core/test/J0/org.apache.solr.cloud.BasicDistributedZkTest-1358356410118/jetty3/index.20130116191346572 lockFactory=org.apache.lucene.store.NativeFSLockFactory@3db48d40; maxCacheMB=48.0 maxMergeSizeMB=4.0)),segFN=segments_3,generation=3,filenames=[segments_3]
[junit4:junit4]   2> 16514 T372 C12 P24965 oasc.SolrDeletionPolicy.updateCommits newest commit = 3[segments_3]
[junit4:junit4]   2> 16516 T372 C12 P24965 oasc.CachingDirectoryFactory.close Releasing directory:/usr/home/hudson/hudson-slave/workspace/Lucene-Solr-Tests-4.x-java7/solr/build/solr-core/test/J0/./org.apache.solr.cloud.BasicDistributedZkTest-1358356410118/jetty3
[junit4:junit4]   2> 16516 T372 C12 P24965 oasu.DirectUpdateHandler2.commit end_commit_flush
[junit4:junit4]   2> 16516 T372 C12 P24965 oasc.CachingDirectoryFactory.close Releasing directory:/usr/home/hudson/hudson-slave/workspace/Lucene-Solr-Tests-4.x-java7/solr/build/solr-core/test/J0/./org.apache.solr.cloud.BasicDistributedZkTest-1358356410118/jetty3/index.20130116191346572
[junit4:junit4]   2> 16517 T372 C12 P24965 oasc.CachingDirectoryFactory.close Releasing directory:/usr/home/hudson/hudson-slave/workspace/Lucene-Solr-Tests-4.x-java7/solr/build/solr-core/test/J0/./org.apache.solr.cloud.BasicDistributedZkTest-1358356410118/jetty3/index
[junit4:junit4]   2> 16517 T372 C12 P24965 oasc.RecoveryStrategy.replay No replay needed. core=collection1
[junit4:junit4]   2> 16517 T372 C12 P24965 oasc.RecoveryStrategy.doRecovery Replication Recovery was successful - registering as Active. core=collection1
[junit4:junit4]   2> 16517 T372 C12 P24965 oasc.ZkController.publish publishing core=collection1 state=active
[junit4:junit4]   2> 16518 T372 C12 P24965 oasc.ZkController.publish numShards not found on descriptor - reading it from system property
[junit4:junit4]   2> 16520 T372 C12 P24965 oasc.RecoveryStrategy.doRecovery Finished recovery process. core=collection1
[junit4:junit4]   2> 16831 T321 oascc.ZkStateReader.updateClusterState Updating cloud state from ZooKeeper... 
[junit4:junit4]   2> 16832 T321 oasc.Overseer$ClusterStateUpdater.updateState Update state numShards=2 message={
[junit4:junit4]   2> 	  "operation":"state",
[junit4:junit4]   2> 	  "numShards":"2",
[junit4:junit4]   2> 	  "shard":"shard2",
[junit4:junit4]   2> 	  "roles":null,
[junit4:junit4]   2> 	  "state":"recovering",
[junit4:junit4]   2> 	  "core":"collection1",
[junit4:junit4]   2> 	  "collection":"collection1",
[junit4:junit4]   2> 	  "node_name":"127.0.0.1:24969_",
[junit4:junit4]   2> 	  "base_url":"http://127.0.0.1:24969"}
[junit4:junit4]   2> 16863 T321 oasc.Overseer$ClusterStateUpdater.updateState Update state numShards=2 message={
[junit4:junit4]   2> 	  "operation":"state",
[junit4:junit4]   2> 	  "numShards":"2",
[junit4:junit4]   2> 	  "shard":"shard1",
[junit4:junit4]   2> 	  "roles":null,
[junit4:junit4]   2> 	  "state":"active",
[junit4:junit4]   2> 	  "core":"collection1",
[junit4:junit4]   2> 	  "collection":"collection1",
[junit4:junit4]   2> 	  "node_name":"127.0.0.1:24965_",
[junit4:junit4]   2> 	  "base_url":"http://127.0.0.1:24965"}
[junit4:junit4]   2> 16875 T354 oascc.ZkStateReader$2.process A cluster state change: WatchedEvent state:SyncConnected type:NodeDataChanged path:/clusterstate.json, has occurred - updating... (live nodes size: 5)
[junit4:junit4]   2> 16875 T339 oascc.ZkStateReader$2.process A cluster state change: WatchedEvent state:SyncConnected type:NodeDataChanged path:/clusterstate.json, has occurred - updating... (live nodes size: 5)
[junit4:junit4]   2> 16875 T326 oascc.ZkStateReader$2.process A cluster state change: WatchedEvent state:SyncConnected type:NodeDataChanged path:/clusterstate.json, has occurred - updating... (live nodes size: 5)
[junit4:junit4]   2> 16875 T369 oascc.ZkStateReader$2.process A cluster state change: WatchedEvent state:SyncConnected type:NodeDataChanged path:/clusterstate.json, has occurred - updating... (live nodes size: 5)
[junit4:junit4]   2> 16875 T385 oascc.ZkStateReader$2.process A cluster state change: WatchedEvent state:SyncConnected type:NodeDataChanged path:/clusterstate.json, has occurred - updating... (live nodes size: 5)
[junit4:junit4]   2> 16875 T320 oascc.ZkStateReader$2.process A cluster state change: WatchedEvent state:SyncConnected type:NodeDataChanged path:/clusterstate.json, has occurred - updating... (live nodes size: 5)
[junit4:junit4]   2> 17375 T298 oascc.ZkStateReader.updateClusterState Updating cloud state from ZooKeeper... 
[junit4:junit4]   2> 18378 T298 oascc.ZkStateReader.updateClusterState Updating cloud state from ZooKeeper... 
[junit4:junit4]   2>  C13_STATE=coll:collection1 core:collection1 props:{shard=shard2, roles=null, state=recovering, core=collection1, collection=collection1, node_name=127.0.0.1:24969_, base_url=http://127.0.0.1:24969}
[junit4:junit4]   2> 19368 T388 C13 P24969 oasc.RecoveryStrategy.doRecovery Attempting to PeerSync from http://127.0.0.1:24962/collection1/ core=collection1 - recoveringAfterStartup=true
[junit4:junit4]   2> 19368 T388 C13 P24969 oasu.PeerSync.sync PeerSync: core=collection1 url=http://127.0.0.1:24969 START replicas=[http://127.0.0.1:24962/collection1/] nUpdates=100
[junit4:junit4]   2> 19369 T388 C13 P24969 oasu.PeerSync.sync WARNING no frame of reference to tell of we've missed updates
[junit4:junit4]   2> 19369 T388 C13 P24969 oasc.RecoveryStrategy.doRecovery PeerSync Recovery was not successful - trying replication. core=collection1
[junit4:junit4]   2> 19369 T388 C13 P24969 oasc.RecoveryStrategy.doRecovery Starting Replication Recovery. core=collection1
[junit4:junit4]   2> 19369 T388 C13 P24969 oasc.RecoveryStrategy.doRecovery Begin buffering updates. core=collection1
[junit4:junit4]   2> 19370 T388 C13 P24969 oasu.UpdateLog.bufferUpdates Starting to buffer updates. FSUpdateLog{state=ACTIVE, tlog=null}
[junit4:junit4]   2> 19371 T388 C13 P24969 oasc.RecoveryStrategy.replicate Attempting to replicate from http://127.0.0.1:24962/collection1/. core=collection1
[junit4:junit4]   2> 19371 T388 C13 P24969 oascsi.HttpClientUtil.createClient Creating new http client, config:maxConnections=128&maxConnectionsPerHost=32&followRedirects=false
[junit4:junit4]   2> 19380 T298 oascc.ZkStateReader.updateClusterState Updating cloud state from ZooKeeper... 
[junit4:junit4]   2> ASYNC  NEW_CORE C15 name=collection1 org.apache.solr.core.SolrCore@6a350f11 url=http://127.0.0.1:24962/collection1 node=127.0.0.1:24962_ C15_STATE=coll:collection1 core:collection1 props:{shard=shard2, roles=null, state=active, core=collection1, collection=collection1, node_name=127.0.0.1:24962_, base_url=http://127.0.0.1:24962, leader=true}
[junit4:junit4]   2> 19402 T346 C15 P24962 oasu.DirectUpdateHandler2.commit start commit{,optimize=false,openSearcher=false,waitSearcher=true,expungeDeletes=false,softCommit=false}
[junit4:junit4]   2> 19402 T345 C15 P24962 REQ /get {getVersions=100&distrib=false&wt=javabin&qt=/get&version=2} status=0 QTime=0 
[junit4:junit4]   2> 19403 T346 C15 P24962 oasc.CachingDirectoryFactory.close Releasing directory:/usr/home/hudson/hudson-slave/workspace/Lucene-Solr-Tests-4.x-java7/solr/build/solr-core/test/J0/./org.apache.solr.cloud.BasicDistributedZkTest-1358356410118/jetty2
[junit4:junit4]   2> 19407 T346 C15 P24962 oasc.SolrDeletionPolicy.onInit SolrDeletionPolicy.onInit: commits:num=1
[junit4:junit4]   2> 		commit{dir=RateLimitedDirectoryWrapper(NRTCachingDirectory(org.apache.lucene.store.NIOFSDirectory@/usr/home/hudson/hudson-slave/workspace/Lucene-Solr-Tests-4.x-java7/solr/build/solr-core/test/J0/org.apache.solr.cloud.BasicDistributedZkTest-1358356410118/jetty2/index lockFactory=org.apache.lucene.store.NativeFSLockFactory@367b3d35; maxCacheMB=48.0 maxMergeSizeMB=4.0)),segFN=segments_1,generation=1,filenames=[segments_1]
[junit4:junit4]   2> 19408 T346 C15 P24962 oasc.SolrDeletionPolicy.updateCommits newest commit = 1[segments_1]
[junit4:junit4]   2> 19448 T346 C15 P24962 oasc.SolrDeletionPolicy.onCommit SolrDeletionPolicy.onCommit: commits:num=2
[junit4:junit4]   2> 		commit{dir=RateLimitedDirectoryWrapper(NRTCachingDirectory(org.apache.lucene.store.NIOFSDirectory@/usr/home/hudson/hudson-slave/workspace/Lucene-Solr-Tests-4.x-java7/solr/build/solr-core/test/J0/org.apache.solr.cloud.BasicDistributedZkTest-1358356410118/jetty2/index lockFactory=org.apache.lucene.store.NativeFSLockFactory@367b3d35; maxCacheMB=48.0 maxMergeSizeMB=4.0)),segFN=segments_1,generation=1,filenames=[segments_1]
[junit4:junit4]   2> 		commit{dir=RateLimitedDirectoryWrapper(NRTCachingDirectory(org.apache.lucene.store.NIOFSDirectory@/usr/home/hudson/hudson-slave/workspace/Lucene-Solr-Tests-4.x-java7/solr/build/solr-core/test/J0/org.apache.solr.cloud.BasicDistributedZkTest-1358356410118/jetty2/index lockFactory=org.apache.lucene.store.NativeFSLockFactory@367b3d35; maxCacheMB=48.0 maxMergeSizeMB=4.0)),segFN=segments_2,generation=2,filenames=[segments_2]
[junit4:junit4]   2> 19448 T346 C15 P24962 oasc.SolrDeletionPolicy.updateCommits newest commit = 2[segments_2]
[junit4:junit4]   2> 19450 T346 C15 P24962 oasc.CachingDirectoryFactory.close Releasing directory:/usr/home/hudson/hudson-slave/workspace/Lucene-Solr-Tests-4.x-java7/solr/build/solr-core/test/J0/./org.apache.solr.cloud.BasicDistributedZkTest-1358356410118/jetty2
[junit4:junit4]   2> 19450 T346 C15 P24962 oass.SolrIndexSearcher.<init> Opening Searcher@3ffcf18 realtime
[junit4:junit4]   2> 19451 T346 C15 P24962 oasu.DirectUpdateHandler2.commit end_commit_flush
[junit4:junit4]   2> 19451 T346 C15 P24962 /update {waitSearcher=true&openSearcher=false&commit=true&wt=javabin&commit_end_point=true&version=2&softCommit=false} {commit=} 0 49
[junit4:junit4]   2> 19452 T388 C13 P24969 oash.ReplicationHandler.inform Commits will be reserved for  10000
[junit4:junit4]   2> 19453 T388 C13 P24969 oash.SnapPuller.<init>  No value set for 'pollInterval'. Timer Task not started.
[junit4:junit4]   2> 19455 T347 C15 P24962 oash.ReplicationHandler.inform Commits will be reserved for  10000
[junit4:junit4]   2> 19456 T347 C15 P24962 REQ /replication {command=indexversion&qt=/replication&wt=javabin&version=2} status=0 QTime=1 
[junit4:junit4]   2> 19457 T388 C13 P24969 oash.SnapPuller.fetchLatestIndex Master's generation: 2
[junit4:junit4]   2> 19457 T388 C13 P24969 oash.SnapPuller.fetchLatestIndex Slave's generation: 1
[junit4:junit4]   2> 19457 T388 C13 P24969 oash.SnapPuller.fetchLatestIndex Starting replication process
[junit4:junit4]   2> 19459 T347 C15 P24962 oasc.CachingDirectoryFactory.close Releasing directory:/usr/home/hudson/hudson-slave/workspace/Lucene-Solr-Tests-4.x-java7/solr/build/solr-core/test/J0/./org.apache.solr.cloud.BasicDistributedZkTest-1358356410118/jetty2
[junit4:junit4]   2> 19460 T347 C15 P24962 oasc.CachingDirectoryFactory.close Releasing directory:/usr/home/hudson/hudson-slave/workspace/Lucene-Solr-Tests-4.x-java7/solr/build/solr-core/test/J0/./org.apache.solr.cloud.BasicDistributedZkTest-1358356410118/jetty2/index
[junit4:junit4]   2> 19461 T347 C15 P24962 REQ /replication {command=filelist&qt=/replication&wt=javabin&generation=2&version=2} status=0 QTime=2 
[junit4:junit4]   2> 19462 T388 C13 P24969 oash.SnapPuller.fetchLatestIndex Number of files in latest index in master: 1
[junit4:junit4]   2> 19463 T388 C13 P24969 oasc.CachingDirectoryFactory.get return new directory for /usr/home/hudson/hudson-slave/workspace/Lucene-Solr-Tests-4.x-java7/solr/build/solr-core/test/J0/./org.apache.solr.cloud.BasicDistributedZkTest-1358356410118/jetty4/index.20130116191349575 forceNew:false
[junit4:junit4]   2> 19463 T388 C13 P24969 oasc.CachingDirectoryFactory.close Releasing directory:/usr/home/hudson/hudson-slave/workspace/Lucene-Solr-Tests-4.x-java7/solr/build/solr-core/test/J0/./org.apache.solr.cloud.BasicDistributedZkTest-1358356410118/jetty4
[junit4:junit4]   2> 19464 T388 C13 P24969 oash.SnapPuller.fetchLatestIndex Starting download to RateLimitedDirectoryWrapper(NRTCachingDirectory(org.apache.lucene.store.NIOFSDirectory@/usr/home/hudson/hudson-slave/workspace/Lucene-Solr-Tests-4.x-java7/solr/build/solr-core/test/J0/org.apache.solr.cloud.BasicDistributedZkTest-1358356410118/jetty4/index.20130116191349575 lockFactory=org.apache.lucene.store.NativeFSLockFactory@31c6e77a; maxCacheMB=48.0 maxMergeSizeMB=4.0)) fullCopy=true
[junit4:junit4]   2> 19468 T347 C15 P24962 REQ /replication {file=segments_2&command=filecontent&checksum=true&wt=filestream&qt=/replication&generation=2} status=0 QTime=0 
[junit4:junit4]   2> 19470 T388 C13 P24969 oasc.CachingDirectoryFactory.close Releasing directory:/usr/home/hudson/hudson-slave/workspace/Lucene-Solr-Tests-4.x-java7/solr/build/solr-core/test/J0/./org.apache.solr.cloud.BasicDistributedZkTe

[...truncated too long message...]

andomizedRunner.access$600(RandomizedRunner.java:79)
[junit4:junit4]   2> 	        at com.carrotsearch.randomizedtesting.RandomizedRunner$8.evaluate(RandomizedRunner.java:795)
[junit4:junit4]   2> 	        at com.carrotsearch.randomizedtesting.rules.SystemPropertiesRestoreRule$1.evaluate(SystemPropertiesRestoreRule.java:53)
[junit4:junit4]   2> 	        at org.apache.lucene.util.TestRuleSetupTeardownChained$1.evaluate(TestRuleSetupTeardownChained.java:50)
[junit4:junit4]   2> 	        at org.apache.lucene.util.TestRuleFieldCacheSanity$1.evaluate(TestRuleFieldCacheSanity.java:51)
[junit4:junit4]   2> 	        at org.apache.lucene.util.AbstractBeforeAfterRule$1.evaluate(AbstractBeforeAfterRule.java:46)
[junit4:junit4]   2> 	        at com.carrotsearch.randomizedtesting.rules.SystemPropertiesInvariantRule$1.evaluate(SystemPropertiesInvariantRule.java:55)
[junit4:junit4]   2> 	        at org.apache.lucene.util.TestRuleThreadAndTestName$1.evaluate(TestRuleThreadAndTestName.java:49)
[junit4:junit4]   2> 	        at org.apache.lucene.util.TestRuleIgnoreAfterMaxFailures$1.evaluate(TestRuleIgnoreAfterMaxFailures.java:70)
[junit4:junit4]   2> 	        at org.apache.lucene.util.TestRuleMarkFailure$1.evaluate(TestRuleMarkFailure.java:48)
[junit4:junit4]   2> 	        at com.carrotsearch.randomizedtesting.rules.StatementAdapter.evaluate(StatementAdapter.java:36)
[junit4:junit4]   2> 	        at com.carrotsearch.randomizedtesting.ThreadLeakControl$StatementRunner.run(ThreadLeakControl.java:358)
[junit4:junit4]   2> 	        at com.carrotsearch.randomizedtesting.ThreadLeakControl.forkTimeoutingTask(ThreadLeakControl.java:782)
[junit4:junit4]   2> 	        at com.carrotsearch.randomizedtesting.ThreadLeakControl$3.evaluate(ThreadLeakControl.java:442)
[junit4:junit4]   2> 	        at com.carrotsearch.randomizedtesting.RandomizedRunner.runSingleTest(RandomizedRunner.java:746)
[junit4:junit4]   2> 	        at com.carrotsearch.randomizedtesting.RandomizedRunner$3.evaluate(RandomizedRunner.java:648)
[junit4:junit4]   2> 	        at com.carrotsearch.randomizedtesting.RandomizedRunner$4.evaluate(RandomizedRunner.java:682)
[junit4:junit4]   2> 	        at com.carrotsearch.randomizedtesting.RandomizedRunner$5.evaluate(RandomizedRunner.java:693)
[junit4:junit4]   2> 	        at com.carrotsearch.randomizedtesting.rules.StatementAdapter.evaluate(StatementAdapter.java:36)
[junit4:junit4]   2> 	        at com.carrotsearch.randomizedtesting.rules.SystemPropertiesRestoreRule$1.evaluate(SystemPropertiesRestoreRule.java:53)
[junit4:junit4]   2> 	        at org.apache.lucene.util.AbstractBeforeAfterRule$1.evaluate(AbstractBeforeAfterRule.java:46)
[junit4:junit4]   2> 	        at org.apache.lucene.util.TestRuleStoreClassName$1.evaluate(TestRuleStoreClassName.java:42)
[junit4:junit4]   2> 	        at com.carrotsearch.randomizedtesting.rules.SystemPropertiesInvariantRule$1.evaluate(SystemPropertiesInvariantRule.java:55)
[junit4:junit4]   2> 	        at com.carrotsearch.randomizedtesting.rules.NoShadowingOrOverridesOnMethodsRule$1.evaluate(NoShadowingOrOverridesOnMethodsRule.java:39)
[junit4:junit4]   2> 	        at com.carrotsearch.randomizedtesting.rules.NoShadowingOrOverridesOnMethodsRule$1.evaluate(NoShadowingOrOverridesOnMethodsRule.java:39)
[junit4:junit4]   2> 	        at com.carrotsearch.randomizedtesting.rules.StatementAdapter.evaluate(StatementAdapter.java:36)
[junit4:junit4]   2> 	        at org.apache.lucene.util.TestRuleAssertionsRequired$1.evaluate(TestRuleAssertionsRequired.java:43)
[junit4:junit4]   2> 	        at org.apache.lucene.util.TestRuleMarkFailure$1.evaluate(TestRuleMarkFailure.java:48)
[junit4:junit4]   2> 	        at org.apache.lucene.util.TestRuleIgnoreAfterMaxFailures$1.evaluate(TestRuleIgnoreAfterMaxFailures.java:70)
[junit4:junit4]   2> 	        at org.apache.lucene.util.TestRuleIgnoreTestSuites$1.evaluate(TestRuleIgnoreTestSuites.java:55)
[junit4:junit4]   2> 	        at com.carrotsearch.randomizedtesting.rules.StatementAdapter.evaluate(StatementAdapter.java:36)
[junit4:junit4]   2> 	        at com.carrotsearch.randomizedtesting.ThreadLeakControl$StatementRunner.run(ThreadLeakControl.java:358)
[junit4:junit4]   2> 	        at java.lang.Thread.run(Thread.java:722)
[junit4:junit4]   2> 	  29) Thread[id=440, name=searcherExecutor-164-thread-1, state=WAITING, group=TGRP-BasicDistributedZkTest]
[junit4:junit4]   2> 	        at sun.misc.Unsafe.park(Native Method)
[junit4:junit4]   2> 	        at java.util.concurrent.locks.LockSupport.park(LockSupport.java:186)
[junit4:junit4]   2> 	        at java.util.concurrent.locks.AbstractQueuedSynchronizer$ConditionObject.await(AbstractQueuedSynchronizer.java:2043)
[junit4:junit4]   2> 	        at java.util.concurrent.LinkedBlockingQueue.take(LinkedBlockingQueue.java:442)
[junit4:junit4]   2> 	        at java.util.concurrent.ThreadPoolExecutor.getTask(ThreadPoolExecutor.java:1043)
[junit4:junit4]   2> 	        at java.util.concurrent.ThreadPoolExecutor.runWorker(ThreadPoolExecutor.java:1103)
[junit4:junit4]   2> 	        at java.util.concurrent.ThreadPoolExecutor$Worker.run(ThreadPoolExecutor.java:603)
[junit4:junit4]   2> 	        at java.lang.Thread.run(Thread.java:722)
[junit4:junit4]   2> 	  30) Thread[id=769, name=searcherExecutor-282-thread-1, state=WAITING, group=TGRP-BasicDistributedZkTest]
[junit4:junit4]   2> 	        at sun.misc.Unsafe.park(Native Method)
[junit4:junit4]   2> 	        at java.util.concurrent.locks.LockSupport.park(LockSupport.java:186)
[junit4:junit4]   2> 	        at java.util.concurrent.locks.AbstractQueuedSynchronizer$ConditionObject.await(AbstractQueuedSynchronizer.java:2043)
[junit4:junit4]   2> 	        at java.util.concurrent.LinkedBlockingQueue.take(LinkedBlockingQueue.java:442)
[junit4:junit4]   2> 	        at java.util.concurrent.ThreadPoolExecutor.getTask(ThreadPoolExecutor.java:1043)
[junit4:junit4]   2> 	        at java.util.concurrent.ThreadPoolExecutor.runWorker(ThreadPoolExecutor.java:1103)
[junit4:junit4]   2> 	        at java.util.concurrent.ThreadPoolExecutor$Worker.run(ThreadPoolExecutor.java:603)
[junit4:junit4]   2> 	        at java.lang.Thread.run(Thread.java:722)
[junit4:junit4]   2> NOTE: test params are: codec=Lucene41: {n_f1=PostingsFormat(name=MockSep), foo_b=MockFixedIntBlock(blockSize=288), cat=PostingsFormat(name=SimpleText), foo_d=PostingsFormat(name=Direct), foo_f=MockFixedIntBlock(blockSize=288), n_tl1=PostingsFormat(name=MockSep), n_d1=PostingsFormat(name=SimpleText), rnd_b=PostingsFormat(name=Direct), intDefault=PostingsFormat(name=MockSep), n_td1=PostingsFormat(name=MockSep), timestamp=PostingsFormat(name=MockSep), id=PostingsFormat(name=Direct), range_facet_sl=PostingsFormat(name=Direct), range_facet_si=PostingsFormat(name=SimpleText), oddField_s=PostingsFormat(name=Direct), sequence_i=PostingsFormat(name=Direct), name=PostingsFormat(name=Direct), foo_i=PostingsFormat(name=MockSep), regex_dup_B_s=PostingsFormat(name=MockSep), multiDefault=PostingsFormat(name=MockSep), n_tf1=PostingsFormat(name=SimpleText), n_dt1=PostingsFormat(name=MockSep), genre_s=PostingsFormat(name=Direct), author_t=PostingsFormat(name=MockSep), n_ti1=PostingsFormat(name=Direct), range_facet_l=PostingsFormat(name=MockSep), text=MockFixedIntBlock(blockSize=288), _version_=PostingsFormat(name=MockSep), val_i=PostingsFormat(name=Direct), SubjectTerms_mfacet=PostingsFormat(name=MockSep), series_t=PostingsFormat(name=MockSep), a_t=PostingsFormat(name=SimpleText), n_tdt1=PostingsFormat(name=MockSep), regex_dup_A_s=MockFixedIntBlock(blockSize=288), price=MockFixedIntBlock(blockSize=288), other_tl1=PostingsFormat(name=MockSep), n_l1=PostingsFormat(name=SimpleText), a_si=PostingsFormat(name=MockSep), inStock=MockFixedIntBlock(blockSize=288)}, sim=DefaultSimilarity, locale=ga, timezone=Europe/Sofia
[junit4:junit4]   2> NOTE: FreeBSD 9.0-RELEASE amd64/Oracle Corporation 1.7.0_09 (64-bit)/cpus=16,threads=31,free=144482608,total=402653184
[junit4:junit4]   2> NOTE: All tests run in this JVM: [CopyFieldTest, TestIndexingPerformance, TestIndexSearcher, TestStressReorder, MoreLikeThisHandlerTest, NotRequiredUniqueKeyTest, SolrCmdDistributorTest, CacheHeaderTest, SimpleFacetsTest, ChaosMonkeySafeLeaderTest, TestFastLRUCache, TestSolrIndexConfig, BasicDistributedZkTest]
[junit4:junit4]   2> NOTE: reproduce with: ant test  -Dtestcase=BasicDistributedZkTest -Dtests.seed=131F65E17E66C663 -Dtests.multiplier=3 -Dtests.slow=true -Dtests.locale=ga -Dtests.timezone=Europe/Sofia -Dtests.file.encoding=US-ASCII
[junit4:junit4] ERROR   0.00s J0 | BasicDistributedZkTest (suite) <<<
[junit4:junit4]    > Throwable #1: java.lang.Exception: Suite timeout exceeded (>= 7200000 msec).
[junit4:junit4]    > 	at __randomizedtesting.SeedInfo.seed([131F65E17E66C663]:0)
[junit4:junit4] Completed on J0 in 7223.62s, 1 test, 2 errors <<< FAILURES!

[...truncated 158 lines...]
BUILD FAILED
/usr/home/hudson/hudson-slave/workspace/Lucene-Solr-Tests-4.x-java7/build.xml:344: The following error occurred while executing this line:
/usr/home/hudson/hudson-slave/workspace/Lucene-Solr-Tests-4.x-java7/build.xml:39: The following error occurred while executing this line:
/usr/home/hudson/hudson-slave/workspace/Lucene-Solr-Tests-4.x-java7/solr/build.xml:178: The following error occurred while executing this line:
/usr/home/hudson/hudson-slave/workspace/Lucene-Solr-Tests-4.x-java7/solr/common-build.xml:428: The following error occurred while executing this line:
/usr/home/hudson/hudson-slave/workspace/Lucene-Solr-Tests-4.x-java7/lucene/common-build.xml:1176: The following error occurred while executing this line:
/usr/home/hudson/hudson-slave/workspace/Lucene-Solr-Tests-4.x-java7/lucene/common-build.xml:841: There were test failures: 248 suites, 1034 tests, 1 suite-level error, 1 error, 181 ignored (3 assumptions)

Total time: 142 minutes 33 seconds
Build step 'Invoke Ant' marked build as failure
Archiving artifacts
Recording test results
Email was triggered for: Failure
Sending email for trigger: Failure



Mime
View raw message