lucene-dev mailing list archives

Site index · List index
Message view « Date » · « Thread »
Top « Date » · « Thread »
From Charlie Cron <hudsonsevilt...@gmail.com>
Subject Build failed in Jenkins: the 4547 machine gun #936
Date Mon, 28 Jan 2013 02:50:19 GMT
See <http://fortyounce.servebeer.com/job/the%204547%20machine%20gun/936/changes>

Changes:

[rmuir] clear up some nocommits

------------------------------------------
[...truncated 54295 lines...]
[junit4:junit4]    > 	at org.apache.lucene.index.BasePostingsFormatTestCase.access$100(BasePostingsFormatTestCase.java:82)
[junit4:junit4]    > 	at org.apache.lucene.index.BasePostingsFormatTestCase$TestThread.run(BasePostingsFormatTestCase.java:914)
[junit4:junit4]    > Throwable #10: com.carrotsearch.randomizedtesting.UncaughtExceptionError:
Captured an uncaught exception in thread: Thread[id=567, name=Thread-367, state=RUNNABLE,
group=TGRP-TestPostingsFormat]
[junit4:junit4]    > Caused by: java.lang.RuntimeException: java.lang.NoSuchMethodError:
org.apache.lucene.util.PagedBytes$Reader.fillSlice(Lorg/apache/lucene/util/BytesRef;JI)Lorg/apache/lucene/util/BytesRef;
[junit4:junit4]    > 	at __randomizedtesting.SeedInfo.seed([A729BA667DCA09B3]:0)
[junit4:junit4]    > 	at org.apache.lucene.index.BasePostingsFormatTestCase$TestThread.run(BasePostingsFormatTestCase.java:916)
[junit4:junit4]    > Caused by: java.lang.NoSuchMethodError: org.apache.lucene.util.PagedBytes$Reader.fillSlice(Lorg/apache/lucene/util/BytesRef;JI)Lorg/apache/lucene/util/BytesRef;
[junit4:junit4]    > 	at org.apache.lucene.codecs.blockterms.FixedGapTermsIndexReader$IndexEnum.seek(FixedGapTermsIndexReader.java:187)
[junit4:junit4]    > 	at org.apache.lucene.codecs.blockterms.BlockTermsReader$FieldReader$SegmentTermsEnum.seekCeil(BlockTermsReader.java:436)
[junit4:junit4]    > 	at org.apache.lucene.index.TermsEnum.seekExact(TermsEnum.java:74)
[junit4:junit4]    > 	at org.apache.lucene.index.BasePostingsFormatTestCase.testTermsOneThread(BasePostingsFormatTestCase.java:986)
[junit4:junit4]    > 	at org.apache.lucene.index.BasePostingsFormatTestCase.access$100(BasePostingsFormatTestCase.java:82)
[junit4:junit4]    > 	at org.apache.lucene.index.BasePostingsFormatTestCase$TestThread.run(BasePostingsFormatTestCase.java:914)
[junit4:junit4]    > Throwable #11: com.carrotsearch.randomizedtesting.UncaughtExceptionError:
Captured an uncaught exception in thread: Thread[id=570, name=Thread-370, state=RUNNABLE,
group=TGRP-TestPostingsFormat]
[junit4:junit4]    > Caused by: java.lang.RuntimeException: java.lang.NoSuchMethodError:
org.apache.lucene.util.PagedBytes$Reader.fillSlice(Lorg/apache/lucene/util/BytesRef;JI)Lorg/apache/lucene/util/BytesRef;
[junit4:junit4]    > 	at __randomizedtesting.SeedInfo.seed([A729BA667DCA09B3]:0)
[junit4:junit4]    > 	at org.apache.lucene.index.BasePostingsFormatTestCase$TestThread.run(BasePostingsFormatTestCase.java:916)
[junit4:junit4]    > Caused by: java.lang.NoSuchMethodError: org.apache.lucene.util.PagedBytes$Reader.fillSlice(Lorg/apache/lucene/util/BytesRef;JI)Lorg/apache/lucene/util/BytesRef;
[junit4:junit4]    > 	at org.apache.lucene.codecs.blockterms.FixedGapTermsIndexReader$IndexEnum.seek(FixedGapTermsIndexReader.java:187)
[junit4:junit4]    > 	at org.apache.lucene.codecs.blockterms.BlockTermsReader$FieldReader$SegmentTermsEnum.seekCeil(BlockTermsReader.java:436)
[junit4:junit4]    > 	at org.apache.lucene.index.TermsEnum.seekExact(TermsEnum.java:74)
[junit4:junit4]    > 	at org.apache.lucene.index.BasePostingsFormatTestCase.testTermsOneThread(BasePostingsFormatTestCase.java:986)
[junit4:junit4]    > 	at org.apache.lucene.index.BasePostingsFormatTestCase.access$100(BasePostingsFormatTestCase.java:82)
[junit4:junit4]    > 	at org.apache.lucene.index.BasePostingsFormatTestCase$TestThread.run(BasePostingsFormatTestCase.java:914)
[junit4:junit4]    > Throwable #12: com.carrotsearch.randomizedtesting.UncaughtExceptionError:
Captured an uncaught exception in thread: Thread[id=569, name=Thread-369, state=RUNNABLE,
group=TGRP-TestPostingsFormat]
[junit4:junit4]    > Caused by: java.lang.RuntimeException: java.lang.NoSuchMethodError:
org.apache.lucene.util.PagedBytes$Reader.fillSlice(Lorg/apache/lucene/util/BytesRef;JI)Lorg/apache/lucene/util/BytesRef;
[junit4:junit4]    > 	at __randomizedtesting.SeedInfo.seed([A729BA667DCA09B3]:0)
[junit4:junit4]    > 	at org.apache.lucene.index.BasePostingsFormatTestCase$TestThread.run(BasePostingsFormatTestCase.java:916)
[junit4:junit4]    > Caused by: java.lang.NoSuchMethodError: org.apache.lucene.util.PagedBytes$Reader.fillSlice(Lorg/apache/lucene/util/BytesRef;JI)Lorg/apache/lucene/util/BytesRef;
[junit4:junit4]    > 	at org.apache.lucene.codecs.blockterms.FixedGapTermsIndexReader$IndexEnum.seek(FixedGapTermsIndexReader.java:187)
[junit4:junit4]    > 	at org.apache.lucene.codecs.blockterms.BlockTermsReader$FieldReader$SegmentTermsEnum.seekCeil(BlockTermsReader.java:436)
[junit4:junit4]    > 	at org.apache.lucene.index.TermsEnum.seekExact(TermsEnum.java:74)
[junit4:junit4]    > 	at org.apache.lucene.index.BasePostingsFormatTestCase.testTermsOneThread(BasePostingsFormatTestCase.java:986)
[junit4:junit4]    > 	at org.apache.lucene.index.BasePostingsFormatTestCase.access$100(BasePostingsFormatTestCase.java:82)
[junit4:junit4]    > 	at org.apache.lucene.index.BasePostingsFormatTestCase$TestThread.run(BasePostingsFormatTestCase.java:914)
[junit4:junit4]   2> NOTE: test params are: codec=Lucene42: {sheuewyntr=PostingsFormat(name=MockRandom),
hd=PostingsFormat(name=Asserting)}, docValues:{}, sim=DefaultSimilarity, locale=vi_VN, timezone=America/Indiana/Vincennes
[junit4:junit4]   2> NOTE: Linux 3.2.0-24-generic amd64/Oracle Corporation 1.7.0_09 (64-bit)/cpus=8,threads=1,free=71962864,total=234881024
[junit4:junit4]   2> NOTE: All tests run in this JVM: [TestPrefixInBooleanQuery, TestIndexCommit,
TestForceMergeForever, TestDeterminizeLexicon, TestDocumentWriter, TestNoMergePolicy, TestMultiMMap,
TestGraphTokenizers, TestUTF32ToUTF8, TestTopScoreDocCollector, TestRegexpRandom, TestDocsAndPositions,
TestOmitNorms, TestFilterAtomicReader, TestAttributeSource, TestMockCharFilter, TestStressIndexing2,
TestCharFilter, Nested, TestPagedBytes, TestPayloadTermQuery, Nested, Nested, Nested, Nested,
Nested, Nested, Nested, Nested, Nested, Nested, Nested, Nested, Nested, Nested, Nested, Nested,
Nested, Nested, Nested, Nested, Nested, TestFixedBitSet, TestSetOnce, TestOmitPositions, TestSmallFloat,
TestIndexInput, TestByteSlices, TestSumDocFreq, Nested, TestPositionIncrement, TestRollback,
TestConjunctions, TestTimeLimitingCollector, TestWildcardRandom, TestSearchWithThreads, TestStressNRT,
TestSearchAfter, TestIdentityHashSet, TestFilteredQuery, TestPerFieldPostingsFormat, TestForTooMuchCloning,
TestIndexableField, TestParallelAtomicReader, TestTermRangeQuery, TestSpanMultiTermQueryWrapper,
TestCheckIndex, TestDocCount, TestIndexWriterConfig, TestDocValuesScoring, TestTermScorer,
TestSpansAdvanced, TestRecyclingByteBlockAllocator, TestReaderClosed, TestMatchAllDocsQuery,
TestIndexWriterOnJRECrash, TestPrefixQuery, TestIntsRef, TestFieldInfos, TestVersion, TestByteBlockPool,
TestSimpleAttributeImpl, TestDemoDocValue, TestFastCompressionMode, TestLucene40PostingsFormat,
TestForUtil, Test2BPostingsBytes, Test4GBStoredFields, TestDocValuesWithThreads, TestPostingsFormat]
[junit4:junit4] Completed on J3 in 0.50s, 7 tests, 2 errors <<< FAILURES!
[junit4:junit4] 
[junit4:junit4] Suite: org.apache.lucene.util.TestBytesRefArray
[junit4:junit4] Completed on J0 in 0.04s, 2 tests
[junit4:junit4] 
[junit4:junit4] Suite: org.apache.lucene.util.TestFilterIterator
[junit4:junit4] Completed on J2 in 0.03s, 8 tests
[junit4:junit4] 
[junit4:junit4] Suite: org.apache.lucene.util.TestRecyclingIntBlockAllocator
[junit4:junit4] Completed on J3 in 0.02s, 3 tests
[junit4:junit4] 
[junit4:junit4] Suite: org.apache.lucene.util.fst.Test2BFST
[junit4:junit4] Completed on J0 in 0.00s, 0 tests
[junit4:junit4] 
[junit4:junit4] Suite: org.apache.lucene.util.junitcompat.TestFailOnFieldCacheInsanity
[junit4:junit4] FAILURE 0.01s J2 | TestFailOnFieldCacheInsanity.testFailOnFieldCacheInsanity
<<<
[junit4:junit4]    > Throwable #1: java.lang.AssertionError
[junit4:junit4]    > 	at org.junit.Assert.fail(Assert.java:92)
[junit4:junit4]    > 	at org.junit.Assert.assertTrue(Assert.java:43)
[junit4:junit4]    > 	at org.junit.Assert.assertTrue(Assert.java:54)
[junit4:junit4]    > 	at org.apache.lucene.util.junitcompat.TestFailOnFieldCacheInsanity.testFailOnFieldCacheInsanity(TestFailOnFieldCacheInsanity.java:74)
[junit4:junit4]    > 	at sun.reflect.NativeMethodAccessorImpl.invoke0(Native Method)
[junit4:junit4]    > 	at sun.reflect.NativeMethodAccessorImpl.invoke(NativeMethodAccessorImpl.java:57)
[junit4:junit4]    > 	at sun.reflect.DelegatingMethodAccessorImpl.invoke(DelegatingMethodAccessorImpl.java:43)
[junit4:junit4]    > 	at java.lang.reflect.Method.invoke(Method.java:601)
[junit4:junit4]    > 	at org.junit.runners.model.FrameworkMethod$1.runReflectiveCall(FrameworkMethod.java:45)
[junit4:junit4]    > 	at org.junit.internal.runners.model.ReflectiveCallable.run(ReflectiveCallable.java:15)
[junit4:junit4]    > 	at org.junit.runners.model.FrameworkMethod.invokeExplosively(FrameworkMethod.java:42)
[junit4:junit4]    > 	at org.junit.internal.runners.statements.InvokeMethod.evaluate(InvokeMethod.java:20)
[junit4:junit4]    > 	at org.junit.internal.runners.statements.RunBefores.evaluate(RunBefores.java:28)
[junit4:junit4]    > 	at org.junit.internal.runners.statements.RunAfters.evaluate(RunAfters.java:30)
[junit4:junit4]    > 	at com.carrotsearch.randomizedtesting.rules.SystemPropertiesRestoreRule$1.evaluate(SystemPropertiesRestoreRule.java:53)
[junit4:junit4]    > 	at org.junit.rules.RunRules.evaluate(RunRules.java:18)
[junit4:junit4]    > 	at org.junit.runners.ParentRunner.runLeaf(ParentRunner.java:263)
[junit4:junit4]    > 	at org.junit.runners.BlockJUnit4ClassRunner.runChild(BlockJUnit4ClassRunner.java:68)
[junit4:junit4]    > 	at org.junit.runners.BlockJUnit4ClassRunner.runChild(BlockJUnit4ClassRunner.java:47)
[junit4:junit4]    > 	at org.junit.runners.ParentRunner$3.run(ParentRunner.java:231)
[junit4:junit4]    > 	at org.junit.runners.ParentRunner$1.schedule(ParentRunner.java:60)
[junit4:junit4]    > 	at org.junit.runners.ParentRunner.runChildren(ParentRunner.java:229)
[junit4:junit4]    > 	at org.junit.runners.ParentRunner.access$000(ParentRunner.java:50)
[junit4:junit4]    > 	at org.junit.runners.ParentRunner$2.evaluate(ParentRunner.java:222)
[junit4:junit4]    > 	at org.junit.runners.ParentRunner.run(ParentRunner.java:300)
[junit4:junit4]    > 	at com.carrotsearch.ant.tasks.junit4.slave.SlaveMain.execute(SlaveMain.java:180)
[junit4:junit4]    > 	at com.carrotsearch.ant.tasks.junit4.slave.SlaveMain.main(SlaveMain.java:275)
[junit4:junit4]    > 	at com.carrotsearch.ant.tasks.junit4.slave.SlaveMainSafe.main(SlaveMainSafe.java:12)
[junit4:junit4] Completed on J2 in 0.01s, 1 test, 1 failure <<< FAILURES!
[junit4:junit4] 
[junit4:junit4] Suite: org.apache.lucene.util.junitcompat.TestLeaveFilesIfTestFails
[junit4:junit4] Completed on J3 in 0.01s, 1 test
[junit4:junit4] 
[junit4:junit4] Suite: org.apache.lucene.index.TestNRTReaderWithThreads
[junit4:junit4]   1> java.lang.NoSuchMethodError: org.apache.lucene.util.ByteBlockPool.setBytesRef(Lorg/apache/lucene/util/BytesRef;I)Lorg/apache/lucene/util/BytesRef;
[junit4:junit4]   1> 	at org.apache.lucene.index.TermVectorsConsumerPerField.finishDocument(TermVectorsConsumerPerField.java:173)
[junit4:junit4]   1> 	at org.apache.lucene.index.TermVectorsConsumer.finishDocument(TermVectorsConsumer.java:110)
[junit4:junit4]   1> 	at org.apache.lucene.index.TermsHash.finishDocument(TermsHash.java:132)
[junit4:junit4]   1> 	at org.apache.lucene.index.DocInverter.finishDocument(DocInverter.java:68)
[junit4:junit4]   1> 	at org.apache.lucene.index.DocFieldProcessor.finishDocument(DocFieldProcessor.java:292)
[junit4:junit4]   1> 	at org.apache.lucene.index.DocumentsWriterPerThread.updateDocument(DocumentsWriterPerThread.java:274)
[junit4:junit4]   1> 	at org.apache.lucene.index.DocumentsWriter.updateDocument(DocumentsWriter.java:376)
[junit4:junit4]   1> 	at org.apache.lucene.index.IndexWriter.updateDocument(IndexWriter.java:1471)
[junit4:junit4]   1> 	at org.apache.lucene.index.IndexWriter.addDocument(IndexWriter.java:1146)
[junit4:junit4]   1> 	at org.apache.lucene.index.IndexWriter.addDocument(IndexWriter.java:1127)
[junit4:junit4]   1> 	at org.apache.lucene.index.TestNRTReaderWithThreads$RunThread.run(TestNRTReaderWithThreads.java:94)
[junit4:junit4]   1> java.lang.NoSuchMethodError: org.apache.lucene.util.ByteBlockPool.setBytesRef(Lorg/apache/lucene/util/BytesRef;I)Lorg/apache/lucene/util/BytesRef;
[junit4:junit4]   1> 	at org.apache.lucene.index.TermVectorsConsumerPerField.finishDocument(TermVectorsConsumerPerField.java:173)
[junit4:junit4]   1> 	at org.apache.lucene.index.TermVectorsConsumer.finishDocument(TermVectorsConsumer.java:110)
[junit4:junit4]   1> 	at org.apache.lucene.index.TermsHash.finishDocument(TermsHash.java:132)
[junit4:junit4]   1> 	at org.apache.lucene.index.DocInverter.finishDocument(DocInverter.java:68)
[junit4:junit4]   1> 	at org.apache.lucene.index.DocFieldProcessor.finishDocument(DocFieldProcessor.java:292)
[junit4:junit4]   1> 	at org.apache.lucene.index.DocumentsWriterPerThread.updateDocument(DocumentsWriterPerThread.java:274)
[junit4:junit4]   1> 	at org.apache.lucene.index.DocumentsWriter.updateDocument(DocumentsWriter.java:376)
[junit4:junit4]   1> 	at org.apache.lucene.index.IndexWriter.updateDocument(IndexWriter.java:1471)
[junit4:junit4]   1> 	at org.apache.lucene.index.IndexWriter.addDocument(IndexWriter.java:1146)
[junit4:junit4]   1> 	at org.apache.lucene.index.IndexWriter.addDocument(IndexWriter.java:1127)
[junit4:junit4]   1> 	at org.apache.lucene.index.TestNRTReaderWithThreads$RunThread.run(TestNRTReaderWithThreads.java:94)
[junit4:junit4]   2> NOTE: reproduce with: ant test  -Dtestcase=TestNRTReaderWithThreads
-Dtests.method=testIndexing -Dtests.seed=A729BA667DCA09B3 -Dtests.slow=true -Dtests.locale=en
-Dtests.timezone=Africa/Kinshasa -Dtests.file.encoding=US-ASCII
[junit4:junit4] FAILURE 1.01s J1 | TestNRTReaderWithThreads.testIndexing <<<
[junit4:junit4]    > Throwable #1: java.lang.AssertionError: Exception thrown: java.lang.NoSuchMethodError:
org.apache.lucene.util.ByteBlockPool.setBytesRef(Lorg/apache/lucene/util/BytesRef;I)Lorg/apache/lucene/util/BytesRef;
[junit4:junit4]    > 	at __randomizedtesting.SeedInfo.seed([A729BA667DCA09B3:43F3F56F5BBF4A38]:0)
[junit4:junit4]    > 	at org.junit.Assert.fail(Assert.java:93)
[junit4:junit4]    > 	at org.junit.Assert.assertTrue(Assert.java:43)
[junit4:junit4]    > 	at org.junit.Assert.assertNull(Assert.java:551)
[junit4:junit4]    > 	at org.apache.lucene.index.TestNRTReaderWithThreads.testIndexing(TestNRTReaderWithThreads.java:56)
[junit4:junit4]    > 	at sun.reflect.NativeMethodAccessorImpl.invoke0(Native Method)
[junit4:junit4]    > 	at sun.reflect.NativeMethodAccessorImpl.invoke(NativeMethodAccessorImpl.java:57)
[junit4:junit4]    > 	at sun.reflect.DelegatingMethodAccessorImpl.invoke(DelegatingMethodAccessorImpl.java:43)
[junit4:junit4]    > 	at java.lang.reflect.Method.invoke(Method.java:601)
[junit4:junit4]    > 	at com.carrotsearch.randomizedtesting.RandomizedRunner.invoke(RandomizedRunner.java:1559)
[junit4:junit4]    > 	at com.carrotsearch.randomizedtesting.RandomizedRunner.access$600(RandomizedRunner.java:79)
[junit4:junit4]    > 	at com.carrotsearch.randomizedtesting.RandomizedRunner$6.evaluate(RandomizedRunner.java:737)
[junit4:junit4]    > 	at com.carrotsearch.randomizedtesting.RandomizedRunner$7.evaluate(RandomizedRunner.java:773)
[junit4:junit4]    > 	at com.carrotsearch.randomizedtesting.RandomizedRunner$8.evaluate(RandomizedRunner.java:787)
[junit4:junit4]    > 	at org.apache.lucene.util.TestRuleSetupTeardownChained$1.evaluate(TestRuleSetupTeardownChained.java:50)
[junit4:junit4]    > 	at org.apache.lucene.util.TestRuleFieldCacheSanity$1.evaluate(TestRuleFieldCacheSanity.java:51)
[junit4:junit4]    > 	at org.apache.lucene.util.AbstractBeforeAfterRule$1.evaluate(AbstractBeforeAfterRule.java:46)
[junit4:junit4]    > 	at com.carrotsearch.randomizedtesting.rules.SystemPropertiesInvariantRule$1.evaluate(SystemPropertiesInvariantRule.java:55)
[junit4:junit4]    > 	at org.apache.lucene.util.TestRuleThreadAndTestName$1.evaluate(TestRuleThreadAndTestName.java:49)
[junit4:junit4]    > 	at org.apache.lucene.util.TestRuleIgnoreAfterMaxFailures$1.evaluate(TestRuleIgnoreAfterMaxFailures.java:70)
[junit4:junit4]    > 	at org.apache.lucene.util.TestRuleMarkFailure$1.evaluate(TestRuleMarkFailure.java:48)
[junit4:junit4]    > 	at com.carrotsearch.randomizedtesting.rules.StatementAdapter.evaluate(StatementAdapter.java:36)
[junit4:junit4]    > 	at com.carrotsearch.randomizedtesting.ThreadLeakControl$StatementRunner.run(ThreadLeakControl.java:358)
[junit4:junit4]    > 	at com.carrotsearch.randomizedtesting.ThreadLeakControl.forkTimeoutingTask(ThreadLeakControl.java:782)
[junit4:junit4]    > 	at com.carrotsearch.randomizedtesting.ThreadLeakControl$3.evaluate(ThreadLeakControl.java:442)
[junit4:junit4]    > 	at com.carrotsearch.randomizedtesting.RandomizedRunner.runSingleTest(RandomizedRunner.java:746)
[junit4:junit4]    > 	at com.carrotsearch.randomizedtesting.RandomizedRunner$3.evaluate(RandomizedRunner.java:648)
[junit4:junit4]    > 	at com.carrotsearch.randomizedtesting.RandomizedRunner$4.evaluate(RandomizedRunner.java:682)
[junit4:junit4]    > 	at com.carrotsearch.randomizedtesting.RandomizedRunner$5.evaluate(RandomizedRunner.java:693)
[junit4:junit4]    > 	at org.apache.lucene.util.AbstractBeforeAfterRule$1.evaluate(AbstractBeforeAfterRule.java:46)
[junit4:junit4]    > 	at org.apache.lucene.util.TestRuleStoreClassName$1.evaluate(TestRuleStoreClassName.java:42)
[junit4:junit4]    > 	at com.carrotsearch.randomizedtesting.rules.SystemPropertiesInvariantRule$1.evaluate(SystemPropertiesInvariantRule.java:55)
[junit4:junit4]    > 	at com.carrotsearch.randomizedtesting.rules.NoShadowingOrOverridesOnMethodsRule$1.evaluate(NoShadowingOrOverridesOnMethodsRule.java:39)
[junit4:junit4]    > 	at com.carrotsearch.randomizedtesting.rules.NoShadowingOrOverridesOnMethodsRule$1.evaluate(NoShadowingOrOverridesOnMethodsRule.java:39)
[junit4:junit4]    > 	at com.carrotsearch.randomizedtesting.rules.StatementAdapter.evaluate(StatementAdapter.java:36)
[junit4:junit4]    > 	at org.apache.lucene.util.TestRuleAssertionsRequired$1.evaluate(TestRuleAssertionsRequired.java:43)
[junit4:junit4]    > 	at org.apache.lucene.util.TestRuleMarkFailure$1.evaluate(TestRuleMarkFailure.java:48)
[junit4:junit4]    > 	at org.apache.lucene.util.TestRuleIgnoreAfterMaxFailures$1.evaluate(TestRuleIgnoreAfterMaxFailures.java:70)
[junit4:junit4]    > 	at org.apache.lucene.util.TestRuleIgnoreTestSuites$1.evaluate(TestRuleIgnoreTestSuites.java:55)
[junit4:junit4]    > 	at com.carrotsearch.randomizedtesting.rules.StatementAdapter.evaluate(StatementAdapter.java:36)
[junit4:junit4]    > 	at com.carrotsearch.randomizedtesting.ThreadLeakControl$StatementRunner.run(ThreadLeakControl.java:358)
[junit4:junit4]    > 	at java.lang.Thread.run(Thread.java:722)
[junit4:junit4]   2> Jan 27, 2013 9:49:56 PM com.carrotsearch.randomizedtesting.ThreadLeakControl
checkThreadLeaks
[junit4:junit4]   2> WARNING: Will linger awaiting termination of 2 leaked thread(s).
[junit4:junit4]   2> Jan 27, 2013 9:50:16 PM com.carrotsearch.randomizedtesting.ThreadLeakControl
checkThreadLeaks
[junit4:junit4]   2> SEVERE: 2 threads leaked from SUITE scope at org.apache.lucene.index.TestNRTReaderWithThreads:

[junit4:junit4]   2>    1) Thread[id=177, name=Thread 1, state=RUNNABLE, group=TGRP-TestNRTReaderWithThreads]
[junit4:junit4]   2>         at org.apache.lucene.index.IndexWriter.getReader(IndexWriter.java:352)
[junit4:junit4]   2>         at org.apache.lucene.index.IndexWriter.getReader(IndexWriter.java:267)
[junit4:junit4]   2>         at org.apache.lucene.index.TestNRTReaderWithThreads$RunThread.run(TestNRTReaderWithThreads.java:99)
[junit4:junit4]   2>    2) Thread[id=179, name=Thread 3, state=BLOCKED, group=TGRP-TestNRTReaderWithThreads]
[junit4:junit4]   2>         at java.lang.Thread.holdsLock(Native Method)
[junit4:junit4]   2>         at org.apache.lucene.index.IndexFileDeleter.locked(IndexFileDeleter.java:115)
[junit4:junit4]   2>         at org.apache.lucene.index.IndexFileDeleter.deletePendingFiles(IndexFileDeleter.java:401)
[junit4:junit4]   2>         at org.apache.lucene.index.IndexWriter.deletePendingFiles(IndexWriter.java:4141)
[junit4:junit4]   2>         at org.apache.lucene.index.StandardDirectoryReader.doClose(StandardDirectoryReader.java:350)
[junit4:junit4]   2>         at org.apache.lucene.index.IndexReader.decRef(IndexReader.java:230)
[junit4:junit4]   2>         at org.apache.lucene.index.IndexReader.close(IndexReader.java:376)
[junit4:junit4]   2>         at org.apache.lucene.index.TestNRTReaderWithThreads$RunThread.run(TestNRTReaderWithThreads.java:104)
[junit4:junit4]   2> Jan 27, 2013 9:50:16 PM com.carrotsearch.randomizedtesting.ThreadLeakControl
tryToInterruptAll
[junit4:junit4]   2> INFO: Starting to interrupt leaked threads:
[junit4:junit4]   2>    1) Thread[id=177, name=Thread 1, state=BLOCKED, group=TGRP-TestNRTReaderWithThreads]
[junit4:junit4]   2>    2) Thread[id=179, name=Thread 3, state=BLOCKED, group=TGRP-TestNRTReaderWithThreads]
[junit4:junit4]   2> Jan 27, 2013 9:50:19 PM com.carrotsearch.randomizedtesting.ThreadLeakControl
tryToInterruptAll
[junit4:junit4]   2> SEVERE: There are still zombie threads that couldn't be terminated:
[junit4:junit4]   2>    1) Thread[id=177, name=Thread 1, state=BLOCKED, group=TGRP-TestNRTReaderWithThreads]
[junit4:junit4]   2>         at org.apache.lucene.index.IndexWriter.getReader(IndexWriter.java:352)
[junit4:junit4]   2>         at org.apache.lucene.index.IndexWriter.getReader(IndexWriter.java:267)
[junit4:junit4]   2>         at org.apache.lucene.index.TestNRTReaderWithThreads$RunThread.run(TestNRTReaderWithThreads.java:99)
[junit4:junit4]   2>    2) Thread[id=179, name=Thread 3, state=RUNNABLE, group=TGRP-TestNRTReaderWithThreads]
[junit4:junit4]   2>         at org.apache.lucene.index.IndexWriter.getReader(IndexWriter.java:352)
[junit4:junit4]   2>         at org.apache.lucene.index.IndexWriter.getReader(IndexWriter.java:267)
[junit4:junit4]   2>         at org.apache.lucene.index.TestNRTReaderWithThreads$RunThread.run(TestNRTReaderWithThreads.java:99)
[junit4:junit4]   2> NOTE: test params are: codec=Lucene41, sim=RandomSimilarityProvider(queryNorm=false,coord=no):
{field5=DFR I(F)1, field4=DFR I(F)Z(0.3), field3=IB SPL-LZ(0.3), field2=DFR GBZ(0.3), field9=DFR
I(ne)Z(0.3), field10=DFR I(n)B2, field8=DFR GB2, field7=DFR I(n)Z(0.3), field6=DFR I(ne)L1,
field1=DFR I(ne)2}, locale=en, timezone=Africa/Kinshasa
[junit4:junit4]   2> NOTE: Linux 3.2.0-24-generic amd64/Oracle Corporation 1.7.0_09 (64-bit)/cpus=8,threads=3,free=206417136,total=349765632
[junit4:junit4]   2> NOTE: All tests run in this JVM: [TestDocValuesIndexing, TestIndexWriterMerging,
TestExplanations, Nested1, TestTermVectors, TestSegmentTermEnum, TestLockFactory, TestBufferedIndexInput,
TestRegexpQuery, TestIsCurrent, TestDeterminism, TestBackwardsCompatibility, TestParallelTermEnum,
TestPayloads, InBeforeClass, InAfterClass, InTestMethod, NonStringProperties, TestRAMDirectory,
TestIndexWriterLockRelease, TestSimilarity2, TestNGramPhraseQuery, TestMultiPhraseQuery, TestPerFieldPostingsFormat2,
TestUniqueTermCount, TestBasics, NestedSetupChain, NestedTeardownChain, TestCodecHoldsOpenFiles,
TestSimilarityBase, TestDateSort, TestNumericRangeQuery64, TestArrayUtil, TestExternalCodecs,
TestThreadedForceMerge, TestDocument, Test2BPostings, TestFlex, TestIndexWriterMergePolicy,
Test2BPositions, TestTopDocsMerge, TestPackedInts, TestBlockPostingsFormat2, TestBooleanQuery,
TestBooleanMinShouldMatch, TestPersistentSnapshotDeletionPolicy, TestDirectoryReaderReopen,
TestLongPostings, TestIndexWriterCommit, TestDirectoryReader, TestWeakIdentityMap, TestCustomNorms,
TestMockAnalyzer, TestNRTReaderWithThreads]
[junit4:junit4]   2> NOTE: reproduce with: ant test  -Dtestcase=TestNRTReaderWithThreads
-Dtests.seed=A729BA667DCA09B3 -Dtests.slow=true -Dtests.locale=en -Dtests.timezone=Africa/Kinshasa
-Dtests.file.encoding=US-ASCII
[junit4:junit4] ERROR   0.00s J1 | TestNRTReaderWithThreads (suite) <<<
[junit4:junit4]    > Throwable #1: com.carrotsearch.randomizedtesting.ThreadLeakError:
2 threads leaked from SUITE scope at org.apache.lucene.index.TestNRTReaderWithThreads: 
[junit4:junit4]    >    1) Thread[id=177, name=Thread 1, state=RUNNABLE, group=TGRP-TestNRTReaderWithThreads]
[junit4:junit4]    >         at org.apache.lucene.index.IndexWriter.getReader(IndexWriter.java:352)
[junit4:junit4]    >         at org.apache.lucene.index.IndexWriter.getReader(IndexWriter.java:267)
[junit4:junit4]    >         at org.apache.lucene.index.TestNRTReaderWithThreads$RunThread.run(TestNRTReaderWithThreads.java:99)
[junit4:junit4]    >    2) Thread[id=179, name=Thread 3, state=BLOCKED, group=TGRP-TestNRTReaderWithThreads]
[junit4:junit4]    >         at java.lang.Thread.holdsLock(Native Method)
[junit4:junit4]    >         at org.apache.lucene.index.IndexFileDeleter.locked(IndexFileDeleter.java:115)
[junit4:junit4]    >         at org.apache.lucene.index.IndexFileDeleter.deletePendingFiles(IndexFileDeleter.java:401)
[junit4:junit4]    >         at org.apache.lucene.index.IndexWriter.deletePendingFiles(IndexWriter.java:4141)
[junit4:junit4]    >         at org.apache.lucene.index.StandardDirectoryReader.doClose(StandardDirectoryReader.java:350)
[junit4:junit4]    >         at org.apache.lucene.index.IndexReader.decRef(IndexReader.java:230)
[junit4:junit4]    >         at org.apache.lucene.index.IndexReader.close(IndexReader.java:376)
[junit4:junit4]    >         at org.apache.lucene.index.TestNRTReaderWithThreads$RunThread.run(TestNRTReaderWithThreads.java:104)
[junit4:junit4]    > 	at __randomizedtesting.SeedInfo.seed([A729BA667DCA09B3]:0)
[junit4:junit4]    > Throwable #2: com.carrotsearch.randomizedtesting.ThreadLeakError:
There are still zombie threads that couldn't be terminated:
[junit4:junit4]    >    1) Thread[id=177, name=Thread 1, state=BLOCKED, group=TGRP-TestNRTReaderWithThreads]
[junit4:junit4]    >         at org.apache.lucene.index.IndexWriter.getReader(IndexWriter.java:352)
[junit4:junit4]    >         at org.apache.lucene.index.IndexWriter.getReader(IndexWriter.java:267)
[junit4:junit4]    >         at org.apache.lucene.index.TestNRTReaderWithThreads$RunThread.run(TestNRTReaderWithThreads.java:99)
[junit4:junit4]    >    2) Thread[id=179, name=Thread 3, state=RUNNABLE, group=TGRP-TestNRTReaderWithThreads]
[junit4:junit4]    >         at org.apache.lucene.index.IndexWriter.getReader(IndexWriter.java:352)
[junit4:junit4]    >         at org.apache.lucene.index.IndexWriter.getReader(IndexWriter.java:267)
[junit4:junit4]    >         at org.apache.lucene.index.TestNRTReaderWithThreads$RunThread.run(TestNRTReaderWithThreads.java:99)
[junit4:junit4]    > 	at __randomizedtesting.SeedInfo.seed([A729BA667DCA09B3]:0)
[junit4:junit4] Completed on J1 in 24.09s, 1 test, 1 failure, 2 errors <<< FAILURES!
[junit4:junit4] 
[junit4:junit4] 
[junit4:junit4] Tests with failures (first 10 out of 745):
[junit4:junit4]   - org.apache.lucene.search.TestFieldValueFilter.testFieldValueFilter
[junit4:junit4]   - org.apache.lucene.search.TestFieldValueFilter.testFieldValueFilterNoValue
[junit4:junit4]   - org.apache.lucene.search.TestPrefixInBooleanQuery (suite)
[junit4:junit4]   - org.apache.lucene.search.TestTermRangeFilter (suite)
[junit4:junit4]   - org.apache.lucene.index.TestIndexWriterForceMerge.testForceMergeTempSpaceUsage
[junit4:junit4]   - org.apache.lucene.index.TestIndexWriterForceMerge.testPartialMerge
[junit4:junit4]   - org.apache.lucene.index.TestIndexWriterForceMerge.testBackgroundForceMerge
[junit4:junit4]   - org.apache.lucene.index.TestIndexWriterForceMerge.testMaxNumSegments2
[junit4:junit4]   - org.apache.lucene.index.TestIndexWriterExceptions.testTermVectorExceptions
[junit4:junit4]   - org.apache.lucene.index.TestIndexWriterExceptions.testExceptionOnMergeInit
[junit4:junit4] 
[junit4:junit4] 
[junit4:junit4] JVM J0:     0.72 ..    54.08 =    53.36s
[junit4:junit4] JVM J1:     0.72 ..    56.10 =    55.38s
[junit4:junit4] JVM J2:     0.72 ..    54.18 =    53.46s
[junit4:junit4] JVM J3:     0.74 ..    54.32 =    53.58s
[junit4:junit4] Execution time total: 56 seconds
[junit4:junit4] Tests summary: 330 suites, 1388 tests, 63 suite-level errors, 701 errors,
12 failures, 23 ignored (12 assumptions)

BUILD FAILED
<http://fortyounce.servebeer.com/job/the%204547%20machine%20gun/ws/build.xml>:50: The
following error occurred while executing this line:
<http://fortyounce.servebeer.com/job/the%204547%20machine%20gun/ws/common-build.xml>:1179:
The following error occurred while executing this line:
<http://fortyounce.servebeer.com/job/the%204547%20machine%20gun/ws/common-build.xml>:842:
There were test failures: 330 suites, 1388 tests, 63 suite-level errors, 701 errors, 12 failures,
23 ignored (12 assumptions)

Total time: 58 seconds
Build step 'Invoke Ant' marked build as failure

---------------------------------------------------------------------
To unsubscribe, e-mail: dev-unsubscribe@lucene.apache.org
For additional commands, e-mail: dev-help@lucene.apache.org


Mime
View raw message