lucene-dev mailing list archives

Site index · List index
Message view « Date » · « Thread »
Top « Date » · « Thread »
From Policeman Jenkins Server <jenk...@thetaphi.de>
Subject [JENKINS] Lucene-Solr-trunk-MacOSX (64bit/jdk1.7.0) - Build # 33 - Still Failing!
Date Wed, 02 Jan 2013 00:20:34 GMT
Build: http://jenkins.thetaphi.de/job/Lucene-Solr-trunk-MacOSX/33/
Java: 64bit/jdk1.7.0 -XX:+UseParallelGC

1 tests failed.
FAILED:  org.apache.solr.cloud.BasicDistributedZkTest.testDistribSearch

Error Message:
There are still nodes recoverying - waited for 230 seconds

Stack Trace:
java.lang.AssertionError: There are still nodes recoverying - waited for 230 seconds
	at __randomizedtesting.SeedInfo.seed([C1A737FBFE5C33AA:4041B9E389035396]:0)
	at org.junit.Assert.fail(Assert.java:93)
	at org.apache.solr.cloud.AbstractDistribZkTestBase.waitForRecoveriesToFinish(AbstractDistribZkTestBase.java:175)
	at org.apache.solr.cloud.AbstractDistribZkTestBase.waitForRecoveriesToFinish(AbstractDistribZkTestBase.java:125)
	at org.apache.solr.cloud.AbstractDistribZkTestBase.waitForRecoveriesToFinish(AbstractDistribZkTestBase.java:120)
	at org.apache.solr.cloud.BasicDistributedZkTest.testCoreUnloadAndLeaders(BasicDistributedZkTest.java:586)
	at org.apache.solr.cloud.BasicDistributedZkTest.doTest(BasicDistributedZkTest.java:337)
	at org.apache.solr.BaseDistributedSearchTestCase.testDistribSearch(BaseDistributedSearchTestCase.java:794)
	at sun.reflect.NativeMethodAccessorImpl.invoke0(Native Method)
	at sun.reflect.NativeMethodAccessorImpl.invoke(NativeMethodAccessorImpl.java:57)
	at sun.reflect.DelegatingMethodAccessorImpl.invoke(DelegatingMethodAccessorImpl.java:43)
	at java.lang.reflect.Method.invoke(Method.java:601)
	at com.carrotsearch.randomizedtesting.RandomizedRunner.invoke(RandomizedRunner.java:1559)
	at com.carrotsearch.randomizedtesting.RandomizedRunner.access$600(RandomizedRunner.java:79)
	at com.carrotsearch.randomizedtesting.RandomizedRunner$6.evaluate(RandomizedRunner.java:737)
	at com.carrotsearch.randomizedtesting.RandomizedRunner$7.evaluate(RandomizedRunner.java:773)
	at com.carrotsearch.randomizedtesting.RandomizedRunner$8.evaluate(RandomizedRunner.java:787)
	at com.carrotsearch.randomizedtesting.rules.SystemPropertiesRestoreRule$1.evaluate(SystemPropertiesRestoreRule.java:53)
	at org.apache.lucene.util.TestRuleSetupTeardownChained$1.evaluate(TestRuleSetupTeardownChained.java:50)
	at org.apache.lucene.util.TestRuleFieldCacheSanity$1.evaluate(TestRuleFieldCacheSanity.java:51)
	at org.apache.lucene.util.AbstractBeforeAfterRule$1.evaluate(AbstractBeforeAfterRule.java:46)
	at com.carrotsearch.randomizedtesting.rules.SystemPropertiesInvariantRule$1.evaluate(SystemPropertiesInvariantRule.java:55)
	at org.apache.lucene.util.TestRuleThreadAndTestName$1.evaluate(TestRuleThreadAndTestName.java:49)
	at org.apache.lucene.util.TestRuleIgnoreAfterMaxFailures$1.evaluate(TestRuleIgnoreAfterMaxFailures.java:70)
	at org.apache.lucene.util.TestRuleMarkFailure$1.evaluate(TestRuleMarkFailure.java:48)
	at com.carrotsearch.randomizedtesting.rules.StatementAdapter.evaluate(StatementAdapter.java:36)
	at com.carrotsearch.randomizedtesting.ThreadLeakControl$StatementRunner.run(ThreadLeakControl.java:358)
	at com.carrotsearch.randomizedtesting.ThreadLeakControl.forkTimeoutingTask(ThreadLeakControl.java:782)
	at com.carrotsearch.randomizedtesting.ThreadLeakControl$3.evaluate(ThreadLeakControl.java:442)
	at com.carrotsearch.randomizedtesting.RandomizedRunner.runSingleTest(RandomizedRunner.java:746)
	at com.carrotsearch.randomizedtesting.RandomizedRunner$3.evaluate(RandomizedRunner.java:648)
	at com.carrotsearch.randomizedtesting.RandomizedRunner$4.evaluate(RandomizedRunner.java:682)
	at com.carrotsearch.randomizedtesting.RandomizedRunner$5.evaluate(RandomizedRunner.java:693)
	at com.carrotsearch.randomizedtesting.rules.StatementAdapter.evaluate(StatementAdapter.java:36)
	at com.carrotsearch.randomizedtesting.rules.SystemPropertiesRestoreRule$1.evaluate(SystemPropertiesRestoreRule.java:53)
	at org.apache.lucene.util.AbstractBeforeAfterRule$1.evaluate(AbstractBeforeAfterRule.java:46)
	at org.apache.lucene.util.TestRuleStoreClassName$1.evaluate(TestRuleStoreClassName.java:42)
	at com.carrotsearch.randomizedtesting.rules.SystemPropertiesInvariantRule$1.evaluate(SystemPropertiesInvariantRule.java:55)
	at com.carrotsearch.randomizedtesting.rules.NoShadowingOrOverridesOnMethodsRule$1.evaluate(NoShadowingOrOverridesOnMethodsRule.java:39)
	at com.carrotsearch.randomizedtesting.rules.NoShadowingOrOverridesOnMethodsRule$1.evaluate(NoShadowingOrOverridesOnMethodsRule.java:39)
	at com.carrotsearch.randomizedtesting.rules.StatementAdapter.evaluate(StatementAdapter.java:36)
	at org.apache.lucene.util.TestRuleAssertionsRequired$1.evaluate(TestRuleAssertionsRequired.java:43)
	at org.apache.lucene.util.TestRuleMarkFailure$1.evaluate(TestRuleMarkFailure.java:48)
	at org.apache.lucene.util.TestRuleIgnoreAfterMaxFailures$1.evaluate(TestRuleIgnoreAfterMaxFailures.java:70)
	at org.apache.lucene.util.TestRuleIgnoreTestSuites$1.evaluate(TestRuleIgnoreTestSuites.java:55)
	at com.carrotsearch.randomizedtesting.rules.StatementAdapter.evaluate(StatementAdapter.java:36)
	at com.carrotsearch.randomizedtesting.ThreadLeakControl$StatementRunner.run(ThreadLeakControl.java:358)
	at java.lang.Thread.run(Thread.java:722)




Build Log:
[...truncated 8899 lines...]
[junit4:junit4] Suite: org.apache.solr.cloud.BasicDistributedZkTest
[junit4:junit4]   2> 0 T1989 oas.BaseDistributedSearchTestCase.initHostContext Setting hostContext system property: /
[junit4:junit4]   2> 7 T1989 oas.SolrTestCaseJ4.setUp ###Starting testDistribSearch
[junit4:junit4]   2> Creating dataDir: /Users/jenkins/jenkins-slave/workspace/Lucene-Solr-trunk-MacOSX/solr/build/solr-core/test/J0/./solrtest-BasicDistributedZkTest-1357084785146
[junit4:junit4]   2> 8 T1989 oasc.ZkTestServer.run STARTING ZK TEST SERVER
[junit4:junit4]   2> 7 T1990 oasc.ZkTestServer$ZKServerMain.runFromConfig Starting server
[junit4:junit4]   2> 9 T1990 oazs.ZooKeeperServer.setTickTime tickTime set to 1000
[junit4:junit4]   2> 9 T1990 oazs.ZooKeeperServer.setMinSessionTimeout minSessionTimeout set to -1
[junit4:junit4]   2> 10 T1990 oazs.ZooKeeperServer.setMaxSessionTimeout maxSessionTimeout set to -1
[junit4:junit4]   2> 10 T1990 oazs.NIOServerCnxnFactory.configure binding to port 0.0.0.0/0.0.0.0:0
[junit4:junit4]   2> 15 T1990 oazsp.FileTxnSnapLog.save Snapshotting: 0x0 to /Users/jenkins/jenkins-slave/workspace/Lucene-Solr-trunk-MacOSX/solr/build/solr-core/test/J0/./org.apache.solr.cloud.BasicDistributedZkTest-1357084785145/zookeeper/server1/data/version-2/snapshot.0
[junit4:junit4]   2> 111 T1989 oasc.ZkTestServer.run start zk server on port:49839
[junit4:junit4]   2> 112 T1989 oaz.ZooKeeper.<init> Initiating client connection, connectString=127.0.0.1:49839 sessionTimeout=10000 watcher=org.apache.solr.common.cloud.ConnectionManager@1c90dba2
[junit4:junit4]   2> 114 T1989 oascc.ConnectionManager.waitForConnected Waiting for client to connect to ZooKeeper
[junit4:junit4]   2> 112 T1995 oaz.ClientCnxn$SendThread.logStartConnect Opening socket connection to server localhost/127.0.0.1:49839. Will not attempt to authenticate using SASL (access denied ("javax.security.auth.AuthPermission" "getLoginConfiguration"))
[junit4:junit4]   2> 116 T1995 oaz.ClientCnxn$SendThread.primeConnection Socket connection established to localhost/127.0.0.1:49839, initiating session
[junit4:junit4]   2> 117 T1991 oazs.NIOServerCnxnFactory.run Accepted socket connection from /127.0.0.1:49840
[junit4:junit4]   2> 117 T1991 oazs.ZooKeeperServer.processConnectRequest Client attempting to establish new session at /127.0.0.1:49840
[junit4:junit4]   2> 118 T1993 oazsp.FileTxnLog.append Creating new log file: log.1
[junit4:junit4]   2> 123 T1993 oazs.ZooKeeperServer.finishSessionInit Established session 0x13bf88e7a000000 with negotiated timeout 10000 for client /127.0.0.1:49840
[junit4:junit4]   2> 121 T1995 oaz.ClientCnxn$SendThread.onConnected Session establishment complete on server localhost/127.0.0.1:49839, sessionid = 0x13bf88e7a000000, negotiated timeout = 10000
[junit4:junit4]   2> 124 T1996 oascc.ConnectionManager.process Watcher org.apache.solr.common.cloud.ConnectionManager@1c90dba2 name:ZooKeeperConnection Watcher:127.0.0.1:49839 got event WatchedEvent state:SyncConnected type:None path:null path:null type:None
[junit4:junit4]   2> 123 T1989 oascc.ConnectionManager.waitForConnected Client is connected to ZooKeeper
[junit4:junit4]   2> 123 T1989 oascc.SolrZkClient.makePath makePath: /solr
[junit4:junit4]   2> 133 T1994 oazs.PrepRequestProcessor.pRequest2Txn Processed session termination for sessionid: 0x13bf88e7a000000
[junit4:junit4]   2> 132 T1996 oaz.ClientCnxn$EventThread.run EventThread shut down
[junit4:junit4]   2> 132 T1989 oaz.ZooKeeper.close Session: 0x13bf88e7a000000 closed
[junit4:junit4]   2> 135 T1991 oazs.NIOServerCnxn.closeSock Closed socket connection for client /127.0.0.1:49840 which had sessionid 0x13bf88e7a000000
[junit4:junit4]   2> 136 T1989 oaz.ZooKeeper.<init> Initiating client connection, connectString=127.0.0.1:49839/solr sessionTimeout=10000 watcher=org.apache.solr.common.cloud.ConnectionManager@551a4d2c
[junit4:junit4]   2> 138 T1989 oascc.ConnectionManager.waitForConnected Waiting for client to connect to ZooKeeper
[junit4:junit4]   2> 137 T1997 oaz.ClientCnxn$SendThread.logStartConnect Opening socket connection to server localhost/127.0.0.1:49839. Will not attempt to authenticate using SASL (access denied ("javax.security.auth.AuthPermission" "getLoginConfiguration"))
[junit4:junit4]   2> 140 T1997 oaz.ClientCnxn$SendThread.primeConnection Socket connection established to localhost/127.0.0.1:49839, initiating session
[junit4:junit4]   2> 141 T1991 oazs.NIOServerCnxnFactory.run Accepted socket connection from /127.0.0.1:49841
[junit4:junit4]   2> 142 T1991 oazs.ZooKeeperServer.processConnectRequest Client attempting to establish new session at /127.0.0.1:49841
[junit4:junit4]   2> 141 T1993 oazs.ZooKeeperServer.finishSessionInit Established session 0x13bf88e7a000001 with negotiated timeout 10000 for client /127.0.0.1:49841
[junit4:junit4]   2> 142 T1997 oaz.ClientCnxn$SendThread.onConnected Session establishment complete on server localhost/127.0.0.1:49839, sessionid = 0x13bf88e7a000001, negotiated timeout = 10000
[junit4:junit4]   2> 142 T1998 oascc.ConnectionManager.process Watcher org.apache.solr.common.cloud.ConnectionManager@551a4d2c name:ZooKeeperConnection Watcher:127.0.0.1:49839/solr got event WatchedEvent state:SyncConnected type:None path:null path:null type:None
[junit4:junit4]   2> 142 T1989 oascc.ConnectionManager.waitForConnected Client is connected to ZooKeeper
[junit4:junit4]   2> 143 T1989 oascc.SolrZkClient.makePath makePath: /collections/collection1
[junit4:junit4]   2> 150 T1989 oascc.SolrZkClient.makePath makePath: /collections/collection1/shards
[junit4:junit4]   2> 154 T1989 oascc.SolrZkClient.makePath makePath: /collections/control_collection
[junit4:junit4]   2> 161 T1989 oascc.SolrZkClient.makePath makePath: /collections/control_collection/shards
[junit4:junit4]   2> 167 T1989 oasc.AbstractZkTestCase.putConfig put /Users/jenkins/jenkins-slave/workspace/Lucene-Solr-trunk-MacOSX/solr/build/solr-core/test-files/solr/collection1/conf/solrconfig.xml to /configs/conf1/solrconfig.xml
[junit4:junit4]   2> 169 T1989 oascc.SolrZkClient.makePath makePath: /configs/conf1/solrconfig.xml
[junit4:junit4]   2> 178 T1989 oasc.AbstractZkTestCase.putConfig put /Users/jenkins/jenkins-slave/workspace/Lucene-Solr-trunk-MacOSX/solr/build/solr-core/test-files/solr/collection1/conf/schema.xml to /configs/conf1/schema.xml
[junit4:junit4]   2> 179 T1989 oascc.SolrZkClient.makePath makePath: /configs/conf1/schema.xml
[junit4:junit4]   2> 185 T1989 oasc.AbstractZkTestCase.putConfig put /Users/jenkins/jenkins-slave/workspace/Lucene-Solr-trunk-MacOSX/solr/build/solr-core/test-files/solr/collection1/conf/stopwords.txt to /configs/conf1/stopwords.txt
[junit4:junit4]   2> 187 T1989 oascc.SolrZkClient.makePath makePath: /configs/conf1/stopwords.txt
[junit4:junit4]   2> 193 T1989 oasc.AbstractZkTestCase.putConfig put /Users/jenkins/jenkins-slave/workspace/Lucene-Solr-trunk-MacOSX/solr/build/solr-core/test-files/solr/collection1/conf/protwords.txt to /configs/conf1/protwords.txt
[junit4:junit4]   2> 194 T1989 oascc.SolrZkClient.makePath makePath: /configs/conf1/protwords.txt
[junit4:junit4]   2> 198 T1989 oasc.AbstractZkTestCase.putConfig put /Users/jenkins/jenkins-slave/workspace/Lucene-Solr-trunk-MacOSX/solr/build/solr-core/test-files/solr/collection1/conf/currency.xml to /configs/conf1/currency.xml
[junit4:junit4]   2> 198 T1989 oascc.SolrZkClient.makePath makePath: /configs/conf1/currency.xml
[junit4:junit4]   2> 204 T1989 oasc.AbstractZkTestCase.putConfig put /Users/jenkins/jenkins-slave/workspace/Lucene-Solr-trunk-MacOSX/solr/build/solr-core/test-files/solr/collection1/conf/open-exchange-rates.json to /configs/conf1/open-exchange-rates.json
[junit4:junit4]   2> 205 T1989 oascc.SolrZkClient.makePath makePath: /configs/conf1/open-exchange-rates.json
[junit4:junit4]   2> 211 T1989 oasc.AbstractZkTestCase.putConfig put /Users/jenkins/jenkins-slave/workspace/Lucene-Solr-trunk-MacOSX/solr/build/solr-core/test-files/solr/collection1/conf/mapping-ISOLatin1Accent.txt to /configs/conf1/mapping-ISOLatin1Accent.txt
[junit4:junit4]   2> 212 T1989 oascc.SolrZkClient.makePath makePath: /configs/conf1/mapping-ISOLatin1Accent.txt
[junit4:junit4]   2> 217 T1989 oasc.AbstractZkTestCase.putConfig put /Users/jenkins/jenkins-slave/workspace/Lucene-Solr-trunk-MacOSX/solr/build/solr-core/test-files/solr/collection1/conf/old_synonyms.txt to /configs/conf1/old_synonyms.txt
[junit4:junit4]   2> 221 T1989 oascc.SolrZkClient.makePath makePath: /configs/conf1/old_synonyms.txt
[junit4:junit4]   2> 224 T1989 oasc.AbstractZkTestCase.putConfig put /Users/jenkins/jenkins-slave/workspace/Lucene-Solr-trunk-MacOSX/solr/build/solr-core/test-files/solr/collection1/conf/synonyms.txt to /configs/conf1/synonyms.txt
[junit4:junit4]   2> 224 T1989 oascc.SolrZkClient.makePath makePath: /configs/conf1/synonyms.txt
[junit4:junit4]   2> 229 T1994 oazs.PrepRequestProcessor.pRequest2Txn Processed session termination for sessionid: 0x13bf88e7a000001
[junit4:junit4]   2> 233 T1991 oazs.NIOServerCnxn.closeSock Closed socket connection for client /127.0.0.1:49841 which had sessionid 0x13bf88e7a000001
[junit4:junit4]   2> 231 T1998 oaz.ClientCnxn$EventThread.run EventThread shut down
[junit4:junit4]   2> 230 T1989 oaz.ZooKeeper.close Session: 0x13bf88e7a000001 closed
[junit4:junit4]   2> 453 T1989 oejs.Server.doStart jetty-8.1.8.v20121106
[junit4:junit4]   2> 467 T1989 oejs.AbstractConnector.doStart Started SelectChannelConnector@127.0.0.1:49842
[junit4:junit4]   2> 468 T1989 oasc.SolrResourceLoader.locateSolrHome JNDI not configured for solr (NoInitialContextEx)
[junit4:junit4]   2> 469 T1989 oasc.SolrResourceLoader.locateSolrHome using system property solr.solr.home: /Users/jenkins/jenkins-slave/workspace/Lucene-Solr-trunk-MacOSX/solr/build/solr-core/test/J0/./org.apache.solr.cloud.BasicDistributedZkTest-controljetty-1357084785372
[junit4:junit4]   2> 469 T1989 oasc.SolrResourceLoader.<init> new SolrResourceLoader for deduced Solr Home: '/Users/jenkins/jenkins-slave/workspace/Lucene-Solr-trunk-MacOSX/solr/build/solr-core/test/J0/./org.apache.solr.cloud.BasicDistributedZkTest-controljetty-1357084785372/'
[junit4:junit4]   2> 500 T1989 oass.SolrDispatchFilter.init SolrDispatchFilter.init()
[junit4:junit4]   2> 501 T1989 oasc.SolrResourceLoader.locateSolrHome JNDI not configured for solr (NoInitialContextEx)
[junit4:junit4]   2> 501 T1989 oasc.SolrResourceLoader.locateSolrHome using system property solr.solr.home: /Users/jenkins/jenkins-slave/workspace/Lucene-Solr-trunk-MacOSX/solr/build/solr-core/test/J0/./org.apache.solr.cloud.BasicDistributedZkTest-controljetty-1357084785372
[junit4:junit4]   2> 502 T1989 oasc.CoreContainer$Initializer.initialize looking for solr.xml: /Users/jenkins/jenkins-slave/workspace/Lucene-Solr-trunk-MacOSX/solr/build/solr-core/test/J0/./org.apache.solr.cloud.BasicDistributedZkTest-controljetty-1357084785372/solr.xml
[junit4:junit4]   2> 502 T1989 oasc.CoreContainer.<init> New CoreContainer 1586325690
[junit4:junit4]   2> 503 T1989 oasc.CoreContainer.load Loading CoreContainer using Solr Home: '/Users/jenkins/jenkins-slave/workspace/Lucene-Solr-trunk-MacOSX/solr/build/solr-core/test/J0/./org.apache.solr.cloud.BasicDistributedZkTest-controljetty-1357084785372/'
[junit4:junit4]   2> 504 T1989 oasc.SolrResourceLoader.<init> new SolrResourceLoader for directory: '/Users/jenkins/jenkins-slave/workspace/Lucene-Solr-trunk-MacOSX/solr/build/solr-core/test/J0/./org.apache.solr.cloud.BasicDistributedZkTest-controljetty-1357084785372/'
[junit4:junit4]   2> 529 T1989 oashc.HttpShardHandlerFactory.getParameter Setting socketTimeout to: 30000
[junit4:junit4]   2> 529 T1989 oashc.HttpShardHandlerFactory.getParameter Setting urlScheme to: http://
[junit4:junit4]   2> 530 T1989 oashc.HttpShardHandlerFactory.getParameter Setting connTimeout to: 15000
[junit4:junit4]   2> 530 T1989 oashc.HttpShardHandlerFactory.getParameter Setting maxConnectionsPerHost to: 20
[junit4:junit4]   2> 531 T1989 oashc.HttpShardHandlerFactory.getParameter Setting corePoolSize to: 0
[junit4:junit4]   2> 532 T1989 oashc.HttpShardHandlerFactory.getParameter Setting maximumPoolSize to: 2147483647
[junit4:junit4]   2> 532 T1989 oashc.HttpShardHandlerFactory.getParameter Setting maxThreadIdleTime to: 5
[junit4:junit4]   2> 533 T1989 oashc.HttpShardHandlerFactory.getParameter Setting sizeOfQueue to: -1
[junit4:junit4]   2> 533 T1989 oashc.HttpShardHandlerFactory.getParameter Setting fairnessPolicy to: false
[junit4:junit4]   2> 534 T1989 oascsi.HttpClientUtil.createClient Creating new http client, config:maxConnectionsPerHost=20&maxConnections=10000&socketTimeout=30000&connTimeout=15000&retry=false
[junit4:junit4]   2> 549 T1989 oasc.CoreContainer.load Registering Log Listener
[junit4:junit4]   2> 572 T1989 oasc.CoreContainer.initZooKeeper Zookeeper client=127.0.0.1:49839/solr
[junit4:junit4]   2> 573 T1989 oasc.ZkController.checkChrootPath zkHost includes chroot
[junit4:junit4]   2> 574 T1989 oaz.ZooKeeper.<init> Initiating client connection, connectString=127.0.0.1:49839 sessionTimeout=60000 watcher=org.apache.solr.common.cloud.ConnectionManager@46cd84d0
[junit4:junit4]   2> 578 T1989 oascc.ConnectionManager.waitForConnected Waiting for client to connect to ZooKeeper
[junit4:junit4]   2> 576 T2008 oaz.ClientCnxn$SendThread.logStartConnect Opening socket connection to server localhost/127.0.0.1:49839. Will not attempt to authenticate using SASL (access denied ("javax.security.auth.AuthPermission" "getLoginConfiguration"))
[junit4:junit4]   2> 580 T2008 oaz.ClientCnxn$SendThread.primeConnection Socket connection established to localhost/127.0.0.1:49839, initiating session
[junit4:junit4]   2> 582 T1991 oazs.NIOServerCnxnFactory.run Accepted socket connection from /127.0.0.1:49843
[junit4:junit4]   2> 580 T1991 oazs.ZooKeeperServer.processConnectRequest Client attempting to establish new session at /127.0.0.1:49843
[junit4:junit4]   2> 585 T1993 oazs.ZooKeeperServer.finishSessionInit Established session 0x13bf88e7a000002 with negotiated timeout 20000 for client /127.0.0.1:49843
[junit4:junit4]   2> 582 T2008 oaz.ClientCnxn$SendThread.onConnected Session establishment complete on server localhost/127.0.0.1:49839, sessionid = 0x13bf88e7a000002, negotiated timeout = 20000
[junit4:junit4]   2> 586 T2009 oascc.ConnectionManager.process Watcher org.apache.solr.common.cloud.ConnectionManager@46cd84d0 name:ZooKeeperConnection Watcher:127.0.0.1:49839 got event WatchedEvent state:SyncConnected type:None path:null path:null type:None
[junit4:junit4]   2> 584 T1989 oascc.ConnectionManager.waitForConnected Client is connected to ZooKeeper
[junit4:junit4]   2> 586 T1994 oazs.PrepRequestProcessor.pRequest2Txn Processed session termination for sessionid: 0x13bf88e7a000002
[junit4:junit4]   2> 590 T1991 oazs.NIOServerCnxn.closeSock Closed socket connection for client /127.0.0.1:49843 which had sessionid 0x13bf88e7a000002
[junit4:junit4]   2> 590 T2009 oaz.ClientCnxn$EventThread.run EventThread shut down
[junit4:junit4]   2> 587 T1989 oaz.ZooKeeper.close Session: 0x13bf88e7a000002 closed
[junit4:junit4]   2> 589 T1989 oascsi.HttpClientUtil.createClient Creating new http client, config:maxConnections=500&maxConnectionsPerHost=16&socketTimeout=15000&connTimeout=30000
[junit4:junit4]   2> 595 T1989 oaz.ZooKeeper.<init> Initiating client connection, connectString=127.0.0.1:49839/solr sessionTimeout=30000 watcher=org.apache.solr.common.cloud.ConnectionManager@65e98812
[junit4:junit4]   2> 600 T1989 oascc.ConnectionManager.waitForConnected Waiting for client to connect to ZooKeeper
[junit4:junit4]   2> 598 T2010 oaz.ClientCnxn$SendThread.logStartConnect Opening socket connection to server localhost/127.0.0.1:49839. Will not attempt to authenticate using SASL (access denied ("javax.security.auth.AuthPermission" "getLoginConfiguration"))
[junit4:junit4]   2> 600 T2010 oaz.ClientCnxn$SendThread.primeConnection Socket connection established to localhost/127.0.0.1:49839, initiating session
[junit4:junit4]   2> 601 T1991 oazs.NIOServerCnxnFactory.run Accepted socket connection from /127.0.0.1:49844
[junit4:junit4]   2> 604 T1991 oazs.ZooKeeperServer.processConnectRequest Client attempting to establish new session at /127.0.0.1:49844
[junit4:junit4]   2> 606 T1993 oazs.ZooKeeperServer.finishSessionInit Established session 0x13bf88e7a000003 with negotiated timeout 20000 for client /127.0.0.1:49844
[junit4:junit4]   2> 604 T2010 oaz.ClientCnxn$SendThread.onConnected Session establishment complete on server localhost/127.0.0.1:49839, sessionid = 0x13bf88e7a000003, negotiated timeout = 20000
[junit4:junit4]   2> 605 T2011 oascc.ConnectionManager.process Watcher org.apache.solr.common.cloud.ConnectionManager@65e98812 name:ZooKeeperConnection Watcher:127.0.0.1:49839/solr got event WatchedEvent state:SyncConnected type:None path:null path:null type:None
[junit4:junit4]   2> 607 T1989 oascc.ConnectionManager.waitForConnected Client is connected to ZooKeeper
[junit4:junit4]   2> 608 T1994 oazs.PrepRequestProcessor.pRequest Got user-level KeeperException when processing sessionid:0x13bf88e7a000003 type:create cxid:0x2 zxid:0x1a txntype:-1 reqpath:n/a Error Path:/solr/overseer Error:KeeperErrorCode = NodeExists for /solr/overseer
[junit4:junit4]   2> 610 T1989 oascc.SolrZkClient.makePath makePath: /live_nodes
[junit4:junit4]   2> 617 T1989 oasc.ZkController.createEphemeralLiveNode Register node as live in ZooKeeper:/live_nodes/127.0.0.1:49842_
[junit4:junit4]   2> 616 T1994 oazs.PrepRequestProcessor.pRequest Got user-level KeeperException when processing sessionid:0x13bf88e7a000003 type:delete cxid:0x7 zxid:0x1c txntype:-1 reqpath:n/a Error Path:/solr/live_nodes/127.0.0.1:49842_ Error:KeeperErrorCode = NoNode for /solr/live_nodes/127.0.0.1:49842_
[junit4:junit4]   2> 617 T1989 oascc.SolrZkClient.makePath makePath: /live_nodes/127.0.0.1:49842_
[junit4:junit4]   2> 624 T1989 oascc.SolrZkClient.makePath makePath: /overseer_elect/election
[junit4:junit4]   2> 635 T1994 oazs.PrepRequestProcessor.pRequest Got user-level KeeperException when processing sessionid:0x13bf88e7a000003 type:delete cxid:0x15 zxid:0x21 txntype:-1 reqpath:n/a Error Path:/solr/overseer_elect/leader Error:KeeperErrorCode = NoNode for /solr/overseer_elect/leader
[junit4:junit4]   2> 638 T1989 oascc.SolrZkClient.makePath makePath: /overseer_elect/leader
[junit4:junit4]   2> 641 T1989 oasc.Overseer.start Overseer (id=88937908479721475-127.0.0.1:49842_-n_0000000000) starting
[junit4:junit4]   2> 642 T1994 oazs.PrepRequestProcessor.pRequest Got user-level KeeperException when processing sessionid:0x13bf88e7a000003 type:create cxid:0x1a zxid:0x23 txntype:-1 reqpath:n/a Error Path:/solr/overseer Error:KeeperErrorCode = NodeExists for /solr/overseer
[junit4:junit4]   2> 646 T1994 oazs.PrepRequestProcessor.pRequest Got user-level KeeperException when processing sessionid:0x13bf88e7a000003 type:create cxid:0x1b zxid:0x24 txntype:-1 reqpath:n/a Error Path:/solr/overseer Error:KeeperErrorCode = NodeExists for /solr/overseer
[junit4:junit4]   2> 648 T1994 oazs.PrepRequestProcessor.pRequest Got user-level KeeperException when processing sessionid:0x13bf88e7a000003 type:create cxid:0x1c zxid:0x25 txntype:-1 reqpath:n/a Error Path:/solr/overseer Error:KeeperErrorCode = NodeExists for /solr/overseer
[junit4:junit4]   2> 650 T1994 oazs.PrepRequestProcessor.pRequest Got user-level KeeperException when processing sessionid:0x13bf88e7a000003 type:create cxid:0x1d zxid:0x26 txntype:-1 reqpath:n/a Error Path:/solr/overseer Error:KeeperErrorCode = NodeExists for /solr/overseer
[junit4:junit4]   2> 652 T2013 oasc.OverseerCollectionProcessor.run Process current queue of collection messages
[junit4:junit4]   2> 652 T1989 oascc.SolrZkClient.makePath makePath: /clusterstate.json
[junit4:junit4]   2> 658 T1989 oascc.ZkStateReader.createClusterStateWatchersAndUpdate Updating cluster state from ZooKeeper... 
[junit4:junit4]   2> 665 T2012 oasc.Overseer$ClusterStateUpdater.run Starting to work on the main queue
[junit4:junit4]   2> 676 T2014 oasc.CoreContainer.create Creating SolrCore 'collection1' using instanceDir: /Users/jenkins/jenkins-slave/workspace/Lucene-Solr-trunk-MacOSX/solr/build/solr-core/test/J0/./org.apache.solr.cloud.BasicDistributedZkTest-controljetty-1357084785372/collection1
[junit4:junit4]   2> 676 T2014 oasc.ZkController.createCollectionZkNode Check for collection zkNode:control_collection
[junit4:junit4]   2> 678 T2014 oasc.ZkController.createCollectionZkNode Collection zkNode exists
[junit4:junit4]   2> 679 T2014 oasc.ZkController.readConfigName Load collection config from:/collections/control_collection
[junit4:junit4]   2> 679 T2014 oasc.SolrResourceLoader.<init> new SolrResourceLoader for directory: '/Users/jenkins/jenkins-slave/workspace/Lucene-Solr-trunk-MacOSX/solr/build/solr-core/test/J0/./org.apache.solr.cloud.BasicDistributedZkTest-controljetty-1357084785372/collection1/'
[junit4:junit4]   2> 680 T2014 oasc.SolrResourceLoader.replaceClassLoader Adding 'file:/Users/jenkins/jenkins-slave/workspace/Lucene-Solr-trunk-MacOSX/solr/build/solr-core/test/J0/org.apache.solr.cloud.BasicDistributedZkTest-controljetty-1357084785372/collection1/lib/classes/' to classloader
[junit4:junit4]   2> 680 T2014 oasc.SolrResourceLoader.replaceClassLoader Adding 'file:/Users/jenkins/jenkins-slave/workspace/Lucene-Solr-trunk-MacOSX/solr/build/solr-core/test/J0/org.apache.solr.cloud.BasicDistributedZkTest-controljetty-1357084785372/collection1/lib/README' to classloader
[junit4:junit4]   2> 737 T2014 oasc.SolrConfig.<init> Using Lucene MatchVersion: LUCENE_50
[junit4:junit4]   2> 826 T2014 oasc.SolrConfig.<init> Loaded SolrConfig: solrconfig.xml
[junit4:junit4]   2> 825 T2014 oass.IndexSchema.readSchema Reading Solr Schema
[junit4:junit4]   2> 831 T2014 oass.IndexSchema.readSchema Schema name=test
[junit4:junit4]   2> 1474 T2014 oass.OpenExchangeRatesOrgProvider.init Initialized with rates=open-exchange-rates.json, refreshInterval=1440.
[junit4:junit4]   2> 1491 T2014 oass.IndexSchema.readSchema default search field in schema is text
[junit4:junit4]   2> 1501 T2014 oass.IndexSchema.readSchema unique key field: id
[junit4:junit4]   2> 1533 T2014 oass.FileExchangeRateProvider.reload Reloading exchange rates from file currency.xml
[junit4:junit4]   2> 1543 T2014 oass.FileExchangeRateProvider.reload Reloading exchange rates from file currency.xml
[junit4:junit4]   2> 1552 T2014 oass.OpenExchangeRatesOrgProvider.reload Reloading exchange rates from open-exchange-rates.json
[junit4:junit4]   2> 1555 T2014 oass.OpenExchangeRatesOrgProvider.reload Reloading exchange rates from open-exchange-rates.json
[junit4:junit4]   2> 1557 T2014 oasc.SolrCore.<init> [collection1] Opening new SolrCore at /Users/jenkins/jenkins-slave/workspace/Lucene-Solr-trunk-MacOSX/solr/build/solr-core/test/J0/./org.apache.solr.cloud.BasicDistributedZkTest-controljetty-1357084785372/collection1/, dataDir=./org.apache.solr.cloud.BasicDistributedZkTest-1357084785145/control/data/
[junit4:junit4]   2> 1558 T2014 oasc.JmxMonitoredMap.<init> JMX monitoring is enabled. Adding Solr mbeans to JMX Server: com.sun.jmx.mbeanserver.JmxMBeanServer@52cf357a
[junit4:junit4]   2> 1559 T2014 oasc.SolrCore.initDirectoryFactory solr.NRTCachingDirectoryFactory
[junit4:junit4]   2> 1560 T2014 oasc.CachingDirectoryFactory.get return new directory for /Users/jenkins/jenkins-slave/workspace/Lucene-Solr-trunk-MacOSX/solr/build/solr-core/test/J0/./org.apache.solr.cloud.BasicDistributedZkTest-1357084785145/control/data forceNew:false
[junit4:junit4]   2> 1561 T2014 oasc.CachingDirectoryFactory.close Releasing directory:/Users/jenkins/jenkins-slave/workspace/Lucene-Solr-trunk-MacOSX/solr/build/solr-core/test/J0/./org.apache.solr.cloud.BasicDistributedZkTest-1357084785145/control/data
[junit4:junit4]   2> 1562 T2014 oasc.SolrCore.getNewIndexDir New index directory detected: old=null new=./org.apache.solr.cloud.BasicDistributedZkTest-1357084785145/control/data/index/
[junit4:junit4]   2> 1562 T2014 oasc.SolrCore.initIndex WARNING [collection1] Solr index directory './org.apache.solr.cloud.BasicDistributedZkTest-1357084785145/control/data/index' doesn't exist. Creating new index...
[junit4:junit4]   2> 1566 T2014 oasc.CachingDirectoryFactory.get return new directory for /Users/jenkins/jenkins-slave/workspace/Lucene-Solr-trunk-MacOSX/solr/build/solr-core/test/J0/./org.apache.solr.cloud.BasicDistributedZkTest-1357084785145/control/data/index forceNew:false
[junit4:junit4]   2> 1574 T2014 oasc.SolrDeletionPolicy.onCommit SolrDeletionPolicy.onCommit: commits:num=1
[junit4:junit4]   2> 		commit{dir=RateLimitedDirectoryWrapper(NRTCachingDirectory(org.apache.lucene.store.NIOFSDirectory@/Users/jenkins/jenkins-slave/workspace/Lucene-Solr-trunk-MacOSX/solr/build/solr-core/test/J0/org.apache.solr.cloud.BasicDistributedZkTest-1357084785145/control/data/index lockFactory=org.apache.lucene.store.NativeFSLockFactory@3a44d78; maxCacheMB=48.0 maxMergeSizeMB=4.0)),segFN=segments_1,generation=1,filenames=[segments_1]
[junit4:junit4]   2> 1575 T2014 oasc.SolrDeletionPolicy.updateCommits newest commit = 1[segments_1]
[junit4:junit4]   2> 1576 T2014 oasc.CachingDirectoryFactory.close Releasing directory:/Users/jenkins/jenkins-slave/workspace/Lucene-Solr-trunk-MacOSX/solr/build/solr-core/test/J0/./org.apache.solr.cloud.BasicDistributedZkTest-1357084785145/control/data/index
[junit4:junit4]   2> 1577 T2014 oasc.SolrCore.initWriters created xml: solr.XMLResponseWriter
[junit4:junit4]   2> 1582 T2014 oasup.UpdateRequestProcessorChain.init inserting DistributedUpdateProcessorFactory into updateRequestProcessorChain "dedupe"
[junit4:junit4]   2> 1582 T2014 oasup.UpdateRequestProcessorChain.init inserting DistributedUpdateProcessorFactory into updateRequestProcessorChain "dedupe-allfields"
[junit4:junit4]   2> 1583 T2014 oasup.UpdateRequestProcessorChain.init inserting DistributedUpdateProcessorFactory into updateRequestProcessorChain "stored_sig"
[junit4:junit4]   2> 1583 T2014 oasup.UpdateRequestProcessorChain.init inserting DistributedUpdateProcessorFactory into updateRequestProcessorChain "uniq-fields"
[junit4:junit4]   2> 1584 T2014 oasup.UpdateRequestProcessorChain.init inserting DistributedUpdateProcessorFactory into updateRequestProcessorChain "distrib-dup-test-chain-implicit"
[junit4:junit4]   2> 1584 T2014 oasc.RequestHandlers.initHandlersFromConfig adding lazy requestHandler: solr.ReplicationHandler
[junit4:junit4]   2> 1585 T2014 oasc.RequestHandlers.initHandlersFromConfig created /replication: solr.ReplicationHandler
[junit4:junit4]   2> 1585 T2014 oasc.RequestHandlers.initHandlersFromConfig created standard: solr.StandardRequestHandler
[junit4:junit4]   2> 1586 T2014 oasc.RequestHandlers.initHandlersFromConfig created /get: solr.RealTimeGetHandler
[junit4:junit4]   2> 1586 T2014 oasc.RequestHandlers.initHandlersFromConfig created dismax: solr.SearchHandler
[junit4:junit4]   2> 1587 T2014 oasc.RequestHandlers.initHandlersFromConfig created mock: org.apache.solr.core.MockQuerySenderListenerReqHandler
[junit4:junit4]   2> 1588 T2014 oasc.RequestHandlers.initHandlersFromConfig created /admin/: org.apache.solr.handler.admin.AdminHandlers
[junit4:junit4]   2> 1588 T2014 oasc.RequestHandlers.initHandlersFromConfig created defaults: solr.StandardRequestHandler
[junit4:junit4]   2> 1588 T2014 oasc.RequestHandlers.initHandlersFromConfig adding lazy requestHandler: solr.StandardRequestHandler
[junit4:junit4]   2> 1589 T2014 oasc.RequestHandlers.initHandlersFromConfig created lazy: solr.StandardRequestHandler
[junit4:junit4]   2> 1589 T2014 oasc.RequestHandlers.initHandlersFromConfig created /update: solr.UpdateRequestHandler
[junit4:junit4]   2> 1590 T2014 oasc.RequestHandlers.initHandlersFromConfig created /terms: org.apache.solr.handler.component.SearchHandler
[junit4:junit4]   2> 1590 T2014 oasc.RequestHandlers.initHandlersFromConfig created spellCheckCompRH: org.apache.solr.handler.component.SearchHandler
[junit4:junit4]   2> 1591 T2014 oasc.RequestHandlers.initHandlersFromConfig created spellCheckCompRH_Direct: org.apache.solr.handler.component.SearchHandler
[junit4:junit4]   2> 1592 T2014 oasc.RequestHandlers.initHandlersFromConfig created spellCheckWithWordbreak: org.apache.solr.handler.component.SearchHandler
[junit4:junit4]   2> 1592 T2014 oasc.RequestHandlers.initHandlersFromConfig created spellCheckWithWordbreak_Direct: org.apache.solr.handler.component.SearchHandler
[junit4:junit4]   2> 1593 T2014 oasc.RequestHandlers.initHandlersFromConfig created spellCheckCompRH1: org.apache.solr.handler.component.SearchHandler
[junit4:junit4]   2> 1593 T2014 oasc.RequestHandlers.initHandlersFromConfig created mltrh: org.apache.solr.handler.component.SearchHandler
[junit4:junit4]   2> 1594 T2014 oasc.RequestHandlers.initHandlersFromConfig created tvrh: org.apache.solr.handler.component.SearchHandler
[junit4:junit4]   2> 1595 T2014 oasc.RequestHandlers.initHandlersFromConfig created /mlt: solr.MoreLikeThisHandler
[junit4:junit4]   2> 1595 T2014 oasc.RequestHandlers.initHandlersFromConfig created /debug/dump: solr.DumpRequestHandler
[junit4:junit4]   2> 1602 T2014 oashl.XMLLoader.init xsltCacheLifetimeSeconds=60
[junit4:junit4]   2> 1605 T2014 oasc.SolrCore.initDeprecatedSupport WARNING solrconfig.xml uses deprecated <admin/gettableFiles>, Please update your config to use the ShowFileRequestHandler.
[junit4:junit4]   2> 1607 T2014 oasc.SolrCore.initDeprecatedSupport WARNING adding ShowFileRequestHandler with hidden files: [SCHEMA.XML, OLD_SYNONYMS.TXT, STOPWORDS.TXT, PROTWORDS.TXT, OPEN-EXCHANGE-RATES.JSON, SYNONYMS.TXT, CURRENCY.XML, MAPPING-ISOLATIN1ACCENT.TXT]
[junit4:junit4]   2> 1610 T2014 oasc.CachingDirectoryFactory.close Releasing directory:/Users/jenkins/jenkins-slave/workspace/Lucene-Solr-trunk-MacOSX/solr/build/solr-core/test/J0/./org.apache.solr.cloud.BasicDistributedZkTest-1357084785145/control/data
[junit4:junit4]   2> 1611 T2014 oass.SolrIndexSearcher.<init> Opening Searcher@1663965e main
[junit4:junit4]   2> 1612 T2014 oasu.CommitTracker.<init> Hard AutoCommit: disabled
[junit4:junit4]   2> 1613 T2014 oasu.CommitTracker.<init> Soft AutoCommit: disabled
[junit4:junit4]   2> 1613 T2014 oashc.SpellCheckComponent.inform Initializing spell checkers
[junit4:junit4]   2> 1620 T2014 oass.DirectSolrSpellChecker.init init: {name=direct,classname=DirectSolrSpellChecker,field=lowerfilt,minQueryLength=3}
[junit4:junit4]   2> 1659 T2015 oasc.SolrCore.registerSearcher [collection1] Registered new searcher Searcher@1663965e main{StandardDirectoryReader(segments_1:1)}
[junit4:junit4]   2> 1670 T2014 oasc.ZkController.publish publishing core=collection1 state=down
[junit4:junit4]   2> 1670 T2014 oasc.ZkController.publish numShards not found on descriptor - reading it from system property
[junit4:junit4]   2> 1672 T1994 oazs.PrepRequestProcessor.pRequest Got user-level KeeperException when processing sessionid:0x13bf88e7a000003 type:create cxid:0x50 zxid:0x29 txntype:-1 reqpath:n/a Error Path:/solr/overseer/queue Error:KeeperErrorCode = NoNode for /solr/overseer/queue
[junit4:junit4]   2> 2186 T2012 oascc.ZkStateReader.updateClusterState Updating cloud state from ZooKeeper... 
[junit4:junit4]   2> 2187 T2012 oasc.Overseer$ClusterStateUpdater.updateState Update state numShards=1 message={
[junit4:junit4]   2> 	  "operation":"state",
[junit4:junit4]   2> 	  "numShards":"1",
[junit4:junit4]   2> 	  "shard":null,
[junit4:junit4]   2> 	  "roles":null,
[junit4:junit4]   2> 	  "state":"down",
[junit4:junit4]   2> 	  "core":"collection1",
[junit4:junit4]   2> 	  "collection":"control_collection",
[junit4:junit4]   2> 	  "node_name":"127.0.0.1:49842_",
[junit4:junit4]   2> 	  "base_url":"http://127.0.0.1:49842"}
[junit4:junit4]   2> 2188 T2012 oasc.Overseer$ClusterStateUpdater.createCollection Create collection control_collection with numShards 1
[junit4:junit4]   2> 2188 T2012 oasc.Overseer$ClusterStateUpdater.updateState Assigning new node to shard shard=shard1
[junit4:junit4]   2> 2189 T1994 oazs.PrepRequestProcessor.pRequest Got user-level KeeperException when processing sessionid:0x13bf88e7a000003 type:create cxid:0x58 zxid:0x2c txntype:-1 reqpath:n/a Error Path:/solr/overseer/queue-work Error:KeeperErrorCode = NoNode for /solr/overseer/queue-work
[junit4:junit4]   2> 2196 T2011 oascc.ZkStateReader$2.process A cluster state change: WatchedEvent state:SyncConnected type:NodeDataChanged path:/clusterstate.json, has occurred - updating... (live nodes size: 1)
[junit4:junit4]   2> 2676 T2014 oasc.CoreContainer.registerCore registering core: collection1
[junit4:junit4]   2> 2676 T2014 oasc.ZkController.register Register replica - core:collection1 address:http://127.0.0.1:49842 collection:control_collection shard:shard1
[junit4:junit4]   2> 2680 T2014 oascc.SolrZkClient.makePath makePath: /collections/control_collection/leader_elect/shard1/election
[junit4:junit4]   2> 2694 T1994 oazs.PrepRequestProcessor.pRequest Got user-level KeeperException when processing sessionid:0x13bf88e7a000003 type:delete cxid:0x72 zxid:0x36 txntype:-1 reqpath:n/a Error Path:/solr/collections/control_collection/leaders Error:KeeperErrorCode = NoNode for /solr/collections/control_collection/leaders
[junit4:junit4]   2> 2695 T2014 oasc.ShardLeaderElectionContext.runLeaderProcess Running the leader process.
[junit4:junit4]   2> 2696 T1994 oazs.PrepRequestProcessor.pRequest Got user-level KeeperException when processing sessionid:0x13bf88e7a000003 type:create cxid:0x73 zxid:0x37 txntype:-1 reqpath:n/a Error Path:/solr/overseer Error:KeeperErrorCode = NodeExists for /solr/overseer
[junit4:junit4]   2> 2702 T2014 oasc.ShardLeaderElectionContext.waitForReplicasToComeUp Enough replicas found to continue.
[junit4:junit4]   2> 2702 T2014 oasc.ShardLeaderElectionContext.runLeaderProcess I may be the new leader - try and sync
[junit4:junit4]   2> 2702 T2014 oasc.SyncStrategy.sync Sync replicas to http://127.0.0.1:49842/collection1/
[junit4:junit4]   2> 2703 T2014 oasc.SyncStrategy.syncReplicas Sync Success - now sync replicas to me
[junit4:junit4]   2> 2703 T2014 oasc.SyncStrategy.syncToMe http://127.0.0.1:49842/collection1/ has no replicas
[junit4:junit4]   2> 2703 T2014 oasc.ShardLeaderElectionContext.runLeaderProcess I am the new leader: http://127.0.0.1:49842/collection1/
[junit4:junit4]   2> 2704 T2014 oascc.SolrZkClient.makePath makePath: /collections/control_collection/leaders/shard1
[junit4:junit4]   2> 2708 T1994 oazs.PrepRequestProcessor.pRequest Got user-level KeeperException when processing sessionid:0x13bf88e7a000003 type:create cxid:0x7d zxid:0x3b txntype:-1 reqpath:n/a Error Path:/solr/overseer Error:KeeperErrorCode = NodeExists for /solr/overseer
[junit4:junit4]   2> 3710 T2012 oascc.ZkStateReader.updateClusterState Updating cloud state from ZooKeeper... 
[junit4:junit4]   2> 3743 T2011 oascc.ZkStateReader$2.process A cluster state change: WatchedEvent state:SyncConnected type:NodeDataChanged path:/clusterstate.json, has occurred - updating... (live nodes size: 1)
[junit4:junit4]   2> 3809 T2014 oasc.ZkController.register We are http://127.0.0.1:49842/collection1/ and leader is http://127.0.0.1:49842/collection1/
[junit4:junit4]   2> 3810 T2014 oasc.ZkController.register No LogReplay needed for core=collection1 baseURL=http://127.0.0.1:49842
[junit4:junit4]   2> 3810 T2014 oasc.ZkController.checkRecovery I am the leader, no recovery necessary
[junit4:junit4]   2> 3811 T2014 oasc.ZkController.publish publishing core=collection1 state=active
[junit4:junit4]   2> 3812 T2014 oasc.ZkController.publish numShards not found on descriptor - reading it from system property
[junit4:junit4]   2> 3820 T2014 oascc.ZkStateReader.updateClusterState Updating cloud state from ZooKeeper... 
[junit4:junit4]   2> 3824 T1989 oass.SolrDispatchFilter.init user.dir=/Users/jenkins/jenkins-slave/workspace/Lucene-Solr-trunk-MacOSX/solr/build/solr-core/test/J0
[junit4:junit4]   2> 3826 T1989 oass.SolrDispatchFilter.init SolrDispatchFilter.init() done
[junit4:junit4]   2> 3828 T1989 oascsi.HttpClientUtil.createClient Creating new http client, config:maxConnections=128&maxConnectionsPerHost=32&followRedirects=false
[junit4:junit4]   2> 3848 T1989 oascsi.HttpClientUtil.createClient Creating new http client, config:
[junit4:junit4]   2> 3859 T1989 oaz.ZooKeeper.<init> Initiating client connection, connectString=127.0.0.1:49839/solr sessionTimeout=10000 watcher=org.apache.solr.common.cloud.ConnectionManager@8743c7f
[junit4:junit4]   2> 3860 T1989 oascc.ConnectionManager.waitForConnected Waiting for client to connect to ZooKeeper
[junit4:junit4]   2> 3858 T2016 oaz.ClientCnxn$SendThread.logStartConnect Opening socket connection to server localhost/127.0.0.1:49839. Will not attempt to authenticate using SASL (access denied ("javax.security.auth.AuthPermission" "getLoginConfiguration"))
[junit4:junit4]   2> 3861 T2016 oaz.ClientCnxn$SendThread.primeConnection Socket connection established to localhost/127.0.0.1:49839, initiating session
[junit4:junit4]   2> 3862 T1991 oazs.NIOServerCnxnFactory.run Accepted socket connection from /127.0.0.1:49845
[junit4:junit4]   2> 3862 T1991 oazs.ZooKeeperServer.processConnectRequest Client attempting to establish new session at /127.0.0.1:49845
[junit4:junit4]   2> 3861 T1993 oazs.ZooKeeperServer.finishSessionInit Established session 0x13bf88e7a000004 with negotiated timeout 10000 for client /127.0.0.1:49845
[junit4:junit4]   2> 3864 T2016 oaz.ClientCnxn$SendThread.onConnected Session establishment complete on server localhost/127.0.0.1:49839, sessionid = 0x13bf88e7a000004, negotiated timeout = 10000
[junit4:junit4]   2> 3862 T2017 oascc.ConnectionManager.process Watcher org.apache.solr.common.cloud.ConnectionManager@8743c7f name:ZooKeeperConnection Watcher:127.0.0.1:49839/solr got event WatchedEvent state:SyncConnected type:None path:null path:null type:None
[junit4:junit4]   2> 3865 T1989 oascc.ConnectionManager.waitForConnected Client is connected to ZooKeeper
[junit4:junit4]   2> 3866 T1989 oascc.ZkStateReader.createClusterStateWatchersAndUpdate Updating cluster state from ZooKeeper... 
[junit4:junit4]   2> 3869 T1989 oasc.ChaosMonkey.monkeyLog monkey: init - expire sessions:true cause connection loss:true
[junit4:junit4]   2> 4065 T1989 oejs.Server.doStart jetty-8.1.8.v20121106
[junit4:junit4]   2> 4070 T1989 oejs.AbstractConnector.doStart Started SelectChannelConnector@127.0.0.1:49846
[junit4:junit4]   2> 4070 T1989 oasc.SolrResourceLoader.locateSolrHome JNDI not configured for solr (NoInitialContextEx)
[junit4:junit4]   2> 4070 T1989 oasc.SolrResourceLoader.locateSolrHome using system property solr.solr.home: /Users/jenkins/jenkins-slave/workspace/Lucene-Solr-trunk-MacOSX/solr/build/solr-core/test/J0/./org.apache.solr.cloud.BasicDistributedZkTest-jetty1-1357084789007
[junit4:junit4]   2> 4071 T1989 oasc.SolrResourceLoader.<init> new SolrResourceLoader for deduced Solr Home: '/Users/jenkins/jenkins-slave/workspace/Lucene-Solr-trunk-MacOSX/solr/build/solr-core/test/J0/./org.apache.solr.cloud.BasicDistributedZkTest-jetty1-1357084789007/'
[junit4:junit4]   2> 4100 T1989 oass.SolrDispatchFilter.init SolrDispatchFilter.init()
[junit4:junit4]   2> 4101 T1989 oasc.SolrResourceLoader.locateSolrHome JNDI not configured for solr (NoInitialContextEx)
[junit4:junit4]   2> 4102 T1989 oasc.SolrResourceLoader.locateSolrHome using system property solr.solr.home: /Users/jenkins/jenkins-slave/workspace/Lucene-Solr-trunk-MacOSX/solr/build/solr-core/test/J0/./org.apache.solr.cloud.BasicDistributedZkTest-jetty1-1357084789007
[junit4:junit4]   2> 4103 T1989 oasc.CoreContainer$Initializer.initialize looking for solr.xml: /Users/jenkins/jenkins-slave/workspace/Lucene-Solr-trunk-MacOSX/solr/build/solr-core/test/J0/./org.apache.solr.cloud.BasicDistributedZkTest-jetty1-1357084789007/solr.xml
[junit4:junit4]   2> 4103 T1989 oasc.CoreContainer.<init> New CoreContainer 156421164
[junit4:junit4]   2> 4104 T1989 oasc.CoreContainer.load Loading CoreContainer using Solr Home: '/Users/jenkins/jenkins-slave/workspace/Lucene-Solr-trunk-MacOSX/solr/build/solr-core/test/J0/./org.apache.solr.cloud.BasicDistributedZkTest-jetty1-1357084789007/'
[junit4:junit4]   2> 4104 T1989 oasc.SolrResourceLoader.<init> new SolrResourceLoader for directory: '/Users/jenkins/jenkins-slave/workspace/Lucene-Solr-trunk-MacOSX/solr/build/solr-core/test/J0/./org.apache.solr.cloud.BasicDistributedZkTest-jetty1-1357084789007/'
[junit4:junit4]   2> 4131 T1989 oashc.HttpShardHandlerFactory.getParameter Setting socketTimeout to: 30000
[junit4:junit4]   2> 4132 T1989 oashc.HttpShardHandlerFactory.getParameter Setting urlScheme to: http://
[junit4:junit4]   2> 4133 T1989 oashc.HttpShardHandlerFactory.getParameter Setting connTimeout to: 15000
[junit4:junit4]   2> 4133 T1989 oashc.HttpShardHandlerFactory.getParameter Setting maxConnectionsPerHost to: 20
[junit4:junit4]   2> 4134 T1989 oashc.HttpShardHandlerFactory.getParameter Setting corePoolSize to: 0
[junit4:junit4]   2> 4135 T1989 oashc.HttpShardHandlerFactory.getParameter Setting maximumPoolSize to: 2147483647
[junit4:junit4]   2> 4135 T1989 oashc.HttpShardHandlerFactory.getParameter Setting maxThreadIdleTime to: 5
[junit4:junit4]   2> 4136 T1989 oashc.HttpShardHandlerFactory.getParameter Setting sizeOfQueue to: -1
[junit4:junit4]   2> 4136 T1989 oashc.HttpShardHandlerFactory.getParameter Setting fairnessPolicy to: false
[junit4:junit4]   2> 4137 T1989 oascsi.HttpClientUtil.createClient Creating new http client, config:maxConnectionsPerHost=20&maxConnections=10000&socketTimeout=30000&connTimeout=15000&retry=false
[junit4:junit4]   2> 4150 T1989 oasc.CoreContainer.load Registering Log Listener
[junit4:junit4]   2> 4169 T1989 oasc.CoreContainer.initZooKeeper Zookeeper client=127.0.0.1:49839/solr
[junit4:junit4]   2> 4169 T1989 oasc.ZkController.checkChrootPath zkHost includes chroot
[junit4:junit4]   2> 4170 T1989 oaz.ZooKeeper.<init> Initiating client connection, connectString=127.0.0.1:49839 sessionTimeout=60000 watcher=org.apache.solr.common.cloud.ConnectionManager@1fb91aab
[junit4:junit4]   2> 4171 T1989 oascc.ConnectionManager.waitForConnected Waiting for client to connect to ZooKeeper
[junit4:junit4]   2> 4169 T2027 oaz.ClientCnxn$SendThread.logStartConnect Opening socket connection to server localhost/127.0.0.1:49839. Will not attempt to authenticate using SASL (access denied ("javax.security.auth.AuthPermission" "getLoginConfiguration"))
[junit4:junit4]   2> 4173 T2027 oaz.ClientCnxn$SendThread.primeConnection Socket connection established to localhost/127.0.0.1:49839, initiating session
[junit4:junit4]   2> 4171 T1991 oazs.NIOServerCnxnFactory.run Accepted socket connection from /127.0.0.1:49847
[junit4:junit4]   2> 4175 T1991 oazs.ZooKeeperServer.processConnectRequest Client attempting to establish new session at /127.0.0.1:49847
[junit4:junit4]   2> 4173 T1993 oazs.ZooKeeperServer.finishSessionInit Established session 0x13bf88e7a000005 with negotiated timeout 20000 for client /127.0.0.1:49847
[junit4:junit4]   2> 4176 T2027 oaz.ClientCnxn$SendThread.onConnected Session establishment complete on server localhost/127.0.0.1:49839, sessionid = 0x13bf88e7a000005, negotiated timeout = 20000
[junit4:junit4]   2> 4174 T2028 oascc.ConnectionManager.process Watcher org.apache.solr.common.cloud.ConnectionManager@1fb91aab name:ZooKeeperConnection Watcher:127.0.0.1:49839 got event WatchedEvent state:SyncConnected type:None path:null path:null type:None
[junit4:junit4]   2> 4177 T1989 oascc.ConnectionManager.waitForConnected Client is connected to ZooKeeper
[junit4:junit4]   2> 4178 T1994 oazs.PrepRequestProcessor.pRequest2Txn Processed session termination for sessionid: 0x13bf88e7a000005
[junit4:junit4]   2> 4177 T1991 oazs.NIOServerCnxn.closeSock Closed socket connection for client /127.0.0.1:49847 which had sessionid 0x13bf88e7a000005
[junit4:junit4]   2> 4179 T1989 oaz.ZooKeeper.close Session: 0x13bf88e7a000005 closed
[junit4:junit4]   2> 4177 T2028 oaz.ClientCnxn$EventThread.run EventThread shut down
[junit4:junit4]   2> 4180 T1989 oascsi.HttpClientUtil.createClient Creating new http client, config:maxConnections=500&maxConnectionsPerHost=16&socketTimeout=15000&connTimeout=30000
[junit4:junit4]   2> 4184 T1989 oaz.ZooKeeper.<init> Initiating client connection, connectString=127.0.0.1:49839/solr sessionTimeout=30000 watcher=org.apache.solr.common.cloud.ConnectionManager@4f99d35f
[junit4:junit4]   2> 4186 T1989 oascc.ConnectionManager.waitForConnected Waiting for client to connect to ZooKeeper
[junit4:junit4]   2> 4184 T2029 oaz.ClientCnxn$SendThread.logStartConnect Opening socket connection to server localhost/127.0.0.1:49839. Will not attempt to authenticate using SASL (access denied ("javax.security.auth.AuthPermission" "getLoginConfiguration"))
[junit4:junit4]   2> 4187 T2029 oaz.ClientCnxn$SendThread.primeConnection Socket connection established to localhost/127.0.0.1:49839, initiating session
[junit4:junit4]   2> 4188 T1991 oazs.NIOServerCnxnFactory.run Accepted socket connection from /127.0.0.1:49848
[junit4:junit4]   2> 4188 T1991 oazs.ZooKeeperServer.processConnectRequest Client attempting to establish new session at /127.0.0.1:49848
[junit4:junit4]   2> 4190 T1993 oazs.ZooKeeperServer.finishSessionInit Established session 0x13bf88e7a000006 with negotiated timeout 20000 for client /127.0.0.1:49848
[junit4:junit4]   2> 4187 T2029 oaz.ClientCnxn$SendThread.onConnected Session establishment complete on server localhost/127.0.0.1:49839, sessionid = 0x13bf88e7a000006, negotiated timeout = 20000
[junit4:junit4]   2> 4190 T2030 oascc.ConnectionManager.process Watcher org.apache.solr.common.cloud.ConnectionManager@4f99d35f name:ZooKeeperConnection Watcher:127.0.0.1:49839/solr got event WatchedEvent state:SyncConnected type:None path:null path:null type:None
[junit4:junit4]   2> 4188 T1989 oascc.ConnectionManager.waitForConnected Client is connected to ZooKeeper
[junit4:junit4]   2> 4189 T1994 oazs.PrepRequestProcessor.pRequest Got user-level KeeperException when processing sessionid:0x13bf88e7a000006 type:create cxid:0x1 zxid:0x49 txntype:-1 reqpath:n/a Error Path:/solr/overseer Error:KeeperErrorCode = NodeExists for /solr/overseer
[junit4:junit4]   2> 4193 T1994 oazs.PrepRequestProcessor.pRequest Got user-level KeeperException when processing sessionid:0x13bf88e7a000006 type:create cxid:0x2 zxid:0x4a txntype:-1 reqpath:n/a Error Path:/solr/overseer Error:KeeperErrorCode = NodeExists for /solr/overseer
[junit4:junit4]   2> 4193 T1989 oasc.ZkController.createEphemeralLiveNode Register node as live in ZooKeeper:/live_nodes/127.0.0.1:49846_
[junit4:junit4]   2> 4194 T1994 oazs.PrepRequestProcessor.pRequest Got user-level KeeperException when processing sessionid:0x13bf88e7a000006 type:delete cxid:0x4 zxid:0x4b txntype:-1 reqpath:n/a Error Path:/solr/live_nodes/127.0.0.1:49846_ Error:KeeperErrorCode = NoNode for /solr/live_nodes/127.0.0.1:49846_
[junit4:junit4]   2> 4195 T1989 oascc.SolrZkClient.makePath makePath: /live_nodes/127.0.0.1:49846_
[junit4:junit4]   2> 4201 T2011 oascc.ZkStateReader$2.process A cluster state change: WatchedEvent state:SyncConnected type:NodeChildrenChanged path:/live_nodes, has occurred - updating... (live nodes size: 1)
[junit4:junit4]   2> 4200 T2017 oascc.ZkStateReader$3.process Updating live nodes... (2)
[junit4:junit4]   2> 4204 T2011 oascc.ZkStateReader$3.process Updating live nodes... (2)
[junit4:junit4]   2> 4207 T1989 oascc.ZkStateReader.createClusterStateWatchersAndUpdate Updating cluster state from ZooKeeper... 
[junit4:junit4]   2> 4219 T2031 oasc.CoreContainer.create Creating SolrCore 'collection1' using instanceDir: /Users/jenkins/jenkins-slave/workspace/Lucene-Solr-trunk-MacOSX/solr/build/solr-core/test/J0/./org.apache.solr.cloud.BasicDistributedZkTest-jetty1-1357084789007/collection1
[junit4:junit4]   2> 4220 T2031 oasc.ZkController.createCollectionZkNode Check for collection zkNode:collection1
[junit4:junit4]   2> 4221 T2031 oasc.ZkController.createCollectionZkNode Collection zkNode exists
[junit4:junit4]   2> 4221 T2031 oasc.ZkController.readConfigName Load collection config from:/collections/collection1
[junit4:junit4]   2> 4224 T2031 oasc.SolrResourceLoader.<init> new SolrResourceLoader for directory: '/Users/jenkins/jenkins-slave/workspace/Lucene-Solr-trunk-MacOSX/solr/build/solr-core/test/J0/./org.apache.solr.cloud.BasicDistributedZkTest-jetty1-1357084789007/collection1/'
[junit4:junit4]   2> 4226 T2031 oasc.SolrResourceLoader.replaceClassLoader Adding 'file:/Users/jenkins/jenkins-slave/workspace/Lucene-Solr-trunk-MacOSX/solr/build/solr-core/test/J0/org.apache.solr.cloud.BasicDistributedZkTest-jetty1-1357084789007/collection1/lib/classes/' to classloader
[junit4:junit4]   2> 4226 T2031 oasc.SolrResourceLoader.replaceClassLoader Adding 'file:/Users/jenkins/jenkins-slave/workspace/Lucene-Solr-trunk-MacOSX/solr/build/solr-core/test/J0/org.apache.solr.cloud.BasicDistributedZkTest-jetty1-1357084789007/collection1/lib/README' to classloader
[junit4:junit4]   2> 4274 T2031 oasc.SolrConfig.<init> Using Lucene MatchVersion: LUCENE_50
[junit4:junit4]   2> 4354 T2031 oasc.SolrConfig.<init> Loaded SolrConfig: solrconfig.xml
[junit4:junit4]   2> 4355 T2031 oass.IndexSchema.readSchema Reading Solr Schema
[junit4:junit4]   2> 4361 T2031 oass.IndexSchema.readSchema Schema name=test
[junit4:junit4]   2> 5029 T2031 oass.OpenExchangeRatesOrgProvider.init Initialized with rates=open-exchange-rates.json, refreshInterval=1440.
[junit4:junit4]   2> 5039 T2031 oass.IndexSchema.readSchema default search field in schema is text
[junit4:junit4]   2> 5043 T2031 oass.IndexSchema.readSchema unique key field: id
[junit4:junit4]   2> 5065 T2031 oass.FileExchangeRateProvider.reload Reloading exchange rates from file currency.xml
[junit4:junit4]   2> 5071 T2031 oass.FileExchangeRateProvider.reload Reloading exchange rates from file currency.xml
[junit4:junit4]   2> 5078 T2031 oass.OpenExchangeRatesOrgProvider.reload Reloading exchange rates from open-exchange-rates.json
[junit4:junit4]   2> 5081 T2031 oass.OpenExchangeRatesOrgProvider.reload Reloading exchange rates from open-exchange-rates.json
[junit4:junit4]   2> 5083 T2031 oasc.SolrCore.<init> [collection1] Opening new SolrCore at /Users/jenkins/jenkins-slave/workspace/Lucene-Solr-trunk-MacOSX/solr/build/solr-core/test/J0/./org.apache.solr.cloud.BasicDistributedZkTest-jetty1-1357084789007/collection1/, dataDir=./org.apache.solr.cloud.BasicDistributedZkTest-1357084785145/jetty1/
[junit4:junit4]   2> 5083 T2031 oasc.JmxMonitoredMap.<init> JMX monitoring is enabled. Adding Solr mbeans to JMX Server: com.sun.jmx.mbeanserver.JmxMBeanServer@52cf357a
[junit4:junit4]   2> 5084 T2031 oasc.SolrCore.initDirectoryFactory solr.NRTCachingDirectoryFactory
[junit4:junit4]   2> 5085 T2031 oasc.CachingDirectoryFactory.get return new directory for /Users/jenkins/jenkins-slave/workspace/Lucene-Solr-trunk-MacOSX/solr/build/solr-core/test/J0/./org.apache.solr.cloud.BasicDistributedZkTest-1357084785145/jetty1 forceNew:false
[junit4:junit4]   2> 5086 T2031 oasc.CachingDirectoryFactory.close Releasing directory:/Users/jenkins/jenkins-slave/workspace/Lucene-Solr-trunk-MacOSX/solr/build/solr-core/test/J0/./org.apache.solr.cloud.BasicDistributedZkTest-1357084785145/jetty1
[junit4:junit4]   2> 5086 T2031 oasc.SolrCore.getNewIndexDir New index directory detected: old=null new=./org.apache.solr.cloud.BasicDistributedZkTest-1357084785145/jetty1/index/
[junit4:junit4]   2> 5087 T2031 oasc.SolrCore.initIndex WARNING [collection1] Solr index directory './org.apache.solr.cloud.BasicDistributedZkTest-1357084785145/jetty1/index' doesn't exist. Creating new index...
[junit4:junit4]   2> 5088 T2031 oasc.CachingDirectoryFactory.get return new directory for /Users/jenkins/jenkins-slave/workspace/Lucene-Solr-trunk-MacOSX/solr/build/solr-core/test/J0/./org.apache.solr.cloud.BasicDistributedZkTest-1357084785145/jetty1/index forceNew:false
[junit4:junit4]   2> 5093 T2031 oasc.SolrDeletionPolicy.onCommit SolrDeletionPolicy.onCommit: commits:num=1
[junit4:junit4]   2> 		commit{dir=RateLimitedDirectoryWrapper(NRTCachingDirectory(org.apache.lucene.store.NIOFSDirectory@/Users/jenkins/jenkins-slave/workspace/Lucene-Solr-trunk-MacOSX/solr/build/solr-core/test/J0/org.apache.solr.cloud.BasicDistributedZkTest-1357084785145/jetty1/index lockFactory=org.apache.lucene.store.NativeFSLockFactory@169138c3; maxCacheMB=48.0 maxMergeSizeMB=4.0)),segFN=segments_1,generation=1,filenames=[segments_1]
[junit4:junit4]   2> 5093 T2031 oasc.SolrDeletionPolicy.updateCommits newest commit = 1[segments_1]
[junit4:junit4]   2> 5094 T2031 oasc.CachingDirectoryFactory.close Releasing directory:/Users/jenkins/jenkins-slave/workspace/Lucene-Solr-trunk-MacOSX/solr/build/solr-core/test/J0/./org.apache.solr.cloud.BasicDistributedZkTest-1357084785145/jetty1/index
[junit4:junit4]   2> 5095 T2031 oasc.SolrCore.initWriters created xml: solr.XMLResponseWriter
[junit4:junit4]   2> 5098 T2031 oasup.UpdateRequestProcessorChain.init inserting DistributedUpdateProcessorFactory into updateRequestProcessorChain "dedupe"
[junit4:junit4]   2> 5098 T2031 oasup.UpdateRequestProcessorChain.init inserting DistributedUpdateProcessorFactory into updateRequestProcessorChain "dedupe-allfields"
[junit4:junit4]   2> 5099 T2031 oasup.UpdateRequestProcessorChain.init inserting DistributedUpdateProcessorFactory into updateRequestProcessorChain "stored_sig"
[junit4:junit4]   2> 5099 T2031 oasup.UpdateRequestProcessorChain.init inserting DistributedUpdateProcessorFactory into updateRequestProcessorChain "uniq-fields"
[junit4:junit4]   2> 5100 T2031 oasup.UpdateRequestProcessorChain.init inserting DistributedUpdateProcessorFactory into updateRequestProcessorChain "distrib-dup-test-chain-implicit"
[junit4:junit4]   2> 5101 T2031 oasc.RequestHandlers.initHandlersFromConfig adding lazy requestHandler: solr.ReplicationHandler
[junit4:junit4]   2> 5101 T2031 oasc.RequestHandlers.initHandlersFromConfig created /replication: solr.ReplicationHandler
[junit4:junit4]   2> 5102 T2031 oasc.RequestHandlers.initHandlersFromConfig created standard: solr.StandardRequestHandler
[junit4:junit4]   2> 5102 T2031 oasc.RequestHandlers.initHandlersFromConfig created /get: solr.RealTimeGetHandler
[junit4:junit4]   2> 5103 T2031 oasc.RequestHandlers.initHandlersFromConfig created dismax: solr.SearchHandler
[junit4:junit4]   2> 5104 T2031 oasc.RequestHandlers.initHandlersFromConfig created mock: org.apache.solr.core.MockQuerySenderListenerReqHandler
[junit4:junit4]   2> 5105 T2031 oasc.RequestHandlers.initHandlersFromConfig created /admin/: org.apache.solr.handler.admin.AdminHandlers
[junit4:junit4]   2> 5106 T2031 oasc.RequestHandlers.initHandlersFromConfig created defaults: solr.StandardRequestHandler
[junit4:junit4]   2> 5106 T2031 oasc.RequestHandlers.initHandlersFromConfig adding lazy requestHandler: solr.StandardRequestHandler
[junit4:junit4]   2> 5106 T2031 oasc.RequestHandlers.initHandlersFromConfig created lazy: solr.StandardRequestHandler
[junit4:junit4]   2> 5107 T2031 oasc.RequestHandlers.initHandlersFromConfig created /update: solr.UpdateRequestHandler
[junit4:junit4]   2> 5108 T2031 oasc.RequestHandlers.initHandlersFromConfig created /terms: org.apache.solr.handler.component.SearchHandler
[junit4:junit4]   2> 5108 T2031 oasc.RequestHandlers.initHandlersFromConfig created spellCheckCompRH: org.apache.solr.handler.component.SearchHandler
[junit4:junit4]   2> 5109 T2031 oasc.RequestHandlers.initHandlersFromConfig created spellCheckCompRH_Direct: org.apache.solr.handler.component.SearchHandler
[junit4:junit4]   2> 5110 T2031 oasc.RequestHandlers.initHandlersFromConfig created spellCheckWithWordbreak: org.apache.solr.handler.component.SearchHandler
[junit4:junit4]   2> 5110 T2031 oasc.RequestHandlers.initHandlersFromConfig created spellCheckWithWordbreak_Direct: org.apache.solr.handler.component.SearchHandler
[junit4:junit4]   2> 5111 T2031 oasc.RequestHandlers.initHandlersFromConfig created spellCheckCompRH1: org.apache.solr.handler.component.SearchHandler
[junit4:junit4]   2> 5111 T2031 oasc.RequestHandlers.initHandlersFromConfig created mltrh: org.apache.solr.handler.component.SearchHandler
[junit4:junit4]   2> 5112 T2031 oasc.RequestHandlers.initHandlersFromConfig created tvrh: org.apache.solr.handler.component.SearchHandler
[junit4:junit4]   2> 5112 T2031 oasc.RequestHandlers.initHandlersFromConfig created /mlt: solr.MoreLikeThisHandler
[junit4:junit4]   2> 5113 T2031 oasc.RequestHandlers.initHandlersFromConfig created /debug/dump: solr.DumpRequestHandler
[junit4:junit4]   2> 5121 T2031 oashl.XMLLoader.init xsltCacheLifetimeSeconds=60
[junit4:junit4]   2> 5124 T2031 oasc.SolrCore.initDeprecatedSupport WARNING solrconfig.xml uses deprecated <admin/gettableFiles>, Please update your config to use the ShowFileRequestHandler.
[junit4:junit4]   2> 5126 T2031 oasc.SolrCore.initDeprecatedSupport WARNING adding ShowFileRequestHandler with hidden files: [SCHEMA.XML, OLD_SYNONYMS.TXT, STOPWORDS.TXT, PROTWORDS.TXT, OPEN-EXCHANGE-RATES.JSON, SYNONYMS.TXT, CURRENCY.XML, MAPPING-ISOLATIN1ACCENT.TXT]
[junit4:junit4]   2> 5129 T2031 oasc.CachingDirectoryFactory.close Releasing directory:/Users/jenkins/jenkins-slave/workspace/Lucene-Solr-trunk-MacOSX/solr/build/solr-core/test/J0/./org.apache.solr.cloud.BasicDistributedZkTest-1357084785145/jetty1
[junit4:junit4]   2> 5131 T2031 oass.SolrIndexSearcher.<init> Opening Searcher@2d6f49b4 main
[junit4:junit4]   2> 5132 T2031 oasu.CommitTracker.<init> Hard AutoCommit: disabled
[junit4:junit4]   2> 5132 T2031 oasu.CommitTracker.<init> Soft AutoCommit: disabled
[junit4:junit4]   2> 5133 T2031 oashc.SpellCheckComponent.inform Initializing spell checkers
[junit4:junit4]   2> 5141 T2031 oass.DirectSolrSpellChecker.init init: {name=direct,classname=DirectSolrSpellChecker,field=lowerfilt,minQueryLength=3}
[junit4:junit4]   2> 5183 T2032 oasc.SolrCore.registerSearcher [collection1] Registered new searcher Searcher@2d6f49b4 main{StandardDirectoryReader(segments_1:1)}
[junit4:junit4]   2> 5194 T2031 oasc.ZkController.publish publishing core=collection1 state=down
[junit4:junit4]   2> 5194 T2031 oasc.ZkController.publish numShards not found on descriptor - reading it from system property
[junit4:junit4]   2> 5265 T2012 oascc.ZkStateReader.updateClusterState Updating cloud state from ZooKeeper... 
[junit4:junit4]   2> 5269 T2012 oasc.Overseer$ClusterStateUpdater.updateState Update state numShards=1 message={
[junit4:junit4]   2> 	  "operation":"state",
[junit4:junit4]   2> 	  "numShards":"1",
[junit4:junit4]   2> 	  "shard":"shard1",
[junit4:junit4]   2> 	  "roles":null,
[junit4:junit4]   2> 	  "state":"active",
[junit4:junit4]   2> 	  "core":"collection1",
[junit4:junit4]   2> 	  "collection":"control_collection",
[junit4:junit4]   2> 	  "node_name":"127.0.0.1:49842_",
[junit4:junit4]   2> 	  "base_url":"http://127.0.0.1:49842"}
[junit4:junit4]   2> 5276 T2012 oasc.Overseer$ClusterStateUpdater.updateState Update state numShards=2 message={
[junit4:junit4]   2> 	  "operation":"state",
[junit4:junit4]   2> 	  "numShards":"2",
[junit4:junit4]   2> 	  "shard":null,
[junit4:junit4]   2> 	  "roles":null,
[junit4:junit4]   2> 	  "state":"down",
[junit4:junit4]   2> 	  "core":"collection1",
[junit4:junit4]   2> 	  "collection":"collection1",
[junit4:junit4]   2> 	  "node_name":"127.0.0.1:49846_",
[junit4:junit4]   2> 	  "base_url":"http://127.0.0.1:49846"}
[junit4:junit4]   2> 5276 T2012 oasc.Overseer$ClusterStateUpdater.createCollection Create collection collection1 with numShards 2
[junit4:junit4]   2> 5276 T2012 oasc.Overseer$ClusterStateUpdater.updateState Assigning new node to shard shard=shard1
[junit4:junit4]   2> 5285 T2030 oascc.ZkStateReader$2.process A cluster state change: WatchedEvent state:SyncConnected type:NodeDataChanged path:/clusterstate.json, has occurred - updating... (live nodes size: 2)
[junit4:junit4]   2> 5286 T2011 oascc.ZkStateReader$2.process A cluster state change: WatchedEvent state:SyncConnected type:NodeDataChanged path:/clusterstate.json, has occurred - updating... (live nodes size: 2)
[junit4:junit4]   2> 5283 T2017 oascc.ZkStateReader$2.process A cluster state change: WatchedEvent state:SyncConnected type:NodeDataChanged path:/clusterstate.json, has occurred - updating... (live nodes size: 2)
[junit4:junit4]   2> 6197 T2031 oasc.CoreContainer.registerCore registering core: collection1
[junit4:junit4]   2> 6197 T2031 oasc.ZkController.register Register replica - core:collection1 address:http://127.0.0.1:49846 collection:collection1 shard:shard1
[junit4:junit4]   2> 6198 T2031 oascc.SolrZkClient.makePath makePath: /collections/collection1/leader_elect/shard1/election
[junit4:junit4]   2> 6213 T1994 oazs.PrepRequestProcessor.pRequest Got user-level KeeperException when processing sessionid:0x13bf88e7a000006 type:delete cxid:0x43 zxid:0x5a txntype:-1 reqpath:n/a Error Path:/solr/collections/collection1/leaders Error:KeeperErrorCode = NoNode for /solr/collections/collection1/leaders
[junit4:junit4]   2> 6212 T2031 oasc.ShardLeaderElectionContext.runLeaderProcess Running the leader process.
[junit4:junit4]   2> 6213 T1994 oazs.PrepRequestProcessor.pRequest Got user-level KeeperException when processing sessionid:0x13bf88e7a000006 type:create cxid:0x44 zxid:0x5b txntype:-1 reqpath:n/a Error Path:/solr/overseer Error:KeeperErrorCode = NodeExists for /solr/overseer
[junit4:junit4]   2> 6215 T2031 oasc.ShardLeaderElectionContext.waitForReplicasToComeUp Enough replicas found to continue.
[junit4:junit4]   2> 6216 T2031 oasc.ShardLeaderElectionContext.runLeaderProcess I may be the new leader - try and sync
[junit4:junit4]   2> 6216 T2031 oasc.SyncStrategy.sync Sync replicas to http://127.0.0.1:49846/collection1/
[junit4:junit4]   2> 6216 T2031 oasc.SyncStrategy.syncReplicas Sync Success - now sync replicas to me
[junit4:junit4]   2> 6216 T2031 oasc.SyncStrategy.syncToMe http://127.0.0.1:49846/collection1/ has no replicas
[junit4:junit4]   2> 6217 T2031 oasc.ShardLeaderElectionContext.runLeaderProcess I am the new leader: http://127.0.0.1:49846/collection1/
[junit4:junit4]   2> 6217 T2031 oascc.SolrZkClient.makePath makePath: /collections/collection1/leaders/shard1
[junit4:junit4]   2> 6226 T1994 oazs.PrepRequestProcessor.pRequest Got user-level KeeperException when processing sessionid:0x13bf88e7a000006 type:create cxid:0x4e zxid:0x5f txntype:-1 reqpath:n/a Error Path:/solr/overseer Error:KeeperErrorCode = NodeExists for /solr/overseer
[junit4:junit4]   2> 6798 T2012 oascc.ZkStateReader.updateClusterState Updating cloud state from ZooKeeper... 
[junit4:junit4]   2> 6829 T2030 oascc.ZkStateReader$2.process A cluster state change: WatchedEvent state:SyncConnected type:NodeDataChanged path:/clusterstate.json, has occurred - updating... (live nodes size: 2)
[junit4:junit4]   2> 6827 T2011 oascc.ZkStateReader$2.process A cluster state change: WatchedEvent state:SyncConnected type:NodeDataChanged path:/clusterstate.json, has occurred - updating... (live nodes size: 2)
[junit4:junit4]   2> 6827 T2017 oascc.ZkStateReader$2.process A cluster state change: WatchedEvent state:SyncConnected type:NodeDataChanged path:/clusterstate.json, has occurred - updating... (live nodes size: 2)
[junit4:junit4]   2> 6868 T2031 oasc.ZkController.register We are http://127.0.0.1:49846/collection1/ and leader is http://127.0.0.1:49846/collection1/
[junit4:junit4]   2> 6869 T2031 oasc.ZkController.register No LogReplay needed for core=collection1 baseURL=http://127.0.0.1:49846
[junit4:junit4]   2> 6869 T2031 oasc.ZkController.checkRecovery I am the leader, no recovery necessary
[junit4:junit4]   2> 6870 T2031 oasc.ZkController.publish publishing core=collection1 state=active
[junit4:junit4]   2> 6871 T2031 oasc.ZkController.publish numShards not found on descriptor - reading it from system property
[junit4:junit4]   2> 6874 T2031 oascc.ZkStateReader.updateClusterState Updating cloud state from ZooKeeper... 
[junit4:junit4]   2> 6880 T1989 oass.SolrDispatchFilter.init user.dir=/Users/jenkins/jenkins-slave/workspace/Lucene-Solr-trunk-MacOSX/solr/build/solr-core/test/J0
[junit4:junit4]   2> 6882 T1989 oass.SolrDispatchFilter.init SolrDispatchFilter.init() done
[junit4:junit4]   2> 6884 T1989 oascsi.HttpClientUtil.createClient Creating new http client, config:maxConnections=128&maxConnectionsPerHost=32&followRedirects=false
[junit4:junit4]   2> 7088 T1989 oejs.Server.doStart jetty-8.1.8.v20121106
[junit4:junit4]   2> 7092 T1989 oejs.AbstractConnector.doStart Started SelectChannelConnector@127.0.0.1:49849
[junit4:junit4]   2> 7097 T1989 oasc.SolrResourceLoader.locateSolrHome JNDI not configured for solr (NoInitialContextEx)
[junit4:junit4]   2> 7098 T1989 oasc.SolrResourceLoader.locateSolrHome using system property solr.solr.home: /Users/jenkins/jenkins-slave/workspace/Lucene-Solr-trunk-MacOSX/solr/build/solr-core/test/J0/./org.apache.solr.cloud.BasicDistributedZkTest-jetty2-1357084792038
[junit4:junit4]   2> 7098 T1989 oasc.SolrResourceLoader.<init> new SolrResourceLoader for deduced Solr Home: '/Users/jenkins/jenkins-slave/workspace/Lucene-Solr-trunk-MacOSX/solr/build/solr-core/test/J0/./org.apache.solr.cloud.BasicDistributedZkTest-jetty2-1357084792038/'
[junit4:junit4]   2> 7124 T1989 oass.SolrDispatchFilter.init SolrDispatchFilter.init()
[junit4:junit4]   2> 7125 T1989 oasc.SolrResourceLoader.locateSolrHome JNDI not configured for solr (NoInitialContextEx)
[junit4:junit4]   2> 7126 T1989 oasc.SolrResourceLoader.locateSolrHome using system property solr.solr.home: /Users/jenkins/jenkins-slave/workspace/Lucene-Solr-trunk-MacOSX/solr/build/solr-core/test/J0/./org.apache.solr.cloud.BasicDistributedZkTest-jetty2-1357084792038
[junit4:junit4]   2> 7126 T1989 oasc.CoreContainer$Initializer.initialize looking for solr.xml: /Users/jenkins/jenkins-slave/workspace/Lucene-Solr-trunk-MacOSX/solr/build/solr-core/test/J0/./org.apache.solr.cloud.BasicDistributedZkTest-jetty2-1357084792038/solr.xml
[junit4:junit4]   2> 7127 T1989 oasc.CoreContainer.<init> New CoreContainer 1233923701
[junit4:junit4]   2> 7127 T1989 oasc.CoreContainer.load Loading CoreContainer using Solr Home: '/Users/jenkins/jenkins-slave/workspace/Lucene-Solr-trunk-MacOSX/solr/build/solr-core/test/J0/./org.apache.solr.cloud.BasicDistributedZkTest-jetty2-1357084792038/'
[junit4:junit4]   2> 7129 T1989 oasc.SolrResourceLoader.<init> new SolrResourceLoader for directory: '/Users/jenkins/jenkins-slave/workspace/Lucene-Solr-trunk-MacOSX/solr/build/solr-core/test/J0/./org.apache.solr.cloud.BasicDistributedZkTest-jetty2-1357084792038/'
[junit4:junit4]   2> 7162 T1989 oashc.HttpShardHandlerFactory.getParameter Setting socketTimeout to: 30000
[junit4:junit4]   2> 7163 T1989 oashc.HttpShardHandlerFactory.getParameter Setting urlScheme to: http://
[junit4:junit4]   2> 7163 T1989 oashc.HttpShardHandlerFactory.getParameter Setting connTimeout to: 15000
[junit4:junit4]   2> 7164 T1989 oashc.HttpShardHandlerFactory.getParameter Setting maxConnectionsPerHost to: 20
[junit4:junit4]   2> 7164 T1989 oashc.HttpShardHandlerFactory.getParameter Setting corePoolSize to: 0
[junit4:junit4]   2> 7165 T1989 oashc.HttpShardHandlerFactory.getParameter Setting maximumPoolSize to: 2147483647
[junit4:junit4]   2> 7165 T1989 oashc.HttpShardHandlerFactory.getParameter Setting maxThreadIdleTime to: 5
[junit4:junit4]   2> 7166 T1989 oashc.HttpShardHandlerFactory.getParameter Setting sizeOfQueue to: -1
[junit4:junit4]   2> 7166 T1989 oashc.HttpShardHandlerFactory.getParameter Setting fairnessPolicy to: false
[junit4:junit4]   2> 7167 T1989 oascsi.HttpClientUtil.createClient Creating new http client, config:maxConnectionsPerHost=20&maxConnections=10000&socketTimeout=30000&connTimeout=15000&retry=false
[junit4:junit4]   2> 7184 T1989 oasc.CoreContainer.load Registering Log Listener
[junit4:junit4]   2> 7208 T1989 oasc.CoreContainer.initZooKeeper Zookeeper client=127.0.0.1:49839/solr
[junit4:junit4]   2> 7209 T1989 oasc.ZkController.checkChrootPath zkHost includes chroot
[junit4:junit4]   2> 7209 T1989 oaz.ZooKeeper.<init> Initiating client connection, connectString=127.0.0.1:49839 sessionTimeout=60000 watcher=org.apache.solr.common.cloud.ConnectionManager@35d7bc23
[junit4:junit4]   2> 7211 T1989 oascc.ConnectionManager.waitForConnected Waiting for client to connect to ZooKeeper
[junit4:junit4]   2> 7213 T2042 oaz.ClientCnxn$SendThread.logStartConnect Opening socket connection to server localhost/127.0.0.1:49839. Will not attempt to authenticate using SASL (access denied ("javax.security.auth.AuthPermission" "getLoginConfiguration"))
[junit4:junit4]   2> 7215 T2042 oaz.ClientCnxn$SendThread.primeConnection Socket connection established to localhost/127.0.0.1:49839, initiating session
[junit4:junit4]   2> 7215 T1991 oazs.NIOServerCnxnFactory.run Accepted socket connection from /127.0.0.1:49850
[junit4:junit4]   2> 7216 T1991 oazs.ZooKeeperServer.processConnectRequest Client attempting to establish new session at /127.0.0.1:49850
[junit4:junit4]   2> 7217 T1993 oazs.ZooKeeperServer.finishSessionInit Established session 0x13bf88e7a000007 with negotiated timeout 20000 for client /127.0.0.1:49850
[junit4:junit4]   2> 7218 T2042 oaz.ClientCnxn$SendThread.onConnected Session establishment complete on server localhost/127.0.0.1:49839, sessionid = 0x13bf88e7a000007, negotiated timeout = 20000
[junit4:junit4]   2> 7216 T2043 oascc.ConnectionManager.process Watcher org.apache.solr.common.cloud.ConnectionManager@35d7bc23 name:ZooKeeperConnection Watcher:127.0.0.1:49839 got event WatchedEvent state:SyncConnected type:None path:null path:null type:None
[junit4:junit4]   2> 7218 T1989 oascc.ConnectionManager.waitForConnected Client is connected to ZooKeeper
[junit4:junit4]   2> 7218 T1994 oazs.PrepRequestProcessor.pRequest2Txn Processed session termination for sessionid: 0x13bf88e7a000007
[junit4:junit4]   2> 7221 T1991 oazs.NIOServerCnxn.closeSock Closed socket connection for client /127.0.0.1:49850 which had sessionid 0x13bf88e7a000007
[junit4:junit4]   2> 7221 T2043 oaz.ClientCnxn$EventThread.run EventThread shut down
[junit4:junit4]   2> 7218 T1989 oaz.ZooKeeper.close Session: 0x13bf88e7a000007 closed
[junit4:junit4]   2> 7219 T1989 oascsi.HttpClientUtil.createClient Creating new http client, config:maxConnections=500&maxConnectionsPerHost=16&socketTimeout=15000&connTimeout=30000
[junit4:junit4]   2> 7227 T1989 oaz.ZooKeeper.<init> Initiating client connection, connectString=127.0.0.1:49839/solr sessionTimeout=30000 watcher=org.apache.solr.common.cloud.ConnectionManager@2749412
[junit4:junit4]   2> 7228 T1989 oascc.ConnectionManager.waitForConnected Waiting for client to connect to ZooKeeper
[junit4:junit4]   2> 7226 T2044 oaz.ClientCnxn$SendThread.logStartConnect Opening socket connection to server localhost/127.0.0.1:49839. Will not attempt to authenticate using SASL (access denied ("javax.security.auth.AuthPermission" "getLoginConfiguration"))
[junit4:junit4]   2> 7229 T2044 oaz.ClientCnxn$SendThread.primeConnection Socket connection established to localhost/127.0.0.1:49839, initiating session
[junit4:junit4]   2> 7228 T1991 oazs.NIOServerCnxnFactory.run Accepted socket connection from /127.0.0.1:49851
[junit4:junit4]   2> 7231 T1991 oazs.ZooKeeperServer.processConnectRequest Client attempting to establish new session at /127.0.0.1:49851
[junit4:junit4]   2> 7232 T1993 oazs.ZooKeeperServer.finishSessionInit Established session 0x13bf88e7a000008 with negotiated timeout 20000 for client /127.0.0.1:49851
[junit4:junit4]   2> 7229 T2044 oaz.ClientCnxn$SendThread.onConnected Session establishment complete on server localhost/127.0.0.1:49839, sessionid = 0x13bf88e7a000008, negotiated timeout = 20000
[junit4:junit4]   2> 7230 T2045 oascc.ConnectionManager.process Watcher org.apache.solr.common.cloud.ConnectionManager@2749412 name:ZooKeeperConnection Watcher:127.0.0.1:49839/solr got event WatchedEvent state:SyncConnected type:None path:null path:null type:None
[junit4:junit4]   2> 7233 T1989 oascc.ConnectionManager.waitForConnected Client is connected to ZooKeeper
[junit4:junit4]   2> 7231 T1994 oazs.PrepRequestProcessor.pRequest Got user-level KeeperException when processing sessionid:0x13bf88e7a000008 type:create cxid:0x1 zxid:0x6c txntype:-1 reqpath:n/a Error Path:/solr/overseer Error:KeeperErrorCode = NodeExists for /solr/overseer
[junit4:junit4]   2> 7233 T1994 oazs.PrepRequestProcessor.pRequest Got user-level KeeperException when processing sessionid:0x13bf88e7a000008 type:create cxid:0x2 zxid:0x6d txntype:-1 reqpath:n/a Error Path:/solr/overseer Error:KeeperErrorCode = NodeExists for /solr/overseer
[junit4:junit4]   2> 7234 T1989 oasc.ZkController.createEphemeralLiveNode Register node as live in ZooKeeper:/live_nodes/127.0.0.1:49849_
[junit4:junit4]   2> 7235 T1994 oazs.PrepRequestProcessor.pRequest Got user-level KeeperException when processing sessionid:0x13bf88e7a000008 type:delete cxid:0x4 zxid:0x6e txntype:-1 reqpath:n/a Error Path:/solr/live_nodes/127.0.0.1:49849_ Error:KeeperErrorCode = NoNode for /solr/live_nodes/127.0.0.1:49849_
[junit4:junit4]   2> 7236 T1989 oascc.SolrZkClient.makePath makePath: /live_nodes/127.0.0.1:49849_
[junit4:junit4]   2> 7242 T2011 oascc.ZkStateReader$2.process A cluster state change: WatchedEvent state:SyncConnected type:NodeChildrenChanged path:/live_nodes, has occurred - updating... (live nodes size: 2)
[junit4:junit4]   2> 7240 T2017 oascc.ZkStateReader$2.process A cluster state change: WatchedEvent state:SyncConnected type:NodeChildrenChanged path:/live_nodes, has occurred - updating... (live nodes size: 2)
[junit4:junit4]   2> 7241 T2030 oascc.ZkStateReader$3.process Updating live nodes... (3)
[junit4:junit4]   2> 7244 T2030 oascc.ZkStateReader$2.process A cluster state change: WatchedEvent state:SyncConnected type:NodeChildrenChanged path:/live_nodes, has occurred - updating... (live nodes size: 3)
[junit4:junit4]   2> 7244 T2017 oascc.ZkStateReader$3.process Updating live nodes... (3)
[junit4:junit4]   2> 7247 T2011 oascc.ZkStateReader$3.process Updating live nodes... (3)
[junit4:junit4]   2> 7248 T1989 oascc.ZkStateReader.createClusterStateWatchersAndUpdate Updating cluster state from ZooKeeper... 
[junit4:junit4]   2> 7257 T2046 oasc.CoreContainer.create Creating SolrCore 'collection1' using instanceDir: /Users/jenkins/jenkins-slave/workspace/Lucene-Solr-trunk-MacOSX/solr/build/solr-core/test/J0/./org.apache.solr.cloud.BasicDistributedZkTest-jetty2-1357084792038/collection1
[junit4:junit4]   2> 7257 T2046 oasc.ZkController.createCollectionZkNode Check for collection zkNode:collection1
[junit4:junit4]   2> 7261 T2046 oasc.ZkController.createCollectionZkNode Collection zkNode exists
[junit4:junit4]   2> 7261 T2046 oasc.ZkController.readConfigName Load collection config from:/collections/collection1
[junit4:junit4]   2> 7261 T2046 oasc.SolrResourceLoader.<init> new SolrResourceLoader for directory: '/Users/jenkins/jenkins-slave/workspace/Lucene-Solr-trunk-MacOSX/solr/build/solr-core/test/J0/./org.apache.solr.cloud.BasicDistributedZkTest-jetty2-1357084792038/collection1/'
[junit4:junit4]   2> 7262 T2046 oasc.SolrResourceLoader.replaceClassLoader Adding 'file:/Users/jenkins/jenkins-slave/workspace/Lucene-Solr-trunk-MacOSX/solr/build/solr-core/test/J0/org.apache.solr.cloud.BasicDistributedZkTest-jetty2-1357084792038/collection1/lib/classes/' to classloader
[junit4:junit4]   2> 7262 T2046 oasc.SolrResourceLoader.replaceClassLoader Adding 'file:/Users/jenkins/jenkins-slave/workspace/Lucene-Solr-trunk-MacOSX/solr/build/solr-core/test/J0/org.apache.solr.cloud.BasicDistributedZkTest-jetty2-1357084792038/collection1/lib/README' to classloader
[junit4:junit4]   2> 7312 T2046 oasc.SolrConfig.<init> Using Lucene MatchVersion: LUCENE_50
[junit4:junit4]   2> 7379 T2046 oasc.SolrConfig.<init> Loaded SolrConfig: solrconfig.xml
[junit4:junit4]   2> 7381 T2046 oass.IndexSchema.readSchema Reading Solr Schema
[junit4:junit4]   2> 7386 T2046 oass.IndexSchema.readSchema Schema name=test
[junit4:junit4]   2> 8011 T2046 oass.OpenExchangeRatesOrgProvider.init Initialized with rates=open-exchange-rates.json, refreshInterval=1440.
[junit4:junit4]   2> 8019 T2046 oass.IndexSchema.readSchema default search field in schema is text
[junit4:junit4]   2> 8023 T2046 oass.IndexSchema.readSchema unique key field: id
[junit4:junit4]   2> 8051 T2046 oass.FileExchangeRateProvider.reload Reloading exchange rates from file currency.xml
[junit4:junit4]   2> 8057 T2046 oass.FileExchangeRateProvider.reload Reloading exchange rates from file currency.xml
[junit4:junit4]   2> 8064 T2046 oass.OpenExchangeRatesOrgProvider.reload Reloading exchange rates from open-exchange-rates.json
[junit4:junit4]   2> 8065 T2046 oass.OpenExchangeRatesOrgProvider.reload Reloading exchange rates from open-exchange-rates.json
[junit4:junit4]   2> 8068 T2046 oasc.SolrCore.<init> [collection1] Opening new SolrCore at /Users/jenkins/jenkins-slave/workspace/Lucene-Solr-trunk-MacOSX/solr/build/solr-core/test/J0/./org.apache.solr.cloud.BasicDistributedZkTest-jetty2-1357084792038/collection1/, dataDir=./org.apache.solr.cloud.BasicDistributedZkTest-1357084785145/jetty2/
[junit4:junit4]   2> 8069 T2046 oasc.JmxMonitoredMap.<init> JMX monitoring is enabled. Adding Solr mbeans to JMX Server: com.sun.jmx.mbeanserver.JmxMBeanServer@52cf357a
[junit4:junit4]   2> 8070 T2046 oasc.SolrCore.initDirectoryFactory solr.NRTCachingDirectoryFactory
[junit4:junit4]   2> 8071 T2046 oasc.CachingDirectoryFactory.get return new directory for /Users/jenkins/jenkins-slave/workspace/Lucene-Solr-trunk-MacOSX/solr/build/solr-core/test/J0/./org.apache.solr.cloud.BasicDistributedZkTest-1357084785145/jetty2 forceNew:false
[junit4:junit4]   2> 8072 T2046 oasc.CachingDirectoryFactory.close Releasing directory:/Users/jenkins/jenkins-slave/workspace/Lucene-Solr-trunk-MacOSX/solr/build/solr-core/test/J0/./org.apache.solr.cloud.BasicDistributedZkTest-1357084785145/jetty2
[junit4:junit4]   2> 8073 T2046 oasc.SolrCore.getNewIndexDir New index directory detected: old=null new=./org.apache.solr.cloud.BasicDistributedZkTest-1357084785145/jetty2/index/
[junit4:junit4]   2> 8073 T2046 oasc.SolrCore.initIndex WARNING [collection1] Solr index directory './org.apache.solr.cloud.BasicDistributedZkTest-1357084785145/jetty2/index' doesn't exist. Creating new index...
[junit4:junit4]   2> 8075 T2046 oasc.CachingDirectoryFactory.get return new directory for /Users/jenkins/jenkins-slave/workspace/Lucene-Solr-trunk-MacOSX/solr/build/solr-core/test/J0/./org.apache.solr.cloud.BasicDistributedZkTest-1357084785145/jetty2/index forceNew:false
[junit4:junit4]   2> 8080 T2046 oasc.SolrDeletionPolicy.onCommit SolrDeletionPolicy.onCommit: commits:num=1
[junit4:junit4]   2> 		commit{dir=RateLimitedDirectoryWrapper(NRTCachingDirectory(org.apache.lucene.store.NIOFSDirectory@/Users/jenkins/jenkins-slave/workspace/Lucene-Solr-trunk-MacOSX/solr/build/solr-core/test/J0/org.apache.solr.cloud.BasicDistributedZkTest-1357084785145/jetty2/index lockFactory=org.apache.lucene.store.NativeFSLockFactory@39f8d04d; maxCacheMB=48.0 maxMergeSizeMB=4.0)),segFN=segments_1,generation=1,filenames=[segments_1]
[junit4:junit4]   2> 8081 T2046 oasc.SolrDeletionPolicy.updateCommits newest commit = 1[segments_1]
[junit4:junit4]   2> 8081 T2046 oasc.CachingDirectoryFactory.close Releasing directory:/Users/jenkins/jenkins-slave/workspace/Lucene-Solr-trunk-MacOSX/solr/build/solr-core/test/J0/./org.apache.solr.cloud.BasicDistributedZkTest-1357084785145/jetty2/index
[junit4:junit4]   2> 8082 T2046 oasc.SolrCore.initWriters created xml: solr.XMLResponseWriter
[junit4:junit4]   2> 8084 T2046 oasup.UpdateRequestProcessorChain.init inserting DistributedUpdateProcessorFactory into updateRequestProcessorChain "dedupe"
[junit4:junit4]   2> 8085 T2046 oasup.UpdateRequestProcessorChain.init inserting DistributedUpdateProcessorFactory into updateRequestProcessorChain "dedupe-allfields"
[junit4:junit4]   2> 8085 T2046 oasup.UpdateRequestProcessorChain.init inserting DistributedUpdateProcessorFactory into updateRequestProcessorChain "stored_sig"
[junit4:junit4]   2> 8086 T2046 oasup.UpdateRequestProcessorChain.init inserting DistributedUpdateProcessorFactory into updateRequestProcessorChain "uniq-fields"
[junit4:junit4]   2> 8086 T2046 oasup.UpdateRequestProcessorChain.init inserting DistributedUpdateProcessorFactory into updateRequestProcessorChain "distrib-dup-test-chain-implicit"
[junit4:junit4]   2> 8087 T2046 oasc.RequestHandlers.initHandlersFromConfig adding lazy requestHandler: solr.ReplicationHandler
[junit4:junit4]   2> 8087 T2046 oasc.RequestHandlers.initHandlersFromConfig created /replication: solr.ReplicationHandler
[junit4:junit4]   2> 8088 T2046 oasc.RequestHandlers.initHandlersFromConfig created standard: solr.StandardRequestHandler
[junit4:junit4]   2> 8089 T2046 oasc.RequestHandlers.initHandlersFromConfig created /get: solr.RealTimeGetHandler
[junit4:junit4]   2> 8089 T2046 oasc.RequestHandlers.initHandlersFromConfig created dismax: solr.SearchHandler
[junit4:junit4]   2> 8090 T2046 oasc.RequestHandlers.initHandlersFromConfig created mock: org.apache.solr.core.MockQuerySenderListenerReqHandler
[junit4:junit4]   2> 8090 T2046 oasc.RequestHandlers.initHandlersFromConfig created /admin/: org.apache.solr.handler.admin.AdminHandlers
[junit4:junit4]   2> 8091 T2046 oasc.RequestHandlers.initHandlersFromConfig created defaults: solr.StandardRequestHandler
[junit4:junit4]   2> 8091 T2046 oasc.RequestHandlers.initHandlersFromConfig adding lazy requestHandler: solr.StandardRequestHandler
[junit4:junit4]   2> 8092 T2046 oasc.RequestHandlers.initHandlersFromConfig created lazy: solr.StandardRequestHandler
[junit4:junit4]   2> 8092 T2046 oasc.RequestHandlers.initHandlersFromConfig created /update: solr.UpdateRequestHandler
[junit4:junit4]   2> 8093 T2046 oasc.RequestHandlers.initHandlersFromConfig created /terms: org.apache.solr.handler.component.SearchHandler
[junit4:junit4]   2> 8093 T2046 oasc.RequestHandlers.initHandlersFromConfig created spellCheckCompRH: org.apache.solr.handler.component.SearchHandler
[junit4:junit4]   2> 8094 T2046 oasc.RequestHandlers.initHandlersFromConfig created spellCheckCompRH_Direct: org.apache.solr.handler.component.SearchHandler
[junit4:junit4]   2> 8094 T2046 oasc.RequestHandlers.initHandlersFromConfig created spellCheckWithWordbreak: org.apache.solr.handler.component.SearchHandler
[junit4:junit4]   2> 8095 T2046 oasc.RequestHandlers.initHandlersFromConfig created spellCheckWithWordbreak_Direct: org.apache.solr.handler.component.SearchHandler
[junit4:junit4]   2> 8095 T2046 oasc.RequestHandlers.initHandlersFromConfig created spellCheckCompRH1: org.apache.solr.handler.component.SearchHandler
[junit4:junit4]   2> 8096 T2046 oasc.RequestHandlers.initHandlersFromConfig created mltrh: org.apache.solr.handler.component.SearchHandler
[junit4:junit4]   2> 8097 T2046 oasc.RequestHandlers.initHandlersFromConfig created tvrh: org.apache.solr.handler.component.SearchHandler
[junit4:junit4]   2> 8098 T2046 oasc.RequestHandlers.initHandlersFromConfig created /mlt: solr.MoreLikeThisHandler
[junit4:junit4]   2> 8098 T2046 oasc.RequestHandlers.initHandlersFromConfig created /debug/dump: solr.DumpRequestHandler
[junit4:junit4]   2> 8105 T2046 oashl.XMLLoader.init xsltCacheLifetimeSeconds=60
[junit4:junit4]   2> 8108 T2046 oasc.SolrCore.initDeprecatedSupport WARNING solrconfig.xml uses deprecated <admin/gettableFiles>, Please update your config to use the ShowFileRequestHandler.
[junit4:junit4]   2> 8113 T2046 oasc.SolrCore.initDeprecatedSupport WARNING adding ShowFileRequestHandler with hidden files: [SCHEMA.XML, OLD_SYNONYMS.TXT, STOPWORDS.TXT, PROTWORDS.TXT, OPEN-EXCHANGE-RATES.JSON, SYNONYMS.TXT, CURRENCY.XML, MAPPING-ISOLATIN1ACCENT.TXT]
[junit4:junit4]   2> 8117 T2046 oasc.CachingDirectoryFactory.close Releasing directory:/Users/jenkins/jenkins-slave/workspace/Lucene-Solr-trunk-MacOSX/solr/build/solr-core/test/J0/./org.apache.solr.cloud.BasicDistributedZkTest-1357084785145/jetty2
[junit4:junit4]   2> 8119 T2046 oass.SolrIndexSearcher.<init> Opening Searcher@3b8bb2a3 main
[junit4:junit4]   2> 8121 T2046 oasu.CommitTracker.<init> Hard AutoCommit: disabled
[junit4:junit4]   2> 8121 T2046 oasu.CommitTracker.<init> Soft AutoCommit: disabled
[junit4:junit4]   2> 8122 T2046 oashc.SpellCheckComponent.inform Initializing spell checkers
[junit4:junit4]   2> 8128 T2046 oass.DirectSolrSpellChecker.init init: {name=direct,classname=DirectSolrSpellChecker,field=lowerfilt,minQueryLength=3}
[junit4:junit4]   2> 8164 T2047 oasc.SolrCore.registerSearcher [collection1] Registered new searcher Searcher@3b8bb2a3 main{StandardDirectoryReader(segments_1:1)}
[junit4:junit4]   2> 8167 T2046 oasc.ZkController.publish publishing core=collection1 state=down
[junit4:junit4]   2> 8167 T2046 oasc.ZkController.publish numShards not found on descriptor - reading it from system property
[junit4:junit4]   2> 8358 T2012 oascc.ZkStateReader.updateClusterState Updating cloud state from ZooKeeper... 
[junit4:junit4]   2> 8359 T2012 oasc.Overseer$ClusterStateUpdater.updateState Update state numShards=2 message={
[junit4:junit4]   2> 	  "operation":"state",
[junit4:junit4]   2> 	  "numShards":"2",
[junit4:junit4]   2> 	  "shard":"shard1",
[junit4:junit4]   2> 	  "roles":null,
[junit4:junit4]   2> 	  "state":"active",
[junit4:junit4]   2> 	  "core":"collection1",
[junit4:junit4]   2> 	  "collection":"collection1",
[junit4:junit4]   2> 	  "node_name":"127.0.0.1:49846_",
[junit4:junit4]   2> 	  "base_url":"http://127.0.0.1:49846"}
[junit4:junit4]   2> 8364 T2012 oasc.Overseer$ClusterStateUpdater.updateState Update state numShards=2 message={
[junit4:junit4]   2> 	  "operation":"state",
[junit4:junit4]   2> 	  "numShards":"2",
[junit4:junit4]   2> 	  "shard":null,
[junit4:junit4]   2> 	  "roles":null,
[junit4:junit4]   2> 	  "state":"down",
[junit4:junit4]   2> 	  "core":"collection1",
[junit4:junit4]   2> 	  "collection":"collection1",
[junit4:junit4]   2> 	  "node_name":"127.0.0.1:49849_",
[junit4:junit4]   2> 	  "base_url":"http://127.0.0.1:49849"}
[junit4:junit4]   2> 8365 T2012 oasc.Overseer$ClusterStateUpdater.updateState Collection already exists with numShards=2
[junit4:junit4]   2> 8365 T2012 oasc.Overseer$ClusterStateUpdater.updateState Assigning new node to shard shard=shard2
[junit4:junit4]   2> 8369 T2045 oascc.ZkStateReader$2.process A cluster state change: WatchedEvent state:SyncConnected type:NodeDataChanged path:/clusterstate.json, has occurred - updating... (live nodes size: 3)
[junit4:junit4]   2> 8371 T2011 oascc.ZkStateReader$2.process A cluster state change: WatchedEvent state:SyncConnected type:NodeDataChanged path:/clusterstate.json, has occurred - updating... (live nodes size: 3)
[junit4:junit4]   2> 8369 T2017 oascc.ZkStateReader$2.process A cluster state change: WatchedEvent state:SyncConnected type:NodeDataChanged path:/clusterstate.json, has occurred - updating... (live nodes size: 3)
[junit4:junit4]   2> 8372 T2030 oascc.ZkStateReader$2.process A cluster state change: WatchedEvent state:SyncConnected type:NodeDataChanged path:/clusterstate.json, has occurred - updating... (live nodes size: 3)
[junit4:junit4]   2> 9174 T2046 oasc.CoreContainer.registerCore registering core: collection1
[junit4:junit4]   2> 9174 T2046 oasc.ZkController.register Register replica - core:collection1 address:http://127.0.0.1:49849 collection:collection1 shard:shard2
[junit4:junit4]   2> 9174 T2046 oascc.SolrZkClient.makePath makePath: /collections/collection1/leader_elect/shard2/election
[junit4:junit4]   2> 9193 T1994 oazs.PrepRequestProcessor.pRequest Got user-level KeeperException when processing sessionid:0x13bf88e7a000008 type:delete cxid:0x42 zxid:0x7c txntype:-1 reqpath:n/a Error Path:/solr/collections/collection1/leaders/shard2 Error:KeeperErrorCode = NoNode for /solr/collections/collection1/leaders/shard2
[junit4:junit4]   2> 9192 T2046 oasc.ShardLeaderElectionContext.runLeaderProcess Running the leader process.
[junit4:junit4]   2> 9195 T1994 oazs.PrepRequestProcessor.pRequest Got user-level KeeperException when processing sessionid:0x13bf88e7a000008 type:create cxid:0x43 zxid:0x7d txntype:-1 reqpath:n/a Error Path:/solr/overseer Error:KeeperErrorCode = NodeExists for /solr/overseer
[junit4:junit4]   2> 9197 T2046 oasc.ShardLeaderElectionContext.waitForReplicasToComeUp Enough replicas found to continue.
[junit4:junit4]   2> 9198 T2046 oasc.ShardLeaderElectionContext.runLeaderProcess I may be the new leader - try and sync
[junit4:junit4]   2> 9198 T2046 oasc.SyncStrategy.sync Sync replicas to http://127.0.0.1:49849/collection1/
[junit4:junit4]   2> 9199 T2046 oasc.SyncStrategy.syncReplicas Sync Success - now sync replicas to me
[junit4:junit4]   2> 9199 T2046 oasc.SyncStrategy.syncToMe http://127.0.0.1:49849/collection1/ has no replicas
[junit4:junit4]   2> 9200 T2046 oasc.ShardLeaderElectionContext.runLeaderProcess I am the new leader: http://127.0.0.1:49849/collection1/
[junit4:junit4]   2> 9200 T2046 oascc.SolrZkClient.makePath makePath: /collections/collection1/leaders/shard2
[junit4:junit4]   2> 9213 T1994 oazs.PrepRequestProcessor.pRequest Got user-level KeeperException when processing sessionid:0x13bf88e7a000008 type:create cxid:0x4c zxid:0x80 txntype:-1 reqpath:n/a Error Path:/solr/overseer Error:KeeperErrorCode = NodeExists for /solr/overseer
[junit4:junit4]   2> 9888 T2012 oascc.ZkStateReader.updateClusterState Updating cloud state from ZooKeeper... 
[junit4:junit4]   2> 9925 T2045 oascc.ZkStateReader$2.process A cluster state change: WatchedEvent state:SyncConnected type:NodeDataChanged path:/clusterstate.json, has occurred - updating... (live nodes size: 3)
[junit4:junit4]   2> 9928 T2030 oascc.ZkStateReader$2.process A cluster state change: WatchedEvent state:SyncConnected type:NodeDataChanged path:/clusterstate.json, has occurred - updating... (live nodes size: 3)
[junit4:junit4]   2> 9926 T2011 oascc.ZkStateReader$2.process A cluster state change: WatchedEvent state:SyncConnected type:NodeDataChanged path:/clusterstate.json, has occurred - updating... (live nodes size: 3)
[junit4:junit4]   2> 9927 T2017 oascc.ZkStateReader$2.process A cluster state change: WatchedEvent state:SyncConnected type:NodeDataChanged path:/clusterstate.json, has occurred - updating... (live nodes size: 3)
[junit4:junit4]   2> 9963 T2046 oasc.ZkController.register We are http://127.0.0.1:49849/collection1/ and leader is http://127.0.0.1:49849/collection1/
[junit4:junit4]   2> 9963 T2046 oasc.ZkController.register No LogReplay needed for core=collection1 baseURL=http://127.0.0.1:49849
[junit4:junit4]   2> 9963 T2046 oasc.ZkController.checkRecovery I am the leader, no recovery necessary
[junit4:junit4]   2> 9964 T2046 oasc.ZkController.publish publishing core=collection1 state=active
[junit4:junit4]   2> 9964 T2046 oasc.ZkController.publish numShards not found on descriptor - reading it from system property
[junit4:junit4]   2> 9969 T2046 oascc.ZkStateReader.updateClusterState Updating cloud state from ZooKeeper... 
[junit4:junit4]   2> 9974 T1989 oass.SolrDispatchFilter.init user.dir=/Users/jenkins/jenkins-slave/workspace/Lucene-Solr-trunk-MacOSX/solr/build/solr-core/test/J0
[junit4:junit4]   2> 9975 T1989 oass.SolrDispatchFilter.init SolrDispatchFilter.init() done
[junit4:junit4]   2> 9976 T1989 oascsi.HttpClientUtil.createClient Creating new http client, config:maxConnections=128&maxConnectionsPerHost=32&followRedirects=false
[junit4:junit4]   2> 10319 T1989 oejs.Server.doStart jetty-8.1.8.v20121106
[junit4:junit4]   2> 10328 T1989 oejs.AbstractConnector.doStart Started SelectChannelConnector@127.0.0.1:49852
[junit4:junit4]   2> 10329 T1989 oasc.SolrResourceLoader.locateSolrHome JNDI not configured for solr (NoInitialContextEx)
[junit4:junit4]   2> 10329 T1989 oasc.SolrResourceLoader.locateSolrHome using system property solr.solr.home: /Users/jenkins/jenkins-slave/workspace/Lucene-Solr-trunk-MacOSX/solr/build/solr-core/test/J0/./org.apache.solr.cloud.BasicDistributedZkTest-jetty3-1357084795120
[junit4:junit4]   2> 10330 T1989 oasc.SolrResourceLoader.<init> new SolrResourceLoader for deduced Solr Home: '/Users/jenkins/jenkins-slave/workspace/Lucene-Solr-trunk-MacOSX/solr/build/solr-core/test/J0/./org.apache.solr.cloud.BasicDistributedZkTest-jetty3-1357084795120/'
[junit4:junit4]   2> 10363 T1989 oass.SolrDispatchFilter.init SolrDispatchFilter.init()
[junit4:junit4]   2> 10364 T1989 oasc.SolrResourceLoader.locateSolrHome JNDI not configured for solr (NoInitialContextEx)
[junit4:junit4]   2> 10364 T1989 oasc.SolrResourceLoader.locateSolrHome using system property solr.solr.home: /Users/jenkins/jenkins-slave/workspace/Lucene-Solr-trunk-MacOSX/solr/build/solr-core/test/J0/./org.apache.solr.cloud.BasicDistributedZkTest-jetty3-1357084795120
[junit4:junit4]   2> 10365 T1989 oasc.CoreContainer$Initializer.initialize looking for solr.xml: /Users/jenkins/jenkins-slave/workspace/Lucene-Solr-trunk-MacOSX/solr/build/solr-core/test/J0/./org.apache.solr.cloud.BasicDistributedZkTest-jetty3-1357084795120/solr.xml
[junit4:junit4]   2> 10365 T1989 oasc.CoreContainer.<init> New CoreContainer 1778725062
[junit4:junit4]   2> 10366 T1989 oasc.CoreContainer.load Loading CoreContainer using Solr Home: '/Users/jenkins/jenkins-slave/workspace/Lucene-Solr-trunk-MacOSX/solr/build/solr-core/test/J0/./org.apache.solr.cloud.BasicDistributedZkTest-jetty3-1357084795120/'
[junit4:junit4]   2> 10366 T1989 oasc.SolrResourceLoader.<init> new SolrResourceLoader for directory: '/Users/jenkins/jenkins-slave/workspace/Lucene-Solr-trunk-MacOSX/solr/build/solr-core/test/J0/./org.apache.solr.cloud.BasicDistributedZkTest-jetty3-1357084795120/'
[junit4:junit4]   2> 10390 T1989 oashc.HttpShardHandlerFactory.getParameter Setting socketTimeout to: 30000
[junit4:junit4]   2> 10391 T1989 oashc.HttpShardHandlerFactory.getParameter Setting urlScheme to: http://
[junit4:junit4]   2> 10391 T1989 oashc.HttpShardHandlerFactory.getParameter Setting connTimeout to: 15000
[junit4:junit4]   2> 10392 T1989 oashc.HttpShardHandlerFactory.getParameter Setting maxConnectionsPerHost to: 20
[junit4:junit4]   2> 10392 T1989 oashc.HttpShardHandlerFactory.getParameter Setting corePoolSize to: 0
[junit4:junit4]   2> 10391 T1989 oashc.HttpShardHandlerFactory.getParameter Setting maximumPoolSize to: 2147483647
[junit4:junit4]   2> 10391 T1989 oashc.HttpShardHandlerFactory.getParameter Setting maxThreadIdleTime to: 5
[junit4:junit4]   2> 10392 T1989 oashc.HttpShardHandlerFactory.getParameter Setting sizeOfQueue to: -1
[junit4:junit4]   2> 10392 T1989 oashc.HttpShardHandlerFactory.getParameter Setting fairnessPolicy to: false
[junit4:junit4]   2> 10393 T1989 oascsi.HttpClientUtil.createClient Creating new http client, config:maxConnectionsPerHost=20&maxConnections=10000&socketTimeout=30000&connTimeout=15000&retry=false
[junit4:junit4]   2> 10409 T1989 oasc.CoreContainer.load Registering Log Listener
[junit4:junit4]   2> 10436 T1989 oasc.CoreContainer.initZooKeeper Zookeeper client=127.0.0.1:49839/solr
[junit4:junit4]   2> 10436 T1989 oasc.ZkController.checkChrootPath zkHost includes chroot
[junit4:junit4]   2> 10437 T1989 oaz.ZooKeeper.<init> Initiating client connection, connectString=127.0.0.1:49839 sessionTimeout=60000 watcher=org.apache.solr.common.cloud.ConnectionManager@5f737342
[junit4:junit4]   2> 10439 T2057 oaz.ClientCnxn$SendThread.logStartConnect Opening socket connection to server localhost/127.0.0.1:49839. Will not attempt to authenticate using SASL (access denied ("javax.security.auth.AuthPermission" "getLoginConfiguration"))
[junit4:junit4]   2> 10442 T1989 oascc.ConnectionManager.waitForConnected Waiting for client to connect to ZooKeeper
[junit4:junit4]   2> 10445 T2057 oaz.ClientCnxn$SendThread.primeConnection Socket connection established to localhost/127.0.0.1:49839, initiating session
[junit4:junit4]   2> 10443 T1991 oazs.NIOServerCnxnFactory.run Accepted socket connection from /127.0.0.1:49853
[junit4:junit4]   2> 10447 T1991 oazs.ZooKeeperServer.processConnectRequest Client attempting to establish new session at /127.0.0.1:49853
[junit4:junit4]   2> 10449 T1993 oazs.ZooKeeperServer.finishSessionInit Established session 0x13bf88e7a000009 with negotiated timeout 20000 for client /127.0.0.1:49853
[junit4:junit4]   2> 10449 T2057 oaz.ClientCnxn$SendThread.onConnected Session establishment complete on server localhost/127.0.0.1:49839, sessionid = 0x13bf88e7a000009, negotiated timeout = 20000
[junit4:junit4]   2> 10447 T2058 oascc.ConnectionManager.process Watcher org.apache.solr.common.cloud.ConnectionManager@5f737342 name:ZooKeeperConnection Watcher:127.0.0.1:49839 got event WatchedEvent state:SyncConnected type:None path:null path:null type:None
[junit4:junit4]   2> 10449 T1989 oascc.ConnectionManager.waitForConnected Client is connected to ZooKeeper
[junit4:junit4]   2> 10451 T1994 oazs.PrepRequestProcessor.pRequest2Txn Processed session termination for sessionid: 0x13bf88e7a000009
[junit4:junit4]   2> 10452 T1991 oazs.NIOServerCnxn.closeSock Closed socket connection for client /127.0.0.1:49853 which had sessionid 0x13bf88e7a000009
[junit4:junit4]   2> 10452 T1989 oaz.ZooKeeper.close Session: 0x13bf88e7a000009 closed
[junit4:junit4]   2> 10455 T2058 oaz.ClientCnxn$EventThread.run EventThread shut down
[junit4:junit4]   2> 10453 T1989 oascsi.HttpClientUtil.createClient Creating new http client, config:maxConnections=500&maxConnectionsPerHost=16&socketTimeout=15000&connTimeout=30000
[junit4:junit4]   2> 10459 T1989 oaz.ZooKeeper.<init> Initiating client connection, connectString=127.0.0.1:49839/solr sessionTimeout=30000 watcher=org.apache.solr.common.cloud.ConnectionManager@6742aaf1
[junit4:junit4]   2> 10461 T2059 oaz.ClientCnxn$SendThread.logStartConnect Opening socket connection to server localhost/127.0.0.1:49839. Will not attempt to authenticate using SASL (access denied ("javax.security.auth.AuthPermission" "getLoginConfiguration"))
[junit4:junit4]   2> 10463 T1989 oascc.ConnectionManager.waitForConnected Waiting for client to connect to ZooKeeper
[junit4:junit4]   2> 10464 T2059 oaz.ClientCnxn$SendThread.primeConnection Socket connection established to localhost/127.0.0.1:49839, initiating session
[junit4:junit4]   2> 10465 T1991 oazs.NIOServerCnxnFactory.run Accepted socket connection from /127.0.0.1:49854
[junit4:junit4]   2> 10465 T1991 oazs.ZooKeeperServer.processConnectRequest Client attempting to establish new session at /127.0.0.1:49854
[junit4:junit4]   2> 10469 T1993 oazs.ZooKeeperServer.finishSessionInit Established session 0x13bf88e7a00000a with negotiated timeout 20000 for client /127.0.0.1:49854
[junit4:junit4]   2> 10469 T2059 oaz.ClientCnxn$SendThread.onConnected Session establishment complete on server localhost/127.0.0.1:49839, sessionid = 0x13bf88e7a00000a, negotiated timeout = 20000
[junit4:junit4]   2> 10467 T2060 oascc.ConnectionManager.process Watcher org.apache.solr.common.cloud.ConnectionManager@6742aaf1 name:ZooKeeperConnection Watcher:127.0.0.1:49839/solr got event WatchedEvent state:SyncConnected type:None path:null path:null type:None
[junit4:junit4]   2> 10475 T1989 oascc.ConnectionManager.waitForConnected Client is connected to ZooKeeper
[junit4:junit4]   2> 10477 T1994 oazs.PrepRequestProcessor.pRequest Got user-level KeeperException when processing sessionid:0x13bf88e7a00000a type:create cxid:0x1 zxid:0x8d txntype:-1 reqpath:n/a Error Path:/solr/overseer Error:KeeperErrorCode = NodeExists for /solr/overseer
[junit4:junit4]   2> 10479 T1994 oazs.PrepRequestProcessor.pRequest Got user-level KeeperException when processing sessionid:0x13bf88e7a00000a type:create cxid:0x2 zxid:0x8e txntype:-1 reqpath:n/a Error Path:/solr/overseer Error:KeeperErrorCode = NodeExists for /solr/overseer
[junit4:junit4]   2> 10482 T1989 oasc.ZkController.createEphemeralLiveNode Register node as live in ZooKeeper:/live_nodes/127.0.0.1:49852_
[junit4:junit4]   2> 10486 T1994 oazs.PrepRequestProcessor.pRequest Got user-level KeeperException when processing sessionid:0x13bf88e7a00000a type:delete cxid:0x4 zxid:0x8f txntype:-1 reqpath:n/a Error Path:/solr/live_nodes/127.0.0.1:49852_ Error:KeeperErrorCode = NoNode for /solr/live_nodes/127.0.0.1:49852_
[junit4:junit4]   2> 10488 T1989 oascc.SolrZkClient.makePath makePath: /live_nodes/127.0.0.1:49852_
[junit4:junit4]   2> 10506 T2011 oascc.ZkStateReader$2.process A cluster state change: WatchedEvent state:SyncConnected type:NodeChildrenChanged path:/live_nodes, has occurred - updating... (live nodes size: 3)
[junit4:junit4]   2> 10506 T2017 oascc.ZkStateReader$2.process A cluster state change: WatchedEvent state:SyncConnected type:NodeChildrenChanged path:/live_nodes, has occurred - updating... (live nodes size: 3)
[junit4:junit4]   2> 10509 T2045 oascc.ZkStateReader$3.process Updating live nodes... (4)
[junit4:junit4]   2> 10510 T2045 oascc.ZkStateReader$2.process A cluster state change: WatchedEvent state:SyncConnected type:NodeChildrenChanged path:/live_nodes, has occurred - updating... (live nodes size: 4)
[junit4:junit4]   2> 10514 T2030 oascc.ZkStateReader$3.process Updating live nodes... (4)
[junit4:junit4]   2> 10514 T2030 oascc.ZkStateReader$2.process A cluster state change: WatchedEvent state:SyncConnected type:NodeChildrenChanged path:/live_nodes, has occurred - updating... (live nodes size: 4)
[junit4:junit4]   2> 10521 T2011 oascc.ZkStateReader$3.process Updating live nodes... (4)
[junit4:junit4]   2> 10521 T2017 oascc.ZkStateReader$3.process Updating live nodes... (4)
[junit4:junit4]   2> 10535 T1989 oascc.ZkStateReader.createClusterStateWatchersAndUpdate Updating cluster state from ZooKeeper... 
[junit4:junit4]   2> 10556 T2061 oasc.CoreContainer.create Creating SolrCore 'collection1' using instanceDir: /Users/jenkins/jenkins-slave/workspace/Lucene-Solr-trunk-MacOSX/solr/build/solr-core/test/J0/./org.apache.solr.cloud.BasicDistributedZkTest-jetty3-1357084795120/collection1
[junit4:junit4]   2> 10555 T2061 oasc.ZkController.createCollectionZkNode Check for collection zkNode:collection1
[junit4:junit4]   2> 10560 T2061 oasc.ZkController.createCollectionZkNode Collection zkNode exists
[junit4:junit4]   2> 10561 T2061 oasc.ZkController.readConfigName Load collection config from:/collections/collection1
[junit4:junit4]   2> 10571 T2061 oasc.SolrResourceLoader.<init> new SolrResourceLoader for directory: '/Users/jenkins/jenkins-slave/workspace/Lucene-Solr-trunk-MacOSX/solr/build/solr-core/test/J0/./org.apache.solr.cloud.BasicDistributedZkTest-jetty3-1357084795120/collection1/'
[junit4:junit4]   2> 10572 T2061 oasc.SolrResourceLoader.replaceClassLoader Adding 'file:/Users/jenkins/jenkins-slave/workspace/Lucene-Solr-trunk-MacOSX/solr/build/solr-core/test/J0/org.apache.solr.cloud.BasicDistributedZkTest-jetty3-1357084795120/collection1/lib/classes/' to classloader
[junit4:junit4]   2> 10570 T2061 oasc.SolrResourceLoader.replaceClassLoader Adding 'file:/Users/jenkins/jenkins-slave/workspace/Lucene-Solr-trunk-MacOSX/solr/build/solr-core/test/J0/org.apache.solr.cloud.BasicDistributedZkTest-jetty3-1357084795120/collection1/lib/README' to classloader
[junit4:junit4]   2> 10645 T2061 oasc.SolrConfig.<init> Using Lucene MatchVersion: LUCENE_50
[junit4:junit4]   2> 10731 T2061 oasc.SolrConfig.<init> Loaded SolrConfig: solrconfig.xml
[junit4:junit4]   2> 10731 T2061 oass.IndexSchema.readSchema Reading Solr Schema
[junit4:junit4]   2> 10740 T2061 oass.IndexSchema.readSchema Schema name=test
[junit4:junit4]   2> 11458 T2012 oascc.ZkStateReader.updateClusterState Updating cloud state from ZooKeeper... 
[junit4:junit4]   2> 11461 T2012 oasc.Overseer$ClusterStateUpdater.updateState Update state numShards=2 message={
[junit4:junit4]   2> 	  "operation":"state",
[junit4:junit4]   2> 	  "numShards":"2",
[junit4:junit4]   2> 	  "shard":"shard2",
[junit4:junit4]   2> 	  "roles":null,
[junit4:junit4]   2> 	  "state":"active",
[junit4:junit4]   2> 	  "core":"collection1",
[junit4:junit4]   2> 	  "collection":"collection1",
[junit4:junit4]   2> 	  "node_name":"127.0.0.1:49849_",
[junit4:junit4]   2> 	  "base_url":"http://127.0.0.1:49849"}
[junit4:junit4]   2> 11501 T2045 oascc.ZkStateReader$2.process A cluster state change: WatchedEvent state:SyncConnected type:NodeDataChanged path:/clusterstate.json, has occurred - updating... (live nodes size: 4)
[junit4:junit4]   2> 11502 T2060 oascc.ZkStateReader$2.process A cluster state change: WatchedEvent state:SyncConnected type:NodeDataChanged path:/clusterstate.json, has occurred - updating... (live nodes size: 4)
[junit4:junit4]   2> 11503 T2030 oascc.ZkStateReader$2.process A cluster state change: WatchedEvent state:SyncConnected type:NodeDataChanged path:/clusterstate.json, has occurred - updating... (live nodes size: 4)
[junit4:junit4]   2> 11503 T2011 oascc.ZkStateReader$2.process A cluster state change: WatchedEvent state:SyncConnected type:NodeDataChanged path:/clusterstate.json, has occurred - updating... (live nodes size: 4)
[junit4:junit4]   2> 11504 T2017 oascc.ZkStateReader$2.process A cluster state change: WatchedEvent state:SyncConnected type:NodeDataChanged path:/clusterstate.json, has occurred - updating... (live nodes size: 4)
[junit4:junit4]   2> 11667 T2061 oass.OpenExchangeRatesOrgProvider.init Initialized with rates=open-exchange-rates.json, refreshInterval=1440.
[junit4:junit4]   2> 11682 T2061 oass.IndexSchema.readSchema default search field in schema is text
[junit4:junit4]   2> 11690 T2061 oass.IndexSchema.readSchema unique key field: id
[junit4:junit4]   2> 11738 T2061 oass.FileExchangeRateProvider.reload Reloading exchange rates from file currency.xml
[junit4:junit4]   2> 11747 T2061 oass.FileExchangeRateProvider.reload Reloading exchange rates from file currency.xml
[junit4:junit4]   2> 11762 T2061 oass.OpenExchangeRatesOrgProvider.reload Reloading exchange rates from open-exchange-rates.json
[junit4:junit4]   2> 11766 T2061 oass.OpenExchangeRatesOrgProvider.reload Reloading exchange rates from open-exchange-rates.json
[junit4:junit4]   2> 11768 T2061 oasc.SolrCore.<init> [collection1] Opening new SolrCore at /Users/jenkins/jenkins-slave/workspace/Lucene-Solr-trunk-MacOSX/solr/build/solr-core/test/J0/./org.apache.solr.cloud.BasicDistributedZkTest-jetty3-1357084795120/collection1/, dataDir=./org.apache.solr.cloud.BasicDistributedZkTest-1357084785145/jetty3/
[junit4:junit4]   2> 11769 T2061 oasc.JmxMonitoredMap.<init> JMX monitoring is enabled. Adding Solr mbeans to JMX Server: com.sun.jmx.mbeanserver.JmxMBeanServer@52cf357a
[junit4:junit4]   2> 11770 T2061 oasc.SolrCore.initDirectoryFactory solr.NRTCachingDirectoryFactory
[junit4:junit4]   2> 11771 T2061 oasc.CachingDirectoryFactory.get return new directory for /Users/jenkins/jenkins-slave/workspace/Lucene-Solr-trunk-MacOSX/solr/build/solr-core/test/J0/./org.apache.solr.cloud.BasicDistributedZkTest-1357084785145/jetty3 forceNew:false
[junit4:junit4]   2> 11773 T2061 oasc.CachingDirectoryFactory.close Releasing directory:/Users/jenkins/jenkins-slave/workspace/Lucene-Solr-trunk-MacOSX/solr/build/solr-core/test/J0/./org.apache.solr.cloud.BasicDistributedZkTest-1357084785145/jetty3
[junit4:junit4]   2> 11773 T2061 oasc.SolrCore.getNewIndexDir New index directory detected: old=null new=./org.apache.solr.cloud.BasicDistributedZkTest-1357084785145/jetty3/index/
[junit4:junit4]   2> 11774 T2061 oasc.SolrCore.initIndex WARNING [collection1] Solr index directory './org.apache.solr.cloud.BasicDistributedZkTest-1357084785145/jetty3/index' doesn't exist. Creating new index...
[junit4:junit4]   2> 11777 T2061 oasc.CachingDirectoryFactory.get return new directory for /Users/jenkins/jenkins-slave/workspace/Lucene-Solr-trunk-MacOSX/solr/build/solr-core/test/J0/./org.apache.solr.cloud.BasicDistributedZkTest-1357084785145/jetty3/index forceNew:false
[junit4:junit4]   2> 11788 T2061 oasc.SolrDeletionPolicy.onCommit SolrDeletionPolicy.onCommit: commits:num=1
[junit4:junit4]   2> 		commit{dir=RateLimitedDirectoryWrapper(NRTCachingDirectory(org.apache.lucene.store.NIOFSDirectory@/Users/jenkins/jenkins-slave/workspace/Lucene-Solr-trunk-MacOSX/solr/build/solr-core/test/J0/org.apache.solr.cloud.BasicDistributedZkTest-1357084785145/jetty3/index lockFactory=org.apache.lucene.store.NativeFSLockFactory@30974b7e; maxCacheMB=48.0 maxMergeSizeMB=4.0)),segFN=segments_1,generation=1,filenames=[segments_1]
[junit4:junit4]   2> 11788 T2061 oasc.SolrDeletionPolicy.updateCommits newest commit = 1[segments_1]
[junit4:junit4]   2> 11789 T2061 oasc.CachingDirectoryFactory.close Releasing directory:/Users/jenkins/jenkins-slave/workspace/Lucene-Solr-trunk-MacOSX/solr/build/solr-core/test/J0/./org.apache.solr.cloud.BasicDistributedZkTest-1357084785145/jetty3/index
[junit4:junit4]   2> 11793 T2061 oasc.SolrCore.initWriters created xml: solr.XMLResponseWriter
[junit4:junit4]   2> 11793 T2061 oasup.UpdateRequestProcessorChain.init inserting DistributedUpdateProcessorFactory into updateRequestProcessorChain "dedupe"
[junit4:junit4]   2> 11793 T2061 oasup.UpdateRequestProcessorChain.init inserting DistributedUpdateProcessorFactory into updateRequestProcessorChain "dedupe-allfields"
[junit4:junit4]   2> 11794 T2061 oasup.UpdateRequestProcessorChain.init inserting DistributedUpdateProcessorFactory into updateRequestProcessorChain "stored_sig"
[junit4:junit4]   2> 11794 T2061 oasup.UpdateRequestProcessorChain.init inserting DistributedUpdateProcessorFactory into updateRequestProcessorChain "uniq-fields"
[junit4:junit4]   2> 11798 T2061 oasup.UpdateRequestProcessorChain.init inserting DistributedUpdateProcessorFactory into updateRequestProcessorChain "distrib-dup-test-chain-implicit"
[junit4:junit4]   2> 11798 T2061 oasc.RequestHandlers.initHandlersFromConfig adding lazy requestHandler: solr.ReplicationHandler
[junit4:junit4]   2> 11799 T2061 oasc.RequestHandlers.initHandlersFromConfig created /replication: solr.ReplicationHandler
[junit4:junit4]   2> 11797 T2061 oasc.RequestHandlers.initHandlersFromConfig created standard: solr.StandardRequestHandler
[junit4:junit4]   2> 11798 T2061 oasc.RequestHandlers.initHandlersFromConfig created /get: solr.RealTimeGetHandler
[junit4:junit4]   2> 11803 T2061 oasc.RequestHandlers.initHandlersFromConfig created dismax: solr.SearchHandler
[junit4:junit4]   2> 11804 T2061 oasc.RequestHandlers.initHandlersFromConfig created mock: org.apache.solr.core.MockQuerySenderListenerReqHandler
[junit4:junit4]   2> 11805 T2061 oasc.RequestHandlers.initHandlersFromConfig created /admin/: org.apache.solr.handler.admin.AdminHandlers
[junit4:junit4]   2> 11805 T2061 oasc.RequestHandlers.initHandlersFromConfig created defaults: solr.StandardRequestHandler
[junit4:junit4]   2> 11805 T2061 oasc.RequestHandlers.initHandlersFromConfig adding lazy requestHandler: solr.StandardRequestHandler
[junit4:junit4]   2> 11807 T2061 oasc.RequestHandlers.initHandlersFromConfig created lazy: solr.StandardRequestHandler
[junit4:junit4]   2> 11807 T2061 oasc.RequestHandlers.initHandlersFromConfig created /update: solr.UpdateRequestHandler
[junit4:junit4]   2> 11808 T2061 oasc.RequestHandlers.initHandlersFromConfig created /terms: org.apache.solr.handler.component.SearchHandler
[junit4:junit4]   2> 11809 T2061 oasc.RequestHandlers.initHandlersFromConfig created spellCheckCompRH: org.apache.solr.handler.component.SearchHandler
[junit4:junit4]   2> 11809 T2061 oasc.RequestHandlers.initHandlersFromConfig created spellCheckCompRH_Direct: org.apache.solr.handler.component.SearchHandler
[junit4:junit4]   2> 11809 T2061 oasc.RequestHandlers.initHandlersFromConfig created spellCheckWithWordbreak: org.apache.solr.handler.component.SearchHandler
[junit4:junit4]   2> 11809 T2061 oasc.RequestHandlers.initHandlersFromConfig created spellCheckWithWordbreak_Direct: org.apache.solr.handler.component.SearchHandler
[junit4:junit4]   2> 11810 T2061 oasc.RequestHandlers.initHandlersFromConfig created spellCheckCompRH1: org.apache.solr.handler.component.SearchHandler
[junit4:junit4]   2> 11810 T2061 oasc.RequestHandlers.initHandlersFromConfig created mltrh: org.apache.solr.handler.component.SearchHandler
[junit4:junit4]   2> 11811 T2061 oasc.RequestHandlers.initHandlersFromConfig created tvrh: org.apache.solr.handler.component.SearchHandler
[junit4:junit4]   2> 11813 T2061 oasc.RequestHandlers.initHandlersFromConfig created /mlt: solr.MoreLikeThisHandler
[junit4:junit4]   2> 11814 T2061 oasc.RequestHandlers.initHandlersFromConfig created /debug/dump: solr.DumpRequestHandler
[junit4:junit4]   2> 11824 T2061 oashl.XMLLoader.init xsltCacheLifetimeSeconds=60
[junit4:junit4]   2> 11833 T2061 oasc.SolrCore.initDeprecatedSupport WARNING solrconfig.xml uses deprecated <admin/gettableFiles>, Please update your config to use the ShowFileRequestHandler.
[junit4:junit4]   2> 11837 T2061 oasc.SolrCore.initDeprecatedSupport WARNING adding ShowFileRequestHandler with hidden files: [SCHEMA.XML, OLD_SYNONYMS.TXT, STOPWORDS.TXT, PROTWORDS.TXT, OPEN-EXCHANGE-RATES.JSON, SYNONYMS.TXT, CURRENCY.XML, MAPPING-ISOLATIN1ACCENT.TXT]
[junit4:junit4]   2> 11841 T2061 oasc.CachingDirectoryFactory.close Releasing directory:/Users/jenkins/jenkins-slave/workspace/Lucene-Solr-trunk-MacOSX/solr/build/solr-core/test/J0/./org.apache.solr.cloud.BasicDistributedZkTest-1357084785145/jetty3
[junit4:junit4]   2> 11842 T2061 oass.SolrIndexSearcher.<init> Opening Searcher@12b50622 main
[junit4:junit4]   2> 11844 T2061 oasu.CommitTracker.<init> Hard AutoCommit: disabled
[junit4:junit4]   2> 11844 T2061 oasu.CommitTracker.<init> Soft AutoCommit: disabled
[junit4:junit4]   2> 11845 T2061 oashc.SpellCheckComponent.inform Initializing spell checkers
[junit4:junit4]   2> 11855 T2061 oass.DirectSolrSpellChecker.init init: {name=direct,classname=DirectSolrSpellChecker,field=lowerfilt,minQueryLength=3}
[junit4:junit4]   2> 11904 T2062 oasc.SolrCore.registerSearcher [collection1] Registered new searcher Searcher@12b50622 main{StandardDirectoryReader(segments_1:1)}
[junit4:junit4]   2> 11913 T2061 oasc.ZkController.publish publishing core=collection1 state=down
[junit4:junit4]   2> 11918 T2061 oasc.ZkController.publish numShards not found on descriptor - reading it from system property
[junit4:junit4]   2> 13028 T2012 oascc.ZkStateReader.updateClusterState Updating cloud state from ZooKeeper... 
[junit4:junit4]   2> 13030 T2012 oasc.Overseer$ClusterStateUpdater.updateState Update state numShards=2 message={
[junit4:junit4]   2> 	  "operation":"state",
[junit4:junit4]   2> 	  "numShards":"2",
[junit4:junit4]   2> 	  "shard":null,
[junit4:junit4]   2> 	  "roles":null,
[junit4:junit4]   2> 	  "state":"down",
[junit4:junit4]   2> 	  "core":"collection1",
[junit4:junit4]   2> 	  "collection":"collection1",
[junit4:junit4]   2> 	  "node_name":"127.0.0.1:49852_",
[junit4:junit4]   2> 	  "base_url":"http://127.0.0.1:49852"}
[junit4:junit4]   2> 13030 T2012 oasc.Overseer$ClusterStateUpdater.updateState Collection already exists with numShards=2
[junit4:junit4]   2> 13030 T2012 oasc.Overseer$ClusterStateUpdater.updateState Assigning new node to shard shard=shard1
[junit4:junit4]   2> 13038 T2045 oascc.ZkStateReader$2.process A cluster state change: WatchedEvent state:SyncConnected type:NodeDataChanged path:/clusterstate.json, has occurred - updating... (live nodes size: 4)
[junit4:junit4]   2> 13040 T2030 oascc.ZkStateReader$2.process A cluster state change: WatchedEvent state:SyncConnected type:NodeDataChanged path:/clusterstate.json, has occurred - updating... (live nodes size: 4)
[junit4:junit4]   2> 13040 T2011 oascc.ZkStateReader$2.process A cluster state change: WatchedEvent state:SyncConnected type:NodeDataChanged path:/clusterstate.json, has occurred - updating... (live nodes size: 4)
[junit4:junit4]   2> 13038 T2060 oascc.ZkStateReader$2.process A cluster state change: WatchedEvent state:SyncConnected type:NodeDataChanged path:/clusterstate.json, has occurred - updating... (live nodes size: 4)
[junit4:junit4]   2> 13038 T2017 oascc.ZkStateReader$2.process A cluster state change: WatchedEvent state:SyncConnected type:NodeDataChanged path:/clusterstate.json, has occurred - updating... (live nodes size: 4)
[junit4:junit4]   2> 13933 T2061 oasc.CoreContainer.registerCore registering core: collection1
[junit4:junit4]   2> 13933 T2061 oasc.ZkController.register Register replica - core:collection1 address:http://127.0.0.1:49852 collection:collection1 shard:shard1
[junit4:junit4]   2> 13937 T2061 oasc.ZkController.register We are http://127.0.0.1:49852/collection1/ and leader is http://127.0.0.1:49846/collection1/
[junit4:junit4]   2> 13938 T2061 oasc.ZkController.register No LogReplay needed for core=collection1 baseURL=http://127.0.0.1:49852
[junit4:junit4]   2> 13939 T2061 oasc.ZkController.checkRecovery Core needs to recover:collection1
[junit4:junit4]   2> 13939 T2061 oasu.DefaultSolrCoreState.doRecovery Running recovery - first canceling any ongoing recovery
[junit4:junit4]   2> ASYNC  NEW_CORE C149 name=collection1 org.apache.solr.core.SolrCore@1df60e59 url=http://127.0.0.1:49852/collection1 node=127.0.0.1:49852_ C149_STATE=coll:collection1 core:collection1 props:{shard=null, roles=null, state=down, core=collection1, collection=collection1, node_name=127.0.0.1:49852_, base_url=http://127.0.0.1:49852}
[junit4:junit4]   2> 13943 T2063 C149 P49852 oasc.RecoveryStrategy.run Starting recovery process.  core=collection1 recoveringAfterStartup=true
[junit4:junit4]   2> 13943 T2063 C149 P49852 oasc.RecoveryStrategy.doRecovery ###### startupVersions=[]
[junit4:junit4]   2> 13944 T2063 C149 P49852 oasc.ZkController.publish publishing core=collection1 state=recovering
[junit4:junit4]   2> 13941 T2061 oascc.ZkStateReader.updateClusterState Updating cloud state from ZooKeeper... 
[junit4:junit4]   2> 13944 T2063 C149 P49852 oasc.ZkController.publish numShards not found on descriptor - reading it from system property
[junit4:junit4]   2> 13944 T1989 oass.SolrDispatchFilter.init user.dir=/Users/jenkins/jenkins-slave/workspace/Lucene-Solr-trunk-MacOSX/solr/build/solr-core/test/J0
[junit4:junit4]   2> 13945 T2063 C149 P49852 oascsi.HttpClientUtil.createClient Creating new http client, config:maxConnections=128&maxConnectionsPerHost=32&followRedirects=false
[junit4:junit4]   2> 13947 T1989 oass.SolrDispatchFilter.init SolrDispatchFilter.init() done
[junit4:junit4]   2> 13948 T1989 oascsi.HttpClientUtil.createClient Creating new http client, config:maxConnections=128&maxConnectionsPerHost=32&followRedirects=false
[junit4:junit4]   2> 14285 T1989 oejs.Server.doStart jetty-8.1.8.v20121106
[junit4:junit4]   2> 14299 T1989 oejs.AbstractConnector.doStart Started SelectChannelConnector@127.0.0.1:49856
[junit4:junit4]   2> 14301 T1989 oasc.SolrResourceLoader.locateSolrHome JNDI not configured for solr (NoInitialContextEx)
[junit4:junit4]   2> 14301 T1989 oasc.SolrResourceLoader.locateSolrHome using system property solr.solr.home: /Users/jenkins/jenkins-slave/workspace/Lucene-Solr-trunk-MacOSX/solr/build/solr-core/test/J0/./org.apache.solr.cloud.BasicDistributedZkTest-jetty4-1357084799094
[junit4:junit4]   2> 14302 T1989 oasc.SolrResourceLoader.<init> new SolrResourceLoader for deduced Solr Home: '/Users/jenkins/jenkins-slave/workspace/Lucene-Solr-trunk-MacOSX/solr/build/solr-core/test/J0/./org.apache.solr.cloud.BasicDistributedZkTest-jetty4-1357084799094/'
[junit4:junit4]   2> 14346 T1989 oass.SolrDispatchFilter.init SolrDispatchFilter.init()
[junit4:junit4]   2> 14347 T1989 oasc.SolrResourceLoader.locateSolrHome JNDI not configured for solr (NoInitialContextEx)
[junit4:junit4]   2> 14347 T1989 oasc.SolrResourceLoader.locateSolrHome using system property solr.solr.home: /Users/jenkins/jenkins-slave/workspace/Lucene-Solr-trunk-MacOSX/solr/build/solr-core/test/J0/./org.apache.solr.cloud.BasicDistributedZkTest-jetty4-1357084799094
[junit4:junit4]   2> 14348 T1989 oasc.CoreContainer$Initializer.initialize looking for solr.xml: /Users/jenkins/jenkins-slave/workspace/Lucene-Solr-trunk-MacOSX/solr/build/solr-core/test/J0/./org.apache.solr.cloud.BasicDistributedZkTest-jetty4-1357084799094/solr.xml
[junit4:junit4]   2> 14348 T1989 oasc.CoreContainer.<init> New CoreContainer 1121292765
[junit4:junit4]   2> 14349 T1989 oasc.CoreContainer.load Loading CoreContainer using Solr Home: '/Users/jenkins/jenkins-slave/workspace/Lucene-Solr-trunk-MacOSX/solr/build/solr-core/test/J0/./org.apache.solr.cloud.BasicDistributedZkTest-jetty4-1357084799094/'
[junit4:junit4]   2> 14350 T1989 oasc.SolrResourceLoader.<init> new SolrResourceLoader for directory: '/Users/jenkins/jenkins-slave/workspace/Lucene-Solr-trunk-MacOSX/solr/build/solr-core/test/J0/./org.apache.solr.cloud.BasicDistributedZkTest-jetty4-1357084799094/'
[junit4:junit4]   2> 14382 T1989 oashc.HttpShardHandlerFactory.getParameter Setting socketTimeout to: 30000
[junit4:junit4]   2> 14383 T1989 oashc.HttpShardHandlerFactory.getParameter Setting urlScheme to: http://
[junit4:junit4]   2> 14387 T1989 oashc.HttpShardHandlerFactory.getParameter Setting connTimeout to: 15000
[junit4:junit4]   2> 14386 T1989 oashc.HttpShardHandlerFactory.getParameter Setting maxConnectionsPerHost to: 20
[junit4:junit4]   2> 14386 T1989 oashc.HttpShardHandlerFactory.getParameter Setting corePoolSize to: 0
[junit4:junit4]   2> 14387 T1989 oashc.HttpShardHandlerFactory.getParameter Setting maximumPoolSize to: 2147483647
[junit4:junit4]   2> 14388 T1989 oashc.HttpShardHandlerFactory.getParameter Setting maxThreadIdleTime to: 5
[junit4:junit4]   2> 14388 T1989 oashc.HttpShardHandlerFactory.getParameter Setting sizeOfQueue to: -1
[junit4:junit4]   2> 14389 T1989 oashc.HttpShardHandlerFactory.getParameter Setting fairnessPolicy to: false
[junit4:junit4]   2> 14389 T1989 oascsi.HttpClientUtil.createClient Creating new http client, config:maxConnectionsPerHost=20&maxConnections=10000&socketTimeout=30000&connTimeout=15000&retry=false
[junit4:junit4]   2> 14408 T1989 oasc.CoreContainer.load Registering Log Listener
[junit4:junit4]   2> 14438 T1989 oasc.CoreContainer.initZooKeeper Zookeeper client=127.0.0.1:49839/solr
[junit4:junit4]   2> 14439 T1989 oasc.ZkController.checkChrootPath zkHost includes chroot
[junit4:junit4]   2> 14440 T1989 oaz.ZooKeeper.<init> Initiating client connection, connectString=127.0.0.1:49839 sessionTimeout=60000 watcher=org.apache.solr.common.cloud.ConnectionManager@4047831d
[junit4:junit4]   2> 14443 T1989 oascc.ConnectionManager.waitForConnected Waiting for client to connect to ZooKeeper
[junit4:junit4]   2> 14443 T2073 oaz.ClientCnxn$SendThread.logStartConnect Opening socket connection to server localhost/127.0.0.1:49839. Will not attempt to authenticate using SASL (access denied ("javax.security.auth.AuthPermission" "getLoginConfiguration"))
[junit4:junit4]   2> 14447 T2073 oaz.ClientCnxn$SendThread.primeConnection Socket connection established to localhost/127.0.0.1:49839, initiating session
[junit4:junit4]   2> 14451 T1991 oazs.NIOServerCnxnFactory.run Accepted socket connection from /127.0.0.1:49857
[junit4:junit4]   2> 14449 T1991 oazs.ZooKeeperServer.processConnectRequest Client attempting to establish new session at /127.0.0.1:49857
[junit4:junit4]   2> 14453 T1993 oazs.ZooKeeperServer.finishSessionInit Established session 0x13bf88e7a00000b with negotiated timeout 20000 for client /127.0.0.1:49857
[junit4:junit4]   2> 14451 T2073 oaz.ClientCnxn$SendThread.onConnected Session establishment complete on server localhost/127.0.0.1:49839, sessionid = 0x13bf88e7a00000b, negotiated timeout = 20000
[junit4:junit4]   2> 14454 T2074 oascc.ConnectionManager.process Watcher org.apache.solr.common.cloud.ConnectionManager@4047831d name:ZooKeeperConnection Watcher:127.0.0.1:49839 got event WatchedEvent state:SyncConnected type:None path:null path:null type:None
[junit4:junit4]   2> 14452 T1989 oascc.ConnectionManager.waitForConnected Client is connected to ZooKeeper
[junit4:junit4]   2> 14455 T1994 oazs.PrepRequestProcessor.pRequest2Txn Processed session termination for sessionid: 0x13bf88e7a00000b
[junit4:junit4]   2> 14457 T1991 oazs.NIOServerCnxn.closeSock Closed socket connection for client /127.0.0.1:49857 which had sessionid 0x13bf88e7a00000b
[junit4:junit4]   2> 14457 T2074 oaz.ClientCnxn$EventThread.run EventThread shut down
[junit4:junit4]   2> 14459 T1989 oaz.ZooKeeper.close Session: 0x13bf88e7a00000b closed
[junit4:junit4]   2> 14458 T1989 oascsi.HttpClientUtil.createClient Creating new http client, config:maxConnections=500&maxConnectionsPerHost=16&socketTimeout=15000&connTimeout=30000
[junit4:junit4]   2> 14466 T1989 oaz.ZooKeeper.<init> Initiating client connection, connectString=127.0.0.1:49839/solr sessionTimeout=30000 watcher=org.apache.solr.common.cloud.ConnectionManager@37e897cf
[junit4:junit4]   2> 14467 T1989 oascc.ConnectionManager.waitForConnected Waiting for client to connect to ZooKeeper
[junit4:junit4]   2> 14468 T2075 oaz.ClientCnxn$SendThread.logStartConnect Opening socket connection to server localhost/127.0.0.1:49839. Will not attempt to authenticate using SASL (access denied ("javax.security.auth.AuthPermission" "getLoginConfiguration"))
[junit4:junit4]   2> 14472 T2075 oaz.ClientCnxn$SendThread.primeConnection Socket connection established to localhost/127.0.0.1:49839, initiating session
[junit4:junit4]   2> 14473 T1991 oazs.NIOServerCnxnFactory.run Accepted socket connection from /127.0.0.1:49858
[junit4:junit4]   2> 14474 T1991 oazs.ZooKeeperServer.processConnectRequest Client attempting to establish new session at /127.0.0.1:49858
[junit4:junit4]   2> 14475 T1993 oazs.ZooKeeperServer.finishSessionInit Established session 0x13bf88e7a00000c with negotiated timeout 20000 for client /127.0.0.1:49858
[junit4:junit4]   2> 14473 T2075 oaz.ClientCnxn$SendThread.onConnected Session establishment complete on server localhost/127.0.0.1:49839, sessionid = 0x13bf88e7a00000c, negotiated timeout = 20000
[junit4:junit4]   2> 14476 T2076 oascc.ConnectionManager.process Watcher org.apache.solr.common.cloud.ConnectionManager@37e897cf name:ZooKeeperConnection Watcher:127.0.0.1:49839/solr got event WatchedEvent state:SyncConnected type:None path:null path:null type:None
[junit4:junit4]   2> 14474 T1989 oascc.ConnectionManager.waitForConnected Client is connected to ZooKeeper
[junit4:junit4]   2> 14476 T1994 oazs.PrepRequestProcessor.pRequest Got user-level KeeperException when processing sessionid:0x13bf88e7a00000c type:create cxid:0x1 zxid:0xa0 txntype:-1 reqpath:n/a Error Path:/solr/overseer Error:KeeperErrorCode = NodeExists for /solr/overseer
[junit4:junit4]   2> 14484 T1994 oazs.PrepRequestProcessor.pRequest Got user-level KeeperException when processing sessionid:0x13bf88e7a00000c type:create cxid:0x2 zxid:0xa1 txntype:-1 reqpath:n/a Error Path:/solr/overseer Error:KeeperErrorCode = NodeExists for /solr/overseer
[junit4:junit4]   2> 14486 T1989 oasc.ZkController.createEphemeralLiveNode Register node as live in ZooKeeper:/live_nodes/127.0.0.1:49856_
[junit4:junit4]   2> 14488 T1994 oazs.PrepRequestProcessor.pRequest Got user-level KeeperException when processing sessionid:0x13bf88e7a00000c type:delete cxid:0x4 zxid:0xa2 txntype:-1 reqpath:n/a Error Path:/solr/live_nodes/127.0.0.1:49856_ Error:KeeperErrorCode = NoNode for /solr/live_nodes/127.0.0.1:49856_
[junit4:junit4]   2> 14490 T1989 oascc.SolrZkClient.makePath makePath: /live_nodes/127.0.0.1:49856_
[junit4:junit4]   2> 14498 T2011 oascc.ZkStateReader$2.process A cluster state change: WatchedEvent state:SyncConnected type:NodeChildrenChanged path:/live_nodes, has occurred - updating... (live nodes size: 4)
[junit4:junit4]   2> 14501 T2017 oascc.ZkStateReader$2.process A cluster state change: WatchedEvent state:SyncConnected type:NodeChildrenChanged path:/live_nodes, has occurred - updating... (live nodes size: 4)
[junit4:junit4]   2> 14500 T2045 oascc.ZkStateReader$3.process Updating live nodes... (5)
[junit4:junit4]   2> 14500 T2045 oascc.ZkStateReader$2.process A cluster state change: WatchedEvent state:SyncConnected type:NodeChildrenChanged path:/live_nodes, has occurred - updating... (live nodes size: 5)
[junit4:junit4]   2> 14503 T2030 oascc.ZkStateReader$3.process Updating live nodes... (5)
[junit4:junit4]   2> 14504 T2030 oascc.ZkStateReader$2.process A cluster state change: WatchedEvent state:SyncConnected type:NodeChildrenChanged path:/live_nodes, has occurred - updating... (live nodes size: 5)
[junit4:junit4]   2> 14503 T2060 oascc.ZkStateReader$3.process Updating live nodes... (5)
[junit4:junit4]   2> 14504 T2060 oascc.ZkStateReader$2.process A cluster state change: WatchedEvent state:SyncConnected type:NodeChildrenChanged path:/live_nodes, has occurred - updating... (live nodes size: 5)
[junit4:junit4]   2> 14507 T2017 oascc.ZkStateReader$3.process Updating live nodes... (5)
[junit4:junit4]   2> 14506 T2011 oascc.ZkStateReader$3.process Updating live nodes... (5)
[junit4:junit4]   2> 14514 T1989 oascc.ZkStateReader.createClusterStateWatchersAndUpdate Updating cluster state from ZooKeeper... 
[junit4:junit4]   2> 14531 T2077 oasc.CoreContainer.create Creating SolrCore 'collection1' using instanceDir: /Users/jenkins/jenkins-slave/workspace/Lucene-Solr-trunk-MacOSX/solr/build/solr-core/test/J0/./org.apache.solr.cloud.BasicDistributedZkTest-jetty4-1357084799094/collection1
[junit4:junit4]   2> 14531 T2077 oasc.ZkController.createCollectionZkNode Check for collection zkNode:collection1
[junit4:junit4]   2> 14530 T2077 oasc.ZkController.createCollectionZkNode Collection zkNode exists
[junit4:junit4]   2> 14531 T2077 oasc.ZkController.readConfigName Load collection config from:/collections/collection1
[junit4:junit4]   2> 14534 T2077 oasc.SolrResourceLoader.<init> new SolrResourceLoader for directory: '/Users/jenkins/jenkins-slave/workspace/Lucene-Solr-trunk-MacOSX/solr/build/solr-core/test/J0/./org.apache.solr.cloud.BasicDistributedZkTest-jetty4-1357084799094/collection1/'
[junit4:junit4]   2> 14535 T2077 oasc.SolrResourceLoader.replaceClassLoader Adding 'file:/Users/jenkins/jenkins-slave/workspace/Lucene-Solr-trunk-MacOSX/solr/build/solr-core/test/J0/org.apache.solr.cloud.BasicDistributedZkTest-jetty4-1357084799094/collection1/lib/classes/' to classloader
[junit4:junit4]   2> 14536 T2077 oasc.SolrResourceLoader.replaceClassLoader Adding 'file:/Users/jenkins/jenkins-slave/workspace/Lucene-Solr-trunk-MacOSX/solr/build/solr-core/test/J0/org.apache.solr.cloud.BasicDistributedZkTest-jetty4-1357084799094/collection1/lib/README' to classloader
[junit4:junit4]   2> 14555 T2012 oascc.ZkStateReader.updateClusterState Updating cloud state from ZooKeeper... 
[junit4:junit4]   2> 14558 T2012 oasc.Overseer$ClusterStateUpdater.updateState Update state numShards=2 message={
[junit4:junit4]   2> 	  "operation":"state",
[junit4:junit4]   2> 	  "numShards":"2",
[junit4:junit4]   2> 	  "shard":"shard1",
[junit4:junit4]   2> 	  "roles":null,
[junit4:junit4]   2> 	  "state":"recovering",
[junit4:junit4]   2> 	  "core":"collection1",
[junit4:junit4]   2> 	  "collection":"collection1",
[junit4:junit4]   2> 	  "node_name":"127.0.0.1:49852_",
[junit4:junit4]   2> 	  "base_url":"http://127.0.0.1:49852"}
[junit4:junit4]   2> 14578 T2045 oascc.ZkStateReader$2.process A cluster state change: WatchedEvent state:SyncConnected type:NodeDataChanged path:/clusterstate.json, has occurred - updating... (live nodes size: 5)
[junit4:junit4]   2> 14580 T2030 oascc.ZkStateReader$2.process A cluster state change: WatchedEvent state:SyncConnected type:NodeDataChanged path:/clusterstate.json, has occurred - updating... (live nodes size: 5)
[junit4:junit4]   2> 14578 T2011 oascc.ZkStateReader$2.process A cluster state change: WatchedEvent state:SyncConnected type:NodeDataChanged path:/clusterstate.json, has occurred - updating... (live nodes size: 5)
[junit4:junit4]   2> 14581 T2060 oascc.ZkStateReader$2.process A cluster state change: WatchedEvent state:SyncConnected type:NodeDataChanged path:/clusterstate.json, has occurred - updating... (live nodes size: 5)
[junit4:junit4]   2> 14580 T2076 oascc.ZkStateReader$2.process A cluster state change: WatchedEvent state:SyncConnected type:NodeDataChanged path:/clusterstate.json, has occurred - updating... (live nodes size: 5)
[junit4:junit4]   2> 14581 T2017 oascc.ZkStateReader$2.process A cluster state change: WatchedEvent state:SyncConnected type:NodeDataChanged path:/clusterstate.json, has occurred - updating... (live nodes size: 5)
[junit4:junit4]   2> 14621 T2077 oasc.SolrConfig.<init> Using Lucene MatchVersion: LUCENE_50
[junit4:junit4]   2> 14721 T2077 oasc.SolrConfig.<init> Loaded SolrConfig: solrconfig.xml
[junit4:junit4]   2> 14723 T2077 oass.IndexSchema.readSchema Reading Solr Schema
[junit4:junit4]   2> 14733 T2077 oass.IndexSchema.readSchema Schema name=test
[junit4:junit4]   2> 15516 T2077 oass.OpenExchangeRatesOrgProvider.init Initialized with rates=open-exchange-rates.json, refreshInterval=1440.
[junit4:junit4]   2> 15533 T2077 oass.IndexSchema.readSchema default search field in schema is text
[junit4:junit4]   2> 15540 T2077 oass.IndexSchema.readSchema unique key field: id
[junit4:junit4]   2> 15574 T2077 oass.FileExchangeRateProvider.reload Reloading exchange rates from file currency.xml
[junit4:junit4]   2> 15580 T2077 oass.FileExchangeRateProvider.reload Reloading exchange rates from file currency.xml
[junit4:junit4]   2> 15587 T2077 oass.OpenExchangeRatesOrgProvider.reload Reloading exchange rates from open-exchange-rates.json
[junit4:junit4]   2> 15587 T2077 oass.OpenExchangeRatesOrgProvider.reload Reloading exchange rates from open-exchange-rates.json
[junit4:junit4]   2> 15592 T2077 oasc.SolrCore.<init> [collection1] Opening new SolrCore at /Users/jenkins/jenkins-slave/workspace/Lucene-Solr-trunk-MacOSX/solr/build/solr-core/test/J0/./org.apache.solr.cloud.BasicDistributedZkTest-jetty4-1357084799094/collection1/, dataDir=./org.apache.solr.cloud.BasicDistributedZkTest-1357084785145/jetty4/
[junit4:junit4]   2> 15593 T2077 oasc.JmxMonitoredMap.<init> JMX monitoring is enabled. Adding Solr mbeans to JMX Server: com.sun.jmx.mbeanserver.JmxMBeanServer@52cf357a
[junit4:junit4]   2> 15593 T2077 oasc.SolrCore.initDirectoryFactory solr.NRTCachingDirectoryFactory
[junit4:junit4]   2> 15594 T2077 oasc.CachingDirectoryFactory.get return new directory for /Users/jenkins/jenkins-slave/workspace/Lucene-Solr-trunk-MacOSX/solr/build/solr-core/test/J0/./org.apache.solr.cloud.BasicDistributedZkTest-1357084785145/jetty4 forceNew:false
[junit4:junit4]   2> 15595 T2077 oasc.CachingDirectoryFactory.close Releasing directory:/Users/jenkins/jenkins-slave/workspace/Lucene-Solr-trunk-MacOSX/solr/build/solr-core/test/J0/./org.apache.solr.cloud.BasicDistributedZkTest-1357084785145/jetty4
[junit4:junit4]   2> 15595 T2077 oasc.SolrCore.getNewIndexDir New index directory detected: old=null new=./org.apache.solr.cloud.BasicDistributedZkTest-1357084785145/jetty4/index/
[junit4:junit4]   2> 15596 T2077 oasc.SolrCore.initIndex WARNING [collection1] Solr index directory './org.apache.solr.cloud.BasicDistributedZkTest-1357084785145/jetty4/index' doesn't exist. Creating new index...
[junit4:junit4]   2> 15597 T2077 oasc.CachingDirectoryFactory.get return new directory for /Users/jenkins/jenkins-slave/workspace/Lucene-Solr-trunk-MacOSX/solr/build/solr-core/test/J0/./org.apache.solr.cloud.BasicDistributedZkTest-1357084785145/jetty4/index forceNew:false
[junit4:junit4]   2> 15601 T2077 oasc.SolrDeletionPolicy.onCommit SolrDeletionPolicy.onCommit: commits:num=1
[junit4:junit4]   2> 		commit{dir=RateLimitedDirectoryWrapper(NRTCachingDirectory(org.apache.lucene.store.NIOFSDirectory@/Users/jenkins/jenkins-slave/workspace/Lucene-Solr-trunk-MacOSX/solr/build/solr-core/test/J0/org.apache.solr.cloud.BasicDistributedZkTest-1357084785145/jetty4/index lockFactory=org.apache.lucene.store.NativeFSLockFactory@62f2a22c; maxCacheMB=48.0 maxMergeSizeMB=4.0)),segFN=segments_1,generation=1,filenames=[segments_1]
[junit4:junit4]   2> 15602 T2077 oasc.SolrDeletionPolicy.updateCommits newest commit = 1[segments_1]
[junit4:junit4]   2> 15603 T2077 oasc.CachingDirectoryFactory.close Releasing directory:/Users/jenkins/jenkins-slave/workspace/Lucene-Solr-trunk-MacOSX/solr/build/solr-core/test/J0/./org.apache.solr.cloud.BasicDistributedZkTest-1357084785145/jetty4/index
[junit4:junit4]   2> 15603 T2077 oasc.SolrCore.initWriters created xml: solr.XMLResponseWriter
[junit4:junit4]   2> 15605 T2077 oasup.UpdateRequestProcessorChain.init inserting DistributedUpdateProcessorFactory into updateRequestProcessorChain "dedupe"
[junit4:junit4]   2> 15606 T2077 oasup.UpdateRequestProcessorChain.init inserting DistributedUpdateProcessorFactory into updateRequestProcessorChain "dedupe-allfields"
[junit4:junit4]   2> 15607 T2077 oasup.UpdateRequestProcessorChain.init inserting DistributedUpdateProcessorFactory into updateRequestProcessorChain "stored_sig"
[junit4:junit4]   2> 15607 T2077 oasup.UpdateRequestProcessorChain.init inserting DistributedUpdateProcessorFactory into updateRequestProcessorChain "uniq-fields"
[junit4:junit4]   2> 15608 T2077 oasup.UpdateRequestProcessorChain.init inserting DistributedUpdateProcessorFactory into updateRequestProcessorChain "distrib-dup-test-chain-implicit"
[junit4:junit4]   2> 15608 T2077 oasc.RequestHandlers.initHandlersFromConfig adding lazy requestHandler: solr.ReplicationHandler
[junit4:junit4]   2> 15609 T2077 oasc.RequestHandlers.initHandlersFromConfig created /replication: solr.ReplicationHandler
[junit4:junit4]   2> 15609 T2077 oasc.RequestHandlers.initHandlersFromConfig created standard: solr.StandardRequestHandler
[junit4:junit4]   2> 15610 T2077 oasc.RequestHandlers.initHandlersFromConfig created /get: solr.RealTimeGetHandler
[junit4:junit4]   2> 15610 T2077 oasc.RequestHandlers.initHandlersFromConfig created dismax: solr.SearchHandler
[junit4:junit4]   2> 15610 T2077 oasc.RequestHandlers.initHandlersFromConfig created mock: org.apache.solr.core.MockQuerySenderListenerReqHandler
[junit4:junit4]   2> 15611 T2077 oasc.RequestHandlers.initHandlersFromConfig created /admin/: org.apache.solr.handler.admin.AdminHandlers
[junit4:junit4]   2> 15611 T2077 oasc.RequestHandlers.initHandlersFromConfig created defaults: solr.StandardRequestHandler
[junit4:junit4]   2> 15611 T2077 oasc.RequestHandlers.initHandlersFromConfig adding lazy requestHandler: solr.StandardRequestHandler
[junit4:junit4]   2> 15612 T2077 oasc.RequestHandlers.initHandlersFromConfig created lazy: solr.StandardRequestHandler
[junit4:junit4]   2> 15612 T2077 oasc.RequestHandlers.initHandlersFromConfig created /update: solr.UpdateRequestHandler
[junit4:junit4]   2> 15612 T2077 oasc.RequestHandlers.initHandlersFromConfig created /terms: org.apache.solr.handler.component.SearchHandler
[junit4:junit4]   2> 15613 T2077 oasc.RequestHandlers.initHandlersFromConfig created spellCheckCompRH: org.apache.solr.handler.component.SearchHandler
[junit4:junit4]   2> 15613 T2077 oasc.RequestHandlers.initHandlersFromConfig created spellCheckCompRH_Direct: org.apache.solr.handler.component.SearchHandler
[junit4:junit4]   2> 15613 T2077 oasc.RequestHandlers.initHandlersFromConfig created spellCheckWithWordbreak: org.apache.solr.handler.component.SearchHandler
[junit4:junit4]   2> 15614 T2077 oasc.RequestHandlers.initHandlersFromConfig created spellCheckWithWordbreak_Direct: org.apache.solr.handler.component.SearchHandler
[junit4:junit4]   2> 15614 T2077 oasc.RequestHandlers.initHandlersFromConfig created spellCheckCompRH1: org.apache.solr.handler.component.SearchHandler
[junit4:junit4]   2> 15614 T2077 oasc.RequestHandlers.initHandlersFromConfig created mltrh: org.apache.solr.handler.component.SearchHandler
[junit4:junit4]   2> 15615 T2077 oasc.RequestHandlers.initHandlersFromConfig created tvrh: org.apache.solr.handler.component.SearchHandler
[junit4:junit4]   2> 15615 T2077 oasc.RequestHandlers.initHandlersFromConfig created /mlt: solr.MoreLikeThisHandler
[junit4:junit4]   2> 15616 T2077 oasc.RequestHandlers.initHandlersFromConfig created /debug/dump: solr.DumpRequestHandler
[junit4:junit4]   2> 15622 T2077 oashl.XMLLoader.init xsltCacheLifetimeSeconds=60
[junit4:junit4]   2> 15627 T2077 oasc.SolrCore.initDeprecatedSupport WARNING solrconfig.xml uses deprecated <admin/gettableFiles>, Please update your config to use the ShowFileRequestHandler.
[junit4:junit4]   2> 15629 T2077 oasc.SolrCore.initDeprecatedSupport WARNING adding ShowFileRequestHandler with hidden files: [SCHEMA.XML, OLD_SYNONYMS.TXT, STOPWORDS.TXT, PROTWORDS.TXT, OPEN-EXCHANGE-RATES.JSON, SYNONYMS.TXT, CURRENCY.XML, MAPPING-ISOLATIN1ACCENT.TXT]
[junit4:junit4]   2> 15633 T2077 oasc.CachingDirectoryFactory.close Releasing directory:/Users/jenkins/jenkins-slave/workspace/Lucene-Solr-trunk-MacOSX/solr/build/solr-core/test/J0/./org.apache.solr.cloud.BasicDistributedZkTest-1357084785145/jetty4
[junit4:junit4]   2> 15634 T2077 oass.SolrIndexSearcher.<init> Opening Searcher@58177bcc main
[junit4:junit4]   2> 15636 T2077 oasu.CommitTracker.<init> Hard AutoCommit: disabled
[junit4:junit4]   2> 15636 T2077 oasu.CommitTracker.<init> Soft AutoCommit: disabled
[junit4:junit4]   2> 15636 T2077 oashc.SpellCheckComponent.inform Initializing spell checkers
[junit4:junit4]   2> 15642 T2077 oass.DirectSolrSpellChecker.init init: {name=direct,classname=DirectSolrSpellChecker,field=lowerfilt,minQueryLength=3}
[junit4:junit4]   2> 15682 T2078 oasc.SolrCore.registerSearcher [collection1] Registered new searcher Searcher@58177bcc main{StandardDirectoryReader(segments_1:1)}
[junit4:junit4]   2> 15694 T2077 oasc.ZkController.publish publishing core=collection1 state=down
[junit4:junit4]   2> 15695 T2077 oasc.ZkController.publish numShards not found on descriptor - reading it from system property
[junit4:junit4]   2> 16099 T2012 oascc.ZkStateReader.updateClusterState Updating cloud state from ZooKeeper... 
[junit4:junit4]   2> 16098 T2012 oasc.Overseer$ClusterStateUpdater.updateState Update state numShards=2 message={
[junit4:junit4]   2> 	  "operation":"state",
[junit4:junit4]   2> 	  "numShards":"2",
[junit4:junit4]   2> 	  "shard":null,
[junit4:junit4]   2> 	  "roles":null,
[junit4:junit4]   2> 	  "state":"down",
[junit4:junit4]   2> 	  "core":"collection1",
[junit4:junit4]   2> 	  "collection":"collection1",
[junit4:junit4]   2> 	  "node_name":"127.0.0.1:49856_",
[junit4:junit4]   2> 	  "base_url":"http://127.0.0.1:49856"}
[junit4:junit4]   2> 16098 T2012 oasc.Overseer$ClusterStateUpdater.updateState Collection already exists with numShards=2
[junit4:junit4]   2> 16098 T2012 oasc.Overseer$ClusterStateUpdater.updateState Assigning new node to shard shard=shard2
[junit4:junit4]   2> 16106 T2030 oascc.ZkStateReader$2.process A cluster state change: WatchedEvent state:SyncConnected type:NodeDataChanged path:/clusterstate.json, has occurred - updating... (live nodes size: 5)
[junit4:junit4]   2> 16107 T2060 oascc.ZkStateReader$2.process A cluster state change: WatchedEvent state:SyncConnected type:NodeDataChanged path:/clusterstate.json, has occurred - updating... (live nodes size: 5)
[junit4:junit4]   2> 16110 T2076 oascc.ZkStateReader$2.process A cluster state change: WatchedEvent state:SyncConnected type:NodeDataChanged path:/clusterstate.json, has occurred - updating... (live nodes size: 5)
[junit4:junit4]   2> 16110 T2045 oascc.ZkStateReader$2.process A cluster state change: WatchedEvent state:SyncConnected type:NodeDataChanged path:/clusterstate.json, has occurred - updating... (live nodes size: 5)
[junit4:junit4]   2> 16107 T2011 oascc.ZkStateReader$2.process A cluster state change: WatchedEvent state:SyncConnected type:NodeDataChanged path:/clusterstate.json, has occurred - updating... (live nodes size: 5)
[junit4:junit4]   2> 16111 T2017 oascc.ZkStateReader$2.process A cluster state change: WatchedEvent state:SyncConnected type:NodeDataChanged path:/clusterstate.json, has occurred - updating... (live nodes size: 5)
[junit4:junit4]   2> 16704 T2077 oasc.CoreContainer.registerCore registering core: collection1
[junit4:junit4]   2> 16705 T2077 oasc.ZkController.register Register replica - core:collection1 address:http://127.0.0.1:49856 collection:collection1 shard:shard2
[junit4:junit4]   2> 16716 T2077 oasc.ZkController.register We are http://127.0.0.1:49856/collection1/ and leader is http://127.0.0.1:49849/collection1/
[junit4:junit4]   2> 16716 T2077 oasc.ZkController.register No LogReplay needed for core=collection1 baseURL=http://127.0.0.1:49856
[junit4:junit4]   2> 16717 T2077 oasc.ZkController.checkRecovery Core needs to recover:collection1
[junit4:junit4]   2> 16717 T2077 oasu.DefaultSolrCoreState.doRecovery Running recovery - first canceling any ongoing recovery
[junit4:junit4]   2> ASYNC  NEW_CORE C150 name=collection1 org.apache.solr.core.SolrCore@3ae4353c url=http://127.0.0.1:49856/collection1 node=127.0.0.1:49856_ C150_STATE=coll:collection1 core:collection1 props:{shard=null, roles=null, state=down, core=collection1, collection=collection1, node_name=127.0.0.1:49856_, base_url=http://127.0.0.1:49856}
[junit4:junit4]   2> 16718 T2079 C150 P49856 oasc.RecoveryStrategy.run Starting recovery process.  core=collection1 recoveringAfterStartup=true
[junit4:junit4]   2> 16720 T2079 C150 P49856 oasc.RecoveryStrategy.doRecovery ###### startupVersions=[]
[junit4:junit4]   2> 16722 T2077 oascc.ZkStateReader.updateClusterState Updating cloud state from ZooKeeper... 
[junit4:junit4]   2> 16720 T2079 C150 P49856 oasc.ZkController.publish publishing core=collection1 state=recovering
[junit4:junit4]   2> 16725 T2079 C150 P49856 oasc.ZkController.publish numShards not found on descriptor - reading it from system property
[junit4:junit4]   2> 16723 T1989 oass.SolrDispatchFilter.init user.dir=/Users/jenkins/jenkins-slave/workspace/Lucene-Solr-trunk-MacOSX/solr/build/solr-core/test/J0
[junit4:junit4]   2> 16725 T1989 oass.SolrDispatchFilter.init SolrDispatchFilter.init() done
[junit4:junit4]   2> 16726 T2079 C150 P49856 oascsi.HttpClientUtil.createClient Creating new http client, config:maxConnections=128&maxConnectionsPerHost=32&followRedirects=false
[junit4:junit4]   2> 16729 T1989 oascsi.HttpClientUtil.createClient Creating new http client, config:maxConnections=128&maxConnectionsPerHost=32&followRedirects=false
[junit4:junit4]   2> 16738 T1989 oascc.ZkStateReader.updateClusterState Updating cloud state from ZooKeeper... 
[junit4:junit4]   2> 16742 T1989 oasc.AbstractDistribZkTestBase.waitForRecoveriesToFinish Wait for recoveries to finish - collection: collection1 failOnTimeout:true timeout (sec):230
[junit4:junit4]   2> 16743 T1989 oascc.ZkStateReader.updateClusterState Updating cloud state from ZooKeeper... 
[junit4:junit4]   2>  C149_STATE=coll:collection1 core:collection1 props:{shard=shard1, roles=null, state=recovering, core=collection1, collection=collection1, node_name=127.0.0.1:49852_, base_url=http://127.0.0.1:49852}
[junit4:junit4]   2> 16976 T2063 C149 P49852 oasc.RecoveryStrategy.doRecovery Attempting to PeerSync from http://127.0.0.1:49846/collection1/ core=collection1 - recoveringAfterStartup=true
[junit4:junit4]   2> 16978 T2063 C149 P49852 oasu.PeerSync.sync PeerSync: core=collection1 url=http://127.0.0.1:49852 START replicas=[http://127.0.0.1:49846/collection1/] nUpdates=100
[junit4:junit4]   2> 16980 T2063 C149 P49852 oasu.PeerSync.sync WARNING no frame of reference to tell of we've missed updates
[junit4:junit4]   2> 16985 T2063 C149 P49852 oasc.RecoveryStrategy.doRecovery PeerSync Recovery was not successful - trying replication. core=collection1
[junit4:junit4]   2> 16985 T2063 C149 P49852 oasc.RecoveryStrategy.doRecovery Starting Replication Recovery. core=collection1
[junit4:junit4]   2> 16986 T2063 C149 P49852 oasc.RecoveryStrategy.doRecovery Begin buffering updates. core=collection1
[junit4:junit4]   2> 16986 T2063 C149 P49852 oasu.UpdateLog.bufferUpdates Starting to buffer updates. FSUpdateLog{state=ACTIVE, tlog=null}
[junit4:junit4]   2> 16986 T2063 C149 P49852 oasc.RecoveryStrategy.replicate Attempting to replicate from http://127.0.0.1:49846/collection1/. core=collection1
[junit4:junit4]   2> 16987 T2063 C149 P49852 oascsi.HttpClientUtil.createClient Creating new http client, config:maxConnections=128&maxConnectionsPerHost=32&followRedirects=false
[junit4:junit4]   2> ASYNC  NEW_CORE C151 name=collection1 org.apache.solr.core.SolrCore@5c164881 url=http://127.0.0.1:49846/collection1 node=127.0.0.1:49846_ C151_STATE=coll:collection1 core:collection1 props:{shard=shard1, roles=null, state=active, core=collection1, collection=collection1, node_name=127.0.0.1:49846_, base_url=http://127.0.0.1:49846, leader=true}
[junit4:junit4]   2> 16997 T2025 C151 P49846 oasu.DirectUpdateHandler2.commit start commit{flags=0,_version_=0,optimize=false,openSearcher=false,waitSearcher=true,expungeDeletes=false,softCommit=false}
[junit4:junit4]   2> 16999 T2025 C151 P49846 oasc.CachingDirectoryFactory.close Releasing directory:/Users/jenkins/jenkins-slave/workspace/Lucene-Solr-trunk-MacOSX/solr/build/solr-core/test/J0/./org.apache.solr.cloud.BasicDistributedZkTest-1357084785145/jetty1
[junit4:junit4]   2> 16998 T2022 C151 P49846 REQ /get {distrib=false&qt=/get&wt=javabin&version=2&getVersions=100} status=0 QTime=0 
[junit4:junit4]   2> 17003 T2025 C151 P49846 oasc.SolrDeletionPolicy.onInit SolrDeletionPolicy.onInit: commits:num=1
[junit4:junit4]   2> 		commit{dir=RateLimitedDirectoryWrapper(NRTCachingDirectory(org.apache.lucene.store.NIOFSDirectory@/Users/jenkins/jenkins-slave/workspace/Lucene-Solr-trunk-MacOSX/solr/build/solr-core/test/J0/org.apache.solr.cloud.BasicDistributedZkTest-1357084785145/jetty1/index lockFactory=org.apache.lucene.store.NativeFSLockFactory@169138c3; maxCacheMB=48.0 maxMergeSizeMB=4.0)),segFN=segments_1,generation=1,filenames=[segments_1]
[junit4:junit4]   2> 17004 T2025 C151 P49846 oasc.SolrDeletionPolicy.updateCommits newest commit = 1[segments_1]
[junit4:junit4]   2> 17007 T2025 C151 P49846 oasc.SolrDeletionPolicy.onCommit SolrDeletionPolicy.onCommit: commits:num=2
[junit4:junit4]   2> 		commit{dir=RateLimitedDirectoryWrapper(NRTCachingDirectory(org.apache.lucene.store.NIOFSDirectory@/Users/jenkins/jenkins-slave/workspace/Lucene-Solr-trunk-MacOSX/solr/build/solr-core/test/J0/org.apache.solr.cloud.BasicDistributedZkTest-1357084785145/jetty1/index lockFactory=org.apache.lucene.store.NativeFSLockFactory@169138c3; maxCacheMB=48.0 maxMergeSizeMB=4.0)),segFN=segments_1,generation=1,filenames=[segments_1]
[junit4:junit4]   2> 		commit{dir=RateLimitedDirectoryWrapper(NRTCachingDirectory(org.apache.lucene.store.NIOFSDirectory@/Users/jenkins/jenkins-slave/workspace/Lucene-Solr-trunk-MacOSX/solr/build/solr-core/test/J0/org.apache.solr.cloud.BasicDistributedZkTest-1357084785145/jetty1/index lockFactory=org.apache.lucene.store.NativeFSLockFactory@169138c3; maxCacheMB=48.0 maxMergeSizeMB=4.0)),segFN=segments_2,generation=2,filenames=[segments_2]
[junit4:junit4]   2> 17007 T2025 C151 P49846 oasc.SolrDeletionPolicy.updateCommits newest commit = 2[segments_2]
[junit4:junit4]   2> 17008 T2025 C151 P49846 oasc.CachingDirectoryFactory.close Releasing directory:/Users/jenkins/jenkins-slave/workspace/Lucene-Solr-trunk-MacOSX/solr/build/solr-core/test/J0/./org.apache.solr.cloud.BasicDistributedZkTest-1357084785145/jetty1
[junit4:junit4]   2> 17009 T2025 C151 P49846 oass.SolrIndexSearcher.<init> Opening Searcher@39a49bd1 realtime
[junit4:junit4]   2> 17009 T2025 C151 P49846 oasu.DirectUpdateHandler2.commit end_commit_flush
[junit4:junit4]   2> 17010 T2025 C151 P49846 /update {waitSearcher=true&openSearcher=false&commit=true&commit_end_point=true&wt=javabin&softCommit=false&version=2} {commit=} 0 13
[junit4:junit4]   2> 17011 T2063 C149 P49852 oash.ReplicationHandler.inform Commits will be reserved for  10000
[junit4:junit4]   2> 17012 T2063 C149 P49852 oash.SnapPuller.<init>  No value set for 'pollInterval'. Timer Task not started.
[junit4:junit4]   2> 17014 T2023 C151 P49846 oash.ReplicationHandler.inform Commits will be reserved for  10000
[junit4:junit4]   2> 17015 T2023 C151 P49846 REQ /replication {command=indexversion&wt=javabin&qt=/replication&version=2} status=0 QTime=2 
[junit4:junit4]   2> 17019 T2063 C149 P49852 oash.SnapPuller.fetchLatestIndex Master's generation: 2
[junit4:junit4]   2> 17019 T2063 C149 P49852 oash.SnapPuller.fetchLatestIndex Slave's generation: 1
[junit4:junit4]   2> 17019 T2063 C149 P49852 oash.SnapPuller.fetchLatestIndex Starting replication process
[junit4:junit4]   2> 17022 T2024 C151 P49846 oasc.CachingDirectoryFactory.close Releasing directory:/Users/jenkins/jenkins-slave/workspace/Lucene-Solr-trunk-MacOSX/solr/build/solr-core/test/J0/./org.apache.solr.cloud.BasicDistributedZkTest-1357084785145/jetty1
[junit4:junit4]   2> 17023 T2024 C151 P49846 oasc.CachingDirectoryFactory.close Releasing directory:/Users/jenkins/jenkins-slave/workspace/Lucene-Solr-trunk-MacOSX/solr/build/solr-core/test/J0/./org.apache.solr.cloud.BasicDistributedZkTest-1357084785145/jetty1/index
[junit4:junit4]   2> 17024 T2024 C151 P49846 REQ /replication {command=filelist&generation=2&wt=javabin&qt=/replication&version=2} status=0 QTime=2 
[junit4:junit4]   2> 17028 T2063 C149 P49852 oash.SnapPuller.fetchLatestIndex Number of files in latest index in master: 1
[junit4:junit4]   2> 17029 T2063 C149 P49852 oasc.CachingDirectoryFactory.get return new directory for /Users/jenkins/jenkins-slave/workspace/Lucene-Solr-trunk-MacOSX/solr/build/solr-core/test/J0/./org.apache.solr.cloud.BasicDistributedZkTest-1357084785145/jetty3/index.20130101210002166 forceNew:false
[junit4:junit4]   2> 17030 T2063 C149 P49852 oasc.CachingDirectoryFactory.close Releasing directory:/Users/jenkins/jenkins-slave/workspace/Lucene-Solr-trunk-MacOSX/solr/build/solr-core/test/J0/./org.apache.solr.cloud.BasicDistributedZkTest-1357084785145/jetty3
[junit4:junit4]   2> 17030 T2063 C149 P49852 oash.SnapPuller.fetchLatestIndex Starting download to RateLimitedDirectoryWrapper(NRTCachingDirectory(org.apache.lucene.store.NIOFSDirectory@/Users/jenkins/jenkins-slave/workspace/Lucene-Solr-trunk-MacOSX/solr/build/solr-core/test/J0/org.apache.solr.cloud.BasicDistributedZkTest-1357084785145/jetty3/index.20130101210002166 lockFactory=org.apache.lucene.store.NativeFSLockFactory@6dcd2348; maxCacheMB=48.0 maxMergeSizeMB=4.0)) fullCopy=true
[junit4:junit4]   2> 17045 T2022 C151 P49846 REQ /replication {file=segments_2&command=filecontent&checksum=true&generation=2&qt=/replication&wt=filestream} status=0 QTime=0 
[junit4:junit4]   2> 17046 T2063 C149 P49852 oasc.CachingDirectoryFactory.close Releasing directory:/Users/jenkins/jenkins-slave/workspace/Lucene-Solr-trunk-MacOSX/solr/build/solr-core/test/J0/./org.apache.solr.cloud.BasicDistributedZkTest-1357084785145/jetty3/index
[junit4:junit4]   2> 17046 T2063 C149 P49852 oash.SnapPuller.fetchLatestIndex Total time taken for download : 0 secs
[junit4:junit4]   2> 17047 T2063 C149 P49852 oash.SnapPuller.modifyIndexProps New index installed. Updating index properties... index=index.20130101210002166
[junit4:junit4]   2> 17048 T2063 C149 P49852 oasc.CachingDirectoryFactory.close Releasing directory:/Users/jenkins/jenkins-slave/workspace/Lucene-Solr-trunk-MacOSX/solr/build/solr-core/test/J0/./org.apache.solr.cloud.BasicDistributedZkTest-1357084785145/jetty3
[junit4:junit4]   2> 17049 T2063 C149 P49852 oasc.CachingDirectoryFactory.close Releasing directory:/Users/jenkins/jenkins-slave/workspace/Lucene-Solr-trunk-MacOSX/solr/build/solr-core/test/J0/./org.apache.solr.cloud.BasicDistributedZkTest-1357084785145/jetty3
[junit4:junit4]   2> 17049 T2063 C149 P49852 oasc.SolrCore.getNewIndexDir New index directory detected: old=./org.apache.solr.cloud.BasicDistributedZkTest-1357084785145/jetty3/index/ new=./org.apache.solr.cloud.BasicDistributedZkTest-1357084785145/jetty3/index.20130101210002166
[junit4:junit4]   2> 17051 T2063 C149 P49852 oasc.SolrDeletionPolicy.onInit SolrDeletionPolicy.onInit: commits:num=1
[junit4:junit4]   2> 		commit{dir=RateLimitedDirectoryWrapper(NRTCachingDirectory(org.apache.lucene.store.NIOFSDirectory@/Users/jenkins/jenkins-slave/workspace/Lucene-Solr-trunk-MacOSX/solr/build/solr-core/test/J0/org.apache.solr.cloud.BasicDistributedZkTest-1357084785145/jetty3/index.20130101210002166 lockFactory=org.apache.lucene.store.NativeFSLockFactory@6dcd2348; maxCacheMB=48.0 maxMergeSizeMB=4.0)),segFN=segments_2,generation=2,filenames=[segments_2]
[junit4:junit4]   2> 17052 T2063 C149 P49852 oasc.SolrDeletionPolicy.updateCommits newest commit = 2[segments_2]
[junit4:junit4]   2> 17053 T2063 C149 P49852 oasc.CachingDirectoryFactory.close Releasing directory:/Users/jenkins/jenkins-slave/workspace/Lucene-Solr-trunk-MacOSX/solr/build/solr-core/test/J0/./org.apache.solr.cloud.BasicDistributedZkTest-1357084785145/jetty3
[junit4:junit4]   2> 17053 T2063 C149 P49852 oasu.DefaultSolrCoreState.newIndexWriter Creating new IndexWriter...
[junit4:junit4]   2> 17053 T2063 C149 P49852 oasu.DefaultSolrCoreState.newIndexWriter Waiting until IndexWriter is unused... core=collection1
[junit4:junit4]   2> 17054 T2063 C149 P49852 oasu.DefaultSolrCoreState.newIndexWriter Rollback old IndexWriter... core=collection1
[junit4:junit4]   2> 17055 T2063 C149 P49852 oasc.CachingDirectoryFactory.close Releasing directory:/Users/jenkins/jenkins-slave/workspace/Lucene-Solr-trunk-MacOSX/solr/build/solr-core/test/J0/./org.apache.solr.cloud.BasicDistributedZkTest-1357084785145/jetty3/index.20130101210002166
[junit4:junit4]   2> 17055 T2063 C149 P49852 oasc.CachingDirectoryFactory.close Releasing directory:/Users/jenkins/jenkins-slave/workspace/Lucene-Solr-trunk-MacOSX/solr/build/solr-core/test/J0/./org.apache.solr.cloud.BasicDistributedZkTest-1357084785145/jetty3
[junit4:junit4]   2> 17059 T2063 C149 P49852 oasc.SolrDeletionPolicy.onInit SolrDeletionPolicy.onInit: commits:num=1
[junit4:junit4]   2> 		commit{dir=RateLimitedDirectoryWrapper(NRTCachingDirectory(org.apache.lucene.store.NIOFSDirectory@/Users/jenkins/jenkins-slave/workspace/Lucene-Solr-trunk-MacOSX/solr/build/solr-core/test/J0/org.apache.solr.cloud.BasicDistributedZkTest-1357084785145/jetty3/index.20130101210002166 lockFactory=org.apache.lucene.store.NativeFSLockFactory@6dcd2348; maxCacheMB=48.0 maxMergeSizeMB=4.0)),segFN=segments_2,generation=2,filenames=[segments_2]
[junit4:junit4]   2> 17059 T2063 C149 P49852 oasc.SolrDeletionPolicy.updateCommits newest commit = 2[segments_2]
[junit4:junit4]   2> 17060 T2063 C149 P49852 oasu.DefaultSolrCoreState.newIndexWriter New IndexWriter is ready to be used.
[junit4:junit4]   2> 17060 T2063 C149 P49852 oasc.CachingDirectoryFactory.close Releasing directory:/Users/jenkins/jenkins-slave/workspace/Lucene-Solr-trunk-MacOSX/solr/build/solr-core/test/J0/./org.apache.solr.cloud.BasicDistributedZkTest-1357084785145/jetty3
[junit4:junit4]   2> 17061 T2063 C149 P49852 oass.SolrIndexSearcher.<init> Opening Searcher@15936c50 main
[junit4:junit4]   2> 17065 T2062 oasc.SolrCore.registerSearcher [collection1] Registered new searcher Searcher@15936c50 main{StandardDirectoryReader(segments_2:1:nrt)}
[junit4:junit4]   2> 17066 T2062 oasc.CachingDirectoryFactory.close Releasing directory:/Users/jenkins/jenkins-slave/workspace/Lucene-Solr-trunk-MacOSX/solr/build/solr-core/test/J0/./org.apache.solr.cloud.BasicDistributedZkTest-1357084785145/jetty3/index
[junit4:junit4]   2> 17064 T2063 C149 P49852 oasu.DirectUpdateHandler2.commit start commit{flags=0,_version_=0,optimize=false,openSearcher=false,waitSearcher=false,expungeDeletes=false,softCommit=false}
[junit4:junit4]   2> 17066 T2063 C149 P49852 oasc.SolrDeletionPolicy.onCommit SolrDeletionPolicy.onCommit: commits:num=2
[junit4:junit4]   2> 		commit{dir=RateLimitedDirectoryWrapper(NRTCachingDirectory(org.apache.lucene.store.NIOFSDirectory@/Users/jenkins/jenkins-slave/workspace/Lucene-Solr-trunk-MacOSX/solr/build/solr-core/test/J0/org.apache.solr.cloud.BasicDistributedZkTest-1357084785145/jetty3/index.20130101210002166 lockFactory=org.apache.lucene.store.NativeFSLockFactory@6dcd2348; maxCacheMB=48.0 maxMergeSizeMB=4.0)),segFN=segments_2,generation=2,filenames=[segments_2]
[junit4:junit4]   2> 		commit{dir=RateLimitedDirectoryWrapper(NRTCachingDirectory(org.apache.lucene.store.NIOFSDirectory@/Users/jenkins/jenkins-slave/workspace/Lucene-Solr-trunk-MacOSX/solr/build/solr-core/test/J0/org.apache.solr.cloud.BasicDistributedZkTest-1357084785145/jetty3/index.20130101210002166 lockFactory=org.apache.lucene.store.NativeFSLockFactory@6dcd2348; maxCacheMB=48.0 maxMergeSizeMB=4.0)),segFN=segments_3,generation=3,filenames=[segments_3]
[junit4:junit4]   2> 17067 T2063 C149 P49852 oasc.SolrDeletionPolicy.updateCommits newest commit = 3[segments_3]
[junit4:junit4]   2> 17068 T2063 C149 P49852 oasc.CachingDirectoryFactory.close Releasing directory:/Users/jenkins/jenkins-slave/workspace/Lucene-Solr-trunk-MacOSX/solr/build/solr-core/test/J0/./org.apache.solr.cloud.BasicDistributedZkTest-1357084785145/jetty3
[junit4:junit4]   2> 17068 T2063 C149 P49852 oasu.DirectUpdateHandler2.commit end_commit_flush
[junit4:junit4]   2> 17068 T2063 C149 P49852 oasc.CachingDirectoryFactory.close Releasing directory:/Users/jenkins/jenkins-slave/workspace/Lucene-Solr-trunk-MacOSX/solr/build/solr-core/test/J0/./org.apache.solr.cloud.BasicDistributedZkTest-1357084785145/jetty3/index.20130101210002166
[junit4:junit4]   2> 17069 T2063 C149 P49852 oasc.CachingDirectoryFactory.close Releasing directory:/Users/jenkins/jenkins-slave/workspace/Lucene-Solr-trunk-MacOSX/solr/build/solr-core/test/J0/./org.apache.solr.cloud.BasicDistributedZkTest-1357084785145/jetty3/index
[junit4:junit4]   2> 17069 T2063 C149 P49852 oasc.RecoveryStrategy.replay No replay needed. core=collection1
[junit4:junit4]   2> 17069 T2063 C149 P49852 oasc.RecoveryStrategy.doRecovery Replication Recovery was successful - registering as Active. core=collection1
[junit4:junit4]   2> 17069 T2063 C149 P49852 oasc.ZkController.publish publishing core=collection1 state=active
[junit4:junit4]   2> 17070 T2063 C149 P49852 oasc.ZkController.publish numShards not found on descriptor - reading it from system property
[junit4:junit4]   2> 17072 T2063 C149 P49852 oasc.RecoveryStrategy.doRecovery Finished recovery process. core=collection1
[junit4:junit4]   2> 17626 T2012 oascc.ZkStateReader.updateClusterState Updating cloud state from ZooKeeper... 
[junit4:junit4]   2> 17627 T2012 oasc.Overseer$ClusterStateUpdater.updateState Update state numShards=2 message={
[junit4:junit4]   2> 	  "operation":"state",
[junit4:junit4]   2> 	  "numShards":"2",
[junit4:junit4]   2> 	  "shard":"shard2",
[junit4:junit4]   2> 	  "roles":null,
[junit4:junit4]   2> 	  "state":"recovering",
[junit4:junit4]   2> 	  "core":"collection1",
[junit4:junit4]   2> 	  "collection":"collection1",
[junit4:junit4]   2> 	  "node_name":"127.0.0.1:49856_",
[junit4:junit4]   2> 	  "base_url":"http://127.0.0.1:49856"}
[junit4:junit4]   2> 17631 T2012 oasc.Overseer$ClusterStateUpdater.updateState Update state numShards=2 message={
[junit4:junit4]   2> 	  "operation":"state",
[junit4:junit4]   2> 	  "numShards":"2",
[junit4:junit4]   2> 	  "shard":"shard1",
[junit4:junit4]   2> 	  "roles":null,
[junit4:junit4]   2> 	  "state":"active",
[junit4:junit4]   2> 	  "core":"collection1",
[junit4:junit4]   2> 	  "collection":"collection1",
[junit4:junit4]   2> 	  "node_name":"127.0.0.1:49852_",
[junit4:junit4]   2> 	  "base_url":"http://127.0.0.1:49852"}
[junit4:junit4]   2> 17641 T2045 oascc.ZkStateReader$2.process A cluster state change: WatchedEvent state:SyncConnected type:NodeDataChanged path:/clusterstate.json, has occurred - updating... (live nodes size: 5)
[junit4:junit4]   2> 17638 T2076 oascc.ZkStateReader$2.process A cluster state change: WatchedEvent state:SyncConnected type:NodeDataChanged path:/clusterstate.json, has occurred - updating... (live nodes size: 5)
[junit4:junit4]   2> 17641 T2060 oascc.ZkStateReader$2.process A cluster state change: WatchedEvent state:SyncConnected type:NodeDataChanged path:/clusterstate.json, has occurred - updating... (live nodes size: 5)
[junit4:junit4]   2> 17639 T2011 oascc.ZkStateReader$2.process A cluster state change: WatchedEvent state:SyncConnected type:NodeDataChanged path:/clusterstate.json, has occurred - updating... (live nodes size: 5)
[junit4:junit4]   2> 17639 T2017 oascc.ZkStateReader$2.process A cluster state change: WatchedEvent state:SyncConnected type:NodeDataChanged path:/clusterstate.json, has occurred - updating... (live nodes size: 5)
[junit4:junit4]   2> 17639 T2030 oascc.ZkStateReader$2.process A cluster state change: WatchedEvent state:SyncConnected type:NodeDataChanged path:/clusterstate.json, has occurred - updating... (live nodes size: 5)
[junit4:junit4]   2> 17744 T1989 oascc.ZkStateReader.updateClusterState Updating cloud state from ZooKeeper... 
[junit4:junit4]   2> 18751 T1989 oascc.ZkStateReader.updateClusterState Updating cloud state from ZooKeeper... 
[junit4:junit4]   2>  C150_STATE=coll:collection1 core:collection1 props:{shard=shard2, roles=null, state=recovering, core=collection1, collection=collection1, node_name=127.0.0.1:49856_, base_url=http://127.0.0.1:49856}
[junit4:junit4]   2> 19745 T2079 C150 P49856 oasc.RecoveryStrategy.doRecovery Attempting to PeerSync from http://127.0.0.1:49849/collection1/ core=collection1 - recoveringAfterStartup=true
[junit4:junit4]   2> 19746 T2079 C150 P49856 oasu.PeerSync.sync PeerSync: core=collection1 url=http://127.0.0.1:49856 START replicas=[http://127.0.0.1:49849/collection1/] nUpdates=100
[junit4:junit4]   2> 19747 T2079 C150 P49856 oasu.PeerSync.sync WARNING no frame of reference to tell of we've missed updates
[junit4:junit4]   2> 19749 T2079 C150 P49856 oasc.RecoveryStrategy.doRecovery PeerSync Recovery was not successful - trying replication. core=collection1
[junit4:junit4]   2> 19749 T2079 C150 P49856 oasc.RecoveryStrategy.doRecovery Starting Replication Recovery. core=collection1
[junit4:junit4]   2> 19750 T2079 C150 P49856 oasc.RecoveryStrategy.doRecovery Begin buffering updates. core=collection1
[junit4:junit4]   2> 19750 T2079 C150 P49856 oasu.UpdateLog.bufferUpdates Starting to buffer updates. FSUpdateLog{state=ACTIVE, tlog=null}
[junit4:junit4]   2> 19751 T2079 C150 P49856 oasc.RecoveryStrategy.replicate Attempting to replicate from http://127.0.0.1:49849/collection1/. core=collection1
[junit4:junit4]   2> 19751 T2079 C150 P49856 oascsi.HttpClientUtil.createClient Creating new http client, config:maxConnections=128&maxConnectionsPerHost=32&followRedirects=false
[junit4:junit4]   2> ASYNC  NEW_CORE C152 name=collection1 org.apache.solr.core.SolrCore@1919bc02 url=http://127.0.0.1:49849/collection1 node=127.0.0.1:49849_ C152_STATE=coll:collection1 core:collection1 props:{shard=shard2, roles=null, state=active, core=collection1, collection=collection1, node_name=127.0.0.1:49849_, base_url=http://127.0.0.1:49849, leader=true}
[junit4:junit4]   2> 19760 T2036 C152 P49849 REQ /get {distrib=false&qt=/get&wt=javabin&version=2&getVersions=100} status=0 QTime=0 
[junit4:junit4]   2> 19762 T1989 oascc.ZkStateReader.updateClusterState Updating cloud state from ZooKeeper... 
[junit4:junit4]   2> 19766 T2040 C152 P49849 oasu.DirectUpdateHandler2.commit start commit{flags=0,_version_=0,optimize=false,openSearcher=false,waitSearcher=true,expungeDeletes=false,softCommit=false}
[junit4:junit4]   2> 19768 T2040 C152 P49849 oasc.CachingDirectoryFactory.close Releasing directory:/Users/jenkins/jenkins-slave/workspace/Lucene-Solr-trunk-MacOSX/solr/build/solr-core/test/J0/./org.apache.solr.cloud.BasicDistributedZkTest-1357084785145/jetty2
[junit4:junit4]   2> 19771 T2040 C152 P49849 oasc.SolrDeletionPolicy.onInit SolrDeletionPolicy.onInit: commits:num=1
[junit4:junit4]   2> 		commit{dir=RateLimitedDirectoryWrapper(NRTCachingDirectory(org.apache.lucene.store.NIOFSDirectory@/Users/jenkins/jenkins-slave/workspace/Lucene-Solr-trunk-MacOSX/solr/build/solr-core/test/J0/org.apache.solr.cloud.BasicDistributedZkTest-1357084785145/jetty2/index lockFactory=org.apache.lucene.store.NativeFSLockFactory@39f8d04d; maxCacheMB=48.0 maxMergeSizeMB=4.0)),segFN=segments_1,generation=1,filenames=[segments_1]
[junit4:junit4]   2> 19772 T2040 C152 P49849 oasc.SolrDeletionPolicy.updateCommits newest commit = 1[segments_1]
[junit4:junit4]   2> 19775 T2040 C152 P49849 oasc.SolrDeletionPolicy.onCommit SolrDeletionPolicy.onCommit: commits:num=2
[junit4:junit4]   2> 		commit{dir=RateLimitedDirectoryWrapper(NRTCachingDirectory(org.apache.lucene.store.NIOFSDirectory@/Users/jenkins/jenkins-slave/workspace/Lucene-Solr-trunk-MacOSX/solr/build/solr-core/test/J0/org.apache.solr.cloud.BasicDistributedZkTest-1357084785145/jetty2/index lockFactory=org.apache.lucene.store.NativeFSLockFactory@39f8d04d; maxCacheMB=48.0 maxMergeSizeMB=4.0)),segFN=segments_1,generation=1,filenames=[segments_1]
[junit4:junit4]   2> 		commit{dir=RateLimitedDirectoryWrapper(NRTCachingDirectory(org.apache.lucene.store.NIOFSDirectory@/Users/jenkins/jenkins-slave/workspace/Lucene-Solr-trunk-MacOSX/solr/build/solr-core/test/J0/org.apache.solr.cloud.BasicDistributedZkTest-1357084785145/jetty2/index lockFactory=org.apache.lucene.store.NativeFSLockFactory@39f8d04d; maxCacheMB=48.0 maxMergeSizeMB=4.0)),segFN=segments_2,generation=2,filenames=[segments_2]
[junit4:junit4]   2> 19776 T2040 C152 P49849 oasc.SolrDeletionPolicy.updateCommits newest commit = 2[segments_2]
[junit4:junit4]   2> 19780 T2040 C152 P49849 oasc.CachingDirectoryFactory.close Releasing directory:/Users/jenkins/jenkins-slave/workspace/Lucene-Solr-trunk-MacOSX/solr/build/solr-core/test/J0/./org.apache.solr.cloud.BasicDistributedZkTest-1357084785145/jetty2
[junit4:junit4]   2> 19781 T2040 C152 P49849 oass.SolrIndexSearcher.<init> Opening Searcher@7c350684 realtime
[junit4:junit4]   2> 19781 T2040 C152 P49849 oasu.DirectUpdateHandler2.commit end_commit_flush
[junit4:junit4]   2> 19782 T2040 C152 P49849 /update {waitSearcher=true&openSearcher=false&commit=true&commit_end_point=true&wt=javabin&softCommit=false&version=2} {commit=} 0 16
[junit4:junit4]   2> 19785 T2079 C150 P49856 oash.ReplicationHandler.inform Commits will be reserved for  10000
[junit4:junit4]   2> 19786 T2079 C150 P49856 oash.SnapPuller.<init>  No value set for 'pollInterval'. Timer Task not started.
[junit4:junit4]   2> 19787 T2037 C152 P49849 oash.ReplicationHandler.inform Commits will be reserved for  10000
[junit4:junit4]   2> 19788 T2037 C152 P49849 REQ /replication {command=indexversion&wt=javabin&qt=/replication&version=2} status=0 QTime=2 
[junit4:junit4]   2> 19789 T2079 C150 P49856 oash.SnapPuller.fetchLatestIndex Master's generation: 2
[junit4:junit4]   2> 19789 T2079 C150 P49856 oash.SnapPuller.fetchLatestIndex Slave's generation: 1
[junit4:junit4]   2> 19789 T2079 C150 P49856 oash.SnapPuller.fetchLatestIndex Starting replication process
[junit4:junit4]   2> 19795 T2038 C152 P49849 oasc.CachingDirectoryFactory.close Releasing directory:/Users/jenkins/jenkins-slave/workspace/Lucene-Solr-trunk-MacOSX/solr/build/solr-core/test/J0/./org.apache.solr.cloud.BasicDistributedZkTest-1357084785145/jetty2
[junit4:junit4]   2> 19796 T2038 C152 P49849 oasc.CachingDirectoryFactory.close Releasing directory:/Users/jenkins/jenkins-slave/workspace/Lucene-Solr-trunk-MacOSX/solr/build/solr-core/test/J0/./org.apache.solr.cloud.BasicDistributedZkTest-1357084785145/jetty2/index
[junit4:junit4]   2> 19796 T2038 C152 P49849 REQ /replication {command=filelist&generation=2&wt=javabin&qt=/replication&version=2} status=0 QTime=1 
[junit4:junit4]   2> 19795 T2079 C150 P49856 oash.SnapPuller.fetchLatestIndex Number of files in latest index in master: 1
[junit4:junit4]   2> 19796 T2079 C150 P49856 oasc.CachingDirectoryFactory.get return new directory for /Users/jenkins/jenkins-slave/workspace/Lucene-Solr-trunk-MacOSX/solr/build/solr-core/test/J0/./org.apache.solr.cloud.BasicDistributedZkTest-1357084785145/jetty4/index.20130101210004933 forceNew:false
[junit4:junit4]   2> 19797 T2079 C150 P49856 oasc.CachingDirectoryFactory.close Releasing directory:/Users/jenkins/jenkins-slave/workspace/Lucene-Solr-trunk-MacOSX/solr/build/solr-core/test/J0/./org.apache.solr.cloud.BasicDistributedZkTest-1357084785145/jetty4
[junit4:junit4]   2> 19797 T2079 C150 P49856 oash.SnapPuller.fetchLatestIndex Starting download to RateLimitedDirectoryWrapper(NRTCachingDirectory(org.apache.lucene.store.NIOFSDirectory@/Users/jenkins/jenkins-slave/workspace/Lucene-Solr-trunk-MacOSX/solr/build/solr-core/test/J0/org.apache.solr.cloud.BasicDistributedZkTest-1357084785145/jetty4/index.20130101210004933 lockFactory=org.apache.lucene.store.NativeFSLockFactory@2cb579e0; maxCacheMB=48.0 maxMergeSizeMB=4.0)) fullCopy=true
[junit4:junit4]   2> 19803 T2036 C152 P49849 REQ /replication {file=segments_2&command=filecontent&checksum=true&generation=2&qt=/replication&wt=filestream} status=0 QTime=0 
[junit4:junit4]   2> 19803 T2079 C150 P49856 oasc.CachingDirectoryFactory.close Releasing directory:/Users/jenkins/jenkins-slave/workspace/Lucene-Solr-trunk-MacOSX/solr/build/solr-core/test/J0/./org.apache.solr.cloud.BasicDistributedZkTest-1357084785145/jetty4/index
[junit4:junit4]   2> 19804 T2079 C150 P49856 oash.SnapPuller.fetchLatestIndex Total time taken for download : 0 secs
[junit4:junit4]   2> 19804 T2079 C150 P49856 oash.SnapPuller.modifyIndexProps New index installed. Updating index properties... index=index.20130101210004933
[junit4:junit4]   2> 19805 T2079 C150 P49856 oasc.CachingDirectoryFactory.close Releasing directory:/Users/jenkins/jenkins-slave/workspace/Lucene-Solr-trunk-MacOSX/solr/build/solr-core/test/J0/./org.apache.solr.cloud.BasicDistributedZkTest-1357084785145/jetty4
[junit4:junit4]   2> 19806 T2079 C150 P49856 oasc.CachingDirectoryFactory.close Releasing directory:/Users/jenkins/jenkins-slave/workspace/Lucene-Solr-trunk-MacOSX/solr/build/solr-core/test/J0/./org.apache.solr.cloud.BasicDistributedZkTest-1357084785145/jetty4
[junit4:junit4]   2> 19806 T2079 C150 P49856 oasc.SolrCore.getNewIndexDir New index directory detected: old=./org.apache.solr.cloud.BasicDistributedZkTest-1357084785145/jetty4/index/ new=./org.apache.solr.cloud.BasicDistributedZkTest-1357084785145/jetty4/index.20130101210004933
[junit4:junit4]   2> 19808 T2079 C150 P49856 oasc.SolrDeletionPolicy.onInit SolrDeletionPolicy.onInit: commits:num=1
[junit4:junit4]   2> 		commit{dir=RateLimitedDirectoryWrapper(NRTCachingDirectory(org.apache.lucene.store.NIOFSDirectory@/Users/jenkins/jenkins-slave/workspace/Lucene-Solr-trunk-MacOSX/solr/build/solr-core/test/J0/org.apache.solr.cloud.BasicDistributedZkTest-1357084785145/jetty4/index.20130101210004933 lockFactory=org.apache.lucene.store.NativeFSLockFactory@2cb579e0; maxCacheMB=48.0 maxMergeSizeMB=4.0)),segFN=segments_2,generation=2,filenames=[segments_2]
[junit4:junit4]   2> 19809 T2079 C150 P49856 oasc.SolrDeletionPolicy.updateCommits newest commit = 2[segments_2]
[junit4:junit4]   2> 19812 T2079 C150 P49856 oasc.CachingDirectoryFactory.close Releasing directory:/Users/jenkins/jenkins-slave/workspace/Lucene-Solr-trunk-MacOSX/solr/build/solr-core/test/J0/./org.apache.solr.cloud.BasicDistributedZkTest-1357084785145/jetty4
[junit4:junit4]   2> 19813 T2079 C150 P49856 oasu.DefaultSolrCoreState.newIndexWriter Creating new IndexWriter...
[junit4:junit4]   2> 19813 T2079 C150 P49856 oasu.DefaultSolrCoreState.newIndexWriter Waiting until IndexWriter is unused... core=collection1
[junit4:junit4]   2> 19813 T2079 C150 P49856 oasu.DefaultSolrCoreState.newIndexWriter Rollback old IndexWriter... core=collection1
[junit4:junit4]   2> 19814 T2079 C150 P49856 oasc.CachingDirectoryFactory.close Releasing directory:/Users/jenkins/jenkins-slave/workspace/Lucene-Solr-trunk-MacOSX/solr/build/solr-core/test/J0/./org.apache.solr.cloud.BasicDistributedZkTest-1357084785145/jetty4/index.20130101210004933
[junit4:junit4]   2> 19814 T2079 C150 P49856 oasc.CachingDirectoryFactory.close Releasing directory:/Users/jenkins/jenkins-slave/workspace/Lucene-Solr-trunk-MacOSX/solr/build/solr-core/test/J0/./org.apache.solr.cloud.BasicDistributedZkTest-1357084785145/jetty4
[junit4:junit4]   2> 19816 T2079 C150 P49856 oasc.SolrDeletionPolicy.onInit SolrDeletionPolicy.onInit: commits:num=1
[junit4:junit4]   2> 		commit{dir=RateLimitedDirectoryWrapper(NRTCachingDirectory(org.apache.lucene.store.NIOFSDirectory@/Users/jenkins/jenkins-slave/workspace/Lucene-Solr-trunk-MacOSX/solr/build/solr-core/test/J0/org.apache.solr.cloud.BasicDistributedZkTest-1357084785145/jetty4/index.20130101210004933 lockFactory=org.apache.lucene.store.NativeFSLockFactory@2cb579e0; maxCacheMB=48.0 maxMergeSizeMB=4.0)),segFN=segments_2,generation=2,filenames=[segments_2]
[junit4:junit4]   2> 19816 T2079 C150 P49856 oasc.SolrDeletionPolicy.updateCommits newest commit = 2[segments_2]
[junit4:junit4]   2> 19816 T2079 C150 P49856 oasu.DefaultSolrCoreState.newIndexWriter New IndexWriter is ready to be used.
[junit4:junit4]   2> 19817 T2079 C150 P49856 oasc.CachingDirectoryFactory.close Releasing directory:/Users/jenkins/jenkins-slave/workspace/Lucene-Solr-trunk-MacOSX/solr/build/solr-core/test/J0/./org.apache.solr.cloud.BasicDistributedZkTest-1357084785145/jetty4
[junit4:junit4]   2> 19817 T2079 C150 P49856 oass.SolrIndexSearcher.<init> Opening Searcher@575df6d7 main
[junit4:junit4]   2> 19817 T2078 oasc.SolrCore.registerSearcher [collection1] Registered new searcher Searcher@575df6d7 main{StandardDirectoryReader(segments_2:1:nrt)}
[junit4:junit4]   2> 19817 T2078 oasc.CachingDirectoryFactory.close Releasing directory:/Users/jenkins/jenkins-slave/workspace/Lucene-Solr-trunk-MacOSX/solr/build/solr-core/test/J0/./org.apache.solr.cloud.BasicDistributedZkTest-1357084785145/jetty4/index
[junit4:junit4]   2> 19820 T2079 C150 P49856 oasu.DirectUpdateHandler2.commit start commit{flags=0,_version_=0,optimize=false,openSearcher=false,waitSearcher=false,expungeDeletes=false,softCommit=false}
[junit4:junit4]   2> 19822 T2079 C150 P49856 oasc.SolrDeletionPolicy.onCommit SolrDeletionPolicy.onCommit: commits:num=2
[junit4:junit4]   2> 		commit{dir=RateLimitedDirectoryWrapper(NRTCachingDirectory(org.apache.lucene.store.NIOFSDirectory@/Users/jenkins/jenkins-slave/workspace/Lucene-Solr-trunk-MacOSX/solr/build/solr-core/test/J0/org.apache.solr.cloud.BasicDistributedZkTest-1357084785145/jetty4/index.20130101210004933 lockFactory=org.apache.lucene.store.NativeFSLockFactory@2cb579e0; maxCacheMB=48.0 maxMergeSizeMB=4.0)),segFN=segments_2,generation=2,filenames=[segments_2]
[junit4:junit4]   2> 		commit{dir=RateLimitedDirectoryWrapper(NRTCachingDirectory(org.apache.lucene.store.NIOFSDirectory@/Users/jenkins/jenkins-slave/workspace/Lucene-Solr-trunk-MacOSX/solr/build/solr-core/test/J0/org.apache.solr.cloud.BasicDistributedZkTest-1357084785145/jetty4/index.20130101210004933 lockFactory=org.apache.lucene.store.NativeFSLockFactory@2cb579e0; maxCacheMB=48.0 maxMergeSizeMB=4.0)),segFN=segments_3,generation=3,filenames=[segments_3]
[junit4:junit4]   2> 19822 T2079 C150 P49856 oasc.SolrDeletionPolicy.updateCommits newest commit = 3[segments_3]
[junit4:junit4]   2> 19823 T2079 C150 P49856 oasc.CachingDirectoryFactory.close Releasing directory:/Users/jenkins/jenkins-slave/workspace/Lucene-Solr-trunk-MacOSX/solr/build/solr-core/test/J0/./org.apache.solr.cloud.BasicDistributedZkTest-1357084785145/jetty4
[junit4:junit4]   2> 19824 T2079 C150 P49856 oasu.DirectUpdateHandler2.commit end_commit_flush
[junit4:junit4]   2> 19824 T2079 C150 P49856 oasc.CachingDirectoryFactory.close Releasing directory:/Users/jenkins/jenkins-slave/workspace/Lucene-Solr-trunk-MacOSX/solr/build/solr-core/test/J0/./org.apache.solr.cloud.BasicDistributedZkTest-1357084785145/jetty4/index.20130101210004933
[junit4:junit4]   2> 19824 T2079 C150 P49856 oasc.CachingDirectoryFactory.close Releasing directory:/Users/jenkins/jenkins-slave/workspace/Lucene-Solr-trunk-MacOSX/solr/build/solr-core/test/J0/./org.apache.solr.cloud.BasicDistributedZkTest-1357084785145/jetty4/index
[junit4:junit4]   2> 19824 T2079 C150 P49856 oasc.RecoveryStrategy.replay No replay needed. core=collection1
[junit4:junit4]   2> 19825 T2079 C150 P49856 oasc.RecoveryStrategy.doRecovery Replication Recovery was successful - registering as Active. core=collection1
[junit4:junit4]   2> 19825 T2079 C150 P49856 oasc.ZkController.publish publishing core=collection1 state=active
[junit4:junit4]   2> 19825 T2079 C150 P49856 oasc.ZkController.publish numShards not found on descriptor - reading it from system property
[junit4:junit4]   2> 19825 T2079 C150 P49856 oasc.RecoveryStrategy.doRecovery Finished recovery process. core=collection1
[junit4:junit4]   2> 20665 T2012 oascc.ZkStateReader.updateClusterState Updating cloud state from ZooKeeper... 
[junit4:junit4]   2> 20666 T2012 oasc.Overseer$ClusterStateUpdater.updateState Update state numShards=2 message={
[junit4:junit4]   2> 	  "operation":"state",
[junit4:junit4]   2> 	  "numShards":"2",
[junit4:junit4]   2> 	  "shard":"shard2",
[junit4:junit4]   2> 	  "roles":null,
[junit4:junit4]   2> 	  "state":"active",
[junit4:junit4]   2> 	  "core":"collection1",
[junit4:junit4]   2> 	  "collection":"collection1",
[junit4:junit4]   2> 	  "node_name":"127.0.0.1:49856_",
[junit4:junit4]   2> 	  "base_url":"http://127.0.0.1:49856"}
[junit4:junit4]   2> 20675 T2011 oascc.ZkStateReader$2.process A cluster state change: WatchedEvent state:SyncConnected type:NodeDataChanged path:/clusterstate.json, has occurred - updating... (live nodes size: 5)
[junit4:junit4]   2> 20677 T2045 oascc.ZkStateReader$2.process A cluster state change: WatchedEvent state:SyncConnected type:NodeDataChanged path:/clusterstate.json, has occurred - updating... (live nodes size: 5)
[junit4:junit4]   2> 20678 T2030 oascc.ZkStateReader$2.process A cluster state change: WatchedEvent state:SyncConnected type:NodeDataChanged path:/clusterstate.json, has occurred - updating... (live nodes size: 5)
[junit4:junit4]   2> 20678 T2060 oascc.ZkStateReader$2.process A cluster state change: WatchedEvent state:SyncConnected type:NodeDataChanged path:/clusterstate.json, has occurred - updating... (live nodes size: 5)
[junit4:junit4]   2> 20677 T2076 oascc.ZkStateReader$2.process A cluster state change: WatchedEvent state:SyncConnected type:NodeDataChanged path:/clusterstate.json, has occurred - updating... (live nodes size: 5)
[junit4:junit4]   2> 20676 T2017 oascc.ZkStateReader$2.process A cluster state change: WatchedEvent state:SyncConnected type:NodeDataChanged path:/clusterstate.json, has occurred - updating... (live nodes size: 5)
[junit4:junit4]   2> 20775 T1989 oascc.ZkStateReader.updateClusterState Updating cloud state from ZooKeeper... 
[junit4:junit4]   2> 20777 T1989 oasc.AbstractDistribZkTestBase.waitForRecoveriesToFinish Recoveries finished - collection: collection1
[junit4:junit4]   2> ASYNC  NEW_CORE C153 name=collection1 org.apache.solr.core.SolrCore@109f6ebb url=http://127.0.0.1:49842/collection1 node=127.0.0.1:49842_ C153_STATE=coll:control_collection core:collection1 props:{shard=shard1, roles=null, state=active, core=collection1, collection=control_collection, node_name=127.0.0.1:49842_, base_url=http://127.0.0.1:49842, leader=true}
[junit4:junit4]   2> 20786 T2003 C153 P49842 oasc.CachingDirectoryFactory.close Releasing directory:/Users/jenkins/jenkins-slave/workspace/Lucene-Solr-trunk-MacOSX/solr/build/solr-core/test/J0/./org.apache.solr.cloud.BasicDistributedZkTest-1357084785145/control/data
[junit4:junit4]   2> 20790 T2003 C153 P49842 oasc.SolrDeletionPolicy.onInit SolrDeletionPolicy.onInit: commits:num=1
[junit4:junit4]   2> 		commit{dir=RateLimitedDirectoryWrapper(NRTCachingDirectory(org.apache.lucene.store.NIOFSDirectory@/Users/jenkins/jenkins-slave/workspace/Lucene-Solr-trunk-MacOSX/solr/build/solr-core/test/J0/org.apache.solr.cloud.BasicDistributedZkTest-1357084785145/control/data/index lockFactory=org.apache.lucene.store.NativeFSLockFactory@3a44d78; maxCacheMB=48.0 maxMergeSizeMB=4.0)),segFN=segments_1,generation=1,filenames=[segments_1]
[junit4:junit4]   2> 20790 T2003 C153 P49842 oasc.SolrDeletionPolicy.updateCommits newest commit = 1[segments_1]
[junit4:junit4]   2> 20792 T2003 C153 P49842 oasc.CachingDirectoryFactory.close Releasing directory:/Users/jenkins/jenkins-slave/workspace/Lucene-Solr-trunk-MacOSX/solr/build/solr-core/test/J0/./org.apache.solr.cloud.BasicDistributedZkTest-1357084785145/control/data
[junit4:junit4]   2> 20792 T2003 C153 P49842 oass.SolrIndexSearcher.<init> Opening Searcher@408aef18 realtime
[junit4:junit4]   2> 20793 T2003 C153 P49842 /update {wt=javabin&version=2} {deleteByQuery=*:* (-1423006557454467072)} 0 9
[junit4:junit4]   2> 20802 T2041 C152 P49849 oasc.CachingDirectoryFactory.close Releasing directory:/Users/jenkins/jenkins-slave/workspace/Lucene-Solr-trunk-MacOSX/solr/build/solr-core/test/J0/./org.apache.solr.cloud.BasicDistributedZkTest-1357084785145/jetty2
[junit4:junit4]   2> 20810 T2023 C151 P49846 oasc.CachingDirectoryFactory.close Releasing directory:/Users/jenkins/jenkins-slave/workspace/Lucene-Solr-trunk-MacOSX/

[...truncated too long message...]

ssorImpl.java:43)
[junit4:junit4]    > 	at java.lang.reflect.Method.invoke(Method.java:601)
[junit4:junit4]    > 	at com.carrotsearch.randomizedtesting.RandomizedRunner.invoke(RandomizedRunner.java:1559)
[junit4:junit4]    > 	at com.carrotsearch.randomizedtesting.RandomizedRunner.access$600(RandomizedRunner.java:79)
[junit4:junit4]    > 	at com.carrotsearch.randomizedtesting.RandomizedRunner$6.evaluate(RandomizedRunner.java:737)
[junit4:junit4]    > 	at com.carrotsearch.randomizedtesting.RandomizedRunner$7.evaluate(RandomizedRunner.java:773)
[junit4:junit4]    > 	at com.carrotsearch.randomizedtesting.RandomizedRunner$8.evaluate(RandomizedRunner.java:787)
[junit4:junit4]    > 	at com.carrotsearch.randomizedtesting.rules.SystemPropertiesRestoreRule$1.evaluate(SystemPropertiesRestoreRule.java:53)
[junit4:junit4]    > 	at org.apache.lucene.util.TestRuleSetupTeardownChained$1.evaluate(TestRuleSetupTeardownChained.java:50)
[junit4:junit4]    > 	at org.apache.lucene.util.TestRuleFieldCacheSanity$1.evaluate(TestRuleFieldCacheSanity.java:51)
[junit4:junit4]    > 	at org.apache.lucene.util.AbstractBeforeAfterRule$1.evaluate(AbstractBeforeAfterRule.java:46)
[junit4:junit4]    > 	at com.carrotsearch.randomizedtesting.rules.SystemPropertiesInvariantRule$1.evaluate(SystemPropertiesInvariantRule.java:55)
[junit4:junit4]    > 	at org.apache.lucene.util.TestRuleThreadAndTestName$1.evaluate(TestRuleThreadAndTestName.java:49)
[junit4:junit4]    > 	at org.apache.lucene.util.TestRuleIgnoreAfterMaxFailures$1.evaluate(TestRuleIgnoreAfterMaxFailures.java:70)
[junit4:junit4]    > 	at org.apache.lucene.util.TestRuleMarkFailure$1.evaluate(TestRuleMarkFailure.java:48)
[junit4:junit4]    > 	at com.carrotsearch.randomizedtesting.rules.StatementAdapter.evaluate(StatementAdapter.java:36)
[junit4:junit4]    > 	at com.carrotsearch.randomizedtesting.ThreadLeakControl$StatementRunner.run(ThreadLeakControl.java:358)
[junit4:junit4]    > 	at com.carrotsearch.randomizedtesting.ThreadLeakControl.forkTimeoutingTask(ThreadLeakControl.java:782)
[junit4:junit4]    > 	at com.carrotsearch.randomizedtesting.ThreadLeakControl$3.evaluate(ThreadLeakControl.java:442)
[junit4:junit4]    > 	at com.carrotsearch.randomizedtesting.RandomizedRunner.runSingleTest(RandomizedRunner.java:746)
[junit4:junit4]    > 	at com.carrotsearch.randomizedtesting.RandomizedRunner$3.evaluate(RandomizedRunner.java:648)
[junit4:junit4]    > 	at com.carrotsearch.randomizedtesting.RandomizedRunner$4.evaluate(RandomizedRunner.java:682)
[junit4:junit4]    > 	at com.carrotsearch.randomizedtesting.RandomizedRunner$5.evaluate(RandomizedRunner.java:693)
[junit4:junit4]    > 	at com.carrotsearch.randomizedtesting.rules.StatementAdapter.evaluate(StatementAdapter.java:36)
[junit4:junit4]    > 	at com.carrotsearch.randomizedtesting.rules.SystemPropertiesRestoreRule$1.evaluate(SystemPropertiesRestoreRule.java:53)
[junit4:junit4]    > 	at org.apache.lucene.util.AbstractBeforeAfterRule$1.evaluate(AbstractBeforeAfterRule.java:46)
[junit4:junit4]    > 	at org.apache.lucene.util.TestRuleStoreClassName$1.evaluate(TestRuleStoreClassName.java:42)
[junit4:junit4]    > 	at com.carrotsearch.randomizedtesting.rules.SystemPropertiesInvariantRule$1.evaluate(SystemPropertiesInvariantRule.java:55)
[junit4:junit4]    > 	at com.carrotsearch.randomizedtesting.rules.NoShadowingOrOverridesOnMethodsRule$1.evaluate(NoShadowingOrOverridesOnMethodsRule.java:39)
[junit4:junit4]    > 	at com.carrotsearch.randomizedtesting.rules.NoShadowingOrOverridesOnMethodsRule$1.evaluate(NoShadowingOrOverridesOnMethodsRule.java:39)
[junit4:junit4]    > 	at com.carrotsearch.randomizedtesting.rules.StatementAdapter.evaluate(StatementAdapter.java:36)
[junit4:junit4]    > 	at org.apache.lucene.util.TestRuleAssertionsRequired$1.evaluate(TestRuleAssertionsRequired.java:43)
[junit4:junit4]    > 	at org.apache.lucene.util.TestRuleMarkFailure$1.evaluate(TestRuleMarkFailure.java:48)
[junit4:junit4]    > 	at org.apache.lucene.util.TestRuleIgnoreAfterMaxFailures$1.evaluate(TestRuleIgnoreAfterMaxFailures.java:70)
[junit4:junit4]    > 	at org.apache.lucene.util.TestRuleIgnoreTestSuites$1.evaluate(TestRuleIgnoreTestSuites.java:55)
[junit4:junit4]    > 	at com.carrotsearch.randomizedtesting.rules.StatementAdapter.evaluate(StatementAdapter.java:36)
[junit4:junit4]    > 	at com.carrotsearch.randomizedtesting.ThreadLeakControl$StatementRunner.run(ThreadLeakControl.java:358)
[junit4:junit4]    > 	at java.lang.Thread.run(Thread.java:722)
[junit4:junit4]   2> 382039 T1989 oas.SolrTestCaseJ4.deleteCore ###deleteCore
[junit4:junit4]   2> NOTE: test params are: codec=Lucene41: {n_f1=MockFixedIntBlock(blockSize=1786), foo_b=PostingsFormat(name=Memory doPackFST= true), cat=PostingsFormat(name=TestBloomFilteredLucene41Postings), foo_d=PostingsFormat(name=Asserting), foo_f=PostingsFormat(name=Memory doPackFST= true), n_tl1=MockFixedIntBlock(blockSize=1786), n_d1=PostingsFormat(name=TestBloomFilteredLucene41Postings), rnd_b=PostingsFormat(name=Asserting), intDefault=MockFixedIntBlock(blockSize=1786), n_td1=MockFixedIntBlock(blockSize=1786), timestamp=PostingsFormat(name=TestBloomFilteredLucene41Postings), id=PostingsFormat(name=Asserting), range_facet_sl=PostingsFormat(name=Asserting), range_facet_si=PostingsFormat(name=TestBloomFilteredLucene41Postings), oddField_s=PostingsFormat(name=Asserting), sequence_i=PostingsFormat(name=Asserting), name=PostingsFormat(name=Asserting), foo_i=MockFixedIntBlock(blockSize=1786), regex_dup_B_s=PostingsFormat(name=TestBloomFilteredLucene41Postings), multiDefault=PostingsFormat(name=TestBloomFilteredLucene41Postings), n_tf1=PostingsFormat(name=TestBloomFilteredLucene41Postings), n_dt1=MockFixedIntBlock(blockSize=1786), genre_s=PostingsFormat(name=Asserting), author_t=MockFixedIntBlock(blockSize=1786), n_ti1=PostingsFormat(name=Asserting), range_facet_l=PostingsFormat(name=TestBloomFilteredLucene41Postings), text=PostingsFormat(name=Memory doPackFST= true), _version_=MockFixedIntBlock(blockSize=1786), val_i=PostingsFormat(name=Asserting), SubjectTerms_mfacet=MockFixedIntBlock(blockSize=1786), series_t=MockFixedIntBlock(blockSize=1786), a_t=PostingsFormat(name=TestBloomFilteredLucene41Postings), n_tdt1=MockFixedIntBlock(blockSize=1786), regex_dup_A_s=PostingsFormat(name=Memory doPackFST= true), price=PostingsFormat(name=Memory doPackFST= true), other_tl1=MockFixedIntBlock(blockSize=1786), n_l1=PostingsFormat(name=TestBloomFilteredLucene41Postings), a_si=MockFixedIntBlock(blockSize=1786), inStock=PostingsFormat(name=Memory doPackFST= true)}, sim=RandomSimilarityProvider(queryNorm=true,coord=crazy): {}, locale=cs_CZ, timezone=America/Cordoba
[junit4:junit4]   2> NOTE: Mac OS X 10.8.2 x86_64/Oracle Corporation 1.7.0_10 (64-bit)/cpus=2,threads=1,free=154622040,total=320012288
[junit4:junit4]   2> NOTE: All tests run in this JVM: [XsltUpdateRequestHandlerTest, SchemaVersionSpecificBehaviorTest, AutoCommitTest, TimeZoneUtilsTest, TestSuggestSpellingConverter, SimpleFacetsTest, CopyFieldTest, DateFieldTest, TestPHPSerializedResponseWriter, TestBadConfig, TestBinaryField, TestDefaultSimilarityFactory, TermsComponentTest, PrimitiveFieldTypeTest, PrimUtilsTest, TestPropInject, TestUpdate, TestXIncludeConfig, LeaderElectionTest, ZkCLITest, TestBM25SimilarityFactory, DistributedQueryElevationComponentTest, DirectUpdateHandlerOptimizeTest, SimplePostToolTest, FieldMutatingUpdateProcessorTest, StandardRequestHandlerTest, OpenExchangeRatesOrgProviderTest, HighlighterConfigTest, EchoParamsTest, IndexSchemaTest, UUIDFieldTest, TestRealTimeGet, StatsComponentTest, FileUtilsTest, BadIndexSchemaTest, SynonymTokenizerTest, DateMathParserTest, TestJoin, TestStressVersions, TestRTGBase, TestStressLucene, ClusterStateTest, ZkControllerTest, TestPseudoReturnFields, ShardRoutingCustomTest, JSONWriterTest, DistributedTermsComponentTest, BadComponentTest, TestPropInjectDefaults, TestIBSimilarityFactory, TestRangeQuery, PingRequestHandlerTest, SolrCoreTest, TestFastOutputStream, TestLMDirichletSimilarityFactory, RequiredFieldsTest, SuggesterTSTTest, TestLuceneMatchVersion, TestSolr4Spatial, SuggesterFSTTest, TestMultiCoreConfBootstrap, TestRecovery, DocumentAnalysisRequestHandlerTest, TestRandomFaceting, TestOmitPositions, OverseerTest, CollectionsAPIDistributedZkTest, LeaderElectionIntegrationTest, DistanceFunctionTest, TestPerFieldSimilarity, TestFoldingMultitermQuery, ZkSolrClientTest, TestStressReorder, PolyFieldTest, TestAnalyzedSuggestions, FieldAnalysisRequestHandlerTest, TestCoreContainer, AnalysisAfterCoreReloadTest, TestCodecSupport, TestSort, TestWriterPerf, TestCSVResponseWriter, TestDocumentBuilder, TestCharFilters, TestCSVLoader, MinimalSchemaTest, PluginInfoTest, PathHierarchyTokenizerFactoryTest, BasicDistributedZkTest]
[junit4:junit4] Completed in 382.43s, 1 test, 1 failure <<< FAILURES!

[...truncated 472 lines...]
BUILD FAILED
/Users/jenkins/jenkins-slave/workspace/Lucene-Solr-trunk-MacOSX/build.xml:353: The following error occurred while executing this line:
/Users/jenkins/jenkins-slave/workspace/Lucene-Solr-trunk-MacOSX/build.xml:39: The following error occurred while executing this line:
/Users/jenkins/jenkins-slave/workspace/Lucene-Solr-trunk-MacOSX/solr/build.xml:178: The following error occurred while executing this line:
/Users/jenkins/jenkins-slave/workspace/Lucene-Solr-trunk-MacOSX/solr/common-build.xml:438: The following error occurred while executing this line:
/Users/jenkins/jenkins-slave/workspace/Lucene-Solr-trunk-MacOSX/lucene/common-build.xml:1176: The following error occurred while executing this line:
/Users/jenkins/jenkins-slave/workspace/Lucene-Solr-trunk-MacOSX/lucene/common-build.xml:841: There were test failures: 245 suites, 1011 tests, 1 failure, 13 ignored (2 assumptions)

Total time: 59 minutes 5 seconds
Build step 'Invoke Ant' marked build as failure
Archiving artifacts
Recording test results
Description set: Java: 64bit/jdk1.7.0 -XX:+UseParallelGC
Email was triggered for: Failure
Sending email for trigger: Failure



Mime
View raw message