lucene-dev mailing list archives

Site index · List index
Message view « Date » · « Thread »
Top « Date » · « Thread »
From Policeman Jenkins Server <jenk...@thetaphi.de>
Subject [JENKINS] Lucene-Solr-trunk-MacOSX (64bit/jdk1.7.0) - Build # 32 - Failure!
Date Tue, 01 Jan 2013 19:36:04 GMT
Build: http://jenkins.thetaphi.de/job/Lucene-Solr-trunk-MacOSX/32/
Java: 64bit/jdk1.7.0 -XX:+UseG1GC

1 tests failed.
REGRESSION:  org.apache.solr.cloud.BasicDistributedZkTest.testDistribSearch

Error Message:
There are still nodes recoverying - waited for 230 seconds

Stack Trace:
java.lang.AssertionError: There are still nodes recoverying - waited for 230 seconds
	at __randomizedtesting.SeedInfo.seed([6752C4800C661C47:E6B44A987B397C7B]:0)
	at org.junit.Assert.fail(Assert.java:93)
	at org.apache.solr.cloud.AbstractDistribZkTestBase.waitForRecoveriesToFinish(AbstractDistribZkTestBase.java:175)
	at org.apache.solr.cloud.AbstractDistribZkTestBase.waitForRecoveriesToFinish(AbstractDistribZkTestBase.java:125)
	at org.apache.solr.cloud.AbstractDistribZkTestBase.waitForRecoveriesToFinish(AbstractDistribZkTestBase.java:120)
	at org.apache.solr.cloud.BasicDistributedZkTest.testCoreUnloadAndLeaders(BasicDistributedZkTest.java:552)
	at org.apache.solr.cloud.BasicDistributedZkTest.doTest(BasicDistributedZkTest.java:337)
	at org.apache.solr.BaseDistributedSearchTestCase.testDistribSearch(BaseDistributedSearchTestCase.java:794)
	at sun.reflect.NativeMethodAccessorImpl.invoke0(Native Method)
	at sun.reflect.NativeMethodAccessorImpl.invoke(NativeMethodAccessorImpl.java:57)
	at sun.reflect.DelegatingMethodAccessorImpl.invoke(DelegatingMethodAccessorImpl.java:43)
	at java.lang.reflect.Method.invoke(Method.java:601)
	at com.carrotsearch.randomizedtesting.RandomizedRunner.invoke(RandomizedRunner.java:1559)
	at com.carrotsearch.randomizedtesting.RandomizedRunner.access$600(RandomizedRunner.java:79)
	at com.carrotsearch.randomizedtesting.RandomizedRunner$6.evaluate(RandomizedRunner.java:737)
	at com.carrotsearch.randomizedtesting.RandomizedRunner$7.evaluate(RandomizedRunner.java:773)
	at com.carrotsearch.randomizedtesting.RandomizedRunner$8.evaluate(RandomizedRunner.java:787)
	at com.carrotsearch.randomizedtesting.rules.SystemPropertiesRestoreRule$1.evaluate(SystemPropertiesRestoreRule.java:53)
	at org.apache.lucene.util.TestRuleSetupTeardownChained$1.evaluate(TestRuleSetupTeardownChained.java:50)
	at org.apache.lucene.util.TestRuleFieldCacheSanity$1.evaluate(TestRuleFieldCacheSanity.java:51)
	at org.apache.lucene.util.AbstractBeforeAfterRule$1.evaluate(AbstractBeforeAfterRule.java:46)
	at com.carrotsearch.randomizedtesting.rules.SystemPropertiesInvariantRule$1.evaluate(SystemPropertiesInvariantRule.java:55)
	at org.apache.lucene.util.TestRuleThreadAndTestName$1.evaluate(TestRuleThreadAndTestName.java:49)
	at org.apache.lucene.util.TestRuleIgnoreAfterMaxFailures$1.evaluate(TestRuleIgnoreAfterMaxFailures.java:70)
	at org.apache.lucene.util.TestRuleMarkFailure$1.evaluate(TestRuleMarkFailure.java:48)
	at com.carrotsearch.randomizedtesting.rules.StatementAdapter.evaluate(StatementAdapter.java:36)
	at com.carrotsearch.randomizedtesting.ThreadLeakControl$StatementRunner.run(ThreadLeakControl.java:358)
	at com.carrotsearch.randomizedtesting.ThreadLeakControl.forkTimeoutingTask(ThreadLeakControl.java:782)
	at com.carrotsearch.randomizedtesting.ThreadLeakControl$3.evaluate(ThreadLeakControl.java:442)
	at com.carrotsearch.randomizedtesting.RandomizedRunner.runSingleTest(RandomizedRunner.java:746)
	at com.carrotsearch.randomizedtesting.RandomizedRunner$3.evaluate(RandomizedRunner.java:648)
	at com.carrotsearch.randomizedtesting.RandomizedRunner$4.evaluate(RandomizedRunner.java:682)
	at com.carrotsearch.randomizedtesting.RandomizedRunner$5.evaluate(RandomizedRunner.java:693)
	at com.carrotsearch.randomizedtesting.rules.StatementAdapter.evaluate(StatementAdapter.java:36)
	at com.carrotsearch.randomizedtesting.rules.SystemPropertiesRestoreRule$1.evaluate(SystemPropertiesRestoreRule.java:53)
	at org.apache.lucene.util.AbstractBeforeAfterRule$1.evaluate(AbstractBeforeAfterRule.java:46)
	at org.apache.lucene.util.TestRuleStoreClassName$1.evaluate(TestRuleStoreClassName.java:42)
	at com.carrotsearch.randomizedtesting.rules.SystemPropertiesInvariantRule$1.evaluate(SystemPropertiesInvariantRule.java:55)
	at com.carrotsearch.randomizedtesting.rules.NoShadowingOrOverridesOnMethodsRule$1.evaluate(NoShadowingOrOverridesOnMethodsRule.java:39)
	at com.carrotsearch.randomizedtesting.rules.NoShadowingOrOverridesOnMethodsRule$1.evaluate(NoShadowingOrOverridesOnMethodsRule.java:39)
	at com.carrotsearch.randomizedtesting.rules.StatementAdapter.evaluate(StatementAdapter.java:36)
	at org.apache.lucene.util.TestRuleAssertionsRequired$1.evaluate(TestRuleAssertionsRequired.java:43)
	at org.apache.lucene.util.TestRuleMarkFailure$1.evaluate(TestRuleMarkFailure.java:48)
	at org.apache.lucene.util.TestRuleIgnoreAfterMaxFailures$1.evaluate(TestRuleIgnoreAfterMaxFailures.java:70)
	at org.apache.lucene.util.TestRuleIgnoreTestSuites$1.evaluate(TestRuleIgnoreTestSuites.java:55)
	at com.carrotsearch.randomizedtesting.rules.StatementAdapter.evaluate(StatementAdapter.java:36)
	at com.carrotsearch.randomizedtesting.ThreadLeakControl$StatementRunner.run(ThreadLeakControl.java:358)
	at java.lang.Thread.run(Thread.java:722)




Build Log:
[...truncated 8769 lines...]
[junit4:junit4] Suite: org.apache.solr.cloud.BasicDistributedZkTest
[junit4:junit4]   2> 0 T626 oas.BaseDistributedSearchTestCase.initHostContext Setting hostContext system property: /
[junit4:junit4]   2> 23 T626 oas.SolrTestCaseJ4.setUp ###Starting testDistribSearch
[junit4:junit4]   2> Creating dataDir: /Users/jenkins/jenkins-slave/workspace/Lucene-Solr-trunk-MacOSX/solr/build/solr-core/test/J0/./solrtest-BasicDistributedZkTest-1357067240683
[junit4:junit4]   2> 28 T626 oasc.ZkTestServer.run STARTING ZK TEST SERVER
[junit4:junit4]   2> 30 T627 oasc.ZkTestServer$ZKServerMain.runFromConfig Starting server
[junit4:junit4]   2> 33 T627 oazs.ZooKeeperServer.setTickTime tickTime set to 1000
[junit4:junit4]   2> 34 T627 oazs.ZooKeeperServer.setMinSessionTimeout minSessionTimeout set to -1
[junit4:junit4]   2> 34 T627 oazs.ZooKeeperServer.setMaxSessionTimeout maxSessionTimeout set to -1
[junit4:junit4]   2> 35 T627 oazs.NIOServerCnxnFactory.configure binding to port 0.0.0.0/0.0.0.0:0
[junit4:junit4]   2> 37 T627 oazsp.FileTxnSnapLog.save Snapshotting: 0x0 to /Users/jenkins/jenkins-slave/workspace/Lucene-Solr-trunk-MacOSX/solr/build/solr-core/test/J0/./org.apache.solr.cloud.BasicDistributedZkTest-1357067240682/zookeeper/server1/data/version-2/snapshot.0
[junit4:junit4]   2> 131 T626 oasc.ZkTestServer.run start zk server on port:49326
[junit4:junit4]   2> 132 T626 oaz.ZooKeeper.<init> Initiating client connection, connectString=127.0.0.1:49326 sessionTimeout=10000 watcher=org.apache.solr.common.cloud.ConnectionManager@25579446
[junit4:junit4]   2> 134 T626 oascc.ConnectionManager.waitForConnected Waiting for client to connect to ZooKeeper
[junit4:junit4]   2> 135 T632 oaz.ClientCnxn$SendThread.logStartConnect Opening socket connection to server localhost/127.0.0.1:49326. Will not attempt to authenticate using SASL (access denied ("javax.security.auth.AuthPermission" "getLoginConfiguration"))
[junit4:junit4]   2> 136 T632 oaz.ClientCnxn$SendThread.primeConnection Socket connection established to localhost/127.0.0.1:49326, initiating session
[junit4:junit4]   2> 137 T628 oazs.NIOServerCnxnFactory.run Accepted socket connection from /127.0.0.1:49327
[junit4:junit4]   2> 138 T628 oazs.ZooKeeperServer.processConnectRequest Client attempting to establish new session at /127.0.0.1:49327
[junit4:junit4]   2> 138 T630 oazsp.FileTxnLog.append Creating new log file: log.1
[junit4:junit4]   2> 148 T630 oazs.ZooKeeperServer.finishSessionInit Established session 0x13bf782c4f50000 with negotiated timeout 10000 for client /127.0.0.1:49327
[junit4:junit4]   2> 149 T632 oaz.ClientCnxn$SendThread.onConnected Session establishment complete on server localhost/127.0.0.1:49326, sessionid = 0x13bf782c4f50000, negotiated timeout = 10000
[junit4:junit4]   2> 154 T633 oascc.ConnectionManager.process Watcher org.apache.solr.common.cloud.ConnectionManager@25579446 name:ZooKeeperConnection Watcher:127.0.0.1:49326 got event WatchedEvent state:SyncConnected type:None path:null path:null type:None
[junit4:junit4]   2> 154 T626 oascc.ConnectionManager.waitForConnected Client is connected to ZooKeeper
[junit4:junit4]   2> 155 T626 oascc.SolrZkClient.makePath makePath: /solr
[junit4:junit4]   2> 161 T631 oazs.PrepRequestProcessor.pRequest2Txn Processed session termination for sessionid: 0x13bf782c4f50000
[junit4:junit4]   2> 165 T633 oaz.ClientCnxn$EventThread.run EventThread shut down
[junit4:junit4]   2> 165 T628 oazs.NIOServerCnxn.closeSock Closed socket connection for client /127.0.0.1:49327 which had sessionid 0x13bf782c4f50000
[junit4:junit4]   2> 166 T626 oaz.ZooKeeper.close Session: 0x13bf782c4f50000 closed
[junit4:junit4]   2> 168 T626 oaz.ZooKeeper.<init> Initiating client connection, connectString=127.0.0.1:49326/solr sessionTimeout=10000 watcher=org.apache.solr.common.cloud.ConnectionManager@4fcfb70d
[junit4:junit4]   2> 170 T626 oascc.ConnectionManager.waitForConnected Waiting for client to connect to ZooKeeper
[junit4:junit4]   2> 171 T634 oaz.ClientCnxn$SendThread.logStartConnect Opening socket connection to server localhost/127.0.0.1:49326. Will not attempt to authenticate using SASL (access denied ("javax.security.auth.AuthPermission" "getLoginConfiguration"))
[junit4:junit4]   2> 172 T634 oaz.ClientCnxn$SendThread.primeConnection Socket connection established to localhost/127.0.0.1:49326, initiating session
[junit4:junit4]   2> 173 T628 oazs.NIOServerCnxnFactory.run Accepted socket connection from /127.0.0.1:49328
[junit4:junit4]   2> 174 T628 oazs.ZooKeeperServer.processConnectRequest Client attempting to establish new session at /127.0.0.1:49328
[junit4:junit4]   2> 176 T630 oazs.ZooKeeperServer.finishSessionInit Established session 0x13bf782c4f50001 with negotiated timeout 10000 for client /127.0.0.1:49328
[junit4:junit4]   2> 177 T634 oaz.ClientCnxn$SendThread.onConnected Session establishment complete on server localhost/127.0.0.1:49326, sessionid = 0x13bf782c4f50001, negotiated timeout = 10000
[junit4:junit4]   2> 178 T635 oascc.ConnectionManager.process Watcher org.apache.solr.common.cloud.ConnectionManager@4fcfb70d name:ZooKeeperConnection Watcher:127.0.0.1:49326/solr got event WatchedEvent state:SyncConnected type:None path:null path:null type:None
[junit4:junit4]   2> 178 T626 oascc.ConnectionManager.waitForConnected Client is connected to ZooKeeper
[junit4:junit4]   2> 179 T626 oascc.SolrZkClient.makePath makePath: /collections/collection1
[junit4:junit4]   2> 188 T626 oascc.SolrZkClient.makePath makePath: /collections/collection1/shards
[junit4:junit4]   2> 195 T626 oascc.SolrZkClient.makePath makePath: /collections/control_collection
[junit4:junit4]   2> 201 T626 oascc.SolrZkClient.makePath makePath: /collections/control_collection/shards
[junit4:junit4]   2> 208 T626 oasc.AbstractZkTestCase.putConfig put /Users/jenkins/jenkins-slave/workspace/Lucene-Solr-trunk-MacOSX/solr/build/solr-core/test-files/solr/collection1/conf/solrconfig.xml to /configs/conf1/solrconfig.xml
[junit4:junit4]   2> 210 T626 oascc.SolrZkClient.makePath makePath: /configs/conf1/solrconfig.xml
[junit4:junit4]   2> 227 T626 oasc.AbstractZkTestCase.putConfig put /Users/jenkins/jenkins-slave/workspace/Lucene-Solr-trunk-MacOSX/solr/build/solr-core/test-files/solr/collection1/conf/schema.xml to /configs/conf1/schema.xml
[junit4:junit4]   2> 228 T626 oascc.SolrZkClient.makePath makePath: /configs/conf1/schema.xml
[junit4:junit4]   2> 242 T626 oasc.AbstractZkTestCase.putConfig put /Users/jenkins/jenkins-slave/workspace/Lucene-Solr-trunk-MacOSX/solr/build/solr-core/test-files/solr/collection1/conf/stopwords.txt to /configs/conf1/stopwords.txt
[junit4:junit4]   2> 243 T626 oascc.SolrZkClient.makePath makePath: /configs/conf1/stopwords.txt
[junit4:junit4]   2> 250 T626 oasc.AbstractZkTestCase.putConfig put /Users/jenkins/jenkins-slave/workspace/Lucene-Solr-trunk-MacOSX/solr/build/solr-core/test-files/solr/collection1/conf/protwords.txt to /configs/conf1/protwords.txt
[junit4:junit4]   2> 252 T626 oascc.SolrZkClient.makePath makePath: /configs/conf1/protwords.txt
[junit4:junit4]   2> 260 T626 oasc.AbstractZkTestCase.putConfig put /Users/jenkins/jenkins-slave/workspace/Lucene-Solr-trunk-MacOSX/solr/build/solr-core/test-files/solr/collection1/conf/currency.xml to /configs/conf1/currency.xml
[junit4:junit4]   2> 261 T626 oascc.SolrZkClient.makePath makePath: /configs/conf1/currency.xml
[junit4:junit4]   2> 268 T626 oasc.AbstractZkTestCase.putConfig put /Users/jenkins/jenkins-slave/workspace/Lucene-Solr-trunk-MacOSX/solr/build/solr-core/test-files/solr/collection1/conf/open-exchange-rates.json to /configs/conf1/open-exchange-rates.json
[junit4:junit4]   2> 270 T626 oascc.SolrZkClient.makePath makePath: /configs/conf1/open-exchange-rates.json
[junit4:junit4]   2> 285 T626 oasc.AbstractZkTestCase.putConfig put /Users/jenkins/jenkins-slave/workspace/Lucene-Solr-trunk-MacOSX/solr/build/solr-core/test-files/solr/collection1/conf/mapping-ISOLatin1Accent.txt to /configs/conf1/mapping-ISOLatin1Accent.txt
[junit4:junit4]   2> 286 T626 oascc.SolrZkClient.makePath makePath: /configs/conf1/mapping-ISOLatin1Accent.txt
[junit4:junit4]   2> 292 T626 oasc.AbstractZkTestCase.putConfig put /Users/jenkins/jenkins-slave/workspace/Lucene-Solr-trunk-MacOSX/solr/build/solr-core/test-files/solr/collection1/conf/old_synonyms.txt to /configs/conf1/old_synonyms.txt
[junit4:junit4]   2> 293 T626 oascc.SolrZkClient.makePath makePath: /configs/conf1/old_synonyms.txt
[junit4:junit4]   2> 303 T626 oasc.AbstractZkTestCase.putConfig put /Users/jenkins/jenkins-slave/workspace/Lucene-Solr-trunk-MacOSX/solr/build/solr-core/test-files/solr/collection1/conf/synonyms.txt to /configs/conf1/synonyms.txt
[junit4:junit4]   2> 304 T626 oascc.SolrZkClient.makePath makePath: /configs/conf1/synonyms.txt
[junit4:junit4]   2> 311 T631 oazs.PrepRequestProcessor.pRequest2Txn Processed session termination for sessionid: 0x13bf782c4f50001
[junit4:junit4]   2> 313 T628 oazs.NIOServerCnxn.closeSock Closed socket connection for client /127.0.0.1:49328 which had sessionid 0x13bf782c4f50001
[junit4:junit4]   2> 314 T635 oaz.ClientCnxn$EventThread.run EventThread shut down
[junit4:junit4]   2> 314 T626 oaz.ZooKeeper.close Session: 0x13bf782c4f50001 closed
[junit4:junit4]   2> 720 T626 oejs.Server.doStart jetty-8.1.8.v20121106
[junit4:junit4]   2> 732 T626 oejs.AbstractConnector.doStart Started SelectChannelConnector@127.0.0.1:49329
[junit4:junit4]   2> 733 T626 oasc.SolrResourceLoader.locateSolrHome JNDI not configured for solr (NoInitialContextEx)
[junit4:junit4]   2> 734 T626 oasc.SolrResourceLoader.locateSolrHome using system property solr.solr.home: /Users/jenkins/jenkins-slave/workspace/Lucene-Solr-trunk-MacOSX/solr/build/solr-core/test/J0/./org.apache.solr.cloud.BasicDistributedZkTest-controljetty-1357067240971
[junit4:junit4]   2> 735 T626 oasc.SolrResourceLoader.<init> new SolrResourceLoader for deduced Solr Home: '/Users/jenkins/jenkins-slave/workspace/Lucene-Solr-trunk-MacOSX/solr/build/solr-core/test/J0/./org.apache.solr.cloud.BasicDistributedZkTest-controljetty-1357067240971/'
[junit4:junit4]   2> 784 T626 oass.SolrDispatchFilter.init SolrDispatchFilter.init()
[junit4:junit4]   2> 785 T626 oasc.SolrResourceLoader.locateSolrHome JNDI not configured for solr (NoInitialContextEx)
[junit4:junit4]   2> 786 T626 oasc.SolrResourceLoader.locateSolrHome using system property solr.solr.home: /Users/jenkins/jenkins-slave/workspace/Lucene-Solr-trunk-MacOSX/solr/build/solr-core/test/J0/./org.apache.solr.cloud.BasicDistributedZkTest-controljetty-1357067240971
[junit4:junit4]   2> 786 T626 oasc.CoreContainer$Initializer.initialize looking for solr.xml: /Users/jenkins/jenkins-slave/workspace/Lucene-Solr-trunk-MacOSX/solr/build/solr-core/test/J0/./org.apache.solr.cloud.BasicDistributedZkTest-controljetty-1357067240971/solr.xml
[junit4:junit4]   2> 787 T626 oasc.CoreContainer.<init> New CoreContainer 1486018688
[junit4:junit4]   2> 788 T626 oasc.CoreContainer.load Loading CoreContainer using Solr Home: '/Users/jenkins/jenkins-slave/workspace/Lucene-Solr-trunk-MacOSX/solr/build/solr-core/test/J0/./org.apache.solr.cloud.BasicDistributedZkTest-controljetty-1357067240971/'
[junit4:junit4]   2> 789 T626 oasc.SolrResourceLoader.<init> new SolrResourceLoader for directory: '/Users/jenkins/jenkins-slave/workspace/Lucene-Solr-trunk-MacOSX/solr/build/solr-core/test/J0/./org.apache.solr.cloud.BasicDistributedZkTest-controljetty-1357067240971/'
[junit4:junit4]   2> 829 T626 oashc.HttpShardHandlerFactory.getParameter Setting socketTimeout to: 30000
[junit4:junit4]   2> 830 T626 oashc.HttpShardHandlerFactory.getParameter Setting urlScheme to: http://
[junit4:junit4]   2> 831 T626 oashc.HttpShardHandlerFactory.getParameter Setting connTimeout to: 15000
[junit4:junit4]   2> 831 T626 oashc.HttpShardHandlerFactory.getParameter Setting maxConnectionsPerHost to: 20
[junit4:junit4]   2> 832 T626 oashc.HttpShardHandlerFactory.getParameter Setting corePoolSize to: 0
[junit4:junit4]   2> 833 T626 oashc.HttpShardHandlerFactory.getParameter Setting maximumPoolSize to: 2147483647
[junit4:junit4]   2> 834 T626 oashc.HttpShardHandlerFactory.getParameter Setting maxThreadIdleTime to: 5
[junit4:junit4]   2> 835 T626 oashc.HttpShardHandlerFactory.getParameter Setting sizeOfQueue to: -1
[junit4:junit4]   2> 835 T626 oashc.HttpShardHandlerFactory.getParameter Setting fairnessPolicy to: false
[junit4:junit4]   2> 836 T626 oascsi.HttpClientUtil.createClient Creating new http client, config:maxConnectionsPerHost=20&maxConnections=10000&socketTimeout=30000&connTimeout=15000&retry=false
[junit4:junit4]   2> 865 T626 oasc.CoreContainer.load Registering Log Listener
[junit4:junit4]   2> 897 T626 oasc.CoreContainer.initZooKeeper Zookeeper client=127.0.0.1:49326/solr
[junit4:junit4]   2> 898 T626 oasc.ZkController.checkChrootPath zkHost includes chroot
[junit4:junit4]   2> 902 T626 oaz.ZooKeeper.<init> Initiating client connection, connectString=127.0.0.1:49326 sessionTimeout=60000 watcher=org.apache.solr.common.cloud.ConnectionManager@7cf2579c
[junit4:junit4]   2> 913 T626 oascc.ConnectionManager.waitForConnected Waiting for client to connect to ZooKeeper
[junit4:junit4]   2> 916 T645 oaz.ClientCnxn$SendThread.logStartConnect Opening socket connection to server localhost/127.0.0.1:49326. Will not attempt to authenticate using SASL (access denied ("javax.security.auth.AuthPermission" "getLoginConfiguration"))
[junit4:junit4]   2> 918 T645 oaz.ClientCnxn$SendThread.primeConnection Socket connection established to localhost/127.0.0.1:49326, initiating session
[junit4:junit4]   2> 919 T628 oazs.NIOServerCnxnFactory.run Accepted socket connection from /127.0.0.1:49330
[junit4:junit4]   2> 920 T628 oazs.ZooKeeperServer.processConnectRequest Client attempting to establish new session at /127.0.0.1:49330
[junit4:junit4]   2> 922 T630 oazs.ZooKeeperServer.finishSessionInit Established session 0x13bf782c4f50002 with negotiated timeout 20000 for client /127.0.0.1:49330
[junit4:junit4]   2> 922 T645 oaz.ClientCnxn$SendThread.onConnected Session establishment complete on server localhost/127.0.0.1:49326, sessionid = 0x13bf782c4f50002, negotiated timeout = 20000
[junit4:junit4]   2> 923 T646 oascc.ConnectionManager.process Watcher org.apache.solr.common.cloud.ConnectionManager@7cf2579c name:ZooKeeperConnection Watcher:127.0.0.1:49326 got event WatchedEvent state:SyncConnected type:None path:null path:null type:None
[junit4:junit4]   2> 923 T626 oascc.ConnectionManager.waitForConnected Client is connected to ZooKeeper
[junit4:junit4]   2> 926 T631 oazs.PrepRequestProcessor.pRequest2Txn Processed session termination for sessionid: 0x13bf782c4f50002
[junit4:junit4]   2> 928 T628 oazs.NIOServerCnxn.closeSock Closed socket connection for client /127.0.0.1:49330 which had sessionid 0x13bf782c4f50002
[junit4:junit4]   2> 929 T646 oaz.ClientCnxn$EventThread.run EventThread shut down
[junit4:junit4]   2> 929 T626 oaz.ZooKeeper.close Session: 0x13bf782c4f50002 closed
[junit4:junit4]   2> 931 T626 oascsi.HttpClientUtil.createClient Creating new http client, config:maxConnections=500&maxConnectionsPerHost=16&socketTimeout=15000&connTimeout=30000
[junit4:junit4]   2> 941 T626 oaz.ZooKeeper.<init> Initiating client connection, connectString=127.0.0.1:49326/solr sessionTimeout=30000 watcher=org.apache.solr.common.cloud.ConnectionManager@50b27cde
[junit4:junit4]   2> 943 T626 oascc.ConnectionManager.waitForConnected Waiting for client to connect to ZooKeeper
[junit4:junit4]   2> 944 T647 oaz.ClientCnxn$SendThread.logStartConnect Opening socket connection to server localhost/127.0.0.1:49326. Will not attempt to authenticate using SASL (access denied ("javax.security.auth.AuthPermission" "getLoginConfiguration"))
[junit4:junit4]   2> 945 T647 oaz.ClientCnxn$SendThread.primeConnection Socket connection established to localhost/127.0.0.1:49326, initiating session
[junit4:junit4]   2> 946 T628 oazs.NIOServerCnxnFactory.run Accepted socket connection from /127.0.0.1:49331
[junit4:junit4]   2> 947 T628 oazs.ZooKeeperServer.processConnectRequest Client attempting to establish new session at /127.0.0.1:49331
[junit4:junit4]   2> 949 T630 oazs.ZooKeeperServer.finishSessionInit Established session 0x13bf782c4f50003 with negotiated timeout 20000 for client /127.0.0.1:49331
[junit4:junit4]   2> 949 T647 oaz.ClientCnxn$SendThread.onConnected Session establishment complete on server localhost/127.0.0.1:49326, sessionid = 0x13bf782c4f50003, negotiated timeout = 20000
[junit4:junit4]   2> 950 T648 oascc.ConnectionManager.process Watcher org.apache.solr.common.cloud.ConnectionManager@50b27cde name:ZooKeeperConnection Watcher:127.0.0.1:49326/solr got event WatchedEvent state:SyncConnected type:None path:null path:null type:None
[junit4:junit4]   2> 950 T626 oascc.ConnectionManager.waitForConnected Client is connected to ZooKeeper
[junit4:junit4]   2> 953 T631 oazs.PrepRequestProcessor.pRequest Got user-level KeeperException when processing sessionid:0x13bf782c4f50003 type:create cxid:0x2 zxid:0x1a txntype:-1 reqpath:n/a Error Path:/solr/overseer Error:KeeperErrorCode = NodeExists for /solr/overseer
[junit4:junit4]   2> 955 T626 oascc.SolrZkClient.makePath makePath: /live_nodes
[junit4:junit4]   2> 959 T626 oasc.ZkController.createEphemeralLiveNode Register node as live in ZooKeeper:/live_nodes/127.0.0.1:49329_
[junit4:junit4]   2> 961 T631 oazs.PrepRequestProcessor.pRequest Got user-level KeeperException when processing sessionid:0x13bf782c4f50003 type:delete cxid:0x7 zxid:0x1c txntype:-1 reqpath:n/a Error Path:/solr/live_nodes/127.0.0.1:49329_ Error:KeeperErrorCode = NoNode for /solr/live_nodes/127.0.0.1:49329_
[junit4:junit4]   2> 963 T626 oascc.SolrZkClient.makePath makePath: /live_nodes/127.0.0.1:49329_
[junit4:junit4]   2> 969 T626 oascc.SolrZkClient.makePath makePath: /overseer_elect/election
[junit4:junit4]   2> 985 T631 oazs.PrepRequestProcessor.pRequest Got user-level KeeperException when processing sessionid:0x13bf782c4f50003 type:delete cxid:0x15 zxid:0x21 txntype:-1 reqpath:n/a Error Path:/solr/overseer_elect/leader Error:KeeperErrorCode = NoNode for /solr/overseer_elect/leader
[junit4:junit4]   2> 987 T626 oascc.SolrZkClient.makePath makePath: /overseer_elect/leader
[junit4:junit4]   2> 999 T626 oasc.Overseer.start Overseer (id=88936758686056451-127.0.0.1:49329_-n_0000000000) starting
[junit4:junit4]   2> 1001 T631 oazs.PrepRequestProcessor.pRequest Got user-level KeeperException when processing sessionid:0x13bf782c4f50003 type:create cxid:0x1a zxid:0x23 txntype:-1 reqpath:n/a Error Path:/solr/overseer Error:KeeperErrorCode = NodeExists for /solr/overseer
[junit4:junit4]   2> 1003 T631 oazs.PrepRequestProcessor.pRequest Got user-level KeeperException when processing sessionid:0x13bf782c4f50003 type:create cxid:0x1b zxid:0x24 txntype:-1 reqpath:n/a Error Path:/solr/overseer Error:KeeperErrorCode = NodeExists for /solr/overseer
[junit4:junit4]   2> 1005 T631 oazs.PrepRequestProcessor.pRequest Got user-level KeeperException when processing sessionid:0x13bf782c4f50003 type:create cxid:0x1c zxid:0x25 txntype:-1 reqpath:n/a Error Path:/solr/overseer Error:KeeperErrorCode = NodeExists for /solr/overseer
[junit4:junit4]   2> 1008 T631 oazs.PrepRequestProcessor.pRequest Got user-level KeeperException when processing sessionid:0x13bf782c4f50003 type:create cxid:0x1d zxid:0x26 txntype:-1 reqpath:n/a Error Path:/solr/overseer Error:KeeperErrorCode = NodeExists for /solr/overseer
[junit4:junit4]   2> 1010 T650 oasc.OverseerCollectionProcessor.run Process current queue of collection messages
[junit4:junit4]   2> 1015 T626 oascc.SolrZkClient.makePath makePath: /clusterstate.json
[junit4:junit4]   2> 1022 T626 oascc.ZkStateReader.createClusterStateWatchersAndUpdate Updating cluster state from ZooKeeper... 
[junit4:junit4]   2> 1032 T649 oasc.Overseer$ClusterStateUpdater.run Starting to work on the main queue
[junit4:junit4]   2> 1047 T651 oasc.CoreContainer.create Creating SolrCore 'collection1' using instanceDir: /Users/jenkins/jenkins-slave/workspace/Lucene-Solr-trunk-MacOSX/solr/build/solr-core/test/J0/./org.apache.solr.cloud.BasicDistributedZkTest-controljetty-1357067240971/collection1
[junit4:junit4]   2> 1048 T651 oasc.ZkController.createCollectionZkNode Check for collection zkNode:control_collection
[junit4:junit4]   2> 1053 T651 oasc.ZkController.createCollectionZkNode Collection zkNode exists
[junit4:junit4]   2> 1054 T651 oasc.ZkController.readConfigName Load collection config from:/collections/control_collection
[junit4:junit4]   2> 1062 T651 oasc.SolrResourceLoader.<init> new SolrResourceLoader for directory: '/Users/jenkins/jenkins-slave/workspace/Lucene-Solr-trunk-MacOSX/solr/build/solr-core/test/J0/./org.apache.solr.cloud.BasicDistributedZkTest-controljetty-1357067240971/collection1/'
[junit4:junit4]   2> 1064 T651 oasc.SolrResourceLoader.replaceClassLoader Adding 'file:/Users/jenkins/jenkins-slave/workspace/Lucene-Solr-trunk-MacOSX/solr/build/solr-core/test/J0/org.apache.solr.cloud.BasicDistributedZkTest-controljetty-1357067240971/collection1/lib/classes/' to classloader
[junit4:junit4]   2> 1065 T651 oasc.SolrResourceLoader.replaceClassLoader Adding 'file:/Users/jenkins/jenkins-slave/workspace/Lucene-Solr-trunk-MacOSX/solr/build/solr-core/test/J0/org.apache.solr.cloud.BasicDistributedZkTest-controljetty-1357067240971/collection1/lib/README' to classloader
[junit4:junit4]   2> 1165 T651 oasc.SolrConfig.<init> Using Lucene MatchVersion: LUCENE_50
[junit4:junit4]   2> 1312 T651 oasc.SolrConfig.<init> Loaded SolrConfig: solrconfig.xml
[junit4:junit4]   2> 1325 T651 oass.IndexSchema.readSchema Reading Solr Schema
[junit4:junit4]   2> 1340 T651 oass.IndexSchema.readSchema Schema name=test
[junit4:junit4]   2> 2571 T651 oass.OpenExchangeRatesOrgProvider.init Initialized with rates=open-exchange-rates.json, refreshInterval=1440.
[junit4:junit4]   2> 2618 T651 oass.IndexSchema.readSchema default search field in schema is text
[junit4:junit4]   2> 2626 T651 oass.IndexSchema.readSchema unique key field: id
[junit4:junit4]   2> 2681 T651 oass.FileExchangeRateProvider.reload Reloading exchange rates from file currency.xml
[junit4:junit4]   2> 2690 T651 oass.FileExchangeRateProvider.reload Reloading exchange rates from file currency.xml
[junit4:junit4]   2> 2700 T651 oass.OpenExchangeRatesOrgProvider.reload Reloading exchange rates from open-exchange-rates.json
[junit4:junit4]   2> 2704 T651 oass.OpenExchangeRatesOrgProvider.reload Reloading exchange rates from open-exchange-rates.json
[junit4:junit4]   2> 2708 T651 oasc.SolrCore.<init> [collection1] Opening new SolrCore at /Users/jenkins/jenkins-slave/workspace/Lucene-Solr-trunk-MacOSX/solr/build/solr-core/test/J0/./org.apache.solr.cloud.BasicDistributedZkTest-controljetty-1357067240971/collection1/, dataDir=./org.apache.solr.cloud.BasicDistributedZkTest-1357067240682/control/data/
[junit4:junit4]   2> 2709 T651 oasc.JmxMonitoredMap.<init> JMX monitoring is enabled. Adding Solr mbeans to JMX Server: com.sun.jmx.mbeanserver.JmxMBeanServer@90a1f5a
[junit4:junit4]   2> 2712 T651 oasc.SolrCore.initDirectoryFactory solr.StandardDirectoryFactory
[junit4:junit4]   2> 2757 T651 oasc.CachingDirectoryFactory.get return new directory for /Users/jenkins/jenkins-slave/workspace/Lucene-Solr-trunk-MacOSX/solr/build/solr-core/test/J0/./org.apache.solr.cloud.BasicDistributedZkTest-1357067240682/control/data forceNew:false
[junit4:junit4]   2> 2758 T651 oasc.CachingDirectoryFactory.close Releasing directory:/Users/jenkins/jenkins-slave/workspace/Lucene-Solr-trunk-MacOSX/solr/build/solr-core/test/J0/./org.apache.solr.cloud.BasicDistributedZkTest-1357067240682/control/data
[junit4:junit4]   2> 2758 T651 oasc.SolrCore.getNewIndexDir New index directory detected: old=null new=./org.apache.solr.cloud.BasicDistributedZkTest-1357067240682/control/data/index/
[junit4:junit4]   2> 2760 T651 oasc.SolrCore.initIndex WARNING [collection1] Solr index directory './org.apache.solr.cloud.BasicDistributedZkTest-1357067240682/control/data/index' doesn't exist. Creating new index...
[junit4:junit4]   2> 2761 T651 oasc.CachingDirectoryFactory.get return new directory for /Users/jenkins/jenkins-slave/workspace/Lucene-Solr-trunk-MacOSX/solr/build/solr-core/test/J0/./org.apache.solr.cloud.BasicDistributedZkTest-1357067240682/control/data/index forceNew:false
[junit4:junit4]   2> 2770 T651 oasc.SolrDeletionPolicy.onCommit SolrDeletionPolicy.onCommit: commits:num=1
[junit4:junit4]   2> 		commit{dir=RateLimitedDirectoryWrapper(org.apache.lucene.store.NIOFSDirectory@/Users/jenkins/jenkins-slave/workspace/Lucene-Solr-trunk-MacOSX/solr/build/solr-core/test/J0/org.apache.solr.cloud.BasicDistributedZkTest-1357067240682/control/data/index lockFactory=org.apache.lucene.store.NativeFSLockFactory@184f6cea),segFN=segments_1,generation=1,filenames=[segments_1]
[junit4:junit4]   2> 2771 T651 oasc.SolrDeletionPolicy.updateCommits newest commit = 1[segments_1]
[junit4:junit4]   2> 2772 T651 oasc.CachingDirectoryFactory.close Releasing directory:/Users/jenkins/jenkins-slave/workspace/Lucene-Solr-trunk-MacOSX/solr/build/solr-core/test/J0/./org.apache.solr.cloud.BasicDistributedZkTest-1357067240682/control/data/index
[junit4:junit4]   2> 2773 T651 oasc.SolrCore.initWriters created xml: solr.XMLResponseWriter
[junit4:junit4]   2> 2778 T651 oasup.UpdateRequestProcessorChain.init inserting DistributedUpdateProcessorFactory into updateRequestProcessorChain "dedupe"
[junit4:junit4]   2> 2779 T651 oasup.UpdateRequestProcessorChain.init inserting DistributedUpdateProcessorFactory into updateRequestProcessorChain "dedupe-allfields"
[junit4:junit4]   2> 2780 T651 oasup.UpdateRequestProcessorChain.init inserting DistributedUpdateProcessorFactory into updateRequestProcessorChain "stored_sig"
[junit4:junit4]   2> 2781 T651 oasup.UpdateRequestProcessorChain.init inserting DistributedUpdateProcessorFactory into updateRequestProcessorChain "uniq-fields"
[junit4:junit4]   2> 2783 T651 oasup.UpdateRequestProcessorChain.init inserting DistributedUpdateProcessorFactory into updateRequestProcessorChain "distrib-dup-test-chain-implicit"
[junit4:junit4]   2> 2783 T651 oasc.RequestHandlers.initHandlersFromConfig adding lazy requestHandler: solr.ReplicationHandler
[junit4:junit4]   2> 2784 T651 oasc.RequestHandlers.initHandlersFromConfig created /replication: solr.ReplicationHandler
[junit4:junit4]   2> 2785 T651 oasc.RequestHandlers.initHandlersFromConfig created standard: solr.StandardRequestHandler
[junit4:junit4]   2> 2785 T651 oasc.RequestHandlers.initHandlersFromConfig created /get: solr.RealTimeGetHandler
[junit4:junit4]   2> 2787 T651 oasc.RequestHandlers.initHandlersFromConfig created dismax: solr.SearchHandler
[junit4:junit4]   2> 2788 T651 oasc.RequestHandlers.initHandlersFromConfig created mock: org.apache.solr.core.MockQuerySenderListenerReqHandler
[junit4:junit4]   2> 2789 T651 oasc.RequestHandlers.initHandlersFromConfig created /admin/: org.apache.solr.handler.admin.AdminHandlers
[junit4:junit4]   2> 2789 T651 oasc.RequestHandlers.initHandlersFromConfig created defaults: solr.StandardRequestHandler
[junit4:junit4]   2> 2790 T651 oasc.RequestHandlers.initHandlersFromConfig adding lazy requestHandler: solr.StandardRequestHandler
[junit4:junit4]   2> 2791 T651 oasc.RequestHandlers.initHandlersFromConfig created lazy: solr.StandardRequestHandler
[junit4:junit4]   2> 2792 T651 oasc.RequestHandlers.initHandlersFromConfig created /update: solr.UpdateRequestHandler
[junit4:junit4]   2> 2792 T651 oasc.RequestHandlers.initHandlersFromConfig created /terms: org.apache.solr.handler.component.SearchHandler
[junit4:junit4]   2> 2793 T651 oasc.RequestHandlers.initHandlersFromConfig created spellCheckCompRH: org.apache.solr.handler.component.SearchHandler
[junit4:junit4]   2> 2794 T651 oasc.RequestHandlers.initHandlersFromConfig created spellCheckCompRH_Direct: org.apache.solr.handler.component.SearchHandler
[junit4:junit4]   2> 2795 T651 oasc.RequestHandlers.initHandlersFromConfig created spellCheckWithWordbreak: org.apache.solr.handler.component.SearchHandler
[junit4:junit4]   2> 2797 T651 oasc.RequestHandlers.initHandlersFromConfig created spellCheckWithWordbreak_Direct: org.apache.solr.handler.component.SearchHandler
[junit4:junit4]   2> 2798 T651 oasc.RequestHandlers.initHandlersFromConfig created spellCheckCompRH1: org.apache.solr.handler.component.SearchHandler
[junit4:junit4]   2> 2798 T651 oasc.RequestHandlers.initHandlersFromConfig created mltrh: org.apache.solr.handler.component.SearchHandler
[junit4:junit4]   2> 2799 T651 oasc.RequestHandlers.initHandlersFromConfig created tvrh: org.apache.solr.handler.component.SearchHandler
[junit4:junit4]   2> 2800 T651 oasc.RequestHandlers.initHandlersFromConfig created /mlt: solr.MoreLikeThisHandler
[junit4:junit4]   2> 2801 T651 oasc.RequestHandlers.initHandlersFromConfig created /debug/dump: solr.DumpRequestHandler
[junit4:junit4]   2> 2814 T651 oashl.XMLLoader.init xsltCacheLifetimeSeconds=60
[junit4:junit4]   2> 2820 T651 oasc.SolrCore.initDeprecatedSupport WARNING solrconfig.xml uses deprecated <admin/gettableFiles>, Please update your config to use the ShowFileRequestHandler.
[junit4:junit4]   2> 2822 T651 oasc.SolrCore.initDeprecatedSupport WARNING adding ShowFileRequestHandler with hidden files: [SCHEMA.XML, OLD_SYNONYMS.TXT, STOPWORDS.TXT, PROTWORDS.TXT, OPEN-EXCHANGE-RATES.JSON, SYNONYMS.TXT, CURRENCY.XML, MAPPING-ISOLATIN1ACCENT.TXT]
[junit4:junit4]   2> 2835 T651 oasc.CachingDirectoryFactory.close Releasing directory:/Users/jenkins/jenkins-slave/workspace/Lucene-Solr-trunk-MacOSX/solr/build/solr-core/test/J0/./org.apache.solr.cloud.BasicDistributedZkTest-1357067240682/control/data
[junit4:junit4]   2> 2838 T651 oass.SolrIndexSearcher.<init> Opening Searcher@f62c5fc main
[junit4:junit4]   2> 2841 T651 oasu.CommitTracker.<init> Hard AutoCommit: disabled
[junit4:junit4]   2> 2841 T651 oasu.CommitTracker.<init> Soft AutoCommit: disabled
[junit4:junit4]   2> 2843 T651 oashc.SpellCheckComponent.inform Initializing spell checkers
[junit4:junit4]   2> 2857 T651 oass.DirectSolrSpellChecker.init init: {name=direct,classname=DirectSolrSpellChecker,field=lowerfilt,minQueryLength=3}
[junit4:junit4]   2> 2904 T652 oasc.SolrCore.registerSearcher [collection1] Registered new searcher Searcher@f62c5fc main{StandardDirectoryReader(segments_1:1)}
[junit4:junit4]   2> 2922 T651 oasc.ZkController.publish publishing core=collection1 state=down
[junit4:junit4]   2> 2922 T651 oasc.ZkController.publish numShards not found on descriptor - reading it from system property
[junit4:junit4]   2> 2924 T631 oazs.PrepRequestProcessor.pRequest Got user-level KeeperException when processing sessionid:0x13bf782c4f50003 type:create cxid:0x53 zxid:0x29 txntype:-1 reqpath:n/a Error Path:/solr/overseer/queue Error:KeeperErrorCode = NoNode for /solr/overseer/queue
[junit4:junit4]   2> 3718 T113 oasc.OverseerCollectionProcessor.run WARNING Overseer cannot talk to ZK
[junit4:junit4]   2> 4045 T649 oascc.ZkStateReader.updateClusterState Updating cloud state from ZooKeeper... 
[junit4:junit4]   2> 4047 T649 oasc.Overseer$ClusterStateUpdater.updateState Update state numShards=1 message={
[junit4:junit4]   2> 	  "operation":"state",
[junit4:junit4]   2> 	  "numShards":"1",
[junit4:junit4]   2> 	  "shard":null,
[junit4:junit4]   2> 	  "roles":null,
[junit4:junit4]   2> 	  "state":"down",
[junit4:junit4]   2> 	  "core":"collection1",
[junit4:junit4]   2> 	  "collection":"control_collection",
[junit4:junit4]   2> 	  "node_name":"127.0.0.1:49329_",
[junit4:junit4]   2> 	  "base_url":"http://127.0.0.1:49329"}
[junit4:junit4]   2> 4048 T649 oasc.Overseer$ClusterStateUpdater.createCollection Create collection control_collection with numShards 1
[junit4:junit4]   2> 4048 T649 oasc.Overseer$ClusterStateUpdater.updateState Assigning new node to shard shard=shard1
[junit4:junit4]   2> 4050 T631 oazs.PrepRequestProcessor.pRequest Got user-level KeeperException when processing sessionid:0x13bf782c4f50003 type:create cxid:0x5b zxid:0x2c txntype:-1 reqpath:n/a Error Path:/solr/overseer/queue-work Error:KeeperErrorCode = NoNode for /solr/overseer/queue-work
[junit4:junit4]   2> 4063 T648 oascc.ZkStateReader$2.process A cluster state change: WatchedEvent state:SyncConnected type:NodeDataChanged path:/clusterstate.json, has occurred - updating... (live nodes size: 1)
[junit4:junit4]   2> 4933 T651 oasc.CoreContainer.registerCore registering core: collection1
[junit4:junit4]   2> 4934 T651 oasc.ZkController.register Register replica - core:collection1 address:http://127.0.0.1:49329 collection:control_collection shard:shard1
[junit4:junit4]   2> 4936 T651 oascc.SolrZkClient.makePath makePath: /collections/control_collection/leader_elect/shard1/election
[junit4:junit4]   2> 4965 T631 oazs.PrepRequestProcessor.pRequest Got user-level KeeperException when processing sessionid:0x13bf782c4f50003 type:delete cxid:0x75 zxid:0x36 txntype:-1 reqpath:n/a Error Path:/solr/collections/control_collection/leaders Error:KeeperErrorCode = NoNode for /solr/collections/control_collection/leaders
[junit4:junit4]   2> 4966 T651 oasc.ShardLeaderElectionContext.runLeaderProcess Running the leader process.
[junit4:junit4]   2> 4968 T631 oazs.PrepRequestProcessor.pRequest Got user-level KeeperException when processing sessionid:0x13bf782c4f50003 type:create cxid:0x76 zxid:0x37 txntype:-1 reqpath:n/a Error Path:/solr/overseer Error:KeeperErrorCode = NodeExists for /solr/overseer
[junit4:junit4]   2> 4972 T651 oasc.ShardLeaderElectionContext.waitForReplicasToComeUp Enough replicas found to continue.
[junit4:junit4]   2> 4972 T651 oasc.ShardLeaderElectionContext.runLeaderProcess I may be the new leader - try and sync
[junit4:junit4]   2> 4973 T651 oasc.SyncStrategy.sync Sync replicas to http://127.0.0.1:49329/collection1/
[junit4:junit4]   2> 4973 T651 oasc.SyncStrategy.syncReplicas Sync Success - now sync replicas to me
[junit4:junit4]   2> 4974 T651 oasc.SyncStrategy.syncToMe http://127.0.0.1:49329/collection1/ has no replicas
[junit4:junit4]   2> 4974 T651 oasc.ShardLeaderElectionContext.runLeaderProcess I am the new leader: http://127.0.0.1:49329/collection1/
[junit4:junit4]   2> 4975 T651 oascc.SolrZkClient.makePath makePath: /collections/control_collection/leaders/shard1
[junit4:junit4]   2> 4985 T631 oazs.PrepRequestProcessor.pRequest Got user-level KeeperException when processing sessionid:0x13bf782c4f50003 type:create cxid:0x80 zxid:0x3b txntype:-1 reqpath:n/a Error Path:/solr/overseer Error:KeeperErrorCode = NodeExists for /solr/overseer
[junit4:junit4]   2> 5575 T649 oascc.ZkStateReader.updateClusterState Updating cloud state from ZooKeeper... 
[junit4:junit4]   2> 5593 T648 oascc.ZkStateReader$2.process A cluster state change: WatchedEvent state:SyncConnected type:NodeDataChanged path:/clusterstate.json, has occurred - updating... (live nodes size: 1)
[junit4:junit4]   2> 5608 T651 oasc.ZkController.register We are http://127.0.0.1:49329/collection1/ and leader is http://127.0.0.1:49329/collection1/
[junit4:junit4]   2> 5608 T651 oasc.ZkController.register No LogReplay needed for core=collection1 baseURL=http://127.0.0.1:49329
[junit4:junit4]   2> 5609 T651 oasc.ZkController.checkRecovery I am the leader, no recovery necessary
[junit4:junit4]   2> 5609 T651 oasc.ZkController.publish publishing core=collection1 state=active
[junit4:junit4]   2> 5610 T651 oasc.ZkController.publish numShards not found on descriptor - reading it from system property
[junit4:junit4]   2> 5613 T651 oascc.ZkStateReader.updateClusterState Updating cloud state from ZooKeeper... 
[junit4:junit4]   2> 5618 T626 oass.SolrDispatchFilter.init user.dir=/Users/jenkins/jenkins-slave/workspace/Lucene-Solr-trunk-MacOSX/solr/build/solr-core/test/J0
[junit4:junit4]   2> 5619 T626 oass.SolrDispatchFilter.init SolrDispatchFilter.init() done
[junit4:junit4]   2> 5628 T121 oasc.OverseerCollectionProcessor.run WARNING Overseer cannot talk to ZK
[junit4:junit4]   2> 5622 T626 oascsi.HttpClientUtil.createClient Creating new http client, config:maxConnections=128&maxConnectionsPerHost=32&followRedirects=false
[junit4:junit4]   2> 5644 T626 oascsi.HttpClientUtil.createClient Creating new http client, config:
[junit4:junit4]   2> 5656 T626 oaz.ZooKeeper.<init> Initiating client connection, connectString=127.0.0.1:49326/solr sessionTimeout=10000 watcher=org.apache.solr.common.cloud.ConnectionManager@3abd5626
[junit4:junit4]   2> 5657 T626 oascc.ConnectionManager.waitForConnected Waiting for client to connect to ZooKeeper
[junit4:junit4]   2> 5658 T653 oaz.ClientCnxn$SendThread.logStartConnect Opening socket connection to server localhost/127.0.0.1:49326. Will not attempt to authenticate using SASL (access denied ("javax.security.auth.AuthPermission" "getLoginConfiguration"))
[junit4:junit4]   2> 5659 T653 oaz.ClientCnxn$SendThread.primeConnection Socket connection established to localhost/127.0.0.1:49326, initiating session
[junit4:junit4]   2> 5659 T628 oazs.NIOServerCnxnFactory.run Accepted socket connection from /127.0.0.1:49332
[junit4:junit4]   2> 5660 T628 oazs.ZooKeeperServer.processConnectRequest Client attempting to establish new session at /127.0.0.1:49332
[junit4:junit4]   2> 5662 T630 oazs.ZooKeeperServer.finishSessionInit Established session 0x13bf782c4f50004 with negotiated timeout 10000 for client /127.0.0.1:49332
[junit4:junit4]   2> 5663 T653 oaz.ClientCnxn$SendThread.onConnected Session establishment complete on server localhost/127.0.0.1:49326, sessionid = 0x13bf782c4f50004, negotiated timeout = 10000
[junit4:junit4]   2> 5664 T654 oascc.ConnectionManager.process Watcher org.apache.solr.common.cloud.ConnectionManager@3abd5626 name:ZooKeeperConnection Watcher:127.0.0.1:49326/solr got event WatchedEvent state:SyncConnected type:None path:null path:null type:None
[junit4:junit4]   2> 5664 T626 oascc.ConnectionManager.waitForConnected Client is connected to ZooKeeper
[junit4:junit4]   2> 5666 T626 oascc.ZkStateReader.createClusterStateWatchersAndUpdate Updating cluster state from ZooKeeper... 
[junit4:junit4]   2> 5674 T626 oasc.ChaosMonkey.monkeyLog monkey: init - expire sessions:true cause connection loss:true
[junit4:junit4]   2> 5982 T626 oejs.Server.doStart jetty-8.1.8.v20121106
[junit4:junit4]   2> 6022 T626 oejs.AbstractConnector.doStart Started SelectChannelConnector@127.0.0.1:49333
[junit4:junit4]   2> 6025 T626 oasc.SolrResourceLoader.locateSolrHome JNDI not configured for solr (NoInitialContextEx)
[junit4:junit4]   2> 6026 T626 oasc.SolrResourceLoader.locateSolrHome using system property solr.solr.home: /Users/jenkins/jenkins-slave/workspace/Lucene-Solr-trunk-MacOSX/solr/build/solr-core/test/J0/./org.apache.solr.cloud.BasicDistributedZkTest-jetty1-1357067246330
[junit4:junit4]   2> 6027 T626 oasc.SolrResourceLoader.<init> new SolrResourceLoader for deduced Solr Home: '/Users/jenkins/jenkins-slave/workspace/Lucene-Solr-trunk-MacOSX/solr/build/solr-core/test/J0/./org.apache.solr.cloud.BasicDistributedZkTest-jetty1-1357067246330/'
[junit4:junit4]   2> 6072 T626 oass.SolrDispatchFilter.init SolrDispatchFilter.init()
[junit4:junit4]   2> 6073 T626 oasc.SolrResourceLoader.locateSolrHome JNDI not configured for solr (NoInitialContextEx)
[junit4:junit4]   2> 6073 T626 oasc.SolrResourceLoader.locateSolrHome using system property solr.solr.home: /Users/jenkins/jenkins-slave/workspace/Lucene-Solr-trunk-MacOSX/solr/build/solr-core/test/J0/./org.apache.solr.cloud.BasicDistributedZkTest-jetty1-1357067246330
[junit4:junit4]   2> 6074 T626 oasc.CoreContainer$Initializer.initialize looking for solr.xml: /Users/jenkins/jenkins-slave/workspace/Lucene-Solr-trunk-MacOSX/solr/build/solr-core/test/J0/./org.apache.solr.cloud.BasicDistributedZkTest-jetty1-1357067246330/solr.xml
[junit4:junit4]   2> 6074 T626 oasc.CoreContainer.<init> New CoreContainer 347405995
[junit4:junit4]   2> 6075 T626 oasc.CoreContainer.load Loading CoreContainer using Solr Home: '/Users/jenkins/jenkins-slave/workspace/Lucene-Solr-trunk-MacOSX/solr/build/solr-core/test/J0/./org.apache.solr.cloud.BasicDistributedZkTest-jetty1-1357067246330/'
[junit4:junit4]   2> 6075 T626 oasc.SolrResourceLoader.<init> new SolrResourceLoader for directory: '/Users/jenkins/jenkins-slave/workspace/Lucene-Solr-trunk-MacOSX/solr/build/solr-core/test/J0/./org.apache.solr.cloud.BasicDistributedZkTest-jetty1-1357067246330/'
[junit4:junit4]   2> 6110 T626 oashc.HttpShardHandlerFactory.getParameter Setting socketTimeout to: 30000
[junit4:junit4]   2> 6111 T626 oashc.HttpShardHandlerFactory.getParameter Setting urlScheme to: http://
[junit4:junit4]   2> 6112 T626 oashc.HttpShardHandlerFactory.getParameter Setting connTimeout to: 15000
[junit4:junit4]   2> 6112 T626 oashc.HttpShardHandlerFactory.getParameter Setting maxConnectionsPerHost to: 20
[junit4:junit4]   2> 6113 T626 oashc.HttpShardHandlerFactory.getParameter Setting corePoolSize to: 0
[junit4:junit4]   2> 6113 T626 oashc.HttpShardHandlerFactory.getParameter Setting maximumPoolSize to: 2147483647
[junit4:junit4]   2> 6114 T626 oashc.HttpShardHandlerFactory.getParameter Setting maxThreadIdleTime to: 5
[junit4:junit4]   2> 6114 T626 oashc.HttpShardHandlerFactory.getParameter Setting sizeOfQueue to: -1
[junit4:junit4]   2> 6117 T626 oashc.HttpShardHandlerFactory.getParameter Setting fairnessPolicy to: false
[junit4:junit4]   2> 6120 T626 oascsi.HttpClientUtil.createClient Creating new http client, config:maxConnectionsPerHost=20&maxConnections=10000&socketTimeout=30000&connTimeout=15000&retry=false
[junit4:junit4]   2> 6145 T626 oasc.CoreContainer.load Registering Log Listener
[junit4:junit4]   2> 6171 T626 oasc.CoreContainer.initZooKeeper Zookeeper client=127.0.0.1:49326/solr
[junit4:junit4]   2> 6172 T626 oasc.ZkController.checkChrootPath zkHost includes chroot
[junit4:junit4]   2> 6172 T626 oaz.ZooKeeper.<init> Initiating client connection, connectString=127.0.0.1:49326 sessionTimeout=60000 watcher=org.apache.solr.common.cloud.ConnectionManager@22bf1acf
[junit4:junit4]   2> 6175 T664 oaz.ClientCnxn$SendThread.logStartConnect Opening socket connection to server localhost/127.0.0.1:49326. Will not attempt to authenticate using SASL (access denied ("javax.security.auth.AuthPermission" "getLoginConfiguration"))
[junit4:junit4]   2> 6179 T664 oaz.ClientCnxn$SendThread.primeConnection Socket connection established to localhost/127.0.0.1:49326, initiating session
[junit4:junit4]   2> 6175 T626 oascc.ConnectionManager.waitForConnected Waiting for client to connect to ZooKeeper
[junit4:junit4]   2> 6184 T628 oazs.NIOServerCnxnFactory.run Accepted socket connection from /127.0.0.1:49334
[junit4:junit4]   2> 6185 T628 oazs.ZooKeeperServer.processConnectRequest Client attempting to establish new session at /127.0.0.1:49334
[junit4:junit4]   2> 6186 T630 oazs.ZooKeeperServer.finishSessionInit Established session 0x13bf782c4f50005 with negotiated timeout 20000 for client /127.0.0.1:49334
[junit4:junit4]   2> 6187 T664 oaz.ClientCnxn$SendThread.onConnected Session establishment complete on server localhost/127.0.0.1:49326, sessionid = 0x13bf782c4f50005, negotiated timeout = 20000
[junit4:junit4]   2> 6187 T665 oascc.ConnectionManager.process Watcher org.apache.solr.common.cloud.ConnectionManager@22bf1acf name:ZooKeeperConnection Watcher:127.0.0.1:49326 got event WatchedEvent state:SyncConnected type:None path:null path:null type:None
[junit4:junit4]   2> 6188 T626 oascc.ConnectionManager.waitForConnected Client is connected to ZooKeeper
[junit4:junit4]   2> 6190 T631 oazs.PrepRequestProcessor.pRequest2Txn Processed session termination for sessionid: 0x13bf782c4f50005
[junit4:junit4]   2> 6192 T628 oazs.NIOServerCnxn.closeSock Closed socket connection for client /127.0.0.1:49334 which had sessionid 0x13bf782c4f50005
[junit4:junit4]   2> 6193 T665 oaz.ClientCnxn$EventThread.run EventThread shut down
[junit4:junit4]   2> 6193 T626 oaz.ZooKeeper.close Session: 0x13bf782c4f50005 closed
[junit4:junit4]   2> 6198 T626 oascsi.HttpClientUtil.createClient Creating new http client, config:maxConnections=500&maxConnectionsPerHost=16&socketTimeout=15000&connTimeout=30000
[junit4:junit4]   2> 6215 T626 oaz.ZooKeeper.<init> Initiating client connection, connectString=127.0.0.1:49326/solr sessionTimeout=30000 watcher=org.apache.solr.common.cloud.ConnectionManager@400cae10
[junit4:junit4]   2> 6219 T666 oaz.ClientCnxn$SendThread.logStartConnect Opening socket connection to server localhost/127.0.0.1:49326. Will not attempt to authenticate using SASL (access denied ("javax.security.auth.AuthPermission" "getLoginConfiguration"))
[junit4:junit4]   2> 6220 T626 oascc.ConnectionManager.waitForConnected Waiting for client to connect to ZooKeeper
[junit4:junit4]   2> 6221 T666 oaz.ClientCnxn$SendThread.primeConnection Socket connection established to localhost/127.0.0.1:49326, initiating session
[junit4:junit4]   2> 6224 T628 oazs.NIOServerCnxnFactory.run Accepted socket connection from /127.0.0.1:49335
[junit4:junit4]   2> 6225 T628 oazs.ZooKeeperServer.processConnectRequest Client attempting to establish new session at /127.0.0.1:49335
[junit4:junit4]   2> 6227 T630 oazs.ZooKeeperServer.finishSessionInit Established session 0x13bf782c4f50006 with negotiated timeout 20000 for client /127.0.0.1:49335
[junit4:junit4]   2> 6228 T666 oaz.ClientCnxn$SendThread.onConnected Session establishment complete on server localhost/127.0.0.1:49326, sessionid = 0x13bf782c4f50006, negotiated timeout = 20000
[junit4:junit4]   2> 6228 T667 oascc.ConnectionManager.process Watcher org.apache.solr.common.cloud.ConnectionManager@400cae10 name:ZooKeeperConnection Watcher:127.0.0.1:49326/solr got event WatchedEvent state:SyncConnected type:None path:null path:null type:None
[junit4:junit4]   2> 6229 T626 oascc.ConnectionManager.waitForConnected Client is connected to ZooKeeper
[junit4:junit4]   2> 6230 T631 oazs.PrepRequestProcessor.pRequest Got user-level KeeperException when processing sessionid:0x13bf782c4f50006 type:create cxid:0x1 zxid:0x49 txntype:-1 reqpath:n/a Error Path:/solr/overseer Error:KeeperErrorCode = NodeExists for /solr/overseer
[junit4:junit4]   2> 6233 T631 oazs.PrepRequestProcessor.pRequest Got user-level KeeperException when processing sessionid:0x13bf782c4f50006 type:create cxid:0x2 zxid:0x4a txntype:-1 reqpath:n/a Error Path:/solr/overseer Error:KeeperErrorCode = NodeExists for /solr/overseer
[junit4:junit4]   2> 6236 T626 oasc.ZkController.createEphemeralLiveNode Register node as live in ZooKeeper:/live_nodes/127.0.0.1:49333_
[junit4:junit4]   2> 6237 T631 oazs.PrepRequestProcessor.pRequest Got user-level KeeperException when processing sessionid:0x13bf782c4f50006 type:delete cxid:0x4 zxid:0x4b txntype:-1 reqpath:n/a Error Path:/solr/live_nodes/127.0.0.1:49333_ Error:KeeperErrorCode = NoNode for /solr/live_nodes/127.0.0.1:49333_
[junit4:junit4]   2> 6238 T626 oascc.SolrZkClient.makePath makePath: /live_nodes/127.0.0.1:49333_
[junit4:junit4]   2> 6244 T648 oascc.ZkStateReader$2.process A cluster state change: WatchedEvent state:SyncConnected type:NodeChildrenChanged path:/live_nodes, has occurred - updating... (live nodes size: 1)
[junit4:junit4]   2> 6248 T654 oascc.ZkStateReader$3.process Updating live nodes... (2)
[junit4:junit4]   2> 6262 T648 oascc.ZkStateReader$3.process Updating live nodes... (2)
[junit4:junit4]   2> 6266 T626 oascc.ZkStateReader.createClusterStateWatchersAndUpdate Updating cluster state from ZooKeeper... 
[junit4:junit4]   2> 6280 T668 oasc.CoreContainer.create Creating SolrCore 'collection1' using instanceDir: /Users/jenkins/jenkins-slave/workspace/Lucene-Solr-trunk-MacOSX/solr/build/solr-core/test/J0/./org.apache.solr.cloud.BasicDistributedZkTest-jetty1-1357067246330/collection1
[junit4:junit4]   2> 6280 T668 oasc.ZkController.createCollectionZkNode Check for collection zkNode:collection1
[junit4:junit4]   2> 6282 T668 oasc.ZkController.createCollectionZkNode Collection zkNode exists
[junit4:junit4]   2> 6282 T668 oasc.ZkController.readConfigName Load collection config from:/collections/collection1
[junit4:junit4]   2> 6285 T668 oasc.SolrResourceLoader.<init> new SolrResourceLoader for directory: '/Users/jenkins/jenkins-slave/workspace/Lucene-Solr-trunk-MacOSX/solr/build/solr-core/test/J0/./org.apache.solr.cloud.BasicDistributedZkTest-jetty1-1357067246330/collection1/'
[junit4:junit4]   2> 6287 T668 oasc.SolrResourceLoader.replaceClassLoader Adding 'file:/Users/jenkins/jenkins-slave/workspace/Lucene-Solr-trunk-MacOSX/solr/build/solr-core/test/J0/org.apache.solr.cloud.BasicDistributedZkTest-jetty1-1357067246330/collection1/lib/classes/' to classloader
[junit4:junit4]   2> 6288 T668 oasc.SolrResourceLoader.replaceClassLoader Adding 'file:/Users/jenkins/jenkins-slave/workspace/Lucene-Solr-trunk-MacOSX/solr/build/solr-core/test/J0/org.apache.solr.cloud.BasicDistributedZkTest-jetty1-1357067246330/collection1/lib/README' to classloader
[junit4:junit4]   2> 6447 T668 oasc.SolrConfig.<init> Using Lucene MatchVersion: LUCENE_50
[junit4:junit4]   2> 6591 T668 oasc.SolrConfig.<init> Loaded SolrConfig: solrconfig.xml
[junit4:junit4]   2> 6594 T668 oass.IndexSchema.readSchema Reading Solr Schema
[junit4:junit4]   2> 6608 T668 oass.IndexSchema.readSchema Schema name=test
[junit4:junit4]   2> 7130 T649 oascc.ZkStateReader.updateClusterState Updating cloud state from ZooKeeper... 
[junit4:junit4]   2> 7132 T649 oasc.Overseer$ClusterStateUpdater.updateState Update state numShards=1 message={
[junit4:junit4]   2> 	  "operation":"state",
[junit4:junit4]   2> 	  "numShards":"1",
[junit4:junit4]   2> 	  "shard":"shard1",
[junit4:junit4]   2> 	  "roles":null,
[junit4:junit4]   2> 	  "state":"active",
[junit4:junit4]   2> 	  "core":"collection1",
[junit4:junit4]   2> 	  "collection":"control_collection",
[junit4:junit4]   2> 	  "node_name":"127.0.0.1:49329_",
[junit4:junit4]   2> 	  "base_url":"http://127.0.0.1:49329"}
[junit4:junit4]   2> 7145 T667 oascc.ZkStateReader$2.process A cluster state change: WatchedEvent state:SyncConnected type:NodeDataChanged path:/clusterstate.json, has occurred - updating... (live nodes size: 2)
[junit4:junit4]   2> 7146 T648 oascc.ZkStateReader$2.process A cluster state change: WatchedEvent state:SyncConnected type:NodeDataChanged path:/clusterstate.json, has occurred - updating... (live nodes size: 2)
[junit4:junit4]   2> 7146 T654 oascc.ZkStateReader$2.process A cluster state change: WatchedEvent state:SyncConnected type:NodeDataChanged path:/clusterstate.json, has occurred - updating... (live nodes size: 2)
[junit4:junit4]   2> 7573 T129 oasc.OverseerCollectionProcessor.run WARNING Overseer cannot talk to ZK
[junit4:junit4]   2> 7667 T668 oass.OpenExchangeRatesOrgProvider.init Initialized with rates=open-exchange-rates.json, refreshInterval=1440.
[junit4:junit4]   2> 7686 T668 oass.IndexSchema.readSchema default search field in schema is text
[junit4:junit4]   2> 7693 T668 oass.IndexSchema.readSchema unique key field: id
[junit4:junit4]   2> 7744 T668 oass.FileExchangeRateProvider.reload Reloading exchange rates from file currency.xml
[junit4:junit4]   2> 7757 T668 oass.FileExchangeRateProvider.reload Reloading exchange rates from file currency.xml
[junit4:junit4]   2> 7791 T668 oass.OpenExchangeRatesOrgProvider.reload Reloading exchange rates from open-exchange-rates.json
[junit4:junit4]   2> 7795 T668 oass.OpenExchangeRatesOrgProvider.reload Reloading exchange rates from open-exchange-rates.json
[junit4:junit4]   2> 7799 T668 oasc.SolrCore.<init> [collection1] Opening new SolrCore at /Users/jenkins/jenkins-slave/workspace/Lucene-Solr-trunk-MacOSX/solr/build/solr-core/test/J0/./org.apache.solr.cloud.BasicDistributedZkTest-jetty1-1357067246330/collection1/, dataDir=./org.apache.solr.cloud.BasicDistributedZkTest-1357067240682/jetty1/
[junit4:junit4]   2> 7800 T668 oasc.JmxMonitoredMap.<init> JMX monitoring is enabled. Adding Solr mbeans to JMX Server: com.sun.jmx.mbeanserver.JmxMBeanServer@90a1f5a
[junit4:junit4]   2> 7801 T668 oasc.SolrCore.initDirectoryFactory solr.StandardDirectoryFactory
[junit4:junit4]   2> 7802 T668 oasc.CachingDirectoryFactory.get return new directory for /Users/jenkins/jenkins-slave/workspace/Lucene-Solr-trunk-MacOSX/solr/build/solr-core/test/J0/./org.apache.solr.cloud.BasicDistributedZkTest-1357067240682/jetty1 forceNew:false
[junit4:junit4]   2> 7803 T668 oasc.CachingDirectoryFactory.close Releasing directory:/Users/jenkins/jenkins-slave/workspace/Lucene-Solr-trunk-MacOSX/solr/build/solr-core/test/J0/./org.apache.solr.cloud.BasicDistributedZkTest-1357067240682/jetty1
[junit4:junit4]   2> 7803 T668 oasc.SolrCore.getNewIndexDir New index directory detected: old=null new=./org.apache.solr.cloud.BasicDistributedZkTest-1357067240682/jetty1/index/
[junit4:junit4]   2> 7804 T668 oasc.SolrCore.initIndex WARNING [collection1] Solr index directory './org.apache.solr.cloud.BasicDistributedZkTest-1357067240682/jetty1/index' doesn't exist. Creating new index...
[junit4:junit4]   2> 7806 T668 oasc.CachingDirectoryFactory.get return new directory for /Users/jenkins/jenkins-slave/workspace/Lucene-Solr-trunk-MacOSX/solr/build/solr-core/test/J0/./org.apache.solr.cloud.BasicDistributedZkTest-1357067240682/jetty1/index forceNew:false
[junit4:junit4]   2> 7813 T668 oasc.SolrDeletionPolicy.onCommit SolrDeletionPolicy.onCommit: commits:num=1
[junit4:junit4]   2> 		commit{dir=RateLimitedDirectoryWrapper(org.apache.lucene.store.NIOFSDirectory@/Users/jenkins/jenkins-slave/workspace/Lucene-Solr-trunk-MacOSX/solr/build/solr-core/test/J0/org.apache.solr.cloud.BasicDistributedZkTest-1357067240682/jetty1/index lockFactory=org.apache.lucene.store.NativeFSLockFactory@763812b1),segFN=segments_1,generation=1,filenames=[segments_1]
[junit4:junit4]   2> 7814 T668 oasc.SolrDeletionPolicy.updateCommits newest commit = 1[segments_1]
[junit4:junit4]   2> 7815 T668 oasc.CachingDirectoryFactory.close Releasing directory:/Users/jenkins/jenkins-slave/workspace/Lucene-Solr-trunk-MacOSX/solr/build/solr-core/test/J0/./org.apache.solr.cloud.BasicDistributedZkTest-1357067240682/jetty1/index
[junit4:junit4]   2> 7816 T668 oasc.SolrCore.initWriters created xml: solr.XMLResponseWriter
[junit4:junit4]   2> 7822 T668 oasup.UpdateRequestProcessorChain.init inserting DistributedUpdateProcessorFactory into updateRequestProcessorChain "dedupe"
[junit4:junit4]   2> 7823 T668 oasup.UpdateRequestProcessorChain.init inserting DistributedUpdateProcessorFactory into updateRequestProcessorChain "dedupe-allfields"
[junit4:junit4]   2> 7824 T668 oasup.UpdateRequestProcessorChain.init inserting DistributedUpdateProcessorFactory into updateRequestProcessorChain "stored_sig"
[junit4:junit4]   2> 7825 T668 oasup.UpdateRequestProcessorChain.init inserting DistributedUpdateProcessorFactory into updateRequestProcessorChain "uniq-fields"
[junit4:junit4]   2> 7827 T668 oasup.UpdateRequestProcessorChain.init inserting DistributedUpdateProcessorFactory into updateRequestProcessorChain "distrib-dup-test-chain-implicit"
[junit4:junit4]   2> 7827 T668 oasc.RequestHandlers.initHandlersFromConfig adding lazy requestHandler: solr.ReplicationHandler
[junit4:junit4]   2> 7828 T668 oasc.RequestHandlers.initHandlersFromConfig created /replication: solr.ReplicationHandler
[junit4:junit4]   2> 7829 T668 oasc.RequestHandlers.initHandlersFromConfig created standard: solr.StandardRequestHandler
[junit4:junit4]   2> 7831 T668 oasc.RequestHandlers.initHandlersFromConfig created /get: solr.RealTimeGetHandler
[junit4:junit4]   2> 7837 T668 oasc.RequestHandlers.initHandlersFromConfig created dismax: solr.SearchHandler
[junit4:junit4]   2> 7839 T668 oasc.RequestHandlers.initHandlersFromConfig created mock: org.apache.solr.core.MockQuerySenderListenerReqHandler
[junit4:junit4]   2> 7840 T668 oasc.RequestHandlers.initHandlersFromConfig created /admin/: org.apache.solr.handler.admin.AdminHandlers
[junit4:junit4]   2> 7841 T668 oasc.RequestHandlers.initHandlersFromConfig created defaults: solr.StandardRequestHandler
[junit4:junit4]   2> 7842 T668 oasc.RequestHandlers.initHandlersFromConfig adding lazy requestHandler: solr.StandardRequestHandler
[junit4:junit4]   2> 7843 T668 oasc.RequestHandlers.initHandlersFromConfig created lazy: solr.StandardRequestHandler
[junit4:junit4]   2> 7844 T668 oasc.RequestHandlers.initHandlersFromConfig created /update: solr.UpdateRequestHandler
[junit4:junit4]   2> 7845 T668 oasc.RequestHandlers.initHandlersFromConfig created /terms: org.apache.solr.handler.component.SearchHandler
[junit4:junit4]   2> 7846 T668 oasc.RequestHandlers.initHandlersFromConfig created spellCheckCompRH: org.apache.solr.handler.component.SearchHandler
[junit4:junit4]   2> 7847 T668 oasc.RequestHandlers.initHandlersFromConfig created spellCheckCompRH_Direct: org.apache.solr.handler.component.SearchHandler
[junit4:junit4]   2> 7848 T668 oasc.RequestHandlers.initHandlersFromConfig created spellCheckWithWordbreak: org.apache.solr.handler.component.SearchHandler
[junit4:junit4]   2> 7849 T668 oasc.RequestHandlers.initHandlersFromConfig created spellCheckWithWordbreak_Direct: org.apache.solr.handler.component.SearchHandler
[junit4:junit4]   2> 7850 T668 oasc.RequestHandlers.initHandlersFromConfig created spellCheckCompRH1: org.apache.solr.handler.component.SearchHandler
[junit4:junit4]   2> 7850 T668 oasc.RequestHandlers.initHandlersFromConfig created mltrh: org.apache.solr.handler.component.SearchHandler
[junit4:junit4]   2> 7851 T668 oasc.RequestHandlers.initHandlersFromConfig created tvrh: org.apache.solr.handler.component.SearchHandler
[junit4:junit4]   2> 7855 T668 oasc.RequestHandlers.initHandlersFromConfig created /mlt: solr.MoreLikeThisHandler
[junit4:junit4]   2> 7856 T668 oasc.RequestHandlers.initHandlersFromConfig created /debug/dump: solr.DumpRequestHandler
[junit4:junit4]   2> 7868 T668 oashl.XMLLoader.init xsltCacheLifetimeSeconds=60
[junit4:junit4]   2> 7874 T668 oasc.SolrCore.initDeprecatedSupport WARNING solrconfig.xml uses deprecated <admin/gettableFiles>, Please update your config to use the ShowFileRequestHandler.
[junit4:junit4]   2> 7877 T668 oasc.SolrCore.initDeprecatedSupport WARNING adding ShowFileRequestHandler with hidden files: [SCHEMA.XML, OLD_SYNONYMS.TXT, STOPWORDS.TXT, PROTWORDS.TXT, OPEN-EXCHANGE-RATES.JSON, SYNONYMS.TXT, CURRENCY.XML, MAPPING-ISOLATIN1ACCENT.TXT]
[junit4:junit4]   2> 7881 T668 oasc.CachingDirectoryFactory.close Releasing directory:/Users/jenkins/jenkins-slave/workspace/Lucene-Solr-trunk-MacOSX/solr/build/solr-core/test/J0/./org.apache.solr.cloud.BasicDistributedZkTest-1357067240682/jetty1
[junit4:junit4]   2> 7884 T668 oass.SolrIndexSearcher.<init> Opening Searcher@32ef3c6a main
[junit4:junit4]   2> 7886 T668 oasu.CommitTracker.<init> Hard AutoCommit: disabled
[junit4:junit4]   2> 7887 T668 oasu.CommitTracker.<init> Soft AutoCommit: disabled
[junit4:junit4]   2> 7888 T668 oashc.SpellCheckComponent.inform Initializing spell checkers
[junit4:junit4]   2> 7898 T668 oass.DirectSolrSpellChecker.init init: {name=direct,classname=DirectSolrSpellChecker,field=lowerfilt,minQueryLength=3}
[junit4:junit4]   2> 7966 T669 oasc.SolrCore.registerSearcher [collection1] Registered new searcher Searcher@32ef3c6a main{StandardDirectoryReader(segments_1:1)}
[junit4:junit4]   2> 7983 T668 oasc.ZkController.publish publishing core=collection1 state=down
[junit4:junit4]   2> 7984 T668 oasc.ZkController.publish numShards not found on descriptor - reading it from system property
[junit4:junit4]   2> 8660 T649 oascc.ZkStateReader.updateClusterState Updating cloud state from ZooKeeper... 
[junit4:junit4]   2> 8662 T649 oasc.Overseer$ClusterStateUpdater.updateState Update state numShards=2 message={
[junit4:junit4]   2> 	  "operation":"state",
[junit4:junit4]   2> 	  "numShards":"2",
[junit4:junit4]   2> 	  "shard":null,
[junit4:junit4]   2> 	  "roles":null,
[junit4:junit4]   2> 	  "state":"down",
[junit4:junit4]   2> 	  "core":"collection1",
[junit4:junit4]   2> 	  "collection":"collection1",
[junit4:junit4]   2> 	  "node_name":"127.0.0.1:49333_",
[junit4:junit4]   2> 	  "base_url":"http://127.0.0.1:49333"}
[junit4:junit4]   2> 8662 T649 oasc.Overseer$ClusterStateUpdater.createCollection Create collection collection1 with numShards 2
[junit4:junit4]   2> 8663 T649 oasc.Overseer$ClusterStateUpdater.updateState Assigning new node to shard shard=shard1
[junit4:junit4]   2> 8671 T648 oascc.ZkStateReader$2.process A cluster state change: WatchedEvent state:SyncConnected type:NodeDataChanged path:/clusterstate.json, has occurred - updating... (live nodes size: 2)
[junit4:junit4]   2> 8676 T654 oascc.ZkStateReader$2.process A cluster state change: WatchedEvent state:SyncConnected type:NodeDataChanged path:/clusterstate.json, has occurred - updating... (live nodes size: 2)
[junit4:junit4]   2> 8677 T667 oascc.ZkStateReader$2.process A cluster state change: WatchedEvent state:SyncConnected type:NodeDataChanged path:/clusterstate.json, has occurred - updating... (live nodes size: 2)
[junit4:junit4]   2> 8989 T668 oasc.CoreContainer.registerCore registering core: collection1
[junit4:junit4]   2> 8990 T668 oasc.ZkController.register Register replica - core:collection1 address:http://127.0.0.1:49333 collection:collection1 shard:shard1
[junit4:junit4]   2> 8992 T668 oascc.SolrZkClient.makePath makePath: /collections/collection1/leader_elect/shard1/election
[junit4:junit4]   2> 9009 T631 oazs.PrepRequestProcessor.pRequest Got user-level KeeperException when processing sessionid:0x13bf782c4f50006 type:delete cxid:0x45 zxid:0x5b txntype:-1 reqpath:n/a Error Path:/solr/collections/collection1/leaders Error:KeeperErrorCode = NoNode for /solr/collections/collection1/leaders
[junit4:junit4]   2> 9010 T668 oasc.ShardLeaderElectionContext.runLeaderProcess Running the leader process.
[junit4:junit4]   2> 9012 T631 oazs.PrepRequestProcessor.pRequest Got user-level KeeperException when processing sessionid:0x13bf782c4f50006 type:create cxid:0x46 zxid:0x5c txntype:-1 reqpath:n/a Error Path:/solr/overseer Error:KeeperErrorCode = NodeExists for /solr/overseer
[junit4:junit4]   2> 9016 T668 oasc.ShardLeaderElectionContext.waitForReplicasToComeUp Enough replicas found to continue.
[junit4:junit4]   2> 9017 T668 oasc.ShardLeaderElectionContext.runLeaderProcess I may be the new leader - try and sync
[junit4:junit4]   2> 9018 T668 oasc.SyncStrategy.sync Sync replicas to http://127.0.0.1:49333/collection1/
[junit4:junit4]   2> 9018 T668 oasc.SyncStrategy.syncReplicas Sync Success - now sync replicas to me
[junit4:junit4]   2> 9019 T668 oasc.SyncStrategy.syncToMe http://127.0.0.1:49333/collection1/ has no replicas
[junit4:junit4]   2> 9019 T668 oasc.ShardLeaderElectionContext.runLeaderProcess I am the new leader: http://127.0.0.1:49333/collection1/
[junit4:junit4]   2> 9020 T668 oascc.SolrZkClient.makePath makePath: /collections/collection1/leaders/shard1
[junit4:junit4]   2> 9030 T631 oazs.PrepRequestProcessor.pRequest Got user-level KeeperException when processing sessionid:0x13bf782c4f50006 type:create cxid:0x50 zxid:0x60 txntype:-1 reqpath:n/a Error Path:/solr/overseer Error:KeeperErrorCode = NodeExists for /solr/overseer
[junit4:junit4]   2> 10185 T649 oascc.ZkStateReader.updateClusterState Updating cloud state from ZooKeeper... 
[junit4:junit4]   2> 10214 T648 oascc.ZkStateReader$2.process A cluster state change: WatchedEvent state:SyncConnected type:NodeDataChanged path:/clusterstate.json, has occurred - updating... (live nodes size: 2)
[junit4:junit4]   2> 10214 T667 oascc.ZkStateReader$2.process A cluster state change: WatchedEvent state:SyncConnected type:NodeDataChanged path:/clusterstate.json, has occurred - updating... (live nodes size: 2)
[junit4:junit4]   2> 10215 T654 oascc.ZkStateReader$2.process A cluster state change: WatchedEvent state:SyncConnected type:NodeDataChanged path:/clusterstate.json, has occurred - updating... (live nodes size: 2)
[junit4:junit4]   2> 10224 T668 oasc.ZkController.register We are http://127.0.0.1:49333/collection1/ and leader is http://127.0.0.1:49333/collection1/
[junit4:junit4]   2> 10225 T668 oasc.ZkController.register No LogReplay needed for core=collection1 baseURL=http://127.0.0.1:49333
[junit4:junit4]   2> 10225 T668 oasc.ZkController.checkRecovery I am the leader, no recovery necessary
[junit4:junit4]   2> 10226 T668 oasc.ZkController.publish publishing core=collection1 state=active
[junit4:junit4]   2> 10226 T668 oasc.ZkController.publish numShards not found on descriptor - reading it from system property
[junit4:junit4]   2> 10231 T668 oascc.ZkStateReader.updateClusterState Updating cloud state from ZooKeeper... 
[junit4:junit4]   2> 10241 T626 oass.SolrDispatchFilter.init user.dir=/Users/jenkins/jenkins-slave/workspace/Lucene-Solr-trunk-MacOSX/solr/build/solr-core/test/J0
[junit4:junit4]   2> 10242 T626 oass.SolrDispatchFilter.init SolrDispatchFilter.init() done
[junit4:junit4]   2> 10244 T626 oascsi.HttpClientUtil.createClient Creating new http client, config:maxConnections=128&maxConnectionsPerHost=32&followRedirects=false
[junit4:junit4]   2> 10697 T626 oejs.Server.doStart jetty-8.1.8.v20121106
[junit4:junit4]   2> 10717 T626 oejs.AbstractConnector.doStart Started SelectChannelConnector@127.0.0.1:49336
[junit4:junit4]   2> 10720 T626 oasc.SolrResourceLoader.locateSolrHome JNDI not configured for solr (NoInitialContextEx)
[junit4:junit4]   2> 10721 T626 oasc.SolrResourceLoader.locateSolrHome using system property solr.solr.home: /Users/jenkins/jenkins-slave/workspace/Lucene-Solr-trunk-MacOSX/solr/build/solr-core/test/J0/./org.apache.solr.cloud.BasicDistributedZkTest-jetty2-1357067250914
[junit4:junit4]   2> 10721 T626 oasc.SolrResourceLoader.<init> new SolrResourceLoader for deduced Solr Home: '/Users/jenkins/jenkins-slave/workspace/Lucene-Solr-trunk-MacOSX/solr/build/solr-core/test/J0/./org.apache.solr.cloud.BasicDistributedZkTest-jetty2-1357067250914/'
[junit4:junit4]   2> 10781 T626 oass.SolrDispatchFilter.init SolrDispatchFilter.init()
[junit4:junit4]   2> 10783 T626 oasc.SolrResourceLoader.locateSolrHome JNDI not configured for solr (NoInitialContextEx)
[junit4:junit4]   2> 10783 T626 oasc.SolrResourceLoader.locateSolrHome using system property solr.solr.home: /Users/jenkins/jenkins-slave/workspace/Lucene-Solr-trunk-MacOSX/solr/build/solr-core/test/J0/./org.apache.solr.cloud.BasicDistributedZkTest-jetty2-1357067250914
[junit4:junit4]   2> 10784 T626 oasc.CoreContainer$Initializer.initialize looking for solr.xml: /Users/jenkins/jenkins-slave/workspace/Lucene-Solr-trunk-MacOSX/solr/build/solr-core/test/J0/./org.apache.solr.cloud.BasicDistributedZkTest-jetty2-1357067250914/solr.xml
[junit4:junit4]   2> 10785 T626 oasc.CoreContainer.<init> New CoreContainer 1065341763
[junit4:junit4]   2> 10787 T626 oasc.CoreContainer.load Loading CoreContainer using Solr Home: '/Users/jenkins/jenkins-slave/workspace/Lucene-Solr-trunk-MacOSX/solr/build/solr-core/test/J0/./org.apache.solr.cloud.BasicDistributedZkTest-jetty2-1357067250914/'
[junit4:junit4]   2> 10788 T626 oasc.SolrResourceLoader.<init> new SolrResourceLoader for directory: '/Users/jenkins/jenkins-slave/workspace/Lucene-Solr-trunk-MacOSX/solr/build/solr-core/test/J0/./org.apache.solr.cloud.BasicDistributedZkTest-jetty2-1357067250914/'
[junit4:junit4]   2> 10830 T626 oashc.HttpShardHandlerFactory.getParameter Setting socketTimeout to: 30000
[junit4:junit4]   2> 10831 T626 oashc.HttpShardHandlerFactory.getParameter Setting urlScheme to: http://
[junit4:junit4]   2> 10832 T626 oashc.HttpShardHandlerFactory.getParameter Setting connTimeout to: 15000
[junit4:junit4]   2> 10833 T626 oashc.HttpShardHandlerFactory.getParameter Setting maxConnectionsPerHost to: 20
[junit4:junit4]   2> 10834 T626 oashc.HttpShardHandlerFactory.getParameter Setting corePoolSize to: 0
[junit4:junit4]   2> 10835 T626 oashc.HttpShardHandlerFactory.getParameter Setting maximumPoolSize to: 2147483647
[junit4:junit4]   2> 10836 T626 oashc.HttpShardHandlerFactory.getParameter Setting maxThreadIdleTime to: 5
[junit4:junit4]   2> 10837 T626 oashc.HttpShardHandlerFactory.getParameter Setting sizeOfQueue to: -1
[junit4:junit4]   2> 10838 T626 oashc.HttpShardHandlerFactory.getParameter Setting fairnessPolicy to: false
[junit4:junit4]   2> 10839 T626 oascsi.HttpClientUtil.createClient Creating new http client, config:maxConnectionsPerHost=20&maxConnections=10000&socketTimeout=30000&connTimeout=15000&retry=false
[junit4:junit4]   2> 10865 T626 oasc.CoreContainer.load Registering Log Listener
[junit4:junit4]   2> 10913 T626 oasc.CoreContainer.initZooKeeper Zookeeper client=127.0.0.1:49326/solr
[junit4:junit4]   2> 10915 T626 oasc.ZkController.checkChrootPath zkHost includes chroot
[junit4:junit4]   2> 10915 T626 oaz.ZooKeeper.<init> Initiating client connection, connectString=127.0.0.1:49326 sessionTimeout=60000 watcher=org.apache.solr.common.cloud.ConnectionManager@22922e62
[junit4:junit4]   2> 10918 T626 oascc.ConnectionManager.waitForConnected Waiting for client to connect to ZooKeeper
[junit4:junit4]   2> 10920 T679 oaz.ClientCnxn$SendThread.logStartConnect Opening socket connection to server localhost/127.0.0.1:49326. Will not attempt to authenticate using SASL (access denied ("javax.security.auth.AuthPermission" "getLoginConfiguration"))
[junit4:junit4]   2> 10924 T679 oaz.ClientCnxn$SendThread.primeConnection Socket connection established to localhost/127.0.0.1:49326, initiating session
[junit4:junit4]   2> 10926 T628 oazs.NIOServerCnxnFactory.run Accepted socket connection from /127.0.0.1:49337
[junit4:junit4]   2> 10927 T628 oazs.ZooKeeperServer.processConnectRequest Client attempting to establish new session at /127.0.0.1:49337
[junit4:junit4]   2> 10928 T630 oazs.ZooKeeperServer.finishSessionInit Established session 0x13bf782c4f50007 with negotiated timeout 20000 for client /127.0.0.1:49337
[junit4:junit4]   2> 10929 T679 oaz.ClientCnxn$SendThread.onConnected Session establishment complete on server localhost/127.0.0.1:49326, sessionid = 0x13bf782c4f50007, negotiated timeout = 20000
[junit4:junit4]   2> 10929 T680 oascc.ConnectionManager.process Watcher org.apache.solr.common.cloud.ConnectionManager@22922e62 name:ZooKeeperConnection Watcher:127.0.0.1:49326 got event WatchedEvent state:SyncConnected type:None path:null path:null type:None
[junit4:junit4]   2> 10930 T626 oascc.ConnectionManager.waitForConnected Client is connected to ZooKeeper
[junit4:junit4]   2> 10962 T631 oazs.PrepRequestProcessor.pRequest2Txn Processed session termination for sessionid: 0x13bf782c4f50007
[junit4:junit4]   2> 10966 T628 oazs.NIOServerCnxn.closeSock Closed socket connection for client /127.0.0.1:49337 which had sessionid 0x13bf782c4f50007
[junit4:junit4]   2> 10966 T626 oaz.ZooKeeper.close Session: 0x13bf782c4f50007 closed
[junit4:junit4]   2> 10967 T626 oascsi.HttpClientUtil.createClient Creating new http client, config:maxConnections=500&maxConnectionsPerHost=16&socketTimeout=15000&connTimeout=30000
[junit4:junit4]   2> 10974 T680 oaz.ClientCnxn$EventThread.run EventThread shut down
[junit4:junit4]   2> 10990 T626 oaz.ZooKeeper.<init> Initiating client connection, connectString=127.0.0.1:49326/solr sessionTimeout=30000 watcher=org.apache.solr.common.cloud.ConnectionManager@ad54c5d
[junit4:junit4]   2> 10992 T626 oascc.ConnectionManager.waitForConnected Waiting for client to connect to ZooKeeper
[junit4:junit4]   2> 10993 T681 oaz.ClientCnxn$SendThread.logStartConnect Opening socket connection to server localhost/127.0.0.1:49326. Will not attempt to authenticate using SASL (access denied ("javax.security.auth.AuthPermission" "getLoginConfiguration"))
[junit4:junit4]   2> 10994 T681 oaz.ClientCnxn$SendThread.primeConnection Socket connection established to localhost/127.0.0.1:49326, initiating session
[junit4:junit4]   2> 10995 T628 oazs.NIOServerCnxnFactory.run Accepted socket connection from /127.0.0.1:49338
[junit4:junit4]   2> 10996 T628 oazs.ZooKeeperServer.processConnectRequest Client attempting to establish new session at /127.0.0.1:49338
[junit4:junit4]   2> 10998 T630 oazs.ZooKeeperServer.finishSessionInit Established session 0x13bf782c4f50008 with negotiated timeout 20000 for client /127.0.0.1:49338
[junit4:junit4]   2> 10998 T681 oaz.ClientCnxn$SendThread.onConnected Session establishment complete on server localhost/127.0.0.1:49326, sessionid = 0x13bf782c4f50008, negotiated timeout = 20000
[junit4:junit4]   2> 11000 T682 oascc.ConnectionManager.process Watcher org.apache.solr.common.cloud.ConnectionManager@ad54c5d name:ZooKeeperConnection Watcher:127.0.0.1:49326/solr got event WatchedEvent state:SyncConnected type:None path:null path:null type:None
[junit4:junit4]   2> 11002 T626 oascc.ConnectionManager.waitForConnected Client is connected to ZooKeeper
[junit4:junit4]   2> 11004 T631 oazs.PrepRequestProcessor.pRequest Got user-level KeeperException when processing sessionid:0x13bf782c4f50008 type:create cxid:0x1 zxid:0x6d txntype:-1 reqpath:n/a Error Path:/solr/overseer Error:KeeperErrorCode = NodeExists for /solr/overseer
[junit4:junit4]   2> 11007 T631 oazs.PrepRequestProcessor.pRequest Got user-level KeeperException when processing sessionid:0x13bf782c4f50008 type:create cxid:0x2 zxid:0x6e txntype:-1 reqpath:n/a Error Path:/solr/overseer Error:KeeperErrorCode = NodeExists for /solr/overseer
[junit4:junit4]   2> 11009 T626 oasc.ZkController.createEphemeralLiveNode Register node as live in ZooKeeper:/live_nodes/127.0.0.1:49336_
[junit4:junit4]   2> 11011 T631 oazs.PrepRequestProcessor.pRequest Got user-level KeeperException when processing sessionid:0x13bf782c4f50008 type:delete cxid:0x4 zxid:0x6f txntype:-1 reqpath:n/a Error Path:/solr/live_nodes/127.0.0.1:49336_ Error:KeeperErrorCode = NoNode for /solr/live_nodes/127.0.0.1:49336_
[junit4:junit4]   2> 11020 T626 oascc.SolrZkClient.makePath makePath: /live_nodes/127.0.0.1:49336_
[junit4:junit4]   2> 11033 T648 oascc.ZkStateReader$2.process A cluster state change: WatchedEvent state:SyncConnected type:NodeChildrenChanged path:/live_nodes, has occurred - updating... (live nodes size: 2)
[junit4:junit4]   2> 11033 T667 oascc.ZkStateReader$2.process A cluster state change: WatchedEvent state:SyncConnected type:NodeChildrenChanged path:/live_nodes, has occurred - updating... (live nodes size: 2)
[junit4:junit4]   2> 11036 T654 oascc.ZkStateReader$3.process Updating live nodes... (3)
[junit4:junit4]   2> 11036 T654 oascc.ZkStateReader$2.process A cluster state change: WatchedEvent state:SyncConnected type:NodeChildrenChanged path:/live_nodes, has occurred - updating... (live nodes size: 3)
[junit4:junit4]   2> 11044 T648 oascc.ZkStateReader$3.process Updating live nodes... (3)
[junit4:junit4]   2> 11044 T667 oascc.ZkStateReader$3.process Updating live nodes... (3)
[junit4:junit4]   2> 11066 T626 oascc.ZkStateReader.createClusterStateWatchersAndUpdate Updating cluster state from ZooKeeper... 
[junit4:junit4]   2> 11094 T683 oasc.CoreContainer.create Creating SolrCore 'collection1' using instanceDir: /Users/jenkins/jenkins-slave/workspace/Lucene-Solr-trunk-MacOSX/solr/build/solr-core/test/J0/./org.apache.solr.cloud.BasicDistributedZkTest-jetty2-1357067250914/collection1
[junit4:junit4]   2> 11095 T683 oasc.ZkController.createCollectionZkNode Check for collection zkNode:collection1
[junit4:junit4]   2> 11096 T683 oasc.ZkController.createCollectionZkNode Collection zkNode exists
[junit4:junit4]   2> 11097 T683 oasc.ZkController.readConfigName Load collection config from:/collections/collection1
[junit4:junit4]   2> 11100 T683 oasc.SolrResourceLoader.<init> new SolrResourceLoader for directory: '/Users/jenkins/jenkins-slave/workspace/Lucene-Solr-trunk-MacOSX/solr/build/solr-core/test/J0/./org.apache.solr.cloud.BasicDistributedZkTest-jetty2-1357067250914/collection1/'
[junit4:junit4]   2> 11102 T683 oasc.SolrResourceLoader.replaceClassLoader Adding 'file:/Users/jenkins/jenkins-slave/workspace/Lucene-Solr-trunk-MacOSX/solr/build/solr-core/test/J0/org.apache.solr.cloud.BasicDistributedZkTest-jetty2-1357067250914/collection1/lib/classes/' to classloader
[junit4:junit4]   2> 11103 T683 oasc.SolrResourceLoader.replaceClassLoader Adding 'file:/Users/jenkins/jenkins-slave/workspace/Lucene-Solr-trunk-MacOSX/solr/build/solr-core/test/J0/org.apache.solr.cloud.BasicDistributedZkTest-jetty2-1357067250914/collection1/lib/README' to classloader
[junit4:junit4]   2> 11203 T683 oasc.SolrConfig.<init> Using Lucene MatchVersion: LUCENE_50
[junit4:junit4]   2> 11343 T683 oasc.SolrConfig.<init> Loaded SolrConfig: solrconfig.xml
[junit4:junit4]   2> 11345 T683 oass.IndexSchema.readSchema Reading Solr Schema
[junit4:junit4]   2> 11360 T683 oass.IndexSchema.readSchema Schema name=test
[junit4:junit4]   2> 11649 T148 oasc.OverseerCollectionProcessor.run WARNING Overseer cannot talk to ZK
[junit4:junit4]   2> 11742 T649 oascc.ZkStateReader.updateClusterState Updating cloud state from ZooKeeper... 
[junit4:junit4]   2> 11746 T649 oasc.Overseer$ClusterStateUpdater.updateState Update state numShards=2 message={
[junit4:junit4]   2> 	  "operation":"state",
[junit4:junit4]   2> 	  "numShards":"2",
[junit4:junit4]   2> 	  "shard":"shard1",
[junit4:junit4]   2> 	  "roles":null,
[junit4:junit4]   2> 	  "state":"active",
[junit4:junit4]   2> 	  "core":"collection1",
[junit4:junit4]   2> 	  "collection":"collection1",
[junit4:junit4]   2> 	  "node_name":"127.0.0.1:49333_",
[junit4:junit4]   2> 	  "base_url":"http://127.0.0.1:49333"}
[junit4:junit4]   2> 11765 T667 oascc.ZkStateReader$2.process A cluster state change: WatchedEvent state:SyncConnected type:NodeDataChanged path:/clusterstate.json, has occurred - updating... (live nodes size: 3)
[junit4:junit4]   2> 11766 T648 oascc.ZkStateReader$2.process A cluster state change: WatchedEvent state:SyncConnected type:NodeDataChanged path:/clusterstate.json, has occurred - updating... (live nodes size: 3)
[junit4:junit4]   2> 11767 T654 oascc.ZkStateReader$2.process A cluster state change: WatchedEvent state:SyncConnected type:NodeDataChanged path:/clusterstate.json, has occurred - updating... (live nodes size: 3)
[junit4:junit4]   2> 11767 T682 oascc.ZkStateReader$2.process A cluster state change: WatchedEvent state:SyncConnected type:NodeDataChanged path:/clusterstate.json, has occurred - updating... (live nodes size: 3)
[junit4:junit4]   2> 12491 T683 oass.OpenExchangeRatesOrgProvider.init Initialized with rates=open-exchange-rates.json, refreshInterval=1440.
[junit4:junit4]   2> 12506 T683 oass.IndexSchema.readSchema default search field in schema is text
[junit4:junit4]   2> 12512 T683 oass.IndexSchema.readSchema unique key field: id
[junit4:junit4]   2> 12553 T683 oass.FileExchangeRateProvider.reload Reloading exchange rates from file currency.xml
[junit4:junit4]   2> 12558 T683 oass.FileExchangeRateProvider.reload Reloading exchange rates from file currency.xml
[junit4:junit4]   2> 12564 T683 oass.OpenExchangeRatesOrgProvider.reload Reloading exchange rates from open-exchange-rates.json
[junit4:junit4]   2> 12578 T683 oass.OpenExchangeRatesOrgProvider.reload Reloading exchange rates from open-exchange-rates.json
[junit4:junit4]   2> 12586 T683 oasc.SolrCore.<init> [collection1] Opening new SolrCore at /Users/jenkins/jenkins-slave/workspace/Lucene-Solr-trunk-MacOSX/solr/build/solr-core/test/J0/./org.apache.solr.cloud.BasicDistributedZkTest-jetty2-1357067250914/collection1/, dataDir=./org.apache.solr.cloud.BasicDistributedZkTest-1357067240682/jetty2/
[junit4:junit4]   2> 12586 T683 oasc.JmxMonitoredMap.<init> JMX monitoring is enabled. Adding Solr mbeans to JMX Server: com.sun.jmx.mbeanserver.JmxMBeanServer@90a1f5a
[junit4:junit4]   2> 12589 T683 oasc.SolrCore.initDirectoryFactory solr.StandardDirectoryFactory
[junit4:junit4]   2> 12589 T683 oasc.CachingDirectoryFactory.get return new directory for /Users/jenkins/jenkins-slave/workspace/Lucene-Solr-trunk-MacOSX/solr/build/solr-core/test/J0/./org.apache.solr.cloud.BasicDistributedZkTest-1357067240682/jetty2 forceNew:false
[junit4:junit4]   2> 12590 T683 oasc.CachingDirectoryFactory.close Releasing directory:/Users/jenkins/jenkins-slave/workspace/Lucene-Solr-trunk-MacOSX/solr/build/solr-core/test/J0/./org.apache.solr.cloud.BasicDistributedZkTest-1357067240682/jetty2
[junit4:junit4]   2> 12590 T683 oasc.SolrCore.getNewIndexDir New index directory detected: old=null new=./org.apache.solr.cloud.BasicDistributedZkTest-1357067240682/jetty2/index/
[junit4:junit4]   2> 12591 T683 oasc.SolrCore.initIndex WARNING [collection1] Solr index directory './org.apache.solr.cloud.BasicDistributedZkTest-1357067240682/jetty2/index' doesn't exist. Creating new index...
[junit4:junit4]   2> 12593 T683 oasc.CachingDirectoryFactory.get return new directory for /Users/jenkins/jenkins-slave/workspace/Lucene-Solr-trunk-MacOSX/solr/build/solr-core/test/J0/./org.apache.solr.cloud.BasicDistributedZkTest-1357067240682/jetty2/index forceNew:false
[junit4:junit4]   2> 12601 T683 oasc.SolrDeletionPolicy.onCommit SolrDeletionPolicy.onCommit: commits:num=1
[junit4:junit4]   2> 		commit{dir=RateLimitedDirectoryWrapper(org.apache.lucene.store.NIOFSDirectory@/Users/jenkins/jenkins-slave/workspace/Lucene-Solr-trunk-MacOSX/solr/build/solr-core/test/J0/org.apache.solr.cloud.BasicDistributedZkTest-1357067240682/jetty2/index lockFactory=org.apache.lucene.store.NativeFSLockFactory@74d8e2b6),segFN=segments_1,generation=1,filenames=[segments_1]
[junit4:junit4]   2> 12601 T683 oasc.SolrDeletionPolicy.updateCommits newest commit = 1[segments_1]
[junit4:junit4]   2> 12602 T683 oasc.CachingDirectoryFactory.close Releasing directory:/Users/jenkins/jenkins-slave/workspace/Lucene-Solr-trunk-MacOSX/solr/build/solr-core/test/J0/./org.apache.solr.cloud.BasicDistributedZkTest-1357067240682/jetty2/index
[junit4:junit4]   2> 12603 T683 oasc.SolrCore.initWriters created xml: solr.XMLResponseWriter
[junit4:junit4]   2> 12606 T683 oasup.UpdateRequestProcessorChain.init inserting DistributedUpdateProcessorFactory into updateRequestProcessorChain "dedupe"
[junit4:junit4]   2> 12607 T683 oasup.UpdateRequestProcessorChain.init inserting DistributedUpdateProcessorFactory into updateRequestProcessorChain "dedupe-allfields"
[junit4:junit4]   2> 12607 T683 oasup.UpdateRequestProcessorChain.init inserting DistributedUpdateProcessorFactory into updateRequestProcessorChain "stored_sig"
[junit4:junit4]   2> 12608 T683 oasup.UpdateRequestProcessorChain.init inserting DistributedUpdateProcessorFactory into updateRequestProcessorChain "uniq-fields"
[junit4:junit4]   2> 12609 T683 oasup.UpdateRequestProcessorChain.init inserting DistributedUpdateProcessorFactory into updateRequestProcessorChain "distrib-dup-test-chain-implicit"
[junit4:junit4]   2> 12609 T683 oasc.RequestHandlers.initHandlersFromConfig adding lazy requestHandler: solr.ReplicationHandler
[junit4:junit4]   2> 12610 T683 oasc.RequestHandlers.initHandlersFromConfig created /replication: solr.ReplicationHandler
[junit4:junit4]   2> 12610 T683 oasc.RequestHandlers.initHandlersFromConfig created standard: solr.StandardRequestHandler
[junit4:junit4]   2> 12611 T683 oasc.RequestHandlers.initHandlersFromConfig created /get: solr.RealTimeGetHandler
[junit4:junit4]   2> 12612 T683 oasc.RequestHandlers.initHandlersFromConfig created dismax: solr.SearchHandler
[junit4:junit4]   2> 12612 T683 oasc.RequestHandlers.initHandlersFromConfig created mock: org.apache.solr.core.MockQuerySenderListenerReqHandler
[junit4:junit4]   2> 12613 T683 oasc.RequestHandlers.initHandlersFromConfig created /admin/: org.apache.solr.handler.admin.AdminHandlers
[junit4:junit4]   2> 12613 T683 oasc.RequestHandlers.initHandlersFromConfig created defaults: solr.StandardRequestHandler
[junit4:junit4]   2> 12614 T683 oasc.RequestHandlers.initHandlersFromConfig adding lazy requestHandler: solr.StandardRequestHandler
[junit4:junit4]   2> 12614 T683 oasc.RequestHandlers.initHandlersFromConfig created lazy: solr.StandardRequestHandler
[junit4:junit4]   2> 12615 T683 oasc.RequestHandlers.initHandlersFromConfig created /update: solr.UpdateRequestHandler
[junit4:junit4]   2> 12615 T683 oasc.RequestHandlers.initHandlersFromConfig created /terms: org.apache.solr.handler.component.SearchHandler
[junit4:junit4]   2> 12616 T683 oasc.RequestHandlers.initHandlersFromConfig created spellCheckCompRH: org.apache.solr.handler.component.SearchHandler
[junit4:junit4]   2> 12617 T683 oasc.RequestHandlers.initHandlersFromConfig created spellCheckCompRH_Direct: org.apache.solr.handler.component.SearchHandler
[junit4:junit4]   2> 12617 T683 oasc.RequestHandlers.initHandlersFromConfig created spellCheckWithWordbreak: org.apache.solr.handler.component.SearchHandler
[junit4:junit4]   2> 12618 T683 oasc.RequestHandlers.initHandlersFromConfig created spellCheckWithWordbreak_Direct: org.apache.solr.handler.component.SearchHandler
[junit4:junit4]   2> 12619 T683 oasc.RequestHandlers.initHandlersFromConfig created spellCheckCompRH1: org.apache.solr.handler.component.SearchHandler
[junit4:junit4]   2> 12619 T683 oasc.RequestHandlers.initHandlersFromConfig created mltrh: org.apache.solr.handler.component.SearchHandler
[junit4:junit4]   2> 12620 T683 oasc.RequestHandlers.initHandlersFromConfig created tvrh: org.apache.solr.handler.component.SearchHandler
[junit4:junit4]   2> 12621 T683 oasc.RequestHandlers.initHandlersFromConfig created /mlt: solr.MoreLikeThisHandler
[junit4:junit4]   2> 12621 T683 oasc.RequestHandlers.initHandlersFromConfig created /debug/dump: solr.DumpRequestHandler
[junit4:junit4]   2> 12630 T683 oashl.XMLLoader.init xsltCacheLifetimeSeconds=60
[junit4:junit4]   2> 12635 T683 oasc.SolrCore.initDeprecatedSupport WARNING solrconfig.xml uses deprecated <admin/gettableFiles>, Please update your config to use the ShowFileRequestHandler.
[junit4:junit4]   2> 12642 T683 oasc.SolrCore.initDeprecatedSupport WARNING adding ShowFileRequestHandler with hidden files: [SCHEMA.XML, OLD_SYNONYMS.TXT, STOPWORDS.TXT, PROTWORDS.TXT, OPEN-EXCHANGE-RATES.JSON, SYNONYMS.TXT, CURRENCY.XML, MAPPING-ISOLATIN1ACCENT.TXT]
[junit4:junit4]   2> 12645 T683 oasc.CachingDirectoryFactory.close Releasing directory:/Users/jenkins/jenkins-slave/workspace/Lucene-Solr-trunk-MacOSX/solr/build/solr-core/test/J0/./org.apache.solr.cloud.BasicDistributedZkTest-1357067240682/jetty2
[junit4:junit4]   2> 12648 T683 oass.SolrIndexSearcher.<init> Opening Searcher@401bc89 main
[junit4:junit4]   2> 12649 T683 oasu.CommitTracker.<init> Hard AutoCommit: disabled
[junit4:junit4]   2> 12649 T683 oasu.CommitTracker.<init> Soft AutoCommit: disabled
[junit4:junit4]   2> 12651 T683 oashc.SpellCheckComponent.inform Initializing spell checkers
[junit4:junit4]   2> 12660 T683 oass.DirectSolrSpellChecker.init init: {name=direct,classname=DirectSolrSpellChecker,field=lowerfilt,minQueryLength=3}
[junit4:junit4]   2> 12757 T684 oasc.SolrCore.registerSearcher [collection1] Registered new searcher Searcher@401bc89 main{StandardDirectoryReader(segments_1:1)}
[junit4:junit4]   2> 12774 T683 oasc.ZkController.publish publishing core=collection1 state=down
[junit4:junit4]   2> 12775 T683 oasc.ZkController.publish numShards not found on descriptor - reading it from system property
[junit4:junit4]   2> 13311 T649 oascc.ZkStateReader.updateClusterState Updating cloud state from ZooKeeper... 
[junit4:junit4]   2> 13313 T649 oasc.Overseer$ClusterStateUpdater.updateState Update state numShards=2 message={
[junit4:junit4]   2> 	  "operation":"state",
[junit4:junit4]   2> 	  "numShards":"2",
[junit4:junit4]   2> 	  "shard":null,
[junit4:junit4]   2> 	  "roles":null,
[junit4:junit4]   2> 	  "state":"down",
[junit4:junit4]   2> 	  "core":"collection1",
[junit4:junit4]   2> 	  "collection":"collection1",
[junit4:junit4]   2> 	  "node_name":"127.0.0.1:49336_",
[junit4:junit4]   2> 	  "base_url":"http://127.0.0.1:49336"}
[junit4:junit4]   2> 13314 T649 oasc.Overseer$ClusterStateUpdater.updateState Collection already exists with numShards=2
[junit4:junit4]   2> 13314 T649 oasc.Overseer$ClusterStateUpdater.updateState Assigning new node to shard shard=shard2
[junit4:junit4]   2> 13332 T667 oascc.ZkStateReader$2.process A cluster state change: WatchedEvent state:SyncConnected type:NodeDataChanged path:/clusterstate.json, has occurred - updating... (live nodes size: 3)
[junit4:junit4]   2> 13333 T648 oascc.ZkStateReader$2.process A cluster state change: WatchedEvent state:SyncConnected type:NodeDataChanged path:/clusterstate.json, has occurred - updating... (live nodes size: 3)
[junit4:junit4]   2> 13332 T654 oascc.ZkStateReader$2.process A cluster state change: WatchedEvent state:SyncConnected type:NodeDataChanged path:/clusterstate.json, has occurred - updating... (live nodes size: 3)
[junit4:junit4]   2> 13333 T682 oascc.ZkStateReader$2.process A cluster state change: WatchedEvent state:SyncConnected type:NodeDataChanged path:/clusterstate.json, has occurred - updating... (live nodes size: 3)
[junit4:junit4]   2> 13778 T683 oasc.CoreContainer.registerCore registering core: collection1
[junit4:junit4]   2> 13779 T683 oasc.ZkController.register Register replica - core:collection1 address:http://127.0.0.1:49336 collection:collection1 shard:shard2
[junit4:junit4]   2> 13781 T683 oascc.SolrZkClient.makePath makePath: /collections/collection1/leader_elect/shard2/election
[junit4:junit4]   2> 13809 T631 oazs.PrepRequestProcessor.pRequest Got user-level KeeperException when processing sessionid:0x13bf782c4f50008 type:delete cxid:0x44 zxid:0x7e txntype:-1 reqpath:n/a Error Path:/solr/collections/collection1/leaders/shard2 Error:KeeperErrorCode = NoNode for /solr/collections/collection1/leaders/shard2
[junit4:junit4]   2> 13811 T683 oasc.ShardLeaderElectionContext.runLeaderProcess Running the leader process.
[junit4:junit4]   2> 13812 T631 oazs.PrepRequestProcessor.pRequest Got user-level KeeperException when processing sessionid:0x13bf782c4f50008 type:create cxid:0x45 zxid:0x7f txntype:-1 reqpath:n/a Error Path:/solr/overseer Error:KeeperErrorCode = NodeExists for /solr/overseer
[junit4:junit4]   2> 13816 T683 oasc.ShardLeaderElectionContext.waitForReplicasToComeUp Enough replicas found to continue.
[junit4:junit4]   2> 13817 T683 oasc.ShardLeaderElectionContext.runLeaderProcess I may be the new leader - try and sync
[junit4:junit4]   2> 13818 T683 oasc.SyncStrategy.sync Sync replicas to http://127.0.0.1:49336/collection1/
[junit4:junit4]   2> 13818 T683 oasc.SyncStrategy.syncReplicas Sync Success - now sync replicas to me
[junit4:junit4]   2> 13819 T683 oasc.SyncStrategy.syncToMe http://127.0.0.1:49336/collection1/ has no replicas
[junit4:junit4]   2> 13819 T683 oasc.ShardLeaderElectionContext.runLeaderProcess I am the new leader: http://127.0.0.1:49336/collection1/
[junit4:junit4]   2> 13820 T683 oascc.SolrZkClient.makePath makePath: /collections/collection1/leaders/shard2
[junit4:junit4]   2> 13839 T631 oazs.PrepRequestProcessor.pRequest Got user-level KeeperException when processing sessionid:0x13bf782c4f50008 type:create cxid:0x4e zxid:0x82 txntype:-1 reqpath:n/a Error Path:/solr/overseer Error:KeeperErrorCode = NodeExists for /solr/overseer
[junit4:junit4]   2> 14563 T163 oasc.OverseerCollectionProcessor.run WARNING Overseer cannot talk to ZK
[junit4:junit4]   2> 14851 T649 oascc.ZkStateReader.updateClusterState Updating cloud state from ZooKeeper... 
[junit4:junit4]   2> 14893 T648 oascc.ZkStateReader$2.process A cluster state change: WatchedEvent state:SyncConnected type:NodeDataChanged path:/clusterstate.json, has occurred - updating... (live nodes size: 3)
[junit4:junit4]   2> 14893 T667 oascc.ZkStateReader$2.process A cluster state change: WatchedEvent state:SyncConnected type:NodeDataChanged path:/clusterstate.json, has occurred - updating... (live nodes size: 3)
[junit4:junit4]   2> 14894 T654 oascc.ZkStateReader$2.process A cluster state change: WatchedEvent state:SyncConnected type:NodeDataChanged path:/clusterstate.json, has occurred - updating... (live nodes size: 3)
[junit4:junit4]   2> 14894 T682 oascc.ZkStateReader$2.process A cluster state change: WatchedEvent state:SyncConnected type:NodeDataChanged path:/clusterstate.json, has occurred - updating... (live nodes size: 3)
[junit4:junit4]   2> 14921 T683 oasc.ZkController.register We are http://127.0.0.1:49336/collection1/ and leader is http://127.0.0.1:49336/collection1/
[junit4:junit4]   2> 14922 T683 oasc.ZkController.register No LogReplay needed for core=collection1 baseURL=http://127.0.0.1:49336
[junit4:junit4]   2> 14922 T683 oasc.ZkController.checkRecovery I am the leader, no recovery necessary
[junit4:junit4]   2> 14922 T683 oasc.ZkController.publish publishing core=collection1 state=active
[junit4:junit4]   2> 14922 T683 oasc.ZkController.publish numShards not found on descriptor - reading it from system property
[junit4:junit4]   2> 14929 T683 oascc.ZkStateReader.updateClusterState Updating cloud state from ZooKeeper... 
[junit4:junit4]   2> 14935 T626 oass.SolrDispatchFilter.init user.dir=/Users/jenkins/jenkins-slave/workspace/Lucene-Solr-trunk-MacOSX/solr/build/solr-core/test/J0
[junit4:junit4]   2> 14936 T626 oass.SolrDispatchFilter.init SolrDispatchFilter.init() done
[junit4:junit4]   2> 14937 T626 oascsi.HttpClientUtil.createClient Creating new http client, config:maxConnections=128&maxConnectionsPerHost=32&followRedirects=false
[junit4:junit4]   2> 15340 T626 oejs.Server.doStart jetty-8.1.8.v20121106
[junit4:junit4]   2> 15352 T626 oejs.AbstractConnector.doStart Started SelectChannelConnector@127.0.0.1:49339
[junit4:junit4]   2> 15353 T626 oasc.SolrResourceLoader.locateSolrHome JNDI not configured for solr (NoInitialContextEx)
[junit4:junit4]   2> 15354 T626 oasc.SolrResourceLoader.locateSolrHome using system property solr.solr.home: /Users/jenkins/jenkins-slave/workspace/Lucene-Solr-trunk-MacOSX/solr/build/solr-core/test/J0/./org.apache.solr.cloud.BasicDistributedZkTest-jetty3-1357067255605
[junit4:junit4]   2> 15354 T626 oasc.SolrResourceLoader.<init> new SolrResourceLoader for deduced Solr Home: '/Users/jenkins/jenkins-slave/workspace/Lucene-Solr-trunk-MacOSX/solr/build/solr-core/test/J0/./org.apache.solr.cloud.BasicDistributedZkTest-jetty3-1357067255605/'
[junit4:junit4]   2> 15396 T626 oass.SolrDispatchFilter.init SolrDispatchFilter.init()
[junit4:junit4]   2> 15396 T626 oasc.SolrResourceLoader.locateSolrHome JNDI not configured for solr (NoInitialContextEx)
[junit4:junit4]   2> 15397 T626 oasc.SolrResourceLoader.locateSolrHome using system property solr.solr.home: /Users/jenkins/jenkins-slave/workspace/Lucene-Solr-trunk-MacOSX/solr/build/solr-core/test/J0/./org.apache.solr.cloud.BasicDistributedZkTest-jetty3-1357067255605
[junit4:junit4]   2> 15397 T626 oasc.CoreContainer$Initializer.initialize looking for solr.xml: /Users/jenkins/jenkins-slave/workspace/Lucene-Solr-trunk-MacOSX/solr/build/solr-core/test/J0/./org.apache.solr.cloud.BasicDistributedZkTest-jetty3-1357067255605/solr.xml
[junit4:junit4]   2> 15398 T626 oasc.CoreContainer.<init> New CoreContainer 856348651
[junit4:junit4]   2> 15399 T626 oasc.CoreContainer.load Loading CoreContainer using Solr Home: '/Users/jenkins/jenkins-slave/workspace/Lucene-Solr-trunk-MacOSX/solr/build/solr-core/test/J0/./org.apache.solr.cloud.BasicDistributedZkTest-jetty3-1357067255605/'
[junit4:junit4]   2> 15399 T626 oasc.SolrResourceLoader.<init> new SolrResourceLoader for directory: '/Users/jenkins/jenkins-slave/workspace/Lucene-Solr-trunk-MacOSX/solr/build/solr-core/test/J0/./org.apache.solr.cloud.BasicDistributedZkTest-jetty3-1357067255605/'
[junit4:junit4]   2> 15424 T626 oashc.HttpShardHandlerFactory.getParameter Setting socketTimeout to: 30000
[junit4:junit4]   2> 15425 T626 oashc.HttpShardHandlerFactory.getParameter Setting urlScheme to: http://
[junit4:junit4]   2> 15426 T626 oashc.HttpShardHandlerFactory.getParameter Setting connTimeout to: 15000
[junit4:junit4]   2> 15426 T626 oashc.HttpShardHandlerFactory.getParameter Setting maxConnectionsPerHost to: 20
[junit4:junit4]   2> 15427 T626 oashc.HttpShardHandlerFactory.getParameter Setting corePoolSize to: 0
[junit4:junit4]   2> 15427 T626 oashc.HttpShardHandlerFactory.getParameter Setting maximumPoolSize to: 2147483647
[junit4:junit4]   2> 15428 T626 oashc.HttpShardHandlerFactory.getParameter Setting maxThreadIdleTime to: 5
[junit4:junit4]   2> 15428 T626 oashc.HttpShardHandlerFactory.getParameter Setting sizeOfQueue to: -1
[junit4:junit4]   2> 15429 T626 oashc.HttpShardHandlerFactory.getParameter Setting fairnessPolicy to: false
[junit4:junit4]   2> 15429 T626 oascsi.HttpClientUtil.createClient Creating new http client, config:maxConnectionsPerHost=20&maxConnections=10000&socketTimeout=30000&connTimeout=15000&retry=false
[junit4:junit4]   2> 15457 T626 oasc.CoreContainer.load Registering Log Listener
[junit4:junit4]   2> 15513 T626 oasc.CoreContainer.initZooKeeper Zookeeper client=127.0.0.1:49326/solr
[junit4:junit4]   2> 15514 T626 oasc.ZkController.checkChrootPath zkHost includes chroot
[junit4:junit4]   2> 15514 T626 oaz.ZooKeeper.<init> Initiating client connection, connectString=127.0.0.1:49326 sessionTimeout=60000 watcher=org.apache.solr.common.cloud.ConnectionManager@304398e6
[junit4:junit4]   2> 15516 T626 oascc.ConnectionManager.waitForConnected Waiting for client to connect to ZooKeeper
[junit4:junit4]   2> 15517 T694 oaz.ClientCnxn$SendThread.logStartConnect Opening socket connection to server localhost/127.0.0.1:49326. Will not attempt to authenticate using SASL (access denied ("javax.security.auth.AuthPermission" "getLoginConfiguration"))
[junit4:junit4]   2> 15519 T694 oaz.ClientCnxn$SendThread.primeConnection Socket connection established to localhost/127.0.0.1:49326, initiating session
[junit4:junit4]   2> 15522 T628 oazs.NIOServerCnxnFactory.run Accepted socket connection from /127.0.0.1:49340
[junit4:junit4]   2> 15525 T628 oazs.ZooKeeperServer.processConnectRequest Client attempting to establish new session at /127.0.0.1:49340
[junit4:junit4]   2> 15527 T630 oazs.ZooKeeperServer.finishSessionInit Established session 0x13bf782c4f50009 with negotiated timeout 20000 for client /127.0.0.1:49340
[junit4:junit4]   2> 15527 T694 oaz.ClientCnxn$SendThread.onConnected Session establishment complete on server localhost/127.0.0.1:49326, sessionid = 0x13bf782c4f50009, negotiated timeout = 20000
[junit4:junit4]   2> 15528 T695 oascc.ConnectionManager.process Watcher org.apache.solr.common.cloud.ConnectionManager@304398e6 name:ZooKeeperConnection Watcher:127.0.0.1:49326 got event WatchedEvent state:SyncConnected type:None path:null path:null type:None
[junit4:junit4]   2> 15532 T626 oascc.ConnectionManager.waitForConnected Client is connected to ZooKeeper
[junit4:junit4]   2> 15547 T631 oazs.PrepRequestProcessor.pRequest2Txn Processed session termination for sessionid: 0x13bf782c4f50009
[junit4:junit4]   2> 15550 T628 oazs.NIOServerCnxn.closeSock Closed socket connection for client /127.0.0.1:49340 which had sessionid 0x13bf782c4f50009
[junit4:junit4]   2> 15551 T626 oaz.ZooKeeper.close Session: 0x13bf782c4f50009 closed
[junit4:junit4]   2> 15551 T626 oascsi.HttpClientUtil.createClient Creating new http client, config:maxConnections=500&maxConnectionsPerHost=16&socketTimeout=15000&connTimeout=30000
[junit4:junit4]   2> 15554 T695 oaz.ClientCnxn$EventThread.run EventThread shut down
[junit4:junit4]   2> 15565 T626 oaz.ZooKeeper.<init> Initiating client connection, connectString=127.0.0.1:49326/solr sessionTimeout=30000 watcher=org.apache.solr.common.cloud.ConnectionManager@52c15f70
[junit4:junit4]   2> 15566 T626 oascc.ConnectionManager.waitForConnected Waiting for client to connect to ZooKeeper
[junit4:junit4]   2> 15567 T696 oaz.ClientCnxn$SendThread.logStartConnect Opening socket connection to server localhost/127.0.0.1:49326. Will not attempt to authenticate using SASL (access denied ("javax.security.auth.AuthPermission" "getLoginConfiguration"))
[junit4:junit4]   2> 15568 T696 oaz.ClientCnxn$SendThread.primeConnection Socket connection established to localhost/127.0.0.1:49326, initiating session
[junit4:junit4]   2> 15573 T628 oazs.NIOServerCnxnFactory.run Accepted socket connection from /127.0.0.1:49341
[junit4:junit4]   2> 15574 T628 oazs.ZooKeeperServer.processConnectRequest Client attempting to establish new session at /127.0.0.1:49341
[junit4:junit4]   2> 15576 T630 oazs.ZooKeeperServer.finishSessionInit Established session 0x13bf782c4f5000a with negotiated timeout 20000 for client /127.0.0.1:49341
[junit4:junit4]   2> 15577 T696 oaz.ClientCnxn$SendThread.onConnected Session establishment complete on server localhost/127.0.0.1:49326, sessionid = 0x13bf782c4f5000a, negotiated timeout = 20000
[junit4:junit4]   2> 15577 T697 oascc.ConnectionManager.process Watcher org.apache.solr.common.cloud.ConnectionManager@52c15f70 name:ZooKeeperConnection Watcher:127.0.0.1:49326/solr got event WatchedEvent state:SyncConnected type:None path:null path:null type:None
[junit4:junit4]   2> 15579 T626 oascc.ConnectionManager.waitForConnected Client is connected to ZooKeeper
[junit4:junit4]   2> 15582 T631 oazs.PrepRequestProcessor.pRequest Got user-level KeeperException when processing sessionid:0x13bf782c4f5000a type:create cxid:0x1 zxid:0x8f txntype:-1 reqpath:n/a Error Path:/solr/overseer Error:KeeperErrorCode = NodeExists for /solr/overseer
[junit4:junit4]   2> 15586 T631 oazs.PrepRequestProcessor.pRequest Got user-level KeeperException when processing sessionid:0x13bf782c4f5000a type:create cxid:0x2 zxid:0x90 txntype:-1 reqpath:n/a Error Path:/solr/overseer Error:KeeperErrorCode = NodeExists for /solr/overseer
[junit4:junit4]   2> 15595 T626 oasc.ZkController.createEphemeralLiveNode Register node as live in ZooKeeper:/live_nodes/127.0.0.1:49339_
[junit4:junit4]   2> 15597 T631 oazs.PrepRequestProcessor.pRequest Got user-level KeeperException when processing sessionid:0x13bf782c4f5000a type:delete cxid:0x4 zxid:0x91 txntype:-1 reqpath:n/a Error Path:/solr/live_nodes/127.0.0.1:49339_ Error:KeeperErrorCode = NoNode for /solr/live_nodes/127.0.0.1:49339_
[junit4:junit4]   2> 15601 T626 oascc.SolrZkClient.makePath makePath: /live_nodes/127.0.0.1:49339_
[junit4:junit4]   2> 15614 T648 oascc.ZkStateReader$2.process A cluster state change: WatchedEvent state:SyncConnected type:NodeChildrenChanged path:/live_nodes, has occurred - updating... (live nodes size: 3)
[junit4:junit4]   2> 15614 T682 oascc.ZkStateReader$3.process Updating live nodes... (4)
[junit4:junit4]   2> 15614 T682 oascc.ZkStateReader$2.process A cluster state change: WatchedEvent state:SyncConnected type:NodeChildrenChanged path:/live_nodes, has occurred - updating... (live nodes size: 4)
[junit4:junit4]   2> 15614 T667 oascc.ZkStateReader$2.process A cluster state change: WatchedEvent state:SyncConnected type:NodeChildrenChanged path:/live_nodes, has occurred - updating... (live nodes size: 3)
[junit4:junit4]   2> 15616 T654 oascc.ZkStateReader$3.process Updating live nodes... (4)
[junit4:junit4]   2> 15617 T654 oascc.ZkStateReader$2.process A cluster state change: WatchedEvent state:SyncConnected type:NodeChildrenChanged path:/live_nodes, has occurred - updating... (live nodes size: 4)
[junit4:junit4]   2> 15620 T648 oascc.ZkStateReader$3.process Updating live nodes... (4)
[junit4:junit4]   2> 15625 T667 oascc.ZkStateReader$3.process Updating live nodes... (4)
[junit4:junit4]   2> 15640 T626 oascc.ZkStateReader.createClusterStateWatchersAndUpdate Updating cluster state from ZooKeeper... 
[junit4:junit4]   2> 15662 T698 oasc.CoreContainer.create Creating SolrCore 'collection1' using instanceDir: /Users/jenkins/jenkins-slave/workspace/Lucene-Solr-trunk-MacOSX/solr/build/solr-core/test/J0/./org.apache.solr.cloud.BasicDistributedZkTest-jetty3-1357067255605/collection1
[junit4:junit4]   2> 15662 T698 oasc.ZkController.createCollectionZkNode Check for collection zkNode:collection1
[junit4:junit4]   2> 15671 T698 oasc.ZkController.createCollectionZkNode Collection zkNode exists
[junit4:junit4]   2> 15671 T698 oasc.ZkController.readConfigName Load collection config from:/collections/collection1
[junit4:junit4]   2> 15676 T698 oasc.SolrResourceLoader.<init> new SolrResourceLoader for directory: '/Users/jenkins/jenkins-slave/workspace/Lucene-Solr-trunk-MacOSX/solr/build/solr-core/test/J0/./org.apache.solr.cloud.BasicDistributedZkTest-jetty3-1357067255605/collection1/'
[junit4:junit4]   2> 15677 T698 oasc.SolrResourceLoader.replaceClassLoader Adding 'file:/Users/jenkins/jenkins-slave/workspace/Lucene-Solr-trunk-MacOSX/solr/build/solr-core/test/J0/org.apache.solr.cloud.BasicDistributedZkTest-jetty3-1357067255605/collection1/lib/classes/' to classloader
[junit4:junit4]   2> 15677 T698 oasc.SolrResourceLoader.replaceClassLoader Adding 'file:/Users/jenkins/jenkins-slave/workspace/Lucene-Solr-trunk-MacOSX/solr/build/solr-core/test/J0/org.apache.solr.cloud.BasicDistributedZkTest-jetty3-1357067255605/collection1/lib/README' to classloader
[junit4:junit4]   2> 15758 T698 oasc.SolrConfig.<init> Using Lucene MatchVersion: LUCENE_50
[junit4:junit4]   2> 15841 T698 oasc.SolrConfig.<init> Loaded SolrConfig: solrconfig.xml
[junit4:junit4]   2> 15847 T698 oass.IndexSchema.readSchema Reading Solr Schema
[junit4:junit4]   2> 15854 T698 oass.IndexSchema.readSchema Schema name=test
[junit4:junit4]   2> 16419 T649 oascc.ZkStateReader.updateClusterState Updating cloud state from ZooKeeper... 
[junit4:junit4]   2> 16427 T649 oasc.Overseer$ClusterStateUpdater.updateState Update state numShards=2 message={
[junit4:junit4]   2> 	  "operation":"state",
[junit4:junit4]   2> 	  "numShards":"2",
[junit4:junit4]   2> 	  "shard":"shard2",
[junit4:junit4]   2> 	  "roles":null,
[junit4:junit4]   2> 	  "state":"active",
[junit4:junit4]   2> 	  "core":"collection1",
[junit4:junit4]   2> 	  "collection":"collection1",
[junit4:junit4]   2> 	  "node_name":"127.0.0.1:49336_",
[junit4:junit4]   2> 	  "base_url":"http://127.0.0.1:49336"}
[junit4:junit4]   2> 16456 T682 oascc.ZkStateReader$2.process A cluster state change: WatchedEvent state:SyncConnected type:NodeDataChanged path:/clusterstate.json, has occurred - updating... (live nodes size: 4)
[junit4:junit4]   2> 16457 T697 oascc.ZkStateReader$2.process A cluster state change: WatchedEvent state:SyncConnected type:NodeDataChanged path:/clusterstate.json, has occurred - updating... (live nodes size: 4)
[junit4:junit4]   2> 16457 T648 oascc.ZkStateReader$2.process A cluster state change: WatchedEvent state:SyncConnected type:NodeDataChanged path:/clusterstate.json, has occurred - updating... (live nodes size: 4)
[junit4:junit4]   2> 16458 T667 oascc.ZkStateReader$2.process A cluster state change: WatchedEvent state:SyncConnected type:NodeDataChanged path:/clusterstate.json, has occurred - updating... (live nodes size: 4)
[junit4:junit4]   2> 16459 T654 oascc.ZkStateReader$2.process A cluster state change: WatchedEvent state:SyncConnected type:NodeDataChanged path:/clusterstate.json, has occurred - updating... (live nodes size: 4)
[junit4:junit4]   2> 16911 T698 oass.OpenExchangeRatesOrgProvider.init Initialized with rates=open-exchange-rates.json, refreshInterval=1440.
[junit4:junit4]   2> 16921 T698 oass.IndexSchema.readSchema default search field in schema is text
[junit4:junit4]   2> 16925 T698 oass.IndexSchema.readSchema unique key field: id
[junit4:junit4]   2> 16994 T698 oass.FileExchangeRateProvider.reload Reloading exchange rates from file currency.xml
[junit4:junit4]   2> 17005 T698 oass.FileExchangeRateProvider.reload Reloading exchange rates from file currency.xml
[junit4:junit4]   2> 17012 T698 oass.OpenExchangeRatesOrgProvider.reload Reloading exchange rates from open-exchange-rates.json
[junit4:junit4]   2> 17020 T698 oass.OpenExchangeRatesOrgProvider.reload Reloading exchange rates from open-exchange-rates.json
[junit4:junit4]   2> 17027 T698 oasc.SolrCore.<init> [collection1] Opening new SolrCore at /Users/jenkins/jenkins-slave/workspace/Lucene-Solr-trunk-MacOSX/solr/build/solr-core/test/J0/./org.apache.solr.cloud.BasicDistributedZkTest-jetty3-1357067255605/collection1/, dataDir=./org.apache.solr.cloud.BasicDistributedZkTest-1357067240682/jetty3/
[junit4:junit4]   2> 17028 T698 oasc.JmxMonitoredMap.<init> JMX monitoring is enabled. Adding Solr mbeans to JMX Server: com.sun.jmx.mbeanserver.JmxMBeanServer@90a1f5a
[junit4:junit4]   2> 17029 T698 oasc.SolrCore.initDirectoryFactory solr.StandardDirectoryFactory
[junit4:junit4]   2> 17030 T698 oasc.CachingDirectoryFactory.get return new directory for /Users/jenkins/jenkins-slave/workspace/Lucene-Solr-trunk-MacOSX/solr/build/solr-core/test/J0/./org.apache.solr.cloud.BasicDistributedZkTest-1357067240682/jetty3 forceNew:false
[junit4:junit4]   2> 17030 T698 oasc.CachingDirectoryFactory.close Releasing directory:/Users/jenkins/jenkins-slave/workspace/Lucene-Solr-trunk-MacOSX/solr/build/solr-core/test/J0/./org.apache.solr.cloud.BasicDistributedZkTest-1357067240682/jetty3
[junit4:junit4]   2> 17030 T698 oasc.SolrCore.getNewIndexDir New index directory detected: old=null new=./org.apache.solr.cloud.BasicDistributedZkTest-1357067240682/jetty3/index/
[junit4:junit4]   2> 17087 T698 oasc.SolrCore.initIndex WARNING [collection1] Solr index directory './org.apache.solr.cloud.BasicDistributedZkTest-1357067240682/jetty3/index' doesn't exist. Creating new index...
[junit4:junit4]   2> 17087 T698 oasc.CachingDirectoryFactory.get return new directory for /Users/jenkins/jenkins-slave/workspace/Lucene-Solr-trunk-MacOSX/solr/build/solr-core/test/J0/./org.apache.solr.cloud.BasicDistributedZkTest-1357067240682/jetty3/index forceNew:false
[junit4:junit4]   2> 17092 T698 oasc.SolrDeletionPolicy.onCommit SolrDeletionPolicy.onCommit: commits:num=1
[junit4:junit4]   2> 		commit{dir=RateLimitedDirectoryWrapper(org.apache.lucene.store.NIOFSDirectory@/Users/jenkins/jenkins-slave/workspace/Lucene-Solr-trunk-MacOSX/solr/build/solr-core/test/J0/org.apache.solr.cloud.BasicDistributedZkTest-1357067240682/jetty3/index lockFactory=org.apache.lucene.store.NativeFSLockFactory@15c886f3),segFN=segments_1,generation=1,filenames=[segments_1]
[junit4:junit4]   2> 17093 T698 oasc.SolrDeletionPolicy.updateCommits newest commit = 1[segments_1]
[junit4:junit4]   2> 17093 T698 oasc.CachingDirectoryFactory.close Releasing directory:/Users/jenkins/jenkins-slave/workspace/Lucene-Solr-trunk-MacOSX/solr/build/solr-core/test/J0/./org.apache.solr.cloud.BasicDistributedZkTest-1357067240682/jetty3/index
[junit4:junit4]   2> 17094 T698 oasc.SolrCore.initWriters created xml: solr.XMLResponseWriter
[junit4:junit4]   2> 17097 T698 oasup.UpdateRequestProcessorChain.init inserting DistributedUpdateProcessorFactory into updateRequestProcessorChain "dedupe"
[junit4:junit4]   2> 17098 T698 oasup.UpdateRequestProcessorChain.init inserting DistributedUpdateProcessorFactory into updateRequestProcessorChain "dedupe-allfields"
[junit4:junit4]   2> 17098 T698 oasup.UpdateRequestProcessorChain.init inserting DistributedUpdateProcessorFactory into updateRequestProcessorChain "stored_sig"
[junit4:junit4]   2> 17099 T698 oasup.UpdateRequestProcessorChain.init inserting DistributedUpdateProcessorFactory into updateRequestProcessorChain "uniq-fields"
[junit4:junit4]   2> 17100 T698 oasup.UpdateRequestProcessorChain.init inserting DistributedUpdateProcessorFactory into updateRequestProcessorChain "distrib-dup-test-chain-implicit"
[junit4:junit4]   2> 17100 T698 oasc.RequestHandlers.initHandlersFromConfig adding lazy requestHandler: solr.ReplicationHandler
[junit4:junit4]   2> 17101 T698 oasc.RequestHandlers.initHandlersFromConfig created /replication: solr.ReplicationHandler
[junit4:junit4]   2> 17101 T698 oasc.RequestHandlers.initHandlersFromConfig created standard: solr.StandardRequestHandler
[junit4:junit4]   2> 17103 T698 oasc.RequestHandlers.initHandlersFromConfig created /get: solr.RealTimeGetHandler
[junit4:junit4]   2> 17103 T698 oasc.RequestHandlers.initHandlersFromConfig created dismax: solr.SearchHandler
[junit4:junit4]   2> 17104 T698 oasc.RequestHandlers.initHandlersFromConfig created mock: org.apache.solr.core.MockQuerySenderListenerReqHandler
[junit4:junit4]   2> 17104 T698 oasc.RequestHandlers.initHandlersFromConfig created /admin/: org.apache.solr.handler.admin.AdminHandlers
[junit4:junit4]   2> 17105 T698 oasc.RequestHandlers.initHandlersFromConfig created defaults: solr.StandardRequestHandler
[junit4:junit4]   2> 17105 T698 oasc.RequestHandlers.initHandlersFromConfig adding lazy requestHandler: solr.StandardRequestHandler
[junit4:junit4]   2> 17106 T698 oasc.RequestHandlers.initHandlersFromConfig created lazy: solr.StandardRequestHandler
[junit4:junit4]   2> 17106 T698 oasc.RequestHandlers.initHandlersFromConfig created /update: solr.UpdateRequestHandler
[junit4:junit4]   2> 17107 T698 oasc.RequestHandlers.initHandlersFromConfig created /terms: org.apache.solr.handler.component.SearchHandler
[junit4:junit4]   2> 17108 T698 oasc.RequestHandlers.initHandlersFromConfig created spellCheckCompRH: org.apache.solr.handler.component.SearchHandler
[junit4:junit4]   2> 17108 T698 oasc.RequestHandlers.initHandlersFromConfig created spellCheckCompRH_Direct: org.apache.solr.handler.component.SearchHandler
[junit4:junit4]   2> 17109 T698 oasc.RequestHandlers.initHandlersFromConfig created spellCheckWithWordbreak: org.apache.solr.handler.component.SearchHandler
[junit4:junit4]   2> 17109 T698 oasc.RequestHandlers.initHandlersFromConfig created spellCheckWithWordbreak_Direct: org.apache.solr.handler.component.SearchHandler
[junit4:junit4]   2> 17110 T698 oasc.RequestHandlers.initHandlersFromConfig created spellCheckCompRH1: org.apache.solr.handler.component.SearchHandler
[junit4:junit4]   2> 17111 T698 oasc.RequestHandlers.initHandlersFromConfig created mltrh: org.apache.solr.handler.component.SearchHandler
[junit4:junit4]   2> 17111 T698 oasc.RequestHandlers.initHandlersFromConfig created tvrh: org.apache.solr.handler.component.SearchHandler
[junit4:junit4]   2> 17112 T698 oasc.RequestHandlers.initHandlersFromConfig created /mlt: solr.MoreLikeThisHandler
[junit4:junit4]   2> 17113 T698 oasc.RequestHandlers.initHandlersFromConfig created /debug/dump: solr.DumpRequestHandler
[junit4:junit4]   2> 17122 T698 oashl.XMLLoader.init xsltCacheLifetimeSeconds=60
[junit4:junit4]   2> 17128 T698 oasc.SolrCore.initDeprecatedSupport WARNING solrconfig.xml uses deprecated <admin/gettableFiles>, Please update your config to use the ShowFileRequestHandler.
[junit4:junit4]   2> 17139 T698 oasc.SolrCore.initDeprecatedSupport WARNING adding ShowFileRequestHandler with hidden files: [SCHEMA.XML, OLD_SYNONYMS.TXT, STOPWORDS.TXT, PROTWORDS.TXT, OPEN-EXCHANGE-RATES.JSON, SYNONYMS.TXT, CURRENCY.XML, MAPPING-ISOLATIN1ACCENT.TXT]
[junit4:junit4]   2> 17146 T698 oasc.CachingDirectoryFactory.close Releasing directory:/Users/jenkins/jenkins-slave/workspace/Lucene-Solr-trunk-MacOSX/solr/build/solr-core/test/J0/./org.apache.solr.cloud.BasicDistributedZkTest-1357067240682/jetty3
[junit4:junit4]   2> 17149 T698 oass.SolrIndexSearcher.<init> Opening Searcher@72d0b2cf main
[junit4:junit4]   2> 17151 T698 oasu.CommitTracker.<init> Hard AutoCommit: disabled
[junit4:junit4]   2> 17151 T698 oasu.CommitTracker.<init> Soft AutoCommit: disabled
[junit4:junit4]   2> 17152 T698 oashc.SpellCheckComponent.inform Initializing spell checkers
[junit4:junit4]   2> 17162 T698 oass.DirectSolrSpellChecker.init init: {name=direct,classname=DirectSolrSpellChecker,field=lowerfilt,minQueryLength=3}
[junit4:junit4]   2> 17231 T699 oasc.SolrCore.registerSearcher [collection1] Registered new searcher Searcher@72d0b2cf main{StandardDirectoryReader(segments_1:1)}
[junit4:junit4]   2> 17254 T698 oasc.ZkController.publish publishing core=collection1 state=down
[junit4:junit4]   2> 17255 T698 oasc.ZkController.publish numShards not found on descriptor - reading it from system property
[junit4:junit4]   2> 17986 T649 oascc.ZkStateReader.updateClusterState Updating cloud state from ZooKeeper... 
[junit4:junit4]   2> 17988 T649 oasc.Overseer$ClusterStateUpdater.updateState Update state numShards=2 message={
[junit4:junit4]   2> 	  "operation":"state",
[junit4:junit4]   2> 	  "numShards":"2",
[junit4:junit4]   2> 	  "shard":null,
[junit4:junit4]   2> 	  "roles":null,
[junit4:junit4]   2> 	  "state":"down",
[junit4:junit4]   2> 	  "core":"collection1",
[junit4:junit4]   2> 	  "collection":"collection1",
[junit4:junit4]   2> 	  "node_name":"127.0.0.1:49339_",
[junit4:junit4]   2> 	  "base_url":"http://127.0.0.1:49339"}
[junit4:junit4]   2> 17989 T649 oasc.Overseer$ClusterStateUpdater.updateState Collection already exists with numShards=2
[junit4:junit4]   2> 17989 T649 oasc.Overseer$ClusterStateUpdater.updateState Assigning new node to shard shard=shard1
[junit4:junit4]   2> 18005 T682 oascc.ZkStateReader$2.process A cluster state change: WatchedEvent state:SyncConnected type:NodeDataChanged path:/clusterstate.json, has occurred - updating... (live nodes size: 4)
[junit4:junit4]   2> 18006 T648 oascc.ZkStateReader$2.process A cluster state change: WatchedEvent state:SyncConnected type:NodeDataChanged path:/clusterstate.json, has occurred - updating... (live nodes size: 4)
[junit4:junit4]   2> 18006 T667 oascc.ZkStateReader$2.process A cluster state change: WatchedEvent state:SyncConnected type:NodeDataChanged path:/clusterstate.json, has occurred - updating... (live nodes size: 4)
[junit4:junit4]   2> 18006 T697 oascc.ZkStateReader$2.process A cluster state change: WatchedEvent state:SyncConnected type:NodeDataChanged path:/clusterstate.json, has occurred - updating... (live nodes size: 4)
[junit4:junit4]   2> 18007 T654 oascc.ZkStateReader$2.process A cluster state change: WatchedEvent state:SyncConnected type:NodeDataChanged path:/clusterstate.json, has occurred - updating... (live nodes size: 4)
[junit4:junit4]   2> 18261 T698 oasc.CoreContainer.registerCore registering core: collection1
[junit4:junit4]   2> 18261 T698 oasc.ZkController.register Register replica - core:collection1 address:http://127.0.0.1:49339 collection:collection1 shard:shard1
[junit4:junit4]   2> 18281 T698 oasc.ZkController.register We are http://127.0.0.1:49339/collection1/ and leader is http://127.0.0.1:49333/collection1/
[junit4:junit4]   2> 18284 T698 oasc.ZkController.register No LogReplay needed for core=collection1 baseURL=http://127.0.0.1:49339
[junit4:junit4]   2> 18284 T698 oasc.ZkController.checkRecovery Core needs to recover:collection1
[junit4:junit4]   2> 18285 T698 oasu.DefaultSolrCoreState.doRecovery Running recovery - first canceling any ongoing recovery
[junit4:junit4]   2> ASYNC  NEW_CORE C16 name=collection1 org.apache.solr.core.SolrCore@52bad42c url=http://127.0.0.1:49339/collection1 node=127.0.0.1:49339_ C16_STATE=coll:collection1 core:collection1 props:{shard=null, roles=null, state=down, core=collection1, collection=collection1, node_name=127.0.0.1:49339_, base_url=http://127.0.0.1:49339}
[junit4:junit4]   2> 18296 T700 C16 P49339 oasc.RecoveryStrategy.run Starting recovery process.  core=collection1 recoveringAfterStartup=true
[junit4:junit4]   2> 18298 T700 C16 P49339 oasc.RecoveryStrategy.doRecovery ###### startupVersions=[]
[junit4:junit4]   2> 18299 T700 C16 P49339 oasc.ZkController.publish publishing core=collection1 state=recovering
[junit4:junit4]   2> 18299 T700 C16 P49339 oasc.ZkController.publish numShards not found on descriptor - reading it from system property
[junit4:junit4]   2> 18310 T698 oascc.ZkStateReader.updateClusterState Updating cloud state from ZooKeeper... 
[junit4:junit4]   2> 18323 T700 C16 P49339 oascsi.HttpClientUtil.createClient Creating new http client, config:maxConnections=128&maxConnectionsPerHost=32&followRedirects=false
[junit4:junit4]   2> 18332 T626 oass.SolrDispatchFilter.init user.dir=/Users/jenkins/jenkins-slave/workspace/Lucene-Solr-trunk-MacOSX/solr/build/solr-core/test/J0
[junit4:junit4]   2> 18333 T626 oass.SolrDispatchFilter.init SolrDispatchFilter.init() done
[junit4:junit4]   2> 18334 T626 oascsi.HttpClientUtil.createClient Creating new http client, config:maxConnections=128&maxConnectionsPerHost=32&followRedirects=false
[junit4:junit4]   2> 18757 T626 oejs.Server.doStart jetty-8.1.8.v20121106
[junit4:junit4]   2> 18795 T626 oejs.AbstractConnector.doStart Started SelectChannelConnector@127.0.0.1:49343
[junit4:junit4]   2> 18799 T626 oasc.SolrResourceLoader.locateSolrHome JNDI not configured for solr (NoInitialContextEx)
[junit4:junit4]   2> 18800 T626 oasc.SolrResourceLoader.locateSolrHome using system property solr.solr.home: /Users/jenkins/jenkins-slave/workspace/Lucene-Solr-trunk-MacOSX/solr/build/solr-core/test/J0/./org.apache.solr.cloud.BasicDistributedZkTest-jetty4-1357067259008
[junit4:junit4]   2> 18801 T626 oasc.SolrResourceLoader.<init> new SolrResourceLoader for deduced Solr Home: '/Users/jenkins/jenkins-slave/workspace/Lucene-Solr-trunk-MacOSX/solr/build/solr-core/test/J0/./org.apache.solr.cloud.BasicDistributedZkTest-jetty4-1357067259008/'
[junit4:junit4]   2> 18899 T626 oass.SolrDispatchFilter.init SolrDispatchFilter.init()
[junit4:junit4]   2> 18900 T626 oasc.SolrResourceLoader.locateSolrHome JNDI not configured for solr (NoInitialContextEx)
[junit4:junit4]   2> 18900 T626 oasc.SolrResourceLoader.locateSolrHome using system property solr.solr.home: /Users/jenkins/jenkins-slave/workspace/Lucene-Solr-trunk-MacOSX/solr/build/solr-core/test/J0/./org.apache.solr.cloud.BasicDistributedZkTest-jetty4-1357067259008
[junit4:junit4]   2> 18901 T626 oasc.CoreContainer$Initializer.initialize looking for solr.xml: /Users/jenkins/jenkins-slave/workspace/Lucene-Solr-trunk-MacOSX/solr/build/solr-core/test/J0/./org.apache.solr.cloud.BasicDistributedZkTest-jetty4-1357067259008/solr.xml
[junit4:junit4]   2> 18901 T626 oasc.CoreContainer.<init> New CoreContainer 1877538072
[junit4:junit4]   2> 18902 T626 oasc.CoreContainer.load Loading CoreContainer using Solr Home: '/Users/jenkins/jenkins-slave/workspace/Lucene-Solr-trunk-MacOSX/solr/build/solr-core/test/J0/./org.apache.solr.cloud.BasicDistributedZkTest-jetty4-1357067259008/'
[junit4:junit4]   2> 18902 T626 oasc.SolrResourceLoader.<init> new SolrResourceLoader for directory: '/Users/jenkins/jenkins-slave/workspace/Lucene-Solr-trunk-MacOSX/solr/build/solr-core/test/J0/./org.apache.solr.cloud.BasicDistributedZkTest-jetty4-1357067259008/'
[junit4:junit4]   2> 18948 T626 oashc.HttpShardHandlerFactory.getParameter Setting socketTimeout to: 30000
[junit4:junit4]   2> 18948 T626 oashc.HttpShardHandlerFactory.getParameter Setting urlScheme to: http://
[junit4:junit4]   2> 18949 T626 oashc.HttpShardHandlerFactory.getParameter Setting connTimeout to: 15000
[junit4:junit4]   2> 18949 T626 oashc.HttpShardHandlerFactory.getParameter Setting maxConnectionsPerHost to: 20
[junit4:junit4]   2> 18950 T626 oashc.HttpShardHandlerFactory.getParameter Setting corePoolSize to: 0
[junit4:junit4]   2> 18950 T626 oashc.HttpShardHandlerFactory.getParameter Setting maximumPoolSize to: 2147483647
[junit4:junit4]   2> 18951 T626 oashc.HttpShardHandlerFactory.getParameter Setting maxThreadIdleTime to: 5
[junit4:junit4]   2> 18951 T626 oashc.HttpShardHandlerFactory.getParameter Setting sizeOfQueue to: -1
[junit4:junit4]   2> 18952 T626 oashc.HttpShardHandlerFactory.getParameter Setting fairnessPolicy to: false
[junit4:junit4]   2> 18952 T626 oascsi.HttpClientUtil.createClient Creating new http client, config:maxConnectionsPerHost=20&maxConnections=10000&socketTimeout=30000&connTimeout=15000&retry=false
[junit4:junit4]   2> 18976 T626 oasc.CoreContainer.load Registering Log Listener
[junit4:junit4]   2> 19016 T626 oasc.CoreContainer.initZooKeeper Zookeeper client=127.0.0.1:49326/solr
[junit4:junit4]   2> 19016 T626 oasc.ZkController.checkChrootPath zkHost includes chroot
[junit4:junit4]   2> 19017 T626 oaz.ZooKeeper.<init> Initiating client connection, connectString=127.0.0.1:49326 sessionTimeout=60000 watcher=org.apache.solr.common.cloud.ConnectionManager@592fea1d
[junit4:junit4]   2> 19018 T626 oascc.ConnectionManager.waitForConnected Waiting for client to connect to ZooKeeper
[junit4:junit4]   2> 19020 T710 oaz.ClientCnxn$SendThread.logStartConnect Opening socket connection to server localhost/127.0.0.1:49326. Will not attempt to authenticate using SASL (access denied ("javax.security.auth.AuthPermission" "getLoginConfiguration"))
[junit4:junit4]   2> 19027 T710 oaz.ClientCnxn$SendThread.primeConnection Socket connection established to localhost/127.0.0.1:49326, initiating session
[junit4:junit4]   2> 19030 T628 oazs.NIOServerCnxnFactory.run Accepted socket connection from /127.0.0.1:49344
[junit4:junit4]   2> 19031 T628 oazs.ZooKeeperServer.processConnectRequest Client attempting to establish new session at /127.0.0.1:49344
[junit4:junit4]   2> 19033 T630 oazs.ZooKeeperServer.finishSessionInit Established session 0x13bf782c4f5000b with negotiated timeout 20000 for client /127.0.0.1:49344
[junit4:junit4]   2> 19033 T710 oaz.ClientCnxn$SendThread.onConnected Session establishment complete on server localhost/127.0.0.1:49326, sessionid = 0x13bf782c4f5000b, negotiated timeout = 20000
[junit4:junit4]   2> 19033 T711 oascc.ConnectionManager.process Watcher org.apache.solr.common.cloud.ConnectionManager@592fea1d name:ZooKeeperConnection Watcher:127.0.0.1:49326 got event WatchedEvent state:SyncConnected type:None path:null path:null type:None
[junit4:junit4]   2> 19034 T626 oascc.ConnectionManager.waitForConnected Client is connected to ZooKeeper
[junit4:junit4]   2> 19040 T631 oazs.PrepRequestProcessor.pRequest2Txn Processed session termination for sessionid: 0x13bf782c4f5000b
[junit4:junit4]   2> 19041 T628 oazs.NIOServerCnxn.closeSock Closed socket connection for client /127.0.0.1:49344 which had sessionid 0x13bf782c4f5000b
[junit4:junit4]   2> 19042 T626 oaz.ZooKeeper.close Session: 0x13bf782c4f5000b closed
[junit4:junit4]   2> 19043 T711 oaz.ClientCnxn$EventThread.run EventThread shut down
[junit4:junit4]   2> 19044 T626 oascsi.HttpClientUtil.createClient Creating new http client, config:maxConnections=500&maxConnectionsPerHost=16&socketTimeout=15000&connTimeout=30000
[junit4:junit4]   2> 19068 T626 oaz.ZooKeeper.<init> Initiating client connection, connectString=127.0.0.1:49326/solr sessionTimeout=30000 watcher=org.apache.solr.common.cloud.ConnectionManager@6626cccc
[junit4:junit4]   2> 19073 T626 oascc.ConnectionManager.waitForConnected Waiting for client to connect to ZooKeeper
[junit4:junit4]   2> 19074 T712 oaz.ClientCnxn$SendThread.logStartConnect Opening socket connection to server localhost/127.0.0.1:49326. Will not attempt to authenticate using SASL (access denied ("javax.security.auth.AuthPermission" "getLoginConfiguration"))
[junit4:junit4]   2> 19075 T712 oaz.ClientCnxn$SendThread.primeConnection Socket connection established to localhost/127.0.0.1:49326, initiating session
[junit4:junit4]   2> 19076 T628 oazs.NIOServerCnxnFactory.run Accepted socket connection from /127.0.0.1:49345
[junit4:junit4]   2> 19076 T628 oazs.ZooKeeperServer.processConnectRequest Client attempting to establish new session at /127.0.0.1:49345
[junit4:junit4]   2> 19078 T630 oazs.ZooKeeperServer.finishSessionInit Established session 0x13bf782c4f5000c with negotiated timeout 20000 for client /127.0.0.1:49345
[junit4:junit4]   2> 19078 T712 oaz.ClientCnxn$SendThread.onConnected Session establishment complete on server localhost/127.0.0.1:49326, sessionid = 0x13bf782c4f5000c, negotiated timeout = 20000
[junit4:junit4]   2> 19078 T713 oascc.ConnectionManager.process Watcher org.apache.solr.common.cloud.ConnectionManager@6626cccc name:ZooKeeperConnection Watcher:127.0.0.1:49326/solr got event WatchedEvent state:SyncConnected type:None path:null path:null type:None
[junit4:junit4]   2> 19081 T626 oascc.ConnectionManager.waitForConnected Client is connected to ZooKeeper
[junit4:junit4]   2> 19086 T631 oazs.PrepRequestProcessor.pRequest Got user-level KeeperException when processing sessionid:0x13bf782c4f5000c type:create cxid:0x1 zxid:0xa2 txntype:-1 reqpath:n/a Error Path:/solr/overseer Error:KeeperErrorCode = NodeExists for /solr/overseer
[junit4:junit4]   2> 19090 T631 oazs.PrepRequestProcessor.pRequest Got user-level KeeperException when processing sessionid:0x13bf782c4f5000c type:create cxid:0x2 zxid:0xa3 txntype:-1 reqpath:n/a Error Path:/solr/overseer Error:KeeperErrorCode = NodeExists for /solr/overseer
[junit4:junit4]   2> 19094 T626 oasc.ZkController.createEphemeralLiveNode Register node as live in ZooKeeper:/live_nodes/127.0.0.1:49343_
[junit4:junit4]   2> 19095 T631 oazs.PrepRequestProcessor.pRequest Got user-level KeeperException when processing sessionid:0x13bf782c4f5000c type:delete cxid:0x4 zxid:0xa4 txntype:-1 reqpath:n/a Error Path:/solr/live_nodes/127.0.0.1:49343_ Error:KeeperErrorCode = NoNode for /solr/live_nodes/127.0.0.1:49343_
[junit4:junit4]   2> 19098 T626 oascc.SolrZkClient.makePath makePath: /live_nodes/127.0.0.1:49343_
[junit4:junit4]   2> 19119 T667 oascc.ZkStateReader$2.process A cluster state change: WatchedEvent state:SyncConnected type:NodeChildrenChanged path:/live_nodes, has occurred - updating... (live nodes size: 4)
[junit4:junit4]   2> 19119 T648 oascc.ZkStateReader$2.process A cluster state change: WatchedEvent state:SyncConnected type:NodeChildrenChanged path:/live_nodes, has occurred - updating... (live nodes size: 4)
[junit4:junit4]   2> 19124 T654 oascc.ZkStateReader$3.process Updating live nodes... (5)
[junit4:junit4]   2> 19124 T682 oascc.ZkStateReader$3.process Updating live nodes... (5)
[junit4:junit4]   2> 19124 T697 oascc.ZkStateReader$3.process Updating live nodes... (5)
[junit4:junit4]   2> 19125 T697 oascc.ZkStateReader$2.process A cluster state change: WatchedEvent state:SyncConnected type:NodeChildrenChanged path:/live_nodes, has occurred - updating... (live nodes size: 5)
[junit4:junit4]   2> 19124 T654 oascc.ZkStateReader$2.process A cluster state change: WatchedEvent state:SyncConnected type:NodeChildrenChanged path:/live_nodes, has occurred - updating... (live nodes size: 5)
[junit4:junit4]   2> 19125 T682 oascc.ZkStateReader$2.process A cluster state change: WatchedEvent state:SyncConnected type:NodeChildrenChanged path:/live_nodes, has occurred - updating... (live nodes size: 5)
[junit4:junit4]   2> 19130 T667 oascc.ZkStateReader$3.process Updating live nodes... (5)
[junit4:junit4]   2> 19131 T648 oascc.ZkStateReader$3.process Updating live nodes... (5)
[junit4:junit4]   2> 19144 T626 oascc.ZkStateReader.createClusterStateWatchersAndUpdate Updating cluster state from ZooKeeper... 
[junit4:junit4]   2> 19165 T714 oasc.CoreContainer.create Creating SolrCore 'collection1' using instanceDir: /Users/jenkins/jenkins-slave/workspace/Lucene-Solr-trunk-MacOSX/solr/build/solr-core/test/J0/./org.apache.solr.cloud.BasicDistributedZkTest-jetty4-1357067259008/collection1
[junit4:junit4]   2> 19165 T714 oasc.ZkController.createCollectionZkNode Check for collection zkNode:collection1
[junit4:junit4]   2> 19172 T714 oasc.ZkController.createCollectionZkNode Collection zkNode exists
[junit4:junit4]   2> 19173 T714 oasc.ZkController.readConfigName Load collection config from:/collections/collection1
[junit4:junit4]   2> 19184 T714 oasc.SolrResourceLoader.<init> new SolrResourceLoader for directory: '/Users/jenkins/jenkins-slave/workspace/Lucene-Solr-trunk-MacOSX/solr/build/solr-core/test/J0/./org.apache.solr.cloud.BasicDistributedZkTest-jetty4-1357067259008/collection1/'
[junit4:junit4]   2> 19185 T714 oasc.SolrResourceLoader.replaceClassLoader Adding 'file:/Users/jenkins/jenkins-slave/workspace/Lucene-Solr-trunk-MacOSX/solr/build/solr-core/test/J0/org.apache.solr.cloud.BasicDistributedZkTest-jetty4-1357067259008/collection1/lib/classes/' to classloader
[junit4:junit4]   2> 19186 T714 oasc.SolrResourceLoader.replaceClassLoader Adding 'file:/Users/jenkins/jenkins-slave/workspace/Lucene-Solr-trunk-MacOSX/solr/build/solr-core/test/J0/org.apache.solr.cloud.BasicDistributedZkTest-jetty4-1357067259008/collection1/lib/README' to classloader
[junit4:junit4]   2> 19266 T714 oasc.SolrConfig.<init> Using Lucene MatchVersion: LUCENE_50
[junit4:junit4]   2> 19358 T714 oasc.SolrConfig.<init> Loaded SolrConfig: solrconfig.xml
[junit4:junit4]   2> 19366 T714 oass.IndexSchema.readSchema Reading Solr Schema
[junit4:junit4]   2> 19383 T714 oass.IndexSchema.readSchema Schema name=test
[junit4:junit4]   2> 19546 T649 oascc.ZkStateReader.updateClusterState Updating cloud state from ZooKeeper... 
[junit4:junit4]   2> 19548 T649 oasc.Overseer$ClusterStateUpdater.updateState Update state numShards=2 message={
[junit4:junit4]   2> 	  "operation":"state",
[junit4:junit4]   2> 	  "numShards":"2",
[junit4:junit4]   2> 	  "shard":"shard1",
[junit4:junit4]   2> 	  "roles":null,
[junit4:junit4]   2> 	  "state":"recovering",
[junit4:junit4]   2> 	  "core":"collection1",
[junit4:junit4]   2> 	  "collection":"collection1",
[junit4:junit4]   2> 	  "node_name":"127.0.0.1:49339_",
[junit4:junit4]   2> 	  "base_url":"http://127.0.0.1:49339"}
[junit4:junit4]   2> 19577 T667 oascc.ZkStateReader$2.process A cluster state change: WatchedEvent state:SyncConnected type:NodeDataChanged path:/clusterstate.json, has occurred - updating... (live nodes size: 5)
[junit4:junit4]   2> 19577 T713 oascc.ZkStateReader$2.process A cluster state change: WatchedEvent state:SyncConnected type:NodeDataChanged path:/clusterstate.json, has occurred - updating... (live nodes size: 5)
[junit4:junit4]   2> 19578 T654 oascc.ZkStateReader$2.process A cluster state change: WatchedEvent state:SyncConnected type:NodeDataChanged path:/clusterstate.json, has occurred - updating... (live nodes size: 5)
[junit4:junit4]   2> 19578 T682 oascc.ZkStateReader$2.process A cluster state change: WatchedEvent state:SyncConnected type:NodeDataChanged path:/clusterstate.json, has occurred - updating... (live nodes size: 5)
[junit4:junit4]   2> 19578 T697 oascc.ZkStateReader$2.process A cluster state change: WatchedEvent state:SyncConnected type:NodeDataChanged path:/clusterstate.json, has occurred - updating... (live nodes size: 5)
[junit4:junit4]   2> 19578 T648 oascc.ZkStateReader$2.process A cluster state change: WatchedEvent state:SyncConnected type:NodeDataChanged path:/clusterstate.json, has occurred - updating... (live nodes size: 5)
[junit4:junit4]   2> 20304 T714 oass.OpenExchangeRatesOrgProvider.init Initialized with rates=open-exchange-rates.json, refreshInterval=1440.
[junit4:junit4]   2> 20317 T714 oass.IndexSchema.readSchema default search field in schema is text
[junit4:junit4]   2> 20323 T714 oass.IndexSchema.readSchema unique key field: id
[junit4:junit4]   2> 20409 T714 oass.FileExchangeRateProvider.reload Reloading exchange rates from file currency.xml
[junit4:junit4]   2> 20434 T714 oass.FileExchangeRateProvider.reload Reloading exchange rates from file currency.xml
[junit4:junit4]   2> 20442 T714 oass.OpenExchangeRatesOrgProvider.reload Reloading exchange rates from open-exchange-rates.json
[junit4:junit4]   2> 20447 T714 oass.OpenExchangeRatesOrgProvider.reload Reloading exchange rates from open-exchange-rates.json
[junit4:junit4]   2> 20452 T714 oasc.SolrCore.<init> [collection1] Opening new SolrCore at /Users/jenkins/jenkins-slave/workspace/Lucene-Solr-trunk-MacOSX/solr/build/solr-core/test/J0/./org.apache.solr.cloud.BasicDistributedZkTest-jetty4-1357067259008/collection1/, dataDir=./org.apache.solr.cloud.BasicDistributedZkTest-1357067240682/jetty4/
[junit4:junit4]   2> 20452 T714 oasc.JmxMonitoredMap.<init> JMX monitoring is enabled. Adding Solr mbeans to JMX Server: com.sun.jmx.mbeanserver.JmxMBeanServer@90a1f5a
[junit4:junit4]   2> 20453 T714 oasc.SolrCore.initDirectoryFactory solr.StandardDirectoryFactory
[junit4:junit4]   2> 20454 T714 oasc.CachingDirectoryFactory.get return new directory for /Users/jenkins/jenkins-slave/workspace/Lucene-Solr-trunk-MacOSX/solr/build/solr-core/test/J0/./org.apache.solr.cloud.BasicDistributedZkTest-1357067240682/jetty4 forceNew:false
[junit4:junit4]   2> 20454 T714 oasc.CachingDirectoryFactory.close Releasing directory:/Users/jenkins/jenkins-slave/workspace/Lucene-Solr-trunk-MacOSX/solr/build/solr-core/test/J0/./org.apache.solr.cloud.BasicDistributedZkTest-1357067240682/jetty4
[junit4:junit4]   2> 20455 T714 oasc.SolrCore.getNewIndexDir New index directory detected: old=null new=./org.apache.solr.cloud.BasicDistributedZkTest-1357067240682/jetty4/index/
[junit4:junit4]   2> 20455 T714 oasc.SolrCore.initIndex WARNING [collection1] Solr index directory './org.apache.solr.cloud.BasicDistributedZkTest-1357067240682/jetty4/index' doesn't exist. Creating new index...
[junit4:junit4]   2> 20456 T714 oasc.CachingDirectoryFactory.get return new directory for /Users/jenkins/jenkins-slave/workspace/Lucene-Solr-trunk-MacOSX/solr/build/solr-core/test/J0/./org.apache.solr.cloud.BasicDistributedZkTest-1357067240682/jetty4/index forceNew:false
[junit4:junit4]   2> 20474 T714 oasc.SolrDeletionPolicy.onCommit SolrDeletionPolicy.onCommit: commits:num=1
[junit4:junit4]   2> 		commit{dir=RateLimitedDirectoryWrapper(org.apache.lucene.store.NIOFSDirectory@/Users/jenkins/jenkins-slave/workspace/Lucene-Solr-trunk-MacOSX/solr/build/solr-core/test/J0/org.apache.solr.cloud.BasicDistributedZkTest-1357067240682/jetty4/index lockFactory=org.apache.lucene.store.NativeFSLockFactory@3e379080),segFN=segments_1,generation=1,filenames=[segments_1]
[junit4:junit4]   2> 20475 T714 oasc.SolrDeletionPolicy.updateCommits newest commit = 1[segments_1]
[junit4:junit4]   2> 20476 T714 oasc.CachingDirectoryFactory.close Releasing directory:/Users/jenkins/jenkins-slave/workspace/Lucene-Solr-trunk-MacOSX/solr/build/solr-core/test/J0/./org.apache.solr.cloud.BasicDistributedZkTest-1357067240682/jetty4/index
[junit4:junit4]   2> 20476 T714 oasc.SolrCore.initWriters created xml: solr.XMLResponseWriter
[junit4:junit4]   2> 20480 T714 oasup.UpdateRequestProcessorChain.init inserting DistributedUpdateProcessorFactory into updateRequestProcessorChain "dedupe"
[junit4:junit4]   2> 20481 T714 oasup.UpdateRequestProcessorChain.init inserting DistributedUpdateProcessorFactory into updateRequestProcessorChain "dedupe-allfields"
[junit4:junit4]   2> 20481 T714 oasup.UpdateRequestProcessorChain.init inserting DistributedUpdateProcessorFactory into updateRequestProcessorChain "stored_sig"
[junit4:junit4]   2> 20482 T714 oasup.UpdateRequestProcessorChain.init inserting DistributedUpdateProcessorFactory into updateRequestProcessorChain "uniq-fields"
[junit4:junit4]   2> 20483 T714 oasup.UpdateRequestProcessorChain.init inserting DistributedUpdateProcessorFactory into updateRequestProcessorChain "distrib-dup-test-chain-implicit"
[junit4:junit4]   2> 20484 T714 oasc.RequestHandlers.initHandlersFromConfig adding lazy requestHandler: solr.ReplicationHandler
[junit4:junit4]   2> 20484 T714 oasc.RequestHandlers.initHandlersFromConfig created /replication: solr.ReplicationHandler
[junit4:junit4]   2> 20485 T714 oasc.RequestHandlers.initHandlersFromConfig created standard: solr.StandardRequestHandler
[junit4:junit4]   2> 20485 T714 oasc.RequestHandlers.initHandlersFromConfig created /get: solr.RealTimeGetHandler
[junit4:junit4]   2> 20486 T714 oasc.RequestHandlers.initHandlersFromConfig created dismax: solr.SearchHandler
[junit4:junit4]   2> 20487 T714 oasc.RequestHandlers.initHandlersFromConfig created mock: org.apache.solr.core.MockQuerySenderListenerReqHandler
[junit4:junit4]   2> 20488 T714 oasc.RequestHandlers.initHandlersFromConfig created /admin/: org.apache.solr.handler.admin.AdminHandlers
[junit4:junit4]   2> 20489 T714 oasc.RequestHandlers.initHandlersFromConfig created defaults: solr.StandardRequestHandler
[junit4:junit4]   2> 20489 T714 oasc.RequestHandlers.initHandlersFromConfig adding lazy requestHandler: solr.StandardRequestHandler
[junit4:junit4]   2> 20490 T714 oasc.RequestHandlers.initHandlersFromConfig created lazy: solr.StandardRequestHandler
[junit4:junit4]   2> 20490 T714 oasc.RequestHandlers.initHandlersFromConfig created /update: solr.UpdateRequestHandler
[junit4:junit4]   2> 20491 T714 oasc.RequestHandlers.initHandlersFromConfig created /terms: org.apache.solr.handler.component.SearchHandler
[junit4:junit4]   2> 20492 T714 oasc.RequestHandlers.initHandlersFromConfig created spellCheckCompRH: org.apache.solr.handler.component.SearchHandler
[junit4:junit4]   2> 20492 T714 oasc.RequestHandlers.initHandlersFromConfig created spellCheckCompRH_Direct: org.apache.solr.handler.component.SearchHandler
[junit4:junit4]   2> 20493 T714 oasc.RequestHandlers.initHandlersFromConfig created spellCheckWithWordbreak: org.apache.solr.handler.component.SearchHandler
[junit4:junit4]   2> 20493 T714 oasc.RequestHandlers.initHandlersFromConfig created spellCheckWithWordbreak_Direct: org.apache.solr.handler.component.SearchHandler
[junit4:junit4]   2> 20495 T714 oasc.RequestHandlers.initHandlersFromConfig created spellCheckCompRH1: org.apache.solr.handler.component.SearchHandler
[junit4:junit4]   2> 20496 T714 oasc.RequestHandlers.initHandlersFromConfig created mltrh: org.apache.solr.handler.component.SearchHandler
[junit4:junit4]   2> 20496 T714 oasc.RequestHandlers.initHandlersFromConfig created tvrh: org.apache.solr.handler.component.SearchHandler
[junit4:junit4]   2> 20497 T714 oasc.RequestHandlers.initHandlersFromConfig created /mlt: solr.MoreLikeThisHandler
[junit4:junit4]   2> 20498 T714 oasc.RequestHandlers.initHandlersFromConfig created /debug/dump: solr.DumpRequestHandler
[junit4:junit4]   2> 20508 T714 oashl.XMLLoader.init xsltCacheLifetimeSeconds=60
[junit4:junit4]   2> 20512 T714 oasc.SolrCore.initDeprecatedSupport WARNING solrconfig.xml uses deprecated <admin/gettableFiles>, Please update your config to use the ShowFileRequestHandler.
[junit4:junit4]   2> 20518 T714 oasc.SolrCore.initDeprecatedSupport WARNING adding ShowFileRequestHandler with hidden files: [SCHEMA.XML, OLD_SYNONYMS.TXT, STOPWORDS.TXT, PROTWORDS.TXT, OPEN-EXCHANGE-RATES.JSON, SYNONYMS.TXT, CURRENCY.XML, MAPPING-ISOLATIN1ACCENT.TXT]
[junit4:junit4]   2> 20521 T714 oasc.CachingDirectoryFactory.close Releasing directory:/Users/jenkins/jenkins-slave/workspace/Lucene-Solr-trunk-MacOSX/solr/build/solr-core/test/J0/./org.apache.solr.cloud.BasicDistributedZkTest-1357067240682/jetty4
[junit4:junit4]   2> 20528 T714 oass.SolrIndexSearcher.<init> Opening Searcher@3942ac57 main
[junit4:junit4]   2> 20529 T714 oasu.CommitTracker.<init> Hard AutoCommit: disabled
[junit4:junit4]   2> 20530 T714 oasu.CommitTracker.<init> Soft AutoCommit: disabled
[junit4:junit4]   2> 20531 T714 oashc.SpellCheckComponent.inform Initializing spell checkers
[junit4:junit4]   2> 20546 T714 oass.DirectSolrSpellChecker.init init: {name=direct,classname=DirectSolrSpellChecker,field=lowerfilt,minQueryLength=3}
[junit4:junit4]   2> 20606 T715 oasc.SolrCore.registerSearcher [collection1] Registered new searcher Searcher@3942ac57 main{StandardDirectoryReader(segments_1:1)}
[junit4:junit4]   2> 20619 T714 oasc.ZkController.publish publishing core=collection1 state=down
[junit4:junit4]   2> 20619 T714 oasc.ZkController.publish numShards not found on descriptor - reading it from system property
[junit4:junit4]   2> 21094 T649 oascc.ZkStateReader.updateClusterState Updating cloud state from ZooKeeper... 
[junit4:junit4]   2> 21096 T649 oasc.Overseer$ClusterStateUpdater.updateState Update state numShards=2 message={
[junit4:junit4]   2> 	  "operation":"state",
[junit4:junit4]   2> 	  "numShards":"2",
[junit4:junit4]   2> 	  "shard":null,
[junit4:junit4]   2> 	  "roles":null,
[junit4:junit4]   2> 	  "state":"down",
[junit4:junit4]   2> 	  "core":"collection1",
[junit4:junit4]   2> 	  "collection":"collection1",
[junit4:junit4]   2> 	  "node_name":"127.0.0.1:49343_",
[junit4:junit4]   2> 	  "base_url":"http://127.0.0.1:49343"}
[junit4:junit4]   2> 21096 T649 oasc.Overseer$ClusterStateUpdater.updateState Collection already exists with numShards=2
[junit4:junit4]   2> 21096 T649 oasc.Overseer$ClusterStateUpdater.updateState Assigning new node to shard shard=shard2
[junit4:junit4]   2> 21103 T667 oascc.ZkStateReader$2.process A cluster state change: WatchedEvent state:SyncConnected type:NodeDataChanged path:/clusterstate.json, has occurred - updating... (live nodes size: 5)
[junit4:junit4]   2> 21103 T648 oascc.ZkStateReader$2.process A cluster state change: WatchedEvent state:SyncConnected type:NodeDataChanged path:/clusterstate.json, has occurred - updating... (live nodes size: 5)
[junit4:junit4]   2> 21103 T654 oascc.ZkStateReader$2.process A cluster state change: WatchedEvent state:SyncConnected type:NodeDataChanged path:/clusterstate.json, has occurred - updating... (live nodes size: 5)
[junit4:junit4]   2> 21104 T697 oascc.ZkStateReader$2.process A cluster state change: WatchedEvent state:SyncConnected type:NodeDataChanged path:/clusterstate.json, has occurred - updating... (live nodes size: 5)
[junit4:junit4]   2> 21104 T713 oascc.ZkStateReader$2.process A cluster state change: WatchedEvent state:SyncConnected type:NodeDataChanged path:/clusterstate.json, has occurred - updating... (live nodes size: 5)
[junit4:junit4]   2> 21104 T682 oascc.ZkStateReader$2.process A cluster state change: WatchedEvent state:SyncConnected type:NodeDataChanged path:/clusterstate.json, has occurred - updating... (live nodes size: 5)
[junit4:junit4]   2> 21624 T714 oasc.CoreContainer.registerCore registering core: collection1
[junit4:junit4]   2> 21625 T714 oasc.ZkController.register Register replica - core:collection1 address:http://127.0.0.1:49343 collection:collection1 shard:shard2
[junit4:junit4]   2> 21629 T714 oasc.ZkController.register We are http://127.0.0.1:49343/collection1/ and leader is http://127.0.0.1:49336/collection1/
[junit4:junit4]   2> 21630 T714 oasc.ZkController.register No LogReplay needed for core=collection1 baseURL=http://127.0.0.1:49343
[junit4:junit4]   2> 21630 T714 oasc.ZkController.checkRecovery Core needs to recover:collection1
[junit4:junit4]   2> 21630 T714 oasu.DefaultSolrCoreState.doRecovery Running recovery - first canceling any ongoing recovery
[junit4:junit4]   2> ASYNC  NEW_CORE C17 name=collection1 org.apache.solr.core.SolrCore@5e2b8638 url=http://127.0.0.1:49343/collection1 node=127.0.0.1:49343_ C17_STATE=coll:collection1 core:collection1 props:{shard=null, roles=null, state=down, core=collection1, collection=collection1, node_name=127.0.0.1:49343_, base_url=http://127.0.0.1:49343}
[junit4:junit4]   2> 21631 T716 C17 P49343 oasc.RecoveryStrategy.run Starting recovery process.  core=collection1 recoveringAfterStartup=true
[junit4:junit4]   2> 21632 T716 C17 P49343 oasc.RecoveryStrategy.doRecovery ###### startupVersions=[]
[junit4:junit4]   2> 21633 T716 C17 P49343 oasc.ZkController.publish publishing core=collection1 state=recovering
[junit4:junit4]   2> 21633 T716 C17 P49343 oasc.ZkController.publish numShards not found on descriptor - reading it from system property
[junit4:junit4]   2> 21634 T714 oascc.ZkStateReader.updateClusterState Updating cloud state from ZooKeeper... 
[junit4:junit4]   2> 21635 T716 C17 P49343 oascsi.HttpClientUtil.createClient Creating new http client, config:maxConnections=128&maxConnectionsPerHost=32&followRedirects=false
[junit4:junit4]   2> 21646 T626 oass.SolrDispatchFilter.init user.dir=/Users/jenkins/jenkins-slave/workspace/Lucene-Solr-trunk-MacOSX/solr/build/solr-core/test/J0
[junit4:junit4]   2> 21646 T626 oass.SolrDispatchFilter.init SolrDispatchFilter.init() done
[junit4:junit4]   2> 21647 T626 oascsi.HttpClientUtil.createClient Creating new http client, config:maxConnections=128&maxConnectionsPerHost=32&followRedirects=false
[junit4:junit4]   2> 21656 T626 oascc.ZkStateReader.updateClusterState Updating cloud state from ZooKeeper... 
[junit4:junit4]   2> 21658 T626 oasc.AbstractDistribZkTestBase.waitForRecoveriesToFinish Wait for recoveries to finish - collection: collection1 failOnTimeout:true timeout (sec):230
[junit4:junit4]   2> 21658 T626 oascc.ZkStateReader.updateClusterState Updating cloud state from ZooKeeper... 
[junit4:junit4]   2>  C16_STATE=coll:collection1 core:collection1 props:{shard=shard1, roles=null, state=recovering, core=collection1, collection=collection1, node_name=127.0.0.1:49339_, base_url=http://127.0.0.1:49339}
[junit4:junit4]   2> 22358 T700 C16 P49339 oasc.RecoveryStrategy.doRecovery Attempting to PeerSync from http://127.0.0.1:49333/collection1/ core=collection1 - recoveringAfterStartup=true
[junit4:junit4]   2> 22366 T700 C16 P49339 oascsi.HttpClientUtil.createClient Creating new http client, config:maxConnectionsPerHost=20&maxConnections=10000&connTimeout=30000&socketTimeout=30000&retry=false
[junit4:junit4]   2> 22380 T700 C16 P49339 oasu.PeerSync.sync PeerSync: core=collection1 url=http://127.0.0.1:49339 START replicas=[http://127.0.0.1:49333/collection1/] nUpdates=100
[junit4:junit4]   2> 22396 T700 C16 P49339 oasu.PeerSync.sync WARNING no frame of reference to tell of we've missed updates
[junit4:junit4]   2> 22397 T700 C16 P49339 oasc.RecoveryStrategy.doRecovery PeerSync Recovery was not successful - trying replication. core=collection1
[junit4:junit4]   2> 22398 T700 C16 P49339 oasc.RecoveryStrategy.doRecovery Starting Replication Recovery. core=collection1
[junit4:junit4]   2> 22398 T700 C16 P49339 oasc.RecoveryStrategy.doRecovery Begin buffering updates. core=collection1
[junit4:junit4]   2> 22398 T700 C16 P49339 oasu.UpdateLog.bufferUpdates Starting to buffer updates. FSUpdateLog{state=ACTIVE, tlog=null}
[junit4:junit4]   2> 22398 T700 C16 P49339 oasc.RecoveryStrategy.replicate Attempting to replicate from http://127.0.0.1:49333/collection1/. core=collection1
[junit4:junit4]   2> 22399 T700 C16 P49339 oascsi.HttpClientUtil.createClient Creating new http client, config:maxConnections=128&maxConnectionsPerHost=32&followRedirects=false
[junit4:junit4]   2> ASYNC  NEW_CORE C18 name=collection1 org.apache.solr.core.SolrCore@75988303 url=http://127.0.0.1:49333/collection1 node=127.0.0.1:49333_ C18_STATE=coll:collection1 core:collection1 props:{shard=shard1, roles=null, state=active, core=collection1, collection=collection1, node_name=127.0.0.1:49333_, base_url=http://127.0.0.1:49333, leader=true}
[junit4:junit4]   2> 22426 T663 C18 P49333 REQ /get {distrib=false&qt=/get&wt=javabin&version=2&getVersions=100} status=0 QTime=1 
[junit4:junit4]   2> 22436 T658 C18 P49333 oasu.DirectUpdateHandler2.commit start commit{flags=0,_version_=0,optimize=false,openSearcher=false,waitSearcher=true,expungeDeletes=false,softCommit=false}
[junit4:junit4]   2> 22438 T658 C18 P49333 oasc.CachingDirectoryFactory.close Releasing directory:/Users/jenkins/jenkins-slave/workspace/Lucene-Solr-trunk-MacOSX/solr/build/solr-core/test/J0/./org.apache.solr.cloud.BasicDistributedZkTest-1357067240682/jetty1
[junit4:junit4]   2> 22442 T658 C18 P49333 oasc.SolrDeletionPolicy.onInit SolrDeletionPolicy.onInit: commits:num=1
[junit4:junit4]   2> 		commit{dir=RateLimitedDirectoryWrapper(org.apache.lucene.store.NIOFSDirectory@/Users/jenkins/jenkins-slave/workspace/Lucene-Solr-trunk-MacOSX/solr/build/solr-core/test/J0/org.apache.solr.cloud.BasicDistributedZkTest-1357067240682/jetty1/index lockFactory=org.apache.lucene.store.NativeFSLockFactory@763812b1),segFN=segments_1,generation=1,filenames=[segments_1]
[junit4:junit4]   2> 22442 T658 C18 P49333 oasc.SolrDeletionPolicy.updateCommits newest commit = 1[segments_1]
[junit4:junit4]   2> 22445 T658 C18 P49333 oasc.SolrDeletionPolicy.onCommit SolrDeletionPolicy.onCommit: commits:num=2
[junit4:junit4]   2> 		commit{dir=RateLimitedDirectoryWrapper(org.apache.lucene.store.NIOFSDirectory@/Users/jenkins/jenkins-slave/workspace/Lucene-Solr-trunk-MacOSX/solr/build/solr-core/test/J0/org.apache.solr.cloud.BasicDistributedZkTest-1357067240682/jetty1/index lockFactory=org.apache.lucene.store.NativeFSLockFactory@763812b1),segFN=segments_1,generation=1,filenames=[segments_1]
[junit4:junit4]   2> 		commit{dir=RateLimitedDirectoryWrapper(org.apache.lucene.store.NIOFSDirectory@/Users/jenkins/jenkins-slave/workspace/Lucene-Solr-trunk-MacOSX/solr/build/solr-core/test/J0/org.apache.solr.cloud.BasicDistributedZkTest-1357067240682/jetty1/index lockFactory=org.apache.lucene.store.NativeFSLockFactory@763812b1),segFN=segments_2,generation=2,filenames=[segments_2]
[junit4:junit4]   2> 22445 T658 C18 P49333 oasc.SolrDeletionPolicy.updateCommits newest commit = 2[segments_2]
[junit4:junit4]   2> 22447 T658 C18 P49333 oasc.CachingDirectoryFactory.close Releasing directory:/Users/jenkins/jenkins-slave/workspace/Lucene-Solr-trunk-MacOSX/solr/build/solr-core/test/J0/./org.apache.solr.cloud.BasicDistributedZkTest-1357067240682/jetty1
[junit4:junit4]   2> 22448 T658 C18 P49333 oass.SolrIndexSearcher.<init> Opening Searcher@1dbd2346 realtime
[junit4:junit4]   2> 22448 T658 C18 P49333 oasu.DirectUpdateHandler2.commit end_commit_flush
[junit4:junit4]   2> 22449 T658 C18 P49333 /update {waitSearcher=true&openSearcher=false&commit=true&commit_end_point=true&wt=javabin&softCommit=false&version=2} {commit=} 0 22
[junit4:junit4]   2> 22496 T700 C16 P49339 oash.ReplicationHandler.inform Commits will be reserved for  10000
[junit4:junit4]   2> 22496 T700 C16 P49339 oascsi.HttpClientUtil.createClient Creating new http client, config:connTimeout=5000&socketTimeout=20000&allowCompression=false&maxConnections=10000&maxConnectionsPerHost=10000
[junit4:junit4]   2> 22514 T700 C16 P49339 oash.SnapPuller.<init>  No value set for 'pollInterval'. Timer Task not started.
[junit4:junit4]   2> 22519 T662 C18 P49333 oash.ReplicationHandler.inform Commits will be reserved for  10000
[junit4:junit4]   2> 22520 T662 C18 P49333 REQ /replication {command=indexversion&wt=javabin&qt=/replication&version=2} status=0 QTime=3 
[junit4:junit4]   2> 22522 T700 C16 P49339 oash.SnapPuller.fetchLatestIndex Master's generation: 2
[junit4:junit4]   2> 22522 T700 C16 P49339 oash.SnapPuller.fetchLatestIndex Slave's generation: 1
[junit4:junit4]   2> 22522 T700 C16 P49339 oash.SnapPuller.fetchLatestIndex Starting replication process
[junit4:junit4]   2> 22527 T661 C18 P49333 oasc.CachingDirectoryFactory.close Releasing directory:/Users/jenkins/jenkins-slave/workspace/Lucene-Solr-trunk-MacOSX/solr/build/solr-core/test/J0/./org.apache.solr.cloud.BasicDistributedZkTest-1357067240682/jetty1
[junit4:junit4]   2> 22528 T661 C18 P49333 oasc.CachingDirectoryFactory.close Releasing directory:/Users/jenkins/jenkins-slave/workspace/Lucene-Solr-trunk-MacOSX/solr/build/solr-core/test/J0/./org.apache.solr.cloud.BasicDistributedZkTest-1357067240682/jetty1/index
[junit4:junit4]   2> 22528 T661 C18 P49333 REQ /replication {command=filelist&generation=2&wt=javabin&qt=/replication&version=2} status=0 QTime=2 
[junit4:junit4]   2> 22530 T700 C16 P49339 oash.SnapPuller.fetchLatestIndex Number of files in latest index in master: 1
[junit4:junit4]   2> 22532 T700 C16 P49339 oasc.CachingDirectoryFactory.get return new directory for /Users/jenkins/jenkins-slave/workspace/Lucene-Solr-trunk-MacOSX/solr/build/solr-core/test/J0/./org.apache.solr.cloud.BasicDistributedZkTest-1357067240682/jetty3/index.20130101140743185 forceNew:false
[junit4:junit4]   2> 22533 T700 C16 P49339 oasc.CachingDirectoryFactory.close Releasing directory:/Users/jenkins/jenkins-slave/workspace/Lucene-Solr-trunk-MacOSX/solr/build/solr-core/test/J0/./org.apache.solr.cloud.BasicDistributedZkTest-1357067240682/jetty3
[junit4:junit4]   2> 22533 T700 C16 P49339 oash.SnapPuller.fetchLatestIndex Starting download to RateLimitedDirectoryWrapper(org.apache.lucene.store.NIOFSDirectory@/Users/jenkins/jenkins-slave/workspace/Lucene-Solr-trunk-MacOSX/solr/build/solr-core/test/J0/org.apache.solr.cloud.BasicDistributedZkTest-1357067240682/jetty3/index.20130101140743185 lockFactory=org.apache.lucene.store.NativeFSLockFactory@4798bcc3) fullCopy=true
[junit4:junit4]   2> 22552 T660 C18 P49333 REQ /replication {file=segments_2&command=filecontent&checksum=true&generation=2&qt=/replication&wt=filestream} status=0 QTime=4 
[junit4:junit4]   2> 22564 T700 C16 P49339 oasc.CachingDirectoryFactory.close Releasing directory:/Users/jenkins/jenkins-slave/workspace/Lucene-Solr-trunk-MacOSX/solr/build/solr-core/test/J0/./org.apache.solr.cloud.BasicDistributedZkTest-1357067240682/jetty3/index
[junit4:junit4]   2> 22564 T700 C16 P49339 oash.SnapPuller.fetchLatestIndex Total time taken for download : 0 secs
[junit4:junit4]   2> 22566 T700 C16 P49339 oash.SnapPuller.modifyIndexProps New index installed. Updating index properties... index=index.20130101140743185
[junit4:junit4]   2> 22568 T700 C16 P49339 oasc.CachingDirectoryFactory.close Releasing directory:/Users/jenkins/jenkins-slave/workspace/Lucene-Solr-trunk-MacOSX/solr/build/solr-core/test/J0/./org.apache.solr.cloud.BasicDistributedZkTest-1357067240682/jetty3
[junit4:junit4]   2> 22569 T700 C16 P49339 oasc.CachingDirectoryFactory.close Releasing directory:/Users/jenkins/jenkins-slave/workspace/Lucene-Solr-trunk-MacOSX/solr/build/solr-core/test/J0/./org.apache.solr.cloud.BasicDistributedZkTest-1357067240682/jetty3
[junit4:junit4]   2> 22569 T700 C16 P49339 oasc.SolrCore.getNewIndexDir New index directory detected: old=./org.apache.solr.cloud.BasicDistributedZkTest-1357067240682/jetty3/index/ new=./org.apache.solr.cloud.BasicDistributedZkTest-1357067240682/jetty3/index.20130101140743185
[junit4:junit4]   2> 22573 T700 C16 P49339 oasc.SolrDeletionPolicy.onInit SolrDeletionPolicy.onInit: commits:num=1
[junit4:junit4]   2> 		commit{dir=RateLimitedDirectoryWrapper(org.apache.lucene.store.NIOFSDirectory@/Users/jenkins/jenkins-slave/workspace/Lucene-Solr-trunk-MacOSX/solr/build/solr-core/test/J0/org.apache.solr.cloud.BasicDistributedZkTest-1357067240682/jetty3/index.20130101140743185 lockFactory=org.apache.lucene.store.NativeFSLockFactory@4798bcc3),segFN=segments_2,generation=2,filenames=[segments_2]
[junit4:junit4]   2> 22573 T700 C16 P49339 oasc.SolrDeletionPolicy.updateCommits newest commit = 2[segments_2]
[junit4:junit4]   2> 22575 T700 C16 P49339 oasc.CachingDirectoryFactory.close Releasing directory:/Users/jenkins/jenkins-slave/workspace/Lucene-Solr-trunk-MacOSX/solr/build/solr-core/test/J0/./org.apache.solr.cloud.BasicDistributedZkTest-1357067240682/jetty3
[junit4:junit4]   2> 22578 T700 C16 P49339 oasu.DefaultSolrCoreState.newIndexWriter Creating new IndexWriter...
[junit4:junit4]   2> 22578 T700 C16 P49339 oasu.DefaultSolrCoreState.newIndexWriter Waiting until IndexWriter is unused... core=collection1
[junit4:junit4]   2> 22578 T700 C16 P49339 oasu.DefaultSolrCoreState.newIndexWriter Rollback old IndexWriter... core=collection1
[junit4:junit4]   2> 22579 T700 C16 P49339 oasc.CachingDirectoryFactory.close Releasing directory:/Users/jenkins/jenkins-slave/workspace/Lucene-Solr-trunk-MacOSX/solr/build/solr-core/test/J0/./org.apache.solr.cloud.BasicDistributedZkTest-1357067240682/jetty3/index.20130101140743185
[junit4:junit4]   2> 22580 T700 C16 P49339 oasc.CachingDirectoryFactory.close Releasing directory:/Users/jenkins/jenkins-slave/workspace/Lucene-Solr-trunk-MacOSX/solr/build/solr-core/test/J0/./org.apache.solr.cloud.BasicDistributedZkTest-1357067240682/jetty3
[junit4:junit4]   2> 22584 T700 C16 P49339 oasc.SolrDeletionPolicy.onInit SolrDeletionPolicy.onInit: commits:num=1
[junit4:junit4]   2> 		commit{dir=RateLimitedDirectoryWrapper(org.apache.lucene.store.NIOFSDirectory@/Users/jenkins/jenkins-slave/workspace/Lucene-Solr-trunk-MacOSX/solr/build/solr-core/test/J0/org.apache.solr.cloud.BasicDistributedZkTest-1357067240682/jetty3/index.20130101140743185 lockFactory=org.apache.lucene.store.NativeFSLockFactory@4798bcc3),segFN=segments_2,generation=2,filenames=[segments_2]
[junit4:junit4]   2> 22585 T700 C16 P49339 oasc.SolrDeletionPolicy.updateCommits newest commit = 2[segments_2]
[junit4:junit4]   2> 22585 T700 C16 P49339 oasu.DefaultSolrCoreState.newIndexWriter New IndexWriter is ready to be used.
[junit4:junit4]   2> 22586 T700 C16 P49339 oasc.CachingDirectoryFactory.close Releasing directory:/Users/jenkins/jenkins-slave/workspace/Lucene-Solr-trunk-MacOSX/solr/build/solr-core/test/J0/./org.apache.solr.cloud.BasicDistributedZkTest-1357067240682/jetty3
[junit4:junit4]   2> 22586 T700 C16 P49339 oass.SolrIndexSearcher.<init> Opening Searcher@647a9a52 main
[junit4:junit4]   2> 22589 T699 oasc.SolrCore.registerSearcher [collection1] Registered new searcher Searcher@647a9a52 main{StandardDirectoryReader(segments_2:1:nrt)}
[junit4:junit4]   2> 22590 T699 oasc.CachingDirectoryFactory.close Releasing directory:/Users/jenkins/jenkins-slave/workspace/Lucene-Solr-trunk-MacOSX/solr/build/solr-core/test/J0/./org.apache.solr.cloud.BasicDistributedZkTest-1357067240682/jetty3/index
[junit4:junit4]   2> 22590 T700 C16 P49339 oasu.DirectUpdateHandler2.commit start commit{flags=0,_version_=0,optimize=false,openSearcher=false,waitSearcher=false,expungeDeletes=false,softCommit=false}
[junit4:junit4]   2> 22592 T700 C16 P49339 oasc.SolrDeletionPolicy.onCommit SolrDeletionPolicy.onCommit: commits:num=2
[junit4:junit4]   2> 		commit{dir=RateLimitedDirectoryWrapper(org.apache.lucene.store.NIOFSDirectory@/Users/jenkins/jenkins-slave/workspace/Lucene-Solr-trunk-MacOSX/solr/build/solr-core/test/J0/org.apache.solr.cloud.BasicDistributedZkTest-1357067240682/jetty3/index.20130101140743185 lockFactory=org.apache.lucene.store.NativeFSLockFactory@4798bcc3),segFN=segments_2,generation=2,filenames=[segments_2]
[junit4:junit4]   2> 		commit{dir=RateLimitedDirectoryWrapper(org.apache.lucene.store.NIOFSDirectory@/Users/jenkins/jenkins-slave/workspace/Lucene-Solr-trunk-MacOSX/solr/build/solr-core/test/J0/org.apache.solr.cloud.BasicDistributedZkTest-1357067240682/jetty3/index.20130101140743185 lockFactory=org.apache.lucene.store.NativeFSLockFactory@4798bcc3),segFN=segments_3,generation=3,filenames=[segments_3]
[junit4:junit4]   2> 22592 T700 C16 P49339 oasc.SolrDeletionPolicy.updateCommits newest commit = 3[segments_3]
[junit4:junit4]   2> 22593 T700 C16 P49339 oasc.CachingDirectoryFactory.close Releasing directory:/Users/jenkins/jenkins-slave/workspace/Lucene-Solr-trunk-MacOSX/solr/build/solr-core/test/J0/./org.apache.solr.cloud.BasicDistributedZkTest-1357067240682/jetty3
[junit4:junit4]   2> 22593 T700 C16 P49339 oasu.DirectUpdateHandler2.commit end_commit_flush
[junit4:junit4]   2> 22594 T700 C16 P49339 oasc.CachingDirectoryFactory.close Releasing directory:/Users/jenkins/jenkins-slave/workspace/Lucene-Solr-trunk-MacOSX/solr/build/solr-core/test/J0/./org.apache.solr.cloud.BasicDistributedZkTest-1357067240682/jetty3/index.20130101140743185
[junit4:junit4]   2> 22594 T700 C16 P49339 oasc.CachingDirectoryFactory.close Releasing directory:/Users/jenkins/jenkins-slave/workspace/Lucene-Solr-trunk-MacOSX/solr/build/solr-core/test/J0/./org.apache.solr.cloud.BasicDistributedZkTest-1357067240682/jetty3/index
[junit4:junit4]   2> 22594 T700 C16 P49339 oasc.RecoveryStrategy.replay No replay needed. core=collection1
[junit4:junit4]   2> 22594 T700 C16 P49339 oasc.RecoveryStrategy.doRecovery Replication Recovery was successful - registering as Active. core=collection1
[junit4:junit4]   2> 22595 T700 C16 P49339 oasc.ZkController.publish publishing core=collection1 state=active
[junit4:junit4]   2> 22595 T700 C16 P49339 oasc.ZkController.publish numShards not found on descriptor - reading it from system property
[junit4:junit4]   2> 22597 T700 C16 P49339 oasc.RecoveryStrategy.doRecovery Finished recovery process. core=collection1
[junit4:junit4]   2> 22617 T649 oascc.ZkStateReader.updateClusterState Updating cloud state from ZooKeeper... 
[junit4:junit4]   2> 22618 T649 oasc.Overseer$ClusterStateUpdater.updateState Update state numShards=2 message={
[junit4:junit4]   2> 	  "operation":"state",
[junit4:junit4]   2> 	  "numShards":"2",
[junit4:junit4]   2> 	  "shard":"shard2",
[junit4:junit4]   2> 	  "roles":null,
[junit4:junit4]   2> 	  "state":"recovering",
[junit4:junit4]   2> 	  "core":"collection1",
[junit4:junit4]   2> 	  "collection":"collection1",
[junit4:junit4]   2> 	  "node_name":"127.0.0.1:49343_",
[junit4:junit4]   2> 	  "base_url":"http://127.0.0.1:49343"}
[junit4:junit4]   2> 22627 T649 oasc.Overseer$ClusterStateUpdater.updateState Update state numShards=2 message={
[junit4:junit4]   2> 	  "operation":"state",
[junit4:junit4]   2> 	  "numShards":"2",
[junit4:junit4]   2> 	  "shard":"shard1",
[junit4:junit4]   2> 	  "roles":null,
[junit4:junit4]   2> 	  "state":"active",
[junit4:junit4]   2> 	  "core":"collection1",
[junit4:junit4]   2> 	  "collection":"collection1",
[junit4:junit4]   2> 	  "node_name":"127.0.0.1:49339_",
[junit4:junit4]   2> 	  "base_url":"http://127.0.0.1:49339"}
[junit4:junit4]   2> 22634 T713 oascc.ZkStateReader$2.process A cluster state change: WatchedEvent state:SyncConnected type:NodeDataChanged path:/clusterstate.json, has occurred - updating... (live nodes size: 5)
[junit4:junit4]   2> 22634 T648 oascc.ZkStateReader$2.process A cluster state change: WatchedEvent state:SyncConnected type:NodeDataChanged path:/clusterstate.json, has occurred - updating... (live nodes size: 5)
[junit4:junit4]   2> 22635 T682 oascc.ZkStateReader$2.process A cluster state change: WatchedEvent state:SyncConnected type:NodeDataChanged path:/clusterstate.json, has occurred - updating... (live nodes size: 5)
[junit4:junit4]   2> 22635 T654 oascc.ZkStateReader$2.process A cluster state change: WatchedEvent state:SyncConnected type:NodeDataChanged path:/clusterstate.json, has occurred - updating... (live nodes size: 5)
[junit4:junit4]   2> 22635 T667 oascc.ZkStateReader$2.process A cluster state change: WatchedEvent state:SyncConnected type:NodeDataChanged path:/clusterstate.json, has occurred - updating... (live nodes size: 5)
[junit4:junit4]   2> 22636 T697 oascc.ZkStateReader$2.process A cluster state change: WatchedEvent state:SyncConnected type:NodeDataChanged path:/clusterstate.json, has occurred - updating... (live nodes size: 5)
[junit4:junit4]   2> 22662 T626 oascc.ZkStateReader.updateClusterState Updating cloud state from ZooKeeper... 
[junit4:junit4]   2> 23667 T626 oascc.ZkStateReader.updateClusterState Updating cloud state from ZooKeeper... 
[junit4:junit4]   2>  C17_STATE=coll:collection1 core:collection1 props:{shard=shard2, roles=null, state=recovering, core=collection1, collection=collection1, node_name=127.0.0.1:49343_, base_url=http://127.0.0.1:49343}
[junit4:junit4]   2> 24658 T716 C17 P49343 oasc.RecoveryStrategy.doRecovery Attempting to PeerSync from http://127.0.0.1:49336/collection1/ core=collection1 - recoveringAfterStartup=true
[junit4:junit4]   2> 24659 T716 C17 P49343 oasu.PeerSync.sync PeerSync: core=collection1 url=http://127.0.0.1:49343 START replicas=[http://127.0.0.1:49336/collection1/] nUpdates=100
[junit4:junit4]   2> 24660 T716 C17 P49343 oasu.PeerSync.sync WARNING no frame of reference to tell of we've missed updates
[junit4:junit4]   2> 24660 T716 C17 P49343 oasc.RecoveryStrategy.doRecovery PeerSync Recovery was not successful - trying replication. core=collection1
[junit4:junit4]   2> 24660 T716 C17 P49343 oasc.RecoveryStrategy.doRecovery Starting Replication Recovery. core=collection1
[junit4:junit4]   2> 24660 T716 C17 P49343 oasc.RecoveryStrategy.doRecovery Begin buffering updates. core=collection1
[junit4:junit4]   2> 24660 T716 C17 P49343 oasu.UpdateLog.bufferUpdates Starting to buffer updates. FSUpdateLog{state=ACTIVE, tlog=null}
[junit4:junit4]   2> 24661 T716 C17 P49343 oasc.RecoveryStrategy.replicate Attempting to replicate from http://127.0.0.1:49336/collection1/. core=collection1
[junit4:junit4]   2> 24663 T716 C17 P49343 oascsi.HttpClientUtil.createClient Creating new http client, config:maxConnections=128&maxConnectionsPerHost=32&followRedirects=false
[junit4:junit4]   2> ASYNC  NEW_CORE C19 name=collection1 org.apache.solr.core.SolrCore@4e451ad url=http://127.0.0.1:49336/collection1 node=127.0.0.1:49336_ C19_STATE=coll:collection1 core:collection1 props:{shard=shard2, roles=null, state=active, core=collection1, collection=collection1, node_name=127.0.0.1:49336_, base_url=http://127.0.0.1:49336, leader=true}
[junit4:junit4]   2> 24684 T673 C19 P49336 REQ /get {distrib=false&qt=/get&wt=javabin&version=2&getVersions=100} status=0 QTime=1 
[junit4:junit4]   2> 24687 T626 oascc.ZkStateReader.updateClusterState Updating cloud state from ZooKeeper... 
[junit4:junit4]   2> 24687 T673 C19 P49336 oasu.DirectUpdateHandler2.commit start commit{flags=0,_version_=0,optimize=false,openSearcher=false,waitSearcher=true,expungeDeletes=false,softCommit=false}
[junit4:junit4]   2> 24689 T673 C19 P49336 oasc.CachingDirectoryFactory.close Releasing directory:/Users/jenkins/jenkins-slave/workspace/Lucene-Solr-trunk-MacOSX/solr/build/solr-core/test/J0/./org.apache.solr.cloud.BasicDistributedZkTest-1357067240682/jetty2
[junit4:junit4]   2> 24692 T673 C19 P49336 oasc.SolrDeletionPolicy.onInit SolrDeletionPolicy.onInit: commits:num=1
[junit4:junit4]   2> 		commit{dir=RateLimitedDirectoryWrapper(org.apache.lucene.store.NIOFSDirectory@/Users/jenkins/jenkins-slave/workspace/Lucene-Solr-trunk-MacOSX/solr/build/solr-core/test/J0/org.apache.solr.cloud.BasicDistributedZkTest-1357067240682/jetty2/index lockFactory=org.apache.lucene.store.NativeFSLockFactory@74d8e2b6),segFN=segments_1,generation=1,filenames=[segments_1]
[junit4:junit4]   2> 24693 T673 C19 P49336 oasc.SolrDeletionPolicy.updateCommits newest commit = 1[segments_1]
[junit4:junit4]   2> 24696 T673 C19 P49336 oasc.SolrDeletionPolicy.onCommit SolrDeletionPolicy.onCommit: commits:num=2
[junit4:junit4]   2> 		commit{dir=RateLimitedDirectoryWrapper(org.apache.lucene.store.NIOFSDirectory@/Users/jenkins/jenkins-slave/workspace/Lucene-Solr-trunk-MacOSX/solr/build/solr-core/test/J0/org.apache.solr.cloud.BasicDistributedZkTest-1357067240682/jetty2/index lockFactory=org.apache.lucene.store.NativeFSLockFactory@74d8e2b6),segFN=segments_1,generation=1,filenames=[segments_1]
[junit4:junit4]   2> 		commit{dir=RateLimitedDirectoryWrapper(org.apache.lucene.store.NIOFSDirectory@/Users/jenkins/jenkins-slave/workspace/Lucene-Solr-trunk-MacOSX/solr/build/solr-core/test/J0/org.apache.solr.cloud.BasicDistributedZkTest-1357067240682/jetty2/index lockFactory=org.apache.lucene.store.NativeFSLockFactory@74d8e2b6),segFN=segments_2,generation=2,filenames=[segments_2]
[junit4:junit4]   2> 24696 T673 C19 P49336 oasc.SolrDeletionPolicy.updateCommits newest commit = 2[segments_2]
[junit4:junit4]   2> 24697 T673 C19 P49336 oasc.CachingDirectoryFactory.close Releasing directory:/Users/jenkins/jenkins-slave/workspace/Lucene-Solr-trunk-MacOSX/solr/build/solr-core/test/J0/./org.apache.solr.cloud.BasicDistributedZkTest-1357067240682/jetty2
[junit4:junit4]   2> 24698 T673 C19 P49336 oass.SolrIndexSearcher.<init> Opening Searcher@7b5cc930 realtime
[junit4:junit4]   2> 24700 T673 C19 P49336 oasu.DirectUpdateHandler2.commit end_commit_flush
[junit4:junit4]   2> 24705 T673 C19 P49336 /update {waitSearcher=true&openSearcher=false&commit=true&commit_end_point=true&wt=javabin&softCommit=false&version=2} {commit=} 0 19
[junit4:junit4]   2> 24706 T716 C17 P49343 oash.ReplicationHandler.inform Commits will be reserved for  10000
[junit4:junit4]   2> 24708 T716 C17 P49343 oash.SnapPuller.<init>  No value set for 'pollInterval'. Timer Task not started.
[junit4:junit4]   2> 24713 T674 C19 P49336 oash.ReplicationHandler.inform Commits will be reserved for  10000
[junit4:junit4]   2> 24713 T674 C19 P49336 REQ /replication {command=indexversion&wt=javabin&qt=/replication&version=2} status=0 QTime=1 
[junit4:junit4]   2> 24714 T716 C17 P49343 oash.SnapPuller.fetchLatestIndex Master's generation: 2
[junit4:junit4]   2> 24715 T716 C17 P49343 oash.SnapPuller.fetchLatestIndex Slave's generation: 1
[junit4:junit4]   2> 24715 T716 C17 P49343 oash.SnapPuller.fetchLatestIndex Starting replication process
[junit4:junit4]   2> 24718 T675 C19 P49336 oasc.CachingDirectoryFactory.close Releasing directory:/Users/jenkins/jenkins-slave/workspace/Lucene-Solr-trunk-MacOSX/solr/build/solr-core/test/J0/./org.apache.solr.cloud.BasicDistributedZkTest-1357067240682/jetty2
[junit4:junit4]   2> 24719 T675 C19 P49336 oasc.CachingDirectoryFactory.close Releasing directory:/Users/jenkins/jenkins-slave/workspace/Lucene-Solr-trunk-MacOSX/solr/build/solr-core/test/J0/./org.apache.solr.cloud.BasicDistributedZkTest-1357067240682/jetty2/index
[junit4:junit4]   2> 24720 T675 C19 P49336 REQ /replication {command=filelist&generation=2&wt=javabin&qt=/replication&version=2} status=0 QTime=2 
[junit4:junit4]   2> 24721 T716 C17 P49343 oash.SnapPuller.fetchLatestIndex Number of files in latest index in master: 1
[junit4:junit4]   2> 24722 T716 C17 P49343 oasc.CachingDirectoryFactory.get return new directory for /Users/jenkins/jenkins-slave/workspace/Lucene-Solr-trunk-MacOSX/solr/build/solr-core/test/J0/./org.apache.solr.cloud.BasicDistributedZkTest-1357067240682/jetty4/index.20130101140745376 forceNew:false
[junit4:junit4]   2> 24723 T716 C17 P49343 oasc.CachingDirectoryFactory.close Releasing directory:/Users/jenkins/jenkins-slave/workspace/Lucene-Solr-trunk-MacOSX/solr/build/solr-core/test/J0/./org.apache.solr.cloud.BasicDistributedZkTest-1357067240682/jetty4
[junit4:junit4]   2> 24723 T716 C17 P49343 oash.SnapPuller.fetchLatestIndex Starting download to RateLimitedDirectoryWrapper(org.apache.lucene.store.NIOFSDirectory@/Users/jenkins/jenkins-slave/workspace/Lucene-Solr-trunk-MacOSX/solr/build/solr-core/test/J0/org.apache.solr.cloud.BasicDistributedZkTest-1357067240682/jetty4/index.20130101140745376 lockFactory=org.apache.lucene.store.NativeFSLockFactory@6c897cdd) fullCopy=true
[junit4:junit4]   2> 24727 T676 C19 P49336 REQ /replication {file=segments_2&command=filecontent&checksum=true&generation=2&qt=/replication&wt=filestream} status=0 QTime=0 
[junit4:junit4]   2> 24729 T716 C17 P49343 oasc.CachingDirectoryFactory.close Releasing directory:/Users/jenkins/jenkins-slave/workspace/Lucene-Solr-trunk-MacOSX/solr/build/solr-core/test/J0/./org.apache.solr.cloud.BasicDistributedZkTest-1357067240682/jetty4/index
[junit4:junit4]   2> 24730 T716 C17 P49343 oash.SnapPuller.fetchLatestIndex Total time taken for download : 0 secs
[junit4:junit4]   2> 24730 T716 C17 P49343 oash.SnapPuller.modifyIndexProps New index installed. Updating index properties... index=index.20130101140745376
[junit4:junit4]   2> 24732 T716 C17 P49343 oasc.CachingDirectoryFactory.close Releasing directory:/Users/jenkins/jenkins-slave/workspace/Lucene-Solr-trunk-MacOSX/solr/build/solr-core/test/J0/./org.apache.solr.cloud.BasicDistributedZkTest-1357067240682/jetty4
[junit4:junit4]   2> 24733 T716 C17 P49343 oasc.CachingDirectoryFactory.close Releasing directory:/Users/jenkins/jenkins-slave/workspace/Lucene-Solr-trunk-MacOSX/solr/build/solr-core/test/J0/./org.apache.solr.cloud.BasicDistributedZkTest-1357067240682/jetty4
[junit4:junit4]   2> 24733 T716 C17 P49343 oasc.SolrCore.getNewIndexDir New index directory detected: old=./org.apache.solr.cloud.BasicDistributedZkTest-1357067240682/jetty4/index/ new=./org.apache.solr.cloud.BasicDistributedZkTest-1357067240682/jetty4/index.20130101140745376
[junit4:junit4]   2> 24737 T716 C17 P49343 oasc.SolrDeletionPolicy.onInit SolrDeletionPolicy.onInit: commits:num=1
[junit4:junit4]   2> 		commit{dir=RateLimitedDirectoryWrapper(org.apache.lucene.store.NIOFSDirectory@/Users/jenkins/jenkins-slave/workspace/Lucene-Solr-trunk-MacOSX/solr/build/solr-core/test/J0/org.apache.solr.cloud.BasicDistributedZkTest-1357067240682/jetty4/index.20130101140745376 lockFactory=org.apache.lucene.store.NativeFSLockFactory@6c897cdd),segFN=segments_2,generation=2,filenames=[segments_2]
[junit4:junit4]   2> 24738 T716 C17 P49343 oasc.SolrDeletionPolicy.updateCommits newest commit = 2[segments_2]
[junit4:junit4]   2> 24739 T716 C17 P49343 oasc.CachingDirectoryFactory.close Releasing directory:/Users/jenkins/jenkins-slave/workspace/Lucene-Solr-trunk-MacOSX/solr/build/solr-core/test/J0/./org.apache.solr.cloud.BasicDistributedZkTest-1357067240682/jetty4
[junit4:junit4]   2> 24740 T716 C17 P49343 oasu.DefaultSolrCoreState.newIndexWriter Creating new IndexWriter...
[junit4:junit4]   2> 24740 T716 C17 P49343 oasu.DefaultSolrCoreState.newIndexWriter Waiting until IndexWriter is unused... core=collection1
[junit4:junit4]   2> 24740 T716 C17 P49343 oasu.DefaultSolrCoreState.newIndexWriter Rollback old IndexWriter... core=collection1
[junit4:junit4]   2> 24741 T716 C17 P49343 oasc.CachingDirectoryFactory.close Releasing directory:/Users/jenkins/jenkins-slave/workspace/Lucene-Solr-trunk-MacOSX/solr/build/solr-core/test/J0/./org.apache.solr.cloud.BasicDistributedZkTest-1357067240682/jetty4/index.20130101140745376
[junit4:junit4]   2> 24742 T716 C17 P49343 oasc.CachingDirectoryFactory.close Releasing directory:/Users/jenkins/jenkins-slave/workspace/Lucene-Solr-trunk-MacOSX/solr/build/solr-core/test/J0/./org.apache.solr.cloud.BasicDistributedZkTest-1357067240682/jetty4
[junit4:junit4]   2> 24745 T716 C17 P49343 oasc.SolrDeletionPolicy.onInit SolrDeletionPolicy.onInit: commits:num=1
[junit4:junit4]   2> 		commit{dir=RateLimitedDirectoryWrapper(org.apache.lucene.store.NIOFSDirectory@/Users/jenkins/jenkins-slave/workspace/Lucene-Solr-trunk-MacOSX/solr/build/solr-core/test/J0/org.apache.solr.cloud.BasicDistributedZkTest-1357067240682/jetty4/index.20130101140745376 lockFactory=org.apache.lucene.store.NativeFSLockFactory@6c897cdd),segFN=segments_2,generation=2,filenames=[segments_2]
[junit4:junit4]   2> 24745 T716 C17 P49343 oasc.SolrDeletionPolicy.updateCommits newest commit = 2[segments_2]
[junit4:junit4]   2> 24746 T716 C17 P49343 oasu.DefaultSolrCoreState.newIndexWriter New IndexWriter is ready to be used.
[junit4:junit4]   2> 24747 T716 C17 P49343 oasc.CachingDirectoryFactory.close Releasing directory:/Users/jenkins/jenkins-slave/workspace/Lucene-Solr-trunk-MacOSX/solr/build/solr-core/test/J0/./org.apache.solr.cloud.BasicDistributedZkTest-1357067240682/jetty4
[junit4:junit4]   2> 24747 T716 C17 P49343 oass.SolrIndexSearcher.<init> Opening Searcher@10afa1ee main
[junit4:junit4]   2> 24750 T715 oasc.SolrCore.registerSearcher [collection1] Registered new searcher Searcher@10afa1ee main{StandardDirectoryReader(segments_2:1:nrt)}
[junit4:junit4]   2> 24751 T715 oasc.CachingDirectoryFactory.close Releasing directory:/Users/jenkins/jenkins-slave/workspace/Lucene-Solr-trunk-MacOSX/solr/build/solr-core/test/J0/./org.apache.solr.cloud.BasicDistributedZkTest-1357067240682/jetty4/index
[junit4:junit4]   2> 24751 T716 C17 P49343 oasu.DirectUpdateHandler2.commit start commit{flags=0,_version_=0,optimize=false,openSearcher=false,waitSearcher=false,expungeDeletes=false,softCommit=false}
[junit4:junit4]   2> 24753 T716 C17 P49343 oasc.SolrDeletionPolicy.onCommit SolrDeletionPolicy.onCommit: commits:num=2
[junit4:junit4]   2> 		commit{dir=RateLimitedDirectoryWrapper(org.apache.lucene.store.NIOFSDirectory@/Users/jenkins/jenkins-slave/workspace/Lucene-Solr-trunk-MacOSX/solr/build/solr-core/test/J0/org.apache.solr.cloud.BasicDistributedZkTest-1357067240682/jetty4/index.20130101140745376 lockFactory=org.apache.lucene.store.NativeFSLockFactory@6c897cdd),segFN=segments_2,generation=2,filenames=[segments_2]
[junit4:junit4]   2> 		commit{dir=RateLimitedDirectoryWrapper(org.apache.lucene.store.NIOFSDirectory@/Users/jenkins/jenkins-slave/workspace/Lucene-Solr-trunk-MacOSX/solr/build/solr-core/test/J0/org.apache.solr.cloud.BasicDistributedZkTest-1357067240682/jetty4/index.20130101140745376 lockFactory=org.apache.lucene.store.NativeFSLockFactory@6c897cdd),segFN=segments_3,generation=3,filenames=[segments_3]
[junit4:junit4]   2> 24753 T716 C17 P49343 oasc.SolrDeletionPolicy.updateCommits newest commit = 3[segments_3]
[junit4:junit4]   2> 24754 T716 C17 P49343 oasc.CachingDirectoryFactory.close Releasing directory:/Users/jenkins/jenkins-slave/workspace/Lucene-Solr-trunk-MacOSX/solr/build/solr-core/test/J0/./org.apache.solr.cloud.BasicDistributedZkTest-1357067240682/jetty4
[junit4:junit4]   2> 24754 T716 C17 P49343 oasu.DirectUpdateHandler2.commit end_commit_flush
[junit4:junit4]   2> 24755 T716 C17 P49343 oasc.CachingDirectoryFactory.close Releasing directory:/Users/jenkins/jenkins-slave/workspace/Lucene-Solr-trunk-MacOSX/solr/build/solr-core/test/J0/./org.apache.solr.cloud.BasicDistributedZkTest-1357067240682/jetty4/index.20130101140745376
[junit4:junit4]   2> 24755 T716 C17 P49343 oasc.CachingDirectoryFactory.close Releasing directory:/Users/jenkins/jenkins-slave/workspace/Lucene-Solr-trunk-MacOSX/solr/build/solr-core/test/J0/./org.apache.solr.cloud.BasicDistributedZkTest-1357067240682/jetty4/index
[junit4:junit4]   2> 24755 T716 C17 P49343 oasc.RecoveryStrategy.replay No replay needed. core=collection1
[junit4:junit4]   2> 24755 T716 C17 P49343 oasc.RecoveryStrategy.doRecovery Replication Recovery was successful - registering as Active. core=collection1
[junit4:junit4]   2> 24756 T716 C17 P49343 oasc.ZkController.publish publishing core=collection1 state=active
[junit4:junit4]   2> 24756 T716 C17 P49343 oasc.ZkController.publish numShards not found on descriptor - reading it from system property
[junit4:junit4]   2> 24758 T716 C17 P49343 oasc.RecoveryStrategy.doRecovery Finished recovery process. core=collection1
[junit4:junit4]   2> 25652 T649 oascc.ZkStateReader.updateClusterState Updating cloud state from ZooKeeper... 
[junit4:junit4]   2> 25653 T649 oasc.Overseer$ClusterStateUpdater.updateState Update state numShards=2 message={
[junit4:junit4]   2> 	  "operation":"state",
[junit4:junit4]   2> 	  "numShards":"2",
[junit4:junit4]   2> 	  "shard":"shard2",
[junit4:junit4]   2> 	  "roles":null,
[junit4:junit4]   2> 	  "state":"active",
[junit4:junit4]   2> 	  "core":"collection1",
[junit4:junit4]   2> 	  "collection":"collection1",
[junit4:junit4]   2> 	  "node_name":"127.0.0.1:49343_",
[junit4:junit4]   2> 	  "base_url":"http://127.0.0.1:49343"}
[junit4:junit4]   2> 25661 T713 oascc.ZkStateReader$2.process A cluster state change: WatchedEvent state:SyncConnected type:NodeDataChanged path:/clusterstate.json, has occurred - updating... (live nodes size: 5)
[junit4:junit4]   2> 25661 T648 oascc.ZkStateReader$2.process A cluster state change: WatchedEvent state:SyncConnected type:NodeDataChanged path:/clusterstate.json, has occurred - updating... (live nodes size: 5)
[junit4:junit4]   2> 25661 T667 oascc.ZkStateReader$2.process A cluster state change: WatchedEvent state:SyncConnected type:NodeDataChanged path:/clusterstate.json, has occurred - updating... (live nodes size: 5)
[junit4:junit4]   2> 25662 T697 oascc.ZkStateReader$2.process A cluster state change: WatchedEvent state:SyncConnected type:NodeDataChanged path:/clusterstate.json, has occurred - updating... (live nodes size: 5)
[junit4:junit4]   2> 25661 T682 oascc.ZkStateReader$2.process A cluster state change: WatchedEvent state:SyncConnected type:NodeDataChanged path:/clusterstate.json, has occurred - updating... (live nodes size: 5)
[junit4:junit4]   2> 25661 T654 oascc.ZkStateReader$2.process A cluster state change: WatchedEvent state:SyncConnected type:NodeDataChanged path:/clusterstate.json, has occurred - updating... (live nodes size: 5)
[junit4:junit4]   2> 25707 T626 oascc.ZkStateReader.updateClusterState Updating cloud state from ZooKeeper... 
[junit4:junit4]   2> 25708 T626 oasc.AbstractDistribZkTestBase.waitForRecoveriesToFinish Recoveries finished - collection: collection1
[junit4:junit4]   2> ASYNC  NEW_CORE C20 name=collection1 org.apache.solr.core.SolrCore@1a57c9e4 url=http://127.0.0.1:49329/collection1 node=127.0.0.1:49329_ C20_STATE=coll:control_collection core:collection1 props:{shard=shard1, roles=null, state=active, core=collection1, collection=control_collection, node_name=127.0.0.1:49329_, base_url=http://127.0.0.1:49329, leader=true}
[junit4:junit4]   2> 25772 T641 C20 P49329 oasc.CachingDirectoryFactory.close Releasing directory:/Users/jenkins/jenkins-slave/workspace/Lucene-Solr-trunk-MacOSX/solr/build/solr-core/test/J0/./org.apache.solr.cloud.BasicDistributedZkTest-1357067240682/control/data
[junit4:junit4]   2> 25776 T641 C20 P49329 oasc.SolrDeletionPolicy.onInit SolrDeletionPolicy.onInit: commits:num=1
[junit4:junit4]   2> 		commit{dir=RateLimitedDirectoryWrapper(org.apache.lucene.store.NIOFSDirectory@/Users/jenkins/jenkins-slave/workspace/Lucene-Solr-trunk-MacOSX/solr/build/solr-core/test/J0/org.apache.solr.cloud.BasicDistributedZkTest-1357067240682/control/data/index lockFactory=org.apache.lucene.store.NativeFSLockFactory@184f6cea),segFN=segments_1,generation=1,filenames=[segments_1]
[junit4:junit4]   2> 25776 T641 C20 P49329 oasc.SolrDeletionPolicy.updateCommits newest commit = 1[segments_1]
[junit4:junit4]   2> 25795 T641 C20 P49329 oasc.CachingDirectoryFactory.close Releasing directory:/Users/jenkins/jenkins-slave/workspace/Lucene-Solr-trunk-MacOSX/solr/build/solr-core/test/J0/./org.apache.solr.cloud.BasicDistributedZkTest-1357067240682/control/data
[junit4:junit4]   2> 25796 T641 C20 P49329 oass.SolrIndexSearcher.<init> Opening Searcher@73245cdc realtime
[junit4:junit4]   2> 25799 T641 C20 P49329 /update {wt=javabin&version=2} {deleteByQuery=*:* (-1422988165958860800)} 0 46
[junit4:junit4]   2> 25816 T678 C19 P49336 oasc.CachingDirectoryFact

[...truncated too long message...]

rowable #1: java.lang.AssertionError: There are still nodes recoverying - waited for 230 seconds
[junit4:junit4]    > 	at __randomizedtesting.SeedInfo.seed([6752C4800C661C47:E6B44A987B397C7B]:0)
[junit4:junit4]    > 	at org.junit.Assert.fail(Assert.java:93)
[junit4:junit4]    > 	at org.apache.solr.cloud.AbstractDistribZkTestBase.waitForRecoveriesToFinish(AbstractDistribZkTestBase.java:175)
[junit4:junit4]    > 	at org.apache.solr.cloud.AbstractDistribZkTestBase.waitForRecoveriesToFinish(AbstractDistribZkTestBase.java:125)
[junit4:junit4]    > 	at org.apache.solr.cloud.AbstractDistribZkTestBase.waitForRecoveriesToFinish(AbstractDistribZkTestBase.java:120)
[junit4:junit4]    > 	at org.apache.solr.cloud.BasicDistributedZkTest.testCoreUnloadAndLeaders(BasicDistributedZkTest.java:552)
[junit4:junit4]    > 	at org.apache.solr.cloud.BasicDistributedZkTest.doTest(BasicDistributedZkTest.java:337)
[junit4:junit4]    > 	at org.apache.solr.BaseDistributedSearchTestCase.testDistribSearch(BaseDistributedSearchTestCase.java:794)
[junit4:junit4]    > 	at sun.reflect.NativeMethodAccessorImpl.invoke0(Native Method)
[junit4:junit4]    > 	at sun.reflect.NativeMethodAccessorImpl.invoke(NativeMethodAccessorImpl.java:57)
[junit4:junit4]    > 	at sun.reflect.DelegatingMethodAccessorImpl.invoke(DelegatingMethodAccessorImpl.java:43)
[junit4:junit4]    > 	at java.lang.reflect.Method.invoke(Method.java:601)
[junit4:junit4]    > 	at com.carrotsearch.randomizedtesting.RandomizedRunner.invoke(RandomizedRunner.java:1559)
[junit4:junit4]    > 	at com.carrotsearch.randomizedtesting.RandomizedRunner.access$600(RandomizedRunner.java:79)
[junit4:junit4]    > 	at com.carrotsearch.randomizedtesting.RandomizedRunner$6.evaluate(RandomizedRunner.java:737)
[junit4:junit4]    > 	at com.carrotsearch.randomizedtesting.RandomizedRunner$7.evaluate(RandomizedRunner.java:773)
[junit4:junit4]    > 	at com.carrotsearch.randomizedtesting.RandomizedRunner$8.evaluate(RandomizedRunner.java:787)
[junit4:junit4]    > 	at com.carrotsearch.randomizedtesting.rules.SystemPropertiesRestoreRule$1.evaluate(SystemPropertiesRestoreRule.java:53)
[junit4:junit4]    > 	at org.apache.lucene.util.TestRuleSetupTeardownChained$1.evaluate(TestRuleSetupTeardownChained.java:50)
[junit4:junit4]    > 	at org.apache.lucene.util.TestRuleFieldCacheSanity$1.evaluate(TestRuleFieldCacheSanity.java:51)
[junit4:junit4]    > 	at org.apache.lucene.util.AbstractBeforeAfterRule$1.evaluate(AbstractBeforeAfterRule.java:46)
[junit4:junit4]    > 	at com.carrotsearch.randomizedtesting.rules.SystemPropertiesInvariantRule$1.evaluate(SystemPropertiesInvariantRule.java:55)
[junit4:junit4]    > 	at org.apache.lucene.util.TestRuleThreadAndTestName$1.evaluate(TestRuleThreadAndTestName.java:49)
[junit4:junit4]    > 	at org.apache.lucene.util.TestRuleIgnoreAfterMaxFailures$1.evaluate(TestRuleIgnoreAfterMaxFailures.java:70)
[junit4:junit4]    > 	at org.apache.lucene.util.TestRuleMarkFailure$1.evaluate(TestRuleMarkFailure.java:48)
[junit4:junit4]    > 	at com.carrotsearch.randomizedtesting.rules.StatementAdapter.evaluate(StatementAdapter.java:36)
[junit4:junit4]    > 	at com.carrotsearch.randomizedtesting.ThreadLeakControl$StatementRunner.run(ThreadLeakControl.java:358)
[junit4:junit4]    > 	at com.carrotsearch.randomizedtesting.ThreadLeakControl.forkTimeoutingTask(ThreadLeakControl.java:782)
[junit4:junit4]    > 	at com.carrotsearch.randomizedtesting.ThreadLeakControl$3.evaluate(ThreadLeakControl.java:442)
[junit4:junit4]    > 	at com.carrotsearch.randomizedtesting.RandomizedRunner.runSingleTest(RandomizedRunner.java:746)
[junit4:junit4]    > 	at com.carrotsearch.randomizedtesting.RandomizedRunner$3.evaluate(RandomizedRunner.java:648)
[junit4:junit4]    > 	at com.carrotsearch.randomizedtesting.RandomizedRunner$4.evaluate(RandomizedRunner.java:682)
[junit4:junit4]    > 	at com.carrotsearch.randomizedtesting.RandomizedRunner$5.evaluate(RandomizedRunner.java:693)
[junit4:junit4]    > 	at com.carrotsearch.randomizedtesting.rules.StatementAdapter.evaluate(StatementAdapter.java:36)
[junit4:junit4]    > 	at com.carrotsearch.randomizedtesting.rules.SystemPropertiesRestoreRule$1.evaluate(SystemPropertiesRestoreRule.java:53)
[junit4:junit4]    > 	at org.apache.lucene.util.AbstractBeforeAfterRule$1.evaluate(AbstractBeforeAfterRule.java:46)
[junit4:junit4]    > 	at org.apache.lucene.util.TestRuleStoreClassName$1.evaluate(TestRuleStoreClassName.java:42)
[junit4:junit4]    > 	at com.carrotsearch.randomizedtesting.rules.SystemPropertiesInvariantRule$1.evaluate(SystemPropertiesInvariantRule.java:55)
[junit4:junit4]    > 	at com.carrotsearch.randomizedtesting.rules.NoShadowingOrOverridesOnMethodsRule$1.evaluate(NoShadowingOrOverridesOnMethodsRule.java:39)
[junit4:junit4]    > 	at com.carrotsearch.randomizedtesting.rules.NoShadowingOrOverridesOnMethodsRule$1.evaluate(NoShadowingOrOverridesOnMethodsRule.java:39)
[junit4:junit4]    > 	at com.carrotsearch.randomizedtesting.rules.StatementAdapter.evaluate(StatementAdapter.java:36)
[junit4:junit4]    > 	at org.apache.lucene.util.TestRuleAssertionsRequired$1.evaluate(TestRuleAssertionsRequired.java:43)
[junit4:junit4]    > 	at org.apache.lucene.util.TestRuleMarkFailure$1.evaluate(TestRuleMarkFailure.java:48)
[junit4:junit4]    > 	at org.apache.lucene.util.TestRuleIgnoreAfterMaxFailures$1.evaluate(TestRuleIgnoreAfterMaxFailures.java:70)
[junit4:junit4]    > 	at org.apache.lucene.util.TestRuleIgnoreTestSuites$1.evaluate(TestRuleIgnoreTestSuites.java:55)
[junit4:junit4]    > 	at com.carrotsearch.randomizedtesting.rules.StatementAdapter.evaluate(StatementAdapter.java:36)
[junit4:junit4]    > 	at com.carrotsearch.randomizedtesting.ThreadLeakControl$StatementRunner.run(ThreadLeakControl.java:358)
[junit4:junit4]    > 	at java.lang.Thread.run(Thread.java:722)
[junit4:junit4]   2> 399309 T626 oas.SolrTestCaseJ4.deleteCore ###deleteCore
[junit4:junit4]   2> NOTE: test params are: codec=Lucene41: {n_f1=Pulsing41(freqCutoff=5 minBlockSize=3 maxBlockSize=103), foo_b=PostingsFormat(name=NestedPulsing), cat=Lucene41(blocksize=128), foo_d=PostingsFormat(name=Memory doPackFST= true), foo_f=PostingsFormat(name=NestedPulsing), n_tl1=Pulsing41(freqCutoff=5 minBlockSize=3 maxBlockSize=103), n_d1=Lucene41(blocksize=128), rnd_b=PostingsFormat(name=Memory doPackFST= true), intDefault=Lucene41(blocksize=128), n_td1=Pulsing41(freqCutoff=5 minBlockSize=3 maxBlockSize=103), timestamp=Lucene41(blocksize=128), id=PostingsFormat(name=Memory doPackFST= true), range_facet_sl=PostingsFormat(name=NestedPulsing), range_facet_si=Pulsing41(freqCutoff=5 minBlockSize=3 maxBlockSize=103), oddField_s=PostingsFormat(name=NestedPulsing), sequence_i=PostingsFormat(name=NestedPulsing), name=PostingsFormat(name=Memory doPackFST= true), foo_i=Pulsing41(freqCutoff=5 minBlockSize=3 maxBlockSize=103), regex_dup_B_s=Lucene41(blocksize=128), multiDefault=Pulsing41(freqCutoff=5 minBlockSize=3 maxBlockSize=103), n_tf1=Lucene41(blocksize=128), n_dt1=Pulsing41(freqCutoff=5 minBlockSize=3 maxBlockSize=103), genre_s=PostingsFormat(name=NestedPulsing), author_t=Pulsing41(freqCutoff=5 minBlockSize=3 maxBlockSize=103), n_ti1=PostingsFormat(name=Memory doPackFST= true), range_facet_l=Lucene41(blocksize=128), text=PostingsFormat(name=NestedPulsing), _version_=Lucene41(blocksize=128), val_i=PostingsFormat(name=Memory doPackFST= true), SubjectTerms_mfacet=Lucene41(blocksize=128), series_t=Pulsing41(freqCutoff=5 minBlockSize=3 maxBlockSize=103), a_t=Lucene41(blocksize=128), n_tdt1=Lucene41(blocksize=128), regex_dup_A_s=PostingsFormat(name=NestedPulsing), price=PostingsFormat(name=NestedPulsing), other_tl1=Lucene41(blocksize=128), n_l1=Lucene41(blocksize=128), a_si=Pulsing41(freqCutoff=5 minBlockSize=3 maxBlockSize=103), inStock=PostingsFormat(name=NestedPulsing)}, sim=RandomSimilarityProvider(queryNorm=true,coord=crazy): {}, locale=mt_MT, timezone=America/Detroit
[junit4:junit4]   2> NOTE: Mac OS X 10.8.2 x86_64/Oracle Corporation 1.7.0_10 (64-bit)/cpus=2,threads=1,free=65755624,total=227540992
[junit4:junit4]   2> NOTE: All tests run in this JVM: [ClusterStateUpdateTest, ChaosMonkeySafeLeaderTest, PreAnalyzedFieldTest, TestCSVLoader, StatelessScriptUpdateProcessorFactoryTest, SignatureUpdateProcessorFactoryTest, MBeansHandlerTest, TestCSVResponseWriter, OverseerTest, DirectSolrConnectionTest, TestSurroundQueryParser, TestWordDelimiterFilterFactory, TestBinaryResponseWriter, TestLuceneMatchVersion, TestStressRecovery, TestSearchPerf, TestPHPSerializedResponseWriter, TestSolrIndexConfig, TestSolrXMLSerializer, JSONWriterTest, BadComponentTest, UpdateRequestProcessorFactoryTest, TestSolrCoreProperties, TermsComponentTest, TestOmitPositions, TestPropInject, TestSolr4Spatial, TestRangeQuery, TimeZoneUtilsTest, BasicDistributedZkTest]
[junit4:junit4] Completed in 399.84s, 1 test, 1 failure <<< FAILURES!

[...truncated 651 lines...]
BUILD FAILED
/Users/jenkins/jenkins-slave/workspace/Lucene-Solr-trunk-MacOSX/build.xml:353: The following error occurred while executing this line:
/Users/jenkins/jenkins-slave/workspace/Lucene-Solr-trunk-MacOSX/build.xml:39: The following error occurred while executing this line:
/Users/jenkins/jenkins-slave/workspace/Lucene-Solr-trunk-MacOSX/solr/build.xml:178: The following error occurred while executing this line:
/Users/jenkins/jenkins-slave/workspace/Lucene-Solr-trunk-MacOSX/solr/common-build.xml:438: The following error occurred while executing this line:
/Users/jenkins/jenkins-slave/workspace/Lucene-Solr-trunk-MacOSX/lucene/common-build.xml:1176: The following error occurred while executing this line:
/Users/jenkins/jenkins-slave/workspace/Lucene-Solr-trunk-MacOSX/lucene/common-build.xml:841: There were test failures: 245 suites, 1011 tests, 1 failure, 13 ignored (2 assumptions)

Total time: 66 minutes 33 seconds
Build step 'Invoke Ant' marked build as failure
Archiving artifacts
Recording test results
Description set: Java: 64bit/jdk1.7.0 -XX:+UseG1GC
Email was triggered for: Failure
Sending email for trigger: Failure



Mime
View raw message