lucene-dev mailing list archives

Site index · List index
Message view « Date » · « Thread »
Top « Date » · « Thread »
From Apache Jenkins Server <jenk...@builds.apache.org>
Subject [JENKINS] Lucene-Solr-Tests-trunk-java7 - Build # 3601 - Still Failing
Date Wed, 02 Jan 2013 10:37:52 GMT
Build: https://builds.apache.org/job/Lucene-Solr-Tests-trunk-java7/3601/

1 tests failed.
REGRESSION:  org.apache.solr.cloud.CollectionsAPIDistributedZkTest.testDistribSearch

Error Message:
some core start times did not change on reload

Stack Trace:
java.lang.AssertionError: some core start times did not change on reload
	at __randomizedtesting.SeedInfo.seed([BAD5DD6B315DB96F:3B3353734602D953]:0)
	at org.junit.Assert.fail(Assert.java:93)
	at org.junit.Assert.assertTrue(Assert.java:43)
	at org.apache.solr.cloud.CollectionsAPIDistributedZkTest.testCollectionsAPI(CollectionsAPIDistributedZkTest.java:274)
	at org.apache.solr.cloud.CollectionsAPIDistributedZkTest.doTest(CollectionsAPIDistributedZkTest.java:152)
	at org.apache.solr.BaseDistributedSearchTestCase.testDistribSearch(BaseDistributedSearchTestCase.java:794)
	at sun.reflect.NativeMethodAccessorImpl.invoke0(Native Method)
	at sun.reflect.NativeMethodAccessorImpl.invoke(NativeMethodAccessorImpl.java:57)
	at sun.reflect.DelegatingMethodAccessorImpl.invoke(DelegatingMethodAccessorImpl.java:43)
	at java.lang.reflect.Method.invoke(Method.java:601)
	at com.carrotsearch.randomizedtesting.RandomizedRunner.invoke(RandomizedRunner.java:1559)
	at com.carrotsearch.randomizedtesting.RandomizedRunner.access$600(RandomizedRunner.java:79)
	at com.carrotsearch.randomizedtesting.RandomizedRunner$6.evaluate(RandomizedRunner.java:737)
	at com.carrotsearch.randomizedtesting.RandomizedRunner$7.evaluate(RandomizedRunner.java:773)
	at com.carrotsearch.randomizedtesting.RandomizedRunner$8.evaluate(RandomizedRunner.java:787)
	at com.carrotsearch.randomizedtesting.rules.SystemPropertiesRestoreRule$1.evaluate(SystemPropertiesRestoreRule.java:53)
	at org.apache.lucene.util.TestRuleSetupTeardownChained$1.evaluate(TestRuleSetupTeardownChained.java:50)
	at org.apache.lucene.util.TestRuleFieldCacheSanity$1.evaluate(TestRuleFieldCacheSanity.java:51)
	at org.apache.lucene.util.AbstractBeforeAfterRule$1.evaluate(AbstractBeforeAfterRule.java:46)
	at com.carrotsearch.randomizedtesting.rules.SystemPropertiesInvariantRule$1.evaluate(SystemPropertiesInvariantRule.java:55)
	at org.apache.lucene.util.TestRuleThreadAndTestName$1.evaluate(TestRuleThreadAndTestName.java:49)
	at org.apache.lucene.util.TestRuleIgnoreAfterMaxFailures$1.evaluate(TestRuleIgnoreAfterMaxFailures.java:70)
	at org.apache.lucene.util.TestRuleMarkFailure$1.evaluate(TestRuleMarkFailure.java:48)
	at com.carrotsearch.randomizedtesting.rules.StatementAdapter.evaluate(StatementAdapter.java:36)
	at com.carrotsearch.randomizedtesting.ThreadLeakControl$StatementRunner.run(ThreadLeakControl.java:358)
	at com.carrotsearch.randomizedtesting.ThreadLeakControl.forkTimeoutingTask(ThreadLeakControl.java:782)
	at com.carrotsearch.randomizedtesting.ThreadLeakControl$3.evaluate(ThreadLeakControl.java:442)
	at com.carrotsearch.randomizedtesting.RandomizedRunner.runSingleTest(RandomizedRunner.java:746)
	at com.carrotsearch.randomizedtesting.RandomizedRunner$3.evaluate(RandomizedRunner.java:648)
	at com.carrotsearch.randomizedtesting.RandomizedRunner$4.evaluate(RandomizedRunner.java:682)
	at com.carrotsearch.randomizedtesting.RandomizedRunner$5.evaluate(RandomizedRunner.java:693)
	at com.carrotsearch.randomizedtesting.rules.StatementAdapter.evaluate(StatementAdapter.java:36)
	at com.carrotsearch.randomizedtesting.rules.SystemPropertiesRestoreRule$1.evaluate(SystemPropertiesRestoreRule.java:53)
	at org.apache.lucene.util.AbstractBeforeAfterRule$1.evaluate(AbstractBeforeAfterRule.java:46)
	at org.apache.lucene.util.TestRuleStoreClassName$1.evaluate(TestRuleStoreClassName.java:42)
	at com.carrotsearch.randomizedtesting.rules.SystemPropertiesInvariantRule$1.evaluate(SystemPropertiesInvariantRule.java:55)
	at com.carrotsearch.randomizedtesting.rules.NoShadowingOrOverridesOnMethodsRule$1.evaluate(NoShadowingOrOverridesOnMethodsRule.java:39)
	at com.carrotsearch.randomizedtesting.rules.NoShadowingOrOverridesOnMethodsRule$1.evaluate(NoShadowingOrOverridesOnMethodsRule.java:39)
	at com.carrotsearch.randomizedtesting.rules.StatementAdapter.evaluate(StatementAdapter.java:36)
	at org.apache.lucene.util.TestRuleAssertionsRequired$1.evaluate(TestRuleAssertionsRequired.java:43)
	at org.apache.lucene.util.TestRuleMarkFailure$1.evaluate(TestRuleMarkFailure.java:48)
	at org.apache.lucene.util.TestRuleIgnoreAfterMaxFailures$1.evaluate(TestRuleIgnoreAfterMaxFailures.java:70)
	at org.apache.lucene.util.TestRuleIgnoreTestSuites$1.evaluate(TestRuleIgnoreTestSuites.java:55)
	at com.carrotsearch.randomizedtesting.rules.StatementAdapter.evaluate(StatementAdapter.java:36)
	at com.carrotsearch.randomizedtesting.ThreadLeakControl$StatementRunner.run(ThreadLeakControl.java:358)
	at java.lang.Thread.run(Thread.java:722)




Build Log:
[...truncated 9429 lines...]
[junit4:junit4] Suite: org.apache.solr.cloud.CollectionsAPIDistributedZkTest
[junit4:junit4]   2> 0 T2972 oas.BaseDistributedSearchTestCase.initHostContext Setting hostContext system property: /
[junit4:junit4]   2> 4 T2972 oas.SolrTestCaseJ4.setUp ###Starting testDistribSearch
[junit4:junit4]   2> Creating dataDir: /usr/home/hudson/hudson-slave/workspace/Lucene-Solr-Tests-trunk-java7/solr/build/solr-core/test/J1/./solrtest-CollectionsAPIDistributedZkTest-1357122781918
[junit4:junit4]   2> 5 T2972 oasc.ZkTestServer.run STARTING ZK TEST SERVER
[junit4:junit4]   2> 6 T2973 oasc.ZkTestServer$ZKServerMain.runFromConfig Starting server
[junit4:junit4]   2> 10 T2973 oazs.ZooKeeperServer.setTickTime tickTime set to 1000
[junit4:junit4]   2> 10 T2973 oazs.ZooKeeperServer.setMinSessionTimeout minSessionTimeout set to -1
[junit4:junit4]   2> 10 T2973 oazs.ZooKeeperServer.setMaxSessionTimeout maxSessionTimeout set to -1
[junit4:junit4]   2> 10 T2973 oazs.NIOServerCnxnFactory.configure binding to port 0.0.0.0/0.0.0.0:0
[junit4:junit4]   2> 11 T2973 oazsp.FileTxnSnapLog.save Snapshotting: 0x0 to /usr/home/hudson/hudson-slave/workspace/Lucene-Solr-Tests-trunk-java7/solr/build/solr-core/test/J1/./org.apache.solr.cloud.CollectionsAPIDistributedZkTest-1357122781917/zookeeper/server1/data/version-2/snapshot.0
[junit4:junit4]   2> 107 T2972 oasc.ZkTestServer.run start zk server on port:28878
[junit4:junit4]   2> 107 T2972 oaz.ZooKeeper.<init> Initiating client connection, connectString=127.0.0.1:28878 sessionTimeout=10000 watcher=org.apache.solr.common.cloud.ConnectionManager@92de7c
[junit4:junit4]   2> 108 T2972 oascc.ConnectionManager.waitForConnected Waiting for client to connect to ZooKeeper
[junit4:junit4]   2> 109 T2978 oaz.ClientCnxn$SendThread.logStartConnect Opening socket connection to server localhost/127.0.0.1:28878. Will not attempt to authenticate using SASL (access denied ("javax.security.auth.AuthPermission" "getLoginConfiguration"))
[junit4:junit4]   2> 109 T2978 oaz.ClientCnxn$SendThread.primeConnection Socket connection established to localhost/127.0.0.1:28878, initiating session
[junit4:junit4]   2> 110 T2974 oazs.NIOServerCnxnFactory.run Accepted socket connection from /140.211.11.196:28879
[junit4:junit4]   2> 110 T2974 oazs.ZooKeeperServer.processConnectRequest Client attempting to establish new session at /140.211.11.196:28879
[junit4:junit4]   2> 110 T2976 oazsp.FileTxnLog.append Creating new log file: log.1
[junit4:junit4]   2> 123 T2976 oazs.ZooKeeperServer.finishSessionInit Established session 0x13bfad242e50000 with negotiated timeout 10000 for client /140.211.11.196:28879
[junit4:junit4]   2> 123 T2978 oaz.ClientCnxn$SendThread.onConnected Session establishment complete on server localhost/127.0.0.1:28878, sessionid = 0x13bfad242e50000, negotiated timeout = 10000
[junit4:junit4]   2> 124 T2979 oascc.ConnectionManager.process Watcher org.apache.solr.common.cloud.ConnectionManager@92de7c name:ZooKeeperConnection Watcher:127.0.0.1:28878 got event WatchedEvent state:SyncConnected type:None path:null path:null type:None
[junit4:junit4]   2> 124 T2972 oascc.ConnectionManager.waitForConnected Client is connected to ZooKeeper
[junit4:junit4]   2> 125 T2972 oascc.SolrZkClient.makePath makePath: /solr
[junit4:junit4]   2> 128 T2977 oazs.PrepRequestProcessor.pRequest2Txn Processed session termination for sessionid: 0x13bfad242e50000
[junit4:junit4]   2> 129 T2979 oaz.ClientCnxn$EventThread.run EventThread shut down
[junit4:junit4]   2> 129 T2974 oazs.NIOServerCnxn.closeSock Closed socket connection for client /140.211.11.196:28879 which had sessionid 0x13bfad242e50000
[junit4:junit4]   2> 129 T2972 oaz.ZooKeeper.close Session: 0x13bfad242e50000 closed
[junit4:junit4]   2> 130 T2972 oaz.ZooKeeper.<init> Initiating client connection, connectString=127.0.0.1:28878/solr sessionTimeout=10000 watcher=org.apache.solr.common.cloud.ConnectionManager@16e719b
[junit4:junit4]   2> 131 T2972 oascc.ConnectionManager.waitForConnected Waiting for client to connect to ZooKeeper
[junit4:junit4]   2> 131 T2980 oaz.ClientCnxn$SendThread.logStartConnect Opening socket connection to server localhost/127.0.0.1:28878. Will not attempt to authenticate using SASL (access denied ("javax.security.auth.AuthPermission" "getLoginConfiguration"))
[junit4:junit4]   2> 131 T2980 oaz.ClientCnxn$SendThread.primeConnection Socket connection established to localhost/127.0.0.1:28878, initiating session
[junit4:junit4]   2> 132 T2974 oazs.NIOServerCnxnFactory.run Accepted socket connection from /140.211.11.196:28880
[junit4:junit4]   2> 132 T2974 oazs.ZooKeeperServer.processConnectRequest Client attempting to establish new session at /140.211.11.196:28880
[junit4:junit4]   2> 141 T2976 oazs.ZooKeeperServer.finishSessionInit Established session 0x13bfad242e50001 with negotiated timeout 10000 for client /140.211.11.196:28880
[junit4:junit4]   2> 141 T2980 oaz.ClientCnxn$SendThread.onConnected Session establishment complete on server localhost/127.0.0.1:28878, sessionid = 0x13bfad242e50001, negotiated timeout = 10000
[junit4:junit4]   2> 142 T2981 oascc.ConnectionManager.process Watcher org.apache.solr.common.cloud.ConnectionManager@16e719b name:ZooKeeperConnection Watcher:127.0.0.1:28878/solr got event WatchedEvent state:SyncConnected type:None path:null path:null type:None
[junit4:junit4]   2> 142 T2972 oascc.ConnectionManager.waitForConnected Client is connected to ZooKeeper
[junit4:junit4]   2> 142 T2972 oascc.SolrZkClient.makePath makePath: /collections/collection1
[junit4:junit4]   2> 150 T2972 oascc.SolrZkClient.makePath makePath: /collections/collection1/shards
[junit4:junit4]   2> 153 T2972 oascc.SolrZkClient.makePath makePath: /collections/control_collection
[junit4:junit4]   2> 156 T2972 oascc.SolrZkClient.makePath makePath: /collections/control_collection/shards
[junit4:junit4]   2> 163 T2972 oasc.AbstractZkTestCase.putConfig put /usr/home/hudson/hudson-slave/workspace/Lucene-Solr-Tests-trunk-java7/solr/build/solr-core/test-files/solr/collection1/conf/solrconfig.xml to /configs/conf1/solrconfig.xml
[junit4:junit4]   2> 164 T2972 oascc.SolrZkClient.makePath makePath: /configs/conf1/solrconfig.xml
[junit4:junit4]   2> 177 T2972 oasc.AbstractZkTestCase.putConfig put /usr/home/hudson/hudson-slave/workspace/Lucene-Solr-Tests-trunk-java7/solr/build/solr-core/test-files/solr/collection1/conf/schema.xml to /configs/conf1/schema.xml
[junit4:junit4]   2> 178 T2972 oascc.SolrZkClient.makePath makePath: /configs/conf1/schema.xml
[junit4:junit4]   2> 282 T2972 oasc.AbstractZkTestCase.putConfig put /usr/home/hudson/hudson-slave/workspace/Lucene-Solr-Tests-trunk-java7/solr/build/solr-core/test-files/solr/collection1/conf/stopwords.txt to /configs/conf1/stopwords.txt
[junit4:junit4]   2> 282 T2972 oascc.SolrZkClient.makePath makePath: /configs/conf1/stopwords.txt
[junit4:junit4]   2> 285 T2972 oasc.AbstractZkTestCase.putConfig put /usr/home/hudson/hudson-slave/workspace/Lucene-Solr-Tests-trunk-java7/solr/build/solr-core/test-files/solr/collection1/conf/protwords.txt to /configs/conf1/protwords.txt
[junit4:junit4]   2> 286 T2972 oascc.SolrZkClient.makePath makePath: /configs/conf1/protwords.txt
[junit4:junit4]   2> 296 T2972 oasc.AbstractZkTestCase.putConfig put /usr/home/hudson/hudson-slave/workspace/Lucene-Solr-Tests-trunk-java7/solr/build/solr-core/test-files/solr/collection1/conf/currency.xml to /configs/conf1/currency.xml
[junit4:junit4]   2> 297 T2972 oascc.SolrZkClient.makePath makePath: /configs/conf1/currency.xml
[junit4:junit4]   2> 300 T2972 oasc.AbstractZkTestCase.putConfig put /usr/home/hudson/hudson-slave/workspace/Lucene-Solr-Tests-trunk-java7/solr/build/solr-core/test-files/solr/collection1/conf/open-exchange-rates.json to /configs/conf1/open-exchange-rates.json
[junit4:junit4]   2> 301 T2972 oascc.SolrZkClient.makePath makePath: /configs/conf1/open-exchange-rates.json
[junit4:junit4]   2> 303 T2972 oasc.AbstractZkTestCase.putConfig put /usr/home/hudson/hudson-slave/workspace/Lucene-Solr-Tests-trunk-java7/solr/build/solr-core/test-files/solr/collection1/conf/mapping-ISOLatin1Accent.txt to /configs/conf1/mapping-ISOLatin1Accent.txt
[junit4:junit4]   2> 304 T2972 oascc.SolrZkClient.makePath makePath: /configs/conf1/mapping-ISOLatin1Accent.txt
[junit4:junit4]   2> 306 T2972 oasc.AbstractZkTestCase.putConfig put /usr/home/hudson/hudson-slave/workspace/Lucene-Solr-Tests-trunk-java7/solr/build/solr-core/test-files/solr/collection1/conf/old_synonyms.txt to /configs/conf1/old_synonyms.txt
[junit4:junit4]   2> 307 T2972 oascc.SolrZkClient.makePath makePath: /configs/conf1/old_synonyms.txt
[junit4:junit4]   2> 315 T2972 oasc.AbstractZkTestCase.putConfig put /usr/home/hudson/hudson-slave/workspace/Lucene-Solr-Tests-trunk-java7/solr/build/solr-core/test-files/solr/collection1/conf/synonyms.txt to /configs/conf1/synonyms.txt
[junit4:junit4]   2> 315 T2972 oascc.SolrZkClient.makePath makePath: /configs/conf1/synonyms.txt
[junit4:junit4]   2> 318 T2977 oazs.PrepRequestProcessor.pRequest2Txn Processed session termination for sessionid: 0x13bfad242e50001
[junit4:junit4]   2> 319 T2981 oaz.ClientCnxn$EventThread.run EventThread shut down
[junit4:junit4]   2> 319 T2974 oazs.NIOServerCnxn.closeSock Closed socket connection for client /140.211.11.196:28880 which had sessionid 0x13bfad242e50001
[junit4:junit4]   2> 319 T2972 oaz.ZooKeeper.close Session: 0x13bfad242e50001 closed
[junit4:junit4]   2> 502 T2972 oejs.Server.doStart jetty-8.1.8.v20121106
[junit4:junit4]   2> 507 T2972 oejs.AbstractConnector.doStart Started SocketConnector@127.0.0.1:28881
[junit4:junit4]   2> 508 T2972 oasc.SolrResourceLoader.locateSolrHome JNDI not configured for solr (NoInitialContextEx)
[junit4:junit4]   2> 509 T2972 oasc.SolrResourceLoader.locateSolrHome using system property solr.solr.home: /usr/home/hudson/hudson-slave/workspace/Lucene-Solr-Tests-trunk-java7/solr/build/solr-core/test/J1/./org.apache.solr.cloud.CollectionsAPIDistributedZkTest-controljetty-1357122782233
[junit4:junit4]   2> 509 T2972 oasc.SolrResourceLoader.<init> new SolrResourceLoader for deduced Solr Home: '/usr/home/hudson/hudson-slave/workspace/Lucene-Solr-Tests-trunk-java7/solr/build/solr-core/test/J1/./org.apache.solr.cloud.CollectionsAPIDistributedZkTest-controljetty-1357122782233/'
[junit4:junit4]   2> 554 T2972 oass.SolrDispatchFilter.init SolrDispatchFilter.init()
[junit4:junit4]   2> 555 T2972 oasc.SolrResourceLoader.locateSolrHome JNDI not configured for solr (NoInitialContextEx)
[junit4:junit4]   2> 555 T2972 oasc.SolrResourceLoader.locateSolrHome using system property solr.solr.home: /usr/home/hudson/hudson-slave/workspace/Lucene-Solr-Tests-trunk-java7/solr/build/solr-core/test/J1/./org.apache.solr.cloud.CollectionsAPIDistributedZkTest-controljetty-1357122782233
[junit4:junit4]   2> 556 T2972 oasc.CoreContainer$Initializer.initialize looking for solr.xml: /usr/home/hudson/hudson-slave/workspace/Lucene-Solr-Tests-trunk-java7/solr/build/solr-core/test/J1/./org.apache.solr.cloud.CollectionsAPIDistributedZkTest-controljetty-1357122782233/solr.xml
[junit4:junit4]   2> 556 T2972 oasc.CoreContainer.<init> New CoreContainer 238692351
[junit4:junit4]   2> 557 T2972 oasc.CoreContainer.load Loading CoreContainer using Solr Home: '/usr/home/hudson/hudson-slave/workspace/Lucene-Solr-Tests-trunk-java7/solr/build/solr-core/test/J1/./org.apache.solr.cloud.CollectionsAPIDistributedZkTest-controljetty-1357122782233/'
[junit4:junit4]   2> 557 T2972 oasc.SolrResourceLoader.<init> new SolrResourceLoader for directory: '/usr/home/hudson/hudson-slave/workspace/Lucene-Solr-Tests-trunk-java7/solr/build/solr-core/test/J1/./org.apache.solr.cloud.CollectionsAPIDistributedZkTest-controljetty-1357122782233/'
[junit4:junit4]   2> 591 T2972 oashc.HttpShardHandlerFactory.getParameter Setting socketTimeout to: 30000
[junit4:junit4]   2> 591 T2972 oashc.HttpShardHandlerFactory.getParameter Setting urlScheme to: http://
[junit4:junit4]   2> 592 T2972 oashc.HttpShardHandlerFactory.getParameter Setting connTimeout to: 15000
[junit4:junit4]   2> 592 T2972 oashc.HttpShardHandlerFactory.getParameter Setting maxConnectionsPerHost to: 20
[junit4:junit4]   2> 593 T2972 oashc.HttpShardHandlerFactory.getParameter Setting corePoolSize to: 0
[junit4:junit4]   2> 593 T2972 oashc.HttpShardHandlerFactory.getParameter Setting maximumPoolSize to: 2147483647
[junit4:junit4]   2> 593 T2972 oashc.HttpShardHandlerFactory.getParameter Setting maxThreadIdleTime to: 5
[junit4:junit4]   2> 594 T2972 oashc.HttpShardHandlerFactory.getParameter Setting sizeOfQueue to: -1
[junit4:junit4]   2> 594 T2972 oashc.HttpShardHandlerFactory.getParameter Setting fairnessPolicy to: false
[junit4:junit4]   2> 595 T2972 oascsi.HttpClientUtil.createClient Creating new http client, config:maxConnectionsPerHost=20&maxConnections=10000&socketTimeout=30000&connTimeout=15000&retry=false
[junit4:junit4]   2> 618 T2972 oasc.CoreContainer.load Registering Log Listener
[junit4:junit4]   2> 639 T2972 oasc.CoreContainer.initZooKeeper Zookeeper client=127.0.0.1:28878/solr
[junit4:junit4]   2> 640 T2972 oasc.ZkController.checkChrootPath zkHost includes chroot
[junit4:junit4]   2> 640 T2972 oaz.ZooKeeper.<init> Initiating client connection, connectString=127.0.0.1:28878 sessionTimeout=60000 watcher=org.apache.solr.common.cloud.ConnectionManager@152470a9
[junit4:junit4]   2> 641 T2972 oascc.ConnectionManager.waitForConnected Waiting for client to connect to ZooKeeper
[junit4:junit4]   2> 641 T2991 oaz.ClientCnxn$SendThread.logStartConnect Opening socket connection to server localhost/127.0.0.1:28878. Will not attempt to authenticate using SASL (access denied ("javax.security.auth.AuthPermission" "getLoginConfiguration"))
[junit4:junit4]   2> 642 T2991 oaz.ClientCnxn$SendThread.primeConnection Socket connection established to localhost/127.0.0.1:28878, initiating session
[junit4:junit4]   2> 643 T2974 oazs.NIOServerCnxnFactory.run Accepted socket connection from /140.211.11.196:28882
[junit4:junit4]   2> 643 T2974 oazs.ZooKeeperServer.processConnectRequest Client attempting to establish new session at /140.211.11.196:28882
[junit4:junit4]   2> 644 T2976 oazs.ZooKeeperServer.finishSessionInit Established session 0x13bfad242e50002 with negotiated timeout 20000 for client /140.211.11.196:28882
[junit4:junit4]   2> 644 T2991 oaz.ClientCnxn$SendThread.onConnected Session establishment complete on server localhost/127.0.0.1:28878, sessionid = 0x13bfad242e50002, negotiated timeout = 20000
[junit4:junit4]   2> 644 T2992 oascc.ConnectionManager.process Watcher org.apache.solr.common.cloud.ConnectionManager@152470a9 name:ZooKeeperConnection Watcher:127.0.0.1:28878 got event WatchedEvent state:SyncConnected type:None path:null path:null type:None
[junit4:junit4]   2> 644 T2972 oascc.ConnectionManager.waitForConnected Client is connected to ZooKeeper
[junit4:junit4]   2> 645 T2977 oazs.PrepRequestProcessor.pRequest2Txn Processed session termination for sessionid: 0x13bfad242e50002
[junit4:junit4]   2> 646 T2992 oaz.ClientCnxn$EventThread.run EventThread shut down
[junit4:junit4]   2> 646 T2974 oazs.NIOServerCnxn.closeSock Closed socket connection for client /140.211.11.196:28882 which had sessionid 0x13bfad242e50002
[junit4:junit4]   2> 646 T2972 oaz.ZooKeeper.close Session: 0x13bfad242e50002 closed
[junit4:junit4]   2> 647 T2972 oascsi.HttpClientUtil.createClient Creating new http client, config:maxConnections=500&maxConnectionsPerHost=16&socketTimeout=15000&connTimeout=30000
[junit4:junit4]   2> 659 T2972 oaz.ZooKeeper.<init> Initiating client connection, connectString=127.0.0.1:28878/solr sessionTimeout=30000 watcher=org.apache.solr.common.cloud.ConnectionManager@4028eaf0
[junit4:junit4]   2> 660 T2972 oascc.ConnectionManager.waitForConnected Waiting for client to connect to ZooKeeper
[junit4:junit4]   2> 660 T2993 oaz.ClientCnxn$SendThread.logStartConnect Opening socket connection to server localhost/127.0.0.1:28878. Will not attempt to authenticate using SASL (access denied ("javax.security.auth.AuthPermission" "getLoginConfiguration"))
[junit4:junit4]   2> 660 T2993 oaz.ClientCnxn$SendThread.primeConnection Socket connection established to localhost/127.0.0.1:28878, initiating session
[junit4:junit4]   2> 661 T2974 oazs.NIOServerCnxnFactory.run Accepted socket connection from /140.211.11.196:28883
[junit4:junit4]   2> 661 T2974 oazs.ZooKeeperServer.processConnectRequest Client attempting to establish new session at /140.211.11.196:28883
[junit4:junit4]   2> 662 T2976 oazs.ZooKeeperServer.finishSessionInit Established session 0x13bfad242e50003 with negotiated timeout 20000 for client /140.211.11.196:28883
[junit4:junit4]   2> 662 T2993 oaz.ClientCnxn$SendThread.onConnected Session establishment complete on server localhost/127.0.0.1:28878, sessionid = 0x13bfad242e50003, negotiated timeout = 20000
[junit4:junit4]   2> 662 T2994 oascc.ConnectionManager.process Watcher org.apache.solr.common.cloud.ConnectionManager@4028eaf0 name:ZooKeeperConnection Watcher:127.0.0.1:28878/solr got event WatchedEvent state:SyncConnected type:None path:null path:null type:None
[junit4:junit4]   2> 662 T2972 oascc.ConnectionManager.waitForConnected Client is connected to ZooKeeper
[junit4:junit4]   2> 664 T2977 oazs.PrepRequestProcessor.pRequest Got user-level KeeperException when processing sessionid:0x13bfad242e50003 type:create cxid:0x2 zxid:0x1a txntype:-1 reqpath:n/a Error Path:/solr/overseer Error:KeeperErrorCode = NodeExists for /solr/overseer
[junit4:junit4]   2> 672 T2972 oascc.SolrZkClient.makePath makePath: /live_nodes
[junit4:junit4]   2> 674 T2972 oasc.ZkController.createEphemeralLiveNode Register node as live in ZooKeeper:/live_nodes/127.0.0.1:28881_
[junit4:junit4]   2> 674 T2977 oazs.PrepRequestProcessor.pRequest Got user-level KeeperException when processing sessionid:0x13bfad242e50003 type:delete cxid:0x7 zxid:0x1c txntype:-1 reqpath:n/a Error Path:/solr/live_nodes/127.0.0.1:28881_ Error:KeeperErrorCode = NoNode for /solr/live_nodes/127.0.0.1:28881_
[junit4:junit4]   2> 680 T2972 oascc.SolrZkClient.makePath makePath: /live_nodes/127.0.0.1:28881_
[junit4:junit4]   2> 683 T2972 oascc.SolrZkClient.makePath makePath: /overseer_elect/election
[junit4:junit4]   2> 694 T2977 oazs.PrepRequestProcessor.pRequest Got user-level KeeperException when processing sessionid:0x13bfad242e50003 type:delete cxid:0x15 zxid:0x21 txntype:-1 reqpath:n/a Error Path:/solr/overseer_elect/leader Error:KeeperErrorCode = NoNode for /solr/overseer_elect/leader
[junit4:junit4]   2> 695 T2972 oascc.SolrZkClient.makePath makePath: /overseer_elect/leader
[junit4:junit4]   2> 704 T2972 oasc.Overseer.start Overseer (id=88940398636236803-127.0.0.1:28881_-n_0000000000) starting
[junit4:junit4]   2> 705 T2977 oazs.PrepRequestProcessor.pRequest Got user-level KeeperException when processing sessionid:0x13bfad242e50003 type:create cxid:0x1a zxid:0x23 txntype:-1 reqpath:n/a Error Path:/solr/overseer Error:KeeperErrorCode = NodeExists for /solr/overseer
[junit4:junit4]   2> 706 T2977 oazs.PrepRequestProcessor.pRequest Got user-level KeeperException when processing sessionid:0x13bfad242e50003 type:create cxid:0x1b zxid:0x24 txntype:-1 reqpath:n/a Error Path:/solr/overseer Error:KeeperErrorCode = NodeExists for /solr/overseer
[junit4:junit4]   2> 712 T2977 oazs.PrepRequestProcessor.pRequest Got user-level KeeperException when processing sessionid:0x13bfad242e50003 type:create cxid:0x1c zxid:0x25 txntype:-1 reqpath:n/a Error Path:/solr/overseer Error:KeeperErrorCode = NodeExists for /solr/overseer
[junit4:junit4]   2> 713 T2977 oazs.PrepRequestProcessor.pRequest Got user-level KeeperException when processing sessionid:0x13bfad242e50003 type:create cxid:0x1d zxid:0x26 txntype:-1 reqpath:n/a Error Path:/solr/overseer Error:KeeperErrorCode = NodeExists for /solr/overseer
[junit4:junit4]   2> 721 T2996 oasc.OverseerCollectionProcessor.run Process current queue of collection messages
[junit4:junit4]   2> 721 T2972 oascc.SolrZkClient.makePath makePath: /clusterstate.json
[junit4:junit4]   2> 724 T2972 oascc.ZkStateReader.createClusterStateWatchersAndUpdate Updating cluster state from ZooKeeper... 
[junit4:junit4]   2> 726 T2995 oasc.Overseer$ClusterStateUpdater.run Starting to work on the main queue
[junit4:junit4]   2> 731 T2997 oasc.CoreContainer.create Creating SolrCore 'collection1' using instanceDir: /usr/home/hudson/hudson-slave/workspace/Lucene-Solr-Tests-trunk-java7/solr/build/solr-core/test/J1/./org.apache.solr.cloud.CollectionsAPIDistributedZkTest-controljetty-1357122782233/collection1
[junit4:junit4]   2> 731 T2997 oasc.ZkController.createCollectionZkNode Check for collection zkNode:control_collection
[junit4:junit4]   2> 732 T2997 oasc.ZkController.createCollectionZkNode Collection zkNode exists
[junit4:junit4]   2> 732 T2997 oasc.ZkController.readConfigName Load collection config from:/collections/control_collection
[junit4:junit4]   2> 733 T2997 oasc.SolrResourceLoader.<init> new SolrResourceLoader for directory: '/usr/home/hudson/hudson-slave/workspace/Lucene-Solr-Tests-trunk-java7/solr/build/solr-core/test/J1/./org.apache.solr.cloud.CollectionsAPIDistributedZkTest-controljetty-1357122782233/collection1/'
[junit4:junit4]   2> 734 T2997 oasc.SolrResourceLoader.replaceClassLoader Adding 'file:/usr/home/hudson/hudson-slave/workspace/Lucene-Solr-Tests-trunk-java7/solr/build/solr-core/test/J1/org.apache.solr.cloud.CollectionsAPIDistributedZkTest-controljetty-1357122782233/collection1/lib/README' to classloader
[junit4:junit4]   2> 734 T2997 oasc.SolrResourceLoader.replaceClassLoader Adding 'file:/usr/home/hudson/hudson-slave/workspace/Lucene-Solr-Tests-trunk-java7/solr/build/solr-core/test/J1/org.apache.solr.cloud.CollectionsAPIDistributedZkTest-controljetty-1357122782233/collection1/lib/classes/' to classloader
[junit4:junit4]   2> 771 T2997 oasc.SolrConfig.<init> Using Lucene MatchVersion: LUCENE_50
[junit4:junit4]   2> 820 T2997 oasc.SolrConfig.<init> Loaded SolrConfig: solrconfig.xml
[junit4:junit4]   2> 920 T2997 oass.IndexSchema.readSchema Reading Solr Schema
[junit4:junit4]   2> 926 T2997 oass.IndexSchema.readSchema Schema name=test
[junit4:junit4]   2> 1354 T2997 oass.OpenExchangeRatesOrgProvider.init Initialized with rates=open-exchange-rates.json, refreshInterval=1440.
[junit4:junit4]   2> 1363 T2997 oass.IndexSchema.readSchema default search field in schema is text
[junit4:junit4]   2> 1366 T2997 oass.IndexSchema.readSchema unique key field: id
[junit4:junit4]   2> 1377 T2997 oass.FileExchangeRateProvider.reload Reloading exchange rates from file currency.xml
[junit4:junit4]   2> 1381 T2997 oass.FileExchangeRateProvider.reload Reloading exchange rates from file currency.xml
[junit4:junit4]   2> 1384 T2997 oass.OpenExchangeRatesOrgProvider.reload Reloading exchange rates from open-exchange-rates.json
[junit4:junit4]   2> 1385 T2997 oass.OpenExchangeRatesOrgProvider.reload Reloading exchange rates from open-exchange-rates.json
[junit4:junit4]   2> 1386 T2997 oasc.SolrCore.<init> [collection1] Opening new SolrCore at /usr/home/hudson/hudson-slave/workspace/Lucene-Solr-Tests-trunk-java7/solr/build/solr-core/test/J1/./org.apache.solr.cloud.CollectionsAPIDistributedZkTest-controljetty-1357122782233/collection1/, dataDir=./org.apache.solr.cloud.CollectionsAPIDistributedZkTest-1357122781917/control/data/
[junit4:junit4]   2> 1386 T2997 oasc.JmxMonitoredMap.<init> JMX monitoring is enabled. Adding Solr mbeans to JMX Server: com.sun.jmx.mbeanserver.JmxMBeanServer@1f936f80
[junit4:junit4]   2> 1386 T2997 oasc.SolrCore.initDirectoryFactory solr.NRTCachingDirectoryFactory
[junit4:junit4]   2> 1387 T2997 oasc.CachingDirectoryFactory.get return new directory for /usr/home/hudson/hudson-slave/workspace/Lucene-Solr-Tests-trunk-java7/solr/build/solr-core/test/J1/./org.apache.solr.cloud.CollectionsAPIDistributedZkTest-1357122781917/control/data forceNew:false
[junit4:junit4]   2> 1388 T2997 oasc.CachingDirectoryFactory.close Releasing directory:/usr/home/hudson/hudson-slave/workspace/Lucene-Solr-Tests-trunk-java7/solr/build/solr-core/test/J1/./org.apache.solr.cloud.CollectionsAPIDistributedZkTest-1357122781917/control/data
[junit4:junit4]   2> 1388 T2997 oasc.SolrCore.getNewIndexDir New index directory detected: old=null new=./org.apache.solr.cloud.CollectionsAPIDistributedZkTest-1357122781917/control/data/index/
[junit4:junit4]   2> 1389 T2997 oasc.SolrCore.initIndex WARNING [collection1] Solr index directory './org.apache.solr.cloud.CollectionsAPIDistributedZkTest-1357122781917/control/data/index' doesn't exist. Creating new index...
[junit4:junit4]   2> 1390 T2997 oasc.CachingDirectoryFactory.get return new directory for /usr/home/hudson/hudson-slave/workspace/Lucene-Solr-Tests-trunk-java7/solr/build/solr-core/test/J1/./org.apache.solr.cloud.CollectionsAPIDistributedZkTest-1357122781917/control/data/index forceNew:false
[junit4:junit4]   2> 1424 T2997 oasc.SolrDeletionPolicy.onCommit SolrDeletionPolicy.onCommit: commits:num=1
[junit4:junit4]   2> 		commit{dir=RateLimitedDirectoryWrapper(NRTCachingDirectory(org.apache.lucene.store.NIOFSDirectory@/usr/home/hudson/hudson-slave/workspace/Lucene-Solr-Tests-trunk-java7/solr/build/solr-core/test/J1/org.apache.solr.cloud.CollectionsAPIDistributedZkTest-1357122781917/control/data/index lockFactory=org.apache.lucene.store.NativeFSLockFactory@2223109; maxCacheMB=48.0 maxMergeSizeMB=4.0)),segFN=segments_1,generation=1,filenames=[segments_1]
[junit4:junit4]   2> 1424 T2997 oasc.SolrDeletionPolicy.updateCommits newest commit = 1[segments_1]
[junit4:junit4]   2> 1425 T2997 oasc.CachingDirectoryFactory.close Releasing directory:/usr/home/hudson/hudson-slave/workspace/Lucene-Solr-Tests-trunk-java7/solr/build/solr-core/test/J1/./org.apache.solr.cloud.CollectionsAPIDistributedZkTest-1357122781917/control/data/index
[junit4:junit4]   2> 1425 T2997 oasc.SolrCore.initWriters created xml: solr.XMLResponseWriter
[junit4:junit4]   2> 1427 T2997 oasup.UpdateRequestProcessorChain.init inserting DistributedUpdateProcessorFactory into updateRequestProcessorChain "dedupe"
[junit4:junit4]   2> 1427 T2997 oasup.UpdateRequestProcessorChain.init inserting DistributedUpdateProcessorFactory into updateRequestProcessorChain "dedupe-allfields"
[junit4:junit4]   2> 1427 T2997 oasup.UpdateRequestProcessorChain.init inserting DistributedUpdateProcessorFactory into updateRequestProcessorChain "stored_sig"
[junit4:junit4]   2> 1427 T2997 oasup.UpdateRequestProcessorChain.init inserting DistributedUpdateProcessorFactory into updateRequestProcessorChain "uniq-fields"
[junit4:junit4]   2> 1428 T2997 oasup.UpdateRequestProcessorChain.init inserting DistributedUpdateProcessorFactory into updateRequestProcessorChain "distrib-dup-test-chain-implicit"
[junit4:junit4]   2> 1428 T2997 oasc.RequestHandlers.initHandlersFromConfig adding lazy requestHandler: solr.ReplicationHandler
[junit4:junit4]   2> 1428 T2997 oasc.RequestHandlers.initHandlersFromConfig created /replication: solr.ReplicationHandler
[junit4:junit4]   2> 1429 T2997 oasc.RequestHandlers.initHandlersFromConfig created standard: solr.StandardRequestHandler
[junit4:junit4]   2> 1429 T2997 oasc.RequestHandlers.initHandlersFromConfig created /get: solr.RealTimeGetHandler
[junit4:junit4]   2> 1429 T2997 oasc.RequestHandlers.initHandlersFromConfig created dismax: solr.SearchHandler
[junit4:junit4]   2> 1430 T2997 oasc.RequestHandlers.initHandlersFromConfig created mock: org.apache.solr.core.MockQuerySenderListenerReqHandler
[junit4:junit4]   2> 1430 T2997 oasc.RequestHandlers.initHandlersFromConfig created /admin/: org.apache.solr.handler.admin.AdminHandlers
[junit4:junit4]   2> 1430 T2997 oasc.RequestHandlers.initHandlersFromConfig created defaults: solr.StandardRequestHandler
[junit4:junit4]   2> 1430 T2997 oasc.RequestHandlers.initHandlersFromConfig adding lazy requestHandler: solr.StandardRequestHandler
[junit4:junit4]   2> 1431 T2997 oasc.RequestHandlers.initHandlersFromConfig created lazy: solr.StandardRequestHandler
[junit4:junit4]   2> 1431 T2997 oasc.RequestHandlers.initHandlersFromConfig created /update: solr.UpdateRequestHandler
[junit4:junit4]   2> 1431 T2997 oasc.RequestHandlers.initHandlersFromConfig created /terms: org.apache.solr.handler.component.SearchHandler
[junit4:junit4]   2> 1432 T2997 oasc.RequestHandlers.initHandlersFromConfig created spellCheckCompRH: org.apache.solr.handler.component.SearchHandler
[junit4:junit4]   2> 1432 T2997 oasc.RequestHandlers.initHandlersFromConfig created spellCheckCompRH_Direct: org.apache.solr.handler.component.SearchHandler
[junit4:junit4]   2> 1432 T2997 oasc.RequestHandlers.initHandlersFromConfig created spellCheckWithWordbreak: org.apache.solr.handler.component.SearchHandler
[junit4:junit4]   2> 1432 T2997 oasc.RequestHandlers.initHandlersFromConfig created spellCheckWithWordbreak_Direct: org.apache.solr.handler.component.SearchHandler
[junit4:junit4]   2> 1433 T2997 oasc.RequestHandlers.initHandlersFromConfig created spellCheckCompRH1: org.apache.solr.handler.component.SearchHandler
[junit4:junit4]   2> 1433 T2997 oasc.RequestHandlers.initHandlersFromConfig created mltrh: org.apache.solr.handler.component.SearchHandler
[junit4:junit4]   2> 1433 T2997 oasc.RequestHandlers.initHandlersFromConfig created tvrh: org.apache.solr.handler.component.SearchHandler
[junit4:junit4]   2> 1434 T2997 oasc.RequestHandlers.initHandlersFromConfig created /mlt: solr.MoreLikeThisHandler
[junit4:junit4]   2> 1434 T2997 oasc.RequestHandlers.initHandlersFromConfig created /debug/dump: solr.DumpRequestHandler
[junit4:junit4]   2> 1443 T2997 oashl.XMLLoader.init xsltCacheLifetimeSeconds=60
[junit4:junit4]   2> 1447 T2997 oasc.SolrCore.initDeprecatedSupport WARNING solrconfig.xml uses deprecated <admin/gettableFiles>, Please update your config to use the ShowFileRequestHandler.
[junit4:junit4]   2> 1448 T2997 oasc.SolrCore.initDeprecatedSupport WARNING adding ShowFileRequestHandler with hidden files: [SCHEMA.XML, OLD_SYNONYMS.TXT, STOPWORDS.TXT, PROTWORDS.TXT, OPEN-EXCHANGE-RATES.JSON, SYNONYMS.TXT, CURRENCY.XML, MAPPING-ISOLATIN1ACCENT.TXT]
[junit4:junit4]   2> 1450 T2997 oasc.CachingDirectoryFactory.close Releasing directory:/usr/home/hudson/hudson-slave/workspace/Lucene-Solr-Tests-trunk-java7/solr/build/solr-core/test/J1/./org.apache.solr.cloud.CollectionsAPIDistributedZkTest-1357122781917/control/data
[junit4:junit4]   2> 1451 T2997 oass.SolrIndexSearcher.<init> Opening Searcher@3e1f42c1 main
[junit4:junit4]   2> 1452 T2997 oasu.CommitTracker.<init> Hard AutoCommit: disabled
[junit4:junit4]   2> 1452 T2997 oasu.CommitTracker.<init> Soft AutoCommit: disabled
[junit4:junit4]   2> 1452 T2997 oashc.SpellCheckComponent.inform Initializing spell checkers
[junit4:junit4]   2> 1459 T2997 oass.DirectSolrSpellChecker.init init: {name=direct,classname=DirectSolrSpellChecker,field=lowerfilt,minQueryLength=3}
[junit4:junit4]   2> 1512 T2998 oasc.SolrCore.registerSearcher [collection1] Registered new searcher Searcher@3e1f42c1 main{StandardDirectoryReader(segments_1:1)}
[junit4:junit4]   2> 1515 T2997 oasc.ZkController.publish publishing core=collection1 state=down
[junit4:junit4]   2> 1515 T2997 oasc.ZkController.publish numShards not found on descriptor - reading it from system property
[junit4:junit4]   2> 1516 T2977 oazs.PrepRequestProcessor.pRequest Got user-level KeeperException when processing sessionid:0x13bfad242e50003 type:create cxid:0x50 zxid:0x29 txntype:-1 reqpath:n/a Error Path:/solr/overseer/queue Error:KeeperErrorCode = NoNode for /solr/overseer/queue
[junit4:junit4]   2> 2229 T2995 oascc.ZkStateReader.updateClusterState Updating cloud state from ZooKeeper... 
[junit4:junit4]   2> 2230 T2995 oasc.Overseer$ClusterStateUpdater.updateState Update state numShards=1 message={
[junit4:junit4]   2> 	  "operation":"state",
[junit4:junit4]   2> 	  "numShards":"1",
[junit4:junit4]   2> 	  "shard":null,
[junit4:junit4]   2> 	  "roles":null,
[junit4:junit4]   2> 	  "state":"down",
[junit4:junit4]   2> 	  "core":"collection1",
[junit4:junit4]   2> 	  "collection":"control_collection",
[junit4:junit4]   2> 	  "node_name":"127.0.0.1:28881_",
[junit4:junit4]   2> 	  "base_url":"http://127.0.0.1:28881"}
[junit4:junit4]   2> 2230 T2995 oasc.Overseer$ClusterStateUpdater.createCollection Create collection control_collection with numShards 1
[junit4:junit4]   2> 2230 T2995 oasc.Overseer$ClusterStateUpdater.updateState Assigning new node to shard shard=shard1
[junit4:junit4]   2> 2231 T2977 oazs.PrepRequestProcessor.pRequest Got user-level KeeperException when processing sessionid:0x13bfad242e50003 type:create cxid:0x58 zxid:0x2c txntype:-1 reqpath:n/a Error Path:/solr/overseer/queue-work Error:KeeperErrorCode = NoNode for /solr/overseer/queue-work
[junit4:junit4]   2> 2276 T2994 oascc.ZkStateReader$2.process A cluster state change: WatchedEvent state:SyncConnected type:NodeDataChanged path:/clusterstate.json, has occurred - updating... (live nodes size: 1)
[junit4:junit4]   2> 2527 T2997 oasc.CoreContainer.registerCore registering core: collection1
[junit4:junit4]   2> 2527 T2997 oasc.ZkController.register Register replica - core:collection1 address:http://127.0.0.1:28881 collection:control_collection shard:shard1
[junit4:junit4]   2> 2528 T2997 oascc.SolrZkClient.makePath makePath: /collections/control_collection/leader_elect/shard1/election
[junit4:junit4]   2> 2545 T2977 oazs.PrepRequestProcessor.pRequest Got user-level KeeperException when processing sessionid:0x13bfad242e50003 type:delete cxid:0x72 zxid:0x36 txntype:-1 reqpath:n/a Error Path:/solr/collections/control_collection/leaders Error:KeeperErrorCode = NoNode for /solr/collections/control_collection/leaders
[junit4:junit4]   2> 2546 T2997 oasc.ShardLeaderElectionContext.runLeaderProcess Running the leader process.
[junit4:junit4]   2> 2546 T2977 oazs.PrepRequestProcessor.pRequest Got user-level KeeperException when processing sessionid:0x13bfad242e50003 type:create cxid:0x73 zxid:0x37 txntype:-1 reqpath:n/a Error Path:/solr/overseer Error:KeeperErrorCode = NodeExists for /solr/overseer
[junit4:junit4]   2> 2556 T2997 oasc.ShardLeaderElectionContext.waitForReplicasToComeUp Enough replicas found to continue.
[junit4:junit4]   2> 2556 T2997 oasc.ShardLeaderElectionContext.runLeaderProcess I may be the new leader - try and sync
[junit4:junit4]   2> 2557 T2997 oasc.SyncStrategy.sync Sync replicas to http://127.0.0.1:28881/collection1/
[junit4:junit4]   2> 2557 T2997 oasc.SyncStrategy.syncReplicas Sync Success - now sync replicas to me
[junit4:junit4]   2> 2557 T2997 oasc.SyncStrategy.syncToMe http://127.0.0.1:28881/collection1/ has no replicas
[junit4:junit4]   2> 2557 T2997 oasc.ShardLeaderElectionContext.runLeaderProcess I am the new leader: http://127.0.0.1:28881/collection1/
[junit4:junit4]   2> 2558 T2997 oascc.SolrZkClient.makePath makePath: /collections/control_collection/leaders/shard1
[junit4:junit4]   2> 2561 T2977 oazs.PrepRequestProcessor.pRequest Got user-level KeeperException when processing sessionid:0x13bfad242e50003 type:create cxid:0x7d zxid:0x3b txntype:-1 reqpath:n/a Error Path:/solr/overseer Error:KeeperErrorCode = NodeExists for /solr/overseer
[junit4:junit4]   2> 3779 T2995 oascc.ZkStateReader.updateClusterState Updating cloud state from ZooKeeper... 
[junit4:junit4]   2> 3845 T2994 oascc.ZkStateReader$2.process A cluster state change: WatchedEvent state:SyncConnected type:NodeDataChanged path:/clusterstate.json, has occurred - updating... (live nodes size: 1)
[junit4:junit4]   2> 3889 T2997 oasc.ZkController.register We are http://127.0.0.1:28881/collection1/ and leader is http://127.0.0.1:28881/collection1/
[junit4:junit4]   2> 3889 T2997 oasc.ZkController.register No LogReplay needed for core=collection1 baseURL=http://127.0.0.1:28881
[junit4:junit4]   2> 3889 T2997 oasc.ZkController.checkRecovery I am the leader, no recovery necessary
[junit4:junit4]   2> 3889 T2997 oasc.ZkController.publish publishing core=collection1 state=active
[junit4:junit4]   2> 3889 T2997 oasc.ZkController.publish numShards not found on descriptor - reading it from system property
[junit4:junit4]   2> 3892 T2997 oascc.ZkStateReader.updateClusterState Updating cloud state from ZooKeeper... 
[junit4:junit4]   2> 3892 T2972 oass.SolrDispatchFilter.init user.dir=/usr/home/hudson/hudson-slave/workspace/Lucene-Solr-Tests-trunk-java7/solr/build/solr-core/test/J1
[junit4:junit4]   2> 3893 T2972 oass.SolrDispatchFilter.init SolrDispatchFilter.init() done
[junit4:junit4]   2> 3894 T2972 oascsi.HttpClientUtil.createClient Creating new http client, config:maxConnections=128&maxConnectionsPerHost=32&followRedirects=false
[junit4:junit4]   2> 3910 T2972 oascsi.HttpClientUtil.createClient Creating new http client, config:
[junit4:junit4]   2> 3921 T2972 oaz.ZooKeeper.<init> Initiating client connection, connectString=127.0.0.1:28878/solr sessionTimeout=10000 watcher=org.apache.solr.common.cloud.ConnectionManager@62c01229
[junit4:junit4]   2> 3923 T2972 oascc.ConnectionManager.waitForConnected Waiting for client to connect to ZooKeeper
[junit4:junit4]   2> 3923 T2999 oaz.ClientCnxn$SendThread.logStartConnect Opening socket connection to server localhost/127.0.0.1:28878. Will not attempt to authenticate using SASL (access denied ("javax.security.auth.AuthPermission" "getLoginConfiguration"))
[junit4:junit4]   2> 3923 T2999 oaz.ClientCnxn$SendThread.primeConnection Socket connection established to localhost/127.0.0.1:28878, initiating session
[junit4:junit4]   2> 3924 T2974 oazs.NIOServerCnxnFactory.run Accepted socket connection from /140.211.11.196:28890
[junit4:junit4]   2> 3924 T2974 oazs.ZooKeeperServer.processConnectRequest Client attempting to establish new session at /140.211.11.196:28890
[junit4:junit4]   2> 3925 T2976 oazs.ZooKeeperServer.finishSessionInit Established session 0x13bfad242e50004 with negotiated timeout 10000 for client /140.211.11.196:28890
[junit4:junit4]   2> 3925 T2999 oaz.ClientCnxn$SendThread.onConnected Session establishment complete on server localhost/127.0.0.1:28878, sessionid = 0x13bfad242e50004, negotiated timeout = 10000
[junit4:junit4]   2> 3926 T3000 oascc.ConnectionManager.process Watcher org.apache.solr.common.cloud.ConnectionManager@62c01229 name:ZooKeeperConnection Watcher:127.0.0.1:28878/solr got event WatchedEvent state:SyncConnected type:None path:null path:null type:None
[junit4:junit4]   2> 3926 T2972 oascc.ConnectionManager.waitForConnected Client is connected to ZooKeeper
[junit4:junit4]   2> 3927 T2972 oascc.ZkStateReader.createClusterStateWatchersAndUpdate Updating cluster state from ZooKeeper... 
[junit4:junit4]   2> 3928 T2972 oasc.ChaosMonkey.monkeyLog monkey: init - expire sessions:true cause connection loss:true
[junit4:junit4]   2> 4102 T2972 oejs.Server.doStart jetty-8.1.8.v20121106
[junit4:junit4]   2> 4106 T2972 oejs.AbstractConnector.doStart Started SocketConnector@127.0.0.1:28891
[junit4:junit4]   2> 4107 T2972 oasc.SolrResourceLoader.locateSolrHome JNDI not configured for solr (NoInitialContextEx)
[junit4:junit4]   2> 4107 T2972 oasc.SolrResourceLoader.locateSolrHome using system property solr.solr.home: /usr/home/hudson/hudson-slave/workspace/Lucene-Solr-Tests-trunk-java7/solr/build/solr-core/test/J1/./org.apache.solr.cloud.CollectionsAPIDistributedZkTest-jetty1-1357122785842
[junit4:junit4]   2> 4108 T2972 oasc.SolrResourceLoader.<init> new SolrResourceLoader for deduced Solr Home: '/usr/home/hudson/hudson-slave/workspace/Lucene-Solr-Tests-trunk-java7/solr/build/solr-core/test/J1/./org.apache.solr.cloud.CollectionsAPIDistributedZkTest-jetty1-1357122785842/'
[junit4:junit4]   2> 4151 T2972 oass.SolrDispatchFilter.init SolrDispatchFilter.init()
[junit4:junit4]   2> 4152 T2972 oasc.SolrResourceLoader.locateSolrHome JNDI not configured for solr (NoInitialContextEx)
[junit4:junit4]   2> 4152 T2972 oasc.SolrResourceLoader.locateSolrHome using system property solr.solr.home: /usr/home/hudson/hudson-slave/workspace/Lucene-Solr-Tests-trunk-java7/solr/build/solr-core/test/J1/./org.apache.solr.cloud.CollectionsAPIDistributedZkTest-jetty1-1357122785842
[junit4:junit4]   2> 4153 T2972 oasc.CoreContainer$Initializer.initialize looking for solr.xml: /usr/home/hudson/hudson-slave/workspace/Lucene-Solr-Tests-trunk-java7/solr/build/solr-core/test/J1/./org.apache.solr.cloud.CollectionsAPIDistributedZkTest-jetty1-1357122785842/solr.xml
[junit4:junit4]   2> 4153 T2972 oasc.CoreContainer.<init> New CoreContainer 1619819652
[junit4:junit4]   2> 4155 T2972 oasc.CoreContainer.load Loading CoreContainer using Solr Home: '/usr/home/hudson/hudson-slave/workspace/Lucene-Solr-Tests-trunk-java7/solr/build/solr-core/test/J1/./org.apache.solr.cloud.CollectionsAPIDistributedZkTest-jetty1-1357122785842/'
[junit4:junit4]   2> 4155 T2972 oasc.SolrResourceLoader.<init> new SolrResourceLoader for directory: '/usr/home/hudson/hudson-slave/workspace/Lucene-Solr-Tests-trunk-java7/solr/build/solr-core/test/J1/./org.apache.solr.cloud.CollectionsAPIDistributedZkTest-jetty1-1357122785842/'
[junit4:junit4]   2> 4192 T2972 oashc.HttpShardHandlerFactory.getParameter Setting socketTimeout to: 30000
[junit4:junit4]   2> 4193 T2972 oashc.HttpShardHandlerFactory.getParameter Setting urlScheme to: http://
[junit4:junit4]   2> 4193 T2972 oashc.HttpShardHandlerFactory.getParameter Setting connTimeout to: 15000
[junit4:junit4]   2> 4193 T2972 oashc.HttpShardHandlerFactory.getParameter Setting maxConnectionsPerHost to: 20
[junit4:junit4]   2> 4194 T2972 oashc.HttpShardHandlerFactory.getParameter Setting corePoolSize to: 0
[junit4:junit4]   2> 4194 T2972 oashc.HttpShardHandlerFactory.getParameter Setting maximumPoolSize to: 2147483647
[junit4:junit4]   2> 4195 T2972 oashc.HttpShardHandlerFactory.getParameter Setting maxThreadIdleTime to: 5
[junit4:junit4]   2> 4195 T2972 oashc.HttpShardHandlerFactory.getParameter Setting sizeOfQueue to: -1
[junit4:junit4]   2> 4196 T2972 oashc.HttpShardHandlerFactory.getParameter Setting fairnessPolicy to: false
[junit4:junit4]   2> 4196 T2972 oascsi.HttpClientUtil.createClient Creating new http client, config:maxConnectionsPerHost=20&maxConnections=10000&socketTimeout=30000&connTimeout=15000&retry=false
[junit4:junit4]   2> 4220 T2972 oasc.CoreContainer.load Registering Log Listener
[junit4:junit4]   2> 4241 T2972 oasc.CoreContainer.initZooKeeper Zookeeper client=127.0.0.1:28878/solr
[junit4:junit4]   2> 4242 T2972 oasc.ZkController.checkChrootPath zkHost includes chroot
[junit4:junit4]   2> 4243 T2972 oaz.ZooKeeper.<init> Initiating client connection, connectString=127.0.0.1:28878 sessionTimeout=60000 watcher=org.apache.solr.common.cloud.ConnectionManager@27a00e6d
[junit4:junit4]   2> 4244 T2972 oascc.ConnectionManager.waitForConnected Waiting for client to connect to ZooKeeper
[junit4:junit4]   2> 4244 T3010 oaz.ClientCnxn$SendThread.logStartConnect Opening socket connection to server localhost/127.0.0.1:28878. Will not attempt to authenticate using SASL (access denied ("javax.security.auth.AuthPermission" "getLoginConfiguration"))
[junit4:junit4]   2> 4245 T3010 oaz.ClientCnxn$SendThread.primeConnection Socket connection established to localhost/127.0.0.1:28878, initiating session
[junit4:junit4]   2> 4246 T2974 oazs.NIOServerCnxnFactory.run Accepted socket connection from /140.211.11.196:28892
[junit4:junit4]   2> 4246 T2974 oazs.ZooKeeperServer.processConnectRequest Client attempting to establish new session at /140.211.11.196:28892
[junit4:junit4]   2> 4248 T2976 oazs.ZooKeeperServer.finishSessionInit Established session 0x13bfad242e50005 with negotiated timeout 20000 for client /140.211.11.196:28892
[junit4:junit4]   2> 4248 T3010 oaz.ClientCnxn$SendThread.onConnected Session establishment complete on server localhost/127.0.0.1:28878, sessionid = 0x13bfad242e50005, negotiated timeout = 20000
[junit4:junit4]   2> 4248 T3011 oascc.ConnectionManager.process Watcher org.apache.solr.common.cloud.ConnectionManager@27a00e6d name:ZooKeeperConnection Watcher:127.0.0.1:28878 got event WatchedEvent state:SyncConnected type:None path:null path:null type:None
[junit4:junit4]   2> 4249 T2972 oascc.ConnectionManager.waitForConnected Client is connected to ZooKeeper
[junit4:junit4]   2> 4250 T2977 oazs.PrepRequestProcessor.pRequest2Txn Processed session termination for sessionid: 0x13bfad242e50005
[junit4:junit4]   2> 4279 T2974 oazs.NIOServerCnxn.closeSock Closed socket connection for client /140.211.11.196:28892 which had sessionid 0x13bfad242e50005
[junit4:junit4]   2> 4279 T3011 oaz.ClientCnxn$EventThread.run EventThread shut down
[junit4:junit4]   2> 4279 T2972 oaz.ZooKeeper.close Session: 0x13bfad242e50005 closed
[junit4:junit4]   2> 4281 T2972 oascsi.HttpClientUtil.createClient Creating new http client, config:maxConnections=500&maxConnectionsPerHost=16&socketTimeout=15000&connTimeout=30000
[junit4:junit4]   2> 4292 T2972 oaz.ZooKeeper.<init> Initiating client connection, connectString=127.0.0.1:28878/solr sessionTimeout=30000 watcher=org.apache.solr.common.cloud.ConnectionManager@39298cfd
[junit4:junit4]   2> 4294 T2972 oascc.ConnectionManager.waitForConnected Waiting for client to connect to ZooKeeper
[junit4:junit4]   2> 4294 T3012 oaz.ClientCnxn$SendThread.logStartConnect Opening socket connection to server localhost/127.0.0.1:28878. Will not attempt to authenticate using SASL (access denied ("javax.security.auth.AuthPermission" "getLoginConfiguration"))
[junit4:junit4]   2> 4295 T3012 oaz.ClientCnxn$SendThread.primeConnection Socket connection established to localhost/127.0.0.1:28878, initiating session
[junit4:junit4]   2> 4295 T2974 oazs.NIOServerCnxnFactory.run Accepted socket connection from /140.211.11.196:28893
[junit4:junit4]   2> 4295 T2974 oazs.ZooKeeperServer.processConnectRequest Client attempting to establish new session at /140.211.11.196:28893
[junit4:junit4]   2> 4334 T2976 oazs.ZooKeeperServer.finishSessionInit Established session 0x13bfad242e50006 with negotiated timeout 20000 for client /140.211.11.196:28893
[junit4:junit4]   2> 4334 T3012 oaz.ClientCnxn$SendThread.onConnected Session establishment complete on server localhost/127.0.0.1:28878, sessionid = 0x13bfad242e50006, negotiated timeout = 20000
[junit4:junit4]   2> 4335 T3013 oascc.ConnectionManager.process Watcher org.apache.solr.common.cloud.ConnectionManager@39298cfd name:ZooKeeperConnection Watcher:127.0.0.1:28878/solr got event WatchedEvent state:SyncConnected type:None path:null path:null type:None
[junit4:junit4]   2> 4335 T2972 oascc.ConnectionManager.waitForConnected Client is connected to ZooKeeper
[junit4:junit4]   2> 4336 T2977 oazs.PrepRequestProcessor.pRequest Got user-level KeeperException when processing sessionid:0x13bfad242e50006 type:create cxid:0x1 zxid:0x49 txntype:-1 reqpath:n/a Error Path:/solr/overseer Error:KeeperErrorCode = NodeExists for /solr/overseer
[junit4:junit4]   2> 4337 T2977 oazs.PrepRequestProcessor.pRequest Got user-level KeeperException when processing sessionid:0x13bfad242e50006 type:create cxid:0x2 zxid:0x4a txntype:-1 reqpath:n/a Error Path:/solr/overseer Error:KeeperErrorCode = NodeExists for /solr/overseer
[junit4:junit4]   2> 4358 T2972 oasc.ZkController.createEphemeralLiveNode Register node as live in ZooKeeper:/live_nodes/127.0.0.1:28891_
[junit4:junit4]   2> 4359 T2977 oazs.PrepRequestProcessor.pRequest Got user-level KeeperException when processing sessionid:0x13bfad242e50006 type:delete cxid:0x4 zxid:0x4b txntype:-1 reqpath:n/a Error Path:/solr/live_nodes/127.0.0.1:28891_ Error:KeeperErrorCode = NoNode for /solr/live_nodes/127.0.0.1:28891_
[junit4:junit4]   2> 4403 T2972 oascc.SolrZkClient.makePath makePath: /live_nodes/127.0.0.1:28891_
[junit4:junit4]   2> 4421 T2994 oascc.ZkStateReader$2.process A cluster state change: WatchedEvent state:SyncConnected type:NodeChildrenChanged path:/live_nodes, has occurred - updating... (live nodes size: 1)
[junit4:junit4]   2> 4422 T3000 oascc.ZkStateReader$3.process Updating live nodes... (2)
[junit4:junit4]   2> 4425 T2994 oascc.ZkStateReader$3.process Updating live nodes... (2)
[junit4:junit4]   2> 4426 T2972 oascc.ZkStateReader.createClusterStateWatchersAndUpdate Updating cluster state from ZooKeeper... 
[junit4:junit4]   2> 4433 T3014 oasc.CoreContainer.create Creating SolrCore 'collection1' using instanceDir: /usr/home/hudson/hudson-slave/workspace/Lucene-Solr-Tests-trunk-java7/solr/build/solr-core/test/J1/./org.apache.solr.cloud.CollectionsAPIDistributedZkTest-jetty1-1357122785842/collection1
[junit4:junit4]   2> 4433 T3014 oasc.ZkController.createCollectionZkNode Check for collection zkNode:collection1
[junit4:junit4]   2> 4434 T3014 oasc.ZkController.createCollectionZkNode Collection zkNode exists
[junit4:junit4]   2> 4434 T3014 oasc.ZkController.readConfigName Load collection config from:/collections/collection1
[junit4:junit4]   2> 4435 T3014 oasc.SolrResourceLoader.<init> new SolrResourceLoader for directory: '/usr/home/hudson/hudson-slave/workspace/Lucene-Solr-Tests-trunk-java7/solr/build/solr-core/test/J1/./org.apache.solr.cloud.CollectionsAPIDistributedZkTest-jetty1-1357122785842/collection1/'
[junit4:junit4]   2> 4437 T3014 oasc.SolrResourceLoader.replaceClassLoader Adding 'file:/usr/home/hudson/hudson-slave/workspace/Lucene-Solr-Tests-trunk-java7/solr/build/solr-core/test/J1/org.apache.solr.cloud.CollectionsAPIDistributedZkTest-jetty1-1357122785842/collection1/lib/classes/' to classloader
[junit4:junit4]   2> 4438 T3014 oasc.SolrResourceLoader.replaceClassLoader Adding 'file:/usr/home/hudson/hudson-slave/workspace/Lucene-Solr-Tests-trunk-java7/solr/build/solr-core/test/J1/org.apache.solr.cloud.CollectionsAPIDistributedZkTest-jetty1-1357122785842/collection1/lib/README' to classloader
[junit4:junit4]   2> 4510 T3014 oasc.SolrConfig.<init> Using Lucene MatchVersion: LUCENE_50
[junit4:junit4]   2> 4583 T3014 oasc.SolrConfig.<init> Loaded SolrConfig: solrconfig.xml
[junit4:junit4]   2> 4683 T3014 oass.IndexSchema.readSchema Reading Solr Schema
[junit4:junit4]   2> 4691 T3014 oass.IndexSchema.readSchema Schema name=test
[junit4:junit4]   2> 5292 T3014 oass.OpenExchangeRatesOrgProvider.init Initialized with rates=open-exchange-rates.json, refreshInterval=1440.
[junit4:junit4]   2> 5300 T3014 oass.IndexSchema.readSchema default search field in schema is text
[junit4:junit4]   2> 5303 T3014 oass.IndexSchema.readSchema unique key field: id
[junit4:junit4]   2> 5311 T3014 oass.FileExchangeRateProvider.reload Reloading exchange rates from file currency.xml
[junit4:junit4]   2> 5314 T3014 oass.FileExchangeRateProvider.reload Reloading exchange rates from file currency.xml
[junit4:junit4]   2> 5317 T3014 oass.OpenExchangeRatesOrgProvider.reload Reloading exchange rates from open-exchange-rates.json
[junit4:junit4]   2> 5318 T3014 oass.OpenExchangeRatesOrgProvider.reload Reloading exchange rates from open-exchange-rates.json
[junit4:junit4]   2> 5319 T3014 oasc.SolrCore.<init> [collection1] Opening new SolrCore at /usr/home/hudson/hudson-slave/workspace/Lucene-Solr-Tests-trunk-java7/solr/build/solr-core/test/J1/./org.apache.solr.cloud.CollectionsAPIDistributedZkTest-jetty1-1357122785842/collection1/, dataDir=./org.apache.solr.cloud.CollectionsAPIDistributedZkTest-1357122781917/jetty1/
[junit4:junit4]   2> 5319 T3014 oasc.JmxMonitoredMap.<init> JMX monitoring is enabled. Adding Solr mbeans to JMX Server: com.sun.jmx.mbeanserver.JmxMBeanServer@1f936f80
[junit4:junit4]   2> 5319 T3014 oasc.SolrCore.initDirectoryFactory solr.NRTCachingDirectoryFactory
[junit4:junit4]   2> 5320 T3014 oasc.CachingDirectoryFactory.get return new directory for /usr/home/hudson/hudson-slave/workspace/Lucene-Solr-Tests-trunk-java7/solr/build/solr-core/test/J1/./org.apache.solr.cloud.CollectionsAPIDistributedZkTest-1357122781917/jetty1 forceNew:false
[junit4:junit4]   2> 5320 T3014 oasc.CachingDirectoryFactory.close Releasing directory:/usr/home/hudson/hudson-slave/workspace/Lucene-Solr-Tests-trunk-java7/solr/build/solr-core/test/J1/./org.apache.solr.cloud.CollectionsAPIDistributedZkTest-1357122781917/jetty1
[junit4:junit4]   2> 5321 T3014 oasc.SolrCore.getNewIndexDir New index directory detected: old=null new=./org.apache.solr.cloud.CollectionsAPIDistributedZkTest-1357122781917/jetty1/index/
[junit4:junit4]   2> 5321 T3014 oasc.SolrCore.initIndex WARNING [collection1] Solr index directory './org.apache.solr.cloud.CollectionsAPIDistributedZkTest-1357122781917/jetty1/index' doesn't exist. Creating new index...
[junit4:junit4]   2> 5322 T3014 oasc.CachingDirectoryFactory.get return new directory for /usr/home/hudson/hudson-slave/workspace/Lucene-Solr-Tests-trunk-java7/solr/build/solr-core/test/J1/./org.apache.solr.cloud.CollectionsAPIDistributedZkTest-1357122781917/jetty1/index forceNew:false
[junit4:junit4]   2> 5326 T3014 oasc.SolrDeletionPolicy.onCommit SolrDeletionPolicy.onCommit: commits:num=1
[junit4:junit4]   2> 		commit{dir=RateLimitedDirectoryWrapper(NRTCachingDirectory(org.apache.lucene.store.NIOFSDirectory@/usr/home/hudson/hudson-slave/workspace/Lucene-Solr-Tests-trunk-java7/solr/build/solr-core/test/J1/org.apache.solr.cloud.CollectionsAPIDistributedZkTest-1357122781917/jetty1/index lockFactory=org.apache.lucene.store.NativeFSLockFactory@136a17b3; maxCacheMB=48.0 maxMergeSizeMB=4.0)),segFN=segments_1,generation=1,filenames=[segments_1]
[junit4:junit4]   2> 5327 T3014 oasc.SolrDeletionPolicy.updateCommits newest commit = 1[segments_1]
[junit4:junit4]   2> 5327 T3014 oasc.CachingDirectoryFactory.close Releasing directory:/usr/home/hudson/hudson-slave/workspace/Lucene-Solr-Tests-trunk-java7/solr/build/solr-core/test/J1/./org.apache.solr.cloud.CollectionsAPIDistributedZkTest-1357122781917/jetty1/index
[junit4:junit4]   2> 5327 T3014 oasc.SolrCore.initWriters created xml: solr.XMLResponseWriter
[junit4:junit4]   2> 5329 T3014 oasup.UpdateRequestProcessorChain.init inserting DistributedUpdateProcessorFactory into updateRequestProcessorChain "dedupe"
[junit4:junit4]   2> 5329 T3014 oasup.UpdateRequestProcessorChain.init inserting DistributedUpdateProcessorFactory into updateRequestProcessorChain "dedupe-allfields"
[junit4:junit4]   2> 5329 T3014 oasup.UpdateRequestProcessorChain.init inserting DistributedUpdateProcessorFactory into updateRequestProcessorChain "stored_sig"
[junit4:junit4]   2> 5330 T3014 oasup.UpdateRequestProcessorChain.init inserting DistributedUpdateProcessorFactory into updateRequestProcessorChain "uniq-fields"
[junit4:junit4]   2> 5330 T3014 oasup.UpdateRequestProcessorChain.init inserting DistributedUpdateProcessorFactory into updateRequestProcessorChain "distrib-dup-test-chain-implicit"
[junit4:junit4]   2> 5330 T3014 oasc.RequestHandlers.initHandlersFromConfig adding lazy requestHandler: solr.ReplicationHandler
[junit4:junit4]   2> 5330 T3014 oasc.RequestHandlers.initHandlersFromConfig created /replication: solr.ReplicationHandler
[junit4:junit4]   2> 5331 T3014 oasc.RequestHandlers.initHandlersFromConfig created standard: solr.StandardRequestHandler
[junit4:junit4]   2> 5331 T3014 oasc.RequestHandlers.initHandlersFromConfig created /get: solr.RealTimeGetHandler
[junit4:junit4]   2> 5331 T3014 oasc.RequestHandlers.initHandlersFromConfig created dismax: solr.SearchHandler
[junit4:junit4]   2> 5332 T3014 oasc.RequestHandlers.initHandlersFromConfig created mock: org.apache.solr.core.MockQuerySenderListenerReqHandler
[junit4:junit4]   2> 5332 T3014 oasc.RequestHandlers.initHandlersFromConfig created /admin/: org.apache.solr.handler.admin.AdminHandlers
[junit4:junit4]   2> 5332 T3014 oasc.RequestHandlers.initHandlersFromConfig created defaults: solr.StandardRequestHandler
[junit4:junit4]   2> 5333 T3014 oasc.RequestHandlers.initHandlersFromConfig adding lazy requestHandler: solr.StandardRequestHandler
[junit4:junit4]   2> 5333 T3014 oasc.RequestHandlers.initHandlersFromConfig created lazy: solr.StandardRequestHandler
[junit4:junit4]   2> 5333 T3014 oasc.RequestHandlers.initHandlersFromConfig created /update: solr.UpdateRequestHandler
[junit4:junit4]   2> 5333 T3014 oasc.RequestHandlers.initHandlersFromConfig created /terms: org.apache.solr.handler.component.SearchHandler
[junit4:junit4]   2> 5334 T3014 oasc.RequestHandlers.initHandlersFromConfig created spellCheckCompRH: org.apache.solr.handler.component.SearchHandler
[junit4:junit4]   2> 5334 T3014 oasc.RequestHandlers.initHandlersFromConfig created spellCheckCompRH_Direct: org.apache.solr.handler.component.SearchHandler
[junit4:junit4]   2> 5334 T3014 oasc.RequestHandlers.initHandlersFromConfig created spellCheckWithWordbreak: org.apache.solr.handler.component.SearchHandler
[junit4:junit4]   2> 5335 T3014 oasc.RequestHandlers.initHandlersFromConfig created spellCheckWithWordbreak_Direct: org.apache.solr.handler.component.SearchHandler
[junit4:junit4]   2> 5335 T3014 oasc.RequestHandlers.initHandlersFromConfig created spellCheckCompRH1: org.apache.solr.handler.component.SearchHandler
[junit4:junit4]   2> 5335 T3014 oasc.RequestHandlers.initHandlersFromConfig created mltrh: org.apache.solr.handler.component.SearchHandler
[junit4:junit4]   2> 5336 T3014 oasc.RequestHandlers.initHandlersFromConfig created tvrh: org.apache.solr.handler.component.SearchHandler
[junit4:junit4]   2> 5336 T3014 oasc.RequestHandlers.initHandlersFromConfig created /mlt: solr.MoreLikeThisHandler
[junit4:junit4]   2> 5336 T3014 oasc.RequestHandlers.initHandlersFromConfig created /debug/dump: solr.DumpRequestHandler
[junit4:junit4]   2> 5345 T3014 oashl.XMLLoader.init xsltCacheLifetimeSeconds=60
[junit4:junit4]   2> 5348 T3014 oasc.SolrCore.initDeprecatedSupport WARNING solrconfig.xml uses deprecated <admin/gettableFiles>, Please update your config to use the ShowFileRequestHandler.
[junit4:junit4]   2> 5349 T3014 oasc.SolrCore.initDeprecatedSupport WARNING adding ShowFileRequestHandler with hidden files: [SCHEMA.XML, OLD_SYNONYMS.TXT, STOPWORDS.TXT, PROTWORDS.TXT, OPEN-EXCHANGE-RATES.JSON, SYNONYMS.TXT, CURRENCY.XML, MAPPING-ISOLATIN1ACCENT.TXT]
[junit4:junit4]   2> 5350 T3014 oasc.CachingDirectoryFactory.close Releasing directory:/usr/home/hudson/hudson-slave/workspace/Lucene-Solr-Tests-trunk-java7/solr/build/solr-core/test/J1/./org.apache.solr.cloud.CollectionsAPIDistributedZkTest-1357122781917/jetty1
[junit4:junit4]   2> 5351 T3014 oass.SolrIndexSearcher.<init> Opening Searcher@2d12dc4 main
[junit4:junit4]   2> 5352 T3014 oasu.CommitTracker.<init> Hard AutoCommit: disabled
[junit4:junit4]   2> 5352 T3014 oasu.CommitTracker.<init> Soft AutoCommit: disabled
[junit4:junit4]   2> 5353 T3014 oashc.SpellCheckComponent.inform Initializing spell checkers
[junit4:junit4]   2> 5359 T2995 oascc.ZkStateReader.updateClusterState Updating cloud state from ZooKeeper... 
[junit4:junit4]   2> 5359 T2995 oasc.Overseer$ClusterStateUpdater.updateState Update state numShards=1 message={
[junit4:junit4]   2> 	  "operation":"state",
[junit4:junit4]   2> 	  "numShards":"1",
[junit4:junit4]   2> 	  "shard":"shard1",
[junit4:junit4]   2> 	  "roles":null,
[junit4:junit4]   2> 	  "state":"active",
[junit4:junit4]   2> 	  "core":"collection1",
[junit4:junit4]   2> 	  "collection":"control_collection",
[junit4:junit4]   2> 	  "node_name":"127.0.0.1:28881_",
[junit4:junit4]   2> 	  "base_url":"http://127.0.0.1:28881"}
[junit4:junit4]   2> 5367 T3014 oass.DirectSolrSpellChecker.init init: {name=direct,classname=DirectSolrSpellChecker,field=lowerfilt,minQueryLength=3}
[junit4:junit4]   2> 5375 T2994 oascc.ZkStateReader$2.process A cluster state change: WatchedEvent state:SyncConnected type:NodeDataChanged path:/clusterstate.json, has occurred - updating... (live nodes size: 2)
[junit4:junit4]   2> 5375 T3000 oascc.ZkStateReader$2.process A cluster state change: WatchedEvent state:SyncConnected type:NodeDataChanged path:/clusterstate.json, has occurred - updating... (live nodes size: 2)
[junit4:junit4]   2> 5375 T3013 oascc.ZkStateReader$2.process A cluster state change: WatchedEvent state:SyncConnected type:NodeDataChanged path:/clusterstate.json, has occurred - updating... (live nodes size: 2)
[junit4:junit4]   2> 5419 T3015 oasc.SolrCore.registerSearcher [collection1] Registered new searcher Searcher@2d12dc4 main{StandardDirectoryReader(segments_1:1)}
[junit4:junit4]   2> 5422 T3014 oasc.ZkController.publish publishing core=collection1 state=down
[junit4:junit4]   2> 5422 T3014 oasc.ZkController.publish numShards not found on descriptor - reading it from system property
[junit4:junit4]   2> 6885 T2995 oascc.ZkStateReader.updateClusterState Updating cloud state from ZooKeeper... 
[junit4:junit4]   2> 6887 T2995 oasc.Overseer$ClusterStateUpdater.updateState Update state numShards=2 message={
[junit4:junit4]   2> 	  "operation":"state",
[junit4:junit4]   2> 	  "numShards":"2",
[junit4:junit4]   2> 	  "shard":null,
[junit4:junit4]   2> 	  "roles":null,
[junit4:junit4]   2> 	  "state":"down",
[junit4:junit4]   2> 	  "core":"collection1",
[junit4:junit4]   2> 	  "collection":"collection1",
[junit4:junit4]   2> 	  "node_name":"127.0.0.1:28891_",
[junit4:junit4]   2> 	  "base_url":"http://127.0.0.1:28891"}
[junit4:junit4]   2> 6887 T2995 oasc.Overseer$ClusterStateUpdater.createCollection Create collection collection1 with numShards 2
[junit4:junit4]   2> 6887 T2995 oasc.Overseer$ClusterStateUpdater.updateState Assigning new node to shard shard=shard1
[junit4:junit4]   2> 6892 T2994 oascc.ZkStateReader$2.process A cluster state change: WatchedEvent state:SyncConnected type:NodeDataChanged path:/clusterstate.json, has occurred - updating... (live nodes size: 2)
[junit4:junit4]   2> 6892 T3013 oascc.ZkStateReader$2.process A cluster state change: WatchedEvent state:SyncConnected type:NodeDataChanged path:/clusterstate.json, has occurred - updating... (live nodes size: 2)
[junit4:junit4]   2> 6893 T3000 oascc.ZkStateReader$2.process A cluster state change: WatchedEvent state:SyncConnected type:NodeDataChanged path:/clusterstate.json, has occurred - updating... (live nodes size: 2)
[junit4:junit4]   2> 7425 T3014 oasc.CoreContainer.registerCore registering core: collection1
[junit4:junit4]   2> 7425 T3014 oasc.ZkController.register Register replica - core:collection1 address:http://127.0.0.1:28891 collection:collection1 shard:shard1
[junit4:junit4]   2> 7426 T3014 oascc.SolrZkClient.makePath makePath: /collections/collection1/leader_elect/shard1/election
[junit4:junit4]   2> 7465 T2977 oazs.PrepRequestProcessor.pRequest Got user-level KeeperException when processing sessionid:0x13bfad242e50006 type:delete cxid:0x45 zxid:0x5b txntype:-1 reqpath:n/a Error Path:/solr/collections/collection1/leaders Error:KeeperErrorCode = NoNode for /solr/collections/collection1/leaders
[junit4:junit4]   2> 7466 T3014 oasc.ShardLeaderElectionContext.runLeaderProcess Running the leader process.
[junit4:junit4]   2> 7467 T2977 oazs.PrepRequestProcessor.pRequest Got user-level KeeperException when processing sessionid:0x13bfad242e50006 type:create cxid:0x46 zxid:0x5c txntype:-1 reqpath:n/a Error Path:/solr/overseer Error:KeeperErrorCode = NodeExists for /solr/overseer
[junit4:junit4]   2> 7479 T3014 oasc.ShardLeaderElectionContext.waitForReplicasToComeUp Enough replicas found to continue.
[junit4:junit4]   2> 7480 T3014 oasc.ShardLeaderElectionContext.runLeaderProcess I may be the new leader - try and sync
[junit4:junit4]   2> 7480 T3014 oasc.SyncStrategy.sync Sync replicas to http://127.0.0.1:28891/collection1/
[junit4:junit4]   2> 7480 T3014 oasc.SyncStrategy.syncReplicas Sync Success - now sync replicas to me
[junit4:junit4]   2> 7480 T3014 oasc.SyncStrategy.syncToMe http://127.0.0.1:28891/collection1/ has no replicas
[junit4:junit4]   2> 7481 T3014 oasc.ShardLeaderElectionContext.runLeaderProcess I am the new leader: http://127.0.0.1:28891/collection1/
[junit4:junit4]   2> 7481 T3014 oascc.SolrZkClient.makePath makePath: /collections/collection1/leaders/shard1
[junit4:junit4]   2> 7493 T2977 oazs.PrepRequestProcessor.pRequest Got user-level KeeperException when processing sessionid:0x13bfad242e50006 type:create cxid:0x50 zxid:0x60 txntype:-1 reqpath:n/a Error Path:/solr/overseer Error:KeeperErrorCode = NodeExists for /solr/overseer
[junit4:junit4]   2> 8408 T2995 oascc.ZkStateReader.updateClusterState Updating cloud state from ZooKeeper... 
[junit4:junit4]   2> 8423 T3013 oascc.ZkStateReader$2.process A cluster state change: WatchedEvent state:SyncConnected type:NodeDataChanged path:/clusterstate.json, has occurred - updating... (live nodes size: 2)
[junit4:junit4]   2> 8423 T2994 oascc.ZkStateReader$2.process A cluster state change: WatchedEvent state:SyncConnected type:NodeDataChanged path:/clusterstate.json, has occurred - updating... (live nodes size: 2)
[junit4:junit4]   2> 8423 T3000 oascc.ZkStateReader$2.process A cluster state change: WatchedEvent state:SyncConnected type:NodeDataChanged path:/clusterstate.json, has occurred - updating... (live nodes size: 2)
[junit4:junit4]   2> 8464 T3014 oasc.ZkController.register We are http://127.0.0.1:28891/collection1/ and leader is http://127.0.0.1:28891/collection1/
[junit4:junit4]   2> 8464 T3014 oasc.ZkController.register No LogReplay needed for core=collection1 baseURL=http://127.0.0.1:28891
[junit4:junit4]   2> 8464 T3014 oasc.ZkController.checkRecovery I am the leader, no recovery necessary
[junit4:junit4]   2> 8464 T3014 oasc.ZkController.publish publishing core=collection1 state=active
[junit4:junit4]   2> 8464 T3014 oasc.ZkController.publish numShards not found on descriptor - reading it from system property
[junit4:junit4]   2> 8466 T3014 oascc.ZkStateReader.updateClusterState Updating cloud state from ZooKeeper... 
[junit4:junit4]   2> 8467 T2972 oass.SolrDispatchFilter.init user.dir=/usr/home/hudson/hudson-slave/workspace/Lucene-Solr-Tests-trunk-java7/solr/build/solr-core/test/J1
[junit4:junit4]   2> 8467 T2972 oass.SolrDispatchFilter.init SolrDispatchFilter.init() done
[junit4:junit4]   2> 8468 T2972 oascsi.HttpClientUtil.createClient Creating new http client, config:maxConnections=128&maxConnectionsPerHost=32&followRedirects=false
[junit4:junit4]   2> 8649 T2972 oejs.Server.doStart jetty-8.1.8.v20121106
[junit4:junit4]   2> 8652 T2972 oejs.AbstractConnector.doStart Started SocketConnector@127.0.0.1:28898
[junit4:junit4]   2> 8653 T2972 oasc.SolrResourceLoader.locateSolrHome JNDI not configured for solr (NoInitialContextEx)
[junit4:junit4]   2> 8653 T2972 oasc.SolrResourceLoader.locateSolrHome using system property solr.solr.home: /usr/home/hudson/hudson-slave/workspace/Lucene-Solr-Tests-trunk-java7/solr/build/solr-core/test/J1/./org.apache.solr.cloud.CollectionsAPIDistributedZkTest-jetty2-1357122790395
[junit4:junit4]   2> 8654 T2972 oasc.SolrResourceLoader.<init> new SolrResourceLoader for deduced Solr Home: '/usr/home/hudson/hudson-slave/workspace/Lucene-Solr-Tests-trunk-java7/solr/build/solr-core/test/J1/./org.apache.solr.cloud.CollectionsAPIDistributedZkTest-jetty2-1357122790395/'
[junit4:junit4]   2> 8695 T2972 oass.SolrDispatchFilter.init SolrDispatchFilter.init()
[junit4:junit4]   2> 8696 T2972 oasc.SolrResourceLoader.locateSolrHome JNDI not configured for solr (NoInitialContextEx)
[junit4:junit4]   2> 8696 T2972 oasc.SolrResourceLoader.locateSolrHome using system property solr.solr.home: /usr/home/hudson/hudson-slave/workspace/Lucene-Solr-Tests-trunk-java7/solr/build/solr-core/test/J1/./org.apache.solr.cloud.CollectionsAPIDistributedZkTest-jetty2-1357122790395
[junit4:junit4]   2> 8696 T2972 oasc.CoreContainer$Initializer.initialize looking for solr.xml: /usr/home/hudson/hudson-slave/workspace/Lucene-Solr-Tests-trunk-java7/solr/build/solr-core/test/J1/./org.apache.solr.cloud.CollectionsAPIDistributedZkTest-jetty2-1357122790395/solr.xml
[junit4:junit4]   2> 8697 T2972 oasc.CoreContainer.<init> New CoreContainer 1243993970
[junit4:junit4]   2> 8698 T2972 oasc.CoreContainer.load Loading CoreContainer using Solr Home: '/usr/home/hudson/hudson-slave/workspace/Lucene-Solr-Tests-trunk-java7/solr/build/solr-core/test/J1/./org.apache.solr.cloud.CollectionsAPIDistributedZkTest-jetty2-1357122790395/'
[junit4:junit4]   2> 8698 T2972 oasc.SolrResourceLoader.<init> new SolrResourceLoader for directory: '/usr/home/hudson/hudson-slave/workspace/Lucene-Solr-Tests-trunk-java7/solr/build/solr-core/test/J1/./org.apache.solr.cloud.CollectionsAPIDistributedZkTest-jetty2-1357122790395/'
[junit4:junit4]   2> 8727 T2972 oashc.HttpShardHandlerFactory.getParameter Setting socketTimeout to: 30000
[junit4:junit4]   2> 8727 T2972 oashc.HttpShardHandlerFactory.getParameter Setting urlScheme to: http://
[junit4:junit4]   2> 8728 T2972 oashc.HttpShardHandlerFactory.getParameter Setting connTimeout to: 15000
[junit4:junit4]   2> 8728 T2972 oashc.HttpShardHandlerFactory.getParameter Setting maxConnectionsPerHost to: 20
[junit4:junit4]   2> 8729 T2972 oashc.HttpShardHandlerFactory.getParameter Setting corePoolSize to: 0
[junit4:junit4]   2> 8729 T2972 oashc.HttpShardHandlerFactory.getParameter Setting maximumPoolSize to: 2147483647
[junit4:junit4]   2> 8729 T2972 oashc.HttpShardHandlerFactory.getParameter Setting maxThreadIdleTime to: 5
[junit4:junit4]   2> 8730 T2972 oashc.HttpShardHandlerFactory.getParameter Setting sizeOfQueue to: -1
[junit4:junit4]   2> 8730 T2972 oashc.HttpShardHandlerFactory.getParameter Setting fairnessPolicy to: false
[junit4:junit4]   2> 8731 T2972 oascsi.HttpClientUtil.createClient Creating new http client, config:maxConnectionsPerHost=20&maxConnections=10000&socketTimeout=30000&connTimeout=15000&retry=false
[junit4:junit4]   2> 8751 T2972 oasc.CoreContainer.load Registering Log Listener
[junit4:junit4]   2> 8770 T2972 oasc.CoreContainer.initZooKeeper Zookeeper client=127.0.0.1:28878/solr
[junit4:junit4]   2> 8771 T2972 oasc.ZkController.checkChrootPath zkHost includes chroot
[junit4:junit4]   2> 8771 T2972 oaz.ZooKeeper.<init> Initiating client connection, connectString=127.0.0.1:28878 sessionTimeout=60000 watcher=org.apache.solr.common.cloud.ConnectionManager@1d0160c3
[junit4:junit4]   2> 8772 T2972 oascc.ConnectionManager.waitForConnected Waiting for client to connect to ZooKeeper
[junit4:junit4]   2> 8773 T3025 oaz.ClientCnxn$SendThread.logStartConnect Opening socket connection to server localhost/127.0.0.1:28878. Will not attempt to authenticate using SASL (access denied ("javax.security.auth.AuthPermission" "getLoginConfiguration"))
[junit4:junit4]   2> 8774 T3025 oaz.ClientCnxn$SendThread.primeConnection Socket connection established to localhost/127.0.0.1:28878, initiating session
[junit4:junit4]   2> 8774 T2974 oazs.NIOServerCnxnFactory.run Accepted socket connection from /140.211.11.196:28899
[junit4:junit4]   2> 8774 T2974 oazs.ZooKeeperServer.processConnectRequest Client attempting to establish new session at /140.211.11.196:28899
[junit4:junit4]   2> 8776 T2976 oazs.ZooKeeperServer.finishSessionInit Established session 0x13bfad242e50007 with negotiated timeout 20000 for client /140.211.11.196:28899
[junit4:junit4]   2> 8776 T3025 oaz.ClientCnxn$SendThread.onConnected Session establishment complete on server localhost/127.0.0.1:28878, sessionid = 0x13bfad242e50007, negotiated timeout = 20000
[junit4:junit4]   2> 8777 T3026 oascc.ConnectionManager.process Watcher org.apache.solr.common.cloud.ConnectionManager@1d0160c3 name:ZooKeeperConnection Watcher:127.0.0.1:28878 got event WatchedEvent state:SyncConnected type:None path:null path:null type:None
[junit4:junit4]   2> 8777 T2972 oascc.ConnectionManager.waitForConnected Client is connected to ZooKeeper
[junit4:junit4]   2> 8778 T2977 oazs.PrepRequestProcessor.pRequest2Txn Processed session termination for sessionid: 0x13bfad242e50007
[junit4:junit4]   2> 8791 T3026 oaz.ClientCnxn$EventThread.run EventThread shut down
[junit4:junit4]   2> 8791 T2974 oazs.NIOServerCnxn.closeSock Closed socket connection for client /140.211.11.196:28899 which had sessionid 0x13bfad242e50007
[junit4:junit4]   2> 8791 T2972 oaz.ZooKeeper.close Session: 0x13bfad242e50007 closed
[junit4:junit4]   2> 8792 T2972 oascsi.HttpClientUtil.createClient Creating new http client, config:maxConnections=500&maxConnectionsPerHost=16&socketTimeout=15000&connTimeout=30000
[junit4:junit4]   2> 8801 T2972 oaz.ZooKeeper.<init> Initiating client connection, connectString=127.0.0.1:28878/solr sessionTimeout=30000 watcher=org.apache.solr.common.cloud.ConnectionManager@3926e1a3
[junit4:junit4]   2> 8802 T2972 oascc.ConnectionManager.waitForConnected Waiting for client to connect to ZooKeeper
[junit4:junit4]   2> 8803 T3027 oaz.ClientCnxn$SendThread.logStartConnect Opening socket connection to server localhost/127.0.0.1:28878. Will not attempt to authenticate using SASL (access denied ("javax.security.auth.AuthPermission" "getLoginConfiguration"))
[junit4:junit4]   2> 8803 T3027 oaz.ClientCnxn$SendThread.primeConnection Socket connection established to localhost/127.0.0.1:28878, initiating session
[junit4:junit4]   2> 8803 T2974 oazs.NIOServerCnxnFactory.run Accepted socket connection from /140.211.11.196:28900
[junit4:junit4]   2> 8804 T2974 oazs.ZooKeeperServer.processConnectRequest Client attempting to establish new session at /140.211.11.196:28900
[junit4:junit4]   2> 8805 T2976 oazs.ZooKeeperServer.finishSessionInit Established session 0x13bfad242e50008 with negotiated timeout 20000 for client /140.211.11.196:28900
[junit4:junit4]   2> 8805 T3027 oaz.ClientCnxn$SendThread.onConnected Session establishment complete on server localhost/127.0.0.1:28878, sessionid = 0x13bfad242e50008, negotiated timeout = 20000
[junit4:junit4]   2> 8805 T3028 oascc.ConnectionManager.process Watcher org.apache.solr.common.cloud.ConnectionManager@3926e1a3 name:ZooKeeperConnection Watcher:127.0.0.1:28878/solr got event WatchedEvent state:SyncConnected type:None path:null path:null type:None
[junit4:junit4]   2> 8806 T2972 oascc.ConnectionManager.waitForConnected Client is connected to ZooKeeper
[junit4:junit4]   2> 8806 T2977 oazs.PrepRequestProcessor.pRequest Got user-level KeeperException when processing sessionid:0x13bfad242e50008 type:create cxid:0x1 zxid:0x6d txntype:-1 reqpath:n/a Error Path:/solr/overseer Error:KeeperErrorCode = NodeExists for /solr/overseer
[junit4:junit4]   2> 8808 T2977 oazs.PrepRequestProcessor.pRequest Got user-level KeeperException when processing sessionid:0x13bfad242e50008 type:create cxid:0x2 zxid:0x6e txntype:-1 reqpath:n/a Error Path:/solr/overseer Error:KeeperErrorCode = NodeExists for /solr/overseer
[junit4:junit4]   2> 8810 T2972 oasc.ZkController.createEphemeralLiveNode Register node as live in ZooKeeper:/live_nodes/127.0.0.1:28898_
[junit4:junit4]   2> 8811 T2977 oazs.PrepRequestProcessor.pRequest Got user-level KeeperException when processing sessionid:0x13bfad242e50008 type:delete cxid:0x4 zxid:0x6f txntype:-1 reqpath:n/a Error Path:/solr/live_nodes/127.0.0.1:28898_ Error:KeeperErrorCode = NoNode for /solr/live_nodes/127.0.0.1:28898_
[junit4:junit4]   2> 8812 T2972 oascc.SolrZkClient.makePath makePath: /live_nodes/127.0.0.1:28898_
[junit4:junit4]   2> 8814 T3013 oascc.ZkStateReader$2.process A cluster state change: WatchedEvent state:SyncConnected type:NodeChildrenChanged path:/live_nodes, has occurred - updating... (live nodes size: 2)
[junit4:junit4]   2> 8814 T2994 oascc.ZkStateReader$2.process A cluster state change: WatchedEvent state:SyncConnected type:NodeChildrenChanged path:/live_nodes, has occurred - updating... (live nodes size: 2)
[junit4:junit4]   2> 8814 T3000 oascc.ZkStateReader$3.process Updating live nodes... (3)
[junit4:junit4]   2> 8814 T3000 oascc.ZkStateReader$2.process A cluster state change: WatchedEvent state:SyncConnected type:NodeChildrenChanged path:/live_nodes, has occurred - updating... (live nodes size: 3)
[junit4:junit4]   2> 8816 T3013 oascc.ZkStateReader$3.process Updating live nodes... (3)
[junit4:junit4]   2> 8816 T2994 oascc.ZkStateReader$3.process Updating live nodes... (3)
[junit4:junit4]   2> 8817 T2972 oascc.ZkStateReader.createClusterStateWatchersAndUpdate Updating cluster state from ZooKeeper... 
[junit4:junit4]   2> 8823 T3029 oasc.CoreContainer.create Creating SolrCore 'collection1' using instanceDir: /usr/home/hudson/hudson-slave/workspace/Lucene-Solr-Tests-trunk-java7/solr/build/solr-core/test/J1/./org.apache.solr.cloud.CollectionsAPIDistributedZkTest-jetty2-1357122790395/collection1
[junit4:junit4]   2> 8823 T3029 oasc.ZkController.createCollectionZkNode Check for collection zkNode:collection1
[junit4:junit4]   2> 8824 T3029 oasc.ZkController.createCollectionZkNode Collection zkNode exists
[junit4:junit4]   2> 8824 T3029 oasc.ZkController.readConfigName Load collection config from:/collections/collection1
[junit4:junit4]   2> 8825 T3029 oasc.SolrResourceLoader.<init> new SolrResourceLoader for directory: '/usr/home/hudson/hudson-slave/workspace/Lucene-Solr-Tests-trunk-java7/solr/build/solr-core/test/J1/./org.apache.solr.cloud.CollectionsAPIDistributedZkTest-jetty2-1357122790395/collection1/'
[junit4:junit4]   2> 8826 T3029 oasc.SolrResourceLoader.replaceClassLoader Adding 'file:/usr/home/hudson/hudson-slave/workspace/Lucene-Solr-Tests-trunk-java7/solr/build/solr-core/test/J1/org.apache.solr.cloud.CollectionsAPIDistributedZkTest-jetty2-1357122790395/collection1/lib/classes/' to classloader
[junit4:junit4]   2> 8827 T3029 oasc.SolrResourceLoader.replaceClassLoader Adding 'file:/usr/home/hudson/hudson-slave/workspace/Lucene-Solr-Tests-trunk-java7/solr/build/solr-core/test/J1/org.apache.solr.cloud.CollectionsAPIDistributedZkTest-jetty2-1357122790395/collection1/lib/README' to classloader
[junit4:junit4]   2> 8879 T3029 oasc.SolrConfig.<init> Using Lucene MatchVersion: LUCENE_50
[junit4:junit4]   2> 8950 T3029 oasc.SolrConfig.<init> Loaded SolrConfig: solrconfig.xml
[junit4:junit4]   2> 9051 T3029 oass.IndexSchema.readSchema Reading Solr Schema
[junit4:junit4]   2> 9059 T3029 oass.IndexSchema.readSchema Schema name=test
[junit4:junit4]   2> 9688 T3029 oass.OpenExchangeRatesOrgProvider.init Initialized with rates=open-exchange-rates.json, refreshInterval=1440.
[junit4:junit4]   2> 9700 T3029 oass.IndexSchema.readSchema default search field in schema is text
[junit4:junit4]   2> 9704 T3029 oass.IndexSchema.readSchema unique key field: id
[junit4:junit4]   2> 9716 T3029 oass.FileExchangeRateProvider.reload Reloading exchange rates from file currency.xml
[junit4:junit4]   2> 9721 T3029 oass.FileExchangeRateProvider.reload Reloading exchange rates from file currency.xml
[junit4:junit4]   2> 9726 T3029 oass.OpenExchangeRatesOrgProvider.reload Reloading exchange rates from open-exchange-rates.json
[junit4:junit4]   2> 9727 T3029 oass.OpenExchangeRatesOrgProvider.reload Reloading exchange rates from open-exchange-rates.json
[junit4:junit4]   2> 9728 T3029 oasc.SolrCore.<init> [collection1] Opening new SolrCore at /usr/home/hudson/hudson-slave/workspace/Lucene-Solr-Tests-trunk-java7/solr/build/solr-core/test/J1/./org.apache.solr.cloud.CollectionsAPIDistributedZkTest-jetty2-1357122790395/collection1/, dataDir=./org.apache.solr.cloud.CollectionsAPIDistributedZkTest-1357122781917/jetty2/
[junit4:junit4]   2> 9728 T3029 oasc.JmxMonitoredMap.<init> JMX monitoring is enabled. Adding Solr mbeans to JMX Server: com.sun.jmx.mbeanserver.JmxMBeanServer@1f936f80
[junit4:junit4]   2> 9728 T3029 oasc.SolrCore.initDirectoryFactory solr.NRTCachingDirectoryFactory
[junit4:junit4]   2> 9729 T3029 oasc.CachingDirectoryFactory.get return new directory for /usr/home/hudson/hudson-slave/workspace/Lucene-Solr-Tests-trunk-java7/solr/build/solr-core/test/J1/./org.apache.solr.cloud.CollectionsAPIDistributedZkTest-1357122781917/jetty2 forceNew:false
[junit4:junit4]   2> 9730 T3029 oasc.CachingDirectoryFactory.close Releasing directory:/usr/home/hudson/hudson-slave/workspace/Lucene-Solr-Tests-trunk-java7/solr/build/solr-core/test/J1/./org.apache.solr.cloud.CollectionsAPIDistributedZkTest-1357122781917/jetty2
[junit4:junit4]   2> 9731 T3029 oasc.SolrCore.getNewIndexDir New index directory detected: old=null new=./org.apache.solr.cloud.CollectionsAPIDistributedZkTest-1357122781917/jetty2/index/
[junit4:junit4]   2> 9731 T3029 oasc.SolrCore.initIndex WARNING [collection1] Solr index directory './org.apache.solr.cloud.CollectionsAPIDistributedZkTest-1357122781917/jetty2/index' doesn't exist. Creating new index...
[junit4:junit4]   2> 9733 T3029 oasc.CachingDirectoryFactory.get return new directory for /usr/home/hudson/hudson-slave/workspace/Lucene-Solr-Tests-trunk-java7/solr/build/solr-core/test/J1/./org.apache.solr.cloud.CollectionsAPIDistributedZkTest-1357122781917/jetty2/index forceNew:false
[junit4:junit4]   2> 9749 T3029 oasc.SolrDeletionPolicy.onCommit SolrDeletionPolicy.onCommit: commits:num=1
[junit4:junit4]   2> 		commit{dir=RateLimitedDirectoryWrapper(NRTCachingDirectory(org.apache.lucene.store.NIOFSDirectory@/usr/home/hudson/hudson-slave/workspace/Lucene-Solr-Tests-trunk-java7/solr/build/solr-core/test/J1/org.apache.solr.cloud.CollectionsAPIDistributedZkTest-1357122781917/jetty2/index lockFactory=org.apache.lucene.store.NativeFSLockFactory@15ac2323; maxCacheMB=48.0 maxMergeSizeMB=4.0)),segFN=segments_1,generation=1,filenames=[segments_1]
[junit4:junit4]   2> 9749 T3029 oasc.SolrDeletionPolicy.updateCommits newest commit = 1[segments_1]
[junit4:junit4]   2> 9751 T3029 oasc.CachingDirectoryFactory.close Releasing directory:/usr/home/hudson/hudson-slave/workspace/Lucene-Solr-Tests-trunk-java7/solr/build/solr-core/test/J1/./org.apache.solr.cloud.CollectionsAPIDistributedZkTest-1357122781917/jetty2/index
[junit4:junit4]   2> 9751 T3029 oasc.SolrCore.initWriters created xml: solr.XMLResponseWriter
[junit4:junit4]   2> 9753 T3029 oasup.UpdateRequestProcessorChain.init inserting DistributedUpdateProcessorFactory into updateRequestProcessorChain "dedupe"
[junit4:junit4]   2> 9753 T3029 oasup.UpdateRequestProcessorChain.init inserting DistributedUpdateProcessorFactory into updateRequestProcessorChain "dedupe-allfields"
[junit4:junit4]   2> 9754 T3029 oasup.UpdateRequestProcessorChain.init inserting DistributedUpdateProcessorFactory into updateRequestProcessorChain "stored_sig"
[junit4:junit4]   2> 9754 T3029 oasup.UpdateRequestProcessorChain.init inserting DistributedUpdateProcessorFactory into updateRequestProcessorChain "uniq-fields"
[junit4:junit4]   2> 9754 T3029 oasup.UpdateRequestProcessorChain.init inserting DistributedUpdateProcessorFactory into updateRequestProcessorChain "distrib-dup-test-chain-implicit"
[junit4:junit4]   2> 9755 T3029 oasc.RequestHandlers.initHandlersFromConfig adding lazy requestHandler: solr.ReplicationHandler
[junit4:junit4]   2> 9755 T3029 oasc.RequestHandlers.initHandlersFromConfig created /replication: solr.ReplicationHandler
[junit4:junit4]   2> 9756 T3029 oasc.RequestHandlers.initHandlersFromConfig created standard: solr.StandardRequestHandler
[junit4:junit4]   2> 9756 T3029 oasc.RequestHandlers.initHandlersFromConfig created /get: solr.RealTimeGetHandler
[junit4:junit4]   2> 9757 T3029 oasc.RequestHandlers.initHandlersFromConfig created dismax: solr.SearchHandler
[junit4:junit4]   2> 9757 T3029 oasc.RequestHandlers.initHandlersFromConfig created mock: org.apache.solr.core.MockQuerySenderListenerReqHandler
[junit4:junit4]   2> 9758 T3029 oasc.RequestHandlers.initHandlersFromConfig created /admin/: org.apache.solr.handler.admin.AdminHandlers
[junit4:junit4]   2> 9758 T3029 oasc.RequestHandlers.initHandlersFromConfig created defaults: solr.StandardRequestHandler
[junit4:junit4]   2> 9758 T3029 oasc.RequestHandlers.initHandlersFromConfig adding lazy requestHandler: solr.StandardRequestHandler
[junit4:junit4]   2> 9759 T3029 oasc.RequestHandlers.initHandlersFromConfig created lazy: solr.StandardRequestHandler
[junit4:junit4]   2> 9759 T3029 oasc.RequestHandlers.initHandlersFromConfig created /update: solr.UpdateRequestHandler
[junit4:junit4]   2> 9760 T3029 oasc.RequestHandlers.initHandlersFromConfig created /terms: org.apache.solr.handler.component.SearchHandler
[junit4:junit4]   2> 9760 T3029 oasc.RequestHandlers.initHandlersFromConfig created spellCheckCompRH: org.apache.solr.handler.component.SearchHandler
[junit4:junit4]   2> 9760 T3029 oasc.RequestHandlers.initHandlersFromConfig created spellCheckCompRH_Direct: org.apache.solr.handler.component.SearchHandler
[junit4:junit4]   2> 9761 T3029 oasc.RequestHandlers.initHandlersFromConfig created spellCheckWithWordbreak: org.apache.solr.handler.component.SearchHandler
[junit4:junit4]   2> 9762 T3029 oasc.RequestHandlers.initHandlersFromConfig created spellCheckWithWordbreak_Direct: org.apache.solr.handler.component.SearchHandler
[junit4:junit4]   2> 9762 T3029 oasc.RequestHandlers.initHandlersFromConfig created spellCheckCompRH1: org.apache.solr.handler.component.SearchHandler
[junit4:junit4]   2> 9763 T3029 oasc.RequestHandlers.initHandlersFromConfig created mltrh: org.apache.solr.handler.component.SearchHandler
[junit4:junit4]   2> 9763 T3029 oasc.RequestHandlers.initHandlersFromConfig created tvrh: org.apache.solr.handler.component.SearchHandler
[junit4:junit4]   2> 9763 T3029 oasc.RequestHandlers.initHandlersFromConfig created /mlt: solr.MoreLikeThisHandler
[junit4:junit4]   2> 9764 T3029 oasc.RequestHandlers.initHandlersFromConfig created /debug/dump: solr.DumpRequestHandler
[junit4:junit4]   2> 9781 T3029 oashl.XMLLoader.init xsltCacheLifetimeSeconds=60
[junit4:junit4]   2> 9787 T3029 oasc.SolrCore.initDeprecatedSupport WARNING solrconfig.xml uses deprecated <admin/gettableFiles>, Please update your config to use the ShowFileRequestHandler.
[junit4:junit4]   2> 9788 T3029 oasc.SolrCore.initDeprecatedSupport WARNING adding ShowFileRequestHandler with hidden files: [SCHEMA.XML, OLD_SYNONYMS.TXT, STOPWORDS.TXT, PROTWORDS.TXT, OPEN-EXCHANGE-RATES.JSON, SYNONYMS.TXT, CURRENCY.XML, MAPPING-ISOLATIN1ACCENT.TXT]
[junit4:junit4]   2> 9791 T3029 oasc.CachingDirectoryFactory.close Releasing directory:/usr/home/hudson/hudson-slave/workspace/Lucene-Solr-Tests-trunk-java7/solr/build/solr-core/test/J1/./org.apache.solr.cloud.CollectionsAPIDistributedZkTest-1357122781917/jetty2
[junit4:junit4]   2> 9792 T3029 oass.SolrIndexSearcher.<init> Opening Searcher@59948e7d main
[junit4:junit4]   2> 9794 T3029 oasu.CommitTracker.<init> Hard AutoCommit: disabled
[junit4:junit4]   2> 9794 T3029 oasu.CommitTracker.<init> Soft AutoCommit: disabled
[junit4:junit4]   2> 9794 T3029 oashc.SpellCheckComponent.inform Initializing spell checkers
[junit4:junit4]   2> 9804 T3029 oass.DirectSolrSpellChecker.init init: {name=direct,classname=DirectSolrSpellChecker,field=lowerfilt,minQueryLength=3}
[junit4:junit4]   2> 9853 T3030 oasc.SolrCore.registerSearcher [collection1] Registered new searcher Searcher@59948e7d main{StandardDirectoryReader(segments_1:1)}
[junit4:junit4]   2> 9858 T3029 oasc.ZkController.publish publishing core=collection1 state=down
[junit4:junit4]   2> 9858 T3029 oasc.ZkController.publish numShards not found on descriptor - reading it from system property
[junit4:junit4]   2> 9928 T2995 oascc.ZkStateReader.updateClusterState Updating cloud state from ZooKeeper... 
[junit4:junit4]   2> 9929 T2995 oasc.Overseer$ClusterStateUpdater.updateState Update state numShards=2 message={
[junit4:junit4]   2> 	  "operation":"state",
[junit4:junit4]   2> 	  "numShards":"2",
[junit4:junit4]   2> 	  "shard":"shard1",
[junit4:junit4]   2> 	  "roles":null,
[junit4:junit4]   2> 	  "state":"active",
[junit4:junit4]   2> 	  "core":"collection1",
[junit4:junit4]   2> 	  "collection":"collection1",
[junit4:junit4]   2> 	  "node_name":"127.0.0.1:28891_",
[junit4:junit4]   2> 	  "base_url":"http://127.0.0.1:28891"}
[junit4:junit4]   2> 9933 T2995 oasc.Overseer$ClusterStateUpdater.updateState Update state numShards=2 message={
[junit4:junit4]   2> 	  "operation":"state",
[junit4:junit4]   2> 	  "numShards":"2",
[junit4:junit4]   2> 	  "shard":null,
[junit4:junit4]   2> 	  "roles":null,
[junit4:junit4]   2> 	  "state":"down",
[junit4:junit4]   2> 	  "core":"collection1",
[junit4:junit4]   2> 	  "collection":"collection1",
[junit4:junit4]   2> 	  "node_name":"127.0.0.1:28898_",
[junit4:junit4]   2> 	  "base_url":"http://127.0.0.1:28898"}
[junit4:junit4]   2> 9933 T2995 oasc.Overseer$ClusterStateUpdater.updateState Collection already exists with numShards=2
[junit4:junit4]   2> 9933 T2995 oasc.Overseer$ClusterStateUpdater.updateState Assigning new node to shard shard=shard2
[junit4:junit4]   2> 9944 T3013 oascc.ZkStateReader$2.process A cluster state change: WatchedEvent state:SyncConnected type:NodeDataChanged path:/clusterstate.json, has occurred - updating... (live nodes size: 3)
[junit4:junit4]   2> 9944 T3000 oascc.ZkStateReader$2.process A cluster state change: WatchedEvent state:SyncConnected type:NodeDataChanged path:/clusterstate.json, has occurred - updating... (live nodes size: 3)
[junit4:junit4]   2> 9944 T3028 oascc.ZkStateReader$2.process A cluster state change: WatchedEvent state:SyncConnected type:NodeDataChanged path:/clusterstate.json, has occurred - updating... (live nodes size: 3)
[junit4:junit4]   2> 9944 T2994 oascc.ZkStateReader$2.process A cluster state change: WatchedEvent state:SyncConnected type:NodeDataChanged path:/clusterstate.json, has occurred - updating... (live nodes size: 3)
[junit4:junit4]   2> 10861 T3029 oasc.CoreContainer.registerCore registering core: collection1
[junit4:junit4]   2> 10861 T3029 oasc.ZkController.register Register replica - core:collection1 address:http://127.0.0.1:28898 collection:collection1 shard:shard2
[junit4:junit4]   2> 10862 T3029 oascc.SolrZkClient.makePath makePath: /collections/collection1/leader_elect/shard2/election
[junit4:junit4]   2> 10895 T2977 oazs.PrepRequestProcessor.pRequest Got user-level KeeperException when processing sessionid:0x13bfad242e50008 type:delete cxid:0x42 zxid:0x7d txntype:-1 reqpath:n/a Error Path:/solr/collections/collection1/leaders/shard2 Error:KeeperErrorCode = NoNode for /solr/collections/collection1/leaders/shard2
[junit4:junit4]   2> 10908 T3029 oasc.ShardLeaderElectionContext.runLeaderProcess Running the leader process.
[junit4:junit4]   2> 10908 T2977 oazs.PrepRequestProcessor.pRequest Got user-level KeeperException when processing sessionid:0x13bfad242e50008 type:create cxid:0x43 zxid:0x7e txntype:-1 reqpath:n/a Error Path:/solr/overseer Error:KeeperErrorCode = NodeExists for /solr/overseer
[junit4:junit4]   2> 10910 T3029 oasc.ShardLeaderElectionContext.waitForReplicasToComeUp Enough replicas found to continue.
[junit4:junit4]   2> 10911 T3029 oasc.ShardLeaderElectionContext.runLeaderProcess I may be the new leader - try and sync
[junit4:junit4]   2> 10911 T3029 oasc.SyncStrategy.sync Sync replicas to http://127.0.0.1:28898/collection1/
[junit4:junit4]   2> 10911 T3029 oasc.SyncStrategy.syncReplicas Sync Success - now sync replicas to me
[junit4:junit4]   2> 10911 T3029 oasc.SyncStrategy.syncToMe http://127.0.0.1:28898/collection1/ has no replicas
[junit4:junit4]   2> 10912 T3029 oasc.ShardLeaderElectionContext.runLeaderProcess I am the new leader: http://127.0.0.1:28898/collection1/
[junit4:junit4]   2> 10912 T3029 oascc.SolrZkClient.makePath makePath: /collections/collection1/leaders/shard2
[junit4:junit4]   2> 10920 T2977 oazs.PrepRequestProcessor.pRequest Got user-level KeeperException when processing sessionid:0x13bfad242e50008 type:create cxid:0x4c zxid:0x81 txntype:-1 reqpath:n/a Error Path:/solr/overseer Error:KeeperErrorCode = NodeExists for /solr/overseer
[junit4:junit4]   2> 11456 T2995 oascc.ZkStateReader.updateClusterState Updating cloud state from ZooKeeper... 
[junit4:junit4]   2> 11472 T3028 oascc.ZkStateReader$2.process A cluster state change: WatchedEvent state:SyncConnected type:NodeDataChanged path:/clusterstate.json, has occurred - updating... (live nodes size: 3)
[junit4:junit4]   2> 11472 T3000 oascc.ZkStateReader$2.process A cluster state change: WatchedEvent state:SyncConnected type:NodeDataChanged path:/clusterstate.json, has occurred - updating... (live nodes size: 3)
[junit4:junit4]   2> 11472 T2994 oascc.ZkStateReader$2.process A cluster state change: WatchedEvent state:SyncConnected type:NodeDataChanged path:/clusterstate.json, has occurred - updating... (live nodes size: 3)
[junit4:junit4]   2> 11472 T3013 oascc.ZkStateReader$2.process A cluster state change: WatchedEvent state:SyncConnected type:NodeDataChanged path:/clusterstate.json, has occurred - updating... (live nodes size: 3)
[junit4:junit4]   2> 11483 T3029 oasc.ZkController.register We are http://127.0.0.1:28898/collection1/ and leader is http://127.0.0.1:28898/collection1/
[junit4:junit4]   2> 11483 T3029 oasc.ZkController.register No LogReplay needed for core=collection1 baseURL=http://127.0.0.1:28898
[junit4:junit4]   2> 11483 T3029 oasc.ZkController.checkRecovery I am the leader, no recovery necessary
[junit4:junit4]   2> 11483 T3029 oasc.ZkController.publish publishing core=collection1 state=active
[junit4:junit4]   2> 11483 T3029 oasc.ZkController.publish numShards not found on descriptor - reading it from system property
[junit4:junit4]   2> 11485 T3029 oascc.ZkStateReader.updateClusterState Updating cloud state from ZooKeeper... 
[junit4:junit4]   2> 11486 T2972 oass.SolrDispatchFilter.init user.dir=/usr/home/hudson/hudson-slave/workspace/Lucene-Solr-Tests-trunk-java7/solr/build/solr-core/test/J1
[junit4:junit4]   2> 11486 T2972 oass.SolrDispatchFilter.init SolrDispatchFilter.init() done
[junit4:junit4]   2> 11487 T2972 oascsi.HttpClientUtil.createClient Creating new http client, config:maxConnections=128&maxConnectionsPerHost=32&followRedirects=false
[junit4:junit4]   2> 11667 T2972 oejs.Server.doStart jetty-8.1.8.v20121106
[junit4:junit4]   2> 11670 T2972 oejs.AbstractConnector.doStart Started SocketConnector@127.0.0.1:28904
[junit4:junit4]   2> 11671 T2972 oasc.SolrResourceLoader.locateSolrHome JNDI not configured for solr (NoInitialContextEx)
[junit4:junit4]   2> 11671 T2972 oasc.SolrResourceLoader.locateSolrHome using system property solr.solr.home: /usr/home/hudson/hudson-slave/workspace/Lucene-Solr-Tests-trunk-java7/solr/build/solr-core/test/J1/./org.apache.solr.cloud.CollectionsAPIDistributedZkTest-jetty3-1357122793416
[junit4:junit4]   2> 11672 T2972 oasc.SolrResourceLoader.<init> new SolrResourceLoader for deduced Solr Home: '/usr/home/hudson/hudson-slave/workspace/Lucene-Solr-Tests-trunk-java7/solr/build/solr-core/test/J1/./org.apache.solr.cloud.CollectionsAPIDistributedZkTest-jetty3-1357122793416/'
[junit4:junit4]   2> 11713 T2972 oass.SolrDispatchFilter.init SolrDispatchFilter.init()
[junit4:junit4]   2> 11714 T2972 oasc.SolrResourceLoader.locateSolrHome JNDI not configured for solr (NoInitialContextEx)
[junit4:junit4]   2> 11714 T2972 oasc.SolrResourceLoader.locateSolrHome using system property solr.solr.home: /usr/home/hudson/hudson-slave/workspace/Lucene-Solr-Tests-trunk-java7/solr/build/solr-core/test/J1/./org.apache.solr.cloud.CollectionsAPIDistributedZkTest-jetty3-1357122793416
[junit4:junit4]   2> 11715 T2972 oasc.CoreContainer$Initializer.initialize looking for solr.xml: /usr/home/hudson/hudson-slave/workspace/Lucene-Solr-Tests-trunk-java7/solr/build/solr-core/test/J1/./org.apache.solr.cloud.CollectionsAPIDistributedZkTest-jetty3-1357122793416/solr.xml
[junit4:junit4]   2> 11715 T2972 oasc.CoreContainer.<init> New CoreContainer 839109034
[junit4:junit4]   2> 11716 T2972 oasc.CoreContainer.load Loading CoreContainer using Solr Home: '/usr/home/hudson/hudson-slave/workspace/Lucene-Solr-Tests-trunk-java7/solr/build/solr-core/test/J1/./org.apache.solr.cloud.CollectionsAPIDistributedZkTest-jetty3-1357122793416/'
[junit4:junit4]   2> 11716 T2972 oasc.SolrResourceLoader.<init> new SolrResourceLoader for directory: '/usr/home/hudson/hudson-slave/workspace/Lucene-Solr-Tests-trunk-java7/solr/build/solr-core/test/J1/./org.apache.solr.cloud.CollectionsAPIDistributedZkTest-jetty3-1357122793416/'
[junit4:junit4]   2> 11745 T2972 oashc.HttpShardHandlerFactory.getParameter Setting socketTimeout to: 30000
[junit4:junit4]   2> 11745 T2972 oashc.HttpShardHandlerFactory.getParameter Setting urlScheme to: http://
[junit4:junit4]   2> 11746 T2972 oashc.HttpShardHandlerFactory.getParameter Setting connTimeout to: 15000
[junit4:junit4]   2> 11746 T2972 oashc.HttpShardHandlerFactory.getParameter Setting maxConnectionsPerHost to: 20
[junit4:junit4]   2> 11746 T2972 oashc.HttpShardHandlerFactory.getParameter Setting corePoolSize to: 0
[junit4:junit4]   2> 11747 T2972 oashc.HttpShardHandlerFactory.getParameter Setting maximumPoolSize to: 2147483647
[junit4:junit4]   2> 11747 T2972 oashc.HttpShardHandlerFactory.getParameter Setting maxThreadIdleTime to: 5
[junit4:junit4]   2> 11748 T2972 oashc.HttpShardHandlerFactory.getParameter Setting sizeOfQueue to: -1
[junit4:junit4]   2> 11748 T2972 oashc.HttpShardHandlerFactory.getParameter Setting fairnessPolicy to: false
[junit4:junit4]   2> 11749 T2972 oascsi.HttpClientUtil.createClient Creating new http client, config:maxConnectionsPerHost=20&maxConnections=10000&socketTimeout=30000&connTimeout=15000&retry=false
[junit4:junit4]   2> 11770 T2972 oasc.CoreContainer.load Registering Log Listener
[junit4:junit4]   2> 11790 T2972 oasc.CoreContainer.initZooKeeper Zookeeper client=127.0.0.1:28878/solr
[junit4:junit4]   2> 11790 T2972 oasc.ZkController.checkChrootPath zkHost includes chroot
[junit4:junit4]   2> 11791 T2972 oaz.ZooKeeper.<init> Initiating client connection, connectString=127.0.0.1:28878 sessionTimeout=60000 watcher=org.apache.solr.common.cloud.ConnectionManager@4c2f1f2b
[junit4:junit4]   2> 11792 T2972 oascc.ConnectionManager.waitForConnected Waiting for client to connect to ZooKeeper
[junit4:junit4]   2> 11792 T3040 oaz.ClientCnxn$SendThread.logStartConnect Opening socket connection to server localhost/127.0.0.1:28878. Will not attempt to authenticate using SASL (access denied ("javax.security.auth.AuthPermission" "getLoginConfiguration"))
[junit4:junit4]   2> 11793 T3040 oaz.ClientCnxn$SendThread.primeConnection Socket connection established to localhost/127.0.0.1:28878, initiating session
[junit4:junit4]   2> 11794 T2974 oazs.NIOServerCnxnFactory.run Accepted socket connection from /140.211.11.196:28905
[junit4:junit4]   2> 11794 T2974 oazs.ZooKeeperServer.processConnectRequest Client attempting to establish new session at /140.211.11.196:28905
[junit4:junit4]   2> 11796 T2976 oazs.ZooKeeperServer.finishSessionInit Established session 0x13bfad242e50009 with negotiated timeout 20000 for client /140.211.11.196:28905
[junit4:junit4]   2> 11796 T3040 oaz.ClientCnxn$SendThread.onConnected Session establishment complete on server localhost/127.0.0.1:28878, sessionid = 0x13bfad242e50009, negotiated timeout = 20000
[junit4:junit4]   2> 11796 T3041 oascc.ConnectionManager.process Watcher org.apache.solr.common.cloud.ConnectionManager@4c2f1f2b name:ZooKeeperConnection Watcher:127.0.0.1:28878 got event WatchedEvent state:SyncConnected type:None path:null path:null type:None
[junit4:junit4]   2> 11796 T2972 oascc.ConnectionManager.waitForConnected Client is connected to ZooKeeper
[junit4:junit4]   2> 11797 T2977 oazs.PrepRequestProcessor.pRequest2Txn Processed session termination for sessionid: 0x13bfad242e50009
[junit4:junit4]   2> 11810 T3041 oaz.ClientCnxn$EventThread.run EventThread shut down
[junit4:junit4]   2> 11810 T2974 oazs.NIOServerCnxn.closeSock Closed socket connection for client /140.211.11.196:28905 which had sessionid 0x13bfad242e50009
[junit4:junit4]   2> 11810 T2972 oaz.ZooKeeper.close Session: 0x13bfad242e50009 closed
[junit4:junit4]   2> 11810 T2972 oascsi.HttpClientUtil.createClient Creating new http client, config:maxConnections=500&maxConnectionsPerHost=16&socketTimeout=15000&connTimeout=30000
[junit4:junit4]   2> 11822 T2972 oaz.ZooKeeper.<init> Initiating client connection, connectString=127.0.0.1:28878/solr sessionTimeout=30000 watcher=org.apache.solr.common.cloud.ConnectionManager@3c658662
[junit4:junit4]   2> 11823 T2972 oascc.ConnectionManager.waitForConnected Waiting for client to connect to ZooKeeper
[junit4:junit4]   2> 11823 T3042 oaz.ClientCnxn$SendThread.logStartConnect Opening socket connection to server localhost/127.0.0.1:28878. Will not attempt to authenticate using SASL (access denied ("javax.security.auth.AuthPermission" "getLoginConfiguration"))
[junit4:junit4]   2> 11824 T3042 oaz.ClientCnxn$SendThread.primeConnection Socket connection established to localhost/127.0.0.1:28878, initiating session
[junit4:junit4]   2> 11824 T2974 oazs.NIOServerCnxnFactory.run Accepted socket connection from /140.211.11.196:28906
[junit4:junit4]   2> 11824 T2974 oazs.ZooKeeperServer.processConnectRequest Client attempting to establish new session at /140.211.11.196:28906
[junit4:junit4]   2> 11825 T2976 oazs.ZooKeeperServer.finishSessionInit Established session 0x13bfad242e5000a with negotiated timeout 20000 for client /140.211.11.196:28906
[junit4:junit4]   2> 11825 T3042 oaz.ClientCnxn$SendThread.onConnected Session establishment complete on server localhost/127.0.0.1:28878, sessionid = 0x13bfad242e5000a, negotiated timeout = 20000
[junit4:junit4]   2> 11826 T3043 oascc.ConnectionManager.process Watcher org.apache.solr.common.cloud.ConnectionManager@3c658662 name:ZooKeeperConnection Watcher:127.0.0.1:28878/solr got event WatchedEvent state:SyncConnected type:None path:null path:null type:None
[junit4:junit4]   2> 11826 T2972 oascc.ConnectionManager.waitForConnected Client is connected to ZooKeeper
[junit4:junit4]   2> 11827 T2977 oazs.PrepRequestProcessor.pRequest Got user-level KeeperException when processing sessionid:0x13bfad242e5000a type:create cxid:0x1 zxid:0x8e txntype:-1 reqpath:n/a Error Path:/solr/overseer Error:KeeperErrorCode = NodeExists for /solr/overseer
[junit4:junit4]   2> 11828 T2977 oazs.PrepRequestProcessor.pRequest Got user-level KeeperException when processing sessionid:0x13bfad242e5000a type:create cxid:0x2 zxid:0x8f txntype:-1 reqpath:n/a Error Path:/solr/overseer Error:KeeperErrorCode = NodeExists for /solr/overseer
[junit4:junit4]   2> 11829 T2972 oasc.ZkController.createEphemeralLiveNode Register node as live in ZooKeeper:/live_nodes/127.0.0.1:28904_
[junit4:junit4]   2> 11830 T2977 oazs.PrepRequestProcessor.pRequest Got user-level KeeperException when processing sessionid:0x13bfad242e5000a type:delete cxid:0x4 zxid:0x90 txntype:-1 reqpath:n/a Error Path:/solr/live_nodes/127.0.0.1:28904_ Error:KeeperErrorCode = NoNode for /solr/live_nodes/127.0.0.1:28904_
[junit4:junit4]   2> 11839 T2972 oascc.SolrZkClient.makePath makePath: /live_nodes/127.0.0.1:28904_
[junit4:junit4]   2> 11842 T3028 oascc.ZkStateReader$2.process A cluster state change: WatchedEvent state:SyncConnected type:NodeChildrenChanged path:/live_nodes, has occurred - updating... (live nodes size: 3)
[junit4:junit4]   2> 11842 T2994 oascc.ZkStateReader$2.process A cluster state change: WatchedEvent state:SyncConnected type:NodeChildrenChanged path:/live_nodes, has occurred - updating... (live nodes size: 3)
[junit4:junit4]   2> 11842 T3013 oascc.ZkStateReader$2.process A cluster state change: WatchedEvent state:SyncConnected type:NodeChildrenChanged path:/live_nodes, has occurred - updating... (live nodes size: 3)
[junit4:junit4]   2> 11842 T3000 oascc.ZkStateReader$3.process Updating live nodes... (4)
[junit4:junit4]   2> 11843 T3000 oascc.ZkStateReader$2.process A cluster state change: WatchedEvent state:SyncConnected type:NodeChildrenChanged path:/live_nodes, has occurred - updating... (live nodes size: 4)
[junit4:junit4]   2> 11843 T3028 oascc.ZkStateReader$3.process Updating live nodes... (4)
[junit4:junit4]   2> 11844 T2994 oascc.ZkStateReader$3.process Updating live nodes... (4)
[junit4:junit4]   2> 11844 T3013 oascc.ZkStateReader$3.process Updating live nodes... (4)
[junit4:junit4]   2> 11845 T2972 oascc.ZkStateReader.createClusterStateWatchersAndUpdate Updating cluster state from ZooKeeper... 
[junit4:junit4]   2> 11852 T3044 oasc.CoreContainer.create Creating SolrCore 'collection1' using instanceDir: /usr/home/hudson/hudson-slave/workspace/Lucene-Solr-Tests-trunk-java7/solr/build/solr-core/test/J1/./org.apache.solr.cloud.CollectionsAPIDistributedZkTest-jetty3-1357122793416/collection1
[junit4:junit4]   2> 11852 T3044 oasc.ZkController.createCollectionZkNode Check for collection zkNode:collection1
[junit4:junit4]   2> 11853 T3044 oasc.ZkController.createCollectionZkNode Collection zkNode exists
[junit4:junit4]   2> 11853 T3044 oasc.ZkController.readConfigName Load collection config from:/collections/collection1
[junit4:junit4]   2> 11854 T3044 oasc.SolrResourceLoader.<init> new SolrResourceLoader for directory: '/usr/home/hudson/hudson-slave/workspace/Lucene-Solr-Tests-trunk-java7/solr/build/solr-core/test/J1/./org.apache.solr.cloud.CollectionsAPIDistributedZkTest-jetty3-1357122793416/collection1/'
[junit4:junit4]   2> 11855 T3044 oasc.SolrResourceLoader.replaceClassLoader Adding 'file:/usr/home/hudson/hudson-slave/workspace/Lucene-Solr-Tests-trunk-java7/solr/build/solr-core/test/J1/org.apache.solr.cloud.CollectionsAPIDistributedZkTest-jetty3-1357122793416/collection1/lib/README' to classloader
[junit4:junit4]   2> 11856 T3044 oasc.SolrResourceLoader.replaceClassLoader Adding 'file:/usr/home/hudson/hudson-slave/workspace/Lucene-Solr-Tests-trunk-java7/solr/build/solr-core/test/J1/org.apache.solr.cloud.CollectionsAPIDistributedZkTest-jetty3-1357122793416/collection1/lib/classes/' to classloader
[junit4:junit4]   2> 11909 T3044 oasc.SolrConfig.<init> Using Lucene MatchVersion: LUCENE_50
[junit4:junit4]   2> 11980 T3044 oasc.SolrConfig.<init> Loaded SolrConfig: solrconfig.xml
[junit4:junit4]   2> 12081 T3044 oass.IndexSchema.readSchema Reading Solr Schema
[junit4:junit4]   2> 12089 T3044 oass.IndexSchema.readSchema Schema name=test
[junit4:junit4]   2> 12724 T3044 oass.OpenExchangeRatesOrgProvider.init Initialized with rates=open-exchange-rates.json, refreshInterval=1440.
[junit4:junit4]   2> 12736 T3044 oass.IndexSchema.readSchema default search field in schema is text
[junit4:junit4]   2> 12740 T3044 oass.IndexSchema.readSchema unique key field: id
[junit4:junit4]   2> 12752 T3044 oass.FileExchangeRateProvider.reload Reloading exchange rates from file currency.xml
[junit4:junit4]   2> 12758 T3044 oass.FileExchangeRateProvider.reload Reloading exchange rates from file currency.xml
[junit4:junit4]   2> 12763 T3044 oass.OpenExchangeRatesOrgProvider.reload Reloading exchange rates from open-exchange-rates.json
[junit4:junit4]   2> 12764 T3044 oass.OpenExchangeRatesOrgProvider.reload Reloading exchange rates from open-exchange-rates.json
[junit4:junit4]   2> 12765 T3044 oasc.SolrCore.<init> [collection1] Opening new SolrCore at /usr/home/hudson/hudson-slave/workspace/Lucene-Solr-Tests-trunk-java7/solr/build/solr-core/test/J1/./org.apache.solr.cloud.CollectionsAPIDistributedZkTest-jetty3-1357122793416/collection1/, dataDir=./org.apache.solr.cloud.CollectionsAPIDistributedZkTest-1357122781917/jetty3/
[junit4:junit4]   2> 12765 T3044 oasc.JmxMonitoredMap.<init> JMX monitoring is enabled. Adding Solr mbeans to JMX Server: com.sun.jmx.mbeanserver.JmxMBeanServer@1f936f80
[junit4:junit4]   2> 12766 T3044 oasc.SolrCore.initDirectoryFactory solr.NRTCachingDirectoryFactory
[junit4:junit4]   2> 12767 T3044 oasc.CachingDirectoryFactory.get return new directory for /usr/home/hudson/hudson-slave/workspace/Lucene-Solr-Tests-trunk-java7/solr/build/solr-core/test/J1/./org.apache.solr.cloud.CollectionsAPIDistributedZkTest-1357122781917/jetty3 forceNew:false
[junit4:junit4]   2> 12768 T3044 oasc.CachingDirectoryFactory.close Releasing directory:/usr/home/hudson/hudson-slave/workspace/Lucene-Solr-Tests-trunk-java7/solr/build/solr-core/test/J1/./org.apache.solr.cloud.CollectionsAPIDistributedZkTest-1357122781917/jetty3
[junit4:junit4]   2> 12768 T3044 oasc.SolrCore.getNewIndexDir New index directory detected: old=null new=./org.apache.solr.cloud.CollectionsAPIDistributedZkTest-1357122781917/jetty3/index/
[junit4:junit4]   2> 12769 T3044 oasc.SolrCore.initIndex WARNING [collection1] Solr index directory './org.apache.solr.cloud.CollectionsAPIDistributedZkTest-1357122781917/jetty3/index' doesn't exist. Creating new index...
[junit4:junit4]   2> 12770 T3044 oasc.CachingDirectoryFactory.get return new directory for /usr/home/hudson/hudson-slave/workspace/Lucene-Solr-Tests-trunk-java7/solr/build/solr-core/test/J1/./org.apache.solr.cloud.CollectionsAPIDistributedZkTest-1357122781917/jetty3/index forceNew:false
[junit4:junit4]   2> 12776 T3044 oasc.SolrDeletionPolicy.onCommit SolrDeletionPolicy.onCommit: commits:num=1
[junit4:junit4]   2> 		commit{dir=RateLimitedDirectoryWrapper(NRTCachingDirectory(org.apache.lucene.store.NIOFSDirectory@/usr/home/hudson/hudson-slave/workspace/Lucene-Solr-Tests-trunk-java7/solr/build/solr-core/test/J1/org.apache.solr.cloud.CollectionsAPIDistributedZkTest-1357122781917/jetty3/index lockFactory=org.apache.lucene.store.NativeFSLockFactory@d1a52b8; maxCacheMB=48.0 maxMergeSizeMB=4.0)),segFN=segments_1,generation=1,filenames=[segments_1]
[junit4:junit4]   2> 12776 T3044 oasc.SolrDeletionPolicy.updateCommits newest commit = 1[segments_1]
[junit4:junit4]   2> 12777 T3044 oasc.CachingDirectoryFactory.close Releasing directory:/usr/home/hudson/hudson-slave/workspace/Lucene-Solr-Tests-trunk-java7/solr/build/solr-core/test/J1/./org.apache.solr.cloud.CollectionsAPIDistributedZkTest-1357122781917/jetty3/index
[junit4:junit4]   2> 12777 T3044 oasc.SolrCore.initWriters created xml: solr.XMLResponseWriter
[junit4:junit4]   2> 12779 T3044 oasup.UpdateRequestProcessorChain.init inserting DistributedUpdateProcessorFactory into updateRequestProcessorChain "dedupe"
[junit4:junit4]   2> 12780 T3044 oasup.UpdateRequestProcessorChain.init inserting DistributedUpdateProcessorFactory into updateRequestProcessorChain "dedupe-allfields"
[junit4:junit4]   2> 12780 T3044 oasup.UpdateRequestProcessorChain.init inserting DistributedUpdateProcessorFactory into updateRequestProcessorChain "stored_sig"
[junit4:junit4]   2> 12780 T3044 oasup.UpdateRequestProcessorChain.init inserting DistributedUpdateProcessorFactory into updateRequestProcessorChain "uniq-fields"
[junit4:junit4]   2> 12781 T3044 oasup.UpdateRequestProcessorChain.init inserting DistributedUpdateProcessorFactory into updateRequestProcessorChain "distrib-dup-test-chain-implicit"
[junit4:junit4]   2> 12781 T3044 oasc.RequestHandlers.initHandlersFromConfig adding lazy requestHandler: solr.ReplicationHandler
[junit4:junit4]   2> 12782 T3044 oasc.RequestHandlers.initHandlersFromConfig created /replication: solr.ReplicationHandler
[junit4:junit4]   2> 12782 T3044 oasc.RequestHandlers.initHandlersFromConfig created standard: solr.StandardRequestHandler
[junit4:junit4]   2> 12783 T3044 oasc.RequestHandlers.initHandlersFromConfig created /get: solr.RealTimeGetHandler
[junit4:junit4]   2> 12783 T3044 oasc.RequestHandlers.initHandlersFromConfig created dismax: solr.SearchHandler
[junit4:junit4]   2> 12784 T3044 oasc.RequestHandlers.initHandlersFromConfig created mock: org.apache.solr.core.MockQuerySenderListenerReqHandler
[junit4:junit4]   2> 12784 T3044 oasc.RequestHandlers.initHandlersFromConfig created /admin/: org.apache.solr.handler.admin.AdminHandlers
[junit4:junit4]   2> 12785 T3044 oasc.RequestHandlers.initHandlersFromConfig created defaults: solr.StandardRequestHandler
[junit4:junit4]   2> 12785 T3044 oasc.RequestHandlers.initHandlersFromConfig adding lazy requestHandler: solr.StandardRequestHandler
[junit4:junit4]   2> 12785 T3044 oasc.RequestHandlers.initHandlersFromConfig created lazy: solr.StandardRequestHandler
[junit4:junit4]   2> 12786 T3044 oasc.RequestHandlers.initHandlersFromConfig created /update: solr.UpdateRequestHandler
[junit4:junit4]   2> 12786 T3044 oasc.RequestHandlers.initHandlersFromConfig created /terms: org.apache.solr.handler.component.SearchHandler
[junit4:junit4]   2> 12787 T3044 oasc.RequestHandlers.initHandlersFromConfig created spellCheckCompRH: org.apache.solr.handler.component.SearchHandler
[junit4:junit4]   2> 12787 T3044 oasc.RequestHandlers.initHandlersFromConfig created spellCheckCompRH_Direct: org.apache.solr.handler.component.SearchHandler
[junit4:junit4]   2> 12787 T3044 oasc.RequestHandlers.initHandlersFromConfig created spellCheckWithWordbreak: org.apache.solr.handler.component.SearchHandler
[junit4:junit4]   2> 12788 T3044 oasc.RequestHandlers.initHandlersFromConfig created spellCheckWithWordbreak_Direct: org.apache.solr.handler.component.SearchHandler
[junit4:junit4]   2> 12788 T3044 oasc.RequestHandlers.initHandlersFromConfig created spellCheckCompRH1: org.apache.solr.handler.component.SearchHandler
[junit4:junit4]   2> 12789 T3044 oasc.RequestHandlers.initHandlersFromConfig created mltrh: org.apache.solr.handler.component.SearchHandler
[junit4:junit4]   2> 12789 T3044 oasc.RequestHandlers.initHandlersFromConfig created tvrh: org.apache.solr.handler.component.SearchHandler
[junit4:junit4]   2> 12790 T3044 oasc.RequestHandlers.initHandlersFromConfig created /mlt: solr.MoreLikeThisHandler
[junit4:junit4]   2> 12790 T3044 oasc.RequestHandlers.initHandlersFromConfig created /debug/dump: solr.DumpRequestHandler
[junit4:junit4]   2> 12803 T3044 oashl.XMLLoader.init xsltCacheLifetimeSeconds=60
[junit4:junit4]   2> 12807 T3044 oasc.SolrCore.initDeprecatedSupport WARNING solrconfig.xml uses deprecated <admin/gettableFiles>, Please update your config to use the ShowFileRequestHandler.
[junit4:junit4]   2> 12808 T3044 oasc.SolrCore.initDeprecatedSupport WARNING adding ShowFileRequestHandler with hidden files: [SCHEMA.XML, OLD_SYNONYMS.TXT, STOPWORDS.TXT, PROTWORDS.TXT, OPEN-EXCHANGE-RATES.JSON, SYNONYMS.TXT, CURRENCY.XML, MAPPING-ISOLATIN1ACCENT.TXT]
[junit4:junit4]   2> 12810 T3044 oasc.CachingDirectoryFactory.close Releasing directory:/usr/home/hudson/hudson-slave/workspace/Lucene-Solr-Tests-trunk-java7/solr/build/solr-core/test/J1/./org.apache.solr.cloud.CollectionsAPIDistributedZkTest-1357122781917/jetty3
[junit4:junit4]   2> 12812 T3044 oass.SolrIndexSearcher.<init> Opening Searcher@4e7bc5c6 main
[junit4:junit4]   2> 12813 T3044 oasu.CommitTracker.<init> Hard AutoCommit: disabled
[junit4:junit4]   2> 12814 T3044 oasu.CommitTracker.<init> Soft AutoCommit: disabled
[junit4:junit4]   2> 12814 T3044 oashc.SpellCheckComponent.inform Initializing spell checkers
[junit4:junit4]   2> 12821 T3044 oass.DirectSolrSpellChecker.init init: {name=direct,classname=DirectSolrSpellChecker,field=lowerfilt,minQueryLength=3}
[junit4:junit4]   2> 12873 T3045 oasc.SolrCore.registerSearcher [collection1] Registered new searcher Searcher@4e7bc5c6 main{StandardDirectoryReader(segments_1:1)}
[junit4:junit4]   2> 12878 T3044 oasc.ZkController.publish publishing core=collection1 state=down
[junit4:junit4]   2> 12878 T3044 oasc.ZkController.publish numShards not found on descriptor - reading it from system property
[junit4:junit4]   2> 12986 T2995 oascc.ZkStateReader.updateClusterState Updating cloud state from ZooKeeper... 
[junit4:junit4]   2> 12987 T2995 oasc.Overseer$ClusterStateUpdater.updateState Update state numShards=2 message={
[junit4:junit4]   2> 	  "operation":"state",
[junit4:junit4]   2> 	  "numShards":"2",
[junit4:junit4]   2> 	  "shard":"shard2",
[junit4:junit4]   2> 	  "roles":null,
[junit4:junit4]   2> 	  "state":"active",
[junit4:junit4]   2> 	  "core":"collection1",
[junit4:junit4]   2> 	  "collection":"collection1",
[junit4:junit4]   2> 	  "node_name":"127.0.0.1:28898_",
[junit4:junit4]   2> 	  "base_url":"http://127.0.0.1:28898"}
[junit4:junit4]   2> 13000 T2995 oasc.Overseer$ClusterStateUpdater.updateState Update state numShards=2 message={
[junit4:junit4]   2> 	  "operation":"state",
[junit4:junit4]   2> 	  "numShards":"2",
[junit4:junit4]   2> 	  "shard":null,
[junit4:junit4]   2> 	  "roles":null,
[junit4:junit4]   2> 	  "state":"down",
[junit4:junit4]   2> 	  "core":"collection1",
[junit4:junit4]   2> 	  "collection":"collection1",
[junit4:junit4]   2> 	  "node_name":"127.0.0.1:28904_",
[junit4:junit4]   2> 	  "base_url":"http://127.0.0.1:28904"}
[junit4:junit4]   2> 13001 T2995 oasc.Overseer$ClusterStateUpdater.updateState Collection already exists with numShards=2
[junit4:junit4]   2> 13001 T2995 oasc.Overseer$ClusterStateUpdater.updateState Assigning new node to shard shard=shard1
[junit4:junit4]   2> 13005 T2994 oascc.ZkStateReader$2.process A cluster state change: WatchedEvent state:SyncConnected type:NodeDataChanged path:/clusterstate.json, has occurred - updating... (live nodes size: 4)
[junit4:junit4]   2> 13005 T3028 oascc.ZkStateReader$2.process A cluster state change: WatchedEvent state:SyncConnected type:NodeDataChanged path:/clusterstate.json, has occurred - updating... (live nodes size: 4)
[junit4:junit4]   2> 13005 T3013 oascc.ZkStateReader$2.process A cluster state change: WatchedEvent state:SyncConnected type:NodeDataChanged path:/clusterstate.json, has occurred - updating... (live nodes size: 4)
[junit4:junit4]   2> 13005 T3000 oascc.ZkStateReader$2.process A cluster state change: WatchedEvent state:SyncConnected type:NodeDataChanged path:/clusterstate.json, has occurred - updating... (live nodes size: 4)
[junit4:junit4]   2> 13005 T3043 oascc.ZkStateReader$2.process A cluster state change: WatchedEvent state:SyncConnected type:NodeDataChanged path:/clusterstate.json, has occurred - updating... (live nodes size: 4)
[junit4:junit4]   2> 13880 T3044 oasc.CoreContainer.registerCore registering core: collection1
[junit4:junit4]   2> 13880 T3044 oasc.ZkController.register Register replica - core:collection1 address:http://127.0.0.1:28904 collection:collection1 shard:shard1
[junit4:junit4]   2> 13909 T3044 oasc.ZkController.register We are http://127.0.0.1:28904/collection1/ and leader is http://127.0.0.1:28891/collection1/
[junit4:junit4]   2> 13910 T3044 oasc.ZkController.register No LogReplay needed for core=collection1 baseURL=http://127.0.0.1:28904
[junit4:junit4]   2> 13910 T3044 oasc.ZkController.checkRecovery Core needs to recover:collection1
[junit4:junit4]   2> 13910 T3044 oasu.DefaultSolrCoreState.doRecovery Running recovery - first canceling any ongoing recovery
[junit4:junit4]   2> ASYNC  NEW_CORE C194 name=collection1 org.apache.solr.core.SolrCore@62bdb075 url=http://127.0.0.1:28904/collection1 node=127.0.0.1:28904_ C194_STATE=coll:collection1 core:collection1 props:{shard=null, roles=null, state=down, core=collection1, collection=collection1, node_name=127.0.0.1:28904_, base_url=http://127.0.0.1:28904}
[junit4:junit4]   2> 13911 T3046 C194 P28904 oasc.RecoveryStrategy.run Starting recovery process.  core=collection1 recoveringAfterStartup=true
[junit4:junit4]   2> 13912 T3046 C194 P28904 oasc.RecoveryStrategy.doRecovery ###### startupVersions=[]
[junit4:junit4]   2> 13912 T3044 oascc.ZkStateReader.updateClusterState Updating cloud state from ZooKeeper... 
[junit4:junit4]   2> 13912 T3046 C194 P28904 oasc.ZkController.publish publishing core=collection1 state=recovering
[junit4:junit4]   2> 13912 T3046 C194 P28904 oasc.ZkController.publish numShards not found on descriptor - reading it from system property
[junit4:junit4]   2> 13913 T2972 oass.SolrDispatchFilter.init user.dir=/usr/home/hudson/hudson-slave/workspace/Lucene-Solr-Tests-trunk-java7/solr/build/solr-core/test/J1
[junit4:junit4]   2> 13913 T2972 oass.SolrDispatchFilter.init SolrDispatchFilter.init() done
[junit4:junit4]   2> 13914 T3046 C194 P28904 oascsi.HttpClientUtil.createClient Creating new http client, config:maxConnections=128&maxConnectionsPerHost=32&followRedirects=false
[junit4:junit4]   2> 13914 T2972 oascsi.HttpClientUtil.createClient Creating new http client, config:maxConnections=128&maxConnectionsPerHost=32&followRedirects=false
[junit4:junit4]   2> 14108 T2972 oejs.Server.doStart jetty-8.1.8.v20121106
[junit4:junit4]   2> 14111 T2972 oejs.AbstractConnector.doStart Started SocketConnector@127.0.0.1:28911
[junit4:junit4]   2> 14112 T2972 oasc.SolrResourceLoader.locateSolrHome JNDI not configured for solr (NoInitialContextEx)
[junit4:junit4]   2> 14112 T2972 oasc.SolrResourceLoader.locateSolrHome using system property solr.solr.home: /usr/home/hudson/hudson-slave/workspace/Lucene-Solr-Tests-trunk-java7/solr/build/solr-core/test/J1/./org.apache.solr.cloud.CollectionsAPIDistributedZkTest-jetty4-1357122795848
[junit4:junit4]   2> 14113 T2972 oasc.SolrResourceLoader.<init> new SolrResourceLoader for deduced Solr Home: '/usr/home/hudson/hudson-slave/workspace/Lucene-Solr-Tests-trunk-java7/solr/build/solr-core/test/J1/./org.apache.solr.cloud.CollectionsAPIDistributedZkTest-jetty4-1357122795848/'
[junit4:junit4]   2> 14155 T2972 oass.SolrDispatchFilter.init SolrDispatchFilter.init()
[junit4:junit4]   2> 14156 T2972 oasc.SolrResourceLoader.locateSolrHome JNDI not configured for solr (NoInitialContextEx)
[junit4:junit4]   2> 14157 T2972 oasc.SolrResourceLoader.locateSolrHome using system property solr.solr.home: /usr/home/hudson/hudson-slave/workspace/Lucene-Solr-Tests-trunk-java7/solr/build/solr-core/test/J1/./org.apache.solr.cloud.CollectionsAPIDistributedZkTest-jetty4-1357122795848
[junit4:junit4]   2> 14157 T2972 oasc.CoreContainer$Initializer.initialize looking for solr.xml: /usr/home/hudson/hudson-slave/workspace/Lucene-Solr-Tests-trunk-java7/solr/build/solr-core/test/J1/./org.apache.solr.cloud.CollectionsAPIDistributedZkTest-jetty4-1357122795848/solr.xml
[junit4:junit4]   2> 14158 T2972 oasc.CoreContainer.<init> New CoreContainer 266799258
[junit4:junit4]   2> 14159 T2972 oasc.CoreContainer.load Loading CoreContainer using Solr Home: '/usr/home/hudson/hudson-slave/workspace/Lucene-Solr-Tests-trunk-java7/solr/build/solr-core/test/J1/./org.apache.solr.cloud.CollectionsAPIDistributedZkTest-jetty4-1357122795848/'
[junit4:junit4]   2> 14160 T2972 oasc.SolrResourceLoader.<init> new SolrResourceLoader for directory: '/usr/home/hudson/hudson-slave/workspace/Lucene-Solr-Tests-trunk-java7/solr/build/solr-core/test/J1/./org.apache.solr.cloud.CollectionsAPIDistributedZkTest-jetty4-1357122795848/'
[junit4:junit4]   2> 14193 T2972 oashc.HttpShardHandlerFactory.getParameter Setting socketTimeout to: 30000
[junit4:junit4]   2> 14193 T2972 oashc.HttpShardHandlerFactory.getParameter Setting urlScheme to: http://
[junit4:junit4]   2> 14194 T2972 oashc.HttpShardHandlerFactory.getParameter Setting connTimeout to: 15000
[junit4:junit4]   2> 14194 T2972 oashc.HttpShardHandlerFactory.getParameter Setting maxConnectionsPerHost to: 20
[junit4:junit4]   2> 14195 T2972 oashc.HttpShardHandlerFactory.getParameter Setting corePoolSize to: 0
[junit4:junit4]   2> 14195 T2972 oashc.HttpShardHandlerFactory.getParameter Setting maximumPoolSize to: 2147483647
[junit4:junit4]   2> 14196 T2972 oashc.HttpShardHandlerFactory.getParameter Setting maxThreadIdleTime to: 5
[junit4:junit4]   2> 14196 T2972 oashc.HttpShardHandlerFactory.getParameter Setting sizeOfQueue to: -1
[junit4:junit4]   2> 14197 T2972 oashc.HttpShardHandlerFactory.getParameter Setting fairnessPolicy to: false
[junit4:junit4]   2> 14197 T2972 oascsi.HttpClientUtil.createClient Creating new http client, config:maxConnectionsPerHost=20&maxConnections=10000&socketTimeout=30000&connTimeout=15000&retry=false
[junit4:junit4]   2> 14217 T2972 oasc.CoreContainer.load Registering Log Listener
[junit4:junit4]   2> 14237 T2972 oasc.CoreContainer.initZooKeeper Zookeeper client=127.0.0.1:28878/solr
[junit4:junit4]   2> 14237 T2972 oasc.ZkController.checkChrootPath zkHost includes chroot
[junit4:junit4]   2> 14238 T2972 oaz.ZooKeeper.<init> Initiating client connection, connectString=127.0.0.1:28878 sessionTimeout=60000 watcher=org.apache.solr.common.cloud.ConnectionManager@2f3e0328
[junit4:junit4]   2> 14239 T2972 oascc.ConnectionManager.waitForConnected Waiting for client to connect to ZooKeeper
[junit4:junit4]   2> 14239 T3056 oaz.ClientCnxn$SendThread.logStartConnect Opening socket connection to server localhost/127.0.0.1:28878. Will not attempt to authenticate using SASL (access denied ("javax.security.auth.AuthPermission" "getLoginConfiguration"))
[junit4:junit4]   2> 14240 T3056 oaz.ClientCnxn$SendThread.primeConnection Socket connection established to localhost/127.0.0.1:28878, initiating session
[junit4:junit4]   2> 14241 T2974 oazs.NIOServerCnxnFactory.run Accepted socket connection from /140.211.11.196:28912
[junit4:junit4]   2> 14241 T2974 oazs.ZooKeeperServer.processConnectRequest Client attempting to establish new session at /140.211.11.196:28912
[junit4:junit4]   2> 14254 T2976 oazs.ZooKeeperServer.finishSessionInit Established session 0x13bfad242e5000b with negotiated timeout 20000 for client /140.211.11.196:28912
[junit4:junit4]   2> 14254 T3056 oaz.ClientCnxn$SendThread.onConnected Session establishment complete on server localhost/127.0.0.1:28878, sessionid = 0x13bfad242e5000b, negotiated timeout = 20000
[junit4:junit4]   2> 14254 T3057 oascc.ConnectionManager.process Watcher org.apache.solr.common.cloud.ConnectionManager@2f3e0328 name:ZooKeeperConnection Watcher:127.0.0.1:28878 got event WatchedEvent state:SyncConnected type:None path:null path:null type:None
[junit4:junit4]   2> 14254 T2972 oascc.ConnectionManager.waitForConnected Client is connected to ZooKeeper
[junit4:junit4]   2> 14255 T2977 oazs.PrepRequestProcessor.pRequest2Txn Processed session termination for sessionid: 0x13bfad242e5000b
[junit4:junit4]   2> 14256 T3057 oaz.ClientCnxn$EventThread.run EventThread shut down
[junit4:junit4]   2> 14256 T2974 oazs.NIOServerCnxn.closeSock Closed socket connection for client /140.211.11.196:28912 which had sessionid 0x13bfad242e5000b
[junit4:junit4]   2> 14256 T2972 oaz.ZooKeeper.close Session: 0x13bfad242e5000b closed
[junit4:junit4]   2> 14257 T2972 oascsi.HttpClientUtil.createClient Creating new http client, config:maxConnections=500&maxConnectionsPerHost=16&socketTimeout=15000&connTimeout=30000
[junit4:junit4]   2> 14266 T2972 oaz.ZooKeeper.<init> Initiating client connection, connectString=127.0.0.1:28878/solr sessionTimeout=30000 watcher=org.apache.solr.common.cloud.ConnectionManager@5e3fb3ef
[junit4:junit4]   2> 14267 T2972 oascc.ConnectionManager.waitForConnected Waiting for client to connect to ZooKeeper
[junit4:junit4]   2> 14268 T3058 oaz.ClientCnxn$SendThread.logStartConnect Opening socket connection to server localhost/127.0.0.1:28878. Will not attempt to authenticate using SASL (access denied ("javax.security.auth.AuthPermission" "getLoginConfiguration"))
[junit4:junit4]   2> 14268 T3058 oaz.ClientCnxn$SendThread.primeConnection Socket connection established to localhost/127.0.0.1:28878, initiating session
[junit4:junit4]   2> 14268 T2974 oazs.NIOServerCnxnFactory.run Accepted socket connection from /140.211.11.196:28913
[junit4:junit4]   2> 14269 T2974 oazs.ZooKeeperServer.processConnectRequest Client attempting to establish new session at /140.211.11.196:28913
[junit4:junit4]   2> 14270 T2976 oazs.ZooKeeperServer.finishSessionInit Established session 0x13bfad242e5000c with negotiated timeout 20000 for client /140.211.11.196:28913
[junit4:junit4]   2> 14270 T3058 oaz.ClientCnxn$SendThread.onConnected Session establishment complete on server localhost/127.0.0.1:28878, sessionid = 0x13bfad242e5000c, negotiated timeout = 20000
[junit4:junit4]   2> 14270 T3059 oascc.ConnectionManager.process Watcher org.apache.solr.common.cloud.ConnectionManager@5e3fb3ef name:ZooKeeperConnection Watcher:127.0.0.1:28878/solr got event WatchedEvent state:SyncConnected type:None path:null path:null type:None
[junit4:junit4]   2> 14271 T2972 oascc.ConnectionManager.waitForConnected Client is connected to ZooKeeper
[junit4:junit4]   2> 14272 T2977 oazs.PrepRequestProcessor.pRequest Got user-level KeeperException when processing sessionid:0x13bfad242e5000c type:create cxid:0x1 zxid:0xa0 txntype:-1 reqpath:n/a Error Path:/solr/overseer Error:KeeperErrorCode = NodeExists for /solr/overseer
[junit4:junit4]   2> 14273 T2977 oazs.PrepRequestProcessor.pRequest Got user-level KeeperException when processing sessionid:0x13bfad242e5000c type:create cxid:0x2 zxid:0xa1 txntype:-1 reqpath:n/a Error Path:/solr/overseer Error:KeeperErrorCode = NodeExists for /solr/overseer
[junit4:junit4]   2> 14317 T2972 oasc.ZkController.createEphemeralLiveNode Register node as live in ZooKeeper:/live_nodes/127.0.0.1:28911_
[junit4:junit4]   2> 14318 T2977 oazs.PrepRequestProcessor.pRequest Got user-level KeeperException when processing sessionid:0x13bfad242e5000c type:delete cxid:0x4 zxid:0xa2 txntype:-1 reqpath:n/a Error Path:/solr/live_nodes/127.0.0.1:28911_ Error:KeeperErrorCode = NoNode for /solr/live_nodes/127.0.0.1:28911_
[junit4:junit4]   2> 14361 T2972 oascc.SolrZkClient.makePath makePath: /live_nodes/127.0.0.1:28911_
[junit4:junit4]   2> 14417 T3013 oascc.ZkStateReader$2.process A cluster state change: WatchedEvent state:SyncConnected type:NodeChildrenChanged path:/live_nodes, has occurred - updating... (live nodes size: 4)
[junit4:junit4]   2> 14417 T3043 oascc.ZkStateReader$2.process A cluster state change: WatchedEvent state:SyncConnected type:NodeChildrenChanged path:/live_nodes, has occurred - updating... (live nodes size: 4)
[junit4:junit4]   2> 14417 T2994 oascc.ZkStateReader$2.process A cluster state change: WatchedEvent state:SyncConnected type:NodeChildrenChanged path:/live_nodes, has occurred - updating... (live nodes size: 4)
[junit4:junit4]   2> 14417 T3028 oascc.ZkStateReader$2.process A cluster state change: WatchedEvent state:SyncConnected type:NodeChildrenChanged path:/live_nodes, has occurred - updating... (live nodes size: 4)
[junit4:junit4]   2> 14418 T3000 oascc.ZkStateReader$3.process Updating live nodes... (5)
[junit4:junit4]   2> 14418 T3000 oascc.ZkStateReader$2.process A cluster state change: WatchedEvent state:SyncConnected type:NodeChildrenChanged path:/live_nodes, has occurred - updating... (live nodes size: 5)
[junit4:junit4]   2> 14472 T3013 oascc.ZkStateReader$3.process Updating live nodes... (5)
[junit4:junit4]   2> 14472 T3043 oascc.ZkStateReader$3.process Updating live nodes... (5)
[junit4:junit4]   2> 14472 T2994 oascc.ZkStateReader$3.process Updating live nodes... (5)
[junit4:junit4]   2> 14473 T3028 oascc.ZkStateReader$3.process Updating live nodes... (5)
[junit4:junit4]   2> 14473 T2972 oascc.ZkStateReader.createClusterStateWatchersAndUpdate Updating cluster state from ZooKeeper... 
[junit4:junit4]   2> 14481 T3060 oasc.CoreContainer.create Creating SolrCore 'collection1' using instanceDir: /usr/home/hudson/hudson-slave/workspace/Lucene-Solr-Tests-trunk-java7/solr/build/solr-core/test/J1/./org.apache.solr.cloud.CollectionsAPIDistributedZkTest-jetty4-1357122795848/collection1
[junit4:junit4]   2> 14481 T3060 oasc.ZkController.createCollectionZkNode Check for collection zkNode:collection1
[junit4:junit4]   2> 14482 T3060 oasc.ZkController.createCollectionZkNode Collection zkNode exists
[junit4:junit4]   2> 14482 T3060 oasc.ZkController.readConfigName Load collection config from:/collections/collection1
[junit4:junit4]   2> 14483 T3060 oasc.SolrResourceLoader.<init> new SolrResourceLoader for directory: '/usr/home/hudson/hudson-slave/workspace/Lucene-Solr-Tests-trunk-java7/solr/build/solr-core/test/J1/./org.apache.solr.cloud.CollectionsAPIDistributedZkTest-jetty4-1357122795848/collection1/'
[junit4:junit4]   2> 14484 T3060 oasc.SolrResourceLoader.replaceClassLoader Adding 'file:/usr/home/hudson/hudson-slave/workspace/Lucene-Solr-Tests-trunk-java7/solr/build/solr-core/test/J1/org.apache.solr.cloud.CollectionsAPIDistributedZkTest-jetty4-1357122795848/collection1/lib/README' to classloader
[junit4:junit4]   2> 14485 T3060 oasc.SolrResourceLoader.replaceClassLoader Adding 'file:/usr/home/hudson/hudson-slave/workspace/Lucene-Solr-Tests-trunk-java7/solr/build/solr-core/test/J1/org.apache.solr.cloud.CollectionsAPIDistributedZkTest-jetty4-1357122795848/collection1/lib/classes/' to classloader
[junit4:junit4]   2> 14520 T2995 oascc.ZkStateReader.updateClusterState Updating cloud state from ZooKeeper... 
[junit4:junit4]   2> 14521 T2995 oasc.Overseer$ClusterStateUpdater.updateState Update state numShards=2 message={
[junit4:junit4]   2> 	  "operation":"state",
[junit4:junit4]   2> 	  "numShards":"2",
[junit4:junit4]   2> 	  "shard":"shard1",
[junit4:junit4]   2> 	  "roles":null,
[junit4:junit4]   2> 	  "state":"recovering",
[junit4:junit4]   2> 	  "core":"collection1",
[junit4:junit4]   2> 	  "collection":"collection1",
[junit4:junit4]   2> 	  "node_name":"127.0.0.1:28904_",
[junit4:junit4]   2> 	  "base_url":"http://127.0.0.1:28904"}
[junit4:junit4]   2> 14537 T3028 oascc.ZkStateReader$2.process A cluster state change: WatchedEvent state:SyncConnected type:NodeDataChanged path:/clusterstate.json, has occurred - updating... (live nodes size: 5)
[junit4:junit4]   2> 14537 T3013 oascc.ZkStateReader$2.process A cluster state change: WatchedEvent state:SyncConnected type:NodeDataChanged path:/clusterstate.json, has occurred - updating... (live nodes size: 5)
[junit4:junit4]   2> 14537 T3043 oascc.ZkStateReader$2.process A cluster state change: WatchedEvent state:SyncConnected type:NodeDataChanged path:/clusterstate.json, has occurred - updating... (live nodes size: 5)
[junit4:junit4]   2> 14537 T3060 oasc.SolrConfig.<init> Using Lucene MatchVersion: LUCENE_50
[junit4:junit4]   2> 14537 T3000 oascc.ZkStateReader$2.process A cluster state change: WatchedEvent state:SyncConnected type:NodeDataChanged path:/clusterstate.json, has occurred - updating... (live nodes size: 5)
[junit4:junit4]   2> 14537 T3059 oascc.ZkStateReader$2.process A cluster state change: WatchedEvent state:SyncConnected type:NodeDataChanged path:/clusterstate.json, has occurred - updating... (live nodes size: 5)
[junit4:junit4]   2> 14537 T2994 oascc.ZkStateReader$2.process A cluster state change: WatchedEvent state:SyncConnected type:NodeDataChanged path:/clusterstate.json, has occurred - updating... (live nodes size: 5)
[junit4:junit4]   2> 14609 T3060 oasc.SolrConfig.<init> Loaded SolrConfig: solrconfig.xml
[junit4:junit4]   2> 14710 T3060 oass.IndexSchema.readSchema Reading Solr Schema
[junit4:junit4]   2> 14716 T3060 oass.IndexSchema.readSchema Schema name=test
[junit4:junit4]   2> 15327 T3060 oass.OpenExchangeRatesOrgProvider.init Initialized with rates=open-exchange-rates.json, refreshInterval=1440.
[junit4:junit4]   2> 15336 T3060 oass.IndexSchema.readSchema default search field in schema is text
[junit4:junit4]   2> 15339 T3060 oass.IndexSchema.readSchema unique key field: id
[junit4:junit4]   2> 15349 T3060 oass.FileExchangeRateProvider.reload Reloading exchange rates from file currency.xml
[junit4:junit4]   2> 15353 T3060 oass.FileExchangeRateProvider.reload Reloading exchange rates from file currency.xml
[junit4:junit4]   2> 15356 T3060 oass.OpenExchangeRatesOrgProvider.reload Reloading exchange rates from open-exchange-rates.json
[junit4:junit4]   2> 15357 T3060 oass.OpenExchangeRatesOrgProvider.reload Reloading exchange rates from open-exchange-rates.json
[junit4:junit4]   2> 15358 T3060 oasc.SolrCore.<init> [collection1] Opening new SolrCore at /usr/home/hudson/hudson-slave/workspace/Lucene-Solr-Tests-trunk-java7/solr/build/solr-core/test/J1/./org.apache.solr.cloud.CollectionsAPIDistributedZkTest-jetty4-1357122795848/collection1/, dataDir=./org.apache.solr.cloud.CollectionsAPIDistributedZkTest-1357122781917/jetty4/
[junit4:junit4]   2> 15358 T3060 oasc.JmxMonitoredMap.<init> JMX monitoring is enabled. Adding Solr mbeans to JMX Server: com.sun.jmx.mbeanserver.JmxMBeanServer@1f936f80
[junit4:junit4]   2> 15359 T3060 oasc.SolrCore.initDirectoryFactory solr.NRTCachingDirectoryFactory
[junit4:junit4]   2> 15359 T3060 oasc.CachingDirectoryFactory.get return new directory for /usr/home/hudson/hudson-slave/workspace/Lucene-Solr-Tests-trunk-java7/solr/build/solr-core/test/J1/./org.apache.solr.cloud.CollectionsAPIDistributedZkTest-1357122781917/jetty4 forceNew:false
[junit4:junit4]   2> 15360 T3060 oasc.CachingDirectoryFactory.close Releasing directory:/usr/home/hudson/hudson-slave/workspace/Lucene-Solr-Tests-trunk-java7/solr/build/solr-core/test/J1/./org.apache.solr.cloud.CollectionsAPIDistributedZkTest-1357122781917/jetty4
[junit4:junit4]   2> 15360 T3060 oasc.SolrCore.getNewIndexDir New index directory detected: old=null new=./org.apache.solr.cloud.CollectionsAPIDistributedZkTest-1357122781917/jetty4/index/
[junit4:junit4]   2> 15360 T3060 oasc.SolrCore.initIndex WARNING [collection1] Solr index directory './org.apache.solr.cloud.CollectionsAPIDistributedZkTest-1357122781917/jetty4/index' doesn't exist. Creating new index...
[junit4:junit4]   2> 15361 T3060 oasc.CachingDirectoryFactory.get return new directory for /usr/home/hudson/hudson-slave/workspace/Lucene-Solr-Tests-trunk-java7/solr/build/solr-core/test/J1/./org.apache.solr.cloud.CollectionsAPIDistributedZkTest-1357122781917/jetty4/index forceNew:false
[junit4:junit4]   2> 15365 T3060 oasc.SolrDeletionPolicy.onCommit SolrDeletionPolicy.onCommit: commits:num=1
[junit4:junit4]   2> 		commit{dir=RateLimitedDirectoryWrapper(NRTCachingDirectory(org.apache.lucene.store.NIOFSDirectory@/usr/home/hudson/hudson-slave/workspace/Lucene-Solr-Tests-trunk-java7/solr/build/solr-core/test/J1/org.apache.solr.cloud.CollectionsAPIDistributedZkTest-1357122781917/jetty4/index lockFactory=org.apache.lucene.store.NativeFSLockFactory@3fcb80; maxCacheMB=48.0 maxMergeSizeMB=4.0)),segFN=segments_1,generation=1,filenames=[segments_1]
[junit4:junit4]   2> 15366 T3060 oasc.SolrDeletionPolicy.updateCommits newest commit = 1[segments_1]
[junit4:junit4]   2> 15366 T3060 oasc.CachingDirectoryFactory.close Releasing directory:/usr/home/hudson/hudson-slave/workspace/Lucene-Solr-Tests-trunk-java7/solr/build/solr-core/test/J1/./org.apache.solr.cloud.CollectionsAPIDistributedZkTest-1357122781917/jetty4/index
[junit4:junit4]   2> 15367 T3060 oasc.SolrCore.initWriters created xml: solr.XMLResponseWriter
[junit4:junit4]   2> 15368 T3060 oasup.UpdateRequestProcessorChain.init inserting DistributedUpdateProcessorFactory into updateRequestProcessorChain "dedupe"
[junit4:junit4]   2> 15368 T3060 oasup.UpdateRequestProcessorChain.init inserting DistributedUpdateProcessorFactory into updateRequestProcessorChain "dedupe-allfields"
[junit4:junit4]   2> 15368 T3060 oasup.UpdateRequestProcessorChain.init inserting DistributedUpdateProcessorFactory into updateRequestProcessorChain "stored_sig"
[junit4:junit4]   2> 15369 T3060 oasup.UpdateRequestProcessorChain.init inserting DistributedUpdateProcessorFactory into updateRequestProcessorChain "uniq-fields"
[junit4:junit4]   2> 15369 T3060 oasup.UpdateRequestProcessorChain.init inserting DistributedUpdateProcessorFactory into updateRequestProcessorChain "distrib-dup-test-chain-implicit"
[junit4:junit4]   2> 15369 T3060 oasc.RequestHandlers.initHandlersFromConfig adding lazy requestHandler: solr.ReplicationHandler
[junit4:junit4]   2> 15370 T3060 oasc.RequestHandlers.initHandlersFromConfig created /replication: solr.ReplicationHandler
[junit4:junit4]   2> 15370 T3060 oasc.RequestHandlers.initHandlersFromConfig created standard: solr.StandardRequestHandler
[junit4:junit4]   2> 15370 T3060 oasc.RequestHandlers.initHandlersFromConfig created /get: solr.RealTimeGetHandler
[junit4:junit4]   2> 15371 T3060 oasc.RequestHandlers.initHandlersFromConfig created dismax: solr.SearchHandler
[junit4:junit4]   2> 15371 T3060 oasc.RequestHandlers.initHandlersFromConfig created mock: org.apache.solr.core.MockQuerySenderListenerReqHandler
[junit4:junit4]   2> 15371 T3060 oasc.RequestHandlers.initHandlersFromConfig created /admin/: org.apache.solr.handler.admin.AdminHandlers
[junit4:junit4]   2> 15372 T3060 oasc.RequestHandlers.initHandlersFromConfig created defaults: solr.StandardRequestHandler
[junit4:junit4]   2> 15372 T3060 oasc.RequestHandlers.initHandlersFromConfig adding lazy requestHandler: solr.StandardRequestHandler
[junit4:junit4]   2> 15372 T3060 oasc.RequestHandlers.initHandlersFromConfig created lazy: solr.StandardRequestHandler
[junit4:junit4]   2> 15372 T3060 oasc.RequestHandlers.initHandlersFromConfig created /update: solr.UpdateRequestHandler
[junit4:junit4]   2> 15373 T3060 oasc.RequestHandlers.initHandlersFromConfig created /terms: org.apache.solr.handler.component.SearchHandler
[junit4:junit4]   2> 15373 T3060 oasc.RequestHandlers.initHandlersFromConfig created spellCheckCompRH: org.apache.solr.handler.component.SearchHandler
[junit4:junit4]   2> 15373 T3060 oasc.RequestHandlers.initHandlersFromConfig created spellCheckCompRH_Direct: org.apache.solr.handler.component.SearchHandler
[junit4:junit4]   2> 15374 T3060 oasc.RequestHandlers.initHandlersFromConfig created spellCheckWithWordbreak: org.apache.solr.handler.component.SearchHandler
[junit4:junit4]   2> 15374 T3060 oasc.RequestHandlers.initHandlersFromConfig created spellCheckWithWordbreak_Direct: org.apache.solr.handler.component.SearchHandler
[junit4:junit4]   2> 15374 T3060 oasc.RequestHandlers.initHandlersFromConfig created spellCheckCompRH1: org.apache.solr.handler.component.SearchHandler
[junit4:junit4]   2> 15375 T3060 oasc.RequestHandlers.initHandlersFromConfig created mltrh: org.apache.solr.handler.component.SearchHandler
[junit4:junit4]   2> 15375 T3060 oasc.RequestHandlers.initHandlersFromConfig created tvrh: org.apache.solr.handler.component.SearchHandler
[junit4:junit4]   2> 15375 T3060 oasc.RequestHandlers.initHandlersFromConfig created /mlt: solr.MoreLikeThisHandler
[junit4:junit4]   2> 15376 T3060 oasc.RequestHandlers.initHandlersFromConfig created /debug/dump: solr.DumpRequestHandler
[junit4:junit4]   2> 15384 T3060 oashl.XMLLoader.init xsltCacheLifetimeSeconds=60
[junit4:junit4]   2> 15387 T3060 oasc.SolrCore.initDeprecatedSupport WARNING solrconfig.xml uses deprecated <admin/gettableFiles>, Please update your config to use the ShowFileRequestHandler.
[junit4:junit4]   2> 15388 T3060 oasc.SolrCore.initDeprecatedSupport WARNING adding ShowFileRequestHandler with hidden files: [SCHEMA.XML, OLD_SYNONYMS.TXT, STOPWORDS.TXT, PROTWORDS.TXT, OPEN-EXCHANGE-RATES.JSON, SYNONYMS.TXT, CURRENCY.XML, MAPPING-ISOLATIN1ACCENT.TXT]
[junit4:junit4]   2> 15390 T3060 oasc.CachingDirectoryFactory.close Releasing directory:/usr/home/hudson/hudson-slave/workspace/Lucene-Solr-Tests-trunk-java7/solr/build/solr-core/test/J1/./org.apache.solr.cloud.CollectionsAPIDistributedZkTest-1357122781917/jetty4
[junit4:junit4]   2> 15391 T3060 oass.SolrIndexSearcher.<init> Opening Searcher@59bb6c6c main
[junit4:junit4]   2> 15391 T3060 oasu.CommitTracker.<init> Hard AutoCommit: disabled
[junit4:junit4]   2> 15392 T3060 oasu.CommitTracker.<init> Soft AutoCommit: disabled
[junit4:junit4]   2> 15392 T3060 oashc.SpellCheckComponent.inform Initializing spell checkers
[junit4:junit4]   2> 15408 T3060 oass.DirectSolrSpellChecker.init init: {name=direct,classname=DirectSolrSpellChecker,field=lowerfilt,minQueryLength=3}
[junit4:junit4]   2> 15453 T3061 oasc.SolrCore.registerSearcher [collection1] Registered new searcher Searcher@59bb6c6c main{StandardDirectoryReader(segments_1:1)}
[junit4:junit4]   2> 15456 T3060 oasc.ZkController.publish publishing core=collection1 state=down
[junit4:junit4]   2> 15456 T3060 oasc.ZkController.publish numShards not found on descriptor - reading it from system property
[junit4:junit4]   2> 16041 T2995 oascc.ZkStateReader.updateClusterState Updating cloud state from ZooKeeper... 
[junit4:junit4]   2> 16041 T2995 oasc.Overseer$ClusterStateUpdater.updateState Update state numShards=2 message={
[junit4:junit4]   2> 	  "operation":"state",
[junit4:junit4]   2> 	  "numShards":"2",
[junit4:junit4]   2> 	  "shard":null,
[junit4:junit4]   2> 	  "roles":null,
[junit4:junit4]   2> 	  "state":"down",
[junit4:junit4]   2> 	  "core":"collection1",
[junit4:junit4]   2> 	  "collection":"collection1",
[junit4:junit4]   2> 	  "node_name":"127.0.0.1:28911_",
[junit4:junit4]   2> 	  "base_url":"http://127.0.0.1:28911"}
[junit4:junit4]   2> 16042 T2995 oasc.Overseer$ClusterStateUpdater.updateState Collection already exists with numShards=2
[junit4:junit4]   2> 16042 T2995 oasc.Overseer$ClusterStateUpdater.updateState Assigning new node to shard shard=shard2
[junit4:junit4]   2> 16046 T3059 oascc.ZkStateReader$2.process A cluster state change: WatchedEvent state:SyncConnected type:NodeDataChanged path:/clusterstate.json, has occurred - updating... (live nodes size: 5)
[junit4:junit4]   2> 16046 T3000 oascc.ZkStateReader$2.process A cluster state change: WatchedEvent state:SyncConnected type:NodeDataChanged path:/clusterstate.json, has occurred - updating... (live nodes size: 5)
[junit4:junit4]   2> 16046 T3013 oascc.ZkStateReader$2.process A cluster state change: WatchedEvent state:SyncConnected type:NodeDataChanged path:/clusterstate.json, has occurred - updating... (live nodes size: 5)
[junit4:junit4]   2> 16046 T3043 oascc.ZkStateReader$2.process A cluster state change: WatchedEvent state:SyncConnected type:NodeDataChanged path:/clusterstate.json, has occurred - updating... (live nodes size: 5)
[junit4:junit4]   2> 16046 T2994 oascc.ZkStateReader$2.process A cluster state change: WatchedEvent state:SyncConnected type:NodeDataChanged path:/clusterstate.json, has occurred - updating... (live nodes size: 5)
[junit4:junit4]   2> 16046 T3028 oascc.ZkStateReader$2.process A cluster state change: WatchedEvent state:SyncConnected type:NodeDataChanged path:/clusterstate.json, has occurred - updating... (live nodes size: 5)
[junit4:junit4]   2> 16458 T3060 oasc.CoreContainer.registerCore registering core: collection1
[junit4:junit4]   2> 16458 T3060 oasc.ZkController.register Register replica - core:collection1 address:http://127.0.0.1:28911 collection:collection1 shard:shard2
[junit4:junit4]   2> 16461 T3060 oasc.ZkController.register We are http://127.0.0.1:28911/collection1/ and leader is http://127.0.0.1:28898/collection1/
[junit4:junit4]   2> 16461 T3060 oasc.ZkController.register No LogReplay needed for core=collection1 baseURL=http://127.0.0.1:28911
[junit4:junit4]   2> 16462 T3060 oasc.ZkController.checkRecovery Core needs to recover:collection1
[junit4:junit4]   2> 16462 T3060 oasu.DefaultSolrCoreState.doRecovery Running recovery - first canceling any ongoing recovery
[junit4:junit4]   2> ASYNC  NEW_CORE C195 name=collection1 org.apache.solr.core.SolrCore@5c6cf169 url=http://127.0.0.1:28911/collection1 node=127.0.0.1:28911_ C195_STATE=coll:collection1 core:collection1 props:{shard=null, roles=null, state=down, core=collection1, collection=collection1, node_name=127.0.0.1:28911_, base_url=http://127.0.0.1:28911}
[junit4:junit4]   2> 16462 T3062 C195 P28911 oasc.RecoveryStrategy.run Starting recovery process.  core=collection1 recoveringAfterStartup=true
[junit4:junit4]   2> 16463 T3060 oascc.ZkStateReader.updateClusterState Updating cloud state from ZooKeeper... 
[junit4:junit4]   2> 16463 T3062 C195 P28911 oasc.RecoveryStrategy.doRecovery ###### startupVersions=[]
[junit4:junit4]   2> 16464 T3062 C195 P28911 oasc.ZkController.publish publishing core=collection1 state=recovering
[junit4:junit4]   2> 16464 T3062 C195 P28911 oasc.ZkController.publish numShards not found on descriptor - reading it from system property
[junit4:junit4]   2> 16464 T2972 oass.SolrDispatchFilter.init user.dir=/usr/home/hudson/hudson-slave/workspace/Lucene-Solr-Tests-trunk-java7/solr/build/solr-core/test/J1
[junit4:junit4]   2> 16465 T2972 oass.SolrDispatchFilter.init SolrDispatchFilter.init() done
[junit4:junit4]   2> 16465 T3062 C195 P28911 oascsi.HttpClientUtil.createClient Creating new http client, config:maxConnections=128&maxConnectionsPerHost=32&followRedirects=false
[junit4:junit4]   2> 16465 T2972 oascsi.HttpClientUtil.createClient Creating new http client, config:maxConnections=128&maxConnectionsPerHost=32&followRedirects=false
[junit4:junit4]   2> 16481 T2972 oascc.ZkStateReader.updateClusterState Updating cloud state from ZooKeeper... 
[junit4:junit4]   2> 16483 T2972 oasc.AbstractDistribZkTestBase.waitForRecoveriesToFinish Wait for recoveries to finish - collection: collection1 failOnTimeout:true timeout (sec):230
[junit4:junit4]   2> 16483 T2972 oascc.ZkStateReader.updateClusterState Updating cloud state from ZooKeeper... 
[junit4:junit4]   2>  C194_STATE=coll:collection1 core:collection1 props:{shard=shard1, roles=null, state=recovering, core=collection1, collection=collection1, node_name=127.0.0.1:28904_, base_url=http://127.0.0.1:28904}
[junit4:junit4]   2> 16939 T3046 C194 P28904 oasc.RecoveryStrategy.doRecovery Attempting to PeerSync from http://127.0.0.1:28891/collection1/ core=collection1 - recoveringAfterStartup=true
[junit4:junit4]   2> 16939 T3046 C194 P28904 oasu.PeerSync.sync PeerSync: core=collection1 url=http://127.0.0.1:28904 START replicas=[http://127.0.0.1:28891/collection1/] nUpdates=100
[junit4:junit4]   2> 16940 T3046 C194 P28904 oasu.PeerSync.sync WARNING no frame of reference to tell of we've missed updates
[junit4:junit4]   2> 16940 T3046 C194 P28904 oasc.RecoveryStrategy.doRecovery PeerSync Recovery was not successful - trying replication. core=collection1
[junit4:junit4]   2> 16940 T3046 C194 P28904 oasc.RecoveryStrategy.doRecovery Starting Replication Recovery. core=collection1
[junit4:junit4]   2> 16940 T3046 C194 P28904 oasc.RecoveryStrategy.doRecovery Begin buffering updates. core=collection1
[junit4:junit4]   2> 16941 T3046 C194 P28904 oasu.UpdateLog.bufferUpdates Starting to buffer updates. FSUpdateLog{state=ACTIVE, tlog=null}
[junit4:junit4]   2> 16941 T3046 C194 P28904 oasc.RecoveryStrategy.replicate Attempting to replicate from http://127.0.0.1:28891/collection1/. core=collection1
[junit4:junit4]   2> 16941 T3046 C194 P28904 oascsi.HttpClientUtil.createClient Creating new http client, config:maxConnections=128&maxConnectionsPerHost=32&followRedirects=false
[junit4:junit4]   2> ASYNC  NEW_CORE C196 name=collection1 org.apache.solr.core.SolrCore@72e066f5 url=http://127.0.0.1:28891/collection1 node=127.0.0.1:28891_ C196_STATE=coll:collection1 core:collection1 props:{shard=shard1, roles=null, state=active, core=collection1, collection=collection1, node_name=127.0.0.1:28891_, base_url=http://127.0.0.1:28891, leader=true}
[junit4:junit4]   2> 16951 T3004 C196 P28891 REQ /get {distrib=false&qt=/get&wt=javabin&version=2&getVersions=100} status=0 QTime=1 
[junit4:junit4]   2> 16953 T3005 C196 P28891 oasu.DirectUpdateHandler2.commit start commit{flags=0,_version_=0,optimize=false,openSearcher=false,waitSearcher=true,expungeDeletes=false,softCommit=false}
[junit4:junit4]   2> 16954 T3005 C196 P28891 oasc.CachingDirectoryFactory.close Releasing directory:/usr/home/hudson/hudson-slave/workspace/Lucene-Solr-Tests-trunk-java7/solr/build/solr-core/test/J1/./org.apache.solr.cloud.CollectionsAPIDistributedZkTest-1357122781917/jetty1
[junit4:junit4]   2> 16959 T3005 C196 P28891 oasc.SolrDeletionPolicy.onInit SolrDeletionPolicy.onInit: commits:num=1
[junit4:junit4]   2> 		commit{dir=RateLimitedDirectoryWrapper(NRTCachingDirectory(org.apache.lucene.store.NIOFSDirectory@/usr/home/hudson/hudson-slave/workspace/Lucene-Solr-Tests-trunk-java7/solr/build/solr-core/test/J1/org.apache.solr.cloud.CollectionsAPIDistributedZkTest-1357122781917/jetty1/index lockFactory=org.apache.lucene.store.NativeFSLockFactory@136a17b3; maxCacheMB=48.0 maxMergeSizeMB=4.0)),segFN=segments_1,generation=1,filenames=[segments_1]
[junit4:junit4]   2> 16960 T3005 C196 P28891 oasc.SolrDeletionPolicy.updateCommits newest commit = 1[segments_1]
[junit4:junit4]   2> 16964 T3005 C196 P28891 oasc.SolrDeletionPolicy.onCommit SolrDeletionPolicy.onCommit: commits:num=2
[junit4:junit4]   2> 		commit{dir=RateLimitedDirectoryWrapper(NRTCachingDirectory(org.apache.lucene.store.NIOFSDirectory@/usr/home/hudson/hudson-slave/workspace/Lucene-Solr-Tests-trunk-java7/solr/build/solr-core/test/J1/org.apache.solr.cloud.CollectionsAPIDistributedZkTest-1357122781917/jetty1/index lockFactory=org.apache.lucene.store.NativeFSLockFactory@136a17b3; maxCacheMB=48.0 maxMergeSizeMB=4.0)),segFN=segments_1,generation=1,filenames=[segments_1]
[junit4:junit4]   2> 		commit{dir=RateLimitedDirectoryWrapper(NRTCachingDirectory(org.apache.lucene.store.NIOFSDirectory@/usr/home/hudson/hudson-slave/workspace/Lucene-Solr-Tests-trunk-java7/solr/build/solr-core/test/J1/org.apache.solr.cloud.CollectionsAPIDistributedZkTest-1357122781917/jetty1/index lockFactory=org.apache.lucene.store.NativeFSLockFactory@136a17b3; maxCacheMB=48.0 maxMergeSizeMB=4.0)),segFN=segments_2,generation=2,filenames=[segments_2]
[junit4:junit4]   2> 16965 T3005 C196 P28891 oasc.SolrDeletionPolicy.updateCommits newest commit = 2[segments_2]
[junit4:junit4]   2> 16966 T3005 C196 P28891 oasc.CachingDirectoryFactory.close Releasing directory:/usr/home/hudson/hudson-slave/workspace/Lucene-Solr-Tests-trunk-java7/solr/build/solr-core/test/J1/./org.apache.solr.cloud.CollectionsAPIDistributedZkTest-1357122781917/jetty1
[junit4:junit4]   2> 16967 T3005 C196 P28891 oass.SolrIndexSearcher.<init> Opening Searcher@390e8182 realtime
[junit4:junit4]   2> 16967 T3005 C196 P28891 oasu.DirectUpdateHandler2.commit end_commit_flush
[junit4:junit4]   2> 16967 T3005 C196 P28891 /update {waitSearcher=true&openSearcher=false&commit=true&commit_end_point=true&wt=javabin&softCommit=false&version=2} {commit=} 0 14
[junit4:junit4]   2> 16968 T3046 C194 P28904 oash.ReplicationHandler.inform Commits will be reserved for  10000
[junit4:junit4]   2> 16969 T3046 C194 P28904 oash.SnapPuller.<init>  No value set for 'pollInterval'. Timer Task not started.
[junit4:junit4]   2> 16971 T3006 C196 P28891 oash.ReplicationHandler.inform Commits will be reserved for  10000
[junit4:junit4]   2> 16971 T3006 C196 P28891 REQ /replication {command=indexversion&wt=javabin&qt=/replication&version=2} status=0 QTime=1 
[junit4:junit4]   2> 16972 T3046 C194 P28904 oash.SnapPuller.fetchLatestIndex Master's generation: 2
[junit4:junit4]   2> 16972 T3046 C194 P28904 oash.SnapPuller.fetchLatestIndex Slave's generation: 1
[junit4:junit4]   2> 16972 T3046 C194 P28904 oash.SnapPuller.fetchLatestIndex Starting replication process
[junit4:junit4]   2> 16974 T3006 C196 P28891 oasc.CachingDirectoryFactory.close Releasing directory:/usr/home/hudson/hudson-slave/workspace/Lucene-Solr-Tests-trunk-java7/solr/build/solr-core/test/J1/./org.apache.solr.cloud.CollectionsAPIDistributedZkTest-1357122781917/jetty1
[junit4:junit4]   2> 16975 T3006 C196 P28891 oasc.CachingDirectoryFactory.close Releasing directory:/usr/home/hudson/hudson-slave/workspace/Lucene-Solr-Tests-trunk-java7/solr/build/solr-core/test/J1/./org.apache.solr.cloud.CollectionsAPIDistributedZkTest-1357122781917/jetty1/index
[junit4:junit4]   2> 16976 T3006 C196 P28891 REQ /replication {command=filelist&generation=2&wt=javabin&qt=/replication&version=2} status=0 QTime=2 
[junit4:junit4]   2> 16976 T3046 C194 P28904 oash.SnapPuller.fetchLatestIndex Number of files in latest index in master: 1
[junit4:junit4]   2> 16978 T3046 C194 P28904 oasc.CachingDirectoryFactory.get return new directory for /usr/home/hudson/hudson-slave/workspace/Lucene-Solr-Tests-trunk-java7/solr/build/solr-core/test/J1/./org.apache.solr.cloud.CollectionsAPIDistributedZkTest-1357122781917/jetty3/index.20130102133318890 forceNew:false
[junit4:junit4]   2> 16978 T3046 C194 P28904 oasc.CachingDirectoryFactory.close Releasing directory:/usr/home/hudson/hudson-slave/workspace/Lucene-Solr-Tests-trunk-java7/solr/build/solr-core/test/J1/./org.apache.solr.cloud.CollectionsAPIDistributedZkTest-1357122781917/jetty3
[junit4:junit4]   2> 16979 T3046 C194 P28904 oash.SnapPuller.fetchLatestIndex Starting download to RateLimitedDirectoryWrapper(NRTCachingDirectory(org.apache.lucene.store.NIOFSDirectory@/usr/home/hudson/hudson-slave/workspace/Lucene-Solr-Tests-trunk-java7/solr/build/solr-core/test/J1/org.apache.solr.cloud.CollectionsAPIDistributedZkTest-1357122781917/jetty3/index.20130102133318890 lockFactory=org.apache.lucene.store.NativeFSLockFactory@34c653e3; maxCacheMB=48.0 maxMergeSizeMB=4.0)) fullCopy=true
[junit4:junit4]   2> 16982 T3006 C196 P28891 REQ /replication {file=segments_2&command=filecontent&checksum=true&generation=2&qt=/replication&wt=filestream} status=0 QTime=0 
[junit4:junit4]   2> 16983 T3046 C194 P28904 oasc.CachingDirectoryFactory.close Releasing directory:/usr/home/hudson/hudson-slave/workspace/Lucene-Solr-Tests-trunk-java7/solr/build/solr-core/test/J1/./org.apache.solr.cloud.CollectionsAPIDistributedZkTest-1357122781917/jetty3/index
[junit4:junit4]   2> 16984 T3046 C194 P28904 oash.SnapPuller.fetchLatestIndex Total time taken for download : 0 secs
[junit4:junit4]   2> 16984 T3046 C194 P28904 oash.SnapPuller.modifyIndexProps New index installed. Updating index properties... index=index.20130102133318890
[junit4:junit4]   2> 16986 T3046 C194 P28904 oasc.CachingDirectoryFactory.close Releasing directory:/usr/home/hudson/hudson-slave/workspace/Lucene-Solr-Tests-trunk-java7/solr/build/solr-core/test/J1/./org.apache.solr.cloud.CollectionsAPIDistributedZkTest-1357122781917/jetty3
[junit4:junit4]   2> 16986 T3046 C194 P28904 oasc.CachingDirectoryFactory.close Releasing directory:/usr/home/hudson/hudson-slave/workspace/Lucene-Solr-Tests-trunk-java7/solr/build/solr-core/test/J1/./org.apache.solr.cloud.CollectionsAPIDistributedZkTest-1357122781917/jetty3
[junit4:junit4]   2> 16987 T3046 C194 P28904 oasc.SolrCore.getNewIndexDir New index directory detected: old=./org.apache.solr.cloud.CollectionsAPIDistributedZkTest-1357122781917/jetty3/index/ new=./org.apache.solr.cloud.CollectionsAPIDistributedZkTest-1357122781917/jetty3/index.20130102133318890
[junit4:junit4]   2> 16990 T3046 C194 P28904 oasc.SolrDeletionPolicy.onInit SolrDeletionPolicy.onInit: commits:num=1
[junit4:junit4]   2> 		commit{dir=RateLimitedDirectoryWrapper(NRTCachingDirectory(org.apache.lucene.store.NIOFSDirectory@/usr/home/hudson/hudson-slave/workspace/Lucene-Solr-Tests-trunk-java7/solr/build/solr-core/test/J1/org.apache.solr.cloud.CollectionsAPIDistributedZkTest-1357122781917/jetty3/index.20130102133318890 lockFactory=org.apache.lucene.store.NativeFSLockFactory@34c653e3; maxCacheMB=48.0 maxMergeSizeMB=4.0)),segFN=segments_2,generation=2,filenames=[segments_2]
[junit4:junit4]   2> 16991 T3046 C194 P28904 oasc.SolrDeletionPolicy.updateCommits newest commit = 2[segments_2]
[junit4:junit4]   2> 16992 T3046 C194 P28904 oasc.CachingDirectoryFactory.close Releasing directory:/usr/home/hudson/hudson-slave/workspace/Lucene-Solr-Tests-trunk-java7/solr/build/solr-core/test/J1/./org.apache.solr.cloud.CollectionsAPIDistributedZkTest-1357122781917/jetty3
[junit4:junit4]   2> 16993 T3046 C194 P28904 oasu.DefaultSolrCoreState.newIndexWriter Creating new IndexWriter...
[junit4:junit4]   2> 16993 T3046 C194 P28904 oasu.DefaultSolrCoreState.newIndexWriter Waiting until IndexWriter is unused... core=collection1
[junit4:junit4]   2> 16993 T3046 C194 P28904 oasu.DefaultSolrCoreState.newIndexWriter Rollback old IndexWriter... core=collection1
[junit4:junit4]   2> 16994 T3046 C194 P28904 oasc.CachingDirectoryFactory.close Releasing directory:/usr/home/hudson/hudson-slave/workspace/Lucene-Solr-Tests-trunk-java7/solr/build/solr-core/test/J1/./org.apache.solr.cloud.CollectionsAPIDistributedZkTest-1357122781917/jetty3/index.20130102133318890
[junit4:junit4]   2> 16995 T3046 C194 P28904 oasc.CachingDirectoryFactory.close Releasing directory:/usr/home/hudson/hudson-slave/workspace/Lucene-Solr-Tests-trunk-java7/solr/build/solr-core/test/J1/./org.apache.solr.cloud.CollectionsAPIDistributedZkTest-1357122781917/jetty3
[junit4:junit4]   2> 16998 T3046 C194 P28904 oasc.SolrDeletionPolicy.onInit SolrDeletionPolicy.onInit: commits:num=1
[junit4:junit4]   2> 		commit{dir=RateLimitedDirectoryWrapper(NRTCachingDirectory(org.apache.lucene.store.NIOFSDirectory@/usr/home/hudson/hudson-slave/workspace/Lucene-Solr-Tests-trunk-java7/solr/build/solr-core/test/J1/org.apache.solr.cloud.CollectionsAPIDistributedZkTest-1357122781917/jetty3/index.20130102133318890 lockFactory=org.apache.lucene.store.NativeFSLockFactory@34c653e3; maxCacheMB=48.0 maxMergeSizeMB=4.0)),segFN=segments_2,generation=2,filenames=[segments_2]
[junit4:junit4]   2> 16999 T3046 C194 P28904 oasc.SolrDeletionPolicy.updateCommits newest commit = 2[segments_2]
[junit4:junit4]   2> 16999 T3046 C194 P28904 oasu.DefaultSolrCoreState.newIndexWriter New IndexWriter is ready to be used.
[junit4:junit4]   2> 16999 T3046 C194 P28904 oasc.CachingDirectoryFactory.close Releasing directory:/usr/home/hudson/hudson-slave/workspace/Lucene-Solr-Tests-trunk-java7/solr/build/solr-core/test/J1/./org.apache.solr.cloud.CollectionsAPIDistributedZkTest-1357122781917/jetty3
[junit4:junit4]   2> 17000 T3046 C194 P28904 oass.SolrIndexSearcher.<init> Opening Searcher@93eba6c main
[junit4:junit4]   2> 17002 T3045 oasc.SolrCore.registerSearcher [collection1] Registered new searcher Searcher@93eba6c main{StandardDirectoryReader(segments_2:1:nrt)}
[junit4:junit4]   2> 17002 T3045 oasc.CachingDirectoryFactory.close Releasing directory:/usr/home/hudson/hudson-slave/workspace/Lucene-Solr-Tests-trunk-java7/solr/build/solr-core/test/J1/./org.apache.solr.cloud.CollectionsAPIDistributedZkTest-1357122781917/jetty3/index
[junit4:junit4]   2> 17002 T3046 C194 P28904 oasu.DirectUpdateHandler2.commit start commit{flags=0,_version_=0,optimize=false,openSearcher=false,waitSearcher=false,expungeDeletes=false,softCommit=false}
[junit4:junit4]   2> 17006 T3046 C194 P28904 oasc.SolrDeletionPolicy.onCommit SolrDeletionPolicy.onCommit: commits:num=2
[junit4:junit4]   2> 		commit{dir=RateLimitedDirectoryWrapper(NRTCachingDirectory(org.apache.lucene.store.NIOFSDirectory@/usr/home/hudson/hudson-slave/workspace/Lucene-Solr-Tests-trunk-java7/solr/build/solr-core/test/J1/org.apache.solr.cloud.CollectionsAPIDistributedZkTest-1357122781917/jetty3/index.20130102133318890 lockFactory=org.apache.lucene.store.NativeFSLockFactory@34c653e3; maxCacheMB=48.0 maxMergeSizeMB=4.0)),segFN=segments_2,generation=2,filenames=[segments_2]
[junit4:junit4]   2> 		commit{dir=RateLimitedDirectoryWrapper(NRTCachingDirectory(org.apache.lucene.store.NIOFSDirectory@/usr/home/hudson/hudson-slave/workspace/Lucene-Solr-Tests-trunk-java7/solr/build/solr-core/test/J1/org.apache.solr.cloud.CollectionsAPIDistributedZkTest-1357122781917/jetty3/index.20130102133318890 lockFactory=org.apache.lucene.store.NativeFSLockFactory@34c653e3; maxCacheMB=48.0 maxMergeSizeMB=4.0)),segFN=segments_3,generation=3,filenames=[segments_3]
[junit4:junit4]   2> 17006 T3046 C194 P28904 oasc.SolrDeletionPolicy.updateCommits newest commit = 3[segments_3]
[junit4:junit4]   2> 17008 T3046 C194 P28904 oasc.CachingDirectoryFactory.close Releasing directory:/usr/home/hudson/hudson-slave/workspace/Lucene-Solr-Tests-trunk-java7/solr/build/solr-core/test/J1/./org.apache.solr.cloud.CollectionsAPIDistributedZkTest-1357122781917/jetty3
[junit4:junit4]   2> 17008 T3046 C194 P28904 oasu.DirectUpdateHandler2.commit end_commit_flush
[junit4:junit4]   2> 17008 T3046 C194 P28904 oasc.CachingDirectoryFactory.close Releasing directory:/usr/home/hudson/hudson-slave/workspace/Lucene-Solr-Tests-trunk-java7/solr/build/solr-core/test/J1/./org.apache.solr.cloud.CollectionsAPIDistributedZkTest-1357122781917/jetty3/index.20130102133318890
[junit4:junit4]   2> 17008 T3046 C194 P28904 oasc.CachingDirectoryFactory.close Releasing directory:/usr/home/hudson/hudson-slave/workspace/Lucene-Solr-Tests-trunk-java7/solr/build/solr-core/test/J1/./org.apache.solr.cloud.CollectionsAPIDistributedZkTest-1357122781917/jetty3/index
[junit4:junit4]   2> 17009 T3046 C194 P28904 oasc.RecoveryStrategy.replay No replay needed. core=collection1
[junit4:junit4]   2> 17009 T3046 C194 P28904 oasc.RecoveryStrategy.doRecovery Replication Recovery was successful - registering as Active. core=collection1
[junit4:junit4]   2> 17009 T3046 C194 P28904 oasc.ZkController.publish publishing core=collection1 state=active
[junit4:junit4]   2> 17009 T3046 C194 P28904 oasc.ZkController.publish numShards not found on descriptor - reading it from system property
[junit4:junit4]   2> 17011 T3046 C194 P28904 oasc.RecoveryStrategy.doRecovery Finished recovery process. core=collection1
[junit4:junit4]   2> 17485 T2972 oascc.ZkStateReader.updateClusterState Updating cloud state from ZooKeeper... 
[junit4:junit4]   2> 17558 T2995 oascc.ZkStateReader.updateClusterState Updating cloud state from ZooKeeper... 
[junit4:junit4]   2> 17559 T2995 oasc.Overseer$ClusterStateUpdater.updateState Update state numShards=2 message={
[junit4:junit4]   2> 	  "operation":"state",
[junit4:junit4]   2> 	  "numShards":"2",
[junit4:junit4]   2> 	  "shard":"shard2",
[junit4:junit4]   2> 	  "roles":null,
[junit4:junit4]   2> 	  "state":"recovering",
[junit4:junit4]   2> 	  "core":"collection1",
[junit4:junit4]   2> 	  "collection":"collection1",
[junit4:junit4]   2> 	  "node_name":"127.0.0.1:28911_",
[junit4:junit4]   2> 	  "base_url":"http://127.0.0.1:28911"}
[junit4:junit4]   2> 17562 T2995 oasc.Overseer$ClusterStateUpdater.updateState Update state numShards=2 message={
[junit4:junit4]   2> 	  "operation":"state",
[junit4:junit4]   2> 	  "numShards":"2",
[junit4:junit4]   2> 	  "shard":"shard1",
[junit4:junit4]   2> 	  "roles":null,
[junit4:junit4]   2> 	  "state":"active",
[junit4:junit4]   2> 	  "core":"collection1",
[junit4:junit4]   2> 	  "collection":"collection1",
[junit4:junit4]   2> 	  "node_name":"127.0.0.1:28904_",
[junit4:junit4]   2> 	  "base_url":"http://127.0.0.1:28904"}
[junit4:junit4]   2> 17565 T2994 oascc.ZkStateReader$2.process A cluster state change: WatchedEvent state:SyncConnected type:NodeDataChanged path:/clusterstate.json, has occurred - updating... (live nodes size: 5)
[junit4:junit4]   2> 17565 T3043 oascc.ZkStateReader$2.process A cluster state change: WatchedEvent state:SyncConnected type:NodeDataChanged path:/clusterstate.json, has occurred - updating... (live nodes size: 5)
[junit4:junit4]   2> 17565 T3028 oascc.ZkStateReader$2.process A cluster state change: WatchedEvent state:SyncConnected type:NodeDataChanged path:/clusterstate.json, has occurred - updating... (live nodes size: 5)
[junit4:junit4]   2> 17565 T3059 oascc.ZkStateReader$2.process A cluster state change: WatchedEvent state:SyncConnected type:NodeDataChanged path:/clusterstate.json, has occurred - updating... (live nodes size: 5)
[junit4:junit4]   2> 17565 T3000 oascc.ZkStateReader$2.process A cluster state change: WatchedEvent state:SyncConnected type:NodeDataChanged path:/clusterstate.json, has occurred - updating... (live nodes size: 5)
[junit4:junit4]   2> 17565 T3013 oascc.ZkStateReader$2.process A cluster state change: WatchedEvent state:SyncConnected type:NodeDataChanged path:/clusterstate.json, has occurred - updating... (live nodes size: 5)
[junit4:junit4]   2> 18487 T2972 oascc.ZkStateReader.updateClusterState Updating cloud state from ZooKeeper... 
[junit4:junit4]   2> 19489 T2972 oascc.ZkStateReader.updateClusterState Updating cloud state from ZooKeeper... 
[junit4:junit4]   2>  C195_STATE=coll:collection1 core:collection1 props:{shard=shard2, roles=null, state=recovering, core=collection1, collection=collection1, node_name=127.0.0.1:28911_, base_url=http://127.0.0.1:28911}
[junit4:junit4]   2> 20485 T3062 C195 P28911 oasc.RecoveryStrategy.doRecovery Attempting to PeerSync from http://127.0.0.1:28898/collection1/ core=collection1 - recoveringAfterStartup=true
[junit4:junit4]   2> 20485 T3062 C195 P28911 oasu.PeerSync.sync PeerSync: core=collection1 url=http://127.0.0.1:28911 START replicas=[http://127.0.0.1:28898/collection1/] nUpdates=100
[junit4:junit4]   2> 20486 T3062 C195 P28911 oasu.PeerSync.sync WARNING no frame of reference to tell of we've missed updates
[junit4:junit4]   2> 20486 T3062 C195 P28911 oasc.RecoveryStrategy.doRecovery PeerSync Recovery was not successful - trying replication. core=collection1
[junit4:junit4]   2> 20486 T3062 C195 P28911 oasc.RecoveryStrategy.doRecovery Starting Replication Recovery. core=collection1
[junit4:junit4]   2> 20486 T3062 C195 P28911 oasc.RecoveryStrategy.doRecovery Begin buffering updates. core=collection1
[junit4:junit4]   2> 20486 T3062 C195 P28911 oasu.UpdateLog.bufferUpdates Starting to buffer updates. FSUpdateLog{state=ACTIVE, tlog=null}
[junit4:junit4]   2> 20487 T3062 C195 P28911 oasc.RecoveryStrategy.replicate Attempting to replicate from http://127.0.0.1:28898/collection1/. core=collection1
[junit4:junit4]   2> 20487 T3062 C195 P28911 oascsi.HttpClientUtil.createClient Creating new http client, config:maxConnections=128&maxConnectionsPerHost=32&followRedirects=false
[junit4:junit4]   2> 20491 T2972 oascc.ZkStateReader.updateClusterState Updating cloud state from ZooKeeper... 
[junit4:junit4]   2> ASYNC  NEW_CORE C197 name=collection1 org.apache.solr.core.SolrCore@58ef67ff url=http://127.0.0.1:28898/collection1 node=127.0.0.1:28898_ C197_STATE=coll:collection1 core:collection1 props:{shard=shard2, roles=null, state=active, core=collection1, collection=collection1, node_name=127.0.0.1:28898_, base_url=http://127.0.0.1:28898, leader=true}
[junit4:junit4]   2> 20496 T3019 C197 P28898 REQ /get {distrib=false&qt=/get&wt=javabin&version=2&getVersions=100} status=0 QTime=0 
[junit4:junit4]   2> 20505 T3020 C197 P28898 oasu.DirectUpdateHandler2.commit start commit{flags=0,_version_=0,optimize=false,openSearcher=false,waitSearcher=true,expungeDeletes=false,softCommit=false}
[junit4:junit4]   2> 20506 T3020 C197 P28898 oasc.CachingDirectoryFactory.close Releasing directory:/usr/home/hudson/hudson-slave/workspace/Lucene-Solr-Tests-trunk-java7/solr/build/solr-core/test/J1/./org.apache.solr.cloud.CollectionsAPIDistributedZkTest-1357122781917/jetty2
[junit4:junit4]   2> 20510 T3020 C197 P28898 oasc.SolrDeletionPolicy.onInit SolrDeletionPolicy.onInit: commits:num=1
[junit4:junit4]   2> 		commit{dir=RateLimitedDirectoryWrapper(NRTCachingDirectory(org.apache.lucene.store.NIOFSDirectory@/usr/home/hudson/hudson-slave/workspace/Lucene-Solr-Tests-trunk-java7/solr/build/solr-core/test/J1/org.apache.solr.cloud.CollectionsAPIDistributedZkTest-1357122781917/jetty2/index lockFactory=org.apache.lucene.store.NativeFSLockFactory@15ac2323; maxCacheMB=48.0 maxMergeSizeMB=4.0)),segFN=segments_1,generation=1,filenames=[segments_1]
[junit4:junit4]   2> 20511 T3020 C197 P28898 oasc.SolrDeletionPolicy.updateCommits newest commit = 1[segments_1]
[junit4:junit4]   2> 20519 T3020 C197 P28898 oasc.SolrDeletionPolicy.onCommit SolrDeletionPolicy.onCommit: commits:num=2
[junit4:junit4]   2> 		commit{dir=RateLimitedDirectoryWrapper(NRTCachingDirectory(org.apache.lucene.store.NIOFSDirectory@/usr/home/hudson/hudson-slave/workspace/Lucene-Solr-Tests-trunk-java7/solr/build/solr-core/test/J1/org.apache.solr.cloud.CollectionsAPIDistributedZkTest-1357122781917/jetty2/index lockFactory=org.apache.lucene.store.NativeFSLockFactory@15ac2323; maxCacheMB=48.0 maxMergeSizeMB=4.0)),segFN=segments_1,generation=1,filenames=[segments_1]
[junit4:junit4]   2> 		commit{dir=RateLimitedDirectoryWrapper(NRTCachingDirectory(org.apache.lucene.store.NIOFSDirectory@/usr/home/hudson/hudson-slave/workspace/Lucene-Solr-Tests-trunk-java7/solr/build/solr-core/test/J1/org.apache.solr.cloud.CollectionsAPIDistributedZkTest-1357122781917/jetty2/index lockFactory=org.apache.lucene.store.NativeFSLockFactory@15ac2323; maxCacheMB=48.0 maxMergeSizeMB=4.0)),segFN=segments_2,generation=2,filenames=[segments_2]
[junit4:junit4]   2> 20520 T3020 C197 P28898 oasc.SolrDeletionPolicy.updateCommits newest commit = 2[segments_2]
[junit4:junit4]   2> 20521 T3020 C197 P28898 oasc.CachingDirectoryFactory.close Releasing directory:/usr/home/hudson/hudson-slave/workspace/Lucene-Solr-Tests-trunk-java7/solr/build/solr-core/test/J1/./org.apache.solr.cloud.CollectionsAPIDistributedZkTest-1357122781917/jetty2
[junit4:junit4]   2> 20522 T3020 C197 P28898 oass.SolrIndexSearcher.<init> Opening Searcher@20393951 realtime
[junit4:junit4]   2> 20523 T3020 C197 P28898 oasu.DirectUpdateHandler2.commit end_commit_flush
[junit4:junit4]   2> 20523 T3020 C197 P28898 /update {waitSearcher=true&openSearcher=false&commit=true&commit_end_point=true&wt=javabin&softCommit=false&version=2} {commit=} 0 19
[junit4:junit4]   2> 20524 T3062 C195 P28911 oash.ReplicationHandler.inform Commits will be reserved for  10000
[junit4:junit4]   2> 20525 T3062 C195 P28911 oash.SnapPuller.<init>  No value set for 'pollInterval'. Timer Task not started.
[junit4:junit4]   2> 20526 T3021 C197 P28898 oash.ReplicationHandler.inform Commits will be reserved for  10000
[junit4:junit4]   2> 20527 T3021 C197 P28898 REQ /replication {command=indexversion&wt=javabin&qt=/replication&version=2} status=0 QTime=1 
[junit4:junit4]   2> 20527 T3062 C195 P28911 oash.SnapPuller.fetchLatestIndex Master's generation: 2
[junit4:junit4]   2> 20528 T3062 C195 P28911 oash.SnapPuller.fetchLatestIndex Slave's generation: 1
[junit4:junit4]   2> 20528 T3062 C195 P28911 oash.SnapPuller.fetchLatestIndex Starting replication process
[junit4:junit4]   2> 20530 T3021 C197 P28898 oasc.CachingDirectoryFactory.close Releasing directory:/usr/home/hudson/hudson-slave/workspace/Lucene-Solr-Tests-trunk-java7/solr/build/solr-core/test/J1/./org.apache.solr.cloud.CollectionsAPIDistributedZkTest-1357122781917/jetty2
[junit4:junit4]   2> 20531 T3021 C197 P28898 oasc.CachingDirectoryFactory.close Releasing directory:/usr/home/hudson/hudson-slave/workspace/Lucene-Solr-Tests-trunk-java7/solr/build/solr-core/test/J1/./org.apache.solr.cloud.CollectionsAPIDistributedZkTest-1357122781917/jetty2/index
[junit4:junit4]   2> 20532 T3021 C197 P28898 REQ /replication {command=filelist&generation=2&wt=javabin&qt=/replication&version=2} status=0 QTime=2 
[junit4:junit4]   2> 20532 T3062 C195 P28911 oash.SnapPuller.fetchLatestIndex Number of files in latest index in master: 1
[junit4:junit4]   2> 20534 T3062 C195 P28911 oasc.CachingDirectoryFactory.get return new directory for /usr/home/hudson/hudson-slave/workspace/Lucene-Solr-Tests-trunk-java7/solr/build/solr-core/test/J1/./org.apache.solr.cloud.CollectionsAPIDistributedZkTest-1357122781917/jetty4/index.20130102133322446 forceNew:false
[junit4:junit4]   2> 20534 T3062 C195 P28911 oasc.CachingDirectoryFactory.close Releasing directory:/usr/home/hudson/hudson-slave/workspace/Lucene-Solr-Tests-trunk-java7/solr/build/solr-core/test/J1/./org.apache.solr.cloud.CollectionsAPIDistributedZkTest-1357122781917/jetty4
[junit4:junit4]   2> 20535 T3062 C195 P28911 oash.SnapPuller.fetchLatestIndex Starting download to RateLimitedDirectoryWrapper(NRTCachingDirectory(org.apache.lucene.store.NIOFSDirectory@/usr/home/hudson/hudson-slave/workspace/Lucene-Solr-Tests-trunk-java7/solr/build/solr-core/test/J1/org.apache.solr.cloud.CollectionsAPIDistributedZkTest-1357122781917/jetty4/index.20130102133322446 lockFactory=org.apache.lucene.store.NativeFSLockFactory@131dff0d; maxCacheMB=48.0 maxMergeSizeMB=4.0)) fullCopy=true
[junit4:junit4]   2> 20538 T3021 C197 P28898 REQ /replication {file=segments_2&command=filecontent&checksum=true&generation=2&qt=/replication&wt=filestream} status=0 QTime=0 
[junit4:junit4]   2> 20539 T3062 C195 P28911 oasc.CachingDirectoryFactory.close Releasing directory:/usr/home/hudson/hudson-slave/workspace/Lucene-Solr-Tests-trunk-java7/solr/build/solr-core/test/J1/./org.apache.solr.cloud.CollectionsAPIDistributedZkTest-1357122781917/jetty4/index
[junit4:junit4]   2> 20540 T3062 C195 P28911 oash.SnapPuller.fetchLatestIndex Total time taken for download : 0 secs
[junit4:junit4]   2> 20540 T3062 C195 P28911 oash.SnapPuller.modifyIndexProps New index installed. Updating index properties... index=index.20130102133322446
[junit4:junit4]   2> 20541 T3062 C195 P28911 oasc.CachingDirectoryFactory.close Releasing directory:/usr/home/hudson/hudson-slave/workspace/Lucene-Solr-Tests-trunk-java7/solr/build/solr-core/test/J1/./org.apache.solr.cloud.CollectionsAPIDistributedZkTest-1357122781917/jetty4
[junit4:junit4]   2> 20542 T3062 C195 P28911 oasc.CachingDirectoryFactory.close Releasing directory:/usr/home/hudson/hudson-slave/workspace/Lucene-Solr-Tests-trunk-java7/solr/build/solr-core/test/J1/./org.apache.solr.cloud.CollectionsAPIDistributedZkTest-1357122781917/jetty4
[junit4:junit4]   2> 20542 T3062 C195 P28911 oasc.SolrCore.getNewIndexDir New index directory detected: old=./org.apache.solr.cloud.CollectionsAPIDistributedZkTest-1357122781917/jetty4/index/ new=./org.apache.solr.cloud.CollectionsAPIDistributedZkTest-1357122781917/jetty4/index.20130102133322446
[junit4:junit4]   2> 20546 T3062 C195 P28911 oasc.SolrDeletionPolicy.onInit SolrDeletionPolicy.onInit: commits:num=1
[junit4:junit4]   2> 		commit{dir=RateLimitedDirectoryWrapper(NRTCachingDirectory(org.apache.lucene.store.NIOFSDirectory@/usr/home/hudson/hudson-slave/workspace/Lucene-Solr-Tests-trunk-java7/solr/build/solr-core/test/J1/org.apache.solr.cloud.CollectionsAPIDistributedZkTest-1357122781917/jetty4/index.20130102133322446 lockFactory=org.apache.lucene.store.NativeFSLockFactory@131dff0d; maxCacheMB=48.0 maxMergeSizeMB=4.0)),segFN=segments_2,generation=2,filenames=[segments_2]
[junit4:junit4]   2> 20546 T3062 C195 P28911 oasc.SolrDeletionPolicy.updateCommits newest commit = 2[segments_2]
[junit4:junit4]   2> 20548 T3062 C195 P28911 oasc.CachingDirectoryFactory.close Releasing directory:/usr/home/hudson/hudson-slave/workspace/Lucene-Solr-Tests-trunk-java7/solr/build/solr-core/test/J1/./org.apache.solr.cloud.CollectionsAPIDistributedZkTest-1357122781917/jetty4
[junit4:junit4]   2> 20548 T3062 C195 P28911 oasu.DefaultSolrCoreState.newIndexWriter Creating new IndexWriter...
[junit4:junit4]   2> 20548 T3062 C195 P28911 oasu.DefaultSolrCoreState.newIndexWriter Waiting until IndexWriter is unused... core=collection1
[junit4:junit4]   2> 20548 T3062 C195 P28911 oasu.DefaultSolrCoreState.newIndexWriter Rollback old IndexWriter... core=collection1
[junit4:junit4]   2> 20549 T3062 C195 P28911 oasc.CachingDirectoryFactory.close Releasing directory:/usr/home/hudson/hudson-slave/workspace/Lucene-Solr-Tests-trunk-java7/solr/build/solr-core/test/J1/./org.apache.solr.cloud.CollectionsAPIDistributedZkTest-1357122781917/jetty4/index.20130102133322446
[junit4:junit4]   2> 20550 T3062 C195 P28911 oasc.CachingDirectoryFactory.close Releasing directory:/usr/home/hudson/hudson-slave/workspace/Lucene-Solr-Tests-trunk-java7/solr/build/solr-core/test/J1/./org.apache.solr.cloud.CollectionsAPIDistributedZkTest-1357122781917/jetty4
[junit4:junit4]   2> 20553 T3062 C195 P28911 oasc.SolrDeletionPolicy.onInit SolrDeletionPolicy.onInit: commits:num=1
[junit4:junit4]   2> 		commit{dir=RateLimitedDirectoryWrapper(NRTCachingDirectory(org.apache.lucene.store.NIOFSDirectory@/usr/home/hudson/hudson-slave/workspace/Lucene-Solr-Tests-trunk-java7/solr/build/solr-core/test/J1/org.apache.solr.cloud.CollectionsAPIDistributedZkTest-1357122781917/jetty4/index.20130102133322446 lockFactory=org.apache.lucene.store.NativeFSLockFactory@131dff0d; maxCacheMB=48.0 maxMergeSizeMB=4.0)),segFN=segments_2,generation=2,filenames=[segments_2]
[junit4:junit4]   2> 20553 T3062 C195 P28911 oasc.SolrDeletionPolicy.updateCommits newest commit = 2[segments_2]
[junit4:junit4]   2> 20554 T3062 C195 P28911 oasu.DefaultSolrCoreState.newIndexWriter New IndexWriter is ready to be used.
[junit4:junit4]   2> 20554 T3062 C195 P28911 oasc.CachingDirectoryFactory.close Releasing directory:/usr/home/hudson/hudson-slave/workspace/Lucene-Solr-Tests-trunk-java7/solr/build/solr-core/test/J1/./org.apache.solr.cloud.CollectionsAPIDistributedZkTest-1357122781917/jetty4
[junit4:junit4]   2> 20554 T3062 C195 P28911 oass.SolrIndexSearcher.<init> Opening Searcher@763a2bfc main
[junit4:junit4]   2> 20556 T3061 oasc.SolrCore.registerSearcher [collection1] Registered new searcher Searcher@763a2bfc main{StandardDirectoryReader(segments_2:1:nrt)}
[junit4:junit4]   2> 20557 T3061 oasc.CachingDirectoryFactory.close Releasing directory:/usr/home/hudson/hudson-slave/workspace/Lucene-Solr-Tests-trunk-java7/solr/build/solr-core/test/J1/./org.apache.solr.cloud.CollectionsAPIDistributedZkTest-1357122781917/jetty4/index
[junit4:junit4]   2> 20557 T3062 C195 P28911 oasu.DirectUpdateHandler2.commit start commit{flags=0,_version_=0,optimize=false,openSearcher=false,waitSearcher=false,expungeDeletes=false,softCommit=false}
[junit4:junit4]   2> 20561 T3062 C195 P28911 oasc.SolrDeletionPolicy.onCommit SolrDeletionPolicy.onCommit: commits:num=2
[junit4:junit4]   2> 		commit{dir=RateLimitedDirectoryWrapper(NRTCachingDirectory(org.apache.lucene.store.NIOFSDirectory@/usr/home/hudson/hudson-slave/workspace/Lucene-Solr-Tests-trunk-java7/solr/build/solr-core/test/J1/org.apache.solr.cloud.CollectionsAPIDistributedZkTest-1357122781917/jetty4/index.20130102133322446 lockFactory=org.apache.lucene.store.NativeFSLockFactory@131dff0d; maxCacheMB=48.0 maxMergeSizeMB=4.0)),segFN=segments_2,generation=2,filenames=[segments_2]
[junit4:junit4]   2> 		commit{dir=RateLimitedDirectoryWrapper(NRTCachingDirectory(org.apache.lucene.store.NIOFSDirectory@/usr/home/hudson/hudson-slave/workspace/Lucene-Solr-Tests-trunk-java7/solr/build/solr-core/test/J1/org.apache.solr.cloud.CollectionsAPIDistributedZkTest-1357122781917/jetty4/index.20130102133322446 lockFactory=org.apache.lucene.store.NativeFSLockFactory@131dff0d; maxCacheMB=48.0 maxMergeSizeMB=4.0)),segFN=segments_3,generation=3,filenames=[segments_3]
[junit4:junit4]   2> 20561 T3062 C195 P28911 oasc.SolrDeletionPolicy.updateCommits newest commit = 3[segments_3]
[junit4:junit4]   2> 20562 T3062 C195 P28911 oasc.CachingDirectoryFactory.close Releasing directory:/usr/home/hudson/hudson-slave/workspace/Lucene-Solr-Tests-trunk-java7/solr/build/solr-core/test/J1/./org.apache.solr.cloud.CollectionsAPIDistributedZkTest-1357122781917/jetty4
[junit4:junit4]   2> 20563 T3062 C195 P28911 oasu.DirectUpdateHandler2.commit end_commit_flush
[junit4:junit4]   2> 20563 T3062 C195 P28911 oasc.CachingDirectoryFactory.close Releasing directory:/usr/home/hudson/hudson-slave/workspace/Lucene-Solr-Tests-trunk-java7/solr/build/solr-core/test/J1/./org.apache.solr.cloud.CollectionsAPIDistributedZkTest-1357122781917/jetty4/index.20130102133322446
[junit4:junit4]   2> 20563 T3062 C195 P28911 oasc.CachingDirectoryFactory.close Releasing directory:/usr/home/hudson/hudson-slave/workspace/Lucene-Solr-Tests-trunk-java7/solr/build/solr-core/test/J1/./org.apache.solr.cloud.CollectionsAPIDistributedZkTest-1357122781917/jetty4/index
[junit4:junit4]   2> 20563 T3062 C195 P28911 oasc.RecoveryStrategy.replay No replay needed. core=collection1
[junit4:junit4]   2> 20563 T3062 C195 P28911 oasc.RecoveryStrategy.doRecovery Replication Recovery was successful - registering as Active. core=collection1
[junit4:junit4]   2> 20564 T3062 C195 P28911 oasc.ZkController.publish publishing core=collection1 state=active
[junit4:junit4]   2> 20564 T3062 C195 P28911 oasc.ZkController.publish numShards not found on descriptor - reading it from system property
[junit4:junit4]   2> 20571 T3062 C195 P28911 oasc.RecoveryStrategy.doRecovery Finished recovery process. core=collection1
[junit4:junit4]   2> 20572 T2995 oascc.ZkStateReader.updateClusterState Updating cloud state from ZooKeeper... 
[junit4:junit4]   2> 20573 T2995 oasc.Overseer$ClusterStateUpdater.updateState Update state numShards=2 message={
[junit4:junit4]   2> 	  "operation":"state",
[junit4:junit4]   2> 	  "numShards":"2",
[junit4:junit4]   2> 	  "shard":"shard2",
[junit4:junit4]   2> 	  "roles":null,
[junit4:junit4]   2> 	  "state":"active",
[junit4:junit4]   2> 	  "core":"collection1",
[junit4:junit4]   2> 	  "collection":"collection1",
[junit4:junit4]   2> 	  "node_name":"127.0.0.1:28911_",
[junit4:junit4]   2> 	  "base_url":"http://127.0.0.1:28911"}
[junit4:junit4]   2> 20585 T3000 oascc.ZkStateReader$2.process A cluster state change: WatchedEvent state:SyncConnected type:NodeDataChanged path:/clusterstate.json, has occurred - updating... (live nodes size: 5)
[junit4:junit4]   2> 20585 T2994 oascc.ZkStateReader$2.process A cluster state change: WatchedEvent state:SyncConnected type:NodeDataChanged path:/clusterstate.json, has occurred - updating... (live nodes size: 5)
[junit4:junit4]   2> 20585 T3059 oascc.ZkStateReader$2.process A cluster state change: WatchedEvent state:SyncConnected type:NodeDataChanged path:/clusterstate.json, has occurred - updating... (live nodes size: 5)
[junit4:junit4]   2> 20585 T3043 oascc.ZkStateReader$2.process A cluster state change: WatchedEvent state:SyncConnected type:NodeDataChanged path:/clusterstate.json, has occurred - updating... (live nodes size: 5)
[junit4:junit4]   2> 20585 T3028 oascc.ZkStateReader$2.process A cluster state change: WatchedEvent state:SyncConnected type:NodeDataChanged path:/clusterstate.json, has occurred - updating... (live nodes size: 5)
[junit4:junit4]   2> 20585 T3013 oascc.ZkStateReader$2.process A cluster state change: WatchedEvent state:SyncConnected type:NodeDataChanged path:/clusterstate.json, has occurred - updating... (live nodes size: 5)
[junit4:junit4]   2> 21493 T2972 oascc.ZkStateReader.updateClusterState Updating cloud state from ZooKeeper... 
[junit4:junit4]   2> 21494 T2972 oasc.AbstractDistribZkTestBase.waitForRecoveriesToFinish Recoveries finished - collection: collection1
[junit4:junit4]   2> ASYNC  NEW_CORE C198 name=collection1 org.apache.solr.core.SolrCore@397dc723 url=http://127.0.0.1:28881/collection1 node=127.0.0.1:28881_ C198_STATE=coll:control_collection core:collection1 props:{shard=shard1, roles=null, state=active, core=collection1, collection=control_collection, node_name=127.0.0.1:28881_, base_url=http://1

[...truncated too long message...]

.junit.Assert.fail(Assert.java:93)
[junit4:junit4]    > 	at org.junit.Assert.assertTrue(Assert.java:43)
[junit4:junit4]    > 	at org.apache.solr.cloud.CollectionsAPIDistributedZkTest.testCollectionsAPI(CollectionsAPIDistributedZkTest.java:274)
[junit4:junit4]    > 	at org.apache.solr.cloud.CollectionsAPIDistributedZkTest.doTest(CollectionsAPIDistributedZkTest.java:152)
[junit4:junit4]    > 	at org.apache.solr.BaseDistributedSearchTestCase.testDistribSearch(BaseDistributedSearchTestCase.java:794)
[junit4:junit4]    > 	at sun.reflect.NativeMethodAccessorImpl.invoke0(Native Method)
[junit4:junit4]    > 	at sun.reflect.NativeMethodAccessorImpl.invoke(NativeMethodAccessorImpl.java:57)
[junit4:junit4]    > 	at sun.reflect.DelegatingMethodAccessorImpl.invoke(DelegatingMethodAccessorImpl.java:43)
[junit4:junit4]    > 	at java.lang.reflect.Method.invoke(Method.java:601)
[junit4:junit4]    > 	at com.carrotsearch.randomizedtesting.RandomizedRunner.invoke(RandomizedRunner.java:1559)
[junit4:junit4]    > 	at com.carrotsearch.randomizedtesting.RandomizedRunner.access$600(RandomizedRunner.java:79)
[junit4:junit4]    > 	at com.carrotsearch.randomizedtesting.RandomizedRunner$6.evaluate(RandomizedRunner.java:737)
[junit4:junit4]    > 	at com.carrotsearch.randomizedtesting.RandomizedRunner$7.evaluate(RandomizedRunner.java:773)
[junit4:junit4]    > 	at com.carrotsearch.randomizedtesting.RandomizedRunner$8.evaluate(RandomizedRunner.java:787)
[junit4:junit4]    > 	at com.carrotsearch.randomizedtesting.rules.SystemPropertiesRestoreRule$1.evaluate(SystemPropertiesRestoreRule.java:53)
[junit4:junit4]    > 	at org.apache.lucene.util.TestRuleSetupTeardownChained$1.evaluate(TestRuleSetupTeardownChained.java:50)
[junit4:junit4]    > 	at org.apache.lucene.util.TestRuleFieldCacheSanity$1.evaluate(TestRuleFieldCacheSanity.java:51)
[junit4:junit4]    > 	at org.apache.lucene.util.AbstractBeforeAfterRule$1.evaluate(AbstractBeforeAfterRule.java:46)
[junit4:junit4]    > 	at com.carrotsearch.randomizedtesting.rules.SystemPropertiesInvariantRule$1.evaluate(SystemPropertiesInvariantRule.java:55)
[junit4:junit4]    > 	at org.apache.lucene.util.TestRuleThreadAndTestName$1.evaluate(TestRuleThreadAndTestName.java:49)
[junit4:junit4]    > 	at org.apache.lucene.util.TestRuleIgnoreAfterMaxFailures$1.evaluate(TestRuleIgnoreAfterMaxFailures.java:70)
[junit4:junit4]    > 	at org.apache.lucene.util.TestRuleMarkFailure$1.evaluate(TestRuleMarkFailure.java:48)
[junit4:junit4]    > 	at com.carrotsearch.randomizedtesting.rules.StatementAdapter.evaluate(StatementAdapter.java:36)
[junit4:junit4]    > 	at com.carrotsearch.randomizedtesting.ThreadLeakControl$StatementRunner.run(ThreadLeakControl.java:358)
[junit4:junit4]    > 	at com.carrotsearch.randomizedtesting.ThreadLeakControl.forkTimeoutingTask(ThreadLeakControl.java:782)
[junit4:junit4]    > 	at com.carrotsearch.randomizedtesting.ThreadLeakControl$3.evaluate(ThreadLeakControl.java:442)
[junit4:junit4]    > 	at com.carrotsearch.randomizedtesting.RandomizedRunner.runSingleTest(RandomizedRunner.java:746)
[junit4:junit4]    > 	at com.carrotsearch.randomizedtesting.RandomizedRunner$3.evaluate(RandomizedRunner.java:648)
[junit4:junit4]    > 	at com.carrotsearch.randomizedtesting.RandomizedRunner$4.evaluate(RandomizedRunner.java:682)
[junit4:junit4]    > 	at com.carrotsearch.randomizedtesting.RandomizedRunner$5.evaluate(RandomizedRunner.java:693)
[junit4:junit4]    > 	at com.carrotsearch.randomizedtesting.rules.StatementAdapter.evaluate(StatementAdapter.java:36)
[junit4:junit4]    > 	at com.carrotsearch.randomizedtesting.rules.SystemPropertiesRestoreRule$1.evaluate(SystemPropertiesRestoreRule.java:53)
[junit4:junit4]    > 	at org.apache.lucene.util.AbstractBeforeAfterRule$1.evaluate(AbstractBeforeAfterRule.java:46)
[junit4:junit4]    > 	at org.apache.lucene.util.TestRuleStoreClassName$1.evaluate(TestRuleStoreClassName.java:42)
[junit4:junit4]    > 	at com.carrotsearch.randomizedtesting.rules.SystemPropertiesInvariantRule$1.evaluate(SystemPropertiesInvariantRule.java:55)
[junit4:junit4]    > 	at com.carrotsearch.randomizedtesting.rules.NoShadowingOrOverridesOnMethodsRule$1.evaluate(NoShadowingOrOverridesOnMethodsRule.java:39)
[junit4:junit4]    > 	at com.carrotsearch.randomizedtesting.rules.NoShadowingOrOverridesOnMethodsRule$1.evaluate(NoShadowingOrOverridesOnMethodsRule.java:39)
[junit4:junit4]    > 	at com.carrotsearch.randomizedtesting.rules.StatementAdapter.evaluate(StatementAdapter.java:36)
[junit4:junit4]    > 	at org.apache.lucene.util.TestRuleAssertionsRequired$1.evaluate(TestRuleAssertionsRequired.java:43)
[junit4:junit4]    > 	at org.apache.lucene.util.TestRuleMarkFailure$1.evaluate(TestRuleMarkFailure.java:48)
[junit4:junit4]    > 	at org.apache.lucene.util.TestRuleIgnoreAfterMaxFailures$1.evaluate(TestRuleIgnoreAfterMaxFailures.java:70)
[junit4:junit4]    > 	at org.apache.lucene.util.TestRuleIgnoreTestSuites$1.evaluate(TestRuleIgnoreTestSuites.java:55)
[junit4:junit4]    > 	at com.carrotsearch.randomizedtesting.rules.StatementAdapter.evaluate(StatementAdapter.java:36)
[junit4:junit4]    > 	at com.carrotsearch.randomizedtesting.ThreadLeakControl$StatementRunner.run(ThreadLeakControl.java:358)
[junit4:junit4]    > 	at java.lang.Thread.run(Thread.java:722)
[junit4:junit4]   2> 277266 T2972 oas.SolrTestCaseJ4.deleteCore ###deleteCore
[junit4:junit4]   2> NOTE: test params are: codec=Lucene41: {timestamp=MockFixedIntBlock(blockSize=727), range_facet_l=MockFixedIntBlock(blockSize=727), id=MockVariableIntBlock(baseBlockSize=71), range_facet_sl=PostingsFormat(name=MockSep), a_t=MockFixedIntBlock(blockSize=727), text=PostingsFormat(name=MockSep), range_facet_si=PostingsFormat(name=Asserting), _version_=MockFixedIntBlock(blockSize=727), other_tl1=MockFixedIntBlock(blockSize=727), multiDefault=PostingsFormat(name=Asserting), a_si=PostingsFormat(name=Asserting), intDefault=MockFixedIntBlock(blockSize=727)}, sim=RandomSimilarityProvider(queryNorm=false,coord=no): {}, locale=sq_AL, timezone=Etc/GMT-3
[junit4:junit4]   2> NOTE: FreeBSD 9.0-RELEASE amd64/Oracle Corporation 1.7.0_09 (64-bit)/cpus=16,threads=1,free=210924616,total=433061888
[junit4:junit4]   2> NOTE: All tests run in this JVM: [RAMDirectoryFactoryTest, TestRecovery, DOMUtilTest, XsltUpdateRequestHandlerTest, TestHashPartitioner, UpdateParamsTest, TestUtils, StatsComponentTest, IndexSchemaRuntimeFieldTest, TestSurroundQueryParser, SoftAutoCommitTest, SolrIndexConfigTest, TestValueSourceCache, IndexSchemaTest, BadIndexSchemaTest, TestPropInject, LukeRequestHandlerTest, SolrInfoMBeanTest, ShowFileRequestHandlerTest, TestUpdate, TestStressReorder, SynonymTokenizerTest, TestSolrCoreProperties, TestSolrDeletionPolicy1, ClusterStateTest, RequiredFieldsTest, TestJmxIntegration, ShardRoutingCustomTest, TestStressLucene, PeerSyncTest, DirectSolrSpellCheckerTest, LeaderElectionTest, BasicZkTest, SuggesterTSTTest, PrimitiveFieldTypeTest, DistributedQueryElevationComponentTest, SyncSliceTest, ZkNodePropsTest, TermVectorComponentTest, TestLazyCores, SolrCoreTest, TestPluginEnable, TestMultiCoreConfBootstrap, DebugComponentTest, TestRTGBase, SpellingQueryConverterTest, ConvertedLegacyTest, TestCharFilters, TestReload, BasicDistributedZk2Test, TimeZoneUtilsTest, UUIDFieldTest, TestArbitraryIndexDir, StatelessScriptUpdateProcessorFactoryTest, OverseerTest, FieldMutatingUpdateProcessorTest, MultiTermTest, TestLRUCache, TestAnalyzedSuggestions, RecoveryZkTest, SpellCheckComponentTest, FullSolrCloudDistribCmdsTest, TestReplicationHandler, DistributedSpellCheckComponentTest, TestDistributedGrouping, SpellCheckCollatorTest, ZkSolrClientTest, DistributedTermsComponentTest, DirectUpdateHandlerTest, TestSort, SortByFunctionTest, BasicFunctionalityTest, SignatureUpdateProcessorFactoryTest, TestBinaryResponseWriter, HighlighterTest, TestIndexSearcher, CoreAdminHandlerTest, TestFunctionQuery, TestTrie, DirectSolrConnectionTest, QueryEqualityTest, TestCSVLoader, PolyFieldTest, TestCSVResponseWriter, DocumentBuilderTest, DisMaxRequestHandlerTest, QueryParsingTest, DistanceFunctionTest, XmlUpdateRequestHandlerTest, PingRequestHandlerTest, DocumentAnalysisRequestHandlerTest, TestSolrQueryParser, TestReversedWildcardFilterFactory, ReturnFieldsTest, TestOmitPositions, TestQueryUtils, SolrCmdDistributorTest, TestLuceneMatchVersion, TestWriterPerf, TestBinaryField, TestSolrDeletionPolicy2, TestMergePolicyConfig, TestQuerySenderListener, TestQuerySenderNoQuery, NumericFieldsTest, OutputWriterTest, EchoParamsTest, TestBM25SimilarityFactory, TestLMDirichletSimilarityFactory, TestPerFieldSimilarity, TestDFRSimilarityFactory, URLClassifyProcessorTest, PrimUtilsTest, FileUtilsTest, TestSolrXMLSerializer, TestSuggestSpellingConverter, TestDocumentBuilder, CollectionsAPIDistributedZkTest]
[junit4:junit4] Completed on J1 in 277.29s, 1 test, 1 failure <<< FAILURES!

[...truncated 10 lines...]
BUILD FAILED
/usr/home/hudson/hudson-slave/workspace/Lucene-Solr-Tests-trunk-java7/build.xml:353: The following error occurred while executing this line:
/usr/home/hudson/hudson-slave/workspace/Lucene-Solr-Tests-trunk-java7/build.xml:39: The following error occurred while executing this line:
/usr/home/hudson/hudson-slave/workspace/Lucene-Solr-Tests-trunk-java7/solr/build.xml:178: The following error occurred while executing this line:
/usr/home/hudson/hudson-slave/workspace/Lucene-Solr-Tests-trunk-java7/solr/common-build.xml:438: The following error occurred while executing this line:
/usr/home/hudson/hudson-slave/workspace/Lucene-Solr-Tests-trunk-java7/lucene/common-build.xml:1176: The following error occurred while executing this line:
/usr/home/hudson/hudson-slave/workspace/Lucene-Solr-Tests-trunk-java7/lucene/common-build.xml:841: There were test failures: 245 suites, 1012 tests, 1 failure, 23 ignored (5 assumptions)

Total time: 37 minutes 41 seconds
Build step 'Invoke Ant' marked build as failure
Archiving artifacts
Recording test results
Email was triggered for: Failure
Sending email for trigger: Failure



Mime
View raw message