lucene-dev mailing list archives

Site index · List index
Message view « Date » · « Thread »
Top « Date » · « Thread »
From Policeman Jenkins Server <jenk...@thetaphi.de>
Subject [JENKINS] Lucene-Solr-4.x-MacOSX (64bit/jdk1.7.0) - Build # 89 - Failure!
Date Fri, 18 Jan 2013 13:11:24 GMT
Build: http://jenkins.thetaphi.de/job/Lucene-Solr-4.x-MacOSX/89/
Java: 64bit/jdk1.7.0 -XX:+UseG1GC

1 tests failed.
REGRESSION:  org.apache.solr.cloud.BasicDistributedZkTest.testDistribSearch

Error Message:
There are still nodes recoverying - waited for 230 seconds

Stack Trace:
java.lang.AssertionError: There are still nodes recoverying - waited for 230 seconds
	at __randomizedtesting.SeedInfo.seed([C43149EDEFD65A9:8DA59A86A9A20595]:0)
	at org.junit.Assert.fail(Assert.java:93)
	at org.apache.solr.cloud.AbstractDistribZkTestBase.waitForRecoveriesToFinish(AbstractDistribZkTestBase.java:168)
	at org.apache.solr.cloud.AbstractDistribZkTestBase.waitForRecoveriesToFinish(AbstractDistribZkTestBase.java:126)
	at org.apache.solr.cloud.AbstractDistribZkTestBase.waitForRecoveriesToFinish(AbstractDistribZkTestBase.java:121)
	at org.apache.solr.cloud.BasicDistributedZkTest.testCoreUnloadAndLeaders(BasicDistributedZkTest.java:586)
	at org.apache.solr.cloud.BasicDistributedZkTest.doTest(BasicDistributedZkTest.java:337)
	at org.apache.solr.BaseDistributedSearchTestCase.testDistribSearch(BaseDistributedSearchTestCase.java:794)
	at sun.reflect.NativeMethodAccessorImpl.invoke0(Native Method)
	at sun.reflect.NativeMethodAccessorImpl.invoke(NativeMethodAccessorImpl.java:57)
	at sun.reflect.DelegatingMethodAccessorImpl.invoke(DelegatingMethodAccessorImpl.java:43)
	at java.lang.reflect.Method.invoke(Method.java:601)
	at com.carrotsearch.randomizedtesting.RandomizedRunner.invoke(RandomizedRunner.java:1559)
	at com.carrotsearch.randomizedtesting.RandomizedRunner.access$600(RandomizedRunner.java:79)
	at com.carrotsearch.randomizedtesting.RandomizedRunner$6.evaluate(RandomizedRunner.java:737)
	at com.carrotsearch.randomizedtesting.RandomizedRunner$7.evaluate(RandomizedRunner.java:773)
	at com.carrotsearch.randomizedtesting.RandomizedRunner$8.evaluate(RandomizedRunner.java:787)
	at com.carrotsearch.randomizedtesting.rules.SystemPropertiesRestoreRule$1.evaluate(SystemPropertiesRestoreRule.java:53)
	at org.apache.lucene.util.TestRuleSetupTeardownChained$1.evaluate(TestRuleSetupTeardownChained.java:50)
	at org.apache.lucene.util.TestRuleFieldCacheSanity$1.evaluate(TestRuleFieldCacheSanity.java:51)
	at org.apache.lucene.util.AbstractBeforeAfterRule$1.evaluate(AbstractBeforeAfterRule.java:46)
	at com.carrotsearch.randomizedtesting.rules.SystemPropertiesInvariantRule$1.evaluate(SystemPropertiesInvariantRule.java:55)
	at org.apache.lucene.util.TestRuleThreadAndTestName$1.evaluate(TestRuleThreadAndTestName.java:49)
	at org.apache.lucene.util.TestRuleIgnoreAfterMaxFailures$1.evaluate(TestRuleIgnoreAfterMaxFailures.java:70)
	at org.apache.lucene.util.TestRuleMarkFailure$1.evaluate(TestRuleMarkFailure.java:48)
	at com.carrotsearch.randomizedtesting.rules.StatementAdapter.evaluate(StatementAdapter.java:36)
	at com.carrotsearch.randomizedtesting.ThreadLeakControl$StatementRunner.run(ThreadLeakControl.java:358)
	at com.carrotsearch.randomizedtesting.ThreadLeakControl.forkTimeoutingTask(ThreadLeakControl.java:782)
	at com.carrotsearch.randomizedtesting.ThreadLeakControl$3.evaluate(ThreadLeakControl.java:442)
	at com.carrotsearch.randomizedtesting.RandomizedRunner.runSingleTest(RandomizedRunner.java:746)
	at com.carrotsearch.randomizedtesting.RandomizedRunner$3.evaluate(RandomizedRunner.java:648)
	at com.carrotsearch.randomizedtesting.RandomizedRunner$4.evaluate(RandomizedRunner.java:682)
	at com.carrotsearch.randomizedtesting.RandomizedRunner$5.evaluate(RandomizedRunner.java:693)
	at com.carrotsearch.randomizedtesting.rules.StatementAdapter.evaluate(StatementAdapter.java:36)
	at com.carrotsearch.randomizedtesting.rules.SystemPropertiesRestoreRule$1.evaluate(SystemPropertiesRestoreRule.java:53)
	at org.apache.lucene.util.AbstractBeforeAfterRule$1.evaluate(AbstractBeforeAfterRule.java:46)
	at org.apache.lucene.util.TestRuleStoreClassName$1.evaluate(TestRuleStoreClassName.java:42)
	at com.carrotsearch.randomizedtesting.rules.SystemPropertiesInvariantRule$1.evaluate(SystemPropertiesInvariantRule.java:55)
	at com.carrotsearch.randomizedtesting.rules.NoShadowingOrOverridesOnMethodsRule$1.evaluate(NoShadowingOrOverridesOnMethodsRule.java:39)
	at com.carrotsearch.randomizedtesting.rules.NoShadowingOrOverridesOnMethodsRule$1.evaluate(NoShadowingOrOverridesOnMethodsRule.java:39)
	at com.carrotsearch.randomizedtesting.rules.StatementAdapter.evaluate(StatementAdapter.java:36)
	at org.apache.lucene.util.TestRuleAssertionsRequired$1.evaluate(TestRuleAssertionsRequired.java:43)
	at org.apache.lucene.util.TestRuleMarkFailure$1.evaluate(TestRuleMarkFailure.java:48)
	at org.apache.lucene.util.TestRuleIgnoreAfterMaxFailures$1.evaluate(TestRuleIgnoreAfterMaxFailures.java:70)
	at org.apache.lucene.util.TestRuleIgnoreTestSuites$1.evaluate(TestRuleIgnoreTestSuites.java:55)
	at com.carrotsearch.randomizedtesting.rules.StatementAdapter.evaluate(StatementAdapter.java:36)
	at com.carrotsearch.randomizedtesting.ThreadLeakControl$StatementRunner.run(ThreadLeakControl.java:358)
	at java.lang.Thread.run(Thread.java:722)




Build Log:
[...truncated 8616 lines...]
[junit4:junit4] Suite: org.apache.solr.cloud.BasicDistributedZkTest
[junit4:junit4]   2> 0 T246 oas.BaseDistributedSearchTestCase.initHostContext Setting hostContext system property: /_/rz
[junit4:junit4]   2> 11 T246 oas.SolrTestCaseJ4.setUp ###Starting testDistribSearch
[junit4:junit4]   2> Creating dataDir: /Users/jenkins/jenkins-slave/workspace/Lucene-Solr-4.x-MacOSX/solr/build/solr-core/test/J0/./solrtest-BasicDistributedZkTest-1358512867446
[junit4:junit4]   2> 12 T246 oasc.ZkTestServer.run STARTING ZK TEST SERVER
[junit4:junit4]   2> 13 T247 oasc.ZkTestServer$ZKServerMain.runFromConfig Starting server
[junit4:junit4]   2> 15 T247 oazs.ZooKeeperServer.setTickTime tickTime set to 1000
[junit4:junit4]   2> 16 T247 oazs.ZooKeeperServer.setMinSessionTimeout minSessionTimeout set to -1
[junit4:junit4]   2> 16 T247 oazs.ZooKeeperServer.setMaxSessionTimeout maxSessionTimeout set to -1
[junit4:junit4]   2> 17 T247 oazs.NIOServerCnxnFactory.configure binding to port 0.0.0.0/0.0.0.0:0
[junit4:junit4]   2> 18 T247 oazsp.FileTxnSnapLog.save Snapshotting: 0x0 to /Users/jenkins/jenkins-slave/workspace/Lucene-Solr-4.x-MacOSX/solr/build/solr-core/test/J0/./org.apache.solr.cloud.BasicDistributedZkTest-1358512867445/zookeeper/server1/data/version-2/snapshot.0
[junit4:junit4]   2> 17 T246 oasc.ZkTestServer.run start zk server on port:51142
[junit4:junit4]   2> 36 T246 oaz.ZooKeeper.<init> Initiating client connection, connectString=127.0.0.1:51142 sessionTimeout=10000 watcher=org.apache.solr.common.cloud.ConnectionManager@7ade17d8
[junit4:junit4]   2> 40 T252 oaz.ClientCnxn$SendThread.logStartConnect Opening socket connection to server localhost/127.0.0.1:51142. Will not attempt to authenticate using SASL (access denied ("javax.security.auth.AuthPermission" "getLoginConfiguration"))
[junit4:junit4]   2> 42 T252 oaz.ClientCnxn$SendThread.primeConnection Socket connection established to localhost/127.0.0.1:51142, initiating session
[junit4:junit4]   2> 42 T248 oazs.NIOServerCnxnFactory.run Accepted socket connection from /127.0.0.1:51143
[junit4:junit4]   2> 44 T248 oazs.ZooKeeperServer.processConnectRequest Client attempting to establish new session at /127.0.0.1:51143
[junit4:junit4]   2> 43 T246 oascc.ConnectionManager.waitForConnected Waiting for client to connect to ZooKeeper
[junit4:junit4]   2> 46 T250 oazsp.FileTxnLog.append Creating new log file: log.1
[junit4:junit4]   2> 49 T250 oazs.ZooKeeperServer.finishSessionInit Established session 0x13c4dad48820000 with negotiated timeout 10000 for client /127.0.0.1:51143
[junit4:junit4]   2> 50 T252 oaz.ClientCnxn$SendThread.onConnected Session establishment complete on server localhost/127.0.0.1:51142, sessionid = 0x13c4dad48820000, negotiated timeout = 10000
[junit4:junit4]   2> 51 T253 oascc.ConnectionManager.process Watcher org.apache.solr.common.cloud.ConnectionManager@7ade17d8 name:ZooKeeperConnection Watcher:127.0.0.1:51142 got event WatchedEvent state:SyncConnected type:None path:null path:null type:None
[junit4:junit4]   2> 52 T246 oascc.ConnectionManager.waitForConnected Client is connected to ZooKeeper
[junit4:junit4]   2> 53 T246 oascc.SolrZkClient.makePath makePath: /solr
[junit4:junit4]   2> 67 T251 oazs.PrepRequestProcessor.pRequest2Txn Processed session termination for sessionid: 0x13c4dad48820000
[junit4:junit4]   2> 70 T248 oazs.NIOServerCnxn.closeSock Closed socket connection for client /127.0.0.1:51143 which had sessionid 0x13c4dad48820000
[junit4:junit4]   2> 71 T253 oaz.ClientCnxn$EventThread.run EventThread shut down
[junit4:junit4]   2> 72 T246 oaz.ZooKeeper.close Session: 0x13c4dad48820000 closed
[junit4:junit4]   2> 74 T246 oaz.ZooKeeper.<init> Initiating client connection, connectString=127.0.0.1:51142/solr sessionTimeout=10000 watcher=org.apache.solr.common.cloud.ConnectionManager@6c2bae18
[junit4:junit4]   2> 77 T254 oaz.ClientCnxn$SendThread.logStartConnect Opening socket connection to server localhost/127.0.0.1:51142. Will not attempt to authenticate using SASL (access denied ("javax.security.auth.AuthPermission" "getLoginConfiguration"))
[junit4:junit4]   2> 77 T246 oascc.ConnectionManager.waitForConnected Waiting for client to connect to ZooKeeper
[junit4:junit4]   2> 79 T248 oazs.NIOServerCnxnFactory.run Accepted socket connection from /127.0.0.1:51144
[junit4:junit4]   2> 78 T254 oaz.ClientCnxn$SendThread.primeConnection Socket connection established to localhost/127.0.0.1:51142, initiating session
[junit4:junit4]   2> 80 T248 oazs.ZooKeeperServer.processConnectRequest Client attempting to establish new session at /127.0.0.1:51144
[junit4:junit4]   2> 84 T250 oazs.ZooKeeperServer.finishSessionInit Established session 0x13c4dad48820001 with negotiated timeout 10000 for client /127.0.0.1:51144
[junit4:junit4]   2> 84 T254 oaz.ClientCnxn$SendThread.onConnected Session establishment complete on server localhost/127.0.0.1:51142, sessionid = 0x13c4dad48820001, negotiated timeout = 10000
[junit4:junit4]   2> 85 T255 oascc.ConnectionManager.process Watcher org.apache.solr.common.cloud.ConnectionManager@6c2bae18 name:ZooKeeperConnection Watcher:127.0.0.1:51142/solr got event WatchedEvent state:SyncConnected type:None path:null path:null type:None
[junit4:junit4]   2> 86 T246 oascc.ConnectionManager.waitForConnected Client is connected to ZooKeeper
[junit4:junit4]   2> 87 T246 oascc.SolrZkClient.makePath makePath: /collections/collection1
[junit4:junit4]   2> 96 T246 oascc.SolrZkClient.makePath makePath: /collections/collection1/shards
[junit4:junit4]   2> 110 T246 oascc.SolrZkClient.makePath makePath: /collections/control_collection
[junit4:junit4]   2> 121 T246 oascc.SolrZkClient.makePath makePath: /collections/control_collection/shards
[junit4:junit4]   2> 138 T246 oasc.AbstractZkTestCase.putConfig put /Users/jenkins/jenkins-slave/workspace/Lucene-Solr-4.x-MacOSX/solr/build/solr-core/test-files/solr/collection1/conf/solrconfig.xml to /configs/conf1/solrconfig.xml
[junit4:junit4]   2> 139 T246 oascc.SolrZkClient.makePath makePath: /configs/conf1/solrconfig.xml
[junit4:junit4]   2> 152 T246 oasc.AbstractZkTestCase.putConfig put /Users/jenkins/jenkins-slave/workspace/Lucene-Solr-4.x-MacOSX/solr/build/solr-core/test-files/solr/collection1/conf/schema.xml to /configs/conf1/schema.xml
[junit4:junit4]   2> 154 T246 oascc.SolrZkClient.makePath makePath: /configs/conf1/schema.xml
[junit4:junit4]   2> 167 T246 oasc.AbstractZkTestCase.putConfig put /Users/jenkins/jenkins-slave/workspace/Lucene-Solr-4.x-MacOSX/solr/build/solr-core/test-files/solr/collection1/conf/stopwords.txt to /configs/conf1/stopwords.txt
[junit4:junit4]   2> 168 T246 oascc.SolrZkClient.makePath makePath: /configs/conf1/stopwords.txt
[junit4:junit4]   2> 181 T246 oasc.AbstractZkTestCase.putConfig put /Users/jenkins/jenkins-slave/workspace/Lucene-Solr-4.x-MacOSX/solr/build/solr-core/test-files/solr/collection1/conf/protwords.txt to /configs/conf1/protwords.txt
[junit4:junit4]   2> 182 T246 oascc.SolrZkClient.makePath makePath: /configs/conf1/protwords.txt
[junit4:junit4]   2> 189 T246 oasc.AbstractZkTestCase.putConfig put /Users/jenkins/jenkins-slave/workspace/Lucene-Solr-4.x-MacOSX/solr/build/solr-core/test-files/solr/collection1/conf/currency.xml to /configs/conf1/currency.xml
[junit4:junit4]   2> 191 T246 oascc.SolrZkClient.makePath makePath: /configs/conf1/currency.xml
[junit4:junit4]   2> 210 T246 oasc.AbstractZkTestCase.putConfig put /Users/jenkins/jenkins-slave/workspace/Lucene-Solr-4.x-MacOSX/solr/build/solr-core/test-files/solr/collection1/conf/open-exchange-rates.json to /configs/conf1/open-exchange-rates.json
[junit4:junit4]   2> 215 T246 oascc.SolrZkClient.makePath makePath: /configs/conf1/open-exchange-rates.json
[junit4:junit4]   2> 228 T246 oasc.AbstractZkTestCase.putConfig put /Users/jenkins/jenkins-slave/workspace/Lucene-Solr-4.x-MacOSX/solr/build/solr-core/test-files/solr/collection1/conf/mapping-ISOLatin1Accent.txt to /configs/conf1/mapping-ISOLatin1Accent.txt
[junit4:junit4]   2> 230 T246 oascc.SolrZkClient.makePath makePath: /configs/conf1/mapping-ISOLatin1Accent.txt
[junit4:junit4]   2> 240 T246 oasc.AbstractZkTestCase.putConfig put /Users/jenkins/jenkins-slave/workspace/Lucene-Solr-4.x-MacOSX/solr/build/solr-core/test-files/solr/collection1/conf/old_synonyms.txt to /configs/conf1/old_synonyms.txt
[junit4:junit4]   2> 241 T246 oascc.SolrZkClient.makePath makePath: /configs/conf1/old_synonyms.txt
[junit4:junit4]   2> 251 T246 oasc.AbstractZkTestCase.putConfig put /Users/jenkins/jenkins-slave/workspace/Lucene-Solr-4.x-MacOSX/solr/build/solr-core/test-files/solr/collection1/conf/synonyms.txt to /configs/conf1/synonyms.txt
[junit4:junit4]   2> 253 T246 oascc.SolrZkClient.makePath makePath: /configs/conf1/synonyms.txt
[junit4:junit4]   2> 267 T251 oazs.PrepRequestProcessor.pRequest2Txn Processed session termination for sessionid: 0x13c4dad48820001
[junit4:junit4]   2> 269 T248 oazs.NIOServerCnxn.closeSock Closed socket connection for client /127.0.0.1:51144 which had sessionid 0x13c4dad48820001
[junit4:junit4]   2> 270 T255 oaz.ClientCnxn$EventThread.run EventThread shut down
[junit4:junit4]   2> 271 T246 oaz.ZooKeeper.close Session: 0x13c4dad48820001 closed
[junit4:junit4]   2> 513 T246 oejs.Server.doStart jetty-8.1.8.v20121106
[junit4:junit4]   2> 521 T246 oejs.AbstractConnector.doStart Started SelectChannelConnector@127.0.0.1:51145
[junit4:junit4]   2> 522 T246 oass.SolrDispatchFilter.init SolrDispatchFilter.init()
[junit4:junit4]   2> 523 T246 oasc.SolrResourceLoader.locateSolrHome JNDI not configured for solr (NoInitialContextEx)
[junit4:junit4]   2> 524 T246 oasc.SolrResourceLoader.locateSolrHome using system property solr.solr.home: /Users/jenkins/jenkins-slave/workspace/Lucene-Solr-4.x-MacOSX/solr/build/solr-core/test/J0/./org.apache.solr.cloud.BasicDistributedZkTest-controljetty-1358512867708
[junit4:junit4]   2> 525 T246 oasc.CoreContainer$Initializer.initialize looking for solr.xml: /Users/jenkins/jenkins-slave/workspace/Lucene-Solr-4.x-MacOSX/solr/build/solr-core/test/J0/./org.apache.solr.cloud.BasicDistributedZkTest-controljetty-1358512867708/solr.xml
[junit4:junit4]   2> 526 T246 oasc.CoreContainer.<init> New CoreContainer 4447765
[junit4:junit4]   2> 527 T246 oasc.CoreContainer.load Loading CoreContainer using Solr Home: '/Users/jenkins/jenkins-slave/workspace/Lucene-Solr-4.x-MacOSX/solr/build/solr-core/test/J0/./org.apache.solr.cloud.BasicDistributedZkTest-controljetty-1358512867708/'
[junit4:junit4]   2> 528 T246 oasc.SolrResourceLoader.<init> new SolrResourceLoader for directory: '/Users/jenkins/jenkins-slave/workspace/Lucene-Solr-4.x-MacOSX/solr/build/solr-core/test/J0/./org.apache.solr.cloud.BasicDistributedZkTest-controljetty-1358512867708/'
[junit4:junit4]   2> 596 T246 oashc.HttpShardHandlerFactory.getParameter Setting socketTimeout to: 60000
[junit4:junit4]   2> 598 T246 oashc.HttpShardHandlerFactory.getParameter Setting urlScheme to: http://
[junit4:junit4]   2> 599 T246 oashc.HttpShardHandlerFactory.getParameter Setting connTimeout to: 15000
[junit4:junit4]   2> 600 T246 oashc.HttpShardHandlerFactory.getParameter Setting maxConnectionsPerHost to: 20
[junit4:junit4]   2> 601 T246 oashc.HttpShardHandlerFactory.getParameter Setting corePoolSize to: 0
[junit4:junit4]   2> 602 T246 oashc.HttpShardHandlerFactory.getParameter Setting maximumPoolSize to: 2147483647
[junit4:junit4]   2> 603 T246 oashc.HttpShardHandlerFactory.getParameter Setting maxThreadIdleTime to: 5
[junit4:junit4]   2> 604 T246 oashc.HttpShardHandlerFactory.getParameter Setting sizeOfQueue to: -1
[junit4:junit4]   2> 605 T246 oashc.HttpShardHandlerFactory.getParameter Setting fairnessPolicy to: false
[junit4:junit4]   2> 606 T246 oascsi.HttpClientUtil.createClient Creating new http client, config:maxConnectionsPerHost=20&maxConnections=10000&socketTimeout=60000&connTimeout=15000&retry=false
[junit4:junit4]   2> 622 T246 oasc.CoreContainer.load Registering Log Listener
[junit4:junit4]   2> 638 T246 oasc.CoreContainer.initZooKeeper Zookeeper client=127.0.0.1:51142/solr
[junit4:junit4]   2> 639 T246 oasc.ZkController.checkChrootPath zkHost includes chroot
[junit4:junit4]   2> 640 T246 oaz.ZooKeeper.<init> Initiating client connection, connectString=127.0.0.1:51142 sessionTimeout=60000 watcher=org.apache.solr.common.cloud.ConnectionManager@5955509e
[junit4:junit4]   2> 641 T246 oascc.ConnectionManager.waitForConnected Waiting for client to connect to ZooKeeper
[junit4:junit4]   2> 642 T265 oaz.ClientCnxn$SendThread.logStartConnect Opening socket connection to server localhost/127.0.0.1:51142. Will not attempt to authenticate using SASL (access denied ("javax.security.auth.AuthPermission" "getLoginConfiguration"))
[junit4:junit4]   2> 643 T265 oaz.ClientCnxn$SendThread.primeConnection Socket connection established to localhost/127.0.0.1:51142, initiating session
[junit4:junit4]   2> 644 T248 oazs.NIOServerCnxnFactory.run Accepted socket connection from /127.0.0.1:51146
[junit4:junit4]   2> 644 T248 oazs.ZooKeeperServer.processConnectRequest Client attempting to establish new session at /127.0.0.1:51146
[junit4:junit4]   2> 1981 T250 oazsp.FileTxnLog.commit WARNING fsync-ing the write ahead log in SyncThread:0 took 1335ms which will adversely effect operation latency. See the ZooKeeper troubleshooting guide
[junit4:junit4]   2> 1982 T250 oazs.ZooKeeperServer.finishSessionInit Established session 0x13c4dad48820002 with negotiated timeout 20000 for client /127.0.0.1:51146
[junit4:junit4]   2> 1983 T265 oaz.ClientCnxn$SendThread.onConnected Session establishment complete on server localhost/127.0.0.1:51142, sessionid = 0x13c4dad48820002, negotiated timeout = 20000
[junit4:junit4]   2> 1984 T266 oascc.ConnectionManager.process Watcher org.apache.solr.common.cloud.ConnectionManager@5955509e name:ZooKeeperConnection Watcher:127.0.0.1:51142 got event WatchedEvent state:SyncConnected type:None path:null path:null type:None
[junit4:junit4]   2> 1984 T246 oascc.ConnectionManager.waitForConnected Client is connected to ZooKeeper
[junit4:junit4]   2> 1988 T251 oazs.PrepRequestProcessor.pRequest2Txn Processed session termination for sessionid: 0x13c4dad48820002
[junit4:junit4]   2> 1989 T248 oazs.NIOServerCnxn.closeSock Closed socket connection for client /127.0.0.1:51146 which had sessionid 0x13c4dad48820002
[junit4:junit4]   2> 1990 T266 oaz.ClientCnxn$EventThread.run EventThread shut down
[junit4:junit4]   2> 1989 T246 oaz.ZooKeeper.close Session: 0x13c4dad48820002 closed
[junit4:junit4]   2> 1992 T246 oascsi.HttpClientUtil.createClient Creating new http client, config:maxConnections=500&maxConnectionsPerHost=16&socketTimeout=60000&connTimeout=15000
[junit4:junit4]   2> 2000 T246 oaz.ZooKeeper.<init> Initiating client connection, connectString=127.0.0.1:51142/solr sessionTimeout=30000 watcher=org.apache.solr.common.cloud.ConnectionManager@ae2d801
[junit4:junit4]   2> 2002 T246 oascc.ConnectionManager.waitForConnected Waiting for client to connect to ZooKeeper
[junit4:junit4]   2> 2003 T267 oaz.ClientCnxn$SendThread.logStartConnect Opening socket connection to server localhost/127.0.0.1:51142. Will not attempt to authenticate using SASL (access denied ("javax.security.auth.AuthPermission" "getLoginConfiguration"))
[junit4:junit4]   2> 2004 T267 oaz.ClientCnxn$SendThread.primeConnection Socket connection established to localhost/127.0.0.1:51142, initiating session
[junit4:junit4]   2> 2005 T248 oazs.NIOServerCnxnFactory.run Accepted socket connection from /127.0.0.1:51147
[junit4:junit4]   2> 2006 T248 oazs.ZooKeeperServer.processConnectRequest Client attempting to establish new session at /127.0.0.1:51147
[junit4:junit4]   2> 2007 T250 oazs.ZooKeeperServer.finishSessionInit Established session 0x13c4dad48820003 with negotiated timeout 20000 for client /127.0.0.1:51147
[junit4:junit4]   2> 2007 T267 oaz.ClientCnxn$SendThread.onConnected Session establishment complete on server localhost/127.0.0.1:51142, sessionid = 0x13c4dad48820003, negotiated timeout = 20000
[junit4:junit4]   2> 2008 T268 oascc.ConnectionManager.process Watcher org.apache.solr.common.cloud.ConnectionManager@ae2d801 name:ZooKeeperConnection Watcher:127.0.0.1:51142/solr got event WatchedEvent state:SyncConnected type:None path:null path:null type:None
[junit4:junit4]   2> 2009 T246 oascc.ConnectionManager.waitForConnected Client is connected to ZooKeeper
[junit4:junit4]   2> 2014 T251 oazs.PrepRequestProcessor.pRequest Got user-level KeeperException when processing sessionid:0x13c4dad48820003 type:create cxid:0x2 zxid:0x1a txntype:-1 reqpath:n/a Error Path:/solr/overseer Error:KeeperErrorCode = NodeExists for /solr/overseer
[junit4:junit4]   2> 2017 T246 oascc.SolrZkClient.makePath makePath: /live_nodes
[junit4:junit4]   2> 2024 T246 oasc.ZkController.createEphemeralLiveNode Register node as live in ZooKeeper:/live_nodes/127.0.0.1:51145__%2Frz
[junit4:junit4]   2> 2025 T251 oazs.PrepRequestProcessor.pRequest Got user-level KeeperException when processing sessionid:0x13c4dad48820003 type:delete cxid:0x7 zxid:0x1c txntype:-1 reqpath:n/a Error Path:/solr/live_nodes/127.0.0.1:51145__%2Frz Error:KeeperErrorCode = NoNode for /solr/live_nodes/127.0.0.1:51145__%2Frz
[junit4:junit4]   2> 2027 T246 oascc.SolrZkClient.makePath makePath: /live_nodes/127.0.0.1:51145__%2Frz
[junit4:junit4]   2> 2035 T246 oascc.SolrZkClient.makePath makePath: /overseer_elect/election
[junit4:junit4]   2> 2050 T251 oazs.PrepRequestProcessor.pRequest Got user-level KeeperException when processing sessionid:0x13c4dad48820003 type:delete cxid:0x15 zxid:0x21 txntype:-1 reqpath:n/a Error Path:/solr/overseer_elect/leader Error:KeeperErrorCode = NoNode for /solr/overseer_elect/leader
[junit4:junit4]   2> 2051 T246 oascc.SolrZkClient.makePath makePath: /overseer_elect/leader
[junit4:junit4]   2> 2058 T246 oasc.Overseer.start Overseer (id=89031499281727491-127.0.0.1:51145__%2Frz-n_0000000000) starting
[junit4:junit4]   2> 2060 T251 oazs.PrepRequestProcessor.pRequest Got user-level KeeperException when processing sessionid:0x13c4dad48820003 type:create cxid:0x1a zxid:0x23 txntype:-1 reqpath:n/a Error Path:/solr/overseer Error:KeeperErrorCode = NodeExists for /solr/overseer
[junit4:junit4]   2> 2062 T251 oazs.PrepRequestProcessor.pRequest Got user-level KeeperException when processing sessionid:0x13c4dad48820003 type:create cxid:0x1b zxid:0x24 txntype:-1 reqpath:n/a Error Path:/solr/overseer Error:KeeperErrorCode = NodeExists for /solr/overseer
[junit4:junit4]   2> 2065 T251 oazs.PrepRequestProcessor.pRequest Got user-level KeeperException when processing sessionid:0x13c4dad48820003 type:create cxid:0x1c zxid:0x25 txntype:-1 reqpath:n/a Error Path:/solr/overseer Error:KeeperErrorCode = NodeExists for /solr/overseer
[junit4:junit4]   2> 2067 T251 oazs.PrepRequestProcessor.pRequest Got user-level KeeperException when processing sessionid:0x13c4dad48820003 type:create cxid:0x1d zxid:0x26 txntype:-1 reqpath:n/a Error Path:/solr/overseer Error:KeeperErrorCode = NodeExists for /solr/overseer
[junit4:junit4]   2> 2069 T270 oasc.OverseerCollectionProcessor.run Process current queue of collection messages
[junit4:junit4]   2> 2072 T246 oascc.SolrZkClient.makePath makePath: /clusterstate.json
[junit4:junit4]   2> 2086 T246 oascc.ZkStateReader.createClusterStateWatchersAndUpdate Updating cluster state from ZooKeeper... 
[junit4:junit4]   2> 2099 T271 oasc.CoreContainer.create Creating SolrCore 'collection1' using instanceDir: /Users/jenkins/jenkins-slave/workspace/Lucene-Solr-4.x-MacOSX/solr/build/solr-core/test/J0/./org.apache.solr.cloud.BasicDistributedZkTest-controljetty-1358512867708/collection1
[junit4:junit4]   2> 2099 T271 oasc.ZkController.createCollectionZkNode Check for collection zkNode:control_collection
[junit4:junit4]   2> 2107 T269 oasc.Overseer$ClusterStateUpdater.run Starting to work on the main queue
[junit4:junit4]   2> 2108 T271 oasc.ZkController.createCollectionZkNode Collection zkNode exists
[junit4:junit4]   2> 2108 T271 oasc.ZkController.readConfigName Load collection config from:/collections/control_collection
[junit4:junit4]   2> 2114 T271 oasc.SolrResourceLoader.<init> new SolrResourceLoader for directory: '/Users/jenkins/jenkins-slave/workspace/Lucene-Solr-4.x-MacOSX/solr/build/solr-core/test/J0/./org.apache.solr.cloud.BasicDistributedZkTest-controljetty-1358512867708/collection1/'
[junit4:junit4]   2> 2116 T271 oasc.SolrResourceLoader.replaceClassLoader Adding 'file:/Users/jenkins/jenkins-slave/workspace/Lucene-Solr-4.x-MacOSX/solr/build/solr-core/test/J0/org.apache.solr.cloud.BasicDistributedZkTest-controljetty-1358512867708/collection1/lib/classes/' to classloader
[junit4:junit4]   2> 2116 T271 oasc.SolrResourceLoader.replaceClassLoader Adding 'file:/Users/jenkins/jenkins-slave/workspace/Lucene-Solr-4.x-MacOSX/solr/build/solr-core/test/J0/org.apache.solr.cloud.BasicDistributedZkTest-controljetty-1358512867708/collection1/lib/README' to classloader
[junit4:junit4]   2> 2198 T271 oasc.SolrConfig.<init> Using Lucene MatchVersion: LUCENE_42
[junit4:junit4]   2> 2274 T271 oasc.SolrConfig.<init> Loaded SolrConfig: solrconfig.xml
[junit4:junit4]   2> 2277 T271 oass.IndexSchema.readSchema Reading Solr Schema
[junit4:junit4]   2> 2285 T271 oass.IndexSchema.readSchema Schema name=test
[junit4:junit4]   2> 3010 T271 oass.OpenExchangeRatesOrgProvider.init Initialized with rates=open-exchange-rates.json, refreshInterval=1440.
[junit4:junit4]   2> 3020 T271 oass.IndexSchema.readSchema default search field in schema is text
[junit4:junit4]   2> 3024 T271 oass.IndexSchema.readSchema unique key field: id
[junit4:junit4]   2> 3060 T271 oass.FileExchangeRateProvider.reload Reloading exchange rates from file currency.xml
[junit4:junit4]   2> 3067 T271 oass.FileExchangeRateProvider.reload Reloading exchange rates from file currency.xml
[junit4:junit4]   2> 3075 T271 oass.OpenExchangeRatesOrgProvider.reload Reloading exchange rates from open-exchange-rates.json
[junit4:junit4]   2> 3078 T271 oass.OpenExchangeRatesOrgProvider.reload Reloading exchange rates from open-exchange-rates.json
[junit4:junit4]   2> 3081 T271 oasc.SolrCore.<init> [collection1] Opening new SolrCore at /Users/jenkins/jenkins-slave/workspace/Lucene-Solr-4.x-MacOSX/solr/build/solr-core/test/J0/./org.apache.solr.cloud.BasicDistributedZkTest-controljetty-1358512867708/collection1/, dataDir=./org.apache.solr.cloud.BasicDistributedZkTest-1358512867445/control/data/
[junit4:junit4]   2> 3082 T271 oasc.JmxMonitoredMap.<init> JMX monitoring is enabled. Adding Solr mbeans to JMX Server: com.sun.jmx.mbeanserver.JmxMBeanServer@2b10f19b
[junit4:junit4]   2> 3082 T271 oasc.SolrCore.initDirectoryFactory solr.NRTCachingDirectoryFactory
[junit4:junit4]   2> 3084 T271 oasc.CachingDirectoryFactory.get return new directory for /Users/jenkins/jenkins-slave/workspace/Lucene-Solr-4.x-MacOSX/solr/build/solr-core/test/J0/./org.apache.solr.cloud.BasicDistributedZkTest-1358512867445/control/data forceNew:false
[junit4:junit4]   2> 3084 T271 oasc.CachingDirectoryFactory.close Releasing directory:/Users/jenkins/jenkins-slave/workspace/Lucene-Solr-4.x-MacOSX/solr/build/solr-core/test/J0/./org.apache.solr.cloud.BasicDistributedZkTest-1358512867445/control/data
[junit4:junit4]   2> 3085 T271 oasc.SolrCore.getNewIndexDir New index directory detected: old=null new=./org.apache.solr.cloud.BasicDistributedZkTest-1358512867445/control/data/index/
[junit4:junit4]   2> 3085 T271 oasc.SolrCore.initIndex WARNING [collection1] Solr index directory './org.apache.solr.cloud.BasicDistributedZkTest-1358512867445/control/data/index' doesn't exist. Creating new index...
[junit4:junit4]   2> 3086 T271 oasc.CachingDirectoryFactory.get return new directory for /Users/jenkins/jenkins-slave/workspace/Lucene-Solr-4.x-MacOSX/solr/build/solr-core/test/J0/./org.apache.solr.cloud.BasicDistributedZkTest-1358512867445/control/data/index forceNew:false
[junit4:junit4]   2> 3092 T271 oasc.SolrDeletionPolicy.onCommit SolrDeletionPolicy.onCommit: commits:num=1
[junit4:junit4]   2> 		commit{dir=RateLimitedDirectoryWrapper(NRTCachingDirectory(org.apache.lucene.store.NIOFSDirectory@/Users/jenkins/jenkins-slave/workspace/Lucene-Solr-4.x-MacOSX/solr/build/solr-core/test/J0/org.apache.solr.cloud.BasicDistributedZkTest-1358512867445/control/data/index lockFactory=org.apache.lucene.store.NativeFSLockFactory@213e7e70; maxCacheMB=48.0 maxMergeSizeMB=4.0)),segFN=segments_1,generation=1,filenames=[segments_1]
[junit4:junit4]   2> 3093 T271 oasc.SolrDeletionPolicy.updateCommits newest commit = 1[segments_1]
[junit4:junit4]   2> 3094 T271 oasc.CachingDirectoryFactory.close Releasing directory:/Users/jenkins/jenkins-slave/workspace/Lucene-Solr-4.x-MacOSX/solr/build/solr-core/test/J0/./org.apache.solr.cloud.BasicDistributedZkTest-1358512867445/control/data/index
[junit4:junit4]   2> 3094 T271 oasc.SolrCore.initWriters created xml: solr.XMLResponseWriter
[junit4:junit4]   2> 3098 T271 oasup.UpdateRequestProcessorChain.init inserting DistributedUpdateProcessorFactory into updateRequestProcessorChain "dedupe"
[junit4:junit4]   2> 3098 T271 oasup.UpdateRequestProcessorChain.init inserting DistributedUpdateProcessorFactory into updateRequestProcessorChain "dedupe-allfields"
[junit4:junit4]   2> 3099 T271 oasup.UpdateRequestProcessorChain.init inserting DistributedUpdateProcessorFactory into updateRequestProcessorChain "stored_sig"
[junit4:junit4]   2> 3100 T271 oasup.UpdateRequestProcessorChain.init inserting DistributedUpdateProcessorFactory into updateRequestProcessorChain "uniq-fields"
[junit4:junit4]   2> 3102 T271 oasup.UpdateRequestProcessorChain.init inserting DistributedUpdateProcessorFactory into updateRequestProcessorChain "distrib-dup-test-chain-implicit"
[junit4:junit4]   2> 3103 T271 oasc.RequestHandlers.initHandlersFromConfig adding lazy requestHandler: solr.ReplicationHandler
[junit4:junit4]   2> 3104 T271 oasc.RequestHandlers.initHandlersFromConfig created /replication: solr.ReplicationHandler
[junit4:junit4]   2> 3105 T271 oasc.RequestHandlers.initHandlersFromConfig created standard: solr.StandardRequestHandler
[junit4:junit4]   2> 3107 T271 oasc.RequestHandlers.initHandlersFromConfig created /get: solr.RealTimeGetHandler
[junit4:junit4]   2> 3107 T271 oasc.RequestHandlers.initHandlersFromConfig created dismax: solr.SearchHandler
[junit4:junit4]   2> 3108 T271 oasc.RequestHandlers.initHandlersFromConfig created mock: org.apache.solr.core.MockQuerySenderListenerReqHandler
[junit4:junit4]   2> 3109 T271 oasc.RequestHandlers.initHandlersFromConfig created /admin/: org.apache.solr.handler.admin.AdminHandlers
[junit4:junit4]   2> 3110 T271 oasc.RequestHandlers.initHandlersFromConfig created defaults: solr.StandardRequestHandler
[junit4:junit4]   2> 3110 T271 oasc.RequestHandlers.initHandlersFromConfig adding lazy requestHandler: solr.StandardRequestHandler
[junit4:junit4]   2> 3110 T271 oasc.RequestHandlers.initHandlersFromConfig created lazy: solr.StandardRequestHandler
[junit4:junit4]   2> 3111 T271 oasc.RequestHandlers.initHandlersFromConfig created /update: solr.UpdateRequestHandler
[junit4:junit4]   2> 3112 T271 oasc.RequestHandlers.initHandlersFromConfig created /terms: org.apache.solr.handler.component.SearchHandler
[junit4:junit4]   2> 3113 T271 oasc.RequestHandlers.initHandlersFromConfig created spellCheckCompRH: org.apache.solr.handler.component.SearchHandler
[junit4:junit4]   2> 3114 T271 oasc.RequestHandlers.initHandlersFromConfig created spellCheckCompRH_Direct: org.apache.solr.handler.component.SearchHandler
[junit4:junit4]   2> 3114 T271 oasc.RequestHandlers.initHandlersFromConfig created spellCheckWithWordbreak: org.apache.solr.handler.component.SearchHandler
[junit4:junit4]   2> 3115 T271 oasc.RequestHandlers.initHandlersFromConfig created spellCheckWithWordbreak_Direct: org.apache.solr.handler.component.SearchHandler
[junit4:junit4]   2> 3116 T271 oasc.RequestHandlers.initHandlersFromConfig created spellCheckCompRH1: org.apache.solr.handler.component.SearchHandler
[junit4:junit4]   2> 3117 T271 oasc.RequestHandlers.initHandlersFromConfig created mltrh: org.apache.solr.handler.component.SearchHandler
[junit4:junit4]   2> 3118 T271 oasc.RequestHandlers.initHandlersFromConfig created tvrh: org.apache.solr.handler.component.SearchHandler
[junit4:junit4]   2> 3118 T271 oasc.RequestHandlers.initHandlersFromConfig created /mlt: solr.MoreLikeThisHandler
[junit4:junit4]   2> 3119 T271 oasc.RequestHandlers.initHandlersFromConfig created /debug/dump: solr.DumpRequestHandler
[junit4:junit4]   2> 3127 T271 oashl.XMLLoader.init xsltCacheLifetimeSeconds=60
[junit4:junit4]   2> 3131 T271 oasc.SolrCore.initDeprecatedSupport WARNING solrconfig.xml uses deprecated <admin/gettableFiles>, Please update your config to use the ShowFileRequestHandler.
[junit4:junit4]   2> 3133 T271 oasc.SolrCore.initDeprecatedSupport WARNING adding ShowFileRequestHandler with hidden files: [SCHEMA.XML, OLD_SYNONYMS.TXT, STOPWORDS.TXT, PROTWORDS.TXT, OPEN-EXCHANGE-RATES.JSON, SYNONYMS.TXT, CURRENCY.XML, MAPPING-ISOLATIN1ACCENT.TXT]
[junit4:junit4]   2> 3139 T271 oasc.CachingDirectoryFactory.close Releasing directory:/Users/jenkins/jenkins-slave/workspace/Lucene-Solr-4.x-MacOSX/solr/build/solr-core/test/J0/./org.apache.solr.cloud.BasicDistributedZkTest-1358512867445/control/data
[junit4:junit4]   2> 3142 T271 oass.SolrIndexSearcher.<init> Opening Searcher@213f379 main
[junit4:junit4]   2> 3145 T271 oasu.CommitTracker.<init> Hard AutoCommit: disabled
[junit4:junit4]   2> 3145 T271 oasu.CommitTracker.<init> Soft AutoCommit: disabled
[junit4:junit4]   2> 3146 T271 oashc.SpellCheckComponent.inform Initializing spell checkers
[junit4:junit4]   2> 3157 T271 oass.DirectSolrSpellChecker.init init: {name=direct,classname=DirectSolrSpellChecker,field=lowerfilt,minQueryLength=3}
[junit4:junit4]   2> 3194 T272 oasc.SolrCore.registerSearcher [collection1] Registered new searcher Searcher@213f379 main{StandardDirectoryReader(segments_1:1)}
[junit4:junit4]   2> 3202 T271 oasc.ZkController.publish publishing core=collection1 state=down
[junit4:junit4]   2> 3202 T271 oasc.ZkController.publish numShards not found on descriptor - reading it from system property
[junit4:junit4]   2> 3204 T251 oazs.PrepRequestProcessor.pRequest Got user-level KeeperException when processing sessionid:0x13c4dad48820003 type:create cxid:0x50 zxid:0x29 txntype:-1 reqpath:n/a Error Path:/solr/overseer/queue Error:KeeperErrorCode = NoNode for /solr/overseer/queue
[junit4:junit4]   2> 3631 T269 oascc.ZkStateReader.updateClusterState Updating cloud state from ZooKeeper... 
[junit4:junit4]   2> 3633 T269 oasc.Overseer$ClusterStateUpdater.updateState Update state numShards=1 message={
[junit4:junit4]   2> 	  "operation":"state",
[junit4:junit4]   2> 	  "numShards":"1",
[junit4:junit4]   2> 	  "shard":null,
[junit4:junit4]   2> 	  "roles":null,
[junit4:junit4]   2> 	  "state":"down",
[junit4:junit4]   2> 	  "core":"collection1",
[junit4:junit4]   2> 	  "collection":"control_collection",
[junit4:junit4]   2> 	  "node_name":"127.0.0.1:51145__%2Frz",
[junit4:junit4]   2> 	  "base_url":"http://127.0.0.1:51145/_/rz"}
[junit4:junit4]   2> 3633 T269 oasc.Overseer$ClusterStateUpdater.createCollection Create collection control_collection with numShards 1
[junit4:junit4]   2> 3633 T269 oasc.Overseer$ClusterStateUpdater.updateState Assigning new node to shard shard=shard1
[junit4:junit4]   2> 3634 T251 oazs.PrepRequestProcessor.pRequest Got user-level KeeperException when processing sessionid:0x13c4dad48820003 type:create cxid:0x58 zxid:0x2c txntype:-1 reqpath:n/a Error Path:/solr/overseer/queue-work Error:KeeperErrorCode = NoNode for /solr/overseer/queue-work
[junit4:junit4]   2> 3643 T268 oascc.ZkStateReader$2.process A cluster state change: WatchedEvent state:SyncConnected type:NodeDataChanged path:/clusterstate.json, has occurred - updating... (live nodes size: 1)
[junit4:junit4]   2> 4211 T271 oasc.CoreContainer.registerCore registering core: collection1
[junit4:junit4]   2> 4212 T271 oasc.ZkController.register Register replica - core:collection1 address:http://127.0.0.1:51145/_/rz collection:control_collection shard:shard1
[junit4:junit4]   2> 4214 T271 oascc.SolrZkClient.makePath makePath: /collections/control_collection/leader_elect/shard1/election
[junit4:junit4]   2> 4230 T251 oazs.PrepRequestProcessor.pRequest Got user-level KeeperException when processing sessionid:0x13c4dad48820003 type:delete cxid:0x72 zxid:0x36 txntype:-1 reqpath:n/a Error Path:/solr/collections/control_collection/leaders Error:KeeperErrorCode = NoNode for /solr/collections/control_collection/leaders
[junit4:junit4]   2> 4231 T271 oasc.ShardLeaderElectionContext.runLeaderProcess Running the leader process.
[junit4:junit4]   2> 4232 T251 oazs.PrepRequestProcessor.pRequest Got user-level KeeperException when processing sessionid:0x13c4dad48820003 type:create cxid:0x73 zxid:0x37 txntype:-1 reqpath:n/a Error Path:/solr/overseer Error:KeeperErrorCode = NodeExists for /solr/overseer
[junit4:junit4]   2> 4236 T271 oasc.ShardLeaderElectionContext.waitForReplicasToComeUp Enough replicas found to continue.
[junit4:junit4]   2> 4237 T271 oasc.ShardLeaderElectionContext.runLeaderProcess I may be the new leader - try and sync
[junit4:junit4]   2> 4237 T271 oasc.SyncStrategy.sync Sync replicas to http://127.0.0.1:51145/_/rz/collection1/
[junit4:junit4]   2> 4237 T271 oasc.SyncStrategy.syncReplicas Sync Success - now sync replicas to me
[junit4:junit4]   2> 4238 T271 oasc.SyncStrategy.syncToMe http://127.0.0.1:51145/_/rz/collection1/ has no replicas
[junit4:junit4]   2> 4238 T271 oasc.ShardLeaderElectionContext.runLeaderProcess I am the new leader: http://127.0.0.1:51145/_/rz/collection1/
[junit4:junit4]   2> 4238 T271 oascc.SolrZkClient.makePath makePath: /collections/control_collection/leaders/shard1
[junit4:junit4]   2> 4249 T251 oazs.PrepRequestProcessor.pRequest Got user-level KeeperException when processing sessionid:0x13c4dad48820003 type:create cxid:0x7d zxid:0x3b txntype:-1 reqpath:n/a Error Path:/solr/overseer Error:KeeperErrorCode = NodeExists for /solr/overseer
[junit4:junit4]   2> 5154 T269 oascc.ZkStateReader.updateClusterState Updating cloud state from ZooKeeper... 
[junit4:junit4]   2> 5175 T268 oascc.ZkStateReader$2.process A cluster state change: WatchedEvent state:SyncConnected type:NodeDataChanged path:/clusterstate.json, has occurred - updating... (live nodes size: 1)
[junit4:junit4]   2> 5236 T271 oasc.ZkController.register We are http://127.0.0.1:51145/_/rz/collection1/ and leader is http://127.0.0.1:51145/_/rz/collection1/
[junit4:junit4]   2> 5236 T271 oasc.ZkController.register No LogReplay needed for core=collection1 baseURL=http://127.0.0.1:51145/_/rz
[junit4:junit4]   2> 5237 T271 oasc.ZkController.checkRecovery I am the leader, no recovery necessary
[junit4:junit4]   2> 5237 T271 oasc.ZkController.publish publishing core=collection1 state=active
[junit4:junit4]   2> 5238 T271 oasc.ZkController.publish numShards not found on descriptor - reading it from system property
[junit4:junit4]   2> 5242 T271 oascc.ZkStateReader.updateClusterState Updating cloud state from ZooKeeper... 
[junit4:junit4]   2> 5245 T246 oass.SolrDispatchFilter.init user.dir=/Users/jenkins/jenkins-slave/workspace/Lucene-Solr-4.x-MacOSX/solr/build/solr-core/test/J0
[junit4:junit4]   2> 5246 T246 oass.SolrDispatchFilter.init SolrDispatchFilter.init() done
[junit4:junit4]   2> 5246 T246 oascsi.HttpClientUtil.createClient Creating new http client, config:maxConnections=128&maxConnectionsPerHost=32&followRedirects=false
[junit4:junit4]   2> 5257 T246 oascsi.HttpClientUtil.createClient Creating new http client, config:
[junit4:junit4]   2> 5264 T246 oaz.ZooKeeper.<init> Initiating client connection, connectString=127.0.0.1:51142/solr sessionTimeout=10000 watcher=org.apache.solr.common.cloud.ConnectionManager@5c19c779
[junit4:junit4]   2> 5265 T246 oascc.ConnectionManager.waitForConnected Waiting for client to connect to ZooKeeper
[junit4:junit4]   2> 5266 T273 oaz.ClientCnxn$SendThread.logStartConnect Opening socket connection to server localhost/127.0.0.1:51142. Will not attempt to authenticate using SASL (access denied ("javax.security.auth.AuthPermission" "getLoginConfiguration"))
[junit4:junit4]   2> 5267 T273 oaz.ClientCnxn$SendThread.primeConnection Socket connection established to localhost/127.0.0.1:51142, initiating session
[junit4:junit4]   2> 5268 T248 oazs.NIOServerCnxnFactory.run Accepted socket connection from /127.0.0.1:51148
[junit4:junit4]   2> 5269 T248 oazs.ZooKeeperServer.processConnectRequest Client attempting to establish new session at /127.0.0.1:51148
[junit4:junit4]   2> 5271 T250 oazs.ZooKeeperServer.finishSessionInit Established session 0x13c4dad48820004 with negotiated timeout 10000 for client /127.0.0.1:51148
[junit4:junit4]   2> 5271 T273 oaz.ClientCnxn$SendThread.onConnected Session establishment complete on server localhost/127.0.0.1:51142, sessionid = 0x13c4dad48820004, negotiated timeout = 10000
[junit4:junit4]   2> 5272 T274 oascc.ConnectionManager.process Watcher org.apache.solr.common.cloud.ConnectionManager@5c19c779 name:ZooKeeperConnection Watcher:127.0.0.1:51142/solr got event WatchedEvent state:SyncConnected type:None path:null path:null type:None
[junit4:junit4]   2> 5273 T246 oascc.ConnectionManager.waitForConnected Client is connected to ZooKeeper
[junit4:junit4]   2> 5276 T246 oascc.ZkStateReader.createClusterStateWatchersAndUpdate Updating cluster state from ZooKeeper... 
[junit4:junit4]   2> 5282 T246 oasc.ChaosMonkey.monkeyLog monkey: init - expire sessions:true cause connection loss:true
[junit4:junit4]   2> 5483 T246 oejs.Server.doStart jetty-8.1.8.v20121106
[junit4:junit4]   2> 5488 T246 oejs.AbstractConnector.doStart Started SelectChannelConnector@127.0.0.1:51149
[junit4:junit4]   2> 5490 T246 oass.SolrDispatchFilter.init SolrDispatchFilter.init()
[junit4:junit4]   2> 5491 T246 oasc.SolrResourceLoader.locateSolrHome JNDI not configured for solr (NoInitialContextEx)
[junit4:junit4]   2> 5493 T246 oasc.SolrResourceLoader.locateSolrHome using system property solr.solr.home: /Users/jenkins/jenkins-slave/workspace/Lucene-Solr-4.x-MacOSX/solr/build/solr-core/test/J0/./org.apache.solr.cloud.BasicDistributedZkTest-jetty1-1358512872717
[junit4:junit4]   2> 5494 T246 oasc.CoreContainer$Initializer.initialize looking for solr.xml: /Users/jenkins/jenkins-slave/workspace/Lucene-Solr-4.x-MacOSX/solr/build/solr-core/test/J0/./org.apache.solr.cloud.BasicDistributedZkTest-jetty1-1358512872717/solr.xml
[junit4:junit4]   2> 5495 T246 oasc.CoreContainer.<init> New CoreContainer 1035397405
[junit4:junit4]   2> 5495 T246 oasc.CoreContainer.load Loading CoreContainer using Solr Home: '/Users/jenkins/jenkins-slave/workspace/Lucene-Solr-4.x-MacOSX/solr/build/solr-core/test/J0/./org.apache.solr.cloud.BasicDistributedZkTest-jetty1-1358512872717/'
[junit4:junit4]   2> 5496 T246 oasc.SolrResourceLoader.<init> new SolrResourceLoader for directory: '/Users/jenkins/jenkins-slave/workspace/Lucene-Solr-4.x-MacOSX/solr/build/solr-core/test/J0/./org.apache.solr.cloud.BasicDistributedZkTest-jetty1-1358512872717/'
[junit4:junit4]   2> 5549 T246 oashc.HttpShardHandlerFactory.getParameter Setting socketTimeout to: 60000
[junit4:junit4]   2> 5550 T246 oashc.HttpShardHandlerFactory.getParameter Setting urlScheme to: http://
[junit4:junit4]   2> 5550 T246 oashc.HttpShardHandlerFactory.getParameter Setting connTimeout to: 15000
[junit4:junit4]   2> 5551 T246 oashc.HttpShardHandlerFactory.getParameter Setting maxConnectionsPerHost to: 20
[junit4:junit4]   2> 5552 T246 oashc.HttpShardHandlerFactory.getParameter Setting corePoolSize to: 0
[junit4:junit4]   2> 5553 T246 oashc.HttpShardHandlerFactory.getParameter Setting maximumPoolSize to: 2147483647
[junit4:junit4]   2> 5554 T246 oashc.HttpShardHandlerFactory.getParameter Setting maxThreadIdleTime to: 5
[junit4:junit4]   2> 5554 T246 oashc.HttpShardHandlerFactory.getParameter Setting sizeOfQueue to: -1
[junit4:junit4]   2> 5555 T246 oashc.HttpShardHandlerFactory.getParameter Setting fairnessPolicy to: false
[junit4:junit4]   2> 5556 T246 oascsi.HttpClientUtil.createClient Creating new http client, config:maxConnectionsPerHost=20&maxConnections=10000&socketTimeout=60000&connTimeout=15000&retry=false
[junit4:junit4]   2> 5577 T246 oasc.CoreContainer.load Registering Log Listener
[junit4:junit4]   2> 5601 T246 oasc.CoreContainer.initZooKeeper Zookeeper client=127.0.0.1:51142/solr
[junit4:junit4]   2> 5602 T246 oasc.ZkController.checkChrootPath zkHost includes chroot
[junit4:junit4]   2> 5603 T246 oaz.ZooKeeper.<init> Initiating client connection, connectString=127.0.0.1:51142 sessionTimeout=60000 watcher=org.apache.solr.common.cloud.ConnectionManager@35b7767
[junit4:junit4]   2> 5604 T246 oascc.ConnectionManager.waitForConnected Waiting for client to connect to ZooKeeper
[junit4:junit4]   2> 5605 T284 oaz.ClientCnxn$SendThread.logStartConnect Opening socket connection to server localhost/127.0.0.1:51142. Will not attempt to authenticate using SASL (access denied ("javax.security.auth.AuthPermission" "getLoginConfiguration"))
[junit4:junit4]   2> 5607 T284 oaz.ClientCnxn$SendThread.primeConnection Socket connection established to localhost/127.0.0.1:51142, initiating session
[junit4:junit4]   2> 5608 T248 oazs.NIOServerCnxnFactory.run Accepted socket connection from /127.0.0.1:51150
[junit4:junit4]   2> 5609 T248 oazs.ZooKeeperServer.processConnectRequest Client attempting to establish new session at /127.0.0.1:51150
[junit4:junit4]   2> 5611 T250 oazs.ZooKeeperServer.finishSessionInit Established session 0x13c4dad48820005 with negotiated timeout 20000 for client /127.0.0.1:51150
[junit4:junit4]   2> 5611 T284 oaz.ClientCnxn$SendThread.onConnected Session establishment complete on server localhost/127.0.0.1:51142, sessionid = 0x13c4dad48820005, negotiated timeout = 20000
[junit4:junit4]   2> 5611 T285 oascc.ConnectionManager.process Watcher org.apache.solr.common.cloud.ConnectionManager@35b7767 name:ZooKeeperConnection Watcher:127.0.0.1:51142 got event WatchedEvent state:SyncConnected type:None path:null path:null type:None
[junit4:junit4]   2> 5612 T246 oascc.ConnectionManager.waitForConnected Client is connected to ZooKeeper
[junit4:junit4]   2> 5615 T251 oazs.PrepRequestProcessor.pRequest2Txn Processed session termination for sessionid: 0x13c4dad48820005
[junit4:junit4]   2> 5617 T248 oazs.NIOServerCnxn.closeSock Closed socket connection for client /127.0.0.1:51150 which had sessionid 0x13c4dad48820005
[junit4:junit4]   2> 5617 T246 oaz.ZooKeeper.close Session: 0x13c4dad48820005 closed
[junit4:junit4]   2> 5617 T285 oaz.ClientCnxn$EventThread.run EventThread shut down
[junit4:junit4]   2> 5618 T246 oascsi.HttpClientUtil.createClient Creating new http client, config:maxConnections=500&maxConnectionsPerHost=16&socketTimeout=60000&connTimeout=15000
[junit4:junit4]   2> 5627 T246 oaz.ZooKeeper.<init> Initiating client connection, connectString=127.0.0.1:51142/solr sessionTimeout=30000 watcher=org.apache.solr.common.cloud.ConnectionManager@31763c9a
[junit4:junit4]   2> 5628 T246 oascc.ConnectionManager.waitForConnected Waiting for client to connect to ZooKeeper
[junit4:junit4]   2> 5629 T286 oaz.ClientCnxn$SendThread.logStartConnect Opening socket connection to server localhost/127.0.0.1:51142. Will not attempt to authenticate using SASL (access denied ("javax.security.auth.AuthPermission" "getLoginConfiguration"))
[junit4:junit4]   2> 5630 T286 oaz.ClientCnxn$SendThread.primeConnection Socket connection established to localhost/127.0.0.1:51142, initiating session
[junit4:junit4]   2> 5630 T248 oazs.NIOServerCnxnFactory.run Accepted socket connection from /127.0.0.1:51151
[junit4:junit4]   2> 5631 T248 oazs.ZooKeeperServer.processConnectRequest Client attempting to establish new session at /127.0.0.1:51151
[junit4:junit4]   2> 5633 T250 oazs.ZooKeeperServer.finishSessionInit Established session 0x13c4dad48820006 with negotiated timeout 20000 for client /127.0.0.1:51151
[junit4:junit4]   2> 5634 T286 oaz.ClientCnxn$SendThread.onConnected Session establishment complete on server localhost/127.0.0.1:51142, sessionid = 0x13c4dad48820006, negotiated timeout = 20000
[junit4:junit4]   2> 5634 T287 oascc.ConnectionManager.process Watcher org.apache.solr.common.cloud.ConnectionManager@31763c9a name:ZooKeeperConnection Watcher:127.0.0.1:51142/solr got event WatchedEvent state:SyncConnected type:None path:null path:null type:None
[junit4:junit4]   2> 5635 T246 oascc.ConnectionManager.waitForConnected Client is connected to ZooKeeper
[junit4:junit4]   2> 5637 T251 oazs.PrepRequestProcessor.pRequest Got user-level KeeperException when processing sessionid:0x13c4dad48820006 type:create cxid:0x1 zxid:0x49 txntype:-1 reqpath:n/a Error Path:/solr/overseer Error:KeeperErrorCode = NodeExists for /solr/overseer
[junit4:junit4]   2> 5640 T251 oazs.PrepRequestProcessor.pRequest Got user-level KeeperException when processing sessionid:0x13c4dad48820006 type:create cxid:0x2 zxid:0x4a txntype:-1 reqpath:n/a Error Path:/solr/overseer Error:KeeperErrorCode = NodeExists for /solr/overseer
[junit4:junit4]   2> 5642 T246 oasc.ZkController.createEphemeralLiveNode Register node as live in ZooKeeper:/live_nodes/127.0.0.1:51149__%2Frz
[junit4:junit4]   2> 5644 T251 oazs.PrepRequestProcessor.pRequest Got user-level KeeperException when processing sessionid:0x13c4dad48820006 type:delete cxid:0x4 zxid:0x4b txntype:-1 reqpath:n/a Error Path:/solr/live_nodes/127.0.0.1:51149__%2Frz Error:KeeperErrorCode = NoNode for /solr/live_nodes/127.0.0.1:51149__%2Frz
[junit4:junit4]   2> 5645 T246 oascc.SolrZkClient.makePath makePath: /live_nodes/127.0.0.1:51149__%2Frz
[junit4:junit4]   2> 5652 T268 oascc.ZkStateReader$3.process Updating live nodes... (2)
[junit4:junit4]   2> 5653 T268 oascc.ZkStateReader$2.process A cluster state change: WatchedEvent state:SyncConnected type:NodeChildrenChanged path:/live_nodes, has occurred - updating... (live nodes size: 2)
[junit4:junit4]   2> 5653 T274 oascc.ZkStateReader$3.process Updating live nodes... (2)
[junit4:junit4]   2> 5660 T246 oascc.ZkStateReader.createClusterStateWatchersAndUpdate Updating cluster state from ZooKeeper... 
[junit4:junit4]   2> 5671 T288 oasc.CoreContainer.create Creating SolrCore 'collection1' using instanceDir: /Users/jenkins/jenkins-slave/workspace/Lucene-Solr-4.x-MacOSX/solr/build/solr-core/test/J0/./org.apache.solr.cloud.BasicDistributedZkTest-jetty1-1358512872717/collection1
[junit4:junit4]   2> 5672 T288 oasc.ZkController.createCollectionZkNode Check for collection zkNode:collection1
[junit4:junit4]   2> 5674 T288 oasc.ZkController.createCollectionZkNode Collection zkNode exists
[junit4:junit4]   2> 5674 T288 oasc.ZkController.readConfigName Load collection config from:/collections/collection1
[junit4:junit4]   2> 5677 T288 oasc.SolrResourceLoader.<init> new SolrResourceLoader for directory: '/Users/jenkins/jenkins-slave/workspace/Lucene-Solr-4.x-MacOSX/solr/build/solr-core/test/J0/./org.apache.solr.cloud.BasicDistributedZkTest-jetty1-1358512872717/collection1/'
[junit4:junit4]   2> 5678 T288 oasc.SolrResourceLoader.replaceClassLoader Adding 'file:/Users/jenkins/jenkins-slave/workspace/Lucene-Solr-4.x-MacOSX/solr/build/solr-core/test/J0/org.apache.solr.cloud.BasicDistributedZkTest-jetty1-1358512872717/collection1/lib/classes/' to classloader
[junit4:junit4]   2> 5679 T288 oasc.SolrResourceLoader.replaceClassLoader Adding 'file:/Users/jenkins/jenkins-slave/workspace/Lucene-Solr-4.x-MacOSX/solr/build/solr-core/test/J0/org.apache.solr.cloud.BasicDistributedZkTest-jetty1-1358512872717/collection1/lib/README' to classloader
[junit4:junit4]   2> 5780 T288 oasc.SolrConfig.<init> Using Lucene MatchVersion: LUCENE_42
[junit4:junit4]   2> 5860 T288 oasc.SolrConfig.<init> Loaded SolrConfig: solrconfig.xml
[junit4:junit4]   2> 5863 T288 oass.IndexSchema.readSchema Reading Solr Schema
[junit4:junit4]   2> 5871 T288 oass.IndexSchema.readSchema Schema name=test
[junit4:junit4]   2> 6620 T288 oass.OpenExchangeRatesOrgProvider.init Initialized with rates=open-exchange-rates.json, refreshInterval=1440.
[junit4:junit4]   2> 6635 T288 oass.IndexSchema.readSchema default search field in schema is text
[junit4:junit4]   2> 6640 T288 oass.IndexSchema.readSchema unique key field: id
[junit4:junit4]   2> 6683 T288 oass.FileExchangeRateProvider.reload Reloading exchange rates from file currency.xml
[junit4:junit4]   2> 6689 T269 oascc.ZkStateReader.updateClusterState Updating cloud state from ZooKeeper... 
[junit4:junit4]   2> 6691 T288 oass.FileExchangeRateProvider.reload Reloading exchange rates from file currency.xml
[junit4:junit4]   2> 6692 T269 oasc.Overseer$ClusterStateUpdater.updateState Update state numShards=1 message={
[junit4:junit4]   2> 	  "operation":"state",
[junit4:junit4]   2> 	  "numShards":"1",
[junit4:junit4]   2> 	  "shard":"shard1",
[junit4:junit4]   2> 	  "roles":null,
[junit4:junit4]   2> 	  "state":"active",
[junit4:junit4]   2> 	  "core":"collection1",
[junit4:junit4]   2> 	  "collection":"control_collection",
[junit4:junit4]   2> 	  "node_name":"127.0.0.1:51145__%2Frz",
[junit4:junit4]   2> 	  "base_url":"http://127.0.0.1:51145/_/rz"}
[junit4:junit4]   2> 6700 T288 oass.OpenExchangeRatesOrgProvider.reload Reloading exchange rates from open-exchange-rates.json
[junit4:junit4]   2> 6703 T288 oass.OpenExchangeRatesOrgProvider.reload Reloading exchange rates from open-exchange-rates.json
[junit4:junit4]   2> 6708 T287 oascc.ZkStateReader$2.process A cluster state change: WatchedEvent state:SyncConnected type:NodeDataChanged path:/clusterstate.json, has occurred - updating... (live nodes size: 2)
[junit4:junit4]   2> 6709 T274 oascc.ZkStateReader$2.process A cluster state change: WatchedEvent state:SyncConnected type:NodeDataChanged path:/clusterstate.json, has occurred - updating... (live nodes size: 2)
[junit4:junit4]   2> 6711 T268 oascc.ZkStateReader$2.process A cluster state change: WatchedEvent state:SyncConnected type:NodeDataChanged path:/clusterstate.json, has occurred - updating... (live nodes size: 2)
[junit4:junit4]   2> 6717 T288 oasc.SolrCore.<init> [collection1] Opening new SolrCore at /Users/jenkins/jenkins-slave/workspace/Lucene-Solr-4.x-MacOSX/solr/build/solr-core/test/J0/./org.apache.solr.cloud.BasicDistributedZkTest-jetty1-1358512872717/collection1/, dataDir=./org.apache.solr.cloud.BasicDistributedZkTest-1358512867445/jetty1/
[junit4:junit4]   2> 6718 T288 oasc.JmxMonitoredMap.<init> JMX monitoring is enabled. Adding Solr mbeans to JMX Server: com.sun.jmx.mbeanserver.JmxMBeanServer@2b10f19b
[junit4:junit4]   2> 6719 T288 oasc.SolrCore.initDirectoryFactory solr.NRTCachingDirectoryFactory
[junit4:junit4]   2> 6720 T288 oasc.CachingDirectoryFactory.get return new directory for /Users/jenkins/jenkins-slave/workspace/Lucene-Solr-4.x-MacOSX/solr/build/solr-core/test/J0/./org.apache.solr.cloud.BasicDistributedZkTest-1358512867445/jetty1 forceNew:false
[junit4:junit4]   2> 6720 T288 oasc.CachingDirectoryFactory.close Releasing directory:/Users/jenkins/jenkins-slave/workspace/Lucene-Solr-4.x-MacOSX/solr/build/solr-core/test/J0/./org.apache.solr.cloud.BasicDistributedZkTest-1358512867445/jetty1
[junit4:junit4]   2> 6721 T288 oasc.SolrCore.getNewIndexDir New index directory detected: old=null new=./org.apache.solr.cloud.BasicDistributedZkTest-1358512867445/jetty1/index/
[junit4:junit4]   2> 6722 T288 oasc.SolrCore.initIndex WARNING [collection1] Solr index directory './org.apache.solr.cloud.BasicDistributedZkTest-1358512867445/jetty1/index' doesn't exist. Creating new index...
[junit4:junit4]   2> 6723 T288 oasc.CachingDirectoryFactory.get return new directory for /Users/jenkins/jenkins-slave/workspace/Lucene-Solr-4.x-MacOSX/solr/build/solr-core/test/J0/./org.apache.solr.cloud.BasicDistributedZkTest-1358512867445/jetty1/index forceNew:false
[junit4:junit4]   2> 6730 T288 oasc.SolrDeletionPolicy.onCommit SolrDeletionPolicy.onCommit: commits:num=1
[junit4:junit4]   2> 		commit{dir=RateLimitedDirectoryWrapper(NRTCachingDirectory(org.apache.lucene.store.NIOFSDirectory@/Users/jenkins/jenkins-slave/workspace/Lucene-Solr-4.x-MacOSX/solr/build/solr-core/test/J0/org.apache.solr.cloud.BasicDistributedZkTest-1358512867445/jetty1/index lockFactory=org.apache.lucene.store.NativeFSLockFactory@494b05ae; maxCacheMB=48.0 maxMergeSizeMB=4.0)),segFN=segments_1,generation=1,filenames=[segments_1]
[junit4:junit4]   2> 6730 T288 oasc.SolrDeletionPolicy.updateCommits newest commit = 1[segments_1]
[junit4:junit4]   2> 6731 T288 oasc.CachingDirectoryFactory.close Releasing directory:/Users/jenkins/jenkins-slave/workspace/Lucene-Solr-4.x-MacOSX/solr/build/solr-core/test/J0/./org.apache.solr.cloud.BasicDistributedZkTest-1358512867445/jetty1/index
[junit4:junit4]   2> 6732 T288 oasc.SolrCore.initWriters created xml: solr.XMLResponseWriter
[junit4:junit4]   2> 6735 T288 oasup.UpdateRequestProcessorChain.init inserting DistributedUpdateProcessorFactory into updateRequestProcessorChain "dedupe"
[junit4:junit4]   2> 6736 T288 oasup.UpdateRequestProcessorChain.init inserting DistributedUpdateProcessorFactory into updateRequestProcessorChain "dedupe-allfields"
[junit4:junit4]   2> 6737 T288 oasup.UpdateRequestProcessorChain.init inserting DistributedUpdateProcessorFactory into updateRequestProcessorChain "stored_sig"
[junit4:junit4]   2> 6738 T288 oasup.UpdateRequestProcessorChain.init inserting DistributedUpdateProcessorFactory into updateRequestProcessorChain "uniq-fields"
[junit4:junit4]   2> 6740 T288 oasup.UpdateRequestProcessorChain.init inserting DistributedUpdateProcessorFactory into updateRequestProcessorChain "distrib-dup-test-chain-implicit"
[junit4:junit4]   2> 6740 T288 oasc.RequestHandlers.initHandlersFromConfig adding lazy requestHandler: solr.ReplicationHandler
[junit4:junit4]   2> 6741 T288 oasc.RequestHandlers.initHandlersFromConfig created /replication: solr.ReplicationHandler
[junit4:junit4]   2> 6742 T288 oasc.RequestHandlers.initHandlersFromConfig created standard: solr.StandardRequestHandler
[junit4:junit4]   2> 6743 T288 oasc.RequestHandlers.initHandlersFromConfig created /get: solr.RealTimeGetHandler
[junit4:junit4]   2> 6744 T288 oasc.RequestHandlers.initHandlersFromConfig created dismax: solr.SearchHandler
[junit4:junit4]   2> 6745 T288 oasc.RequestHandlers.initHandlersFromConfig created mock: org.apache.solr.core.MockQuerySenderListenerReqHandler
[junit4:junit4]   2> 6746 T288 oasc.RequestHandlers.initHandlersFromConfig created /admin/: org.apache.solr.handler.admin.AdminHandlers
[junit4:junit4]   2> 6746 T288 oasc.RequestHandlers.initHandlersFromConfig created defaults: solr.StandardRequestHandler
[junit4:junit4]   2> 6747 T288 oasc.RequestHandlers.initHandlersFromConfig adding lazy requestHandler: solr.StandardRequestHandler
[junit4:junit4]   2> 6748 T288 oasc.RequestHandlers.initHandlersFromConfig created lazy: solr.StandardRequestHandler
[junit4:junit4]   2> 6749 T288 oasc.RequestHandlers.initHandlersFromConfig created /update: solr.UpdateRequestHandler
[junit4:junit4]   2> 6749 T288 oasc.RequestHandlers.initHandlersFromConfig created /terms: org.apache.solr.handler.component.SearchHandler
[junit4:junit4]   2> 6750 T288 oasc.RequestHandlers.initHandlersFromConfig created spellCheckCompRH: org.apache.solr.handler.component.SearchHandler
[junit4:junit4]   2> 6751 T288 oasc.RequestHandlers.initHandlersFromConfig created spellCheckCompRH_Direct: org.apache.solr.handler.component.SearchHandler
[junit4:junit4]   2> 6752 T288 oasc.RequestHandlers.initHandlersFromConfig created spellCheckWithWordbreak: org.apache.solr.handler.component.SearchHandler
[junit4:junit4]   2> 6754 T288 oasc.RequestHandlers.initHandlersFromConfig created spellCheckWithWordbreak_Direct: org.apache.solr.handler.component.SearchHandler
[junit4:junit4]   2> 6755 T288 oasc.RequestHandlers.initHandlersFromConfig created spellCheckCompRH1: org.apache.solr.handler.component.SearchHandler
[junit4:junit4]   2> 6756 T288 oasc.RequestHandlers.initHandlersFromConfig created mltrh: org.apache.solr.handler.component.SearchHandler
[junit4:junit4]   2> 6757 T288 oasc.RequestHandlers.initHandlersFromConfig created tvrh: org.apache.solr.handler.component.SearchHandler
[junit4:junit4]   2> 6759 T288 oasc.RequestHandlers.initHandlersFromConfig created /mlt: solr.MoreLikeThisHandler
[junit4:junit4]   2> 6760 T288 oasc.RequestHandlers.initHandlersFromConfig created /debug/dump: solr.DumpRequestHandler
[junit4:junit4]   2> 6768 T288 oashl.XMLLoader.init xsltCacheLifetimeSeconds=60
[junit4:junit4]   2> 6771 T288 oasc.SolrCore.initDeprecatedSupport WARNING solrconfig.xml uses deprecated <admin/gettableFiles>, Please update your config to use the ShowFileRequestHandler.
[junit4:junit4]   2> 6774 T288 oasc.SolrCore.initDeprecatedSupport WARNING adding ShowFileRequestHandler with hidden files: [SCHEMA.XML, OLD_SYNONYMS.TXT, STOPWORDS.TXT, PROTWORDS.TXT, OPEN-EXCHANGE-RATES.JSON, SYNONYMS.TXT, CURRENCY.XML, MAPPING-ISOLATIN1ACCENT.TXT]
[junit4:junit4]   2> 6778 T288 oasc.CachingDirectoryFactory.close Releasing directory:/Users/jenkins/jenkins-slave/workspace/Lucene-Solr-4.x-MacOSX/solr/build/solr-core/test/J0/./org.apache.solr.cloud.BasicDistributedZkTest-1358512867445/jetty1
[junit4:junit4]   2> 6781 T288 oass.SolrIndexSearcher.<init> Opening Searcher@4fdb97c8 main
[junit4:junit4]   2> 6783 T288 oasu.CommitTracker.<init> Hard AutoCommit: disabled
[junit4:junit4]   2> 6783 T288 oasu.CommitTracker.<init> Soft AutoCommit: disabled
[junit4:junit4]   2> 6785 T288 oashc.SpellCheckComponent.inform Initializing spell checkers
[junit4:junit4]   2> 6794 T288 oass.DirectSolrSpellChecker.init init: {name=direct,classname=DirectSolrSpellChecker,field=lowerfilt,minQueryLength=3}
[junit4:junit4]   2> 6832 T289 oasc.SolrCore.registerSearcher [collection1] Registered new searcher Searcher@4fdb97c8 main{StandardDirectoryReader(segments_1:1)}
[junit4:junit4]   2> 6843 T288 oasc.ZkController.publish publishing core=collection1 state=down
[junit4:junit4]   2> 6843 T288 oasc.ZkController.publish numShards not found on descriptor - reading it from system property
[junit4:junit4]   2> 8232 T269 oascc.ZkStateReader.updateClusterState Updating cloud state from ZooKeeper... 
[junit4:junit4]   2> 8234 T269 oasc.Overseer$ClusterStateUpdater.updateState Update state numShards=2 message={
[junit4:junit4]   2> 	  "operation":"state",
[junit4:junit4]   2> 	  "numShards":"2",
[junit4:junit4]   2> 	  "shard":null,
[junit4:junit4]   2> 	  "roles":null,
[junit4:junit4]   2> 	  "state":"down",
[junit4:junit4]   2> 	  "core":"collection1",
[junit4:junit4]   2> 	  "collection":"collection1",
[junit4:junit4]   2> 	  "node_name":"127.0.0.1:51149__%2Frz",
[junit4:junit4]   2> 	  "base_url":"http://127.0.0.1:51149/_/rz"}
[junit4:junit4]   2> 8234 T269 oasc.Overseer$ClusterStateUpdater.createCollection Create collection collection1 with numShards 2
[junit4:junit4]   2> 8235 T269 oasc.Overseer$ClusterStateUpdater.updateState Assigning new node to shard shard=shard1
[junit4:junit4]   2> 8244 T268 oascc.ZkStateReader$2.process A cluster state change: WatchedEvent state:SyncConnected type:NodeDataChanged path:/clusterstate.json, has occurred - updating... (live nodes size: 2)
[junit4:junit4]   2> 8245 T287 oascc.ZkStateReader$2.process A cluster state change: WatchedEvent state:SyncConnected type:NodeDataChanged path:/clusterstate.json, has occurred - updating... (live nodes size: 2)
[junit4:junit4]   2> 8245 T274 oascc.ZkStateReader$2.process A cluster state change: WatchedEvent state:SyncConnected type:NodeDataChanged path:/clusterstate.json, has occurred - updating... (live nodes size: 2)
[junit4:junit4]   2> 8851 T288 oasc.CoreContainer.registerCore registering core: collection1
[junit4:junit4]   2> 8851 T288 oasc.ZkController.register Register replica - core:collection1 address:http://127.0.0.1:51149/_/rz collection:collection1 shard:shard1
[junit4:junit4]   2> 8853 T288 oascc.SolrZkClient.makePath makePath: /collections/collection1/leader_elect/shard1/election
[junit4:junit4]   2> 8870 T251 oazs.PrepRequestProcessor.pRequest Got user-level KeeperException when processing sessionid:0x13c4dad48820006 type:delete cxid:0x45 zxid:0x5b txntype:-1 reqpath:n/a Error Path:/solr/collections/collection1/leaders Error:KeeperErrorCode = NoNode for /solr/collections/collection1/leaders
[junit4:junit4]   2> 8872 T288 oasc.ShardLeaderElectionContext.runLeaderProcess Running the leader process.
[junit4:junit4]   2> 8873 T251 oazs.PrepRequestProcessor.pRequest Got user-level KeeperException when processing sessionid:0x13c4dad48820006 type:create cxid:0x46 zxid:0x5c txntype:-1 reqpath:n/a Error Path:/solr/overseer Error:KeeperErrorCode = NodeExists for /solr/overseer
[junit4:junit4]   2> 8877 T288 oasc.ShardLeaderElectionContext.waitForReplicasToComeUp Enough replicas found to continue.
[junit4:junit4]   2> 8878 T288 oasc.ShardLeaderElectionContext.runLeaderProcess I may be the new leader - try and sync
[junit4:junit4]   2> 8879 T288 oasc.SyncStrategy.sync Sync replicas to http://127.0.0.1:51149/_/rz/collection1/
[junit4:junit4]   2> 8880 T288 oasc.SyncStrategy.syncReplicas Sync Success - now sync replicas to me
[junit4:junit4]   2> 8880 T288 oasc.SyncStrategy.syncToMe http://127.0.0.1:51149/_/rz/collection1/ has no replicas
[junit4:junit4]   2> 8881 T288 oasc.ShardLeaderElectionContext.runLeaderProcess I am the new leader: http://127.0.0.1:51149/_/rz/collection1/
[junit4:junit4]   2> 8882 T288 oascc.SolrZkClient.makePath makePath: /collections/collection1/leaders/shard1
[junit4:junit4]   2> 8894 T251 oazs.PrepRequestProcessor.pRequest Got user-level KeeperException when processing sessionid:0x13c4dad48820006 type:create cxid:0x50 zxid:0x60 txntype:-1 reqpath:n/a Error Path:/solr/overseer Error:KeeperErrorCode = NodeExists for /solr/overseer
[junit4:junit4]   2> 9756 T269 oascc.ZkStateReader.updateClusterState Updating cloud state from ZooKeeper... 
[junit4:junit4]   2> 9771 T268 oascc.ZkStateReader$2.process A cluster state change: WatchedEvent state:SyncConnected type:NodeDataChanged path:/clusterstate.json, has occurred - updating... (live nodes size: 2)
[junit4:junit4]   2> 9772 T287 oascc.ZkStateReader$2.process A cluster state change: WatchedEvent state:SyncConnected type:NodeDataChanged path:/clusterstate.json, has occurred - updating... (live nodes size: 2)
[junit4:junit4]   2> 9772 T274 oascc.ZkStateReader$2.process A cluster state change: WatchedEvent state:SyncConnected type:NodeDataChanged path:/clusterstate.json, has occurred - updating... (live nodes size: 2)
[junit4:junit4]   2> 9795 T288 oasc.ZkController.register We are http://127.0.0.1:51149/_/rz/collection1/ and leader is http://127.0.0.1:51149/_/rz/collection1/
[junit4:junit4]   2> 9795 T288 oasc.ZkController.register No LogReplay needed for core=collection1 baseURL=http://127.0.0.1:51149/_/rz
[junit4:junit4]   2> 9796 T288 oasc.ZkController.checkRecovery I am the leader, no recovery necessary
[junit4:junit4]   2> 9796 T288 oasc.ZkController.publish publishing core=collection1 state=active
[junit4:junit4]   2> 9796 T288 oasc.ZkController.publish numShards not found on descriptor - reading it from system property
[junit4:junit4]   2> 9800 T288 oascc.ZkStateReader.updateClusterState Updating cloud state from ZooKeeper... 
[junit4:junit4]   2> 9802 T246 oass.SolrDispatchFilter.init user.dir=/Users/jenkins/jenkins-slave/workspace/Lucene-Solr-4.x-MacOSX/solr/build/solr-core/test/J0
[junit4:junit4]   2> 9803 T246 oass.SolrDispatchFilter.init SolrDispatchFilter.init() done
[junit4:junit4]   2> 9803 T246 oascsi.HttpClientUtil.createClient Creating new http client, config:maxConnections=128&maxConnectionsPerHost=32&followRedirects=false
[junit4:junit4]   2> 9998 T246 oejs.Server.doStart jetty-8.1.8.v20121106
[junit4:junit4]   2> 10003 T246 oejs.AbstractConnector.doStart Started SelectChannelConnector@127.0.0.1:51152
[junit4:junit4]   2> 10005 T246 oass.SolrDispatchFilter.init SolrDispatchFilter.init()
[junit4:junit4]   2> 10006 T246 oasc.SolrResourceLoader.locateSolrHome JNDI not configured for solr (NoInitialContextEx)
[junit4:junit4]   2> 10007 T246 oasc.SolrResourceLoader.locateSolrHome using system property solr.solr.home: /Users/jenkins/jenkins-slave/workspace/Lucene-Solr-4.x-MacOSX/solr/build/solr-core/test/J0/./org.apache.solr.cloud.BasicDistributedZkTest-jetty2-1358512877247
[junit4:junit4]   2> 10008 T246 oasc.CoreContainer$Initializer.initialize looking for solr.xml: /Users/jenkins/jenkins-slave/workspace/Lucene-Solr-4.x-MacOSX/solr/build/solr-core/test/J0/./org.apache.solr.cloud.BasicDistributedZkTest-jetty2-1358512877247/solr.xml
[junit4:junit4]   2> 10009 T246 oasc.CoreContainer.<init> New CoreContainer 365176307
[junit4:junit4]   2> 10010 T246 oasc.CoreContainer.load Loading CoreContainer using Solr Home: '/Users/jenkins/jenkins-slave/workspace/Lucene-Solr-4.x-MacOSX/solr/build/solr-core/test/J0/./org.apache.solr.cloud.BasicDistributedZkTest-jetty2-1358512877247/'
[junit4:junit4]   2> 10011 T246 oasc.SolrResourceLoader.<init> new SolrResourceLoader for directory: '/Users/jenkins/jenkins-slave/workspace/Lucene-Solr-4.x-MacOSX/solr/build/solr-core/test/J0/./org.apache.solr.cloud.BasicDistributedZkTest-jetty2-1358512877247/'
[junit4:junit4]   2> 10053 T246 oashc.HttpShardHandlerFactory.getParameter Setting socketTimeout to: 60000
[junit4:junit4]   2> 10054 T246 oashc.HttpShardHandlerFactory.getParameter Setting urlScheme to: http://
[junit4:junit4]   2> 10054 T246 oashc.HttpShardHandlerFactory.getParameter Setting connTimeout to: 15000
[junit4:junit4]   2> 10055 T246 oashc.HttpShardHandlerFactory.getParameter Setting maxConnectionsPerHost to: 20
[junit4:junit4]   2> 10056 T246 oashc.HttpShardHandlerFactory.getParameter Setting corePoolSize to: 0
[junit4:junit4]   2> 10056 T246 oashc.HttpShardHandlerFactory.getParameter Setting maximumPoolSize to: 2147483647
[junit4:junit4]   2> 10057 T246 oashc.HttpShardHandlerFactory.getParameter Setting maxThreadIdleTime to: 5
[junit4:junit4]   2> 10057 T246 oashc.HttpShardHandlerFactory.getParameter Setting sizeOfQueue to: -1
[junit4:junit4]   2> 10058 T246 oashc.HttpShardHandlerFactory.getParameter Setting fairnessPolicy to: false
[junit4:junit4]   2> 10059 T246 oascsi.HttpClientUtil.createClient Creating new http client, config:maxConnectionsPerHost=20&maxConnections=10000&socketTimeout=60000&connTimeout=15000&retry=false
[junit4:junit4]   2> 10078 T246 oasc.CoreContainer.load Registering Log Listener
[junit4:junit4]   2> 10103 T246 oasc.CoreContainer.initZooKeeper Zookeeper client=127.0.0.1:51142/solr
[junit4:junit4]   2> 10104 T246 oasc.ZkController.checkChrootPath zkHost includes chroot
[junit4:junit4]   2> 10104 T246 oaz.ZooKeeper.<init> Initiating client connection, connectString=127.0.0.1:51142 sessionTimeout=60000 watcher=org.apache.solr.common.cloud.ConnectionManager@1b081d5e
[junit4:junit4]   2> 10106 T246 oascc.ConnectionManager.waitForConnected Waiting for client to connect to ZooKeeper
[junit4:junit4]   2> 10106 T299 oaz.ClientCnxn$SendThread.logStartConnect Opening socket connection to server localhost/127.0.0.1:51142. Will not attempt to authenticate using SASL (access denied ("javax.security.auth.AuthPermission" "getLoginConfiguration"))
[junit4:junit4]   2> 10107 T299 oaz.ClientCnxn$SendThread.primeConnection Socket connection established to localhost/127.0.0.1:51142, initiating session
[junit4:junit4]   2> 10108 T248 oazs.NIOServerCnxnFactory.run Accepted socket connection from /127.0.0.1:51153
[junit4:junit4]   2> 10109 T248 oazs.ZooKeeperServer.processConnectRequest Client attempting to establish new session at /127.0.0.1:51153
[junit4:junit4]   2> 10110 T250 oazs.ZooKeeperServer.finishSessionInit Established session 0x13c4dad48820007 with negotiated timeout 20000 for client /127.0.0.1:51153
[junit4:junit4]   2> 10110 T299 oaz.ClientCnxn$SendThread.onConnected Session establishment complete on server localhost/127.0.0.1:51142, sessionid = 0x13c4dad48820007, negotiated timeout = 20000
[junit4:junit4]   2> 10111 T300 oascc.ConnectionManager.process Watcher org.apache.solr.common.cloud.ConnectionManager@1b081d5e name:ZooKeeperConnection Watcher:127.0.0.1:51142 got event WatchedEvent state:SyncConnected type:None path:null path:null type:None
[junit4:junit4]   2> 10111 T246 oascc.ConnectionManager.waitForConnected Client is connected to ZooKeeper
[junit4:junit4]   2> 10114 T251 oazs.PrepRequestProcessor.pRequest2Txn Processed session termination for sessionid: 0x13c4dad48820007
[junit4:junit4]   2> 10115 T248 oazs.NIOServerCnxn.closeSock Closed socket connection for client /127.0.0.1:51153 which had sessionid 0x13c4dad48820007
[junit4:junit4]   2> 10116 T300 oaz.ClientCnxn$EventThread.run EventThread shut down
[junit4:junit4]   2> 10116 T246 oaz.ZooKeeper.close Session: 0x13c4dad48820007 closed
[junit4:junit4]   2> 10117 T246 oascsi.HttpClientUtil.createClient Creating new http client, config:maxConnections=500&maxConnectionsPerHost=16&socketTimeout=60000&connTimeout=15000
[junit4:junit4]   2> 10123 T246 oaz.ZooKeeper.<init> Initiating client connection, connectString=127.0.0.1:51142/solr sessionTimeout=30000 watcher=org.apache.solr.common.cloud.ConnectionManager@2ae0952f
[junit4:junit4]   2> 10125 T246 oascc.ConnectionManager.waitForConnected Waiting for client to connect to ZooKeeper
[junit4:junit4]   2> 10125 T301 oaz.ClientCnxn$SendThread.logStartConnect Opening socket connection to server localhost/127.0.0.1:51142. Will not attempt to authenticate using SASL (access denied ("javax.security.auth.AuthPermission" "getLoginConfiguration"))
[junit4:junit4]   2> 10126 T301 oaz.ClientCnxn$SendThread.primeConnection Socket connection established to localhost/127.0.0.1:51142, initiating session
[junit4:junit4]   2> 10126 T248 oazs.NIOServerCnxnFactory.run Accepted socket connection from /127.0.0.1:51154
[junit4:junit4]   2> 10127 T248 oazs.ZooKeeperServer.processConnectRequest Client attempting to establish new session at /127.0.0.1:51154
[junit4:junit4]   2> 10129 T250 oazs.ZooKeeperServer.finishSessionInit Established session 0x13c4dad48820008 with negotiated timeout 20000 for client /127.0.0.1:51154
[junit4:junit4]   2> 10129 T301 oaz.ClientCnxn$SendThread.onConnected Session establishment complete on server localhost/127.0.0.1:51142, sessionid = 0x13c4dad48820008, negotiated timeout = 20000
[junit4:junit4]   2> 10129 T302 oascc.ConnectionManager.process Watcher org.apache.solr.common.cloud.ConnectionManager@2ae0952f name:ZooKeeperConnection Watcher:127.0.0.1:51142/solr got event WatchedEvent state:SyncConnected type:None path:null path:null type:None
[junit4:junit4]   2> 10130 T246 oascc.ConnectionManager.waitForConnected Client is connected to ZooKeeper
[junit4:junit4]   2> 10132 T251 oazs.PrepRequestProcessor.pRequest Got user-level KeeperException when processing sessionid:0x13c4dad48820008 type:create cxid:0x1 zxid:0x6d txntype:-1 reqpath:n/a Error Path:/solr/overseer Error:KeeperErrorCode = NodeExists for /solr/overseer
[junit4:junit4]   2> 10133 T251 oazs.PrepRequestProcessor.pRequest Got user-level KeeperException when processing sessionid:0x13c4dad48820008 type:create cxid:0x2 zxid:0x6e txntype:-1 reqpath:n/a Error Path:/solr/overseer Error:KeeperErrorCode = NodeExists for /solr/overseer
[junit4:junit4]   2> 10136 T246 oasc.ZkController.createEphemeralLiveNode Register node as live in ZooKeeper:/live_nodes/127.0.0.1:51152__%2Frz
[junit4:junit4]   2> 10137 T251 oazs.PrepRequestProcessor.pRequest Got user-level KeeperException when processing sessionid:0x13c4dad48820008 type:delete cxid:0x4 zxid:0x6f txntype:-1 reqpath:n/a Error Path:/solr/live_nodes/127.0.0.1:51152__%2Frz Error:KeeperErrorCode = NoNode for /solr/live_nodes/127.0.0.1:51152__%2Frz
[junit4:junit4]   2> 10138 T246 oascc.SolrZkClient.makePath makePath: /live_nodes/127.0.0.1:51152__%2Frz
[junit4:junit4]   2> 10145 T268 oascc.ZkStateReader$3.process Updating live nodes... (3)
[junit4:junit4]   2> 10145 T274 oascc.ZkStateReader$3.process Updating live nodes... (3)
[junit4:junit4]   2> 10146 T287 oascc.ZkStateReader$3.process Updating live nodes... (3)
[junit4:junit4]   2> 10146 T287 oascc.ZkStateReader$2.process A cluster state change: WatchedEvent state:SyncConnected type:NodeChildrenChanged path:/live_nodes, has occurred - updating... (live nodes size: 3)
[junit4:junit4]   2> 10145 T268 oascc.ZkStateReader$2.process A cluster state change: WatchedEvent state:SyncConnected type:NodeChildrenChanged path:/live_nodes, has occurred - updating... (live nodes size: 3)
[junit4:junit4]   2> 10146 T274 oascc.ZkStateReader$2.process A cluster state change: WatchedEvent state:SyncConnected type:NodeChildrenChanged path:/live_nodes, has occurred - updating... (live nodes size: 3)
[junit4:junit4]   2> 10155 T246 oascc.ZkStateReader.createClusterStateWatchersAndUpdate Updating cluster state from ZooKeeper... 
[junit4:junit4]   2> 10164 T303 oasc.CoreContainer.create Creating SolrCore 'collection1' using instanceDir: /Users/jenkins/jenkins-slave/workspace/Lucene-Solr-4.x-MacOSX/solr/build/solr-core/test/J0/./org.apache.solr.cloud.BasicDistributedZkTest-jetty2-1358512877247/collection1
[junit4:junit4]   2> 10164 T303 oasc.ZkController.createCollectionZkNode Check for collection zkNode:collection1
[junit4:junit4]   2> 10166 T303 oasc.ZkController.createCollectionZkNode Collection zkNode exists
[junit4:junit4]   2> 10166 T303 oasc.ZkController.readConfigName Load collection config from:/collections/collection1
[junit4:junit4]   2> 10169 T303 oasc.SolrResourceLoader.<init> new SolrResourceLoader for directory: '/Users/jenkins/jenkins-slave/workspace/Lucene-Solr-4.x-MacOSX/solr/build/solr-core/test/J0/./org.apache.solr.cloud.BasicDistributedZkTest-jetty2-1358512877247/collection1/'
[junit4:junit4]   2> 10170 T303 oasc.SolrResourceLoader.replaceClassLoader Adding 'file:/Users/jenkins/jenkins-slave/workspace/Lucene-Solr-4.x-MacOSX/solr/build/solr-core/test/J0/org.apache.solr.cloud.BasicDistributedZkTest-jetty2-1358512877247/collection1/lib/classes/' to classloader
[junit4:junit4]   2> 10171 T303 oasc.SolrResourceLoader.replaceClassLoader Adding 'file:/Users/jenkins/jenkins-slave/workspace/Lucene-Solr-4.x-MacOSX/solr/build/solr-core/test/J0/org.apache.solr.cloud.BasicDistributedZkTest-jetty2-1358512877247/collection1/lib/README' to classloader
[junit4:junit4]   2> 10232 T303 oasc.SolrConfig.<init> Using Lucene MatchVersion: LUCENE_42
[junit4:junit4]   2> 10299 T303 oasc.SolrConfig.<init> Loaded SolrConfig: solrconfig.xml
[junit4:junit4]   2> 10301 T303 oass.IndexSchema.readSchema Reading Solr Schema
[junit4:junit4]   2> 10309 T303 oass.IndexSchema.readSchema Schema name=test
[junit4:junit4]   2> 11006 T303 oass.OpenExchangeRatesOrgProvider.init Initialized with rates=open-exchange-rates.json, refreshInterval=1440.
[junit4:junit4]   2> 11025 T303 oass.IndexSchema.readSchema default search field in schema is text
[junit4:junit4]   2> 11029 T303 oass.IndexSchema.readSchema unique key field: id
[junit4:junit4]   2> 11073 T303 oass.FileExchangeRateProvider.reload Reloading exchange rates from file currency.xml
[junit4:junit4]   2> 11080 T303 oass.FileExchangeRateProvider.reload Reloading exchange rates from file currency.xml
[junit4:junit4]   2> 11087 T303 oass.OpenExchangeRatesOrgProvider.reload Reloading exchange rates from open-exchange-rates.json
[junit4:junit4]   2> 11092 T303 oass.OpenExchangeRatesOrgProvider.reload Reloading exchange rates from open-exchange-rates.json
[junit4:junit4]   2> 11096 T303 oasc.SolrCore.<init> [collection1] Opening new SolrCore at /Users/jenkins/jenkins-slave/workspace/Lucene-Solr-4.x-MacOSX/solr/build/solr-core/test/J0/./org.apache.solr.cloud.BasicDistributedZkTest-jetty2-1358512877247/collection1/, dataDir=./org.apache.solr.cloud.BasicDistributedZkTest-1358512867445/jetty2/
[junit4:junit4]   2> 11096 T303 oasc.JmxMonitoredMap.<init> JMX monitoring is enabled. Adding Solr mbeans to JMX Server: com.sun.jmx.mbeanserver.JmxMBeanServer@2b10f19b
[junit4:junit4]   2> 11097 T303 oasc.SolrCore.initDirectoryFactory solr.NRTCachingDirectoryFactory
[junit4:junit4]   2> 11099 T303 oasc.CachingDirectoryFactory.get return new directory for /Users/jenkins/jenkins-slave/workspace/Lucene-Solr-4.x-MacOSX/solr/build/solr-core/test/J0/./org.apache.solr.cloud.BasicDistributedZkTest-1358512867445/jetty2 forceNew:false
[junit4:junit4]   2> 11100 T303 oasc.CachingDirectoryFactory.close Releasing directory:/Users/jenkins/jenkins-slave/workspace/Lucene-Solr-4.x-MacOSX/solr/build/solr-core/test/J0/./org.apache.solr.cloud.BasicDistributedZkTest-1358512867445/jetty2
[junit4:junit4]   2> 11101 T303 oasc.SolrCore.getNewIndexDir New index directory detected: old=null new=./org.apache.solr.cloud.BasicDistributedZkTest-1358512867445/jetty2/index/
[junit4:junit4]   2> 11102 T303 oasc.SolrCore.initIndex WARNING [collection1] Solr index directory './org.apache.solr.cloud.BasicDistributedZkTest-1358512867445/jetty2/index' doesn't exist. Creating new index...
[junit4:junit4]   2> 11103 T303 oasc.CachingDirectoryFactory.get return new directory for /Users/jenkins/jenkins-slave/workspace/Lucene-Solr-4.x-MacOSX/solr/build/solr-core/test/J0/./org.apache.solr.cloud.BasicDistributedZkTest-1358512867445/jetty2/index forceNew:false
[junit4:junit4]   2> 11111 T303 oasc.SolrDeletionPolicy.onCommit SolrDeletionPolicy.onCommit: commits:num=1
[junit4:junit4]   2> 		commit{dir=RateLimitedDirectoryWrapper(NRTCachingDirectory(org.apache.lucene.store.NIOFSDirectory@/Users/jenkins/jenkins-slave/workspace/Lucene-Solr-4.x-MacOSX/solr/build/solr-core/test/J0/org.apache.solr.cloud.BasicDistributedZkTest-1358512867445/jetty2/index lockFactory=org.apache.lucene.store.NativeFSLockFactory@1b268984; maxCacheMB=48.0 maxMergeSizeMB=4.0)),segFN=segments_1,generation=1,filenames=[segments_1]
[junit4:junit4]   2> 11112 T303 oasc.SolrDeletionPolicy.updateCommits newest commit = 1[segments_1]
[junit4:junit4]   2> 11114 T303 oasc.CachingDirectoryFactory.close Releasing directory:/Users/jenkins/jenkins-slave/workspace/Lucene-Solr-4.x-MacOSX/solr/build/solr-core/test/J0/./org.apache.solr.cloud.BasicDistributedZkTest-1358512867445/jetty2/index
[junit4:junit4]   2> 11114 T303 oasc.SolrCore.initWriters created xml: solr.XMLResponseWriter
[junit4:junit4]   2> 11120 T303 oasup.UpdateRequestProcessorChain.init inserting DistributedUpdateProcessorFactory into updateRequestProcessorChain "dedupe"
[junit4:junit4]   2> 11121 T303 oasup.UpdateRequestProcessorChain.init inserting DistributedUpdateProcessorFactory into updateRequestProcessorChain "dedupe-allfields"
[junit4:junit4]   2> 11122 T303 oasup.UpdateRequestProcessorChain.init inserting DistributedUpdateProcessorFactory into updateRequestProcessorChain "stored_sig"
[junit4:junit4]   2> 11123 T303 oasup.UpdateRequestProcessorChain.init inserting DistributedUpdateProcessorFactory into updateRequestProcessorChain "uniq-fields"
[junit4:junit4]   2> 11125 T303 oasup.UpdateRequestProcessorChain.init inserting DistributedUpdateProcessorFactory into updateRequestProcessorChain "distrib-dup-test-chain-implicit"
[junit4:junit4]   2> 11125 T303 oasc.RequestHandlers.initHandlersFromConfig adding lazy requestHandler: solr.ReplicationHandler
[junit4:junit4]   2> 11126 T303 oasc.RequestHandlers.initHandlersFromConfig created /replication: solr.ReplicationHandler
[junit4:junit4]   2> 11128 T303 oasc.RequestHandlers.initHandlersFromConfig created standard: solr.StandardRequestHandler
[junit4:junit4]   2> 11129 T303 oasc.RequestHandlers.initHandlersFromConfig created /get: solr.RealTimeGetHandler
[junit4:junit4]   2> 11130 T303 oasc.RequestHandlers.initHandlersFromConfig created dismax: solr.SearchHandler
[junit4:junit4]   2> 11131 T303 oasc.RequestHandlers.initHandlersFromConfig created mock: org.apache.solr.core.MockQuerySenderListenerReqHandler
[junit4:junit4]   2> 11132 T303 oasc.RequestHandlers.initHandlersFromConfig created /admin/: org.apache.solr.handler.admin.AdminHandlers
[junit4:junit4]   2> 11133 T303 oasc.RequestHandlers.initHandlersFromConfig created defaults: solr.StandardRequestHandler
[junit4:junit4]   2> 11133 T303 oasc.RequestHandlers.initHandlersFromConfig adding lazy requestHandler: solr.StandardRequestHandler
[junit4:junit4]   2> 11134 T303 oasc.RequestHandlers.initHandlersFromConfig created lazy: solr.StandardRequestHandler
[junit4:junit4]   2> 11135 T303 oasc.RequestHandlers.initHandlersFromConfig created /update: solr.UpdateRequestHandler
[junit4:junit4]   2> 11136 T303 oasc.RequestHandlers.initHandlersFromConfig created /terms: org.apache.solr.handler.component.SearchHandler
[junit4:junit4]   2> 11137 T303 oasc.RequestHandlers.initHandlersFromConfig created spellCheckCompRH: org.apache.solr.handler.component.SearchHandler
[junit4:junit4]   2> 11138 T303 oasc.RequestHandlers.initHandlersFromConfig created spellCheckCompRH_Direct: org.apache.solr.handler.component.SearchHandler
[junit4:junit4]   2> 11139 T303 oasc.RequestHandlers.initHandlersFromConfig created spellCheckWithWordbreak: org.apache.solr.handler.component.SearchHandler
[junit4:junit4]   2> 11140 T303 oasc.RequestHandlers.initHandlersFromConfig created spellCheckWithWordbreak_Direct: org.apache.solr.handler.component.SearchHandler
[junit4:junit4]   2> 11141 T303 oasc.RequestHandlers.initHandlersFromConfig created spellCheckCompRH1: org.apache.solr.handler.component.SearchHandler
[junit4:junit4]   2> 11142 T303 oasc.RequestHandlers.initHandlersFromConfig created mltrh: org.apache.solr.handler.component.SearchHandler
[junit4:junit4]   2> 11143 T303 oasc.RequestHandlers.initHandlersFromConfig created tvrh: org.apache.solr.handler.component.SearchHandler
[junit4:junit4]   2> 11144 T303 oasc.RequestHandlers.initHandlersFromConfig created /mlt: solr.MoreLikeThisHandler
[junit4:junit4]   2> 11145 T303 oasc.RequestHandlers.initHandlersFromConfig created /debug/dump: solr.DumpRequestHandler
[junit4:junit4]   2> 11154 T303 oashl.XMLLoader.init xsltCacheLifetimeSeconds=60
[junit4:junit4]   2> 11159 T303 oasc.SolrCore.initDeprecatedSupport WARNING solrconfig.xml uses deprecated <admin/gettableFiles>, Please update your config to use the ShowFileRequestHandler.
[junit4:junit4]   2> 11162 T303 oasc.SolrCore.initDeprecatedSupport WARNING adding ShowFileRequestHandler with hidden files: [SCHEMA.XML, OLD_SYNONYMS.TXT, STOPWORDS.TXT, PROTWORDS.TXT, OPEN-EXCHANGE-RATES.JSON, SYNONYMS.TXT, CURRENCY.XML, MAPPING-ISOLATIN1ACCENT.TXT]
[junit4:junit4]   2> 11165 T303 oasc.CachingDirectoryFactory.close Releasing directory:/Users/jenkins/jenkins-slave/workspace/Lucene-Solr-4.x-MacOSX/solr/build/solr-core/test/J0/./org.apache.solr.cloud.BasicDistributedZkTest-1358512867445/jetty2
[junit4:junit4]   2> 11166 T303 oass.SolrIndexSearcher.<init> Opening Searcher@457a32c0 main
[junit4:junit4]   2> 11167 T303 oasu.CommitTracker.<init> Hard AutoCommit: disabled
[junit4:junit4]   2> 11168 T303 oasu.CommitTracker.<init> Soft AutoCommit: disabled
[junit4:junit4]   2> 11169 T303 oashc.SpellCheckComponent.inform Initializing spell checkers
[junit4:junit4]   2> 11173 T303 oass.DirectSolrSpellChecker.init init: {name=direct,classname=DirectSolrSpellChecker,field=lowerfilt,minQueryLength=3}
[junit4:junit4]   2> 11212 T304 oasc.SolrCore.registerSearcher [collection1] Registered new searcher Searcher@457a32c0 main{StandardDirectoryReader(segments_1:1)}
[junit4:junit4]   2> 11224 T303 oasc.ZkController.publish publishing core=collection1 state=down
[junit4:junit4]   2> 11225 T303 oasc.ZkController.publish numShards not found on descriptor - reading it from system property
[junit4:junit4]   2> 11298 T269 oascc.ZkStateReader.updateClusterState Updating cloud state from ZooKeeper... 
[junit4:junit4]   2> 11303 T269 oasc.Overseer$ClusterStateUpdater.updateState Update state numShards=2 message={
[junit4:junit4]   2> 	  "operation":"state",
[junit4:junit4]   2> 	  "numShards":"2",
[junit4:junit4]   2> 	  "shard":"shard1",
[junit4:junit4]   2> 	  "roles":null,
[junit4:junit4]   2> 	  "state":"active",
[junit4:junit4]   2> 	  "core":"collection1",
[junit4:junit4]   2> 	  "collection":"collection1",
[junit4:junit4]   2> 	  "node_name":"127.0.0.1:51149__%2Frz",
[junit4:junit4]   2> 	  "base_url":"http://127.0.0.1:51149/_/rz"}
[junit4:junit4]   2> 11318 T269 oasc.Overseer$ClusterStateUpdater.updateState Update state numShards=2 message={
[junit4:junit4]   2> 	  "operation":"state",
[junit4:junit4]   2> 	  "numShards":"2",
[junit4:junit4]   2> 	  "shard":null,
[junit4:junit4]   2> 	  "roles":null,
[junit4:junit4]   2> 	  "state":"down",
[junit4:junit4]   2> 	  "core":"collection1",
[junit4:junit4]   2> 	  "collection":"collection1",
[junit4:junit4]   2> 	  "node_name":"127.0.0.1:51152__%2Frz",
[junit4:junit4]   2> 	  "base_url":"http://127.0.0.1:51152/_/rz"}
[junit4:junit4]   2> 11319 T269 oasc.Overseer$ClusterStateUpdater.updateState Collection already exists with numShards=2
[junit4:junit4]   2> 11319 T269 oasc.Overseer$ClusterStateUpdater.updateState Assigning new node to shard shard=shard2
[junit4:junit4]   2> 11329 T287 oascc.ZkStateReader$2.process A cluster state change: WatchedEvent state:SyncConnected type:NodeDataChanged path:/clusterstate.json, has occurred - updating... (live nodes size: 3)
[junit4:junit4]   2> 11330 T268 oascc.ZkStateReader$2.process A cluster state change: WatchedEvent state:SyncConnected type:NodeDataChanged path:/clusterstate.json, has occurred - updating... (live nodes size: 3)
[junit4:junit4]   2> 11330 T302 oascc.ZkStateReader$2.process A cluster state change: WatchedEvent state:SyncConnected type:NodeDataChanged path:/clusterstate.json, has occurred - updating... (live nodes size: 3)
[junit4:junit4]   2> 11330 T274 oascc.ZkStateReader$2.process A cluster state change: WatchedEvent state:SyncConnected type:NodeDataChanged path:/clusterstate.json, has occurred - updating... (live nodes size: 3)
[junit4:junit4]   2> 12232 T303 oasc.CoreContainer.registerCore registering core: collection1
[junit4:junit4]   2> 12233 T303 oasc.ZkController.register Register replica - core:collection1 address:http://127.0.0.1:51152/_/rz collection:collection1 shard:shard2
[junit4:junit4]   2> 12235 T303 oascc.SolrZkClient.makePath makePath: /collections/collection1/leader_elect/shard2/election
[junit4:junit4]   2> 12264 T251 oazs.PrepRequestProcessor.pRequest Got user-level KeeperException when processing sessionid:0x13c4dad48820008 type:delete cxid:0x42 zxid:0x7d txntype:-1 reqpath:n/a Error Path:/solr/collections/collection1/leaders/shard2 Error:KeeperErrorCode = NoNode for /solr/collections/collection1/leaders/shard2
[junit4:junit4]   2> 12267 T303 oasc.ShardLeaderElectionContext.runLeaderProcess Running the leader process.
[junit4:junit4]   2> 12268 T251 oazs.PrepRequestProcessor.pRequest Got user-level KeeperException when processing sessionid:0x13c4dad48820008 type:create cxid:0x43 zxid:0x7e txntype:-1 reqpath:n/a Error Path:/solr/overseer Error:KeeperErrorCode = NodeExists for /solr/overseer
[junit4:junit4]   2> 12278 T303 oasc.ShardLeaderElectionContext.waitForReplicasToComeUp Enough replicas found to continue.
[junit4:junit4]   2> 12279 T303 oasc.ShardLeaderElectionContext.runLeaderProcess I may be the new leader - try and sync
[junit4:junit4]   2> 12279 T303 oasc.SyncStrategy.sync Sync replicas to http://127.0.0.1:51152/_/rz/collection1/
[junit4:junit4]   2> 12280 T303 oasc.SyncStrategy.syncReplicas Sync Success - now sync replicas to me
[junit4:junit4]   2> 12280 T303 oasc.SyncStrategy.syncToMe http://127.0.0.1:51152/_/rz/collection1/ has no replicas
[junit4:junit4]   2> 12281 T303 oasc.ShardLeaderElectionContext.runLeaderProcess I am the new leader: http://127.0.0.1:51152/_/rz/collection1/
[junit4:junit4]   2> 12282 T303 oascc.SolrZkClient.makePath makePath: /collections/collection1/leaders/shard2
[junit4:junit4]   2> 12292 T251 oazs.PrepRequestProcessor.pRequest Got user-level KeeperException when processing sessionid:0x13c4dad48820008 type:create cxid:0x4c zxid:0x81 txntype:-1 reqpath:n/a Error Path:/solr/overseer Error:KeeperErrorCode = NodeExists for /solr/overseer
[junit4:junit4]   2> 12852 T269 oascc.ZkStateReader.updateClusterState Updating cloud state from ZooKeeper... 
[junit4:junit4]   2> 12877 T268 oascc.ZkStateReader$2.process A cluster state change: WatchedEvent state:SyncConnected type:NodeDataChanged path:/clusterstate.json, has occurred - updating... (live nodes size: 3)
[junit4:junit4]   2> 12882 T274 oascc.ZkStateReader$2.process A cluster state change: WatchedEvent state:SyncConnected type:NodeDataChanged path:/clusterstate.json, has occurred - updating... (live nodes size: 3)
[junit4:junit4]   2> 12887 T287 oascc.ZkStateReader$2.process A cluster state change: WatchedEvent state:SyncConnected type:NodeDataChanged path:/clusterstate.json, has occurred - updating... (live nodes size: 3)
[junit4:junit4]   2> 12887 T302 oascc.ZkStateReader$2.process A cluster state change: WatchedEvent state:SyncConnected type:NodeDataChanged path:/clusterstate.json, has occurred - updating... (live nodes size: 3)
[junit4:junit4]   2> 12936 T303 oasc.ZkController.register We are http://127.0.0.1:51152/_/rz/collection1/ and leader is http://127.0.0.1:51152/_/rz/collection1/
[junit4:junit4]   2> 12937 T303 oasc.ZkController.register No LogReplay needed for core=collection1 baseURL=http://127.0.0.1:51152/_/rz
[junit4:junit4]   2> 12937 T303 oasc.ZkController.checkRecovery I am the leader, no recovery necessary
[junit4:junit4]   2> 12938 T303 oasc.ZkController.publish publishing core=collection1 state=active
[junit4:junit4]   2> 12938 T303 oasc.ZkController.publish numShards not found on descriptor - reading it from system property
[junit4:junit4]   2> 12943 T303 oascc.ZkStateReader.updateClusterState Updating cloud state from ZooKeeper... 
[junit4:junit4]   2> 12947 T246 oass.SolrDispatchFilter.init user.dir=/Users/jenkins/jenkins-slave/workspace/Lucene-Solr-4.x-MacOSX/solr/build/solr-core/test/J0
[junit4:junit4]   2> 12948 T246 oass.SolrDispatchFilter.init SolrDispatchFilter.init() done
[junit4:junit4]   2> 12950 T246 oascsi.HttpClientUtil.createClient Creating new http client, config:maxConnections=128&maxConnectionsPerHost=32&followRedirects=false
[junit4:junit4]   2> 13198 T246 oejs.Server.doStart jetty-8.1.8.v20121106
[junit4:junit4]   2> 13204 T246 oejs.AbstractConnector.doStart Started SelectChannelConnector@127.0.0.1:51155
[junit4:junit4]   2> 13207 T246 oass.SolrDispatchFilter.init SolrDispatchFilter.init()
[junit4:junit4]   2> 13208 T246 oasc.SolrResourceLoader.locateSolrHome JNDI not configured for solr (NoInitialContextEx)
[junit4:junit4]   2> 13209 T246 oasc.SolrResourceLoader.locateSolrHome using system property solr.solr.home: /Users/jenkins/jenkins-slave/workspace/Lucene-Solr-4.x-MacOSX/solr/build/solr-core/test/J0/./org.apache.solr.cloud.BasicDistributedZkTest-jetty3-1358512880399
[junit4:junit4]   2> 13210 T246 oasc.CoreContainer$Initializer.initialize looking for solr.xml: /Users/jenkins/jenkins-slave/workspace/Lucene-Solr-4.x-MacOSX/solr/build/solr-core/test/J0/./org.apache.solr.cloud.BasicDistributedZkTest-jetty3-1358512880399/solr.xml
[junit4:junit4]   2> 13211 T246 oasc.CoreContainer.<init> New CoreContainer 614082581
[junit4:junit4]   2> 13213 T246 oasc.CoreContainer.load Loading CoreContainer using Solr Home: '/Users/jenkins/jenkins-slave/workspace/Lucene-Solr-4.x-MacOSX/solr/build/solr-core/test/J0/./org.apache.solr.cloud.BasicDistributedZkTest-jetty3-1358512880399/'
[junit4:junit4]   2> 13215 T246 oasc.SolrResourceLoader.<init> new SolrResourceLoader for directory: '/Users/jenkins/jenkins-slave/workspace/Lucene-Solr-4.x-MacOSX/solr/build/solr-core/test/J0/./org.apache.solr.cloud.BasicDistributedZkTest-jetty3-1358512880399/'
[junit4:junit4]   2> 13280 T246 oashc.HttpShardHandlerFactory.getParameter Setting socketTimeout to: 60000
[junit4:junit4]   2> 13281 T246 oashc.HttpShardHandlerFactory.getParameter Setting urlScheme to: http://
[junit4:junit4]   2> 13282 T246 oashc.HttpShardHandlerFactory.getParameter Setting connTimeout to: 15000
[junit4:junit4]   2> 13283 T246 oashc.HttpShardHandlerFactory.getParameter Setting maxConnectionsPerHost to: 20
[junit4:junit4]   2> 13284 T246 oashc.HttpShardHandlerFactory.getParameter Setting corePoolSize to: 0
[junit4:junit4]   2> 13285 T246 oashc.HttpShardHandlerFactory.getParameter Setting maximumPoolSize to: 2147483647
[junit4:junit4]   2> 13286 T246 oashc.HttpShardHandlerFactory.getParameter Setting maxThreadIdleTime to: 5
[junit4:junit4]   2> 13287 T246 oashc.HttpShardHandlerFactory.getParameter Setting sizeOfQueue to: -1
[junit4:junit4]   2> 13288 T246 oashc.HttpShardHandlerFactory.getParameter Setting fairnessPolicy to: false
[junit4:junit4]   2> 13289 T246 oascsi.HttpClientUtil.createClient Creating new http client, config:maxConnectionsPerHost=20&maxConnections=10000&socketTimeout=60000&connTimeout=15000&retry=false
[junit4:junit4]   2> 13321 T246 oasc.CoreContainer.load Registering Log Listener
[junit4:junit4]   2> 13360 T246 oasc.CoreContainer.initZooKeeper Zookeeper client=127.0.0.1:51142/solr
[junit4:junit4]   2> 13362 T246 oasc.ZkController.checkChrootPath zkHost includes chroot
[junit4:junit4]   2> 13363 T246 oaz.ZooKeeper.<init> Initiating client connection, connectString=127.0.0.1:51142 sessionTimeout=60000 watcher=org.apache.solr.common.cloud.ConnectionManager@75e207f
[junit4:junit4]   2> 13365 T246 oascc.ConnectionManager.waitForConnected Waiting for client to connect to ZooKeeper
[junit4:junit4]   2> 13366 T314 oaz.ClientCnxn$SendThread.logStartConnect Opening socket connection to server localhost/127.0.0.1:51142. Will not attempt to authenticate using SASL (access denied ("javax.security.auth.AuthPermission" "getLoginConfiguration"))
[junit4:junit4]   2> 13368 T314 oaz.ClientCnxn$SendThread.primeConnection Socket connection established to localhost/127.0.0.1:51142, initiating session
[junit4:junit4]   2> 13369 T248 oazs.NIOServerCnxnFactory.run Accepted socket connection from /127.0.0.1:51156
[junit4:junit4]   2> 13370 T248 oazs.ZooKeeperServer.processConnectRequest Client attempting to establish new session at /127.0.0.1:51156
[junit4:junit4]   2> 13372 T250 oazs.ZooKeeperServer.finishSessionInit Established session 0x13c4dad48820009 with negotiated timeout 20000 for client /127.0.0.1:51156
[junit4:junit4]   2> 13373 T314 oaz.ClientCnxn$SendThread.onConnected Session establishment complete on server localhost/127.0.0.1:51142, sessionid = 0x13c4dad48820009, negotiated timeout = 20000
[junit4:junit4]   2> 13374 T315 oascc.ConnectionManager.process Watcher org.apache.solr.common.cloud.ConnectionManager@75e207f name:ZooKeeperConnection Watcher:127.0.0.1:51142 got event WatchedEvent state:SyncConnected type:None path:null path:null type:None
[junit4:junit4]   2> 13383 T246 oascc.ConnectionManager.waitForConnected Client is connected to ZooKeeper
[junit4:junit4]   2> 13388 T251 oazs.PrepRequestProcessor.pRequest2Txn Processed session termination for sessionid: 0x13c4dad48820009
[junit4:junit4]   2> 13390 T248 oazs.NIOServerCnxn.closeSock Closed socket connection for client /127.0.0.1:51156 which had sessionid 0x13c4dad48820009
[junit4:junit4]   2> 13390 T246 oaz.ZooKeeper.close Session: 0x13c4dad48820009 closed
[junit4:junit4]   2> 13391 T315 oaz.ClientCnxn$EventThread.run EventThread shut down
[junit4:junit4]   2> 13392 T246 oascsi.HttpClientUtil.createClient Creating new http client, config:maxConnections=500&maxConnectionsPerHost=16&socketTimeout=60000&connTimeout=15000
[junit4:junit4]   2> 13406 T246 oaz.ZooKeeper.<init> Initiating client connection, connectString=127.0.0.1:51142/solr sessionTimeout=30000 watcher=org.apache.solr.common.cloud.ConnectionManager@5ec7baab
[junit4:junit4]   2> 13409 T246 oascc.ConnectionManager.waitForConnected Waiting for client to connect to ZooKeeper
[junit4:junit4]   2> 13409 T316 oaz.ClientCnxn$SendThread.logStartConnect Opening socket connection to server localhost/127.0.0.1:51142. Will not attempt to authenticate using SASL (access denied ("javax.security.auth.AuthPermission" "getLoginConfiguration"))
[junit4:junit4]   2> 13411 T316 oaz.ClientCnxn$SendThread.primeConnection Socket connection established to localhost/127.0.0.1:51142, initiating session
[junit4:junit4]   2> 13411 T248 oazs.NIOServerCnxnFactory.run Accepted socket connection from /127.0.0.1:51157
[junit4:junit4]   2> 13412 T248 oazs.ZooKeeperServer.processConnectRequest Client attempting to establish new session at /127.0.0.1:51157
[junit4:junit4]   2> 13414 T250 oazs.ZooKeeperServer.finishSessionInit Established session 0x13c4dad4882000a with negotiated timeout 20000 for client /127.0.0.1:51157
[junit4:junit4]   2> 13414 T316 oaz.ClientCnxn$SendThread.onConnected Session establishment complete on server localhost/127.0.0.1:51142, sessionid = 0x13c4dad4882000a, negotiated timeout = 20000
[junit4:junit4]   2> 13415 T317 oascc.ConnectionManager.process Watcher org.apache.solr.common.cloud.ConnectionManager@5ec7baab name:ZooKeeperConnection Watcher:127.0.0.1:51142/solr got event WatchedEvent state:SyncConnected type:None path:null path:null type:None
[junit4:junit4]   2> 13416 T246 oascc.ConnectionManager.waitForConnected Client is connected to ZooKeeper
[junit4:junit4]   2> 13418 T251 oazs.PrepRequestProcessor.pRequest Got user-level KeeperException when processing sessionid:0x13c4dad4882000a type:create cxid:0x1 zxid:0x8e txntype:-1 reqpath:n/a Error Path:/solr/overseer Error:KeeperErrorCode = NodeExists for /solr/overseer
[junit4:junit4]   2> 13420 T251 oazs.PrepRequestProcessor.pRequest Got user-level KeeperException when processing sessionid:0x13c4dad4882000a type:create cxid:0x2 zxid:0x8f txntype:-1 reqpath:n/a Error Path:/solr/overseer Error:KeeperErrorCode = NodeExists for /solr/overseer
[junit4:junit4]   2> 13422 T246 oasc.ZkController.createEphemeralLiveNode Register node as live in ZooKeeper:/live_nodes/127.0.0.1:51155__%2Frz
[junit4:junit4]   2> 13424 T251 oazs.PrepRequestProcessor.pRequest Got user-level KeeperException when processing sessionid:0x13c4dad4882000a type:delete cxid:0x4 zxid:0x90 txntype:-1 reqpath:n/a Error Path:/solr/live_nodes/127.0.0.1:51155__%2Frz Error:KeeperErrorCode = NoNode for /solr/live_nodes/127.0.0.1:51155__%2Frz
[junit4:junit4]   2> 13425 T246 oascc.SolrZkClient.makePath makePath: /live_nodes/127.0.0.1:51155__%2Frz
[junit4:junit4]   2> 13431 T302 oascc.ZkStateReader$2.process A cluster state change: WatchedEvent state:SyncConnected type:NodeChildrenChanged path:/live_nodes, has occurred - updating... (live nodes size: 3)
[junit4:junit4]   2> 13437 T287 oascc.ZkStateReader$3.process Updating live nodes... (4)
[junit4:junit4]   2> 13438 T287 oascc.ZkStateReader$2.process A cluster state change: WatchedEvent state:SyncConnected type:NodeChildrenChanged path:/live_nodes, has occurred - updating... (live nodes size: 4)
[junit4:junit4]   2> 13439 T274 oascc.ZkStateReader$3.process Updating live nodes... (4)
[junit4:junit4]   2> 13440 T274 oascc.ZkStateReader$2.process A cluster state change: WatchedEvent state:SyncConnected type:NodeChildrenChanged path:/live_nodes, has occurred - updating... (live nodes size: 4)
[junit4:junit4]   2> 13441 T268 oascc.ZkStateReader$3.process Updating live nodes... (4)
[junit4:junit4]   2> 13442 T268 oascc.ZkStateReader$2.process A cluster state change: WatchedEvent state:SyncConnected type:NodeChildrenChanged path:/live_nodes, has occurred - updating... (live nodes size: 4)
[junit4:junit4]   2> 13448 T302 oascc.ZkStateReader$3.process Updating live nodes... (4)
[junit4:junit4]   2> 13455 T246 oascc.ZkStateReader.createClusterStateWatchersAndUpdate Updating cluster state from ZooKeeper... 
[junit4:junit4]   2> 13467 T318 oasc.CoreContainer.create Creating SolrCore 'collection1' using instanceDir: /Users/jenkins/jenkins-slave/workspace/Lucene-Solr-4.x-MacOSX/solr/build/solr-core/test/J0/./org.apache.solr.cloud.BasicDistributedZkTest-jetty3-1358512880399/collection1
[junit4:junit4]   2> 13468 T318 oasc.ZkController.createCollectionZkNode Check for collection zkNode:collection1
[junit4:junit4]   2> 13470 T318 oasc.ZkController.createCollectionZkNode Collection zkNode exists
[junit4:junit4]   2> 13471 T318 oasc.ZkController.readConfigName Load collection config from:/collections/collection1
[junit4:junit4]   2> 13475 T318 oasc.SolrResourceLoader.<init> new SolrResourceLoader for directory: '/Users/jenkins/jenkins-slave/workspace/Lucene-Solr-4.x-MacOSX/solr/build/solr-core/test/J0/./org.apache.solr.cloud.BasicDistributedZkTest-jetty3-1358512880399/collection1/'
[junit4:junit4]   2> 13477 T318 oasc.SolrResourceLoader.replaceClassLoader Adding 'file:/Users/jenkins/jenkins-slave/workspace/Lucene-Solr-4.x-MacOSX/solr/build/solr-core/test/J0/org.apache.solr.cloud.BasicDistributedZkTest-jetty3-1358512880399/collection1/lib/classes/' to classloader
[junit4:junit4]   2> 13478 T318 oasc.SolrResourceLoader.replaceClassLoader Adding 'file:/Users/jenkins/jenkins-slave/workspace/Lucene-Solr-4.x-MacOSX/solr/build/solr-core/test/J0/org.apache.solr.cloud.BasicDistributedZkTest-jetty3-1358512880399/collection1/lib/README' to classloader
[junit4:junit4]   2> 13571 T318 oasc.SolrConfig.<init> Using Lucene MatchVersion: LUCENE_42
[junit4:junit4]   2> 13684 T318 oasc.SolrConfig.<init> Loaded SolrConfig: solrconfig.xml
[junit4:junit4]   2> 13686 T318 oass.IndexSchema.readSchema Reading Solr Schema
[junit4:junit4]   2> 13698 T318 oass.IndexSchema.readSchema Schema name=test
[junit4:junit4]   2> 14411 T269 oascc.ZkStateReader.updateClusterState Updating cloud state from ZooKeeper... 
[junit4:junit4]   2> 14413 T269 oasc.Overseer$ClusterStateUpdater.updateState Update state numShards=2 message={
[junit4:junit4]   2> 	  "operation":"state",
[junit4:junit4]   2> 	  "numShards":"2",
[junit4:junit4]   2> 	  "shard":"shard2",
[junit4:junit4]   2> 	  "roles":null,
[junit4:junit4]   2> 	  "state":"active",
[junit4:junit4]   2> 	  "core":"collection1",
[junit4:junit4]   2> 	  "collection":"collection1",
[junit4:junit4]   2> 	  "node_name":"127.0.0.1:51152__%2Frz",
[junit4:junit4]   2> 	  "base_url":"http://127.0.0.1:51152/_/rz"}
[junit4:junit4]   2> 14428 T287 oascc.ZkStateReader$2.process A cluster state change: WatchedEvent state:SyncConnected type:NodeDataChanged path:/clusterstate.json, has occurred - updating... (live nodes size: 4)
[junit4:junit4]   2> 14428 T268 oascc.ZkStateReader$2.process A cluster state change: WatchedEvent state:SyncConnected type:NodeDataChanged path:/clusterstate.json, has occurred - updating... (live nodes size: 4)
[junit4:junit4]   2> 14429 T274 oascc.ZkStateReader$2.process A cluster state change: WatchedEvent state:SyncConnected type:NodeDataChanged path:/clusterstate.json, has occurred - updating... (live nodes size: 4)
[junit4:junit4]   2> 14429 T317 oascc.ZkStateReader$2.process A cluster state change: WatchedEvent state:SyncConnected type:NodeDataChanged path:/clusterstate.json, has occurred - updating... (live nodes size: 4)
[junit4:junit4]   2> 14429 T302 oascc.ZkStateReader$2.process A cluster state change: WatchedEvent state:SyncConnected type:NodeDataChanged path:/clusterstate.json, has occurred - updating... (live nodes size: 4)
[junit4:junit4]   2> 14586 T318 oass.OpenExchangeRatesOrgProvider.init Initialized with rates=open-exchange-rates.json, refreshInterval=1440.
[junit4:junit4]   2> 14597 T318 oass.IndexSchema.readSchema default search field in schema is text
[junit4:junit4]   2> 14602 T318 oass.IndexSchema.readSchema unique key field: id
[junit4:junit4]   2> 14639 T318 oass.FileExchangeRateProvider.reload Reloading exchange rates from file currency.xml
[junit4:junit4]   2> 14646 T318 oass.FileExchangeRateProvider.reload Reloading exchange rates from file currency.xml
[junit4:junit4]   2> 14661 T318 oass.OpenExchangeRatesOrgProvider.reload Reloading exchange rates from open-exchange-rates.json
[junit4:junit4]   2> 14665 T318 oass.OpenExchangeRatesOrgProvider.reload Reloading exchange rates from open-exchange-rates.json
[junit4:junit4]   2> 14669 T318 oasc.SolrCore.<init> [collection1] Opening new SolrCore at /Users/jenkins/jenkins-slave/workspace/Lucene-Solr-4.x-MacOSX/solr/build/solr-core/test/J0/./org.apache.solr.cloud.BasicDistributedZkTest-jetty3-1358512880399/collection1/, dataDir=./org.apache.solr.cloud.BasicDistributedZkTest-1358512867445/jetty3/
[junit4:junit4]   2> 14669 T318 oasc.JmxMonitoredMap.<init> JMX monitoring is enabled. Adding Solr mbeans to JMX Server: com.sun.jmx.mbeanserver.JmxMBeanServer@2b10f19b
[junit4:junit4]   2> 14670 T318 oasc.SolrCore.initDirectoryFactory solr.NRTCachingDirectoryFactory
[junit4:junit4]   2> 14672 T318 oasc.CachingDirectoryFactory.get return new directory for /Users/jenkins/jenkins-slave/workspace/Lucene-Solr-4.x-MacOSX/solr/build/solr-core/test/J0/./org.apache.solr.cloud.BasicDistributedZkTest-1358512867445/jetty3 forceNew:false
[junit4:junit4]   2> 14672 T318 oasc.CachingDirectoryFactory.close Releasing directory:/Users/jenkins/jenkins-slave/workspace/Lucene-Solr-4.x-MacOSX/solr/build/solr-core/test/J0/./org.apache.solr.cloud.BasicDistributedZkTest-1358512867445/jetty3
[junit4:junit4]   2> 14673 T318 oasc.SolrCore.getNewIndexDir New index directory detected: old=null new=./org.apache.solr.cloud.BasicDistributedZkTest-1358512867445/jetty3/index/
[junit4:junit4]   2> 14674 T318 oasc.SolrCore.initIndex WARNING [collection1] Solr index directory './org.apache.solr.cloud.BasicDistributedZkTest-1358512867445/jetty3/index' doesn't exist. Creating new index...
[junit4:junit4]   2> 14675 T318 oasc.CachingDirectoryFactory.get return new directory for /Users/jenkins/jenkins-slave/workspace/Lucene-Solr-4.x-MacOSX/solr/build/solr-core/test/J0/./org.apache.solr.cloud.BasicDistributedZkTest-1358512867445/jetty3/index forceNew:false
[junit4:junit4]   2> 14681 T318 oasc.SolrDeletionPolicy.onCommit SolrDeletionPolicy.onCommit: commits:num=1
[junit4:junit4]   2> 		commit{dir=RateLimitedDirectoryWrapper(NRTCachingDirectory(org.apache.lucene.store.NIOFSDirectory@/Users/jenkins/jenkins-slave/workspace/Lucene-Solr-4.x-MacOSX/solr/build/solr-core/test/J0/org.apache.solr.cloud.BasicDistributedZkTest-1358512867445/jetty3/index lockFactory=org.apache.lucene.store.NativeFSLockFactory@2b180267; maxCacheMB=48.0 maxMergeSizeMB=4.0)),segFN=segments_1,generation=1,filenames=[segments_1]
[junit4:junit4]   2> 14682 T318 oasc.SolrDeletionPolicy.updateCommits newest commit = 1[segments_1]
[junit4:junit4]   2> 14683 T318 oasc.CachingDirectoryFactory.close Releasing directory:/Users/jenkins/jenkins-slave/workspace/Lucene-Solr-4.x-MacOSX/solr/build/solr-core/test/J0/./org.apache.solr.cloud.BasicDistributedZkTest-1358512867445/jetty3/index
[junit4:junit4]   2> 14683 T318 oasc.SolrCore.initWriters created xml: solr.XMLResponseWriter
[junit4:junit4]   2> 14689 T318 oasup.UpdateRequestProcessorChain.init inserting DistributedUpdateProcessorFactory into updateRequestProcessorChain "dedupe"
[junit4:junit4]   2> 14690 T318 oasup.UpdateRequestProcessorChain.init inserting DistributedUpdateProcessorFactory into updateRequestProcessorChain "dedupe-allfields"
[junit4:junit4]   2> 14692 T318 oasup.UpdateRequestProcessorChain.init inserting DistributedUpdateProcessorFactory into updateRequestProcessorChain "stored_sig"
[junit4:junit4]   2> 14693 T318 oasup.UpdateRequestProcessorChain.init inserting DistributedUpdateProcessorFactory into updateRequestProcessorChain "uniq-fields"
[junit4:junit4]   2> 14695 T318 oasup.UpdateRequestProcessorChain.init inserting DistributedUpdateProcessorFactory into updateRequestProcessorChain "distrib-dup-test-chain-implicit"
[junit4:junit4]   2> 14696 T318 oasc.RequestHandlers.initHandlersFromConfig adding lazy requestHandler: solr.ReplicationHandler
[junit4:junit4]   2> 14697 T318 oasc.RequestHandlers.initHandlersFromConfig created /replication: solr.ReplicationHandler
[junit4:junit4]   2> 14699 T318 oasc.RequestHandlers.initHandlersFromConfig created standard: solr.StandardRequestHandler
[junit4:junit4]   2> 14700 T318 oasc.RequestHandlers.initHandlersFromConfig created /get: solr.RealTimeGetHandler
[junit4:junit4]   2> 14702 T318 oasc.RequestHandlers.initHandlersFromConfig created dismax: solr.SearchHandler
[junit4:junit4]   2> 14703 T318 oasc.RequestHandlers.initHandlersFromConfig created mock: org.apache.solr.core.MockQuerySenderListenerReqHandler
[junit4:junit4]   2> 14704 T318 oasc.RequestHandlers.initHandlersFromConfig created /admin/: org.apache.solr.handler.admin.AdminHandlers
[junit4:junit4]   2> 14705 T318 oasc.RequestHandlers.initHandlersFromConfig created defaults: solr.StandardRequestHandler
[junit4:junit4]   2> 14705 T318 oasc.RequestHandlers.initHandlersFromConfig adding lazy requestHandler: solr.StandardRequestHandler
[junit4:junit4]   2> 14706 T318 oasc.RequestHandlers.initHandlersFromConfig created lazy: solr.StandardRequestHandler
[junit4:junit4]   2> 14707 T318 oasc.RequestHandlers.initHandlersFromConfig created /update: solr.UpdateRequestHandler
[junit4:junit4]   2> 14707 T318 oasc.RequestHandlers.initHandlersFromConfig created /terms: org.apache.solr.handler.component.SearchHandler
[junit4:junit4]   2> 14708 T318 oasc.RequestHandlers.initHandlersFromConfig created spellCheckCompRH: org.apache.solr.handler.component.SearchHandler
[junit4:junit4]   2> 14709 T318 oasc.RequestHandlers.initHandlersFromConfig created spellCheckCompRH_Direct: org.apache.solr.handler.component.SearchHandler
[junit4:junit4]   2> 14711 T318 oasc.RequestHandlers.initHandlersFromConfig created spellCheckWithWordbreak: org.apache.solr.handler.component.SearchHandler
[junit4:junit4]   2> 14711 T318 oasc.RequestHandlers.initHandlersFromConfig created spellCheckWithWordbreak_Direct: org.apache.solr.handler.component.SearchHandler
[junit4:junit4]   2> 14712 T318 oasc.RequestHandlers.initHandlersFromConfig created spellCheckCompRH1: org.apache.solr.handler.component.SearchHandler
[junit4:junit4]   2> 14713 T318 oasc.RequestHandlers.initHandlersFromConfig created mltrh: org.apache.solr.handler.component.SearchHandler
[junit4:junit4]   2> 14714 T318 oasc.RequestHandlers.initHandlersFromConfig created tvrh: org.apache.solr.handler.component.SearchHandler
[junit4:junit4]   2> 14714 T318 oasc.RequestHandlers.initHandlersFromConfig created /mlt: solr.MoreLikeThisHandler
[junit4:junit4]   2> 14715 T318 oasc.RequestHandlers.initHandlersFromConfig created /debug/dump: solr.DumpRequestHandler
[junit4:junit4]   2> 14723 T318 oashl.XMLLoader.init xsltCacheLifetimeSeconds=60
[junit4:junit4]   2> 14727 T318 oasc.SolrCore.initDeprecatedSupport WARNING solrconfig.xml uses deprecated <admin/gettableFiles>, Please update your config to use the ShowFileRequestHandler.
[junit4:junit4]   2> 14730 T318 oasc.SolrCore.initDeprecatedSupport WARNING adding ShowFileRequestHandler with hidden files: [SCHEMA.XML, OLD_SYNONYMS.TXT, STOPWORDS.TXT, PROTWORDS.TXT, OPEN-EXCHANGE-RATES.JSON, SYNONYMS.TXT, CURRENCY.XML, MAPPING-ISOLATIN1ACCENT.TXT]
[junit4:junit4]   2> 14735 T318 oasc.CachingDirectoryFactory.close Releasing directory:/Users/jenkins/jenkins-slave/workspace/Lucene-Solr-4.x-MacOSX/solr/build/solr-core/test/J0/./org.apache.solr.cloud.BasicDistributedZkTest-1358512867445/jetty3
[junit4:junit4]   2> 14737 T318 oass.SolrIndexSearcher.<init> Opening Searcher@667876c7 main
[junit4:junit4]   2> 14739 T318 oasu.CommitTracker.<init> Hard AutoCommit: disabled
[junit4:junit4]   2> 14740 T318 oasu.CommitTracker.<init> Soft AutoCommit: disabled
[junit4:junit4]   2> 14741 T318 oashc.SpellCheckComponent.inform Initializing spell checkers
[junit4:junit4]   2> 14752 T318 oass.DirectSolrSpellChecker.init init: {name=direct,classname=DirectSolrSpellChecker,field=lowerfilt,minQueryLength=3}
[junit4:junit4]   2> 14797 T319 oasc.SolrCore.registerSearcher [collection1] Registered new searcher Searcher@667876c7 main{StandardDirectoryReader(segments_1:1)}
[junit4:junit4]   2> 14807 T318 oasc.ZkController.publish publishing core=collection1 state=down
[junit4:junit4]   2> 14808 T318 oasc.ZkController.publish numShards not found on descriptor - reading it from system property
[junit4:junit4]   2> 15948 T269 oascc.ZkStateReader.updateClusterState Updating cloud state from ZooKeeper... 
[junit4:junit4]   2> 15951 T269 oasc.Overseer$ClusterStateUpdater.updateState Update state numShards=2 message={
[junit4:junit4]   2> 	  "operation":"state",
[junit4:junit4]   2> 	  "numShards":"2",
[junit4:junit4]   2> 	  "shard":null,
[junit4:junit4]   2> 	  "roles":null,
[junit4:junit4]   2> 	  "state":"down",
[junit4:junit4]   2> 	  "core":"collection1",
[junit4:junit4]   2> 	  "collection":"collection1",
[junit4:junit4]   2> 	  "node_name":"127.0.0.1:51155__%2Frz",
[junit4:junit4]   2> 	  "base_url":"http://127.0.0.1:51155/_/rz"}
[junit4:junit4]   2> 15952 T269 oasc.Overseer$ClusterStateUpdater.updateState Collection already exists with numShards=2
[junit4:junit4]   2> 15952 T269 oasc.Overseer$ClusterStateUpdater.updateState Assigning new node to shard shard=shard1
[junit4:junit4]   2> 15963 T302 oascc.ZkStateReader$2.process A cluster state change: WatchedEvent state:SyncConnected type:NodeDataChanged path:/clusterstate.json, has occurred - updating... (live nodes size: 4)
[junit4:junit4]   2> 15963 T317 oascc.ZkStateReader$2.process A cluster state change: WatchedEvent state:SyncConnected type:NodeDataChanged path:/clusterstate.json, has occurred - updating... (live nodes size: 4)
[junit4:junit4]   2> 15964 T268 oascc.ZkStateReader$2.process A cluster state change: WatchedEvent state:SyncConnected type:NodeDataChanged path:/clusterstate.json, has occurred - updating... (live nodes size: 4)
[junit4:junit4]   2> 15964 T287 oascc.ZkStateReader$2.process A cluster state change: WatchedEvent state:SyncConnected type:NodeDataChanged path:/clusterstate.json, has occurred - updating... (live nodes size: 4)
[junit4:junit4]   2> 15964 T274 oascc.ZkStateReader$2.process A cluster state change: WatchedEvent state:SyncConnected type:NodeDataChanged path:/clusterstate.json, has occurred - updating... (live nodes size: 4)
[junit4:junit4]   2> 16813 T318 oasc.CoreContainer.registerCore registering core: collection1
[junit4:junit4]   2> 16813 T318 oasc.ZkController.register Register replica - core:collection1 address:http://127.0.0.1:51155/_/rz collection:collection1 shard:shard1
[junit4:junit4]   2> 16818 T318 oasc.ZkController.register We are http://127.0.0.1:51155/_/rz/collection1/ and leader is http://127.0.0.1:51149/_/rz/collection1/
[junit4:junit4]   2> 16819 T318 oasc.ZkController.register No LogReplay needed for core=collection1 baseURL=http://127.0.0.1:51155/_/rz
[junit4:junit4]   2> 16819 T318 oasc.ZkController.checkRecovery Core needs to recover:collection1
[junit4:junit4]   2> 16819 T318 oasu.DefaultSolrCoreState.doRecovery Running recovery - first canceling any ongoing recovery
[junit4:junit4]   2> ASYNC  NEW_CORE C11 name=collection1 org.apache.solr.core.SolrCore@8d6437a url=http://127.0.0.1:51155/_/rz/collection1 node=127.0.0.1:51155__%2Frz C11_STATE=coll:collection1 core:collection1 props:{shard=null, roles=null, state=down, core=collection1, collection=collection1, node_name=127.0.0.1:51155__%2Frz, base_url=http://127.0.0.1:51155/_/rz}
[junit4:junit4]   2> 16820 T320 C11 P51155 oasc.RecoveryStrategy.run Starting recovery process.  core=collection1 recoveringAfterStartup=true
[junit4:junit4]   2> 16821 T320 C11 P51155 oasc.RecoveryStrategy.doRecovery ###### startupVersions=[]
[junit4:junit4]   2> 16821 T318 oascc.ZkStateReader.updateClusterState Updating cloud state from ZooKeeper... 
[junit4:junit4]   2> 16821 T320 C11 P51155 oasc.ZkController.publish publishing core=collection1 state=recovering
[junit4:junit4]   2> 16822 T320 C11 P51155 oasc.ZkController.publish numShards not found on descriptor - reading it from system property
[junit4:junit4]   2> 16823 T246 oass.SolrDispatchFilter.init user.dir=/Users/jenkins/jenkins-slave/workspace/Lucene-Solr-4.x-MacOSX/solr/build/solr-core/test/J0
[junit4:junit4]   2> 16823 T246 oass.SolrDispatchFilter.init SolrDispatchFilter.init() done
[junit4:junit4]   2> 16823 T320 C11 P51155 oascsi.HttpClientUtil.createClient Creating new http client, config:maxConnections=128&maxConnectionsPerHost=32&followRedirects=false
[junit4:junit4]   2> 16824 T246 oascsi.HttpClientUtil.createClient Creating new http client, config:maxConnections=128&maxConnectionsPerHost=32&followRedirects=false
[junit4:junit4]   2> 16995 T246 oejs.Server.doStart jetty-8.1.8.v20121106
[junit4:junit4]   2> 16999 T246 oejs.AbstractConnector.doStart Started SelectChannelConnector@127.0.0.1:51159
[junit4:junit4]   2> 17000 T246 oass.SolrDispatchFilter.init SolrDispatchFilter.init()
[junit4:junit4]   2> 17001 T246 oasc.SolrResourceLoader.locateSolrHome JNDI not configured for solr (NoInitialContextEx)
[junit4:junit4]   2> 17002 T246 oasc.SolrResourceLoader.locateSolrHome using system property solr.solr.home: /Users/jenkins/jenkins-slave/workspace/Lucene-Solr-4.x-MacOSX/solr/build/solr-core/test/J0/./org.apache.solr.cloud.BasicDistributedZkTest-jetty4-1358512884270
[junit4:junit4]   2> 17002 T246 oasc.CoreContainer$Initializer.initialize looking for solr.xml: /Users/jenkins/jenkins-slave/workspace/Lucene-Solr-4.x-MacOSX/solr/build/solr-core/test/J0/./org.apache.solr.cloud.BasicDistributedZkTest-jetty4-1358512884270/solr.xml
[junit4:junit4]   2> 17003 T246 oasc.CoreContainer.<init> New CoreContainer 967049443
[junit4:junit4]   2> 17004 T246 oasc.CoreContainer.load Loading CoreContainer using Solr Home: '/Users/jenkins/jenkins-slave/workspace/Lucene-Solr-4.x-MacOSX/solr/build/solr-core/test/J0/./org.apache.solr.cloud.BasicDistributedZkTest-jetty4-1358512884270/'
[junit4:junit4]   2> 17004 T246 oasc.SolrResourceLoader.<init> new SolrResourceLoader for directory: '/Users/jenkins/jenkins-slave/workspace/Lucene-Solr-4.x-MacOSX/solr/build/solr-core/test/J0/./org.apache.solr.cloud.BasicDistributedZkTest-jetty4-1358512884270/'
[junit4:junit4]   2> 17077 T246 oashc.HttpShardHandlerFactory.getParameter Setting socketTimeout to: 60000
[junit4:junit4]   2> 17078 T246 oashc.HttpShardHandlerFactory.getParameter Setting urlScheme to: http://
[junit4:junit4]   2> 17079 T246 oashc.HttpShardHandlerFactory.getParameter Setting connTimeout to: 15000
[junit4:junit4]   2> 17079 T246 oashc.HttpShardHandlerFactory.getParameter Setting maxConnectionsPerHost to: 20
[junit4:junit4]   2> 17080 T246 oashc.HttpShardHandlerFactory.getParameter Setting corePoolSize to: 0
[junit4:junit4]   2> 17081 T246 oashc.HttpShardHandlerFactory.getParameter Setting maximumPoolSize to: 2147483647
[junit4:junit4]   2> 17081 T246 oashc.HttpShardHandlerFactory.getParameter Setting maxThreadIdleTime to: 5
[junit4:junit4]   2> 17082 T246 oashc.HttpShardHandlerFactory.getParameter Setting sizeOfQueue to: -1
[junit4:junit4]   2> 17082 T246 oashc.HttpShardHandlerFactory.getParameter Setting fairnessPolicy to: false
[junit4:junit4]   2> 17083 T246 oascsi.HttpClientUtil.createClient Creating new http client, config:maxConnectionsPerHost=20&maxConnections=10000&socketTimeout=60000&connTimeout=15000&retry=false
[junit4:junit4]   2> 17102 T246 oasc.CoreContainer.load Registering Log Listener
[junit4:junit4]   2> 17125 T246 oasc.CoreContainer.initZooKeeper Zookeeper client=127.0.0.1:51142/solr
[junit4:junit4]   2> 17126 T246 oasc.ZkController.checkChrootPath zkHost includes chroot
[junit4:junit4]   2> 17126 T246 oaz.ZooKeeper.<init> Initiating client connection, connectString=127.0.0.1:51142 sessionTimeout=60000 watcher=org.apache.solr.common.cloud.ConnectionManager@58034a41
[junit4:junit4]   2> 17128 T246 oascc.ConnectionManager.waitForConnected Waiting for client to connect to ZooKeeper
[junit4:junit4]   2> 17128 T330 oaz.ClientCnxn$SendThread.logStartConnect Opening socket connection to server localhost/127.0.0.1:51142. Will not attempt to authenticate using SASL (access denied ("javax.security.auth.AuthPermission" "getLoginConfiguration"))
[junit4:junit4]   2> 17130 T330 oaz.ClientCnxn$SendThread.primeConnection Socket connection established to localhost/127.0.0.1:51142, initiating session
[junit4:junit4]   2> 17131 T248 oazs.NIOServerCnxnFactory.run Accepted socket connection from /127.0.0.1:51160
[junit4:junit4]   2> 17132 T248 oazs.ZooKeeperServer.processConnectRequest Client attempting to establish new session at /127.0.0.1:51160
[junit4:junit4]   2> 17134 T250 oazs.ZooKeeperServer.finishSessionInit Established session 0x13c4dad4882000b with negotiated timeout 20000 for client /127.0.0.1:51160
[junit4:junit4]   2> 17134 T330 oaz.ClientCnxn$SendThread.onConnected Session establishment complete on server localhost/127.0.0.1:51142, sessionid = 0x13c4dad4882000b, negotiated timeout = 20000
[junit4:junit4]   2> 17134 T331 oascc.ConnectionManager.process Watcher org.apache.solr.common.cloud.ConnectionManager@58034a41 name:ZooKeeperConnection Watcher:127.0.0.1:51142 got event WatchedEvent state:SyncConnected type:None path:null path:null type:None
[junit4:junit4]   2> 17135 T246 oascc.ConnectionManager.waitForConnected Client is connected to ZooKeeper
[junit4:junit4]   2> 17138 T251 oazs.PrepRequestProcessor.pRequest2Txn Processed session termination for sessionid: 0x13c4dad4882000b
[junit4:junit4]   2> 17139 T248 oazs.NIOServerCnxn.closeSock Closed socket connection for client /127.0.0.1:51160 which had sessionid 0x13c4dad4882000b
[junit4:junit4]   2> 17140 T331 oaz.ClientCnxn$EventThread.run EventThread shut down
[junit4:junit4]   2> 17140 T246 oaz.ZooKeeper.close Session: 0x13c4dad4882000b closed
[junit4:junit4]   2> 17141 T246 oascsi.HttpClientUtil.createClient Creating new http client, config:maxConnections=500&maxConnectionsPerHost=16&socketTimeout=60000&connTimeout=15000
[junit4:junit4]   2> 17152 T246 oaz.ZooKeeper.<init> Initiating client connection, connectString=127.0.0.1:51142/solr sessionTimeout=30000 watcher=org.apache.solr.common.cloud.ConnectionManager@2b164eb5
[junit4:junit4]   2> 17153 T246 oascc.ConnectionManager.waitForConnected Waiting for client to connect to ZooKeeper
[junit4:junit4]   2> 17154 T332 oaz.ClientCnxn$SendThread.logStartConnect Opening socket connection to server localhost/127.0.0.1:51142. Will not attempt to authenticate using SASL (access denied ("javax.security.auth.AuthPermission" "getLoginConfiguration"))
[junit4:junit4]   2> 17155 T332 oaz.ClientCnxn$SendThread.primeConnection Socket connection established to localhost/127.0.0.1:51142, initiating session
[junit4:junit4]   2> 17156 T248 oazs.NIOServerCnxnFactory.run Accepted socket connection from /127.0.0.1:51161
[junit4:junit4]   2> 17157 T248 oazs.ZooKeeperServer.processConnectRequest Client attempting to establish new session at /127.0.0.1:51161
[junit4:junit4]   2> 17158 T250 oazs.ZooKeeperServer.finishSessionInit Established session 0x13c4dad4882000c with negotiated timeout 20000 for client /127.0.0.1:51161
[junit4:junit4]   2> 17159 T332 oaz.ClientCnxn$SendThread.onConnected Session establishment complete on server localhost/127.0.0.1:51142, sessionid = 0x13c4dad4882000c, negotiated timeout = 20000
[junit4:junit4]   2> 17159 T333 oascc.ConnectionManager.process Watcher org.apache.solr.common.cloud.ConnectionManager@2b164eb5 name:ZooKeeperConnection Watcher:127.0.0.1:51142/solr got event WatchedEvent state:SyncConnected type:None path:null path:null type:None
[junit4:junit4]   2> 17162 T246 oascc.ConnectionManager.waitForConnected Client is connected to ZooKeeper
[junit4:junit4]   2> 17165 T251 oazs.PrepRequestProcessor.pRequest Got user-level KeeperException when processing sessionid:0x13c4dad4882000c type:create cxid:0x1 zxid:0xa1 txntype:-1 reqpath:n/a Error Path:/solr/overseer Error:KeeperErrorCode = NodeExists for /solr/overseer
[junit4:junit4]   2> 17172 T251 oazs.PrepRequestProcessor.pRequest Got user-level KeeperException when processing sessionid:0x13c4dad4882000c type:create cxid:0x2 zxid:0xa2 txntype:-1 reqpath:n/a Error Path:/solr/overseer Error:KeeperErrorCode = NodeExists for /solr/overseer
[junit4:junit4]   2> 17174 T246 oasc.ZkController.createEphemeralLiveNode Register node as live in ZooKeeper:/live_nodes/127.0.0.1:51159__%2Frz
[junit4:junit4]   2> 17176 T251 oazs.PrepRequestProcessor.pRequest Got user-level KeeperException when processing sessionid:0x13c4dad4882000c type:delete cxid:0x4 zxid:0xa3 txntype:-1 reqpath:n/a Error Path:/solr/live_nodes/127.0.0.1:51159__%2Frz Error:KeeperErrorCode = NoNode for /solr/live_nodes/127.0.0.1:51159__%2Frz
[junit4:junit4]   2> 17177 T246 oascc.SolrZkClient.makePath makePath: /live_nodes/127.0.0.1:51159__%2Frz
[junit4:junit4]   2> 17183 T302 oascc.ZkStateReader$2.process A cluster state change: WatchedEvent state:SyncConnected type:NodeChildrenChanged path:/live_nodes, has occurred - updating... (live nodes size: 4)
[junit4:junit4]   2> 17186 T268 oascc.ZkStateReader$3.process Updating live nodes... (5)
[junit4:junit4]   2> 17186 T287 oascc.ZkStateReader$3.process Updating live nodes... (5)
[junit4:junit4]   2> 17187 T274 oascc.ZkStateReader$3.process Updating live nodes... (5)
[junit4:junit4]   2> 17187 T274 oascc.ZkStateReader$2.process A cluster state change: WatchedEvent state:SyncConnected type:NodeChildrenChanged path:/live_nodes, has occurred - updating... (live nodes size: 5)
[junit4:junit4]   2> 17186 T317 oascc.ZkStateReader$3.process Updating live nodes... (5)
[junit4:junit4]   2> 17188 T317 oascc.ZkStateReader$2.process A cluster state change: WatchedEvent state:SyncConnected type:NodeChildrenChanged path:/live_nodes, has occurred - updating... (live nodes size: 5)
[junit4:junit4]   2> 17187 T287 oascc.ZkStateReader$2.process A cluster state change: WatchedEvent state:SyncConnected type:NodeChildrenChanged path:/live_nodes, has occurred - updating... (live nodes size: 5)
[junit4:junit4]   2> 17186 T268 oascc.ZkStateReader$2.process A cluster state change: WatchedEvent state:SyncConnected type:NodeChildrenChanged path:/live_nodes, has occurred - updating... (live nodes size: 5)
[junit4:junit4]   2> 17193 T302 oascc.ZkStateReader$3.process Updating live nodes... (5)
[junit4:junit4]   2> 17210 T246 oascc.ZkStateReader.createClusterStateWatchersAndUpdate Updating cluster state from ZooKeeper... 
[junit4:junit4]   2> 17225 T334 oasc.CoreContainer.create Creating SolrCore 'collection1' using instanceDir: /Users/jenkins/jenkins-slave/workspace/Lucene-Solr-4.x-MacOSX/solr/build/solr-core/test/J0/./org.apache.solr.cloud.BasicDistributedZkTest-jetty4-1358512884270/collection1
[junit4:junit4]   2> 17226 T334 oasc.ZkController.createCollectionZkNode Check for collection zkNode:collection1
[junit4:junit4]   2> 17228 T334 oasc.ZkController.createCollectionZkNode Collection zkNode exists
[junit4:junit4]   2> 17228 T334 oasc.ZkController.readConfigName Load collection config from:/collections/collection1
[junit4:junit4]   2> 17232 T334 oasc.SolrResourceLoader.<init> new SolrResourceLoader for directory: '/Users/jenkins/jenkins-slave/workspace/Lucene-Solr-4.x-MacOSX/solr/build/solr-core/test/J0/./org.apache.solr.cloud.BasicDistributedZkTest-jetty4-1358512884270/collection1/'
[junit4:junit4]   2> 17234 T334 oasc.SolrResourceLoader.replaceClassLoader Adding 'file:/Users/jenkins/jenkins-slave/workspace/Lucene-Solr-4.x-MacOSX/solr/build/solr-core/test/J0/org.apache.solr.cloud.BasicDistributedZkTest-jetty4-1358512884270/collection1/lib/classes/' to classloader
[junit4:junit4]   2> 17235 T334 oasc.SolrResourceLoader.replaceClassLoader Adding 'file:/Users/jenkins/jenkins-slave/workspace/Lucene-Solr-4.x-MacOSX/solr/build/solr-core/test/J0/org.apache.solr.cloud.BasicDistributedZkTest-jetty4-1358512884270/collection1/lib/README' to classloader
[junit4:junit4]   2> 17302 T334 oasc.SolrConfig.<init> Using Lucene MatchVersion: LUCENE_42
[junit4:junit4]   2> 17445 T334 oasc.SolrConfig.<init> Loaded SolrConfig: solrconfig.xml
[junit4:junit4]   2> 17447 T334 oass.IndexSchema.readSchema Reading Solr Schema
[junit4:junit4]   2> 17456 T334 oass.IndexSchema.readSchema Schema name=test
[junit4:junit4]   2> 17480 T269 oascc.ZkStateReader.updateClusterState Updating cloud state from ZooKeeper... 
[junit4:junit4]   2> 17481 T269 oasc.Overseer$ClusterStateUpdater.updateState Update state numShards=2 message={
[junit4:junit4]   2> 	  "operation":"state",
[junit4:junit4]   2> 	  "numShards":"2",
[junit4:junit4]   2> 	  "shard":"shard1",
[junit4:junit4]   2> 	  "roles":null,
[junit4:junit4]   2> 	  "state":"recovering",
[junit4:junit4]   2> 	  "core":"collection1",
[junit4:junit4]   2> 	  "collection":"collection1",
[junit4:junit4]   2> 	  "node_name":"127.0.0.1:51155__%2Frz",
[junit4:junit4]   2> 	  "base_url":"http://127.0.0.1:51155/_/rz"}
[junit4:junit4]   2> 17492 T333 oascc.ZkStateReader$2.process A cluster state change: WatchedEvent state:SyncConnected type:NodeDataChanged path:/clusterstate.json, has occurred - updating... (live nodes size: 5)
[junit4:junit4]   2> 17492 T317 oascc.ZkStateReader$2.process A cluster state change: WatchedEvent state:SyncConnected type:NodeDataChanged path:/clusterstate.json, has occurred - updating... (live nodes size: 5)
[junit4:junit4]   2> 17494 T287 oascc.ZkStateReader$2.process A cluster state change: WatchedEvent state:SyncConnected type:NodeDataChanged path:/clusterstate.json, has occurred - updating... (live nodes size: 5)
[junit4:junit4]   2> 17495 T268 oascc.ZkStateReader$2.process A cluster state change: WatchedEvent state:SyncConnected type:NodeDataChanged path:/clusterstate.json, has occurred - updating... (live nodes size: 5)
[junit4:junit4]   2> 17496 T274 oascc.ZkStateReader$2.process A cluster state change: WatchedEvent state:SyncConnected type:NodeDataChanged path:/clusterstate.json, has occurred - updating... (live nodes size: 5)
[junit4:junit4]   2> 17498 T302 oascc.ZkStateReader$2.process A cluster state change: WatchedEvent state:SyncConnected type:NodeDataChanged path:/clusterstate.json, has occurred - updating... (live nodes size: 5)
[junit4:junit4]   2> 18251 T334 oass.OpenExchangeRatesOrgProvider.init Initialized with rates=open-exchange-rates.json, refreshInterval=1440.
[junit4:junit4]   2> 18266 T334 oass.IndexSchema.readSchema default search field in schema is text
[junit4:junit4]   2> 18270 T334 oass.IndexSchema.readSchema unique key field: id
[junit4:junit4]   2> 18306 T334 oass.FileExchangeRateProvider.reload Reloading exchange rates from file currency.xml
[junit4:junit4]   2> 18313 T334 oass.FileExchangeRateProvider.reload Reloading exchange rates from file currency.xml
[junit4:junit4]   2> 18321 T334 oass.OpenExchangeRatesOrgProvider.reload Reloading exchange rates from open-exchange-rates.json
[junit4:junit4]   2> 18324 T334 oass.OpenExchangeRatesOrgProvider.reload Reloading exchange rates from open-exchange-rates.json
[junit4:junit4]   2> 18327 T334 oasc.SolrCore.<init> [collection1] Opening new SolrCore at /Users/jenkins/jenkins-slave/workspace/Lucene-Solr-4.x-MacOSX/solr/build/solr-core/test/J0/./org.apache.solr.cloud.BasicDistributedZkTest-jetty4-1358512884270/collection1/, dataDir=./org.apache.solr.cloud.BasicDistributedZkTest-1358512867445/jetty4/
[junit4:junit4]   2> 18328 T334 oasc.JmxMonitoredMap.<init> JMX monitoring is enabled. Adding Solr mbeans to JMX Server: com.sun.jmx.mbeanserver.JmxMBeanServer@2b10f19b
[junit4:junit4]   2> 18329 T334 oasc.SolrCore.initDirectoryFactory solr.NRTCachingDirectoryFactory
[junit4:junit4]   2> 18330 T334 oasc.CachingDirectoryFactory.get return new directory for /Users/jenkins/jenkins-slave/workspace/Lucene-Solr-4.x-MacOSX/solr/build/solr-core/test/J0/./org.apache.solr.cloud.BasicDistributedZkTest-1358512867445/jetty4 forceNew:false
[junit4:junit4]   2> 18331 T334 oasc.CachingDirectoryFactory.close Releasing directory:/Users/jenkins/jenkins-slave/workspace/Lucene-Solr-4.x-MacOSX/solr/build/solr-core/test/J0/./org.apache.solr.cloud.BasicDistributedZkTest-1358512867445/jetty4
[junit4:junit4]   2> 18331 T334 oasc.SolrCore.getNewIndexDir New index directory detected: old=null new=./org.apache.solr.cloud.BasicDistributedZkTest-1358512867445/jetty4/index/
[junit4:junit4]   2> 18332 T334 oasc.SolrCore.initIndex WARNING [collection1] Solr index directory './org.apache.solr.cloud.BasicDistributedZkTest-1358512867445/jetty4/index' doesn't exist. Creating new index...
[junit4:junit4]   2> 18333 T334 oasc.CachingDirectoryFactory.get return new directory for /Users/jenkins/jenkins-slave/workspace/Lucene-Solr-4.x-MacOSX/solr/build/solr-core/test/J0/./org.apache.solr.cloud.BasicDistributedZkTest-1358512867445/jetty4/index forceNew:false
[junit4:junit4]   2> 18339 T334 oasc.SolrDeletionPolicy.onCommit SolrDeletionPolicy.onCommit: commits:num=1
[junit4:junit4]   2> 		commit{dir=RateLimitedDirectoryWrapper(NRTCachingDirectory(org.apache.lucene.store.NIOFSDirectory@/Users/jenkins/jenkins-slave/workspace/Lucene-Solr-4.x-MacOSX/solr/build/solr-core/test/J0/org.apache.solr.cloud.BasicDistributedZkTest-1358512867445/jetty4/index lockFactory=org.apache.lucene.store.NativeFSLockFactory@1349c070; maxCacheMB=48.0 maxMergeSizeMB=4.0)),segFN=segments_1,generation=1,filenames=[segments_1]
[junit4:junit4]   2> 18340 T334 oasc.SolrDeletionPolicy.updateCommits newest commit = 1[segments_1]
[junit4:junit4]   2> 18341 T334 oasc.CachingDirectoryFactory.close Releasing directory:/Users/jenkins/jenkins-slave/workspace/Lucene-Solr-4.x-MacOSX/solr/build/solr-core/test/J0/./org.apache.solr.cloud.BasicDistributedZkTest-1358512867445/jetty4/index
[junit4:junit4]   2> 18342 T334 oasc.SolrCore.initWriters created xml: solr.XMLResponseWriter
[junit4:junit4]   2> 18346 T334 oasup.UpdateRequestProcessorChain.init inserting DistributedUpdateProcessorFactory into updateRequestProcessorChain "dedupe"
[junit4:junit4]   2> 18347 T334 oasup.UpdateRequestProcessorChain.init inserting DistributedUpdateProcessorFactory into updateRequestProcessorChain "dedupe-allfields"
[junit4:junit4]   2> 18348 T334 oasup.UpdateRequestProcessorChain.init inserting DistributedUpdateProcessorFactory into updateRequestProcessorChain "stored_sig"
[junit4:junit4]   2> 18348 T334 oasup.UpdateRequestProcessorChain.init inserting DistributedUpdateProcessorFactory into updateRequestProcessorChain "uniq-fields"
[junit4:junit4]   2> 18350 T334 oasup.UpdateRequestProcessorChain.init inserting DistributedUpdateProcessorFactory into updateRequestProcessorChain "distrib-dup-test-chain-implicit"
[junit4:junit4]   2> 18350 T334 oasc.RequestHandlers.initHandlersFromConfig adding lazy requestHandler: solr.ReplicationHandler
[junit4:junit4]   2> 18351 T334 oasc.RequestHandlers.initHandlersFromConfig created /replication: solr.ReplicationHandler
[junit4:junit4]   2> 18352 T334 oasc.RequestHandlers.initHandlersFromConfig created standard: solr.StandardRequestHandler
[junit4:junit4]   2> 18353 T334 oasc.RequestHandlers.initHandlersFromConfig created /get: solr.RealTimeGetHandler
[junit4:junit4]   2> 18354 T334 oasc.RequestHandlers.initHandlersFromConfig created dismax: solr.SearchHandler
[junit4:junit4]   2> 18355 T334 oasc.RequestHandlers.initHandlersFromConfig created mock: org.apache.solr.core.MockQuerySenderListenerReqHandler
[junit4:junit4]   2> 18356 T334 oasc.RequestHandlers.initHandlersFromConfig created /admin/: org.apache.solr.handler.admin.AdminHandlers
[junit4:junit4]   2> 18357 T334 oasc.RequestHandlers.initHandlersFromConfig created defaults: solr.StandardRequestHandler
[junit4:junit4]   2> 18357 T334 oasc.RequestHandlers.initHandlersFromConfig adding lazy requestHandler: solr.StandardRequestHandler
[junit4:junit4]   2> 18358 T334 oasc.RequestHandlers.initHandlersFromConfig created lazy: solr.StandardRequestHandler
[junit4:junit4]   2> 18359 T334 oasc.RequestHandlers.initHandlersFromConfig created /update: solr.UpdateRequestHandler
[junit4:junit4]   2> 18359 T334 oasc.RequestHandlers.initHandlersFromConfig created /terms: org.apache.solr.handler.component.SearchHandler
[junit4:junit4]   2> 18360 T334 oasc.RequestHandlers.initHandlersFromConfig created spellCheckCompRH: org.apache.solr.handler.component.SearchHandler
[junit4:junit4]   2> 18361 T334 oasc.RequestHandlers.initHandlersFromConfig created spellCheckCompRH_Direct: org.apache.solr.handler.component.SearchHandler
[junit4:junit4]   2> 18362 T334 oasc.RequestHandlers.initHandlersFromConfig created spellCheckWithWordbreak: org.apache.solr.handler.component.SearchHandler
[junit4:junit4]   2> 18363 T334 oasc.RequestHandlers.initHandlersFromConfig created spellCheckWithWordbreak_Direct: org.apache.solr.handler.component.SearchHandler
[junit4:junit4]   2> 18363 T334 oasc.RequestHandlers.initHandlersFromConfig created spellCheckCompRH1: org.apache.solr.handler.component.SearchHandler
[junit4:junit4]   2> 18364 T334 oasc.RequestHandlers.initHandlersFromConfig created mltrh: org.apache.solr.handler.component.SearchHandler
[junit4:junit4]   2> 18364 T334 oasc.RequestHandlers.initHandlersFromConfig created tvrh: org.apache.solr.handler.component.SearchHandler
[junit4:junit4]   2> 18365 T334 oasc.RequestHandlers.initHandlersFromConfig created /mlt: solr.MoreLikeThisHandler
[junit4:junit4]   2> 18366 T334 oasc.RequestHandlers.initHandlersFromConfig created /debug/dump: solr.DumpRequestHandler
[junit4:junit4]   2> 18373 T334 oashl.XMLLoader.init xsltCacheLifetimeSeconds=60
[junit4:junit4]   2> 18376 T334 oasc.SolrCore.initDeprecatedSupport WARNING solrconfig.xml uses deprecated <admin/gettableFiles>, Please update your config to use the ShowFileRequestHandler.
[junit4:junit4]   2> 18378 T334 oasc.SolrCore.initDeprecatedSupport WARNING adding ShowFileRequestHandler with hidden files: [SCHEMA.XML, OLD_SYNONYMS.TXT, STOPWORDS.TXT, PROTWORDS.TXT, OPEN-EXCHANGE-RATES.JSON, SYNONYMS.TXT, CURRENCY.XML, MAPPING-ISOLATIN1ACCENT.TXT]
[junit4:junit4]   2> 18382 T334 oasc.CachingDirectoryFactory.close Releasing directory:/Users/jenkins/jenkins-slave/workspace/Lucene-Solr-4.x-MacOSX/solr/build/solr-core/test/J0/./org.apache.solr.cloud.BasicDistributedZkTest-1358512867445/jetty4
[junit4:junit4]   2> 18384 T334 oass.SolrIndexSearcher.<init> Opening Searcher@21c1f85c main
[junit4:junit4]   2> 18385 T334 oasu.CommitTracker.<init> Hard AutoCommit: disabled
[junit4:junit4]   2> 18385 T334 oasu.CommitTracker.<init> Soft AutoCommit: disabled
[junit4:junit4]   2> 18387 T334 oashc.SpellCheckComponent.inform Initializing spell checkers
[junit4:junit4]   2> 18391 T334 oass.DirectSolrSpellChecker.init init: {name=direct,classname=DirectSolrSpellChecker,field=lowerfilt,minQueryLength=3}
[junit4:junit4]   2> 18438 T335 oasc.SolrCore.registerSearcher [collection1] Registered new searcher Searcher@21c1f85c main{StandardDirectoryReader(segments_1:1)}
[junit4:junit4]   2> 18449 T334 oasc.ZkController.publish publishing core=collection1 state=down
[junit4:junit4]   2> 18450 T334 oasc.ZkController.publish numShards not found on descriptor - reading it from system property
[junit4:junit4]   2> 19012 T269 oascc.ZkStateReader.updateClusterState Updating cloud state from ZooKeeper... 
[junit4:junit4]   2> 19014 T269 oasc.Overseer$ClusterStateUpdater.updateState Update state numShards=2 message={
[junit4:junit4]   2> 	  "operation":"state",
[junit4:junit4]   2> 	  "numShards":"2",
[junit4:junit4]   2> 	  "shard":null,
[junit4:junit4]   2> 	  "roles":null,
[junit4:junit4]   2> 	  "state":"down",
[junit4:junit4]   2> 	  "core":"collection1",
[junit4:junit4]   2> 	  "collection":"collection1",
[junit4:junit4]   2> 	  "node_name":"127.0.0.1:51159__%2Frz",
[junit4:junit4]   2> 	  "base_url":"http://127.0.0.1:51159/_/rz"}
[junit4:junit4]   2> 19015 T269 oasc.Overseer$ClusterStateUpdater.updateState Collection already exists with numShards=2
[junit4:junit4]   2> 19015 T269 oasc.Overseer$ClusterStateUpdater.updateState Assigning new node to shard shard=shard2
[junit4:junit4]   2> 19024 T317 oascc.ZkStateReader$2.process A cluster state change: WatchedEvent state:SyncConnected type:NodeDataChanged path:/clusterstate.json, has occurred - updating... (live nodes size: 5)
[junit4:junit4]   2> 19025 T333 oascc.ZkStateReader$2.process A cluster state change: WatchedEvent state:SyncConnected type:NodeDataChanged path:/clusterstate.json, has occurred - updating... (live nodes size: 5)
[junit4:junit4]   2> 19025 T287 oascc.ZkStateReader$2.process A cluster state change: WatchedEvent state:SyncConnected type:NodeDataChanged path:/clusterstate.json, has occurred - updating... (live nodes size: 5)
[junit4:junit4]   2> 19025 T274 oascc.ZkStateReader$2.process A cluster state change: WatchedEvent state:SyncConnected type:NodeDataChanged path:/clusterstate.json, has occurred - updating... (live nodes size: 5)
[junit4:junit4]   2> 19025 T268 oascc.ZkStateReader$2.process A cluster state change: WatchedEvent state:SyncConnected type:NodeDataChanged path:/clusterstate.json, has occurred - updating... (live nodes size: 5)
[junit4:junit4]   2> 19026 T302 oascc.ZkStateReader$2.process A cluster state change: WatchedEvent state:SyncConnected type:NodeDataChanged path:/clusterstate.json, has occurred - updating... (live nodes size: 5)
[junit4:junit4]   2> 19454 T334 oasc.CoreContainer.registerCore registering core: collection1
[junit4:junit4]   2> 19454 T334 oasc.ZkController.register Register replica - core:collection1 address:http://127.0.0.1:51159/_/rz collection:collection1 shard:shard2
[junit4:junit4]   2>  C11_STATE=coll:collection1 core:collection1 props:{shard=shard1, roles=null, state=recovering, core=collection1, collection=collection1, node_name=127.0.0.1:51155__%2Frz, base_url=http://127.0.0.1:51155/_/rz}
[junit4:junit4]   2> 19839 T320 C11 P51155 oasc.RecoveryStrategy.doRecovery Attempting to PeerSync from http://127.0.0.1:51149/_/rz/collection1/ core=collection1 - recoveringAfterStartup=true
[junit4:junit4]   2> 19841 T320 C11 P51155 oasu.PeerSync.sync PeerSync: core=collection1 url=http://127.0.0.1:51155/_/rz START replicas=[http://127.0.0.1:51149/_/rz/collection1/] nUpdates=100
[junit4:junit4]   2> 19842 T320 C11 P51155 oasu.PeerSync.sync WARNING no frame of reference to tell of we've missed updates
[junit4:junit4]   2> 19843 T320 C11 P51155 oasc.RecoveryStrategy.doRecovery PeerSync Recovery was not successful - trying replication. core=collection1
[junit4:junit4]   2> 19844 T320 C11 P51155 oasc.RecoveryStrategy.doRecovery Starting Replication Recovery. core=collection1
[junit4:junit4]   2> 19845 T320 C11 P51155 oasc.RecoveryStrategy.doRecovery Begin buffering updates. core=collection1
[junit4:junit4]   2> 19845 T320 C11 P51155 oasu.UpdateLog.bufferUpdates Starting to buffer updates. FSUpdateLog{state=ACTIVE, tlog=null}
[junit4:junit4]   2> 19846 T320 C11 P51155 oasc.RecoveryStrategy.replicate Attempting to replicate from http://127.0.0.1:51149/_/rz/collection1/. core=collection1
[junit4:junit4]   2> 19846 T320 C11 P51155 oascsi.HttpClientUtil.createClient Creating new http client, config:maxConnections=128&maxConnectionsPerHost=32&followRedirects=false
[junit4:junit4]   2> ASYNC  NEW_CORE C12 name=collection1 org.apache.solr.core.SolrCore@5e526cf9 url=http://127.0.0.1:51149/_/rz/collection1 node=127.0.0.1:51149__%2Frz C12_STATE=coll:collection1 core:collection1 props:{shard=shard1, roles=null, state=active, core=collection1, collection=collection1, node_name=127.0.0.1:51149__%2Frz, base_url=http://127.0.0.1:51149/_/rz, leader=true}
[junit4:junit4]   2> 19857 T282 C12 P51149 REQ /get {getVersions=100&distrib=false&wt=javabin&qt=/get&version=2} status=0 QTime=1 
[junit4:junit4]   2> 19861 T280 C12 P51149 oasu.DirectUpdateHandler2.commit start commit{,optimize=false,openSearcher=false,waitSearcher=true,expungeDeletes=false,softCommit=false}
[junit4:junit4]   2> 19862 T280 C12 P51149 oasc.CachingDirectoryFactory.close Releasing directory:/Users/jenkins/jenkins-slave/workspace/Lucene-Solr-4.x-MacOSX/solr/build/solr-core/test/J0/./org.apache.solr.cloud.BasicDistributedZkTest-1358512867445/jetty1
[junit4:junit4]   2> 19865 T280 C12 P51149 oasc.SolrDeletionPolicy.onInit SolrDeletionPolicy.onInit: commits:num=1
[junit4:junit4]   2> 		commit{dir=RateLimitedDirectoryWrapper(NRTCachingDirectory(org.apache.lucene.store.NIOFSDirectory@/Users/jenkins/jenkins-slave/workspace/Lucene-Solr-4.x-MacOSX/solr/build/solr-core/test/J0/org.apache.solr.cloud.BasicDistributedZkTest-1358512867445/jetty1/index lockFactory=org.apache.lucene.store.NativeFSLockFactory@494b05ae; maxCacheMB=48.0 maxMergeSizeMB=4.0)),segFN=segments_1,generation=1,filenames=[segments_1]
[junit4:junit4]   2> 19866 T280 C12 P51149 oasc.SolrDeletionPolicy.updateCommits newest commit = 1[segments_1]
[junit4:junit4]   2> 19922 T280 C12 P51149 oasc.SolrDeletionPolicy.onCommit SolrDeletionPolicy.onCommit: commits:num=2
[junit4:junit4]   2> 		commit{dir=RateLimitedDirectoryWrapper(NRTCachingDirectory(org.apache.lucene.store.NIOFSDirectory@/Users/jenkins/jenkins-slave/workspace/Lucene-Solr-4.x-MacOSX/solr/build/solr-core/test/J0/org.apache.solr.cloud.BasicDistributedZkTest-1358512867445/jetty1/index lockFactory=org.apache.lucene.store.NativeFSLockFactory@494b05ae; maxCacheMB=48.0 maxMergeSizeMB=4.0)),segFN=segments_1,generation=1,filenames=[segments_1]
[junit4:junit4]   2> 		commit{dir=RateLimitedDirectoryWrapper(NRTCachingDirectory(org.apache.lucene.store.NIOFSDirectory@/Users/jenkins/jenkins-slave/workspace/Lucene-Solr-4.x-MacOSX/solr/build/solr-core/test/J0/org.apache.solr.cloud.BasicDistributedZkTest-1358512867445/jetty1/index lockFactory=org.apache.lucene.store.NativeFSLockFactory@494b05ae; maxCacheMB=48.0 maxMergeSizeMB=4.0)),segFN=segments_2,generation=2,filenames=[segments_2]
[junit4:junit4]   2> 19923 T280 C12 P51149 oasc.SolrDeletionPolicy.updateCommits newest commit = 2[segments_2]
[junit4:junit4]   2> 19926 T280 C12 P51149 oasc.CachingDirectoryFactory.close Releasing directory:/Users/jenkins/jenkins-slave/workspace/Lucene-Solr-4.x-MacOSX/solr/build/solr-core/test/J0/./org.apache.solr.cloud.BasicDistributedZkTest-1358512867445/jetty1
[junit4:junit4]   2> 19928 T280 C12 P51149 oass.SolrIndexSearcher.<init> Opening Searcher@29b1649a realtime
[junit4:junit4]   2> 19929 T280 C12 P51149 oasu.DirectUpdateHandler2.commit end_commit_flush
[junit4:junit4]   2> 19929 T334 oasc.ZkController.register We are http://127.0.0.1:51159/_/rz/collection1/ and leader is http://127.0.0.1:51152/_/rz/collection1/
[junit4:junit4]   2> 19931 T280 C12 P51149 /update {waitSearcher=true&openSearcher=false&commit=true&wt=javabin&commit_end_point=true&version=2&softCommit=false} {commit=} 0 70
[junit4:junit4]   2> 19932 T334 oasc.ZkController.register No LogReplay needed for core=collection1 baseURL=http://127.0.0.1:51159/_/rz
[junit4:junit4]   2> 19933 T334 oasc.ZkController.checkRecovery Core needs to recover:collection1
[junit4:junit4]   2> 19934 T320 C11 P51155 oash.ReplicationHandler.inform Commits will be reserved for  10000
[junit4:junit4]   2> 19935 T334 oasu.DefaultSolrCoreState.doRecovery Running recovery - first canceling any ongoing recovery
[junit4:junit4]   2> 19935 T320 C11 P51155 oash.SnapPuller.<init>  No value set for 'pollInterval'. Timer Task not started.
[junit4:junit4]   2> ASYNC  NEW_CORE C13 name=collection1 org.apache.solr.core.SolrCore@1c962a81 url=http://127.0.0.1:51159/_/rz/collection1 node=127.0.0.1:51159__%2Frz C13_STATE=coll:collection1 core:collection1 props:{shard=null, roles=null, state=down, core=collection1, collection=collection1, node_name=127.0.0.1:51159__%2Frz, base_url=http://127.0.0.1:51159/_/rz}
[junit4:junit4]   2> 19936 T337 C13 P51159 oasc.RecoveryStrategy.run Starting recovery process.  core=collection1 recoveringAfterStartup=true
[junit4:junit4]   2> 19938 T337 C13 P51159 oasc.RecoveryStrategy.doRecovery ###### startupVersions=[]
[junit4:junit4]   2> 19938 T337 C13 P51159 oasc.ZkController.publish publishing core=collection1 state=recovering
[junit4:junit4]   2> 19939 T337 C13 P51159 oasc.ZkController.publish numShards not found on descriptor - reading it from system property
[junit4:junit4]   2> 19941 T334 oascc.ZkStateReader.updateClusterState Updating cloud state from ZooKeeper... 
[junit4:junit4]   2> 19943 T283 C12 P51149 oash.ReplicationHandler.inform Commits will be reserved for  10000
[junit4:junit4]   2> 19944 T337 C13 P51159 oascsi.HttpClientUtil.createClient Creating new http client, config:maxConnections=128&maxConnectionsPerHost=32&followRedirects=false
[junit4:junit4]   2> 19944 T283 C12 P51149 REQ /replication {command=indexversion&qt=/replication&wt=javabin&version=2} status=0 QTime=4 
[junit4:junit4]   2> 19946 T320 C11 P51155 oash.SnapPuller.fetchLatestIndex Master's generation: 2
[junit4:junit4]   2> 19947 T320 C11 P51155 oash.SnapPuller.fetchLatestIndex Slave's generation: 1
[junit4:junit4]   2> 19948 T320 C11 P51155 oash.SnapPuller.fetchLatestIndex Starting replication process
[junit4:junit4]   2> 19952 T278 C12 P51149 oasc.CachingDirectoryFactory.close Releasing directory:/Users/jenkins/jenkins-slave/workspace/Lucene-Solr-4.x-MacOSX/solr/build/solr-core/test/J0/./org.apache.solr.cloud.BasicDistributedZkTest-1358512867445/jetty1
[junit4:junit4]   2> 19953 T278 C12 P51149 oasc.CachingDirectoryFactory.close Releasing directory:/Users/jenkins/jenkins-slave/workspace/Lucene-Solr-4.x-MacOSX/solr/build/solr-core/test/J0/./org.apache.solr.cloud.BasicDistributedZkTest-1358512867445/jetty1/index
[junit4:junit4]   2> 19954 T278 C12 P51149 REQ /replication {command=filelist&qt=/replication&wt=javabin&generation=2&version=2} status=0 QTime=3 
[junit4:junit4]   2> 19956 T320 C11 P51155 oash.SnapPuller.fetchLatestIndex Number of files in latest index in master: 1
[junit4:junit4]   2> 19957 T246 oass.SolrDispatchFilter.init user.dir=/Users/jenkins/jenkins-slave/workspace/Lucene-Solr-4.x-MacOSX/solr/build/solr-core/test/J0
[junit4:junit4]   2> 19958 T246 oass.SolrDispatchFilter.init SolrDispatchFilter.init() done
[junit4:junit4]   2> 19959 T246 oascsi.HttpClientUtil.createClient Creating new http client, config:maxConnections=128&maxConnectionsPerHost=32&followRedirects=false
[junit4:junit4]   2> 19964 T320 C11 P51155 oasc.CachingDirectoryFactory.get return new directory for /Users/jenkins/jenkins-slave/workspace/Lucene-Solr-4.x-MacOSX/solr/build/solr-core/test/J0/./org.apache.solr.cloud.BasicDistributedZkTest-1358512867445/jetty3/index.20130118014127391 forceNew:false
[junit4:junit4]   2> 19965 T320 C11 P51155 oasc.CachingDirectoryFactory.close Releasing directory:/Users/jenkins/jenkins-slave/workspace/Lucene-Solr-4.x-MacOSX/solr/build/solr-core/test/J0/./org.apache.solr.cloud.BasicDistributedZkTest-1358512867445/jetty3
[junit4:junit4]   2> 19966 T320 C11 P51155 oash.SnapPuller.fetchLatestIndex Starting download to RateLimitedDirectoryWrapper(NRTCachingDirectory(org.apache.lucene.store.NIOFSDirectory@/Users/jenkins/jenkins-slave/workspace/Lucene-Solr-4.x-MacOSX/solr/build/solr-core/test/J0/org.apache.solr.cloud.BasicDistributedZkTest-1358512867445/jetty3/index.20130118014127391 lockFactory=org.apache.lucene.store.NativeFSLockFactory@9484766; maxCacheMB=48.0 maxMergeSizeMB=4.0)) fullCopy=true
[junit4:junit4]   2> 19969 T279 C12 P51149 REQ /replication {file=segments_2&command=filecontent&checksum=true&wt=filestream&qt=/replication&generation=2} status=0 QTime=0 
[junit4:junit4]   2> 19971 T246 oascc.ZkStateReader.updateClusterState Updating cloud state from ZooKeeper... 
[junit4:junit4]   2> 19972 T320 C11 P51155 oasc.CachingDirectoryFactory.close Releasing directory:/Users/jenkins/jenkins-slave/workspace/Lucene-Solr-4.x-MacOSX/solr/build/solr-core/test/J0/./org.apache.solr.cloud.BasicDistributedZkTest-1358512867445/jetty3/index
[junit4:junit4]   2> 19972 T246 oasc.AbstractDistribZkTestBase.waitForRecoveriesToFinish Wait for recoveries to finish - collection: collection1 failOnTimeout:true timeout (sec):230
[junit4:junit4]   2> 19973 T320 C11 P51155 oash.SnapPuller.fetchLatestIndex Total time taken for download : 0 secs
[junit4:junit4]   2> 19973 T320 C11 P51155 oash.SnapPuller.modifyIndexProps New index installed. Updating index properties... index=index.20130118014127391
[junit4:junit4]   2> 19974 T246 oascc.ZkStateReader.updateClusterState Updating cloud state from ZooKeeper... 
[junit4:junit4]   2> 19975 T320 C11 P51155 oasc.CachingDirectoryFactory.close Releasing directory:/Users/jenkins/jenkins-slave/workspace/Lucene-Solr-4.x-MacOSX/solr/build/solr-core/test/J0/./org.apache.solr.cloud.BasicDistributedZkTest-1358512867445/jetty3
[junit4:junit4]   2> 19976 T320 C11 P51155 oasc.CachingDirectoryFactory.close Releasing directory:/Users/jenkins/jenkins-slave/workspace/Lucene-Solr-4.x-MacOSX/solr/build/solr-core/test/J0/./org.apache.solr.cloud.BasicDistributedZkTest-1358512867445/jetty3
[junit4:junit4]   2> 19976 T320 C11 P51155 oasc.SolrCore.getNewIndexDir New index directory detected: old=./org.apache.solr.cloud.BasicDistributedZkTest-1358512867445/jetty3/index/ new=./org.apache.solr.cloud.BasicDistributedZkTest-1358512867445/jetty3/index.20130118014127391
[junit4:junit4]   2> 19980 T320 C11 P51155 oasc.SolrDeletionPolicy.onInit SolrDeletionPolicy.onInit: commits:num=1
[junit4:junit4]   2> 		commit{dir=RateLimitedDirectoryWrapper(NRTCachingDirectory(org.apache.lucene.store.NIOFSDirectory@/Users/jenkins/jenkins-slave/workspace/Lucene-Solr-4.x-MacOSX/solr/build/solr-core/test/J0/org.apache.solr.cloud.BasicDistributedZkTest-1358512867445/jetty3/index.20130118014127391 lockFactory=org.apache.lucene.store.NativeFSLockFactory@9484766; maxCacheMB=48.0 maxMergeSizeMB=4.0)),segFN=segments_2,generation=2,filenames=[segments_2]
[junit4:junit4]   2> 19980 T320 C11 P51155 oasc.SolrDeletionPolicy.updateCommits newest commit = 2[segments_2]
[junit4:junit4]   2> 19982 T320 C11 P51155 oasc.CachingDirectoryFactory.close Releasing directory:/Users/jenkins/jenkins-slave/workspace/Lucene-Solr-4.x-MacOSX/solr/build/solr-core/test/J0/./org.apache.solr.cloud.BasicDistributedZkTest-1358512867445/jetty3
[junit4:junit4]   2> 19983 T320 C11 P51155 oasu.DefaultSolrCoreState.newIndexWriter Creating new IndexWriter...
[junit4:junit4]   2> 19983 T320 C11 P51155 oasu.DefaultSolrCoreState.newIndexWriter Waiting until IndexWriter is unused... core=collection1
[junit4:junit4]   2> 19983 T320 C11 P51155 oasu.DefaultSolrCoreState.newIndexWriter Rollback old IndexWriter... core=collection1
[junit4:junit4]   2> 19984 T320 C11 P51155 oasc.CachingDirectoryFactory.close Releasing directory:/Users/jenkins/jenkins-slave/workspace/Lucene-Solr-4.x-MacOSX/solr/build/solr-core/test/J0/./org.apache.solr.cloud.BasicDistributedZkTest-1358512867445/jetty3/index.20130118014127391
[junit4:junit4]   2> 19985 T320 C11 P51155 oasc.CachingDirectoryFactory.close Releasing directory:/Users/jenkins/jenkins-slave/workspace/Lucene-Solr-4.x-MacOSX/solr/build/solr-core/test/J0/./org.apache.solr.cloud.BasicDistributedZkTest-1358512867445/jetty3
[junit4:junit4]   2> 19988 T320 C11 P51155 oasc.SolrDeletionPolicy.onInit SolrDeletionPolicy.onInit: commits:num=1
[junit4:junit4]   2> 		commit{dir=RateLimitedDirectoryWrapper(NRTCachingDirectory(org.apache.lucene.store.NIOFSDirectory@/Users/jenkins/jenkins-slave/workspace/Lucene-Solr-4.x-MacOSX/solr/build/solr-core/test/J0/org.apache.solr.cloud.BasicDistributedZkTest-1358512867445/jetty3/index.20130118014127391 lockFactory=org.apache.lucene.store.NativeFSLockFactory@9484766; maxCacheMB=48.0 maxMergeSizeMB=4.0)),segFN=segments_2,generation=2,filenames=[segments_2]
[junit4:junit4]   2> 19989 T320 C11 P51155 oasc.SolrDeletionPolicy.updateCommits newest commit = 2[segments_2]
[junit4:junit4]   2> 19989 T320 C11 P51155 oasu.DefaultSolrCoreState.newIndexWriter New IndexWriter is ready to be used.
[junit4:junit4]   2> 19990 T320 C11 P51155 oasc.CachingDirectoryFactory.close Releasing directory:/Users/jenkins/jenkins-slave/workspace/Lucene-Solr-4.x-MacOSX/solr/build/solr-core/test/J0/./org.apache.solr.cloud.BasicDistributedZkTest-1358512867445/jetty3
[junit4:junit4]   2> 19991 T320 C11 P51155 oass.SolrIndexSearcher.<init> Opening Searcher@36049c97 main
[junit4:junit4]   2> 19993 T319 oasc.SolrCore.registerSearcher [collection1] Registered new searcher Searcher@36049c97 main{StandardDirectoryReader(segments_2:1:nrt)}
[junit4:junit4]   2> 19995 T319 oasc.CachingDirectoryFactory.close Releasing directory:/Users/jenkins/jenkins-slave/workspace/Lucene-Solr-4.x-MacOSX/solr/build/solr-core/test/J0/./org.apache.solr.cloud.BasicDistributedZkTest-1358512867445/jetty3/index
[junit4:junit4]   2> 19995 T320 C11 P51155 oasu.DirectUpdateHandler2.commit start commit{,optimize=false,openSearcher=false,waitSearcher=false,expungeDeletes=false,softCommit=false}
[junit4:junit4]   2> 19998 T320 C11 P51155 oasc.SolrDeletionPolicy.onCommit SolrDeletionPolicy.onCommit: commits:num=2
[junit4:junit4]   2> 		commit{dir=RateLimitedDirectoryWrapper(NRTCachingDirectory(org.apache.lucene.store.NIOFSDirectory@/Users/jenkins/jenkins-slave/workspace/Lucene-Solr-4.x-MacOSX/solr/build/solr-core/test/J0/org.apache.solr.cloud.BasicDistributedZkTest-1358512867445/jetty3/index.20130118014127391 lockFactory=org.apache.lucene.store.NativeFSLockFactory@9484766; maxCacheMB=48.0 maxMergeSizeMB=4.0)),segFN=segments_2,generation=2,filenames=[segments_2]
[junit4:junit4]   2> 		commit{dir=RateLimitedDirectoryWrapper(NRTCachingDirectory(org.apache.lucene.store.NIOFSDirectory@/Users/jenkins/jenkins-slave/workspace/Lucene-Solr-4.x-MacOSX/solr/build/solr-core/test/J0/org.apache.solr.cloud.BasicDistributedZkTest-1358512867445/jetty3/index.20130118014127391 lockFactory=org.apache.lucene.store.NativeFSLockFactory@9484766; maxCacheMB=48.0 maxMergeSizeMB=4.0)),segFN=segments_3,generation=3,filenames=[segments_3]
[junit4:junit4]   2> 19998 T320 C11 P51155 oasc.SolrDeletionPolicy.updateCommits newest commit = 3[segments_3]
[junit4:junit4]   2> 19999 T320 C11 P51155 oasc.CachingDirectoryFactory.close Releasing directory:/Users/jenkins/jenkins-slave/workspace/Lucene-Solr-4.x-MacOSX/solr/build/solr-core/test/J0/./org.apache.solr.cloud.BasicDistributedZkTest-1358512867445/jetty3
[junit4:junit4]   2> 20000 T320 C11 P51155 oasu.DirectUpdateHandler2.commit end_commit_flush
[junit4:junit4]   2> 20000 T320 C11 P51155 oasc.CachingDirectoryFactory.close Releasing directory:/Users/jenkins/jenkins-slave/workspace/Lucene-Solr-4.x-MacOSX/solr/build/solr-core/test/J0/./org.apache.solr.cloud.BasicDistributedZkTest-1358512867445/jetty3/index.20130118014127391
[junit4:junit4]   2> 20001 T320 C11 P51155 oasc.CachingDirectoryFactory.close Releasing directory:/Users/jenkins/jenkins-slave/workspace/Lucene-Solr-4.x-MacOSX/solr/build/solr-core/test/J0/./org.apache.solr.cloud.BasicDistributedZkTest-1358512867445/jetty3/index
[junit4:junit4]   2> 20001 T320 C11 P51155 oasc.RecoveryStrategy.replay No replay needed. core=collection1
[junit4:junit4]   2> 20001 T320 C11 P51155 oasc.RecoveryStrategy.doRecovery Replication Recovery was successful - registering as Active. core=collection1
[junit4:junit4]   2> 20002 T320 C11 P51155 oasc.ZkController.publish publishing core=collection1 state=active
[junit4:junit4]   2> 20002 T320 C11 P51155 oasc.ZkController.publish numShards not found on descriptor - reading it from system property
[junit4:junit4]   2> 20004 T320 C11 P51155 oasc.RecoveryStrategy.doRecovery Finished recovery process. core=collection1
[junit4:junit4]   2> 20540 T269 oascc.ZkStateReader.updateClusterState Updating cloud state from ZooKeeper... 
[junit4:junit4]   2> 20541 T269 oasc.Overseer$ClusterStateUpdater.updateState Update state numShards=2 message={
[junit4:junit4]   2> 	  "operation":"state",
[junit4:junit4]   2> 	  "numShards":"2",
[junit4:junit4]   2> 	  "shard":"shard2",
[junit4:junit4]   2> 	  "roles":null,
[junit4:junit4]   2> 	  "state":"recovering",
[junit4:junit4]   2> 	  "core":"collection1",
[junit4:junit4]   2> 	  "collection":"collection1",
[junit4:junit4]   2> 	  "node_name":"127.0.0.1:51159__%2Frz",
[junit4:junit4]   2> 	  "base_url":"http://127.0.0.1:51159/_/rz"}
[junit4:junit4]   2> 20548 T269 oasc.Overseer$ClusterStateUpdater.updateState Update state numShards=2 message={
[junit4:junit4]   2> 	  "operation":"state",
[junit4:junit4]   2> 	  "numShards":"2",
[junit4:junit4]   2> 	  "shard":"shard1",
[junit4:junit4]   2> 	  "roles":null,
[junit4:junit4]   2> 	  "state":"active",
[junit4:junit4]   2> 	  "core":"collection1",
[junit4:junit4]   2> 	  "collection":"collection1",
[junit4:junit4]   2> 	  "node_name":"127.0.0.1:51155__%2Frz",
[junit4:junit4]   2> 	  "base_url":"http://127.0.0.1:51155/_/rz"}
[junit4:junit4]   2> 20557 T317 oascc.ZkStateReader$2.process A cluster state change: WatchedEvent state:SyncConnected type:NodeDataChanged path:/clusterstate.json, has occurred - updating... (live nodes size: 5)
[junit4:junit4]   2> 20557 T268 oascc.ZkStateReader$2.process A cluster state change: WatchedEvent state:SyncConnected type:NodeDataChanged path:/clusterstate.json, has occurred - updating... (live nodes size: 5)
[junit4:junit4]   2> 20558 T302 oascc.ZkStateReader$2.process A cluster state change: WatchedEvent state:SyncConnected type:NodeDataChanged path:/clusterstate.json, has occurred - updating... (live nodes size: 5)
[junit4:junit4]   2> 20558 T274 oascc.ZkStateReader$2.process A cluster state change: WatchedEvent state:SyncConnected type:NodeDataChanged path:/clusterstate.json, has occurred - updating... (live nodes size: 5)
[junit4:junit4]   2> 20558 T287 oascc.ZkStateReader$2.process A cluster state change: WatchedEvent state:SyncConnected type:NodeDataChanged path:/clusterstate.json, has occurred - updating... (live nodes size: 5)
[junit4:junit4]   2> 20558 T333 oascc.ZkStateReader$2.process A cluster state change: WatchedEvent state:SyncConnected type:NodeDataChanged path:/clusterstate.json, has occurred - updating... (live nodes size: 5)
[junit4:junit4]   2> 20978 T246 oascc.ZkStateReader.updateClusterState Updating cloud state from ZooKeeper... 
[junit4:junit4]   2> 21987 T246 oascc.ZkStateReader.updateClusterState Updating cloud state from ZooKeeper... 
[junit4:junit4]   2>  C13_STATE=coll:collection1 core:collection1 props:{shard=shard2, roles=null, state=recovering, core=collection1, collection=collection1, node_name=127.0.0.1:51159__%2Frz, base_url=http://127.0.0.1:51159/_/rz}
[junit4:junit4]   2> 22968 T337 C13 P51159 oasc.RecoveryStrategy.doRecovery Attempting to PeerSync from http://127.0.0.1:51152/_/rz/collection1/ core=collection1 - recoveringAfterStartup=true
[junit4:junit4]   2> 22969 T337 C13 P51159 oasu.PeerSync.sync PeerSync: core=collection1 url=http://127.0.0.1:51159/_/rz START replicas=[http://127.0.0.1:51152/_/rz/collection1/] nUpdates=100
[junit4:junit4]   2> 22969 T337 C13 P51159 oasu.PeerSync.sync WARNING no frame of reference to tell of we've missed updates
[junit4:junit4]   2> 22970 T337 C13 P51159 oasc.RecoveryStrategy.doRecovery PeerSync Recovery was not successful - trying replication. core=collection1
[junit4:junit4]   2> 22970 T337 C13 P51159 oasc.RecoveryStrategy.doRecovery Starting Replication Recovery. core=collection1
[junit4:junit4]   2> 22971 T337 C13 P51159 oasc.RecoveryStrategy.doRecovery Begin buffering updates. core=collection1
[junit4:junit4]   2> 22971 T337 C13 P51159 oasu.UpdateLog.bufferUpdates Starting to buffer updates. FSUpdateLog{state=ACTIVE, tlog=null}
[junit4:junit4]   2> 22971 T337 C13 P51159 oasc.RecoveryStrategy.replicate Attempting to replicate from http://127.0.0.1:51152/_/rz/collection1/. core=collection1
[junit4:junit4]   2> 22972 T337 C13 P51159 oascsi.HttpClientUtil.createClient Creating new http client, config:maxConnections=128&maxConnectionsPerHost=32&followRedirects=false
[junit4:junit4]   2> ASYNC  NEW_CORE C14 name=collection1 org.apache.solr.core.SolrCore@772221c5 url=http://127.0.0.1:51152/_/rz/collection1 node=127.0.0.1:51152__%2Frz C14_STATE=coll:collection1 core:collection1 props:{shard=shard2, roles=null, state=active, core=collection1, collection=collection1, node_name=127.0.0.1:51152__%2Frz, base_url=http://127.0.0.1:51152/_/rz, leader=true}
[junit4:junit4]   2> 22981 T298 C14 P51152 REQ /get {getVersions=100&distrib=false&wt=javabin&qt=/get&version=2} status=0 QTime=2 
[junit4:junit4]   2> 22984 T296 C14 P51152 oasu.DirectUpdateHandler2.commit start commit{,optimize=false,openSearcher=false,waitSearcher=true,expungeDeletes=false,softCommit=false}
[junit4:junit4]   2> 22985 T296 C14 P51152 oasc.CachingDirectoryFactory.close Releasing directory:/Users/jenkins/jenkins-slave/workspace/Lucene-Solr-4.x-MacOSX/solr/build/solr-core/test/J0/./org.apache.solr.cloud.BasicDistributedZkTest-1358512867445/jetty2
[junit4:junit4]   2> 22988 T296 C14 P51152 oasc.SolrDeletionPolicy.onInit SolrDeletionPolicy.onInit: commits:num=1
[junit4:junit4]   2> 		commit{dir=RateLimitedDirectoryWrapper(NRTCachingDirectory(org.apache.lucene.store.NIOFSDirectory@/Users/jenkins/jenkins-slave/workspace/Lucene-Solr-4.x-MacOSX/solr/build/solr-core/test/J0/org.apache.solr.cloud.BasicDistributedZkTest-1358512867445/jetty2/index lockFactory=org.apache.lucene.store.NativeFSLockFactory@1b268984; maxCacheMB=48.0 maxMergeSizeMB=4.0)),segFN=segments_1,generation=1,filenames=[segments_1]
[junit4:junit4]   2> 22989 T296 C14 P51152 oasc.SolrDeletionPolicy.updateCommits newest commit = 1[segments_1]
[junit4:junit4]   2> 22991 T246 oascc.ZkStateReader.updateClusterState Updating cloud state from ZooKeeper... 
[junit4:junit4]   2> 22992 T296 C14 P51152 oasc.SolrDeletionPolicy.onCommit SolrDeletionPolicy.onCommit: commits:num=2
[junit4:junit4]   2> 		commit{dir=RateLimitedDirectoryWrapper(NRTCachingDirectory(org.apache.lucene.store.NIOFSDirectory@/Users/jenkins/jenkins-slave/workspace/Lucene-Solr-4.x-MacOSX/solr/build/solr-core/test/J0/org.apache.solr.cloud.BasicDistributedZkTest-1358512867445/jetty2/index lockFactory=org.apache.lucene.store.NativeFSLockFactory@1b268984; maxCacheMB=48.0 maxMergeSizeMB=4.0)),segFN=segments_1,generation=1,filenames=[segments_1]
[junit4:junit4]   2> 		commit{dir=RateLimitedDirectoryWrapper(NRTCachingDirectory(org.apache.lucene.store.NIOFSDirectory@/Users/jenkins/jenkins-slave/workspace/Lucene-Solr-4.x-MacOSX/solr/build/solr-core/test/J0/org.apache.solr.cloud.BasicDistributedZkTest-1358512867445/jetty2/index lockFactory=org.apache.lucene.store.NativeFSLockFactory@1b268984; maxCacheMB=48.0 maxMergeSizeMB=4.0)),segFN=segments_2,generation=2,filenames=[segments_2]
[junit4:junit4]   2> 22992 T296 C14 P51152 oasc.SolrDeletionPolicy.updateCommits newest commit = 2[segments_2]
[junit4:junit4]   2> 22993 T296 C14 P51152 oasc.CachingDirectoryFactory.close Releasing directory:/Users/jenkins/jenkins-slave/workspace/Lucene-Solr-4.x-MacOSX/solr/build/solr-core/test/J0/./org.apache.solr.cloud.BasicDistributedZkTest-1358512867445/jetty2
[junit4:junit4]   2> 22994 T296 C14 P51152 oass.SolrIndexSearcher.<init> Opening Searcher@1dc5bb3d realtime
[junit4:junit4]   2> 22995 T296 C14 P51152 oasu.DirectUpdateHandler2.commit end_commit_flush
[junit4:junit4]   2> 22995 T296 C14 P51152 /update {waitSearcher=true&openSearcher=false&commit=true&wt=javabin&commit_end_point=true&version=2&softCommit=false} {commit=} 0 11
[junit4:junit4]   2> 22997 T337 C13 P51159 oash.ReplicationHandler.inform Commits will be reserved for  10000
[junit4:junit4]   2> 22998 T337 C13 P51159 oash.SnapPuller.<init>  No value set for 'pollInterval'. Timer Task not started.
[junit4:junit4]   2> 23001 T293 C14 P51152 oash.ReplicationHandler.inform Commits will be reserved for  10000
[junit4:junit4]   2> 23002 T293 C14 P51152 REQ /replication {command=indexversion&qt=/replication&wt=javabin&version=2} status=0 QTime=2 
[junit4:junit4]   2> 23003 T337 C13 P51159 oash.SnapPuller.fetchLatestIndex Master's generation: 2
[junit4:junit4]   2> 23003 T337 C13 P51159 oash.SnapPuller.fetchLatestIndex Slave's generation: 1
[junit4:junit4]   2> 23004 T337 C13 P51159 oash.SnapPuller.fetchLatestIndex Starting replication process
[junit4:junit4]   2> 23006 T294 C14 P51152 oasc.CachingDirectoryFactory.close Releasing directory:/Users/jenkins/jenkins-slave/workspace/Lucene-Solr-4.x-MacOSX/solr/build/solr-core/test/J0/./org.apache.solr.cloud.BasicDistributedZkTest-1358512867445/jetty2
[junit4:junit4]   2> 23007 T294 C14 P51152 oasc.CachingDirectoryFactory.close Releasing directory:/Users/jenkins/jenkins-slave/workspace/Lucene-Solr-4.x-MacOSX/solr/build/solr-core/test/J0/./org.apache.solr.cloud.BasicDistributedZkTest-1358512867445/jetty2/index
[junit4:junit4]   2> 23008 T294 C14 P51152 REQ /replication {command=filelist&qt=/replication&wt=javabin&generation=2&version=2} status=0 QTime=2 
[junit4:junit4]   2> 23009 T337 C13 P51159 oash.SnapPuller.fetchLatestIndex Number of files in latest index in master: 1
[junit4:junit4]   2> 23010 T337 C13 P51159 oasc.CachingDirectoryFactory.get return new directory for /Users/jenkins/jenkins-slave/workspace/Lucene-Solr-4.x-MacOSX/solr/build/solr-core/test/J0/./org.apache.solr.cloud.BasicDistributedZkTest-1358512867445/jetty4/index.20130118014130443 forceNew:false
[junit4:junit4]   2> 23010 T337 C13 P51159 oasc.CachingDirectoryFactory.close Releasing directory:/Users/jenkins/jenkins-slave/workspace/Lucene-Solr-4.x-MacOSX/solr/build/solr-core/test/J0/./org.apache.solr.cloud.BasicDistributedZkTest-1358512867445/jetty4
[junit4:junit4]   2> 23011 T337 C13 P51159 oash.SnapPuller.fetchLatestIndex Starting download to RateLimitedDirectoryWrapper(NRTCachingDirectory(org.apache.lucene.store.NIOFSDirectory@/Users/jenkins/jenkins-slave/workspace/Lucene-Solr-4.x-MacOSX/solr/build/solr-core/test/J0/org.apache.solr.cloud.BasicDistributedZkTest-1358512867445/jetty4/index.20130118014130443 lockFactory=org.apache.lucene.store.NativeFSLockFactory@358c5162; maxCacheMB=48.0 maxMergeSizeMB=4.0)) fullCopy=true
[junit4:junit4]   2> 23014 T298 C14 P51152 REQ /replication {file=segments_2&command=filecontent&checksum=true&wt=filestream&qt=/replication&generation=2} status=0 QTime=0 
[junit4:junit4]   2> 23016 T337 C13 P51159 oasc.CachingDirectoryFactory.close Releasing directory:/Users/jenkins/jenkins-slave/workspace/Lucene-Solr-4.x-MacOSX/solr/build/solr-core/test/J0/./org.apache.solr.cloud.BasicDistributedZkTest-1358512867445/jetty4/index
[junit4:junit4]   2> 23016 T337 C13 P51159 oash.SnapPuller.fetchLatestIndex Total time taken for download : 0 secs
[junit4:junit4]   2> 23017 T337 C13 P51159 oash.SnapPuller.modifyIndexProps New index installed. Updating index properties... index=index.20130118014130443
[junit4:junit4]   2> 23018 T337 C13 P51159 oasc.CachingDirectoryFactory.close Releasing directory:/Users/jenkins/jenkins-slave/workspace/Lucene-Solr-4.x-MacOSX/solr/build/solr-core/test/J0/./org.apache.solr.cloud.BasicDistributedZkTest-1358512867445/jetty4
[junit4:junit4]   2> 23019 T337 C13 P51159 oasc.CachingDirectoryFactory.close Releasing directory:/Users/jenkins/jenkins-slave/workspace/Lucene-Solr-4.x-MacOSX/solr/build/solr-core/test/J0/./org.apache.solr.cloud.BasicDistributedZkTest-1358512867445/jetty4
[junit4:junit4]   2> 23020 T337 C13 P51159 oasc.SolrCore.getNewIndexDir New index directory detected: old=./org.apache.solr.cloud.BasicDistributedZkTest-1358512867445/jetty4/index/ new=./org.apache.solr.cloud.BasicDistributedZkTest-1358512867445/jetty4/index.20130118014130443
[junit4:junit4]   2> 23022 T337 C13 P51159 oasc.SolrDeletionPolicy.onInit SolrDeletionPolicy.onInit: commits:num=1
[junit4:junit4]   2> 		commit{dir=RateLimitedDirectoryWrapper(NRTCachingDirectory(org.apache.lucene.store.NIOFSDirectory@/Users/jenkins/jenkins-slave/workspace/Lucene-Solr-4.x-MacOSX/solr/build/solr-core/test/J0/org.apache.solr.cloud.BasicDistributedZkTest-1358512867445/jetty4/index.20130118014130443 lockFactory=org.apache.lucene.store.NativeFSLockFactory@358c5162; maxCacheMB=48.0 maxMergeSizeMB=4.0)),segFN=segments_2,generation=2,filenames=[segments_2]
[junit4:junit4]   2> 23023 T337 C13 P51159 oasc.SolrDeletionPolicy.updateCommits newest commit = 2[segments_2]
[junit4:junit4]   2> 23025 T337 C13 P51159 oasc.CachingDirectoryFactory.close Releasing directory:/Users/jenkins/jenkins-slave/workspace/Lucene-Solr-4.x-MacOSX/solr/build/solr-core/test/J0/./org.apache.solr.cloud.BasicDistributedZkTest-1358512867445/jetty4
[junit4:junit4]   2> 23025 T337 C13 P51159 oasu.DefaultSolrCoreState.newIndexWriter Creating new IndexWriter...
[junit4:junit4]   2> 23026 T337 C13 P51159 oasu.DefaultSolrCoreState.newIndexWriter Waiting until IndexWriter is unused... core=collection1
[junit4:junit4]   2> 23027 T337 C13 P51159 oasu.DefaultSolrCoreState.newIndexWriter Rollback old IndexWriter... core=collection1
[junit4:junit4]   2> 23028 T337 C13 P51159 oasc.CachingDirectoryFactory.close Releasing directory:/Users/jenkins/jenkins-slave/workspace/Lucene-Solr-4.x-MacOSX/solr/build/solr-core/test/J0/./org.apache.solr.cloud.BasicDistributedZkTest-1358512867445/jetty4/index.20130118014130443
[junit4:junit4]   2> 23029 T337 C13 P51159 oasc.CachingDirectoryFactory.close Releasing directory:/Users/jenkins/jenkins-slave/workspace/Lucene-Solr-4.x-MacOSX/solr/build/solr-core/test/J0/./org.apache.solr.cloud.BasicDistributedZkTest-1358512867445/jetty4
[junit4:junit4]   2> 23032 T337 C13 P51159 oasc.SolrDeletionPolicy.onInit SolrDeletionPolicy.onInit: commits:num=1
[junit4:junit4]   2> 		commit{dir=RateLimitedDirectoryWrapper(NRTCachingDirectory(org.apache.lucene.store.NIOFSDirectory@/Users/jenkins/jenkins-slave/workspace/Lucene-Solr-4.x-MacOSX/solr/build/solr-core/test/J0/org.apache.solr.cloud.BasicDistributedZkTest-1358512867445/jetty4/index.20130118014130443 lockFactory=org.apache.lucene.store.NativeFSLockFactory@358c5162; maxCacheMB=48.0 maxMergeSizeMB=4.0)),segFN=segments_2,generation=2,filenames=[segments_2]
[junit4:junit4]   2> 23032 T337 C13 P51159 oasc.SolrDeletionPolicy.updateCommits newest commit = 2[segments_2]
[junit4:junit4]   2> 23033 T337 C13 P51159 oasu.DefaultSolrCoreState.newIndexWriter New IndexWriter is ready to be used.
[junit4:junit4]   2> 23033 T337 C13 P51159 oasc.CachingDirectoryFactory.close Releasing directory:/Users/jenkins/jenkins-slave/workspace/Lucene-Solr-4.x-MacOSX/solr/build/solr-core/test/J0/./org.apache.solr.cloud.BasicDistributedZkTest-1358512867445/jetty4
[junit4:junit4]   2> 23034 T337 C13 P51159 oass.SolrIndexSearcher.<init> Opening Searcher@37b7b97c main
[junit4:junit4]   2> 23037 T335 oasc.SolrCore.registerSearcher [collection1] Registered new searcher Searcher@37b7b97c main{StandardDirectoryReader(segments_2:1:nrt)}
[junit4:junit4]   2> 23037 T335 oasc.CachingDirectoryFactory.close Releasing directory:/Users/jenkins/jenkins-slave/workspace/Lucene-Solr-4.x-MacOSX/solr/build/solr-core/test/J0/./org.apache.solr.cloud.BasicDistributedZkTest-1358512867445/jetty4/index
[junit4:junit4]   2> 23038 T337 C13 P51159 oasu.DirectUpdateHandler2.commit start commit{,optimize=false,openSearcher=false,waitSearcher=false,expungeDeletes=false,softCommit=false}
[junit4:junit4]   2> 23041 T337 C13 P51159 oasc.SolrDeletionPolicy.onCommit SolrDeletionPolicy.onCommit: commits:num=2
[junit4:junit4]   2> 		commit{dir=RateLimitedDirectoryWrapper(NRTCachingDirectory(org.apache.lucene.store.NIOFSDirectory@/Users/jenkins/jenkins-slave/workspace/Lucene-Solr-4.x-MacOSX/solr/build/solr-core/test/J0/org.apache.solr.cloud.BasicDistributedZkTest-1358512867445/jetty4/index.20130118014130443 lockFactory=org.apache.lucene.store.NativeFSLockFactory@358c5162; maxCacheMB=48.0 maxMergeSizeMB=4.0)),segFN=segments_2,generation=2,filenames=[segments_2]
[junit4:junit4]   2> 		commit{dir=RateLimitedDirectoryWrapper(NRTCachingDirectory(org.apache.lucene.store.NIOFSDirectory@/Users/jenkins/jenkins-slave/workspace/Lucene-Solr-4.x-MacOSX/solr/build/solr-core/test/J0/org.apache.solr.cloud.BasicDistributedZkTest-1358512867445/jetty4/index.20130118014130443 lockFactory=org.apache.lucene.store.NativeFSLockFactory@358c5162; maxCacheMB=48.0 maxMergeSizeMB=4.0)),segFN=segments_3,generation=3,filenames=[segments_3]
[junit4:junit4]   2> 23041 T337 C13 P51159 oasc.SolrDeletionPolicy.updateCommits newest commit = 3[segments_3]
[junit4:junit4]   2> 23042 T337 C13 P51159 oasc.CachingDirectoryFactory.close Releasing directory:/Users/jenkins/jenkins-slave/workspace/Lucene-Solr-4.x-MacOSX/solr/build/solr-core/test/J0/./org.apache.solr.cloud.BasicDistributedZkTest-1358512867445/jetty4
[junit4:junit4]   2> 23043 T337 C13 P51159 oasu.DirectUpdateHandler2.commit end_commit_flush
[junit4:junit4]   2> 23043 T337 C13 P51159 oasc.CachingDirectoryFactory.close Releasing directory:/Users/jenkins/jenkins-slave/workspace/Lucene-Solr-4.x-MacOSX/solr/build/solr-core/test/J0/./org.apache.solr.cloud.BasicDistributedZkTest-1358512867445/jetty4/index.20130118014130443
[junit4:junit4]   2> 23043 T337 C13 P51159 oasc.CachingDirectoryFactory.close Releasing directory:/Users/jenkins/jenkins-slave/workspace/Lucene-Solr-4.x-MacOSX/solr/build/solr-core/test/J0/./org.apache.solr.cloud.BasicDistributedZkTest-1358512867445/jetty4/index
[junit4:junit4]   2> 23044 T337 C13 P51159 oasc.RecoveryStrategy.replay No replay needed. core=collection1
[junit4:junit4]   2> 23044 T337 C13 P51159 oasc.RecoveryStrategy.doRecovery Replication Recovery was successful - registering as Active. core=collection1
[junit4:junit4]   2> 23044 T337 C13 P51159 oasc.ZkController.publish publishing core=collection1 state=active
[junit4:junit4]   2> 23045 T337 C13 P51159 oasc.ZkController.publish numShards not found on descriptor - reading it from system property
[junit4:junit4]   2> 23047 T337 C13 P51159 oasc.RecoveryStrategy.doRecovery Finished recovery process. core=collection1
[junit4:junit4]   2> 23580 T269 oascc.ZkStateReader.updateClusterState Updating cloud state from ZooKeeper... 
[junit4:junit4]   2> 23582 T269 oasc.Overseer$ClusterStateUpdater.updateState Update state numShards=2 message={
[junit4:junit4]   2> 	  "operation":"state",
[junit4:junit4]   2> 	  "numShards":"2",
[junit4:junit4]   2> 	  "shard":"shard2",
[junit4:junit4]   2> 	  "roles":null,
[junit4:junit4]   2> 	  "state":"active",
[junit4:junit4]   2> 	  "core":"collection1",
[junit4:junit4]   2> 	  "collection":"collection1",
[junit4:junit4]   2> 	  "node_name":"127.0.0.1:51159__%2Frz",
[junit4:junit4]   2> 	  "base_url":"http://127.0.0.1:51159/_/rz"}
[junit4:junit4]   2> 23593 T317 oascc.ZkStateReader$2.process A cluster state change: WatchedEvent state:SyncConnected type:NodeDataChanged path:/clusterstate.json, has occurred - updating... (live nodes size: 5)
[junit4:junit4]   2> 23593 T287 oascc.ZkStateReader$2.process A cluster state change: WatchedEvent state:SyncConnected type:NodeDataChanged path:/clusterstate.json, has occurred - updating... (live nodes size: 5)
[junit4:junit4]   2> 23594 T302 oascc.ZkStateReader$2.process A cluster state change: WatchedEvent state:SyncConnected type:NodeDataChanged path:/clusterstate.json, has occurred - updating... (live nodes size: 5)
[junit4:junit4]   2> 23593 T333 oascc.ZkStateReader$2.process A cluster state change: WatchedEvent state:SyncConnected type:NodeDataChanged path:/clusterstate.json, has occurred - updating... (live nodes size: 5)
[junit4:junit4]   2> 23594 T274 oascc.ZkStateReader$2.process A cluster state change: WatchedEvent state:SyncConnected type:NodeDataChanged path:/clusterstate.json, has occurred - updating... (live nodes size: 5)
[junit4:junit4]   2> 23593 T268 oascc.ZkStateReader$2.process A cluster state change: WatchedEvent state:SyncConnected type:NodeDataChanged path:/clusterstate.json, has occurred - updating... (live nodes size: 5)
[junit4:junit4]   2> 23997 T246 oascc.ZkStateReader.updateClusterState Updating cloud state from ZooKeeper... 
[junit4:junit4]   2> 23999 T246 oasc.AbstractDistribZkTestBase.waitForRecoveriesToFinish Recoveries finished - collection: collection1
[junit4:junit4]   2> ASYNC  NEW_CORE C15 name=collection1 org.apache.solr.core.SolrCore@48de42ee url=http://127.0.0.1:51145/_/rz/collection1 node=127.0.0.1:51145__%2Frz C15_STATE=coll:control_collection core:collection1 props:{shard=shard1, roles=null, state=active, core=collection1, collection=control_collection, node_name=127.0.0.1:51145__%2Frz, base_url=http://127.0.0.1:51145/_/rz, leader=true}
[junit4:junit4]   2> 24014 T262 C15 P51145 oasc.CachingDirectoryFactory.close Releasing directory:/Users/jenkins/jenkins-slave/workspace/Lucene-Solr-4.x-MacOSX/solr/build/solr-core/test/J0/./org.apache.solr.cloud.BasicDistributedZkTest-1358512867445/control/data
[junit4:junit4]   2> 24018 T262 C15 P51145 oasc.SolrDeletionPolicy.onInit SolrDeletionPolicy.onInit: commits:num=1
[junit4:junit4]   2> 		commit{dir=RateLimitedDirectoryWrapper(NRTCachingDirectory(org.apache.lucene.store.NIOFSDirectory@/Users/jenkins/jenkins-slave/workspace/Lucene-Solr-4.x-MacOSX/solr/build/solr-core/test/J0/org.apache.solr.cloud.BasicDistributedZkTest-1358512867445/control/data/index lockFactory=org.apache.lucene.store.NativeFSLockFactory@213e7e70; maxCacheMB=48.0 maxMergeSizeMB=4.0)),segFN=segments_1,generation=1,filenames=[segments_1]
[junit4:junit4]   2> 24020 T262 C15 P51145 oasc.SolrDeletionPolicy.updateCommits newest commit = 1[segments_1]
[junit4:junit4]   2> 24021 T262 C15 P51145 oasc.CachingDirectoryFactory.close Releasing directory:/Users/jenkins/jenkins-slave/workspace/Lucene-Solr-4.x-MacOSX/solr/build/solr-core/test/J0/./org.apache.solr.cloud.BasicDistributedZkTest-1358512867445/control/data
[junit4:junit4]   2> 24022 T262 C15 P51145 oass.SolrIndexSearcher.<init> Opening Searcher@6d3deca1 realtime
[junit4:junit4]   2> 24022 T262 C15 P51145 /update {wt=javabin&version=2} {deleteByQuery=*:* (-1424504013661929472)} 0 10
[junit4:junit4]   2> 24028 T278 C12 P51149 oasc.CachingDirectoryFactory.close Releasing directory:/Users/jenkins/jenkins-slave/workspace/Lucene-Solr-4.x-MacOSX/solr/build/solr-core/test/J0/./org.apache.solr.cloud.BasicDistributedZkTest-1358512867445/jetty1
[junit4:junit4]   2> 24036 T297 C14 P51152 oasc.CachingDirectoryFactory.close Releasing directory:/Users/jenkins/jenkins-slave/workspace/Lucene-Solr-4.x-MacOSX/solr/build/solr-core/test/J0/./org.apache.solr.cloud.BasicDistributedZkTest-1358512867445/jetty2
[junit4:junit4]   2>  C11_STATE=coll:collection1 core:collection1 props:{shard=shard1, roles=null, state=active, core=collection1, collection=collection1, node_name=127.0.0.1:51155__%2Frz, base_url=http://127.0.0.1:51155/_/rz}
[junit4:junit4]   2> 24050 T310 C11 P51155 oasc.CachingDirectoryFactory.close Releasing directory:/Users/jenkins/jenkins-slave/workspace/Lucene-Solr-4.x-MacOSX/solr/build/solr-core/test/J0/./org.apache.solr.cloud.BasicDistributedZkTest-1358512867445/jetty3
[junit4:junit4]   2> 24052 T310 C11 P51155 /update {update.distrib=FROMLEADER&_version_=-1424504013675560960&update.from=http://127.0.0.1:51149/_/rz/collection1/&wt=javabin&version=2} {deleteByQuery=*:* (-1424504013675560960)} 0 5
[junit4:junit4]   2>  C13_STATE=coll:collection1 core:collection1 props:{shard=shard2, roles=null, state=active, core=collection1, collection=collection1, node_name=127.0.0.1:51159__%2Frz, base_url=http://127.0.0.1:51159/_/rz}
[junit4:junit4]   2> 24058 T329 C13 P51159 oasc.CachingDirectoryFactory.close Releasing directory:/Users/jenkins/jenkins-slave/workspace/Lucene-Solr-4.x-MacOSX/solr/build/solr-core/test/J0/./org.apache.solr.cloud.BasicDistributedZkTest-1358512867445/jetty4
[junit4:junit4]   2> 24059 T329 C13 P51159 /update {update.distrib=FROMLEADER&_version_=-1424504013683949568&update.from=http://127.0.0.1:51152/_/rz/collection1/&wt=javabin&version=2} {deleteByQuery=*:* (-1424504013683949568)} 0 4
[junit4:junit4]   2> 24061 T297 C14 P51152 /update {update.distrib=TOLEADER&wt=javabin&version=2} {deleteByQuery=*:* (-1424504013683949568)} 0 27
[junit4:junit4]   2> 24063 T278 C12 P51149 /update {wt=javabin&version=2} {deleteByQuery=*:* (-1424504013675560960)} 0 37
[junit4:junit4]   2> 24104 T263 C15 P51145 /update {wt=javabin&version=2} {add=[1 (1424504013750009856)]} 0 8
[junit4:junit4]   2> 24131 T311 C11 P51155 /update {distrib.from=http://127.0.0.1:51149/_/rz/collection1/&update.distrib=FROMLEADER&wt=javabin&version=2} {add=[1 (1424504013764689920)]} 0 4
[junit4:junit4]   2> 24132 T279 C12 P51149 /update {wt=javabin&version=2} {add=[1 (1424504013764689920)]} 0 22
[junit4:junit4]   2> 24143 T264 C15 P51145 /update {wt=javabin&version=2} {add=[2 (1424504013794050048)]} 0 4
[junit4:junit4]   2> 24173 T324 C13 P51159 /update {distrib.from=http://127.0.0.1:51152/_/rz/collection1/&update.distrib=FROMLEADER&wt=javabin&version=2} {add=[2 (1424504013818167296)]} 0 5
[junit4:junit4]   2> 24174 T293 C14 P51152 /update {distrib.from=http://127.0.0.1:51149/_/rz/collection1/&update.distrib=TOLEADER&wt=javabin&version=2} {add=[2 (1424504013818167296)]} 0 13
[junit4:junit4]   2> 24175 T282 C12 P51149 /update {wt=javabin&version=2} {add=[2]} 0 21
[junit4:junit4]   2> 24191 T259 C15 P51145 /update {wt=javabin&version=2} {add=[3 (1424504013845430272)]} 0 4
[junit4:junit4]   2> 24212 T325 C13 P51159 /update {distrib.from=http://127.0.0.1:51152/_/rz/collection1/&update.distrib=FROMLEADER&wt=javabin&version=2} {add=[3 (1424504013856964608)]} 0 4
[junit4:junit4]   2> 24214 T294 C14 P51152 /update {distrib.from=http://127.0.0.1:51149/_/rz/collection1/&update.distrib=TOLEADER&wt=j

[...truncated too long message...]

t4]   1>                   "base_url":"http://127.0.0.1:51145/_/rz",
[junit4:junit4]   1>                   "leader":"true"}}}},
[junit4:junit4]   1>           "router":"compositeId"}}
[junit4:junit4]   1>  /zookeeper (1)
[junit4:junit4]   1>  DATA:
[junit4:junit4]   1>      
[junit4:junit4]   1> 
[junit4:junit4]   2> NOTE: reproduce with: ant test  -Dtestcase=BasicDistributedZkTest -Dtests.method=testDistribSearch -Dtests.seed=C43149EDEFD65A9 -Dtests.slow=true -Dtests.locale=bg -Dtests.timezone=Pacific/Pago_Pago -Dtests.file.encoding=US-ASCII
[junit4:junit4] FAILURE  403s | BasicDistributedZkTest.testDistribSearch <<<
[junit4:junit4]    > Throwable #1: java.lang.AssertionError: There are still nodes recoverying - waited for 230 seconds
[junit4:junit4]    > 	at __randomizedtesting.SeedInfo.seed([C43149EDEFD65A9:8DA59A86A9A20595]:0)
[junit4:junit4]    > 	at org.junit.Assert.fail(Assert.java:93)
[junit4:junit4]    > 	at org.apache.solr.cloud.AbstractDistribZkTestBase.waitForRecoveriesToFinish(AbstractDistribZkTestBase.java:168)
[junit4:junit4]    > 	at org.apache.solr.cloud.AbstractDistribZkTestBase.waitForRecoveriesToFinish(AbstractDistribZkTestBase.java:126)
[junit4:junit4]    > 	at org.apache.solr.cloud.AbstractDistribZkTestBase.waitForRecoveriesToFinish(AbstractDistribZkTestBase.java:121)
[junit4:junit4]    > 	at org.apache.solr.cloud.BasicDistributedZkTest.testCoreUnloadAndLeaders(BasicDistributedZkTest.java:586)
[junit4:junit4]    > 	at org.apache.solr.cloud.BasicDistributedZkTest.doTest(BasicDistributedZkTest.java:337)
[junit4:junit4]    > 	at org.apache.solr.BaseDistributedSearchTestCase.testDistribSearch(BaseDistributedSearchTestCase.java:794)
[junit4:junit4]    > 	at sun.reflect.NativeMethodAccessorImpl.invoke0(Native Method)
[junit4:junit4]    > 	at sun.reflect.NativeMethodAccessorImpl.invoke(NativeMethodAccessorImpl.java:57)
[junit4:junit4]    > 	at sun.reflect.DelegatingMethodAccessorImpl.invoke(DelegatingMethodAccessorImpl.java:43)
[junit4:junit4]    > 	at java.lang.reflect.Method.invoke(Method.java:601)
[junit4:junit4]    > 	at com.carrotsearch.randomizedtesting.RandomizedRunner.invoke(RandomizedRunner.java:1559)
[junit4:junit4]    > 	at com.carrotsearch.randomizedtesting.RandomizedRunner.access$600(RandomizedRunner.java:79)
[junit4:junit4]    > 	at com.carrotsearch.randomizedtesting.RandomizedRunner$6.evaluate(RandomizedRunner.java:737)
[junit4:junit4]    > 	at com.carrotsearch.randomizedtesting.RandomizedRunner$7.evaluate(RandomizedRunner.java:773)
[junit4:junit4]    > 	at com.carrotsearch.randomizedtesting.RandomizedRunner$8.evaluate(RandomizedRunner.java:787)
[junit4:junit4]    > 	at com.carrotsearch.randomizedtesting.rules.SystemPropertiesRestoreRule$1.evaluate(SystemPropertiesRestoreRule.java:53)
[junit4:junit4]    > 	at org.apache.lucene.util.TestRuleSetupTeardownChained$1.evaluate(TestRuleSetupTeardownChained.java:50)
[junit4:junit4]    > 	at org.apache.lucene.util.TestRuleFieldCacheSanity$1.evaluate(TestRuleFieldCacheSanity.java:51)
[junit4:junit4]    > 	at org.apache.lucene.util.AbstractBeforeAfterRule$1.evaluate(AbstractBeforeAfterRule.java:46)
[junit4:junit4]    > 	at com.carrotsearch.randomizedtesting.rules.SystemPropertiesInvariantRule$1.evaluate(SystemPropertiesInvariantRule.java:55)
[junit4:junit4]    > 	at org.apache.lucene.util.TestRuleThreadAndTestName$1.evaluate(TestRuleThreadAndTestName.java:49)
[junit4:junit4]    > 	at org.apache.lucene.util.TestRuleIgnoreAfterMaxFailures$1.evaluate(TestRuleIgnoreAfterMaxFailures.java:70)
[junit4:junit4]    > 	at org.apache.lucene.util.TestRuleMarkFailure$1.evaluate(TestRuleMarkFailure.java:48)
[junit4:junit4]    > 	at com.carrotsearch.randomizedtesting.rules.StatementAdapter.evaluate(StatementAdapter.java:36)
[junit4:junit4]    > 	at com.carrotsearch.randomizedtesting.ThreadLeakControl$StatementRunner.run(ThreadLeakControl.java:358)
[junit4:junit4]    > 	at com.carrotsearch.randomizedtesting.ThreadLeakControl.forkTimeoutingTask(ThreadLeakControl.java:782)
[junit4:junit4]    > 	at com.carrotsearch.randomizedtesting.ThreadLeakControl$3.evaluate(ThreadLeakControl.java:442)
[junit4:junit4]    > 	at com.carrotsearch.randomizedtesting.RandomizedRunner.runSingleTest(RandomizedRunner.java:746)
[junit4:junit4]    > 	at com.carrotsearch.randomizedtesting.RandomizedRunner$3.evaluate(RandomizedRunner.java:648)
[junit4:junit4]    > 	at com.carrotsearch.randomizedtesting.RandomizedRunner$4.evaluate(RandomizedRunner.java:682)
[junit4:junit4]    > 	at com.carrotsearch.randomizedtesting.RandomizedRunner$5.evaluate(RandomizedRunner.java:693)
[junit4:junit4]    > 	at com.carrotsearch.randomizedtesting.rules.StatementAdapter.evaluate(StatementAdapter.java:36)
[junit4:junit4]    > 	at com.carrotsearch.randomizedtesting.rules.SystemPropertiesRestoreRule$1.evaluate(SystemPropertiesRestoreRule.java:53)
[junit4:junit4]    > 	at org.apache.lucene.util.AbstractBeforeAfterRule$1.evaluate(AbstractBeforeAfterRule.java:46)
[junit4:junit4]    > 	at org.apache.lucene.util.TestRuleStoreClassName$1.evaluate(TestRuleStoreClassName.java:42)
[junit4:junit4]    > 	at com.carrotsearch.randomizedtesting.rules.SystemPropertiesInvariantRule$1.evaluate(SystemPropertiesInvariantRule.java:55)
[junit4:junit4]    > 	at com.carrotsearch.randomizedtesting.rules.NoShadowingOrOverridesOnMethodsRule$1.evaluate(NoShadowingOrOverridesOnMethodsRule.java:39)
[junit4:junit4]    > 	at com.carrotsearch.randomizedtesting.rules.NoShadowingOrOverridesOnMethodsRule$1.evaluate(NoShadowingOrOverridesOnMethodsRule.java:39)
[junit4:junit4]    > 	at com.carrotsearch.randomizedtesting.rules.StatementAdapter.evaluate(StatementAdapter.java:36)
[junit4:junit4]    > 	at org.apache.lucene.util.TestRuleAssertionsRequired$1.evaluate(TestRuleAssertionsRequired.java:43)
[junit4:junit4]    > 	at org.apache.lucene.util.TestRuleMarkFailure$1.evaluate(TestRuleMarkFailure.java:48)
[junit4:junit4]    > 	at org.apache.lucene.util.TestRuleIgnoreAfterMaxFailures$1.evaluate(TestRuleIgnoreAfterMaxFailures.java:70)
[junit4:junit4]    > 	at org.apache.lucene.util.TestRuleIgnoreTestSuites$1.evaluate(TestRuleIgnoreTestSuites.java:55)
[junit4:junit4]    > 	at com.carrotsearch.randomizedtesting.rules.StatementAdapter.evaluate(StatementAdapter.java:36)
[junit4:junit4]    > 	at com.carrotsearch.randomizedtesting.ThreadLeakControl$StatementRunner.run(ThreadLeakControl.java:358)
[junit4:junit4]    > 	at java.lang.Thread.run(Thread.java:722)
[junit4:junit4]   2> 403372 T246 oas.SolrTestCaseJ4.deleteCore ###deleteCore
[junit4:junit4]   2> NOTE: test params are: codec=Lucene41: {n_f1=Lucene41(blocksize=128), foo_b=PostingsFormat(name=NestedPulsing), cat=Pulsing41(freqCutoff=12 minBlockSize=66 maxBlockSize=145), foo_d=PostingsFormat(name=Asserting), foo_f=PostingsFormat(name=NestedPulsing), n_tl1=Lucene41(blocksize=128), n_d1=Pulsing41(freqCutoff=12 minBlockSize=66 maxBlockSize=145), rnd_b=PostingsFormat(name=Asserting), intDefault=Lucene41(blocksize=128), n_td1=Lucene41(blocksize=128), timestamp=Pulsing41(freqCutoff=12 minBlockSize=66 maxBlockSize=145), id=PostingsFormat(name=Asserting), range_facet_sl=PostingsFormat(name=Asserting), range_facet_si=Pulsing41(freqCutoff=12 minBlockSize=66 maxBlockSize=145), oddField_s=PostingsFormat(name=Asserting), sequence_i=PostingsFormat(name=Asserting), name=PostingsFormat(name=Asserting), foo_i=Lucene41(blocksize=128), regex_dup_B_s=Pulsing41(freqCutoff=12 minBlockSize=66 maxBlockSize=145), multiDefault=Pulsing41(freqCutoff=12 minBlockSize=66 maxBlockSize=145), n_tf1=Pulsing41(freqCutoff=12 minBlockSize=66 maxBlockSize=145), n_dt1=Lucene41(blocksize=128), genre_s=PostingsFormat(name=Asserting), author_t=Lucene41(blocksize=128), n_ti1=PostingsFormat(name=Asserting), range_facet_l=Pulsing41(freqCutoff=12 minBlockSize=66 maxBlockSize=145), text=PostingsFormat(name=NestedPulsing), _version_=Lucene41(blocksize=128), val_i=PostingsFormat(name=Asserting), SubjectTerms_mfacet=Lucene41(blocksize=128), series_t=Lucene41(blocksize=128), a_t=Pulsing41(freqCutoff=12 minBlockSize=66 maxBlockSize=145), n_tdt1=Lucene41(blocksize=128), regex_dup_A_s=PostingsFormat(name=NestedPulsing), price=PostingsFormat(name=NestedPulsing), other_tl1=Lucene41(blocksize=128), n_l1=Pulsing41(freqCutoff=12 minBlockSize=66 maxBlockSize=145), a_si=Lucene41(blocksize=128), inStock=PostingsFormat(name=NestedPulsing)}, sim=DefaultSimilarity, locale=bg, timezone=Pacific/Pago_Pago
[junit4:junit4]   2> NOTE: Mac OS X 10.8.2 x86_64/Oracle Corporation 1.7.0_10 (64-bit)/cpus=2,threads=1,free=105105640,total=377487360
[junit4:junit4]   2> NOTE: All tests run in this JVM: [TestFaceting, NumericFieldsTest, TestSolrIndexConfig, TestCoreContainer, TestCSVResponseWriter, SyncSliceTest, HighlighterTest, TestOmitPositions, BasicDistributedZkTest]
[junit4:junit4] Completed in 403.80s, 1 test, 1 failure <<< FAILURES!

[...truncated 735 lines...]
BUILD FAILED
/Users/jenkins/jenkins-slave/workspace/Lucene-Solr-4.x-MacOSX/build.xml:344: The following error occurred while executing this line:
/Users/jenkins/jenkins-slave/workspace/Lucene-Solr-4.x-MacOSX/build.xml:39: The following error occurred while executing this line:
/Users/jenkins/jenkins-slave/workspace/Lucene-Solr-4.x-MacOSX/solr/build.xml:178: The following error occurred while executing this line:
/Users/jenkins/jenkins-slave/workspace/Lucene-Solr-4.x-MacOSX/solr/common-build.xml:428: The following error occurred while executing this line:
/Users/jenkins/jenkins-slave/workspace/Lucene-Solr-4.x-MacOSX/lucene/common-build.xml:1176: The following error occurred while executing this line:
/Users/jenkins/jenkins-slave/workspace/Lucene-Solr-4.x-MacOSX/lucene/common-build.xml:841: There were test failures: 248 suites, 1034 tests, 1 failure, 14 ignored (3 assumptions)

Total time: 63 minutes 32 seconds
Build step 'Invoke Ant' marked build as failure
Archiving artifacts
Recording test results
Description set: Java: 64bit/jdk1.7.0 -XX:+UseG1GC
Email was triggered for: Failure
Sending email for trigger: Failure



Mime
View raw message