lucene-dev mailing list archives

Site index · List index
Message view « Date » · « Thread »
Top « Date » · « Thread »
From Apache Jenkins Server <jenk...@builds.apache.org>
Subject [JENKINS] Lucene-Solr-Tests-4.x-Java6 - Build # 1295 - Failure
Date Thu, 31 Jan 2013 21:18:50 GMT
Build: https://builds.apache.org/job/Lucene-Solr-Tests-4.x-Java6/1295/

1 tests failed.
REGRESSION:  org.apache.solr.cloud.SyncSliceTest.testDistribSearch

Error Message:
shard1 should have just been set up to be inconsistent - but it's still consistent

Stack Trace:
java.lang.AssertionError: shard1 should have just been set up to be inconsistent - but it's still consistent
	at __randomizedtesting.SeedInfo.seed([5D1528D128C9A709:DCF3A6C95F96C735]:0)
	at org.junit.Assert.fail(Assert.java:93)
	at org.junit.Assert.assertTrue(Assert.java:43)
	at org.junit.Assert.assertNotNull(Assert.java:526)
	at org.apache.solr.cloud.SyncSliceTest.doTest(SyncSliceTest.java:214)
	at org.apache.solr.BaseDistributedSearchTestCase.testDistribSearch(BaseDistributedSearchTestCase.java:794)
	at sun.reflect.NativeMethodAccessorImpl.invoke0(Native Method)
	at sun.reflect.NativeMethodAccessorImpl.invoke(NativeMethodAccessorImpl.java:57)
	at sun.reflect.DelegatingMethodAccessorImpl.invoke(DelegatingMethodAccessorImpl.java:43)
	at java.lang.reflect.Method.invoke(Method.java:616)
	at com.carrotsearch.randomizedtesting.RandomizedRunner.invoke(RandomizedRunner.java:1559)
	at com.carrotsearch.randomizedtesting.RandomizedRunner.access$600(RandomizedRunner.java:79)
	at com.carrotsearch.randomizedtesting.RandomizedRunner$6.evaluate(RandomizedRunner.java:737)
	at com.carrotsearch.randomizedtesting.RandomizedRunner$7.evaluate(RandomizedRunner.java:773)
	at com.carrotsearch.randomizedtesting.RandomizedRunner$8.evaluate(RandomizedRunner.java:787)
	at com.carrotsearch.randomizedtesting.rules.SystemPropertiesRestoreRule$1.evaluate(SystemPropertiesRestoreRule.java:53)
	at org.apache.lucene.util.TestRuleSetupTeardownChained$1.evaluate(TestRuleSetupTeardownChained.java:50)
	at org.apache.lucene.util.TestRuleFieldCacheSanity$1.evaluate(TestRuleFieldCacheSanity.java:51)
	at org.apache.lucene.util.AbstractBeforeAfterRule$1.evaluate(AbstractBeforeAfterRule.java:46)
	at com.carrotsearch.randomizedtesting.rules.SystemPropertiesInvariantRule$1.evaluate(SystemPropertiesInvariantRule.java:55)
	at org.apache.lucene.util.TestRuleThreadAndTestName$1.evaluate(TestRuleThreadAndTestName.java:49)
	at org.apache.lucene.util.TestRuleIgnoreAfterMaxFailures$1.evaluate(TestRuleIgnoreAfterMaxFailures.java:70)
	at org.apache.lucene.util.TestRuleMarkFailure$1.evaluate(TestRuleMarkFailure.java:48)
	at com.carrotsearch.randomizedtesting.rules.StatementAdapter.evaluate(StatementAdapter.java:36)
	at com.carrotsearch.randomizedtesting.ThreadLeakControl$StatementRunner.run(ThreadLeakControl.java:358)
	at com.carrotsearch.randomizedtesting.ThreadLeakControl.forkTimeoutingTask(ThreadLeakControl.java:782)
	at com.carrotsearch.randomizedtesting.ThreadLeakControl$3.evaluate(ThreadLeakControl.java:442)
	at com.carrotsearch.randomizedtesting.RandomizedRunner.runSingleTest(RandomizedRunner.java:746)
	at com.carrotsearch.randomizedtesting.RandomizedRunner$3.evaluate(RandomizedRunner.java:648)
	at com.carrotsearch.randomizedtesting.RandomizedRunner$4.evaluate(RandomizedRunner.java:682)
	at com.carrotsearch.randomizedtesting.RandomizedRunner$5.evaluate(RandomizedRunner.java:693)
	at com.carrotsearch.randomizedtesting.rules.StatementAdapter.evaluate(StatementAdapter.java:36)
	at com.carrotsearch.randomizedtesting.rules.SystemPropertiesRestoreRule$1.evaluate(SystemPropertiesRestoreRule.java:53)
	at org.apache.lucene.util.AbstractBeforeAfterRule$1.evaluate(AbstractBeforeAfterRule.java:46)
	at org.apache.lucene.util.TestRuleStoreClassName$1.evaluate(TestRuleStoreClassName.java:42)
	at com.carrotsearch.randomizedtesting.rules.SystemPropertiesInvariantRule$1.evaluate(SystemPropertiesInvariantRule.java:55)
	at com.carrotsearch.randomizedtesting.rules.NoShadowingOrOverridesOnMethodsRule$1.evaluate(NoShadowingOrOverridesOnMethodsRule.java:39)
	at com.carrotsearch.randomizedtesting.rules.NoShadowingOrOverridesOnMethodsRule$1.evaluate(NoShadowingOrOverridesOnMethodsRule.java:39)
	at com.carrotsearch.randomizedtesting.rules.StatementAdapter.evaluate(StatementAdapter.java:36)
	at org.apache.lucene.util.TestRuleAssertionsRequired$1.evaluate(TestRuleAssertionsRequired.java:43)
	at org.apache.lucene.util.TestRuleMarkFailure$1.evaluate(TestRuleMarkFailure.java:48)
	at org.apache.lucene.util.TestRuleIgnoreAfterMaxFailures$1.evaluate(TestRuleIgnoreAfterMaxFailures.java:70)
	at org.apache.lucene.util.TestRuleIgnoreTestSuites$1.evaluate(TestRuleIgnoreTestSuites.java:55)
	at com.carrotsearch.randomizedtesting.rules.StatementAdapter.evaluate(StatementAdapter.java:36)
	at com.carrotsearch.randomizedtesting.ThreadLeakControl$StatementRunner.run(ThreadLeakControl.java:358)
	at java.lang.Thread.run(Thread.java:679)




Build Log:
[...truncated 8164 lines...]
[junit4:junit4] Suite: org.apache.solr.cloud.SyncSliceTest
[junit4:junit4]   2> 0 T132 oas.BaseDistributedSearchTestCase.initHostContext Setting hostContext system property: /dgg/af
[junit4:junit4]   2> 4 T132 oas.SolrTestCaseJ4.setUp ###Starting testDistribSearch
[junit4:junit4]   2> Creating dataDir: /usr/home/hudson/hudson-slave/workspace/Lucene-Solr-Tests-4.x-Java6/solr/build/solr-core/test/J0/./solrtest-SyncSliceTest-1359666257762
[junit4:junit4]   2> 5 T132 oasc.ZkTestServer.run STARTING ZK TEST SERVER
[junit4:junit4]   2> 5 T133 oasc.ZkTestServer$ZKServerMain.runFromConfig Starting server
[junit4:junit4]   2> 7 T133 oazs.ZooKeeperServer.setTickTime tickTime set to 1000
[junit4:junit4]   2> 7 T133 oazs.ZooKeeperServer.setMinSessionTimeout minSessionTimeout set to -1
[junit4:junit4]   2> 7 T133 oazs.ZooKeeperServer.setMaxSessionTimeout maxSessionTimeout set to -1
[junit4:junit4]   2> 8 T133 oazs.NIOServerCnxnFactory.configure binding to port 0.0.0.0/0.0.0.0:0
[junit4:junit4]   2> 9 T133 oazsp.FileTxnSnapLog.save Snapshotting: 0x0 to /usr/home/hudson/hudson-slave/workspace/Lucene-Solr-Tests-4.x-Java6/solr/build/solr-core/test/J0/./org.apache.solr.cloud.SyncSliceTest-1359666257762/zookeeper/server1/data/version-2/snapshot.0
[junit4:junit4]   2> 106 T132 oasc.ZkTestServer.run start zk server on port:58058
[junit4:junit4]   2> 106 T132 oaz.ZooKeeper.<init> Initiating client connection, connectString=127.0.0.1:58058 sessionTimeout=10000 watcher=org.apache.solr.common.cloud.ConnectionManager@4c451268
[junit4:junit4]   2> 107 T132 oascc.ConnectionManager.waitForConnected Waiting for client to connect to ZooKeeper
[junit4:junit4]   2> 108 T138 oaz.ClientCnxn$SendThread.logStartConnect Opening socket connection to server localhost/127.0.0.1:58058. Will not attempt to authenticate using SASL (access denied (javax.security.auth.AuthPermission getLoginConfiguration))
[junit4:junit4]   2> 108 T138 oaz.ClientCnxn$SendThread.primeConnection Socket connection established to localhost/127.0.0.1:58058, initiating session
[junit4:junit4]   2> 109 T134 oazs.NIOServerCnxnFactory.run Accepted socket connection from /140.211.11.196:63347
[junit4:junit4]   2> 109 T134 oazs.ZooKeeperServer.processConnectRequest Client attempting to establish new session at /140.211.11.196:63347
[junit4:junit4]   2> 109 T136 oazsp.FileTxnLog.append Creating new log file: log.1
[junit4:junit4]   2> 111 T136 oazs.ZooKeeperServer.finishSessionInit Established session 0x13c926c9f680000 with negotiated timeout 10000 for client /140.211.11.196:63347
[junit4:junit4]   2> 111 T138 oaz.ClientCnxn$SendThread.onConnected Session establishment complete on server localhost/127.0.0.1:58058, sessionid = 0x13c926c9f680000, negotiated timeout = 10000
[junit4:junit4]   2> 112 T139 oascc.ConnectionManager.process Watcher org.apache.solr.common.cloud.ConnectionManager@4c451268 name:ZooKeeperConnection Watcher:127.0.0.1:58058 got event WatchedEvent state:SyncConnected type:None path:null path:null type:None
[junit4:junit4]   2> 112 T132 oascc.ConnectionManager.waitForConnected Client is connected to ZooKeeper
[junit4:junit4]   2> 112 T132 oascc.SolrZkClient.makePath makePath: /solr
[junit4:junit4]   2> 115 T137 oazs.PrepRequestProcessor.pRequest2Txn Processed session termination for sessionid: 0x13c926c9f680000
[junit4:junit4]   2> 124 T139 oaz.ClientCnxn$EventThread.run EventThread shut down
[junit4:junit4]   2> 124 T132 oaz.ZooKeeper.close Session: 0x13c926c9f680000 closed
[junit4:junit4]   2> 124 T132 oaz.ZooKeeper.<init> Initiating client connection, connectString=127.0.0.1:58058/solr sessionTimeout=10000 watcher=org.apache.solr.common.cloud.ConnectionManager@24be0cc7
[junit4:junit4]   2> 125 T134 oazs.NIOServerCnxn.closeSock Closed socket connection for client /140.211.11.196:63347 which had sessionid 0x13c926c9f680000
[junit4:junit4]   2> 125 T132 oascc.ConnectionManager.waitForConnected Waiting for client to connect to ZooKeeper
[junit4:junit4]   2> 126 T140 oaz.ClientCnxn$SendThread.logStartConnect Opening socket connection to server localhost/127.0.0.1:58058. Will not attempt to authenticate using SASL (access denied (javax.security.auth.AuthPermission getLoginConfiguration))
[junit4:junit4]   2> 126 T140 oaz.ClientCnxn$SendThread.primeConnection Socket connection established to localhost/127.0.0.1:58058, initiating session
[junit4:junit4]   2> 126 T134 oazs.NIOServerCnxnFactory.run Accepted socket connection from /140.211.11.196:62999
[junit4:junit4]   2> 127 T134 oazs.ZooKeeperServer.processConnectRequest Client attempting to establish new session at /140.211.11.196:62999
[junit4:junit4]   2> 128 T136 oazs.ZooKeeperServer.finishSessionInit Established session 0x13c926c9f680001 with negotiated timeout 10000 for client /140.211.11.196:62999
[junit4:junit4]   2> 128 T140 oaz.ClientCnxn$SendThread.onConnected Session establishment complete on server localhost/127.0.0.1:58058, sessionid = 0x13c926c9f680001, negotiated timeout = 10000
[junit4:junit4]   2> 128 T141 oascc.ConnectionManager.process Watcher org.apache.solr.common.cloud.ConnectionManager@24be0cc7 name:ZooKeeperConnection Watcher:127.0.0.1:58058/solr got event WatchedEvent state:SyncConnected type:None path:null path:null type:None
[junit4:junit4]   2> 128 T132 oascc.ConnectionManager.waitForConnected Client is connected to ZooKeeper
[junit4:junit4]   2> 129 T132 oascc.SolrZkClient.makePath makePath: /collections/collection1
[junit4:junit4]   2> 139 T132 oascc.SolrZkClient.makePath makePath: /collections/collection1/shards
[junit4:junit4]   2> 142 T132 oascc.SolrZkClient.makePath makePath: /collections/control_collection
[junit4:junit4]   2> 145 T132 oascc.SolrZkClient.makePath makePath: /collections/control_collection/shards
[junit4:junit4]   2> 154 T132 oasc.AbstractZkTestCase.putConfig put /usr/home/hudson/hudson-slave/workspace/Lucene-Solr-Tests-4.x-Java6/solr/build/solr-core/test-files/solr/collection1/conf/solrconfig.xml to /configs/conf1/solrconfig.xml
[junit4:junit4]   2> 154 T132 oascc.SolrZkClient.makePath makePath: /configs/conf1/solrconfig.xml
[junit4:junit4]   2> 166 T132 oasc.AbstractZkTestCase.putConfig put /usr/home/hudson/hudson-slave/workspace/Lucene-Solr-Tests-4.x-Java6/solr/build/solr-core/test-files/solr/collection1/conf/schema.xml to /configs/conf1/schema.xml
[junit4:junit4]   2> 167 T132 oascc.SolrZkClient.makePath makePath: /configs/conf1/schema.xml
[junit4:junit4]   2> 271 T132 oasc.AbstractZkTestCase.putConfig put /usr/home/hudson/hudson-slave/workspace/Lucene-Solr-Tests-4.x-Java6/solr/build/solr-core/test-files/solr/collection1/conf/stopwords.txt to /configs/conf1/stopwords.txt
[junit4:junit4]   2> 272 T132 oascc.SolrZkClient.makePath makePath: /configs/conf1/stopwords.txt
[junit4:junit4]   2> 275 T132 oasc.AbstractZkTestCase.putConfig put /usr/home/hudson/hudson-slave/workspace/Lucene-Solr-Tests-4.x-Java6/solr/build/solr-core/test-files/solr/collection1/conf/protwords.txt to /configs/conf1/protwords.txt
[junit4:junit4]   2> 275 T132 oascc.SolrZkClient.makePath makePath: /configs/conf1/protwords.txt
[junit4:junit4]   2> 286 T132 oasc.AbstractZkTestCase.putConfig put /usr/home/hudson/hudson-slave/workspace/Lucene-Solr-Tests-4.x-Java6/solr/build/solr-core/test-files/solr/collection1/conf/currency.xml to /configs/conf1/currency.xml
[junit4:junit4]   2> 287 T132 oascc.SolrZkClient.makePath makePath: /configs/conf1/currency.xml
[junit4:junit4]   2> 290 T132 oasc.AbstractZkTestCase.putConfig put /usr/home/hudson/hudson-slave/workspace/Lucene-Solr-Tests-4.x-Java6/solr/build/solr-core/test-files/solr/collection1/conf/open-exchange-rates.json to /configs/conf1/open-exchange-rates.json
[junit4:junit4]   2> 291 T132 oascc.SolrZkClient.makePath makePath: /configs/conf1/open-exchange-rates.json
[junit4:junit4]   2> 294 T132 oasc.AbstractZkTestCase.putConfig put /usr/home/hudson/hudson-slave/workspace/Lucene-Solr-Tests-4.x-Java6/solr/build/solr-core/test-files/solr/collection1/conf/mapping-ISOLatin1Accent.txt to /configs/conf1/mapping-ISOLatin1Accent.txt
[junit4:junit4]   2> 294 T132 oascc.SolrZkClient.makePath makePath: /configs/conf1/mapping-ISOLatin1Accent.txt
[junit4:junit4]   2> 297 T132 oasc.AbstractZkTestCase.putConfig put /usr/home/hudson/hudson-slave/workspace/Lucene-Solr-Tests-4.x-Java6/solr/build/solr-core/test-files/solr/collection1/conf/old_synonyms.txt to /configs/conf1/old_synonyms.txt
[junit4:junit4]   2> 298 T132 oascc.SolrZkClient.makePath makePath: /configs/conf1/old_synonyms.txt
[junit4:junit4]   2> 305 T132 oasc.AbstractZkTestCase.putConfig put /usr/home/hudson/hudson-slave/workspace/Lucene-Solr-Tests-4.x-Java6/solr/build/solr-core/test-files/solr/collection1/conf/synonyms.txt to /configs/conf1/synonyms.txt
[junit4:junit4]   2> 306 T132 oascc.SolrZkClient.makePath makePath: /configs/conf1/synonyms.txt
[junit4:junit4]   2> 309 T137 oazs.PrepRequestProcessor.pRequest2Txn Processed session termination for sessionid: 0x13c926c9f680001
[junit4:junit4]   2> 310 T141 oaz.ClientCnxn$EventThread.run EventThread shut down
[junit4:junit4]   2> 310 T132 oaz.ZooKeeper.close Session: 0x13c926c9f680001 closed
[junit4:junit4]   2> 310 T134 oazs.NIOServerCnxn.closeSock Closed socket connection for client /140.211.11.196:62999 which had sessionid 0x13c926c9f680001
[junit4:junit4]   2> 419 T132 oejs.Server.doStart jetty-8.1.8.v20121106
[junit4:junit4]   2> 422 T132 oejs.AbstractConnector.doStart Started SocketConnector@127.0.0.1:46162
[junit4:junit4]   2> 422 T132 oass.SolrDispatchFilter.init SolrDispatchFilter.init()
[junit4:junit4]   2> 423 T132 oasc.SolrResourceLoader.locateSolrHome JNDI not configured for solr (NoInitialContextEx)
[junit4:junit4]   2> 423 T132 oasc.SolrResourceLoader.locateSolrHome using system property solr.solr.home: /usr/home/hudson/hudson-slave/workspace/Lucene-Solr-Tests-4.x-Java6/solr/build/solr-core/test/J0/./org.apache.solr.cloud.SyncSliceTest-controljetty-1359666258068
[junit4:junit4]   2> 423 T132 oasc.CoreContainer$Initializer.initialize looking for solr.xml: /usr/home/hudson/hudson-slave/workspace/Lucene-Solr-Tests-4.x-Java6/solr/build/solr-core/test/J0/./org.apache.solr.cloud.SyncSliceTest-controljetty-1359666258068/solr.xml
[junit4:junit4]   2> 423 T132 oasc.CoreContainer.<init> New CoreContainer 167616864
[junit4:junit4]   2> 424 T132 oasc.CoreContainer.load Loading CoreContainer using Solr Home: '/usr/home/hudson/hudson-slave/workspace/Lucene-Solr-Tests-4.x-Java6/solr/build/solr-core/test/J0/./org.apache.solr.cloud.SyncSliceTest-controljetty-1359666258068/'
[junit4:junit4]   2> 424 T132 oasc.SolrResourceLoader.<init> new SolrResourceLoader for directory: '/usr/home/hudson/hudson-slave/workspace/Lucene-Solr-Tests-4.x-Java6/solr/build/solr-core/test/J0/./org.apache.solr.cloud.SyncSliceTest-controljetty-1359666258068/'
[junit4:junit4]   2> 452 T132 oashc.HttpShardHandlerFactory.getParameter Setting socketTimeout to: 60000
[junit4:junit4]   2> 453 T132 oashc.HttpShardHandlerFactory.getParameter Setting urlScheme to: http://
[junit4:junit4]   2> 453 T132 oashc.HttpShardHandlerFactory.getParameter Setting connTimeout to: 15000
[junit4:junit4]   2> 453 T132 oashc.HttpShardHandlerFactory.getParameter Setting maxConnectionsPerHost to: 20
[junit4:junit4]   2> 453 T132 oashc.HttpShardHandlerFactory.getParameter Setting corePoolSize to: 0
[junit4:junit4]   2> 454 T132 oashc.HttpShardHandlerFactory.getParameter Setting maximumPoolSize to: 2147483647
[junit4:junit4]   2> 454 T132 oashc.HttpShardHandlerFactory.getParameter Setting maxThreadIdleTime to: 5
[junit4:junit4]   2> 454 T132 oashc.HttpShardHandlerFactory.getParameter Setting sizeOfQueue to: -1
[junit4:junit4]   2> 454 T132 oashc.HttpShardHandlerFactory.getParameter Setting fairnessPolicy to: false
[junit4:junit4]   2> 455 T132 oascsi.HttpClientUtil.createClient Creating new http client, config:maxConnectionsPerHost=20&maxConnections=10000&socketTimeout=60000&connTimeout=15000&retry=false
[junit4:junit4]   2> 470 T132 oasc.CoreContainer.load Registering Log Listener
[junit4:junit4]   2> 482 T132 oasc.CoreContainer.initZooKeeper Zookeeper client=127.0.0.1:58058/solr
[junit4:junit4]   2> 482 T132 oasc.ZkController.checkChrootPath zkHost includes chroot
[junit4:junit4]   2> 483 T132 oaz.ZooKeeper.<init> Initiating client connection, connectString=127.0.0.1:58058 sessionTimeout=60000 watcher=org.apache.solr.common.cloud.ConnectionManager@487dac47
[junit4:junit4]   2> 484 T132 oascc.ConnectionManager.waitForConnected Waiting for client to connect to ZooKeeper
[junit4:junit4]   2> 484 T151 oaz.ClientCnxn$SendThread.logStartConnect Opening socket connection to server localhost/127.0.0.1:58058. Will not attempt to authenticate using SASL (access denied (javax.security.auth.AuthPermission getLoginConfiguration))
[junit4:junit4]   2> 485 T151 oaz.ClientCnxn$SendThread.primeConnection Socket connection established to localhost/127.0.0.1:58058, initiating session
[junit4:junit4]   2> 485 T134 oazs.NIOServerCnxnFactory.run Accepted socket connection from /140.211.11.196:50003
[junit4:junit4]   2> 485 T134 oazs.ZooKeeperServer.processConnectRequest Client attempting to establish new session at /140.211.11.196:50003
[junit4:junit4]   2> 489 T136 oazs.ZooKeeperServer.finishSessionInit Established session 0x13c926c9f680002 with negotiated timeout 20000 for client /140.211.11.196:50003
[junit4:junit4]   2> 489 T151 oaz.ClientCnxn$SendThread.onConnected Session establishment complete on server localhost/127.0.0.1:58058, sessionid = 0x13c926c9f680002, negotiated timeout = 20000
[junit4:junit4]   2> 490 T152 oascc.ConnectionManager.process Watcher org.apache.solr.common.cloud.ConnectionManager@487dac47 name:ZooKeeperConnection Watcher:127.0.0.1:58058 got event WatchedEvent state:SyncConnected type:None path:null path:null type:None
[junit4:junit4]   2> 490 T132 oascc.ConnectionManager.waitForConnected Client is connected to ZooKeeper
[junit4:junit4]   2> 491 T137 oazs.PrepRequestProcessor.pRequest2Txn Processed session termination for sessionid: 0x13c926c9f680002
[junit4:junit4]   2> 492 T152 oaz.ClientCnxn$EventThread.run EventThread shut down
[junit4:junit4]   2> 492 T134 oazs.NIOServerCnxn.closeSock Closed socket connection for client /140.211.11.196:50003 which had sessionid 0x13c926c9f680002
[junit4:junit4]   2> 492 T132 oaz.ZooKeeper.close Session: 0x13c926c9f680002 closed
[junit4:junit4]   2> 493 T132 oascsi.HttpClientUtil.createClient Creating new http client, config:maxConnections=500&maxConnectionsPerHost=16&socketTimeout=60000&connTimeout=15000
[junit4:junit4]   2> 502 T132 oaz.ZooKeeper.<init> Initiating client connection, connectString=127.0.0.1:58058/solr sessionTimeout=30000 watcher=org.apache.solr.common.cloud.ConnectionManager@4f8953fb
[junit4:junit4]   2> 503 T132 oascc.ConnectionManager.waitForConnected Waiting for client to connect to ZooKeeper
[junit4:junit4]   2> 503 T153 oaz.ClientCnxn$SendThread.logStartConnect Opening socket connection to server localhost/127.0.0.1:58058. Will not attempt to authenticate using SASL (access denied (javax.security.auth.AuthPermission getLoginConfiguration))
[junit4:junit4]   2> 503 T153 oaz.ClientCnxn$SendThread.primeConnection Socket connection established to localhost/127.0.0.1:58058, initiating session
[junit4:junit4]   2> 503 T134 oazs.NIOServerCnxnFactory.run Accepted socket connection from /140.211.11.196:51121
[junit4:junit4]   2> 504 T134 oazs.ZooKeeperServer.processConnectRequest Client attempting to establish new session at /140.211.11.196:51121
[junit4:junit4]   2> 505 T136 oazs.ZooKeeperServer.finishSessionInit Established session 0x13c926c9f680003 with negotiated timeout 20000 for client /140.211.11.196:51121
[junit4:junit4]   2> 505 T153 oaz.ClientCnxn$SendThread.onConnected Session establishment complete on server localhost/127.0.0.1:58058, sessionid = 0x13c926c9f680003, negotiated timeout = 20000
[junit4:junit4]   2> 505 T154 oascc.ConnectionManager.process Watcher org.apache.solr.common.cloud.ConnectionManager@4f8953fb name:ZooKeeperConnection Watcher:127.0.0.1:58058/solr got event WatchedEvent state:SyncConnected type:None path:null path:null type:None
[junit4:junit4]   2> 505 T132 oascc.ConnectionManager.waitForConnected Client is connected to ZooKeeper
[junit4:junit4]   2> 510 T137 oazs.PrepRequestProcessor.pRequest Got user-level KeeperException when processing sessionid:0x13c926c9f680003 type:create cxid:0x2 zxid:0x1a txntype:-1 reqpath:n/a Error Path:/solr/overseer Error:KeeperErrorCode = NodeExists for /solr/overseer
[junit4:junit4]   2> 511 T132 oascc.SolrZkClient.makePath makePath: /live_nodes
[junit4:junit4]   2> 522 T132 oasc.ZkController.createEphemeralLiveNode Register node as live in ZooKeeper:/live_nodes/127.0.0.1:46162_dgg%2Faf
[junit4:junit4]   2> 527 T137 oazs.PrepRequestProcessor.pRequest Got user-level KeeperException when processing sessionid:0x13c926c9f680003 type:delete cxid:0x7 zxid:0x1c txntype:-1 reqpath:n/a Error Path:/solr/live_nodes/127.0.0.1:46162_dgg%2Faf Error:KeeperErrorCode = NoNode for /solr/live_nodes/127.0.0.1:46162_dgg%2Faf
[junit4:junit4]   2> 531 T132 oascc.SolrZkClient.makePath makePath: /live_nodes/127.0.0.1:46162_dgg%2Faf
[junit4:junit4]   2> 564 T132 oascc.SolrZkClient.makePath makePath: /overseer_elect/election
[junit4:junit4]   2> 640 T137 oazs.PrepRequestProcessor.pRequest Got user-level KeeperException when processing sessionid:0x13c926c9f680003 type:delete cxid:0x15 zxid:0x21 txntype:-1 reqpath:n/a Error Path:/solr/overseer_elect/leader Error:KeeperErrorCode = NoNode for /solr/overseer_elect/leader
[junit4:junit4]   2> 695 T132 oascc.SolrZkClient.makePath makePath: /overseer_elect/leader
[junit4:junit4]   2> 698 T132 oasc.Overseer.start Overseer (id=89107087869083651-127.0.0.1:46162_dgg%2Faf-n_0000000000) starting
[junit4:junit4]   2> 699 T137 oazs.PrepRequestProcessor.pRequest Got user-level KeeperException when processing sessionid:0x13c926c9f680003 type:create cxid:0x1a zxid:0x23 txntype:-1 reqpath:n/a Error Path:/solr/overseer Error:KeeperErrorCode = NodeExists for /solr/overseer
[junit4:junit4]   2> 706 T137 oazs.PrepRequestProcessor.pRequest Got user-level KeeperException when processing sessionid:0x13c926c9f680003 type:create cxid:0x1b zxid:0x24 txntype:-1 reqpath:n/a Error Path:/solr/overseer Error:KeeperErrorCode = NodeExists for /solr/overseer
[junit4:junit4]   2> 735 T137 oazs.PrepRequestProcessor.pRequest Got user-level KeeperException when processing sessionid:0x13c926c9f680003 type:create cxid:0x1c zxid:0x25 txntype:-1 reqpath:n/a Error Path:/solr/overseer Error:KeeperErrorCode = NodeExists for /solr/overseer
[junit4:junit4]   2> 757 T137 oazs.PrepRequestProcessor.pRequest Got user-level KeeperException when processing sessionid:0x13c926c9f680003 type:create cxid:0x1d zxid:0x26 txntype:-1 reqpath:n/a Error Path:/solr/overseer Error:KeeperErrorCode = NodeExists for /solr/overseer
[junit4:junit4]   2> 782 T156 oasc.OverseerCollectionProcessor.run Process current queue of collection creations
[junit4:junit4]   2> 783 T132 oascc.SolrZkClient.makePath makePath: /clusterstate.json
[junit4:junit4]   2> 810 T132 oascc.ZkStateReader.createClusterStateWatchersAndUpdate Updating cluster state from ZooKeeper... 
[junit4:junit4]   2> 816 T155 oasc.Overseer$ClusterStateUpdater.run Starting to work on the main queue
[junit4:junit4]   2> 822 T157 oasc.CoreContainer.create Creating SolrCore 'collection1' using instanceDir: /usr/home/hudson/hudson-slave/workspace/Lucene-Solr-Tests-4.x-Java6/solr/build/solr-core/test/J0/./org.apache.solr.cloud.SyncSliceTest-controljetty-1359666258068/collection1
[junit4:junit4]   2> 822 T157 oasc.ZkController.createCollectionZkNode Check for collection zkNode:control_collection
[junit4:junit4]   2> 823 T157 oasc.ZkController.createCollectionZkNode Collection zkNode exists
[junit4:junit4]   2> 823 T157 oasc.ZkController.readConfigName Load collection config from:/collections/control_collection
[junit4:junit4]   2> 825 T157 oasc.SolrResourceLoader.<init> new SolrResourceLoader for directory: '/usr/home/hudson/hudson-slave/workspace/Lucene-Solr-Tests-4.x-Java6/solr/build/solr-core/test/J0/./org.apache.solr.cloud.SyncSliceTest-controljetty-1359666258068/collection1/'
[junit4:junit4]   2> 826 T157 oasc.SolrResourceLoader.replaceClassLoader Adding 'file:/usr/home/hudson/hudson-slave/workspace/Lucene-Solr-Tests-4.x-Java6/solr/build/solr-core/test/J0/org.apache.solr.cloud.SyncSliceTest-controljetty-1359666258068/collection1/lib/README' to classloader
[junit4:junit4]   2> 827 T157 oasc.SolrResourceLoader.replaceClassLoader Adding 'file:/usr/home/hudson/hudson-slave/workspace/Lucene-Solr-Tests-4.x-Java6/solr/build/solr-core/test/J0/org.apache.solr.cloud.SyncSliceTest-controljetty-1359666258068/collection1/lib/classes/' to classloader
[junit4:junit4]   2> 867 T157 oasc.SolrConfig.<init> Using Lucene MatchVersion: LUCENE_42
[junit4:junit4]   2> 919 T157 oasc.SolrConfig.<init> Loaded SolrConfig: solrconfig.xml
[junit4:junit4]   2> 1025 T157 oass.IndexSchema.readSchema Reading Solr Schema
[junit4:junit4]   2> 1032 T157 oass.IndexSchema.readSchema Schema name=test
[junit4:junit4]   2> 1477 T157 oass.OpenExchangeRatesOrgProvider.init Initialized with rates=open-exchange-rates.json, refreshInterval=1440.
[junit4:junit4]   2> 1486 T157 oass.IndexSchema.readSchema default search field in schema is text
[junit4:junit4]   2> 1489 T157 oass.IndexSchema.readSchema unique key field: id
[junit4:junit4]   2> 1509 T157 oass.FileExchangeRateProvider.reload Reloading exchange rates from file currency.xml
[junit4:junit4]   2> 1513 T157 oass.FileExchangeRateProvider.reload Reloading exchange rates from file currency.xml
[junit4:junit4]   2> 1517 T157 oass.OpenExchangeRatesOrgProvider.reload Reloading exchange rates from open-exchange-rates.json
[junit4:junit4]   2> 1519 T157 oass.OpenExchangeRatesOrgProvider.reload Reloading exchange rates from open-exchange-rates.json
[junit4:junit4]   2> 1521 T157 oasc.SolrCore.<init> [collection1] Opening new SolrCore at /usr/home/hudson/hudson-slave/workspace/Lucene-Solr-Tests-4.x-Java6/solr/build/solr-core/test/J0/./org.apache.solr.cloud.SyncSliceTest-controljetty-1359666258068/collection1/, dataDir=./org.apache.solr.cloud.SyncSliceTest-1359666257762/control/data/
[junit4:junit4]   2> 1521 T157 oasc.JmxMonitoredMap.<init> JMX monitoring is enabled. Adding Solr mbeans to JMX Server: com.sun.jmx.mbeanserver.JmxMBeanServer@39320a41
[junit4:junit4]   2> 1522 T157 oasc.SolrCore.initDirectoryFactory solr.StandardDirectoryFactory
[junit4:junit4]   2> 1553 T157 oasc.CachingDirectoryFactory.get return new directory for /usr/home/hudson/hudson-slave/workspace/Lucene-Solr-Tests-4.x-Java6/solr/build/solr-core/test/J0/./org.apache.solr.cloud.SyncSliceTest-1359666257762/control/data forceNew:false
[junit4:junit4]   2> 1554 T157 oasc.CachingDirectoryFactory.close Releasing directory:/usr/home/hudson/hudson-slave/workspace/Lucene-Solr-Tests-4.x-Java6/solr/build/solr-core/test/J0/./org.apache.solr.cloud.SyncSliceTest-1359666257762/control/data
[junit4:junit4]   2> 1554 T157 oasc.SolrCore.getNewIndexDir New index directory detected: old=null new=./org.apache.solr.cloud.SyncSliceTest-1359666257762/control/data/index/
[junit4:junit4]   2> 1555 T157 oasc.SolrCore.initIndex WARNING [collection1] Solr index directory './org.apache.solr.cloud.SyncSliceTest-1359666257762/control/data/index' doesn't exist. Creating new index...
[junit4:junit4]   2> 1556 T157 oasc.CachingDirectoryFactory.get return new directory for /usr/home/hudson/hudson-slave/workspace/Lucene-Solr-Tests-4.x-Java6/solr/build/solr-core/test/J0/./org.apache.solr.cloud.SyncSliceTest-1359666257762/control/data/index forceNew:false
[junit4:junit4]   2> 1592 T157 oasc.SolrDeletionPolicy.onCommit SolrDeletionPolicy.onCommit: commits:num=1
[junit4:junit4]   2> 		commit{dir=RateLimitedDirectoryWrapper(org.apache.lucene.store.NIOFSDirectory@/usr/home/hudson/hudson-slave/workspace/Lucene-Solr-Tests-4.x-Java6/solr/build/solr-core/test/J0/org.apache.solr.cloud.SyncSliceTest-1359666257762/control/data/index lockFactory=org.apache.lucene.store.NativeFSLockFactory@713055ba),segFN=segments_1,generation=1,filenames=[segments_1]
[junit4:junit4]   2> 1593 T157 oasc.SolrDeletionPolicy.updateCommits newest commit = 1[segments_1]
[junit4:junit4]   2> 1593 T157 oasc.CachingDirectoryFactory.close Releasing directory:/usr/home/hudson/hudson-slave/workspace/Lucene-Solr-Tests-4.x-Java6/solr/build/solr-core/test/J0/./org.apache.solr.cloud.SyncSliceTest-1359666257762/control/data/index
[junit4:junit4]   2> 1594 T157 oasc.SolrCore.initWriters created xml: solr.XMLResponseWriter
[junit4:junit4]   2> 1595 T157 oasup.UpdateRequestProcessorChain.init inserting DistributedUpdateProcessorFactory into updateRequestProcessorChain "dedupe"
[junit4:junit4]   2> 1596 T157 oasup.UpdateRequestProcessorChain.init inserting DistributedUpdateProcessorFactory into updateRequestProcessorChain "dedupe-allfields"
[junit4:junit4]   2> 1596 T157 oasup.UpdateRequestProcessorChain.init inserting DistributedUpdateProcessorFactory into updateRequestProcessorChain "stored_sig"
[junit4:junit4]   2> 1597 T157 oasup.UpdateRequestProcessorChain.init inserting DistributedUpdateProcessorFactory into updateRequestProcessorChain "uniq-fields"
[junit4:junit4]   2> 1597 T157 oasup.UpdateRequestProcessorChain.init inserting DistributedUpdateProcessorFactory into updateRequestProcessorChain "distrib-dup-test-chain-implicit"
[junit4:junit4]   2> 1597 T157 oasc.RequestHandlers.initHandlersFromConfig adding lazy requestHandler: solr.ReplicationHandler
[junit4:junit4]   2> 1598 T157 oasc.RequestHandlers.initHandlersFromConfig created /replication: solr.ReplicationHandler
[junit4:junit4]   2> 1598 T157 oasc.RequestHandlers.initHandlersFromConfig created standard: solr.StandardRequestHandler
[junit4:junit4]   2> 1599 T157 oasc.RequestHandlers.initHandlersFromConfig created /get: solr.RealTimeGetHandler
[junit4:junit4]   2> 1599 T157 oasc.RequestHandlers.initHandlersFromConfig created dismax: solr.SearchHandler
[junit4:junit4]   2> 1599 T157 oasc.RequestHandlers.initHandlersFromConfig created mock: org.apache.solr.core.MockQuerySenderListenerReqHandler
[junit4:junit4]   2> 1600 T157 oasc.RequestHandlers.initHandlersFromConfig created /admin/: org.apache.solr.handler.admin.AdminHandlers
[junit4:junit4]   2> 1600 T157 oasc.RequestHandlers.initHandlersFromConfig created defaults: solr.StandardRequestHandler
[junit4:junit4]   2> 1600 T157 oasc.RequestHandlers.initHandlersFromConfig adding lazy requestHandler: solr.StandardRequestHandler
[junit4:junit4]   2> 1601 T157 oasc.RequestHandlers.initHandlersFromConfig created lazy: solr.StandardRequestHandler
[junit4:junit4]   2> 1601 T157 oasc.RequestHandlers.initHandlersFromConfig created /update: solr.UpdateRequestHandler
[junit4:junit4]   2> 1601 T157 oasc.RequestHandlers.initHandlersFromConfig created /terms: org.apache.solr.handler.component.SearchHandler
[junit4:junit4]   2> 1602 T157 oasc.RequestHandlers.initHandlersFromConfig created spellCheckCompRH: org.apache.solr.handler.component.SearchHandler
[junit4:junit4]   2> 1602 T157 oasc.RequestHandlers.initHandlersFromConfig created spellCheckCompRH_Direct: org.apache.solr.handler.component.SearchHandler
[junit4:junit4]   2> 1602 T157 oasc.RequestHandlers.initHandlersFromConfig created spellCheckWithWordbreak: org.apache.solr.handler.component.SearchHandler
[junit4:junit4]   2> 1603 T157 oasc.RequestHandlers.initHandlersFromConfig created spellCheckWithWordbreak_Direct: org.apache.solr.handler.component.SearchHandler
[junit4:junit4]   2> 1603 T157 oasc.RequestHandlers.initHandlersFromConfig created spellCheckCompRH1: org.apache.solr.handler.component.SearchHandler
[junit4:junit4]   2> 1604 T157 oasc.RequestHandlers.initHandlersFromConfig created mltrh: org.apache.solr.handler.component.SearchHandler
[junit4:junit4]   2> 1604 T157 oasc.RequestHandlers.initHandlersFromConfig created tvrh: org.apache.solr.handler.component.SearchHandler
[junit4:junit4]   2> 1604 T157 oasc.RequestHandlers.initHandlersFromConfig created /mlt: solr.MoreLikeThisHandler
[junit4:junit4]   2> 1605 T157 oasc.RequestHandlers.initHandlersFromConfig created /debug/dump: solr.DumpRequestHandler
[junit4:junit4]   2> 1610 T157 oashl.XMLLoader.init xsltCacheLifetimeSeconds=60
[junit4:junit4]   2> 1614 T157 oasc.SolrCore.initDeprecatedSupport WARNING solrconfig.xml uses deprecated <admin/gettableFiles>, Please update your config to use the ShowFileRequestHandler.
[junit4:junit4]   2> 1615 T157 oasc.SolrCore.initDeprecatedSupport WARNING adding ShowFileRequestHandler with hidden files: [SCHEMA.XML, OLD_SYNONYMS.TXT, STOPWORDS.TXT, PROTWORDS.TXT, OPEN-EXCHANGE-RATES.JSON, SYNONYMS.TXT, CURRENCY.XML, MAPPING-ISOLATIN1ACCENT.TXT]
[junit4:junit4]   2> 1617 T157 oasc.CachingDirectoryFactory.close Releasing directory:/usr/home/hudson/hudson-slave/workspace/Lucene-Solr-Tests-4.x-Java6/solr/build/solr-core/test/J0/./org.apache.solr.cloud.SyncSliceTest-1359666257762/control/data
[junit4:junit4]   2> 1618 T157 oass.SolrIndexSearcher.<init> Opening Searcher@636323cc main
[junit4:junit4]   2> 1619 T157 oasu.CommitTracker.<init> Hard AutoCommit: disabled
[junit4:junit4]   2> 1619 T157 oasu.CommitTracker.<init> Soft AutoCommit: disabled
[junit4:junit4]   2> 1620 T157 oashc.SpellCheckComponent.inform Initializing spell checkers
[junit4:junit4]   2> 1626 T157 oass.DirectSolrSpellChecker.init init: {name=direct,classname=DirectSolrSpellChecker,field=lowerfilt,minQueryLength=3}
[junit4:junit4]   2> 1678 T158 oasc.SolrCore.registerSearcher [collection1] Registered new searcher Searcher@636323cc main{StandardDirectoryReader(segments_1:1)}
[junit4:junit4]   2> 1682 T157 oasc.ZkController.publish publishing core=collection1 state=down
[junit4:junit4]   2> 1682 T157 oasc.ZkController.publish numShards not found on descriptor - reading it from system property
[junit4:junit4]   2> 1683 T137 oazs.PrepRequestProcessor.pRequest Got user-level KeeperException when processing sessionid:0x13c926c9f680003 type:create cxid:0x50 zxid:0x29 txntype:-1 reqpath:n/a Error Path:/solr/overseer/queue Error:KeeperErrorCode = NoNode for /solr/overseer/queue
[junit4:junit4]   2> 2324 T155 oascc.ZkStateReader.updateClusterState Updating cloud state from ZooKeeper... 
[junit4:junit4]   2> 2325 T155 oasc.Overseer$ClusterStateUpdater.updateState Update state numShards=1 message={
[junit4:junit4]   2> 	  "operation":"state",
[junit4:junit4]   2> 	  "numShards":"1",
[junit4:junit4]   2> 	  "shard":null,
[junit4:junit4]   2> 	  "roles":null,
[junit4:junit4]   2> 	  "state":"down",
[junit4:junit4]   2> 	  "core":"collection1",
[junit4:junit4]   2> 	  "collection":"control_collection",
[junit4:junit4]   2> 	  "node_name":"127.0.0.1:46162_dgg%2Faf",
[junit4:junit4]   2> 	  "base_url":"http://127.0.0.1:46162/dgg/af"}
[junit4:junit4]   2> 2325 T155 oasc.Overseer$ClusterStateUpdater.createCollection Create collection control_collection with numShards 1
[junit4:junit4]   2> 2349 T155 oasc.Overseer$ClusterStateUpdater.updateState Assigning new node to shard shard=shard1
[junit4:junit4]   2> 2350 T137 oazs.PrepRequestProcessor.pRequest Got user-level KeeperException when processing sessionid:0x13c926c9f680003 type:create cxid:0x58 zxid:0x2c txntype:-1 reqpath:n/a Error Path:/solr/overseer/queue-work Error:KeeperErrorCode = NoNode for /solr/overseer/queue-work
[junit4:junit4]   2> 2376 T154 oascc.ZkStateReader$2.process A cluster state change: WatchedEvent state:SyncConnected type:NodeDataChanged path:/clusterstate.json, has occurred - updating... (live nodes size: 1)
[junit4:junit4]   2> 2688 T157 oasc.CoreContainer.registerCore registering core: collection1
[junit4:junit4]   2> 2688 T157 oasc.ZkController.register Register replica - core:collection1 address:http://127.0.0.1:46162/dgg/af collection:control_collection shard:shard1
[junit4:junit4]   2> 2697 T157 oascsi.HttpClientUtil.createClient Creating new http client, config:maxConnections=10000&maxConnectionsPerHost=20&connTimeout=30000&socketTimeout=30000&retry=false
[junit4:junit4]   2> 2712 T157 oascc.SolrZkClient.makePath makePath: /collections/control_collection/leader_elect/shard1/election
[junit4:junit4]   2> 2732 T137 oazs.PrepRequestProcessor.pRequest Got user-level KeeperException when processing sessionid:0x13c926c9f680003 type:delete cxid:0x72 zxid:0x36 txntype:-1 reqpath:n/a Error Path:/solr/collections/control_collection/leaders Error:KeeperErrorCode = NoNode for /solr/collections/control_collection/leaders
[junit4:junit4]   2> 2733 T157 oasc.ShardLeaderElectionContext.runLeaderProcess Running the leader process.
[junit4:junit4]   2> 2734 T137 oazs.PrepRequestProcessor.pRequest Got user-level KeeperException when processing sessionid:0x13c926c9f680003 type:create cxid:0x73 zxid:0x37 txntype:-1 reqpath:n/a Error Path:/solr/overseer Error:KeeperErrorCode = NodeExists for /solr/overseer
[junit4:junit4]   2> 2742 T157 oasc.ShardLeaderElectionContext.waitForReplicasToComeUp Enough replicas found to continue.
[junit4:junit4]   2> 2743 T157 oasc.ShardLeaderElectionContext.runLeaderProcess I may be the new leader - try and sync
[junit4:junit4]   2> 2748 T157 oasc.SyncStrategy.sync Sync replicas to http://127.0.0.1:46162/dgg/af/collection1/
[junit4:junit4]   2> 2748 T157 oasc.SyncStrategy.syncReplicas Sync Success - now sync replicas to me
[junit4:junit4]   2> 2748 T157 oasc.SyncStrategy.syncToMe http://127.0.0.1:46162/dgg/af/collection1/ has no replicas
[junit4:junit4]   2> 2748 T157 oasc.ShardLeaderElectionContext.runLeaderProcess I am the new leader: http://127.0.0.1:46162/dgg/af/collection1/
[junit4:junit4]   2> 2749 T157 oascc.SolrZkClient.makePath makePath: /collections/control_collection/leaders/shard1
[junit4:junit4]   2> 2755 T137 oazs.PrepRequestProcessor.pRequest Got user-level KeeperException when processing sessionid:0x13c926c9f680003 type:create cxid:0x7d zxid:0x3b txntype:-1 reqpath:n/a Error Path:/solr/overseer Error:KeeperErrorCode = NodeExists for /solr/overseer
[junit4:junit4]   2> 3881 T155 oascc.ZkStateReader.updateClusterState Updating cloud state from ZooKeeper... 
[junit4:junit4]   2> 3928 T154 oascc.ZkStateReader$2.process A cluster state change: WatchedEvent state:SyncConnected type:NodeDataChanged path:/clusterstate.json, has occurred - updating... (live nodes size: 1)
[junit4:junit4]   2> 3989 T157 oasc.ZkController.register We are http://127.0.0.1:46162/dgg/af/collection1/ and leader is http://127.0.0.1:46162/dgg/af/collection1/
[junit4:junit4]   2> 3989 T157 oasc.ZkController.register No LogReplay needed for core=collection1 baseURL=http://127.0.0.1:46162/dgg/af
[junit4:junit4]   2> 3989 T157 oasc.ZkController.checkRecovery I am the leader, no recovery necessary
[junit4:junit4]   2> 3990 T157 oasc.ZkController.publish publishing core=collection1 state=active
[junit4:junit4]   2> 3990 T157 oasc.ZkController.publish numShards not found on descriptor - reading it from system property
[junit4:junit4]   2> 3993 T157 oascc.ZkStateReader.updateClusterState Updating cloud state from ZooKeeper... 
[junit4:junit4]   2> 3994 T132 oass.SolrDispatchFilter.init user.dir=/usr/home/hudson/hudson-slave/workspace/Lucene-Solr-Tests-4.x-Java6/solr/build/solr-core/test/J0
[junit4:junit4]   2> 3995 T132 oass.SolrDispatchFilter.init SolrDispatchFilter.init() done
[junit4:junit4]   2> 3996 T132 oascsi.HttpClientUtil.createClient Creating new http client, config:maxConnections=128&maxConnectionsPerHost=32&followRedirects=false
[junit4:junit4]   2> 4007 T132 oascsi.HttpClientUtil.createClient Creating new http client, config:
[junit4:junit4]   2> 4030 T132 oaz.ZooKeeper.<init> Initiating client connection, connectString=127.0.0.1:58058/solr sessionTimeout=10000 watcher=org.apache.solr.common.cloud.ConnectionManager@39d3da65
[junit4:junit4]   2> 4031 T132 oascc.ConnectionManager.waitForConnected Waiting for client to connect to ZooKeeper
[junit4:junit4]   2> 4032 T159 oaz.ClientCnxn$SendThread.logStartConnect Opening socket connection to server localhost/127.0.0.1:58058. Will not attempt to authenticate using SASL (access denied (javax.security.auth.AuthPermission getLoginConfiguration))
[junit4:junit4]   2> 4032 T159 oaz.ClientCnxn$SendThread.primeConnection Socket connection established to localhost/127.0.0.1:58058, initiating session
[junit4:junit4]   2> 4032 T134 oazs.NIOServerCnxnFactory.run Accepted socket connection from /140.211.11.196:47669
[junit4:junit4]   2> 4033 T134 oazs.ZooKeeperServer.processConnectRequest Client attempting to establish new session at /140.211.11.196:47669
[junit4:junit4]   2> 4034 T136 oazs.ZooKeeperServer.finishSessionInit Established session 0x13c926c9f680004 with negotiated timeout 10000 for client /140.211.11.196:47669
[junit4:junit4]   2> 4034 T159 oaz.ClientCnxn$SendThread.onConnected Session establishment complete on server localhost/127.0.0.1:58058, sessionid = 0x13c926c9f680004, negotiated timeout = 10000
[junit4:junit4]   2> 4035 T160 oascc.ConnectionManager.process Watcher org.apache.solr.common.cloud.ConnectionManager@39d3da65 name:ZooKeeperConnection Watcher:127.0.0.1:58058/solr got event WatchedEvent state:SyncConnected type:None path:null path:null type:None
[junit4:junit4]   2> 4035 T132 oascc.ConnectionManager.waitForConnected Client is connected to ZooKeeper
[junit4:junit4]   2> 4036 T132 oascc.ZkStateReader.createClusterStateWatchersAndUpdate Updating cluster state from ZooKeeper... 
[junit4:junit4]   2> 4042 T132 oasc.ChaosMonkey.monkeyLog monkey: init - expire sessions:true cause connection loss:true
[junit4:junit4]   2> 4293 T132 oejs.Server.doStart jetty-8.1.8.v20121106
[junit4:junit4]   2> 4297 T132 oejs.AbstractConnector.doStart Started SocketConnector@127.0.0.1:26711
[junit4:junit4]   2> 4298 T132 oass.SolrDispatchFilter.init SolrDispatchFilter.init()
[junit4:junit4]   2> 4299 T132 oasc.SolrResourceLoader.locateSolrHome JNDI not configured for solr (NoInitialContextEx)
[junit4:junit4]   2> 4299 T132 oasc.SolrResourceLoader.locateSolrHome using system property solr.solr.home: /usr/home/hudson/hudson-slave/workspace/Lucene-Solr-Tests-4.x-Java6/solr/build/solr-core/test/J0/./org.apache.solr.cloud.SyncSliceTest-jetty1-1359666261801
[junit4:junit4]   2> 4300 T132 oasc.CoreContainer$Initializer.initialize looking for solr.xml: /usr/home/hudson/hudson-slave/workspace/Lucene-Solr-Tests-4.x-Java6/solr/build/solr-core/test/J0/./org.apache.solr.cloud.SyncSliceTest-jetty1-1359666261801/solr.xml
[junit4:junit4]   2> 4301 T132 oasc.CoreContainer.<init> New CoreContainer 319241302
[junit4:junit4]   2> 4302 T132 oasc.CoreContainer.load Loading CoreContainer using Solr Home: '/usr/home/hudson/hudson-slave/workspace/Lucene-Solr-Tests-4.x-Java6/solr/build/solr-core/test/J0/./org.apache.solr.cloud.SyncSliceTest-jetty1-1359666261801/'
[junit4:junit4]   2> 4302 T132 oasc.SolrResourceLoader.<init> new SolrResourceLoader for directory: '/usr/home/hudson/hudson-slave/workspace/Lucene-Solr-Tests-4.x-Java6/solr/build/solr-core/test/J0/./org.apache.solr.cloud.SyncSliceTest-jetty1-1359666261801/'
[junit4:junit4]   2> 4368 T132 oashc.HttpShardHandlerFactory.getParameter Setting socketTimeout to: 60000
[junit4:junit4]   2> 4369 T132 oashc.HttpShardHandlerFactory.getParameter Setting urlScheme to: http://
[junit4:junit4]   2> 4370 T132 oashc.HttpShardHandlerFactory.getParameter Setting connTimeout to: 15000
[junit4:junit4]   2> 4371 T132 oashc.HttpShardHandlerFactory.getParameter Setting maxConnectionsPerHost to: 20
[junit4:junit4]   2> 4371 T132 oashc.HttpShardHandlerFactory.getParameter Setting corePoolSize to: 0
[junit4:junit4]   2> 4372 T132 oashc.HttpShardHandlerFactory.getParameter Setting maximumPoolSize to: 2147483647
[junit4:junit4]   2> 4372 T132 oashc.HttpShardHandlerFactory.getParameter Setting maxThreadIdleTime to: 5
[junit4:junit4]   2> 4373 T132 oashc.HttpShardHandlerFactory.getParameter Setting sizeOfQueue to: -1
[junit4:junit4]   2> 4374 T132 oashc.HttpShardHandlerFactory.getParameter Setting fairnessPolicy to: false
[junit4:junit4]   2> 4374 T132 oascsi.HttpClientUtil.createClient Creating new http client, config:maxConnectionsPerHost=20&maxConnections=10000&socketTimeout=60000&connTimeout=15000&retry=false
[junit4:junit4]   2> 4407 T132 oasc.CoreContainer.load Registering Log Listener
[junit4:junit4]   2> 4436 T132 oasc.CoreContainer.initZooKeeper Zookeeper client=127.0.0.1:58058/solr
[junit4:junit4]   2> 4436 T132 oasc.ZkController.checkChrootPath zkHost includes chroot
[junit4:junit4]   2> 4437 T132 oaz.ZooKeeper.<init> Initiating client connection, connectString=127.0.0.1:58058 sessionTimeout=60000 watcher=org.apache.solr.common.cloud.ConnectionManager@5fe0095c
[junit4:junit4]   2> 4439 T132 oascc.ConnectionManager.waitForConnected Waiting for client to connect to ZooKeeper
[junit4:junit4]   2> 4439 T170 oaz.ClientCnxn$SendThread.logStartConnect Opening socket connection to server localhost/127.0.0.1:58058. Will not attempt to authenticate using SASL (access denied (javax.security.auth.AuthPermission getLoginConfiguration))
[junit4:junit4]   2> 4440 T170 oaz.ClientCnxn$SendThread.primeConnection Socket connection established to localhost/127.0.0.1:58058, initiating session
[junit4:junit4]   2> 4440 T134 oazs.NIOServerCnxnFactory.run Accepted socket connection from /140.211.11.196:26477
[junit4:junit4]   2> 4441 T134 oazs.ZooKeeperServer.processConnectRequest Client attempting to establish new session at /140.211.11.196:26477
[junit4:junit4]   2> 4443 T136 oazs.ZooKeeperServer.finishSessionInit Established session 0x13c926c9f680005 with negotiated timeout 20000 for client /140.211.11.196:26477
[junit4:junit4]   2> 4443 T170 oaz.ClientCnxn$SendThread.onConnected Session establishment complete on server localhost/127.0.0.1:58058, sessionid = 0x13c926c9f680005, negotiated timeout = 20000
[junit4:junit4]   2> 4443 T171 oascc.ConnectionManager.process Watcher org.apache.solr.common.cloud.ConnectionManager@5fe0095c name:ZooKeeperConnection Watcher:127.0.0.1:58058 got event WatchedEvent state:SyncConnected type:None path:null path:null type:None
[junit4:junit4]   2> 4443 T132 oascc.ConnectionManager.waitForConnected Client is connected to ZooKeeper
[junit4:junit4]   2> 4445 T137 oazs.PrepRequestProcessor.pRequest2Txn Processed session termination for sessionid: 0x13c926c9f680005
[junit4:junit4]   2> 4446 T171 oaz.ClientCnxn$EventThread.run EventThread shut down
[junit4:junit4]   2> 4446 T134 oazs.NIOServerCnxn.closeSock Closed socket connection for client /140.211.11.196:26477 which had sessionid 0x13c926c9f680005
[junit4:junit4]   2> 4446 T132 oaz.ZooKeeper.close Session: 0x13c926c9f680005 closed
[junit4:junit4]   2> 4447 T132 oascsi.HttpClientUtil.createClient Creating new http client, config:maxConnections=500&maxConnectionsPerHost=16&socketTimeout=60000&connTimeout=15000
[junit4:junit4]   2> 4464 T132 oaz.ZooKeeper.<init> Initiating client connection, connectString=127.0.0.1:58058/solr sessionTimeout=30000 watcher=org.apache.solr.common.cloud.ConnectionManager@7e9a57a0
[junit4:junit4]   2> 4466 T132 oascc.ConnectionManager.waitForConnected Waiting for client to connect to ZooKeeper
[junit4:junit4]   2> 4466 T172 oaz.ClientCnxn$SendThread.logStartConnect Opening socket connection to server localhost/127.0.0.1:58058. Will not attempt to authenticate using SASL (access denied (javax.security.auth.AuthPermission getLoginConfiguration))
[junit4:junit4]   2> 4467 T172 oaz.ClientCnxn$SendThread.primeConnection Socket connection established to localhost/127.0.0.1:58058, initiating session
[junit4:junit4]   2> 4467 T134 oazs.NIOServerCnxnFactory.run Accepted socket connection from /140.211.11.196:29363
[junit4:junit4]   2> 4468 T134 oazs.ZooKeeperServer.processConnectRequest Client attempting to establish new session at /140.211.11.196:29363
[junit4:junit4]   2> 4469 T136 oazs.ZooKeeperServer.finishSessionInit Established session 0x13c926c9f680006 with negotiated timeout 20000 for client /140.211.11.196:29363
[junit4:junit4]   2> 4469 T172 oaz.ClientCnxn$SendThread.onConnected Session establishment complete on server localhost/127.0.0.1:58058, sessionid = 0x13c926c9f680006, negotiated timeout = 20000
[junit4:junit4]   2> 4470 T173 oascc.ConnectionManager.process Watcher org.apache.solr.common.cloud.ConnectionManager@7e9a57a0 name:ZooKeeperConnection Watcher:127.0.0.1:58058/solr got event WatchedEvent state:SyncConnected type:None path:null path:null type:None
[junit4:junit4]   2> 4470 T132 oascc.ConnectionManager.waitForConnected Client is connected to ZooKeeper
[junit4:junit4]   2> 4471 T137 oazs.PrepRequestProcessor.pRequest Got user-level KeeperException when processing sessionid:0x13c926c9f680006 type:create cxid:0x1 zxid:0x49 txntype:-1 reqpath:n/a Error Path:/solr/overseer Error:KeeperErrorCode = NodeExists for /solr/overseer
[junit4:junit4]   2> 4473 T137 oazs.PrepRequestProcessor.pRequest Got user-level KeeperException when processing sessionid:0x13c926c9f680006 type:create cxid:0x2 zxid:0x4a txntype:-1 reqpath:n/a Error Path:/solr/overseer Error:KeeperErrorCode = NodeExists for /solr/overseer
[junit4:junit4]   2> 4475 T132 oasc.ZkController.createEphemeralLiveNode Register node as live in ZooKeeper:/live_nodes/127.0.0.1:26711_dgg%2Faf
[junit4:junit4]   2> 4476 T137 oazs.PrepRequestProcessor.pRequest Got user-level KeeperException when processing sessionid:0x13c926c9f680006 type:delete cxid:0x4 zxid:0x4b txntype:-1 reqpath:n/a Error Path:/solr/live_nodes/127.0.0.1:26711_dgg%2Faf Error:KeeperErrorCode = NoNode for /solr/live_nodes/127.0.0.1:26711_dgg%2Faf
[junit4:junit4]   2> 4483 T132 oascc.SolrZkClient.makePath makePath: /live_nodes/127.0.0.1:26711_dgg%2Faf
[junit4:junit4]   2> 4487 T154 oascc.ZkStateReader$3.process Updating live nodes... (2)
[junit4:junit4]   2> 4487 T160 oascc.ZkStateReader$3.process Updating live nodes... (2)
[junit4:junit4]   2> 4488 T154 oascc.ZkStateReader$2.process A cluster state change: WatchedEvent state:SyncConnected type:NodeChildrenChanged path:/live_nodes, has occurred - updating... (live nodes size: 2)
[junit4:junit4]   2> 4499 T132 oascc.ZkStateReader.createClusterStateWatchersAndUpdate Updating cluster state from ZooKeeper... 
[junit4:junit4]   2> 4509 T174 oasc.CoreContainer.create Creating SolrCore 'collection1' using instanceDir: /usr/home/hudson/hudson-slave/workspace/Lucene-Solr-Tests-4.x-Java6/solr/build/solr-core/test/J0/./org.apache.solr.cloud.SyncSliceTest-jetty1-1359666261801/collection1
[junit4:junit4]   2> 4509 T174 oasc.ZkController.createCollectionZkNode Check for collection zkNode:collection1
[junit4:junit4]   2> 4510 T174 oasc.ZkController.createCollectionZkNode Collection zkNode exists
[junit4:junit4]   2> 4510 T174 oasc.ZkController.readConfigName Load collection config from:/collections/collection1
[junit4:junit4]   2> 4512 T174 oasc.SolrResourceLoader.<init> new SolrResourceLoader for directory: '/usr/home/hudson/hudson-slave/workspace/Lucene-Solr-Tests-4.x-Java6/solr/build/solr-core/test/J0/./org.apache.solr.cloud.SyncSliceTest-jetty1-1359666261801/collection1/'
[junit4:junit4]   2> 4513 T174 oasc.SolrResourceLoader.replaceClassLoader Adding 'file:/usr/home/hudson/hudson-slave/workspace/Lucene-Solr-Tests-4.x-Java6/solr/build/solr-core/test/J0/org.apache.solr.cloud.SyncSliceTest-jetty1-1359666261801/collection1/lib/README' to classloader
[junit4:junit4]   2> 4514 T174 oasc.SolrResourceLoader.replaceClassLoader Adding 'file:/usr/home/hudson/hudson-slave/workspace/Lucene-Solr-Tests-4.x-Java6/solr/build/solr-core/test/J0/org.apache.solr.cloud.SyncSliceTest-jetty1-1359666261801/collection1/lib/classes/' to classloader
[junit4:junit4]   2> 4566 T174 oasc.SolrConfig.<init> Using Lucene MatchVersion: LUCENE_42
[junit4:junit4]   2> 4636 T174 oasc.SolrConfig.<init> Loaded SolrConfig: solrconfig.xml
[junit4:junit4]   2> 4737 T174 oass.IndexSchema.readSchema Reading Solr Schema
[junit4:junit4]   2> 4746 T174 oass.IndexSchema.readSchema Schema name=test
[junit4:junit4]   2> 5276 T174 oass.OpenExchangeRatesOrgProvider.init Initialized with rates=open-exchange-rates.json, refreshInterval=1440.
[junit4:junit4]   2> 5284 T174 oass.IndexSchema.readSchema default search field in schema is text
[junit4:junit4]   2> 5286 T174 oass.IndexSchema.readSchema unique key field: id
[junit4:junit4]   2> 5302 T174 oass.FileExchangeRateProvider.reload Reloading exchange rates from file currency.xml
[junit4:junit4]   2> 5306 T174 oass.FileExchangeRateProvider.reload Reloading exchange rates from file currency.xml
[junit4:junit4]   2> 5310 T174 oass.OpenExchangeRatesOrgProvider.reload Reloading exchange rates from open-exchange-rates.json
[junit4:junit4]   2> 5311 T174 oass.OpenExchangeRatesOrgProvider.reload Reloading exchange rates from open-exchange-rates.json
[junit4:junit4]   2> 5313 T174 oasc.SolrCore.<init> [collection1] Opening new SolrCore at /usr/home/hudson/hudson-slave/workspace/Lucene-Solr-Tests-4.x-Java6/solr/build/solr-core/test/J0/./org.apache.solr.cloud.SyncSliceTest-jetty1-1359666261801/collection1/, dataDir=./org.apache.solr.cloud.SyncSliceTest-1359666257762/jetty1/
[junit4:junit4]   2> 5313 T174 oasc.JmxMonitoredMap.<init> JMX monitoring is enabled. Adding Solr mbeans to JMX Server: com.sun.jmx.mbeanserver.JmxMBeanServer@39320a41
[junit4:junit4]   2> 5314 T174 oasc.SolrCore.initDirectoryFactory solr.StandardDirectoryFactory
[junit4:junit4]   2> 5314 T174 oasc.CachingDirectoryFactory.get return new directory for /usr/home/hudson/hudson-slave/workspace/Lucene-Solr-Tests-4.x-Java6/solr/build/solr-core/test/J0/./org.apache.solr.cloud.SyncSliceTest-1359666257762/jetty1 forceNew:false
[junit4:junit4]   2> 5315 T174 oasc.CachingDirectoryFactory.close Releasing directory:/usr/home/hudson/hudson-slave/workspace/Lucene-Solr-Tests-4.x-Java6/solr/build/solr-core/test/J0/./org.apache.solr.cloud.SyncSliceTest-1359666257762/jetty1
[junit4:junit4]   2> 5315 T174 oasc.SolrCore.getNewIndexDir New index directory detected: old=null new=./org.apache.solr.cloud.SyncSliceTest-1359666257762/jetty1/index/
[junit4:junit4]   2> 5315 T174 oasc.SolrCore.initIndex WARNING [collection1] Solr index directory './org.apache.solr.cloud.SyncSliceTest-1359666257762/jetty1/index' doesn't exist. Creating new index...
[junit4:junit4]   2> 5316 T174 oasc.CachingDirectoryFactory.get return new directory for /usr/home/hudson/hudson-slave/workspace/Lucene-Solr-Tests-4.x-Java6/solr/build/solr-core/test/J0/./org.apache.solr.cloud.SyncSliceTest-1359666257762/jetty1/index forceNew:false
[junit4:junit4]   2> 5320 T174 oasc.SolrDeletionPolicy.onCommit SolrDeletionPolicy.onCommit: commits:num=1
[junit4:junit4]   2> 		commit{dir=RateLimitedDirectoryWrapper(org.apache.lucene.store.NIOFSDirectory@/usr/home/hudson/hudson-slave/workspace/Lucene-Solr-Tests-4.x-Java6/solr/build/solr-core/test/J0/org.apache.solr.cloud.SyncSliceTest-1359666257762/jetty1/index lockFactory=org.apache.lucene.store.NativeFSLockFactory@6e4a084c),segFN=segments_1,generation=1,filenames=[segments_1]
[junit4:junit4]   2> 5320 T174 oasc.SolrDeletionPolicy.updateCommits newest commit = 1[segments_1]
[junit4:junit4]   2> 5321 T174 oasc.CachingDirectoryFactory.close Releasing directory:/usr/home/hudson/hudson-slave/workspace/Lucene-Solr-Tests-4.x-Java6/solr/build/solr-core/test/J0/./org.apache.solr.cloud.SyncSliceTest-1359666257762/jetty1/index
[junit4:junit4]   2> 5321 T174 oasc.SolrCore.initWriters created xml: solr.XMLResponseWriter
[junit4:junit4]   2> 5323 T174 oasup.UpdateRequestProcessorChain.init inserting DistributedUpdateProcessorFactory into updateRequestProcessorChain "dedupe"
[junit4:junit4]   2> 5323 T174 oasup.UpdateRequestProcessorChain.init inserting DistributedUpdateProcessorFactory into updateRequestProcessorChain "dedupe-allfields"
[junit4:junit4]   2> 5323 T174 oasup.UpdateRequestProcessorChain.init inserting DistributedUpdateProcessorFactory into updateRequestProcessorChain "stored_sig"
[junit4:junit4]   2> 5324 T174 oasup.UpdateRequestProcessorChain.init inserting DistributedUpdateProcessorFactory into updateRequestProcessorChain "uniq-fields"
[junit4:junit4]   2> 5324 T174 oasup.UpdateRequestProcessorChain.init inserting DistributedUpdateProcessorFactory into updateRequestProcessorChain "distrib-dup-test-chain-implicit"
[junit4:junit4]   2> 5324 T174 oasc.RequestHandlers.initHandlersFromConfig adding lazy requestHandler: solr.ReplicationHandler
[junit4:junit4]   2> 5325 T174 oasc.RequestHandlers.initHandlersFromConfig created /replication: solr.ReplicationHandler
[junit4:junit4]   2> 5325 T174 oasc.RequestHandlers.initHandlersFromConfig created standard: solr.StandardRequestHandler
[junit4:junit4]   2> 5325 T174 oasc.RequestHandlers.initHandlersFromConfig created /get: solr.RealTimeGetHandler
[junit4:junit4]   2> 5326 T174 oasc.RequestHandlers.initHandlersFromConfig created dismax: solr.SearchHandler
[junit4:junit4]   2> 5326 T174 oasc.RequestHandlers.initHandlersFromConfig created mock: org.apache.solr.core.MockQuerySenderListenerReqHandler
[junit4:junit4]   2> 5327 T174 oasc.RequestHandlers.initHandlersFromConfig created /admin/: org.apache.solr.handler.admin.AdminHandlers
[junit4:junit4]   2> 5327 T174 oasc.RequestHandlers.initHandlersFromConfig created defaults: solr.StandardRequestHandler
[junit4:junit4]   2> 5327 T174 oasc.RequestHandlers.initHandlersFromConfig adding lazy requestHandler: solr.StandardRequestHandler
[junit4:junit4]   2> 5327 T174 oasc.RequestHandlers.initHandlersFromConfig created lazy: solr.StandardRequestHandler
[junit4:junit4]   2> 5328 T174 oasc.RequestHandlers.initHandlersFromConfig created /update: solr.UpdateRequestHandler
[junit4:junit4]   2> 5328 T174 oasc.RequestHandlers.initHandlersFromConfig created /terms: org.apache.solr.handler.component.SearchHandler
[junit4:junit4]   2> 5329 T174 oasc.RequestHandlers.initHandlersFromConfig created spellCheckCompRH: org.apache.solr.handler.component.SearchHandler
[junit4:junit4]   2> 5329 T174 oasc.RequestHandlers.initHandlersFromConfig created spellCheckCompRH_Direct: org.apache.solr.handler.component.SearchHandler
[junit4:junit4]   2> 5330 T174 oasc.RequestHandlers.initHandlersFromConfig created spellCheckWithWordbreak: org.apache.solr.handler.component.SearchHandler
[junit4:junit4]   2> 5330 T174 oasc.RequestHandlers.initHandlersFromConfig created spellCheckWithWordbreak_Direct: org.apache.solr.handler.component.SearchHandler
[junit4:junit4]   2> 5330 T174 oasc.RequestHandlers.initHandlersFromConfig created spellCheckCompRH1: org.apache.solr.handler.component.SearchHandler
[junit4:junit4]   2> 5331 T174 oasc.RequestHandlers.initHandlersFromConfig created mltrh: org.apache.solr.handler.component.SearchHandler
[junit4:junit4]   2> 5331 T174 oasc.RequestHandlers.initHandlersFromConfig created tvrh: org.apache.solr.handler.component.SearchHandler
[junit4:junit4]   2> 5332 T174 oasc.RequestHandlers.initHandlersFromConfig created /mlt: solr.MoreLikeThisHandler
[junit4:junit4]   2> 5332 T174 oasc.RequestHandlers.initHandlersFromConfig created /debug/dump: solr.DumpRequestHandler
[junit4:junit4]   2> 5337 T174 oashl.XMLLoader.init xsltCacheLifetimeSeconds=60
[junit4:junit4]   2> 5340 T174 oasc.SolrCore.initDeprecatedSupport WARNING solrconfig.xml uses deprecated <admin/gettableFiles>, Please update your config to use the ShowFileRequestHandler.
[junit4:junit4]   2> 5342 T174 oasc.SolrCore.initDeprecatedSupport WARNING adding ShowFileRequestHandler with hidden files: [SCHEMA.XML, OLD_SYNONYMS.TXT, STOPWORDS.TXT, PROTWORDS.TXT, OPEN-EXCHANGE-RATES.JSON, SYNONYMS.TXT, CURRENCY.XML, MAPPING-ISOLATIN1ACCENT.TXT]
[junit4:junit4]   2> 5343 T174 oasc.CachingDirectoryFactory.close Releasing directory:/usr/home/hudson/hudson-slave/workspace/Lucene-Solr-Tests-4.x-Java6/solr/build/solr-core/test/J0/./org.apache.solr.cloud.SyncSliceTest-1359666257762/jetty1
[junit4:junit4]   2> 5345 T174 oass.SolrIndexSearcher.<init> Opening Searcher@5bd86632 main
[junit4:junit4]   2> 5345 T174 oasu.CommitTracker.<init> Hard AutoCommit: disabled
[junit4:junit4]   2> 5346 T174 oasu.CommitTracker.<init> Soft AutoCommit: disabled
[junit4:junit4]   2> 5346 T174 oashc.SpellCheckComponent.inform Initializing spell checkers
[junit4:junit4]   2> 5351 T174 oass.DirectSolrSpellChecker.init init: {name=direct,classname=DirectSolrSpellChecker,field=lowerfilt,minQueryLength=3}
[junit4:junit4]   2> 5398 T175 oasc.SolrCore.registerSearcher [collection1] Registered new searcher Searcher@5bd86632 main{StandardDirectoryReader(segments_1:1)}
[junit4:junit4]   2> 5402 T174 oasc.ZkController.publish publishing core=collection1 state=down
[junit4:junit4]   2> 5403 T174 oasc.ZkController.publish numShards not found on descriptor - reading it from system property
[junit4:junit4]   2> 5443 T155 oascc.ZkStateReader.updateClusterState Updating cloud state from ZooKeeper... 
[junit4:junit4]   2> 5443 T155 oasc.Overseer$ClusterStateUpdater.updateState Update state numShards=1 message={
[junit4:junit4]   2> 	  "operation":"state",
[junit4:junit4]   2> 	  "numShards":"1",
[junit4:junit4]   2> 	  "shard":"shard1",
[junit4:junit4]   2> 	  "roles":null,
[junit4:junit4]   2> 	  "state":"active",
[junit4:junit4]   2> 	  "core":"collection1",
[junit4:junit4]   2> 	  "collection":"control_collection",
[junit4:junit4]   2> 	  "node_name":"127.0.0.1:46162_dgg%2Faf",
[junit4:junit4]   2> 	  "base_url":"http://127.0.0.1:46162/dgg/af"}
[junit4:junit4]   2> 5448 T155 oasc.Overseer$ClusterStateUpdater.updateState Update state numShards=1 message={
[junit4:junit4]   2> 	  "operation":"state",
[junit4:junit4]   2> 	  "numShards":"1",
[junit4:junit4]   2> 	  "shard":null,
[junit4:junit4]   2> 	  "roles":null,
[junit4:junit4]   2> 	  "state":"down",
[junit4:junit4]   2> 	  "core":"collection1",
[junit4:junit4]   2> 	  "collection":"collection1",
[junit4:junit4]   2> 	  "node_name":"127.0.0.1:26711_dgg%2Faf",
[junit4:junit4]   2> 	  "base_url":"http://127.0.0.1:26711/dgg/af"}
[junit4:junit4]   2> 5448 T155 oasc.Overseer$ClusterStateUpdater.createCollection Create collection collection1 with numShards 1
[junit4:junit4]   2> 5448 T155 oasc.Overseer$ClusterStateUpdater.updateState Assigning new node to shard shard=shard1
[junit4:junit4]   2> 5460 T154 oascc.ZkStateReader$2.process A cluster state change: WatchedEvent state:SyncConnected type:NodeDataChanged path:/clusterstate.json, has occurred - updating... (live nodes size: 2)
[junit4:junit4]   2> 5460 T160 oascc.ZkStateReader$2.process A cluster state change: WatchedEvent state:SyncConnected type:NodeDataChanged path:/clusterstate.json, has occurred - updating... (live nodes size: 2)
[junit4:junit4]   2> 5460 T173 oascc.ZkStateReader$2.process A cluster state change: WatchedEvent state:SyncConnected type:NodeDataChanged path:/clusterstate.json, has occurred - updating... (live nodes size: 2)
[junit4:junit4]   2> 6405 T174 oasc.CoreContainer.registerCore registering core: collection1
[junit4:junit4]   2> 6405 T174 oasc.ZkController.register Register replica - core:collection1 address:http://127.0.0.1:26711/dgg/af collection:collection1 shard:shard1
[junit4:junit4]   2> 6406 T174 oascc.SolrZkClient.makePath makePath: /collections/collection1/leader_elect/shard1/election
[junit4:junit4]   2> 6451 T137 oazs.PrepRequestProcessor.pRequest Got user-level KeeperException when processing sessionid:0x13c926c9f680006 type:delete cxid:0x43 zxid:0x5a txntype:-1 reqpath:n/a Error Path:/solr/collections/collection1/leaders Error:KeeperErrorCode = NoNode for /solr/collections/collection1/leaders
[junit4:junit4]   2> 6452 T174 oasc.ShardLeaderElectionContext.runLeaderProcess Running the leader process.
[junit4:junit4]   2> 6453 T137 oazs.PrepRequestProcessor.pRequest Got user-level KeeperException when processing sessionid:0x13c926c9f680006 type:create cxid:0x44 zxid:0x5b txntype:-1 reqpath:n/a Error Path:/solr/overseer Error:KeeperErrorCode = NodeExists for /solr/overseer
[junit4:junit4]   2> 6462 T174 oasc.ShardLeaderElectionContext.waitForReplicasToComeUp Enough replicas found to continue.
[junit4:junit4]   2> 6463 T174 oasc.ShardLeaderElectionContext.runLeaderProcess I may be the new leader - try and sync
[junit4:junit4]   2> 6463 T174 oasc.SyncStrategy.sync Sync replicas to http://127.0.0.1:26711/dgg/af/collection1/
[junit4:junit4]   2> 6463 T174 oasc.SyncStrategy.syncReplicas Sync Success - now sync replicas to me
[junit4:junit4]   2> 6463 T174 oasc.SyncStrategy.syncToMe http://127.0.0.1:26711/dgg/af/collection1/ has no replicas
[junit4:junit4]   2> 6464 T174 oasc.ShardLeaderElectionContext.runLeaderProcess I am the new leader: http://127.0.0.1:26711/dgg/af/collection1/
[junit4:junit4]   2> 6464 T174 oascc.SolrZkClient.makePath makePath: /collections/collection1/leaders/shard1
[junit4:junit4]   2> 6469 T137 oazs.PrepRequestProcessor.pRequest Got user-level KeeperException when processing sessionid:0x13c926c9f680006 type:create cxid:0x4e zxid:0x5f txntype:-1 reqpath:n/a Error Path:/solr/overseer Error:KeeperErrorCode = NodeExists for /solr/overseer
[junit4:junit4]   2> 6977 T155 oascc.ZkStateReader.updateClusterState Updating cloud state from ZooKeeper... 
[junit4:junit4]   2> 7349 T154 oascc.ZkStateReader$2.process A cluster state change: WatchedEvent state:SyncConnected type:NodeDataChanged path:/clusterstate.json, has occurred - updating... (live nodes size: 2)
[junit4:junit4]   2> 7349 T160 oascc.ZkStateReader$2.process A cluster state change: WatchedEvent state:SyncConnected type:NodeDataChanged path:/clusterstate.json, has occurred - updating... (live nodes size: 2)
[junit4:junit4]   2> 7349 T173 oascc.ZkStateReader$2.process A cluster state change: WatchedEvent state:SyncConnected type:NodeDataChanged path:/clusterstate.json, has occurred - updating... (live nodes size: 2)
[junit4:junit4]   2> 7398 T174 oasc.ZkController.register We are http://127.0.0.1:26711/dgg/af/collection1/ and leader is http://127.0.0.1:26711/dgg/af/collection1/
[junit4:junit4]   2> 7398 T174 oasc.ZkController.register No LogReplay needed for core=collection1 baseURL=http://127.0.0.1:26711/dgg/af
[junit4:junit4]   2> 7398 T174 oasc.ZkController.checkRecovery I am the leader, no recovery necessary
[junit4:junit4]   2> 7398 T174 oasc.ZkController.publish publishing core=collection1 state=active
[junit4:junit4]   2> 7398 T174 oasc.ZkController.publish numShards not found on descriptor - reading it from system property
[junit4:junit4]   2> 7400 T174 oascc.ZkStateReader.updateClusterState Updating cloud state from ZooKeeper... 
[junit4:junit4]   2> 7401 T132 oass.SolrDispatchFilter.init user.dir=/usr/home/hudson/hudson-slave/workspace/Lucene-Solr-Tests-4.x-Java6/solr/build/solr-core/test/J0
[junit4:junit4]   2> 7402 T132 oass.SolrDispatchFilter.init SolrDispatchFilter.init() done
[junit4:junit4]   2> 7403 T132 oascsi.HttpClientUtil.createClient Creating new http client, config:maxConnections=128&maxConnectionsPerHost=32&followRedirects=false
[junit4:junit4]   2> 7625 T132 oejs.Server.doStart jetty-8.1.8.v20121106
[junit4:junit4]   2> 7628 T132 oejs.AbstractConnector.doStart Started SocketConnector@127.0.0.1:19007
[junit4:junit4]   2> 7629 T132 oass.SolrDispatchFilter.init SolrDispatchFilter.init()
[junit4:junit4]   2> 7630 T132 oasc.SolrResourceLoader.locateSolrHome JNDI not configured for solr (NoInitialContextEx)
[junit4:junit4]   2> 7630 T132 oasc.SolrResourceLoader.locateSolrHome using system property solr.solr.home: /usr/home/hudson/hudson-slave/workspace/Lucene-Solr-Tests-4.x-Java6/solr/build/solr-core/test/J0/./org.apache.solr.cloud.SyncSliceTest-jetty2-1359666265177
[junit4:junit4]   2> 7630 T132 oasc.CoreContainer$Initializer.initialize looking for solr.xml: /usr/home/hudson/hudson-slave/workspace/Lucene-Solr-Tests-4.x-Java6/solr/build/solr-core/test/J0/./org.apache.solr.cloud.SyncSliceTest-jetty2-1359666265177/solr.xml
[junit4:junit4]   2> 7631 T132 oasc.CoreContainer.<init> New CoreContainer 2122529300
[junit4:junit4]   2> 7631 T132 oasc.CoreContainer.load Loading CoreContainer using Solr Home: '/usr/home/hudson/hudson-slave/workspace/Lucene-Solr-Tests-4.x-Java6/solr/build/solr-core/test/J0/./org.apache.solr.cloud.SyncSliceTest-jetty2-1359666265177/'
[junit4:junit4]   2> 7632 T132 oasc.SolrResourceLoader.<init> new SolrResourceLoader for directory: '/usr/home/hudson/hudson-slave/workspace/Lucene-Solr-Tests-4.x-Java6/solr/build/solr-core/test/J0/./org.apache.solr.cloud.SyncSliceTest-jetty2-1359666265177/'
[junit4:junit4]   2> 7672 T132 oashc.HttpShardHandlerFactory.getParameter Setting socketTimeout to: 60000
[junit4:junit4]   2> 7672 T132 oashc.HttpShardHandlerFactory.getParameter Setting urlScheme to: http://
[junit4:junit4]   2> 7673 T132 oashc.HttpShardHandlerFactory.getParameter Setting connTimeout to: 15000
[junit4:junit4]   2> 7673 T132 oashc.HttpShardHandlerFactory.getParameter Setting maxConnectionsPerHost to: 20
[junit4:junit4]   2> 7673 T132 oashc.HttpShardHandlerFactory.getParameter Setting corePoolSize to: 0
[junit4:junit4]   2> 7674 T132 oashc.HttpShardHandlerFactory.getParameter Setting maximumPoolSize to: 2147483647
[junit4:junit4]   2> 7674 T132 oashc.HttpShardHandlerFactory.getParameter Setting maxThreadIdleTime to: 5
[junit4:junit4]   2> 7674 T132 oashc.HttpShardHandlerFactory.getParameter Setting sizeOfQueue to: -1
[junit4:junit4]   2> 7675 T132 oashc.HttpShardHandlerFactory.getParameter Setting fairnessPolicy to: false
[junit4:junit4]   2> 7675 T132 oascsi.HttpClientUtil.createClient Creating new http client, config:maxConnectionsPerHost=20&maxConnections=10000&socketTimeout=60000&connTimeout=15000&retry=false
[junit4:junit4]   2> 7698 T132 oasc.CoreContainer.load Registering Log Listener
[junit4:junit4]   2> 7716 T132 oasc.CoreContainer.initZooKeeper Zookeeper client=127.0.0.1:58058/solr
[junit4:junit4]   2> 7716 T132 oasc.ZkController.checkChrootPath zkHost includes chroot
[junit4:junit4]   2> 7717 T132 oaz.ZooKeeper.<init> Initiating client connection, connectString=127.0.0.1:58058 sessionTimeout=60000 watcher=org.apache.solr.common.cloud.ConnectionManager@320e59bd
[junit4:junit4]   2> 7718 T132 oascc.ConnectionManager.waitForConnected Waiting for client to connect to ZooKeeper
[junit4:junit4]   2> 7718 T185 oaz.ClientCnxn$SendThread.logStartConnect Opening socket connection to server localhost/127.0.0.1:58058. Will not attempt to authenticate using SASL (access denied (javax.security.auth.AuthPermission getLoginConfiguration))
[junit4:junit4]   2> 7719 T185 oaz.ClientCnxn$SendThread.primeConnection Socket connection established to localhost/127.0.0.1:58058, initiating session
[junit4:junit4]   2> 7719 T134 oazs.NIOServerCnxnFactory.run Accepted socket connection from /140.211.11.196:34060
[junit4:junit4]   2> 7720 T134 oazs.ZooKeeperServer.processConnectRequest Client attempting to establish new session at /140.211.11.196:34060
[junit4:junit4]   2> 7722 T136 oazs.ZooKeeperServer.finishSessionInit Established session 0x13c926c9f680007 with negotiated timeout 20000 for client /140.211.11.196:34060
[junit4:junit4]   2> 7722 T185 oaz.ClientCnxn$SendThread.onConnected Session establishment complete on server localhost/127.0.0.1:58058, sessionid = 0x13c926c9f680007, negotiated timeout = 20000
[junit4:junit4]   2> 7722 T186 oascc.ConnectionManager.process Watcher org.apache.solr.common.cloud.ConnectionManager@320e59bd name:ZooKeeperConnection Watcher:127.0.0.1:58058 got event WatchedEvent state:SyncConnected type:None path:null path:null type:None
[junit4:junit4]   2> 7722 T132 oascc.ConnectionManager.waitForConnected Client is connected to ZooKeeper
[junit4:junit4]   2> 7724 T137 oazs.PrepRequestProcessor.pRequest2Txn Processed session termination for sessionid: 0x13c926c9f680007
[junit4:junit4]   2> 7735 T186 oaz.ClientCnxn$EventThread.run EventThread shut down
[junit4:junit4]   2> 7735 T134 oazs.NIOServerCnxn.closeSock Closed socket connection for client /140.211.11.196:34060 which had sessionid 0x13c926c9f680007
[junit4:junit4]   2> 7735 T132 oaz.ZooKeeper.close Session: 0x13c926c9f680007 closed
[junit4:junit4]   2> 7735 T132 oascsi.HttpClientUtil.createClient Creating new http client, config:maxConnections=500&maxConnectionsPerHost=16&socketTimeout=60000&connTimeout=15000
[junit4:junit4]   2> 7749 T132 oaz.ZooKeeper.<init> Initiating client connection, connectString=127.0.0.1:58058/solr sessionTimeout=30000 watcher=org.apache.solr.common.cloud.ConnectionManager@4e2b983f
[junit4:junit4]   2> 7750 T132 oascc.ConnectionManager.waitForConnected Waiting for client to connect to ZooKeeper
[junit4:junit4]   2> 7751 T187 oaz.ClientCnxn$SendThread.logStartConnect Opening socket connection to server localhost/127.0.0.1:58058. Will not attempt to authenticate using SASL (access denied (javax.security.auth.AuthPermission getLoginConfiguration))
[junit4:junit4]   2> 7751 T187 oaz.ClientCnxn$SendThread.primeConnection Socket connection established to localhost/127.0.0.1:58058, initiating session
[junit4:junit4]   2> 7751 T134 oazs.NIOServerCnxnFactory.run Accepted socket connection from /140.211.11.196:38453
[junit4:junit4]   2> 7752 T134 oazs.ZooKeeperServer.processConnectRequest Client attempting to establish new session at /140.211.11.196:38453
[junit4:junit4]   2> 7753 T136 oazs.ZooKeeperServer.finishSessionInit Established session 0x13c926c9f680008 with negotiated timeout 20000 for client /140.211.11.196:38453
[junit4:junit4]   2> 7753 T187 oaz.ClientCnxn$SendThread.onConnected Session establishment complete on server localhost/127.0.0.1:58058, sessionid = 0x13c926c9f680008, negotiated timeout = 20000
[junit4:junit4]   2> 7753 T188 oascc.ConnectionManager.process Watcher org.apache.solr.common.cloud.ConnectionManager@4e2b983f name:ZooKeeperConnection Watcher:127.0.0.1:58058/solr got event WatchedEvent state:SyncConnected type:None path:null path:null type:None
[junit4:junit4]   2> 7754 T132 oascc.ConnectionManager.waitForConnected Client is connected to ZooKeeper
[junit4:junit4]   2> 7755 T137 oazs.PrepRequestProcessor.pRequest Got user-level KeeperException when processing sessionid:0x13c926c9f680008 type:create cxid:0x1 zxid:0x6c txntype:-1 reqpath:n/a Error Path:/solr/overseer Error:KeeperErrorCode = NodeExists for /solr/overseer
[junit4:junit4]   2> 7756 T137 oazs.PrepRequestProcessor.pRequest Got user-level KeeperException when processing sessionid:0x13c926c9f680008 type:create cxid:0x2 zxid:0x6d txntype:-1 reqpath:n/a Error Path:/solr/overseer Error:KeeperErrorCode = NodeExists for /solr/overseer
[junit4:junit4]   2> 7758 T132 oasc.ZkController.createEphemeralLiveNode Register node as live in ZooKeeper:/live_nodes/127.0.0.1:19007_dgg%2Faf
[junit4:junit4]   2> 7759 T137 oazs.PrepRequestProcessor.pRequest Got user-level KeeperException when processing sessionid:0x13c926c9f680008 type:delete cxid:0x4 zxid:0x6e txntype:-1 reqpath:n/a Error Path:/solr/live_nodes/127.0.0.1:19007_dgg%2Faf Error:KeeperErrorCode = NoNode for /solr/live_nodes/127.0.0.1:19007_dgg%2Faf
[junit4:junit4]   2> 7767 T132 oascc.SolrZkClient.makePath makePath: /live_nodes/127.0.0.1:19007_dgg%2Faf
[junit4:junit4]   2> 7771 T154 oascc.ZkStateReader$3.process Updating live nodes... (3)
[junit4:junit4]   2> 7771 T160 oascc.ZkStateReader$3.process Updating live nodes... (3)
[junit4:junit4]   2> 7771 T154 oascc.ZkStateReader$2.process A cluster state change: WatchedEvent state:SyncConnected type:NodeChildrenChanged path:/live_nodes, has occurred - updating... (live nodes size: 3)
[junit4:junit4]   2> 7771 T173 oascc.ZkStateReader$3.process Updating live nodes... (3)
[junit4:junit4]   2> 7771 T160 oascc.ZkStateReader$2.process A cluster state change: WatchedEvent state:SyncConnected type:NodeChildrenChanged path:/live_nodes, has occurred - updating... (live nodes size: 3)
[junit4:junit4]   2> 7771 T173 oascc.ZkStateReader$2.process A cluster state change: WatchedEvent state:SyncConnected type:NodeChildrenChanged path:/live_nodes, has occurred - updating... (live nodes size: 3)
[junit4:junit4]   2> 7775 T132 oascc.ZkStateReader.createClusterStateWatchersAndUpdate Updating cluster state from ZooKeeper... 
[junit4:junit4]   2> 7785 T189 oasc.CoreContainer.create Creating SolrCore 'collection1' using instanceDir: /usr/home/hudson/hudson-slave/workspace/Lucene-Solr-Tests-4.x-Java6/solr/build/solr-core/test/J0/./org.apache.solr.cloud.SyncSliceTest-jetty2-1359666265177/collection1
[junit4:junit4]   2> 7785 T189 oasc.ZkController.createCollectionZkNode Check for collection zkNode:collection1
[junit4:junit4]   2> 7785 T189 oasc.ZkController.createCollectionZkNode Collection zkNode exists
[junit4:junit4]   2> 7786 T189 oasc.ZkController.readConfigName Load collection config from:/collections/collection1
[junit4:junit4]   2> 7787 T189 oasc.SolrResourceLoader.<init> new SolrResourceLoader for directory: '/usr/home/hudson/hudson-slave/workspace/Lucene-Solr-Tests-4.x-Java6/solr/build/solr-core/test/J0/./org.apache.solr.cloud.SyncSliceTest-jetty2-1359666265177/collection1/'
[junit4:junit4]   2> 7788 T189 oasc.SolrResourceLoader.replaceClassLoader Adding 'file:/usr/home/hudson/hudson-slave/workspace/Lucene-Solr-Tests-4.x-Java6/solr/build/solr-core/test/J0/org.apache.solr.cloud.SyncSliceTest-jetty2-1359666265177/collection1/lib/classes/' to classloader
[junit4:junit4]   2> 7789 T189 oasc.SolrResourceLoader.replaceClassLoader Adding 'file:/usr/home/hudson/hudson-slave/workspace/Lucene-Solr-Tests-4.x-Java6/solr/build/solr-core/test/J0/org.apache.solr.cloud.SyncSliceTest-jetty2-1359666265177/collection1/lib/README' to classloader
[junit4:junit4]   2> 7846 T189 oasc.SolrConfig.<init> Using Lucene MatchVersion: LUCENE_42
[junit4:junit4]   2> 7938 T189 oasc.SolrConfig.<init> Loaded SolrConfig: solrconfig.xml
[junit4:junit4]   2> 8039 T189 oass.IndexSchema.readSchema Reading Solr Schema
[junit4:junit4]   2> 8045 T189 oass.IndexSchema.readSchema Schema name=test
[junit4:junit4]   2> 8778 T189 oass.OpenExchangeRatesOrgProvider.init Initialized with rates=open-exchange-rates.json, refreshInterval=1440.
[junit4:junit4]   2> 8785 T189 oass.IndexSchema.readSchema default search field in schema is text
[junit4:junit4]   2> 8788 T189 oass.IndexSchema.readSchema unique key field: id
[junit4:junit4]   2> 8805 T189 oass.FileExchangeRateProvider.reload Reloading exchange rates from file currency.xml
[junit4:junit4]   2> 8809 T189 oass.FileExchangeRateProvider.reload Reloading exchange rates from file currency.xml
[junit4:junit4]   2> 8813 T189 oass.OpenExchangeRatesOrgProvider.reload Reloading exchange rates from open-exchange-rates.json
[junit4:junit4]   2> 8815 T189 oass.OpenExchangeRatesOrgProvider.reload Reloading exchange rates from open-exchange-rates.json
[junit4:junit4]   2> 8816 T189 oasc.SolrCore.<init> [collection1] Opening new SolrCore at /usr/home/hudson/hudson-slave/workspace/Lucene-Solr-Tests-4.x-Java6/solr/build/solr-core/test/J0/./org.apache.solr.cloud.SyncSliceTest-jetty2-1359666265177/collection1/, dataDir=./org.apache.solr.cloud.SyncSliceTest-1359666257762/jetty2/
[junit4:junit4]   2> 8816 T189 oasc.JmxMonitoredMap.<init> JMX monitoring is enabled. Adding Solr mbeans to JMX Server: com.sun.jmx.mbeanserver.JmxMBeanServer@39320a41
[junit4:junit4]   2> 8817 T189 oasc.SolrCore.initDirectoryFactory solr.StandardDirectoryFactory
[junit4:junit4]   2> 8817 T189 oasc.CachingDirectoryFactory.get return new directory for /usr/home/hudson/hudson-slave/workspace/Lucene-Solr-Tests-4.x-Java6/solr/build/solr-core/test/J0/./org.apache.solr.cloud.SyncSliceTest-1359666257762/jetty2 forceNew:false
[junit4:junit4]   2> 8818 T189 oasc.CachingDirectoryFactory.close Releasing directory:/usr/home/hudson/hudson-slave/workspace/Lucene-Solr-Tests-4.x-Java6/solr/build/solr-core/test/J0/./org.apache.solr.cloud.SyncSliceTest-1359666257762/jetty2
[junit4:junit4]   2> 8818 T189 oasc.SolrCore.getNewIndexDir New index directory detected: old=null new=./org.apache.solr.cloud.SyncSliceTest-1359666257762/jetty2/index/
[junit4:junit4]   2> 8818 T189 oasc.SolrCore.initIndex WARNING [collection1] Solr index directory './org.apache.solr.cloud.SyncSliceTest-1359666257762/jetty2/index' doesn't exist. Creating new index...
[junit4:junit4]   2> 8819 T189 oasc.CachingDirectoryFactory.get return new directory for /usr/home/hudson/hudson-slave/workspace/Lucene-Solr-Tests-4.x-Java6/solr/build/solr-core/test/J0/./org.apache.solr.cloud.SyncSliceTest-1359666257762/jetty2/index forceNew:false
[junit4:junit4]   2> 8841 T189 oasc.SolrDeletionPolicy.onCommit SolrDeletionPolicy.onCommit: commits:num=1
[junit4:junit4]   2> 		commit{dir=RateLimitedDirectoryWrapper(org.apache.lucene.store.NIOFSDirectory@/usr/home/hudson/hudson-slave/workspace/Lucene-Solr-Tests-4.x-Java6/solr/build/solr-core/test/J0/org.apache.solr.cloud.SyncSliceTest-1359666257762/jetty2/index lockFactory=org.apache.lucene.store.NativeFSLockFactory@22ebbf0d),segFN=segments_1,generation=1,filenames=[segments_1]
[junit4:junit4]   2> 8841 T189 oasc.SolrDeletionPolicy.updateCommits newest commit = 1[segments_1]
[junit4:junit4]   2> 8842 T189 oasc.CachingDirectoryFactory.close Releasing directory:/usr/home/hudson/hudson-slave/workspace/Lucene-Solr-Tests-4.x-Java6/solr/build/solr-core/test/J0/./org.apache.solr.cloud.SyncSliceTest-1359666257762/jetty2/index
[junit4:junit4]   2> 8842 T189 oasc.SolrCore.initWriters created xml: solr.XMLResponseWriter
[junit4:junit4]   2> 8844 T189 oasup.UpdateRequestProcessorChain.init inserting DistributedUpdateProcessorFactory into updateRequestProcessorChain "dedupe"
[junit4:junit4]   2> 8844 T189 oasup.UpdateRequestProcessorChain.init inserting DistributedUpdateProcessorFactory into updateRequestProcessorChain "dedupe-allfields"
[junit4:junit4]   2> 8844 T189 oasup.UpdateRequestProcessorChain.init inserting DistributedUpdateProcessorFactory into updateRequestProcessorChain "stored_sig"
[junit4:junit4]   2> 8844 T189 oasup.UpdateRequestProcessorChain.init inserting DistributedUpdateProcessorFactory into updateRequestProcessorChain "uniq-fields"
[junit4:junit4]   2> 8845 T189 oasup.UpdateRequestProcessorChain.init inserting DistributedUpdateProcessorFactory into updateRequestProcessorChain "distrib-dup-test-chain-implicit"
[junit4:junit4]   2> 8845 T189 oasc.RequestHandlers.initHandlersFromConfig adding lazy requestHandler: solr.ReplicationHandler
[junit4:junit4]   2> 8845 T189 oasc.RequestHandlers.initHandlersFromConfig created /replication: solr.ReplicationHandler
[junit4:junit4]   2> 8846 T189 oasc.RequestHandlers.initHandlersFromConfig created standard: solr.StandardRequestHandler
[junit4:junit4]   2> 8846 T189 oasc.RequestHandlers.initHandlersFromConfig created /get: solr.RealTimeGetHandler
[junit4:junit4]   2> 8847 T189 oasc.RequestHandlers.initHandlersFromConfig created dismax: solr.SearchHandler
[junit4:junit4]   2> 8847 T189 oasc.RequestHandlers.initHandlersFromConfig created mock: org.apache.solr.core.MockQuerySenderListenerReqHandler
[junit4:junit4]   2> 8847 T189 oasc.RequestHandlers.initHandlersFromConfig created /admin/: org.apache.solr.handler.admin.AdminHandlers
[junit4:junit4]   2> 8848 T189 oasc.RequestHandlers.initHandlersFromConfig created defaults: solr.StandardRequestHandler
[junit4:junit4]   2> 8848 T189 oasc.RequestHandlers.initHandlersFromConfig adding lazy requestHandler: solr.StandardRequestHandler
[junit4:junit4]   2> 8848 T189 oasc.RequestHandlers.initHandlersFromConfig created lazy: solr.StandardRequestHandler
[junit4:junit4]   2> 8849 T189 oasc.RequestHandlers.initHandlersFromConfig created /update: solr.UpdateRequestHandler
[junit4:junit4]   2> 8849 T189 oasc.RequestHandlers.initHandlersFromConfig created /terms: org.apache.solr.handler.component.SearchHandler
[junit4:junit4]   2> 8850 T189 oasc.RequestHandlers.initHandlersFromConfig created spellCheckCompRH: org.apache.solr.handler.component.SearchHandler
[junit4:junit4]   2> 8850 T189 oasc.RequestHandlers.initHandlersFromConfig created spellCheckCompRH_Direct: org.apache.solr.handler.component.SearchHandler
[junit4:junit4]   2> 8851 T189 oasc.RequestHandlers.initHandlersFromConfig created spellCheckWithWordbreak: org.apache.solr.handler.component.SearchHandler
[junit4:junit4]   2> 8851 T189 oasc.RequestHandlers.initHandlersFromConfig created spellCheckWithWordbreak_Direct: org.apache.solr.handler.component.SearchHandler
[junit4:junit4]   2> 8851 T189 oasc.RequestHandlers.initHandlersFromConfig created spellCheckCompRH1: org.apache.solr.handler.component.SearchHandler
[junit4:junit4]   2> 8852 T189 oasc.RequestHandlers.initHandlersFromConfig created mltrh: org.apache.solr.handler.component.SearchHandler
[junit4:junit4]   2> 8852 T189 oasc.RequestHandlers.initHandlersFromConfig created tvrh: org.apache.solr.handler.component.SearchHandler
[junit4:junit4]   2> 8853 T189 oasc.RequestHandlers.initHandlersFromConfig created /mlt: solr.MoreLikeThisHandler
[junit4:junit4]   2> 8853 T189 oasc.RequestHandlers.initHandlersFromConfig created /debug/dump: solr.DumpRequestHandler
[junit4:junit4]   2> 8858 T189 oashl.XMLLoader.init xsltCacheLifetimeSeconds=60
[junit4:junit4]   2> 8861 T189 oasc.SolrCore.initDeprecatedSupport WARNING solrconfig.xml uses deprecated <admin/gettableFiles>, Please update your config to use the ShowFileRequestHandler.
[junit4:junit4]   2> 8862 T155 oascc.ZkStateReader.updateClusterState Updating cloud state from ZooKeeper... 
[junit4:junit4]   2> 8862 T189 oasc.SolrCore.initDeprecatedSupport WARNING adding ShowFileRequestHandler with hidden files: [SCHEMA.XML, OLD_SYNONYMS.TXT, STOPWORDS.TXT, PROTWORDS.TXT, OPEN-EXCHANGE-RATES.JSON, SYNONYMS.TXT, CURRENCY.XML, MAPPING-ISOLATIN1ACCENT.TXT]
[junit4:junit4]   2> 8863 T155 oasc.Overseer$ClusterStateUpdater.updateState Update state numShards=1 message={
[junit4:junit4]   2> 	  "operation":"state",
[junit4:junit4]   2> 	  "numShards":"1",
[junit4:junit4]   2> 	  "shard":"shard1",
[junit4:junit4]   2> 	  "roles":null,
[junit4:junit4]   2> 	  "state":"active",
[junit4:junit4]   2> 	  "core":"collection1",
[junit4:junit4]   2> 	  "collection":"collection1",
[junit4:junit4]   2> 	  "node_name":"127.0.0.1:26711_dgg%2Faf",
[junit4:junit4]   2> 	  "base_url":"http://127.0.0.1:26711/dgg/af"}
[junit4:junit4]   2> 8864 T189 oasc.CachingDirectoryFactory.close Releasing directory:/usr/home/hudson/hudson-slave/workspace/Lucene-Solr-Tests-4.x-Java6/solr/build/solr-core/test/J0/./org.apache.solr.cloud.SyncSliceTest-1359666257762/jetty2
[junit4:junit4]   2> 8866 T189 oass.SolrIndexSearcher.<init> Opening Searcher@7b058bfc main
[junit4:junit4]   2> 8866 T189 oasu.CommitTracker.<init> Hard AutoCommit: disabled
[junit4:junit4]   2> 8867 T189 oasu.CommitTracker.<init> Soft AutoCommit: disabled
[junit4:junit4]   2> 8867 T189 oashc.SpellCheckComponent.inform Initializing spell checkers
[junit4:junit4]   2> 8888 T189 oass.DirectSolrSpellChecker.init init: {name=direct,classname=DirectSolrSpellChecker,field=lowerfilt,minQueryLength=3}
[junit4:junit4]   2> 8889 T154 oascc.ZkStateReader$2.process A cluster state change: WatchedEvent state:SyncConnected type:NodeDataChanged path:/clusterstate.json, has occurred - updating... (live nodes size: 3)
[junit4:junit4]   2> 8889 T160 oascc.ZkStateReader$2.process A cluster state change: WatchedEvent state:SyncConnected type:NodeDataChanged path:/clusterstate.json, has occurred - updating... (live nodes size: 3)
[junit4:junit4]   2> 8889 T173 oascc.ZkStateReader$2.process A cluster state change: WatchedEvent state:SyncConnected type:NodeDataChanged path:/clusterstate.json, has occurred - updating... (live nodes size: 3)
[junit4:junit4]   2> 8889 T188 oascc.ZkStateReader$2.process A cluster state change: WatchedEvent state:SyncConnected type:NodeDataChanged path:/clusterstate.json, has occurred - updating... (live nodes size: 3)
[junit4:junit4]   2> 8932 T190 oasc.SolrCore.registerSearcher [collection1] Registered new searcher Searcher@7b058bfc main{StandardDirectoryReader(segments_1:1)}
[junit4:junit4]   2> 8937 T189 oasc.ZkController.publish publishing core=collection1 state=down
[junit4:junit4]   2> 8937 T189 oasc.ZkController.publish numShards not found on descriptor - reading it from system property
[junit4:junit4]   2> 10396 T155 oascc.ZkStateReader.updateClusterState Updating cloud state from ZooKeeper... 
[junit4:junit4]   2> 10397 T155 oasc.Overseer$ClusterStateUpdater.updateState Update state numShards=1 message={
[junit4:junit4]   2> 	  "operation":"state",
[junit4:junit4]   2> 	  "numShards":"1",
[junit4:junit4]   2> 	  "shard":null,
[junit4:junit4]   2> 	  "roles":null,
[junit4:junit4]   2> 	  "state":"down",
[junit4:junit4]   2> 	  "core":"collection1",
[junit4:junit4]   2> 	  "collection":"collection1",
[junit4:junit4]   2> 	  "node_name":"127.0.0.1:19007_dgg%2Faf",
[junit4:junit4]   2> 	  "base_url":"http://127.0.0.1:19007/dgg/af"}
[junit4:junit4]   2> 10397 T155 oasc.Overseer$ClusterStateUpdater.updateState Collection already exists with numShards=1
[junit4:junit4]   2> 10397 T155 oasc.Overseer$ClusterStateUpdater.updateState Assigning new node to shard shard=shard1
[junit4:junit4]   2> 10409 T154 oascc.ZkStateReader$2.process A cluster state change: WatchedEvent state:SyncConnected type:NodeDataChanged path:/clusterstate.json, has occurred - updating... (live nodes size: 3)
[junit4:junit4]   2> 10409 T173 oascc.ZkStateReader$2.process A cluster state change: WatchedEvent state:SyncConnected type:NodeDataChanged path:/clusterstate.json, has occurred - updating... (live nodes size: 3)
[junit4:junit4]   2> 10410 T188 oascc.ZkStateReader$2.process A cluster state change: WatchedEvent state:SyncConnected type:NodeDataChanged path:/clusterstate.json, has occurred - updating... (live nodes size: 3)
[junit4:junit4]   2> 10409 T160 oascc.ZkStateReader$2.process A cluster state change: WatchedEvent state:SyncConnected type:NodeDataChanged path:/clusterstate.json, has occurred - updating... (live nodes size: 3)
[junit4:junit4]   2> 10942 T189 oasc.CoreContainer.registerCore registering core: collection1
[junit4:junit4]   2> 10942 T189 oasc.ZkController.register Register replica - core:collection1 address:http://127.0.0.1:19007/dgg/af collection:collection1 shard:shard1
[junit4:junit4]   2> 10947 T189 oasc.ZkController.register We are http://127.0.0.1:19007/dgg/af/collection1/ and leader is http://127.0.0.1:26711/dgg/af/collection1/
[junit4:junit4]   2> 10947 T189 oasc.ZkController.register No LogReplay needed for core=collection1 baseURL=http://127.0.0.1:19007/dgg/af
[junit4:junit4]   2> 10947 T189 oasc.ZkController.checkRecovery Core needs to recover:collection1
[junit4:junit4]   2> 10948 T189 oasu.DefaultSolrCoreState.doRecovery Running recovery - first canceling any ongoing recovery
[junit4:junit4]   2> ASYNC  NEW_CORE C16 name=collection1 org.apache.solr.core.SolrCore@42919b58 url=http://127.0.0.1:19007/dgg/af/collection1 node=127.0.0.1:19007_dgg%2Faf C16_STATE=coll:collection1 core:collection1 props:{shard=null, roles=null, state=down, core=collection1, collection=collection1, node_name=127.0.0.1:19007_dgg%2Faf, base_url=http://127.0.0.1:19007/dgg/af}
[junit4:junit4]   2> 10956 T191 C16 P19007 oasc.RecoveryStrategy.run Starting recovery process.  core=collection1 recoveringAfterStartup=true
[junit4:junit4]   2> 10956 T191 C16 P19007 oasc.RecoveryStrategy.doRecovery ###### startupVersions=[]
[junit4:junit4]   2> 10956 T189 oascc.ZkStateReader.updateClusterState Updating cloud state from ZooKeeper... 
[junit4:junit4]   2> 10957 T191 C16 P19007 oasc.ZkController.publish publishing core=collection1 state=recovering
[junit4:junit4]   2> 10957 T191 C16 P19007 oasc.ZkController.publish numShards not found on descriptor - reading it from system property
[junit4:junit4]   2> 10958 T132 oass.SolrDispatchFilter.init user.dir=/usr/home/hudson/hudson-slave/workspace/Lucene-Solr-Tests-4.x-Java6/solr/build/solr-core/test/J0
[junit4:junit4]   2> 10958 T132 oass.SolrDispatchFilter.init SolrDispatchFilter.init() done
[junit4:junit4]   2> 10959 T132 oascsi.HttpClientUtil.createClient Creating new http client, config:maxConnections=128&maxConnectionsPerHost=32&followRedirects=false
[junit4:junit4]   2> 11006 T191 C16 P19007 oascsi.HttpClientUtil.createClient Creating new http client, config:maxConnections=128&maxConnectionsPerHost=32&followRedirects=false
[junit4:junit4]   2> 11151 T132 oejs.Server.doStart jetty-8.1.8.v20121106
[junit4:junit4]   2> 11154 T132 oejs.AbstractConnector.doStart Started SocketConnector@127.0.0.1:14126
[junit4:junit4]   2> 11155 T132 oass.SolrDispatchFilter.init SolrDispatchFilter.init()
[junit4:junit4]   2> 11155 T132 oasc.SolrResourceLoader.locateSolrHome JNDI not configured for solr (NoInitialContextEx)
[junit4:junit4]   2> 11156 T132 oasc.SolrResourceLoader.locateSolrHome using system property solr.solr.home: /usr/home/hudson/hudson-slave/workspace/Lucene-Solr-Tests-4.x-Java6/solr/build/solr-core/test/J0/./org.apache.solr.cloud.SyncSliceTest-jetty3-1359666268734
[junit4:junit4]   2> 11156 T132 oasc.CoreContainer$Initializer.initialize looking for solr.xml: /usr/home/hudson/hudson-slave/workspace/Lucene-Solr-Tests-4.x-Java6/solr/build/solr-core/test/J0/./org.apache.solr.cloud.SyncSliceTest-jetty3-1359666268734/solr.xml
[junit4:junit4]   2> 11157 T132 oasc.CoreContainer.<init> New CoreContainer 698858500
[junit4:junit4]   2> 11157 T132 oasc.CoreContainer.load Loading CoreContainer using Solr Home: '/usr/home/hudson/hudson-slave/workspace/Lucene-Solr-Tests-4.x-Java6/solr/build/solr-core/test/J0/./org.apache.solr.cloud.SyncSliceTest-jetty3-1359666268734/'
[junit4:junit4]   2> 11158 T132 oasc.SolrResourceLoader.<init> new SolrResourceLoader for directory: '/usr/home/hudson/hudson-slave/workspace/Lucene-Solr-Tests-4.x-Java6/solr/build/solr-core/test/J0/./org.apache.solr.cloud.SyncSliceTest-jetty3-1359666268734/'
[junit4:junit4]   2> 11204 T132 oashc.HttpShardHandlerFactory.getParameter Setting socketTimeout to: 60000
[junit4:junit4]   2> 11204 T132 oashc.HttpShardHandlerFactory.getParameter Setting urlScheme to: http://
[junit4:junit4]   2> 11205 T132 oashc.HttpShardHandlerFactory.getParameter Setting connTimeout to: 15000
[junit4:junit4]   2> 11205 T132 oashc.HttpShardHandlerFactory.getParameter Setting maxConnectionsPerHost to: 20
[junit4:junit4]   2> 11205 T132 oashc.HttpShardHandlerFactory.getParameter Setting corePoolSize to: 0
[junit4:junit4]   2> 11206 T132 oashc.HttpShardHandlerFactory.getParameter Setting maximumPoolSize to: 2147483647
[junit4:junit4]   2> 11206 T132 oashc.HttpShardHandlerFactory.getParameter Setting maxThreadIdleTime to: 5
[junit4:junit4]   2> 11207 T132 oashc.HttpShardHandlerFactory.getParameter Setting sizeOfQueue to: -1
[junit4:junit4]   2> 11207 T132 oashc.HttpShardHandlerFactory.getParameter Setting fairnessPolicy to: false
[junit4:junit4]   2> 11208 T132 oascsi.HttpClientUtil.createClient Creating new http client, config:maxConnectionsPerHost=20&maxConnections=10000&socketTimeout=60000&connTimeout=15000&retry=false
[junit4:junit4]   2> 11229 T132 oasc.CoreContainer.load Registering Log Listener
[junit4:junit4]   2> 11248 T132 oasc.CoreContainer.initZooKeeper Zookeeper client=127.0.0.1:58058/solr
[junit4:junit4]   2> 11248 T132 oasc.ZkController.checkChrootPath zkHost includes chroot
[junit4:junit4]   2> 11249 T132 oaz.ZooKeeper.<init> Initiating client connection, connectString=127.0.0.1:58058 sessionTimeout=60000 watcher=org.apache.solr.common.cloud.ConnectionManager@285396e1
[junit4:junit4]   2> 11250 T132 oascc.ConnectionManager.waitForConnected Waiting for client to connect to ZooKeeper
[junit4:junit4]   2> 11250 T201 oaz.ClientCnxn$SendThread.logStartConnect Opening socket connection to server localhost/127.0.0.1:58058. Will not attempt to authenticate using SASL (access denied (javax.security.auth.AuthPermission getLoginConfiguration))
[junit4:junit4]   2> 11251 T201 oaz.ClientCnxn$SendThread.primeConnection Socket connection established to localhost/127.0.0.1:58058, initiating session
[junit4:junit4]   2> 11251 T134 oazs.NIOServerCnxnFactory.run Accepted socket connection from /140.211.11.196:23920
[junit4:junit4]   2> 11251 T134 oazs.ZooKeeperServer.processConnectRequest Client attempting to establish new session at /140.211.11.196:23920
[junit4:junit4]   2> 11254 T136 oazs.ZooKeeperServer.finishSessionInit Established session 0x13c926c9f680009 with negotiated timeout 20000 for client /140.211.11.196:23920
[junit4:junit4]   2> 11254 T201 oaz.ClientCnxn$SendThread.onConnected Session establishment complete on server localhost/127.0.0.1:58058, sessionid = 0x13c926c9f680009, negotiated timeout = 20000
[junit4:junit4]   2> 11254 T202 oascc.ConnectionManager.process Watcher org.apache.solr.common.cloud.ConnectionManager@285396e1 name:ZooKeeperConnection Watcher:127.0.0.1:58058 got event WatchedEvent state:SyncConnected type:None path:null path:null type:None
[junit4:junit4]   2> 11254 T132 oascc.ConnectionManager.waitForConnected Client is connected to ZooKeeper
[junit4:junit4]   2> 11256 T137 oazs.PrepRequestProcessor.pRequest2Txn Processed session termination for sessionid: 0x13c926c9f680009
[junit4:junit4]   2> 11272 T134 oazs.NIOServerCnxn.closeSock Closed socket connection for client /140.211.11.196:23920 which had sessionid 0x13c926c9f680009
[junit4:junit4]   2> 11272 T202 oaz.ClientCnxn$EventThread.run EventThread shut down
[junit4:junit4]   2> 11272 T132 oaz.ZooKeeper.close Session: 0x13c926c9f680009 closed
[junit4:junit4]   2> 11273 T132 oascsi.HttpClientUtil.createClient Creating new http client, config:maxConnections=500&maxConnectionsPerHost=16&socketTimeout=60000&connTimeout=15000
[junit4:junit4]   2> 11284 T132 oaz.ZooKeeper.<init> Initiating client connection, connectString=127.0.0.1:58058/solr sessionTimeout=30000 watcher=org.apache.solr.common.cloud.ConnectionManager@6a83bdcf
[junit4:junit4]   2> 11285 T132 oascc.ConnectionManager.waitForConnected Waiting for client to connect to ZooKeeper
[junit4:junit4]   2> 11286 T203 oaz.ClientCnxn$SendThread.logStartConnect Opening socket connection to server localhost/127.0.0.1:58058. Will not attempt to authenticate using SASL (access denied (javax.security.auth.AuthPermission getLoginConfiguration))
[junit4:junit4]   2> 11286 T203 oaz.ClientCnxn$SendThread.primeConnection Socket connection established to localhost/127.0.0.1:58058, initiating session
[junit4:junit4]   2> 11287 T134 oazs.NIOServerCnxnFactory.run Accepted socket connection from /140.211.11.196:25038
[junit4:junit4]   2> 11287 T134 oazs.ZooKeeperServer.processConnectRequest Client attempting to establish new session at /140.211.11.196:25038
[junit4:junit4]   2> 11289 T136 oazs.ZooKeeperServer.finishSessionInit Established session 0x13c926c9f68000a with negotiated timeout 20000 for client /140.211.11.196:25038
[junit4:junit4]   2> 11289 T203 oaz.ClientCnxn$SendThread.onConnected Session establishment complete on server localhost/127.0.0.1:58058, sessionid = 0x13c926c9f68000a, negotiated timeout = 20000
[junit4:junit4]   2> 11289 T204 oascc.ConnectionManager.process Watcher org.apache.solr.common.cloud.ConnectionManager@6a83bdcf name:ZooKeeperConnection Watcher:127.0.0.1:58058/solr got event WatchedEvent state:SyncConnected type:None path:null path:null type:None
[junit4:junit4]   2> 11289 T132 oascc.ConnectionManager.waitForConnected Client is connected to ZooKeeper
[junit4:junit4]   2> 11291 T137 oazs.PrepRequestProcessor.pRequest Got user-level KeeperException when processing sessionid:0x13c926c9f68000a type:create cxid:0x1 zxid:0x7f txntype:-1 reqpath:n/a Error Path:/solr/overseer Error:KeeperErrorCode = NodeExists for /solr/overseer
[junit4:junit4]   2> 11293 T137 oazs.PrepRequestProcessor.pRequest Got user-level KeeperException when processing sessionid:0x13c926c9f68000a type:create cxid:0x2 zxid:0x80 txntype:-1 reqpath:n/a Error Path:/solr/overseer Error:KeeperErrorCode = NodeExists for /solr/overseer
[junit4:junit4]   2> 11306 T132 oasc.ZkController.createEphemeralLiveNode Register node as live in ZooKeeper:/live_nodes/127.0.0.1:14126_dgg%2Faf
[junit4:junit4]   2> 11307 T137 oazs.PrepRequestProcessor.pRequest Got user-level KeeperException when processing sessionid:0x13c926c9f68000a type:delete cxid:0x4 zxid:0x81 txntype:-1 reqpath:n/a Error Path:/solr/live_nodes/127.0.0.1:14126_dgg%2Faf Error:KeeperErrorCode = NoNode for /solr/live_nodes/127.0.0.1:14126_dgg%2Faf
[junit4:junit4]   2> 11309 T132 oascc.SolrZkClient.makePath makePath: /live_nodes/127.0.0.1:14126_dgg%2Faf
[junit4:junit4]   2> 11312 T188 oascc.ZkStateReader$2.process A cluster state change: WatchedEvent state:SyncConnected type:NodeChildrenChanged path:/live_nodes, has occurred - updating... (live nodes size: 3)
[junit4:junit4]   2> 11313 T154 oascc.ZkStateReader$3.process Updating live nodes... (4)
[junit4:junit4]   2> 11313 T160 oascc.ZkStateReader$3.process Updating live nodes... (4)
[junit4:junit4]   2> 11313 T154 oascc.ZkStateReader$2.process A cluster state change: WatchedEvent state:SyncConnected type:NodeChildrenChanged path:/live_nodes, has occurred - updating... (live nodes size: 4)
[junit4:junit4]   2> 11313 T173 oascc.ZkStateReader$3.process Updating live nodes... (4)
[junit4:junit4]   2> 11313 T160 oascc.ZkStateReader$2.process A cluster state change: WatchedEvent state:SyncConnected type:NodeChildrenChanged path:/live_nodes, has occurred - updating... (live nodes size: 4)
[junit4:junit4]   2> 11313 T173 oascc.ZkStateReader$2.process A cluster state change: WatchedEvent state:SyncConnected type:NodeChildrenChanged path:/live_nodes, has occurred - updating... (live nodes size: 4)
[junit4:junit4]   2> 11315 T188 oascc.ZkStateReader$3.process Updating live nodes... (4)
[junit4:junit4]   2> 11318 T132 oascc.ZkStateReader.createClusterStateWatchersAndUpdate Updating cluster state from ZooKeeper... 
[junit4:junit4]   2> 11326 T205 oasc.CoreContainer.create Creating SolrCore 'collection1' using instanceDir: /usr/home/hudson/hudson-slave/workspace/Lucene-Solr-Tests-4.x-Java6/solr/build/solr-core/test/J0/./org.apache.solr.cloud.SyncSliceTest-jetty3-1359666268734/collection1
[junit4:junit4]   2> 11326 T205 oasc.ZkController.createCollectionZkNode Check for collection zkNode:collection1
[junit4:junit4]   2> 11327 T205 oasc.ZkController.createCollectionZkNode Collection zkNode exists
[junit4:junit4]   2> 11327 T205 oasc.ZkController.readConfigName Load collection config from:/collections/collection1
[junit4:junit4]   2> 11329 T205 oasc.SolrResourceLoader.<init> new SolrResourceLoader for directory: '/usr/home/hudson/hudson-slave/workspace/Lucene-Solr-Tests-4.x-Java6/solr/build/solr-core/test/J0/./org.apache.solr.cloud.SyncSliceTest-jetty3-1359666268734/collection1/'
[junit4:junit4]   2> 11331 T205 oasc.SolrResourceLoader.replaceClassLoader Adding 'file:/usr/home/hudson/hudson-slave/workspace/Lucene-Solr-Tests-4.x-Java6/solr/build/solr-core/test/J0/org.apache.solr.cloud.SyncSliceTest-jetty3-1359666268734/collection1/lib/classes/' to classloader
[junit4:junit4]   2> 11332 T205 oasc.SolrResourceLoader.replaceClassLoader Adding 'file:/usr/home/hudson/hudson-slave/workspace/Lucene-Solr-Tests-4.x-Java6/solr/build/solr-core/test/J0/org.apache.solr.cloud.SyncSliceTest-jetty3-1359666268734/collection1/lib/README' to classloader
[junit4:junit4]   2> 11390 T205 oasc.SolrConfig.<init> Using Lucene MatchVersion: LUCENE_42
[junit4:junit4]   2> 11463 T205 oasc.SolrConfig.<init> Loaded SolrConfig: solrconfig.xml
[junit4:junit4]   2> 11564 T205 oass.IndexSchema.readSchema Reading Solr Schema
[junit4:junit4]   2> 11574 T205 oass.IndexSchema.readSchema Schema name=test
[junit4:junit4]   2> 11916 T155 oascc.ZkStateReader.updateClusterState Updating cloud state from ZooKeeper... 
[junit4:junit4]   2> 11917 T155 oasc.Overseer$ClusterStateUpdater.updateState Update state numShards=1 message={
[junit4:junit4]   2> 	  "operation":"state",
[junit4:junit4]   2> 	  "numShards":"1",
[junit4:junit4]   2> 	  "shard":"shard1",
[junit4:junit4]   2> 	  "roles":null,
[junit4:junit4]   2> 	  "state":"recovering",
[junit4:junit4]   2> 	  "core":"collection1",
[junit4:junit4]   2> 	  "collection":"collection1",
[junit4:junit4]   2> 	  "node_name":"127.0.0.1:19007_dgg%2Faf",
[junit4:junit4]   2> 	  "base_url":"http://127.0.0.1:19007/dgg/af"}
[junit4:junit4]   2> 11957 T154 oascc.ZkStateReader$2.process A cluster state change: WatchedEvent state:SyncConnected type:NodeDataChanged path:/clusterstate.json, has occurred - updating... (live nodes size: 4)
[junit4:junit4]   2> 11957 T204 oascc.ZkStateReader$2.process A cluster state change: WatchedEvent state:SyncConnected type:NodeDataChanged path:/clusterstate.json, has occurred - updating... (live nodes size: 4)
[junit4:junit4]   2> 11957 T160 oascc.ZkStateReader$2.process A cluster state change: WatchedEvent state:SyncConnected type:NodeDataChanged path:/clusterstate.json, has occurred - updating... (live nodes size: 4)
[junit4:junit4]   2> 11957 T188 oascc.ZkStateReader$2.process A cluster state change: WatchedEvent state:SyncConnected type:NodeDataChanged path:/clusterstate.json, has occurred - updating... (live nodes size: 4)
[junit4:junit4]   2> 11957 T173 oascc.ZkStateReader$2.process A cluster state change: WatchedEvent state:SyncConnected type:NodeDataChanged path:/clusterstate.json, has occurred - updating... (live nodes size: 4)
[junit4:junit4]   2> 12241 T205 oass.OpenExchangeRatesOrgProvider.init Initialized with rates=open-exchange-rates.json, refreshInterval=1440.
[junit4:junit4]   2> 12254 T205 oass.IndexSchema.readSchema default search field in schema is text
[junit4:junit4]   2> 12257 T205 oass.IndexSchema.readSchema unique key field: id
[junit4:junit4]   2> 12275 T205 oass.FileExchangeRateProvider.reload Reloading exchange rates from file currency.xml
[junit4:junit4]   2> 12280 T205 oass.FileExchangeRateProvider.reload Reloading exchange rates from file currency.xml
[junit4:junit4]   2> 12284 T205 oass.OpenExchangeRatesOrgProvider.reload Reloading exchange rates from open-exchange-rates.json
[junit4:junit4]   2> 12286 T205 oass.OpenExchangeRatesOrgProvider.reload Reloading exchange rates from open-exchange-rates.json
[junit4:junit4]   2> 12288 T205 oasc.SolrCore.<init> [collection1] Opening new SolrCore at /usr/home/hudson/hudson-slave/workspace/Lucene-Solr-Tests-4.x-Java6/solr/build/solr-core/test/J0/./org.apache.solr.cloud.SyncSliceTest-jetty3-1359666268734/collection1/, dataDir=./org.apache.solr.cloud.SyncSliceTest-1359666257762/jetty3/
[junit4:junit4]   2> 12288 T205 oasc.JmxMonitoredMap.<init> JMX monitoring is enabled. Adding Solr mbeans to JMX Server: com.sun.jmx.mbeanserver.JmxMBeanServer@39320a41
[junit4:junit4]   2> 12288 T205 oasc.SolrCore.initDirectoryFactory solr.StandardDirectoryFactory
[junit4:junit4]   2> 12289 T205 oasc.CachingDirectoryFactory.get return new directory for /usr/home/hudson/hudson-slave/workspace/Lucene-Solr-Tests-4.x-Java6/solr/build/solr-core/test/J0/./org.apache.solr.cloud.SyncSliceTest-1359666257762/jetty3 forceNew:false
[junit4:junit4]   2> 12289 T205 oasc.CachingDirectoryFactory.close Releasing directory:/usr/home/hudson/hudson-slave/workspace/Lucene-Solr-Tests-4.x-Java6/solr/build/solr-core/test/J0/./org.apache.solr.cloud.SyncSliceTest-1359666257762/jetty3
[junit4:junit4]   2> 12290 T205 oasc.SolrCore.getNewIndexDir New index directory detected: old=null new=./org.apache.solr.cloud.SyncSliceTest-1359666257762/jetty3/index/
[junit4:junit4]   2> 12290 T205 oasc.SolrCore.initIndex WARNING [collection1] Solr index directory './org.apache.solr.cloud.SyncSliceTest-1359666257762/jetty3/index' doesn't exist. Creating new index...
[junit4:junit4]   2> 12291 T205 oasc.CachingDirectoryFactory.get return new directory for /usr/home/hudson/hudson-slave/workspace/Lucene-Solr-Tests-4.x-Java6/solr/build/solr-core/test/J0/./org.apache.solr.cloud.SyncSliceTest-1359666257762/jetty3/index forceNew:false
[junit4:junit4]   2> 12296 T205 oasc.SolrDeletionPolicy.onCommit SolrDeletionPolicy.onCommit: commits:num=1
[junit4:junit4]   2> 		commit{dir=RateLimitedDirectoryWrapper(org.apache.lucene.store.NIOFSDirectory@/usr/home/hudson/hudson-slave/workspace/Lucene-Solr-Tests-4.x-Java6/solr/build/solr-core/test/J0/org.apache.solr.cloud.SyncSliceTest-1359666257762/jetty3/index lockFactory=org.apache.lucene.store.NativeFSLockFactory@10279954),segFN=segments_1,generation=1,filenames=[segments_1]
[junit4:junit4]   2> 12296 T205 oasc.SolrDeletionPolicy.updateCommits newest commit = 1[segments_1]
[junit4:junit4]   2> 12297 T205 oasc.CachingDirectoryFactory.close Releasing directory:/usr/home/hudson/hudson-slave/workspace/Lucene-Solr-Tests-4.x-Java6/solr/build/solr-core/test/J0/./org.apache.solr.cloud.SyncSliceTest-1359666257762/jetty3/index
[junit4:junit4]   2> 12297 T205 oasc.SolrCore.initWriters created xml: solr.XMLResponseWriter
[junit4:junit4]   2> 12298 T205 oasup.UpdateRequestProcessorChain.init inserting DistributedUpdateProcessorFactory into updateRequestProcessorChain "dedupe"
[junit4:junit4]   2> 12299 T205 oasup.UpdateRequestProcessorChain.init inserting DistributedUpdateProcessorFactory into updateRequestProcessorChain "dedupe-allfields"
[junit4:junit4]   2> 12299 T205 oasup.UpdateRequestProcessorChain.init inserting DistributedUpdateProcessorFactory into updateRequestProcessorChain "stored_sig"
[junit4:junit4]   2> 12299 T205 oasup.UpdateRequestProcessorChain.init inserting DistributedUpdateProcessorFactory into updateRequestProcessorChain "uniq-fields"
[junit4:junit4]   2> 12300 T205 oasup.UpdateRequestProcessorChain.init inserting DistributedUpdateProcessorFactory into updateRequestProcessorChain "distrib-dup-test-chain-implicit"
[junit4:junit4]   2> 12300 T205 oasc.RequestHandlers.initHandlersFromConfig adding lazy requestHandler: solr.ReplicationHandler
[junit4:junit4]   2> 12300 T205 oasc.RequestHandlers.initHandlersFromConfig created /replication: solr.ReplicationHandler
[junit4:junit4]   2> 12300 T205 oasc.RequestHandlers.initHandlersFromConfig created standard: solr.StandardRequestHandler
[junit4:junit4]   2> 12301 T205 oasc.RequestHandlers.initHandlersFromConfig created /get: solr.RealTimeGetHandler
[junit4:junit4]   2> 12301 T205 oasc.RequestHandlers.initHandlersFromConfig created dismax: solr.SearchHandler
[junit4:junit4]   2> 12302 T205 oasc.RequestHandlers.initHandlersFromConfig created mock: org.apache.solr.core.MockQuerySenderListenerReqHandler
[junit4:junit4]   2> 12302 T205 oasc.RequestHandlers.initHandlersFromConfig created /admin/: org.apache.solr.handler.admin.AdminHandlers
[junit4:junit4]   2> 12302 T205 oasc.RequestHandlers.initHandlersFromConfig created defaults: solr.StandardRequestHandler
[junit4:junit4]   2> 12303 T205 oasc.RequestHandlers.initHandlersFromConfig adding lazy requestHandler: solr.StandardRequestHandler
[junit4:junit4]   2> 12303 T205 oasc.RequestHandlers.initHandlersFromConfig created lazy: solr.StandardRequestHandler
[junit4:junit4]   2> 12303 T205 oasc.RequestHandlers.initHandlersFromConfig created /update: solr.UpdateRequestHandler
[junit4:junit4]   2> 12304 T205 oasc.RequestHandlers.initHandlersFromConfig created /terms: org.apache.solr.handler.component.SearchHandler
[junit4:junit4]   2> 12304 T205 oasc.RequestHandlers.initHandlersFromConfig created spellCheckCompRH: org.apache.solr.handler.component.SearchHandler
[junit4:junit4]   2> 12304 T205 oasc.RequestHandlers.initHandlersFromConfig created spellCheckCompRH_Direct: org.apache.solr.handler.component.SearchHandler
[junit4:junit4]   2> 12305 T205 oasc.RequestHandlers.initHandlersFromConfig created spellCheckWithWordbreak: org.apache.solr.handler.component.SearchHandler
[junit4:junit4]   2> 12305 T205 oasc.RequestHandlers.initHandlersFromConfig created spellCheckWithWordbreak_Direct: org.apache.solr.handler.component.SearchHandler
[junit4:junit4]   2> 12306 T205 oasc.RequestHandlers.initHandlersFromConfig created spellCheckCompRH1: org.apache.solr.handler.component.SearchHandler
[junit4:junit4]   2> 12306 T205 oasc.RequestHandlers.initHandlersFromConfig created mltrh: org.apache.solr.handler.component.SearchHandler
[junit4:junit4]   2> 12306 T205 oasc.RequestHandlers.initHandlersFromConfig created tvrh: org.apache.solr.handler.component.SearchHandler
[junit4:junit4]   2> 12307 T205 oasc.RequestHandlers.initHandlersFromConfig created /mlt: solr.MoreLikeThisHandler
[junit4:junit4]   2> 12307 T205 oasc.RequestHandlers.initHandlersFromConfig created /debug/dump: solr.DumpRequestHandler
[junit4:junit4]   2> 12314 T205 oashl.XMLLoader.init xsltCacheLifetimeSeconds=60
[junit4:junit4]   2> 12318 T205 oasc.SolrCore.initDeprecatedSupport WARNING solrconfig.xml uses deprecated <admin/gettableFiles>, Please update your config to use the ShowFileRequestHandler.
[junit4:junit4]   2> 12319 T205 oasc.SolrCore.initDeprecatedSupport WARNING adding ShowFileRequestHandler with hidden files: [SCHEMA.XML, OLD_SYNONYMS.TXT, STOPWORDS.TXT, PROTWORDS.TXT, OPEN-EXCHANGE-RATES.JSON, SYNONYMS.TXT, CURRENCY.XML, MAPPING-ISOLATIN1ACCENT.TXT]
[junit4:junit4]   2> 12321 T205 oasc.CachingDirectoryFactory.close Releasing directory:/usr/home/hudson/hudson-slave/workspace/Lucene-Solr-Tests-4.x-Java6/solr/build/solr-core/test/J0/./org.apache.solr.cloud.SyncSliceTest-1359666257762/jetty3
[junit4:junit4]   2> 12323 T205 oass.SolrIndexSearcher.<init> Opening Searcher@1826850a main
[junit4:junit4]   2> 12324 T205 oasu.CommitTracker.<init> Hard AutoCommit: disabled
[junit4:junit4]   2> 12324 T205 oasu.CommitTracker.<init> Soft AutoCommit: disabled
[junit4:junit4]   2> 12324 T205 oashc.SpellCheckComponent.inform Initializing spell checkers
[junit4:junit4]   2> 12330 T205 oass.DirectSolrSpellChecker.init init: {name=direct,classname=DirectSolrSpellChecker,field=lowerfilt,minQueryLength=3}
[junit4:junit4]   2> 12385 T206 oasc.SolrCore.registerSearcher [collection1] Registered new searcher Searcher@1826850a main{StandardDirectoryReader(segments_1:1)}
[junit4:junit4]   2> 12389 T205 oasc.ZkController.publish publishing core=collection1 state=down
[junit4:junit4]   2> 12390 T205 oasc.ZkController.publish numShards not found on descriptor - reading it from system property
[junit4:junit4]   2> 13464 T155 oascc.ZkStateReader.updateClusterState Updating cloud state from ZooKeeper... 
[junit4:junit4]   2> 13465 T155 oasc.Overseer$ClusterStateUpdater.updateState Update state numShards=1 message={
[junit4:junit4]   2> 	  "operation":"state",
[junit4:junit4]   2> 	  "numShards":"1",
[junit4:junit4]   2> 	  "shard":null,
[junit4:junit4]   2> 	  "roles":null,
[junit4:junit4]   2> 	  "state":"down",
[junit4:junit4]   2> 	  "core":"collection1",
[junit4:junit4]   2> 	  "collection":"collection1",
[junit4:junit4]   2> 	  "node_name":"127.0.0.1:14126_dgg%2Faf",
[junit4:junit4]   2> 	  "base_url":"http://127.0.0.1:14126/dgg/af"}
[junit4:junit4]   2> 13465 T155 oasc.Overseer$ClusterStateUpdater.updateState Collection already exists with numShards=1
[junit4:junit4]   2> 13465 T155 oasc.Overseer$ClusterStateUpdater.updateState Assigning new node to shard shard=shard1
[junit4:junit4]   2> 13479 T154 oascc.ZkStateReader$2.process A cluster state change: WatchedEvent state:SyncConnected type:NodeDataChanged path:/clusterstate.json, has occurred - updating... (live nodes size: 4)
[junit4:junit4]   2> 13479 T160 oascc.ZkStateReader$2.process A cluster state change: WatchedEvent state:SyncConnected type:NodeDataChanged path:/clusterstate.json, has occurred - updating... (live nodes size: 4)
[junit4:junit4]   2> 13479 T204 oascc.ZkStateReader$2.process A cluster state change: WatchedEvent state:SyncConnected type:NodeDataChanged path:/clusterstate.json, has occurred - updating... (live nodes size: 4)
[junit4:junit4]   2> 13479 T173 oascc.ZkStateReader$2.process A cluster state change: WatchedEvent state:SyncConnected type:NodeDataChanged path:/clusterstate.json, has occurred - updating... (live nodes size: 4)
[junit4:junit4]   2> 13479 T188 oascc.ZkStateReader$2.process A cluster state change: WatchedEvent state:SyncConnected type:NodeDataChanged path:/clusterstate.json, has occurred - updating... (live nodes size: 4)
[junit4:junit4]   2>  C16_STATE=coll:collection1 core:collection1 props:{shard=shard1, roles=null, state=recovering, core=collection1, collection=collection1, node_name=127.0.0.1:19007_dgg%2Faf, base_url=http://127.0.0.1:19007/dgg/af}
[junit4:junit4]   2> 14057 T191 C16 P19007 oasc.RecoveryStrategy.doRecovery Attempting to PeerSync from http://127.0.0.1:26711/dgg/af/collection1/ core=collection1 - recoveringAfterStartup=true
[junit4:junit4]   2> 14067 T191 C16 P19007 oascsi.HttpClientUtil.createClient Creating new http client, config:maxConnectionsPerHost=20&maxConnections=10000&connTimeout=30000&socketTimeout=30000&retry=false
[junit4:junit4]   2> 14088 T191 C16 P19007 oasu.PeerSync.sync PeerSync: core=collection1 url=http://127.0.0.1:19007/dgg/af START replicas=[http://127.0.0.1:26711/dgg/af/collection1/] nUpdates=100
[junit4:junit4]   2> 14098 T191 C16 P19007 oasu.PeerSync.sync WARNING no frame of reference to tell of we've missed updates
[junit4:junit4]   2> 14099 T191 C16 P19007 oasc.RecoveryStrategy.doRecovery PeerSync Recovery was not successful - trying replication. core=collection1
[junit4:junit4]   2> 14099 T191 C16 P19007 oasc.RecoveryStrategy.doRecovery Starting Replication Recovery. core=collection1
[junit4:junit4]   2> 14099 T191 C16 P19007 oasc.RecoveryStrategy.doRecovery Begin buffering updates. core=collection1
[junit4:junit4]   2> 14100 T191 C16 P19007 oasu.UpdateLog.bufferUpdates Starting to buffer updates. FSUpdateLog{state=ACTIVE, tlog=null}
[junit4:junit4]   2> 14100 T191 C16 P19007 oasc.RecoveryStrategy.replicate Attempting to replicate from http://127.0.0.1:26711/dgg/af/collection1/. core=collection1
[junit4:junit4]   2> 14100 T191 C16 P19007 oascsi.HttpClientUtil.createClient Creating new http client, config:maxConnections=128&maxConnectionsPerHost=32&followRedirects=false
[junit4:junit4]   2> ASYNC  NEW_CORE C17 name=collection1 org.apache.solr.core.SolrCore@929750e url=http://127.0.0.1:26711/dgg/af/collection1 node=127.0.0.1:26711_dgg%2Faf C17_STATE=coll:collection1 core:collection1 props:{shard=shard1, roles=null, state=active, core=collection1, collection=collection1, node_name=127.0.0.1:26711_dgg%2Faf, base_url=http://127.0.0.1:26711/dgg/af, leader=true}
[junit4:junit4]   2> 14132 T164 C17 P26711 REQ /get {getVersions=100&distrib=false&wt=javabin&qt=/get&version=2} status=0 QTime=1 
[junit4:junit4]   2> 14148 T165 C17 P26711 oasu.DirectUpdateHandler2.commit start commit{,optimize=false,openSearcher=false,waitSearcher=true,expungeDeletes=false,softCommit=false}
[junit4:junit4]   2> 14150 T165 C17 P26711 oasc.CachingDirectoryFactory.close Releasing directory:/usr/home/hudson/hudson-slave/workspace/Lucene-Solr-Tests-4.x-Java6/solr/build/solr-core/test/J0/./org.apache.solr.cloud.SyncSliceTest-1359666257762/jetty1
[junit4:junit4]   2> 14153 T165 C17 P26711 oasc.SolrDeletionPolicy.onInit SolrDeletionPolicy.onInit: commits:num=1
[junit4:junit4]   2> 		commit{dir=RateLimitedDirectoryWrapper(org.apache.lucene.store.NIOFSDirectory@/usr/home/hudson/hudson-slave/workspace/Lucene-Solr-Tests-4.x-Java6/solr/build/solr-core/test/J0/org.apache.solr.cloud.SyncSliceTest-1359666257762/jetty1/index lockFactory=org.apache.lucene.store.NativeFSLockFactory@6e4a084c),segFN=segments_1,generation=1,filenames=[segments_1]
[junit4:junit4]   2> 14154 T165 C17 P26711 oasc.SolrDeletionPolicy.updateCommits newest commit = 1[segments_1]
[junit4:junit4]   2> 14156 T165 C17 P26711 oasc.SolrDeletionPolicy.onCommit SolrDeletionPolicy.onCommit: commits:num=2
[junit4:junit4]   2> 		commit{dir=RateLimitedDirectoryWrapper(org.apache.lucene.store.NIOFSDirectory@/usr/home/hudson/hudson-slave/workspace/Lucene-Solr-Tests-4.x-Java6/solr/build/solr-core/test/J0/org.apache.solr.cloud.SyncSliceTest-1359666257762/jetty1/index lockFactory=org.apache.lucene.store.NativeFSLockFactory@6e4a084c),segFN=segments_1,generation=1,filenames=[segments_1]
[junit4:junit4]   2> 		commit{dir=RateLimitedDirectoryWrapper(org.apache.lucene.store.NIOFSDirectory@/usr/home/hudson/hudson-slave/workspace/Lucene-Solr-Tests-4.x-Java6/solr/build/solr-core/test/J0/org.apache.solr.cloud.SyncSliceTest-1359666257762/jetty1/index lockFactory=org.apache.lucene.store.NativeFSLockFactory@6e4a084c),segFN=segments_2,generation=2,filenames=[segments_2]
[junit4:junit4]   2> 14157 T165 C17 P26711 oasc.SolrDeletionPolicy.updateCommits newest commit = 2[segments_2]
[junit4:junit4]   2> 14157 T165 C17 P26711 oasc.CachingDirectoryFactory.close Releasing directory:/usr/home/hudson/hudson-slave/workspace/Lucene-Solr-Tests-4.x-Java6/solr/build/solr-core/test/J0/./org.apache.solr.cloud.SyncSliceTest-1359666257762/jetty1
[junit4:junit4]   2> 14158 T165 C17 P26711 oass.SolrIndexSearcher.<init> Opening Searcher@14b867db realtime
[junit4:junit4]   2> 14158 T165 C17 P26711 oasu.DirectUpdateHandler2.commit end_commit_flush
[junit4:junit4]   2> 14158 T165 C17 P26711 /update {waitSearcher=true&openSearcher=false&commit=true&wt=javabin&commit_end_point=true&version=2&softCommit=false} {commit=} 0 27
[junit4:junit4]   2> 14233 T191 C16 P19007 oash.ReplicationHandler.inform Commits will be reserved for  10000
[junit4:junit4]   2> 14234 T191 C16 P19007 oascsi.HttpClientUtil.createClient Creating new http client, config:connTimeout=5000&socketTimeout=20000&allowCompression=false&maxConnections=10000&maxConnectionsPerHost=10000
[junit4:junit4]   2> 14265 T191 C16 P19007 oash.SnapPuller.<init>  No value set for 'pollInterval'. Timer Task not started.
[junit4:junit4]   2> 14325 T166 C17 P26711 oash.ReplicationHandler.inform Commits will be reserved for  10000
[junit4:junit4]   2> 14325 T166 C17 P26711 REQ /replication {command=indexversion&qt=/replication&wt=javabin&version=2} status=0 QTime=57 
[junit4:junit4]   2> 14327 T191 C16 P19007 oash.SnapPuller.fetchLatestIndex Master's generation: 2
[junit4:junit4]   2> 14327 T191 C16 P19007 oash.SnapPuller.fetchLatestIndex Slave's generation: 1
[junit4:junit4]   2> 14327 T191 C16 P19007 oash.SnapPuller.fetchLatestIndex Starting replication process
[junit4:junit4]   2> 14330 T166 C17 P26711 oasc.CachingDirectoryFactory.close Releasing directory:/usr/home/hudson/hudson-slave/workspace/Lucene-Solr-Tests-4.x-Java6/solr/build/solr-core/test/J0/./org.apache.solr.cloud.SyncSliceTest-1359666257762/jetty1
[junit4:junit4]   2> 14330 T166 C17 P26711 oasc.CachingDirectoryFactory.close Releasing directory:/usr/home/hudson/hudson-slave/workspace/Lucene-Solr-Tests-4.x-Java6/solr/build/solr-core/test/J0/./org.apache.solr.cloud.SyncSliceTest-1359666257762/jetty1/index
[junit4:junit4]   2> 14331 T166 C17 P26711 REQ /replication {command=filelist&qt=/replication&wt=javabin&generation=2&version=2} status=0 QTime=2 
[junit4:junit4]   2> 14332 T191 C16 P19007 oash.SnapPuller.fetchLatestIndex Number of files in latest index in master: 1
[junit4:junit4]   2> 14333 T191 C16 P19007 oasc.CachingDirectoryFactory.get return new directory for /usr/home/hudson/hudson-slave/workspace/Lucene-Solr-Tests-4.x-Java6/solr/build/solr-core/test/J0/./org.apache.solr.cloud.SyncSliceTest-1359666257762/jetty2/index.20130131230432090 forceNew:false
[junit4:junit4]   2> 14333 T191 C16 P19007 oasc.CachingDirectoryFactory.close Releasing directory:/usr/home/hudson/hudson-slave/workspace/Lucene-Solr-Tests-4.x-Java6/solr/build/solr-core/test/J0/./org.apache.solr.cloud.SyncSliceTest-1359666257762/jetty2
[junit4:junit4]   2> 14333 T191 C16 P19007 oash.SnapPuller.fetchLatestIndex Starting download to RateLimitedDirectoryWrapper(org.apache.lucene.store.NIOFSDirectory@/usr/home/hudson/hudson-slave/workspace/Lucene-Solr-Tests-4.x-Java6/solr/build/solr-core/test/J0/org.apache.solr.cloud.SyncSliceTest-1359666257762/jetty2/index.20130131230432090 lockFactory=org.apache.lucene.store.NativeFSLockFactory@171ba877) fullCopy=true
[junit4:junit4]   2> 14345 T166 C17 P26711 REQ /replication {file=segments_2&command=filecontent&checksum=true&wt=filestream&qt=/replication&generation=2} status=0 QTime=5 
[junit4:junit4]   2> 14352 T191 C16 P19007 oasc.CachingDirectoryFactory.close Releasing directory:/usr/home/hudson/hudson-slave/workspace/Lucene-Solr-Tests-4.x-Java6/solr/build/solr-core/test/J0/./org.apache.solr.cloud.SyncSliceTest-1359666257762/jetty2/index
[junit4:junit4]   2> 14352 T191 C16 P19007 oash.SnapPuller.fetchLatestIndex Total time taken for download : 0 secs
[junit4:junit4]   2> 14354 T191 C16 P19007 oash.SnapPuller.modifyIndexProps New index installed. Updating index properties... index=index.20130131230432090
[junit4:junit4]   2> 14355 T191 C16 P19007 oasc.CachingDirectoryFactory.close Releasing directory:/usr/home/hudson/hudson-slave/workspace/Lucene-Solr-Tests-4.x-Java6/solr/build/solr-core/test/J0/./org.apache.solr.cloud.SyncSliceTest-1359666257762/jetty2
[junit4:junit4]   2> 14356 T191 C16 P19007 oasc.CachingDirectoryFactory.close Releasing directory:/usr/home/hudson/hudson-slave/workspace/Lucene-Solr-Tests-4.x-Java6/solr/build/solr-core/test/J0/./org.apache.solr.cloud.SyncSliceTest-1359666257762/jetty2
[junit4:junit4]   2> 14356 T191 C16 P19007 oasc.SolrCore.getNewIndexDir New index directory detected: old=./org.apache.solr.cloud.SyncSliceTest-1359666257762/jetty2/index/ new=./org.apache.solr.cloud.SyncSliceTest-1359666257762/jetty2/index.20130131230432090
[junit4:junit4]   2> 14361 T191 C16 P19007 oasc.SolrDeletionPolicy.onInit SolrDeletionPolicy.onInit: commits:num=1
[junit4:junit4]   2> 		commit{dir=RateLimitedDirectoryWrapper(org.apache.lucene.store.NIOFSDirectory@/usr/home/hudson/hudson-slave/workspace/Lucene-Solr-Tests-4.x-Java6/solr/build/solr-core/test/J0/org.apache.solr.cloud.SyncSliceTest-1359666257762/jetty2/index.20130131230432090 lockFactory=org.apache.lucene.store.NativeFSLockFactory@171ba877),segFN=segments_2,generation=2,filenames=[segments_2]
[junit4:junit4]   2> 14361 T191 C16 P19007 oasc.SolrDeletionPolicy.updateCommits newest commit = 2[segments_2]
[junit4:junit4]   2> 14362 T191 C16 P19007 oasc.CachingDirectoryFactory.close Releasing directory:/usr/home/hudson/hudson-slave/workspace/Lucene-Solr-Tests-4.x-Java6/solr/build/solr-core/test/J0/./org.apache.solr.cloud.SyncSliceTest-1359666257762/jetty2
[junit4:junit4]   2> 14368 T191 C16 P19007 oasu.DefaultSolrCoreState.newIndexWriter Creating new IndexWriter...
[junit4:junit4]   2> 14368 T191 C16 P19007 oasu.DefaultSolrCoreState.newIndexWriter Waiting until IndexWriter is unused... core=collection1
[junit4:junit4]   2> 14368 T191 C16 P19007 oasu.DefaultSolrCoreState.newIndexWriter Rollback old IndexWriter... core=collection1
[junit4:junit4]   2> 14369 T191 C16 P19007 oasc.CachingDirectoryFactory.close Releasing directory:/usr/home/hudson/hudson-slave/workspace/Lucene-Solr-Tests-4.x-Java6/solr/build/solr-core/test/J0/./org.apache.solr.cloud.SyncSliceTest-1359666257762/jetty2/index.20130131230432090
[junit4:junit4]   2> 14370 T191 C16 P19007 oasc.CachingDirectoryFactory.close Releasing directory:/usr/home/hudson/hudson-slave/workspace/Lucene-Solr-Tests-4.x-Java6/solr/build/solr-core/test/J0/./org.apache.solr.cloud.SyncSliceTest-1359666257762/jetty2
[junit4:junit4]   2> 14374 T191 C16 P19007 oasc.SolrDeletionPolicy.onInit SolrDeletionPolicy.onInit: commits:num=1
[junit4:junit4]   2> 		commit{dir=RateLimitedDirectoryWrapper(org.apache.lucene.store.NIOFSDirectory@/usr/home/hudson/hudson-slave/workspace/Lucene-Solr-Tests-4.x-Java6/solr/build/solr-core/test/J0/org.apache.solr.cloud.SyncSliceTest-1359666257762/jetty2/index.20130131230432090 lockFactory=org.apache.lucene.store.NativeFSLockFactory@171ba877),segFN=segments_2,generation=2,filenames=[segments_2]
[junit4:junit4]   2> 14374 T191 C16 P19007 oasc.SolrDeletionPolicy.updateCommits newest commit = 2[segments_2]
[junit4:junit4]   2> 14374 T191 C16 P19007 oasu.DefaultSolrCoreState.newIndexWriter New IndexWriter is ready to be used.
[junit4:junit4]   2> 14375 T191 C16 P19007 oasc.CachingDirectoryFactory.close Releasing directory:/usr/home/hudson/hudson-slave/workspace/Lucene-Solr-Tests-4.x-Java6/solr/build/solr-core/test/J0/./org.apache.solr.cloud.SyncSliceTest-1359666257762/jetty2
[junit4:junit4]   2> 14375 T191 C16 P19007 oass.SolrIndexSearcher.<init> Opening Searcher@21673408 main
[junit4:junit4]   2> 14377 T190 oasc.SolrCore.registerSearcher [collection1] Registered new searcher Searcher@21673408 main{StandardDirectoryReader(segments_2:1:nrt)}
[junit4:junit4]   2> 14377 T190 oasc.CachingDirectoryFactory.close Releasing directory:/usr/home/hudson/hudson-slave/workspace/Lucene-Solr-Tests-4.x-Java6/solr/build/solr-core/test/J0/./org.apache.solr.cloud.SyncSliceTest-1359666257762/jetty2/index
[junit4:junit4]   2> 14377 T191 C16 P19007 oasu.DirectUpdateHandler2.commit start commit{,optimize=false,openSearcher=false,waitSearcher=false,expungeDeletes=false,softCommit=false}
[junit4:junit4]   2> 14380 T191 C16 P19007 oasc.SolrDeletionPolicy.onCommit SolrDeletionPolicy.onCommit: commits:num=2
[junit4:junit4]   2> 		commit{dir=RateLimitedDirectoryWrapper(org.apache.lucene.store.NIOFSDirectory@/usr/home/hudson/hudson-slave/workspace/Lucene-Solr-Tests-4.x-Java6/solr/build/solr-core/test/J0/org.apache.solr.cloud.SyncSliceTest-1359666257762/jetty2/index.20130131230432090 lockFactory=org.apache.lucene.store.NativeFSLockFactory@171ba877),segFN=segments_2,generation=2,filenames=[segments_2]
[junit4:junit4]   2> 		commit{dir=RateLimitedDirectoryWrapper(org.apache.lucene.store.NIOFSDirectory@/usr/home/hudson/hudson-slave/workspace/Lucene-Solr-Tests-4.x-Java6/solr/build/solr-core/test/J0/org.apache.solr.cloud.SyncSliceTest-1359666257762/jetty2/index.20130131230432090 lockFactory=org.apache.lucene.store.NativeFSLockFactory@171ba877),segFN=segments_3,generation=3,filenames=[segments_3]
[junit4:junit4]   2> 14380 T191 C16 P19007 oasc.SolrDeletionPolicy.updateCommits newest commit = 3[segments_3]
[junit4:junit4]   2> 14381 T191 C16 P19007 oasc.CachingDirectoryFactory.close Releasing directory:/usr/home/hudson/hudson-slave/workspace/Lucene-Solr-Tests-4.x-Java6/solr/build/solr-core/test/J0/./org.apache.solr.cloud.SyncSliceTest-1359666257762/jetty2
[junit4:junit4]   2> 14381 T191 C16 P19007 oasu.DirectUpdateHandler2.commit end_commit_flush
[junit4:junit4]   2> 14382 T191 C16 P19007 oasc.CachingDirectoryFactory.close Releasing directory:/usr/home/hudson/hudson-slave/workspace/Lucene-Solr-Tests-4.x-Java6/solr/build/solr-core/test/J0/./org.apache.solr.cloud.SyncSliceTest-1359666257762/jetty2/index.20130131230432090
[junit4:junit4]   2> 14382 T191 C16 P19007 oasc.CachingDirectoryFactory.close Releasing directory:/usr/home/hudson/hudson-slave/workspace/Lucene-Solr-Tests-4.x-Java6/solr/build/solr-core/test/J0/./org.apache.solr.cloud.SyncSliceTest-1359666257762/jetty2/index
[junit4:junit4]   2> 14382 T191 C16 P19007 oasc.RecoveryStrategy.replay No replay needed. core=collection1
[junit4:junit4]   2> 14382 T191 C16 P19007 oasc.RecoveryStrategy.doRecovery Replication Recovery was successful - registering as Active. core=collection1
[junit4:junit4]   2> 14382 T191 C16 P19007 oasc.ZkController.publish publishing core=collection1 state=active
[junit4:junit4]   2> 14383 T191 C16 P19007 oasc.ZkController.publish numShards not found on descriptor - reading it from system property
[junit4:junit4]   2> 14390 T191 C16 P19007 oasc.RecoveryStrategy.doRecovery Finished recovery process. core=collection1
[junit4:junit4]   2> 14393 T205 oasc.CoreContainer.registerCore registering core: collection1
[junit4:junit4]   2> 14393 T205 oasc.ZkController.register Register replica - core:collection1 address:http://127.0.0.1:14126/dgg/af collection:collection1 shard:shard1
[junit4:junit4]   2> 14396 T205 oasc.ZkController.register We are http://127.0.0.1:14126/dgg/af/collection1/ and leader is http://127.0.0.1:26711/dgg/af/collection1/
[junit4:junit4]   2> 14396 T205 oasc.ZkController.register No LogReplay needed for core=collection1 baseURL=http://127.0.0.1:14126/dgg/af
[junit4:junit4]   2> 14397 T205 oasc.ZkController.checkRecovery Core needs to recover:collection1
[junit4:junit4]   2> 14397 T205 oasu.DefaultSolrCoreState.doRecovery Running recovery - first canceling any ongoing recovery
[junit4:junit4]   2> ASYNC  NEW_CORE C18 name=collection1 org.apache.solr.core.SolrCore@32e8f3eb url=http://127.0.0.1:14126/dgg/af/collection1 node=127.0.0.1:14126_dgg%2Faf C18_STATE=coll:collection1 core:collection1 props:{shard=null, roles=null, state=down, core=collection1, collection=collection1, node_name=127.0.0.1:14126_dgg%2Faf, base_url=http://127.0.0.1:14126/dgg/af}
[junit4:junit4]   2> 14397 T209 C18 P14126 oasc.RecoveryStrategy.run Starting recovery process.  core=collection1 recoveringAfterStartup=true
[junit4:junit4]   2> 14398 T209 C18 P14126 oasc.RecoveryStrategy.doRecovery ###### startupVersions=[]
[junit4:junit4]   2> 14398 T205 oascc.ZkStateReader.updateClusterState Updating cloud state from ZooKeeper... 
[junit4:junit4]   2> 14398 T209 C18 P14126 oasc.ZkController.publish publishing core=collection1 state=recovering
[junit4:junit4]   2> 14398 T209 C18 P14126 oasc.ZkController.publish numShards not found on descriptor - reading it from system property
[junit4:junit4]   2> 14399 T132 oass.SolrDispatchFilter.init user.dir=/usr/home/hudson/hudson-slave/workspace/Lucene-Solr-Tests-4.x-Java6/solr/build/solr-core/test/J0
[junit4:junit4]   2> 14399 T132 oass.SolrDispatchFilter.init SolrDispatchFilter.init() done
[junit4:junit4]   2> 14399 T132 oascsi.HttpClientUtil.createClient Creating new http client, config:maxConnections=128&maxConnectionsPerHost=32&followRedirects=false
[junit4:junit4]   2> 14400 T209 C18 P14126 oascsi.HttpClientUtil.createClient Creating new http client, config:maxConnections=128&maxConnectionsPerHost=32&followRedirects=false
[junit4:junit4]   2> 14556 T132 oejs.Server.doStart jetty-8.1.8.v20121106
[junit4:junit4]   2> 14558 T132 oejs.AbstractConnector.doStart Started SocketConnector@127.0.0.1:45501
[junit4:junit4]   2> 14559 T132 oass.SolrDispatchFilter.init SolrDispatchFilter.init()
[junit4:junit4]   2> 14559 T132 oasc.SolrResourceLoader.locateSolrHome JNDI not configured for solr (NoInitialContextEx)
[junit4:junit4]   2> 14559 T132 oasc.SolrResourceLoader.locateSolrHome using system property solr.solr.home: /usr/home/hudson/hudson-slave/workspace/Lucene-Solr-Tests-4.x-Java6/solr/build/solr-core/test/J0/./org.apache.solr.cloud.SyncSliceTest-jetty4-1359666272171
[junit4:junit4]   2> 14560 T132 oasc.CoreContainer$Initializer.initialize looking for solr.xml: /usr/home/hudson/hudson-slave/workspace/Lucene-Solr-Tests-4.x-Java6/solr/build/solr-core/test/J0/./org.apache.solr.cloud.SyncSliceTest-jetty4-1359666272171/solr.xml
[junit4:junit4]   2> 14560 T132 oasc.CoreContainer.<init> New CoreContainer 1563674250
[junit4:junit4]   2> 14560 T132 oasc.CoreContainer.load Loading CoreContainer using Solr Home: '/usr/home/hudson/hudson-slave/workspace/Lucene-Solr-Tests-4.x-Java6/solr/build/solr-core/test/J0/./org.apache.solr.cloud.SyncSliceTest-jetty4-1359666272171/'
[junit4:junit4]   2> 14561 T132 oasc.SolrResourceLoader.<init> new SolrResourceLoader for directory: '/usr/home/hudson/hudson-slave/workspace/Lucene-Solr-Tests-4.x-Java6/solr/build/solr-core/test/J0/./org.apache.solr.cloud.SyncSliceTest-jetty4-1359666272171/'
[junit4:junit4]   2> 14600 T132 oashc.HttpShardHandlerFactory.getParameter Setting socketTimeout to: 60000
[junit4:junit4]   2> 14601 T132 oashc.HttpShardHandlerFactory.getParameter Setting urlScheme to: http://
[junit4:junit4]   2> 14601 T132 oashc.HttpShardHandlerFactory.getParameter Setting connTimeout to: 15000
[junit4:junit4]   2> 14601 T132 oashc.HttpShardHandlerFactory.getParameter Setting maxConnectionsPerHost to: 20
[junit4:junit4]   2> 14602 T132 oashc.HttpShardHandlerFactory.getParameter Setting corePoolSize to: 0
[junit4:junit4]   2> 14602 T132 oashc.HttpShardHandlerFactory.getParameter Setting maximumPoolSize to: 2147483647
[junit4:junit4]   2> 14602 T132 oashc.HttpShardHandlerFactory.getParameter Setting maxThreadIdleTime to: 5
[junit4:junit4]   2> 14603 T132 oashc.HttpShardHandlerFactory.getParameter Setting sizeOfQueue to: -1
[junit4:junit4]   2> 14603 T132 oashc.HttpShardHandlerFactory.getParameter Setting fairnessPolicy to: false
[junit4:junit4]   2> 14603 T132 oascsi.HttpClientUtil.createClient Creating new http client, config:maxConnectionsPerHost=20&maxConnections=10000&socketTimeout=60000&connTimeout=15000&retry=false
[junit4:junit4]   2> 14620 T132 oasc.CoreContainer.load Registering Log Listener
[junit4:junit4]   2> 14636 T132 oasc.CoreContainer.initZooKeeper Zookeeper client=127.0.0.1:58058/solr
[junit4:junit4]   2> 14636 T132 oasc.ZkController.checkChrootPath zkHost includes chroot
[junit4:junit4]   2> 14637 T132 oaz.ZooKeeper.<init> Initiating client connection, connectString=127.0.0.1:58058 sessionTimeout=60000 watcher=org.apache.solr.common.cloud.ConnectionManager@1c57a236
[junit4:junit4]   2> 14637 T132 oascc.ConnectionManager.waitForConnected Waiting for client to connect to ZooKeeper
[junit4:junit4]   2> 14638 T219 oaz.ClientCnxn$SendThread.logStartConnect Opening socket connection to server localhost/127.0.0.1:58058. Will not attempt to authenticate using SASL (access denied (javax.security.auth.AuthPermission getLoginConfiguration))
[junit4:junit4]   2> 14639 T219 oaz.ClientCnxn$SendThread.primeConnection Socket connection established to localhost/127.0.0.1:58058, initiating session
[junit4:junit4]   2> 14639 T134 oazs.NIOServerCnxnFactory.run Accepted socket connection from /140.211.11.196:52773
[junit4:junit4]   2> 14639 T134 oazs.ZooKeeperServer.processConnectRequest Client attempting to establish new session at /140.211.11.196:52773
[junit4:junit4]   2> 14640 T136 oazs.ZooKeeperServer.finishSessionInit Established session 0x13c926c9f68000b with negotiated timeout 20000 for client /140.211.11.196:52773
[junit4:junit4]   2> 14640 T219 oaz.ClientCnxn$SendThread.onConnected Session establishment complete on server localhost/127.0.0.1:58058, sessionid = 0x13c926c9f68000b, negotiated timeout = 20000
[junit4:junit4]   2> 14641 T220 oascc.ConnectionManager.process Watcher org.apache.solr.common.cloud.ConnectionManager@1c57a236 name:ZooKeeperConnection Watcher:127.0.0.1:58058 got event WatchedEvent state:SyncConnected type:None path:null path:null type:None
[junit4:junit4]   2> 14641 T132 oascc.ConnectionManager.waitForConnected Client is connected to ZooKeeper
[junit4:junit4]   2> 14642 T137 oazs.PrepRequestProcessor.pRequest2Txn Processed session termination for sessionid: 0x13c926c9f68000b
[junit4:junit4]   2> 14643 T220 oaz.ClientCnxn$EventThread.run EventThread shut down
[junit4:junit4]   2> 14643 T134 oazs.NIOServerCnxn.closeSock Closed socket connection for client /140.211.11.196:52773 which had sessionid 0x13c926c9f68000b
[junit4:junit4]   2> 14643 T132 oaz.ZooKeeper.close Session: 0x13c926c9f68000b closed
[junit4:junit4]   2> 14643 T132 oascsi.HttpClientUtil.createClient Creating new http client, config:maxConnections=500&maxConnectionsPerHost=16&socketTimeout=60000&connTimeout=15000
[junit4:junit4]   2> 14651 T132 oaz.ZooKeeper.<init> Initiating client connection, connectString=127.0.0.1:58058/solr sessionTimeout=30000 watcher=org.apache.solr.common.cloud.ConnectionManager@647909a7
[junit4:junit4]   2> 14652 T132 oascc.ConnectionManager.waitForConnected Waiting for client to connect to ZooKeeper
[junit4:junit4]   2> 14652 T221 oaz.ClientCnxn$SendThread.logStartConnect Opening socket connection to server localhost/127.0.0.1:58058. Will not attempt to authenticate using SASL (access denied (javax.security.auth.AuthPermission getLoginConfiguration))
[junit4:junit4]   2> 14652 T221 oaz.ClientCnxn$SendThread.primeConnection Socket connection established to localhost/127.0.0.1:58058, initiating session
[junit4:junit4]   2> 14652 T134 oazs.NIOServerCnxnFactory.run Accepted socket connection from /140.211.11.196:45333
[junit4:junit4]   2> 14652 T134 oazs.ZooKeeperServer.processConnectRequest Client attempting to establish new session at /140.211.11.196:45333
[junit4:junit4]   2> 14654 T136 oazs.ZooKeeperServer.finishSessionInit Established session 0x13c926c9f68000c with negotiated timeout 20000 for client /140.211.11.196:45333
[junit4:junit4]   2> 14654 T221 oaz.ClientCnxn$SendThread.onConnected Session establishment complete on server localhost/127.0.0.1:58058, sessionid = 0x13c926c9f68000c, negotiated timeout = 20000
[junit4:junit4]   2> 14654 T222 oascc.ConnectionManager.process Watcher org.apache.solr.common.cloud.ConnectionManager@647909a7 name:ZooKeeperConnection Watcher:127.0.0.1:58058/solr got event WatchedEvent state:SyncConnected type:None path:null path:null type:None
[junit4:junit4]   2> 14654 T132 oascc.ConnectionManager.waitForConnected Client is connected to ZooKeeper
[junit4:junit4]   2> 14655 T137 oazs.PrepRequestProcessor.pRequest Got user-level KeeperException when processing sessionid:0x13c926c9f68000c type:create cxid:0x1 zxid:0x93 txntype:-1 reqpath:n/a Error Path:/solr/overseer Error:KeeperErrorCode = NodeExists for /solr/overseer
[junit4:junit4]   2> 14656 T137 oazs.PrepRequestProcessor.pRequest Got user-level KeeperException when processing sessionid:0x13c926c9f68000c type:create cxid:0x2 zxid:0x94 txntype:-1 reqpath:n/a Error Path:/solr/overseer Error:KeeperErrorCode = NodeExists for /solr/overseer
[junit4:junit4]   2> 14664 T132 oasc.ZkController.createEphemeralLiveNode Register node as live in ZooKeeper:/live_nodes/127.0.0.1:45501_dgg%2Faf
[junit4:junit4]   2> 14665 T137 oazs.PrepRequestProcessor.pRequest Got user-level KeeperException when processing sessionid:0x13c926c9f68000c type:delete cxid:0x4 zxid:0x95 txntype:-1 reqpath:n/a Error Path:/solr/live_nodes/127.0.0.1:45501_dgg%2Faf Error:KeeperErrorCode = NoNode for /solr/live_nodes/127.0.0.1:45501_dgg%2Faf
[junit4:junit4]   2> 14666 T132 oascc.SolrZkClient.makePath makePath: /live_nodes/127.0.0.1:45501_dgg%2Faf
[junit4:junit4]   2> 14668 T204 oascc.ZkStateReader$2.process A cluster state change: WatchedEvent state:SyncConnected type:NodeChildrenChanged path:/live_nodes, has occurred - updating... (live nodes size: 4)
[junit4:junit4]   2> 14668 T188 oascc.ZkStateReader$2.process A cluster state change: WatchedEvent state:SyncConnected type:NodeChildrenChanged path:/live_nodes, has occurred - updating... (live nodes size: 4)
[junit4:junit4]   2> 14669 T173 oascc.ZkStateReader$3.process Updating live nodes... (5)
[junit4:junit4]   2> 14669 T160 oascc.ZkStateReader$3.process Updating live nodes... (5)
[junit4:junit4]   2> 14669 T173 oascc.ZkStateReader$2.process A cluster state change: WatchedEvent state:SyncConnected type:NodeChildrenChanged path:/live_nodes, has occurred - updating... (live nodes size: 5)
[junit4:junit4]   2> 14669 T160 oascc.ZkStateReader$2.process A cluster state change: WatchedEvent state:SyncConnected type:NodeChildrenChanged path:/live_nodes, has occurred - updating... (live nodes size: 5)
[junit4:junit4]   2> 14669 T154 oascc.ZkStateReader$3.process Updating live nodes... (5)
[junit4:junit4]   2> 14669 T154 oascc.ZkStateReader$2.process A cluster state change: WatchedEvent state:SyncConnected type:NodeChildrenChanged path:/live_nodes, has occurred - updating... (live nodes size: 5)
[junit4:junit4]   2> 14671 T204 oascc.ZkStateReader$3.process Updating live nodes... (5)
[junit4:junit4]   2> 14672 T188 oascc.ZkStateReader$3.process Updating live nodes... (5)
[junit4:junit4]   2> 14673 T132 oascc.ZkStateReader.createClusterStateWatchersAndUpdate Updating cluster state from ZooKeeper... 
[junit4:junit4]   2> 14679 T223 oasc.CoreContainer.create Creating SolrCore 'collection1' using instanceDir: /usr/home/hudson/hudson-slave/workspace/Lucene-Solr-Tests-4.x-Java6/solr/build/solr-core/test/J0/./org.apache.solr.cloud.SyncSliceTest-jetty4-1359666272171/collection1
[junit4:junit4]   2> 14679 T223 oasc.ZkController.createCollectionZkNode Check for collection zkNode:collection1
[junit4:junit4]   2> 14680 T223 oasc.ZkController.createCollectionZkNode Collection zkNode exists
[junit4:junit4]   2> 14680 T223 oasc.ZkController.readConfigName Load collection config from:/collections/collection1
[junit4:junit4]   2> 14688 T223 oasc.SolrResourceLoader.<init> new SolrResourceLoader for directory: '/usr/home/hudson/hudson-slave/workspace/Lucene-Solr-Tests-4.x-Java6/solr/build/solr-core/test/J0/./org.apache.solr.cloud.SyncSliceTest-jetty4-1359666272171/collection1/'
[junit4:junit4]   2> 14689 T223 oasc.SolrResourceLoader.replaceClassLoader Adding 'file:/usr/home/hudson/hudson-slave/workspace/Lucene-Solr-Tests-4.x-Java6/solr/build/solr-core/test/J0/org.apache.solr.cloud.SyncSliceTest-jetty4-1359666272171/collection1/lib/classes/' to classloader
[junit4:junit4]   2> 14689 T223 oasc.SolrResourceLoader.replaceClassLoader Adding 'file:/usr/home/hudson/hudson-slave/workspace/Lucene-Solr-Tests-4.x-Java6/solr/build/solr-core/test/J0/org.apache.solr.cloud.SyncSliceTest-jetty4-1359666272171/collection1/lib/README' to classloader
[junit4:junit4]   2> 14737 T223 oasc.SolrConfig.<init> Using Lucene MatchVersion: LUCENE_42
[junit4:junit4]   2> 14803 T223 oasc.SolrConfig.<init> Loaded SolrConfig: solrconfig.xml
[junit4:junit4]   2> 14905 T223 oass.IndexSchema.readSchema Reading Solr Schema
[junit4:junit4]   2> 14913 T223 oass.IndexSchema.readSchema Schema name=test
[junit4:junit4]   2> 14986 T155 oascc.ZkStateReader.updateClusterState Updating cloud state from ZooKeeper... 
[junit4:junit4]   2> 14987 T155 oasc.Overseer$ClusterStateUpdater.updateState Update state numShards=1 message={
[junit4:junit4]   2> 	  "operation":"state",
[junit4:junit4]   2> 	  "numShards":"1",
[junit4:junit4]   2> 	  "shard":"shard1",
[junit4:junit4]   2> 	  "roles":null,
[junit4:junit4]   2> 	  "state":"active",
[junit4:junit4]   2> 	  "core":"collection1",
[junit4:junit4]   2> 	  "collection":"collection1",
[junit4:junit4]   2> 	  "node_name":"127.0.0.1:19007_dgg%2Faf",
[junit4:junit4]   2> 	  "base_url":"http://127.0.0.1:19007/dgg/af"}
[junit4:junit4]   2> 14992 T155 oasc.Overseer$ClusterStateUpdater.updateState Update state numShards=1 message={
[junit4:junit4]   2> 	  "operation":"state",
[junit4:junit4]   2> 	  "numShards":"1",
[junit4:junit4]   2> 	  "shard":"shard1",
[junit4:junit4]   2> 	  "roles":null,
[junit4:junit4]   2> 	  "state":"recovering",
[junit4:junit4]   2> 	  "core":"collection1",
[junit4:junit4]   2> 	  "collection":"collection1",
[junit4:junit4]   2> 	  "node_name":"127.0.0.1:14126_dgg%2Faf",
[junit4:junit4]   2> 	  "base_url":"http://127.0.0.1:14126/dgg/af"}
[junit4:junit4]   2> 15004 T160 oascc.ZkStateReader$2.process A cluster state change: WatchedEvent state:SyncConnected type:NodeDataChanged path:/clusterstate.json, has occurred - updating... (live nodes size: 5)
[junit4:junit4]   2> 15004 T173 oascc.ZkStateReader$2.process A cluster state change: WatchedEvent state:SyncConnected type:NodeDataChanged path:/clusterstate.json, has occurred - updating... (live nodes size: 5)
[junit4:junit4]   2> 15004 T222 oascc.ZkStateReader$2.process A cluster state change: WatchedEvent state:SyncConnected type:NodeDataChanged path:/clusterstate.json, has occurred - updating... (live nodes size: 5)
[junit4:junit4]   2> 15004 T204 oascc.ZkStateReader$2.process A cluster state change: WatchedEvent state:SyncConnected type:NodeDataChanged path:/clusterstate.json, has occurred - updating... (live nodes size: 5)
[junit4:junit4]   2> 15004 T154 oascc.ZkStateReader$2.process A cluster state change: WatchedEvent state:SyncConnected type:NodeDataChanged path:/clusterstate.json, has occurred - updating... (live nodes size: 5)
[junit4:junit4]   2> 15004 T188 oascc.ZkStateReader$2.process A cluster state change: WatchedEvent state:SyncConnected type:NodeDataChanged path:/clusterstate.json, has occurred - updating... (live nodes size: 5)
[junit4:junit4]   2> 15521 T223 oass.OpenExchangeRatesOrgProvider.init Initialized with rates=open-exchange-rates.json, refreshInterval=1440.
[junit4:junit4]   2> 15543 T223 oass.IndexSchema.readSchema default search field in schema is text
[junit4:junit4]   2> 15548 T223 oass.IndexSchema.readSchema unique key field: id
[junit4:junit4]   2> 15569 T223 oass.FileExchangeRateProvider.reload Reloading exchange rates from file currency.xml
[junit4:junit4]   2> 15575 T223 oass.FileExchangeRateProvider.reload Reloading exchange rates from file currency.xml
[junit4:junit4]   2> 15580 T223 oass.OpenExchangeRatesOrgProvider.reload Reloading exchange rates from open-exchange-rates.json
[junit4:junit4]   2> 15582 T223 oass.OpenExchangeRatesOrgProvider.reload Reloading exchange rates from open-exchange-rates.json
[junit4:junit4]   2> 15584 T223 oasc.SolrCore.<init> [collection1] Opening new SolrCore at /usr/home/hudson/hudson-slave/workspace/Lucene-Solr-Tests-4.x-Java6/solr/build/solr-core/test/J0/./org.apache.solr.cloud.SyncSliceTest-jetty4-1359666272171/collection1/, dataDir=./org.apache.solr.cloud.SyncSliceTest-1359666257762/jetty4/
[junit4:junit4]   2> 15584 T223 oasc.JmxMonitoredMap.<init> JMX monitoring is enabled. Adding Solr mbeans to JMX Server: com.sun.jmx.mbeanserver.JmxMBeanServer@39320a41
[junit4:junit4]   2> 15585 T223 oasc.SolrCore.initDirectoryFactory solr.StandardDirectoryFactory
[junit4:junit4]   2> 15586 T223 oasc.CachingDirectoryFactory.get return new directory for /usr/home/hudson/hudson-slave/workspace/Lucene-Solr-Tests-4.x-Java6/solr/build/solr-core/test/J0/./org.apache.solr.cloud.SyncSliceTest-1359666257762/jetty4 forceNew:false
[junit4:junit4]   2> 15586 T223 oasc.CachingDirectoryFactory.close Releasing directory:/usr/home/hudson/hudson-slave/workspace/Lucene-Solr-Tests-4.x-Java6/solr/build/solr-core/test/J0/./org.apache.solr.cloud.SyncSliceTest-1359666257762/jetty4
[junit4:junit4]   2> 15587 T223 oasc.SolrCore.getNewIndexDir New index directory detected: old=null new=./org.apache.solr.cloud.SyncSliceTest-1359666257762/jetty4/index/
[junit4:junit4]   2> 15587 T223 oasc.SolrCore.initIndex WARNING [collection1] Solr index directory './org.apache.solr.cloud.SyncSliceTest-1359666257762/jetty4/index' doesn't exist. Creating new index...
[junit4:junit4]   2> 15588 T223 oasc.CachingDirectoryFactory.get return new directory for /usr/home/hudson/hudson-slave/workspace/Lucene-Solr-Tests-4.x-Java6/solr/build/solr-core/test/J0/./org.apache.solr.cloud.SyncSliceTest-1359666257762/jetty4/index forceNew:false
[junit4:junit4]   2> 15595 T223 oasc.SolrDeletionPolicy.onCommit SolrDeletionPolicy.onCommit: commits:num=1
[junit4:junit4]   2> 		commit{dir=RateLimitedDirectoryWrapper(org.apache.lucene.store.NIOFSDirectory@/usr/home/hudson/hudson-slave/workspace/Lucene-Solr-Tests-4.x-Java6/solr/build/solr-core/test/J0/org.apache.solr.cloud.SyncSliceTest-1359666257762/jetty4/index lockFactory=org.apache.lucene.store.NativeFSLockFactory@426e95e9),segFN=segments_1,generation=1,filenames=[segments_1]
[junit4:junit4]   2> 15595 T223 oasc.SolrDeletionPolicy.updateCommits newest commit = 1[segments_1]
[junit4:junit4]   2> 15596 T223 oasc.CachingDirectoryFactory.close Releasing directory:/usr/home/hudson/hudson-slave/workspace/Lucene-Solr-Tests-4.x-Java6/solr/build/solr-core/test/J0/./org.apache.solr.cloud.SyncSliceTest-1359666257762/jetty4/index
[junit4:junit4]   2> 15596 T223 oasc.SolrCore.initWriters created xml: solr.XMLResponseWriter
[junit4:junit4]   2> 15599 T223 oasup.UpdateRequestProcessorChain.init inserting DistributedUpdateProcessorFactory into updateRequestProcessorChain "dedupe"
[junit4:junit4]   2> 15599 T223 oasup.UpdateRequestProcessorChain.init inserting DistributedUpdateProcessorFactory into updateRequestProcessorChain "dedupe-allfields"
[junit4:junit4]   2> 15600 T223 oasup.UpdateRequestProcessorChain.init inserting DistributedUpdateProcessorFactory into updateRequestProcessorChain "stored_sig"
[junit4:junit4]   2> 15600 T223 oasup.UpdateRequestProcessorChain.init inserting DistributedUpdateProcessorFactory into updateRequestProcessorChain "uniq-fields"
[junit4:junit4]   2> 15601 T223 oasup.UpdateRequestProcessorChain.init inserting DistributedUpdateProcessorFactory into updateRequestProcessorChain "distrib-dup-test-chain-implicit"
[junit4:junit4]   2> 15601 T223 oasc.RequestHandlers.initHandlersFromConfig adding lazy requestHandler: solr.ReplicationHandler
[junit4:junit4]   2> 15602 T223 oasc.RequestHandlers.initHandlersFromConfig created /replication: solr.ReplicationHandler
[junit4:junit4]   2> 15602 T223 oasc.RequestHandlers.initHandlersFromConfig created standard: solr.StandardRequestHandler
[junit4:junit4]   2> 15603 T223 oasc.RequestHandlers.initHandlersFromConfig created /get: solr.RealTimeGetHandler
[junit4:junit4]   2> 15603 T223 oasc.RequestHandlers.initHandlersFromConfig created dismax: solr.SearchHandler
[junit4:junit4]   2> 15604 T223 oasc.RequestHandlers.initHandlersFromConfig created mock: org.apache.solr.core.MockQuerySenderListenerReqHandler
[junit4:junit4]   2> 15605 T223 oasc.RequestHandlers.initHandlersFromConfig created /admin/: org.apache.solr.handler.admin.AdminHandlers
[junit4:junit4]   2> 15605 T223 oasc.RequestHandlers.initHandlersFromConfig created defaults: solr.StandardRequestHandler
[junit4:junit4]   2> 15605 T223 oasc.RequestHandlers.initHandlersFromConfig adding lazy requestHandler: solr.StandardRequestHandler
[junit4:junit4]   2> 15606 T223 oasc.RequestHandlers.initHandlersFromConfig created lazy: solr.StandardRequestHandler
[junit4:junit4]   2> 15606 T223 oasc.RequestHandlers.initHandlersFromConfig created /update: solr.UpdateRequestHandler
[junit4:junit4]   2> 15607 T223 oasc.RequestHandlers.initHandlersFromConfig created /terms: org.apache.solr.handler.component.SearchHandler
[junit4:junit4]   2> 15608 T223 oasc.RequestHandlers.initHandlersFromConfig created spellCheckCompRH: org.apache.solr.handler.component.SearchHandler
[junit4:junit4]   2> 15608 T223 oasc.RequestHandlers.initHandlersFromConfig created spellCheckCompRH_Direct: org.apache.solr.handler.component.SearchHandler
[junit4:junit4]   2> 15609 T223 oasc.RequestHandlers.initHandlersFromConfig created spellCheckWithWordbreak: org.apache.solr.handler.component.SearchHandler
[junit4:junit4]   2> 15609 T223 oasc.RequestHandlers.initHandlersFromConfig created spellCheckWithWordbreak_Direct: org.apache.solr.handler.component.SearchHandler
[junit4:junit4]   2> 15610 T223 oasc.RequestHandlers.initHandlersFromConfig created spellCheckCompRH1: org.apache.solr.handler.component.SearchHandler
[junit4:junit4]   2> 15611 T223 oasc.RequestHandlers.initHandlersFromConfig created mltrh: org.apache.solr.handler.component.SearchHandler
[junit4:junit4]   2> 15611 T223 oasc.RequestHandlers.initHandlersFromConfig created tvrh: org.apache.solr.handler.component.SearchHandler
[junit4:junit4]   2> 15612 T223 oasc.RequestHandlers.initHandlersFromConfig created /mlt: solr.MoreLikeThisHandler
[junit4:junit4]   2> 15613 T223 oasc.RequestHandlers.initHandlersFromConfig created /debug/dump: solr.DumpRequestHandler
[junit4:junit4]   2> 15622 T223 oashl.XMLLoader.init xsltCacheLifetimeSeconds=60
[junit4:junit4]   2> 15628 T223 oasc.SolrCore.initDeprecatedSupport WARNING solrconfig.xml uses deprecated <admin/gettableFiles>, Please update your config to use the ShowFileRequestHandler.
[junit4:junit4]   2> 15629 T223 oasc.SolrCore.initDeprecatedSupport WARNING adding ShowFileRequestHandler with hidden files: [SCHEMA.XML, OLD_SYNONYMS.TXT, STOPWORDS.TXT, PROTWORDS.TXT, OPEN-EXCHANGE-RATES.JSON, SYNONYMS.TXT, CURRENCY.XML, MAPPING-ISOLATIN1ACCENT.TXT]
[junit4:junit4]   2> 15632 T223 oasc.CachingDirectoryFactory.close Releasing directory:/usr/home/hudson/hudson-slave/workspace/Lucene-Solr-Tests-4.x-Java6/solr/build/solr-core/test/J0/./org.apache.solr.cloud.SyncSliceTest-1359666257762/jetty4
[junit4:junit4]   2> 15634 T223 oass.SolrIndexSearcher.<init> Opening Searcher@632c13a2 main
[junit4:junit4]   2> 15635 T223 oasu.CommitTracker.<init> Hard AutoCommit: disabled
[junit4:junit4]   2> 15636 T223 oasu.CommitTracker.<init> Soft AutoCommit: disabled
[junit4:junit4]   2> 15636 T223 oashc.SpellCheckComponent.inform Initializing spell checkers
[junit4:junit4]   2> 15708 T223 oass.DirectSolrSpellChecker.init init: {name=direct,classname=DirectSolrSpellChecker,field=lowerfilt,minQueryLength=3}
[junit4:junit4]   2> 15942 T224 oasc.SolrCore.registerSearcher [collection1] Registered new searcher Searcher@632c13a2 main{StandardDirectoryReader(segments_1:1)}
[junit4:junit4]   2> 15949 T223 oasc.ZkController.publish publishing core=collection1 state=down
[junit4:junit4]   2> 15949 T223 oasc.ZkController.publish numShards not found on descriptor - reading it from system property
[junit4:junit4]   2> 16519 T155 oascc.ZkStateReader.updateClusterState Updating cloud state from ZooKeeper... 
[junit4:junit4]   2> 16521 T155 oasc.Overseer$ClusterStateUpdater.updateState Update state numShards=1 message={
[junit4:junit4]   2> 	  "operation":"state",
[junit4:junit4]   2> 	  "numShards":"1",
[junit4:junit4]   2> 	  "shard":null,
[junit4:junit4]   2> 	  "roles":null,
[junit4:junit4]   2> 	  "state":"down",
[junit4:junit4]   2> 	  "core":"collection1",
[junit4:junit4]   2> 	  "collection":"collection1",
[junit4:junit4]   2> 	  "node_name":"127.0.0.1:45501_dgg%2Faf",
[junit4:junit4]   2> 	  "base_url":"http://127.0.0.1:45501/dgg/af"}
[junit4:junit4]   2> 16521 T155 oasc.Overseer$ClusterStateUpdater.updateState Collection already exists with numShards=1
[junit4:junit4]   2> 16521 T155 oasc.Overseer$ClusterStateUpdater.updateState Assigning new node to shard shard=shard1
[junit4:junit4]   2> 16566 T154 oascc.ZkStateReader$2.process A cluster state change: WatchedEvent state:SyncConnected type:NodeDataChanged path:/clusterstate.json, has occurred - updating... (live nodes size: 5)
[junit4:junit4]   2> 16566 T204 oascc.ZkStateReader$2.process A cluster state change: WatchedEvent state:SyncConnected type:NodeDataChanged path:/clusterstate.json, has occurred - updating... (live nodes size: 5)
[junit4:junit4]   2> 16566 T160 oascc.ZkStateReader$2.process A cluster state change: WatchedEvent state:SyncConnected type:NodeDataChanged path:/clusterstate.json, has occurred - updating... (live nodes size: 5)
[junit4:junit4]   2> 16566 T188 oascc.ZkStateReader$2.process A cluster state change: WatchedEvent state:SyncConnected type:NodeDataChanged path:/clusterstate.json, has occurred - updating... (live nodes size: 5)
[junit4:junit4]   2> 16566 T173 oascc.ZkStateReader$2.process A cluster state change: WatchedEvent state:SyncConnected type:NodeDataChanged path:/clusterstate.json, has occurred - updating... (live nodes size: 5)
[junit4:junit4]   2> 16566 T222 oascc.ZkStateReader$2.process A cluster state change: WatchedEvent state:SyncConnected type:NodeDataChanged path:/clusterstate.json, has occurred - updating... (live nodes size: 5)
[junit4:junit4]   2> 16953 T223 oasc.CoreContainer.registerCore registering core: collection1
[junit4:junit4]   2> 16953 T223 oasc.ZkController.register Register replica - core:collection1 address:http://127.0.0.1:45501/dgg/af collection:collection1 shard:shard1
[junit4:junit4]   2> 16959 T223 oasc.ZkController.register We are http://127.0.0.1:45501/dgg/af/collection1/ and leader is http://127.0.0.1:26711/dgg/af/collection1/
[junit4:junit4]   2> 16959 T223 oasc.ZkController.register No LogReplay needed for core=collection1 baseURL=http://127.0.0.1:45501/dgg/af
[junit4:junit4]   2> 16959 T223 oasc.ZkController.checkRecovery Core needs to recover:collection1
[junit4:junit4]   2> 16960 T223 oasu.DefaultSolrCoreState.doRecovery Running recovery - first canceling any ongoing recovery
[junit4:junit4]   2> ASYNC  NEW_CORE C19 name=collection1 org.apache.solr.core.SolrCore@51b30472 url=http://127.0.0.1:45501/dgg/af/collection1 node=127.0.0.1:45501_dgg%2Faf C19_STATE=coll:collection1 core:collection1 props:{shard=null, roles=null, state=down, core=collection1, collection=collection1, node_name=127.0.0.1:45501_dgg%2Faf, base_url=http://127.0.0.1:45501/dgg/af}
[junit4:junit4]   2> 16960 T225 C19 P45501 oasc.RecoveryStrategy.run Starting recovery process.  core=collection1 recoveringAfterStartup=true
[junit4:junit4]   2> 16961 T225 C19 P45501 oasc.RecoveryStrategy.doRecovery ###### startupVersions=[]
[junit4:junit4]   2> 16961 T225 C19 P45501 oasc.ZkController.publish publishing core=collection1 state=recovering
[junit4:junit4]   2> 16961 T225 C19 P45501 oasc.ZkController.publish numShards not found on descriptor - reading it from system property
[junit4:junit4]   2> 16961 T223 oascc.ZkStateReader.updateClusterState Updating cloud state from ZooKeeper... 
[junit4:junit4]   2> 16963 T225 C19 P45501 oascsi.HttpClientUtil.createClient Creating new http client, config:maxConnections=128&maxConnectionsPerHost=32&followRedirects=false
[junit4:junit4]   2> 16964 T132 oass.SolrDispatchFilter.init user.dir=/usr/home/hudson/hudson-slave/workspace/Lucene-Solr-Tests-4.x-Java6/solr/build/solr-core/test/J0
[junit4:junit4]   2> 16964 T132 oass.SolrDispatchFilter.init SolrDispatchFilter.init() done
[junit4:junit4]   2> 16965 T132 oascsi.HttpClientUtil.createClient Creating new http client, config:maxConnections=128&maxConnectionsPerHost=32&followRedirects=false
[junit4:junit4]   2> 16985 T132 oascc.ZkStateReader.updateClusterState Updating cloud state from ZooKeeper... 
[junit4:junit4]   2> 16988 T132 oasc.AbstractFullDistribZkTestBase.waitForThingsToLevelOut Wait for recoveries to finish - wait 15 for each attempt
[junit4:junit4]   2> 16988 T132 oasc.AbstractDistribZkTestBase.waitForRecoveriesToFinish Wait for recoveries to finish - collection: collection1 failOnTimeout:true timeout (sec):15
[junit4:junit4]   2> 16989 T132 oascc.ZkStateReader.updateClusterState Updating cloud state from ZooKeeper... 
[junit4:junit4]   2>  C18_STATE=coll:collection1 core:collection1 props:{shard=shard1, roles=null, state=recovering, core=collection1, collection=collection1, node_name=127.0.0.1:14126_dgg%2Faf, base_url=http://127.0.0.1:14126/dgg/af}
[junit4:junit4]   2> 17417 T209 C18 P14126 oasc.RecoveryStrategy.doRecovery Attempting to PeerSync from http://127.0.0.1:26711/dgg/af/collection1/ core=collection1 - recoveringAfterStartup=true
[junit4:junit4]   2> 17417 T209 C18 P14126 oasu.PeerSync.sync PeerSync: core=collection1 url=http://127.0.0.1:14126/dgg/af START replicas=[http://127.0.0.1:26711/dgg/af/collection1/] nUpdates=100
[junit4:junit4]   2> 17418 T209 C18 P14126 oasu.PeerSync.sync WARNING no frame of reference to tell of we've missed updates
[junit4:junit4]   2> 17418 T209 C18 P14126 oasc.RecoveryStrategy.doRecovery PeerSync Recovery was not successful - trying replication. core=collection1
[junit4:junit4]   2> 17418 T209 C18 P14126 oasc.RecoveryStrategy.doRecovery Starting Replication Recovery. core=collection1
[junit4:junit4]   2> 17418 T209 C18 P14126 oasc.RecoveryStrategy.doRecovery Begin buffering updates. core=collection1
[junit4:junit4]   2> 17419 T209 C18 P14126 oasu.UpdateLog.bufferUpdates Starting to buffer updates. FSUpdateLog{state=ACTIVE, tlog=null}
[junit4:junit4]   2> 17419 T209 C18 P14126 oasc.RecoveryStrategy.replicate Attempting to replicate from http://127.0.0.1:26711/dgg/af/collection1/. core=collection1
[junit4:junit4]   2> 17419 T209 C18 P14126 oascsi.HttpClientUtil.createClient Creating new http client, config:maxConnections=128&maxConnectionsPerHost=32&followRedirects=false
[junit4:junit4]   2> 17421 T164 C17 P26711 REQ /get {getVersions=100&distrib=false&wt=javabin&qt=/get&version=2} status=0 QTime=1 
[junit4:junit4]   2> 17433 T169 C17 P26711 oasu.DirectUpdateHandler2.commit start commit{,optimize=false,openSearcher=false,waitSearcher=true,expungeDeletes=false,softCommit=false}
[junit4:junit4]   2> 17437 T169 C17 P26711 oasc.SolrDeletionPolicy.onCommit SolrDeletionPolicy.onCommit: commits:num=2
[junit4:junit4]   2> 		commit{dir=RateLimitedDirectoryWrapper(org.apache.lucene.store.NIOFSDirectory@/usr/home/hudson/hudson-slave/workspace/Lucene-Solr-Tests-4.x-Java6/solr/build/solr-core/test/J0/org.apache.solr.cloud.SyncSliceTest-1359666257762/jetty1/index lockFactory=org.apache.lucene.store.NativeFSLockFactory@6e4a084c),segFN=segments_2,generation=2,filenames=[segments_2]
[junit4:junit4]   2> 		commit{dir=RateLimitedDirectoryWrapper(org.apache.lucene.store.NIOFSDirectory@/usr/home/hudson/hudson-slave/workspace/Lucene-Solr-Tests-4.x-Java6/solr/build/solr-core/test/J0/org.apache.solr.cloud.SyncSliceTest-1359666257762/jetty1/index lockFactory=org.apache.lucene.store.NativeFSLockFactory@6e4a084c),segFN=segments_3,generation=3,filenames=[segments_3]
[junit4:junit4]   2> 17438 T169 C17 P26711 oasc.SolrDeletionPolicy.updateCommits newest commit = 3[segments_3]
[junit4:junit4]   2> 17439 T169 C17 P26711 oasc.CachingDirectoryFactory.close Releasing directory:/usr/home/hudson/hudson-slave/workspace/Lucene-Solr-Tests-4.x-Java6/solr/build/solr-core/test/J0/./org.apache.solr.cloud.SyncSliceTest-1359666257762/jetty1
[junit4:junit4]   2> 17439 T169 C17 P26711 oasu.DirectUpdateHandler2.commit end_commit_flush
[junit4:junit4]   2> 17440 T169 C17 P26711 /update {waitSearcher=true&openSearcher=false&commit=true&wt=javabin&commit_end_point=true&version=2&softCommit=false} {commit=} 0 8
[junit4:junit4]   2> 17441 T209 C18 P14126 oash.ReplicationHandler.inform Commits will be reserved for  10000
[junit4:junit4]   2> 17441 T209 C18 P14126 oash.SnapPuller.<init>  No value set for 'pollInterval'. Timer Task not started.
[junit4:junit4]   2> 17445 T166 C17 P26711 REQ /replication {command=indexversion&qt=/replication&wt=javabin&version=2} status=0 QTime=1 
[junit4:junit4]   2> 17446 T209 C18 P14126 oash.SnapPuller.fetchLatestIndex Master's generation: 3
[junit4:junit4]   2> 17446 T209 C18 P14126 oash.SnapPuller.fetchLatestIndex Slave's generation: 1
[junit4:junit4]   2> 17446 T209 C18 P14126 oash.SnapPuller.fetchLatestIndex Starting replication process
[junit4:junit4]   2> 17448 T166 C17 P26711 oasc.CachingDirectoryFactory.close Releasing directory:/usr/home/hudson/hudson-slave/workspace/Lucene-Solr-Tests-4.x-Java6/solr/build/solr-core/test/J0/./org.apache.solr.cloud.SyncSliceTest-1359666257762/jetty1
[junit4:junit4]   2> 17449 T166 C17 P26711 oasc.CachingDirectoryFactory.close Releasing directory:/usr/home/hudson/hudson-slave/workspace/Lucene-Solr-Tests-4.x-Java6/solr/build/solr-core/test/J0/./org.apache.solr.cloud.SyncSliceTest-1359666257762/jetty1/index
[junit4:junit4]   2> 17450 T166 C17 P26711 REQ /replication {command=filelist&qt=/replication&wt=javabin&generation=3&version=2} status=0 QTime=2 
[junit4:junit4]   2> 17451 T209 C18 P14126 oash.SnapPuller.fetchLatestIndex Number of files in latest index in master: 1
[junit4:junit4]   2> 17452 T209 C18 P14126 oasc.CachingDirectoryFactory.get return new directory for /usr/home/hudson/hudson-slave/workspace/Lucene-Solr-Tests-4.x-Java6/solr/build/solr-core/test/J0/./org.apache.solr.cloud.SyncSliceTest-1359666257762/jetty3/index.20130131230435209 forceNew:false
[junit4:junit4]   2> 17452 T209 C18 P14126 oasc.CachingDirectoryFactory.close Releasing directory:/usr/home/hudson/hudson-slave/workspace/Lucene-Solr-Tests-4.x-Java6/solr/build/solr-core/test/J0/./org.apache.solr.cloud.SyncSliceTest-1359666257762/jetty3
[junit4:junit4]   2> 17453 T209 C18 P14126 oash.SnapPuller.fetchLatestIndex Starting download to RateLimitedDirectoryWrapper(org.apache.lucene.store.NIOFSDirectory@/usr/home/hudson/hudson-slave/workspace/Lucene-Solr-Tests-4.x-Java6/solr/build/solr-core/test/J0/org.apache.solr.cloud.SyncSliceTest-1359666257762/jetty3/index.20130131230435209 lockFactory=org.apache.lucene.store.NativeFSLockFactory@6046f8df) fullCopy=true
[junit4:junit4]   2> 17457 T166 C17 P26711 REQ /replication {file=segments_3&command=filecontent&checksum=true&wt=filestream&qt=/replication&generation=3} status=0 QTime=1 
[junit4:junit4]   2> 17458 T209 C18 P14126 oasc.CachingDirectoryFactory.close Releasing directory:/usr/home/hudson/hudson-slave/workspace/Lucene-Solr-Tests-4.x-Java6/solr/build/solr-core/test/J0/./org.apache.solr.cloud.SyncSliceTest-1359666257762/jetty3/index
[junit4:junit4]   2> 17459 T209 C18 P14126 oash.SnapPuller.fetchLatestIndex Total time taken for download : 0 secs
[junit4:junit4]   2> 17466 T209 C18 P14126 oash.SnapPuller.modifyIndexProps New index installed. Updating index properties... index=index.20130131230435209
[junit4:junit4]   2> 17467 T209 C18 P14126 oasc.CachingDirectoryFactory.close Releasing directory:/usr/home/hudson/hudson-slave/workspace/Lucene-Solr-Tests-4.x-Java6/solr/build/solr-core/test/J0/./org.apache.solr.cloud.SyncSliceTest-1359666257762/jetty3
[junit4:junit4]   2> 17467 T209 C18 P14126 oasc.CachingDirectoryFactory.close Releasing directory:/usr/home/hudson/hudson-slave/workspace/Lucene-Solr-Tests-4.x-Java6/solr/build/solr-core/test/J0/./org.apache.solr.cloud.SyncSliceTest-1359666257762/jetty3
[junit4:junit4]   2> 17468 T209 C18 P14126 oasc.SolrCore.getNewIndexDir New index directory detected: old=./org.apache.solr.cloud.SyncSliceTest-1359666257762/jetty3/index/ new=./org.apache.solr.cloud.SyncSliceTest-1359666257762/jetty3/index.20130131230435209
[junit4:junit4]   2> 17470 T209 C18 P14126 oasc.SolrDeletionPolicy.onInit SolrDeletionPolicy.onInit: commits:num=1
[junit4:junit4]   2> 		commit{dir=RateLimitedDirectoryWrapper(org.apache.lucene.store.NIOFSDirectory@/usr/home/hudson/hudson-slave/workspace/Lucene-Solr-Tests-4.x-Java6/solr/build/solr-core/test/J0/org.apache.solr.cloud.SyncSliceTest-1359666257762/jetty3/index.20130131230435209 lockFactory=org.apache.lucene.store.NativeFSLockFactory@6046f8df),segFN=segments_3,generation=3,filenames=[segments_3]
[junit4:junit4]   2> 17470 T209 C18 P14126 oasc.SolrDeletionPolicy.updateCommits newest commit = 3[segments_3]
[junit4:junit4]   2> 17471 T209 C18 P14126 oasc.CachingDirectoryFactory.close Releasing directory:/usr/home/hudson/hudson-slave/workspace/Lucene-Solr-Tests-4.x-Java6/solr/build/solr-core/test/J0/./org.apache.solr.cloud.SyncSliceTest-1359666257762/jetty3
[junit4:junit4]   2> 17471 T209 C18 P14126 oasu.DefaultSolrCoreState.newIndexWriter Creating new IndexWriter...
[junit4:junit4]   2> 17472 T209 C18 P14126 oasu.DefaultSolrCoreState.newIndexWriter Waiting until IndexWriter is unused... core=collection1
[junit4:junit4]   2> 17472 T209 C18 P14126 oasu.DefaultSolrCoreState.newIndexWriter Rollback old IndexWriter... core=collection1
[junit4:junit4]   2> 17472 T209 C18 P14126 oasc.CachingDirectoryFactory.close Releasing directory:/usr/home/hudson/hudson-slave/workspace/Lucene-Solr-Tests-4.x-Java6/solr/build/solr-core/test/J0/./org.apache.solr.cloud.SyncSliceTest-1359666257762/jetty3/index.20130131230435209
[junit4:junit4]   2> 17473 T209 C18 P14126 oasc.CachingDirectoryFactory.close Releasing directory:/usr/home/hudson/hudson-slave/workspace/Lucene-Solr-Tests-4.x-Java6/solr/build/solr-core/test/J0/./org.apache.solr.cloud.SyncSliceTest-1359666257762/jetty3
[junit4:junit4]   2> 17476 T209 C18 P14126 oasc.SolrDeletionPolicy.onInit SolrDeletionPolicy.onInit: commits:num=1
[junit4:junit4]   2> 		commit{dir=RateLimitedDirectoryWrapper(org.apache.lucene.store.NIOFSDirectory@/usr/home/hudson/hudson-slave/workspace/Lucene-Solr-Tests-4.x-Java6/solr/build/solr-core/test/J0/org.apache.solr.cloud.SyncSliceTest-1359666257762/jetty3/index.20130131230435209 lockFactory=org.apache.lucene.store.NativeFSLockFactory@6046f8df),segFN=segments_3,generation=3,filenames=[segments_3]
[junit4:junit4]   2> 17476 T209 C18 P14126 oasc.SolrDeletionPolicy.updateCommits newest commit = 3[segments_3]
[junit4:junit4]   2> 17476 T209 C18 P14126 oasu.DefaultSolrCoreState.newIndexWriter New IndexWriter is ready to be used.
[junit4:junit4]   2> 17476 T209 C18 P14126 oasc.CachingDirectoryFactory.close Releasing directory:/usr/home/hudson/hudson-slave/workspace/Lucene-Solr-Tests-4.x-Java6/solr/build/solr-core/test/J0/./org.apache.solr.cloud.SyncSliceTest-1359666257762/jetty3
[junit4:junit4]   2> 17476 T209 C18 P14126 oass.SolrIndexSearcher.<init> Opening Searcher@75af028b main
[junit4:junit4]   2> 17478 T206 oasc.SolrCore.registerSearcher [collection1] Registered new searcher Searcher@75af028b main{StandardDirectoryReader(segments_3:1:nrt)}
[junit4:junit4]   2> 17479 T206 oasc.CachingDirectoryFactory.close Releasing directory:/usr/home/hudson/hudson-slave/workspace/Lucene-Solr-Tests-4.x-Java6/solr/build/solr-core/test/J0/./org.apache.solr.cloud.SyncSliceTest-1359666257762/jetty3/index
[junit4:junit4]   2> 17479 T209 C18 P14126 oasu.DirectUpdateHandler2.commit start commit{,optimize=false,openSearcher=false,waitSearcher=false,expungeDeletes=false,softCommit=false}
[junit4:junit4]   2> 17483 T209 C18 P14126 oasc.SolrDeletionPolicy.onCommit SolrDeletionPolicy.onCommit: commits:num=2
[junit4:junit4]   2> 		commit{dir=RateLimitedDirectoryWrapper(org.apache.lucene.store.NIOFSDirectory@/usr/home/hudson/hudson-slave/workspace/Lucene-Solr-Tests-4.x-Java6/solr/build/solr-core/test/J0/org.apache.solr.cloud.SyncSliceTest-1359666257762/jetty3/index.20130131230435209 lockFactory=org.apache.lucene.store.NativeFSLockFactory@6046f8df),segFN=segments_3,generation=3,filenames=[segments_3]
[junit4:junit4]   2> 		commit{dir=RateLimitedDirectoryWrapper(org.apache.lucene.store.NIOFSDirectory@/usr/home/hudson/hudson-slave/workspace/Lucene-Solr-Tests-4.x-Java6/solr/build/solr-core/test/J0/org.apache.solr.cloud.SyncSliceTest-1359666257762/jetty3/index.20130131230435209 lockFactory=org.apache.lucene.store.NativeFSLockFactory@6046f8df),segFN=segments_4,generation=4,filenames=[segments_4]
[junit4:junit4]   2> 17483 T209 C18 P14126 oasc.SolrDeletionPolicy.updateCommits newest commit = 4[segments_4]
[junit4:junit4]   2> 17484 T209 C18 P14126 oasc.CachingDirectoryFactory.close Releasing directory:/usr/home/hudson/hudson-slave/workspace/Lucene-Solr-Tests-4.x-Java6/solr/build/solr-core/test/J0/./org.apache.solr.cloud.SyncSliceTest-1359666257762/jetty3
[junit4:junit4]   2> 17484 T209 C18 P14126 oasu.DirectUpdateHandler2.commit end_commit_flush
[junit4:junit4]   2> 17484 T209 C18 P14126 oasc.CachingDirectoryFactory.close Releasing directory:/usr/home/hudson/hudson-slave/workspace/Lucene-Solr-Tests-4.x-Java6/solr/build/solr-core/test/J0/./org.apache.solr.cloud.SyncSliceTest-1359666257762/jetty3/index.20130131230435209
[junit4:junit4]   2> 17484 T209 C18 P14126 oasc.CachingDirectoryFactory.close Releasing directory:/usr/home/hudson/hudson-slave/workspace/Lucene-Solr-Tests-4.x-Java6/solr/build/solr-core/test/J0/./org.apache.solr.cloud.SyncSliceTest-1359666257762/jetty3/index
[junit4:junit4]   2> 17484 T209 C18 P14126 oasc.RecoveryStrategy.replay No replay needed. core=collection1
[junit4:junit4]   2> 17484 T209 C18 P14126 oasc.RecoveryStrategy.doRecovery Replication Recovery was successful - registering as Active. core=collection1
[junit4:junit4]   2> 17485 T209 C18 P14126 oasc.ZkController.publish publishing core=collection1 state=active
[junit4:junit4]   2> 17485 T209 C18 P14126 oasc.ZkController.publish numShards not found on descriptor - reading it from system property
[junit4:junit4]   2> 17495 T209 C18 P14126 oasc.RecoveryStrategy.doRecovery Finished recovery process. core=collection1
[junit4:junit4]   2> 17991 T132 oascc.ZkStateReader.updateClusterState Updating cloud state from ZooKeeper... 
[junit4:junit4]   2> 18074 T155 oascc.ZkStateReader.updateClusterState Updating cloud state from ZooKeeper... 
[junit4:junit4]   2> 18074 T155 oasc.Overseer$ClusterStateUpdater.updateState Update state numShards=1 message={
[junit4:junit4]   2> 	  "operation":"state",
[junit4:junit4]   2> 	  "numShards":"1",
[junit4:junit4]   2> 	  "shard":"shard1",
[junit4:junit4]   2> 	  "roles":null,
[junit4:junit4]   2> 	  "state":"recovering",
[junit4:junit4]   2> 	  "core":"collection1",
[junit4:junit4]   2> 	  "collection":"collection1",
[junit4:junit4]   2> 	  "node_name":"127.0.0.1:45501_dgg%2Faf",
[junit4:junit4]   2> 	  "base_url":"http://127.0.0.1:45501/dgg/af"}
[junit4:junit4]   2> 18078 T155 oasc.Overseer$ClusterStateUpdater.updateState Update state numShards=1 message={
[junit4:junit4]   2> 	  "operation":"state",
[junit4:junit4]   2> 	  "numShards":"1",
[junit4:junit4]   2> 	  "shard":"shard1",
[junit4:junit4]   2> 	  "roles":null,
[junit4:junit4]   2> 	  "state":"active",
[junit4:junit4]   2> 	  "core":"collection1",
[junit4:junit4]   2> 	  "collection":"collection1",
[junit4:junit4]   2> 	  "node_name":"127.0.0.1:14126_dgg%2Faf",
[junit4:junit4]   2> 	  "base_url":"http://127.0.0.1:14126/dgg/af"}
[junit4:junit4]   2> 18089 T154 oascc.ZkStateReader$2.process A cluster state change: WatchedEvent state:SyncConnected type:NodeDataChanged path:/clusterstate.json, has occurred - updating... (live nodes size: 5)
[junit4:junit4]   2> 18089 T222 oascc.ZkStateReader$2.process A cluster state change: WatchedEvent state:SyncConnected type:NodeDataChanged path:/clusterstate.json, has occurred - updating... (live nodes size: 5)
[junit4:junit4]   2> 18089 T173 oascc.ZkStateReader$2.process A cluster state change: WatchedEvent state:SyncConnected type:NodeDataChanged path:/clusterstate.json, has occurred - updating... (live nodes size: 5)
[junit4:junit4]   2> 18089 T204 oascc.ZkStateReader$2.process A cluster state change: WatchedEvent state:SyncConnected type:NodeDataChanged path:/clusterstate.json, has occurred - updating... (live nodes size: 5)
[junit4:junit4]   2> 18089 T188 oascc.ZkStateReader$2.process A cluster state change: WatchedEvent state:SyncConnected type:NodeDataChanged path:/clusterstate.json, has occurred - updating... (live nodes size: 5)
[junit4:junit4]   2> 18089 T160 oascc.ZkStateReader$2.process A cluster state change: WatchedEvent state:SyncConnected type:NodeDataChanged path:/clusterstate.json, has occurred - updating... (live nodes size: 5)
[junit4:junit4]   2> 18994 T132 oascc.ZkStateReader.updateClusterState Updating cloud state from ZooKeeper... 
[junit4:junit4]   2> 19996 T132 oascc.ZkStateReader.updateClusterState Updating cloud state from ZooKeeper... 
[junit4:junit4]   2>  C19_STATE=coll:collection1 core:collection1 props:{shard=shard1, roles=null, state=recovering, core=collection1, collection=collection1, node_name=127.0.0.1:45501_dgg%2Faf, base_url=http://127.0.0.1:45501/dgg/af}
[junit4:junit4]   2> 20989 T225 C19 P45501 oasc.RecoveryStrategy.doRecovery Attempting to PeerSync from http://127.0.0.1:26711/dgg/af/collection1/ core=collection1 - recoveringAfterStartup=true
[junit4:junit4]   2> 20989 T225 C19 P45501 oasu.PeerSync.sync PeerSync: core=collection1 url=http://127.0.0.1:45501/dgg/af START replicas=[http://127.0.0.1:26711/dgg/af/collection1/] nUpdates=100
[junit4:junit4]   2> 20990 T225 C19 P45501 oasu.PeerSync.sync WARNING no frame of reference to tell of we've missed updates
[junit4:junit4]   2> 20990 T225 C19 P45501 oasc.RecoveryStrategy.doRecovery PeerSync Recovery was not successful - trying replication. core=collection1
[junit4:junit4]   2> 20990 T225 C19 P45501 oasc.RecoveryStrategy.doRecovery Starting Replication Recovery. core=collection1
[junit4:junit4]   2> 20990 T225 C19 P45501 oasc.RecoveryStrategy.doRecovery Begin buffering updates. core=collection1
[junit4:junit4]   2> 20990 T225 C19 P45501 oasu.UpdateLog.bufferUpdates Starting to buffer updates. FSUpdateLog{state=ACTIVE, tlog=null}
[junit4:junit4]   2> 20990 T225 C19 P45501 oasc.RecoveryStrategy.replicate Attempting to replicate from http://127.0.0.1:26711/dgg/af/collection1/. core=collection1
[junit4:junit4]   2> 20991 T225 C19 P45501 oascsi.HttpClientUtil.createClient Creating new http client, config:maxConnections=128&maxConnectionsPerHost=32&followRedirects=false
[junit4:junit4]   2> 20993 T164 C17 P26711 REQ /get {getVersions=100&distrib=false&wt=javabin&qt=/get&version=2} status=0 QTime=0 
[junit4:junit4]   2> 20999 T132 oascc.ZkStateReader.updateClusterState Updating cloud state from ZooKeeper... 
[junit4:junit4]   2> 21008 T163 C17 P26711 oasu.DirectUpdateHandler2.commit start commit{,optimize=false,openSearcher=false,waitSearcher=true,expungeDeletes=false,softCommit=false}
[junit4:junit4]   2> 21016 T163 C17 P26711 oasc.SolrDeletionPolicy.onCommit SolrDeletionPolicy.onCommit: commits:num=3
[junit4:junit4]   2> 		commit{dir=RateLimitedDirectoryWrapper(org.apache.lucene.store.NIOFSDirectory@/usr/home/hudson/hudson-slave/workspace/Lucene-Solr-Tests-4.x-Java6/solr/build/solr-core/test/J0/org.apache.solr.cloud.SyncSliceTest-1359666257762/jetty1/index lockFactory=org.apache.lucene.store.NativeFSLockFactory@6e4a084c),segFN=segments_2,generation=2,filenames=[segments_2]
[junit4:junit4]   2> 		commit{dir=RateLimitedDirectoryWrapper(org.apache.lucene.store.NIOFSDirectory@/usr/home/hudson/hudson-slave/workspace/Lucene-Solr-Tests-4.x-Java6/solr/build/solr-core/test/J0/org.apache.solr.cloud.SyncSliceTest-1359666257762/jetty1/index lockFactory=org.apache.lucene.store.NativeFSLockFactory@6e4a084c),segFN=segments_3,generation=3,filenames=[segments_3]
[junit4:junit4]   2> 		commit{dir=RateLimitedDirectoryWrapper(org.apache.lucene.store.NIOFSDirectory@/usr/home/hudson/hudson-slave/workspace/Lucene-Solr-Tests-4.x-Java6/solr/build/solr-core/test/J0/org.apache.solr.cloud.SyncSliceTest-1359666257762/jetty1/index lockFactory=org.apache.lucene.store.NativeFSLockFactory@6e4a084c),segFN=segments_4,generation=4,filenames=[segments_4]
[junit4:junit4]   2> 21017 T163 C17 P26711 oasc.SolrDeletionPolicy.updateCommits newest commit = 4[segments_4]
[junit4:junit4]   2> 21017 T163 C17 P26711 oasc.CachingDirectoryFactory.close Releasing directory:/usr/home/hudson/hudson-slave/workspace/Lucene-Solr-Tests-4.x-Java6/solr/build/solr-core/test/J0/./org.apache.solr.cloud.SyncSliceTest-1359666257762/jetty1
[junit4:junit4]   2> 21018 T163 C17 P26711 oasu.DirectUpdateHandler2.commit end_commit_flush
[junit4:junit4]   2> 21018 T163 C17 P26711 /update {waitSearcher=true&openSearcher=false&commit=true&wt=javabin&commit_end_point=true&version=2&softCommit=false} {commit=} 0 10
[junit4:junit4]   2> 21019 T225 C19 P45501 oash.ReplicationHandler.inform Commits will be reserved for  10000
[junit4:junit4]   2> 21020 T225 C19 P45501 oash.SnapPuller.<init>  No value set for 'pollInterval'. Timer Task not started.
[junit4:junit4]   2> 21023 T166 C17 P26711 REQ /replication {command=indexversion&qt=/replication&wt=javabin&version=2} status=0 QTime=1 
[junit4:junit4]   2> 21024 T225 C19 P45501 oash.SnapPuller.fetchLatestIndex Master's generation: 4
[junit4:junit4]   2> 21024 T225 C19 P45501 oash.SnapPuller.fetchLatestIndex Slave's generation: 1
[junit4:junit4]   2> 21024 T225 C19 P45501 oash.SnapPuller.fetchLatestIndex Starting replication process
[junit4:junit4]   2> 21028 T166 C17 P26711 oasc.CachingDirectoryFactory.close Releasing directory:/usr/home/hudson/hudson-slave/workspace/Lucene-Solr-Tests-4.x-Java6/solr/build/solr-core/test/J0/./org.apache.solr.cloud.SyncSliceTest-1359666257762/jetty1
[junit4:junit4]   2> 21029 T166 C17 P26711 oasc.CachingDirectoryFactory.close Releasing directory:/usr/home/hudson/hudson-slave/workspace/Lucene-Solr-Tests-4.x-Java6/solr/build/solr-core/test/J0/./org.apache.solr.cloud.SyncSliceTest-1359666257762/jetty1/index
[junit4:junit4]   2> 21029 T166 C17 P26711 REQ /replication {command=filelist&qt=/replication&wt=javabin&generation=4&version=2} status=0 QTime=2 
[junit4:junit4]   2> 21031 T225 C19 P45501 oash.SnapPuller.fetchLatestIndex Number of files in latest index in master: 1
[junit4:junit4]   2> 21032 T225 C19 P45501 oasc.CachingDirectoryFactory.get return new directory for /usr/home/hudson/hudson-slave/workspace/Lucene-Solr-Tests-4.x-Java6/solr/build/solr-core/test/J0/./org.apache.solr.cloud.SyncSliceTest-1359666257762/jetty4/index.20130131230438789 forceNew:false
[junit4:junit4]   2> 21032 T225 C19 P45501 oasc.CachingDirectoryFactory.close Releasing directory:/usr/home/hudson/hudson-slave/workspace/Lucene-Solr-Tests-4.x-Java6/solr/build/solr-core/test/J0/./org.apache.solr.cloud.SyncSliceTest-1359666257762/jetty4
[junit4:junit4]   2> 21033 T225 C19 P45501 oash.SnapPuller.fetchLatestIndex Starting download to RateLimitedDirectoryWrapper(org.apache.lucene.store.NIOFSDirectory@/usr/home/hudson/hudson-slave/workspace/Lucene-Solr-Tests-4.x-Java6/solr/build/solr-core/test/J0/org.apache.solr.cloud.SyncSliceTest-1359666257762/jetty4/index.20130131230438789 lockFactory=org.apache.lucene.store.NativeFSLockFactory@65bad9fe) fullCopy=true
[junit4:junit4]   2> 21037 T166 C17 P26711 REQ /replication {file=segments_4&command=filecontent&checksum=true&wt=filestream&qt=/replication&generation=4} status=0 QTime=1 
[junit4:junit4]   2> 21039 T225 C19 P45501 oasc.CachingDirectoryFactory.close Releasing directory:/usr/home/hudson/hudson-slave/workspace/Lucene-Solr-Tests-4.x-Java6/solr/build/solr-core/test/J0/./org.apache.solr.cloud.SyncSliceTest-1359666257762/jetty4/index
[junit4:junit4]   2> 21039 T225 C19 P45501 oash.SnapPuller.fetchLatestIndex Total time taken for download : 0 secs
[junit4:junit4]   2> 21040 T225 C19 P45501 oash.SnapPuller.modifyIndexProps New index installed. Updating index properties... index=index.20130131230438789
[junit4:junit4]   2> 21041 T225 C19 P45501 oasc.CachingDirectoryFactory.close Releasing directory:/usr/home/hudson/hudson-slave/workspace/Lucene-Solr-Tests-4.x-Java6/solr/build/solr-core/test/J0/./org.apache.solr.cloud.SyncSliceTest-1359666257762/jetty4
[junit4:junit4]   2> 21042 T225 C19 P45501 oasc.CachingDirectoryFactory.close Releasing directory:/usr/home/hudson/hudson-slave/workspace/Lucene-Solr-Tests-4.x-Java6/solr/build/solr-core/test/J0/./org.apache.solr.cloud.SyncSliceTest-1359666257762/jetty4
[junit4:junit4]   2> 21042 T225 C19 P45501 oasc.SolrCore.getNewIndexDir New index directory detected: old=./org.apache.solr.cloud.SyncSliceTest-1359666257762/jetty4/index/ new=./org.apache.solr.cloud.SyncSliceTest-1359666257762/jetty4/index.20130131230438789
[junit4:junit4]   2> 21045 T225 C19 P45501 oasc.SolrDeletionPolicy.onInit SolrDeletionPolicy.onInit: commits:num=1
[junit4:junit4]   2> 		commit{dir=RateLimitedDirectoryWrapper(org.apache.lucene.store.NIOFSDirectory@/usr/home/hudson/hudson-slave/workspace/Lucene-Solr-Tests-4.x-Java6/solr/build/solr-core/test/J0/org.apache.solr.cloud.SyncSliceTest-1359666257762/jetty4/index.20130131230438789 lockFactory=org.apache.lucene.store.NativeFSLockFactory@65bad9fe),segFN=segments_4,generation=4,filenames=[segments_4]
[junit4:junit4]   2> 21046 T225 C19 P45501 oasc.SolrDeletionPolicy.updateCommits newest commit = 4[segments_4]
[junit4:junit4]   2> 21047 T225 C19 P45501 oasc.CachingDirectoryFactory.close Releasing directory:/usr/home/hudson/hudson-slave/workspace/Lucene-Solr-Tests-4.x-Java6/solr/build/solr-core/test/J0/./org.apache.solr.cloud.SyncSliceTest-1359666257762/jetty4
[junit4:junit4]   2> 21047 T225 C19 P45501 oasu.DefaultSolrCoreState.newIndexWriter Creating new IndexWriter...
[junit4:junit4]   2> 21047 T225 C19 P45501 oasu.DefaultSolrCoreState.newIndexWriter Waiting until IndexWriter is unused... core=collection1
[junit4:junit4]   2> 21048 T225 C19 P45501 oasu.DefaultSolrCoreState.newIndexWriter Rollback old IndexWriter... core=collection1
[junit4:junit4]   2> 21048 T225 C19 P45501 oasc.CachingDirectoryFactory.close Releasing directory:/usr/home/hudson/hudson-slave/workspace/Lucene-Solr-Tests-4.x-Java6/solr/build/solr-core/test/J0/./org.apache.solr.cloud.SyncSliceTest-1359666257762/jetty4/index.20130131230438789
[junit4:junit4]   2> 21049 T225 C19 P45501 oasc.CachingDirectoryFactory.close Releasing directory:/usr/home/hudson/hudson-slave/workspace/Lucene-Solr-Tests-4.x-Java6/solr/build/solr-core/test/J0/./org.apache.solr.cloud.SyncSliceTest-1359666257762/jetty4
[junit4:junit4]   2> 21052 T225 C19 P45501 oasc.SolrDeletionPolicy.onInit SolrDeletionPolicy.onInit: commits:num=1
[junit4:junit4]   2> 		commit{dir=RateLimitedDirectoryWrapper(org.apache.lucene.store.NIOFSDirectory@/usr/home/hudson/hudson-slave/workspace/Lucene-Solr-Tests-4.x-Java6/solr/build/solr-core/test/J0/org.apache.solr.cloud.SyncSliceTest-1359666257762/jetty4/index.20130131230438789 lockFactory=org.apache.lucene.store.NativeFSLockFactory@65bad9fe),segFN=segments_4,generation=4,filenames=[segments_4]
[junit4:junit4]   2> 21053 T225 C19 P45501 oasc.SolrDeletionPolicy.updateCommits newest commit = 4[segments_4]
[junit4:junit4]   2> 21053 T225 C19 P45501 oasu.DefaultSolrCoreState.newIndexWriter New IndexWriter is ready to be used.
[junit4:junit4]   2> 21053 T225 C19 P45501 oasc.CachingDirectoryFactory.close Releasing directory:/usr/home/hudson/hudson-slave/workspace/Lucene-Solr-Tests-4.x-Java6/solr/build/solr-core/test/J0/./org.apache.solr.cloud.SyncSliceTest-1359666257762/jetty4
[junit4:junit4]   2> 21054 T225 C19 P45501 oass.SolrIndexSearcher.<init> Opening Searcher@3551ff5b main
[junit4:junit4]   2> 21056 T224 oasc.SolrCore.registerSearcher [collection1] Registered new searcher Searcher@3551ff5b main{StandardDirectoryReader(segments_4:1:nrt)}
[junit4:junit4]   2> 21056 T224 oasc.CachingDirectoryFactory.close Releasing directory:/usr/home/hudson/hudson-slave/workspace/Lucene-Solr-Tests-4.x-Java6/solr/build/solr-core/test/J0/./org.apache.solr.cloud.SyncSliceTest-1359666257762/jetty4/index
[junit4:junit4]   2> 21056 T225 C19 P45501 oasu.DirectUpdateHandler2.commit start commit{,optimize=false,openSearcher=false,waitSearcher=false,expungeDeletes=false,softCommit=false}
[junit4:junit4]   2> 21059 T225 C19 P45501 oasc.SolrDeletionPolicy.onCommit SolrDeletionPolicy.onCommit: commits:num=2
[junit4:junit4]   2> 		commit{dir=RateLimitedDirectoryWrapper(org.apache.lucene.store.NIOFSDirectory@/usr/home/hudson/hudson-slave/workspace/Lucene

[...truncated too long message...]

Solr-Tests-4.x-Java6/solr/build/solr-core/test/J0/org.apache.solr.cloud.SyncSliceTest-1359666257762/jetty4/index lockFactory=org.apache.lucene.store.NativeFSLockFactory@426e95e9)
[junit4:junit4]   2> 165087 T132 oasc.CachingDirectoryFactory.closeDirectory Closing directory:/usr/home/hudson/hudson-slave/workspace/Lucene-Solr-Tests-4.x-Java6/solr/build/solr-core/test/J0/./org.apache.solr.cloud.SyncSliceTest-1359666257762/jetty4/index.20130131230438789
[junit4:junit4]   2> 165087 T132 oash.SnapPuller$2.postClose removing old index directory RateLimitedDirectoryWrapper(org.apache.lucene.store.NIOFSDirectory@/usr/home/hudson/hudson-slave/workspace/Lucene-Solr-Tests-4.x-Java6/solr/build/solr-core/test/J0/org.apache.solr.cloud.SyncSliceTest-1359666257762/jetty4/index lockFactory=org.apache.lucene.store.NativeFSLockFactory@426e95e9)
[junit4:junit4]   2> 165088 T132 oasc.CachingDirectoryFactory.close Closing directory when closing factory:/usr/home/hudson/hudson-slave/workspace/Lucene-Solr-Tests-4.x-Java6/solr/build/solr-core/test/J0/./org.apache.solr.cloud.SyncSliceTest-1359666257762/jetty4
[junit4:junit4]   2> 165088 T132 oasc.CachingDirectoryFactory.closeDirectory Closing directory:/usr/home/hudson/hudson-slave/workspace/Lucene-Solr-Tests-4.x-Java6/solr/build/solr-core/test/J0/./org.apache.solr.cloud.SyncSliceTest-1359666257762/jetty4
[junit4:junit4]   2> 165088 T132 oasc.CachingDirectoryFactory.close Closing directory when closing factory:/usr/home/hudson/hudson-slave/workspace/Lucene-Solr-Tests-4.x-Java6/solr/build/solr-core/test/J0/./org.apache.solr.cloud.SyncSliceTest-1359666257762/jetty4/index
[junit4:junit4]   2> 165089 T132 oasc.CachingDirectoryFactory.closeDirectory Closing directory:/usr/home/hudson/hudson-slave/workspace/Lucene-Solr-Tests-4.x-Java6/solr/build/solr-core/test/J0/./org.apache.solr.cloud.SyncSliceTest-1359666257762/jetty4/index
[junit4:junit4]   2> 165961 T222 oaz.ClientCnxn$EventThread.run EventThread shut down
[junit4:junit4]   2> 165961 T132 oaz.ZooKeeper.close Session: 0x13c926c9f68000c closed
[junit4:junit4]   2> 165963 T132 oejsh.ContextHandler.doStop stopped o.e.j.s.ServletContextHandler{/dgg/af,null}
[junit4:junit4]   2> 166166 T132 oas.SolrTestCaseJ4.tearDown ###Ending testDistribSearch
[junit4:junit4]   1> client port:0.0.0.0/0.0.0.0:0
[junit4:junit4]   2> NOTE: reproduce with: ant test  -Dtestcase=SyncSliceTest -Dtests.method=testDistribSearch -Dtests.seed=5D1528D128C9A709 -Dtests.multiplier=3 -Dtests.slow=true -Dtests.locale=el -Dtests.timezone=Asia/Tel_Aviv -Dtests.file.encoding=US-ASCII
[junit4:junit4] FAILURE  166s J0 | SyncSliceTest.testDistribSearch <<<
[junit4:junit4]    > Throwable #1: java.lang.AssertionError: shard1 should have just been set up to be inconsistent - but it's still consistent
[junit4:junit4]    > 	at __randomizedtesting.SeedInfo.seed([5D1528D128C9A709:DCF3A6C95F96C735]:0)
[junit4:junit4]    > 	at org.junit.Assert.fail(Assert.java:93)
[junit4:junit4]    > 	at org.junit.Assert.assertTrue(Assert.java:43)
[junit4:junit4]    > 	at org.junit.Assert.assertNotNull(Assert.java:526)
[junit4:junit4]    > 	at org.apache.solr.cloud.SyncSliceTest.doTest(SyncSliceTest.java:214)
[junit4:junit4]    > 	at org.apache.solr.BaseDistributedSearchTestCase.testDistribSearch(BaseDistributedSearchTestCase.java:794)
[junit4:junit4]    > 	at sun.reflect.NativeMethodAccessorImpl.invoke0(Native Method)
[junit4:junit4]    > 	at sun.reflect.NativeMethodAccessorImpl.invoke(NativeMethodAccessorImpl.java:57)
[junit4:junit4]    > 	at sun.reflect.DelegatingMethodAccessorImpl.invoke(DelegatingMethodAccessorImpl.java:43)
[junit4:junit4]    > 	at java.lang.reflect.Method.invoke(Method.java:616)
[junit4:junit4]    > 	at com.carrotsearch.randomizedtesting.RandomizedRunner.invoke(RandomizedRunner.java:1559)
[junit4:junit4]    > 	at com.carrotsearch.randomizedtesting.RandomizedRunner.access$600(RandomizedRunner.java:79)
[junit4:junit4]    > 	at com.carrotsearch.randomizedtesting.RandomizedRunner$6.evaluate(RandomizedRunner.java:737)
[junit4:junit4]    > 	at com.carrotsearch.randomizedtesting.RandomizedRunner$7.evaluate(RandomizedRunner.java:773)
[junit4:junit4]    > 	at com.carrotsearch.randomizedtesting.RandomizedRunner$8.evaluate(RandomizedRunner.java:787)
[junit4:junit4]    > 	at com.carrotsearch.randomizedtesting.rules.SystemPropertiesRestoreRule$1.evaluate(SystemPropertiesRestoreRule.java:53)
[junit4:junit4]    > 	at org.apache.lucene.util.TestRuleSetupTeardownChained$1.evaluate(TestRuleSetupTeardownChained.java:50)
[junit4:junit4]    > 	at org.apache.lucene.util.TestRuleFieldCacheSanity$1.evaluate(TestRuleFieldCacheSanity.java:51)
[junit4:junit4]    > 	at org.apache.lucene.util.AbstractBeforeAfterRule$1.evaluate(AbstractBeforeAfterRule.java:46)
[junit4:junit4]    > 	at com.carrotsearch.randomizedtesting.rules.SystemPropertiesInvariantRule$1.evaluate(SystemPropertiesInvariantRule.java:55)
[junit4:junit4]    > 	at org.apache.lucene.util.TestRuleThreadAndTestName$1.evaluate(TestRuleThreadAndTestName.java:49)
[junit4:junit4]    > 	at org.apache.lucene.util.TestRuleIgnoreAfterMaxFailures$1.evaluate(TestRuleIgnoreAfterMaxFailures.java:70)
[junit4:junit4]    > 	at org.apache.lucene.util.TestRuleMarkFailure$1.evaluate(TestRuleMarkFailure.java:48)
[junit4:junit4]    > 	at com.carrotsearch.randomizedtesting.rules.StatementAdapter.evaluate(StatementAdapter.java:36)
[junit4:junit4]    > 	at com.carrotsearch.randomizedtesting.ThreadLeakControl$StatementRunner.run(ThreadLeakControl.java:358)
[junit4:junit4]    > 	at com.carrotsearch.randomizedtesting.ThreadLeakControl.forkTimeoutingTask(ThreadLeakControl.java:782)
[junit4:junit4]    > 	at com.carrotsearch.randomizedtesting.ThreadLeakControl$3.evaluate(ThreadLeakControl.java:442)
[junit4:junit4]    > 	at com.carrotsearch.randomizedtesting.RandomizedRunner.runSingleTest(RandomizedRunner.java:746)
[junit4:junit4]    > 	at com.carrotsearch.randomizedtesting.RandomizedRunner$3.evaluate(RandomizedRunner.java:648)
[junit4:junit4]    > 	at com.carrotsearch.randomizedtesting.RandomizedRunner$4.evaluate(RandomizedRunner.java:682)
[junit4:junit4]    > 	at com.carrotsearch.randomizedtesting.RandomizedRunner$5.evaluate(RandomizedRunner.java:693)
[junit4:junit4]    > 	at com.carrotsearch.randomizedtesting.rules.StatementAdapter.evaluate(StatementAdapter.java:36)
[junit4:junit4]    > 	at com.carrotsearch.randomizedtesting.rules.SystemPropertiesRestoreRule$1.evaluate(SystemPropertiesRestoreRule.java:53)
[junit4:junit4]    > 	at org.apache.lucene.util.AbstractBeforeAfterRule$1.evaluate(AbstractBeforeAfterRule.java:46)
[junit4:junit4]    > 	at org.apache.lucene.util.TestRuleStoreClassName$1.evaluate(TestRuleStoreClassName.java:42)
[junit4:junit4]    > 	at com.carrotsearch.randomizedtesting.rules.SystemPropertiesInvariantRule$1.evaluate(SystemPropertiesInvariantRule.java:55)
[junit4:junit4]    > 	at com.carrotsearch.randomizedtesting.rules.NoShadowingOrOverridesOnMethodsRule$1.evaluate(NoShadowingOrOverridesOnMethodsRule.java:39)
[junit4:junit4]    > 	at com.carrotsearch.randomizedtesting.rules.NoShadowingOrOverridesOnMethodsRule$1.evaluate(NoShadowingOrOverridesOnMethodsRule.java:39)
[junit4:junit4]    > 	at com.carrotsearch.randomizedtesting.rules.StatementAdapter.evaluate(StatementAdapter.java:36)
[junit4:junit4]    > 	at org.apache.lucene.util.TestRuleAssertionsRequired$1.evaluate(TestRuleAssertionsRequired.java:43)
[junit4:junit4]    > 	at org.apache.lucene.util.TestRuleMarkFailure$1.evaluate(TestRuleMarkFailure.java:48)
[junit4:junit4]    > 	at org.apache.lucene.util.TestRuleIgnoreAfterMaxFailures$1.evaluate(TestRuleIgnoreAfterMaxFailures.java:70)
[junit4:junit4]    > 	at org.apache.lucene.util.TestRuleIgnoreTestSuites$1.evaluate(TestRuleIgnoreTestSuites.java:55)
[junit4:junit4]    > 	at com.carrotsearch.randomizedtesting.rules.StatementAdapter.evaluate(StatementAdapter.java:36)
[junit4:junit4]    > 	at com.carrotsearch.randomizedtesting.ThreadLeakControl$StatementRunner.run(ThreadLeakControl.java:358)
[junit4:junit4]    > 	at java.lang.Thread.run(Thread.java:679)
[junit4:junit4]   2> 166314 T132 oas.SolrTestCaseJ4.deleteCore ###deleteCore
[junit4:junit4]   2> NOTE: test params are: codec=Lucene3x, sim=DefaultSimilarity, locale=el, timezone=Asia/Tel_Aviv
[junit4:junit4]   2> NOTE: FreeBSD 9.0-RELEASE amd64/Sun Microsystems Inc. 1.6.0_32 (64-bit)/cpus=16,threads=2,free=303287456,total=469827584
[junit4:junit4]   2> NOTE: All tests run in this JVM: [TestPartialUpdateDeduplication, TestFaceting, SimplePostToolTest, NoCacheHeaderTest, DirectSolrConnectionTest, QueryElevationComponentTest, TestFastWriter, AlternateDirectoryTest, TestDefaultSimilarityFactory, ZkControllerTest, SpellCheckComponentTest, TestFiltering, DistanceFunctionTest, MoreLikeThisHandlerTest, SyncSliceTest]
[junit4:junit4] Completed on J0 in 166.34s, 1 test, 1 failure <<< FAILURES!

[...truncated 585 lines...]
BUILD FAILED
/usr/home/hudson/hudson-slave/workspace/Lucene-Solr-Tests-4.x-Java6/build.xml:346: The following error occurred while executing this line:
/usr/home/hudson/hudson-slave/workspace/Lucene-Solr-Tests-4.x-Java6/build.xml:39: The following error occurred while executing this line:
/usr/home/hudson/hudson-slave/workspace/Lucene-Solr-Tests-4.x-Java6/solr/build.xml:178: The following error occurred while executing this line:
/usr/home/hudson/hudson-slave/workspace/Lucene-Solr-Tests-4.x-Java6/solr/common-build.xml:428: The following error occurred while executing this line:
/usr/home/hudson/hudson-slave/workspace/Lucene-Solr-Tests-4.x-Java6/lucene/common-build.xml:1176: The following error occurred while executing this line:
/usr/home/hudson/hudson-slave/workspace/Lucene-Solr-Tests-4.x-Java6/lucene/common-build.xml:841: There were test failures: 249 suites, 1040 tests, 1 failure, 23 ignored (5 assumptions)

Total time: 37 minutes 5 seconds
Build step 'Invoke Ant' marked build as failure
Archiving artifacts
Recording test results
Email was triggered for: Failure
Sending email for trigger: Failure



Mime
View raw message