lucene-dev mailing list archives

Site index · List index
Message view « Date » · « Thread »
Top « Date » · « Thread »
From Policeman Jenkins Server <jenk...@thetaphi.de>
Subject [JENKINS] Lucene-Solr-trunk-MacOSX (64bit/jdk1.7.0) - Build # 35 - Failure!
Date Wed, 02 Jan 2013 08:39:54 GMT
Build: http://jenkins.thetaphi.de/job/Lucene-Solr-trunk-MacOSX/35/
Java: 64bit/jdk1.7.0 -XX:+UseParallelGC

1 tests failed.
REGRESSION:  org.apache.solr.cloud.BasicDistributedZkTest.testDistribSearch

Error Message:
No registered leader was found, collection:multiunload2 slice:shard1

Stack Trace:
org.apache.solr.common.SolrException: No registered leader was found, collection:multiunload2 slice:shard1
	at org.apache.solr.common.cloud.ZkStateReader.getLeaderRetry(ZkStateReader.java:429)
	at org.apache.solr.cloud.BasicDistributedZkTest.testStopAndStartCoresInOneInstance(BasicDistributedZkTest.java:678)
	at org.apache.solr.cloud.BasicDistributedZkTest.doTest(BasicDistributedZkTest.java:339)
	at org.apache.solr.BaseDistributedSearchTestCase.testDistribSearch(BaseDistributedSearchTestCase.java:794)
	at sun.reflect.NativeMethodAccessorImpl.invoke0(Native Method)
	at sun.reflect.NativeMethodAccessorImpl.invoke(NativeMethodAccessorImpl.java:57)
	at sun.reflect.DelegatingMethodAccessorImpl.invoke(DelegatingMethodAccessorImpl.java:43)
	at java.lang.reflect.Method.invoke(Method.java:601)
	at com.carrotsearch.randomizedtesting.RandomizedRunner.invoke(RandomizedRunner.java:1559)
	at com.carrotsearch.randomizedtesting.RandomizedRunner.access$600(RandomizedRunner.java:79)
	at com.carrotsearch.randomizedtesting.RandomizedRunner$6.evaluate(RandomizedRunner.java:737)
	at com.carrotsearch.randomizedtesting.RandomizedRunner$7.evaluate(RandomizedRunner.java:773)
	at com.carrotsearch.randomizedtesting.RandomizedRunner$8.evaluate(RandomizedRunner.java:787)
	at com.carrotsearch.randomizedtesting.rules.SystemPropertiesRestoreRule$1.evaluate(SystemPropertiesRestoreRule.java:53)
	at org.apache.lucene.util.TestRuleSetupTeardownChained$1.evaluate(TestRuleSetupTeardownChained.java:50)
	at org.apache.lucene.util.TestRuleFieldCacheSanity$1.evaluate(TestRuleFieldCacheSanity.java:51)
	at org.apache.lucene.util.AbstractBeforeAfterRule$1.evaluate(AbstractBeforeAfterRule.java:46)
	at com.carrotsearch.randomizedtesting.rules.SystemPropertiesInvariantRule$1.evaluate(SystemPropertiesInvariantRule.java:55)
	at org.apache.lucene.util.TestRuleThreadAndTestName$1.evaluate(TestRuleThreadAndTestName.java:49)
	at org.apache.lucene.util.TestRuleIgnoreAfterMaxFailures$1.evaluate(TestRuleIgnoreAfterMaxFailures.java:70)
	at org.apache.lucene.util.TestRuleMarkFailure$1.evaluate(TestRuleMarkFailure.java:48)
	at com.carrotsearch.randomizedtesting.rules.StatementAdapter.evaluate(StatementAdapter.java:36)
	at com.carrotsearch.randomizedtesting.ThreadLeakControl$StatementRunner.run(ThreadLeakControl.java:358)
	at com.carrotsearch.randomizedtesting.ThreadLeakControl.forkTimeoutingTask(ThreadLeakControl.java:782)
	at com.carrotsearch.randomizedtesting.ThreadLeakControl$3.evaluate(ThreadLeakControl.java:442)
	at com.carrotsearch.randomizedtesting.RandomizedRunner.runSingleTest(RandomizedRunner.java:746)
	at com.carrotsearch.randomizedtesting.RandomizedRunner$3.evaluate(RandomizedRunner.java:648)
	at com.carrotsearch.randomizedtesting.RandomizedRunner$4.evaluate(RandomizedRunner.java:682)
	at com.carrotsearch.randomizedtesting.RandomizedRunner$5.evaluate(RandomizedRunner.java:693)
	at com.carrotsearch.randomizedtesting.rules.StatementAdapter.evaluate(StatementAdapter.java:36)
	at com.carrotsearch.randomizedtesting.rules.SystemPropertiesRestoreRule$1.evaluate(SystemPropertiesRestoreRule.java:53)
	at org.apache.lucene.util.AbstractBeforeAfterRule$1.evaluate(AbstractBeforeAfterRule.java:46)
	at org.apache.lucene.util.TestRuleStoreClassName$1.evaluate(TestRuleStoreClassName.java:42)
	at com.carrotsearch.randomizedtesting.rules.SystemPropertiesInvariantRule$1.evaluate(SystemPropertiesInvariantRule.java:55)
	at com.carrotsearch.randomizedtesting.rules.NoShadowingOrOverridesOnMethodsRule$1.evaluate(NoShadowingOrOverridesOnMethodsRule.java:39)
	at com.carrotsearch.randomizedtesting.rules.NoShadowingOrOverridesOnMethodsRule$1.evaluate(NoShadowingOrOverridesOnMethodsRule.java:39)
	at com.carrotsearch.randomizedtesting.rules.StatementAdapter.evaluate(StatementAdapter.java:36)
	at org.apache.lucene.util.TestRuleAssertionsRequired$1.evaluate(TestRuleAssertionsRequired.java:43)
	at org.apache.lucene.util.TestRuleMarkFailure$1.evaluate(TestRuleMarkFailure.java:48)
	at org.apache.lucene.util.TestRuleIgnoreAfterMaxFailures$1.evaluate(TestRuleIgnoreAfterMaxFailures.java:70)
	at org.apache.lucene.util.TestRuleIgnoreTestSuites$1.evaluate(TestRuleIgnoreTestSuites.java:55)
	at com.carrotsearch.randomizedtesting.rules.StatementAdapter.evaluate(StatementAdapter.java:36)
	at com.carrotsearch.randomizedtesting.ThreadLeakControl$StatementRunner.run(ThreadLeakControl.java:358)
	at java.lang.Thread.run(Thread.java:722)




Build Log:
[...truncated 9063 lines...]
[junit4:junit4] Suite: org.apache.solr.cloud.BasicDistributedZkTest
[junit4:junit4]   2> 0 T2160 oas.BaseDistributedSearchTestCase.initHostContext Setting hostContext system property: /
[junit4:junit4]   2> 12 T2160 oas.SolrTestCaseJ4.setUp ###Starting testDistribSearch
[junit4:junit4]   2> Creating dataDir: /Users/jenkins/jenkins-slave/workspace/Lucene-Solr-trunk-MacOSX/solr/build/solr-core/test/J0/./solrtest-BasicDistributedZkTest-1357115020541
[junit4:junit4]   2> 13 T2160 oasc.ZkTestServer.run STARTING ZK TEST SERVER
[junit4:junit4]   2> 14 T2161 oasc.ZkTestServer$ZKServerMain.runFromConfig Starting server
[junit4:junit4]   2> 16 T2161 oazs.ZooKeeperServer.setTickTime tickTime set to 1000
[junit4:junit4]   2> 16 T2161 oazs.ZooKeeperServer.setMinSessionTimeout minSessionTimeout set to -1
[junit4:junit4]   2> 16 T2161 oazs.ZooKeeperServer.setMaxSessionTimeout maxSessionTimeout set to -1
[junit4:junit4]   2> 17 T2161 oazs.NIOServerCnxnFactory.configure binding to port 0.0.0.0/0.0.0.0:0
[junit4:junit4]   2> 18 T2161 oazsp.FileTxnSnapLog.save Snapshotting: 0x0 to /Users/jenkins/jenkins-slave/workspace/Lucene-Solr-trunk-MacOSX/solr/build/solr-core/test/J0/./org.apache.solr.cloud.BasicDistributedZkTest-1357115020540/zookeeper/server1/data/version-2/snapshot.0
[junit4:junit4]   2> 17 T2160 oasc.ZkTestServer.run start zk server on port:49753
[junit4:junit4]   2> 22 T2160 oaz.ZooKeeper.<init> Initiating client connection, connectString=127.0.0.1:49753 sessionTimeout=10000 watcher=org.apache.solr.common.cloud.ConnectionManager@5b47e0c7
[junit4:junit4]   2> 32 T2160 oascc.ConnectionManager.waitForConnected Waiting for client to connect to ZooKeeper
[junit4:junit4]   2> 33 T2166 oaz.ClientCnxn$SendThread.logStartConnect Opening socket connection to server localhost/127.0.0.1:49753. Will not attempt to authenticate using SASL (access denied ("javax.security.auth.AuthPermission" "getLoginConfiguration"))
[junit4:junit4]   2> 45 T2166 oaz.ClientCnxn$SendThread.primeConnection Socket connection established to localhost/127.0.0.1:49753, initiating session
[junit4:junit4]   2> 56 T2162 oazs.NIOServerCnxnFactory.run Accepted socket connection from /127.0.0.1:49754
[junit4:junit4]   2> 56 T2162 oazs.ZooKeeperServer.processConnectRequest Client attempting to establish new session at /127.0.0.1:49754
[junit4:junit4]   2> 65 T2164 oazsp.FileTxnLog.append Creating new log file: log.1
[junit4:junit4]   2> 71 T2164 oazs.ZooKeeperServer.finishSessionInit Established session 0x13bfa5bd5030000 with negotiated timeout 10000 for client /127.0.0.1:49754
[junit4:junit4]   2> 72 T2166 oaz.ClientCnxn$SendThread.onConnected Session establishment complete on server localhost/127.0.0.1:49753, sessionid = 0x13bfa5bd5030000, negotiated timeout = 10000
[junit4:junit4]   2> 73 T2167 oascc.ConnectionManager.process Watcher org.apache.solr.common.cloud.ConnectionManager@5b47e0c7 name:ZooKeeperConnection Watcher:127.0.0.1:49753 got event WatchedEvent state:SyncConnected type:None path:null path:null type:None
[junit4:junit4]   2> 73 T2160 oascc.ConnectionManager.waitForConnected Client is connected to ZooKeeper
[junit4:junit4]   2> 73 T2160 oascc.SolrZkClient.makePath makePath: /solr
[junit4:junit4]   2> 79 T2165 oazs.PrepRequestProcessor.pRequest2Txn Processed session termination for sessionid: 0x13bfa5bd5030000
[junit4:junit4]   2> 80 T2160 oaz.ZooKeeper.close Session: 0x13bfa5bd5030000 closed
[junit4:junit4]   2> 83 T2162 oazs.NIOServerCnxn.closeSock Closed socket connection for client /127.0.0.1:49754 which had sessionid 0x13bfa5bd5030000
[junit4:junit4]   2> 83 T2167 oaz.ClientCnxn$EventThread.run EventThread shut down
[junit4:junit4]   2> 83 T2160 oaz.ZooKeeper.<init> Initiating client connection, connectString=127.0.0.1:49753/solr sessionTimeout=10000 watcher=org.apache.solr.common.cloud.ConnectionManager@190f3f60
[junit4:junit4]   2> 86 T2160 oascc.ConnectionManager.waitForConnected Waiting for client to connect to ZooKeeper
[junit4:junit4]   2> 86 T2168 oaz.ClientCnxn$SendThread.logStartConnect Opening socket connection to server localhost/127.0.0.1:49753. Will not attempt to authenticate using SASL (access denied ("javax.security.auth.AuthPermission" "getLoginConfiguration"))
[junit4:junit4]   2> 90 T2168 oaz.ClientCnxn$SendThread.primeConnection Socket connection established to localhost/127.0.0.1:49753, initiating session
[junit4:junit4]   2> 91 T2162 oazs.NIOServerCnxnFactory.run Accepted socket connection from /127.0.0.1:49755
[junit4:junit4]   2> 91 T2162 oazs.ZooKeeperServer.processConnectRequest Client attempting to establish new session at /127.0.0.1:49755
[junit4:junit4]   2> 99 T2168 oaz.ClientCnxn$SendThread.onConnected Session establishment complete on server localhost/127.0.0.1:49753, sessionid = 0x13bfa5bd5030001, negotiated timeout = 10000
[junit4:junit4]   2> 99 T2169 oascc.ConnectionManager.process Watcher org.apache.solr.common.cloud.ConnectionManager@190f3f60 name:ZooKeeperConnection Watcher:127.0.0.1:49753/solr got event WatchedEvent state:SyncConnected type:None path:null path:null type:None
[junit4:junit4]   2> 99 T2160 oascc.ConnectionManager.waitForConnected Client is connected to ZooKeeper
[junit4:junit4]   2> 100 T2160 oascc.SolrZkClient.makePath makePath: /collections/collection1
[junit4:junit4]   2> 98 T2164 oazs.ZooKeeperServer.finishSessionInit Established session 0x13bfa5bd5030001 with negotiated timeout 10000 for client /127.0.0.1:49755
[junit4:junit4]   2> 134 T2160 oascc.SolrZkClient.makePath makePath: /collections/collection1/shards
[junit4:junit4]   2> 139 T2160 oascc.SolrZkClient.makePath makePath: /collections/control_collection
[junit4:junit4]   2> 142 T2160 oascc.SolrZkClient.makePath makePath: /collections/control_collection/shards
[junit4:junit4]   2> 149 T2160 oasc.AbstractZkTestCase.putConfig put /Users/jenkins/jenkins-slave/workspace/Lucene-Solr-trunk-MacOSX/solr/build/solr-core/test-files/solr/collection1/conf/solrconfig.xml to /configs/conf1/solrconfig.xml
[junit4:junit4]   2> 151 T2160 oascc.SolrZkClient.makePath makePath: /configs/conf1/solrconfig.xml
[junit4:junit4]   2> 157 T2160 oasc.AbstractZkTestCase.putConfig put /Users/jenkins/jenkins-slave/workspace/Lucene-Solr-trunk-MacOSX/solr/build/solr-core/test-files/solr/collection1/conf/schema.xml to /configs/conf1/schema.xml
[junit4:junit4]   2> 158 T2160 oascc.SolrZkClient.makePath makePath: /configs/conf1/schema.xml
[junit4:junit4]   2> 202 T2160 oasc.AbstractZkTestCase.putConfig put /Users/jenkins/jenkins-slave/workspace/Lucene-Solr-trunk-MacOSX/solr/build/solr-core/test-files/solr/collection1/conf/stopwords.txt to /configs/conf1/stopwords.txt
[junit4:junit4]   2> 203 T2160 oascc.SolrZkClient.makePath makePath: /configs/conf1/stopwords.txt
[junit4:junit4]   2> 213 T2160 oasc.AbstractZkTestCase.putConfig put /Users/jenkins/jenkins-slave/workspace/Lucene-Solr-trunk-MacOSX/solr/build/solr-core/test-files/solr/collection1/conf/protwords.txt to /configs/conf1/protwords.txt
[junit4:junit4]   2> 214 T2160 oascc.SolrZkClient.makePath makePath: /configs/conf1/protwords.txt
[junit4:junit4]   2> 218 T2160 oasc.AbstractZkTestCase.putConfig put /Users/jenkins/jenkins-slave/workspace/Lucene-Solr-trunk-MacOSX/solr/build/solr-core/test-files/solr/collection1/conf/currency.xml to /configs/conf1/currency.xml
[junit4:junit4]   2> 219 T2160 oascc.SolrZkClient.makePath makePath: /configs/conf1/currency.xml
[junit4:junit4]   2> 223 T2160 oasc.AbstractZkTestCase.putConfig put /Users/jenkins/jenkins-slave/workspace/Lucene-Solr-trunk-MacOSX/solr/build/solr-core/test-files/solr/collection1/conf/open-exchange-rates.json to /configs/conf1/open-exchange-rates.json
[junit4:junit4]   2> 224 T2160 oascc.SolrZkClient.makePath makePath: /configs/conf1/open-exchange-rates.json
[junit4:junit4]   2> 253 T2160 oasc.AbstractZkTestCase.putConfig put /Users/jenkins/jenkins-slave/workspace/Lucene-Solr-trunk-MacOSX/solr/build/solr-core/test-files/solr/collection1/conf/mapping-ISOLatin1Accent.txt to /configs/conf1/mapping-ISOLatin1Accent.txt
[junit4:junit4]   2> 254 T2160 oascc.SolrZkClient.makePath makePath: /configs/conf1/mapping-ISOLatin1Accent.txt
[junit4:junit4]   2> 257 T2160 oasc.AbstractZkTestCase.putConfig put /Users/jenkins/jenkins-slave/workspace/Lucene-Solr-trunk-MacOSX/solr/build/solr-core/test-files/solr/collection1/conf/old_synonyms.txt to /configs/conf1/old_synonyms.txt
[junit4:junit4]   2> 258 T2160 oascc.SolrZkClient.makePath makePath: /configs/conf1/old_synonyms.txt
[junit4:junit4]   2> 267 T2160 oasc.AbstractZkTestCase.putConfig put /Users/jenkins/jenkins-slave/workspace/Lucene-Solr-trunk-MacOSX/solr/build/solr-core/test-files/solr/collection1/conf/synonyms.txt to /configs/conf1/synonyms.txt
[junit4:junit4]   2> 268 T2160 oascc.SolrZkClient.makePath makePath: /configs/conf1/synonyms.txt
[junit4:junit4]   2> 276 T2165 oazs.PrepRequestProcessor.pRequest2Txn Processed session termination for sessionid: 0x13bfa5bd5030001
[junit4:junit4]   2> 277 T2162 oazs.NIOServerCnxn.closeSock Closed socket connection for client /127.0.0.1:49755 which had sessionid 0x13bfa5bd5030001
[junit4:junit4]   2> 277 T2160 oaz.ZooKeeper.close Session: 0x13bfa5bd5030001 closed
[junit4:junit4]   2> 278 T2169 oaz.ClientCnxn$EventThread.run EventThread shut down
[junit4:junit4]   2> 554 T2160 oejs.Server.doStart jetty-8.1.8.v20121106
[junit4:junit4]   2> 563 T2160 oejs.AbstractConnector.doStart Started SelectChannelConnector@127.0.0.1:49756
[junit4:junit4]   2> 565 T2160 oasc.SolrResourceLoader.locateSolrHome JNDI not configured for solr (NoInitialContextEx)
[junit4:junit4]   2> 566 T2160 oasc.SolrResourceLoader.locateSolrHome using system property solr.solr.home: /Users/jenkins/jenkins-slave/workspace/Lucene-Solr-trunk-MacOSX/solr/build/solr-core/test/J0/./org.apache.solr.cloud.BasicDistributedZkTest-controljetty-1357115020806
[junit4:junit4]   2> 567 T2160 oasc.SolrResourceLoader.<init> new SolrResourceLoader for deduced Solr Home: '/Users/jenkins/jenkins-slave/workspace/Lucene-Solr-trunk-MacOSX/solr/build/solr-core/test/J0/./org.apache.solr.cloud.BasicDistributedZkTest-controljetty-1357115020806/'
[junit4:junit4]   2> 599 T2160 oass.SolrDispatchFilter.init SolrDispatchFilter.init()
[junit4:junit4]   2> 599 T2160 oasc.SolrResourceLoader.locateSolrHome JNDI not configured for solr (NoInitialContextEx)
[junit4:junit4]   2> 600 T2160 oasc.SolrResourceLoader.locateSolrHome using system property solr.solr.home: /Users/jenkins/jenkins-slave/workspace/Lucene-Solr-trunk-MacOSX/solr/build/solr-core/test/J0/./org.apache.solr.cloud.BasicDistributedZkTest-controljetty-1357115020806
[junit4:junit4]   2> 600 T2160 oasc.CoreContainer$Initializer.initialize looking for solr.xml: /Users/jenkins/jenkins-slave/workspace/Lucene-Solr-trunk-MacOSX/solr/build/solr-core/test/J0/./org.apache.solr.cloud.BasicDistributedZkTest-controljetty-1357115020806/solr.xml
[junit4:junit4]   2> 601 T2160 oasc.CoreContainer.<init> New CoreContainer 535922821
[junit4:junit4]   2> 601 T2160 oasc.CoreContainer.load Loading CoreContainer using Solr Home: '/Users/jenkins/jenkins-slave/workspace/Lucene-Solr-trunk-MacOSX/solr/build/solr-core/test/J0/./org.apache.solr.cloud.BasicDistributedZkTest-controljetty-1357115020806/'
[junit4:junit4]   2> 602 T2160 oasc.SolrResourceLoader.<init> new SolrResourceLoader for directory: '/Users/jenkins/jenkins-slave/workspace/Lucene-Solr-trunk-MacOSX/solr/build/solr-core/test/J0/./org.apache.solr.cloud.BasicDistributedZkTest-controljetty-1357115020806/'
[junit4:junit4]   2> 626 T2160 oashc.HttpShardHandlerFactory.getParameter Setting socketTimeout to: 30000
[junit4:junit4]   2> 627 T2160 oashc.HttpShardHandlerFactory.getParameter Setting urlScheme to: http://
[junit4:junit4]   2> 627 T2160 oashc.HttpShardHandlerFactory.getParameter Setting connTimeout to: 15000
[junit4:junit4]   2> 628 T2160 oashc.HttpShardHandlerFactory.getParameter Setting maxConnectionsPerHost to: 20
[junit4:junit4]   2> 628 T2160 oashc.HttpShardHandlerFactory.getParameter Setting corePoolSize to: 0
[junit4:junit4]   2> 629 T2160 oashc.HttpShardHandlerFactory.getParameter Setting maximumPoolSize to: 2147483647
[junit4:junit4]   2> 629 T2160 oashc.HttpShardHandlerFactory.getParameter Setting maxThreadIdleTime to: 5
[junit4:junit4]   2> 629 T2160 oashc.HttpShardHandlerFactory.getParameter Setting sizeOfQueue to: -1
[junit4:junit4]   2> 630 T2160 oashc.HttpShardHandlerFactory.getParameter Setting fairnessPolicy to: false
[junit4:junit4]   2> 630 T2160 oascsi.HttpClientUtil.createClient Creating new http client, config:maxConnectionsPerHost=20&maxConnections=10000&socketTimeout=30000&connTimeout=15000&retry=false
[junit4:junit4]   2> 645 T2160 oasc.CoreContainer.load Registering Log Listener
[junit4:junit4]   2> 672 T2160 oasc.CoreContainer.initZooKeeper Zookeeper client=127.0.0.1:49753/solr
[junit4:junit4]   2> 673 T2160 oasc.ZkController.checkChrootPath zkHost includes chroot
[junit4:junit4]   2> 674 T2160 oaz.ZooKeeper.<init> Initiating client connection, connectString=127.0.0.1:49753 sessionTimeout=60000 watcher=org.apache.solr.common.cloud.ConnectionManager@55dec996
[junit4:junit4]   2> 677 T2160 oascc.ConnectionManager.waitForConnected Waiting for client to connect to ZooKeeper
[junit4:junit4]   2> 678 T2179 oaz.ClientCnxn$SendThread.logStartConnect Opening socket connection to server localhost/127.0.0.1:49753. Will not attempt to authenticate using SASL (access denied ("javax.security.auth.AuthPermission" "getLoginConfiguration"))
[junit4:junit4]   2> 679 T2179 oaz.ClientCnxn$SendThread.primeConnection Socket connection established to localhost/127.0.0.1:49753, initiating session
[junit4:junit4]   2> 680 T2162 oazs.NIOServerCnxnFactory.run Accepted socket connection from /127.0.0.1:49757
[junit4:junit4]   2> 680 T2162 oazs.ZooKeeperServer.processConnectRequest Client attempting to establish new session at /127.0.0.1:49757
[junit4:junit4]   2> 682 T2164 oazs.ZooKeeperServer.finishSessionInit Established session 0x13bfa5bd5030002 with negotiated timeout 20000 for client /127.0.0.1:49757
[junit4:junit4]   2> 682 T2179 oaz.ClientCnxn$SendThread.onConnected Session establishment complete on server localhost/127.0.0.1:49753, sessionid = 0x13bfa5bd5030002, negotiated timeout = 20000
[junit4:junit4]   2> 682 T2180 oascc.ConnectionManager.process Watcher org.apache.solr.common.cloud.ConnectionManager@55dec996 name:ZooKeeperConnection Watcher:127.0.0.1:49753 got event WatchedEvent state:SyncConnected type:None path:null path:null type:None
[junit4:junit4]   2> 683 T2160 oascc.ConnectionManager.waitForConnected Client is connected to ZooKeeper
[junit4:junit4]   2> 685 T2165 oazs.PrepRequestProcessor.pRequest2Txn Processed session termination for sessionid: 0x13bfa5bd5030002
[junit4:junit4]   2> 686 T2162 oazs.NIOServerCnxn.closeSock Closed socket connection for client /127.0.0.1:49757 which had sessionid 0x13bfa5bd5030002
[junit4:junit4]   2> 686 T2180 oaz.ClientCnxn$EventThread.run EventThread shut down
[junit4:junit4]   2> 686 T2160 oaz.ZooKeeper.close Session: 0x13bfa5bd5030002 closed
[junit4:junit4]   2> 687 T2160 oascsi.HttpClientUtil.createClient Creating new http client, config:maxConnections=500&maxConnectionsPerHost=16&socketTimeout=15000&connTimeout=30000
[junit4:junit4]   2> 692 T2160 oaz.ZooKeeper.<init> Initiating client connection, connectString=127.0.0.1:49753/solr sessionTimeout=30000 watcher=org.apache.solr.common.cloud.ConnectionManager@4b614635
[junit4:junit4]   2> 693 T2160 oascc.ConnectionManager.waitForConnected Waiting for client to connect to ZooKeeper
[junit4:junit4]   2> 694 T2181 oaz.ClientCnxn$SendThread.logStartConnect Opening socket connection to server localhost/127.0.0.1:49753. Will not attempt to authenticate using SASL (access denied ("javax.security.auth.AuthPermission" "getLoginConfiguration"))
[junit4:junit4]   2> 694 T2181 oaz.ClientCnxn$SendThread.primeConnection Socket connection established to localhost/127.0.0.1:49753, initiating session
[junit4:junit4]   2> 695 T2162 oazs.NIOServerCnxnFactory.run Accepted socket connection from /127.0.0.1:49758
[junit4:junit4]   2> 695 T2162 oazs.ZooKeeperServer.processConnectRequest Client attempting to establish new session at /127.0.0.1:49758
[junit4:junit4]   2> 697 T2164 oazs.ZooKeeperServer.finishSessionInit Established session 0x13bfa5bd5030003 with negotiated timeout 20000 for client /127.0.0.1:49758
[junit4:junit4]   2> 697 T2181 oaz.ClientCnxn$SendThread.onConnected Session establishment complete on server localhost/127.0.0.1:49753, sessionid = 0x13bfa5bd5030003, negotiated timeout = 20000
[junit4:junit4]   2> 697 T2182 oascc.ConnectionManager.process Watcher org.apache.solr.common.cloud.ConnectionManager@4b614635 name:ZooKeeperConnection Watcher:127.0.0.1:49753/solr got event WatchedEvent state:SyncConnected type:None path:null path:null type:None
[junit4:junit4]   2> 698 T2160 oascc.ConnectionManager.waitForConnected Client is connected to ZooKeeper
[junit4:junit4]   2> 701 T2165 oazs.PrepRequestProcessor.pRequest Got user-level KeeperException when processing sessionid:0x13bfa5bd5030003 type:create cxid:0x2 zxid:0x1a txntype:-1 reqpath:n/a Error Path:/solr/overseer Error:KeeperErrorCode = NodeExists for /solr/overseer
[junit4:junit4]   2> 703 T2160 oascc.SolrZkClient.makePath makePath: /live_nodes
[junit4:junit4]   2> 706 T2160 oasc.ZkController.createEphemeralLiveNode Register node as live in ZooKeeper:/live_nodes/127.0.0.1:49756_
[junit4:junit4]   2> 707 T2165 oazs.PrepRequestProcessor.pRequest Got user-level KeeperException when processing sessionid:0x13bfa5bd5030003 type:delete cxid:0x7 zxid:0x1c txntype:-1 reqpath:n/a Error Path:/solr/live_nodes/127.0.0.1:49756_ Error:KeeperErrorCode = NoNode for /solr/live_nodes/127.0.0.1:49756_
[junit4:junit4]   2> 708 T2160 oascc.SolrZkClient.makePath makePath: /live_nodes/127.0.0.1:49756_
[junit4:junit4]   2> 714 T2160 oascc.SolrZkClient.makePath makePath: /overseer_elect/election
[junit4:junit4]   2> 722 T2165 oazs.PrepRequestProcessor.pRequest Got user-level KeeperException when processing sessionid:0x13bfa5bd5030003 type:delete cxid:0x15 zxid:0x21 txntype:-1 reqpath:n/a Error Path:/solr/overseer_elect/leader Error:KeeperErrorCode = NoNode for /solr/overseer_elect/leader
[junit4:junit4]   2> 723 T2160 oascc.SolrZkClient.makePath makePath: /overseer_elect/leader
[junit4:junit4]   2> 726 T2160 oasc.Overseer.start Overseer (id=88939889986568195-127.0.0.1:49756_-n_0000000000) starting
[junit4:junit4]   2> 727 T2165 oazs.PrepRequestProcessor.pRequest Got user-level KeeperException when processing sessionid:0x13bfa5bd5030003 type:create cxid:0x1a zxid:0x23 txntype:-1 reqpath:n/a Error Path:/solr/overseer Error:KeeperErrorCode = NodeExists for /solr/overseer
[junit4:junit4]   2> 729 T2165 oazs.PrepRequestProcessor.pRequest Got user-level KeeperException when processing sessionid:0x13bfa5bd5030003 type:create cxid:0x1b zxid:0x24 txntype:-1 reqpath:n/a Error Path:/solr/overseer Error:KeeperErrorCode = NodeExists for /solr/overseer
[junit4:junit4]   2> 735 T2165 oazs.PrepRequestProcessor.pRequest Got user-level KeeperException when processing sessionid:0x13bfa5bd5030003 type:create cxid:0x1c zxid:0x25 txntype:-1 reqpath:n/a Error Path:/solr/overseer Error:KeeperErrorCode = NodeExists for /solr/overseer
[junit4:junit4]   2> 739 T2165 oazs.PrepRequestProcessor.pRequest Got user-level KeeperException when processing sessionid:0x13bfa5bd5030003 type:create cxid:0x1d zxid:0x26 txntype:-1 reqpath:n/a Error Path:/solr/overseer Error:KeeperErrorCode = NodeExists for /solr/overseer
[junit4:junit4]   2> 740 T2184 oasc.OverseerCollectionProcessor.run Process current queue of collection messages
[junit4:junit4]   2> 742 T2160 oascc.SolrZkClient.makePath makePath: /clusterstate.json
[junit4:junit4]   2> 746 T2160 oascc.ZkStateReader.createClusterStateWatchersAndUpdate Updating cluster state from ZooKeeper... 
[junit4:junit4]   2> 750 T2183 oasc.Overseer$ClusterStateUpdater.run Starting to work on the main queue
[junit4:junit4]   2> 755 T2185 oasc.CoreContainer.create Creating SolrCore 'collection1' using instanceDir: /Users/jenkins/jenkins-slave/workspace/Lucene-Solr-trunk-MacOSX/solr/build/solr-core/test/J0/./org.apache.solr.cloud.BasicDistributedZkTest-controljetty-1357115020806/collection1
[junit4:junit4]   2> 756 T2185 oasc.ZkController.createCollectionZkNode Check for collection zkNode:control_collection
[junit4:junit4]   2> 757 T2185 oasc.ZkController.createCollectionZkNode Collection zkNode exists
[junit4:junit4]   2> 757 T2185 oasc.ZkController.readConfigName Load collection config from:/collections/control_collection
[junit4:junit4]   2> 759 T2185 oasc.SolrResourceLoader.<init> new SolrResourceLoader for directory: '/Users/jenkins/jenkins-slave/workspace/Lucene-Solr-trunk-MacOSX/solr/build/solr-core/test/J0/./org.apache.solr.cloud.BasicDistributedZkTest-controljetty-1357115020806/collection1/'
[junit4:junit4]   2> 760 T2185 oasc.SolrResourceLoader.replaceClassLoader Adding 'file:/Users/jenkins/jenkins-slave/workspace/Lucene-Solr-trunk-MacOSX/solr/build/solr-core/test/J0/org.apache.solr.cloud.BasicDistributedZkTest-controljetty-1357115020806/collection1/lib/classes/' to classloader
[junit4:junit4]   2> 761 T2185 oasc.SolrResourceLoader.replaceClassLoader Adding 'file:/Users/jenkins/jenkins-slave/workspace/Lucene-Solr-trunk-MacOSX/solr/build/solr-core/test/J0/org.apache.solr.cloud.BasicDistributedZkTest-controljetty-1357115020806/collection1/lib/README' to classloader
[junit4:junit4]   2> 814 T2185 oasc.SolrConfig.<init> Using Lucene MatchVersion: LUCENE_50
[junit4:junit4]   2> 876 T2185 oasc.SolrConfig.<init> Loaded SolrConfig: solrconfig.xml
[junit4:junit4]   2> 878 T2185 oass.IndexSchema.readSchema Reading Solr Schema
[junit4:junit4]   2> 883 T2185 oass.IndexSchema.readSchema Schema name=test
[junit4:junit4]   2> 1499 T2185 oass.OpenExchangeRatesOrgProvider.init Initialized with rates=open-exchange-rates.json, refreshInterval=1440.
[junit4:junit4]   2> 1512 T2185 oass.IndexSchema.readSchema default search field in schema is text
[junit4:junit4]   2> 1517 T2185 oass.IndexSchema.readSchema unique key field: id
[junit4:junit4]   2> 1542 T2185 oass.FileExchangeRateProvider.reload Reloading exchange rates from file currency.xml
[junit4:junit4]   2> 1548 T2185 oass.FileExchangeRateProvider.reload Reloading exchange rates from file currency.xml
[junit4:junit4]   2> 1554 T2185 oass.OpenExchangeRatesOrgProvider.reload Reloading exchange rates from open-exchange-rates.json
[junit4:junit4]   2> 1556 T2185 oass.OpenExchangeRatesOrgProvider.reload Reloading exchange rates from open-exchange-rates.json
[junit4:junit4]   2> 1558 T2185 oasc.SolrCore.<init> [collection1] Opening new SolrCore at /Users/jenkins/jenkins-slave/workspace/Lucene-Solr-trunk-MacOSX/solr/build/solr-core/test/J0/./org.apache.solr.cloud.BasicDistributedZkTest-controljetty-1357115020806/collection1/, dataDir=./org.apache.solr.cloud.BasicDistributedZkTest-1357115020540/control/data/
[junit4:junit4]   2> 1559 T2185 oasc.JmxMonitoredMap.<init> JMX monitoring is enabled. Adding Solr mbeans to JMX Server: com.sun.jmx.mbeanserver.JmxMBeanServer@26d68a6e
[junit4:junit4]   2> 1559 T2185 oasc.SolrCore.initDirectoryFactory solr.StandardDirectoryFactory
[junit4:junit4]   2> 1560 T2185 oasc.CachingDirectoryFactory.get return new directory for /Users/jenkins/jenkins-slave/workspace/Lucene-Solr-trunk-MacOSX/solr/build/solr-core/test/J0/./org.apache.solr.cloud.BasicDistributedZkTest-1357115020540/control/data forceNew:false
[junit4:junit4]   2> 1561 T2185 oasc.CachingDirectoryFactory.close Releasing directory:/Users/jenkins/jenkins-slave/workspace/Lucene-Solr-trunk-MacOSX/solr/build/solr-core/test/J0/./org.apache.solr.cloud.BasicDistributedZkTest-1357115020540/control/data
[junit4:junit4]   2> 1561 T2185 oasc.SolrCore.getNewIndexDir New index directory detected: old=null new=./org.apache.solr.cloud.BasicDistributedZkTest-1357115020540/control/data/index/
[junit4:junit4]   2> 1562 T2185 oasc.SolrCore.initIndex WARNING [collection1] Solr index directory './org.apache.solr.cloud.BasicDistributedZkTest-1357115020540/control/data/index' doesn't exist. Creating new index...
[junit4:junit4]   2> 1563 T2185 oasc.CachingDirectoryFactory.get return new directory for /Users/jenkins/jenkins-slave/workspace/Lucene-Solr-trunk-MacOSX/solr/build/solr-core/test/J0/./org.apache.solr.cloud.BasicDistributedZkTest-1357115020540/control/data/index forceNew:false
[junit4:junit4]   2> 1573 T2185 oasc.SolrDeletionPolicy.onCommit SolrDeletionPolicy.onCommit: commits:num=1
[junit4:junit4]   2> 		commit{dir=RateLimitedDirectoryWrapper(org.apache.lucene.store.NIOFSDirectory@/Users/jenkins/jenkins-slave/workspace/Lucene-Solr-trunk-MacOSX/solr/build/solr-core/test/J0/org.apache.solr.cloud.BasicDistributedZkTest-1357115020540/control/data/index lockFactory=org.apache.lucene.store.NativeFSLockFactory@5ad07e3a),segFN=segments_1,generation=1,filenames=[segments_1]
[junit4:junit4]   2> 1573 T2185 oasc.SolrDeletionPolicy.updateCommits newest commit = 1[segments_1]
[junit4:junit4]   2> 1575 T2185 oasc.CachingDirectoryFactory.close Releasing directory:/Users/jenkins/jenkins-slave/workspace/Lucene-Solr-trunk-MacOSX/solr/build/solr-core/test/J0/./org.apache.solr.cloud.BasicDistributedZkTest-1357115020540/control/data/index
[junit4:junit4]   2> 1575 T2185 oasc.SolrCore.initWriters created xml: solr.XMLResponseWriter
[junit4:junit4]   2> 1578 T2185 oasup.UpdateRequestProcessorChain.init inserting DistributedUpdateProcessorFactory into updateRequestProcessorChain "dedupe"
[junit4:junit4]   2> 1578 T2185 oasup.UpdateRequestProcessorChain.init inserting DistributedUpdateProcessorFactory into updateRequestProcessorChain "dedupe-allfields"
[junit4:junit4]   2> 1579 T2185 oasup.UpdateRequestProcessorChain.init inserting DistributedUpdateProcessorFactory into updateRequestProcessorChain "stored_sig"
[junit4:junit4]   2> 1579 T2185 oasup.UpdateRequestProcessorChain.init inserting DistributedUpdateProcessorFactory into updateRequestProcessorChain "uniq-fields"
[junit4:junit4]   2> 1580 T2185 oasup.UpdateRequestProcessorChain.init inserting DistributedUpdateProcessorFactory into updateRequestProcessorChain "distrib-dup-test-chain-implicit"
[junit4:junit4]   2> 1580 T2185 oasc.RequestHandlers.initHandlersFromConfig adding lazy requestHandler: solr.ReplicationHandler
[junit4:junit4]   2> 1580 T2185 oasc.RequestHandlers.initHandlersFromConfig created /replication: solr.ReplicationHandler
[junit4:junit4]   2> 1581 T2185 oasc.RequestHandlers.initHandlersFromConfig created standard: solr.StandardRequestHandler
[junit4:junit4]   2> 1581 T2185 oasc.RequestHandlers.initHandlersFromConfig created /get: solr.RealTimeGetHandler
[junit4:junit4]   2> 1582 T2185 oasc.RequestHandlers.initHandlersFromConfig created dismax: solr.SearchHandler
[junit4:junit4]   2> 1583 T2185 oasc.RequestHandlers.initHandlersFromConfig created mock: org.apache.solr.core.MockQuerySenderListenerReqHandler
[junit4:junit4]   2> 1583 T2185 oasc.RequestHandlers.initHandlersFromConfig created /admin/: org.apache.solr.handler.admin.AdminHandlers
[junit4:junit4]   2> 1583 T2185 oasc.RequestHandlers.initHandlersFromConfig created defaults: solr.StandardRequestHandler
[junit4:junit4]   2> 1584 T2185 oasc.RequestHandlers.initHandlersFromConfig adding lazy requestHandler: solr.StandardRequestHandler
[junit4:junit4]   2> 1586 T2185 oasc.RequestHandlers.initHandlersFromConfig created lazy: solr.StandardRequestHandler
[junit4:junit4]   2> 1587 T2185 oasc.RequestHandlers.initHandlersFromConfig created /update: solr.UpdateRequestHandler
[junit4:junit4]   2> 1588 T2185 oasc.RequestHandlers.initHandlersFromConfig created /terms: org.apache.solr.handler.component.SearchHandler
[junit4:junit4]   2> 1588 T2185 oasc.RequestHandlers.initHandlersFromConfig created spellCheckCompRH: org.apache.solr.handler.component.SearchHandler
[junit4:junit4]   2> 1588 T2185 oasc.RequestHandlers.initHandlersFromConfig created spellCheckCompRH_Direct: org.apache.solr.handler.component.SearchHandler
[junit4:junit4]   2> 1589 T2185 oasc.RequestHandlers.initHandlersFromConfig created spellCheckWithWordbreak: org.apache.solr.handler.component.SearchHandler
[junit4:junit4]   2> 1589 T2185 oasc.RequestHandlers.initHandlersFromConfig created spellCheckWithWordbreak_Direct: org.apache.solr.handler.component.SearchHandler
[junit4:junit4]   2> 1590 T2185 oasc.RequestHandlers.initHandlersFromConfig created spellCheckCompRH1: org.apache.solr.handler.component.SearchHandler
[junit4:junit4]   2> 1590 T2185 oasc.RequestHandlers.initHandlersFromConfig created mltrh: org.apache.solr.handler.component.SearchHandler
[junit4:junit4]   2> 1591 T2185 oasc.RequestHandlers.initHandlersFromConfig created tvrh: org.apache.solr.handler.component.SearchHandler
[junit4:junit4]   2> 1591 T2185 oasc.RequestHandlers.initHandlersFromConfig created /mlt: solr.MoreLikeThisHandler
[junit4:junit4]   2> 1592 T2185 oasc.RequestHandlers.initHandlersFromConfig created /debug/dump: solr.DumpRequestHandler
[junit4:junit4]   2> 1598 T2185 oashl.XMLLoader.init xsltCacheLifetimeSeconds=60
[junit4:junit4]   2> 1602 T2185 oasc.SolrCore.initDeprecatedSupport WARNING solrconfig.xml uses deprecated <admin/gettableFiles>, Please update your config to use the ShowFileRequestHandler.
[junit4:junit4]   2> 1604 T2185 oasc.SolrCore.initDeprecatedSupport WARNING adding ShowFileRequestHandler with hidden files: [SCHEMA.XML, OLD_SYNONYMS.TXT, STOPWORDS.TXT, PROTWORDS.TXT, OPEN-EXCHANGE-RATES.JSON, SYNONYMS.TXT, CURRENCY.XML, MAPPING-ISOLATIN1ACCENT.TXT]
[junit4:junit4]   2> 1606 T2185 oasc.CachingDirectoryFactory.close Releasing directory:/Users/jenkins/jenkins-slave/workspace/Lucene-Solr-trunk-MacOSX/solr/build/solr-core/test/J0/./org.apache.solr.cloud.BasicDistributedZkTest-1357115020540/control/data
[junit4:junit4]   2> 1607 T2185 oass.SolrIndexSearcher.<init> Opening Searcher@2dbc07cb main
[junit4:junit4]   2> 1609 T2185 oasu.CommitTracker.<init> Hard AutoCommit: disabled
[junit4:junit4]   2> 1609 T2185 oasu.CommitTracker.<init> Soft AutoCommit: disabled
[junit4:junit4]   2> 1609 T2185 oashc.SpellCheckComponent.inform Initializing spell checkers
[junit4:junit4]   2> 1615 T2185 oass.DirectSolrSpellChecker.init init: {name=direct,classname=DirectSolrSpellChecker,field=lowerfilt,minQueryLength=3}
[junit4:junit4]   2> 1653 T2186 oasc.SolrCore.registerSearcher [collection1] Registered new searcher Searcher@2dbc07cb main{StandardDirectoryReader(segments_1:1)}
[junit4:junit4]   2> 1659 T2185 oasc.ZkController.publish publishing core=collection1 state=down
[junit4:junit4]   2> 1659 T2185 oasc.ZkController.publish numShards not found on descriptor - reading it from system property
[junit4:junit4]   2> 1660 T2165 oazs.PrepRequestProcessor.pRequest Got user-level KeeperException when processing sessionid:0x13bfa5bd5030003 type:create cxid:0x50 zxid:0x29 txntype:-1 reqpath:n/a Error Path:/solr/overseer/queue Error:KeeperErrorCode = NoNode for /solr/overseer/queue
[junit4:junit4]   2> 2260 T2183 oascc.ZkStateReader.updateClusterState Updating cloud state from ZooKeeper... 
[junit4:junit4]   2> 2262 T2183 oasc.Overseer$ClusterStateUpdater.updateState Update state numShards=1 message={
[junit4:junit4]   2> 	  "operation":"state",
[junit4:junit4]   2> 	  "numShards":"1",
[junit4:junit4]   2> 	  "shard":null,
[junit4:junit4]   2> 	  "roles":null,
[junit4:junit4]   2> 	  "state":"down",
[junit4:junit4]   2> 	  "core":"collection1",
[junit4:junit4]   2> 	  "collection":"control_collection",
[junit4:junit4]   2> 	  "node_name":"127.0.0.1:49756_",
[junit4:junit4]   2> 	  "base_url":"http://127.0.0.1:49756"}
[junit4:junit4]   2> 2262 T2183 oasc.Overseer$ClusterStateUpdater.createCollection Create collection control_collection with numShards 1
[junit4:junit4]   2> 2263 T2183 oasc.Overseer$ClusterStateUpdater.updateState Assigning new node to shard shard=shard1
[junit4:junit4]   2> 2264 T2165 oazs.PrepRequestProcessor.pRequest Got user-level KeeperException when processing sessionid:0x13bfa5bd5030003 type:create cxid:0x58 zxid:0x2c txntype:-1 reqpath:n/a Error Path:/solr/overseer/queue-work Error:KeeperErrorCode = NoNode for /solr/overseer/queue-work
[junit4:junit4]   2> 2276 T2182 oascc.ZkStateReader$2.process A cluster state change: WatchedEvent state:SyncConnected type:NodeDataChanged path:/clusterstate.json, has occurred - updating... (live nodes size: 1)
[junit4:junit4]   2> 2665 T2185 oasc.CoreContainer.registerCore registering core: collection1
[junit4:junit4]   2> 2665 T2185 oasc.ZkController.register Register replica - core:collection1 address:http://127.0.0.1:49756 collection:control_collection shard:shard1
[junit4:junit4]   2> 2668 T2185 oascc.SolrZkClient.makePath makePath: /collections/control_collection/leader_elect/shard1/election
[junit4:junit4]   2> 2681 T2165 oazs.PrepRequestProcessor.pRequest Got user-level KeeperException when processing sessionid:0x13bfa5bd5030003 type:delete cxid:0x72 zxid:0x36 txntype:-1 reqpath:n/a Error Path:/solr/collections/control_collection/leaders Error:KeeperErrorCode = NoNode for /solr/collections/control_collection/leaders
[junit4:junit4]   2> 2682 T2185 oasc.ShardLeaderElectionContext.runLeaderProcess Running the leader process.
[junit4:junit4]   2> 2683 T2165 oazs.PrepRequestProcessor.pRequest Got user-level KeeperException when processing sessionid:0x13bfa5bd5030003 type:create cxid:0x73 zxid:0x37 txntype:-1 reqpath:n/a Error Path:/solr/overseer Error:KeeperErrorCode = NodeExists for /solr/overseer
[junit4:junit4]   2> 2685 T2185 oasc.ShardLeaderElectionContext.waitForReplicasToComeUp Enough replicas found to continue.
[junit4:junit4]   2> 2685 T2185 oasc.ShardLeaderElectionContext.runLeaderProcess I may be the new leader - try and sync
[junit4:junit4]   2> 2686 T2185 oasc.SyncStrategy.sync Sync replicas to http://127.0.0.1:49756/collection1/
[junit4:junit4]   2> 2686 T2185 oasc.SyncStrategy.syncReplicas Sync Success - now sync replicas to me
[junit4:junit4]   2> 2686 T2185 oasc.SyncStrategy.syncToMe http://127.0.0.1:49756/collection1/ has no replicas
[junit4:junit4]   2> 2686 T2185 oasc.ShardLeaderElectionContext.runLeaderProcess I am the new leader: http://127.0.0.1:49756/collection1/
[junit4:junit4]   2> 2687 T2185 oascc.SolrZkClient.makePath makePath: /collections/control_collection/leaders/shard1
[junit4:junit4]   2> 2694 T2165 oazs.PrepRequestProcessor.pRequest Got user-level KeeperException when processing sessionid:0x13bfa5bd5030003 type:create cxid:0x7d zxid:0x3b txntype:-1 reqpath:n/a Error Path:/solr/overseer Error:KeeperErrorCode = NodeExists for /solr/overseer
[junit4:junit4]   2> 3788 T2183 oascc.ZkStateReader.updateClusterState Updating cloud state from ZooKeeper... 
[junit4:junit4]   2> 3805 T2182 oascc.ZkStateReader$2.process A cluster state change: WatchedEvent state:SyncConnected type:NodeDataChanged path:/clusterstate.json, has occurred - updating... (live nodes size: 1)
[junit4:junit4]   2> 3840 T2185 oasc.ZkController.register We are http://127.0.0.1:49756/collection1/ and leader is http://127.0.0.1:49756/collection1/
[junit4:junit4]   2> 3843 T2185 oasc.ZkController.register No LogReplay needed for core=collection1 baseURL=http://127.0.0.1:49756
[junit4:junit4]   2> 3844 T2185 oasc.ZkController.checkRecovery I am the leader, no recovery necessary
[junit4:junit4]   2> 3845 T2185 oasc.ZkController.publish publishing core=collection1 state=active
[junit4:junit4]   2> 3846 T2185 oasc.ZkController.publish numShards not found on descriptor - reading it from system property
[junit4:junit4]   2> 3850 T2185 oascc.ZkStateReader.updateClusterState Updating cloud state from ZooKeeper... 
[junit4:junit4]   2> 3851 T2160 oass.SolrDispatchFilter.init user.dir=/Users/jenkins/jenkins-slave/workspace/Lucene-Solr-trunk-MacOSX/solr/build/solr-core/test/J0
[junit4:junit4]   2> 3852 T2160 oass.SolrDispatchFilter.init SolrDispatchFilter.init() done
[junit4:junit4]   2> 3853 T2160 oascsi.HttpClientUtil.createClient Creating new http client, config:maxConnections=128&maxConnectionsPerHost=32&followRedirects=false
[junit4:junit4]   2> 3860 T2160 oascsi.HttpClientUtil.createClient Creating new http client, config:
[junit4:junit4]   2> 3867 T2160 oaz.ZooKeeper.<init> Initiating client connection, connectString=127.0.0.1:49753/solr sessionTimeout=10000 watcher=org.apache.solr.common.cloud.ConnectionManager@4a1840cd
[junit4:junit4]   2> 3869 T2187 oaz.ClientCnxn$SendThread.logStartConnect Opening socket connection to server localhost/127.0.0.1:49753. Will not attempt to authenticate using SASL (access denied ("javax.security.auth.AuthPermission" "getLoginConfiguration"))
[junit4:junit4]   2> 3871 T2160 oascc.ConnectionManager.waitForConnected Waiting for client to connect to ZooKeeper
[junit4:junit4]   2> 3871 T2187 oaz.ClientCnxn$SendThread.primeConnection Socket connection established to localhost/127.0.0.1:49753, initiating session
[junit4:junit4]   2> 3872 T2162 oazs.NIOServerCnxnFactory.run Accepted socket connection from /127.0.0.1:49759
[junit4:junit4]   2> 3872 T2162 oazs.ZooKeeperServer.processConnectRequest Client attempting to establish new session at /127.0.0.1:49759
[junit4:junit4]   2> 3873 T2164 oazs.ZooKeeperServer.finishSessionInit Established session 0x13bfa5bd5030004 with negotiated timeout 10000 for client /127.0.0.1:49759
[junit4:junit4]   2> 3873 T2187 oaz.ClientCnxn$SendThread.onConnected Session establishment complete on server localhost/127.0.0.1:49753, sessionid = 0x13bfa5bd5030004, negotiated timeout = 10000
[junit4:junit4]   2> 3874 T2188 oascc.ConnectionManager.process Watcher org.apache.solr.common.cloud.ConnectionManager@4a1840cd name:ZooKeeperConnection Watcher:127.0.0.1:49753/solr got event WatchedEvent state:SyncConnected type:None path:null path:null type:None
[junit4:junit4]   2> 3874 T2160 oascc.ConnectionManager.waitForConnected Client is connected to ZooKeeper
[junit4:junit4]   2> 3875 T2160 oascc.ZkStateReader.createClusterStateWatchersAndUpdate Updating cluster state from ZooKeeper... 
[junit4:junit4]   2> 3878 T2160 oasc.ChaosMonkey.monkeyLog monkey: init - expire sessions:true cause connection loss:true
[junit4:junit4]   2> 4097 T2160 oejs.Server.doStart jetty-8.1.8.v20121106
[junit4:junit4]   2> 4103 T2160 oejs.AbstractConnector.doStart Started SelectChannelConnector@127.0.0.1:49760
[junit4:junit4]   2> 4104 T2160 oasc.SolrResourceLoader.locateSolrHome JNDI not configured for solr (NoInitialContextEx)
[junit4:junit4]   2> 4105 T2160 oasc.SolrResourceLoader.locateSolrHome using system property solr.solr.home: /Users/jenkins/jenkins-slave/workspace/Lucene-Solr-trunk-MacOSX/solr/build/solr-core/test/J0/./org.apache.solr.cloud.BasicDistributedZkTest-jetty1-1357115024406
[junit4:junit4]   2> 4112 T2160 oasc.SolrResourceLoader.<init> new SolrResourceLoader for deduced Solr Home: '/Users/jenkins/jenkins-slave/workspace/Lucene-Solr-trunk-MacOSX/solr/build/solr-core/test/J0/./org.apache.solr.cloud.BasicDistributedZkTest-jetty1-1357115024406/'
[junit4:junit4]   2> 4143 T2160 oass.SolrDispatchFilter.init SolrDispatchFilter.init()
[junit4:junit4]   2> 4144 T2160 oasc.SolrResourceLoader.locateSolrHome JNDI not configured for solr (NoInitialContextEx)
[junit4:junit4]   2> 4144 T2160 oasc.SolrResourceLoader.locateSolrHome using system property solr.solr.home: /Users/jenkins/jenkins-slave/workspace/Lucene-Solr-trunk-MacOSX/solr/build/solr-core/test/J0/./org.apache.solr.cloud.BasicDistributedZkTest-jetty1-1357115024406
[junit4:junit4]   2> 4145 T2160 oasc.CoreContainer$Initializer.initialize looking for solr.xml: /Users/jenkins/jenkins-slave/workspace/Lucene-Solr-trunk-MacOSX/solr/build/solr-core/test/J0/./org.apache.solr.cloud.BasicDistributedZkTest-jetty1-1357115024406/solr.xml
[junit4:junit4]   2> 4145 T2160 oasc.CoreContainer.<init> New CoreContainer 1756879525
[junit4:junit4]   2> 4146 T2160 oasc.CoreContainer.load Loading CoreContainer using Solr Home: '/Users/jenkins/jenkins-slave/workspace/Lucene-Solr-trunk-MacOSX/solr/build/solr-core/test/J0/./org.apache.solr.cloud.BasicDistributedZkTest-jetty1-1357115024406/'
[junit4:junit4]   2> 4147 T2160 oasc.SolrResourceLoader.<init> new SolrResourceLoader for directory: '/Users/jenkins/jenkins-slave/workspace/Lucene-Solr-trunk-MacOSX/solr/build/solr-core/test/J0/./org.apache.solr.cloud.BasicDistributedZkTest-jetty1-1357115024406/'
[junit4:junit4]   2> 4171 T2160 oashc.HttpShardHandlerFactory.getParameter Setting socketTimeout to: 30000
[junit4:junit4]   2> 4171 T2160 oashc.HttpShardHandlerFactory.getParameter Setting urlScheme to: http://
[junit4:junit4]   2> 4172 T2160 oashc.HttpShardHandlerFactory.getParameter Setting connTimeout to: 15000
[junit4:junit4]   2> 4172 T2160 oashc.HttpShardHandlerFactory.getParameter Setting maxConnectionsPerHost to: 20
[junit4:junit4]   2> 4173 T2160 oashc.HttpShardHandlerFactory.getParameter Setting corePoolSize to: 0
[junit4:junit4]   2> 4174 T2160 oashc.HttpShardHandlerFactory.getParameter Setting maximumPoolSize to: 2147483647
[junit4:junit4]   2> 4177 T2160 oashc.HttpShardHandlerFactory.getParameter Setting maxThreadIdleTime to: 5
[junit4:junit4]   2> 4180 T2160 oashc.HttpShardHandlerFactory.getParameter Setting sizeOfQueue to: -1
[junit4:junit4]   2> 4182 T2160 oashc.HttpShardHandlerFactory.getParameter Setting fairnessPolicy to: false
[junit4:junit4]   2> 4183 T2160 oascsi.HttpClientUtil.createClient Creating new http client, config:maxConnectionsPerHost=20&maxConnections=10000&socketTimeout=30000&connTimeout=15000&retry=false
[junit4:junit4]   2> 4208 T2160 oasc.CoreContainer.load Registering Log Listener
[junit4:junit4]   2> 4240 T2160 oasc.CoreContainer.initZooKeeper Zookeeper client=127.0.0.1:49753/solr
[junit4:junit4]   2> 4240 T2160 oasc.ZkController.checkChrootPath zkHost includes chroot
[junit4:junit4]   2> 4241 T2160 oaz.ZooKeeper.<init> Initiating client connection, connectString=127.0.0.1:49753 sessionTimeout=60000 watcher=org.apache.solr.common.cloud.ConnectionManager@5df3c926
[junit4:junit4]   2> 4242 T2160 oascc.ConnectionManager.waitForConnected Waiting for client to connect to ZooKeeper
[junit4:junit4]   2> 4243 T2198 oaz.ClientCnxn$SendThread.logStartConnect Opening socket connection to server localhost/127.0.0.1:49753. Will not attempt to authenticate using SASL (access denied ("javax.security.auth.AuthPermission" "getLoginConfiguration"))
[junit4:junit4]   2> 4245 T2198 oaz.ClientCnxn$SendThread.primeConnection Socket connection established to localhost/127.0.0.1:49753, initiating session
[junit4:junit4]   2> 4245 T2162 oazs.NIOServerCnxnFactory.run Accepted socket connection from /127.0.0.1:49761
[junit4:junit4]   2> 4246 T2162 oazs.ZooKeeperServer.processConnectRequest Client attempting to establish new session at /127.0.0.1:49761
[junit4:junit4]   2> 4247 T2164 oazs.ZooKeeperServer.finishSessionInit Established session 0x13bfa5bd5030005 with negotiated timeout 20000 for client /127.0.0.1:49761
[junit4:junit4]   2> 4247 T2198 oaz.ClientCnxn$SendThread.onConnected Session establishment complete on server localhost/127.0.0.1:49753, sessionid = 0x13bfa5bd5030005, negotiated timeout = 20000
[junit4:junit4]   2> 4248 T2199 oascc.ConnectionManager.process Watcher org.apache.solr.common.cloud.ConnectionManager@5df3c926 name:ZooKeeperConnection Watcher:127.0.0.1:49753 got event WatchedEvent state:SyncConnected type:None path:null path:null type:None
[junit4:junit4]   2> 4252 T2160 oascc.ConnectionManager.waitForConnected Client is connected to ZooKeeper
[junit4:junit4]   2> 4254 T2165 oazs.PrepRequestProcessor.pRequest2Txn Processed session termination for sessionid: 0x13bfa5bd5030005
[junit4:junit4]   2> 4255 T2162 oazs.NIOServerCnxn.closeSock Closed socket connection for client /127.0.0.1:49761 which had sessionid 0x13bfa5bd5030005
[junit4:junit4]   2> 4256 T2199 oaz.ClientCnxn$EventThread.run EventThread shut down
[junit4:junit4]   2> 4256 T2160 oaz.ZooKeeper.close Session: 0x13bfa5bd5030005 closed
[junit4:junit4]   2> 4257 T2160 oascsi.HttpClientUtil.createClient Creating new http client, config:maxConnections=500&maxConnectionsPerHost=16&socketTimeout=15000&connTimeout=30000
[junit4:junit4]   2> 4267 T2160 oaz.ZooKeeper.<init> Initiating client connection, connectString=127.0.0.1:49753/solr sessionTimeout=30000 watcher=org.apache.solr.common.cloud.ConnectionManager@75929aeb
[junit4:junit4]   2> 4270 T2160 oascc.ConnectionManager.waitForConnected Waiting for client to connect to ZooKeeper
[junit4:junit4]   2> 4271 T2200 oaz.ClientCnxn$SendThread.logStartConnect Opening socket connection to server localhost/127.0.0.1:49753. Will not attempt to authenticate using SASL (access denied ("javax.security.auth.AuthPermission" "getLoginConfiguration"))
[junit4:junit4]   2> 4272 T2162 oazs.NIOServerCnxnFactory.run Accepted socket connection from /127.0.0.1:49762
[junit4:junit4]   2> 4273 T2200 oaz.ClientCnxn$SendThread.primeConnection Socket connection established to localhost/127.0.0.1:49753, initiating session
[junit4:junit4]   2> 4273 T2162 oazs.ZooKeeperServer.processConnectRequest Client attempting to establish new session at /127.0.0.1:49762
[junit4:junit4]   2> 4274 T2164 oazs.ZooKeeperServer.finishSessionInit Established session 0x13bfa5bd5030006 with negotiated timeout 20000 for client /127.0.0.1:49762
[junit4:junit4]   2> 4275 T2200 oaz.ClientCnxn$SendThread.onConnected Session establishment complete on server localhost/127.0.0.1:49753, sessionid = 0x13bfa5bd5030006, negotiated timeout = 20000
[junit4:junit4]   2> 4275 T2201 oascc.ConnectionManager.process Watcher org.apache.solr.common.cloud.ConnectionManager@75929aeb name:ZooKeeperConnection Watcher:127.0.0.1:49753/solr got event WatchedEvent state:SyncConnected type:None path:null path:null type:None
[junit4:junit4]   2> 4275 T2160 oascc.ConnectionManager.waitForConnected Client is connected to ZooKeeper
[junit4:junit4]   2> 4277 T2165 oazs.PrepRequestProcessor.pRequest Got user-level KeeperException when processing sessionid:0x13bfa5bd5030006 type:create cxid:0x1 zxid:0x49 txntype:-1 reqpath:n/a Error Path:/solr/overseer Error:KeeperErrorCode = NodeExists for /solr/overseer
[junit4:junit4]   2> 4278 T2165 oazs.PrepRequestProcessor.pRequest Got user-level KeeperException when processing sessionid:0x13bfa5bd5030006 type:create cxid:0x2 zxid:0x4a txntype:-1 reqpath:n/a Error Path:/solr/overseer Error:KeeperErrorCode = NodeExists for /solr/overseer
[junit4:junit4]   2> 4280 T2160 oasc.ZkController.createEphemeralLiveNode Register node as live in ZooKeeper:/live_nodes/127.0.0.1:49760_
[junit4:junit4]   2> 4281 T2165 oazs.PrepRequestProcessor.pRequest Got user-level KeeperException when processing sessionid:0x13bfa5bd5030006 type:delete cxid:0x4 zxid:0x4b txntype:-1 reqpath:n/a Error Path:/solr/live_nodes/127.0.0.1:49760_ Error:KeeperErrorCode = NoNode for /solr/live_nodes/127.0.0.1:49760_
[junit4:junit4]   2> 4282 T2160 oascc.SolrZkClient.makePath makePath: /live_nodes/127.0.0.1:49760_
[junit4:junit4]   2> 4292 T2160 oascc.ZkStateReader.createClusterStateWatchersAndUpdate Updating cluster state from ZooKeeper... 
[junit4:junit4]   2> 4305 T2182 oascc.ZkStateReader$3.process Updating live nodes... (2)
[junit4:junit4]   2> 4305 T2188 oascc.ZkStateReader$3.process Updating live nodes... (2)
[junit4:junit4]   2> 4306 T2182 oascc.ZkStateReader$2.process A cluster state change: WatchedEvent state:SyncConnected type:NodeChildrenChanged path:/live_nodes, has occurred - updating... (live nodes size: 2)
[junit4:junit4]   2> 4306 T2202 oasc.CoreContainer.create Creating SolrCore 'collection1' using instanceDir: /Users/jenkins/jenkins-slave/workspace/Lucene-Solr-trunk-MacOSX/solr/build/solr-core/test/J0/./org.apache.solr.cloud.BasicDistributedZkTest-jetty1-1357115024406/collection1
[junit4:junit4]   2> 4306 T2202 oasc.ZkController.createCollectionZkNode Check for collection zkNode:collection1
[junit4:junit4]   2> 4307 T2202 oasc.ZkController.createCollectionZkNode Collection zkNode exists
[junit4:junit4]   2> 4307 T2202 oasc.ZkController.readConfigName Load collection config from:/collections/collection1
[junit4:junit4]   2> 4310 T2202 oasc.SolrResourceLoader.<init> new SolrResourceLoader for directory: '/Users/jenkins/jenkins-slave/workspace/Lucene-Solr-trunk-MacOSX/solr/build/solr-core/test/J0/./org.apache.solr.cloud.BasicDistributedZkTest-jetty1-1357115024406/collection1/'
[junit4:junit4]   2> 4311 T2202 oasc.SolrResourceLoader.replaceClassLoader Adding 'file:/Users/jenkins/jenkins-slave/workspace/Lucene-Solr-trunk-MacOSX/solr/build/solr-core/test/J0/org.apache.solr.cloud.BasicDistributedZkTest-jetty1-1357115024406/collection1/lib/classes/' to classloader
[junit4:junit4]   2> 4311 T2202 oasc.SolrResourceLoader.replaceClassLoader Adding 'file:/Users/jenkins/jenkins-slave/workspace/Lucene-Solr-trunk-MacOSX/solr/build/solr-core/test/J0/org.apache.solr.cloud.BasicDistributedZkTest-jetty1-1357115024406/collection1/lib/README' to classloader
[junit4:junit4]   2> 4373 T2202 oasc.SolrConfig.<init> Using Lucene MatchVersion: LUCENE_50
[junit4:junit4]   2> 4439 T2202 oasc.SolrConfig.<init> Loaded SolrConfig: solrconfig.xml
[junit4:junit4]   2> 4440 T2202 oass.IndexSchema.readSchema Reading Solr Schema
[junit4:junit4]   2> 4446 T2202 oass.IndexSchema.readSchema Schema name=test
[junit4:junit4]   2> 5299 T2202 oass.OpenExchangeRatesOrgProvider.init Initialized with rates=open-exchange-rates.json, refreshInterval=1440.
[junit4:junit4]   2> 5313 T2202 oass.IndexSchema.readSchema default search field in schema is text
[junit4:junit4]   2> 5317 T2202 oass.IndexSchema.readSchema unique key field: id
[junit4:junit4]   2> 5324 T2183 oascc.ZkStateReader.updateClusterState Updating cloud state from ZooKeeper... 
[junit4:junit4]   2> 5326 T2183 oasc.Overseer$ClusterStateUpdater.updateState Update state numShards=1 message={
[junit4:junit4]   2> 	  "operation":"state",
[junit4:junit4]   2> 	  "numShards":"1",
[junit4:junit4]   2> 	  "shard":"shard1",
[junit4:junit4]   2> 	  "roles":null,
[junit4:junit4]   2> 	  "state":"active",
[junit4:junit4]   2> 	  "core":"collection1",
[junit4:junit4]   2> 	  "collection":"control_collection",
[junit4:junit4]   2> 	  "node_name":"127.0.0.1:49756_",
[junit4:junit4]   2> 	  "base_url":"http://127.0.0.1:49756"}
[junit4:junit4]   2> 5334 T2188 oascc.ZkStateReader$2.process A cluster state change: WatchedEvent state:SyncConnected type:NodeDataChanged path:/clusterstate.json, has occurred - updating... (live nodes size: 2)
[junit4:junit4]   2> 5334 T2182 oascc.ZkStateReader$2.process A cluster state change: WatchedEvent state:SyncConnected type:NodeDataChanged path:/clusterstate.json, has occurred - updating... (live nodes size: 2)
[junit4:junit4]   2> 5337 T2201 oascc.ZkStateReader$2.process A cluster state change: WatchedEvent state:SyncConnected type:NodeDataChanged path:/clusterstate.json, has occurred - updating... (live nodes size: 2)
[junit4:junit4]   2> 5365 T2202 oass.FileExchangeRateProvider.reload Reloading exchange rates from file currency.xml
[junit4:junit4]   2> 5371 T2202 oass.FileExchangeRateProvider.reload Reloading exchange rates from file currency.xml
[junit4:junit4]   2> 5376 T2202 oass.OpenExchangeRatesOrgProvider.reload Reloading exchange rates from open-exchange-rates.json
[junit4:junit4]   2> 5378 T2202 oass.OpenExchangeRatesOrgProvider.reload Reloading exchange rates from open-exchange-rates.json
[junit4:junit4]   2> 5380 T2202 oasc.SolrCore.<init> [collection1] Opening new SolrCore at /Users/jenkins/jenkins-slave/workspace/Lucene-Solr-trunk-MacOSX/solr/build/solr-core/test/J0/./org.apache.solr.cloud.BasicDistributedZkTest-jetty1-1357115024406/collection1/, dataDir=./org.apache.solr.cloud.BasicDistributedZkTest-1357115020540/jetty1/
[junit4:junit4]   2> 5381 T2202 oasc.JmxMonitoredMap.<init> JMX monitoring is enabled. Adding Solr mbeans to JMX Server: com.sun.jmx.mbeanserver.JmxMBeanServer@26d68a6e
[junit4:junit4]   2> 5381 T2202 oasc.SolrCore.initDirectoryFactory solr.StandardDirectoryFactory
[junit4:junit4]   2> 5382 T2202 oasc.CachingDirectoryFactory.get return new directory for /Users/jenkins/jenkins-slave/workspace/Lucene-Solr-trunk-MacOSX/solr/build/solr-core/test/J0/./org.apache.solr.cloud.BasicDistributedZkTest-1357115020540/jetty1 forceNew:false
[junit4:junit4]   2> 5382 T2202 oasc.CachingDirectoryFactory.close Releasing directory:/Users/jenkins/jenkins-slave/workspace/Lucene-Solr-trunk-MacOSX/solr/build/solr-core/test/J0/./org.apache.solr.cloud.BasicDistributedZkTest-1357115020540/jetty1
[junit4:junit4]   2> 5383 T2202 oasc.SolrCore.getNewIndexDir New index directory detected: old=null new=./org.apache.solr.cloud.BasicDistributedZkTest-1357115020540/jetty1/index/
[junit4:junit4]   2> 5383 T2202 oasc.SolrCore.initIndex WARNING [collection1] Solr index directory './org.apache.solr.cloud.BasicDistributedZkTest-1357115020540/jetty1/index' doesn't exist. Creating new index...
[junit4:junit4]   2> 5384 T2202 oasc.CachingDirectoryFactory.get return new directory for /Users/jenkins/jenkins-slave/workspace/Lucene-Solr-trunk-MacOSX/solr/build/solr-core/test/J0/./org.apache.solr.cloud.BasicDistributedZkTest-1357115020540/jetty1/index forceNew:false
[junit4:junit4]   2> 5388 T2202 oasc.SolrDeletionPolicy.onCommit SolrDeletionPolicy.onCommit: commits:num=1
[junit4:junit4]   2> 		commit{dir=RateLimitedDirectoryWrapper(org.apache.lucene.store.NIOFSDirectory@/Users/jenkins/jenkins-slave/workspace/Lucene-Solr-trunk-MacOSX/solr/build/solr-core/test/J0/org.apache.solr.cloud.BasicDistributedZkTest-1357115020540/jetty1/index lockFactory=org.apache.lucene.store.NativeFSLockFactory@2a08cf4e),segFN=segments_1,generation=1,filenames=[segments_1]
[junit4:junit4]   2> 5388 T2202 oasc.SolrDeletionPolicy.updateCommits newest commit = 1[segments_1]
[junit4:junit4]   2> 5389 T2202 oasc.CachingDirectoryFactory.close Releasing directory:/Users/jenkins/jenkins-slave/workspace/Lucene-Solr-trunk-MacOSX/solr/build/solr-core/test/J0/./org.apache.solr.cloud.BasicDistributedZkTest-1357115020540/jetty1/index
[junit4:junit4]   2> 5389 T2202 oasc.SolrCore.initWriters created xml: solr.XMLResponseWriter
[junit4:junit4]   2> 5397 T2202 oasup.UpdateRequestProcessorChain.init inserting DistributedUpdateProcessorFactory into updateRequestProcessorChain "dedupe"
[junit4:junit4]   2> 5398 T2202 oasup.UpdateRequestProcessorChain.init inserting DistributedUpdateProcessorFactory into updateRequestProcessorChain "dedupe-allfields"
[junit4:junit4]   2> 5400 T2202 oasup.UpdateRequestProcessorChain.init inserting DistributedUpdateProcessorFactory into updateRequestProcessorChain "stored_sig"
[junit4:junit4]   2> 5401 T2202 oasup.UpdateRequestProcessorChain.init inserting DistributedUpdateProcessorFactory into updateRequestProcessorChain "uniq-fields"
[junit4:junit4]   2> 5402 T2202 oasup.UpdateRequestProcessorChain.init inserting DistributedUpdateProcessorFactory into updateRequestProcessorChain "distrib-dup-test-chain-implicit"
[junit4:junit4]   2> 5402 T2202 oasc.RequestHandlers.initHandlersFromConfig adding lazy requestHandler: solr.ReplicationHandler
[junit4:junit4]   2> 5403 T2202 oasc.RequestHandlers.initHandlersFromConfig created /replication: solr.ReplicationHandler
[junit4:junit4]   2> 5403 T2202 oasc.RequestHandlers.initHandlersFromConfig created standard: solr.StandardRequestHandler
[junit4:junit4]   2> 5404 T2202 oasc.RequestHandlers.initHandlersFromConfig created /get: solr.RealTimeGetHandler
[junit4:junit4]   2> 5405 T2202 oasc.RequestHandlers.initHandlersFromConfig created dismax: solr.SearchHandler
[junit4:junit4]   2> 5405 T2202 oasc.RequestHandlers.initHandlersFromConfig created mock: org.apache.solr.core.MockQuerySenderListenerReqHandler
[junit4:junit4]   2> 5406 T2202 oasc.RequestHandlers.initHandlersFromConfig created /admin/: org.apache.solr.handler.admin.AdminHandlers
[junit4:junit4]   2> 5406 T2202 oasc.RequestHandlers.initHandlersFromConfig created defaults: solr.StandardRequestHandler
[junit4:junit4]   2> 5406 T2202 oasc.RequestHandlers.initHandlersFromConfig adding lazy requestHandler: solr.StandardRequestHandler
[junit4:junit4]   2> 5407 T2202 oasc.RequestHandlers.initHandlersFromConfig created lazy: solr.StandardRequestHandler
[junit4:junit4]   2> 5407 T2202 oasc.RequestHandlers.initHandlersFromConfig created /update: solr.UpdateRequestHandler
[junit4:junit4]   2> 5408 T2202 oasc.RequestHandlers.initHandlersFromConfig created /terms: org.apache.solr.handler.component.SearchHandler
[junit4:junit4]   2> 5408 T2202 oasc.RequestHandlers.initHandlersFromConfig created spellCheckCompRH: org.apache.solr.handler.component.SearchHandler
[junit4:junit4]   2> 5409 T2202 oasc.RequestHandlers.initHandlersFromConfig created spellCheckCompRH_Direct: org.apache.solr.handler.component.SearchHandler
[junit4:junit4]   2> 5410 T2202 oasc.RequestHandlers.initHandlersFromConfig created spellCheckWithWordbreak: org.apache.solr.handler.component.SearchHandler
[junit4:junit4]   2> 5413 T2202 oasc.RequestHandlers.initHandlersFromConfig created spellCheckWithWordbreak_Direct: org.apache.solr.handler.component.SearchHandler
[junit4:junit4]   2> 5413 T2202 oasc.RequestHandlers.initHandlersFromConfig created spellCheckCompRH1: org.apache.solr.handler.component.SearchHandler
[junit4:junit4]   2> 5414 T2202 oasc.RequestHandlers.initHandlersFromConfig created mltrh: org.apache.solr.handler.component.SearchHandler
[junit4:junit4]   2> 5414 T2202 oasc.RequestHandlers.initHandlersFromConfig created tvrh: org.apache.solr.handler.component.SearchHandler
[junit4:junit4]   2> 5415 T2202 oasc.RequestHandlers.initHandlersFromConfig created /mlt: solr.MoreLikeThisHandler
[junit4:junit4]   2> 5415 T2202 oasc.RequestHandlers.initHandlersFromConfig created /debug/dump: solr.DumpRequestHandler
[junit4:junit4]   2> 5422 T2202 oashl.XMLLoader.init xsltCacheLifetimeSeconds=60
[junit4:junit4]   2> 5425 T2202 oasc.SolrCore.initDeprecatedSupport WARNING solrconfig.xml uses deprecated <admin/gettableFiles>, Please update your config to use the ShowFileRequestHandler.
[junit4:junit4]   2> 5427 T2202 oasc.SolrCore.initDeprecatedSupport WARNING adding ShowFileRequestHandler with hidden files: [SCHEMA.XML, OLD_SYNONYMS.TXT, STOPWORDS.TXT, PROTWORDS.TXT, OPEN-EXCHANGE-RATES.JSON, SYNONYMS.TXT, CURRENCY.XML, MAPPING-ISOLATIN1ACCENT.TXT]
[junit4:junit4]   2> 5429 T2202 oasc.CachingDirectoryFactory.close Releasing directory:/Users/jenkins/jenkins-slave/workspace/Lucene-Solr-trunk-MacOSX/solr/build/solr-core/test/J0/./org.apache.solr.cloud.BasicDistributedZkTest-1357115020540/jetty1
[junit4:junit4]   2> 5430 T2202 oass.SolrIndexSearcher.<init> Opening Searcher@67089179 main
[junit4:junit4]   2> 5432 T2202 oasu.CommitTracker.<init> Hard AutoCommit: disabled
[junit4:junit4]   2> 5432 T2202 oasu.CommitTracker.<init> Soft AutoCommit: disabled
[junit4:junit4]   2> 5433 T2202 oashc.SpellCheckComponent.inform Initializing spell checkers
[junit4:junit4]   2> 5443 T2202 oass.DirectSolrSpellChecker.init init: {name=direct,classname=DirectSolrSpellChecker,field=lowerfilt,minQueryLength=3}
[junit4:junit4]   2> 5488 T2203 oasc.SolrCore.registerSearcher [collection1] Registered new searcher Searcher@67089179 main{StandardDirectoryReader(segments_1:1)}
[junit4:junit4]   2> 5501 T2202 oasc.ZkController.publish publishing core=collection1 state=down
[junit4:junit4]   2> 5501 T2202 oasc.ZkController.publish numShards not found on descriptor - reading it from system property
[junit4:junit4]   2> 6859 T2183 oascc.ZkStateReader.updateClusterState Updating cloud state from ZooKeeper... 
[junit4:junit4]   2> 6860 T2183 oasc.Overseer$ClusterStateUpdater.updateState Update state numShards=2 message={
[junit4:junit4]   2> 	  "operation":"state",
[junit4:junit4]   2> 	  "numShards":"2",
[junit4:junit4]   2> 	  "shard":null,
[junit4:junit4]   2> 	  "roles":null,
[junit4:junit4]   2> 	  "state":"down",
[junit4:junit4]   2> 	  "core":"collection1",
[junit4:junit4]   2> 	  "collection":"collection1",
[junit4:junit4]   2> 	  "node_name":"127.0.0.1:49760_",
[junit4:junit4]   2> 	  "base_url":"http://127.0.0.1:49760"}
[junit4:junit4]   2> 6860 T2183 oasc.Overseer$ClusterStateUpdater.createCollection Create collection collection1 with numShards 2
[junit4:junit4]   2> 6861 T2183 oasc.Overseer$ClusterStateUpdater.updateState Assigning new node to shard shard=shard1
[junit4:junit4]   2> 6867 T2188 oascc.ZkStateReader$2.process A cluster state change: WatchedEvent state:SyncConnected type:NodeDataChanged path:/clusterstate.json, has occurred - updating... (live nodes size: 2)
[junit4:junit4]   2> 6870 T2182 oascc.ZkStateReader$2.process A cluster state change: WatchedEvent state:SyncConnected type:NodeDataChanged path:/clusterstate.json, has occurred - updating... (live nodes size: 2)
[junit4:junit4]   2> 6873 T2201 oascc.ZkStateReader$2.process A cluster state change: WatchedEvent state:SyncConnected type:NodeDataChanged path:/clusterstate.json, has occurred - updating... (live nodes size: 2)
[junit4:junit4]   2> 7506 T2202 oasc.CoreContainer.registerCore registering core: collection1
[junit4:junit4]   2> 7506 T2202 oasc.ZkController.register Register replica - core:collection1 address:http://127.0.0.1:49760 collection:collection1 shard:shard1
[junit4:junit4]   2> 7508 T2202 oascc.SolrZkClient.makePath makePath: /collections/collection1/leader_elect/shard1/election
[junit4:junit4]   2> 7520 T2165 oazs.PrepRequestProcessor.pRequest Got user-level KeeperException when processing sessionid:0x13bfa5bd5030006 type:delete cxid:0x45 zxid:0x5b txntype:-1 reqpath:n/a Error Path:/solr/collections/collection1/leaders Error:KeeperErrorCode = NoNode for /solr/collections/collection1/leaders
[junit4:junit4]   2> 7520 T2202 oasc.ShardLeaderElectionContext.runLeaderProcess Running the leader process.
[junit4:junit4]   2> 7521 T2165 oazs.PrepRequestProcessor.pRequest Got user-level KeeperException when processing sessionid:0x13bfa5bd5030006 type:create cxid:0x46 zxid:0x5c txntype:-1 reqpath:n/a Error Path:/solr/overseer Error:KeeperErrorCode = NodeExists for /solr/overseer
[junit4:junit4]   2> 7523 T2202 oasc.ShardLeaderElectionContext.waitForReplicasToComeUp Enough replicas found to continue.
[junit4:junit4]   2> 7523 T2202 oasc.ShardLeaderElectionContext.runLeaderProcess I may be the new leader - try and sync
[junit4:junit4]   2> 7524 T2202 oasc.SyncStrategy.sync Sync replicas to http://127.0.0.1:49760/collection1/
[junit4:junit4]   2> 7525 T2202 oasc.SyncStrategy.syncReplicas Sync Success - now sync replicas to me
[junit4:junit4]   2> 7525 T2202 oasc.SyncStrategy.syncToMe http://127.0.0.1:49760/collection1/ has no replicas
[junit4:junit4]   2> 7525 T2202 oasc.ShardLeaderElectionContext.runLeaderProcess I am the new leader: http://127.0.0.1:49760/collection1/
[junit4:junit4]   2> 7525 T2202 oascc.SolrZkClient.makePath makePath: /collections/collection1/leaders/shard1
[junit4:junit4]   2> 7530 T2165 oazs.PrepRequestProcessor.pRequest Got user-level KeeperException when processing sessionid:0x13bfa5bd5030006 type:create cxid:0x50 zxid:0x60 txntype:-1 reqpath:n/a Error Path:/solr/overseer Error:KeeperErrorCode = NodeExists for /solr/overseer
[junit4:junit4]   2> 8380 T2183 oascc.ZkStateReader.updateClusterState Updating cloud state from ZooKeeper... 
[junit4:junit4]   2> 8393 T2188 oascc.ZkStateReader$2.process A cluster state change: WatchedEvent state:SyncConnected type:NodeDataChanged path:/clusterstate.json, has occurred - updating... (live nodes size: 2)
[junit4:junit4]   2> 8395 T2182 oascc.ZkStateReader$2.process A cluster state change: WatchedEvent state:SyncConnected type:NodeDataChanged path:/clusterstate.json, has occurred - updating... (live nodes size: 2)
[junit4:junit4]   2> 8398 T2201 oascc.ZkStateReader$2.process A cluster state change: WatchedEvent state:SyncConnected type:NodeDataChanged path:/clusterstate.json, has occurred - updating... (live nodes size: 2)
[junit4:junit4]   2> 8411 T2202 oasc.ZkController.register We are http://127.0.0.1:49760/collection1/ and leader is http://127.0.0.1:49760/collection1/
[junit4:junit4]   2> 8412 T2202 oasc.ZkController.register No LogReplay needed for core=collection1 baseURL=http://127.0.0.1:49760
[junit4:junit4]   2> 8412 T2202 oasc.ZkController.checkRecovery I am the leader, no recovery necessary
[junit4:junit4]   2> 8412 T2202 oasc.ZkController.publish publishing core=collection1 state=active
[junit4:junit4]   2> 8413 T2202 oasc.ZkController.publish numShards not found on descriptor - reading it from system property
[junit4:junit4]   2> 8415 T2202 oascc.ZkStateReader.updateClusterState Updating cloud state from ZooKeeper... 
[junit4:junit4]   2> 8417 T2160 oass.SolrDispatchFilter.init user.dir=/Users/jenkins/jenkins-slave/workspace/Lucene-Solr-trunk-MacOSX/solr/build/solr-core/test/J0
[junit4:junit4]   2> 8417 T2160 oass.SolrDispatchFilter.init SolrDispatchFilter.init() done
[junit4:junit4]   2> 8418 T2160 oascsi.HttpClientUtil.createClient Creating new http client, config:maxConnections=128&maxConnectionsPerHost=32&followRedirects=false
[junit4:junit4]   2> 8794 T2160 oejs.Server.doStart jetty-8.1.8.v20121106
[junit4:junit4]   2> 8804 T2160 oejs.AbstractConnector.doStart Started SelectChannelConnector@127.0.0.1:49763
[junit4:junit4]   2> 8805 T2160 oasc.SolrResourceLoader.locateSolrHome JNDI not configured for solr (NoInitialContextEx)
[junit4:junit4]   2> 8805 T2160 oasc.SolrResourceLoader.locateSolrHome using system property solr.solr.home: /Users/jenkins/jenkins-slave/workspace/Lucene-Solr-trunk-MacOSX/solr/build/solr-core/test/J0/./org.apache.solr.cloud.BasicDistributedZkTest-jetty2-1357115028953
[junit4:junit4]   2> 8806 T2160 oasc.SolrResourceLoader.<init> new SolrResourceLoader for deduced Solr Home: '/Users/jenkins/jenkins-slave/workspace/Lucene-Solr-trunk-MacOSX/solr/build/solr-core/test/J0/./org.apache.solr.cloud.BasicDistributedZkTest-jetty2-1357115028953/'
[junit4:junit4]   2> 8860 T2160 oass.SolrDispatchFilter.init SolrDispatchFilter.init()
[junit4:junit4]   2> 8861 T2160 oasc.SolrResourceLoader.locateSolrHome JNDI not configured for solr (NoInitialContextEx)
[junit4:junit4]   2> 8862 T2160 oasc.SolrResourceLoader.locateSolrHome using system property solr.solr.home: /Users/jenkins/jenkins-slave/workspace/Lucene-Solr-trunk-MacOSX/solr/build/solr-core/test/J0/./org.apache.solr.cloud.BasicDistributedZkTest-jetty2-1357115028953
[junit4:junit4]   2> 8862 T2160 oasc.CoreContainer$Initializer.initialize looking for solr.xml: /Users/jenkins/jenkins-slave/workspace/Lucene-Solr-trunk-MacOSX/solr/build/solr-core/test/J0/./org.apache.solr.cloud.BasicDistributedZkTest-jetty2-1357115028953/solr.xml
[junit4:junit4]   2> 8863 T2160 oasc.CoreContainer.<init> New CoreContainer 723900114
[junit4:junit4]   2> 8864 T2160 oasc.CoreContainer.load Loading CoreContainer using Solr Home: '/Users/jenkins/jenkins-slave/workspace/Lucene-Solr-trunk-MacOSX/solr/build/solr-core/test/J0/./org.apache.solr.cloud.BasicDistributedZkTest-jetty2-1357115028953/'
[junit4:junit4]   2> 8864 T2160 oasc.SolrResourceLoader.<init> new SolrResourceLoader for directory: '/Users/jenkins/jenkins-slave/workspace/Lucene-Solr-trunk-MacOSX/solr/build/solr-core/test/J0/./org.apache.solr.cloud.BasicDistributedZkTest-jetty2-1357115028953/'
[junit4:junit4]   2> 8893 T2160 oashc.HttpShardHandlerFactory.getParameter Setting socketTimeout to: 30000
[junit4:junit4]   2> 8894 T2160 oashc.HttpShardHandlerFactory.getParameter Setting urlScheme to: http://
[junit4:junit4]   2> 8895 T2160 oashc.HttpShardHandlerFactory.getParameter Setting connTimeout to: 15000
[junit4:junit4]   2> 8895 T2160 oashc.HttpShardHandlerFactory.getParameter Setting maxConnectionsPerHost to: 20
[junit4:junit4]   2> 8895 T2160 oashc.HttpShardHandlerFactory.getParameter Setting corePoolSize to: 0
[junit4:junit4]   2> 8896 T2160 oashc.HttpShardHandlerFactory.getParameter Setting maximumPoolSize to: 2147483647
[junit4:junit4]   2> 8896 T2160 oashc.HttpShardHandlerFactory.getParameter Setting maxThreadIdleTime to: 5
[junit4:junit4]   2> 8897 T2160 oashc.HttpShardHandlerFactory.getParameter Setting sizeOfQueue to: -1
[junit4:junit4]   2> 8897 T2160 oashc.HttpShardHandlerFactory.getParameter Setting fairnessPolicy to: false
[junit4:junit4]   2> 8898 T2160 oascsi.HttpClientUtil.createClient Creating new http client, config:maxConnectionsPerHost=20&maxConnections=10000&socketTimeout=30000&connTimeout=15000&retry=false
[junit4:junit4]   2> 8910 T2160 oasc.CoreContainer.load Registering Log Listener
[junit4:junit4]   2> 8933 T2160 oasc.CoreContainer.initZooKeeper Zookeeper client=127.0.0.1:49753/solr
[junit4:junit4]   2> 8933 T2160 oasc.ZkController.checkChrootPath zkHost includes chroot
[junit4:junit4]   2> 8934 T2160 oaz.ZooKeeper.<init> Initiating client connection, connectString=127.0.0.1:49753 sessionTimeout=60000 watcher=org.apache.solr.common.cloud.ConnectionManager@701b9e5f
[junit4:junit4]   2> 8942 T2213 oaz.ClientCnxn$SendThread.logStartConnect Opening socket connection to server localhost/127.0.0.1:49753. Will not attempt to authenticate using SASL (access denied ("javax.security.auth.AuthPermission" "getLoginConfiguration"))
[junit4:junit4]   2> 8944 T2213 oaz.ClientCnxn$SendThread.primeConnection Socket connection established to localhost/127.0.0.1:49753, initiating session
[junit4:junit4]   2> 8945 T2162 oazs.NIOServerCnxnFactory.run Accepted socket connection from /127.0.0.1:49764
[junit4:junit4]   2> 8946 T2160 oascc.ConnectionManager.waitForConnected Waiting for client to connect to ZooKeeper
[junit4:junit4]   2> 8947 T2162 oazs.ZooKeeperServer.processConnectRequest Client attempting to establish new session at /127.0.0.1:49764
[junit4:junit4]   2> 8949 T2164 oazs.ZooKeeperServer.finishSessionInit Established session 0x13bfa5bd5030007 with negotiated timeout 20000 for client /127.0.0.1:49764
[junit4:junit4]   2> 8949 T2213 oaz.ClientCnxn$SendThread.onConnected Session establishment complete on server localhost/127.0.0.1:49753, sessionid = 0x13bfa5bd5030007, negotiated timeout = 20000
[junit4:junit4]   2> 8949 T2214 oascc.ConnectionManager.process Watcher org.apache.solr.common.cloud.ConnectionManager@701b9e5f name:ZooKeeperConnection Watcher:127.0.0.1:49753 got event WatchedEvent state:SyncConnected type:None path:null path:null type:None
[junit4:junit4]   2> 8950 T2160 oascc.ConnectionManager.waitForConnected Client is connected to ZooKeeper
[junit4:junit4]   2> 8954 T2165 oazs.PrepRequestProcessor.pRequest2Txn Processed session termination for sessionid: 0x13bfa5bd5030007
[junit4:junit4]   2> 8955 T2160 oaz.ZooKeeper.close Session: 0x13bfa5bd5030007 closed
[junit4:junit4]   2> 8956 T2214 oaz.ClientCnxn$EventThread.run EventThread shut down
[junit4:junit4]   2> 8956 T2160 oascsi.HttpClientUtil.createClient Creating new http client, config:maxConnections=500&maxConnectionsPerHost=16&socketTimeout=15000&connTimeout=30000
[junit4:junit4]   2> 8956 T2162 oazs.NIOServerCnxn.closeSock Closed socket connection for client /127.0.0.1:49764 which had sessionid 0x13bfa5bd5030007
[junit4:junit4]   2> 8966 T2160 oaz.ZooKeeper.<init> Initiating client connection, connectString=127.0.0.1:49753/solr sessionTimeout=30000 watcher=org.apache.solr.common.cloud.ConnectionManager@43dbc88
[junit4:junit4]   2> 8968 T2160 oascc.ConnectionManager.waitForConnected Waiting for client to connect to ZooKeeper
[junit4:junit4]   2> 8968 T2215 oaz.ClientCnxn$SendThread.logStartConnect Opening socket connection to server localhost/127.0.0.1:49753. Will not attempt to authenticate using SASL (access denied ("javax.security.auth.AuthPermission" "getLoginConfiguration"))
[junit4:junit4]   2> 8969 T2215 oaz.ClientCnxn$SendThread.primeConnection Socket connection established to localhost/127.0.0.1:49753, initiating session
[junit4:junit4]   2> 8970 T2162 oazs.NIOServerCnxnFactory.run Accepted socket connection from /127.0.0.1:49765
[junit4:junit4]   2> 8970 T2162 oazs.ZooKeeperServer.processConnectRequest Client attempting to establish new session at /127.0.0.1:49765
[junit4:junit4]   2> 8972 T2164 oazs.ZooKeeperServer.finishSessionInit Established session 0x13bfa5bd5030008 with negotiated timeout 20000 for client /127.0.0.1:49765
[junit4:junit4]   2> 8972 T2215 oaz.ClientCnxn$SendThread.onConnected Session establishment complete on server localhost/127.0.0.1:49753, sessionid = 0x13bfa5bd5030008, negotiated timeout = 20000
[junit4:junit4]   2> 8973 T2216 oascc.ConnectionManager.process Watcher org.apache.solr.common.cloud.ConnectionManager@43dbc88 name:ZooKeeperConnection Watcher:127.0.0.1:49753/solr got event WatchedEvent state:SyncConnected type:None path:null path:null type:None
[junit4:junit4]   2> 8973 T2160 oascc.ConnectionManager.waitForConnected Client is connected to ZooKeeper
[junit4:junit4]   2> 8976 T2165 oazs.PrepRequestProcessor.pRequest Got user-level KeeperException when processing sessionid:0x13bfa5bd5030008 type:create cxid:0x1 zxid:0x6d txntype:-1 reqpath:n/a Error Path:/solr/overseer Error:KeeperErrorCode = NodeExists for /solr/overseer
[junit4:junit4]   2> 8978 T2165 oazs.PrepRequestProcessor.pRequest Got user-level KeeperException when processing sessionid:0x13bfa5bd5030008 type:create cxid:0x2 zxid:0x6e txntype:-1 reqpath:n/a Error Path:/solr/overseer Error:KeeperErrorCode = NodeExists for /solr/overseer
[junit4:junit4]   2> 8980 T2160 oasc.ZkController.createEphemeralLiveNode Register node as live in ZooKeeper:/live_nodes/127.0.0.1:49763_
[junit4:junit4]   2> 8982 T2165 oazs.PrepRequestProcessor.pRequest Got user-level KeeperException when processing sessionid:0x13bfa5bd5030008 type:delete cxid:0x4 zxid:0x6f txntype:-1 reqpath:n/a Error Path:/solr/live_nodes/127.0.0.1:49763_ Error:KeeperErrorCode = NoNode for /solr/live_nodes/127.0.0.1:49763_
[junit4:junit4]   2> 8983 T2160 oascc.SolrZkClient.makePath makePath: /live_nodes/127.0.0.1:49763_
[junit4:junit4]   2> 8989 T2182 oascc.ZkStateReader$3.process Updating live nodes... (3)
[junit4:junit4]   2> 8990 T2182 oascc.ZkStateReader$2.process A cluster state change: WatchedEvent state:SyncConnected type:NodeChildrenChanged path:/live_nodes, has occurred - updating... (live nodes size: 3)
[junit4:junit4]   2> 8991 T2201 oascc.ZkStateReader$3.process Updating live nodes... (3)
[junit4:junit4]   2> 8991 T2201 oascc.ZkStateReader$2.process A cluster state change: WatchedEvent state:SyncConnected type:NodeChildrenChanged path:/live_nodes, has occurred - updating... (live nodes size: 3)
[junit4:junit4]   2> 8991 T2188 oascc.ZkStateReader$3.process Updating live nodes... (3)
[junit4:junit4]   2> 8992 T2188 oascc.ZkStateReader$2.process A cluster state change: WatchedEvent state:SyncConnected type:NodeChildrenChanged path:/live_nodes, has occurred - updating... (live nodes size: 3)
[junit4:junit4]   2> 8999 T2160 oascc.ZkStateReader.createClusterStateWatchersAndUpdate Updating cluster state from ZooKeeper... 
[junit4:junit4]   2> 9008 T2217 oasc.CoreContainer.create Creating SolrCore 'collection1' using instanceDir: /Users/jenkins/jenkins-slave/workspace/Lucene-Solr-trunk-MacOSX/solr/build/solr-core/test/J0/./org.apache.solr.cloud.BasicDistributedZkTest-jetty2-1357115028953/collection1
[junit4:junit4]   2> 9008 T2217 oasc.ZkController.createCollectionZkNode Check for collection zkNode:collection1
[junit4:junit4]   2> 9009 T2217 oasc.ZkController.createCollectionZkNode Collection zkNode exists
[junit4:junit4]   2> 9010 T2217 oasc.ZkController.readConfigName Load collection config from:/collections/collection1
[junit4:junit4]   2> 9015 T2217 oasc.SolrResourceLoader.<init> new SolrResourceLoader for directory: '/Users/jenkins/jenkins-slave/workspace/Lucene-Solr-trunk-MacOSX/solr/build/solr-core/test/J0/./org.apache.solr.cloud.BasicDistributedZkTest-jetty2-1357115028953/collection1/'
[junit4:junit4]   2> 9016 T2217 oasc.SolrResourceLoader.replaceClassLoader Adding 'file:/Users/jenkins/jenkins-slave/workspace/Lucene-Solr-trunk-MacOSX/solr/build/solr-core/test/J0/org.apache.solr.cloud.BasicDistributedZkTest-jetty2-1357115028953/collection1/lib/classes/' to classloader
[junit4:junit4]   2> 9017 T2217 oasc.SolrResourceLoader.replaceClassLoader Adding 'file:/Users/jenkins/jenkins-slave/workspace/Lucene-Solr-trunk-MacOSX/solr/build/solr-core/test/J0/org.apache.solr.cloud.BasicDistributedZkTest-jetty2-1357115028953/collection1/lib/README' to classloader
[junit4:junit4]   2> 9082 T2217 oasc.SolrConfig.<init> Using Lucene MatchVersion: LUCENE_50
[junit4:junit4]   2> 9171 T2217 oasc.SolrConfig.<init> Loaded SolrConfig: solrconfig.xml
[junit4:junit4]   2> 9175 T2217 oass.IndexSchema.readSchema Reading Solr Schema
[junit4:junit4]   2> 9185 T2217 oass.IndexSchema.readSchema Schema name=test
[junit4:junit4]   2> 9915 T2183 oascc.ZkStateReader.updateClusterState Updating cloud state from ZooKeeper... 
[junit4:junit4]   2> 9919 T2183 oasc.Overseer$ClusterStateUpdater.updateState Update state numShards=2 message={
[junit4:junit4]   2> 	  "operation":"state",
[junit4:junit4]   2> 	  "numShards":"2",
[junit4:junit4]   2> 	  "shard":"shard1",
[junit4:junit4]   2> 	  "roles":null,
[junit4:junit4]   2> 	  "state":"active",
[junit4:junit4]   2> 	  "core":"collection1",
[junit4:junit4]   2> 	  "collection":"collection1",
[junit4:junit4]   2> 	  "node_name":"127.0.0.1:49760_",
[junit4:junit4]   2> 	  "base_url":"http://127.0.0.1:49760"}
[junit4:junit4]   2> 9932 T2216 oascc.ZkStateReader$2.process A cluster state change: WatchedEvent state:SyncConnected type:NodeDataChanged path:/clusterstate.json, has occurred - updating... (live nodes size: 3)
[junit4:junit4]   2> 9932 T2188 oascc.ZkStateReader$2.process A cluster state change: WatchedEvent state:SyncConnected type:NodeDataChanged path:/clusterstate.json, has occurred - updating... (live nodes size: 3)
[junit4:junit4]   2> 9932 T2182 oascc.ZkStateReader$2.process A cluster state change: WatchedEvent state:SyncConnected type:NodeDataChanged path:/clusterstate.json, has occurred - updating... (live nodes size: 3)
[junit4:junit4]   2> 9933 T2201 oascc.ZkStateReader$2.process A cluster state change: WatchedEvent state:SyncConnected type:NodeDataChanged path:/clusterstate.json, has occurred - updating... (live nodes size: 3)
[junit4:junit4]   2> 10247 T2217 oass.OpenExchangeRatesOrgProvider.init Initialized with rates=open-exchange-rates.json, refreshInterval=1440.
[junit4:junit4]   2> 10264 T2217 oass.IndexSchema.readSchema default search field in schema is text
[junit4:junit4]   2> 10276 T2217 oass.IndexSchema.readSchema unique key field: id
[junit4:junit4]   2> 10334 T2217 oass.FileExchangeRateProvider.reload Reloading exchange rates from file currency.xml
[junit4:junit4]   2> 10339 T2217 oass.FileExchangeRateProvider.reload Reloading exchange rates from file currency.xml
[junit4:junit4]   2> 10346 T2217 oass.OpenExchangeRatesOrgProvider.reload Reloading exchange rates from open-exchange-rates.json
[junit4:junit4]   2> 10348 T2217 oass.OpenExchangeRatesOrgProvider.reload Reloading exchange rates from open-exchange-rates.json
[junit4:junit4]   2> 10349 T2217 oasc.SolrCore.<init> [collection1] Opening new SolrCore at /Users/jenkins/jenkins-slave/workspace/Lucene-Solr-trunk-MacOSX/solr/build/solr-core/test/J0/./org.apache.solr.cloud.BasicDistributedZkTest-jetty2-1357115028953/collection1/, dataDir=./org.apache.solr.cloud.BasicDistributedZkTest-1357115020540/jetty2/
[junit4:junit4]   2> 10349 T2217 oasc.JmxMonitoredMap.<init> JMX monitoring is enabled. Adding Solr mbeans to JMX Server: com.sun.jmx.mbeanserver.JmxMBeanServer@26d68a6e
[junit4:junit4]   2> 10350 T2217 oasc.SolrCore.initDirectoryFactory solr.StandardDirectoryFactory
[junit4:junit4]   2> 10351 T2217 oasc.CachingDirectoryFactory.get return new directory for /Users/jenkins/jenkins-slave/workspace/Lucene-Solr-trunk-MacOSX/solr/build/solr-core/test/J0/./org.apache.solr.cloud.BasicDistributedZkTest-1357115020540/jetty2 forceNew:false
[junit4:junit4]   2> 10351 T2217 oasc.CachingDirectoryFactory.close Releasing directory:/Users/jenkins/jenkins-slave/workspace/Lucene-Solr-trunk-MacOSX/solr/build/solr-core/test/J0/./org.apache.solr.cloud.BasicDistributedZkTest-1357115020540/jetty2
[junit4:junit4]   2> 10352 T2217 oasc.SolrCore.getNewIndexDir New index directory detected: old=null new=./org.apache.solr.cloud.BasicDistributedZkTest-1357115020540/jetty2/index/
[junit4:junit4]   2> 10352 T2217 oasc.SolrCore.initIndex WARNING [collection1] Solr index directory './org.apache.solr.cloud.BasicDistributedZkTest-1357115020540/jetty2/index' doesn't exist. Creating new index...
[junit4:junit4]   2> 10353 T2217 oasc.CachingDirectoryFactory.get return new directory for /Users/jenkins/jenkins-slave/workspace/Lucene-Solr-trunk-MacOSX/solr/build/solr-core/test/J0/./org.apache.solr.cloud.BasicDistributedZkTest-1357115020540/jetty2/index forceNew:false
[junit4:junit4]   2> 10355 T2217 oasc.SolrDeletionPolicy.onCommit SolrDeletionPolicy.onCommit: commits:num=1
[junit4:junit4]   2> 		commit{dir=RateLimitedDirectoryWrapper(org.apache.lucene.store.NIOFSDirectory@/Users/jenkins/jenkins-slave/workspace/Lucene-Solr-trunk-MacOSX/solr/build/solr-core/test/J0/org.apache.solr.cloud.BasicDistributedZkTest-1357115020540/jetty2/index lockFactory=org.apache.lucene.store.NativeFSLockFactory@1971e051),segFN=segments_1,generation=1,filenames=[segments_1]
[junit4:junit4]   2> 10356 T2217 oasc.SolrDeletionPolicy.updateCommits newest commit = 1[segments_1]
[junit4:junit4]   2> 10357 T2217 oasc.CachingDirectoryFactory.close Releasing directory:/Users/jenkins/jenkins-slave/workspace/Lucene-Solr-trunk-MacOSX/solr/build/solr-core/test/J0/./org.apache.solr.cloud.BasicDistributedZkTest-1357115020540/jetty2/index
[junit4:junit4]   2> 10357 T2217 oasc.SolrCore.initWriters created xml: solr.XMLResponseWriter
[junit4:junit4]   2> 10358 T2217 oasup.UpdateRequestProcessorChain.init inserting DistributedUpdateProcessorFactory into updateRequestProcessorChain "dedupe"
[junit4:junit4]   2> 10359 T2217 oasup.UpdateRequestProcessorChain.init inserting DistributedUpdateProcessorFactory into updateRequestProcessorChain "dedupe-allfields"
[junit4:junit4]   2> 10359 T2217 oasup.UpdateRequestProcessorChain.init inserting DistributedUpdateProcessorFactory into updateRequestProcessorChain "stored_sig"
[junit4:junit4]   2> 10360 T2217 oasup.UpdateRequestProcessorChain.init inserting DistributedUpdateProcessorFactory into updateRequestProcessorChain "uniq-fields"
[junit4:junit4]   2> 10360 T2217 oasup.UpdateRequestProcessorChain.init inserting DistributedUpdateProcessorFactory into updateRequestProcessorChain "distrib-dup-test-chain-implicit"
[junit4:junit4]   2> 10361 T2217 oasc.RequestHandlers.initHandlersFromConfig adding lazy requestHandler: solr.ReplicationHandler
[junit4:junit4]   2> 10361 T2217 oasc.RequestHandlers.initHandlersFromConfig created /replication: solr.ReplicationHandler
[junit4:junit4]   2> 10361 T2217 oasc.RequestHandlers.initHandlersFromConfig created standard: solr.StandardRequestHandler
[junit4:junit4]   2> 10362 T2217 oasc.RequestHandlers.initHandlersFromConfig created /get: solr.RealTimeGetHandler
[junit4:junit4]   2> 10362 T2217 oasc.RequestHandlers.initHandlersFromConfig created dismax: solr.SearchHandler
[junit4:junit4]   2> 10362 T2217 oasc.RequestHandlers.initHandlersFromConfig created mock: org.apache.solr.core.MockQuerySenderListenerReqHandler
[junit4:junit4]   2> 10363 T2217 oasc.RequestHandlers.initHandlersFromConfig created /admin/: org.apache.solr.handler.admin.AdminHandlers
[junit4:junit4]   2> 10363 T2217 oasc.RequestHandlers.initHandlersFromConfig created defaults: solr.StandardRequestHandler
[junit4:junit4]   2> 10363 T2217 oasc.RequestHandlers.initHandlersFromConfig adding lazy requestHandler: solr.StandardRequestHandler
[junit4:junit4]   2> 10364 T2217 oasc.RequestHandlers.initHandlersFromConfig created lazy: solr.StandardRequestHandler
[junit4:junit4]   2> 10364 T2217 oasc.RequestHandlers.initHandlersFromConfig created /update: solr.UpdateRequestHandler
[junit4:junit4]   2> 10365 T2217 oasc.RequestHandlers.initHandlersFromConfig created /terms: org.apache.solr.handler.component.SearchHandler
[junit4:junit4]   2> 10365 T2217 oasc.RequestHandlers.initHandlersFromConfig created spellCheckCompRH: org.apache.solr.handler.component.SearchHandler
[junit4:junit4]   2> 10366 T2217 oasc.RequestHandlers.initHandlersFromConfig created spellCheckCompRH_Direct: org.apache.solr.handler.component.SearchHandler
[junit4:junit4]   2> 10366 T2217 oasc.RequestHandlers.initHandlersFromConfig created spellCheckWithWordbreak: org.apache.solr.handler.component.SearchHandler
[junit4:junit4]   2> 10367 T2217 oasc.RequestHandlers.initHandlersFromConfig created spellCheckWithWordbreak_Direct: org.apache.solr.handler.component.SearchHandler
[junit4:junit4]   2> 10367 T2217 oasc.RequestHandlers.initHandlersFromConfig created spellCheckCompRH1: org.apache.solr.handler.component.SearchHandler
[junit4:junit4]   2> 10368 T2217 oasc.RequestHandlers.initHandlersFromConfig created mltrh: org.apache.solr.handler.component.SearchHandler
[junit4:junit4]   2> 10369 T2217 oasc.RequestHandlers.initHandlersFromConfig created tvrh: org.apache.solr.handler.component.SearchHandler
[junit4:junit4]   2> 10369 T2217 oasc.RequestHandlers.initHandlersFromConfig created /mlt: solr.MoreLikeThisHandler
[junit4:junit4]   2> 10370 T2217 oasc.RequestHandlers.initHandlersFromConfig created /debug/dump: solr.DumpRequestHandler
[junit4:junit4]   2> 10379 T2217 oashl.XMLLoader.init xsltCacheLifetimeSeconds=60
[junit4:junit4]   2> 10383 T2217 oasc.SolrCore.initDeprecatedSupport WARNING solrconfig.xml uses deprecated <admin/gettableFiles>, Please update your config to use the ShowFileRequestHandler.
[junit4:junit4]   2> 10386 T2217 oasc.SolrCore.initDeprecatedSupport WARNING adding ShowFileRequestHandler with hidden files: [SCHEMA.XML, OLD_SYNONYMS.TXT, STOPWORDS.TXT, PROTWORDS.TXT, OPEN-EXCHANGE-RATES.JSON, SYNONYMS.TXT, CURRENCY.XML, MAPPING-ISOLATIN1ACCENT.TXT]
[junit4:junit4]   2> 10389 T2217 oasc.CachingDirectoryFactory.close Releasing directory:/Users/jenkins/jenkins-slave/workspace/Lucene-Solr-trunk-MacOSX/solr/build/solr-core/test/J0/./org.apache.solr.cloud.BasicDistributedZkTest-1357115020540/jetty2
[junit4:junit4]   2> 10390 T2217 oass.SolrIndexSearcher.<init> Opening Searcher@204d9f1f main
[junit4:junit4]   2> 10391 T2217 oasu.CommitTracker.<init> Hard AutoCommit: disabled
[junit4:junit4]   2> 10392 T2217 oasu.CommitTracker.<init> Soft AutoCommit: disabled
[junit4:junit4]   2> 10393 T2217 oashc.SpellCheckComponent.inform Initializing spell checkers
[junit4:junit4]   2> 10401 T2217 oass.DirectSolrSpellChecker.init init: {name=direct,classname=DirectSolrSpellChecker,field=lowerfilt,minQueryLength=3}
[junit4:junit4]   2> 10479 T2218 oasc.SolrCore.registerSearcher [collection1] Registered new searcher Searcher@204d9f1f main{StandardDirectoryReader(segments_1:1)}
[junit4:junit4]   2> 10492 T2217 oasc.ZkController.publish publishing core=collection1 state=down
[junit4:junit4]   2> 10492 T2217 oasc.ZkController.publish numShards not found on descriptor - reading it from system property
[junit4:junit4]   2> 11459 T2183 oascc.ZkStateReader.updateClusterState Updating cloud state from ZooKeeper... 
[junit4:junit4]   2> 11460 T2183 oasc.Overseer$ClusterStateUpdater.updateState Update state numShards=2 message={
[junit4:junit4]   2> 	  "operation":"state",
[junit4:junit4]   2> 	  "numShards":"2",
[junit4:junit4]   2> 	  "shard":null,
[junit4:junit4]   2> 	  "roles":null,
[junit4:junit4]   2> 	  "state":"down",
[junit4:junit4]   2> 	  "core":"collection1",
[junit4:junit4]   2> 	  "collection":"collection1",
[junit4:junit4]   2> 	  "node_name":"127.0.0.1:49763_",
[junit4:junit4]   2> 	  "base_url":"http://127.0.0.1:49763"}
[junit4:junit4]   2> 11461 T2183 oasc.Overseer$ClusterStateUpdater.updateState Collection already exists with numShards=2
[junit4:junit4]   2> 11461 T2183 oasc.Overseer$ClusterStateUpdater.updateState Assigning new node to shard shard=shard2
[junit4:junit4]   2> 11474 T2182 oascc.ZkStateReader$2.process A cluster state change: WatchedEvent state:SyncConnected type:NodeDataChanged path:/clusterstate.json, has occurred - updating... (live nodes size: 3)
[junit4:junit4]   2> 11474 T2188 oascc.ZkStateReader$2.process A cluster state change: WatchedEvent state:SyncConnected type:NodeDataChanged path:/clusterstate.json, has occurred - updating... (live nodes size: 3)
[junit4:junit4]   2> 11475 T2201 oascc.ZkStateReader$2.process A cluster state change: WatchedEvent state:SyncConnected type:NodeDataChanged path:/clusterstate.json, has occurred - updating... (live nodes size: 3)
[junit4:junit4]   2> 11475 T2216 oascc.ZkStateReader$2.process A cluster state change: WatchedEvent state:SyncConnected type:NodeDataChanged path:/clusterstate.json, has occurred - updating... (live nodes size: 3)
[junit4:junit4]   2> 11503 T2217 oasc.CoreContainer.registerCore registering core: collection1
[junit4:junit4]   2> 11504 T2217 oasc.ZkController.register Register replica - core:collection1 address:http://127.0.0.1:49763 collection:collection1 shard:shard2
[junit4:junit4]   2> 11505 T2217 oascc.SolrZkClient.makePath makePath: /collections/collection1/leader_elect/shard2/election
[junit4:junit4]   2> 11538 T2165 oazs.PrepRequestProcessor.pRequest Got user-level KeeperException when processing sessionid:0x13bfa5bd5030008 type:delete cxid:0x44 zxid:0x7e txntype:-1 reqpath:n/a Error Path:/solr/collections/collection1/leaders/shard2 Error:KeeperErrorCode = NoNode for /solr/collections/collection1/leaders/shard2
[junit4:junit4]   2> 11539 T2217 oasc.ShardLeaderElectionContext.runLeaderProcess Running the leader process.
[junit4:junit4]   2> 11540 T2165 oazs.PrepRequestProcessor.pRequest Got user-level KeeperException when processing sessionid:0x13bfa5bd5030008 type:create cxid:0x45 zxid:0x7f txntype:-1 reqpath:n/a Error Path:/solr/overseer Error:KeeperErrorCode = NodeExists for /solr/overseer
[junit4:junit4]   2> 11547 T2217 oasc.ShardLeaderElectionContext.waitForReplicasToComeUp Enough replicas found to continue.
[junit4:junit4]   2> 11548 T2217 oasc.ShardLeaderElectionContext.runLeaderProcess I may be the new leader - try and sync
[junit4:junit4]   2> 11549 T2217 oasc.SyncStrategy.sync Sync replicas to http://127.0.0.1:49763/collection1/
[junit4:junit4]   2> 11549 T2217 oasc.SyncStrategy.syncReplicas Sync Success - now sync replicas to me
[junit4:junit4]   2> 11550 T2217 oasc.SyncStrategy.syncToMe http://127.0.0.1:49763/collection1/ has no replicas
[junit4:junit4]   2> 11550 T2217 oasc.ShardLeaderElectionContext.runLeaderProcess I am the new leader: http://127.0.0.1:49763/collection1/
[junit4:junit4]   2> 11551 T2217 oascc.SolrZkClient.makePath makePath: /collections/collection1/leaders/shard2
[junit4:junit4]   2> 11561 T2165 oazs.PrepRequestProcessor.pRequest Got user-level KeeperException when processing sessionid:0x13bfa5bd5030008 type:create cxid:0x4e zxid:0x82 txntype:-1 reqpath:n/a Error Path:/solr/overseer Error:KeeperErrorCode = NodeExists for /solr/overseer
[junit4:junit4]   2> 12988 T2183 oascc.ZkStateReader.updateClusterState Updating cloud state from ZooKeeper... 
[junit4:junit4]   2> 13001 T2216 oascc.ZkStateReader$2.process A cluster state change: WatchedEvent state:SyncConnected type:NodeDataChanged path:/clusterstate.json, has occurred - updating... (live nodes size: 3)
[junit4:junit4]   2> 13001 T2201 oascc.ZkStateReader$2.process A cluster state change: WatchedEvent state:SyncConnected type:NodeDataChanged path:/clusterstate.json, has occurred - updating... (live nodes size: 3)
[junit4:junit4]   2> 13003 T2188 oascc.ZkStateReader$2.process A cluster state change: WatchedEvent state:SyncConnected type:NodeDataChanged path:/clusterstate.json, has occurred - updating... (live nodes size: 3)
[junit4:junit4]   2> 13004 T2182 oascc.ZkStateReader$2.process A cluster state change: WatchedEvent state:SyncConnected type:NodeDataChanged path:/clusterstate.json, has occurred - updating... (live nodes size: 3)
[junit4:junit4]   2> 13043 T2217 oasc.ZkController.register We are http://127.0.0.1:49763/collection1/ and leader is http://127.0.0.1:49763/collection1/
[junit4:junit4]   2> 13044 T2217 oasc.ZkController.register No LogReplay needed for core=collection1 baseURL=http://127.0.0.1:49763
[junit4:junit4]   2> 13044 T2217 oasc.ZkController.checkRecovery I am the leader, no recovery necessary
[junit4:junit4]   2> 13044 T2217 oasc.ZkController.publish publishing core=collection1 state=active
[junit4:junit4]   2> 13045 T2217 oasc.ZkController.publish numShards not found on descriptor - reading it from system property
[junit4:junit4]   2> 13047 T2217 oascc.ZkStateReader.updateClusterState Updating cloud state from ZooKeeper... 
[junit4:junit4]   2> 13049 T2160 oass.SolrDispatchFilter.init user.dir=/Users/jenkins/jenkins-slave/workspace/Lucene-Solr-trunk-MacOSX/solr/build/solr-core/test/J0
[junit4:junit4]   2> 13049 T2160 oass.SolrDispatchFilter.init SolrDispatchFilter.init() done
[junit4:junit4]   2> 13049 T2160 oascsi.HttpClientUtil.createClient Creating new http client, config:maxConnections=128&maxConnectionsPerHost=32&followRedirects=false
[junit4:junit4]   2> 13380 T2160 oejs.Server.doStart jetty-8.1.8.v20121106
[junit4:junit4]   2> 13390 T2160 oejs.AbstractConnector.doStart Started SelectChannelConnector@127.0.0.1:49766
[junit4:junit4]   2> 13393 T2160 oasc.SolrResourceLoader.locateSolrHome JNDI not configured for solr (NoInitialContextEx)
[junit4:junit4]   2> 13393 T2160 oasc.SolrResourceLoader.locateSolrHome using system property solr.solr.home: /Users/jenkins/jenkins-slave/workspace/Lucene-Solr-trunk-MacOSX/solr/build/solr-core/test/J0/./org.apache.solr.cloud.BasicDistributedZkTest-jetty3-1357115033585
[junit4:junit4]   2> 13394 T2160 oasc.SolrResourceLoader.<init> new SolrResourceLoader for deduced Solr Home: '/Users/jenkins/jenkins-slave/workspace/Lucene-Solr-trunk-MacOSX/solr/build/solr-core/test/J0/./org.apache.solr.cloud.BasicDistributedZkTest-jetty3-1357115033585/'
[junit4:junit4]   2> 13427 T2160 oass.SolrDispatchFilter.init SolrDispatchFilter.init()
[junit4:junit4]   2> 13431 T2160 oasc.SolrResourceLoader.locateSolrHome JNDI not configured for solr (NoInitialContextEx)
[junit4:junit4]   2> 13438 T2160 oasc.SolrResourceLoader.locateSolrHome using system property solr.solr.home: /Users/jenkins/jenkins-slave/workspace/Lucene-Solr-trunk-MacOSX/solr/build/solr-core/test/J0/./org.apache.solr.cloud.BasicDistributedZkTest-jetty3-1357115033585
[junit4:junit4]   2> 13438 T2160 oasc.CoreContainer$Initializer.initialize looking for solr.xml: /Users/jenkins/jenkins-slave/workspace/Lucene-Solr-trunk-MacOSX/solr/build/solr-core/test/J0/./org.apache.solr.cloud.BasicDistributedZkTest-jetty3-1357115033585/solr.xml
[junit4:junit4]   2> 13439 T2160 oasc.CoreContainer.<init> New CoreContainer 1883146840
[junit4:junit4]   2> 13440 T2160 oasc.CoreContainer.load Loading CoreContainer using Solr Home: '/Users/jenkins/jenkins-slave/workspace/Lucene-Solr-trunk-MacOSX/solr/build/solr-core/test/J0/./org.apache.solr.cloud.BasicDistributedZkTest-jetty3-1357115033585/'
[junit4:junit4]   2> 13441 T2160 oasc.SolrResourceLoader.<init> new SolrResourceLoader for directory: '/Users/jenkins/jenkins-slave/workspace/Lucene-Solr-trunk-MacOSX/solr/build/solr-core/test/J0/./org.apache.solr.cloud.BasicDistributedZkTest-jetty3-1357115033585/'
[junit4:junit4]   2> 13470 T2160 oashc.HttpShardHandlerFactory.getParameter Setting socketTimeout to: 30000
[junit4:junit4]   2> 13470 T2160 oashc.HttpShardHandlerFactory.getParameter Setting urlScheme to: http://
[junit4:junit4]   2> 13471 T2160 oashc.HttpShardHandlerFactory.getParameter Setting connTimeout to: 15000
[junit4:junit4]   2> 13472 T2160 oashc.HttpShardHandlerFactory.getParameter Setting maxConnectionsPerHost to: 20
[junit4:junit4]   2> 13473 T2160 oashc.HttpShardHandlerFactory.getParameter Setting corePoolSize to: 0
[junit4:junit4]   2> 13473 T2160 oashc.HttpShardHandlerFactory.getParameter Setting maximumPoolSize to: 2147483647
[junit4:junit4]   2> 13474 T2160 oashc.HttpShardHandlerFactory.getParameter Setting maxThreadIdleTime to: 5
[junit4:junit4]   2> 13474 T2160 oashc.HttpShardHandlerFactory.getParameter Setting sizeOfQueue to: -1
[junit4:junit4]   2> 13475 T2160 oashc.HttpShardHandlerFactory.getParameter Setting fairnessPolicy to: false
[junit4:junit4]   2> 13475 T2160 oascsi.HttpClientUtil.createClient Creating new http client, config:maxConnectionsPerHost=20&maxConnections=10000&socketTimeout=30000&connTimeout=15000&retry=false
[junit4:junit4]   2> 13490 T2160 oasc.CoreContainer.load Registering Log Listener
[junit4:junit4]   2> 13523 T2160 oasc.CoreContainer.initZooKeeper Zookeeper client=127.0.0.1:49753/solr
[junit4:junit4]   2> 13524 T2160 oasc.ZkController.checkChrootPath zkHost includes chroot
[junit4:junit4]   2> 13525 T2160 oaz.ZooKeeper.<init> Initiating client connection, connectString=127.0.0.1:49753 sessionTimeout=60000 watcher=org.apache.solr.common.cloud.ConnectionManager@4c4bc07
[junit4:junit4]   2> 13527 T2228 oaz.ClientCnxn$SendThread.logStartConnect Opening socket connection to server localhost/127.0.0.1:49753. Will not attempt to authenticate using SASL (access denied ("javax.security.auth.AuthPermission" "getLoginConfiguration"))
[junit4:junit4]   2> 13548 T2160 oascc.ConnectionManager.waitForConnected Waiting for client to connect to ZooKeeper
[junit4:junit4]   2> 13550 T2228 oaz.ClientCnxn$SendThread.primeConnection Socket connection established to localhost/127.0.0.1:49753, initiating session
[junit4:junit4]   2> 13551 T2162 oazs.NIOServerCnxnFactory.run Accepted socket connection from /127.0.0.1:49767
[junit4:junit4]   2> 13551 T2162 oazs.ZooKeeperServer.processConnectRequest Client attempting to establish new session at /127.0.0.1:49767
[junit4:junit4]   2> 13553 T2164 oazs.ZooKeeperServer.finishSessionInit Established session 0x13bfa5bd5030009 with negotiated timeout 20000 for client /127.0.0.1:49767
[junit4:junit4]   2> 13553 T2228 oaz.ClientCnxn$SendThread.onConnected Session establishment complete on server localhost/127.0.0.1:49753, sessionid = 0x13bfa5bd5030009, negotiated timeout = 20000
[junit4:junit4]   2> 13553 T2229 oascc.ConnectionManager.process Watcher org.apache.solr.common.cloud.ConnectionManager@4c4bc07 name:ZooKeeperConnection Watcher:127.0.0.1:49753 got event WatchedEvent state:SyncConnected type:None path:null path:null type:None
[junit4:junit4]   2> 13555 T2160 oascc.ConnectionManager.waitForConnected Client is connected to ZooKeeper
[junit4:junit4]   2> 13559 T2165 oazs.PrepRequestProcessor.pRequest2Txn Processed session termination for sessionid: 0x13bfa5bd5030009
[junit4:junit4]   2> 13560 T2162 oazs.NIOServerCnxn.closeSock Closed socket connection for client /127.0.0.1:49767 which had sessionid 0x13bfa5bd5030009
[junit4:junit4]   2> 13561 T2229 oaz.ClientCnxn$EventThread.run EventThread shut down
[junit4:junit4]   2> 13561 T2160 oaz.ZooKeeper.close Session: 0x13bfa5bd5030009 closed
[junit4:junit4]   2> 13562 T2160 oascsi.HttpClientUtil.createClient Creating new http client, config:maxConnections=500&maxConnectionsPerHost=16&socketTimeout=15000&connTimeout=30000
[junit4:junit4]   2> 13567 T2160 oaz.ZooKeeper.<init> Initiating client connection, connectString=127.0.0.1:49753/solr sessionTimeout=30000 watcher=org.apache.solr.common.cloud.ConnectionManager@71a62f3d
[junit4:junit4]   2> 13569 T2230 oaz.ClientCnxn$SendThread.logStartConnect Opening socket connection to server localhost/127.0.0.1:49753. Will not attempt to authenticate using SASL (access denied ("javax.security.auth.AuthPermission" "getLoginConfiguration"))
[junit4:junit4]   2> 13569 T2160 oascc.ConnectionManager.waitForConnected Waiting for client to connect to ZooKeeper
[junit4:junit4]   2> 13570 T2230 oaz.ClientCnxn$SendThread.primeConnection Socket connection established to localhost/127.0.0.1:49753, initiating session
[junit4:junit4]   2> 13571 T2162 oazs.NIOServerCnxnFactory.run Accepted socket connection from /127.0.0.1:49768
[junit4:junit4]   2> 13572 T2162 oazs.ZooKeeperServer.processConnectRequest Client attempting to establish new session at /127.0.0.1:49768
[junit4:junit4]   2> 13573 T2230 oaz.ClientCnxn$SendThread.onConnected Session establishment complete on server localhost/127.0.0.1:49753, sessionid = 0x13bfa5bd503000a, negotiated timeout = 20000
[junit4:junit4]   2> 13573 T2231 oascc.ConnectionManager.process Watcher org.apache.solr.common.cloud.ConnectionManager@71a62f3d name:ZooKeeperConnection Watcher:127.0.0.1:49753/solr got event WatchedEvent state:SyncConnected type:None path:null path:null type:None
[junit4:junit4]   2> 13575 T2164 oazs.ZooKeeperServer.finishSessionInit Established session 0x13bfa5bd503000a with negotiated timeout 20000 for client /127.0.0.1:49768
[junit4:junit4]   2> 13576 T2160 oascc.ConnectionManager.waitForConnected Client is connected to ZooKeeper
[junit4:junit4]   2> 13584 T2165 oazs.PrepRequestProcessor.pRequest Got user-level KeeperException when processing sessionid:0x13bfa5bd503000a type:create cxid:0x1 zxid:0x8f txntype:-1 reqpath:n/a Error Path:/solr/overseer Error:KeeperErrorCode = NodeExists for /solr/overseer
[junit4:junit4]   2> 13586 T2165 oazs.PrepRequestProcessor.pRequest Got user-level KeeperException when processing sessionid:0x13bfa5bd503000a type:create cxid:0x2 zxid:0x90 txntype:-1 reqpath:n/a Error Path:/solr/overseer Error:KeeperErrorCode = NodeExists for /solr/overseer
[junit4:junit4]   2> 13588 T2160 oasc.ZkController.createEphemeralLiveNode Register node as live in ZooKeeper:/live_nodes/127.0.0.1:49766_
[junit4:junit4]   2> 13589 T2165 oazs.PrepRequestProcessor.pRequest Got user-level KeeperException when processing sessionid:0x13bfa5bd503000a type:delete cxid:0x4 zxid:0x91 txntype:-1 reqpath:n/a Error Path:/solr/live_nodes/127.0.0.1:49766_ Error:KeeperErrorCode = NoNode for /solr/live_nodes/127.0.0.1:49766_
[junit4:junit4]   2> 13594 T2160 oascc.SolrZkClient.makePath makePath: /live_nodes/127.0.0.1:49766_
[junit4:junit4]   2> 13607 T2216 oascc.ZkStateReader$2.process A cluster state change: WatchedEvent state:SyncConnected type:NodeChildrenChanged path:/live_nodes, has occurred - updating... (live nodes size: 3)
[junit4:junit4]   2> 13614 T2188 oascc.ZkStateReader$3.process Updating live nodes... (4)
[junit4:junit4]   2> 13614 T2188 oascc.ZkStateReader$2.process A cluster state change: WatchedEvent state:SyncConnected type:NodeChildrenChanged path:/live_nodes, has occurred - updating... (live nodes size: 4)
[junit4:junit4]   2> 13621 T2216 oascc.ZkStateReader$3.process Updating live nodes... (4)
[junit4:junit4]   2> 13625 T2182 oascc.ZkStateReader$3.process Updating live nodes... (4)
[junit4:junit4]   2> 13626 T2182 oascc.ZkStateReader$2.process A cluster state change: WatchedEvent state:SyncConnected type:NodeChildrenChanged path:/live_nodes, has occurred - updating... (live nodes size: 4)
[junit4:junit4]   2> 13629 T2201 oascc.ZkStateReader$3.process Updating live nodes... (4)
[junit4:junit4]   2> 13630 T2201 oascc.ZkStateReader$2.process A cluster state change: WatchedEvent state:SyncConnected type:NodeChildrenChanged path:/live_nodes, has occurred - updating... (live nodes size: 4)
[junit4:junit4]   2> 13644 T2160 oascc.ZkStateReader.createClusterStateWatchersAndUpdate Updating cluster state from ZooKeeper... 
[junit4:junit4]   2> 13673 T2232 oasc.CoreContainer.create Creating SolrCore 'collection1' using instanceDir: /Users/jenkins/jenkins-slave/workspace/Lucene-Solr-trunk-MacOSX/solr/build/solr-core/test/J0/./org.apache.solr.cloud.BasicDistributedZkTest-jetty3-1357115033585/collection1
[junit4:junit4]   2> 13674 T2232 oasc.ZkController.createCollectionZkNode Check for collection zkNode:collection1
[junit4:junit4]   2> 13675 T2232 oasc.ZkController.createCollectionZkNode Collection zkNode exists
[junit4:junit4]   2> 13675 T2232 oasc.ZkController.readConfigName Load collection config from:/collections/collection1
[junit4:junit4]   2> 13679 T2232 oasc.SolrResourceLoader.<init> new SolrResourceLoader for directory: '/Users/jenkins/jenkins-slave/workspace/Lucene-Solr-trunk-MacOSX/solr/build/solr-core/test/J0/./org.apache.solr.cloud.BasicDistributedZkTest-jetty3-1357115033585/collection1/'
[junit4:junit4]   2> 13681 T2232 oasc.SolrResourceLoader.replaceClassLoader Adding 'file:/Users/jenkins/jenkins-slave/workspace/Lucene-Solr-trunk-MacOSX/solr/build/solr-core/test/J0/org.apache.solr.cloud.BasicDistributedZkTest-jetty3-1357115033585/collection1/lib/classes/' to classloader
[junit4:junit4]   2> 13681 T2232 oasc.SolrResourceLoader.replaceClassLoader Adding 'file:/Users/jenkins/jenkins-slave/workspace/Lucene-Solr-trunk-MacOSX/solr/build/solr-core/test/J0/org.apache.solr.cloud.BasicDistributedZkTest-jetty3-1357115033585/collection1/lib/README' to classloader
[junit4:junit4]   2> 13741 T2232 oasc.SolrConfig.<init> Using Lucene MatchVersion: LUCENE_50
[junit4:junit4]   2> 13803 T2232 oasc.SolrConfig.<init> Loaded SolrConfig: solrconfig.xml
[junit4:junit4]   2> 13814 T2232 oass.IndexSchema.readSchema Reading Solr Schema
[junit4:junit4]   2> 13823 T2232 oass.IndexSchema.readSchema Schema name=test
[junit4:junit4]   2> 14515 T2183 oascc.ZkStateReader.updateClusterState Updating cloud state from ZooKeeper... 
[junit4:junit4]   2> 14518 T2183 oasc.Overseer$ClusterStateUpdater.updateState Update state numShards=2 message={
[junit4:junit4]   2> 	  "operation":"state",
[junit4:junit4]   2> 	  "numShards":"2",
[junit4:junit4]   2> 	  "shard":"shard2",
[junit4:junit4]   2> 	  "roles":null,
[junit4:junit4]   2> 	  "state":"active",
[junit4:junit4]   2> 	  "core":"collection1",
[junit4:junit4]   2> 	  "collection":"collection1",
[junit4:junit4]   2> 	  "node_name":"127.0.0.1:49763_",
[junit4:junit4]   2> 	  "base_url":"http://127.0.0.1:49763"}
[junit4:junit4]   2> 14528 T2182 oascc.ZkStateReader$2.process A cluster state change: WatchedEvent state:SyncConnected type:NodeDataChanged path:/clusterstate.json, has occurred - updating... (live nodes size: 4)
[junit4:junit4]   2> 14528 T2188 oascc.ZkStateReader$2.process A cluster state change: WatchedEvent state:SyncConnected type:NodeDataChanged path:/clusterstate.json, has occurred - updating... (live nodes size: 4)
[junit4:junit4]   2> 14529 T2201 oascc.ZkStateReader$2.process A cluster state change: WatchedEvent state:SyncConnected type:NodeDataChanged path:/clusterstate.json, has occurred - updating... (live nodes size: 4)
[junit4:junit4]   2> 14529 T2231 oascc.ZkStateReader$2.process A cluster state change: WatchedEvent state:SyncConnected type:NodeDataChanged path:/clusterstate.json, has occurred - updating... (live nodes size: 4)
[junit4:junit4]   2> 14529 T2216 oascc.ZkStateReader$2.process A cluster state change: WatchedEvent state:SyncConnected type:NodeDataChanged path:/clusterstate.json, has occurred - updating... (live nodes size: 4)
[junit4:junit4]   2> 14757 T2232 oass.OpenExchangeRatesOrgProvider.init Initialized with rates=open-exchange-rates.json, refreshInterval=1440.
[junit4:junit4]   2> 14769 T2232 oass.IndexSchema.readSchema default search field in schema is text
[junit4:junit4]   2> 14773 T2232 oass.IndexSchema.readSchema unique key field: id
[junit4:junit4]   2> 14858 T2232 oass.FileExchangeRateProvider.reload Reloading exchange rates from file currency.xml
[junit4:junit4]   2> 14873 T2232 oass.FileExchangeRateProvider.reload Reloading exchange rates from file currency.xml
[junit4:junit4]   2> 14891 T2232 oass.OpenExchangeRatesOrgProvider.reload Reloading exchange rates from open-exchange-rates.json
[junit4:junit4]   2> 14907 T2232 oass.OpenExchangeRatesOrgProvider.reload Reloading exchange rates from open-exchange-rates.json
[junit4:junit4]   2> 14913 T2232 oasc.SolrCore.<init> [collection1] Opening new SolrCore at /Users/jenkins/jenkins-slave/workspace/Lucene-Solr-trunk-MacOSX/solr/build/solr-core/test/J0/./org.apache.solr.cloud.BasicDistributedZkTest-jetty3-1357115033585/collection1/, dataDir=./org.apache.solr.cloud.BasicDistributedZkTest-1357115020540/jetty3/
[junit4:junit4]   2> 14913 T2232 oasc.JmxMonitoredMap.<init> JMX monitoring is enabled. Adding Solr mbeans to JMX Server: com.sun.jmx.mbeanserver.JmxMBeanServer@26d68a6e
[junit4:junit4]   2> 14914 T2232 oasc.SolrCore.initDirectoryFactory solr.StandardDirectoryFactory
[junit4:junit4]   2> 14914 T2232 oasc.CachingDirectoryFactory.get return new directory for /Users/jenkins/jenkins-slave/workspace/Lucene-Solr-trunk-MacOSX/solr/build/solr-core/test/J0/./org.apache.solr.cloud.BasicDistributedZkTest-1357115020540/jetty3 forceNew:false
[junit4:junit4]   2> 14915 T2232 oasc.CachingDirectoryFactory.close Releasing directory:/Users/jenkins/jenkins-slave/workspace/Lucene-Solr-trunk-MacOSX/solr/build/solr-core/test/J0/./org.apache.solr.cloud.BasicDistributedZkTest-1357115020540/jetty3
[junit4:junit4]   2> 14915 T2232 oasc.SolrCore.getNewIndexDir New index directory detected: old=null new=./org.apache.solr.cloud.BasicDistributedZkTest-1357115020540/jetty3/index/
[junit4:junit4]   2> 14916 T2232 oasc.SolrCore.initIndex WARNING [collection1] Solr index directory './org.apache.solr.cloud.BasicDistributedZkTest-1357115020540/jetty3/index' doesn't exist. Creating new index...
[junit4:junit4]   2> 14917 T2232 oasc.CachingDirectoryFactory.get return new directory for /Users/jenkins/jenkins-slave/workspace/Lucene-Solr-trunk-MacOSX/solr/build/solr-core/test/J0/./org.apache.solr.cloud.BasicDistributedZkTest-1357115020540/jetty3/index forceNew:false
[junit4:junit4]   2> 14929 T2232 oasc.SolrDeletionPolicy.onCommit SolrDeletionPolicy.onCommit: commits:num=1
[junit4:junit4]   2> 		commit{dir=RateLimitedDirectoryWrapper(org.apache.lucene.store.NIOFSDirectory@/Users/jenkins/jenkins-slave/workspace/Lucene-Solr-trunk-MacOSX/solr/build/solr-core/test/J0/org.apache.solr.cloud.BasicDistributedZkTest-1357115020540/jetty3/index lockFactory=org.apache.lucene.store.NativeFSLockFactory@3793e1da),segFN=segments_1,generation=1,filenames=[segments_1]
[junit4:junit4]   2> 14930 T2232 oasc.SolrDeletionPolicy.updateCommits newest commit = 1[segments_1]
[junit4:junit4]   2> 14931 T2232 oasc.CachingDirectoryFactory.close Releasing directory:/Users/jenkins/jenkins-slave/workspace/Lucene-Solr-trunk-MacOSX/solr/build/solr-core/test/J0/./org.apache.solr.cloud.BasicDistributedZkTest-1357115020540/jetty3/index
[junit4:junit4]   2> 14931 T2232 oasc.SolrCore.initWriters created xml: solr.XMLResponseWriter
[junit4:junit4]   2> 14934 T2232 oasup.UpdateRequestProcessorChain.init inserting DistributedUpdateProcessorFactory into updateRequestProcessorChain "dedupe"
[junit4:junit4]   2> 14934 T2232 oasup.UpdateRequestProcessorChain.init inserting DistributedUpdateProcessorFactory into updateRequestProcessorChain "dedupe-allfields"
[junit4:junit4]   2> 14935 T2232 oasup.UpdateRequestProcessorChain.init inserting DistributedUpdateProcessorFactory into updateRequestProcessorChain "stored_sig"
[junit4:junit4]   2> 14935 T2232 oasup.UpdateRequestProcessorChain.init inserting DistributedUpdateProcessorFactory into updateRequestProcessorChain "uniq-fields"
[junit4:junit4]   2> 14936 T2232 oasup.UpdateRequestProcessorChain.init inserting DistributedUpdateProcessorFactory into updateRequestProcessorChain "distrib-dup-test-chain-implicit"
[junit4:junit4]   2> 14936 T2232 oasc.RequestHandlers.initHandlersFromConfig adding lazy requestHandler: solr.ReplicationHandler
[junit4:junit4]   2> 14937 T2232 oasc.RequestHandlers.initHandlersFromConfig created /replication: solr.ReplicationHandler
[junit4:junit4]   2> 14937 T2232 oasc.RequestHandlers.initHandlersFromConfig created standard: solr.StandardRequestHandler
[junit4:junit4]   2> 14938 T2232 oasc.RequestHandlers.initHandlersFromConfig created /get: solr.RealTimeGetHandler
[junit4:junit4]   2> 14940 T2232 oasc.RequestHandlers.initHandlersFromConfig created dismax: solr.SearchHandler
[junit4:junit4]   2> 14941 T2232 oasc.RequestHandlers.initHandlersFromConfig created mock: org.apache.solr.core.MockQuerySenderListenerReqHandler
[junit4:junit4]   2> 14942 T2232 oasc.RequestHandlers.initHandlersFromConfig created /admin/: org.apache.solr.handler.admin.AdminHandlers
[junit4:junit4]   2> 14943 T2232 oasc.RequestHandlers.initHandlersFromConfig created defaults: solr.StandardRequestHandler
[junit4:junit4]   2> 14943 T2232 oasc.RequestHandlers.initHandlersFromConfig adding lazy requestHandler: solr.StandardRequestHandler
[junit4:junit4]   2> 14944 T2232 oasc.RequestHandlers.initHandlersFromConfig created lazy: solr.StandardRequestHandler
[junit4:junit4]   2> 14944 T2232 oasc.RequestHandlers.initHandlersFromConfig created /update: solr.UpdateRequestHandler
[junit4:junit4]   2> 14945 T2232 oasc.RequestHandlers.initHandlersFromConfig created /terms: org.apache.solr.handler.component.SearchHandler
[junit4:junit4]   2> 14946 T2232 oasc.RequestHandlers.initHandlersFromConfig created spellCheckCompRH: org.apache.solr.handler.component.SearchHandler
[junit4:junit4]   2> 14946 T2232 oasc.RequestHandlers.initHandlersFromConfig created spellCheckCompRH_Direct: org.apache.solr.handler.component.SearchHandler
[junit4:junit4]   2> 14947 T2232 oasc.RequestHandlers.initHandlersFromConfig created spellCheckWithWordbreak: org.apache.solr.handler.component.SearchHandler
[junit4:junit4]   2> 14947 T2232 oasc.RequestHandlers.initHandlersFromConfig created spellCheckWithWordbreak_Direct: org.apache.solr.handler.component.SearchHandler
[junit4:junit4]   2> 14948 T2232 oasc.RequestHandlers.initHandlersFromConfig created spellCheckCompRH1: org.apache.solr.handler.component.SearchHandler
[junit4:junit4]   2> 14948 T2232 oasc.RequestHandlers.initHandlersFromConfig created mltrh: org.apache.solr.handler.component.SearchHandler
[junit4:junit4]   2> 14949 T2232 oasc.RequestHandlers.initHandlersFromConfig created tvrh: org.apache.solr.handler.component.SearchHandler
[junit4:junit4]   2> 14951 T2232 oasc.RequestHandlers.initHandlersFromConfig created /mlt: solr.MoreLikeThisHandler
[junit4:junit4]   2> 14952 T2232 oasc.RequestHandlers.initHandlersFromConfig created /debug/dump: solr.DumpRequestHandler
[junit4:junit4]   2> 14959 T2232 oashl.XMLLoader.init xsltCacheLifetimeSeconds=60
[junit4:junit4]   2> 14962 T2232 oasc.SolrCore.initDeprecatedSupport WARNING solrconfig.xml uses deprecated <admin/gettableFiles>, Please update your config to use the ShowFileRequestHandler.
[junit4:junit4]   2> 14964 T2232 oasc.SolrCore.initDeprecatedSupport WARNING adding ShowFileRequestHandler with hidden files: [SCHEMA.XML, OLD_SYNONYMS.TXT, STOPWORDS.TXT, PROTWORDS.TXT, OPEN-EXCHANGE-RATES.JSON, SYNONYMS.TXT, CURRENCY.XML, MAPPING-ISOLATIN1ACCENT.TXT]
[junit4:junit4]   2> 14968 T2232 oasc.CachingDirectoryFactory.close Releasing directory:/Users/jenkins/jenkins-slave/workspace/Lucene-Solr-trunk-MacOSX/solr/build/solr-core/test/J0/./org.apache.solr.cloud.BasicDistributedZkTest-1357115020540/jetty3
[junit4:junit4]   2> 14970 T2232 oass.SolrIndexSearcher.<init> Opening Searcher@6f7cb751 main
[junit4:junit4]   2> 14971 T2232 oasu.CommitTracker.<init> Hard AutoCommit: disabled
[junit4:junit4]   2> 14971 T2232 oasu.CommitTracker.<init> Soft AutoCommit: disabled
[junit4:junit4]   2> 14972 T2232 oashc.SpellCheckComponent.inform Initializing spell checkers
[junit4:junit4]   2> 14977 T2232 oass.DirectSolrSpellChecker.init init: {name=direct,classname=DirectSolrSpellChecker,field=lowerfilt,minQueryLength=3}
[junit4:junit4]   2> 15028 T2233 oasc.SolrCore.registerSearcher [collection1] Registered new searcher Searcher@6f7cb751 main{StandardDirectoryReader(segments_1:1)}
[junit4:junit4]   2> 15035 T2232 oasc.ZkController.publish publishing core=collection1 state=down
[junit4:junit4]   2> 15035 T2232 oasc.ZkController.publish numShards not found on descriptor - reading it from system property
[junit4:junit4]   2> 16065 T2183 oascc.ZkStateReader.updateClusterState Updating cloud state from ZooKeeper... 
[junit4:junit4]   2> 16067 T2183 oasc.Overseer$ClusterStateUpdater.updateState Update state numShards=2 message={
[junit4:junit4]   2> 	  "operation":"state",
[junit4:junit4]   2> 	  "numShards":"2",
[junit4:junit4]   2> 	  "shard":null,
[junit4:junit4]   2> 	  "roles":null,
[junit4:junit4]   2> 	  "state":"down",
[junit4:junit4]   2> 	  "core":"collection1",
[junit4:junit4]   2> 	  "collection":"collection1",
[junit4:junit4]   2> 	  "node_name":"127.0.0.1:49766_",
[junit4:junit4]   2> 	  "base_url":"http://127.0.0.1:49766"}
[junit4:junit4]   2> 16067 T2183 oasc.Overseer$ClusterStateUpdater.updateState Collection already exists with numShards=2
[junit4:junit4]   2> 16067 T2183 oasc.Overseer$ClusterStateUpdater.updateState Assigning new node to shard shard=shard1
[junit4:junit4]   2> 16075 T2188 oascc.ZkStateReader$2.process A cluster state change: WatchedEvent state:SyncConnected type:NodeDataChanged path:/clusterstate.json, has occurred - updating... (live nodes size: 4)
[junit4:junit4]   2> 16075 T2216 oascc.ZkStateReader$2.process A cluster state change: WatchedEvent state:SyncConnected type:NodeDataChanged path:/clusterstate.json, has occurred - updating... (live nodes size: 4)
[junit4:junit4]   2> 16075 T2201 oascc.ZkStateReader$2.process A cluster state change: WatchedEvent state:SyncConnected type:NodeDataChanged path:/clusterstate.json, has occurred - updating... (live nodes size: 4)
[junit4:junit4]   2> 16076 T2231 oascc.ZkStateReader$2.process A cluster state change: WatchedEvent state:SyncConnected type:NodeDataChanged path:/clusterstate.json, has occurred - updating... (live nodes size: 4)
[junit4:junit4]   2> 16076 T2182 oascc.ZkStateReader$2.process A cluster state change: WatchedEvent state:SyncConnected type:NodeDataChanged path:/clusterstate.json, has occurred - updating... (live nodes size: 4)
[junit4:junit4]   2> 17047 T2232 oasc.CoreContainer.registerCore registering core: collection1
[junit4:junit4]   2> 17048 T2232 oasc.ZkController.register Register replica - core:collection1 address:http://127.0.0.1:49766 collection:collection1 shard:shard1
[junit4:junit4]   2> 17053 T2232 oasc.ZkController.register We are http://127.0.0.1:49766/collection1/ and leader is http://127.0.0.1:49760/collection1/
[junit4:junit4]   2> 17053 T2232 oasc.ZkController.register No LogReplay needed for core=collection1 baseURL=http://127.0.0.1:49766
[junit4:junit4]   2> 17053 T2232 oasc.ZkController.checkRecovery Core needs to recover:collection1
[junit4:junit4]   2> 17053 T2232 oasu.DefaultSolrCoreState.doRecovery Running recovery - first canceling any ongoing recovery
[junit4:junit4]   2> ASYNC  NEW_CORE C140 name=collection1 org.apache.solr.core.SolrCore@290ef207 url=http://127.0.0.1:49766/collection1 node=127.0.0.1:49766_ C140_STATE=coll:collection1 core:collection1 props:{shard=null, roles=null, state=down, core=collection1, collection=collection1, node_name=127.0.0.1:49766_, base_url=http://127.0.0.1:49766}
[junit4:junit4]   2> 17054 T2234 C140 P49766 oasc.RecoveryStrategy.run Starting recovery process.  core=collection1 recoveringAfterStartup=true
[junit4:junit4]   2> 17055 T2234 C140 P49766 oasc.RecoveryStrategy.doRecovery ###### startupVersions=[]
[junit4:junit4]   2> 17055 T2234 C140 P49766 oasc.ZkController.publish publishing core=collection1 state=recovering
[junit4:junit4]   2> 17056 T2232 oascc.ZkStateReader.updateClusterState Updating cloud state from ZooKeeper... 
[junit4:junit4]   2> 17056 T2234 C140 P49766 oasc.ZkController.publish numShards not found on descriptor - reading it from system property
[junit4:junit4]   2> 17057 T2160 oass.SolrDispatchFilter.init user.dir=/Users/jenkins/jenkins-slave/workspace/Lucene-Solr-trunk-MacOSX/solr/build/solr-core/test/J0
[junit4:junit4]   2> 17058 T2160 oass.SolrDispatchFilter.init SolrDispatchFilter.init() done
[junit4:junit4]   2> 17058 T2234 C140 P49766 oascsi.HttpClientUtil.createClient Creating new http client, config:maxConnections=128&maxConnectionsPerHost=32&followRedirects=false
[junit4:junit4]   2> 17065 T2160 oascsi.HttpClientUtil.createClient Creating new http client, config:maxConnections=128&maxConnectionsPerHost=32&followRedirects=false
[junit4:junit4]   2> 17434 T2160 oejs.Server.doStart jetty-8.1.8.v20121106
[junit4:junit4]   2> 17459 T2160 oejs.AbstractConnector.doStart Started SelectChannelConnector@127.0.0.1:49770
[junit4:junit4]   2> 17461 T2160 oasc.SolrResourceLoader.locateSolrHome JNDI not configured for solr (NoInitialContextEx)
[junit4:junit4]   2> 17462 T2160 oasc.SolrResourceLoader.locateSolrHome using system property solr.solr.home: /Users/jenkins/jenkins-slave/workspace/Lucene-Solr-trunk-MacOSX/solr/build/solr-core/test/J0/./org.apache.solr.cloud.BasicDistributedZkTest-jetty4-1357115037597
[junit4:junit4]   2> 17463 T2160 oasc.SolrResourceLoader.<init> new SolrResourceLoader for deduced Solr Home: '/Users/jenkins/jenkins-slave/workspace/Lucene-Solr-trunk-MacOSX/solr/build/solr-core/test/J0/./org.apache.solr.cloud.BasicDistributedZkTest-jetty4-1357115037597/'
[junit4:junit4]   2> 17493 T2160 oass.SolrDispatchFilter.init SolrDispatchFilter.init()
[junit4:junit4]   2> 17493 T2160 oasc.SolrResourceLoader.locateSolrHome JNDI not configured for solr (NoInitialContextEx)
[junit4:junit4]   2> 17494 T2160 oasc.SolrResourceLoader.locateSolrHome using system property solr.solr.home: /Users/jenkins/jenkins-slave/workspace/Lucene-Solr-trunk-MacOSX/solr/build/solr-core/test/J0/./org.apache.solr.cloud.BasicDistributedZkTest-jetty4-1357115037597
[junit4:junit4]   2> 17494 T2160 oasc.CoreContainer$Initializer.initialize looking for solr.xml: /Users/jenkins/jenkins-slave/workspace/Lucene-Solr-trunk-MacOSX/solr/build/solr-core/test/J0/./org.apache.solr.cloud.BasicDistributedZkTest-jetty4-1357115037597/solr.xml
[junit4:junit4]   2> 17494 T2160 oasc.CoreContainer.<init> New CoreContainer 2116176547
[junit4:junit4]   2> 17495 T2160 oasc.CoreContainer.load Loading CoreContainer using Solr Home: '/Users/jenkins/jenkins-slave/workspace/Lucene-Solr-trunk-MacOSX/solr/build/solr-core/test/J0/./org.apache.solr.cloud.BasicDistributedZkTest-jetty4-1357115037597/'
[junit4:junit4]   2> 17495 T2160 oasc.SolrResourceLoader.<init> new SolrResourceLoader for directory: '/Users/jenkins/jenkins-slave/workspace/Lucene-Solr-trunk-MacOSX/solr/build/solr-core/test/J0/./org.apache.solr.cloud.BasicDistributedZkTest-jetty4-1357115037597/'
[junit4:junit4]   2> 17527 T2160 oashc.HttpShardHandlerFactory.getParameter Setting socketTimeout to: 30000
[junit4:junit4]   2> 17527 T2160 oashc.HttpShardHandlerFactory.getParameter Setting urlScheme to: http://
[junit4:junit4]   2> 17528 T2160 oashc.HttpShardHandlerFactory.getParameter Setting connTimeout to: 15000
[junit4:junit4]   2> 17528 T2160 oashc.HttpShardHandlerFactory.getParameter Setting maxConnectionsPerHost to: 20
[junit4:junit4]   2> 17529 T2160 oashc.HttpShardHandlerFactory.getParameter Setting corePoolSize to: 0
[junit4:junit4]   2> 17529 T2160 oashc.HttpShardHandlerFactory.getParameter Setting maximumPoolSize to: 2147483647
[junit4:junit4]   2> 17530 T2160 oashc.HttpShardHandlerFactory.getParameter Setting maxThreadIdleTime to: 5
[junit4:junit4]   2> 17530 T2160 oashc.HttpShardHandlerFactory.getParameter Setting sizeOfQueue to: -1
[junit4:junit4]   2> 17531 T2160 oashc.HttpShardHandlerFactory.getParameter Setting fairnessPolicy to: false
[junit4:junit4]   2> 17531 T2160 oascsi.HttpClientUtil.createClient Creating new http client, config:maxConnectionsPerHost=20&maxConnections=10000&socketTimeout=30000&connTimeout=15000&retry=false
[junit4:junit4]   2> 17563 T2160 oasc.CoreContainer.load Registering Log Listener
[junit4:junit4]   2> 17588 T2183 oascc.ZkStateReader.updateClusterState Updating cloud state from ZooKeeper... 
[junit4:junit4]   2> 17589 T2183 oasc.Overseer$ClusterStateUpdater.updateState Update state numShards=2 message={
[junit4:junit4]   2> 	  "operation":"state",
[junit4:junit4]   2> 	  "numShards":"2",
[junit4:junit4]   2> 	  "shard":"shard1",
[junit4:junit4]   2> 	  "roles":null,
[junit4:junit4]   2> 	  "state":"recovering",
[junit4:junit4]   2> 	  "core":"collection1",
[junit4:junit4]   2> 	  "collection":"collection1",
[junit4:junit4]   2> 	  "node_name":"127.0.0.1:49766_",
[junit4:junit4]   2> 	  "base_url":"http://127.0.0.1:49766"}
[junit4:junit4]   2> 17602 T2188 oascc.ZkStateReader$2.process A cluster state change: WatchedEvent state:SyncConnected type:NodeDataChanged path:/clusterstate.json, has occurred - updating... (live nodes size: 4)
[junit4:junit4]   2> 17602 T2182 oascc.ZkStateReader$2.process A cluster state change: WatchedEvent state:SyncConnected type:NodeDataChanged path:/clusterstate.json, has occurred - updating... (live nodes size: 4)
[junit4:junit4]   2> 17602 T2231 oascc.ZkStateReader$2.process A cluster state change: WatchedEvent state:SyncConnected type:NodeDataChanged path:/clusterstate.json, has occurred - updating... (live nodes size: 4)
[junit4:junit4]   2> 17602 T2216 oascc.ZkStateReader$2.process A cluster state change: WatchedEvent state:SyncConnected type:NodeDataChanged path:/clusterstate.json, has occurred - updating... (live nodes size: 4)
[junit4:junit4]   2> 17602 T2201 oascc.ZkStateReader$2.process A cluster state change: WatchedEvent state:SyncConnected type:NodeDataChanged path:/clusterstate.json, has occurred - updating... (live nodes size: 4)
[junit4:junit4]   2> 17622 T2160 oasc.CoreContainer.initZooKeeper Zookeeper client=127.0.0.1:49753/solr
[junit4:junit4]   2> 17623 T2160 oasc.ZkController.checkChrootPath zkHost includes chroot
[junit4:junit4]   2> 17624 T2160 oaz.ZooKeeper.<init> Initiating client connection, connectString=127.0.0.1:49753 sessionTimeout=60000 watcher=org.apache.solr.common.cloud.ConnectionManager@70ac142f
[junit4:junit4]   2> 17636 T2244 oaz.ClientCnxn$SendThread.logStartConnect Opening socket connection to server localhost/127.0.0.1:49753. Will not attempt to authenticate using SASL (access denied ("javax.security.auth.AuthPermission" "getLoginConfiguration"))
[junit4:junit4]   2> 17636 T2160 oascc.ConnectionManager.waitForConnected Waiting for client to connect to ZooKeeper
[junit4:junit4]   2> 17637 T2244 oaz.ClientCnxn$SendThread.primeConnection Socket connection established to localhost/127.0.0.1:49753, initiating session
[junit4:junit4]   2> 17640 T2162 oazs.NIOServerCnxnFactory.run Accepted socket connection from /127.0.0.1:49771
[junit4:junit4]   2> 17640 T2162 oazs.ZooKeeperServer.processConnectRequest Client attempting to establish new session at /127.0.0.1:49771
[junit4:junit4]   2> 17642 T2164 oazs.ZooKeeperServer.finishSessionInit Established session 0x13bfa5bd503000b with negotiated timeout 20000 for client /127.0.0.1:49771
[junit4:junit4]   2> 17642 T2244 oaz.ClientCnxn$SendThread.onConnected Session establishment complete on server localhost/127.0.0.1:49753, sessionid = 0x13bfa5bd503000b, negotiated timeout = 20000
[junit4:junit4]   2> 17642 T2245 oascc.ConnectionManager.process Watcher org.apache.solr.common.cloud.ConnectionManager@70ac142f name:ZooKeeperConnection Watcher:127.0.0.1:49753 got event WatchedEvent state:SyncConnected type:None path:null path:null type:None
[junit4:junit4]   2> 17644 T2160 oascc.ConnectionManager.waitForConnected Client is connected to ZooKeeper
[junit4:junit4]   2> 17648 T2165 oazs.PrepRequestProcessor.pRequest2Txn Processed session termination for sessionid: 0x13bfa5bd503000b
[junit4:junit4]   2> 17649 T2162 oazs.NIOServerCnxn.closeSock Closed socket connection for client /127.0.0.1:49771 which had sessionid 0x13bfa5bd503000b
[junit4:junit4]   2> 17650 T2245 oaz.ClientCnxn$EventThread.run EventThread shut down
[junit4:junit4]   2> 17650 T2160 oaz.ZooKeeper.close Session: 0x13bfa5bd503000b closed
[junit4:junit4]   2> 17651 T2160 oascsi.HttpClientUtil.createClient Creating new http client, config:maxConnections=500&maxConnectionsPerHost=16&socketTimeout=15000&connTimeout=30000
[junit4:junit4]   2> 17656 T2160 oaz.ZooKeeper.<init> Initiating client connection, connectString=127.0.0.1:49753/solr sessionTimeout=30000 watcher=org.apache.solr.common.cloud.ConnectionManager@6039c5c5
[junit4:junit4]   2> 17660 T2246 oaz.ClientCnxn$SendThread.logStartConnect Opening socket connection to server localhost/127.0.0.1:49753. Will not attempt to authenticate using SASL (access denied ("javax.security.auth.AuthPermission" "getLoginConfiguration"))
[junit4:junit4]   2> 17661 T2246 oaz.ClientCnxn$SendThread.primeConnection Socket connection established to localhost/127.0.0.1:49753, initiating session
[junit4:junit4]   2> 17661 T2162 oazs.NIOServerCnxnFactory.run Accepted socket connection from /127.0.0.1:49772
[junit4:junit4]   2> 17662 T2162 oazs.ZooKeeperServer.processConnectRequest Client attempting to establish new session at /127.0.0.1:49772
[junit4:junit4]   2> 17663 T2164 oazs.ZooKeeperServer.finishSessionInit Established session 0x13bfa5bd503000c with negotiated timeout 20000 for client /127.0.0.1:49772
[junit4:junit4]   2> 17663 T2246 oaz.ClientCnxn$SendThread.onConnected Session establishment complete on server localhost/127.0.0.1:49753, sessionid = 0x13bfa5bd503000c, negotiated timeout = 20000
[junit4:junit4]   2> 17672 T2160 oascc.ConnectionManager.waitForConnected Waiting for client to connect to ZooKeeper
[junit4:junit4]   2> 17673 T2247 oascc.ConnectionManager.process Watcher org.apache.solr.common.cloud.ConnectionManager@6039c5c5 name:ZooKeeperConnection Watcher:127.0.0.1:49753/solr got event WatchedEvent state:SyncConnected type:None path:null path:null type:None
[junit4:junit4]   2> 17675 T2160 oascc.ConnectionManager.waitForConnected Client is connected to ZooKeeper
[junit4:junit4]   2> 17678 T2165 oazs.PrepRequestProcessor.pRequest Got user-level KeeperException when processing sessionid:0x13bfa5bd503000c type:create cxid:0x1 zxid:0xa6 txntype:-1 reqpath:n/a Error Path:/solr/overseer Error:KeeperErrorCode = NodeExists for /solr/overseer
[junit4:junit4]   2> 17682 T2165 oazs.PrepRequestProcessor.pRequest Got user-level KeeperException when processing sessionid:0x13bfa5bd503000c type:create cxid:0x2 zxid:0xa7 txntype:-1 reqpath:n/a Error Path:/solr/overseer Error:KeeperErrorCode = NodeExists for /solr/overseer
[junit4:junit4]   2> 17686 T2160 oasc.ZkController.createEphemeralLiveNode Register node as live in ZooKeeper:/live_nodes/127.0.0.1:49770_
[junit4:junit4]   2> 17688 T2165 oazs.PrepRequestProcessor.pRequest Got user-level KeeperException when processing sessionid:0x13bfa5bd503000c type:delete cxid:0x4 zxid:0xa8 txntype:-1 reqpath:n/a Error Path:/solr/live_nodes/127.0.0.1:49770_ Error:KeeperErrorCode = NoNode for /solr/live_nodes/127.0.0.1:49770_
[junit4:junit4]   2> 17691 T2160 oascc.SolrZkClient.makePath makePath: /live_nodes/127.0.0.1:49770_
[junit4:junit4]   2> 17707 T2216 oascc.ZkStateReader$2.process A cluster state change: WatchedEvent state:SyncConnected type:NodeChildrenChanged path:/live_nodes, has occurred - updating... (live nodes size: 4)
[junit4:junit4]   2> 17708 T2188 oascc.ZkStateReader$3.process Updating live nodes... (5)
[junit4:junit4]   2> 17708 T2188 oascc.ZkStateReader$2.process A cluster state change: WatchedEvent state:SyncConnected type:NodeChildrenChanged path:/live_nodes, has occurred - updating... (live nodes size: 5)
[junit4:junit4]   2> 17710 T2201 oascc.ZkStateReader$3.process Updating live nodes... (5)
[junit4:junit4]   2> 17711 T2231 oascc.ZkStateReader$3.process Updating live nodes... (5)
[junit4:junit4]   2> 17711 T2201 oascc.ZkStateReader$2.process A cluster state change: WatchedEvent state:SyncConnected type:NodeChildrenChanged path:/live_nodes, has occurred - updating... (live nodes size: 5)
[junit4:junit4]   2> 17711 T2231 oascc.ZkStateReader$2.process A cluster state change: WatchedEvent state:SyncConnected type:NodeChildrenChanged path:/live_nodes, has occurred - updating... (live nodes size: 5)
[junit4:junit4]   2> 17712 T2182 oascc.ZkStateReader$3.process Updating live nodes... (5)
[junit4:junit4]   2> 17713 T2182 oascc.ZkStateReader$2.process A cluster state change: WatchedEvent state:SyncConnected type:NodeChildrenChanged path:/live_nodes, has occurred - updating... (live nodes size: 5)
[junit4:junit4]   2> 17715 T2216 oascc.ZkStateReader$3.process Updating live nodes... (5)
[junit4:junit4]   2> 17745 T2160 oascc.ZkStateReader.createClusterStateWatchersAndUpdate Updating cluster state from ZooKeeper... 
[junit4:junit4]   2> 17855 T2248 oasc.CoreContainer.create Creating SolrCore 'collection1' using instanceDir: /Users/jenkins/jenkins-slave/workspace/Lucene-Solr-trunk-MacOSX/solr/build/solr-core/test/J0/./org.apache.solr.cloud.BasicDistributedZkTest-jetty4-1357115037597/collection1
[junit4:junit4]   2> 17856 T2248 oasc.ZkController.createCollectionZkNode Check for collection zkNode:collection1
[junit4:junit4]   2> 17858 T2248 oasc.ZkController.createCollectionZkNode Collection zkNode exists
[junit4:junit4]   2> 17859 T2248 oasc.ZkController.readConfigName Load collection config from:/collections/collection1
[junit4:junit4]   2> 17879 T2248 oasc.SolrResourceLoader.<init> new SolrResourceLoader for directory: '/Users/jenkins/jenkins-slave/workspace/Lucene-Solr-trunk-MacOSX/solr/build/solr-core/test/J0/./org.apache.solr.cloud.BasicDistributedZkTest-jetty4-1357115037597/collection1/'
[junit4:junit4]   2> 17879 T2248 oasc.SolrResourceLoader.replaceClassLoader Adding 'file:/Users/jenkins/jenkins-slave/workspace/Lucene-Solr-trunk-MacOSX/solr/build/solr-core/test/J0/org.apache.solr.cloud.BasicDistributedZkTest-jetty4-1357115037597/collection1/lib/classes/' to classloader
[junit4:junit4]   2> 17880 T2248 oasc.SolrResourceLoader.replaceClassLoader Adding 'file:/Users/jenkins/jenkins-slave/workspace/Lucene-Solr-trunk-MacOSX/solr/build/solr-core/test/J0/org.apache.solr.cloud.BasicDistributedZkTest-jetty4-1357115037597/collection1/lib/README' to classloader
[junit4:junit4]   2> 17959 T2248 oasc.SolrConfig.<init> Using Lucene MatchVersion: LUCENE_50
[junit4:junit4]   2> 18047 T2248 oasc.SolrConfig.<init> Loaded SolrConfig: solrconfig.xml
[junit4:junit4]   2> 18061 T2248 oass.IndexSchema.readSchema Reading Solr Schema
[junit4:junit4]   2> 18072 T2248 oass.IndexSchema.readSchema Schema name=test
[junit4:junit4]   2> 18941 T2248 oass.OpenExchangeRatesOrgProvider.init Initialized with rates=open-exchange-rates.json, refreshInterval=1440.
[junit4:junit4]   2> 18950 T2248 oass.IndexSchema.readSchema default search field in schema is text
[junit4:junit4]   2> 18954 T2248 oass.IndexSchema.readSchema unique key field: id
[junit4:junit4]   2> 18990 T2248 oass.FileExchangeRateProvider.reload Reloading exchange rates from file currency.xml
[junit4:junit4]   2> 18996 T2248 oass.FileExchangeRateProvider.reload Reloading exchange rates from file currency.xml
[junit4:junit4]   2> 19002 T2248 oass.OpenExchangeRatesOrgProvider.reload Reloading exchange rates from open-exchange-rates.json
[junit4:junit4]   2> 19004 T2248 oass.OpenExchangeRatesOrgProvider.reload Reloading exchange rates from open-exchange-rates.json
[junit4:junit4]   2> 19006 T2248 oasc.SolrCore.<init> [collection1] Opening new SolrCore at /Users/jenkins/jenkins-slave/workspace/Lucene-Solr-trunk-MacOSX/solr/build/solr-core/test/J0/./org.apache.solr.cloud.BasicDistributedZkTest-jetty4-1357115037597/collection1/, dataDir=./org.apache.solr.cloud.BasicDistributedZkTest-1357115020540/jetty4/
[junit4:junit4]   2> 19006 T2248 oasc.JmxMonitoredMap.<init> JMX monitoring is enabled. Adding Solr mbeans to JMX Server: com.sun.jmx.mbeanserver.JmxMBeanServer@26d68a6e
[junit4:junit4]   2> 19007 T2248 oasc.SolrCore.initDirectoryFactory solr.StandardDirectoryFactory
[junit4:junit4]   2> 19008 T2248 oasc.CachingDirectoryFactory.get return new directory for /Users/jenkins/jenkins-slave/workspace/Lucene-Solr-trunk-MacOSX/solr/build/solr-core/test/J0/./org.apache.solr.cloud.BasicDistributedZkTest-1357115020540/jetty4 forceNew:false
[junit4:junit4]   2> 19008 T2248 oasc.CachingDirectoryFactory.close Releasing directory:/Users/jenkins/jenkins-slave/workspace/Lucene-Solr-trunk-MacOSX/solr/build/solr-core/test/J0/./org.apache.solr.cloud.BasicDistributedZkTest-1357115020540/jetty4
[junit4:junit4]   2> 19008 T2248 oasc.SolrCore.getNewIndexDir New index directory detected: old=null new=./org.apache.solr.cloud.BasicDistributedZkTest-1357115020540/jetty4/index/
[junit4:junit4]   2> 19009 T2248 oasc.SolrCore.initIndex WARNING [collection1] Solr index directory './org.apache.solr.cloud.BasicDistributedZkTest-1357115020540/jetty4/index' doesn't exist. Creating new index...
[junit4:junit4]   2> 19011 T2248 oasc.CachingDirectoryFactory.get return new directory for /Users/jenkins/jenkins-slave/workspace/Lucene-Solr-trunk-MacOSX/solr/build/solr-core/test/J0/./org.apache.solr.cloud.BasicDistributedZkTest-1357115020540/jetty4/index forceNew:false
[junit4:junit4]   2> 19018 T2248 oasc.SolrDeletionPolicy.onCommit SolrDeletionPolicy.onCommit: commits:num=1
[junit4:junit4]   2> 		commit{dir=RateLimitedDirectoryWrapper(org.apache.lucene.store.NIOFSDirectory@/Users/jenkins/jenkins-slave/workspace/Lucene-Solr-trunk-MacOSX/solr/build/solr-core/test/J0/org.apache.solr.cloud.BasicDistributedZkTest-1357115020540/jetty4/index lockFactory=org.apache.lucene.store.NativeFSLockFactory@6bd1d900),segFN=segments_1,generation=1,filenames=[segments_1]
[junit4:junit4]   2> 19018 T2248 oasc.SolrDeletionPolicy.updateCommits newest commit = 1[segments_1]
[junit4:junit4]   2> 19019 T2248 oasc.CachingDirectoryFactory.close Releasing directory:/Users/jenkins/jenkins-slave/workspace/Lucene-Solr-trunk-MacOSX/solr/build/solr-core/test/J0/./org.apache.solr.cloud.BasicDistributedZkTest-1357115020540/jetty4/index
[junit4:junit4]   2> 19019 T2248 oasc.SolrCore.initWriters created xml: solr.XMLResponseWriter
[junit4:junit4]   2> 19022 T2248 oasup.UpdateRequestProcessorChain.init inserting DistributedUpdateProcessorFactory into updateRequestProcessorChain "dedupe"
[junit4:junit4]   2> 19022 T2248 oasup.UpdateRequestProcessorChain.init inserting DistributedUpdateProcessorFactory into updateRequestProcessorChain "dedupe-allfields"
[junit4:junit4]   2> 19023 T2248 oasup.UpdateRequestProcessorChain.init inserting DistributedUpdateProcessorFactory into updateRequestProcessorChain "stored_sig"
[junit4:junit4]   2> 19023 T2248 oasup.UpdateRequestProcessorChain.init inserting DistributedUpdateProcessorFactory into updateRequestProcessorChain "uniq-fields"
[junit4:junit4]   2> 19024 T2248 oasup.UpdateRequestProcessorChain.init inserting DistributedUpdateProcessorFactory into updateRequestProcessorChain "distrib-dup-test-chain-implicit"
[junit4:junit4]   2> 19026 T2248 oasc.RequestHandlers.initHandlersFromConfig adding lazy requestHandler: solr.ReplicationHandler
[junit4:junit4]   2> 19027 T2248 oasc.RequestHandlers.initHandlersFromConfig created /replication: solr.ReplicationHandler
[junit4:junit4]   2> 19034 T2248 oasc.RequestHandlers.initHandlersFromConfig created standard: solr.StandardRequestHandler
[junit4:junit4]   2> 19035 T2248 oasc.RequestHandlers.initHandlersFromConfig created /get: solr.RealTimeGetHandler
[junit4:junit4]   2> 19036 T2248 oasc.RequestHandlers.initHandlersFromConfig created dismax: solr.SearchHandler
[junit4:junit4]   2> 19038 T2248 oasc.RequestHandlers.initHandlersFromConfig created mock: org.apache.solr.core.MockQuerySenderListenerReqHandler
[junit4:junit4]   2> 19040 T2248 oasc.RequestHandlers.initHandlersFromConfig created /admin/: org.apache.solr.handler.admin.AdminHandlers
[junit4:junit4]   2> 19040 T2248 oasc.RequestHandlers.initHandlersFromConfig created defaults: solr.StandardRequestHandler
[junit4:junit4]   2> 19041 T2248 oasc.RequestHandlers.initHandlersFromConfig adding lazy requestHandler: solr.StandardRequestHandler
[junit4:junit4]   2> 19041 T2248 oasc.RequestHandlers.initHandlersFromConfig created lazy: solr.StandardRequestHandler
[junit4:junit4]   2> 19042 T2248 oasc.RequestHandlers.initHandlersFromConfig created /update: solr.UpdateRequestHandler
[junit4:junit4]   2> 19042 T2248 oasc.RequestHandlers.initHandlersFromConfig created /terms: org.apache.solr.handler.component.SearchHandler
[junit4:junit4]   2> 19043 T2248 oasc.RequestHandlers.initHandlersFromConfig created spellCheckCompRH: org.apache.solr.handler.component.SearchHandler
[junit4:junit4]   2> 19043 T2248 oasc.RequestHandlers.initHandlersFromConfig created spellCheckCompRH_Direct: org.apache.solr.handler.component.SearchHandler
[junit4:junit4]   2> 19044 T2248 oasc.RequestHandlers.initHandlersFromConfig created spellCheckWithWordbreak: org.apache.solr.handler.component.SearchHandler
[junit4:junit4]   2> 19045 T2248 oasc.RequestHandlers.initHandlersFromConfig created spellCheckWithWordbreak_Direct: org.apache.solr.handler.component.SearchHandler
[junit4:junit4]   2> 19046 T2248 oasc.RequestHandlers.initHandlersFromConfig created spellCheckCompRH1: org.apache.solr.handler.component.SearchHandler
[junit4:junit4]   2> 19047 T2248 oasc.RequestHandlers.initHandlersFromConfig created mltrh: org.apache.solr.handler.component.SearchHandler
[junit4:junit4]   2> 19047 T2248 oasc.RequestHandlers.initHandlersFromConfig created tvrh: org.apache.solr.handler.component.SearchHandler
[junit4:junit4]   2> 19050 T2248 oasc.RequestHandlers.initHandlersFromConfig created /mlt: solr.MoreLikeThisHandler
[junit4:junit4]   2> 19050 T2248 oasc.RequestHandlers.initHandlersFromConfig created /debug/dump: solr.DumpRequestHandler
[junit4:junit4]   2> 19058 T2248 oashl.XMLLoader.init xsltCacheLifetimeSeconds=60
[junit4:junit4]   2> 19063 T2248 oasc.SolrCore.initDeprecatedSupport WARNING solrconfig.xml uses deprecated <admin/gettableFiles>, Please update your config to use the ShowFileRequestHandler.
[junit4:junit4]   2> 19072 T2248 oasc.SolrCore.initDeprecatedSupport WARNING adding ShowFileRequestHandler with hidden files: [SCHEMA.XML, OLD_SYNONYMS.TXT, STOPWORDS.TXT, PROTWORDS.TXT, OPEN-EXCHANGE-RATES.JSON, SYNONYMS.TXT, CURRENCY.XML, MAPPING-ISOLATIN1ACCENT.TXT]
[junit4:junit4]   2> 19078 T2248 oasc.CachingDirectoryFactory.close Releasing directory:/Users/jenkins/jenkins-slave/workspace/Lucene-Solr-trunk-MacOSX/solr/build/solr-core/test/J0/./org.apache.solr.cloud.BasicDistributedZkTest-1357115020540/jetty4
[junit4:junit4]   2> 19079 T2248 oass.SolrIndexSearcher.<init> Opening Searcher@55f919a1 main
[junit4:junit4]   2> 19081 T2248 oasu.CommitTracker.<init> Hard AutoCommit: disabled
[junit4:junit4]   2> 19081 T2248 oasu.CommitTracker.<init> Soft AutoCommit: disabled
[junit4:junit4]   2> 19081 T2248 oashc.SpellCheckComponent.inform Initializing spell checkers
[junit4:junit4]   2> 19095 T2248 oass.DirectSolrSpellChecker.init init: {name=direct,classname=DirectSolrSpellChecker,field=lowerfilt,minQueryLength=3}
[junit4:junit4]   2> 19156 T2249 oasc.SolrCore.registerSearcher [collection1] Registered new searcher Searcher@55f919a1 main{StandardDirectoryReader(segments_1:1)}
[junit4:junit4]   2> 19166 T2248 oasc.ZkController.publish publishing core=collection1 state=down
[junit4:junit4]   2> 19167 T2248 oasc.ZkController.publish numShards not found on descriptor - reading it from system property
[junit4:junit4]   2>  C140_STATE=coll:collection1 core:collection1 props:{shard=shard1, roles=null, state=recovering, core=collection1, collection=collection1, node_name=127.0.0.1:49766_, base_url=http://127.0.0.1:49766}
[junit4:junit4]   2> 20085 T2234 C140 P49766 oasc.RecoveryStrategy.doRecovery Attempting to PeerSync from http://127.0.0.1:49760/collection1/ core=collection1 - recoveringAfterStartup=true
[junit4:junit4]   2> 20085 T2234 C140 P49766 oasu.PeerSync.sync PeerSync: core=collection1 url=http://127.0.0.1:49766 START replicas=[http://127.0.0.1:49760/collection1/] nUpdates=100
[junit4:junit4]   2> 20086 T2234 C140 P49766 oasu.PeerSync.sync WARNING no frame of reference to tell of we've missed updates
[junit4:junit4]   2> 20087 T2234 C140 P49766 oasc.RecoveryStrategy.doRecovery PeerSync Recovery was not successful - trying replication. core=collection1
[junit4:junit4]   2> 20087 T2234 C140 P49766 oasc.RecoveryStrategy.doRecovery Starting Replication Recovery. core=collection1
[junit4:junit4]   2> 20087 T2234 C140 P49766 oasc.RecoveryStrategy.doRecovery Begin buffering updates. core=collection1
[junit4:junit4]   2> 20088 T2234 C140 P49766 oasu.UpdateLog.bufferUpdates Starting to buffer updates. FSUpdateLog{state=ACTIVE, tlog=null}
[junit4:junit4]   2> 20089 T2234 C140 P49766 oasc.RecoveryStrategy.replicate Attempting to replicate from http://127.0.0.1:49760/collection1/. core=collection1
[junit4:junit4]   2> 20089 T2234 C140 P49766 oascsi.HttpClientUtil.createClient Creating new http client, config:maxConnections=128&maxConnectionsPerHost=32&followRedirects=false
[junit4:junit4]   2> ASYNC  NEW_CORE C141 name=collection1 org.apache.solr.core.SolrCore@463f116b url=http://127.0.0.1:49760/collection1 node=127.0.0.1:49760_ C141_STATE=coll:collection1 core:collection1 props:{shard=shard1, roles=null, state=active, core=collection1, collection=collection1, node_name=127.0.0.1:49760_, base_url=http://127.0.0.1:49760, leader=true}
[junit4:junit4]   2> 20108 T2195 C141 P49760 REQ /get {distrib=false&qt=/get&wt=javabin&version=2&getVersions=100} status=0 QTime=0 
[junit4:junit4]   2> 20110 T2192 C141 P49760 oasu.DirectUpdateHandler2.commit start commit{flags=0,_version_=0,optimize=false,openSearcher=false,waitSearcher=true,expungeDeletes=false,softCommit=false}
[junit4:junit4]   2> 20111 T2192 C141 P49760 oasc.CachingDirectoryFactory.close Releasing directory:/Users/jenkins/jenkins-slave/workspace/Lucene-Solr-trunk-MacOSX/solr/build/solr-core/test/J0/./org.apache.solr.cloud.BasicDistributedZkTest-1357115020540/jetty1
[junit4:junit4]   2> 20114 T2192 C141 P49760 oasc.SolrDeletionPolicy.onInit SolrDeletionPolicy.onInit: commits:num=1
[junit4:junit4]   2> 		commit{dir=RateLimitedDirectoryWrapper(org.apache.lucene.store.NIOFSDirectory@/Users/jenkins/jenkins-slave/workspace/Lucene-Solr-trunk-MacOSX/solr/build/solr-core/test/J0/org.apache.solr.cloud.BasicDistributedZkTest-1357115020540/jetty1/index lockFactory=org.apache.lucene.store.NativeFSLockFactory@2a08cf4e),segFN=segments_1,generation=1,filenames=[segments_1]
[junit4:junit4]   2> 20115 T2192 C141 P49760 oasc.SolrDeletionPolicy.updateCommits newest commit = 1[segments_1]
[junit4:junit4]   2> 20117 T2192 C141 P49760 oasc.SolrDeletionPolicy.onCommit SolrDeletionPolicy.onCommit: commits:num=2
[junit4:junit4]   2> 		commit{dir=RateLimitedDirectoryWrapper(org.apache.lucene.store.NIOFSDirectory@/Users/jenkins/jenkins-slave/workspace/Lucene-Solr-trunk-MacOSX/solr/build/solr-core/test/J0/org.apache.solr.cloud.BasicDistributedZkTest-1357115020540/jetty1/index lockFactory=org.apache.lucene.store.NativeFSLockFactory@2a08cf4e),segFN=segments_1,generation=1,filenames=[segments_1]
[junit4:junit4]   2> 		commit{dir=RateLimitedDirectoryWrapper(org.apache.lucene.store.NIOFSDirectory@/Users/jenkins/jenkins-slave/workspace/Lucene-Solr-trunk-MacOSX/solr/build/solr-core/test/J0/org.apache.solr.cloud.BasicDistributedZkTest-1357115020540/jetty1/index lockFactory=org.apache.lucene.store.NativeFSLockFactory@2a08cf4e),segFN=segments_2,generation=2,filenames=[segments_2]
[junit4:junit4]   2> 20117 T2192 C141 P49760 oasc.SolrDeletionPolicy.updateCommits newest commit = 2[segments_2]
[junit4:junit4]   2> 20119 T2192 C141 P49760 oasc.CachingDirectoryFactory.close Releasing directory:/Users/jenkins/jenkins-slave/workspace/Lucene-Solr-trunk-MacOSX/solr/build/solr-core/test/J0/./org.apache.solr.cloud.BasicDistributedZkTest-1357115020540/jetty1
[junit4:junit4]   2> 20119 T2192 C141 P49760 oass.SolrIndexSearcher.<init> Opening Searcher@72f6df55 realtime
[junit4:junit4]   2> 20120 T2192 C141 P49760 oasu.DirectUpdateHandler2.commit end_commit_flush
[junit4:junit4]   2> 20120 T2192 C141 P49760 /update {waitSearcher=true&openSearcher=false&commit=true&commit_end_point=true&wt=javabin&softCommit=false&version=2} {commit=} 0 10
[junit4:junit4]   2> 20121 T2234 C140 P49766 oash.ReplicationHandler.inform Commits will be reserved for  10000
[junit4:junit4]   2> 20121 T2234 C140 P49766 oash.SnapPuller.<init>  No value set for 'pollInterval'. Timer Task not started.
[junit4:junit4]   2> 20125 T2194 C141 P49760 oash.ReplicationHandler.inform Commits will be reserved for  10000
[junit4:junit4]   2> 20125 T2194 C141 P49760 REQ /replication {command=indexversion&wt=javabin&qt=/replication&version=2} status=0 QTime=2 
[junit4:junit4]   2> 20126 T2234 C140 P49766 oash.SnapPuller.fetchLatestIndex Master's generation: 2
[junit4:junit4]   2> 20126 T2234 C140 P49766 oash.SnapPuller.fetchLatestIndex Slave's generation: 1
[junit4:junit4]   2> 20127 T2234 C140 P49766 oash.SnapPuller.fetchLatestIndex Starting replication process
[junit4:junit4]   2> 20129 T2196 C141 P49760 oasc.CachingDirectoryFactory.close Releasing directory:/Users/jenkins/jenkins-slave/workspace/Lucene-Solr-trunk-MacOSX/solr/build/solr-core/test/J0/./org.apache.solr.cloud.BasicDistributedZkTest-1357115020540/jetty1
[junit4:junit4]   2> 20130 T2196 C141 P49760 oasc.CachingDirectoryFactory.close Releasing directory:/Users/jenkins/jenkins-slave/workspace/Lucene-Solr-trunk-MacOSX/solr/build/solr-core/test/J0/./org.apache.solr.cloud.BasicDistributedZkTest-1357115020540/jetty1/index
[junit4:junit4]   2> 20130 T2196 C141 P49760 REQ /replication {command=filelist&generation=2&wt=javabin&qt=/replication&version=2} status=0 QTime=1 
[junit4:junit4]   2> 20131 T2234 C140 P49766 oash.SnapPuller.fetchLatestIndex Number of files in latest index in master: 1
[junit4:junit4]   2> 20132 T2234 C140 P49766 oasc.CachingDirectoryFactory.get return new directory for /Users/jenkins/jenkins-slave/workspace/Lucene-Solr-trunk-MacOSX/solr/build/solr-core/test/J0/./org.apache.solr.cloud.BasicDistributedZkTest-1357115020540/jetty3/index.20130102012400659 forceNew:false
[junit4:junit4]   2> 20135 T2234 C140 P49766 oasc.CachingDirectoryFactory.close Releasing directory:/Users/jenkins/jenkins-slave/workspace/Lucene-Solr-trunk-MacOSX/solr/build/solr-core/test/J0/./org.apache.solr.cloud.BasicDistributedZkTest-1357115020540/jetty3
[junit4:junit4]   2> 20138 T2234 C140 P49766 oash.SnapPuller.fetchLatestIndex Starting download to RateLimitedDirectoryWrapper(org.apache.lucene.store.NIOFSDirectory@/Users/jenkins/jenkins-slave/workspace/Lucene-Solr-trunk-MacOSX/solr/build/solr-core/test/J0/org.apache.solr.cloud.BasicDistributedZkTest-1357115020540/jetty3/index.20130102012400659 lockFactory=org.apache.lucene.store.NativeFSLockFactory@7993df72) fullCopy=true
[junit4:junit4]   2> 20142 T2197 C141 P49760 REQ /replication {file=segments_2&command=filecontent&checksum=true&generation=2&qt=/replication&wt=filestream} status=0 QTime=1 
[junit4:junit4]   2> 20144 T2234 C140 P49766 oasc.CachingDirectoryFactory.close Releasing directory:/Users/jenkins/jenkins-slave/workspace/Lucene-Solr-trunk-MacOSX/solr/build/solr-core/test/J0/./org.apache.solr.cloud.BasicDistributedZkTest-1357115020540/jetty3/index
[junit4:junit4]   2> 20144 T2234 C140 P49766 oash.SnapPuller.fetchLatestIndex Total time taken for download : 0 secs
[junit4:junit4]   2> 20144 T2234 C140 P49766 oash.SnapPuller.modifyIndexProps New index installed. Updating index properties... index=index.20130102012400659
[junit4:junit4]   2> 20146 T2234 C140 P49766 oasc.CachingDirectoryFactory.close Releasing directory:/Users/jenkins/jenkins-slave/workspace/Lucene-Solr-trunk-MacOSX/solr/build/solr-core/test/J0/./org.apache.solr.cloud.BasicDistributedZkTest-1357115020540/jetty3
[junit4:junit4]   2> 20146 T2234 C140 P49766 oasc.CachingDirectoryFactory.close Releasing directory:/Users/jenkins/jenkins-slave/workspace/Lucene-Solr-trunk-MacOSX/solr/build/solr-core/test/J0/./org.apache.solr.cloud.BasicDistributedZkTest-1357115020540/jetty3
[junit4:junit4]   2> 20146 T2234 C140 P49766 oasc.SolrCore.getNewIndexDir New index directory detected: old=./org.apache.solr.cloud.BasicDistributedZkTest-1357115020540/jetty3/index/ new=./org.apache.solr.cloud.BasicDistributedZkTest-1357115020540/jetty3/index.20130102012400659
[junit4:junit4]   2> 20152 T2234 C140 P49766 oasc.SolrDeletionPolicy.onInit SolrDeletionPolicy.onInit: commits:num=1
[junit4:junit4]   2> 		commit{dir=RateLimitedDirectoryWrapper(org.apache.lucene.store.NIOFSDirectory@/Users/jenkins/jenkins-slave/workspace/Lucene-Solr-trunk-MacOSX/solr/build/solr-core/test/J0/org.apache.solr.cloud.BasicDistributedZkTest-1357115020540/jetty3/index.20130102012400659 lockFactory=org.apache.lucene.store.NativeFSLockFactory@7993df72),segFN=segments_2,generation=2,filenames=[segments_2]
[junit4:junit4]   2> 20152 T2234 C140 P49766 oasc.SolrDeletionPolicy.updateCommits newest commit = 2[segments_2]
[junit4:junit4]   2> 20154 T2234 C140 P49766 oasc.CachingDirectoryFactory.close Releasing directory:/Users/jenkins/jenkins-slave/workspace/Lucene-Solr-trunk-MacOSX/solr/build/solr-core/test/J0/./org.apache.solr.cloud.BasicDistributedZkTest-1357115020540/jetty3
[junit4:junit4]   2> 20154 T2234 C140 P49766 oasu.DefaultSolrCoreState.newIndexWriter Creating new IndexWriter...
[junit4:junit4]   2> 20154 T2234 C140 P49766 oasu.DefaultSolrCoreState.newIndexWriter Waiting until IndexWriter is unused... core=collection1
[junit4:junit4]   2> 20154 T2234 C140 P49766 oasu.DefaultSolrCoreState.newIndexWriter Rollback old IndexWriter... core=collection1
[junit4:junit4]   2> 20155 T2234 C140 P49766 oasc.CachingDirectoryFactory.close Releasing directory:/Users/jenkins/jenkins-slave/workspace/Lucene-Solr-trunk-MacOSX/solr/build/solr-core/test/J0/./org.apache.solr.cloud.BasicDistributedZkTest-1357115020540/jetty3/index.20130102012400659
[junit4:junit4]   2> 20156 T2234 C140 P49766 oasc.CachingDirectoryFactory.close Releasing directory:/Users/jenkins/jenkins-slave/workspace/Lucene-Solr-trunk-MacOSX/solr/build/solr-core/test/J0/./org.apache.solr.cloud.BasicDistributedZkTest-1357115020540/jetty3
[junit4:junit4]   2> 20159 T2234 C140 P49766 oasc.SolrDeletionPolicy.onInit SolrDeletionPolicy.onInit: commits:num=1
[junit4:junit4]   2> 		commit{dir=RateLimitedDirectoryWrapper(org.apache.lucene.store.NIOFSDirectory@/Users/jenkins/jenkins-slave/workspace/Lucene-Solr-trunk-MacOSX/solr/build/solr-core/test/J0/org.apache.solr.cloud.BasicDistributedZkTest-1357115020540/jetty3/index.20130102012400659 lockFactory=org.apache.lucene.store.NativeFSLockFactory@7993df72),segFN=segments_2,generation=2,filenames=[segments_2]
[junit4:junit4]   2> 20159 T2234 C140 P49766 oasc.SolrDeletionPolicy.updateCommits newest commit = 2[segments_2]
[junit4:junit4]   2> 20159 T2234 C140 P49766 oasu.DefaultSolrCoreState.newIndexWriter New IndexWriter is ready to be used.
[junit4:junit4]   2> 20160 T2234 C140 P49766 oasc.CachingDirectoryFactory.close Releasing directory:/Users/jenkins/jenkins-slave/workspace/Lucene-Solr-trunk-MacOSX/solr/build/solr-core/test/J0/./org.apache.solr.cloud.BasicDistributedZkTest-1357115020540/jetty3
[junit4:junit4]   2> 20160 T2234 C140 P49766 oass.SolrIndexSearcher.<init> Opening Searcher@3f69bd81 main
[junit4:junit4]   2> 20162 T2233 oasc.SolrCore.registerSearcher [collection1] Registered new searcher Searcher@3f69bd81 main{StandardDirectoryReader(segments_2:1:nrt)}
[junit4:junit4]   2> 20163 T2233 oasc.CachingDirectoryFactory.close Releasing directory:/Users/jenkins/jenkins-slave/workspace/Lucene-Solr-trunk-MacOSX/solr/build/solr-core/test/J0/./org.apache.solr.cloud.BasicDistributedZkTest-1357115020540/jetty3/index
[junit4:junit4]   2> 20163 T2234 C140 P49766 oasu.DirectUpdateHandler2.commit start commit{flags=0,_version_=0,optimize=false,openSearcher=false,waitSearcher=false,expungeDeletes=false,softCommit=false}
[junit4:junit4]   2> 20165 T2234 C140 P49766 oasc.SolrDeletionPolicy.onCommit SolrDeletionPolicy.onCommit: commits:num=2
[junit4:junit4]   2> 		commit{dir=RateLimitedDirectoryWrapper(org.apache.lucene.store.NIOFSDirectory@/Users/jenkins/jenkins-slave/workspace/Lucene-Solr-trunk-MacOSX/solr/build/solr-core/test/J0/org.apache.solr.cloud.BasicDistributedZkTest-1357115020540/jetty3/index.20130102012400659 lockFactory=org.apache.lucene.store.NativeFSLockFactory@7993df72),segFN=segments_2,generation=2,filenames=[segments_2]
[junit4:junit4]   2> 		commit{dir=RateLimitedDirectoryWrapper(org.apache.lucene.store.NIOFSDirectory@/Users/jenkins/jenkins-slave/workspace/Lucene-Solr-trunk-MacOSX/solr/build/solr-core/test/J0/org.apache.solr.cloud.BasicDistributedZkTest-1357115020540/jetty3/index.20130102012400659 lockFactory=org.apache.lucene.store.NativeFSLockFactory@7993df72),segFN=segments_3,generation=3,filenames=[segments_3]
[junit4:junit4]   2> 20166 T2234 C140 P49766 oasc.SolrDeletionPolicy.updateCommits newest commit = 3[segments_3]
[junit4:junit4]   2> 20166 T2234 C140 P49766 oasc.CachingDirectoryFactory.close Releasing directory:/Users/jenkins/jenkins-slave/workspace/Lucene-Solr-trunk-MacOSX/solr/build/solr-core/test/J0/./org.apache.solr.cloud.BasicDistributedZkTest-1357115020540/jetty3
[junit4:junit4]   2> 20167 T2234 C140 P49766 oasu.DirectUpdateHandler2.commit end_commit_flush
[junit4:junit4]   2> 20167 T2234 C140 P49766 oasc.CachingDirectoryFactory.close Releasing directory:/Users/jenkins/jenkins-slave/workspace/Lucene-Solr-trunk-MacOSX/solr/build/solr-core/test/J0/./org.apache.solr.cloud.BasicDistributedZkTest-1357115020540/jetty3/index.20130102012400659
[junit4:junit4]   2> 20167 T2234 C140 P49766 oasc.CachingDirectoryFactory.close Releasing directory:/Users/jenkins/jenkins-slave/workspace/Lucene-Solr-trunk-MacOSX/solr/build/solr-core/test/J0/./org.apache.solr.cloud.BasicDistributedZkTest-1357115020540/jetty3/index
[junit4:junit4]   2> 20168 T2234 C140 P49766 oasc.RecoveryStrategy.replay No replay needed. core=collection1
[junit4:junit4]   2> 20168 T2234 C140 P49766 oasc.RecoveryStrategy.doRecovery Replication Recovery was successful - registering as Active. core=collection1
[junit4:junit4]   2> 20168 T2234 C140 P49766 oasc.ZkController.publish publishing core=collection1 state=active
[junit4:junit4]   2> 20169 T2234 C140 P49766 oasc.ZkController.publish numShards not found on descriptor - reading it from system property
[junit4:junit4]   2> 20170 T2234 C140 P49766 oasc.RecoveryStrategy.doRecovery Finished recovery process. core=collection1
[junit4:junit4]   2> 20626 T2183 oascc.ZkStateReader.updateClusterState Updating cloud state from ZooKeeper... 
[junit4:junit4]   2> 20628 T2183 oasc.Overseer$ClusterStateUpdater.updateState Update state numShards=2 message={
[junit4:junit4]   2> 	  "operation":"state",
[junit4:junit4]   2> 	  "numShards":"2",
[junit4:junit4]   2> 	  "shard":null,
[junit4:junit4]   2> 	  "roles":null,
[junit4:junit4]   2> 	  "state":"down",
[junit4:junit4]   2> 	  "core":"collection1",
[junit4:junit4]   2> 	  "collection":"collection1",
[junit4:junit4]   2> 	  "node_name":"127.0.0.1:49770_",
[junit4:junit4]   2> 	  "base_url":"http://127.0.0.1:49770"}
[junit4:junit4]   2> 20628 T2183 oasc.Overseer$ClusterStateUpdater.updateState Collection already exists with numShards=2
[junit4:junit4]   2> 20630 T2183 oasc.Overseer$ClusterStateUpdater.updateState Assigning new node to shard shard=shard2
[junit4:junit4]   2> 20643 T2183 oasc.Overseer$ClusterStateUpdater.updateState Update state numShards=2 message={
[junit4:junit4]   2> 	  "operation":"state",
[junit4:junit4]   2> 	  "numShards":"2",
[junit4:junit4]   2> 	  "shard":"shard1",
[junit4:junit4]   2> 	  "roles":null,
[junit4:junit4]   2> 	  "state":"active",
[junit4:junit4]   2> 	  "core":"collection1",
[junit4:junit4]   2> 	  "collection":"collection1",
[junit4:junit4]   2> 	  "node_name":"127.0.0.1:49766_",
[junit4:junit4]   2> 	  "base_url":"http://127.0.0.1:49766"}
[junit4:junit4]   2> 20651 T2188 oascc.ZkStateReader$2.process A cluster state change: WatchedEvent state:SyncConnected type:NodeDataChanged path:/clusterstate.json, has occurred - updating... (live nodes size: 5)
[junit4:junit4]   2> 20651 T2247 oascc.ZkStateReader$2.process A cluster state change: WatchedEvent state:SyncConnected type:NodeDataChanged path:/clusterstate.json, has occurred - updating... (live nodes size: 5)
[junit4:junit4]   2> 20651 T2182 oascc.ZkStateReader$2.process A cluster state change: WatchedEvent state:SyncConnected type:NodeDataChanged path:/clusterstate.json, has occurred - updating... (live nodes size: 5)
[junit4:junit4]   2> 20652 T2201 oascc.ZkStateReader$2.process A cluster state change: WatchedEvent state:SyncConnected type:NodeDataChanged path:/clusterstate.json, has occurred - updating... (live nodes size: 5)
[junit4:junit4]   2> 20651 T2216 oascc.ZkStateReader$2.process A cluster state change: WatchedEvent state:SyncConnected type:NodeDataChanged path:/clusterstate.json, has occurred - updating... (live nodes size: 5)
[junit4:junit4]   2> 20651 T2231 oascc.ZkStateReader$2.process A cluster state change: WatchedEvent state:SyncConnected type:NodeDataChanged path:/clusterstate.json, has occurred - updating... (live nodes size: 5)
[junit4:junit4]   2> 21171 T2248 oasc.CoreContainer.registerCore registering core: collection1
[junit4:junit4]   2> 21171 T2248 oasc.ZkController.register Register replica - core:collection1 address:http://127.0.0.1:49770 collection:collection1 shard:shard2
[junit4:junit4]   2> 21180 T2248 oasc.ZkController.register We are http://127.0.0.1:49770/collection1/ and leader is http://127.0.0.1:49763/collection1/
[junit4:junit4]   2> 21180 T2248 oasc.ZkController.register No LogReplay needed for core=collection1 baseURL=http://127.0.0.1:49770
[junit4:junit4]   2> 21180 T2248 oasc.ZkController.checkRecovery Core needs to recover:collection1
[junit4:junit4]   2> 21181 T2248 oasu.DefaultSolrCoreState.doRecovery Running recovery - first canceling any ongoing recovery
[junit4:junit4]   2> ASYNC  NEW_CORE C142 name=collection1 org.apache.solr.core.SolrCore@2f7879ed url=http://127.0.0.1:49770/collection1 node=127.0.0.1:49770_ C142_STATE=coll:collection1 core:collection1 props:{shard=null, roles=null, state=down, core=collection1, collection=collection1, node_name=127.0.0.1:49770_, base_url=http://127.0.0.1:49770}
[junit4:junit4]   2> 21181 T2252 C142 P49770 oasc.RecoveryStrategy.run Starting recovery process.  core=collection1 recoveringAfterStartup=true
[junit4:junit4]   2> 21183 T2252 C142 P49770 oasc.RecoveryStrategy.doRecovery ###### startupVersions=[]
[junit4:junit4]   2> 21183 T2252 C142 P49770 oasc.ZkController.publish publishing core=collection1 state=recovering
[junit4:junit4]   2> 21183 T2252 C142 P49770 oasc.ZkController.publish numShards not found on descriptor - reading it from system property
[junit4:junit4]   2> 21184 T2248 oascc.ZkStateReader.updateClusterState Updating cloud state from ZooKeeper... 
[junit4:junit4]   2> 21187 T2252 C142 P49770 oascsi.HttpClientUtil.createClient Creating new http client, config:maxConnections=128&maxConnectionsPerHost=32&followRedirects=false
[junit4:junit4]   2> 21195 T2160 oass.SolrDispatchFilter.init user.dir=/Users/jenkins/jenkins-slave/workspace/Lucene-Solr-trunk-MacOSX/solr/build/solr-core/test/J0
[junit4:junit4]   2> 21196 T2160 oass.SolrDispatchFilter.init SolrDispatchFilter.init() done
[junit4:junit4]   2> 21197 T2160 oascsi.HttpClientUtil.createClient Creating new http client, config:maxConnections=128&maxConnectionsPerHost=32&followRedirects=false
[junit4:junit4]   2> 21211 T2160 oascc.ZkStateReader.updateClusterState Updating cloud state from ZooKeeper... 
[junit4:junit4]   2> 21214 T2160 oasc.AbstractDistribZkTestBase.waitForRecoveriesToFinish Wait for recoveries to finish - collection: collection1 failOnTimeout:true timeout (sec):230
[junit4:junit4]   2> 21215 T2160 oascc.ZkStateReader.updateClusterState Updating cloud state from ZooKeeper... 
[junit4:junit4]   2> 22171 T2183 oascc.ZkStateReader.updateClusterState Updating cloud state from ZooKeeper... 
[junit4:junit4]   2> 22172 T2183 oasc.Overseer$ClusterStateUpdater.updateState Update state numShards=2 message={
[junit4:junit4]   2> 	  "operation":"state",
[junit4:junit4]   2> 	  "numShards":"2",
[junit4:junit4]   2> 	  "shard":"shard2",
[junit4:junit4]   2> 	  "roles":null,
[junit4:junit4]   2> 	  "state":"recovering",
[junit4:junit4]   2> 	  "core":"collection1",
[junit4:junit4]   2> 	  "collection":"collection1",
[junit4:junit4]   2> 	  "node_name":"127.0.0.1:49770_",
[junit4:junit4]   2> 	  "base_url":"http://127.0.0.1:49770"}
[junit4:junit4]   2> 22180 T2247 oascc.ZkStateReader$2.process A cluster state change: WatchedEvent state:SyncConnected type:NodeDataChanged path:/clusterstate.json, has occurred - updating... (live nodes size: 5)
[junit4:junit4]   2> 22180 T2201 oascc.ZkStateReader$2.process A cluster state change: WatchedEvent state:SyncConnected type:NodeDataChanged path:/clusterstate.json, has occurred - updating... (live nodes size: 5)
[junit4:junit4]   2> 22183 T2188 oascc.ZkStateReader$2.process A cluster state change: WatchedEvent state:SyncConnected type:NodeDataChanged path:/clusterstate.json, has occurred - updating... (live nodes size: 5)
[junit4:junit4]   2> 22186 T2216 oascc.ZkStateReader$2.process A cluster state change: WatchedEvent state:SyncConnected type:NodeDataChanged path:/clusterstate.json, has occurred - updating... (live nodes size: 5)
[junit4:junit4]   2> 22186 T2182 oascc.ZkStateReader$2.process A cluster state change: WatchedEvent state:SyncConnected type:NodeDataChanged path:/clusterstate.json, has occurred - updating... (live nodes size: 5)
[junit4:junit4]   2> 22186 T2231 oascc.ZkStateReader$2.process A cluster state change: WatchedEvent state:SyncConnected type:NodeDataChanged path:/clusterstate.json, has occurred - updating... (live nodes size: 5)
[junit4:junit4]   2> 22219 T2160 oascc.ZkStateReader.updateClusterState Updating cloud state from ZooKeeper... 
[junit4:junit4]   2> 23222 T2160 oascc.ZkStateReader.updateClusterState Updating cloud state from ZooKeeper... 
[junit4:junit4]   2>  C142_STATE=coll:collection1 core:collection1 props:{shard=shard2, roles=null, state=recovering, core=collection1, collection=collection1, node_name=127.0.0.1:49770_, base_url=http://127.0.0.1:49770}
[junit4:junit4]   2> 24211 T2252 C142 P49770 oasc.RecoveryStrategy.doRecovery Attempting to PeerSync from http://127.0.0.1:49763/collection1/ core=collection1 - recoveringAfterStartup=true
[junit4:junit4]   2> 24212 T2252 C142 P49770 oasu.PeerSync.sync PeerSync: core=collection1 url=http://127.0.0.1:49770 START replicas=[http://127.0.0.1:49763/collection1/] nUpdates=100
[junit4:junit4]   2> 24213 T2252 C142 P49770 oasu.PeerSync.sync WARNING no frame of reference to tell of we've missed updates
[junit4:junit4]   2> 24213 T2252 C142 P49770 oasc.RecoveryStrategy.doRecovery PeerSync Recovery was not successful - trying replication. core=collection1
[junit4:junit4]   2> 24214 T2252 C142 P49770 oasc.RecoveryStrategy.doRecovery Starting Replication Recovery. core=collection1
[junit4:junit4]   2> 24214 T2252 C142 P49770 oasc.RecoveryStrategy.doRecovery Begin buffering updates. core=collection1
[junit4:junit4]   2> 24214 T2252 C142 P49770 oasu.UpdateLog.bufferUpdates Starting to buffer updates. FSUpdateLog{state=ACTIVE, tlog=null}
[junit4:junit4]   2> 24214 T2252 C142 P49770 oasc.RecoveryStrategy.replicate Attempting to replicate from http://127.0.0.1:49763/collection1/. core=collection1
[junit4:junit4]   2> 24215 T2252 C142 P49770 oascsi.HttpClientUtil.createClient Creating new http client, config:maxConnections=128&maxConnectionsPerHost=32&followRedirects=false
[junit4:junit4]   2> ASYNC  NEW_CORE C143 name=collection1 org.apache.solr.core.SolrCore@5081996d url=http://127.0.0.1:49763/collection1 node=127.0.0.1:49763_ C143_STATE=coll:collection1 core:collection1 props:{shard=shard2, roles=null, state=active, core=collection1, collection=collection1, node_name=127.0.0.1:49763_, base_url=http://127.0.0.1:49763, leader=true}
[junit4:junit4]   2> 24228 T2209 C143 P49763 oasu.DirectUpdateHandler2.commit start commit{flags=0,_version_=0,optimize=false,openSearcher=false,waitSearcher=true,expungeDeletes=false,softCommit=false}
[junit4:junit4]   2> 24230 T2209 C143 P49763 oasc.CachingDirectoryFactory.close Releasing directory:/Users/jenkins/jenkins-slave/workspace/Lucene-Solr-trunk-MacOSX/solr/build/solr-core/test/J0/./org.apache.solr.cloud.BasicDistributedZkTest-1357115020540/jetty2
[junit4:junit4]   2> 24233 T2209 C143 P49763 oasc.SolrDeletionPolicy.onInit SolrDeletionPolicy.onInit: commits:num=1
[junit4:junit4]   2> 		commit{dir=RateLimitedDirectoryWrapper(org.apache.lucene.store.NIOFSDirectory@/Users/jenkins/jenkins-slave/workspace/Lucene-Solr-trunk-MacOSX/solr/build/solr-core/test/J0/org.apache.solr.cloud.BasicDistributedZkTest-1357115020540/jetty2/index lockFactory=org.apache.lucene.store.NativeFSLockFactory@1971e051),segFN=segments_1,generation=1,filenames=[segments_1]
[junit4:junit4]   2> 24235 T2209 C143 P49763 oasc.SolrDeletionPolicy.updateCommits newest commit = 1[segments_1]
[junit4:junit4]   2> 24237 T2209 C143 P49763 oasc.SolrDeletionPolicy.onCommit SolrDeletionPolicy.onCommit: commits:num=2
[junit4:junit4]   2> 		commit{dir=RateLimitedDirectoryWrapper(org.apache.lucene.store.NIOFSDirectory@/Users/jenkins/jenkins-slave/workspace/Lucene-Solr-trunk-MacOSX/solr/build/solr-core/test/J0/org.apache.solr.cloud.BasicDistributedZkTest-1357115020540/jetty2/index lockFactory=org.apache.lucene.store.NativeFSLockFactory@1971e051),segFN=segments_1,generation=1,filenames=[segments_1]
[junit4:junit4]   2> 		commit{dir=RateLimitedDirectoryWrapper(org.apache.lucene.store.NIOFSDirectory@/Users/jenkins/jenkins-slave/workspace/Lucene-Solr-trunk-MacOSX/solr/build/solr-core/test/J0/org.apache.solr.cloud.BasicDistributedZkTest-1357115020540/jetty2/index lockFactory=org.apache.lucene.store.NativeFSLockFactory@1971e051),segFN=segments_2,generation=2,filenames=[segments_2]
[junit4:junit4]   2> 24238 T2209 C143 P49763 oasc.SolrDeletionPolicy.updateCommits newest commit = 2[segments_2]
[junit4:junit4]   2> 24238 T2210 C143 P49763 REQ /get {distrib=false&qt=/get&wt=javabin&version=2&getVersions=100} status=0 QTime=0 
[junit4:junit4]   2> 24239 T2209 C143 P49763 oasc.CachingDirectoryFactory.close Releasing directory:/Users/jenkins/jenkins-slave/workspace/Lucene-Solr-trunk-MacOSX/solr/build/solr-core/test/J0/./org.apache.solr.cloud.BasicDistributedZkTest-1357115020540/jetty2
[junit4:junit4]   2> 24239 T2209 C143 P49763 oass.SolrIndexSearcher.<init> Opening Searcher@3b533db2 realtime
[junit4:junit4]   2> 24240 T2209 C143 P49763 oasu.DirectUpdateHandler2.commit end_commit_flush
[junit4:junit4]   2> 24240 T2160 oascc.ZkStateReader.updateClusterState Updating cloud state from ZooKeeper... 
[junit4:junit4]   2> 24240 T2209 C143 P49763 /update {waitSearcher=true&openSearcher=false&commit=true&commit_end_point=true&wt=javabin&softCommit=false&version=2} {commit=} 0 12
[junit4:junit4]   2> 24250 T2252 C142 P49770 oash.ReplicationHandler.inform Commits will be reserved for  10000
[junit4:junit4]   2> 24250 T2252 C142 P49770 oash.SnapPuller.<init>  No value set for 'pollInterval'. Timer Task not started.
[junit4:junit4]   2> 24253 T2211 C143 P49763 oash.ReplicationHandler.inform Commits will be reserved for  10000
[junit4:junit4]   2> 24254 T2211 C143 P49763 REQ /replication {command=indexversion&wt=javabin&qt=/replication&version=2} status=0 QTime=1 
[junit4:junit4]   2> 24254 T2252 C142 P49770 oash.SnapPuller.fetchLatestIndex Master's generation: 2
[junit4:junit4]   2> 24255 T2252 C142 P49770 oash.SnapPuller.fetchLatestIndex Slave's generation: 1
[junit4:junit4]   2> 24255 T2252 C142 P49770 oash.SnapPuller.fetchLatestIndex Starting replication process
[junit4:junit4]   2> 24258 T2207 C143 P49763 oasc.CachingDirectoryFactory.close Releasing directory:/Users/jenkins/jenkins-slave/workspace/Lucene-Solr-trunk-MacOSX/solr/build/solr-core/test/J0/./org.apache.solr.cloud.BasicDistributedZkTest-1357115020540/jetty2
[junit4:junit4]   2> 24258 T2207 C143 P49763 oasc.CachingDirectoryFactory.close Releasing directory:/Users/jenkins/jenkins-slave/workspace/Lucene-Solr-trunk-MacOSX/solr/build/solr-core/test/J0/./org.apache.solr.cloud.BasicDistributedZkTest-1357115020540/jetty2/index
[junit4:junit4]   2> 24259 T2207 C143 P49763 REQ /replication {command=filelist&generation=2&wt=javabin&qt=/replication&version=2} status=0 QTime=2 
[junit4:junit4]   2> 24260 T2252 C142 P49770 oash.SnapPuller.fetchLatestIndex Number of files in latest index in master: 1
[junit4:junit4]   2> 24261 T2252 C142 P49770 oasc.CachingDirectoryFactory.get return new directory for /Users/jenkins/jenkins-slave/workspace/Lucene-Solr-trunk-MacOSX/solr/build/solr-core/test/J0/./org.apache.solr.cloud.BasicDistributedZkTest-1357115020540/jetty4/index.20130102012404788 forceNew:false
[junit4:junit4]   2> 24261 T2252 C142 P49770 oasc.CachingDirectoryFactory.close Releasing directory:/Users/jenkins/jenkins-slave/workspace/Lucene-Solr-trunk-MacOSX/solr/build/solr-core/test/J0/./org.apache.solr.cloud.BasicDistributedZkTest-1357115020540/jetty4
[junit4:junit4]   2> 24262 T2252 C142 P49770 oash.SnapPuller.fetchLatestIndex Starting download to RateLimitedDirectoryWrapper(org.apache.lucene.store.NIOFSDirectory@/Users/jenkins/jenkins-slave/workspace/Lucene-Solr-trunk-MacOSX/solr/build/solr-core/test/J0/org.apache.solr.cloud.BasicDistributedZkTest-1357115020540/jetty4/index.20130102012404788 lockFactory=org.apache.lucene.store.NativeFSLockFactory@6e428d9d) fullCopy=true
[junit4:junit4]   2> 24266 T2208 C143 P49763 REQ /replication {file=segments_2&command=filecontent&checksum=true&generation=2&qt=/replication&wt=filestream} status=0 QTime=0 
[junit4:junit4]   2> 24269 T2252 C142 P49770 oasc.CachingDirectoryFactory.close Releasing directory:/Users/jenkins/jenkins-slave/workspace/Lucene-Solr-trunk-MacOSX/solr/build/solr-core/test/J0/./org.apache.solr.cloud.BasicDistributedZkTest-1357115020540/jetty4/index
[junit4:junit4]   2> 24269 T2252 C142 P49770 oash.SnapPuller.fetchLatestIndex Total time taken for download : 0 secs
[junit4:junit4]   2> 24269 T2252 C142 P49770 oash.SnapPuller.modifyIndexProps New index installed. Updating index properties... index=index.20130102012404788
[junit4:junit4]   2> 24271 T2252 C142 P49770 oasc.CachingDirectoryFactory.close Releasing directory:/Users/jenkins/jenkins-slave/workspace/Lucene-Solr-trunk-MacOSX/solr/build/solr-core/test/J0/./org.apache.solr.cloud.BasicDistributedZkTest-1357115020540/jetty4
[junit4:junit4]   2> 24271 T2252 C142 P49770 oasc.CachingDirectoryFactory.close Releasing directory:/Users/jenkins/jenkins-slave/workspace/Lucene-Solr-trunk-MacOSX/solr/build/solr-core/test/J0/./org.apache.solr.cloud.BasicDistributedZkTest-1357115020540/jetty4
[junit4:junit4]   2> 24271 T2252 C142 P49770 oasc.SolrCore.getNewIndexDir New index directory detected: old=./org.apache.solr.cloud.BasicDistributedZkTest-1357115020540/jetty4/index/ new=./org.apache.solr.cloud.BasicDistributedZkTest-1357115020540/jetty4/index.20130102012404788
[junit4:junit4]   2> 24274 T2252 C142 P49770 oasc.SolrDeletionPolicy.onInit SolrDeletionPolicy.onInit: commits:num=1
[junit4:junit4]   2> 		commit{dir=RateLimitedDirectoryWrapper(org.apache.lucene.store.NIOFSDirectory@/Users/jenkins/jenkins-slave/workspace/Lucene-Solr-trunk-MacOSX/solr/build/solr-core/test/J0/org.apache.solr.cloud.BasicDistributedZkTest-1357115020540/jetty4/index.20130102012404788 lockFactory=org.apache.lucene.store.NativeFSLockFactory@6e428d9d),segFN=segments_2,generation=2,filenames=[segments_2]
[junit4:junit4]   2> 24274 T2252 C142 P49770 oasc.SolrDeletionPolicy.updateCommits newest commit = 2[segments_2]
[junit4:junit4]   2> 24275 T2252 C142 P49770 oasc.CachingDirectoryFactory.close Releasing directory:/Users/jenkins/jenkins-slave/workspace/Lucene-Solr-trunk-MacOSX/solr/build/solr-core/test/J0/./org.apache.solr.cloud.BasicDistributedZkTest-1357115020540/jetty4
[junit4:junit4]   2> 24276 T2252 C142 P49770 oasu.DefaultSolrCoreState.newIndexWriter Creating new IndexWriter...
[junit4:junit4]   2> 24276 T2252 C142 P49770 oasu.DefaultSolrCoreState.newIndexWriter Waiting until IndexWriter is unused... core=collection1
[junit4:junit4]   2> 24276 T2252 C142 P49770 oasu.DefaultSolrCoreState.newIndexWriter Rollback old IndexWriter... core=collection1
[junit4:junit4]   2> 24277 T2252 C142 P49770 oasc.CachingDirectoryFactory.close Releasing directory:/Users/jenkins/jenkins-slave/workspace/Lucene-Solr-trunk-MacOSX/solr/build/solr-core/test/J0/./org.apache.solr.cloud.BasicDistributedZkTest-1357115020540/jetty4/index.20130102012404788
[junit4:junit4]   2> 24277 T2252 C142 P49770 oasc.CachingDirectoryFactory.close Releasing directory:/Users/jenkins/jenkins-slave/workspace/Lucene-Solr-trunk-MacOSX/solr/build/solr-core/test/J0/./org.apache.solr.cloud.BasicDistributedZkTest-1357115020540/jetty4
[junit4:junit4]   2> 24279 T2252 C142 P49770 oasc.SolrDeletionPolicy.onInit SolrDeletionPolicy.onInit: commits:num=1
[junit4:junit4]   2> 		commit{dir=RateLimitedDirectoryWrapper(org.apache.lucene.store.NIOFSDirectory@/Users/jenkins/jenkins-slave/workspace/Lucene-Solr-trunk-MacOSX/solr/build/solr-core/test/J0/org.apache.solr.cloud.BasicDistributedZkTest-1357115020540/jetty4/index.20130102012404788 lockFactory=org.apache.lucene.store.NativeFSLockFactory@6e428d9d),segFN=segments_2,generation=2,filenames=[segments_2]
[junit4:junit4]   2> 24279 T2252 C142 P49770 oasc.SolrDeletionPolicy.updateCommits newest commit = 2[segments_2]
[junit4:junit4]   2> 24280 T2252 C142 P49770 oasu.DefaultSolrCoreState.newIndexWriter New IndexWriter is ready to be used.
[junit4:junit4]   2> 24280 T2252 C142 P49770 oasc.CachingDirectoryFactory.close Releasing directory:/Users/jenkins/jenkins-slave/workspace/Lucene-Solr-trunk-MacOSX/solr/build/solr-core/test/J0/./org.apache.solr.cloud.BasicDistributedZkTest-1357115020540/jetty4
[junit4:junit4]   2> 24281 T2252 C142 P49770 oass.SolrIndexSearcher.<init> Opening Searcher@1a21b484 main
[junit4:junit4]   2> 24283 T2249 oasc.SolrCore.registerSearcher [collection1] Registered new searcher Searcher@1a21b484 main{StandardDirectoryReader(segments_2:1:nrt)}
[junit4:junit4]   2> 24283 T2249 oasc.CachingDirectoryFactory.close Releasing directory:/Users/jenkins/jenkins-slave/workspace/Lucene-Solr-trunk-MacOSX/solr/build/solr-core/test/J0/./org.apache.solr.cloud.BasicDistributedZkTest-1357115020540/jetty4/index
[junit4:junit4]   2> 24283 T2252 C142 P49770 oasu.DirectUpdateHandler2.commit start commit{flags=0,_version_=0,optimize=false,openSearcher=false,waitSearcher=false,expungeDeletes=false,softCommit=false}
[junit4:junit4]   2> 24287 T2252 C142 P49770 oasc.SolrDeletionPolicy.onCommit SolrDeletionPolicy.onCommit: commits:num=2
[junit4:junit4]   2> 		commit{dir=RateLimitedDirectoryWrapper(org.apache.lucene.store.NIOFSDirectory@/Users/jenkins/jenkins-slave/workspace/Lucene-Solr-trunk-MacOSX/solr/build/solr-core/test/J0/org.apache.solr.cloud.BasicDistributedZkTest-1357115020540/jetty4/index.20130102012404788 lockFactory=org.apache.lucene.store.NativeFSLockFactory@6e428d9d),segFN=segments_2,generation=2,filenames=[segments_2]
[junit4:junit4]   2> 		commit{dir=RateLimitedDirectoryWrapper(org.apache.lucene.store.NIOFSDirectory@/Users/jenkins/jenkins-slave/workspace/Lucene-Solr-trunk-MacOSX/solr/build/solr-core/test/J0/org.apache.solr.cloud.BasicDistributedZkTest-1357115020540/jetty4/index.20130102012404788 lockFactory=org.apache.lucene.store.NativeFSLockFactory@6e428d9d),segFN=segments_3,generation=3,filenames=[segments_3]
[junit4:junit4]   2> 24291 T2252 C142 P49770 oasc.SolrDeletionPolicy.updateCommits newest commit = 3[segments_3]
[junit4:junit4]   2> 24292 T2252 C142 P49770 oasc.CachingDirectoryFactory.close Releasing directory:/Users/jenkins/jenkins-slave/workspace/Lucene-Solr-trunk-MacOSX/solr/build/solr-core/test/J0/./org.apache.solr.cloud.BasicDistributedZkTest-1357115020540/jetty4
[junit4:junit4]   2> 24292 T2252 C142 P49770 oasu.DirectUpdateHandler2.commit end_commit_flush
[junit4:junit4]   2> 24292 T2252 C142 P49770 oasc.CachingDirectoryFactory.close Releasing directory:/Users/jenkins/jenkins-slave/workspace/Lucene-Solr-trunk-MacOSX/solr/build/solr-core/test/J0/./org.apache.solr.cloud.BasicDistributedZkTest-1357115020540/jetty4/index.20130102012404788
[junit4:junit4]   2> 24293 T2252 C142 P49770 oasc.CachingDirectoryFactory.close Releasing directory:/Users/jenkins/jenkins-slave/workspace/Lucene-Solr-trunk-MacOSX/solr/build/solr-core/test/J0/./org.apache.solr.cloud.BasicDistributedZkTest-1357115020540/jetty4/index
[junit4:junit4]   2> 24293 T2252 C142 P49770 oasc.RecoveryStrategy.replay No replay needed. core=collection1
[junit4:junit4]   2> 24293 T2252 C142 P49770 oasc.RecoveryStrategy.doRecovery Replication Recovery was successful - registering as Active. core=collection1
[junit4:junit4]   2> 24293 T2252 C142 P49770 oasc.ZkController.publish publishing core=collection1 state=active
[junit4:junit4]   2> 24293 T2252 C142 P49770 oasc.ZkController.publish numShards not found on descriptor - reading it from system property
[junit4:junit4]   2> 24295 T2252 C142 P49770 oasc.RecoveryStrategy.doRecovery Finished recovery process. core=collection1
[junit4:junit4]   2> 25208 T2183 oascc.ZkStateReader.updateClusterState Updating cloud state from ZooKeeper... 
[junit4:junit4]   2> 25209 T2183 oasc.Overseer$ClusterStateUpdater.updateState Update state numShards=2 message={
[junit4:junit4]   2> 	  "operation":"state",
[junit4:junit4]   2> 	  "numShards":"2",
[junit4:junit4]   2> 	  "shard":"shard2",
[junit4:junit4]   2> 	  "roles":null,
[junit4:junit4]   2> 	  "state":"active",
[junit4:junit4]   2> 	  "core":"collection1",
[junit4:junit4]   2> 	  "collection":"collection1",
[junit4:junit4]   2> 	  "node_name":"127.0.0.1:49770_",
[junit4:junit4]   2> 	  "base_url":"http://127.0.0.1:49770"}
[junit4:junit4]   2> 25217 T2216 oascc.ZkStateReader$2.process A cluster state change: WatchedEvent state:SyncConnected type:NodeDataChanged path:/clusterstate.json, has occurred - updating... (live nodes size: 5)
[junit4:junit4]   2> 25217 T2247 oascc.ZkStateReader$2.process A cluster state change: WatchedEvent state:SyncConnected type:NodeDataChanged path:/clusterstate.json, has occurred - updating... (live nodes size: 5)
[junit4:junit4]   2> 25217 T2201 oascc.ZkStateReader$2.process A cluster state change: WatchedEvent state:SyncConnected type:NodeDataChanged path:/clusterstate.json, has occurred - updating... (live nodes size: 5)
[junit4:junit4]   2> 25220 T2188 oascc.ZkStateReader$2.process A cluster state change: WatchedEvent state:SyncConnected type:NodeDataChanged path:/clusterstate.json, has occurred - updating... (live nodes size: 5)
[junit4:junit4]   2> 25222 T2182 oascc.ZkStateReader$2.process A cluster state change: WatchedEvent state:SyncConnected type:NodeDataChanged path:/clusterstate.json, has occurred - updating... (live nodes size: 5)
[junit4:junit4]   2> 25223 T2231 oascc.ZkStateReader$2.process A cluster state change: WatchedEvent state:SyncConnected type:NodeDataChanged path:/clusterstate.json, has occurred - updating... (live nodes size: 5)
[junit4:junit4]   2> 25254 T2160 oascc.ZkStateReader.updateClusterState Updating cloud state from ZooKeeper... 
[junit4:junit4]   2> 25256 T2160 oasc.AbstractDistribZkTestBase.waitForRecoveriesToFinish Recoveries finished - collection: collection1
[junit4:junit4]   2> ASYNC  NEW_CORE C144 name=collection1 org.apache.solr.core.SolrCore@50fec9c8 url=http://127.0.0.1:49756/collection1 node=127.0.0.1:49756_ C144_STATE=coll:control_collection core:collection1 props:{shard=shard1, roles=null, state=active, core=collection1, collection=control_collection, node_name=127.0.0.1:49756_, base_url=http://127.0.0.1:49756, leader=true}
[junit4:junit4]   2> 25267 T2176 C144 P49756 oasc.CachingDirectoryFactory.close Releasing directory:/Users/jenkins/jenkins-slave/workspace/Lucene-Solr-trunk-MacOSX/solr/build/solr-core/test/J0/./org.apache.solr.cloud.BasicDistributedZkTest-1357115020540/control/data
[junit4:junit4]   2> 25271 T2176 C144 P49756 oasc.SolrDeletionPolicy.onInit SolrDeletionPolicy.onInit: commits:num=1
[junit4:junit4]   2> 		commit{dir=RateLimitedDirectoryWrapper(org.apache.lucene.store.NIOFSDirectory@/Users/jenkins/jenkins-slave/workspace/Lucene-Solr-trunk-MacOSX/solr/build/solr-core/test/J0/org.apache.solr.cloud.BasicDistributedZkTest-1357115020540/control/data/index lockFactory=org.apache.lucene.store.NativeFSLockFactory@5ad07e3a),segFN=segments_1,generation=1,filenames=[segments_1]
[junit4:junit4]   2> 25271 T2176 C144 P49756 oasc.SolrDeletionPolicy.updateCommits newest commit = 1[segments_1]
[junit4:junit4]   2> 25273 T2176 C144 P49756 oasc.CachingDirectoryFactory.close Releasing directory:/Users/jenkins/jenkins-slave/workspace/Lucene-Solr-trunk-MacOSX/solr/build/solr-core/test/J0/./org.apache.solr.cloud.BasicDistributedZkTest-1357115020540/control/data
[junit4:junit4]   2> 25273 T2176 C144 P49756 oass.SolrIndexSearcher.<init> Opening Searcher@4a02c577 realtime
[junit4:junit4]   2> 25274 T2176 C144 P49756 /update {wt=javabin&version=2} {deleteByQuery=*:* (-1423038266258489344)} 0 8
[junit4:junit4]   2> 25280 T2209 C143 P49763 oasc.CachingDirectoryFactory.close Releasing directory:/Users/jenkins/jenkins-slave/workspace/Lucene-Solr-trunk-MacOSX/solr/build/solr-core/test/J0/./org.apache.solr.cloud.BasicDistributedZkTest-1357115020540/jetty2
[junit4:junit4]   2> 25311 T2196 C141 P49760 oasc.CachingDirectoryFactory.close Releasing directory:/Users/jenkins/jenkins-slave/workspace/Lucene-Solr-trunk-MacOSX/solr/build/solr-core/t

[...truncated too long message...]

unit4]    > 	... 5 more
[junit4:junit4]    > Throwable #7: com.carrotsearch.randomizedtesting.UncaughtExceptionError: Captured an uncaught exception in thread: Thread[id=2516, name=testExecutor-1419-thread-2, state=RUNNABLE, group=TGRP-BasicDistributedZkTest]
[junit4:junit4]    > Caused by: java.lang.RuntimeException: org.apache.solr.client.solrj.SolrServerException: IOException occured when talking to server at: http://127.0.0.1:49760
[junit4:junit4]    > 	at __randomizedtesting.SeedInfo.seed([2D2D949F26E079A3]:0)
[junit4:junit4]    > 	at org.apache.solr.cloud.BasicDistributedZkTest$2.run(BasicDistributedZkTest.java:706)
[junit4:junit4]    > 	at java.util.concurrent.ThreadPoolExecutor.runWorker(ThreadPoolExecutor.java:1110)
[junit4:junit4]    > 	at java.util.concurrent.ThreadPoolExecutor$Worker.run(ThreadPoolExecutor.java:603)
[junit4:junit4]    > 	at java.lang.Thread.run(Thread.java:722)
[junit4:junit4]    > Caused by: org.apache.solr.client.solrj.SolrServerException: IOException occured when talking to server at: http://127.0.0.1:49760
[junit4:junit4]    > 	at org.apache.solr.client.solrj.impl.HttpSolrServer.request(HttpSolrServer.java:413)
[junit4:junit4]    > 	at org.apache.solr.client.solrj.impl.HttpSolrServer.request(HttpSolrServer.java:181)
[junit4:junit4]    > 	at org.apache.solr.cloud.BasicDistributedZkTest$2.run(BasicDistributedZkTest.java:704)
[junit4:junit4]    > 	... 3 more
[junit4:junit4]    > Caused by: java.net.SocketException: Invalid argument
[junit4:junit4]    > 	at java.net.SocketInputStream.socketRead0(Native Method)
[junit4:junit4]    > 	at java.net.SocketInputStream.read(SocketInputStream.java:150)
[junit4:junit4]    > 	at java.net.SocketInputStream.read(SocketInputStream.java:121)
[junit4:junit4]    > 	at org.apache.http.impl.io.AbstractSessionInputBuffer.fillBuffer(AbstractSessionInputBuffer.java:149)
[junit4:junit4]    > 	at org.apache.http.impl.io.SocketInputBuffer.fillBuffer(SocketInputBuffer.java:111)
[junit4:junit4]    > 	at org.apache.http.impl.io.AbstractSessionInputBuffer.readLine(AbstractSessionInputBuffer.java:264)
[junit4:junit4]    > 	at org.apache.http.impl.conn.DefaultResponseParser.parseHead(DefaultResponseParser.java:98)
[junit4:junit4]    > 	at org.apache.http.impl.io.AbstractMessageParser.parse(AbstractMessageParser.java:252)
[junit4:junit4]    > 	at org.apache.http.impl.AbstractHttpClientConnection.receiveResponseHeader(AbstractHttpClientConnection.java:282)
[junit4:junit4]    > 	at org.apache.http.impl.conn.DefaultClientConnection.receiveResponseHeader(DefaultClientConnection.java:247)
[junit4:junit4]    > 	at org.apache.http.impl.conn.AbstractClientConnAdapter.receiveResponseHeader(AbstractClientConnAdapter.java:216)
[junit4:junit4]    > 	at org.apache.http.protocol.HttpRequestExecutor.doReceiveResponse(HttpRequestExecutor.java:298)
[junit4:junit4]    > 	at org.apache.http.protocol.HttpRequestExecutor.execute(HttpRequestExecutor.java:125)
[junit4:junit4]    > 	at org.apache.http.impl.client.DefaultRequestDirector.tryExecute(DefaultRequestDirector.java:647)
[junit4:junit4]    > 	at org.apache.http.impl.client.DefaultRequestDirector.execute(DefaultRequestDirector.java:464)
[junit4:junit4]    > 	at org.apache.http.impl.client.AbstractHttpClient.execute(AbstractHttpClient.java:820)
[junit4:junit4]    > 	at org.apache.http.impl.client.AbstractHttpClient.execute(AbstractHttpClient.java:754)
[junit4:junit4]    > 	at org.apache.http.impl.client.AbstractHttpClient.execute(AbstractHttpClient.java:732)
[junit4:junit4]    > 	at org.apache.solr.client.solrj.impl.HttpSolrServer.request(HttpSolrServer.java:352)
[junit4:junit4]    > 	... 5 more
[junit4:junit4]   2> 257031 T2160 oas.SolrTestCaseJ4.deleteCore ###deleteCore
[junit4:junit4]   2> NOTE: test params are: codec=Lucene41: {n_f1=Pulsing41(freqCutoff=16 minBlockSize=65 maxBlockSize=186), foo_b=MockVariableIntBlock(baseBlockSize=31), cat=PostingsFormat(name=Direct), foo_d=PostingsFormat(name=Memory doPackFST= true), foo_f=MockVariableIntBlock(baseBlockSize=31), n_tl1=Pulsing41(freqCutoff=16 minBlockSize=65 maxBlockSize=186), n_d1=PostingsFormat(name=Direct), rnd_b=PostingsFormat(name=Memory doPackFST= true), intDefault=Pulsing41(freqCutoff=16 minBlockSize=65 maxBlockSize=186), n_td1=Pulsing41(freqCutoff=16 minBlockSize=65 maxBlockSize=186), timestamp=PostingsFormat(name=Direct), id=PostingsFormat(name=Memory doPackFST= true), range_facet_sl=PostingsFormat(name=Memory doPackFST= true), range_facet_si=PostingsFormat(name=Direct), oddField_s=PostingsFormat(name=Memory doPackFST= true), sequence_i=PostingsFormat(name=Memory doPackFST= true), name=PostingsFormat(name=Memory doPackFST= true), foo_i=Pulsing41(freqCutoff=16 minBlockSize=65 maxBlockSize=186), regex_dup_B_s=PostingsFormat(name=Direct), multiDefault=PostingsFormat(name=Direct), n_tf1=PostingsFormat(name=Direct), n_dt1=Pulsing41(freqCutoff=16 minBlockSize=65 maxBlockSize=186), genre_s=PostingsFormat(name=Memory doPackFST= true), author_t=Pulsing41(freqCutoff=16 minBlockSize=65 maxBlockSize=186), n_ti1=PostingsFormat(name=Memory doPackFST= true), range_facet_l=PostingsFormat(name=Direct), text=MockVariableIntBlock(baseBlockSize=31), _version_=Pulsing41(freqCutoff=16 minBlockSize=65 maxBlockSize=186), val_i=PostingsFormat(name=Memory doPackFST= true), SubjectTerms_mfacet=Pulsing41(freqCutoff=16 minBlockSize=65 maxBlockSize=186), series_t=Pulsing41(freqCutoff=16 minBlockSize=65 maxBlockSize=186), a_t=PostingsFormat(name=Direct), n_tdt1=Pulsing41(freqCutoff=16 minBlockSize=65 maxBlockSize=186), regex_dup_A_s=MockVariableIntBlock(baseBlockSize=31), price=MockVariableIntBlock(baseBlockSize=31), other_tl1=Pulsing41(freqCutoff=16 minBlockSize=65 maxBlockSize=186), n_l1=PostingsFormat(name=Direct), a_si=Pulsing41(freqCutoff=16 minBlockSize=65 maxBlockSize=186), inStock=MockVariableIntBlock(baseBlockSize=31)}, sim=RandomSimilarityProvider(queryNorm=true,coord=crazy): {}, locale=zh_CN, timezone=America/Inuvik
[junit4:junit4]   2> NOTE: Mac OS X 10.8.2 x86_64/Oracle Corporation 1.7.0_10 (64-bit)/cpus=2,threads=1,free=220235640,total=341180416
[junit4:junit4]   2> NOTE: All tests run in this JVM: [SuggesterTest, LegacyHTMLStripCharFilterTest, TestRemoteStreaming, TestDefaultSimilarityFactory, TestFunctionQuery, LeaderElectionIntegrationTest, LeaderElectionTest, SynonymTokenizerTest, UpdateParamsTest, AlternateDirectoryTest, PluginInfoTest, SolrCoreTest, SampleTest, CurrencyFieldTest, TestPhraseSuggestions, BasicDistributedZk2Test, TestPseudoReturnFields, TestComponentsName, URLClassifyProcessorTest, TestReplicationHandler, TestNumberUtils, XmlUpdateRequestHandlerTest, MoreLikeThisHandlerTest, ResponseLogComponentTest, ScriptEngineTest, HighlighterConfigTest, TestAnalyzedSuggestions, TestRangeQuery, MinimalSchemaTest, TestBinaryResponseWriter, BasicFunctionalityTest, DirectSolrConnectionTest, TestDFRSimilarityFactory, ClusterStateUpdateTest, UniqFieldsUpdateProcessorFactoryTest, SuggesterFSTTest, TestRandomFaceting, NotRequiredUniqueKeyTest, ReturnFieldsTest, HighlighterTest, ChaosMonkeySafeLeaderTest, AutoCommitTest, TestUtils, SimpleFacetsTest, TestDocSet, TestFaceting, JsonLoaderTest, TermsComponentTest, ShardRoutingCustomTest, TestQueryUtils, CircularListTest, SuggesterWFSTTest, TestIndexSearcher, PeerSyncTest, DefaultValueUpdateProcessorTest, TestSearchPerf, PingRequestHandlerTest, TestSolrDeletionPolicy1, QueryParsingTest, TestJoin, JSONWriterTest, TestArbitraryIndexDir, FastVectorHighlighterTest, SoftAutoCommitTest, TestJmxIntegration, TestExtendedDismaxParser, TestFiltering, TestPerFieldSimilarity, TestDistributedGrouping, TestPHPSerializedResponseWriter, MultiTermTest, LoggingHandlerTest, BasicZkTest, DisMaxRequestHandlerTest, FileUtilsTest, UUIDFieldTest, TestCharFilters, CSVRequestHandlerTest, DistanceFunctionTest, TestLMJelinekMercerSimilarityFactory, TestLuceneMatchVersion, TestQueryTypes, TestPluginEnable, RequestHandlersTest, TestSolrIndexConfig, OutputWriterTest, SolrPluginUtilsTest, FullSolrCloudDistribCmdsTest, ZkSolrClientTest, PathHierarchyTokenizerFactoryTest, TestRealTimeGet, TestFuzzyAnalyzedSuggestions, AnalysisAfterCoreReloadTest, TestHashPartitioner, ZkNodePropsTest, SpellCheckComponentTest, CacheHeaderTest, TestReversedWildcardFilterFactory, TestLRUCache, TestFastLRUCache, DistributedQueryElevationComponentTest, FieldMutatingUpdateProcessorTest, RequiredFieldsTest, LukeRequestHandlerTest, TestUpdate, BinaryUpdateRequestHandlerTest, FileBasedSpellCheckerTest, TestQuerySenderListener, TermVectorComponentDistributedTest, ResourceLoaderTest, TestIBSimilarityFactory, RecoveryZkTest, DistributedTermsComponentTest, BadComponentTest, TestSolrDeletionPolicy2, TestCSVLoader, TestSolrXMLSerializer, TestFastOutputStream, BasicDistributedZkTest]
[junit4:junit4] Completed in 257.78s, 1 test, 1 error <<< FAILURES!

[...truncated 379 lines...]
BUILD FAILED
/Users/jenkins/jenkins-slave/workspace/Lucene-Solr-trunk-MacOSX/build.xml:353: The following error occurred while executing this line:
/Users/jenkins/jenkins-slave/workspace/Lucene-Solr-trunk-MacOSX/build.xml:39: The following error occurred while executing this line:
/Users/jenkins/jenkins-slave/workspace/Lucene-Solr-trunk-MacOSX/solr/build.xml:178: The following error occurred while executing this line:
/Users/jenkins/jenkins-slave/workspace/Lucene-Solr-trunk-MacOSX/solr/common-build.xml:438: The following error occurred while executing this line:
/Users/jenkins/jenkins-slave/workspace/Lucene-Solr-trunk-MacOSX/lucene/common-build.xml:1176: The following error occurred while executing this line:
/Users/jenkins/jenkins-slave/workspace/Lucene-Solr-trunk-MacOSX/lucene/common-build.xml:841: There were test failures: 245 suites, 1012 tests, 1 error, 14 ignored (3 assumptions)

Total time: 54 minutes 41 seconds
Build step 'Invoke Ant' marked build as failure
Archiving artifacts
Recording test results
Description set: Java: 64bit/jdk1.7.0 -XX:+UseParallelGC
Email was triggered for: Failure
Sending email for trigger: Failure



Mime
View raw message