lucene-dev mailing list archives

Site index · List index
Message view « Date » · « Thread »
Top « Date » · « Thread »
From Apache Jenkins Server <jenk...@builds.apache.org>
Subject [JENKINS] Lucene-Solr-Tests-trunk-java7 - Build # 3604 - Still Failing
Date Thu, 03 Jan 2013 05:51:06 GMT
Build: https://builds.apache.org/job/Lucene-Solr-Tests-trunk-java7/3604/

3 tests failed.
REGRESSION:  org.apache.solr.cloud.SyncSliceTest.testDistribSearch

Error Message:
shard1 should have just been set up to be inconsistent - but it's still consistent

Stack Trace:
java.lang.AssertionError: shard1 should have just been set up to be inconsistent - but it's still consistent
	at __randomizedtesting.SeedInfo.seed([88D06608409B4251:936E81037C4226D]:0)
	at org.junit.Assert.fail(Assert.java:93)
	at org.junit.Assert.assertTrue(Assert.java:43)
	at org.junit.Assert.assertNotNull(Assert.java:526)
	at org.apache.solr.cloud.SyncSliceTest.doTest(SyncSliceTest.java:214)
	at org.apache.solr.BaseDistributedSearchTestCase.testDistribSearch(BaseDistributedSearchTestCase.java:794)
	at sun.reflect.NativeMethodAccessorImpl.invoke0(Native Method)
	at sun.reflect.NativeMethodAccessorImpl.invoke(NativeMethodAccessorImpl.java:57)
	at sun.reflect.DelegatingMethodAccessorImpl.invoke(DelegatingMethodAccessorImpl.java:43)
	at java.lang.reflect.Method.invoke(Method.java:601)
	at com.carrotsearch.randomizedtesting.RandomizedRunner.invoke(RandomizedRunner.java:1559)
	at com.carrotsearch.randomizedtesting.RandomizedRunner.access$600(RandomizedRunner.java:79)
	at com.carrotsearch.randomizedtesting.RandomizedRunner$6.evaluate(RandomizedRunner.java:737)
	at com.carrotsearch.randomizedtesting.RandomizedRunner$7.evaluate(RandomizedRunner.java:773)
	at com.carrotsearch.randomizedtesting.RandomizedRunner$8.evaluate(RandomizedRunner.java:787)
	at com.carrotsearch.randomizedtesting.rules.SystemPropertiesRestoreRule$1.evaluate(SystemPropertiesRestoreRule.java:53)
	at org.apache.lucene.util.TestRuleSetupTeardownChained$1.evaluate(TestRuleSetupTeardownChained.java:50)
	at org.apache.lucene.util.TestRuleFieldCacheSanity$1.evaluate(TestRuleFieldCacheSanity.java:51)
	at org.apache.lucene.util.AbstractBeforeAfterRule$1.evaluate(AbstractBeforeAfterRule.java:46)
	at com.carrotsearch.randomizedtesting.rules.SystemPropertiesInvariantRule$1.evaluate(SystemPropertiesInvariantRule.java:55)
	at org.apache.lucene.util.TestRuleThreadAndTestName$1.evaluate(TestRuleThreadAndTestName.java:49)
	at org.apache.lucene.util.TestRuleIgnoreAfterMaxFailures$1.evaluate(TestRuleIgnoreAfterMaxFailures.java:70)
	at org.apache.lucene.util.TestRuleMarkFailure$1.evaluate(TestRuleMarkFailure.java:48)
	at com.carrotsearch.randomizedtesting.rules.StatementAdapter.evaluate(StatementAdapter.java:36)
	at com.carrotsearch.randomizedtesting.ThreadLeakControl$StatementRunner.run(ThreadLeakControl.java:358)
	at com.carrotsearch.randomizedtesting.ThreadLeakControl.forkTimeoutingTask(ThreadLeakControl.java:782)
	at com.carrotsearch.randomizedtesting.ThreadLeakControl$3.evaluate(ThreadLeakControl.java:442)
	at com.carrotsearch.randomizedtesting.RandomizedRunner.runSingleTest(RandomizedRunner.java:746)
	at com.carrotsearch.randomizedtesting.RandomizedRunner$3.evaluate(RandomizedRunner.java:648)
	at com.carrotsearch.randomizedtesting.RandomizedRunner$4.evaluate(RandomizedRunner.java:682)
	at com.carrotsearch.randomizedtesting.RandomizedRunner$5.evaluate(RandomizedRunner.java:693)
	at com.carrotsearch.randomizedtesting.rules.StatementAdapter.evaluate(StatementAdapter.java:36)
	at com.carrotsearch.randomizedtesting.rules.SystemPropertiesRestoreRule$1.evaluate(SystemPropertiesRestoreRule.java:53)
	at org.apache.lucene.util.AbstractBeforeAfterRule$1.evaluate(AbstractBeforeAfterRule.java:46)
	at org.apache.lucene.util.TestRuleStoreClassName$1.evaluate(TestRuleStoreClassName.java:42)
	at com.carrotsearch.randomizedtesting.rules.SystemPropertiesInvariantRule$1.evaluate(SystemPropertiesInvariantRule.java:55)
	at com.carrotsearch.randomizedtesting.rules.NoShadowingOrOverridesOnMethodsRule$1.evaluate(NoShadowingOrOverridesOnMethodsRule.java:39)
	at com.carrotsearch.randomizedtesting.rules.NoShadowingOrOverridesOnMethodsRule$1.evaluate(NoShadowingOrOverridesOnMethodsRule.java:39)
	at com.carrotsearch.randomizedtesting.rules.StatementAdapter.evaluate(StatementAdapter.java:36)
	at org.apache.lucene.util.TestRuleAssertionsRequired$1.evaluate(TestRuleAssertionsRequired.java:43)
	at org.apache.lucene.util.TestRuleMarkFailure$1.evaluate(TestRuleMarkFailure.java:48)
	at org.apache.lucene.util.TestRuleIgnoreAfterMaxFailures$1.evaluate(TestRuleIgnoreAfterMaxFailures.java:70)
	at org.apache.lucene.util.TestRuleIgnoreTestSuites$1.evaluate(TestRuleIgnoreTestSuites.java:55)
	at com.carrotsearch.randomizedtesting.rules.StatementAdapter.evaluate(StatementAdapter.java:36)
	at com.carrotsearch.randomizedtesting.ThreadLeakControl$StatementRunner.run(ThreadLeakControl.java:358)
	at java.lang.Thread.run(Thread.java:722)


FAILED:  junit.framework.TestSuite.org.apache.solr.cloud.BasicDistributedZkTest

Error Message:
Suite timeout exceeded (>= 7200000 msec).

Stack Trace:
java.lang.Exception: Suite timeout exceeded (>= 7200000 msec).
	at __randomizedtesting.SeedInfo.seed([88D06608409B4251]:0)


FAILED:  org.apache.solr.cloud.BasicDistributedZkTest.testDistribSearch

Error Message:
Test abandoned because suite timeout was reached.

Stack Trace:
java.lang.Exception: Test abandoned because suite timeout was reached.
	at __randomizedtesting.SeedInfo.seed([88D06608409B4251]:0)




Build Log:
[...truncated 9387 lines...]
[junit4:junit4] Suite: org.apache.solr.cloud.SyncSliceTest
[junit4:junit4]   2> 0 T3859 oas.BaseDistributedSearchTestCase.initHostContext Setting hostContext system property: /f/jk
[junit4:junit4]   2> 6 T3859 oas.SolrTestCaseJ4.setUp ###Starting testDistribSearch
[junit4:junit4]   2> Creating dataDir: /usr/home/hudson/hudson-slave/workspace/Lucene-Solr-Tests-trunk-java7/solr/build/solr-core/test/J0/./solrtest-SyncSliceTest-1357185846221
[junit4:junit4]   2> 8 T3859 oasc.ZkTestServer.run STARTING ZK TEST SERVER
[junit4:junit4]   2> 8 T3860 oasc.ZkTestServer$ZKServerMain.runFromConfig Starting server
[junit4:junit4]   2> 13 T3860 oazs.ZooKeeperServer.setTickTime tickTime set to 1000
[junit4:junit4]   2> 13 T3860 oazs.ZooKeeperServer.setMinSessionTimeout minSessionTimeout set to -1
[junit4:junit4]   2> 13 T3860 oazs.ZooKeeperServer.setMaxSessionTimeout maxSessionTimeout set to -1
[junit4:junit4]   2> 13 T3860 oazs.NIOServerCnxnFactory.configure binding to port 0.0.0.0/0.0.0.0:0
[junit4:junit4]   2> 14 T3860 oazsp.FileTxnSnapLog.save Snapshotting: 0x0 to /usr/home/hudson/hudson-slave/workspace/Lucene-Solr-Tests-trunk-java7/solr/build/solr-core/test/J0/./org.apache.solr.cloud.SyncSliceTest-1357185846221/zookeeper/server1/data/version-2/snapshot.0
[junit4:junit4]   2> 109 T3859 oasc.ZkTestServer.run start zk server on port:28847
[junit4:junit4]   2> 109 T3859 oaz.ZooKeeper.<init> Initiating client connection, connectString=127.0.0.1:28847 sessionTimeout=10000 watcher=org.apache.solr.common.cloud.ConnectionManager@568a7875
[junit4:junit4]   2> 110 T3859 oascc.ConnectionManager.waitForConnected Waiting for client to connect to ZooKeeper
[junit4:junit4]   2> 111 T3865 oaz.ClientCnxn$SendThread.logStartConnect Opening socket connection to server localhost/127.0.0.1:28847. Will not attempt to authenticate using SASL (access denied ("javax.security.auth.AuthPermission" "getLoginConfiguration"))
[junit4:junit4]   2> 111 T3865 oaz.ClientCnxn$SendThread.primeConnection Socket connection established to localhost/127.0.0.1:28847, initiating session
[junit4:junit4]   2> 111 T3861 oazs.NIOServerCnxnFactory.run Accepted socket connection from /140.211.11.196:56622
[junit4:junit4]   2> 112 T3861 oazs.ZooKeeperServer.processConnectRequest Client attempting to establish new session at /140.211.11.196:56622
[junit4:junit4]   2> 112 T3863 oazsp.FileTxnLog.append Creating new log file: log.1
[junit4:junit4]   2> 116 T3863 oazs.ZooKeeperServer.finishSessionInit Established session 0x13bfe948bd50000 with negotiated timeout 10000 for client /140.211.11.196:56622
[junit4:junit4]   2> 116 T3865 oaz.ClientCnxn$SendThread.onConnected Session establishment complete on server localhost/127.0.0.1:28847, sessionid = 0x13bfe948bd50000, negotiated timeout = 10000
[junit4:junit4]   2> 116 T3866 oascc.ConnectionManager.process Watcher org.apache.solr.common.cloud.ConnectionManager@568a7875 name:ZooKeeperConnection Watcher:127.0.0.1:28847 got event WatchedEvent state:SyncConnected type:None path:null path:null type:None
[junit4:junit4]   2> 116 T3859 oascc.ConnectionManager.waitForConnected Client is connected to ZooKeeper
[junit4:junit4]   2> 117 T3859 oascc.SolrZkClient.makePath makePath: /solr
[junit4:junit4]   2> 231 T3864 oazs.PrepRequestProcessor.pRequest2Txn Processed session termination for sessionid: 0x13bfe948bd50000
[junit4:junit4]   2> 232 T3866 oaz.ClientCnxn$EventThread.run EventThread shut down
[junit4:junit4]   2> 233 T3861 oazs.NIOServerCnxn.closeSock Closed socket connection for client /140.211.11.196:56622 which had sessionid 0x13bfe948bd50000
[junit4:junit4]   2> 232 T3859 oaz.ZooKeeper.close Session: 0x13bfe948bd50000 closed
[junit4:junit4]   2> 234 T3859 oaz.ZooKeeper.<init> Initiating client connection, connectString=127.0.0.1:28847/solr sessionTimeout=10000 watcher=org.apache.solr.common.cloud.ConnectionManager@585fd514
[junit4:junit4]   2> 235 T3859 oascc.ConnectionManager.waitForConnected Waiting for client to connect to ZooKeeper
[junit4:junit4]   2> 235 T3867 oaz.ClientCnxn$SendThread.logStartConnect Opening socket connection to server localhost/127.0.0.1:28847. Will not attempt to authenticate using SASL (access denied ("javax.security.auth.AuthPermission" "getLoginConfiguration"))
[junit4:junit4]   2> 235 T3867 oaz.ClientCnxn$SendThread.primeConnection Socket connection established to localhost/127.0.0.1:28847, initiating session
[junit4:junit4]   2> 236 T3861 oazs.NIOServerCnxnFactory.run Accepted socket connection from /140.211.11.196:32910
[junit4:junit4]   2> 236 T3861 oazs.ZooKeeperServer.processConnectRequest Client attempting to establish new session at /140.211.11.196:32910
[junit4:junit4]   2> 237 T3863 oazs.ZooKeeperServer.finishSessionInit Established session 0x13bfe948bd50001 with negotiated timeout 10000 for client /140.211.11.196:32910
[junit4:junit4]   2> 237 T3867 oaz.ClientCnxn$SendThread.onConnected Session establishment complete on server localhost/127.0.0.1:28847, sessionid = 0x13bfe948bd50001, negotiated timeout = 10000
[junit4:junit4]   2> 237 T3868 oascc.ConnectionManager.process Watcher org.apache.solr.common.cloud.ConnectionManager@585fd514 name:ZooKeeperConnection Watcher:127.0.0.1:28847/solr got event WatchedEvent state:SyncConnected type:None path:null path:null type:None
[junit4:junit4]   2> 238 T3859 oascc.ConnectionManager.waitForConnected Client is connected to ZooKeeper
[junit4:junit4]   2> 238 T3859 oascc.SolrZkClient.makePath makePath: /collections/collection1
[junit4:junit4]   2> 262 T3859 oascc.SolrZkClient.makePath makePath: /collections/collection1/shards
[junit4:junit4]   2> 265 T3859 oascc.SolrZkClient.makePath makePath: /collections/control_collection
[junit4:junit4]   2> 274 T3859 oascc.SolrZkClient.makePath makePath: /collections/control_collection/shards
[junit4:junit4]   2> 276 T3859 oasc.AbstractZkTestCase.putConfig put /usr/home/hudson/hudson-slave/workspace/Lucene-Solr-Tests-trunk-java7/solr/build/solr-core/test-files/solr/collection1/conf/solrconfig.xml to /configs/conf1/solrconfig.xml
[junit4:junit4]   2> 277 T3859 oascc.SolrZkClient.makePath makePath: /configs/conf1/solrconfig.xml
[junit4:junit4]   2> 298 T3859 oasc.AbstractZkTestCase.putConfig put /usr/home/hudson/hudson-slave/workspace/Lucene-Solr-Tests-trunk-java7/solr/build/solr-core/test-files/solr/collection1/conf/schema.xml to /configs/conf1/schema.xml
[junit4:junit4]   2> 299 T3859 oascc.SolrZkClient.makePath makePath: /configs/conf1/schema.xml
[junit4:junit4]   2> 405 T3859 oasc.AbstractZkTestCase.putConfig put /usr/home/hudson/hudson-slave/workspace/Lucene-Solr-Tests-trunk-java7/solr/build/solr-core/test-files/solr/collection1/conf/stopwords.txt to /configs/conf1/stopwords.txt
[junit4:junit4]   2> 406 T3859 oascc.SolrZkClient.makePath makePath: /configs/conf1/stopwords.txt
[junit4:junit4]   2> 408 T3859 oasc.AbstractZkTestCase.putConfig put /usr/home/hudson/hudson-slave/workspace/Lucene-Solr-Tests-trunk-java7/solr/build/solr-core/test-files/solr/collection1/conf/protwords.txt to /configs/conf1/protwords.txt
[junit4:junit4]   2> 409 T3859 oascc.SolrZkClient.makePath makePath: /configs/conf1/protwords.txt
[junit4:junit4]   2> 419 T3859 oasc.AbstractZkTestCase.putConfig put /usr/home/hudson/hudson-slave/workspace/Lucene-Solr-Tests-trunk-java7/solr/build/solr-core/test-files/solr/collection1/conf/currency.xml to /configs/conf1/currency.xml
[junit4:junit4]   2> 420 T3859 oascc.SolrZkClient.makePath makePath: /configs/conf1/currency.xml
[junit4:junit4]   2> 423 T3859 oasc.AbstractZkTestCase.putConfig put /usr/home/hudson/hudson-slave/workspace/Lucene-Solr-Tests-trunk-java7/solr/build/solr-core/test-files/solr/collection1/conf/open-exchange-rates.json to /configs/conf1/open-exchange-rates.json
[junit4:junit4]   2> 423 T3859 oascc.SolrZkClient.makePath makePath: /configs/conf1/open-exchange-rates.json
[junit4:junit4]   2> 433 T3859 oasc.AbstractZkTestCase.putConfig put /usr/home/hudson/hudson-slave/workspace/Lucene-Solr-Tests-trunk-java7/solr/build/solr-core/test-files/solr/collection1/conf/mapping-ISOLatin1Accent.txt to /configs/conf1/mapping-ISOLatin1Accent.txt
[junit4:junit4]   2> 435 T3859 oascc.SolrZkClient.makePath makePath: /configs/conf1/mapping-ISOLatin1Accent.txt
[junit4:junit4]   2> 438 T3859 oasc.AbstractZkTestCase.putConfig put /usr/home/hudson/hudson-slave/workspace/Lucene-Solr-Tests-trunk-java7/solr/build/solr-core/test-files/solr/collection1/conf/old_synonyms.txt to /configs/conf1/old_synonyms.txt
[junit4:junit4]   2> 439 T3859 oascc.SolrZkClient.makePath makePath: /configs/conf1/old_synonyms.txt
[junit4:junit4]   2> 447 T3859 oasc.AbstractZkTestCase.putConfig put /usr/home/hudson/hudson-slave/workspace/Lucene-Solr-Tests-trunk-java7/solr/build/solr-core/test-files/solr/collection1/conf/synonyms.txt to /configs/conf1/synonyms.txt
[junit4:junit4]   2> 448 T3859 oascc.SolrZkClient.makePath makePath: /configs/conf1/synonyms.txt
[junit4:junit4]   2> 451 T3864 oazs.PrepRequestProcessor.pRequest2Txn Processed session termination for sessionid: 0x13bfe948bd50001
[junit4:junit4]   2> 452 T3868 oaz.ClientCnxn$EventThread.run EventThread shut down
[junit4:junit4]   2> 452 T3859 oaz.ZooKeeper.close Session: 0x13bfe948bd50001 closed
[junit4:junit4]   2> 452 T3861 oazs.NIOServerCnxn.closeSock Closed socket connection for client /140.211.11.196:32910 which had sessionid 0x13bfe948bd50001
[junit4:junit4]   2> 632 T3859 oejs.Server.doStart jetty-8.1.8.v20121106
[junit4:junit4]   2> 638 T3859 oejs.AbstractConnector.doStart Started SocketConnector@127.0.0.1:64615
[junit4:junit4]   2> 639 T3859 oasc.SolrResourceLoader.locateSolrHome JNDI not configured for solr (NoInitialContextEx)
[junit4:junit4]   2> 640 T3859 oasc.SolrResourceLoader.locateSolrHome using system property solr.solr.home: /usr/home/hudson/hudson-slave/workspace/Lucene-Solr-Tests-trunk-java7/solr/build/solr-core/test/J0/./org.apache.solr.cloud.SyncSliceTest-controljetty-1357185846667
[junit4:junit4]   2> 640 T3859 oasc.SolrResourceLoader.<init> new SolrResourceLoader for deduced Solr Home: '/usr/home/hudson/hudson-slave/workspace/Lucene-Solr-Tests-trunk-java7/solr/build/solr-core/test/J0/./org.apache.solr.cloud.SyncSliceTest-controljetty-1357185846667/'
[junit4:junit4]   2> 684 T3859 oass.SolrDispatchFilter.init SolrDispatchFilter.init()
[junit4:junit4]   2> 685 T3859 oasc.SolrResourceLoader.locateSolrHome JNDI not configured for solr (NoInitialContextEx)
[junit4:junit4]   2> 685 T3859 oasc.SolrResourceLoader.locateSolrHome using system property solr.solr.home: /usr/home/hudson/hudson-slave/workspace/Lucene-Solr-Tests-trunk-java7/solr/build/solr-core/test/J0/./org.apache.solr.cloud.SyncSliceTest-controljetty-1357185846667
[junit4:junit4]   2> 686 T3859 oasc.CoreContainer$Initializer.initialize looking for solr.xml: /usr/home/hudson/hudson-slave/workspace/Lucene-Solr-Tests-trunk-java7/solr/build/solr-core/test/J0/./org.apache.solr.cloud.SyncSliceTest-controljetty-1357185846667/solr.xml
[junit4:junit4]   2> 686 T3859 oasc.CoreContainer.<init> New CoreContainer 2096718820
[junit4:junit4]   2> 687 T3859 oasc.CoreContainer.load Loading CoreContainer using Solr Home: '/usr/home/hudson/hudson-slave/workspace/Lucene-Solr-Tests-trunk-java7/solr/build/solr-core/test/J0/./org.apache.solr.cloud.SyncSliceTest-controljetty-1357185846667/'
[junit4:junit4]   2> 687 T3859 oasc.SolrResourceLoader.<init> new SolrResourceLoader for directory: '/usr/home/hudson/hudson-slave/workspace/Lucene-Solr-Tests-trunk-java7/solr/build/solr-core/test/J0/./org.apache.solr.cloud.SyncSliceTest-controljetty-1357185846667/'
[junit4:junit4]   2> 730 T3859 oashc.HttpShardHandlerFactory.getParameter Setting socketTimeout to: 30000
[junit4:junit4]   2> 731 T3859 oashc.HttpShardHandlerFactory.getParameter Setting urlScheme to: http://
[junit4:junit4]   2> 732 T3859 oashc.HttpShardHandlerFactory.getParameter Setting connTimeout to: 15000
[junit4:junit4]   2> 732 T3859 oashc.HttpShardHandlerFactory.getParameter Setting maxConnectionsPerHost to: 20
[junit4:junit4]   2> 733 T3859 oashc.HttpShardHandlerFactory.getParameter Setting corePoolSize to: 0
[junit4:junit4]   2> 733 T3859 oashc.HttpShardHandlerFactory.getParameter Setting maximumPoolSize to: 2147483647
[junit4:junit4]   2> 734 T3859 oashc.HttpShardHandlerFactory.getParameter Setting maxThreadIdleTime to: 5
[junit4:junit4]   2> 734 T3859 oashc.HttpShardHandlerFactory.getParameter Setting sizeOfQueue to: -1
[junit4:junit4]   2> 735 T3859 oashc.HttpShardHandlerFactory.getParameter Setting fairnessPolicy to: false
[junit4:junit4]   2> 735 T3859 oascsi.HttpClientUtil.createClient Creating new http client, config:maxConnectionsPerHost=20&maxConnections=10000&socketTimeout=30000&connTimeout=15000&retry=false
[junit4:junit4]   2> 757 T3859 oasc.CoreContainer.load Registering Log Listener
[junit4:junit4]   2> 777 T3859 oasc.CoreContainer.initZooKeeper Zookeeper client=127.0.0.1:28847/solr
[junit4:junit4]   2> 778 T3859 oasc.ZkController.checkChrootPath zkHost includes chroot
[junit4:junit4]   2> 779 T3859 oaz.ZooKeeper.<init> Initiating client connection, connectString=127.0.0.1:28847 sessionTimeout=60000 watcher=org.apache.solr.common.cloud.ConnectionManager@7452d0a7
[junit4:junit4]   2> 780 T3859 oascc.ConnectionManager.waitForConnected Waiting for client to connect to ZooKeeper
[junit4:junit4]   2> 780 T3878 oaz.ClientCnxn$SendThread.logStartConnect Opening socket connection to server localhost/127.0.0.1:28847. Will not attempt to authenticate using SASL (access denied ("javax.security.auth.AuthPermission" "getLoginConfiguration"))
[junit4:junit4]   2> 781 T3878 oaz.ClientCnxn$SendThread.primeConnection Socket connection established to localhost/127.0.0.1:28847, initiating session
[junit4:junit4]   2> 782 T3861 oazs.NIOServerCnxnFactory.run Accepted socket connection from /140.211.11.196:50398
[junit4:junit4]   2> 782 T3861 oazs.ZooKeeperServer.processConnectRequest Client attempting to establish new session at /140.211.11.196:50398
[junit4:junit4]   2> 783 T3863 oazs.ZooKeeperServer.finishSessionInit Established session 0x13bfe948bd50002 with negotiated timeout 20000 for client /140.211.11.196:50398
[junit4:junit4]   2> 783 T3878 oaz.ClientCnxn$SendThread.onConnected Session establishment complete on server localhost/127.0.0.1:28847, sessionid = 0x13bfe948bd50002, negotiated timeout = 20000
[junit4:junit4]   2> 784 T3879 oascc.ConnectionManager.process Watcher org.apache.solr.common.cloud.ConnectionManager@7452d0a7 name:ZooKeeperConnection Watcher:127.0.0.1:28847 got event WatchedEvent state:SyncConnected type:None path:null path:null type:None
[junit4:junit4]   2> 784 T3859 oascc.ConnectionManager.waitForConnected Client is connected to ZooKeeper
[junit4:junit4]   2> 785 T3864 oazs.PrepRequestProcessor.pRequest2Txn Processed session termination for sessionid: 0x13bfe948bd50002
[junit4:junit4]   2> 786 T3879 oaz.ClientCnxn$EventThread.run EventThread shut down
[junit4:junit4]   2> 786 T3861 oazs.NIOServerCnxn.closeSock Closed socket connection for client /140.211.11.196:50398 which had sessionid 0x13bfe948bd50002
[junit4:junit4]   2> 786 T3859 oaz.ZooKeeper.close Session: 0x13bfe948bd50002 closed
[junit4:junit4]   2> 786 T3859 oascsi.HttpClientUtil.createClient Creating new http client, config:maxConnections=500&maxConnectionsPerHost=16&socketTimeout=15000&connTimeout=30000
[junit4:junit4]   2> 797 T3859 oaz.ZooKeeper.<init> Initiating client connection, connectString=127.0.0.1:28847/solr sessionTimeout=30000 watcher=org.apache.solr.common.cloud.ConnectionManager@4f0547f0
[junit4:junit4]   2> 799 T3859 oascc.ConnectionManager.waitForConnected Waiting for client to connect to ZooKeeper
[junit4:junit4]   2> 799 T3880 oaz.ClientCnxn$SendThread.logStartConnect Opening socket connection to server localhost/127.0.0.1:28847. Will not attempt to authenticate using SASL (access denied ("javax.security.auth.AuthPermission" "getLoginConfiguration"))
[junit4:junit4]   2> 799 T3880 oaz.ClientCnxn$SendThread.primeConnection Socket connection established to localhost/127.0.0.1:28847, initiating session
[junit4:junit4]   2> 800 T3861 oazs.NIOServerCnxnFactory.run Accepted socket connection from /140.211.11.196:44965
[junit4:junit4]   2> 800 T3861 oazs.ZooKeeperServer.processConnectRequest Client attempting to establish new session at /140.211.11.196:44965
[junit4:junit4]   2> 801 T3863 oazs.ZooKeeperServer.finishSessionInit Established session 0x13bfe948bd50003 with negotiated timeout 20000 for client /140.211.11.196:44965
[junit4:junit4]   2> 801 T3880 oaz.ClientCnxn$SendThread.onConnected Session establishment complete on server localhost/127.0.0.1:28847, sessionid = 0x13bfe948bd50003, negotiated timeout = 20000
[junit4:junit4]   2> 801 T3881 oascc.ConnectionManager.process Watcher org.apache.solr.common.cloud.ConnectionManager@4f0547f0 name:ZooKeeperConnection Watcher:127.0.0.1:28847/solr got event WatchedEvent state:SyncConnected type:None path:null path:null type:None
[junit4:junit4]   2> 801 T3859 oascc.ConnectionManager.waitForConnected Client is connected to ZooKeeper
[junit4:junit4]   2> 803 T3864 oazs.PrepRequestProcessor.pRequest Got user-level KeeperException when processing sessionid:0x13bfe948bd50003 type:create cxid:0x2 zxid:0x1a txntype:-1 reqpath:n/a Error Path:/solr/overseer Error:KeeperErrorCode = NodeExists for /solr/overseer
[junit4:junit4]   2> 816 T3859 oascc.SolrZkClient.makePath makePath: /live_nodes
[junit4:junit4]   2> 818 T3859 oasc.ZkController.createEphemeralLiveNode Register node as live in ZooKeeper:/live_nodes/127.0.0.1:64615_f%2Fjk
[junit4:junit4]   2> 818 T3864 oazs.PrepRequestProcessor.pRequest Got user-level KeeperException when processing sessionid:0x13bfe948bd50003 type:delete cxid:0x7 zxid:0x1c txntype:-1 reqpath:n/a Error Path:/solr/live_nodes/127.0.0.1:64615_f%2Fjk Error:KeeperErrorCode = NoNode for /solr/live_nodes/127.0.0.1:64615_f%2Fjk
[junit4:junit4]   2> 837 T3859 oascc.SolrZkClient.makePath makePath: /live_nodes/127.0.0.1:64615_f%2Fjk
[junit4:junit4]   2> 840 T3859 oascc.SolrZkClient.makePath makePath: /overseer_elect/election
[junit4:junit4]   2> 860 T3864 oazs.PrepRequestProcessor.pRequest Got user-level KeeperException when processing sessionid:0x13bfe948bd50003 type:delete cxid:0x15 zxid:0x21 txntype:-1 reqpath:n/a Error Path:/solr/overseer_elect/leader Error:KeeperErrorCode = NoNode for /solr/overseer_elect/leader
[junit4:junit4]   2> 869 T3859 oascc.SolrZkClient.makePath makePath: /overseer_elect/leader
[junit4:junit4]   2> 872 T3859 oasc.Overseer.start Overseer (id=88944531618463747-127.0.0.1:64615_f%2Fjk-n_0000000000) starting
[junit4:junit4]   2> 872 T3864 oazs.PrepRequestProcessor.pRequest Got user-level KeeperException when processing sessionid:0x13bfe948bd50003 type:create cxid:0x1a zxid:0x23 txntype:-1 reqpath:n/a Error Path:/solr/overseer Error:KeeperErrorCode = NodeExists for /solr/overseer
[junit4:junit4]   2> 878 T3864 oazs.PrepRequestProcessor.pRequest Got user-level KeeperException when processing sessionid:0x13bfe948bd50003 type:create cxid:0x1b zxid:0x24 txntype:-1 reqpath:n/a Error Path:/solr/overseer Error:KeeperErrorCode = NodeExists for /solr/overseer
[junit4:junit4]   2> 879 T3864 oazs.PrepRequestProcessor.pRequest Got user-level KeeperException when processing sessionid:0x13bfe948bd50003 type:create cxid:0x1c zxid:0x25 txntype:-1 reqpath:n/a Error Path:/solr/overseer Error:KeeperErrorCode = NodeExists for /solr/overseer
[junit4:junit4]   2> 882 T3864 oazs.PrepRequestProcessor.pRequest Got user-level KeeperException when processing sessionid:0x13bfe948bd50003 type:create cxid:0x1d zxid:0x26 txntype:-1 reqpath:n/a Error Path:/solr/overseer Error:KeeperErrorCode = NodeExists for /solr/overseer
[junit4:junit4]   2> 902 T3883 oasc.OverseerCollectionProcessor.run Process current queue of collection messages
[junit4:junit4]   2> 902 T3859 oascc.SolrZkClient.makePath makePath: /clusterstate.json
[junit4:junit4]   2> 916 T3859 oascc.ZkStateReader.createClusterStateWatchersAndUpdate Updating cluster state from ZooKeeper... 
[junit4:junit4]   2> 918 T3882 oasc.Overseer$ClusterStateUpdater.run Starting to work on the main queue
[junit4:junit4]   2> 928 T3884 oasc.CoreContainer.create Creating SolrCore 'collection1' using instanceDir: /usr/home/hudson/hudson-slave/workspace/Lucene-Solr-Tests-trunk-java7/solr/build/solr-core/test/J0/./org.apache.solr.cloud.SyncSliceTest-controljetty-1357185846667/collection1
[junit4:junit4]   2> 928 T3884 oasc.ZkController.createCollectionZkNode Check for collection zkNode:control_collection
[junit4:junit4]   2> 929 T3884 oasc.ZkController.createCollectionZkNode Collection zkNode exists
[junit4:junit4]   2> 929 T3884 oasc.ZkController.readConfigName Load collection config from:/collections/control_collection
[junit4:junit4]   2> 930 T3884 oasc.SolrResourceLoader.<init> new SolrResourceLoader for directory: '/usr/home/hudson/hudson-slave/workspace/Lucene-Solr-Tests-trunk-java7/solr/build/solr-core/test/J0/./org.apache.solr.cloud.SyncSliceTest-controljetty-1357185846667/collection1/'
[junit4:junit4]   2> 931 T3884 oasc.SolrResourceLoader.replaceClassLoader Adding 'file:/usr/home/hudson/hudson-slave/workspace/Lucene-Solr-Tests-trunk-java7/solr/build/solr-core/test/J0/org.apache.solr.cloud.SyncSliceTest-controljetty-1357185846667/collection1/lib/README' to classloader
[junit4:junit4]   2> 931 T3884 oasc.SolrResourceLoader.replaceClassLoader Adding 'file:/usr/home/hudson/hudson-slave/workspace/Lucene-Solr-Tests-trunk-java7/solr/build/solr-core/test/J0/org.apache.solr.cloud.SyncSliceTest-controljetty-1357185846667/collection1/lib/classes/' to classloader
[junit4:junit4]   2> 989 T3884 oasc.SolrConfig.<init> Using Lucene MatchVersion: LUCENE_50
[junit4:junit4]   2> 1074 T3884 oasc.SolrConfig.<init> Loaded SolrConfig: solrconfig.xml
[junit4:junit4]   2> 1175 T3884 oass.IndexSchema.readSchema Reading Solr Schema
[junit4:junit4]   2> 1182 T3884 oass.IndexSchema.readSchema Schema name=test
[junit4:junit4]   2> 1838 T3884 oass.OpenExchangeRatesOrgProvider.init Initialized with rates=open-exchange-rates.json, refreshInterval=1440.
[junit4:junit4]   2> 1879 T3884 oass.IndexSchema.readSchema default search field in schema is text
[junit4:junit4]   2> 1883 T3884 oass.IndexSchema.readSchema unique key field: id
[junit4:junit4]   2> 1894 T3884 oass.FileExchangeRateProvider.reload Reloading exchange rates from file currency.xml
[junit4:junit4]   2> 1898 T3884 oass.FileExchangeRateProvider.reload Reloading exchange rates from file currency.xml
[junit4:junit4]   2> 1903 T3884 oass.OpenExchangeRatesOrgProvider.reload Reloading exchange rates from open-exchange-rates.json
[junit4:junit4]   2> 1904 T3884 oass.OpenExchangeRatesOrgProvider.reload Reloading exchange rates from open-exchange-rates.json
[junit4:junit4]   2> 1905 T3884 oasc.SolrCore.<init> [collection1] Opening new SolrCore at /usr/home/hudson/hudson-slave/workspace/Lucene-Solr-Tests-trunk-java7/solr/build/solr-core/test/J0/./org.apache.solr.cloud.SyncSliceTest-controljetty-1357185846667/collection1/, dataDir=./org.apache.solr.cloud.SyncSliceTest-1357185846221/control/data/
[junit4:junit4]   2> 1905 T3884 oasc.JmxMonitoredMap.<init> JMX monitoring is enabled. Adding Solr mbeans to JMX Server: com.sun.jmx.mbeanserver.JmxMBeanServer@230a52e5
[junit4:junit4]   2> 1906 T3884 oasc.SolrCore.initDirectoryFactory solr.NRTCachingDirectoryFactory
[junit4:junit4]   2> 1907 T3884 oasc.CachingDirectoryFactory.get return new directory for /usr/home/hudson/hudson-slave/workspace/Lucene-Solr-Tests-trunk-java7/solr/build/solr-core/test/J0/./org.apache.solr.cloud.SyncSliceTest-1357185846221/control/data forceNew:false
[junit4:junit4]   2> 1908 T3884 oasc.CachingDirectoryFactory.close Releasing directory:/usr/home/hudson/hudson-slave/workspace/Lucene-Solr-Tests-trunk-java7/solr/build/solr-core/test/J0/./org.apache.solr.cloud.SyncSliceTest-1357185846221/control/data
[junit4:junit4]   2> 1908 T3884 oasc.SolrCore.getNewIndexDir New index directory detected: old=null new=./org.apache.solr.cloud.SyncSliceTest-1357185846221/control/data/index/
[junit4:junit4]   2> 1909 T3884 oasc.SolrCore.initIndex WARNING [collection1] Solr index directory './org.apache.solr.cloud.SyncSliceTest-1357185846221/control/data/index' doesn't exist. Creating new index...
[junit4:junit4]   2> 1910 T3884 oasc.CachingDirectoryFactory.get return new directory for /usr/home/hudson/hudson-slave/workspace/Lucene-Solr-Tests-trunk-java7/solr/build/solr-core/test/J0/./org.apache.solr.cloud.SyncSliceTest-1357185846221/control/data/index forceNew:false
[junit4:junit4]   2> 1926 T3884 oasc.SolrDeletionPolicy.onCommit SolrDeletionPolicy.onCommit: commits:num=1
[junit4:junit4]   2> 		commit{dir=RateLimitedDirectoryWrapper(NRTCachingDirectory(org.apache.lucene.store.NIOFSDirectory@/usr/home/hudson/hudson-slave/workspace/Lucene-Solr-Tests-trunk-java7/solr/build/solr-core/test/J0/org.apache.solr.cloud.SyncSliceTest-1357185846221/control/data/index lockFactory=org.apache.lucene.store.NativeFSLockFactory@24e3cf18; maxCacheMB=48.0 maxMergeSizeMB=4.0)),segFN=segments_1,generation=1,filenames=[segments_1]
[junit4:junit4]   2> 1927 T3884 oasc.SolrDeletionPolicy.updateCommits newest commit = 1[segments_1]
[junit4:junit4]   2> 1928 T3884 oasc.CachingDirectoryFactory.close Releasing directory:/usr/home/hudson/hudson-slave/workspace/Lucene-Solr-Tests-trunk-java7/solr/build/solr-core/test/J0/./org.apache.solr.cloud.SyncSliceTest-1357185846221/control/data/index
[junit4:junit4]   2> 1928 T3884 oasc.SolrCore.initWriters created xml: solr.XMLResponseWriter
[junit4:junit4]   2> 1930 T3884 oasup.UpdateRequestProcessorChain.init inserting DistributedUpdateProcessorFactory into updateRequestProcessorChain "dedupe"
[junit4:junit4]   2> 1930 T3884 oasup.UpdateRequestProcessorChain.init inserting DistributedUpdateProcessorFactory into updateRequestProcessorChain "dedupe-allfields"
[junit4:junit4]   2> 1930 T3884 oasup.UpdateRequestProcessorChain.init inserting DistributedUpdateProcessorFactory into updateRequestProcessorChain "stored_sig"
[junit4:junit4]   2> 1931 T3884 oasup.UpdateRequestProcessorChain.init inserting DistributedUpdateProcessorFactory into updateRequestProcessorChain "uniq-fields"
[junit4:junit4]   2> 1931 T3884 oasup.UpdateRequestProcessorChain.init inserting DistributedUpdateProcessorFactory into updateRequestProcessorChain "distrib-dup-test-chain-implicit"
[junit4:junit4]   2> 1932 T3884 oasc.RequestHandlers.initHandlersFromConfig adding lazy requestHandler: solr.ReplicationHandler
[junit4:junit4]   2> 1932 T3884 oasc.RequestHandlers.initHandlersFromConfig created /replication: solr.ReplicationHandler
[junit4:junit4]   2> 1932 T3884 oasc.RequestHandlers.initHandlersFromConfig created standard: solr.StandardRequestHandler
[junit4:junit4]   2> 1933 T3884 oasc.RequestHandlers.initHandlersFromConfig created /get: solr.RealTimeGetHandler
[junit4:junit4]   2> 1933 T3884 oasc.RequestHandlers.initHandlersFromConfig created dismax: solr.SearchHandler
[junit4:junit4]   2> 1934 T3884 oasc.RequestHandlers.initHandlersFromConfig created mock: org.apache.solr.core.MockQuerySenderListenerReqHandler
[junit4:junit4]   2> 1934 T3884 oasc.RequestHandlers.initHandlersFromConfig created /admin/: org.apache.solr.handler.admin.AdminHandlers
[junit4:junit4]   2> 1934 T3884 oasc.RequestHandlers.initHandlersFromConfig created defaults: solr.StandardRequestHandler
[junit4:junit4]   2> 1935 T3884 oasc.RequestHandlers.initHandlersFromConfig adding lazy requestHandler: solr.StandardRequestHandler
[junit4:junit4]   2> 1935 T3884 oasc.RequestHandlers.initHandlersFromConfig created lazy: solr.StandardRequestHandler
[junit4:junit4]   2> 1935 T3884 oasc.RequestHandlers.initHandlersFromConfig created /update: solr.UpdateRequestHandler
[junit4:junit4]   2> 1936 T3884 oasc.RequestHandlers.initHandlersFromConfig created /terms: org.apache.solr.handler.component.SearchHandler
[junit4:junit4]   2> 1936 T3884 oasc.RequestHandlers.initHandlersFromConfig created spellCheckCompRH: org.apache.solr.handler.component.SearchHandler
[junit4:junit4]   2> 1937 T3884 oasc.RequestHandlers.initHandlersFromConfig created spellCheckCompRH_Direct: org.apache.solr.handler.component.SearchHandler
[junit4:junit4]   2> 1937 T3884 oasc.RequestHandlers.initHandlersFromConfig created spellCheckWithWordbreak: org.apache.solr.handler.component.SearchHandler
[junit4:junit4]   2> 1937 T3884 oasc.RequestHandlers.initHandlersFromConfig created spellCheckWithWordbreak_Direct: org.apache.solr.handler.component.SearchHandler
[junit4:junit4]   2> 1938 T3884 oasc.RequestHandlers.initHandlersFromConfig created spellCheckCompRH1: org.apache.solr.handler.component.SearchHandler
[junit4:junit4]   2> 1938 T3884 oasc.RequestHandlers.initHandlersFromConfig created mltrh: org.apache.solr.handler.component.SearchHandler
[junit4:junit4]   2> 1938 T3884 oasc.RequestHandlers.initHandlersFromConfig created tvrh: org.apache.solr.handler.component.SearchHandler
[junit4:junit4]   2> 1939 T3884 oasc.RequestHandlers.initHandlersFromConfig created /mlt: solr.MoreLikeThisHandler
[junit4:junit4]   2> 1939 T3884 oasc.RequestHandlers.initHandlersFromConfig created /debug/dump: solr.DumpRequestHandler
[junit4:junit4]   2> 1951 T3884 oashl.XMLLoader.init xsltCacheLifetimeSeconds=60
[junit4:junit4]   2> 1987 T3884 oasc.SolrCore.initDeprecatedSupport WARNING solrconfig.xml uses deprecated <admin/gettableFiles>, Please update your config to use the ShowFileRequestHandler.
[junit4:junit4]   2> 1988 T3884 oasc.SolrCore.initDeprecatedSupport WARNING adding ShowFileRequestHandler with hidden files: [SCHEMA.XML, OLD_SYNONYMS.TXT, STOPWORDS.TXT, PROTWORDS.TXT, OPEN-EXCHANGE-RATES.JSON, SYNONYMS.TXT, CURRENCY.XML, MAPPING-ISOLATIN1ACCENT.TXT]
[junit4:junit4]   2> 1990 T3884 oasc.CachingDirectoryFactory.close Releasing directory:/usr/home/hudson/hudson-slave/workspace/Lucene-Solr-Tests-trunk-java7/solr/build/solr-core/test/J0/./org.apache.solr.cloud.SyncSliceTest-1357185846221/control/data
[junit4:junit4]   2> 2032 T3884 oass.SolrIndexSearcher.<init> Opening Searcher@2689a76f main
[junit4:junit4]   2> 2034 T3884 oasu.CommitTracker.<init> Hard AutoCommit: disabled
[junit4:junit4]   2> 2034 T3884 oasu.CommitTracker.<init> Soft AutoCommit: disabled
[junit4:junit4]   2> 2034 T3884 oashc.SpellCheckComponent.inform Initializing spell checkers
[junit4:junit4]   2> 2087 T3884 oass.DirectSolrSpellChecker.init init: {name=direct,classname=DirectSolrSpellChecker,field=lowerfilt,minQueryLength=3}
[junit4:junit4]   2> 2160 T3885 oasc.SolrCore.registerSearcher [collection1] Registered new searcher Searcher@2689a76f main{StandardDirectoryReader(segments_1:1)}
[junit4:junit4]   2> 2163 T3884 oasc.ZkController.publish publishing core=collection1 state=down
[junit4:junit4]   2> 2164 T3884 oasc.ZkController.publish numShards not found on descriptor - reading it from system property
[junit4:junit4]   2> 2164 T3864 oazs.PrepRequestProcessor.pRequest Got user-level KeeperException when processing sessionid:0x13bfe948bd50003 type:create cxid:0x50 zxid:0x29 txntype:-1 reqpath:n/a Error Path:/solr/overseer/queue Error:KeeperErrorCode = NoNode for /solr/overseer/queue
[junit4:junit4]   2> 2421 T3882 oascc.ZkStateReader.updateClusterState Updating cloud state from ZooKeeper... 
[junit4:junit4]   2> 2422 T3882 oasc.Overseer$ClusterStateUpdater.updateState Update state numShards=1 message={
[junit4:junit4]   2> 	  "operation":"state",
[junit4:junit4]   2> 	  "numShards":"1",
[junit4:junit4]   2> 	  "shard":null,
[junit4:junit4]   2> 	  "roles":null,
[junit4:junit4]   2> 	  "state":"down",
[junit4:junit4]   2> 	  "core":"collection1",
[junit4:junit4]   2> 	  "collection":"control_collection",
[junit4:junit4]   2> 	  "node_name":"127.0.0.1:64615_f%2Fjk",
[junit4:junit4]   2> 	  "base_url":"http://127.0.0.1:64615/f/jk"}
[junit4:junit4]   2> 2422 T3882 oasc.Overseer$ClusterStateUpdater.createCollection Create collection control_collection with numShards 1
[junit4:junit4]   2> 2422 T3882 oasc.Overseer$ClusterStateUpdater.updateState Assigning new node to shard shard=shard1
[junit4:junit4]   2> 2422 T3864 oazs.PrepRequestProcessor.pRequest Got user-level KeeperException when processing sessionid:0x13bfe948bd50003 type:create cxid:0x58 zxid:0x2c txntype:-1 reqpath:n/a Error Path:/solr/overseer/queue-work Error:KeeperErrorCode = NoNode for /solr/overseer/queue-work
[junit4:junit4]   2> 2441 T3881 oascc.ZkStateReader$2.process A cluster state change: WatchedEvent state:SyncConnected type:NodeDataChanged path:/clusterstate.json, has occurred - updating... (live nodes size: 1)
[junit4:junit4]   2> 3177 T3884 oasc.CoreContainer.registerCore registering core: collection1
[junit4:junit4]   2> 3177 T3884 oasc.ZkController.register Register replica - core:collection1 address:http://127.0.0.1:64615/f/jk collection:control_collection shard:shard1
[junit4:junit4]   2> 3178 T3884 oascc.SolrZkClient.makePath makePath: /collections/control_collection/leader_elect/shard1/election
[junit4:junit4]   2> 3212 T3864 oazs.PrepRequestProcessor.pRequest Got user-level KeeperException when processing sessionid:0x13bfe948bd50003 type:delete cxid:0x72 zxid:0x36 txntype:-1 reqpath:n/a Error Path:/solr/collections/control_collection/leaders Error:KeeperErrorCode = NoNode for /solr/collections/control_collection/leaders
[junit4:junit4]   2> 3213 T3884 oasc.ShardLeaderElectionContext.runLeaderProcess Running the leader process.
[junit4:junit4]   2> 3213 T3864 oazs.PrepRequestProcessor.pRequest Got user-level KeeperException when processing sessionid:0x13bfe948bd50003 type:create cxid:0x73 zxid:0x37 txntype:-1 reqpath:n/a Error Path:/solr/overseer Error:KeeperErrorCode = NodeExists for /solr/overseer
[junit4:junit4]   2> 3215 T3884 oasc.ShardLeaderElectionContext.waitForReplicasToComeUp Enough replicas found to continue.
[junit4:junit4]   2> 3215 T3884 oasc.ShardLeaderElectionContext.runLeaderProcess I may be the new leader - try and sync
[junit4:junit4]   2> 3216 T3884 oasc.SyncStrategy.sync Sync replicas to http://127.0.0.1:64615/f/jk/collection1/
[junit4:junit4]   2> 3216 T3884 oasc.SyncStrategy.syncReplicas Sync Success - now sync replicas to me
[junit4:junit4]   2> 3216 T3884 oasc.SyncStrategy.syncToMe http://127.0.0.1:64615/f/jk/collection1/ has no replicas
[junit4:junit4]   2> 3216 T3884 oasc.ShardLeaderElectionContext.runLeaderProcess I am the new leader: http://127.0.0.1:64615/f/jk/collection1/
[junit4:junit4]   2> 3217 T3884 oascc.SolrZkClient.makePath makePath: /collections/control_collection/leaders/shard1
[junit4:junit4]   2> 3224 T3864 oazs.PrepRequestProcessor.pRequest Got user-level KeeperException when processing sessionid:0x13bfe948bd50003 type:create cxid:0x7d zxid:0x3b txntype:-1 reqpath:n/a Error Path:/solr/overseer Error:KeeperErrorCode = NodeExists for /solr/overseer
[junit4:junit4]   2> 3951 T3882 oascc.ZkStateReader.updateClusterState Updating cloud state from ZooKeeper... 
[junit4:junit4]   2> 4008 T3881 oascc.ZkStateReader$2.process A cluster state change: WatchedEvent state:SyncConnected type:NodeDataChanged path:/clusterstate.json, has occurred - updating... (live nodes size: 1)
[junit4:junit4]   2> 4050 T3884 oasc.ZkController.register We are http://127.0.0.1:64615/f/jk/collection1/ and leader is http://127.0.0.1:64615/f/jk/collection1/
[junit4:junit4]   2> 4050 T3884 oasc.ZkController.register No LogReplay needed for core=collection1 baseURL=http://127.0.0.1:64615/f/jk
[junit4:junit4]   2> 4050 T3884 oasc.ZkController.checkRecovery I am the leader, no recovery necessary
[junit4:junit4]   2> 4050 T3884 oasc.ZkController.publish publishing core=collection1 state=active
[junit4:junit4]   2> 4050 T3884 oasc.ZkController.publish numShards not found on descriptor - reading it from system property
[junit4:junit4]   2> 4053 T3884 oascc.ZkStateReader.updateClusterState Updating cloud state from ZooKeeper... 
[junit4:junit4]   2> 4053 T3859 oass.SolrDispatchFilter.init user.dir=/usr/home/hudson/hudson-slave/workspace/Lucene-Solr-Tests-trunk-java7/solr/build/solr-core/test/J0
[junit4:junit4]   2> 4054 T3859 oass.SolrDispatchFilter.init SolrDispatchFilter.init() done
[junit4:junit4]   2> 4055 T3859 oascsi.HttpClientUtil.createClient Creating new http client, config:maxConnections=128&maxConnectionsPerHost=32&followRedirects=false
[junit4:junit4]   2> 4072 T3859 oascsi.HttpClientUtil.createClient Creating new http client, config:
[junit4:junit4]   2> 4091 T3859 oaz.ZooKeeper.<init> Initiating client connection, connectString=127.0.0.1:28847/solr sessionTimeout=10000 watcher=org.apache.solr.common.cloud.ConnectionManager@69bad1d0
[junit4:junit4]   2> 4093 T3859 oascc.ConnectionManager.waitForConnected Waiting for client to connect to ZooKeeper
[junit4:junit4]   2> 4093 T3886 oaz.ClientCnxn$SendThread.logStartConnect Opening socket connection to server localhost/127.0.0.1:28847. Will not attempt to authenticate using SASL (access denied ("javax.security.auth.AuthPermission" "getLoginConfiguration"))
[junit4:junit4]   2> 4093 T3886 oaz.ClientCnxn$SendThread.primeConnection Socket connection established to localhost/127.0.0.1:28847, initiating session
[junit4:junit4]   2> 4094 T3861 oazs.NIOServerCnxnFactory.run Accepted socket connection from /140.211.11.196:41813
[junit4:junit4]   2> 4094 T3861 oazs.ZooKeeperServer.processConnectRequest Client attempting to establish new session at /140.211.11.196:41813
[junit4:junit4]   2> 4098 T3863 oazs.ZooKeeperServer.finishSessionInit Established session 0x13bfe948bd50004 with negotiated timeout 10000 for client /140.211.11.196:41813
[junit4:junit4]   2> 4098 T3886 oaz.ClientCnxn$SendThread.onConnected Session establishment complete on server localhost/127.0.0.1:28847, sessionid = 0x13bfe948bd50004, negotiated timeout = 10000
[junit4:junit4]   2> 4099 T3887 oascc.ConnectionManager.process Watcher org.apache.solr.common.cloud.ConnectionManager@69bad1d0 name:ZooKeeperConnection Watcher:127.0.0.1:28847/solr got event WatchedEvent state:SyncConnected type:None path:null path:null type:None
[junit4:junit4]   2> 4099 T3859 oascc.ConnectionManager.waitForConnected Client is connected to ZooKeeper
[junit4:junit4]   2> 4100 T3859 oascc.ZkStateReader.createClusterStateWatchersAndUpdate Updating cluster state from ZooKeeper... 
[junit4:junit4]   2> 4101 T3859 oasc.ChaosMonkey.monkeyLog monkey: init - expire sessions:true cause connection loss:true
[junit4:junit4]   2> 4502 T3859 oejs.Server.doStart jetty-8.1.8.v20121106
[junit4:junit4]   2> 4505 T3859 oejs.AbstractConnector.doStart Started SocketConnector@127.0.0.1:50746
[junit4:junit4]   2> 4506 T3859 oasc.SolrResourceLoader.locateSolrHome JNDI not configured for solr (NoInitialContextEx)
[junit4:junit4]   2> 4506 T3859 oasc.SolrResourceLoader.locateSolrHome using system property solr.solr.home: /usr/home/hudson/hudson-slave/workspace/Lucene-Solr-Tests-trunk-java7/solr/build/solr-core/test/J0/./org.apache.solr.cloud.SyncSliceTest-jetty1-1357185850315
[junit4:junit4]   2> 4506 T3859 oasc.SolrResourceLoader.<init> new SolrResourceLoader for deduced Solr Home: '/usr/home/hudson/hudson-slave/workspace/Lucene-Solr-Tests-trunk-java7/solr/build/solr-core/test/J0/./org.apache.solr.cloud.SyncSliceTest-jetty1-1357185850315/'
[junit4:junit4]   2> 4556 T3859 oass.SolrDispatchFilter.init SolrDispatchFilter.init()
[junit4:junit4]   2> 4557 T3859 oasc.SolrResourceLoader.locateSolrHome JNDI not configured for solr (NoInitialContextEx)
[junit4:junit4]   2> 4557 T3859 oasc.SolrResourceLoader.locateSolrHome using system property solr.solr.home: /usr/home/hudson/hudson-slave/workspace/Lucene-Solr-Tests-trunk-java7/solr/build/solr-core/test/J0/./org.apache.solr.cloud.SyncSliceTest-jetty1-1357185850315
[junit4:junit4]   2> 4558 T3859 oasc.CoreContainer$Initializer.initialize looking for solr.xml: /usr/home/hudson/hudson-slave/workspace/Lucene-Solr-Tests-trunk-java7/solr/build/solr-core/test/J0/./org.apache.solr.cloud.SyncSliceTest-jetty1-1357185850315/solr.xml
[junit4:junit4]   2> 4558 T3859 oasc.CoreContainer.<init> New CoreContainer 1241770584
[junit4:junit4]   2> 4558 T3859 oasc.CoreContainer.load Loading CoreContainer using Solr Home: '/usr/home/hudson/hudson-slave/workspace/Lucene-Solr-Tests-trunk-java7/solr/build/solr-core/test/J0/./org.apache.solr.cloud.SyncSliceTest-jetty1-1357185850315/'
[junit4:junit4]   2> 4559 T3859 oasc.SolrResourceLoader.<init> new SolrResourceLoader for directory: '/usr/home/hudson/hudson-slave/workspace/Lucene-Solr-Tests-trunk-java7/solr/build/solr-core/test/J0/./org.apache.solr.cloud.SyncSliceTest-jetty1-1357185850315/'
[junit4:junit4]   2> 4580 T3859 oashc.HttpShardHandlerFactory.getParameter Setting socketTimeout to: 30000
[junit4:junit4]   2> 4581 T3859 oashc.HttpShardHandlerFactory.getParameter Setting urlScheme to: http://
[junit4:junit4]   2> 4581 T3859 oashc.HttpShardHandlerFactory.getParameter Setting connTimeout to: 15000
[junit4:junit4]   2> 4582 T3859 oashc.HttpShardHandlerFactory.getParameter Setting maxConnectionsPerHost to: 20
[junit4:junit4]   2> 4582 T3859 oashc.HttpShardHandlerFactory.getParameter Setting corePoolSize to: 0
[junit4:junit4]   2> 4582 T3859 oashc.HttpShardHandlerFactory.getParameter Setting maximumPoolSize to: 2147483647
[junit4:junit4]   2> 4582 T3859 oashc.HttpShardHandlerFactory.getParameter Setting maxThreadIdleTime to: 5
[junit4:junit4]   2> 4583 T3859 oashc.HttpShardHandlerFactory.getParameter Setting sizeOfQueue to: -1
[junit4:junit4]   2> 4583 T3859 oashc.HttpShardHandlerFactory.getParameter Setting fairnessPolicy to: false
[junit4:junit4]   2> 4584 T3859 oascsi.HttpClientUtil.createClient Creating new http client, config:maxConnectionsPerHost=20&maxConnections=10000&socketTimeout=30000&connTimeout=15000&retry=false
[junit4:junit4]   2> 4598 T3859 oasc.CoreContainer.load Registering Log Listener
[junit4:junit4]   2> 4611 T3859 oasc.CoreContainer.initZooKeeper Zookeeper client=127.0.0.1:28847/solr
[junit4:junit4]   2> 4612 T3859 oasc.ZkController.checkChrootPath zkHost includes chroot
[junit4:junit4]   2> 4612 T3859 oaz.ZooKeeper.<init> Initiating client connection, connectString=127.0.0.1:28847 sessionTimeout=60000 watcher=org.apache.solr.common.cloud.ConnectionManager@17f4c52d
[junit4:junit4]   2> 4613 T3859 oascc.ConnectionManager.waitForConnected Waiting for client to connect to ZooKeeper
[junit4:junit4]   2> 4614 T3897 oaz.ClientCnxn$SendThread.logStartConnect Opening socket connection to server localhost/127.0.0.1:28847. Will not attempt to authenticate using SASL (access denied ("javax.security.auth.AuthPermission" "getLoginConfiguration"))
[junit4:junit4]   2> 4615 T3897 oaz.ClientCnxn$SendThread.primeConnection Socket connection established to localhost/127.0.0.1:28847, initiating session
[junit4:junit4]   2> 4615 T3861 oazs.NIOServerCnxnFactory.run Accepted socket connection from /140.211.11.196:41322
[junit4:junit4]   2> 4615 T3861 oazs.ZooKeeperServer.processConnectRequest Client attempting to establish new session at /140.211.11.196:41322
[junit4:junit4]   2> 4621 T3863 oazs.ZooKeeperServer.finishSessionInit Established session 0x13bfe948bd50005 with negotiated timeout 20000 for client /140.211.11.196:41322
[junit4:junit4]   2> 4621 T3897 oaz.ClientCnxn$SendThread.onConnected Session establishment complete on server localhost/127.0.0.1:28847, sessionid = 0x13bfe948bd50005, negotiated timeout = 20000
[junit4:junit4]   2> 4621 T3898 oascc.ConnectionManager.process Watcher org.apache.solr.common.cloud.ConnectionManager@17f4c52d name:ZooKeeperConnection Watcher:127.0.0.1:28847 got event WatchedEvent state:SyncConnected type:None path:null path:null type:None
[junit4:junit4]   2> 4621 T3859 oascc.ConnectionManager.waitForConnected Client is connected to ZooKeeper
[junit4:junit4]   2> 4622 T3864 oazs.PrepRequestProcessor.pRequest2Txn Processed session termination for sessionid: 0x13bfe948bd50005
[junit4:junit4]   2> 4673 T3898 oaz.ClientCnxn$EventThread.run EventThread shut down
[junit4:junit4]   2> 4674 T3861 oazs.NIOServerCnxn.closeSock Closed socket connection for client /140.211.11.196:41322 which had sessionid 0x13bfe948bd50005
[junit4:junit4]   2> 4673 T3859 oaz.ZooKeeper.close Session: 0x13bfe948bd50005 closed
[junit4:junit4]   2> 4674 T3859 oascsi.HttpClientUtil.createClient Creating new http client, config:maxConnections=500&maxConnectionsPerHost=16&socketTimeout=15000&connTimeout=30000
[junit4:junit4]   2> 4682 T3859 oaz.ZooKeeper.<init> Initiating client connection, connectString=127.0.0.1:28847/solr sessionTimeout=30000 watcher=org.apache.solr.common.cloud.ConnectionManager@2675b8d4
[junit4:junit4]   2> 4683 T3859 oascc.ConnectionManager.waitForConnected Waiting for client to connect to ZooKeeper
[junit4:junit4]   2> 4683 T3899 oaz.ClientCnxn$SendThread.logStartConnect Opening socket connection to server localhost/127.0.0.1:28847. Will not attempt to authenticate using SASL (access denied ("javax.security.auth.AuthPermission" "getLoginConfiguration"))
[junit4:junit4]   2> 4683 T3899 oaz.ClientCnxn$SendThread.primeConnection Socket connection established to localhost/127.0.0.1:28847, initiating session
[junit4:junit4]   2> 4684 T3861 oazs.NIOServerCnxnFactory.run Accepted socket connection from /140.211.11.196:27998
[junit4:junit4]   2> 4684 T3861 oazs.ZooKeeperServer.processConnectRequest Client attempting to establish new session at /140.211.11.196:27998
[junit4:junit4]   2> 4693 T3863 oazs.ZooKeeperServer.finishSessionInit Established session 0x13bfe948bd50006 with negotiated timeout 20000 for client /140.211.11.196:27998
[junit4:junit4]   2> 4693 T3899 oaz.ClientCnxn$SendThread.onConnected Session establishment complete on server localhost/127.0.0.1:28847, sessionid = 0x13bfe948bd50006, negotiated timeout = 20000
[junit4:junit4]   2> 4693 T3900 oascc.ConnectionManager.process Watcher org.apache.solr.common.cloud.ConnectionManager@2675b8d4 name:ZooKeeperConnection Watcher:127.0.0.1:28847/solr got event WatchedEvent state:SyncConnected type:None path:null path:null type:None
[junit4:junit4]   2> 4693 T3859 oascc.ConnectionManager.waitForConnected Client is connected to ZooKeeper
[junit4:junit4]   2> 4694 T3864 oazs.PrepRequestProcessor.pRequest Got user-level KeeperException when processing sessionid:0x13bfe948bd50006 type:create cxid:0x1 zxid:0x49 txntype:-1 reqpath:n/a Error Path:/solr/overseer Error:KeeperErrorCode = NodeExists for /solr/overseer
[junit4:junit4]   2> 4741 T3864 oazs.PrepRequestProcessor.pRequest Got user-level KeeperException when processing sessionid:0x13bfe948bd50006 type:create cxid:0x2 zxid:0x4a txntype:-1 reqpath:n/a Error Path:/solr/overseer Error:KeeperErrorCode = NodeExists for /solr/overseer
[junit4:junit4]   2> 4746 T3859 oasc.ZkController.createEphemeralLiveNode Register node as live in ZooKeeper:/live_nodes/127.0.0.1:50746_f%2Fjk
[junit4:junit4]   2> 4746 T3864 oazs.PrepRequestProcessor.pRequest Got user-level KeeperException when processing sessionid:0x13bfe948bd50006 type:delete cxid:0x4 zxid:0x4b txntype:-1 reqpath:n/a Error Path:/solr/live_nodes/127.0.0.1:50746_f%2Fjk Error:KeeperErrorCode = NoNode for /solr/live_nodes/127.0.0.1:50746_f%2Fjk
[junit4:junit4]   2> 4747 T3859 oascc.SolrZkClient.makePath makePath: /live_nodes/127.0.0.1:50746_f%2Fjk
[junit4:junit4]   2> 4763 T3887 oascc.ZkStateReader$3.process Updating live nodes... (2)
[junit4:junit4]   2> 4763 T3881 oascc.ZkStateReader$3.process Updating live nodes... (2)
[junit4:junit4]   2> 4764 T3881 oascc.ZkStateReader$2.process A cluster state change: WatchedEvent state:SyncConnected type:NodeChildrenChanged path:/live_nodes, has occurred - updating... (live nodes size: 2)
[junit4:junit4]   2> 4766 T3859 oascc.ZkStateReader.createClusterStateWatchersAndUpdate Updating cluster state from ZooKeeper... 
[junit4:junit4]   2> 4772 T3901 oasc.CoreContainer.create Creating SolrCore 'collection1' using instanceDir: /usr/home/hudson/hudson-slave/workspace/Lucene-Solr-Tests-trunk-java7/solr/build/solr-core/test/J0/./org.apache.solr.cloud.SyncSliceTest-jetty1-1357185850315/collection1
[junit4:junit4]   2> 4772 T3901 oasc.ZkController.createCollectionZkNode Check for collection zkNode:collection1
[junit4:junit4]   2> 4773 T3901 oasc.ZkController.createCollectionZkNode Collection zkNode exists
[junit4:junit4]   2> 4773 T3901 oasc.ZkController.readConfigName Load collection config from:/collections/collection1
[junit4:junit4]   2> 4774 T3901 oasc.SolrResourceLoader.<init> new SolrResourceLoader for directory: '/usr/home/hudson/hudson-slave/workspace/Lucene-Solr-Tests-trunk-java7/solr/build/solr-core/test/J0/./org.apache.solr.cloud.SyncSliceTest-jetty1-1357185850315/collection1/'
[junit4:junit4]   2> 4775 T3901 oasc.SolrResourceLoader.replaceClassLoader Adding 'file:/usr/home/hudson/hudson-slave/workspace/Lucene-Solr-Tests-trunk-java7/solr/build/solr-core/test/J0/org.apache.solr.cloud.SyncSliceTest-jetty1-1357185850315/collection1/lib/classes/' to classloader
[junit4:junit4]   2> 4776 T3901 oasc.SolrResourceLoader.replaceClassLoader Adding 'file:/usr/home/hudson/hudson-slave/workspace/Lucene-Solr-Tests-trunk-java7/solr/build/solr-core/test/J0/org.apache.solr.cloud.SyncSliceTest-jetty1-1357185850315/collection1/lib/README' to classloader
[junit4:junit4]   2> 4837 T3901 oasc.SolrConfig.<init> Using Lucene MatchVersion: LUCENE_50
[junit4:junit4]   2> 4890 T3901 oasc.SolrConfig.<init> Loaded SolrConfig: solrconfig.xml
[junit4:junit4]   2> 4991 T3901 oass.IndexSchema.readSchema Reading Solr Schema
[junit4:junit4]   2> 4996 T3901 oass.IndexSchema.readSchema Schema name=test
[junit4:junit4]   2> 5529 T3901 oass.OpenExchangeRatesOrgProvider.init Initialized with rates=open-exchange-rates.json, refreshInterval=1440.
[junit4:junit4]   2> 5530 T3882 oascc.ZkStateReader.updateClusterState Updating cloud state from ZooKeeper... 
[junit4:junit4]   2> 5531 T3882 oasc.Overseer$ClusterStateUpdater.updateState Update state numShards=1 message={
[junit4:junit4]   2> 	  "operation":"state",
[junit4:junit4]   2> 	  "numShards":"1",
[junit4:junit4]   2> 	  "shard":"shard1",
[junit4:junit4]   2> 	  "roles":null,
[junit4:junit4]   2> 	  "state":"active",
[junit4:junit4]   2> 	  "core":"collection1",
[junit4:junit4]   2> 	  "collection":"control_collection",
[junit4:junit4]   2> 	  "node_name":"127.0.0.1:64615_f%2Fjk",
[junit4:junit4]   2> 	  "base_url":"http://127.0.0.1:64615/f/jk"}
[junit4:junit4]   2> 5536 T3887 oascc.ZkStateReader$2.process A cluster state change: WatchedEvent state:SyncConnected type:NodeDataChanged path:/clusterstate.json, has occurred - updating... (live nodes size: 2)
[junit4:junit4]   2> 5536 T3881 oascc.ZkStateReader$2.process A cluster state change: WatchedEvent state:SyncConnected type:NodeDataChanged path:/clusterstate.json, has occurred - updating... (live nodes size: 2)
[junit4:junit4]   2> 5536 T3900 oascc.ZkStateReader$2.process A cluster state change: WatchedEvent state:SyncConnected type:NodeDataChanged path:/clusterstate.json, has occurred - updating... (live nodes size: 2)
[junit4:junit4]   2> 5538 T3901 oass.IndexSchema.readSchema default search field in schema is text
[junit4:junit4]   2> 5541 T3901 oass.IndexSchema.readSchema unique key field: id
[junit4:junit4]   2> 5561 T3901 oass.FileExchangeRateProvider.reload Reloading exchange rates from file currency.xml
[junit4:junit4]   2> 5564 T3901 oass.FileExchangeRateProvider.reload Reloading exchange rates from file currency.xml
[junit4:junit4]   2> 5568 T3901 oass.OpenExchangeRatesOrgProvider.reload Reloading exchange rates from open-exchange-rates.json
[junit4:junit4]   2> 5569 T3901 oass.OpenExchangeRatesOrgProvider.reload Reloading exchange rates from open-exchange-rates.json
[junit4:junit4]   2> 5570 T3901 oasc.SolrCore.<init> [collection1] Opening new SolrCore at /usr/home/hudson/hudson-slave/workspace/Lucene-Solr-Tests-trunk-java7/solr/build/solr-core/test/J0/./org.apache.solr.cloud.SyncSliceTest-jetty1-1357185850315/collection1/, dataDir=./org.apache.solr.cloud.SyncSliceTest-1357185846221/jetty1/
[junit4:junit4]   2> 5570 T3901 oasc.JmxMonitoredMap.<init> JMX monitoring is enabled. Adding Solr mbeans to JMX Server: com.sun.jmx.mbeanserver.JmxMBeanServer@230a52e5
[junit4:junit4]   2> 5570 T3901 oasc.SolrCore.initDirectoryFactory solr.NRTCachingDirectoryFactory
[junit4:junit4]   2> 5571 T3901 oasc.CachingDirectoryFactory.get return new directory for /usr/home/hudson/hudson-slave/workspace/Lucene-Solr-Tests-trunk-java7/solr/build/solr-core/test/J0/./org.apache.solr.cloud.SyncSliceTest-1357185846221/jetty1 forceNew:false
[junit4:junit4]   2> 5571 T3901 oasc.CachingDirectoryFactory.close Releasing directory:/usr/home/hudson/hudson-slave/workspace/Lucene-Solr-Tests-trunk-java7/solr/build/solr-core/test/J0/./org.apache.solr.cloud.SyncSliceTest-1357185846221/jetty1
[junit4:junit4]   2> 5571 T3901 oasc.SolrCore.getNewIndexDir New index directory detected: old=null new=./org.apache.solr.cloud.SyncSliceTest-1357185846221/jetty1/index/
[junit4:junit4]   2> 5572 T3901 oasc.SolrCore.initIndex WARNING [collection1] Solr index directory './org.apache.solr.cloud.SyncSliceTest-1357185846221/jetty1/index' doesn't exist. Creating new index...
[junit4:junit4]   2> 5573 T3901 oasc.CachingDirectoryFactory.get return new directory for /usr/home/hudson/hudson-slave/workspace/Lucene-Solr-Tests-trunk-java7/solr/build/solr-core/test/J0/./org.apache.solr.cloud.SyncSliceTest-1357185846221/jetty1/index forceNew:false
[junit4:junit4]   2> 5589 T3901 oasc.SolrDeletionPolicy.onCommit SolrDeletionPolicy.onCommit: commits:num=1
[junit4:junit4]   2> 		commit{dir=RateLimitedDirectoryWrapper(NRTCachingDirectory(org.apache.lucene.store.NIOFSDirectory@/usr/home/hudson/hudson-slave/workspace/Lucene-Solr-Tests-trunk-java7/solr/build/solr-core/test/J0/org.apache.solr.cloud.SyncSliceTest-1357185846221/jetty1/index lockFactory=org.apache.lucene.store.NativeFSLockFactory@14ce370c; maxCacheMB=48.0 maxMergeSizeMB=4.0)),segFN=segments_1,generation=1,filenames=[segments_1]
[junit4:junit4]   2> 5590 T3901 oasc.SolrDeletionPolicy.updateCommits newest commit = 1[segments_1]
[junit4:junit4]   2> 5592 T3901 oasc.CachingDirectoryFactory.close Releasing directory:/usr/home/hudson/hudson-slave/workspace/Lucene-Solr-Tests-trunk-java7/solr/build/solr-core/test/J0/./org.apache.solr.cloud.SyncSliceTest-1357185846221/jetty1/index
[junit4:junit4]   2> 5592 T3901 oasc.SolrCore.initWriters created xml: solr.XMLResponseWriter
[junit4:junit4]   2> 5595 T3901 oasup.UpdateRequestProcessorChain.init inserting DistributedUpdateProcessorFactory into updateRequestProcessorChain "dedupe"
[junit4:junit4]   2> 5596 T3901 oasup.UpdateRequestProcessorChain.init inserting DistributedUpdateProcessorFactory into updateRequestProcessorChain "dedupe-allfields"
[junit4:junit4]   2> 5596 T3901 oasup.UpdateRequestProcessorChain.init inserting DistributedUpdateProcessorFactory into updateRequestProcessorChain "stored_sig"
[junit4:junit4]   2> 5597 T3901 oasup.UpdateRequestProcessorChain.init inserting DistributedUpdateProcessorFactory into updateRequestProcessorChain "uniq-fields"
[junit4:junit4]   2> 5598 T3901 oasup.UpdateRequestProcessorChain.init inserting DistributedUpdateProcessorFactory into updateRequestProcessorChain "distrib-dup-test-chain-implicit"
[junit4:junit4]   2> 5598 T3901 oasc.RequestHandlers.initHandlersFromConfig adding lazy requestHandler: solr.ReplicationHandler
[junit4:junit4]   2> 5599 T3901 oasc.RequestHandlers.initHandlersFromConfig created /replication: solr.ReplicationHandler
[junit4:junit4]   2> 5599 T3901 oasc.RequestHandlers.initHandlersFromConfig created standard: solr.StandardRequestHandler
[junit4:junit4]   2> 5600 T3901 oasc.RequestHandlers.initHandlersFromConfig created /get: solr.RealTimeGetHandler
[junit4:junit4]   2> 5601 T3901 oasc.RequestHandlers.initHandlersFromConfig created dismax: solr.SearchHandler
[junit4:junit4]   2> 5602 T3901 oasc.RequestHandlers.initHandlersFromConfig created mock: org.apache.solr.core.MockQuerySenderListenerReqHandler
[junit4:junit4]   2> 5602 T3901 oasc.RequestHandlers.initHandlersFromConfig created /admin/: org.apache.solr.handler.admin.AdminHandlers
[junit4:junit4]   2> 5603 T3901 oasc.RequestHandlers.initHandlersFromConfig created defaults: solr.StandardRequestHandler
[junit4:junit4]   2> 5603 T3901 oasc.RequestHandlers.initHandlersFromConfig adding lazy requestHandler: solr.StandardRequestHandler
[junit4:junit4]   2> 5604 T3901 oasc.RequestHandlers.initHandlersFromConfig created lazy: solr.StandardRequestHandler
[junit4:junit4]   2> 5605 T3901 oasc.RequestHandlers.initHandlersFromConfig created /update: solr.UpdateRequestHandler
[junit4:junit4]   2> 5605 T3901 oasc.RequestHandlers.initHandlersFromConfig created /terms: org.apache.solr.handler.component.SearchHandler
[junit4:junit4]   2> 5606 T3901 oasc.RequestHandlers.initHandlersFromConfig created spellCheckCompRH: org.apache.solr.handler.component.SearchHandler
[junit4:junit4]   2> 5606 T3901 oasc.RequestHandlers.initHandlersFromConfig created spellCheckCompRH_Direct: org.apache.solr.handler.component.SearchHandler
[junit4:junit4]   2> 5607 T3901 oasc.RequestHandlers.initHandlersFromConfig created spellCheckWithWordbreak: org.apache.solr.handler.component.SearchHandler
[junit4:junit4]   2> 5608 T3901 oasc.RequestHandlers.initHandlersFromConfig created spellCheckWithWordbreak_Direct: org.apache.solr.handler.component.SearchHandler
[junit4:junit4]   2> 5608 T3901 oasc.RequestHandlers.initHandlersFromConfig created spellCheckCompRH1: org.apache.solr.handler.component.SearchHandler
[junit4:junit4]   2> 5609 T3901 oasc.RequestHandlers.initHandlersFromConfig created mltrh: org.apache.solr.handler.component.SearchHandler
[junit4:junit4]   2> 5610 T3901 oasc.RequestHandlers.initHandlersFromConfig created tvrh: org.apache.solr.handler.component.SearchHandler
[junit4:junit4]   2> 5610 T3901 oasc.RequestHandlers.initHandlersFromConfig created /mlt: solr.MoreLikeThisHandler
[junit4:junit4]   2> 5611 T3901 oasc.RequestHandlers.initHandlersFromConfig created /debug/dump: solr.DumpRequestHandler
[junit4:junit4]   2> 5631 T3901 oashl.XMLLoader.init xsltCacheLifetimeSeconds=60
[junit4:junit4]   2> 5639 T3901 oasc.SolrCore.initDeprecatedSupport WARNING solrconfig.xml uses deprecated <admin/gettableFiles>, Please update your config to use the ShowFileRequestHandler.
[junit4:junit4]   2> 5640 T3901 oasc.SolrCore.initDeprecatedSupport WARNING adding ShowFileRequestHandler with hidden files: [SCHEMA.XML, OLD_SYNONYMS.TXT, STOPWORDS.TXT, PROTWORDS.TXT, OPEN-EXCHANGE-RATES.JSON, SYNONYMS.TXT, CURRENCY.XML, MAPPING-ISOLATIN1ACCENT.TXT]
[junit4:junit4]   2> 5644 T3901 oasc.CachingDirectoryFactory.close Releasing directory:/usr/home/hudson/hudson-slave/workspace/Lucene-Solr-Tests-trunk-java7/solr/build/solr-core/test/J0/./org.apache.solr.cloud.SyncSliceTest-1357185846221/jetty1
[junit4:junit4]   2> 5647 T3901 oass.SolrIndexSearcher.<init> Opening Searcher@7e13e128 main
[junit4:junit4]   2> 5648 T3901 oasu.CommitTracker.<init> Hard AutoCommit: disabled
[junit4:junit4]   2> 5649 T3901 oasu.CommitTracker.<init> Soft AutoCommit: disabled
[junit4:junit4]   2> 5649 T3901 oashc.SpellCheckComponent.inform Initializing spell checkers
[junit4:junit4]   2> 5678 T3901 oass.DirectSolrSpellChecker.init init: {name=direct,classname=DirectSolrSpellChecker,field=lowerfilt,minQueryLength=3}
[junit4:junit4]   2> 5756 T3902 oasc.SolrCore.registerSearcher [collection1] Registered new searcher Searcher@7e13e128 main{StandardDirectoryReader(segments_1:1)}
[junit4:junit4]   2> 5764 T3901 oasc.ZkController.publish publishing core=collection1 state=down
[junit4:junit4]   2> 5764 T3901 oasc.ZkController.publish numShards not found on descriptor - reading it from system property
[junit4:junit4]   2> 7055 T3882 oascc.ZkStateReader.updateClusterState Updating cloud state from ZooKeeper... 
[junit4:junit4]   2> 7056 T3882 oasc.Overseer$ClusterStateUpdater.updateState Update state numShards=1 message={
[junit4:junit4]   2> 	  "operation":"state",
[junit4:junit4]   2> 	  "numShards":"1",
[junit4:junit4]   2> 	  "shard":null,
[junit4:junit4]   2> 	  "roles":null,
[junit4:junit4]   2> 	  "state":"down",
[junit4:junit4]   2> 	  "core":"collection1",
[junit4:junit4]   2> 	  "collection":"collection1",
[junit4:junit4]   2> 	  "node_name":"127.0.0.1:50746_f%2Fjk",
[junit4:junit4]   2> 	  "base_url":"http://127.0.0.1:50746/f/jk"}
[junit4:junit4]   2> 7056 T3882 oasc.Overseer$ClusterStateUpdater.createCollection Create collection collection1 with numShards 1
[junit4:junit4]   2> 7056 T3882 oasc.Overseer$ClusterStateUpdater.updateState Assigning new node to shard shard=shard1
[junit4:junit4]   2> 7081 T3887 oascc.ZkStateReader$2.process A cluster state change: WatchedEvent state:SyncConnected type:NodeDataChanged path:/clusterstate.json, has occurred - updating... (live nodes size: 2)
[junit4:junit4]   2> 7081 T3881 oascc.ZkStateReader$2.process A cluster state change: WatchedEvent state:SyncConnected type:NodeDataChanged path:/clusterstate.json, has occurred - updating... (live nodes size: 2)
[junit4:junit4]   2> 7081 T3900 oascc.ZkStateReader$2.process A cluster state change: WatchedEvent state:SyncConnected type:NodeDataChanged path:/clusterstate.json, has occurred - updating... (live nodes size: 2)
[junit4:junit4]   2> 7768 T3901 oasc.CoreContainer.registerCore registering core: collection1
[junit4:junit4]   2> 7768 T3901 oasc.ZkController.register Register replica - core:collection1 address:http://127.0.0.1:50746/f/jk collection:collection1 shard:shard1
[junit4:junit4]   2> 7769 T3901 oascc.SolrZkClient.makePath makePath: /collections/collection1/leader_elect/shard1/election
[junit4:junit4]   2> 7781 T3864 oazs.PrepRequestProcessor.pRequest Got user-level KeeperException when processing sessionid:0x13bfe948bd50006 type:delete cxid:0x45 zxid:0x5b txntype:-1 reqpath:n/a Error Path:/solr/collections/collection1/leaders Error:KeeperErrorCode = NoNode for /solr/collections/collection1/leaders
[junit4:junit4]   2> 7790 T3901 oasc.ShardLeaderElectionContext.runLeaderProcess Running the leader process.
[junit4:junit4]   2> 7791 T3864 oazs.PrepRequestProcessor.pRequest Got user-level KeeperException when processing sessionid:0x13bfe948bd50006 type:create cxid:0x46 zxid:0x5c txntype:-1 reqpath:n/a Error Path:/solr/overseer Error:KeeperErrorCode = NodeExists for /solr/overseer
[junit4:junit4]   2> 7802 T3901 oasc.ShardLeaderElectionContext.waitForReplicasToComeUp Enough replicas found to continue.
[junit4:junit4]   2> 7803 T3901 oasc.ShardLeaderElectionContext.runLeaderProcess I may be the new leader - try and sync
[junit4:junit4]   2> 7803 T3901 oasc.SyncStrategy.sync Sync replicas to http://127.0.0.1:50746/f/jk/collection1/
[junit4:junit4]   2> 7803 T3901 oasc.SyncStrategy.syncReplicas Sync Success - now sync replicas to me
[junit4:junit4]   2> 7804 T3901 oasc.SyncStrategy.syncToMe http://127.0.0.1:50746/f/jk/collection1/ has no replicas
[junit4:junit4]   2> 7804 T3901 oasc.ShardLeaderElectionContext.runLeaderProcess I am the new leader: http://127.0.0.1:50746/f/jk/collection1/
[junit4:junit4]   2> 7804 T3901 oascc.SolrZkClient.makePath makePath: /collections/collection1/leaders/shard1
[junit4:junit4]   2> 7816 T3864 oazs.PrepRequestProcessor.pRequest Got user-level KeeperException when processing sessionid:0x13bfe948bd50006 type:create cxid:0x50 zxid:0x60 txntype:-1 reqpath:n/a Error Path:/solr/overseer Error:KeeperErrorCode = NodeExists for /solr/overseer
[junit4:junit4]   2> 8585 T3882 oascc.ZkStateReader.updateClusterState Updating cloud state from ZooKeeper... 
[junit4:junit4]   2> 8608 T3881 oascc.ZkStateReader$2.process A cluster state change: WatchedEvent state:SyncConnected type:NodeDataChanged path:/clusterstate.json, has occurred - updating... (live nodes size: 2)
[junit4:junit4]   2> 8608 T3900 oascc.ZkStateReader$2.process A cluster state change: WatchedEvent state:SyncConnected type:NodeDataChanged path:/clusterstate.json, has occurred - updating... (live nodes size: 2)
[junit4:junit4]   2> 8608 T3887 oascc.ZkStateReader$2.process A cluster state change: WatchedEvent state:SyncConnected type:NodeDataChanged path:/clusterstate.json, has occurred - updating... (live nodes size: 2)
[junit4:junit4]   2> 8640 T3901 oasc.ZkController.register We are http://127.0.0.1:50746/f/jk/collection1/ and leader is http://127.0.0.1:50746/f/jk/collection1/
[junit4:junit4]   2> 8640 T3901 oasc.ZkController.register No LogReplay needed for core=collection1 baseURL=http://127.0.0.1:50746/f/jk
[junit4:junit4]   2> 8640 T3901 oasc.ZkController.checkRecovery I am the leader, no recovery necessary
[junit4:junit4]   2> 8641 T3901 oasc.ZkController.publish publishing core=collection1 state=active
[junit4:junit4]   2> 8641 T3901 oasc.ZkController.publish numShards not found on descriptor - reading it from system property
[junit4:junit4]   2> 8644 T3901 oascc.ZkStateReader.updateClusterState Updating cloud state from ZooKeeper... 
[junit4:junit4]   2> 8645 T3859 oass.SolrDispatchFilter.init user.dir=/usr/home/hudson/hudson-slave/workspace/Lucene-Solr-Tests-trunk-java7/solr/build/solr-core/test/J0
[junit4:junit4]   2> 8646 T3859 oass.SolrDispatchFilter.init SolrDispatchFilter.init() done
[junit4:junit4]   2> 8646 T3859 oascsi.HttpClientUtil.createClient Creating new http client, config:maxConnections=128&maxConnectionsPerHost=32&followRedirects=false
[junit4:junit4]   2> 8832 T3859 oejs.Server.doStart jetty-8.1.8.v20121106
[junit4:junit4]   2> 8835 T3859 oejs.AbstractConnector.doStart Started SocketConnector@127.0.0.1:16232
[junit4:junit4]   2> 8836 T3859 oasc.SolrResourceLoader.locateSolrHome JNDI not configured for solr (NoInitialContextEx)
[junit4:junit4]   2> 8837 T3859 oasc.SolrResourceLoader.locateSolrHome using system property solr.solr.home: /usr/home/hudson/hudson-slave/workspace/Lucene-Solr-Tests-trunk-java7/solr/build/solr-core/test/J0/./org.apache.solr.cloud.SyncSliceTest-jetty2-1357185854870
[junit4:junit4]   2> 8837 T3859 oasc.SolrResourceLoader.<init> new SolrResourceLoader for deduced Solr Home: '/usr/home/hudson/hudson-slave/workspace/Lucene-Solr-Tests-trunk-java7/solr/build/solr-core/test/J0/./org.apache.solr.cloud.SyncSliceTest-jetty2-1357185854870/'
[junit4:junit4]   2> 8879 T3859 oass.SolrDispatchFilter.init SolrDispatchFilter.init()
[junit4:junit4]   2> 8880 T3859 oasc.SolrResourceLoader.locateSolrHome JNDI not configured for solr (NoInitialContextEx)
[junit4:junit4]   2> 8881 T3859 oasc.SolrResourceLoader.locateSolrHome using system property solr.solr.home: /usr/home/hudson/hudson-slave/workspace/Lucene-Solr-Tests-trunk-java7/solr/build/solr-core/test/J0/./org.apache.solr.cloud.SyncSliceTest-jetty2-1357185854870
[junit4:junit4]   2> 8881 T3859 oasc.CoreContainer$Initializer.initialize looking for solr.xml: /usr/home/hudson/hudson-slave/workspace/Lucene-Solr-Tests-trunk-java7/solr/build/solr-core/test/J0/./org.apache.solr.cloud.SyncSliceTest-jetty2-1357185854870/solr.xml
[junit4:junit4]   2> 8881 T3859 oasc.CoreContainer.<init> New CoreContainer 1392569662
[junit4:junit4]   2> 8882 T3859 oasc.CoreContainer.load Loading CoreContainer using Solr Home: '/usr/home/hudson/hudson-slave/workspace/Lucene-Solr-Tests-trunk-java7/solr/build/solr-core/test/J0/./org.apache.solr.cloud.SyncSliceTest-jetty2-1357185854870/'
[junit4:junit4]   2> 8882 T3859 oasc.SolrResourceLoader.<init> new SolrResourceLoader for directory: '/usr/home/hudson/hudson-slave/workspace/Lucene-Solr-Tests-trunk-java7/solr/build/solr-core/test/J0/./org.apache.solr.cloud.SyncSliceTest-jetty2-1357185854870/'
[junit4:junit4]   2> 8919 T3859 oashc.HttpShardHandlerFactory.getParameter Setting socketTimeout to: 30000
[junit4:junit4]   2> 8919 T3859 oashc.HttpShardHandlerFactory.getParameter Setting urlScheme to: http://
[junit4:junit4]   2> 8920 T3859 oashc.HttpShardHandlerFactory.getParameter Setting connTimeout to: 15000
[junit4:junit4]   2> 8920 T3859 oashc.HttpShardHandlerFactory.getParameter Setting maxConnectionsPerHost to: 20
[junit4:junit4]   2> 8921 T3859 oashc.HttpShardHandlerFactory.getParameter Setting corePoolSize to: 0
[junit4:junit4]   2> 8921 T3859 oashc.HttpShardHandlerFactory.getParameter Setting maximumPoolSize to: 2147483647
[junit4:junit4]   2> 8921 T3859 oashc.HttpShardHandlerFactory.getParameter Setting maxThreadIdleTime to: 5
[junit4:junit4]   2> 8922 T3859 oashc.HttpShardHandlerFactory.getParameter Setting sizeOfQueue to: -1
[junit4:junit4]   2> 8922 T3859 oashc.HttpShardHandlerFactory.getParameter Setting fairnessPolicy to: false
[junit4:junit4]   2> 8923 T3859 oascsi.HttpClientUtil.createClient Creating new http client, config:maxConnectionsPerHost=20&maxConnections=10000&socketTimeout=30000&connTimeout=15000&retry=false
[junit4:junit4]   2> 8941 T3859 oasc.CoreContainer.load Registering Log Listener
[junit4:junit4]   2> 8957 T3859 oasc.CoreContainer.initZooKeeper Zookeeper client=127.0.0.1:28847/solr
[junit4:junit4]   2> 8958 T3859 oasc.ZkController.checkChrootPath zkHost includes chroot
[junit4:junit4]   2> 8959 T3859 oaz.ZooKeeper.<init> Initiating client connection, connectString=127.0.0.1:28847 sessionTimeout=60000 watcher=org.apache.solr.common.cloud.ConnectionManager@48f81322
[junit4:junit4]   2> 8959 T3859 oascc.ConnectionManager.waitForConnected Waiting for client to connect to ZooKeeper
[junit4:junit4]   2> 8960 T3913 oaz.ClientCnxn$SendThread.logStartConnect Opening socket connection to server localhost/127.0.0.1:28847. Will not attempt to authenticate using SASL (access denied ("javax.security.auth.AuthPermission" "getLoginConfiguration"))
[junit4:junit4]   2> 8961 T3913 oaz.ClientCnxn$SendThread.primeConnection Socket connection established to localhost/127.0.0.1:28847, initiating session
[junit4:junit4]   2> 8961 T3861 oazs.NIOServerCnxnFactory.run Accepted socket connection from /140.211.11.196:21079
[junit4:junit4]   2> 8962 T3861 oazs.ZooKeeperServer.processConnectRequest Client attempting to establish new session at /140.211.11.196:21079
[junit4:junit4]   2> 8967 T3863 oazs.ZooKeeperServer.finishSessionInit Established session 0x13bfe948bd50007 with negotiated timeout 20000 for client /140.211.11.196:21079
[junit4:junit4]   2> 8967 T3913 oaz.ClientCnxn$SendThread.onConnected Session establishment complete on server localhost/127.0.0.1:28847, sessionid = 0x13bfe948bd50007, negotiated timeout = 20000
[junit4:junit4]   2> 8967 T3914 oascc.ConnectionManager.process Watcher org.apache.solr.common.cloud.ConnectionManager@48f81322 name:ZooKeeperConnection Watcher:127.0.0.1:28847 got event WatchedEvent state:SyncConnected type:None path:null path:null type:None
[junit4:junit4]   2> 8967 T3859 oascc.ConnectionManager.waitForConnected Client is connected to ZooKeeper
[junit4:junit4]   2> 8968 T3864 oazs.PrepRequestProcessor.pRequest2Txn Processed session termination for sessionid: 0x13bfe948bd50007
[junit4:junit4]   2> 8981 T3914 oaz.ClientCnxn$EventThread.run EventThread shut down
[junit4:junit4]   2> 8981 T3861 oazs.NIOServerCnxn.closeSock Closed socket connection for client /140.211.11.196:21079 which had sessionid 0x13bfe948bd50007
[junit4:junit4]   2> 8981 T3859 oaz.ZooKeeper.close Session: 0x13bfe948bd50007 closed
[junit4:junit4]   2> 8981 T3859 oascsi.HttpClientUtil.createClient Creating new http client, config:maxConnections=500&maxConnectionsPerHost=16&socketTimeout=15000&connTimeout=30000
[junit4:junit4]   2> 8994 T3859 oaz.ZooKeeper.<init> Initiating client connection, connectString=127.0.0.1:28847/solr sessionTimeout=30000 watcher=org.apache.solr.common.cloud.ConnectionManager@618f6523
[junit4:junit4]   2> 8995 T3859 oascc.ConnectionManager.waitForConnected Waiting for client to connect to ZooKeeper
[junit4:junit4]   2> 8995 T3915 oaz.ClientCnxn$SendThread.logStartConnect Opening socket connection to server localhost/127.0.0.1:28847. Will not attempt to authenticate using SASL (access denied ("javax.security.auth.AuthPermission" "getLoginConfiguration"))
[junit4:junit4]   2> 8996 T3915 oaz.ClientCnxn$SendThread.primeConnection Socket connection established to localhost/127.0.0.1:28847, initiating session
[junit4:junit4]   2> 8996 T3861 oazs.NIOServerCnxnFactory.run Accepted socket connection from /140.211.11.196:12387
[junit4:junit4]   2> 8996 T3861 oazs.ZooKeeperServer.processConnectRequest Client attempting to establish new session at /140.211.11.196:12387
[junit4:junit4]   2> 8998 T3863 oazs.ZooKeeperServer.finishSessionInit Established session 0x13bfe948bd50008 with negotiated timeout 20000 for client /140.211.11.196:12387
[junit4:junit4]   2> 8998 T3915 oaz.ClientCnxn$SendThread.onConnected Session establishment complete on server localhost/127.0.0.1:28847, sessionid = 0x13bfe948bd50008, negotiated timeout = 20000
[junit4:junit4]   2> 8998 T3916 oascc.ConnectionManager.process Watcher org.apache.solr.common.cloud.ConnectionManager@618f6523 name:ZooKeeperConnection Watcher:127.0.0.1:28847/solr got event WatchedEvent state:SyncConnected type:None path:null path:null type:None
[junit4:junit4]   2> 8998 T3859 oascc.ConnectionManager.waitForConnected Client is connected to ZooKeeper
[junit4:junit4]   2> 8999 T3864 oazs.PrepRequestProcessor.pRequest Got user-level KeeperException when processing sessionid:0x13bfe948bd50008 type:create cxid:0x1 zxid:0x6d txntype:-1 reqpath:n/a Error Path:/solr/overseer Error:KeeperErrorCode = NodeExists for /solr/overseer
[junit4:junit4]   2> 9000 T3864 oazs.PrepRequestProcessor.pRequest Got user-level KeeperException when processing sessionid:0x13bfe948bd50008 type:create cxid:0x2 zxid:0x6e txntype:-1 reqpath:n/a Error Path:/solr/overseer Error:KeeperErrorCode = NodeExists for /solr/overseer
[junit4:junit4]   2> 9002 T3859 oasc.ZkController.createEphemeralLiveNode Register node as live in ZooKeeper:/live_nodes/127.0.0.1:16232_f%2Fjk
[junit4:junit4]   2> 9003 T3864 oazs.PrepRequestProcessor.pRequest Got user-level KeeperException when processing sessionid:0x13bfe948bd50008 type:delete cxid:0x4 zxid:0x6f txntype:-1 reqpath:n/a Error Path:/solr/live_nodes/127.0.0.1:16232_f%2Fjk Error:KeeperErrorCode = NoNode for /solr/live_nodes/127.0.0.1:16232_f%2Fjk
[junit4:junit4]   2> 9004 T3859 oascc.SolrZkClient.makePath makePath: /live_nodes/127.0.0.1:16232_f%2Fjk
[junit4:junit4]   2> 9019 T3887 oascc.ZkStateReader$3.process Updating live nodes... (3)
[junit4:junit4]   2> 9020 T3900 oascc.ZkStateReader$3.process Updating live nodes... (3)
[junit4:junit4]   2> 9020 T3887 oascc.ZkStateReader$2.process A cluster state change: WatchedEvent state:SyncConnected type:NodeChildrenChanged path:/live_nodes, has occurred - updating... (live nodes size: 3)
[junit4:junit4]   2> 9020 T3881 oascc.ZkStateReader$3.process Updating live nodes... (3)
[junit4:junit4]   2> 9020 T3900 oascc.ZkStateReader$2.process A cluster state change: WatchedEvent state:SyncConnected type:NodeChildrenChanged path:/live_nodes, has occurred - updating... (live nodes size: 3)
[junit4:junit4]   2> 9020 T3881 oascc.ZkStateReader$2.process A cluster state change: WatchedEvent state:SyncConnected type:NodeChildrenChanged path:/live_nodes, has occurred - updating... (live nodes size: 3)
[junit4:junit4]   2> 9022 T3859 oascc.ZkStateReader.createClusterStateWatchersAndUpdate Updating cluster state from ZooKeeper... 
[junit4:junit4]   2> 9028 T3917 oasc.CoreContainer.create Creating SolrCore 'collection1' using instanceDir: /usr/home/hudson/hudson-slave/workspace/Lucene-Solr-Tests-trunk-java7/solr/build/solr-core/test/J0/./org.apache.solr.cloud.SyncSliceTest-jetty2-1357185854870/collection1
[junit4:junit4]   2> 9028 T3917 oasc.ZkController.createCollectionZkNode Check for collection zkNode:collection1
[junit4:junit4]   2> 9029 T3917 oasc.ZkController.createCollectionZkNode Collection zkNode exists
[junit4:junit4]   2> 9029 T3917 oasc.ZkController.readConfigName Load collection config from:/collections/collection1
[junit4:junit4]   2> 9030 T3917 oasc.SolrResourceLoader.<init> new SolrResourceLoader for directory: '/usr/home/hudson/hudson-slave/workspace/Lucene-Solr-Tests-trunk-java7/solr/build/solr-core/test/J0/./org.apache.solr.cloud.SyncSliceTest-jetty2-1357185854870/collection1/'
[junit4:junit4]   2> 9031 T3917 oasc.SolrResourceLoader.replaceClassLoader Adding 'file:/usr/home/hudson/hudson-slave/workspace/Lucene-Solr-Tests-trunk-java7/solr/build/solr-core/test/J0/org.apache.solr.cloud.SyncSliceTest-jetty2-1357185854870/collection1/lib/README' to classloader
[junit4:junit4]   2> 9032 T3917 oasc.SolrResourceLoader.replaceClassLoader Adding 'file:/usr/home/hudson/hudson-slave/workspace/Lucene-Solr-Tests-trunk-java7/solr/build/solr-core/test/J0/org.apache.solr.cloud.SyncSliceTest-jetty2-1357185854870/collection1/lib/classes/' to classloader
[junit4:junit4]   2> 9156 T3917 oasc.SolrConfig.<init> Using Lucene MatchVersion: LUCENE_50
[junit4:junit4]   2> 9270 T3917 oasc.SolrConfig.<init> Loaded SolrConfig: solrconfig.xml
[junit4:junit4]   2> 9371 T3917 oass.IndexSchema.readSchema Reading Solr Schema
[junit4:junit4]   2> 9378 T3917 oass.IndexSchema.readSchema Schema name=test
[junit4:junit4]   2> 10121 T3882 oascc.ZkStateReader.updateClusterState Updating cloud state from ZooKeeper... 
[junit4:junit4]   2> 10122 T3882 oasc.Overseer$ClusterStateUpdater.updateState Update state numShards=1 message={
[junit4:junit4]   2> 	  "operation":"state",
[junit4:junit4]   2> 	  "numShards":"1",
[junit4:junit4]   2> 	  "shard":"shard1",
[junit4:junit4]   2> 	  "roles":null,
[junit4:junit4]   2> 	  "state":"active",
[junit4:junit4]   2> 	  "core":"collection1",
[junit4:junit4]   2> 	  "collection":"collection1",
[junit4:junit4]   2> 	  "node_name":"127.0.0.1:50746_f%2Fjk",
[junit4:junit4]   2> 	  "base_url":"http://127.0.0.1:50746/f/jk"}
[junit4:junit4]   2> 10139 T3881 oascc.ZkStateReader$2.process A cluster state change: WatchedEvent state:SyncConnected type:NodeDataChanged path:/clusterstate.json, has occurred - updating... (live nodes size: 3)
[junit4:junit4]   2> 10139 T3887 oascc.ZkStateReader$2.process A cluster state change: WatchedEvent state:SyncConnected type:NodeDataChanged path:/clusterstate.json, has occurred - updating... (live nodes size: 3)
[junit4:junit4]   2> 10139 T3900 oascc.ZkStateReader$2.process A cluster state change: WatchedEvent state:SyncConnected type:NodeDataChanged path:/clusterstate.json, has occurred - updating... (live nodes size: 3)
[junit4:junit4]   2> 10139 T3916 oascc.ZkStateReader$2.process A cluster state change: WatchedEvent state:SyncConnected type:NodeDataChanged path:/clusterstate.json, has occurred - updating... (live nodes size: 3)
[junit4:junit4]   2> 10256 T3917 oass.OpenExchangeRatesOrgProvider.init Initialized with rates=open-exchange-rates.json, refreshInterval=1440.
[junit4:junit4]   2> 10277 T3917 oass.IndexSchema.readSchema default search field in schema is text
[junit4:junit4]   2> 10282 T3917 oass.IndexSchema.readSchema unique key field: id
[junit4:junit4]   2> 10293 T3917 oass.FileExchangeRateProvider.reload Reloading exchange rates from file currency.xml
[junit4:junit4]   2> 10299 T3917 oass.FileExchangeRateProvider.reload Reloading exchange rates from file currency.xml
[junit4:junit4]   2> 10314 T3917 oass.OpenExchangeRatesOrgProvider.reload Reloading exchange rates from open-exchange-rates.json
[junit4:junit4]   2> 10315 T3917 oass.OpenExchangeRatesOrgProvider.reload Reloading exchange rates from open-exchange-rates.json
[junit4:junit4]   2> 10316 T3917 oasc.SolrCore.<init> [collection1] Opening new SolrCore at /usr/home/hudson/hudson-slave/workspace/Lucene-Solr-Tests-trunk-java7/solr/build/solr-core/test/J0/./org.apache.solr.cloud.SyncSliceTest-jetty2-1357185854870/collection1/, dataDir=./org.apache.solr.cloud.SyncSliceTest-1357185846221/jetty2/
[junit4:junit4]   2> 10316 T3917 oasc.JmxMonitoredMap.<init> JMX monitoring is enabled. Adding Solr mbeans to JMX Server: com.sun.jmx.mbeanserver.JmxMBeanServer@230a52e5
[junit4:junit4]   2> 10317 T3917 oasc.SolrCore.initDirectoryFactory solr.NRTCachingDirectoryFactory
[junit4:junit4]   2> 10318 T3917 oasc.CachingDirectoryFactory.get return new directory for /usr/home/hudson/hudson-slave/workspace/Lucene-Solr-Tests-trunk-java7/solr/build/solr-core/test/J0/./org.apache.solr.cloud.SyncSliceTest-1357185846221/jetty2 forceNew:false
[junit4:junit4]   2> 10318 T3917 oasc.CachingDirectoryFactory.close Releasing directory:/usr/home/hudson/hudson-slave/workspace/Lucene-Solr-Tests-trunk-java7/solr/build/solr-core/test/J0/./org.apache.solr.cloud.SyncSliceTest-1357185846221/jetty2
[junit4:junit4]   2> 10319 T3917 oasc.SolrCore.getNewIndexDir New index directory detected: old=null new=./org.apache.solr.cloud.SyncSliceTest-1357185846221/jetty2/index/
[junit4:junit4]   2> 10319 T3917 oasc.SolrCore.initIndex WARNING [collection1] Solr index directory './org.apache.solr.cloud.SyncSliceTest-1357185846221/jetty2/index' doesn't exist. Creating new index...
[junit4:junit4]   2> 10321 T3917 oasc.CachingDirectoryFactory.get return new directory for /usr/home/hudson/hudson-slave/workspace/Lucene-Solr-Tests-trunk-java7/solr/build/solr-core/test/J0/./org.apache.solr.cloud.SyncSliceTest-1357185846221/jetty2/index forceNew:false
[junit4:junit4]   2> 10328 T3917 oasc.SolrDeletionPolicy.onCommit SolrDeletionPolicy.onCommit: commits:num=1
[junit4:junit4]   2> 		commit{dir=RateLimitedDirectoryWrapper(NRTCachingDirectory(org.apache.lucene.store.NIOFSDirectory@/usr/home/hudson/hudson-slave/workspace/Lucene-Solr-Tests-trunk-java7/solr/build/solr-core/test/J0/org.apache.solr.cloud.SyncSliceTest-1357185846221/jetty2/index lockFactory=org.apache.lucene.store.NativeFSLockFactory@65a2ded2; maxCacheMB=48.0 maxMergeSizeMB=4.0)),segFN=segments_1,generation=1,filenames=[segments_1]
[junit4:junit4]   2> 10328 T3917 oasc.SolrDeletionPolicy.updateCommits newest commit = 1[segments_1]
[junit4:junit4]   2> 10329 T3917 oasc.CachingDirectoryFactory.close Releasing directory:/usr/home/hudson/hudson-slave/workspace/Lucene-Solr-Tests-trunk-java7/solr/build/solr-core/test/J0/./org.apache.solr.cloud.SyncSliceTest-1357185846221/jetty2/index
[junit4:junit4]   2> 10330 T3917 oasc.SolrCore.initWriters created xml: solr.XMLResponseWriter
[junit4:junit4]   2> 10332 T3917 oasup.UpdateRequestProcessorChain.init inserting DistributedUpdateProcessorFactory into updateRequestProcessorChain "dedupe"
[junit4:junit4]   2> 10332 T3917 oasup.UpdateRequestProcessorChain.init inserting DistributedUpdateProcessorFactory into updateRequestProcessorChain "dedupe-allfields"
[junit4:junit4]   2> 10333 T3917 oasup.UpdateRequestProcessorChain.init inserting DistributedUpdateProcessorFactory into updateRequestProcessorChain "stored_sig"
[junit4:junit4]   2> 10333 T3917 oasup.UpdateRequestProcessorChain.init inserting DistributedUpdateProcessorFactory into updateRequestProcessorChain "uniq-fields"
[junit4:junit4]   2> 10334 T3917 oasup.UpdateRequestProcessorChain.init inserting DistributedUpdateProcessorFactory into updateRequestProcessorChain "distrib-dup-test-chain-implicit"
[junit4:junit4]   2> 10334 T3917 oasc.RequestHandlers.initHandlersFromConfig adding lazy requestHandler: solr.ReplicationHandler
[junit4:junit4]   2> 10334 T3917 oasc.RequestHandlers.initHandlersFromConfig created /replication: solr.ReplicationHandler
[junit4:junit4]   2> 10335 T3917 oasc.RequestHandlers.initHandlersFromConfig created standard: solr.StandardRequestHandler
[junit4:junit4]   2> 10335 T3917 oasc.RequestHandlers.initHandlersFromConfig created /get: solr.RealTimeGetHandler
[junit4:junit4]   2> 10336 T3917 oasc.RequestHandlers.initHandlersFromConfig created dismax: solr.SearchHandler
[junit4:junit4]   2> 10336 T3917 oasc.RequestHandlers.initHandlersFromConfig created mock: org.apache.solr.core.MockQuerySenderListenerReqHandler
[junit4:junit4]   2> 10337 T3917 oasc.RequestHandlers.initHandlersFromConfig created /admin/: org.apache.solr.handler.admin.AdminHandlers
[junit4:junit4]   2> 10337 T3917 oasc.RequestHandlers.initHandlersFromConfig created defaults: solr.StandardRequestHandler
[junit4:junit4]   2> 10337 T3917 oasc.RequestHandlers.initHandlersFromConfig adding lazy requestHandler: solr.StandardRequestHandler
[junit4:junit4]   2> 10338 T3917 oasc.RequestHandlers.initHandlersFromConfig created lazy: solr.StandardRequestHandler
[junit4:junit4]   2> 10338 T3917 oasc.RequestHandlers.initHandlersFromConfig created /update: solr.UpdateRequestHandler
[junit4:junit4]   2> 10339 T3917 oasc.RequestHandlers.initHandlersFromConfig created /terms: org.apache.solr.handler.component.SearchHandler
[junit4:junit4]   2> 10339 T3917 oasc.RequestHandlers.initHandlersFromConfig created spellCheckCompRH: org.apache.solr.handler.component.SearchHandler
[junit4:junit4]   2> 10340 T3917 oasc.RequestHandlers.initHandlersFromConfig created spellCheckCompRH_Direct: org.apache.solr.handler.component.SearchHandler
[junit4:junit4]   2> 10340 T3917 oasc.RequestHandlers.initHandlersFromConfig created spellCheckWithWordbreak: org.apache.solr.handler.component.SearchHandler
[junit4:junit4]   2> 10340 T3917 oasc.RequestHandlers.initHandlersFromConfig created spellCheckWithWordbreak_Direct: org.apache.solr.handler.component.SearchHandler
[junit4:junit4]   2> 10341 T3917 oasc.RequestHandlers.initHandlersFromConfig created spellCheckCompRH1: org.apache.solr.handler.component.SearchHandler
[junit4:junit4]   2> 10341 T3917 oasc.RequestHandlers.initHandlersFromConfig created mltrh: org.apache.solr.handler.component.SearchHandler
[junit4:junit4]   2> 10342 T3917 oasc.RequestHandlers.initHandlersFromConfig created tvrh: org.apache.solr.handler.component.SearchHandler
[junit4:junit4]   2> 10342 T3917 oasc.RequestHandlers.initHandlersFromConfig created /mlt: solr.MoreLikeThisHandler
[junit4:junit4]   2> 10343 T3917 oasc.RequestHandlers.initHandlersFromConfig created /debug/dump: solr.DumpRequestHandler
[junit4:junit4]   2> 10356 T3917 oashl.XMLLoader.init xsltCacheLifetimeSeconds=60
[junit4:junit4]   2> 10361 T3917 oasc.SolrCore.initDeprecatedSupport WARNING solrconfig.xml uses deprecated <admin/gettableFiles>, Please update your config to use the ShowFileRequestHandler.
[junit4:junit4]   2> 10362 T3917 oasc.SolrCore.initDeprecatedSupport WARNING adding ShowFileRequestHandler with hidden files: [SCHEMA.XML, OLD_SYNONYMS.TXT, STOPWORDS.TXT, PROTWORDS.TXT, OPEN-EXCHANGE-RATES.JSON, SYNONYMS.TXT, CURRENCY.XML, MAPPING-ISOLATIN1ACCENT.TXT]
[junit4:junit4]   2> 10364 T3917 oasc.CachingDirectoryFactory.close Releasing directory:/usr/home/hudson/hudson-slave/workspace/Lucene-Solr-Tests-trunk-java7/solr/build/solr-core/test/J0/./org.apache.solr.cloud.SyncSliceTest-1357185846221/jetty2
[junit4:junit4]   2> 10366 T3917 oass.SolrIndexSearcher.<init> Opening Searcher@144dc65a main
[junit4:junit4]   2> 10369 T3917 oasu.CommitTracker.<init> Hard AutoCommit: disabled
[junit4:junit4]   2> 10369 T3917 oasu.CommitTracker.<init> Soft AutoCommit: disabled
[junit4:junit4]   2> 10370 T3917 oashc.SpellCheckComponent.inform Initializing spell checkers
[junit4:junit4]   2> 10445 T3917 oass.DirectSolrSpellChecker.init init: {name=direct,classname=DirectSolrSpellChecker,field=lowerfilt,minQueryLength=3}
[junit4:junit4]   2> 10517 T3918 oasc.SolrCore.registerSearcher [collection1] Registered new searcher Searcher@144dc65a main{StandardDirectoryReader(segments_1:1)}
[junit4:junit4]   2> 10521 T3917 oasc.ZkController.publish publishing core=collection1 state=down
[junit4:junit4]   2> 10522 T3917 oasc.ZkController.publish numShards not found on descriptor - reading it from system property
[junit4:junit4]   2> 11643 T3882 oascc.ZkStateReader.updateClusterState Updating cloud state from ZooKeeper... 
[junit4:junit4]   2> 11644 T3882 oasc.Overseer$ClusterStateUpdater.updateState Update state numShards=1 message={
[junit4:junit4]   2> 	  "operation":"state",
[junit4:junit4]   2> 	  "numShards":"1",
[junit4:junit4]   2> 	  "shard":null,
[junit4:junit4]   2> 	  "roles":null,
[junit4:junit4]   2> 	  "state":"down",
[junit4:junit4]   2> 	  "core":"collection1",
[junit4:junit4]   2> 	  "collection":"collection1",
[junit4:junit4]   2> 	  "node_name":"127.0.0.1:16232_f%2Fjk",
[junit4:junit4]   2> 	  "base_url":"http://127.0.0.1:16232/f/jk"}
[junit4:junit4]   2> 11644 T3882 oasc.Overseer$ClusterStateUpdater.updateState Collection already exists with numShards=1
[junit4:junit4]   2> 11644 T3882 oasc.Overseer$ClusterStateUpdater.updateState Assigning new node to shard shard=shard1
[junit4:junit4]   2> 11669 T3887 oascc.ZkStateReader$2.process A cluster state change: WatchedEvent state:SyncConnected type:NodeDataChanged path:/clusterstate.json, has occurred - updating... (live nodes size: 3)
[junit4:junit4]   2> 11669 T3881 oascc.ZkStateReader$2.process A cluster state change: WatchedEvent state:SyncConnected type:NodeDataChanged path:/clusterstate.json, has occurred - updating... (live nodes size: 3)
[junit4:junit4]   2> 11669 T3916 oascc.ZkStateReader$2.process A cluster state change: WatchedEvent state:SyncConnected type:NodeDataChanged path:/clusterstate.json, has occurred - updating... (live nodes size: 3)
[junit4:junit4]   2> 11669 T3900 oascc.ZkStateReader$2.process A cluster state change: WatchedEvent state:SyncConnected type:NodeDataChanged path:/clusterstate.json, has occurred - updating... (live nodes size: 3)
[junit4:junit4]   2> 12525 T3917 oasc.CoreContainer.registerCore registering core: collection1
[junit4:junit4]   2> 12525 T3917 oasc.ZkController.register Register replica - core:collection1 address:http://127.0.0.1:16232/f/jk collection:collection1 shard:shard1
[junit4:junit4]   2> 12528 T3917 oasc.ZkController.register We are http://127.0.0.1:16232/f/jk/collection1/ and leader is http://127.0.0.1:50746/f/jk/collection1/
[junit4:junit4]   2> 12528 T3917 oasc.ZkController.register No LogReplay needed for core=collection1 baseURL=http://127.0.0.1:16232/f/jk
[junit4:junit4]   2> 12529 T3917 oasc.ZkController.checkRecovery Core needs to recover:collection1
[junit4:junit4]   2> 12529 T3917 oasu.DefaultSolrCoreState.doRecovery Running recovery - first canceling any ongoing recovery
[junit4:junit4]   2> ASYNC  NEW_CORE C232 name=collection1 org.apache.solr.core.SolrCore@a9b7ea4 url=http://127.0.0.1:16232/f/jk/collection1 node=127.0.0.1:16232_f%2Fjk C232_STATE=coll:collection1 core:collection1 props:{shard=null, roles=null, state=down, core=collection1, collection=collection1, node_name=127.0.0.1:16232_f%2Fjk, base_url=http://127.0.0.1:16232/f/jk}
[junit4:junit4]   2> 12529 T3919 C232 P16232 oasc.RecoveryStrategy.run Starting recovery process.  core=collection1 recoveringAfterStartup=true
[junit4:junit4]   2> 12530 T3919 C232 P16232 oasc.RecoveryStrategy.doRecovery ###### startupVersions=[]
[junit4:junit4]   2> 12530 T3919 C232 P16232 oasc.ZkController.publish publishing core=collection1 state=recovering
[junit4:junit4]   2> 12530 T3919 C232 P16232 oasc.ZkController.publish numShards not found on descriptor - reading it from system property
[junit4:junit4]   2> 12530 T3917 oascc.ZkStateReader.updateClusterState Updating cloud state from ZooKeeper... 
[junit4:junit4]   2> 12531 T3919 C232 P16232 oascsi.HttpClientUtil.createClient Creating new http client, config:maxConnections=128&maxConnectionsPerHost=32&followRedirects=false
[junit4:junit4]   2> 12532 T3859 oass.SolrDispatchFilter.init user.dir=/usr/home/hudson/hudson-slave/workspace/Lucene-Solr-Tests-trunk-java7/solr/build/solr-core/test/J0
[junit4:junit4]   2> 12532 T3859 oass.SolrDispatchFilter.init SolrDispatchFilter.init() done
[junit4:junit4]   2> 12533 T3859 oascsi.HttpClientUtil.createClient Creating new http client, config:maxConnections=128&maxConnectionsPerHost=32&followRedirects=false
[junit4:junit4]   2> 12685 T3859 oejs.Server.doStart jetty-8.1.8.v20121106
[junit4:junit4]   2> 12689 T3859 oejs.AbstractConnector.doStart Started SocketConnector@127.0.0.1:17124
[junit4:junit4]   2> 12689 T3859 oasc.SolrResourceLoader.locateSolrHome JNDI not configured for solr (NoInitialContextEx)
[junit4:junit4]   2> 12690 T3859 oasc.SolrResourceLoader.locateSolrHome using system property solr.solr.home: /usr/home/hudson/hudson-slave/workspace/Lucene-Solr-Tests-trunk-java7/solr/build/solr-core/test/J0/./org.apache.solr.cloud.SyncSliceTest-jetty3-1357185858759
[junit4:junit4]   2> 12690 T3859 oasc.SolrResourceLoader.<init> new SolrResourceLoader for deduced Solr Home: '/usr/home/hudson/hudson-slave/workspace/Lucene-Solr-Tests-trunk-java7/solr/build/solr-core/test/J0/./org.apache.solr.cloud.SyncSliceTest-jetty3-1357185858759/'
[junit4:junit4]   2> 12722 T3859 oass.SolrDispatchFilter.init SolrDispatchFilter.init()
[junit4:junit4]   2> 12723 T3859 oasc.SolrResourceLoader.locateSolrHome JNDI not configured for solr (NoInitialContextEx)
[junit4:junit4]   2> 12723 T3859 oasc.SolrResourceLoader.locateSolrHome using system property solr.solr.home: /usr/home/hudson/hudson-slave/workspace/Lucene-Solr-Tests-trunk-java7/solr/build/solr-core/test/J0/./org.apache.solr.cloud.SyncSliceTest-jetty3-1357185858759
[junit4:junit4]   2> 12723 T3859 oasc.CoreContainer$Initializer.initialize looking for solr.xml: /usr/home/hudson/hudson-slave/workspace/Lucene-Solr-Tests-trunk-java7/solr/build/solr-core/test/J0/./org.apache.solr.cloud.SyncSliceTest-jetty3-1357185858759/solr.xml
[junit4:junit4]   2> 12724 T3859 oasc.CoreContainer.<init> New CoreContainer 1319491410
[junit4:junit4]   2> 12724 T3859 oasc.CoreContainer.load Loading CoreContainer using Solr Home: '/usr/home/hudson/hudson-slave/workspace/Lucene-Solr-Tests-trunk-java7/solr/build/solr-core/test/J0/./org.apache.solr.cloud.SyncSliceTest-jetty3-1357185858759/'
[junit4:junit4]   2> 12724 T3859 oasc.SolrResourceLoader.<init> new SolrResourceLoader for directory: '/usr/home/hudson/hudson-slave/workspace/Lucene-Solr-Tests-trunk-java7/solr/build/solr-core/test/J0/./org.apache.solr.cloud.SyncSliceTest-jetty3-1357185858759/'
[junit4:junit4]   2> 12756 T3859 oashc.HttpShardHandlerFactory.getParameter Setting socketTimeout to: 30000
[junit4:junit4]   2> 12756 T3859 oashc.HttpShardHandlerFactory.getParameter Setting urlScheme to: http://
[junit4:junit4]   2> 12757 T3859 oashc.HttpShardHandlerFactory.getParameter Setting connTimeout to: 15000
[junit4:junit4]   2> 12757 T3859 oashc.HttpShardHandlerFactory.getParameter Setting maxConnectionsPerHost to: 20
[junit4:junit4]   2> 12757 T3859 oashc.HttpShardHandlerFactory.getParameter Setting corePoolSize to: 0
[junit4:junit4]   2> 12758 T3859 oashc.HttpShardHandlerFactory.getParameter Setting maximumPoolSize to: 2147483647
[junit4:junit4]   2> 12758 T3859 oashc.HttpShardHandlerFactory.getParameter Setting maxThreadIdleTime to: 5
[junit4:junit4]   2> 12758 T3859 oashc.HttpShardHandlerFactory.getParameter Setting sizeOfQueue to: -1
[junit4:junit4]   2> 12759 T3859 oashc.HttpShardHandlerFactory.getParameter Setting fairnessPolicy to: false
[junit4:junit4]   2> 12759 T3859 oascsi.HttpClientUtil.createClient Creating new http client, config:maxConnectionsPerHost=20&maxConnections=10000&socketTimeout=30000&connTimeout=15000&retry=false
[junit4:junit4]   2> 12774 T3859 oasc.CoreContainer.load Registering Log Listener
[junit4:junit4]   2> 12788 T3859 oasc.CoreContainer.initZooKeeper Zookeeper client=127.0.0.1:28847/solr
[junit4:junit4]   2> 12788 T3859 oasc.ZkController.checkChrootPath zkHost includes chroot
[junit4:junit4]   2> 12789 T3859 oaz.ZooKeeper.<init> Initiating client connection, connectString=127.0.0.1:28847 sessionTimeout=60000 watcher=org.apache.solr.common.cloud.ConnectionManager@4a021cec
[junit4:junit4]   2> 12790 T3859 oascc.ConnectionManager.waitForConnected Waiting for client to connect to ZooKeeper
[junit4:junit4]   2> 12790 T3929 oaz.ClientCnxn$SendThread.logStartConnect Opening socket connection to server localhost/127.0.0.1:28847. Will not attempt to authenticate using SASL (access denied ("javax.security.auth.AuthPermission" "getLoginConfiguration"))
[junit4:junit4]   2> 12791 T3929 oaz.ClientCnxn$SendThread.primeConnection Socket connection established to localhost/127.0.0.1:28847, initiating session
[junit4:junit4]   2> 12791 T3861 oazs.NIOServerCnxnFactory.run Accepted socket connection from /140.211.11.196:43327
[junit4:junit4]   2> 12792 T3861 oazs.ZooKeeperServer.processConnectRequest Client attempting to establish new session at /140.211.11.196:43327
[junit4:junit4]   2> 12794 T3863 oazs.ZooKeeperServer.finishSessionInit Established session 0x13bfe948bd50009 with negotiated timeout 20000 for client /140.211.11.196:43327
[junit4:junit4]   2> 12794 T3929 oaz.ClientCnxn$SendThread.onConnected Session establishment complete on server localhost/127.0.0.1:28847, sessionid = 0x13bfe948bd50009, negotiated timeout = 20000
[junit4:junit4]   2> 12795 T3930 oascc.ConnectionManager.process Watcher org.apache.solr.common.cloud.ConnectionManager@4a021cec name:ZooKeeperConnection Watcher:127.0.0.1:28847 got event WatchedEvent state:SyncConnected type:None path:null path:null type:None
[junit4:junit4]   2> 12795 T3859 oascc.ConnectionManager.waitForConnected Client is connected to ZooKeeper
[junit4:junit4]   2> 12796 T3864 oazs.PrepRequestProcessor.pRequest2Txn Processed session termination for sessionid: 0x13bfe948bd50009
[junit4:junit4]   2> 12796 T3930 oaz.ClientCnxn$EventThread.run EventThread shut down
[junit4:junit4]   2> 12796 T3861 oazs.NIOServerCnxn.closeSock Closed socket connection for client /140.211.11.196:43327 which had sessionid 0x13bfe948bd50009
[junit4:junit4]   2> 12796 T3859 oaz.ZooKeeper.close Session: 0x13bfe948bd50009 closed
[junit4:junit4]   2> 12797 T3859 oascsi.HttpClientUtil.createClient Creating new http client, config:maxConnections=500&maxConnectionsPerHost=16&socketTimeout=15000&connTimeout=30000
[junit4:junit4]   2> 12805 T3859 oaz.ZooKeeper.<init> Initiating client connection, connectString=127.0.0.1:28847/solr sessionTimeout=30000 watcher=org.apache.solr.common.cloud.ConnectionManager@123bd634
[junit4:junit4]   2> 12805 T3859 oascc.ConnectionManager.waitForConnected Waiting for client to connect to ZooKeeper
[junit4:junit4]   2> 12806 T3931 oaz.ClientCnxn$SendThread.logStartConnect Opening socket connection to server localhost/127.0.0.1:28847. Will not attempt to authenticate using SASL (access denied ("javax.security.auth.AuthPermission" "getLoginConfiguration"))
[junit4:junit4]   2> 12806 T3931 oaz.ClientCnxn$SendThread.primeConnection Socket connection established to localhost/127.0.0.1:28847, initiating session
[junit4:junit4]   2> 12806 T3861 oazs.NIOServerCnxnFactory.run Accepted socket connection from /140.211.11.196:19094
[junit4:junit4]   2> 12807 T3861 oazs.ZooKeeperServer.processConnectRequest Client attempting to establish new session at /140.211.11.196:19094
[junit4:junit4]   2> 12808 T3863 oazs.ZooKeeperServer.finishSessionInit Established session 0x13bfe948bd5000a with negotiated timeout 20000 for client /140.211.11.196:19094
[junit4:junit4]   2> 12808 T3931 oaz.ClientCnxn$SendThread.onConnected Session establishment complete on server localhost/127.0.0.1:28847, sessionid = 0x13bfe948bd5000a, negotiated timeout = 20000
[junit4:junit4]   2> 12808 T3932 oascc.ConnectionManager.process Watcher org.apache.solr.common.cloud.ConnectionManager@123bd634 name:ZooKeeperConnection Watcher:127.0.0.1:28847/solr got event WatchedEvent state:SyncConnected type:None path:null path:null type:None
[junit4:junit4]   2> 12808 T3859 oascc.ConnectionManager.waitForConnected Client is connected to ZooKeeper
[junit4:junit4]   2> 12809 T3864 oazs.PrepRequestProcessor.pRequest Got user-level KeeperException when processing sessionid:0x13bfe948bd5000a type:create cxid:0x1 zxid:0x80 txntype:-1 reqpath:n/a Error Path:/solr/overseer Error:KeeperErrorCode = NodeExists for /solr/overseer
[junit4:junit4]   2> 12810 T3864 oazs.PrepRequestProcessor.pRequest Got user-level KeeperException when processing sessionid:0x13bfe948bd5000a type:create cxid:0x2 zxid:0x81 txntype:-1 reqpath:n/a Error Path:/solr/overseer Error:KeeperErrorCode = NodeExists for /solr/overseer
[junit4:junit4]   2> 12820 T3859 oasc.ZkController.createEphemeralLiveNode Register node as live in ZooKeeper:/live_nodes/127.0.0.1:17124_f%2Fjk
[junit4:junit4]   2> 12821 T3864 oazs.PrepRequestProcessor.pRequest Got user-level KeeperException when processing sessionid:0x13bfe948bd5000a type:delete cxid:0x4 zxid:0x82 txntype:-1 reqpath:n/a Error Path:/solr/live_nodes/127.0.0.1:17124_f%2Fjk Error:KeeperErrorCode = NoNode for /solr/live_nodes/127.0.0.1:17124_f%2Fjk
[junit4:junit4]   2> 12822 T3859 oascc.SolrZkClient.makePath makePath: /live_nodes/127.0.0.1:17124_f%2Fjk
[junit4:junit4]   2> 12830 T3881 oascc.ZkStateReader$3.process Updating live nodes... (4)
[junit4:junit4]   2> 12830 T3887 oascc.ZkStateReader$3.process Updating live nodes... (4)
[junit4:junit4]   2> 12830 T3900 oascc.ZkStateReader$3.process Updating live nodes... (4)
[junit4:junit4]   2> 12830 T3887 oascc.ZkStateReader$2.process A cluster state change: WatchedEvent state:SyncConnected type:NodeChildrenChanged path:/live_nodes, has occurred - updating... (live nodes size: 4)
[junit4:junit4]   2> 12830 T3881 oascc.ZkStateReader$2.process A cluster state change: WatchedEvent state:SyncConnected type:NodeChildrenChanged path:/live_nodes, has occurred - updating... (live nodes size: 4)
[junit4:junit4]   2> 12830 T3916 oascc.ZkStateReader$3.process Updating live nodes... (4)
[junit4:junit4]   2> 12830 T3900 oascc.ZkStateReader$2.process A cluster state change: WatchedEvent state:SyncConnected type:NodeChildrenChanged path:/live_nodes, has occurred - updating... (live nodes size: 4)
[junit4:junit4]   2> 12831 T3916 oascc.ZkStateReader$2.process A cluster state change: WatchedEvent state:SyncConnected type:NodeChildrenChanged path:/live_nodes, has occurred - updating... (live nodes size: 4)
[junit4:junit4]   2> 12838 T3859 oascc.ZkStateReader.createClusterStateWatchersAndUpdate Updating cluster state from ZooKeeper... 
[junit4:junit4]   2> 12842 T3933 oasc.CoreContainer.create Creating SolrCore 'collection1' using instanceDir: /usr/home/hudson/hudson-slave/workspace/Lucene-Solr-Tests-trunk-java7/solr/build/solr-core/test/J0/./org.apache.solr.cloud.SyncSliceTest-jetty3-1357185858759/collection1
[junit4:junit4]   2> 12843 T3933 oasc.ZkController.createCollectionZkNode Check for collection zkNode:collection1
[junit4:junit4]   2> 12843 T3933 oasc.ZkController.createCollectionZkNode Collection zkNode exists
[junit4:junit4]   2> 12843 T3933 oasc.ZkController.readConfigName Load collection config from:/collections/collection1
[junit4:junit4]   2> 12844 T3933 oasc.SolrResourceLoader.<init> new SolrResourceLoader for directory: '/usr/home/hudson/hudson-slave/workspace/Lucene-Solr-Tests-trunk-java7/solr/build/solr-core/test/J0/./org.apache.solr.cloud.SyncSliceTest-jetty3-1357185858759/collection1/'
[junit4:junit4]   2> 12845 T3933 oasc.SolrResourceLoader.replaceClassLoader Adding 'file:/usr/home/hudson/hudson-slave/workspace/Lucene-Solr-Tests-trunk-java7/solr/build/solr-core/test/J0/org.apache.solr.cloud.SyncSliceTest-jetty3-1357185858759/collection1/lib/classes/' to classloader
[junit4:junit4]   2> 12845 T3933 oasc.SolrResourceLoader.replaceClassLoader Adding 'file:/usr/home/hudson/hudson-slave/workspace/Lucene-Solr-Tests-trunk-java7/solr/build/solr-core/test/J0/org.apache.solr.cloud.SyncSliceTest-jetty3-1357185858759/collection1/lib/README' to classloader
[junit4:junit4]   2> 12893 T3933 oasc.SolrConfig.<init> Using Lucene MatchVersion: LUCENE_50
[junit4:junit4]   2> 12966 T3933 oasc.SolrConfig.<init> Loaded SolrConfig: solrconfig.xml
[junit4:junit4]   2> 13067 T3933 oass.IndexSchema.readSchema Reading Solr Schema
[junit4:junit4]   2> 13072 T3933 oass.IndexSchema.readSchema Schema name=test
[junit4:junit4]   2> 13173 T3882 oascc.ZkStateReader.updateClusterState Updating cloud state from ZooKeeper... 
[junit4:junit4]   2> 13174 T3882 oasc.Overseer$ClusterStateUpdater.updateState Update state numShards=1 message={
[junit4:junit4]   2> 	  "operation":"state",
[junit4:junit4]   2> 	  "numShards":"1",
[junit4:junit4]   2> 	  "shard":"shard1",
[junit4:junit4]   2> 	  "roles":null,
[junit4:junit4]   2> 	  "state":"recovering",
[junit4:junit4]   2> 	  "core":"collection1",
[junit4:junit4]   2> 	  "collection":"collection1",
[junit4:junit4]   2> 	  "node_name":"127.0.0.1:16232_f%2Fjk",
[junit4:junit4]   2> 	  "base_url":"http://127.0.0.1:16232/f/jk"}
[junit4:junit4]   2> 13178 T3881 oascc.ZkStateReader$2.process A cluster state change: WatchedEvent state:SyncConnected type:NodeDataChanged path:/clusterstate.json, has occurred - updating... (live nodes size: 4)
[junit4:junit4]   2> 13178 T3887 oascc.ZkStateReader$2.process A cluster state change: WatchedEvent state:SyncConnected type:NodeDataChanged path:/clusterstate.json, has occurred - updating... (live nodes size: 4)
[junit4:junit4]   2> 13178 T3900 oascc.ZkStateReader$2.process A cluster state change: WatchedEvent state:SyncConnected type:NodeDataChanged path:/clusterstate.json, has occurred - updating... (live nodes size: 4)
[junit4:junit4]   2> 13178 T3932 oascc.ZkStateReader$2.process A cluster state change: WatchedEvent state:SyncConnected type:NodeDataChanged path:/clusterstate.json, has occurred - updating... (live nodes size: 4)
[junit4:junit4]   2> 13178 T3916 oascc.ZkStateReader$2.process A cluster state change: WatchedEvent state:SyncConnected type:NodeDataChanged path:/clusterstate.json, has occurred - updating... (live nodes size: 4)
[junit4:junit4]   2> 13640 T3933 oass.OpenExchangeRatesOrgProvider.init Initialized with rates=open-exchange-rates.json, refreshInterval=1440.
[junit4:junit4]   2> 13652 T3933 oass.IndexSchema.readSchema default search field in schema is text
[junit4:junit4]   2> 13655 T3933 oass.IndexSchema.readSchema unique key field: id
[junit4:junit4]   2> 13665 T3933 oass.FileExchangeRateProvider.reload Reloading exchange rates from file currency.xml
[junit4:junit4]   2> 13669 T3933 oass.FileExchangeRateProvider.reload Reloading exchange rates from file currency.xml
[junit4:junit4]   2> 13678 T3933 oass.OpenExchangeRatesOrgProvider.reload Reloading exchange rates from open-exchange-rates.json
[junit4:junit4]   2> 13678 T3933 oass.OpenExchangeRatesOrgProvider.reload Reloading exchange rates from open-exchange-rates.json
[junit4:junit4]   2> 13679 T3933 oasc.SolrCore.<init> [collection1] Opening new SolrCore at /usr/home/hudson/hudson-slave/workspace/Lucene-Solr-Tests-trunk-java7/solr/build/solr-core/test/J0/./org.apache.solr.cloud.SyncSliceTest-jetty3-1357185858759/collection1/, dataDir=./org.apache.solr.cloud.SyncSliceTest-1357185846221/jetty3/
[junit4:junit4]   2> 13679 T3933 oasc.JmxMonitoredMap.<init> JMX monitoring is enabled. Adding Solr mbeans to JMX Server: com.sun.jmx.mbeanserver.JmxMBeanServer@230a52e5
[junit4:junit4]   2> 13680 T3933 oasc.SolrCore.initDirectoryFactory solr.NRTCachingDirectoryFactory
[junit4:junit4]   2> 13680 T3933 oasc.CachingDirectoryFactory.get return new directory for /usr/home/hudson/hudson-slave/workspace/Lucene-Solr-Tests-trunk-java7/solr/build/solr-core/test/J0/./org.apache.solr.cloud.SyncSliceTest-1357185846221/jetty3 forceNew:false
[junit4:junit4]   2> 13681 T3933 oasc.CachingDirectoryFactory.close Releasing directory:/usr/home/hudson/hudson-slave/workspace/Lucene-Solr-Tests-trunk-java7/solr/build/solr-core/test/J0/./org.apache.solr.cloud.SyncSliceTest-1357185846221/jetty3
[junit4:junit4]   2> 13681 T3933 oasc.SolrCore.getNewIndexDir New index directory detected: old=null new=./org.apache.solr.cloud.SyncSliceTest-1357185846221/jetty3/index/
[junit4:junit4]   2> 13681 T3933 oasc.SolrCore.initIndex WARNING [collection1] Solr index directory './org.apache.solr.cloud.SyncSliceTest-1357185846221/jetty3/index' doesn't exist. Creating new index...
[junit4:junit4]   2> 13683 T3933 oasc.CachingDirectoryFactory.get return new directory for /usr/home/hudson/hudson-slave/workspace/Lucene-Solr-Tests-trunk-java7/solr/build/solr-core/test/J0/./org.apache.solr.cloud.SyncSliceTest-1357185846221/jetty3/index forceNew:false
[junit4:junit4]   2> 13697 T3933 oasc.SolrDeletionPolicy.onCommit SolrDeletionPolicy.onCommit: commits:num=1
[junit4:junit4]   2> 		commit{dir=RateLimitedDirectoryWrapper(NRTCachingDirectory(org.apache.lucene.store.NIOFSDirectory@/usr/home/hudson/hudson-slave/workspace/Lucene-Solr-Tests-trunk-java7/solr/build/solr-core/test/J0/org.apache.solr.cloud.SyncSliceTest-1357185846221/jetty3/index lockFactory=org.apache.lucene.store.NativeFSLockFactory@311f8f08; maxCacheMB=48.0 maxMergeSizeMB=4.0)),segFN=segments_1,generation=1,filenames=[segments_1]
[junit4:junit4]   2> 13698 T3933 oasc.SolrDeletionPolicy.updateCommits newest commit = 1[segments_1]
[junit4:junit4]   2> 13698 T3933 oasc.CachingDirectoryFactory.close Releasing directory:/usr/home/hudson/hudson-slave/workspace/Lucene-Solr-Tests-trunk-java7/solr/build/solr-core/test/J0/./org.apache.solr.cloud.SyncSliceTest-1357185846221/jetty3/index
[junit4:junit4]   2> 13699 T3933 oasc.SolrCore.initWriters created xml: solr.XMLResponseWriter
[junit4:junit4]   2> 13700 T3933 oasup.UpdateRequestProcessorChain.init inserting DistributedUpdateProcessorFactory into updateRequestProcessorChain "dedupe"
[junit4:junit4]   2> 13700 T3933 oasup.UpdateRequestProcessorChain.init inserting DistributedUpdateProcessorFactory into updateRequestProcessorChain "dedupe-allfields"
[junit4:junit4]   2> 13701 T3933 oasup.UpdateRequestProcessorChain.init inserting DistributedUpdateProcessorFactory into updateRequestProcessorChain "stored_sig"
[junit4:junit4]   2> 13701 T3933 oasup.UpdateRequestProcessorChain.init inserting DistributedUpdateProcessorFactory into updateRequestProcessorChain "uniq-fields"
[junit4:junit4]   2> 13701 T3933 oasup.UpdateRequestProcessorChain.init inserting DistributedUpdateProcessorFactory into updateRequestProcessorChain "distrib-dup-test-chain-implicit"
[junit4:junit4]   2> 13701 T3933 oasc.RequestHandlers.initHandlersFromConfig adding lazy requestHandler: solr.ReplicationHandler
[junit4:junit4]   2> 13702 T3933 oasc.RequestHandlers.initHandlersFromConfig created /replication: solr.ReplicationHandler
[junit4:junit4]   2> 13702 T3933 oasc.RequestHandlers.initHandlersFromConfig created standard: solr.StandardRequestHandler
[junit4:junit4]   2> 13702 T3933 oasc.RequestHandlers.initHandlersFromConfig created /get: solr.RealTimeGetHandler
[junit4:junit4]   2> 13703 T3933 oasc.RequestHandlers.initHandlersFromConfig created dismax: solr.SearchHandler
[junit4:junit4]   2> 13703 T3933 oasc.RequestHandlers.initHandlersFromConfig created mock: org.apache.solr.core.MockQuerySenderListenerReqHandler
[junit4:junit4]   2> 13703 T3933 oasc.RequestHandlers.initHandlersFromConfig created /admin/: org.apache.solr.handler.admin.AdminHandlers
[junit4:junit4]   2> 13704 T3933 oasc.RequestHandlers.initHandlersFromConfig created defaults: solr.StandardRequestHandler
[junit4:junit4]   2> 13704 T3933 oasc.RequestHandlers.initHandlersFromConfig adding lazy requestHandler: solr.StandardRequestHandler
[junit4:junit4]   2> 13704 T3933 oasc.RequestHandlers.initHandlersFromConfig created lazy: solr.StandardRequestHandler
[junit4:junit4]   2> 13704 T3933 oasc.RequestHandlers.initHandlersFromConfig created /update: solr.UpdateRequestHandler
[junit4:junit4]   2> 13705 T3933 oasc.RequestHandlers.initHandlersFromConfig created /terms: org.apache.solr.handler.component.SearchHandler
[junit4:junit4]   2> 13705 T3933 oasc.RequestHandlers.initHandlersFromConfig created spellCheckCompRH: org.apache.solr.handler.component.SearchHandler
[junit4:junit4]   2> 13705 T3933 oasc.RequestHandlers.initHandlersFromConfig created spellCheckCompRH_Direct: org.apache.solr.handler.component.SearchHandler
[junit4:junit4]   2> 13706 T3933 oasc.RequestHandlers.initHandlersFromConfig created spellCheckWithWordbreak: org.apache.solr.handler.component.SearchHandler
[junit4:junit4]   2> 13706 T3933 oasc.RequestHandlers.initHandlersFromConfig created spellCheckWithWordbreak_Direct: org.apache.solr.handler.component.SearchHandler
[junit4:junit4]   2> 13706 T3933 oasc.RequestHandlers.initHandlersFromConfig created spellCheckCompRH1: org.apache.solr.handler.component.SearchHandler
[junit4:junit4]   2> 13707 T3933 oasc.RequestHandlers.initHandlersFromConfig created mltrh: org.apache.solr.handler.component.SearchHandler
[junit4:junit4]   2> 13707 T3933 oasc.RequestHandlers.initHandlersFromConfig created tvrh: org.apache.solr.handler.component.SearchHandler
[junit4:junit4]   2> 13707 T3933 oasc.RequestHandlers.initHandlersFromConfig created /mlt: solr.MoreLikeThisHandler
[junit4:junit4]   2> 13708 T3933 oasc.RequestHandlers.initHandlersFromConfig created /debug/dump: solr.DumpRequestHandler
[junit4:junit4]   2> 13717 T3933 oashl.XMLLoader.init xsltCacheLifetimeSeconds=60
[junit4:junit4]   2> 13720 T3933 oasc.SolrCore.initDeprecatedSupport WARNING solrconfig.xml uses deprecated <admin/gettableFiles>, Please update your config to use the ShowFileRequestHandler.
[junit4:junit4]   2> 13721 T3933 oasc.SolrCore.initDeprecatedSupport WARNING adding ShowFileRequestHandler with hidden files: [SCHEMA.XML, OLD_SYNONYMS.TXT, STOPWORDS.TXT, PROTWORDS.TXT, OPEN-EXCHANGE-RATES.JSON, SYNONYMS.TXT, CURRENCY.XML, MAPPING-ISOLATIN1ACCENT.TXT]
[junit4:junit4]   2> 13723 T3933 oasc.CachingDirectoryFactory.close Releasing directory:/usr/home/hudson/hudson-slave/workspace/Lucene-Solr-Tests-trunk-java7/solr/build/solr-core/test/J0/./org.apache.solr.cloud.SyncSliceTest-1357185846221/jetty3
[junit4:junit4]   2> 13725 T3933 oass.SolrIndexSearcher.<init> Opening Searcher@5cf052df main
[junit4:junit4]   2> 13726 T3933 oasu.CommitTracker.<init> Hard AutoCommit: disabled
[junit4:junit4]   2> 13726 T3933 oasu.CommitTracker.<init> Soft AutoCommit: disabled
[junit4:junit4]   2> 13726 T3933 oashc.SpellCheckComponent.inform Initializing spell checkers
[junit4:junit4]   2> 13732 T3933 oass.DirectSolrSpellChecker.init init: {name=direct,classname=DirectSolrSpellChecker,field=lowerfilt,minQueryLength=3}
[junit4:junit4]   2> 13779 T3934 oasc.SolrCore.registerSearcher [collection1] Registered new searcher Searcher@5cf052df main{StandardDirectoryReader(segments_1:1)}
[junit4:junit4]   2> 13781 T3933 oasc.ZkController.publish publishing core=collection1 state=down
[junit4:junit4]   2> 13782 T3933 oasc.ZkController.publish numShards not found on descriptor - reading it from system property
[junit4:junit4]   2> 14695 T3882 oascc.ZkStateReader.updateClusterState Updating cloud state from ZooKeeper... 
[junit4:junit4]   2> 14696 T3882 oasc.Overseer$ClusterStateUpdater.updateState Update state numShards=1 message={
[junit4:junit4]   2> 	  "operation":"state",
[junit4:junit4]   2> 	  "numShards":"1",
[junit4:junit4]   2> 	  "shard":null,
[junit4:junit4]   2> 	  "roles":null,
[junit4:junit4]   2> 	  "state":"down",
[junit4:junit4]   2> 	  "core":"collection1",
[junit4:junit4]   2> 	  "collection":"collection1",
[junit4:junit4]   2> 	  "node_name":"127.0.0.1:17124_f%2Fjk",
[junit4:junit4]   2> 	  "base_url":"http://127.0.0.1:17124/f/jk"}
[junit4:junit4]   2> 14696 T3882 oasc.Overseer$ClusterStateUpdater.updateState Collection already exists with numShards=1
[junit4:junit4]   2> 14696 T3882 oasc.Overseer$ClusterStateUpdater.updateState Assigning new node to shard shard=shard1
[junit4:junit4]   2> 14782 T3881 oascc.ZkStateReader$2.process A cluster state change: WatchedEvent state:SyncConnected type:NodeDataChanged path:/clusterstate.json, has occurred - updating... (live nodes size: 4)
[junit4:junit4]   2> 14782 T3932 oascc.ZkStateReader$2.process A cluster state change: WatchedEvent state:SyncConnected type:NodeDataChanged path:/clusterstate.json, has occurred - updating... (live nodes size: 4)
[junit4:junit4]   2> 14782 T3887 oascc.ZkStateReader$2.process A cluster state change: WatchedEvent state:SyncConnected type:NodeDataChanged path:/clusterstate.json, has occurred - updating... (live nodes size: 4)
[junit4:junit4]   2> 14782 T3900 oascc.ZkStateReader$2.process A cluster state change: WatchedEvent state:SyncConnected type:NodeDataChanged path:/clusterstate.json, has occurred - updating... (live nodes size: 4)
[junit4:junit4]   2> 14782 T3916 oascc.ZkStateReader$2.process A cluster state change: WatchedEvent state:SyncConnected type:NodeDataChanged path:/clusterstate.json, has occurred - updating... (live nodes size: 4)
[junit4:junit4]   2> 14786 T3933 oasc.CoreContainer.registerCore registering core: collection1
[junit4:junit4]   2> 14786 T3933 oasc.ZkController.register Register replica - core:collection1 address:http://127.0.0.1:17124/f/jk collection:collection1 shard:shard1
[junit4:junit4]   2> 14789 T3933 oasc.ZkController.register We are http://127.0.0.1:17124/f/jk/collection1/ and leader is http://127.0.0.1:50746/f/jk/collection1/
[junit4:junit4]   2> 14789 T3933 oasc.ZkController.register No LogReplay needed for core=collection1 baseURL=http://127.0.0.1:17124/f/jk
[junit4:junit4]   2> 14789 T3933 oasc.ZkController.checkRecovery Core needs to recover:collection1
[junit4:junit4]   2> 14789 T3933 oasu.DefaultSolrCoreState.doRecovery Running recovery - first canceling any ongoing recovery
[junit4:junit4]   2> ASYNC  NEW_CORE C233 name=collection1 org.apache.solr.core.SolrCore@1721b27e url=http://127.0.0.1:17124/f/jk/collection1 node=127.0.0.1:17124_f%2Fjk C233_STATE=coll:collection1 core:collection1 props:{shard=null, roles=null, state=down, core=collection1, collection=collection1, node_name=127.0.0.1:17124_f%2Fjk, base_url=http://127.0.0.1:17124/f/jk}
[junit4:junit4]   2> 14789 T3935 C233 P17124 oasc.RecoveryStrategy.run Starting recovery process.  core=collection1 recoveringAfterStartup=true
[junit4:junit4]   2> 14790 T3933 oascc.ZkStateReader.updateClusterState Updating cloud state from ZooKeeper... 
[junit4:junit4]   2> 14790 T3935 C233 P17124 oasc.RecoveryStrategy.doRecovery ###### startupVersions=[]
[junit4:junit4]   2> 14790 T3935 C233 P17124 oasc.ZkController.publish publishing core=collection1 state=recovering
[junit4:junit4]   2> 14790 T3935 C233 P17124 oasc.ZkController.publish numShards not found on descriptor - reading it from system property
[junit4:junit4]   2> 14790 T3859 oass.SolrDispatchFilter.init user.dir=/usr/home/hudson/hudson-slave/workspace/Lucene-Solr-Tests-trunk-java7/solr/build/solr-core/test/J0
[junit4:junit4]   2> 14791 T3859 oass.SolrDispatchFilter.init SolrDispatchFilter.init() done
[junit4:junit4]   2> 14792 T3859 oascsi.HttpClientUtil.createClient Creating new http client, config:maxConnections=128&maxConnectionsPerHost=32&followRedirects=false
[junit4:junit4]   2> 14793 T3935 C233 P17124 oascsi.HttpClientUtil.createClient Creating new http client, config:maxConnections=128&maxConnectionsPerHost=32&followRedirects=false
[junit4:junit4]   2> 15011 T3859 oejs.Server.doStart jetty-8.1.8.v20121106
[junit4:junit4]   2> 15013 T3859 oejs.AbstractConnector.doStart Started SocketConnector@127.0.0.1:40006
[junit4:junit4]   2> 15015 T3859 oasc.SolrResourceLoader.locateSolrHome JNDI not configured for solr (NoInitialContextEx)
[junit4:junit4]   2> 15016 T3859 oasc.SolrResourceLoader.locateSolrHome using system property solr.solr.home: /usr/home/hudson/hudson-slave/workspace/Lucene-Solr-Tests-trunk-java7/solr/build/solr-core/test/J0/./org.apache.solr.cloud.SyncSliceTest-jetty4-1357185861022
[junit4:junit4]   2> 15016 T3859 oasc.SolrResourceLoader.<init> new SolrResourceLoader for deduced Solr Home: '/usr/home/hudson/hudson-slave/workspace/Lucene-Solr-Tests-trunk-java7/solr/build/solr-core/test/J0/./org.apache.solr.cloud.SyncSliceTest-jetty4-1357185861022/'
[junit4:junit4]   2> 15051 T3859 oass.SolrDispatchFilter.init SolrDispatchFilter.init()
[junit4:junit4]   2> 15051 T3859 oasc.SolrResourceLoader.locateSolrHome JNDI not configured for solr (NoInitialContextEx)
[junit4:junit4]   2> 15052 T3859 oasc.SolrResourceLoader.locateSolrHome using system property solr.solr.home: /usr/home/hudson/hudson-slave/workspace/Lucene-Solr-Tests-trunk-java7/solr/build/solr-core/test/J0/./org.apache.solr.cloud.SyncSliceTest-jetty4-1357185861022
[junit4:junit4]   2> 15052 T3859 oasc.CoreContainer$Initializer.initialize looking for solr.xml: /usr/home/hudson/hudson-slave/workspace/Lucene-Solr-Tests-trunk-java7/solr/build/solr-core/test/J0/./org.apache.solr.cloud.SyncSliceTest-jetty4-1357185861022/solr.xml
[junit4:junit4]   2> 15052 T3859 oasc.CoreContainer.<init> New CoreContainer 1169640477
[junit4:junit4]   2> 15053 T3859 oasc.CoreContainer.load Loading CoreContainer using Solr Home: '/usr/home/hudson/hudson-slave/workspace/Lucene-Solr-Tests-trunk-java7/solr/build/solr-core/test/J0/./org.apache.solr.cloud.SyncSliceTest-jetty4-1357185861022/'
[junit4:junit4]   2> 15053 T3859 oasc.SolrResourceLoader.<init> new SolrResourceLoader for directory: '/usr/home/hudson/hudson-slave/workspace/Lucene-Solr-Tests-trunk-java7/solr/build/solr-core/test/J0/./org.apache.solr.cloud.SyncSliceTest-jetty4-1357185861022/'
[junit4:junit4]   2> 15080 T3859 oashc.HttpShardHandlerFactory.getParameter Setting socketTimeout to: 30000
[junit4:junit4]   2> 15081 T3859 oashc.HttpShardHandlerFactory.getParameter Setting urlScheme to: http://
[junit4:junit4]   2> 15081 T3859 oashc.HttpShardHandlerFactory.getParameter Setting connTimeout to: 15000
[junit4:junit4]   2> 15081 T3859 oashc.HttpShardHandlerFactory.getParameter Setting maxConnectionsPerHost to: 20
[junit4:junit4]   2> 15082 T3859 oashc.HttpShardHandlerFactory.getParameter Setting corePoolSize to: 0
[junit4:junit4]   2> 15082 T3859 oashc.HttpShardHandlerFactory.getParameter Setting maximumPoolSize to: 2147483647
[junit4:junit4]   2> 15082 T3859 oashc.HttpShardHandlerFactory.getParameter Setting maxThreadIdleTime to: 5
[junit4:junit4]   2> 15083 T3859 oashc.HttpShardHandlerFactory.getParameter Setting sizeOfQueue to: -1
[junit4:junit4]   2> 15083 T3859 oashc.HttpShardHandlerFactory.getParameter Setting fairnessPolicy to: false
[junit4:junit4]   2> 15083 T3859 oascsi.HttpClientUtil.createClient Creating new http client, config:maxConnectionsPerHost=20&maxConnections=10000&socketTimeout=30000&connTimeout=15000&retry=false
[junit4:junit4]   2> 15099 T3859 oasc.CoreContainer.load Registering Log Listener
[junit4:junit4]   2> 15114 T3859 oasc.CoreContainer.initZooKeeper Zookeeper client=127.0.0.1:28847/solr
[junit4:junit4]   2> 15114 T3859 oasc.ZkController.checkChrootPath zkHost includes chroot
[junit4:junit4]   2> 15115 T3859 oaz.ZooKeeper.<init> Initiating client connection, connectString=127.0.0.1:28847 sessionTimeout=60000 watcher=org.apache.solr.common.cloud.ConnectionManager@1894cf3b
[junit4:junit4]   2> 15116 T3859 oascc.ConnectionManager.waitForConnected Waiting for client to connect to ZooKeeper
[junit4:junit4]   2> 15116 T3945 oaz.ClientCnxn$SendThread.logStartConnect Opening socket connection to server localhost/127.0.0.1:28847. Will not attempt to authenticate using SASL (access denied ("javax.security.auth.AuthPermission" "getLoginConfiguration"))
[junit4:junit4]   2> 15117 T3945 oaz.ClientCnxn$SendThread.primeConnection Socket connection established to localhost/127.0.0.1:28847, initiating session
[junit4:junit4]   2> 15118 T3861 oazs.NIOServerCnxnFactory.run Accepted socket connection from /140.211.11.196:12739
[junit4:junit4]   2> 15118 T3861 oazs.ZooKeeperServer.processConnectRequest Client attempting to establish new session at /140.211.11.196:12739
[junit4:junit4]   2> 15124 T3863 oazs.ZooKeeperServer.finishSessionInit Established session 0x13bfe948bd5000b with negotiated timeout 20000 for client /140.211.11.196:12739
[junit4:junit4]   2> 15124 T3945 oaz.ClientCnxn$SendThread.onConnected Session establishment complete on server localhost/127.0.0.1:28847, sessionid = 0x13bfe948bd5000b, negotiated timeout = 20000
[junit4:junit4]   2> 15124 T3946 oascc.ConnectionManager.process Watcher org.apache.solr.common.cloud.ConnectionManager@1894cf3b name:ZooKeeperConnection Watcher:127.0.0.1:28847 got event WatchedEvent state:SyncConnected type:None path:null path:null type:None
[junit4:junit4]   2> 15125 T3859 oascc.ConnectionManager.waitForConnected Client is connected to ZooKeeper
[junit4:junit4]   2> 15126 T3864 oazs.PrepRequestProcessor.pRequest2Txn Processed session termination for sessionid: 0x13bfe948bd5000b
[junit4:junit4]   2> 15127 T3946 oaz.ClientCnxn$EventThread.run EventThread shut down
[junit4:junit4]   2> 15127 T3861 oazs.NIOServerCnxn.closeSock Closed socket connection for client /140.211.11.196:12739 which had sessionid 0x13bfe948bd5000b
[junit4:junit4]   2> 15127 T3859 oaz.ZooKeeper.close Session: 0x13bfe948bd5000b closed
[junit4:junit4]   2> 15128 T3859 oascsi.HttpClientUtil.createClient Creating new http client, config:maxConnections=500&maxConnectionsPerHost=16&socketTimeout=15000&connTimeout=30000
[junit4:junit4]   2> 15137 T3859 oaz.ZooKeeper.<init> Initiating client connection, connectString=127.0.0.1:28847/solr sessionTimeout=30000 watcher=org.apache.solr.common.cloud.ConnectionManager@16e5613e
[junit4:junit4]   2> 15138 T3859 oascc.ConnectionManager.waitForConnected Waiting for client to connect to ZooKeeper
[junit4:junit4]   2> 15139 T3947 oaz.ClientCnxn$SendThread.logStartConnect Opening socket connection to server localhost/127.0.0.1:28847. Will not attempt to authenticate using SASL (access denied ("javax.security.auth.AuthPermission" "getLoginConfiguration"))
[junit4:junit4]   2> 15139 T3947 oaz.ClientCnxn$SendThread.primeConnection Socket connection established to localhost/127.0.0.1:28847, initiating session
[junit4:junit4]   2> 15139 T3861 oazs.NIOServerCnxnFactory.run Accepted socket connection from /140.211.11.196:29575
[junit4:junit4]   2> 15140 T3861 oazs.ZooKeeperServer.processConnectRequest Client attempting to establish new session at /140.211.11.196:29575
[junit4:junit4]   2> 15141 T3863 oazs.ZooKeeperServer.finishSessionInit Established session 0x13bfe948bd5000c with negotiated timeout 20000 for client /140.211.11.196:29575
[junit4:junit4]   2> 15141 T3947 oaz.ClientCnxn$SendThread.onConnected Session establishment complete on server localhost/127.0.0.1:28847, sessionid = 0x13bfe948bd5000c, negotiated timeout = 20000
[junit4:junit4]   2> 15141 T3948 oascc.ConnectionManager.process Watcher org.apache.solr.common.cloud.ConnectionManager@16e5613e name:ZooKeeperConnection Watcher:127.0.0.1:28847/solr got event WatchedEvent state:SyncConnected type:None path:null path:null type:None
[junit4:junit4]   2> 15142 T3859 oascc.ConnectionManager.waitForConnected Client is connected to ZooKeeper
[junit4:junit4]   2> 15142 T3864 oazs.PrepRequestProcessor.pRequest Got user-level KeeperException when processing sessionid:0x13bfe948bd5000c type:create cxid:0x1 zxid:0x93 txntype:-1 reqpath:n/a Error Path:/solr/overseer Error:KeeperErrorCode = NodeExists for /solr/overseer
[junit4:junit4]   2> 15143 T3864 oazs.PrepRequestProcessor.pRequest Got user-level KeeperException when processing sessionid:0x13bfe948bd5000c type:create cxid:0x2 zxid:0x94 txntype:-1 reqpath:n/a Error Path:/solr/overseer Error:KeeperErrorCode = NodeExists for /solr/overseer
[junit4:junit4]   2> 15145 T3859 oasc.ZkController.createEphemeralLiveNode Register node as live in ZooKeeper:/live_nodes/127.0.0.1:40006_f%2Fjk
[junit4:junit4]   2> 15145 T3864 oazs.PrepRequestProcessor.pRequest Got user-level KeeperException when processing sessionid:0x13bfe948bd5000c type:delete cxid:0x4 zxid:0x95 txntype:-1 reqpath:n/a Error Path:/solr/live_nodes/127.0.0.1:40006_f%2Fjk Error:KeeperErrorCode = NoNode for /solr/live_nodes/127.0.0.1:40006_f%2Fjk
[junit4:junit4]   2> 15146 T3859 oascc.SolrZkClient.makePath makePath: /live_nodes/127.0.0.1:40006_f%2Fjk
[junit4:junit4]   2> 15149 T3900 oascc.ZkStateReader$3.process Updating live nodes... (5)
[junit4:junit4]   2> 15149 T3932 oascc.ZkStateReader$3.process Updating live nodes... (5)
[junit4:junit4]   2> 15149 T3881 oascc.ZkStateReader$3.process Updating live nodes... (5)
[junit4:junit4]   2> 15149 T3900 oascc.ZkStateReader$2.process A cluster state change: WatchedEvent state:SyncConnected type:NodeChildrenChanged path:/live_nodes, has occurred - updating... (live nodes size: 5)
[junit4:junit4]   2> 15149 T3887 oascc.ZkStateReader$3.process Updating live nodes... (5)
[junit4:junit4]   2> 15149 T3916 oascc.ZkStateReader$3.process Updating live nodes... (5)
[junit4:junit4]   2> 15149 T3887 oascc.ZkStateReader$2.process A cluster state change: WatchedEvent state:SyncConnected type:NodeChildrenChanged path:/live_nodes, has occurred - updating... (live nodes size: 5)
[junit4:junit4]   2> 15149 T3881 oascc.ZkStateReader$2.process A cluster state change: WatchedEvent state:SyncConnected type:NodeChildrenChanged path:/live_nodes, has occurred - updating... (live nodes size: 5)
[junit4:junit4]   2> 15149 T3932 oascc.ZkStateReader$2.process A cluster state change: WatchedEvent state:SyncConnected type:NodeChildrenChanged path:/live_nodes, has occurred - updating... (live nodes size: 5)
[junit4:junit4]   2> 15149 T3916 oascc.ZkStateReader$2.process A cluster state change: WatchedEvent state:SyncConnected type:NodeChildrenChanged path:/live_nodes, has occurred - updating... (live nodes size: 5)
[junit4:junit4]   2> 15151 T3859 oascc.ZkStateReader.createClusterStateWatchersAndUpdate Updating cluster state from ZooKeeper... 
[junit4:junit4]   2> 15157 T3949 oasc.CoreContainer.create Creating SolrCore 'collection1' using instanceDir: /usr/home/hudson/hudson-slave/workspace/Lucene-Solr-Tests-trunk-java7/solr/build/solr-core/test/J0/./org.apache.solr.cloud.SyncSliceTest-jetty4-1357185861022/collection1
[junit4:junit4]   2> 15157 T3949 oasc.ZkController.createCollectionZkNode Check for collection zkNode:collection1
[junit4:junit4]   2> 15157 T3949 oasc.ZkController.createCollectionZkNode Collection zkNode exists
[junit4:junit4]   2> 15158 T3949 oasc.ZkController.readConfigName Load collection config from:/collections/collection1
[junit4:junit4]   2> 15159 T3949 oasc.SolrResourceLoader.<init> new SolrResourceLoader for directory: '/usr/home/hudson/hudson-slave/workspace/Lucene-Solr-Tests-trunk-java7/solr/build/solr-core/test/J0/./org.apache.solr.cloud.SyncSliceTest-jetty4-1357185861022/collection1/'
[junit4:junit4]   2> 15160 T3949 oasc.SolrResourceLoader.replaceClassLoader Adding 'file:/usr/home/hudson/hudson-slave/workspace/Lucene-Solr-Tests-trunk-java7/solr/build/solr-core/test/J0/org.apache.solr.cloud.SyncSliceTest-jetty4-1357185861022/collection1/lib/classes/' to classloader
[junit4:junit4]   2> 15160 T3949 oasc.SolrResourceLoader.replaceClassLoader Adding 'file:/usr/home/hudson/hudson-slave/workspace/Lucene-Solr-Tests-trunk-java7/solr/build/solr-core/test/J0/org.apache.solr.cloud.SyncSliceTest-jetty4-1357185861022/collection1/lib/README' to classloader
[junit4:junit4]   2> 15226 T3949 oasc.SolrConfig.<init> Using Lucene MatchVersion: LUCENE_50
[junit4:junit4]   2> 15304 T3949 oasc.SolrConfig.<init> Loaded SolrConfig: solrconfig.xml
[junit4:junit4]   2> 15405 T3949 oass.IndexSchema.readSchema Reading Solr Schema
[junit4:junit4]   2> 15412 T3949 oass.IndexSchema.readSchema Schema name=test
[junit4:junit4]   2>  C232_STATE=coll:collection1 core:collection1 props:{shard=shard1, roles=null, state=recovering, core=collection1, collection=collection1, node_name=127.0.0.1:16232_f%2Fjk, base_url=http://127.0.0.1:16232/f/jk}
[junit4:junit4]   2> 15548 T3919 C232 P16232 oasc.RecoveryStrategy.doRecovery Attempting to PeerSync from http://127.0.0.1:50746/f/jk/collection1/ core=collection1 - recoveringAfterStartup=true
[junit4:junit4]   2> 15548 T3919 C232 P16232 oasu.PeerSync.sync PeerSync: core=collection1 url=http://127.0.0.1:16232/f/jk START replicas=[http://127.0.0.1:50746/f/jk/collection1/] nUpdates=100
[junit4:junit4]   2> 15549 T3919 C232 P16232 oasu.PeerSync.sync WARNING no frame of reference to tell of we've missed updates
[junit4:junit4]   2> 15550 T3919 C232 P16232 oasc.RecoveryStrategy.doRecovery PeerSync Recovery was not successful - trying replication. core=collection1
[junit4:junit4]   2> 15550 T3919 C232 P16232 oasc.RecoveryStrategy.doRecovery Starting Replication Recovery. core=collection1
[junit4:junit4]   2> 15550 T3919 C232 P16232 oasc.RecoveryStrategy.doRecovery Begin buffering updates. core=collection1
[junit4:junit4]   2> 15551 T3919 C232 P16232 oasu.UpdateLog.bufferUpdates Starting to buffer updates. FSUpdateLog{state=ACTIVE, tlog=null}
[junit4:junit4]   2> 15551 T3919 C232 P16232 oasc.RecoveryStrategy.replicate Attempting to replicate from http://127.0.0.1:50746/f/jk/collection1/. core=collection1
[junit4:junit4]   2> 15551 T3919 C232 P16232 oascsi.HttpClientUtil.createClient Creating new http client, config:maxConnections=128&maxConnectionsPerHost=32&followRedirects=false
[junit4:junit4]   2> ASYNC  NEW_CORE C234 name=collection1 org.apache.solr.core.SolrCore@2d89cc13 url=http://127.0.0.1:50746/f/jk/collection1 node=127.0.0.1:50746_f%2Fjk C234_STATE=coll:collection1 core:collection1 props:{shard=shard1, roles=null, state=active, core=collection1, collection=collection1, node_name=127.0.0.1:50746_f%2Fjk, base_url=http://127.0.0.1:50746/f/jk, leader=true}
[junit4:junit4]   2> 15557 T3892 C234 P50746 REQ /get {distrib=false&qt=/get&wt=javabin&version=2&getVersions=100} status=0 QTime=0 
[junit4:junit4]   2> 15564 T3893 C234 P50746 oasu.DirectUpdateHandler2.commit start commit{flags=0,_version_=0,optimize=false,openSearcher=false,waitSearcher=true,expungeDeletes=false,softCommit=false}
[junit4:junit4]   2> 15565 T3893 C234 P50746 oasc.CachingDirectoryFactory.close Releasing directory:/usr/home/hudson/hudson-slave/workspace/Lucene-Solr-Tests-trunk-java7/solr/build/solr-core/test/J0/./org.apache.solr.cloud.SyncSliceTest-1357185846221/jetty1
[junit4:junit4]   2> 15570 T3893 C234 P50746 oasc.SolrDeletionPolicy.onInit SolrDeletionPolicy.onInit: commits:num=1
[junit4:junit4]   2> 		commit{dir=RateLimitedDirectoryWrapper(NRTCachingDirectory(org.apache.lucene.store.NIOFSDirectory@/usr/home/hudson/hudson-slave/workspace/Lucene-Solr-Tests-trunk-java7/solr/build/solr-core/test/J0/org.apache.solr.cloud.SyncSliceTest-1357185846221/jetty1/index lockFactory=org.apache.lucene.store.NativeFSLockFactory@14ce370c; maxCacheMB=48.0 maxMergeSizeMB=4.0)),segFN=segments_1,generation=1,filenames=[segments_1]
[junit4:junit4]   2> 15570 T3893 C234 P50746 oasc.SolrDeletionPolicy.updateCommits newest commit = 1[segments_1]
[junit4:junit4]   2> 15597 T3893 C234 P50746 oasc.SolrDeletionPolicy.onCommit SolrDeletionPolicy.onCommit: commits:num=2
[junit4:junit4]   2> 		commit{dir=RateLimitedDirectoryWrapper(NRTCachingDirectory(org.apache.lucene.store.NIOFSDirectory@/usr/home/hudson/hudson-slave/workspace/Lucene-Solr-Tests-trunk-java7/solr/build/solr-core/test/J0/org.apache.solr.cloud.SyncSliceTest-1357185846221/jetty1/index lockFactory=org.apache.lucene.store.NativeFSLockFactory@14ce370c; maxCacheMB=48.0 maxMergeSizeMB=4.0)),segFN=segments_1,generation=1,filenames=[segments_1]
[junit4:junit4]   2> 		commit{dir=RateLimitedDirectoryWrapper(NRTCachingDirectory(org.apache.lucene.store.NIOFSDirectory@/usr/home/hudson/hudson-slave/workspace/Lucene-Solr-Tests-trunk-java7/solr/build/solr-core/test/J0/org.apache.solr.cloud.SyncSliceTest-1357185846221/jetty1/index lockFactory=org.apache.lucene.store.NativeFSLockFactory@14ce370c; maxCacheMB=48.0 maxMergeSizeMB=4.0)),segFN=segments_2,generation=2,filenames=[segments_2]
[junit4:junit4]   2> 15598 T3893 C234 P50746 oasc.SolrDeletionPolicy.updateCommits newest commit = 2[segments_2]
[junit4:junit4]   2> 15599 T3893 C234 P50746 oasc.CachingDirectoryFactory.close Releasing directory:/usr/home/hudson/hudson-slave/workspace/Lucene-Solr-Tests-trunk-java7/solr/build/solr-core/test/J0/./org.apache.solr.cloud.SyncSliceTest-1357185846221/jetty1
[junit4:junit4]   2> 15600 T3893 C234 P50746 oass.SolrIndexSearcher.<init> Opening Searcher@5d8e28a5 realtime
[junit4:junit4]   2> 15600 T3893 C234 P50746 oasu.DirectUpdateHandler2.commit end_commit_flush
[junit4:junit4]   2> 15601 T3893 C234 P50746 /update {waitSearcher=true&openSearcher=false&commit=true&commit_end_point=true&wt=javabin&softCommit=false&version=2} {commit=} 0 37
[junit4:junit4]   2> 15602 T3919 C232 P16232 oash.ReplicationHandler.inform Commits will be reserved for  10000
[junit4:junit4]   2> 15602 T3919 C232 P16232 oash.SnapPuller.<init>  No value set for 'pollInterval'. Timer Task not started.
[junit4:junit4]   2> 15633 T3894 C234 P50746 oash.ReplicationHandler.inform Commits will be reserved for  10000
[junit4:junit4]   2> 15634 T3894 C234 P50746 REQ /replication {command=indexversion&wt=javabin&qt=/replication&version=2} status=0 QTime=3 
[junit4:junit4]   2> 15634 T3919 C232 P16232 oash.SnapPuller.fetchLatestIndex Master's generation: 2
[junit4:junit4]   2> 15635 T3919 C232 P16232 oash.SnapPuller.fetchLatestIndex Slave's generation: 1
[junit4:junit4]   2> 15635 T3919 C232 P16232 oash.SnapPuller.fetchLatestIndex Starting replication process
[junit4:junit4]   2> 15637 T3894 C234 P50746 oasc.CachingDirectoryFactory.close Releasing directory:/usr/home/hudson/hudson-slave/workspace/Lucene-Solr-Tests-trunk-java7/solr/build/solr-core/test/J0/./org.apache.solr.cloud.SyncSliceTest-1357185846221/jetty1
[junit4:junit4]   2> 15639 T3894 C234 P50746 oasc.CachingDirectoryFactory.close Releasing directory:/usr/home/hudson/hudson-slave/workspace/Lucene-Solr-Tests-trunk-java7/solr/build/solr-core/test/J0/./org.apache.solr.cloud.SyncSliceTest-1357185846221/jetty1/index
[junit4:junit4]   2> 15639 T3894 C234 P50746 REQ /replication {command=filelist&generation=2&wt=javabin&qt=/replication&version=2} status=0 QTime=2 
[junit4:junit4]   2> 15640 T3919 C232 P16232 oash.SnapPuller.fetchLatestIndex Number of files in latest index in master: 1
[junit4:junit4]   2> 15641 T3919 C232 P16232 oasc.CachingDirectoryFactory.get return new directory for /usr/home/hudson/hudson-slave/workspace/Lucene-Solr-Tests-trunk-java7/solr/build/solr-core/test/J0/./org.apache.solr.cloud.SyncSliceTest-1357185846221/jetty2/index.20130102230421855 forceNew:false
[junit4:junit4]   2> 15642 T3919 C232 P16232 oasc.CachingDirectoryFactory.close Releasing directory:/usr/home/hudson/hudson-slave/workspace/Lucene-Solr-Tests-trunk-java7/solr/build/solr-core/test/J0/./org.apache.solr.cloud.SyncSliceTest-1357185846221/jetty2
[junit4:junit4]   2> 15642 T3919 C232 P16232 oash.SnapPuller.fetchLatestIndex Starting download to RateLimitedDirectoryWrapper(NRTCachingDirectory(org.apache.lucene.store.NIOFSDirectory@/usr/home/hudson/hudson-slave/workspace/Lucene-Solr-Tests-trunk-java7/solr/build/solr-core/test/J0/org.apache.solr.cloud.SyncSliceTest-1357185846221/jetty2/index.20130102230421855 lockFactory=org.apache.lucene.store.NativeFSLockFactory@26da4cd2; maxCacheMB=48.0 maxMergeSizeMB=4.0)) fullCopy=true
[junit4:junit4]   2> 15646 T3894 C234 P50746 REQ /replication {file=segments_2&command=filecontent&checksum=true&generation=2&qt=/replication&wt=filestream} status=0 QTime=0 
[junit4:junit4]   2> 15648 T3919 C232 P16232 oasc.CachingDirectoryFactory.close Releasing directory:/usr/home/hudson/hudson-slave/workspace/Lucene-Solr-Tests-trunk-java7/solr/build/solr-core/test/J0/./org.apache.solr.cloud.SyncSliceTest-1357185846221/jetty2/index
[junit4:junit4]   2> 15649 T3919 C232 P16232 oash.SnapPuller.fetchLatestIndex Total time taken for download : 0 secs
[junit4:junit4]   2> 15649 T3919 C232 P16232 oash.SnapPuller.modifyIndexProps New index installed. Updating index properties... index=index.20130102230421855
[junit4:junit4]   2> 15651 T3919 C232 P16232 oasc.CachingDirectoryFactory.close Releasing directory:/usr/home/hudson/hudson-slave/workspace/Lucene-Solr-Tests-trunk-java7/solr/build/solr-core/test/J0/./org.apache.solr.cloud.SyncSliceTest-1357185846221/jetty2
[junit4:junit4]   2> 15651 T3919 C232 P16232 oasc.CachingDirectoryFactory.close Releasing directory:/usr/home/hudson/hudson-slave/workspace/Lucene-Solr-Tests-trunk-java7/solr/build/solr-core/test/J0/./org.apache.solr.cloud.SyncSliceTest-1357185846221/jetty2
[junit4:junit4]   2> 15652 T3919 C232 P16232 oasc.SolrCore.getNewIndexDir New index directory detected: old=./org.apache.solr.cloud.SyncSliceTest-1357185846221/jetty2/index/ new=./org.apache.solr.cloud.SyncSliceTest-1357185846221/jetty2/index.20130102230421855
[junit4:junit4]   2> 15655 T3919 C232 P16232 oasc.SolrDeletionPolicy.onInit SolrDeletionPolicy.onInit: commits:num=1
[junit4:junit4]   2> 		commit{dir=RateLimitedDirectoryWrapper(NRTCachingDirectory(org.apache.lucene.store.NIOFSDirectory@/usr/home/hudson/hudson-slave/workspace/Lucene-Solr-Tests-trunk-java7/solr/build/solr-core/test/J0/org.apache.solr.cloud.SyncSliceTest-1357185846221/jetty2/index.20130102230421855 lockFactory=org.apache.lucene.store.NativeFSLockFactory@26da4cd2; maxCacheMB=48.0 maxMergeSizeMB=4.0)),segFN=segments_2,generation=2,filenames=[segments_2]
[junit4:junit4]   2> 15656 T3919 C232 P16232 oasc.SolrDeletionPolicy.updateCommits newest commit = 2[segments_2]
[junit4:junit4]   2> 15657 T3919 C232 P16232 oasc.CachingDirectoryFactory.close Releasing directory:/usr/home/hudson/hudson-slave/workspace/Lucene-Solr-Tests-trunk-java7/solr/build/solr-core/test/J0/./org.apache.solr.cloud.SyncSliceTest-1357185846221/jetty2
[junit4:junit4]   2> 15658 T3919 C232 P16232 oasu.DefaultSolrCoreState.newIndexWriter Creating new IndexWriter...
[junit4:junit4]   2> 15658 T3919 C232 P16232 oasu.DefaultSolrCoreState.newIndexWriter Waiting until IndexWriter is unused... core=collection1
[junit4:junit4]   2> 15658 T3919 C232 P16232 oasu.DefaultSolrCoreState.newIndexWriter Rollback old IndexWriter... core=collection1
[junit4:junit4]   2> 15659 T3919 C232 P16232 oasc.CachingDirectoryFactory.close Releasing directory:/usr/home/hudson/hudson-slave/workspace/Lucene-Solr-Tests-trunk-java7/solr/build/solr-core/test/J0/./org.apache.solr.cloud.SyncSliceTest-1357185846221/jetty2/index.20130102230421855
[junit4:junit4]   2> 15660 T3919 C232 P16232 oasc.CachingDirectoryFactory.close Releasing directory:/usr/home/hudson/hudson-slave/workspace/Lucene-Solr-Tests-trunk-java7/solr/build/solr-core/test/J0/./org.apache.solr.cloud.SyncSliceTest-1357185846221/jetty2
[junit4:junit4]   2> 15663 T3919 C232 P16232 oasc.SolrDeletionPolicy.onInit SolrDeletionPolicy.onInit: commits:num=1
[junit4:junit4]   2> 		commit{dir=RateLimitedDirectoryWrapper(NRTCachingDirectory(org.apache.lucene.store.NIOFSDirectory@/usr/home/hudson/hudson-slave/workspace/Lucene-Solr-Tests-trunk-java7/solr/build/solr-core/test/J0/org.apache.solr.cloud.SyncSliceTest-1357185846221/jetty2/index.20130102230421855 lockFactory=org.apache.lucene.store.NativeFSLockFactory@26da4cd2; maxCacheMB=48.0 maxMergeSizeMB=4.0)),segFN=segments_2,generation=2,filenames=[segments_2]
[junit4:junit4]   2> 15663 T3919 C232 P16232 oasc.SolrDeletionPolicy.updateCommits newest commit = 2[segments_2]
[junit4:junit4]   2> 15664 T3919 C232 P16232 oasu.DefaultSolrCoreState.newIndexWriter New IndexWriter is ready to be used.
[junit4:junit4]   2> 15664 T3919 C232 P16232 oasc.CachingDirectoryFactory.close Releasing directory:/usr/home/hudson/hudson-slave/workspace/Lucene-Solr-Tests-trunk-java7/solr/build/solr-core/test/J0/./org.apache.solr.cloud.SyncSliceTest-1357185846221/jetty2
[junit4:junit4]   2> 15664 T3919 C232 P16232 oass.SolrIndexSearcher.<init> Opening Searcher@11b651a5 main
[junit4:junit4]   2> 15667 T3918 oasc.SolrCore.registerSearcher [collection1] Registered new searcher Searcher@11b651a5 main{StandardDirectoryReader(segments_2:1:nrt)}
[junit4:junit4]   2> 15668 T3918 oasc.CachingDirectoryFactory.close Releasing directory:/usr/home/hudson/hudson-slave/workspace/Lucene-Solr-Tests-trunk-java7/solr/build/solr-core/test/J0/./org.apache.solr.cloud.SyncSliceTest-1357185846221/jetty2/index
[junit4:junit4]   2> 15668 T3919 C232 P16232 oasu.DirectUpdateHandler2.commit start commit{flags=0,_version_=0,optimize=false,openSearcher=false,waitSearcher=false,expungeDeletes=false,softCommit=false}
[junit4:junit4]   2> 15674 T3919 C232 P16232 oasc.SolrDeletionPolicy.onCommit SolrDeletionPolicy.onCommit: commits:num=2
[junit4:junit4]   2> 		commit{dir=RateLimitedDirectoryWrapper(NRTCachingDirectory(org.apache.lucene.store.NIOFSDirectory@/usr/home/hudson/hudson-slave/workspace/Lucene-Solr-Tests-trunk-java7/solr/build/solr-core/test/J0/org.apache.solr.cloud.SyncSliceTest-1357185846221/jetty2/index.20130102230421855 lockFactory=org.apache.lucene.store.NativeFSLockFactory@26da4cd2; maxCacheMB=48.0 maxMergeSizeMB=4.0)),segFN=segments_2,generation=2,filenames=[segments_2]
[junit4:junit4]   2> 		commit{dir=RateLimitedDirectoryWrapper(NRTCachingDirectory(org.apache.lucene.store.NIOFSDirectory@/usr/home/hudson/hudson-slave/workspace/Lucene-Solr-Tests-trunk-java7/solr/build/solr-core/test/J0/org.apache.solr.cloud.SyncSliceTest-1357185846221/jetty2/index.20130102230421855 lockFactory=org.apache.lucene.store.NativeFSLockFactory@26da4cd2; maxCacheMB=48.0 maxMergeSizeMB=4.0)),segFN=segments_3,generation=3,filenames=[segments_3]
[junit4:junit4]   2> 15674 T3919 C232 P16232 oasc.SolrDeletionPolicy.updateCommits newest commit = 3[segments_3]
[junit4:junit4]   2> 15676 T3919 C232 P16232 oasc.CachingDirectoryFactory.close Releasing directory:/usr/home/hudson/hudson-slave/workspace/Lucene-Solr-Tests-trunk-java7/solr/build/solr-core/test/J0/./org.apache.solr.cloud.SyncSliceTest-1357185846221/jetty2
[junit4:junit4]   2> 15676 T3919 C232 P16232 oasu.DirectUpdateHandler2.commit end_commit_flush
[junit4:junit4]   2> 15676 T3919 C232 P16232 oasc.CachingDirectoryFactory.close Releasing directory:/usr/home/hudson/hudson-slave/workspace/Lucene-Solr-Tests-trunk-java7/solr/build/solr-core/test/J0/./org.apache.solr.cloud.SyncSliceTest-1357185846221/jetty2/index.20130102230421855
[junit4:junit4]   2> 15676 T3919 C232 P16232 oasc.CachingDirectoryFactory.close Releasing directory:/usr/home/hudson/hudson-slave/workspace/Lucene-Solr-Tests-trunk-java7/solr/build/solr-core/test/J0/./org.apache.solr.cloud.SyncSliceTest-1357185846221/jetty2/index
[junit4:junit4]   2> 15677 T3919 C232 P16232 oasc.RecoveryStrategy.replay No replay needed. core=collection1
[junit4:junit4]   2> 15677 T3919 C232 P16232 oasc.RecoveryStrategy.doRecovery Replication Recovery was successful - registering as Active. core=collection1
[junit4:junit4]   2> 15677 T3919 C232 P16232 oasc.ZkController.publish publishing core=collection1 state=active
[junit4:junit4]   2> 15677 T3919 C232 P16232 oasc.ZkController.publish numShards not found on descriptor - reading it from system property
[junit4:junit4]   2> 15679 T3919 C232 P16232 oasc.RecoveryStrategy.doRecovery Finished recovery process. core=collection1
[junit4:junit4]   2> 16275 T3949 oass.OpenExchangeRatesOrgProvider.init Initialized with rates=open-exchange-rates.json, refreshInterval=1440.
[junit4:junit4]   2> 16286 T3882 oascc.ZkStateReader.updateClusterState Updating cloud state from ZooKeeper... 
[junit4:junit4]   2> 16286 T3949 oass.IndexSchema.readSchema default search field in schema is text
[junit4:junit4]   2> 16287 T3882 oasc.Overseer$ClusterStateUpdater.updateState Update state numShards=1 message={
[junit4:junit4]   2> 	  "operation":"state",
[junit4:junit4]   2> 	  "numShards":"1",
[junit4:junit4]   2> 	  "shard":"shard1",
[junit4:junit4]   2> 	  "roles":null,
[junit4:junit4]   2> 	  "state":"recovering",
[junit4:junit4]   2> 	  "core":"collection1",
[junit4:junit4]   2> 	  "collection":"collection1",
[junit4:junit4]   2> 	  "node_name":"127.0.0.1:17124_f%2Fjk",
[junit4:junit4]   2> 	  "base_url":"http://127.0.0.1:17124/f/jk"}
[junit4:junit4]   2> 16291 T3949 oass.IndexSchema.readSchema unique key field: id
[junit4:junit4]   2> 16294 T3882 oasc.Overseer$ClusterStateUpdater.updateState Update state numShards=1 message={
[junit4:junit4]   2> 	  "operation":"state",
[junit4:junit4]   2> 	  "numShards":"1",
[junit4:junit4]   2> 	  "shard":"shard1",
[junit4:junit4]   2> 	  "roles":null,
[junit4:junit4]   2> 	  "state":"active",
[junit4:junit4]   2> 	  "core":"collection1",
[junit4:junit4]   2> 	  "collection":"collection1",
[junit4:junit4]   2> 	  "node_name":"127.0.0.1:16232_f%2Fjk",
[junit4:junit4]   2> 	  "base_url":"http://127.0.0.1:16232/f/jk"}
[junit4:junit4]   2> 16318 T3948 oascc.ZkStateReader$2.process A cluster state change: WatchedEvent state:SyncConnected type:NodeDataChanged path:/clusterstate.json, has occurred - updating... (live nodes size: 5)
[junit4:junit4]   2> 16318 T3932 oascc.ZkStateReader$2.process A cluster state change: WatchedEvent state:SyncConnected type:NodeDataChanged path:/clusterstate.json, has occurred - updating... (live nodes size: 5)
[junit4:junit4]   2> 16318 T3900 oascc.ZkStateReader$2.process A cluster state change: WatchedEvent state:SyncConnected type:NodeDataChanged path:/clusterstate.json, has occurred - updating... (live nodes size: 5)
[junit4:junit4]   2> 16318 T3887 oascc.ZkStateReader$2.process A cluster state change: WatchedEvent state:SyncConnected type:NodeDataChanged path:/clusterstate.json, has occurred - updating... (live nodes size: 5)
[junit4:junit4]   2> 16318 T3881 oascc.ZkStateReader$2.process A cluster state change: WatchedEvent state:SyncConnected type:NodeDataChanged path:/clusterstate.json, has occurred - updating... (live nodes size: 5)
[junit4:junit4]   2> 16318 T3916 oascc.ZkStateReader$2.process A cluster state change: WatchedEvent state:SyncConnected type:NodeDataChanged path:/clusterstate.json, has occurred - updating... (live nodes size: 5)
[junit4:junit4]   2> 16362 T3949 oass.FileExchangeRateProvider.reload Reloading exchange rates from file currency.xml
[junit4:junit4]   2> 16406 T3949 oass.FileExchangeRateProvider.reload Reloading exchange rates from file currency.xml
[junit4:junit4]   2> 16413 T3949 oass.OpenExchangeRatesOrgProvider.reload Reloading exchange rates from open-exchange-rates.json
[junit4:junit4]   2> 16414 T3949 oass.OpenExchangeRatesOrgProvider.reload Reloading exchange rates from open-exchange-rates.json
[junit4:junit4]   2> 16415 T3949 oasc.SolrCore.<init> [collection1] Opening new SolrCore at /usr/home/hudson/hudson-slave/workspace/Lucene-Solr-Tests-trunk-java7/solr/build/solr-core/test/J0/./org.apache.solr.cloud.SyncSliceTest-jetty4-1357185861022/collection1/, dataDir=./org.apache.solr.cloud.SyncSliceTest-1357185846221/jetty4/
[junit4:junit4]   2> 16416 T3949 oasc.JmxMonitoredMap.<init> JMX monitoring is enabled. Adding Solr mbeans to JMX Server: com.sun.jmx.mbeanserver.JmxMBeanServer@230a52e5
[junit4:junit4]   2> 16416 T3949 oasc.SolrCore.initDirectoryFactory solr.NRTCachingDirectoryFactory
[junit4:junit4]   2> 16417 T3949 oasc.CachingDirectoryFactory.get return new directory for /usr/home/hudson/hudson-slave/workspace/Lucene-Solr-Tests-trunk-java7/solr/build/solr-core/test/J0/./org.apache.solr.cloud.SyncSliceTest-1357185846221/jetty4 forceNew:false
[junit4:junit4]   2> 16418 T3949 oasc.CachingDirectoryFactory.close Releasing directory:/usr/home/hudson/hudson-slave/workspace/Lucene-Solr-Tests-trunk-java7/solr/build/solr-core/test/J0/./org.apache.solr.cloud.SyncSliceTest-1357185846221/jetty4
[junit4:junit4]   2> 16419 T3949 oasc.SolrCore.getNewIndexDir New index directory detected: old=null new=./org.apache.solr.cloud.SyncSliceTest-1357185846221/jetty4/index/
[junit4:junit4]   2> 16420 T3949 oasc.SolrCore.initIndex WARNING [collection1] Solr index directory './org.apache.solr.cloud.SyncSliceTest-1357185846221/jetty4/index' doesn't exist. Creating new index...
[junit4:junit4]   2> 16422 T3949 oasc.CachingDirectoryFactory.get return new directory for /usr/home/hudson/hudson-slave/workspace/Lucene-Solr-Tests-trunk-java7/solr/build/solr-core/test/J0/./org.apache.solr.cloud.SyncSliceTest-1357185846221/jetty4/index forceNew:false
[junit4:junit4]   2> 16485 T3949 oasc.SolrDeletionPolicy.onCommit SolrDeletionPolicy.onCommit: commits:num=1
[junit4:junit4]   2> 		commit{dir=RateLimitedDirectoryWrapper(NRTCachingDirectory(org.apache.lucene.store.NIOFSDirectory@/usr/home/hudson/hudson-slave/workspace/Lucene-Solr-Tests-trunk-java7/solr/build/solr-core/test/J0/org.apache.solr.cloud.SyncSliceTest-1357185846221/jetty4/index lockFactory=org.apache.lucene.store.NativeFSLockFactory@3e5f54b9; maxCacheMB=48.0 maxMergeSizeMB=4.0)),segFN=segments_1,generation=1,filenames=[segments_1]
[junit4:junit4]   2> 16486 T3949 oasc.SolrDeletionPolicy.updateCommits newest commit = 1[segments_1]
[junit4:junit4]   2> 16487 T3949 oasc.CachingDirectoryFactory.close Releasing directory:/usr/home/hudson/hudson-slave/workspace/Lucene-Solr-Tests-trunk-java7/solr/build/solr-core/test/J0/./org.apache.solr.cloud.SyncSliceTest-1357185846221/jetty4/index
[junit4:junit4]   2> 16487 T3949 oasc.SolrCore.initWriters created xml: solr.XMLResponseWriter
[junit4:junit4]   2> 16489 T3949 oasup.UpdateRequestProcessorChain.init inserting DistributedUpdateProcessorFactory into updateRequestProcessorChain "dedupe"
[junit4:junit4]   2> 16489 T3949 oasup.UpdateRequestProcessorChain.init inserting DistributedUpdateProcessorFactory into updateRequestProcessorChain "dedupe-allfields"
[junit4:junit4]   2> 16490 T3949 oasup.UpdateRequestProcessorChain.init inserting DistributedUpdateProcessorFactory into updateRequestProcessorChain "stored_sig"
[junit4:junit4]   2> 16490 T3949 oasup.UpdateRequestProcessorChain.init inserting DistributedUpdateProcessorFactory into updateRequestProcessorChain "uniq-fields"
[junit4:junit4]   2> 16491 T3949 oasup.UpdateRequestProcessorChain.init inserting DistributedUpdateProcessorFactory into updateRequestProcessorChain "distrib-dup-test-chain-implicit"
[junit4:junit4]   2> 16491 T3949 oasc.RequestHandlers.initHandlersFromConfig adding lazy requestHandler: solr.ReplicationHandler
[junit4:junit4]   2> 16491 T3949 oasc.RequestHandlers.initHandlersFromConfig created /replication: solr.ReplicationHandler
[junit4:junit4]   2> 16492 T3949 oasc.RequestHandlers.initHandlersFromConfig created standard: solr.StandardRequestHandler
[junit4:junit4]   2> 16492 T3949 oasc.RequestHandlers.initHandlersFromConfig created /get: solr.RealTimeGetHandler
[junit4:junit4]   2> 16493 T3949 oasc.RequestHandlers.initHandlersFromConfig created dismax: solr.SearchHandler
[junit4:junit4]   2> 16493 T3949 oasc.RequestHandlers.initHandlersFromConfig created mock: org.apache.solr.core.MockQuerySenderListenerReqHandler
[junit4:junit4]   2> 16494 T3949 oasc.RequestHandlers.initHandlersFromConfig created /admin/: org.apache.solr.handler.admin.AdminHandlers
[junit4:junit4]   2> 16494 T3949 oasc.RequestHandlers.initHandlersFromConfig created defaults: solr.StandardRequestHandler
[junit4:junit4]   2> 16495 T3949 oasc.RequestHandlers.initHandlersFromConfig adding lazy requestHandler: solr.StandardRequestHandler
[junit4:junit4]   2> 16495 T3949 oasc.RequestHandlers.initHandlersFromConfig created lazy: solr.StandardRequestHandler
[junit4:junit4]   2> 16495 T3949 oasc.RequestHandlers.initHandlersFromConfig created /update: solr.UpdateRequestHandler
[junit4:junit4]   2> 16496 T3949 oasc.RequestHandlers.initHandlersFromConfig created /terms: org.apache.solr.handler.component.SearchHandler
[junit4:junit4]   2> 16496 T3949 oasc.RequestHandlers.initHandlersFromConfig created spellCheckCompRH: org.apache.solr.handler.component.SearchHandler
[junit4:junit4]   2> 16497 T3949 oasc.RequestHandlers.initHandlersFromConfig created spellCheckCompRH_Direct: org.apache.solr.handler.component.SearchHandler
[junit4:junit4]   2> 16497 T3949 oasc.RequestHandlers.initHandlersFromConfig created spellCheckWithWordbreak: org.apache.solr.handler.component.SearchHandler
[junit4:junit4]   2> 16498 T3949 oasc.RequestHandlers.initHandlersFromConfig created spellCheckWithWordbreak_Direct: org.apache.solr.handler.component.SearchHandler
[junit4:junit4]   2> 16498 T3949 oasc.RequestHandlers.initHandlersFromConfig created spellCheckCompRH1: org.apache.solr.handler.component.SearchHandler
[junit4:junit4]   2> 16499 T3949 oasc.RequestHandlers.initHandlersFromConfig created mltrh: org.apache.solr.handler.component.SearchHandler
[junit4:junit4]   2> 16499 T3949 oasc.RequestHandlers.initHandlersFromConfig created tvrh: org.apache.solr.handler.component.SearchHandler
[junit4:junit4]   2> 16499 T3949 oasc.RequestHandlers.initHandlersFromConfig created /mlt: solr.MoreLikeThisHandler
[junit4:junit4]   2> 16500 T3949 oasc.RequestHandlers.initHandlersFromConfig created /debug/dump: solr.DumpRequestHandler
[junit4:junit4]   2> 16513 T3949 oashl.XMLLoader.init xsltCacheLifetimeSeconds=60
[junit4:junit4]   2> 16520 T3949 oasc.SolrCore.initDeprecatedSupport WARNING solrconfig.xml uses deprecated <admin/gettableFiles>, Please update your config to use the ShowFileRequestHandler.
[junit4:junit4]   2> 16521 T3949 oasc.SolrCore.initDeprecatedSupport WARNING adding ShowFileRequestHandler with hidden files: [SCHEMA.XML, OLD_SYNONYMS.TXT, STOPWORDS.TXT, PROTWORDS.TXT, OPEN-EXCHANGE-RATES.JSON, SYNONYMS.TXT, CURRENCY.XML, MAPPING-ISOLATIN1ACCENT.TXT]
[junit4:junit4]   2> 16527 T3949 oasc.CachingDirectoryFactory.close Releasing directory:/usr/home/hudson/hudson-slave/workspace/Lucene-Solr-Tests-trunk-java7/solr/build/solr-core/test/J0/./org.apache.solr.cloud.SyncSliceTest-1357185846221/jetty4
[junit4:junit4]   2> 16528 T3949 oass.SolrIndexSearcher.<init> Opening Searcher@46a31163 main
[junit4:junit4]   2> 16529 T3949 oasu.CommitTracker.<init> Hard AutoCommit: disabled
[junit4:junit4]   2> 16530 T3949 oasu.CommitTracker.<init> Soft AutoCommit: disabled
[junit4:junit4]   2> 16530 T3949 oashc.SpellCheckComponent.inform Initializing spell checkers
[junit4:junit4]   2> 16549 T3949 oass.DirectSolrSpellChecker.init init: {name=direct,classname=DirectSolrSpellChecker,field=lowerfilt,minQueryLength=3}
[junit4:junit4]   2> 16629 T3952 oasc.SolrCore.registerSearcher [collection1] Registered new searcher Searcher@46a31163 main{StandardDirectoryReader(segments_1:1)}
[junit4:junit4]   2> 16633 T3949 oasc.ZkController.publish publishing core=collection1 state=down
[junit4:junit4]   2> 16634 T3949 oasc.ZkController.publish numShards not found on descriptor - reading it from system property
[junit4:junit4]   2> 17857 T3882 oascc.ZkStateReader.updateClusterState Updating cloud state from ZooKeeper... 
[junit4:junit4]   2> 17858 T3882 oasc.Overseer$ClusterStateUpdater.updateState Update state numShards=1 message={
[junit4:junit4]   2> 	  "operation":"state",
[junit4:junit4]   2> 	  "numShards":"1",
[junit4:junit4]   2> 	  "shard":null,
[junit4:junit4]   2> 	  "roles":null,
[junit4:junit4]   2> 	  "state":"down",
[junit4:junit4]   2> 	  "core":"collection1",
[junit4:junit4]   2> 	  "collection":"collection1",
[junit4:junit4]   2> 	  "node_name":"127.0.0.1:40006_f%2Fjk",
[junit4:junit4]   2> 	  "base_url":"http://127.0.0.1:40006/f/jk"}
[junit4:junit4]   2> 17858 T3882 oasc.Overseer$ClusterStateUpdater.updateState Collection already exists with numShards=1
[junit4:junit4]   2> 17858 T3882 oasc.Overseer$ClusterStateUpdater.updateState Assigning new node to shard shard=shard1
[junit4:junit4]   2> 17884 T3948 oascc.ZkStateReader$2.process A cluster state change: WatchedEvent state:SyncConnected type:NodeDataChanged path:/clusterstate.json, has occurred - updating... (live nodes size: 5)
[junit4:junit4]   2> 17884 T3887 oascc.ZkStateReader$2.process A cluster state change: WatchedEvent state:SyncConnected type:NodeDataChanged path:/clusterstate.json, has occurred - updating... (live nodes size: 5)
[junit4:junit4]   2> 17884 T3932 oascc.ZkStateReader$2.process A cluster state change: WatchedEvent state:SyncConnected type:NodeDataChanged path:/clusterstate.json, has occurred - updating... (live nodes size: 5)
[junit4:junit4]   2> 17884 T3916 oascc.ZkStateReader$2.process A cluster state change: WatchedEvent state:SyncConnected type:NodeDataChanged path:/clusterstate.json, has occurred - updating... (live nodes size: 5)
[junit4:junit4]   2> 17884 T3900 oascc.ZkStateReader$2.process A cluster state change: WatchedEvent state:SyncConnected type:NodeDataChanged path:/clusterstate.json, has occurred - updating... (live nodes size: 5)
[junit4:junit4]   2> 17884 T3881 oascc.ZkStateReader$2.process A cluster state change: WatchedEvent state:SyncConnected type:NodeDataChanged path:/clusterstate.json, has occurred - updating... (live nodes size: 5)
[junit4:junit4]   2> 18637 T3949 oasc.CoreContainer.registerCore registering core: collection1
[junit4:junit4]   2> 18637 T3949 oasc.ZkController.register Register replica - core:collection1 address:http://127.0.0.1:40006/f/jk collection:collection1 shard:shard1
[junit4:junit4]   2> 18640 T3949 oasc.ZkController.register We are http://127.0.0.1:40006/f/jk/collection1/ and leader is http://127.0.0.1:50746/f/jk/collection1/
[junit4:junit4]   2> 18641 T3949 oasc.ZkController.register No LogReplay needed for core=collection1 baseURL=http://127.0.0.1:40006/f/jk
[junit4:junit4]   2> 18641 T3949 oasc.ZkController.checkRecovery Core needs to recover:collection1
[junit4:junit4]   2> 18641 T3949 oasu.DefaultSolrCoreState.doRecovery Running recovery - first canceling any ongoing recovery
[junit4:junit4]   2> ASYNC  NEW_CORE C235 name=collection1 org.apache.solr.core.SolrCore@d64ad82 url=http://127.0.0.1:40006/f/jk/collection1 node=127.0.0.1:40006_f%2Fjk C235_STATE=coll:collection1 core:collection1 props:{shard=null, roles=null, state=down, core=collection1, collection=collection1, node_name=127.0.0.1:40006_f%2Fjk, base_url=http://127.0.0.1:40006/f/jk}
[junit4:junit4]   2> 18641 T3953 C235 P40006 oasc.RecoveryStrategy.run Starting recovery process.  core=collection1 recoveringAfterStartup=true
[junit4:junit4]   2> 18642 T3953 C235 P40006 oasc.RecoveryStrategy.doRecovery ###### startupVersions=[]
[junit4:junit4]   2> 18642 T3953 C235 P40006 oasc.ZkController.publish publishing core=collection1 state=recovering
[junit4:junit4]   2> 18642 T3953 C235 P40006 oasc.ZkController.publish numShards not found on descriptor - reading it from system property
[junit4:junit4]   2> 18643 T3949 oascc.ZkStateReader.updateClusterState Updating cloud state from ZooKeeper... 
[junit4:junit4]   2> 18643 T3953 C235 P40006 oascsi.HttpClientUtil.createClient Creating new http client, config:maxConnections=128&maxConnectionsPerHost=32&followRedirects=false
[junit4:junit4]   2> 18644 T3859 oass.SolrDispatchFilter.init user.dir=/usr/home/hudson/hudson-slave/workspace/Lucene-Solr-Tests-trunk-java7/solr/build/solr-core/test/J0
[junit4:junit4]   2> 18645 T3859 oass.SolrDispatchFilter.init SolrDispatchFilter.init() done
[junit4:junit4]   2> 18646 T3859 oascsi.HttpClientUtil.createClient Creating new http client, config:maxConnections=128&maxConnectionsPerHost=32&followRedirects=false
[junit4:junit4]   2> 18664 T3859 oascc.ZkStateReader.updateClusterState Updating cloud state from ZooKeeper... 
[junit4:junit4]   2> 18666 T3859 oasc.AbstractFullDistribZkTestBase.waitForThingsToLevelOut Wait for recoveries to finish - wait 15 for each attempt
[junit4:junit4]   2> 18666 T3859 oasc.AbstractDistribZkTestBase.waitForRecoveriesToFinish Wait for recoveries to finish - collection: collection1 failOnTimeout:true timeout (sec):15
[junit4:junit4]   2> 18667 T3859 oascc.ZkStateReader.updateClusterState Updating cloud state from ZooKeeper... 
[junit4:junit4]   2>  C233_STATE=coll:collection1 core:collection1 props:{shard=shard1, roles=null, state=recovering, core=collection1, collection=collection1, node_name=127.0.0.1:17124_f%2Fjk, base_url=http://127.0.0.1:17124/f/jk}
[junit4:junit4]   2> 18813 T3935 C233 P17124 oasc.RecoveryStrategy.doRecovery Attempting to PeerSync from http://127.0.0.1:50746/f/jk/collection1/ core=collection1 - recoveringAfterStartup=true
[junit4:junit4]   2> 18813 T3935 C233 P17124 oasu.PeerSync.sync PeerSync: core=collection1 url=http://127.0.0.1:17124/f/jk START replicas=[http://127.0.0.1:50746/f/jk/collection1/] nUpdates=100
[junit4:junit4]   2> 18814 T3935 C233 P17124 oasu.PeerSync.sync WARNING no frame of reference to tell of we've missed updates
[junit4:junit4]   2> 18814 T3935 C233 P17124 oasc.RecoveryStrategy.doRecovery PeerSync Recovery was not successful - trying replication. core=collection1
[junit4:junit4]   2> 18814 T3935 C233 P17124 oasc.RecoveryStrategy.doRecovery Starting Replication Recovery. core=collection1
[junit4:junit4]   2> 18814 T3935 C233 P17124 oasc.RecoveryStrategy.doRecovery Begin buffering updates. core=collection1
[junit4:junit4]   2> 18814 T3935 C233 P17124 oasu.UpdateLog.bufferUpdates Starting to buffer updates. FSUpdateLog{state=ACTIVE, tlog=null}
[junit4:junit4]   2> 18814 T3935 C233 P17124 oasc.RecoveryStrategy.replicate Attempting to replicate from http://127.0.0.1:50746/f/jk/collection1/. core=collection1
[junit4:junit4]   2> 18814 T3935 C233 P17124 oascsi.HttpClientUtil.createClient Creating new http client, config:maxConnections=128&maxConnectionsPerHost=32&followRedirects=false
[junit4:junit4]   2> 18816 T3892 C234 P50746 REQ /get {distrib=false&qt=/get&wt=javabin&version=2&getVersions=100} status=0 QTime=0 
[junit4:junit4]   2> 18825 T3896 C234 P50746 oasu.DirectUpdateHandler2.commit start commit{flags=0,_version_=0,optimize=false,openSearcher=false,waitSearcher=true,expungeDeletes=false,softCommit=false}
[junit4:junit4]   2> 18830 T3896 C234 P50746 oasc.SolrDeletionPolicy.onCommit SolrDeletionPolicy.onCommit: commits:num=2
[junit4:junit4]   2> 		commit{dir=RateLimitedDirectoryWrapper(NRTCachingDirectory(org.apache.lucene.store.NIOFSDirectory@/usr/home/hudson/hudson-slave/workspace/Lucene-Solr-Tests-trunk-java7/solr/build/solr-core/test/J0/org.apache.solr.cloud.SyncSliceTest-1357185846221/jetty1/index lockFactory=org.apache.lucene.store.NativeFSLockFactory@14ce370c; maxCacheMB=48.0 maxMergeSizeMB=4.0)),segFN=segments_2,generation=2,filenames=[segments_2]
[junit4:junit4]   2> 		commit{dir=RateLimitedDirectoryWrapper(NRTCachingDirectory(org.apache.lucene.store.NIOFSDirectory@/usr/home/hudson/hudson-slave/workspace/Lucene-Solr-Tests-trunk-java7/solr/build/solr-core/test/J0/org.apache.solr.cloud.SyncSliceTest-1357185846221/jetty1/index lockFactory=org.apache.lucene.store.NativeFSLockFactory@14ce370c; maxCacheMB=48.0 maxMergeSizeMB=4.0)),segFN=segments_3,generation=3,filenames=[segments_3]
[junit4:junit4]   2> 18831 T3896 C234 P50746 oasc.SolrDeletionPolicy.updateCommits newest commit = 3[segments_3]
[junit4:junit4]   2> 18831 T3896 C234 P50746 oasc.CachingDirectoryFactory.close Releasing directory:/usr/home/hudson/hudson-slave/workspace/Lucene-Solr-Tests-trunk-java7/solr/build/solr-core/test/J0/./org.apache.solr.cloud.SyncSliceTest-1357185846221/jetty1
[junit4:junit4]   2> 18832 T3896 C234 P50746 oasu.DirectUpdateHandler2.commit end_commit_flush
[junit4:junit4]   2> 18832 T3896 C234 P50746 /update {waitSearcher=true&openSearcher=false&commit=true&commit_end_point=true&wt=javabin&softCommit=false&version=2} {commit=} 0 7
[junit4:junit4]   2> 18833 T3935 C233 P17124 oash.ReplicationHandler.inform Commits will be reserved for  10000
[junit4:junit4]   2> 18833 T3935 C233 P17124 oash.SnapPuller.<init>  No value set for 'pollInterval'. Timer Task not started.
[junit4:junit4]   2> 18835 T3894 C234 P50746 REQ /replication {command=indexversion&wt=javabin&qt=/replication&version=2} status=0 QTime=0 
[junit4:junit4]   2> 18836 T3935 C233 P17124 oash.SnapPuller.fetchLatestIndex Master's generation: 3
[junit4:junit4]   2> 18837 T3935 C233 P17124 oash.SnapPuller.fetchLatestIndex Slave's generation: 1
[junit4:junit4]   2> 18837 T3935 C233 P17124 oash.SnapPuller.fetchLatestIndex Starting replication process
[junit4:junit4]   2> 18840 T3894 C234 P50746 oasc.CachingDirectoryFactory.close Releasing directory:/usr/home/hudson/hudson-slave/workspace/Lucene-Solr-Tests-trunk-java7/solr/build/solr-core/test/J0/./org.apache.solr.cloud.SyncSliceTest-1357185846221/jetty1
[junit4:junit4]   2> 18841 T3894 C234 P50746 oasc.CachingDirectoryFactory.close Releasing directory:/usr/home/hudson/hudson-slave/workspace/Lucene-Solr-Tests-trunk-java7/solr/build/solr-core/test/J0/./org.apache.solr.cloud.SyncSliceTest-1357185846221/jetty1/index
[junit4:junit4]   2> 18841 T3894 C234 P50746 REQ /replication {command=filelist&generation=3&wt=javabin&qt=/replication&version=2} status=0 QTime=2 
[junit4:junit4]   2> 18842 T3935 C233 P17124 oash.SnapPuller.fetchLatestIndex Number of files in latest index in master: 1
[junit4:junit4]   2> 18845 T3935 C233 P17124 oasc.CachingDirectoryFactory.get return new directory for /usr/home/hudson/hudson-slave/workspace/Lucene-Solr-Tests-trunk-java7/solr/build/solr-core/test/J0/./org.apache.solr.cloud.SyncSliceTest-1357185846221/jetty3/index.20130102230425057 forceNew:false
[junit4:junit4]   2> 18846 T3935 C233 P17124 oasc.CachingDirectoryFactory.close Releasing directory:/usr/home/hudson/hudson-slave/workspace/Lucene-Solr-Tests-trunk-java7/solr/build/solr-core/test/J0/./org.apache.solr.cloud.SyncSliceTest-1357185846221/jetty3
[junit4:junit4]   2> 18847 T3935 C233 P17124 oash.SnapPuller.fetchLatestIndex Starting download to RateLimitedDirectoryWrapper(NRTCachingDirectory(org.apache.lucene.store.NIOFSDirectory@/usr/home/hudson/hudson-slave/workspace/Lucene-Solr-Tests-trunk-java7/solr/build/solr-core/test/J0/org.apache.solr.cloud.SyncSliceTest-1357185846221/jetty3/index.20130102230425057 lockFactory=org.apache.lucene.store.NativeFSLockFactory@2f0da52d; maxCacheMB=48.0 maxMergeSizeMB=4.0)) fullCopy=true
[junit4:junit4]   2> 18878 T3894 C234 P50746 REQ /replication {file=segments_3&command=filecontent&checksum=true&generation=3&qt=/replication&wt=filestream} status=0 QTime=0 
[junit4:junit4]   2> 18880 T3935 C233 P17124 oasc.CachingDirectoryFactory.close Releasing directory:/usr/home/hudson/hudson-slave/workspace/Lucene-Solr-Tests-trunk-java7/solr/build/solr-core/test/J0/./org.apache.solr.cloud.SyncSliceTest-1357185846221/jetty3/index
[junit4:junit4]   2> 18880 T3935 C233 P17124 oash.SnapPuller.fetchLatestIndex Total time taken for download : 0 secs
[junit4:junit4]   2> 18881 T3935 C233 P17124 oash.SnapPuller.modifyIndexProps New index installed. Updating index properties... index=index.20130102230425057
[junit4:junit4]   2> 18882 T3935 C233 P17124 oasc.CachingDirectoryFactory.close Releasing directory:/usr/home/hudson/hudson-slave/workspace/Lucene-Solr-Tests-trunk-java7/solr/build/solr-core/test/J0/./org.apache.solr.cloud.SyncSliceTest-1357185846221/jetty3
[junit4:junit4]   2> 18883 T3935 C233 P17124 oasc.CachingDirectoryFactory.close Releasing directory:/usr/home/hudson/hudson-slave/workspace/Lucene-Solr-Tests-trunk-java7/solr/build/solr-core/test/J0/./org.apache.solr.cloud.SyncSliceTest-1357185846221/jetty3
[junit4:junit4]   2> 18883 T3935 C233 P17124 oasc.SolrCore.getNewIndexDir New index directory detected: old=./org.apache.solr.cloud.SyncSliceTest-1357185846221/jetty3/index/ new=./org.apache.solr.cloud.SyncSliceTest-1357185846221/jetty3/index.20130102230425057
[junit4:junit4]   2> 18886 T3935 C233 P17124 oasc.SolrDeletionPolicy.onInit SolrDeletionPolicy.onInit: commits:num=1
[junit4:junit4]   2> 		commit{dir=RateLimitedDirectoryWrapper(NRTCachingDirectory(org.apache.lucene.store.NIOFSDirectory@/usr/home/hudson/hudson-slave/workspace/Lucene-Solr-Tests-trunk-java7/solr/build/solr-core/test/J0/org.apache.solr.cloud.SyncSliceTest-1357185846221/jetty3/index.20130102230425057 lockFactory=org.apache.lucene.store.NativeFSLockFactory@2f0da52d; maxCacheMB=48.0 maxMergeSizeMB=4.0)),segFN=segments_3,generation=3,filenames=[segments_3]
[junit4:junit4]   2> 18887 T3935 C233 P17124 oasc.SolrDeletionPolicy.updateCommits newest commit = 3[segments_3]
[junit4:junit4]   2> 18888 T3935 C233 P17124 oasc.CachingDirectoryFactory.close Releasing directory:/usr/home/hudson/hudson-slave/workspace/Lucene-Solr-Tests-trunk-java7/solr/build/solr-core/test/J0/./org.apache.solr.cloud.SyncSliceTest-1357185846221/jetty3
[junit4:junit4]   2> 18888 T3935 C233 P17124 oasu.DefaultSolrCoreState.newIndexWriter Creating new IndexWriter...
[junit4:junit4]   2> 18888 T3935 C233 P17124 oasu.DefaultSolrCoreState.newIndexWriter Waiting until IndexWriter is unused... core=collection1
[junit4:junit4]   2> 18888 T3935 C233 P17124 oasu.DefaultSolrCoreState.newIndexWriter Rollback old IndexWriter... core=collection1
[junit4:junit4]   2> 18890 T3935 C233 P17124 oasc.CachingDirectoryFactory.close Releasing directory:/usr/home/hudson/hudson-slave/workspace/Lucene-Solr-Tests-trunk-java7/solr/build/solr-core/test/J0/./org.apache.solr.cloud.SyncSliceTest-1357185846221/jetty3/index.20130102230425057
[junit4:junit4]   2> 18890 T3935 C233 P17124 oasc.CachingDirectoryFactory.close Releasing directory:/usr/home/hudson/hudson-slave/workspace/Lucene-Solr-Tests-trunk-java7/solr/build/solr-core/test/J0/./org.apache.solr.cloud.SyncSliceTest-1357185846221/jetty3
[junit4:junit4]   2> 18893 T3935 C233 P17124 oasc.SolrDeletionPolicy.onInit SolrDeletionPolicy.onInit: commits:num=1
[junit4:junit4]   2> 		commit{dir=RateLimitedDirectoryWrapper(NRTCachingDirectory(org.apache.lucene.store.NIOFSDirectory@/usr/home/hudson/hudson-slave/workspace/Lucene-Solr-Tests-trunk-java7/solr/build/solr-core/test/J0/org.apache.solr.cloud.SyncSliceTest-1357185846221/jetty3/index.20130102230425057 lockFactory=org.apache.lucene.store.NativeFSLockFactory@2f0da52d; maxCacheMB=48.0 maxMergeSizeMB=4.0)),segFN=segments_3,generation=3,filenames=[segments_3]
[junit4:junit4]   2> 18894 T3935 C233 P17124 oasc.SolrDeletionPolicy.updateCommits newest commit = 3[segments_3]
[junit4:junit4]   2> 18894 T3935 C233 P17124 oasu.DefaultSolrCoreState.newIndexWriter New IndexWriter is ready to be used.
[junit4:junit4]   2> 18894 T3935 C233 P17124 oasc.CachingDirectoryFactory.close Releasing directory:/usr/home/hudson/hudson-slave/workspace/Lucene-Solr-Tests-trunk-java7/solr/build/solr-core/test/J0/./org.apache.solr.cloud.SyncSliceTest-1357185846221/jetty3
[junit4:junit4]   2> 18895 T3935 C233 P17124 oass.SolrIndexSearcher.<init> Opening Searcher@6c60f1fe main
[junit4:junit4]   2> 18896 T3934 oasc.SolrCore.registerSearcher [collection1] Registered new searcher Searcher@6c60f1fe main{StandardDirectoryReader(segments_3:1:nrt)}
[junit4:junit4]   2> 18898 T3934 oasc.CachingDirectoryFactory.close Releasing directory:/usr/home/hudson/hudson-slave/workspace/Lucene-Solr-Tests-trunk-java7/solr/build/solr-core/test/J0/./org.apache.solr.cloud.SyncSliceTest-1357185846221/jetty3/index
[junit4:junit4]   2> 18898 T3935 C233 P17124 oasu.DirectUpdateHandler2.commit start commit{flags=0,_version_=0,optimize=false,openSearcher=false,waitSearcher=false,expungeDeletes=false,softCommit=false}
[junit4:junit4]   2> 18902 T3935 C233 P17124 oasc.SolrDeletionPolicy.onCommit SolrDeletionPolicy.onCommit: commits:num=2
[junit4:junit4]   2> 		commit{dir=RateLimitedDirectoryWrapper(NRTCachingDirectory(org.apache.lucene.store.NIOFSDirectory@/usr/home/hudson/hudson-slave/workspace/Lucene-Solr-Tests-trunk-java7/solr/build/solr-core/test/J0/org.apache.solr.cloud.SyncSliceTest-1357185846221/jetty3/index.20130102230425057 lockFactory=org.apache.lucene.store.NativeFSLockFactory@2f0da52d; maxCacheMB=48.0 maxMergeSizeMB=4.0)),segFN=segments_3,generation=3,filenames=[segments_3]
[junit4:junit4]   2> 		commit{dir=RateLimitedDirectoryWrapper(NRTCachingDirectory(org.apache.lucene.store.NIOFSDirectory@/usr/home/hudson/hudson-slave/workspace/Lucene-Solr-Tests-trunk-java7/solr/build/solr-core/test/J0/org.apache.solr.cloud.SyncSliceTest-1357185846221/jetty3/index.20130102230425057 lockFactory=org.apache.lucene.store.NativeFSLockFactory@2f0da52d; maxCacheMB=48.0 maxMergeSizeMB=4.0)),segFN=segments_4,generation=4,filenames=[segments_4]
[junit4:junit4]   2> 18902 T3935 C233 P17124 oasc.SolrDeletionPolicy.updateCommits newest commit = 4[segments_4]
[junit4:junit4]   2> 18903 T3935 C233 P17124 oasc.CachingDirectoryFactory.close Releasing directory:/usr/home/hudson/hudson-slave/workspace/Lucene-Solr-Tests-trunk-java7/solr/build/solr-core/test/J0/./org.apache.solr.cloud.SyncSliceTest-1357185846221/jetty3
[junit4:junit4]   2> 18904 T3935 C233 P17124 oasu.DirectUpdateHandler2.commit end_commit_flush
[junit4:junit4]   2> 18904 T3935 C233 P17124 oasc.CachingDirectoryFactory.close Releasing directory:/usr/home/hudson/hudson-slave/workspace/Lucene-Solr-Tests-trunk-java7/solr/build/solr-core/test/J0/./org.apache.solr.cloud.SyncSliceTest-1357185846221/jetty3/index.20130102230425057
[junit4:junit4]   2> 18904 T3935 C233 P17124 oasc.CachingDirectoryFactory.close Releasing directory:/usr/home/hudson/hudson-slave/workspace/Lucene-Solr-Tests-trunk-java7/solr/build/solr-core/test/J0/./org.apache.solr.cloud.SyncSliceTest-1357185846221/jetty3/index
[junit4:junit4]   2> 18904 T3935 C233 P17124 oasc.RecoveryStrategy.replay No replay needed. core=collection1
[junit4:junit4]   2> 18904 T3935 C233 P17124 oasc.RecoveryStrategy.doRecovery Replication Recovery was successful - registering as Active. core=collection1
[junit4:junit4]   2> 18905 T3935 C233 P17124 oasc.ZkController.publish publishing core=collection1 state=active
[junit4:junit4]   2> 18905 T3935 C233 P17124 oasc.ZkController.publish numShards not found on descriptor - reading it from system property
[junit4:junit4]   2> 18912 T3935 C233 P17124 oasc.RecoveryStrategy.doRecovery Finished recovery process. core=collection1
[junit4:junit4]   2> 19406 T3882 oascc.ZkStateReader.updateClusterState Updating cloud state from ZooKeeper... 
[junit4:junit4]   2> 19407 T3882 oasc.Overseer$ClusterStateUpdater.updateState Update state numShards=1 message={
[junit4:junit4]   2> 	  "operation":"state",
[junit4:junit4]   2> 	  "numShards":"1",
[junit4:junit4]   2> 	  "shard":"shard1",
[junit4:junit4]   2> 	  "roles":null,
[junit4:junit4]   2> 	  "state":"recovering",
[junit4:junit4]   2> 	  "core":"collection1",
[junit4:junit4]   2> 	  "collection":"collection1",
[junit4:junit4]   2> 	  "node_name":"127.0.0.1:40006_f%2Fjk",
[junit4:junit4]   2> 	  "base_url":"http://127.0.0.1:40006/f/jk"}
[junit4:junit4]   2> 19444 T3882 oasc.Overseer$ClusterStateUpdater.updateState Update state numShards=1 message={
[junit4:junit4]   2> 	  "operation":"state",
[junit4:junit4]   2> 	  "numShards":"1",
[junit4:junit4]   2> 	  "shard":"shard1",
[junit4:junit4]   2> 	  "roles":null,
[junit4:junit4]   2> 	  "state":"active",
[junit4:junit4]   2> 	  "core":"collection1",
[junit4:junit4]   2> 	  "collection":"collection1",
[junit4:junit4]   2> 	  "node_name":"127.0.0.1:17124_f%2Fjk",
[junit4:junit4]   2> 	  "base_url":"http://127.0.0.1:17124/f/jk"}
[junit4:junit4]   2> 19487 T3881 oascc.ZkStateReader$2.process A cluster state change: WatchedEvent state:SyncConnected type:NodeDataChanged path:/clusterstate.json, has occurred - updating... (live nodes size: 5)
[junit4:junit4]   2> 19487 T3887 oascc.ZkStateReader$2.process A cluster state change: WatchedEvent state:SyncConnected type:NodeDataChanged path:/clusterstate.json, has occurred - updating... (live nodes size: 5)
[junit4:junit4]   2> 19487 T3932 oascc.ZkStateReader$2.process A cluster state change: WatchedEvent state:SyncConnected type:NodeDataChanged path:/clusterstate.json, has occurred - updating... (live nodes size: 5)
[junit4:junit4]   2> 19487 T3948 oascc.ZkStateReader$2.process A cluster state change: WatchedEvent state:SyncConnected type:NodeDataChanged path:/clusterstate.json, has occurred - updating... (live nodes size: 5)
[junit4:junit4]   2> 19487 T3916 oascc.ZkStateReader$2.process A cluster state change: WatchedEvent state:SyncConnected type:NodeDataChanged path:/clusterstate.json, has occurred - updating... (live nodes size: 5)
[junit4:junit4]   2> 19487 T3900 oascc.ZkStateReader$2.process A cluster state change: WatchedEvent state:SyncConnected type:NodeDataChanged path:/clusterstate.json, has occurred - updating... (live nodes size: 5)
[junit4:junit4]   2> 19669 T3859 oascc.ZkStateReader.updateClusterState Updating cloud state from ZooKeeper... 
[junit4:junit4]   2> 20671 T3859 oascc.ZkStateReader.updateClusterState Updating cloud state from ZooKeeper... 
[junit4:junit4]   2>  C235_STATE=coll:collection1 core:collection1 props:{shard=shard1, roles=null, state=recovering, core=collection1, collection=collection1, node_name=127.0.0.1:40006_f%2Fjk, base_url=http://127.0.0.1:40006/f/jk}
[junit4:junit4]   2> 21663 T3953 C235 P40006 oasc.RecoveryStrategy.doRecovery Attempting to PeerSync from http://127.0.0.1:50746/f/jk/collection1/ core=collection1 - recoveringAfterStartup=true
[junit4:junit4]   2> 21663 T3953 C235 P40006 oasu.PeerSync.sync PeerSync: core=collection1 url=http://127.0.0.1:40006/f/jk START replicas=[http://127.0.0.1:50746/f/jk/collection1/] nUpdates=100
[junit4:junit4]   2> 21663 T3953 C235 P40006 oasu.PeerSync.sync WARNING no frame of reference to tell of we've missed updates
[junit4:junit4]   2> 21664 T3953 C235 P40006 oasc.RecoveryStrategy.doRecovery PeerSync Recovery was not successful - trying replication. core=collection1
[junit4:junit4]   2> 21664 T3953 C235 P40006 oasc.RecoveryStrategy.doRecovery Starting Replication Recovery. core=collection1
[junit4:junit4]   2> 21664 T3953 C235 P40006 oasc.RecoveryStrategy.doRecovery Begin buffering updates. core=collection1
[junit4:junit4]   2> 21664 T3953 C235 P40006 oasu.UpdateLog.bufferUpdates Starting to buffer updates. FSUpdateLog{state=ACTIVE, tlog=null}
[junit4:junit4]   2> 21664 T3953 C235 P40006 oasc.RecoveryStrategy.replicate Attempting to replicate from http://127.0.0.1:50746/f/jk/collection1/. core=collection1
[junit4:junit4]   2> 21664 T3953 C235 P40006 oascsi.HttpClientUtil.createClient Creating new http client, config:maxConnections=128&maxConnectionsPerHost=32&followRedirects=false
[junit4:junit4]   2> 21666 T3892 C234 P50746 REQ /get {distrib=false&qt=/get&wt=javabin&version=2&getVersions=100} status=0 QTime=0 
[junit4:junit4]   2> 21673 T3859 oascc.ZkStateReader.updateClusterState Updating cloud state from ZooKeeper... 
[junit4:junit4]   2> 21676 T3890 C234 P50746 oasu.DirectUpdateHandler2.commit start commit{flags=0,_version_=0,optimize=false,openSearcher=false,waitSearcher=true,expungeDeletes=false,softCommit=false}
[junit4:junit4]   2> 21680 T3890 C234 P50746 oasc.SolrDeletionPolicy.onCommit SolrDeletionPolicy.onCommit: commits:num=3
[junit4:junit4]   2> 		commit{dir=RateLimitedDirectoryWrapper(NRTCachingDirectory(org.apache.lucene.store.NIOFSDirectory@/usr/home/hudson/hudson-slave/workspace/Lucene-Solr-Tests-trunk-java7/solr/build/solr-core/test/J0/org.apache.solr.cloud.SyncSliceTest-1357185846221/jetty1/index lockFactory=org.apache.lucene.store.NativeFSLockFactory@14ce370c; maxCacheMB=48.0 maxMergeSizeMB=4.0)),segFN=segments_2,generation=2,filenames=[segments_2]
[junit4:junit4]   2> 		commit{dir=RateLimitedDirectoryWrapper(NRTCachingDirectory(org.apache.lucene.store.NIOFSDirectory@/usr/home/hudson/hudson-slave/workspace/Lucene-Solr-Tests-trunk-java7/solr/build/solr-core/test/J0/org.apache.solr.cloud.SyncSliceTest-1357185846221/jetty1/index lockFactory=org.apache.lucene.store.NativeFSLockFactory@14ce370c; maxCacheMB=48.0 maxMergeSizeMB=4.0)),segFN=segments_3,generation=3,filenames=[segments_3]
[junit4:junit4]   2> 		commit{dir=RateLimitedDirectoryWrapper(NRTCachingDirectory(org.apache.lucene.store.NIOFSDirectory@/usr/home/hudson/hudson-slave/workspace/Lucene-Solr-Tests-trunk-java7/solr/build/solr-core/test/J0/org.apache.solr.cloud.SyncSliceTest-1357185846221/jetty1/index lockFactory=org.apache.lucene.store.NativeFSLockFactory@14ce370c; maxCacheMB=48.0 maxMergeSizeMB=4.0)),segFN=segments_4,generation=4,filenames=[segments_4]
[junit4:junit4]   2> 21680 T3890 C234 P50746 oasc.SolrDeletionPolicy.updateCommits newest commit = 4[segments_4]
[junit4:junit4]   2> 21680 T3890 C234 P50746 oasc.CachingDirectoryFactory.close Releasing directory:/usr/home/hudson/hudson-slave/workspace/Lucene-Solr-Tests-trunk-java7/solr/build/solr-core/test/J0/./org.apache.solr.cloud.SyncSliceTest-1357185846221/jetty1
[junit4:junit4]   2> 21681 T3890 C234 P50746 oasu.DirectUpdateHandler2.commit end_commit_flush
[junit4:junit4]   2> 21681 T3890 C234 P50746 /update {waitSearcher=true&openSearcher=false&commit=true&commit_end_point=true&wt=javabin&softCommit=false&version=2} {commit=} 0 5
[junit4:junit4]   2> 21682 T3953 C235 P40006 oash.ReplicationHandler.inform Commits will be reserved for  10000
[junit4:junit4]   2> 21682 T3953 C235 P40006 oash.SnapPuller.<init>  No value set for 'pollInterval'. Timer Task not started.
[junit4:junit4]   2> 21685 T3894 C234 P50746 REQ /replication {command=indexversion&wt=javabin&qt=/replication&version=2} status=0 QTime=0 
[junit4:junit4]   2> 21686 T3953 C235 P40006 oash.SnapPuller.fetchLatestIndex Master's generation: 4
[junit4:junit4]   2> 21686 T3953 C235 P40006 oash.SnapPuller.fetchLatestIndex Slave's generation: 1
[junit4:junit4]   2> 21686 T3953 C235 P40006 oash.SnapPuller.fetchLatestIndex Starting replication process
[junit4:junit4]   2> 21688 T3894 C234 P50746 oasc.CachingDirectoryFactory.close Releasing directory:/usr/home/hudson/hudson-slave/workspace/Lucene-Solr-Tests-trunk-java7/solr/build/solr-core/test/J0/./org.apache.solr.cloud.SyncSliceTest-1357185846221/jetty1
[junit4

[...truncated too long message...]

    at java.net.AbstractPlainSocketImpl.accept(AbstractPlainSocketImpl.java:398)
[junit4:junit4]   2> 	        at java.net.ServerSocket.implAccept(ServerSocket.java:522)
[junit4:junit4]   2> 	        at java.net.ServerSocket.accept(ServerSocket.java:490)
[junit4:junit4]   2> 	        at org.eclipse.jetty.server.bio.SocketConnector.accept(SocketConnector.java:117)
[junit4:junit4]   2> 	        at org.eclipse.jetty.server.AbstractConnector$Acceptor.run(AbstractConnector.java:938)
[junit4:junit4]   2> 	        at org.eclipse.jetty.util.thread.QueuedThreadPool.runJob(QueuedThreadPool.java:608)
[junit4:junit4]   2> 	        at org.eclipse.jetty.util.thread.QueuedThreadPool$3.run(QueuedThreadPool.java:543)
[junit4:junit4]   2> 	        at java.lang.Thread.run(Thread.java:722)
[junit4:junit4]   2> 	  20) Thread[id=1082, name=qtp1900214702-1082 Acceptor0 SocketConnector@127.0.0.1:53760, state=RUNNABLE, group=TGRP-BasicDistributedZkTest]
[junit4:junit4]   2> 	        at java.net.PlainSocketImpl.socketAccept(Native Method)
[junit4:junit4]   2> 	        at java.net.AbstractPlainSocketImpl.accept(AbstractPlainSocketImpl.java:398)
[junit4:junit4]   2> 	        at java.net.ServerSocket.implAccept(ServerSocket.java:522)
[junit4:junit4]   2> 	        at java.net.ServerSocket.accept(ServerSocket.java:490)
[junit4:junit4]   2> 	        at org.eclipse.jetty.server.bio.SocketConnector.accept(SocketConnector.java:117)
[junit4:junit4]   2> 	        at org.eclipse.jetty.server.AbstractConnector$Acceptor.run(AbstractConnector.java:938)
[junit4:junit4]   2> 	        at org.eclipse.jetty.util.thread.QueuedThreadPool.runJob(QueuedThreadPool.java:608)
[junit4:junit4]   2> 	        at org.eclipse.jetty.util.thread.QueuedThreadPool$3.run(QueuedThreadPool.java:543)
[junit4:junit4]   2> 	        at java.lang.Thread.run(Thread.java:722)
[junit4:junit4]   2> 	  21) Thread[id=1052, name=qtp186686455-1052 Acceptor0 SocketConnector@127.0.0.1:53754, state=RUNNABLE, group=TGRP-BasicDistributedZkTest]
[junit4:junit4]   2> 	        at java.net.PlainSocketImpl.socketAccept(Native Method)
[junit4:junit4]   2> 	        at java.net.AbstractPlainSocketImpl.accept(AbstractPlainSocketImpl.java:398)
[junit4:junit4]   2> 	        at java.net.ServerSocket.implAccept(ServerSocket.java:522)
[junit4:junit4]   2> 	        at java.net.ServerSocket.accept(ServerSocket.java:490)
[junit4:junit4]   2> 	        at org.eclipse.jetty.server.bio.SocketConnector.accept(SocketConnector.java:117)
[junit4:junit4]   2> 	        at org.eclipse.jetty.server.AbstractConnector$Acceptor.run(AbstractConnector.java:938)
[junit4:junit4]   2> 	        at org.eclipse.jetty.util.thread.QueuedThreadPool.runJob(QueuedThreadPool.java:608)
[junit4:junit4]   2> 	        at org.eclipse.jetty.util.thread.QueuedThreadPool$3.run(QueuedThreadPool.java:543)
[junit4:junit4]   2> 	        at java.lang.Thread.run(Thread.java:722)
[junit4:junit4]   2> 	  22) Thread[id=1095, name=searcherExecutor-687-thread-1, state=WAITING, group=TGRP-BasicDistributedZkTest]
[junit4:junit4]   2> 	        at sun.misc.Unsafe.park(Native Method)
[junit4:junit4]   2> 	        at java.util.concurrent.locks.LockSupport.park(LockSupport.java:186)
[junit4:junit4]   2> 	        at java.util.concurrent.locks.AbstractQueuedSynchronizer$ConditionObject.await(AbstractQueuedSynchronizer.java:2043)
[junit4:junit4]   2> 	        at java.util.concurrent.LinkedBlockingQueue.take(LinkedBlockingQueue.java:442)
[junit4:junit4]   2> 	        at java.util.concurrent.ThreadPoolExecutor.getTask(ThreadPoolExecutor.java:1043)
[junit4:junit4]   2> 	        at java.util.concurrent.ThreadPoolExecutor.runWorker(ThreadPoolExecutor.java:1103)
[junit4:junit4]   2> 	        at java.util.concurrent.ThreadPoolExecutor$Worker.run(ThreadPoolExecutor.java:603)
[junit4:junit4]   2> 	        at java.lang.Thread.run(Thread.java:722)
[junit4:junit4]   2> 	  23) Thread[id=1124, name=TEST-BasicDistributedZkTest.testDistribSearch-seed#[88D06608409B4251]-SendThread(localhost:53747), state=RUNNABLE, group=TGRP-BasicDistributedZkTest]
[junit4:junit4]   2> 	        at sun.nio.ch.KQueueArrayWrapper.kevent0(Native Method)
[junit4:junit4]   2> 	        at sun.nio.ch.KQueueArrayWrapper.poll(KQueueArrayWrapper.java:159)
[junit4:junit4]   2> 	        at sun.nio.ch.KQueueSelectorImpl.doSelect(KQueueSelectorImpl.java:103)
[junit4:junit4]   2> 	        at sun.nio.ch.SelectorImpl.lockAndDoSelect(SelectorImpl.java:87)
[junit4:junit4]   2> 	        at sun.nio.ch.SelectorImpl.select(SelectorImpl.java:98)
[junit4:junit4]   2> 	        at org.apache.zookeeper.ClientCnxnSocketNIO.doTransport(ClientCnxnSocketNIO.java:338)
[junit4:junit4]   2> 	        at org.apache.zookeeper.ClientCnxn$SendThread.run(ClientCnxn.java:1068)
[junit4:junit4]   2> 	  24) Thread[id=1097, name=HashSessionScavenger-23, state=TIMED_WAITING, group=TGRP-BasicDistributedZkTest]
[junit4:junit4]   2> 	        at java.lang.Object.wait(Native Method)
[junit4:junit4]   2> 	        at java.util.TimerThread.mainLoop(Timer.java:552)
[junit4:junit4]   2> 	        at java.util.TimerThread.run(Timer.java:505)
[junit4:junit4]   2> NOTE: test params are: codec=Lucene41: {n_f1=PostingsFormat(name=Direct), foo_b=Pulsing41(freqCutoff=5 minBlockSize=22 maxBlockSize=112), foo_d=PostingsFormat(name=MockSep), foo_f=Pulsing41(freqCutoff=5 minBlockSize=22 maxBlockSize=112), n_tl1=PostingsFormat(name=Direct), n_d1=Pulsing41(freqCutoff=20 minBlockSize=22 maxBlockSize=112), rnd_b=PostingsFormat(name=MockSep), intDefault=Pulsing41(freqCutoff=20 minBlockSize=22 maxBlockSize=112), n_td1=PostingsFormat(name=Direct), timestamp=Pulsing41(freqCutoff=20 minBlockSize=22 maxBlockSize=112), id=PostingsFormat(name=MockSep), range_facet_sl=Pulsing41(freqCutoff=5 minBlockSize=22 maxBlockSize=112), range_facet_si=PostingsFormat(name=Direct), oddField_s=Pulsing41(freqCutoff=5 minBlockSize=22 maxBlockSize=112), foo_i=PostingsFormat(name=Direct), multiDefault=PostingsFormat(name=Direct), n_tf1=Pulsing41(freqCutoff=20 minBlockSize=22 maxBlockSize=112), n_dt1=PostingsFormat(name=Direct), n_ti1=PostingsFormat(name=MockSep), range_facet_l=Pulsing41(freqCutoff=20 minBlockSize=22 maxBlockSize=112), text=Pulsing41(freqCutoff=5 minBlockSize=22 maxBlockSize=112), _version_=Pulsing41(freqCutoff=20 minBlockSize=22 maxBlockSize=112), val_i=PostingsFormat(name=MockSep), SubjectTerms_mfacet=Pulsing41(freqCutoff=20 minBlockSize=22 maxBlockSize=112), a_t=Pulsing41(freqCutoff=20 minBlockSize=22 maxBlockSize=112), n_tdt1=Pulsing41(freqCutoff=20 minBlockSize=22 maxBlockSize=112), other_tl1=Pulsing41(freqCutoff=20 minBlockSize=22 maxBlockSize=112), n_l1=Pulsing41(freqCutoff=20 minBlockSize=22 maxBlockSize=112), a_si=PostingsFormat(name=Direct)}, sim=DefaultSimilarity, locale=fi_FI, timezone=Asia/Thimphu
[junit4:junit4]   2> NOTE: FreeBSD 9.0-RELEASE amd64/Oracle Corporation 1.7.0_09 (64-bit)/cpus=16,threads=26,free=270072800,total=497025024
[junit4:junit4]   2> NOTE: All tests run in this JVM: [TestDFRSimilarityFactory, ZkSolrClientTest, OutputWriterTest, TestDocSet, DOMUtilTest, TermVectorComponentTest, TestReload, TestLazyCores, IndexSchemaRuntimeFieldTest, TestRealTimeGet, ConvertedLegacyTest, DisMaxRequestHandlerTest, TestPhraseSuggestions, TestMultiCoreConfBootstrap, PeerSyncTest, TestSort, XmlUpdateRequestHandlerTest, URLClassifyProcessorTest, TestRecovery, TestSolrJ, StandardRequestHandlerTest, ReturnFieldsTest, TestSolr4Spatial, TestStressRecovery, StatsComponentTest, SuggesterTSTTest, SuggesterTest, TestSolrCoreProperties, TestAnalyzedSuggestions, IndexReaderFactoryTest, TestValueSourceCache, TestPropInject, TestSolrDeletionPolicy2, RecoveryZkTest, QueryParsingTest, MultiTermTest, TestStressLucene, DocumentBuilderTest, TestCharFilters, TestUtils, UpdateParamsTest, TestReversedWildcardFilterFactory, RAMDirectoryFactoryTest, SignatureUpdateProcessorFactoryTest, TestBM25SimilarityFactory, TestHashPartitioner, PrimUtilsTest, UUIDFieldTest, TestSolrDeletionPolicy1, TestDistributedSearch, DebugComponentTest, TestStressReorder, RequiredFieldsTest, FieldMutatingUpdateProcessorTest, TestMergePolicyConfig, TestFoldingMultitermQuery, LeaderElectionTest, SchemaVersionSpecificBehaviorTest, LukeRequestHandlerTest, PrimitiveFieldTypeTest, BasicDistributedZkTest]
[junit4:junit4]   2> NOTE: reproduce with: ant test  -Dtestcase=BasicDistributedZkTest -Dtests.seed=88D06608409B4251 -Dtests.multiplier=3 -Dtests.slow=true -Dtests.locale=fi_FI -Dtests.timezone=Asia/Thimphu -Dtests.file.encoding=US-ASCII
[junit4:junit4] ERROR   0.00s J1 | BasicDistributedZkTest (suite) <<<
[junit4:junit4]    > Throwable #1: java.lang.Exception: Suite timeout exceeded (>= 7200000 msec).
[junit4:junit4]    > 	at __randomizedtesting.SeedInfo.seed([88D06608409B4251]:0)
[junit4:junit4] Completed on J1 in 7223.65s, 1 test, 2 errors <<< FAILURES!

[...truncated 12 lines...]
BUILD FAILED
/usr/home/hudson/hudson-slave/workspace/Lucene-Solr-Tests-trunk-java7/build.xml:353: The following error occurred while executing this line:
/usr/home/hudson/hudson-slave/workspace/Lucene-Solr-Tests-trunk-java7/build.xml:39: The following error occurred while executing this line:
/usr/home/hudson/hudson-slave/workspace/Lucene-Solr-Tests-trunk-java7/solr/build.xml:178: The following error occurred while executing this line:
/usr/home/hudson/hudson-slave/workspace/Lucene-Solr-Tests-trunk-java7/solr/common-build.xml:438: The following error occurred while executing this line:
/usr/home/hudson/hudson-slave/workspace/Lucene-Solr-Tests-trunk-java7/lucene/common-build.xml:1177: The following error occurred while executing this line:
/usr/home/hudson/hudson-slave/workspace/Lucene-Solr-Tests-trunk-java7/lucene/common-build.xml:842: There were test failures: 245 suites, 1016 tests, 1 suite-level error, 1 error, 1 failure, 23 ignored (5 assumptions)

Total time: 149 minutes 15 seconds
Build step 'Invoke Ant' marked build as failure
Archiving artifacts
Recording test results
Email was triggered for: Failure
Sending email for trigger: Failure



Mime
View raw message