lucene-dev mailing list archives

Site index · List index
Message view « Date » · « Thread »
Top « Date » · « Thread »
From Policeman Jenkins Server <jenk...@thetaphi.de>
Subject [JENKINS] Lucene-Solr-trunk-Linux (32bit/jdk1.6.0_38) - Build # 3685 - Failure!
Date Wed, 09 Jan 2013 21:12:08 GMT
Build: http://jenkins.thetaphi.de/job/Lucene-Solr-trunk-Linux/3685/
Java: 32bit/jdk1.6.0_38 -client -XX:+UseSerialGC

4 tests failed.
FAILED:  junit.framework.TestSuite.org.apache.solr.cloud.ClusterStateUpdateTest

Error Message:
ERROR: SolrIndexSearcher opens=4 closes=3

Stack Trace:
java.lang.AssertionError: ERROR: SolrIndexSearcher opens=4 closes=3
	at __randomizedtesting.SeedInfo.seed([DC130EEEFAE7E940]:0)
	at org.junit.Assert.fail(Assert.java:93)
	at org.apache.solr.SolrTestCaseJ4.endTrackingSearchers(SolrTestCaseJ4.java:246)
	at org.apache.solr.SolrTestCaseJ4.afterClass(SolrTestCaseJ4.java:97)
	at sun.reflect.NativeMethodAccessorImpl.invoke0(Native Method)
	at sun.reflect.NativeMethodAccessorImpl.invoke(NativeMethodAccessorImpl.java:39)
	at sun.reflect.DelegatingMethodAccessorImpl.invoke(DelegatingMethodAccessorImpl.java:25)
	at java.lang.reflect.Method.invoke(Method.java:597)
	at com.carrotsearch.randomizedtesting.RandomizedRunner.invoke(RandomizedRunner.java:1559)
	at com.carrotsearch.randomizedtesting.RandomizedRunner.access$600(RandomizedRunner.java:79)
	at com.carrotsearch.randomizedtesting.RandomizedRunner$5.evaluate(RandomizedRunner.java:700)
	at com.carrotsearch.randomizedtesting.rules.StatementAdapter.evaluate(StatementAdapter.java:36)
	at com.carrotsearch.randomizedtesting.rules.SystemPropertiesRestoreRule$1.evaluate(SystemPropertiesRestoreRule.java:53)
	at org.apache.lucene.util.AbstractBeforeAfterRule$1.evaluate(AbstractBeforeAfterRule.java:46)
	at org.apache.lucene.util.TestRuleStoreClassName$1.evaluate(TestRuleStoreClassName.java:42)
	at com.carrotsearch.randomizedtesting.rules.SystemPropertiesInvariantRule$1.evaluate(SystemPropertiesInvariantRule.java:55)
	at com.carrotsearch.randomizedtesting.rules.NoShadowingOrOverridesOnMethodsRule$1.evaluate(NoShadowingOrOverridesOnMethodsRule.java:39)
	at com.carrotsearch.randomizedtesting.rules.NoShadowingOrOverridesOnMethodsRule$1.evaluate(NoShadowingOrOverridesOnMethodsRule.java:39)
	at com.carrotsearch.randomizedtesting.rules.StatementAdapter.evaluate(StatementAdapter.java:36)
	at org.apache.lucene.util.TestRuleAssertionsRequired$1.evaluate(TestRuleAssertionsRequired.java:43)
	at org.apache.lucene.util.TestRuleMarkFailure$1.evaluate(TestRuleMarkFailure.java:48)
	at org.apache.lucene.util.TestRuleIgnoreAfterMaxFailures$1.evaluate(TestRuleIgnoreAfterMaxFailures.java:70)
	at org.apache.lucene.util.TestRuleIgnoreTestSuites$1.evaluate(TestRuleIgnoreTestSuites.java:55)
	at com.carrotsearch.randomizedtesting.rules.StatementAdapter.evaluate(StatementAdapter.java:36)
	at com.carrotsearch.randomizedtesting.ThreadLeakControl$StatementRunner.run(ThreadLeakControl.java:358)
	at java.lang.Thread.run(Thread.java:662)


FAILED:  junit.framework.TestSuite.org.apache.solr.cloud.ClusterStateUpdateTest

Error Message:
1 thread leaked from SUITE scope at org.apache.solr.cloud.ClusterStateUpdateTest:     1) Thread[id=748, name=searcherExecutor-284-thread-1, state=WAITING, group=TGRP-ClusterStateUpdateTest]         at sun.misc.Unsafe.park(Native Method)         at java.util.concurrent.locks.LockSupport.park(LockSupport.java:156)         at java.util.concurrent.locks.AbstractQueuedSynchronizer$ConditionObject.await(AbstractQueuedSynchronizer.java:1987)         at java.util.concurrent.LinkedBlockingQueue.take(LinkedBlockingQueue.java:399)         at java.util.concurrent.ThreadPoolExecutor.getTask(ThreadPoolExecutor.java:947)         at java.util.concurrent.ThreadPoolExecutor$Worker.run(ThreadPoolExecutor.java:907)         at java.lang.Thread.run(Thread.java:662)

Stack Trace:
com.carrotsearch.randomizedtesting.ThreadLeakError: 1 thread leaked from SUITE scope at org.apache.solr.cloud.ClusterStateUpdateTest: 
   1) Thread[id=748, name=searcherExecutor-284-thread-1, state=WAITING, group=TGRP-ClusterStateUpdateTest]
        at sun.misc.Unsafe.park(Native Method)
        at java.util.concurrent.locks.LockSupport.park(LockSupport.java:156)
        at java.util.concurrent.locks.AbstractQueuedSynchronizer$ConditionObject.await(AbstractQueuedSynchronizer.java:1987)
        at java.util.concurrent.LinkedBlockingQueue.take(LinkedBlockingQueue.java:399)
        at java.util.concurrent.ThreadPoolExecutor.getTask(ThreadPoolExecutor.java:947)
        at java.util.concurrent.ThreadPoolExecutor$Worker.run(ThreadPoolExecutor.java:907)
        at java.lang.Thread.run(Thread.java:662)
	at __randomizedtesting.SeedInfo.seed([DC130EEEFAE7E940]:0)


FAILED:  junit.framework.TestSuite.org.apache.solr.cloud.ClusterStateUpdateTest

Error Message:
There are still zombie threads that couldn't be terminated:    1) Thread[id=748, name=searcherExecutor-284-thread-1, state=WAITING, group=TGRP-ClusterStateUpdateTest]         at sun.misc.Unsafe.park(Native Method)         at java.util.concurrent.locks.LockSupport.park(LockSupport.java:156)         at java.util.concurrent.locks.AbstractQueuedSynchronizer$ConditionObject.await(AbstractQueuedSynchronizer.java:1987)         at java.util.concurrent.LinkedBlockingQueue.take(LinkedBlockingQueue.java:399)         at java.util.concurrent.ThreadPoolExecutor.getTask(ThreadPoolExecutor.java:947)         at java.util.concurrent.ThreadPoolExecutor$Worker.run(ThreadPoolExecutor.java:907)         at java.lang.Thread.run(Thread.java:662)

Stack Trace:
com.carrotsearch.randomizedtesting.ThreadLeakError: There are still zombie threads that couldn't be terminated:
   1) Thread[id=748, name=searcherExecutor-284-thread-1, state=WAITING, group=TGRP-ClusterStateUpdateTest]
        at sun.misc.Unsafe.park(Native Method)
        at java.util.concurrent.locks.LockSupport.park(LockSupport.java:156)
        at java.util.concurrent.locks.AbstractQueuedSynchronizer$ConditionObject.await(AbstractQueuedSynchronizer.java:1987)
        at java.util.concurrent.LinkedBlockingQueue.take(LinkedBlockingQueue.java:399)
        at java.util.concurrent.ThreadPoolExecutor.getTask(ThreadPoolExecutor.java:947)
        at java.util.concurrent.ThreadPoolExecutor$Worker.run(ThreadPoolExecutor.java:907)
        at java.lang.Thread.run(Thread.java:662)
	at __randomizedtesting.SeedInfo.seed([DC130EEEFAE7E940]:0)


REGRESSION:  org.apache.solr.cloud.ClusterStateUpdateTest.testCoreRegistration

Error Message:
Could not get shard_id for core: testcore coreNodeName:127.0.0.1:1661_solr_testcore

Stack Trace:
org.apache.solr.common.SolrException: Could not get shard_id for core: testcore coreNodeName:127.0.0.1:1661_solr_testcore
	at __randomizedtesting.SeedInfo.seed([DC130EEEFAE7E940:62986841839DE775]:0)
	at org.apache.solr.cloud.ZkController.doGetShardIdProcess(ZkController.java:1123)
	at org.apache.solr.cloud.ZkController.preRegister(ZkController.java:1181)
	at org.apache.solr.core.CoreContainer.registerCore(CoreContainer.java:841)
	at org.apache.solr.core.CoreContainer.register(CoreContainer.java:821)
	at org.apache.solr.core.CoreContainer.register(CoreContainer.java:923)
	at org.apache.solr.cloud.ClusterStateUpdateTest.testCoreRegistration(ClusterStateUpdateTest.java:162)
	at sun.reflect.NativeMethodAccessorImpl.invoke0(Native Method)
	at sun.reflect.NativeMethodAccessorImpl.invoke(NativeMethodAccessorImpl.java:39)
	at sun.reflect.DelegatingMethodAccessorImpl.invoke(DelegatingMethodAccessorImpl.java:25)
	at java.lang.reflect.Method.invoke(Method.java:597)
	at com.carrotsearch.randomizedtesting.RandomizedRunner.invoke(RandomizedRunner.java:1559)
	at com.carrotsearch.randomizedtesting.RandomizedRunner.access$600(RandomizedRunner.java:79)
	at com.carrotsearch.randomizedtesting.RandomizedRunner$6.evaluate(RandomizedRunner.java:737)
	at com.carrotsearch.randomizedtesting.RandomizedRunner$7.evaluate(RandomizedRunner.java:773)
	at com.carrotsearch.randomizedtesting.RandomizedRunner$8.evaluate(RandomizedRunner.java:787)
	at com.carrotsearch.randomizedtesting.rules.SystemPropertiesRestoreRule$1.evaluate(SystemPropertiesRestoreRule.java:53)
	at org.apache.lucene.util.TestRuleSetupTeardownChained$1.evaluate(TestRuleSetupTeardownChained.java:50)
	at org.apache.lucene.util.TestRuleFieldCacheSanity$1.evaluate(TestRuleFieldCacheSanity.java:51)
	at org.apache.lucene.util.AbstractBeforeAfterRule$1.evaluate(AbstractBeforeAfterRule.java:46)
	at com.carrotsearch.randomizedtesting.rules.SystemPropertiesInvariantRule$1.evaluate(SystemPropertiesInvariantRule.java:55)
	at org.apache.lucene.util.TestRuleThreadAndTestName$1.evaluate(TestRuleThreadAndTestName.java:49)
	at org.apache.lucene.util.TestRuleIgnoreAfterMaxFailures$1.evaluate(TestRuleIgnoreAfterMaxFailures.java:70)
	at org.apache.lucene.util.TestRuleMarkFailure$1.evaluate(TestRuleMarkFailure.java:48)
	at com.carrotsearch.randomizedtesting.rules.StatementAdapter.evaluate(StatementAdapter.java:36)
	at com.carrotsearch.randomizedtesting.ThreadLeakControl$StatementRunner.run(ThreadLeakControl.java:358)
	at com.carrotsearch.randomizedtesting.ThreadLeakControl.forkTimeoutingTask(ThreadLeakControl.java:782)
	at com.carrotsearch.randomizedtesting.ThreadLeakControl$3.evaluate(ThreadLeakControl.java:442)
	at com.carrotsearch.randomizedtesting.RandomizedRunner.runSingleTest(RandomizedRunner.java:746)
	at com.carrotsearch.randomizedtesting.RandomizedRunner$3.evaluate(RandomizedRunner.java:648)
	at com.carrotsearch.randomizedtesting.RandomizedRunner$4.evaluate(RandomizedRunner.java:682)
	at com.carrotsearch.randomizedtesting.RandomizedRunner$5.evaluate(RandomizedRunner.java:693)
	at com.carrotsearch.randomizedtesting.rules.StatementAdapter.evaluate(StatementAdapter.java:36)
	at com.carrotsearch.randomizedtesting.rules.SystemPropertiesRestoreRule$1.evaluate(SystemPropertiesRestoreRule.java:53)
	at org.apache.lucene.util.AbstractBeforeAfterRule$1.evaluate(AbstractBeforeAfterRule.java:46)
	at org.apache.lucene.util.TestRuleStoreClassName$1.evaluate(TestRuleStoreClassName.java:42)
	at com.carrotsearch.randomizedtesting.rules.SystemPropertiesInvariantRule$1.evaluate(SystemPropertiesInvariantRule.java:55)
	at com.carrotsearch.randomizedtesting.rules.NoShadowingOrOverridesOnMethodsRule$1.evaluate(NoShadowingOrOverridesOnMethodsRule.java:39)
	at com.carrotsearch.randomizedtesting.rules.NoShadowingOrOverridesOnMethodsRule$1.evaluate(NoShadowingOrOverridesOnMethodsRule.java:39)
	at com.carrotsearch.randomizedtesting.rules.StatementAdapter.evaluate(StatementAdapter.java:36)
	at org.apache.lucene.util.TestRuleAssertionsRequired$1.evaluate(TestRuleAssertionsRequired.java:43)
	at org.apache.lucene.util.TestRuleMarkFailure$1.evaluate(TestRuleMarkFailure.java:48)
	at org.apache.lucene.util.TestRuleIgnoreAfterMaxFailures$1.evaluate(TestRuleIgnoreAfterMaxFailures.java:70)
	at org.apache.lucene.util.TestRuleIgnoreTestSuites$1.evaluate(TestRuleIgnoreTestSuites.java:55)
	at com.carrotsearch.randomizedtesting.rules.StatementAdapter.evaluate(StatementAdapter.java:36)
	at com.carrotsearch.randomizedtesting.ThreadLeakControl$StatementRunner.run(ThreadLeakControl.java:358)
	at java.lang.Thread.run(Thread.java:662)




Build Log:
[...truncated 8338 lines...]
[junit4:junit4] Suite: org.apache.solr.cloud.ClusterStateUpdateTest
[junit4:junit4]   2> 1 T716 oas.SolrTestCaseJ4.setUp ###Starting testCoreRegistration
[junit4:junit4]   2> Creating dataDir: /mnt/ssd/jenkins/workspace/Lucene-Solr-trunk-Linux/solr/build/solr-core/test/J0/./solrtest-ClusterStateUpdateTest-1357765387058
[junit4:junit4]   2> 2 T716 oasc.ZkTestServer.run STARTING ZK TEST SERVER
[junit4:junit4]   2> 2 T717 oasc.ZkTestServer$ZKServerMain.runFromConfig Starting server
[junit4:junit4]   2> 3 T717 oazs.ZooKeeperServer.setTickTime tickTime set to 1000
[junit4:junit4]   2> 3 T717 oazs.ZooKeeperServer.setMinSessionTimeout minSessionTimeout set to -1
[junit4:junit4]   2> 3 T717 oazs.ZooKeeperServer.setMaxSessionTimeout maxSessionTimeout set to -1
[junit4:junit4]   2> 4 T717 oazs.NIOServerCnxnFactory.configure binding to port 0.0.0.0/0.0.0.0:0
[junit4:junit4]   2> 5 T717 oazsp.FileTxnSnapLog.save Snapshotting: 0x0 to /mnt/ssd/jenkins/workspace/Lucene-Solr-trunk-Linux/solr/build/solr-core/test/J0/./solrtest-ClusterStateUpdateTest-1357765387058/zookeeper/server1/data/version-2/snapshot.0
[junit4:junit4]   2> 103 T716 oasc.ZkTestServer.run start zk server on port:36154
[junit4:junit4]   2> 103 T716 oaz.ZooKeeper.<init> Initiating client connection, connectString=127.0.0.1:36154 sessionTimeout=10000 watcher=org.apache.solr.common.cloud.ConnectionManager@1707f2c
[junit4:junit4]   2> 104 T716 oascc.ConnectionManager.waitForConnected Waiting for client to connect to ZooKeeper
[junit4:junit4]   2> 104 T722 oaz.ClientCnxn$SendThread.logStartConnect Opening socket connection to server localhost.localdomain/127.0.0.1:36154. Will not attempt to authenticate using SASL (access denied (javax.security.auth.AuthPermission getLoginConfiguration))
[junit4:junit4]   2> 105 T722 oaz.ClientCnxn$SendThread.primeConnection Socket connection established to localhost.localdomain/127.0.0.1:36154, initiating session
[junit4:junit4]   2> 105 T718 oazs.NIOServerCnxnFactory.run Accepted socket connection from /127.0.0.1:58199
[junit4:junit4]   2> 105 T718 oazs.ZooKeeperServer.processConnectRequest Client attempting to establish new session at /127.0.0.1:58199
[junit4:junit4]   2> 106 T720 oazsp.FileTxnLog.append Creating new log file: log.1
[junit4:junit4]   2> 116 T720 oazs.ZooKeeperServer.finishSessionInit Established session 0x13c211fa3350000 with negotiated timeout 10000 for client /127.0.0.1:58199
[junit4:junit4]   2> 116 T722 oaz.ClientCnxn$SendThread.onConnected Session establishment complete on server localhost.localdomain/127.0.0.1:36154, sessionid = 0x13c211fa3350000, negotiated timeout = 10000
[junit4:junit4]   2> 117 T723 oascc.ConnectionManager.process Watcher org.apache.solr.common.cloud.ConnectionManager@1707f2c name:ZooKeeperConnection Watcher:127.0.0.1:36154 got event WatchedEvent state:SyncConnected type:None path:null path:null type:None
[junit4:junit4]   2> 117 T716 oascc.ConnectionManager.waitForConnected Client is connected to ZooKeeper
[junit4:junit4]   2> 117 T716 oascc.SolrZkClient.makePath makePath: /solr
[junit4:junit4]   2> 121 T721 oazs.PrepRequestProcessor.pRequest2Txn Processed session termination for sessionid: 0x13c211fa3350000
[junit4:junit4]   2> 121 T723 oaz.ClientCnxn$EventThread.run EventThread shut down
[junit4:junit4]   2> 121 T718 oazs.NIOServerCnxn.closeSock Closed socket connection for client /127.0.0.1:58199 which had sessionid 0x13c211fa3350000
[junit4:junit4]   2> 121 T716 oaz.ZooKeeper.close Session: 0x13c211fa3350000 closed
[junit4:junit4]   2> 122 T716 oaz.ZooKeeper.<init> Initiating client connection, connectString=127.0.0.1:36154/solr sessionTimeout=10000 watcher=org.apache.solr.common.cloud.ConnectionManager@cad587
[junit4:junit4]   2> 123 T716 oascc.ConnectionManager.waitForConnected Waiting for client to connect to ZooKeeper
[junit4:junit4]   2> 127 T724 oaz.ClientCnxn$SendThread.logStartConnect Opening socket connection to server localhost.localdomain/127.0.0.1:36154. Will not attempt to authenticate using SASL (access denied (javax.security.auth.AuthPermission getLoginConfiguration))
[junit4:junit4]   2> 127 T724 oaz.ClientCnxn$SendThread.primeConnection Socket connection established to localhost.localdomain/127.0.0.1:36154, initiating session
[junit4:junit4]   2> 127 T718 oazs.NIOServerCnxnFactory.run Accepted socket connection from /127.0.0.1:58200
[junit4:junit4]   2> 128 T718 oazs.ZooKeeperServer.processConnectRequest Client attempting to establish new session at /127.0.0.1:58200
[junit4:junit4]   2> 129 T720 oazs.ZooKeeperServer.finishSessionInit Established session 0x13c211fa3350001 with negotiated timeout 10000 for client /127.0.0.1:58200
[junit4:junit4]   2> 129 T724 oaz.ClientCnxn$SendThread.onConnected Session establishment complete on server localhost.localdomain/127.0.0.1:36154, sessionid = 0x13c211fa3350001, negotiated timeout = 10000
[junit4:junit4]   2> 129 T725 oascc.ConnectionManager.process Watcher org.apache.solr.common.cloud.ConnectionManager@cad587 name:ZooKeeperConnection Watcher:127.0.0.1:36154/solr got event WatchedEvent state:SyncConnected type:None path:null path:null type:None
[junit4:junit4]   2> 130 T716 oascc.ConnectionManager.waitForConnected Client is connected to ZooKeeper
[junit4:junit4]   2> 130 T716 oascc.SolrZkClient.makePath makePath: /collections/collection1
[junit4:junit4]   2> 133 T716 oascc.SolrZkClient.makePath makePath: /collections/collection1/shards
[junit4:junit4]   2> 135 T716 oascc.SolrZkClient.makePath makePath: /collections/control_collection
[junit4:junit4]   2> 137 T716 oascc.SolrZkClient.makePath makePath: /collections/control_collection/shards
[junit4:junit4]   2> 139 T716 oasc.AbstractZkTestCase.putConfig put /mnt/ssd/jenkins/workspace/Lucene-Solr-trunk-Linux/solr/build/solr-core/test-files/solr/collection1/conf/solrconfig.xml to /configs/conf1/solrconfig.xml
[junit4:junit4]   2> 139 T716 oascc.SolrZkClient.makePath makePath: /configs/conf1/solrconfig.xml
[junit4:junit4]   2> 143 T716 oasc.AbstractZkTestCase.putConfig put /mnt/ssd/jenkins/workspace/Lucene-Solr-trunk-Linux/solr/build/solr-core/test-files/solr/collection1/conf/schema.xml to /configs/conf1/schema.xml
[junit4:junit4]   2> 143 T716 oascc.SolrZkClient.makePath makePath: /configs/conf1/schema.xml
[junit4:junit4]   2> 146 T716 oasc.AbstractZkTestCase.putConfig put /mnt/ssd/jenkins/workspace/Lucene-Solr-trunk-Linux/solr/build/solr-core/test-files/solr/collection1/conf/stopwords.txt to /configs/conf1/stopwords.txt
[junit4:junit4]   2> 146 T716 oascc.SolrZkClient.makePath makePath: /configs/conf1/stopwords.txt
[junit4:junit4]   2> 149 T716 oasc.AbstractZkTestCase.putConfig put /mnt/ssd/jenkins/workspace/Lucene-Solr-trunk-Linux/solr/build/solr-core/test-files/solr/collection1/conf/protwords.txt to /configs/conf1/protwords.txt
[junit4:junit4]   2> 149 T716 oascc.SolrZkClient.makePath makePath: /configs/conf1/protwords.txt
[junit4:junit4]   2> 152 T716 oasc.AbstractZkTestCase.putConfig put /mnt/ssd/jenkins/workspace/Lucene-Solr-trunk-Linux/solr/build/solr-core/test-files/solr/collection1/conf/currency.xml to /configs/conf1/currency.xml
[junit4:junit4]   2> 152 T716 oascc.SolrZkClient.makePath makePath: /configs/conf1/currency.xml
[junit4:junit4]   2> 154 T716 oasc.AbstractZkTestCase.putConfig put /mnt/ssd/jenkins/workspace/Lucene-Solr-trunk-Linux/solr/build/solr-core/test-files/solr/collection1/conf/open-exchange-rates.json to /configs/conf1/open-exchange-rates.json
[junit4:junit4]   2> 155 T716 oascc.SolrZkClient.makePath makePath: /configs/conf1/open-exchange-rates.json
[junit4:junit4]   2> 157 T716 oasc.AbstractZkTestCase.putConfig put /mnt/ssd/jenkins/workspace/Lucene-Solr-trunk-Linux/solr/build/solr-core/test-files/solr/collection1/conf/mapping-ISOLatin1Accent.txt to /configs/conf1/mapping-ISOLatin1Accent.txt
[junit4:junit4]   2> 157 T716 oascc.SolrZkClient.makePath makePath: /configs/conf1/mapping-ISOLatin1Accent.txt
[junit4:junit4]   2> 160 T716 oasc.AbstractZkTestCase.putConfig put /mnt/ssd/jenkins/workspace/Lucene-Solr-trunk-Linux/solr/build/solr-core/test-files/solr/collection1/conf/old_synonyms.txt to /configs/conf1/old_synonyms.txt
[junit4:junit4]   2> 160 T716 oascc.SolrZkClient.makePath makePath: /configs/conf1/old_synonyms.txt
[junit4:junit4]   2> 162 T716 oasc.AbstractZkTestCase.putConfig put /mnt/ssd/jenkins/workspace/Lucene-Solr-trunk-Linux/solr/build/solr-core/test-files/solr/collection1/conf/synonyms.txt to /configs/conf1/synonyms.txt
[junit4:junit4]   2> 163 T716 oascc.SolrZkClient.makePath makePath: /configs/conf1/synonyms.txt
[junit4:junit4]   2> 165 T721 oazs.PrepRequestProcessor.pRequest2Txn Processed session termination for sessionid: 0x13c211fa3350001
[junit4:junit4]   2> 165 T718 oazs.NIOServerCnxn.closeSock Closed socket connection for client /127.0.0.1:58200 which had sessionid 0x13c211fa3350001
[junit4:junit4]   2> 165 T716 oaz.ZooKeeper.close Session: 0x13c211fa3350001 closed
[junit4:junit4]   2> 166 T725 oaz.ClientCnxn$EventThread.run EventThread shut down
[junit4:junit4]   2> 166 T716 oasc.ClusterStateUpdateTest.setUp ####SETUP_START testCoreRegistration
[junit4:junit4]   2> 167 T716 oasc.SolrResourceLoader.locateSolrHome JNDI not configured for solr (NoInitialContextEx)
[junit4:junit4]   2> 167 T716 oasc.SolrResourceLoader.locateSolrHome using system property solr.solr.home: /mnt/ssd/jenkins/workspace/Lucene-Solr-trunk-Linux/solr/build/solr-core/test-files/solr
[junit4:junit4]   2> 168 T716 oasc.CoreContainer$Initializer.initialize looking for solr.xml: /mnt/ssd/jenkins/workspace/Lucene-Solr-trunk-Linux/solr/build/solr-core/test-files/solr/solr.xml
[junit4:junit4]   2> 168 T716 oasc.CoreContainer.<init> New CoreContainer 24458669
[junit4:junit4]   2> 168 T716 oasc.CoreContainer.load Loading CoreContainer using Solr Home: '/mnt/ssd/jenkins/workspace/Lucene-Solr-trunk-Linux/solr/build/solr-core/test-files/solr/'
[junit4:junit4]   2> 168 T716 oasc.SolrResourceLoader.<init> new SolrResourceLoader for directory: '/mnt/ssd/jenkins/workspace/Lucene-Solr-trunk-Linux/solr/build/solr-core/test-files/solr/'
[junit4:junit4]   2> 181 T716 oashc.HttpShardHandlerFactory.getParameter Setting socketTimeout to: 60000
[junit4:junit4]   2> 181 T716 oashc.HttpShardHandlerFactory.getParameter Setting urlScheme to: http://
[junit4:junit4]   2> 182 T716 oashc.HttpShardHandlerFactory.getParameter Setting connTimeout to: 15000
[junit4:junit4]   2> 182 T716 oashc.HttpShardHandlerFactory.getParameter Setting maxConnectionsPerHost to: 20
[junit4:junit4]   2> 182 T716 oashc.HttpShardHandlerFactory.getParameter Setting corePoolSize to: 0
[junit4:junit4]   2> 182 T716 oashc.HttpShardHandlerFactory.getParameter Setting maximumPoolSize to: 2147483647
[junit4:junit4]   2> 183 T716 oashc.HttpShardHandlerFactory.getParameter Setting maxThreadIdleTime to: 5
[junit4:junit4]   2> 183 T716 oashc.HttpShardHandlerFactory.getParameter Setting sizeOfQueue to: -1
[junit4:junit4]   2> 183 T716 oashc.HttpShardHandlerFactory.getParameter Setting fairnessPolicy to: false
[junit4:junit4]   2> 183 T716 oascsi.HttpClientUtil.createClient Creating new http client, config:maxConnectionsPerHost=20&maxConnections=10000&socketTimeout=60000&connTimeout=15000&retry=false
[junit4:junit4]   2> 189 T716 oasc.CoreContainer.load Registering Log Listener
[junit4:junit4]   2> 201 T716 oasc.CoreContainer.initZooKeeper Zookeeper client=127.0.0.1:36154/solr
[junit4:junit4]   2> 202 T716 oasc.ZkController.checkChrootPath zkHost includes chroot
[junit4:junit4]   2> 202 T716 oaz.ZooKeeper.<init> Initiating client connection, connectString=127.0.0.1:36154 sessionTimeout=60000 watcher=org.apache.solr.common.cloud.ConnectionManager@ad247d
[junit4:junit4]   2> 203 T716 oascc.ConnectionManager.waitForConnected Waiting for client to connect to ZooKeeper
[junit4:junit4]   2> 203 T726 oaz.ClientCnxn$SendThread.logStartConnect Opening socket connection to server localhost.localdomain/127.0.0.1:36154. Will not attempt to authenticate using SASL (access denied (javax.security.auth.AuthPermission getLoginConfiguration))
[junit4:junit4]   2> 204 T726 oaz.ClientCnxn$SendThread.primeConnection Socket connection established to localhost.localdomain/127.0.0.1:36154, initiating session
[junit4:junit4]   2> 204 T718 oazs.NIOServerCnxnFactory.run Accepted socket connection from /127.0.0.1:58201
[junit4:junit4]   2> 204 T718 oazs.ZooKeeperServer.processConnectRequest Client attempting to establish new session at /127.0.0.1:58201
[junit4:junit4]   2> 205 T720 oazs.ZooKeeperServer.finishSessionInit Established session 0x13c211fa3350002 with negotiated timeout 20000 for client /127.0.0.1:58201
[junit4:junit4]   2> 205 T726 oaz.ClientCnxn$SendThread.onConnected Session establishment complete on server localhost.localdomain/127.0.0.1:36154, sessionid = 0x13c211fa3350002, negotiated timeout = 20000
[junit4:junit4]   2> 206 T727 oascc.ConnectionManager.process Watcher org.apache.solr.common.cloud.ConnectionManager@ad247d name:ZooKeeperConnection Watcher:127.0.0.1:36154 got event WatchedEvent state:SyncConnected type:None path:null path:null type:None
[junit4:junit4]   2> 206 T716 oascc.ConnectionManager.waitForConnected Client is connected to ZooKeeper
[junit4:junit4]   2> 207 T721 oazs.PrepRequestProcessor.pRequest2Txn Processed session termination for sessionid: 0x13c211fa3350002
[junit4:junit4]   2> 207 T718 oazs.NIOServerCnxn.closeSock Closed socket connection for client /127.0.0.1:58201 which had sessionid 0x13c211fa3350002
[junit4:junit4]   2> 208 T727 oaz.ClientCnxn$EventThread.run EventThread shut down
[junit4:junit4]   2> 208 T716 oaz.ZooKeeper.close Session: 0x13c211fa3350002 closed
[junit4:junit4]   2> 208 T716 oascsi.HttpClientUtil.createClient Creating new http client, config:maxConnections=500&maxConnectionsPerHost=16&socketTimeout=60000&connTimeout=15000
[junit4:junit4]   2> 210 T716 oaz.ZooKeeper.<init> Initiating client connection, connectString=127.0.0.1:36154/solr sessionTimeout=3000 watcher=org.apache.solr.common.cloud.ConnectionManager@cd3ffa
[junit4:junit4]   2> 211 T728 oaz.ClientCnxn$SendThread.logStartConnect Opening socket connection to server localhost.localdomain/127.0.0.1:36154. Will not attempt to authenticate using SASL (access denied (javax.security.auth.AuthPermission getLoginConfiguration))
[junit4:junit4]   2> 211 T716 oascc.ConnectionManager.waitForConnected Waiting for client to connect to ZooKeeper
[junit4:junit4]   2> 212 T728 oaz.ClientCnxn$SendThread.primeConnection Socket connection established to localhost.localdomain/127.0.0.1:36154, initiating session
[junit4:junit4]   2> 212 T718 oazs.NIOServerCnxnFactory.run Accepted socket connection from /127.0.0.1:58202
[junit4:junit4]   2> 212 T718 oazs.ZooKeeperServer.processConnectRequest Client attempting to establish new session at /127.0.0.1:58202
[junit4:junit4]   2> 213 T720 oazs.ZooKeeperServer.finishSessionInit Established session 0x13c211fa3350003 with negotiated timeout 3000 for client /127.0.0.1:58202
[junit4:junit4]   2> 213 T728 oaz.ClientCnxn$SendThread.onConnected Session establishment complete on server localhost.localdomain/127.0.0.1:36154, sessionid = 0x13c211fa3350003, negotiated timeout = 3000
[junit4:junit4]   2> 213 T729 oascc.ConnectionManager.process Watcher org.apache.solr.common.cloud.ConnectionManager@cd3ffa name:ZooKeeperConnection Watcher:127.0.0.1:36154/solr got event WatchedEvent state:SyncConnected type:None path:null path:null type:None
[junit4:junit4]   2> 213 T716 oascc.ConnectionManager.waitForConnected Client is connected to ZooKeeper
[junit4:junit4]   2> 215 T721 oazs.PrepRequestProcessor.pRequest Got user-level KeeperException when processing sessionid:0x13c211fa3350003 type:create cxid:0x2 zxid:0x1a txntype:-1 reqpath:n/a Error Path:/solr/overseer Error:KeeperErrorCode = NodeExists for /solr/overseer
[junit4:junit4]   2> 216 T716 oascc.SolrZkClient.makePath makePath: /live_nodes
[junit4:junit4]   2> 217 T716 oasc.ZkController.createEphemeralLiveNode Register node as live in ZooKeeper:/live_nodes/127.0.0.1:1661_solr
[junit4:junit4]   2> 218 T721 oazs.PrepRequestProcessor.pRequest Got user-level KeeperException when processing sessionid:0x13c211fa3350003 type:delete cxid:0x7 zxid:0x1c txntype:-1 reqpath:n/a Error Path:/solr/live_nodes/127.0.0.1:1661_solr Error:KeeperErrorCode = NoNode for /solr/live_nodes/127.0.0.1:1661_solr
[junit4:junit4]   2> 218 T716 oascc.SolrZkClient.makePath makePath: /live_nodes/127.0.0.1:1661_solr
[junit4:junit4]   2> 220 T716 oascc.SolrZkClient.makePath makePath: /overseer_elect/election
[junit4:junit4]   2> 223 T721 oazs.PrepRequestProcessor.pRequest Got user-level KeeperException when processing sessionid:0x13c211fa3350003 type:delete cxid:0x15 zxid:0x21 txntype:-1 reqpath:n/a Error Path:/solr/overseer_elect/leader Error:KeeperErrorCode = NoNode for /solr/overseer_elect/leader
[junit4:junit4]   2> 224 T716 oascc.SolrZkClient.makePath makePath: /overseer_elect/leader
[junit4:junit4]   2> 227 T716 oasc.Overseer.start Overseer (id=88982512406429699-127.0.0.1:1661_solr-n_0000000000) starting
[junit4:junit4]   2> 227 T721 oazs.PrepRequestProcessor.pRequest Got user-level KeeperException when processing sessionid:0x13c211fa3350003 type:create cxid:0x1a zxid:0x23 txntype:-1 reqpath:n/a Error Path:/solr/overseer Error:KeeperErrorCode = NodeExists for /solr/overseer
[junit4:junit4]   2> 229 T721 oazs.PrepRequestProcessor.pRequest Got user-level KeeperException when processing sessionid:0x13c211fa3350003 type:create cxid:0x1b zxid:0x24 txntype:-1 reqpath:n/a Error Path:/solr/overseer Error:KeeperErrorCode = NodeExists for /solr/overseer
[junit4:junit4]   2> 229 T721 oazs.PrepRequestProcessor.pRequest Got user-level KeeperException when processing sessionid:0x13c211fa3350003 type:create cxid:0x1c zxid:0x25 txntype:-1 reqpath:n/a Error Path:/solr/overseer Error:KeeperErrorCode = NodeExists for /solr/overseer
[junit4:junit4]   2> 230 T721 oazs.PrepRequestProcessor.pRequest Got user-level KeeperException when processing sessionid:0x13c211fa3350003 type:create cxid:0x1d zxid:0x26 txntype:-1 reqpath:n/a Error Path:/solr/overseer Error:KeeperErrorCode = NodeExists for /solr/overseer
[junit4:junit4]   2> 231 T731 oasc.OverseerCollectionProcessor.run Process current queue of collection messages
[junit4:junit4]   2> 232 T716 oascc.SolrZkClient.makePath makePath: /clusterstate.json
[junit4:junit4]   2> 234 T716 oascc.ZkStateReader.createClusterStateWatchersAndUpdate Updating cluster state from ZooKeeper... 
[junit4:junit4]   2> 235 T730 oasc.Overseer$ClusterStateUpdater.run Starting to work on the main queue
[junit4:junit4]   2> 238 T732 oasc.CoreContainer.create Creating SolrCore 'collection1' using instanceDir: /mnt/ssd/jenkins/workspace/Lucene-Solr-trunk-Linux/solr/build/solr-core/test-files/solr/collection1
[junit4:junit4]   2> 239 T732 oasc.ZkController.createCollectionZkNode Check for collection zkNode:collection1
[junit4:junit4]   2> 239 T732 oasc.ZkController.createCollectionZkNode Collection zkNode exists
[junit4:junit4]   2> 239 T732 oasc.ZkController.readConfigName Load collection config from:/collections/collection1
[junit4:junit4]   2> 240 T732 oasc.SolrResourceLoader.<init> new SolrResourceLoader for directory: '/mnt/ssd/jenkins/workspace/Lucene-Solr-trunk-Linux/solr/build/solr-core/test-files/solr/collection1/'
[junit4:junit4]   2> 241 T732 oasc.SolrResourceLoader.replaceClassLoader Adding 'file:/mnt/ssd/jenkins/workspace/Lucene-Solr-trunk-Linux/solr/build/solr-core/test-files/solr/collection1/lib/README' to classloader
[junit4:junit4]   2> 241 T732 oasc.SolrResourceLoader.replaceClassLoader Adding 'file:/mnt/ssd/jenkins/workspace/Lucene-Solr-trunk-Linux/solr/build/solr-core/test-files/solr/collection1/lib/classes/' to classloader
[junit4:junit4]   2> 277 T732 oasc.SolrConfig.<init> Using Lucene MatchVersion: LUCENE_50
[junit4:junit4]   2> 330 T732 oasc.SolrConfig.<init> Loaded SolrConfig: solrconfig.xml
[junit4:junit4]   2> 332 T732 oass.IndexSchema.readSchema Reading Solr Schema
[junit4:junit4]   2> 336 T732 oass.IndexSchema.readSchema Schema name=test
[junit4:junit4]   2> 766 T732 oass.OpenExchangeRatesOrgProvider.init Initialized with rates=open-exchange-rates.json, refreshInterval=1440.
[junit4:junit4]   2> 773 T732 oass.IndexSchema.readSchema default search field in schema is text
[junit4:junit4]   2> 776 T732 oass.IndexSchema.readSchema unique key field: id
[junit4:junit4]   2> 787 T732 oass.FileExchangeRateProvider.reload Reloading exchange rates from file currency.xml
[junit4:junit4]   2> 801 T732 oass.FileExchangeRateProvider.reload Reloading exchange rates from file currency.xml
[junit4:junit4]   2> 804 T732 oass.OpenExchangeRatesOrgProvider.reload Reloading exchange rates from open-exchange-rates.json
[junit4:junit4]   2> 805 T732 oass.OpenExchangeRatesOrgProvider.reload Reloading exchange rates from open-exchange-rates.json
[junit4:junit4]   2> 806 T732 oasc.SolrCore.<init> [collection1] Opening new SolrCore at /mnt/ssd/jenkins/workspace/Lucene-Solr-trunk-Linux/solr/build/solr-core/test-files/solr/collection1/, dataDir=/mnt/ssd/jenkins/workspace/Lucene-Solr-trunk-Linux/solr/build/solr-core/test/J0/./solrtest-ClusterStateUpdateTest-1357765387058/data1/
[junit4:junit4]   2> 807 T732 oasc.JmxMonitoredMap.<init> JMX monitoring is enabled. Adding Solr mbeans to JMX Server: com.sun.jmx.mbeanserver.JmxMBeanServer@a3d3b
[junit4:junit4]   2> 807 T732 oasc.SolrCore.initDirectoryFactory org.apache.solr.core.MockDirectoryFactory
[junit4:junit4]   2> 807 T732 oasc.CachingDirectoryFactory.get return new directory for /mnt/ssd/jenkins/workspace/Lucene-Solr-trunk-Linux/solr/build/solr-core/test/J0/./solrtest-ClusterStateUpdateTest-1357765387058/data1 forceNew:false
[junit4:junit4]   2> 807 T732 oasc.CachingDirectoryFactory.close Releasing directory:/mnt/ssd/jenkins/workspace/Lucene-Solr-trunk-Linux/solr/build/solr-core/test/J0/./solrtest-ClusterStateUpdateTest-1357765387058/data1
[junit4:junit4]   2> 808 T732 oasc.SolrCore.getNewIndexDir New index directory detected: old=null new=/mnt/ssd/jenkins/workspace/Lucene-Solr-trunk-Linux/solr/build/solr-core/test/J0/./solrtest-ClusterStateUpdateTest-1357765387058/data1/index/
[junit4:junit4]   2> 808 T732 oasc.SolrCore.initIndex WARNING [collection1] Solr index directory '/mnt/ssd/jenkins/workspace/Lucene-Solr-trunk-Linux/solr/build/solr-core/test/J0/./solrtest-ClusterStateUpdateTest-1357765387058/data1/index' doesn't exist. Creating new index...
[junit4:junit4]   2> 809 T732 oasc.CachingDirectoryFactory.get return new directory for /mnt/ssd/jenkins/workspace/Lucene-Solr-trunk-Linux/solr/build/solr-core/test/J0/./solrtest-ClusterStateUpdateTest-1357765387058/data1/index forceNew:false
[junit4:junit4]   2> 810 T732 oasc.SolrDeletionPolicy.onCommit SolrDeletionPolicy.onCommit: commits:num=1
[junit4:junit4]   2> 		commit{dir=RateLimitedDirectoryWrapper(MockDirWrapper(org.apache.lucene.store.RAMDirectory@811e7 lockFactory=org.apache.lucene.store.NativeFSLockFactory@2cf72d)),segFN=segments_1,generation=1,filenames=[segments_1]
[junit4:junit4]   2> 810 T732 oasc.SolrDeletionPolicy.updateCommits newest commit = 1[segments_1]
[junit4:junit4]   2> 810 T732 oasc.CachingDirectoryFactory.close Releasing directory:/mnt/ssd/jenkins/workspace/Lucene-Solr-trunk-Linux/solr/build/solr-core/test/J0/./solrtest-ClusterStateUpdateTest-1357765387058/data1/index
[junit4:junit4]   2> 810 T732 oasc.SolrCore.initWriters created xml: solr.XMLResponseWriter
[junit4:junit4]   2> 811 T732 oasup.UpdateRequestProcessorChain.init inserting DistributedUpdateProcessorFactory into updateRequestProcessorChain "dedupe"
[junit4:junit4]   2> 812 T732 oasup.UpdateRequestProcessorChain.init inserting DistributedUpdateProcessorFactory into updateRequestProcessorChain "dedupe-allfields"
[junit4:junit4]   2> 812 T732 oasup.UpdateRequestProcessorChain.init inserting DistributedUpdateProcessorFactory into updateRequestProcessorChain "stored_sig"
[junit4:junit4]   2> 812 T732 oasup.UpdateRequestProcessorChain.init inserting DistributedUpdateProcessorFactory into updateRequestProcessorChain "uniq-fields"
[junit4:junit4]   2> 812 T732 oasup.UpdateRequestProcessorChain.init inserting DistributedUpdateProcessorFactory into updateRequestProcessorChain "distrib-dup-test-chain-implicit"
[junit4:junit4]   2> 813 T732 oasc.RequestHandlers.initHandlersFromConfig adding lazy requestHandler: solr.ReplicationHandler
[junit4:junit4]   2> 813 T732 oasc.RequestHandlers.initHandlersFromConfig created /replication: solr.ReplicationHandler
[junit4:junit4]   2> 813 T732 oasc.RequestHandlers.initHandlersFromConfig created standard: solr.StandardRequestHandler
[junit4:junit4]   2> 814 T732 oasc.RequestHandlers.initHandlersFromConfig created /get: solr.RealTimeGetHandler
[junit4:junit4]   2> 814 T732 oasc.RequestHandlers.initHandlersFromConfig created dismax: solr.SearchHandler
[junit4:junit4]   2> 814 T732 oasc.RequestHandlers.initHandlersFromConfig created mock: org.apache.solr.core.MockQuerySenderListenerReqHandler
[junit4:junit4]   2> 814 T732 oasc.RequestHandlers.initHandlersFromConfig created /admin/: org.apache.solr.handler.admin.AdminHandlers
[junit4:junit4]   2> 815 T732 oasc.RequestHandlers.initHandlersFromConfig created defaults: solr.StandardRequestHandler
[junit4:junit4]   2> 815 T732 oasc.RequestHandlers.initHandlersFromConfig adding lazy requestHandler: solr.StandardRequestHandler
[junit4:junit4]   2> 815 T732 oasc.RequestHandlers.initHandlersFromConfig created lazy: solr.StandardRequestHandler
[junit4:junit4]   2> 815 T732 oasc.RequestHandlers.initHandlersFromConfig created /update: solr.UpdateRequestHandler
[junit4:junit4]   2> 816 T732 oasc.RequestHandlers.initHandlersFromConfig created /terms: org.apache.solr.handler.component.SearchHandler
[junit4:junit4]   2> 816 T732 oasc.RequestHandlers.initHandlersFromConfig created spellCheckCompRH: org.apache.solr.handler.component.SearchHandler
[junit4:junit4]   2> 816 T732 oasc.RequestHandlers.initHandlersFromConfig created spellCheckCompRH_Direct: org.apache.solr.handler.component.SearchHandler
[junit4:junit4]   2> 817 T732 oasc.RequestHandlers.initHandlersFromConfig created spellCheckWithWordbreak: org.apache.solr.handler.component.SearchHandler
[junit4:junit4]   2> 817 T732 oasc.RequestHandlers.initHandlersFromConfig created spellCheckWithWordbreak_Direct: org.apache.solr.handler.component.SearchHandler
[junit4:junit4]   2> 817 T732 oasc.RequestHandlers.initHandlersFromConfig created spellCheckCompRH1: org.apache.solr.handler.component.SearchHandler
[junit4:junit4]   2> 818 T732 oasc.RequestHandlers.initHandlersFromConfig created mltrh: org.apache.solr.handler.component.SearchHandler
[junit4:junit4]   2> 818 T732 oasc.RequestHandlers.initHandlersFromConfig created tvrh: org.apache.solr.handler.component.SearchHandler
[junit4:junit4]   2> 818 T732 oasc.RequestHandlers.initHandlersFromConfig created /mlt: solr.MoreLikeThisHandler
[junit4:junit4]   2> 819 T732 oasc.RequestHandlers.initHandlersFromConfig created /debug/dump: solr.DumpRequestHandler
[junit4:junit4]   2> 820 T732 oashl.XMLLoader.init xsltCacheLifetimeSeconds=60
[junit4:junit4]   2> 822 T732 oasc.SolrCore.initDeprecatedSupport WARNING solrconfig.xml uses deprecated <admin/gettableFiles>, Please update your config to use the ShowFileRequestHandler.
[junit4:junit4]   2> 823 T732 oasc.SolrCore.initDeprecatedSupport WARNING adding ShowFileRequestHandler with hidden files: [SCHEMA.XML, OLD_SYNONYMS.TXT, STOPWORDS.TXT, PROTWORDS.TXT, OPEN-EXCHANGE-RATES.JSON, SYNONYMS.TXT, CURRENCY.XML, MAPPING-ISOLATIN1ACCENT.TXT]
[junit4:junit4]   2> 825 T732 oasc.CachingDirectoryFactory.close Releasing directory:/mnt/ssd/jenkins/workspace/Lucene-Solr-trunk-Linux/solr/build/solr-core/test/J0/./solrtest-ClusterStateUpdateTest-1357765387058/data1
[junit4:junit4]   2> 825 T732 oass.SolrIndexSearcher.<init> Opening Searcher@1fe4c43 main
[junit4:junit4]   2> 825 T732 oasu.CommitTracker.<init> Hard AutoCommit: disabled
[junit4:junit4]   2> 826 T732 oasu.CommitTracker.<init> Soft AutoCommit: disabled
[junit4:junit4]   2> 826 T732 oashc.SpellCheckComponent.inform Initializing spell checkers
[junit4:junit4]   2> 829 T732 oass.DirectSolrSpellChecker.init init: {name=direct,classname=DirectSolrSpellChecker,field=lowerfilt,minQueryLength=3}
[junit4:junit4]   2> 847 T733 oasc.SolrCore.registerSearcher [collection1] Registered new searcher Searcher@1fe4c43 main{StandardDirectoryReader(segments_1:1)}
[junit4:junit4]   2> 850 T732 oasc.ZkController.publish publishing core=collection1 state=down
[junit4:junit4]   2> 850 T732 oasc.ZkController.publish numShards not found on descriptor - reading it from system property
[junit4:junit4]   2> 850 T721 oazs.PrepRequestProcessor.pRequest Got user-level KeeperException when processing sessionid:0x13c211fa3350003 type:create cxid:0x50 zxid:0x29 txntype:-1 reqpath:n/a Error Path:/solr/overseer/queue Error:KeeperErrorCode = NoNode for /solr/overseer/queue
[junit4:junit4]   2> 1738 T730 oascc.ZkStateReader.updateClusterState Updating cloud state from ZooKeeper... 
[junit4:junit4]   2> 1739 T730 oasc.Overseer$ClusterStateUpdater.updateState Update state numShards=null message={
[junit4:junit4]   2> 	  "operation":"state",
[junit4:junit4]   2> 	  "numShards":null,
[junit4:junit4]   2> 	  "shard":null,
[junit4:junit4]   2> 	  "roles":null,
[junit4:junit4]   2> 	  "state":"down",
[junit4:junit4]   2> 	  "core":"collection1",
[junit4:junit4]   2> 	  "collection":"collection1",
[junit4:junit4]   2> 	  "node_name":"127.0.0.1:1661_solr",
[junit4:junit4]   2> 	  "base_url":"http://127.0.0.1:1661/solr"}
[junit4:junit4]   2> 1739 T730 oasc.Overseer$ClusterStateUpdater.updateState Assigning new node to shard shard=shard1
[junit4:junit4]   2> 1740 T721 oazs.PrepRequestProcessor.pRequest Got user-level KeeperException when processing sessionid:0x13c211fa3350003 type:create cxid:0x58 zxid:0x2c txntype:-1 reqpath:n/a Error Path:/solr/overseer/queue-work Error:KeeperErrorCode = NoNode for /solr/overseer/queue-work
[junit4:junit4]   2> 1744 T729 oascc.ZkStateReader$2.process A cluster state change: WatchedEvent state:SyncConnected type:NodeDataChanged path:/clusterstate.json, has occurred - updating... (live nodes size: 1)
[junit4:junit4]   2> 1852 T732 oasc.CoreContainer.registerCore registering core: collection1
[junit4:junit4]   2> 1853 T732 oasc.ZkController.register Register replica - core:collection1 address:http://127.0.0.1:1661/solr collection:collection1 shard:shard1
[junit4:junit4]   2> 1853 T732 oascc.SolrZkClient.makePath makePath: /collections/collection1/leader_elect/shard1/election
[junit4:junit4]   2> 1859 T721 oazs.PrepRequestProcessor.pRequest Got user-level KeeperException when processing sessionid:0x13c211fa3350003 type:delete cxid:0x72 zxid:0x36 txntype:-1 reqpath:n/a Error Path:/solr/collections/collection1/leaders Error:KeeperErrorCode = NoNode for /solr/collections/collection1/leaders
[junit4:junit4]   2> 1860 T732 oasc.ShardLeaderElectionContext.runLeaderProcess Running the leader process.
[junit4:junit4]   2> 1860 T721 oazs.PrepRequestProcessor.pRequest Got user-level KeeperException when processing sessionid:0x13c211fa3350003 type:create cxid:0x73 zxid:0x37 txntype:-1 reqpath:n/a Error Path:/solr/overseer Error:KeeperErrorCode = NodeExists for /solr/overseer
[junit4:junit4]   2> 1862 T732 oasc.ShardLeaderElectionContext.waitForReplicasToComeUp Enough replicas found to continue.
[junit4:junit4]   2> 1862 T732 oasc.ShardLeaderElectionContext.runLeaderProcess I may be the new leader - try and sync
[junit4:junit4]   2> 1862 T732 oasc.ShardLeaderElectionContext.runLeaderProcess I am the new leader: http://127.0.0.1:1661/solr/collection1/
[junit4:junit4]   2> 1862 T732 oascc.SolrZkClient.makePath makePath: /collections/collection1/leaders/shard1
[junit4:junit4]   2> 1867 T721 oazs.PrepRequestProcessor.pRequest Got user-level KeeperException when processing sessionid:0x13c211fa3350003 type:create cxid:0x7d zxid:0x3b txntype:-1 reqpath:n/a Error Path:/solr/overseer Error:KeeperErrorCode = NodeExists for /solr/overseer
[junit4:junit4]   2> 3249 T730 oascc.ZkStateReader.updateClusterState Updating cloud state from ZooKeeper... 
[junit4:junit4]   2> 4650 T720 oazsp.FileTxnLog.commit WARNING fsync-ing the write ahead log in SyncThread:0 took 1224ms which will adversely effect operation latency. See the ZooKeeper troubleshooting guide
[junit4:junit4]   2> 4650 T729 oascc.ZkStateReader$2.process A cluster state change: WatchedEvent state:SyncConnected type:NodeDataChanged path:/clusterstate.json, has occurred - updating... (live nodes size: 1)
[junit4:junit4]   2> 4675 T732 oasc.ZkController.register We are http://127.0.0.1:1661/solr/collection1/ and leader is http://127.0.0.1:1661/solr/collection1/
[junit4:junit4]   2> 4676 T732 oasc.ZkController.checkRecovery WARNING Skipping recovery according to sys prop solrcloud.skip.autorecovery
[junit4:junit4]   2> 4676 T732 oasc.ZkController.publish publishing core=collection1 state=active
[junit4:junit4]   2> 4676 T732 oasc.ZkController.publish numShards not found on descriptor - reading it from system property
[junit4:junit4]   2> 4677 T732 oascc.ZkStateReader.updateClusterState Updating cloud state from ZooKeeper... 
[junit4:junit4]   2> 4678 T716 oasc.SolrResourceLoader.locateSolrHome JNDI not configured for solr (NoInitialContextEx)
[junit4:junit4]   2> 4678 T716 oasc.SolrResourceLoader.locateSolrHome using system property solr.solr.home: /mnt/ssd/jenkins/workspace/Lucene-Solr-trunk-Linux/solr/build/solr-core/test-files/solr
[junit4:junit4]   2> 4679 T716 oasc.CoreContainer$Initializer.initialize looking for solr.xml: /mnt/ssd/jenkins/workspace/Lucene-Solr-trunk-Linux/solr/build/solr-core/test-files/solr/solr.xml
[junit4:junit4]   2> 4679 T716 oasc.CoreContainer.<init> New CoreContainer 9643629
[junit4:junit4]   2> 4680 T716 oasc.CoreContainer.load Loading CoreContainer using Solr Home: '/mnt/ssd/jenkins/workspace/Lucene-Solr-trunk-Linux/solr/build/solr-core/test-files/solr/'
[junit4:junit4]   2> 4680 T716 oasc.SolrResourceLoader.<init> new SolrResourceLoader for directory: '/mnt/ssd/jenkins/workspace/Lucene-Solr-trunk-Linux/solr/build/solr-core/test-files/solr/'
[junit4:junit4]   2> 4703 T716 oashc.HttpShardHandlerFactory.getParameter Setting socketTimeout to: 60000
[junit4:junit4]   2> 4703 T716 oashc.HttpShardHandlerFactory.getParameter Setting urlScheme to: http://
[junit4:junit4]   2> 4704 T716 oashc.HttpShardHandlerFactory.getParameter Setting connTimeout to: 15000
[junit4:junit4]   2> 4704 T716 oashc.HttpShardHandlerFactory.getParameter Setting maxConnectionsPerHost to: 20
[junit4:junit4]   2> 4705 T716 oashc.HttpShardHandlerFactory.getParameter Setting corePoolSize to: 0
[junit4:junit4]   2> 4705 T716 oashc.HttpShardHandlerFactory.getParameter Setting maximumPoolSize to: 2147483647
[junit4:junit4]   2> 4706 T716 oashc.HttpShardHandlerFactory.getParameter Setting maxThreadIdleTime to: 5
[junit4:junit4]   2> 4706 T716 oashc.HttpShardHandlerFactory.getParameter Setting sizeOfQueue to: -1
[junit4:junit4]   2> 4706 T716 oashc.HttpShardHandlerFactory.getParameter Setting fairnessPolicy to: false
[junit4:junit4]   2> 4706 T716 oascsi.HttpClientUtil.createClient Creating new http client, config:maxConnectionsPerHost=20&maxConnections=10000&socketTimeout=60000&connTimeout=15000&retry=false
[junit4:junit4]   2> 4713 T716 oasc.CoreContainer.load Registering Log Listener
[junit4:junit4]   2> 4725 T716 oasc.CoreContainer.initZooKeeper Zookeeper client=127.0.0.1:36154/solr
[junit4:junit4]   2> 4726 T716 oasc.ZkController.checkChrootPath zkHost includes chroot
[junit4:junit4]   2> 4726 T716 oaz.ZooKeeper.<init> Initiating client connection, connectString=127.0.0.1:36154 sessionTimeout=60000 watcher=org.apache.solr.common.cloud.ConnectionManager@bd8fcd
[junit4:junit4]   2> 4727 T734 oaz.ClientCnxn$SendThread.logStartConnect Opening socket connection to server localhost.localdomain/127.0.0.1:36154. Will not attempt to authenticate using SASL (access denied (javax.security.auth.AuthPermission getLoginConfiguration))
[junit4:junit4]   2> 4727 T716 oascc.ConnectionManager.waitForConnected Waiting for client to connect to ZooKeeper
[junit4:junit4]   2> 4728 T734 oaz.ClientCnxn$SendThread.primeConnection Socket connection established to localhost.localdomain/127.0.0.1:36154, initiating session
[junit4:junit4]   2> 4728 T718 oazs.NIOServerCnxnFactory.run Accepted socket connection from /127.0.0.1:58210
[junit4:junit4]   2> 4728 T718 oazs.ZooKeeperServer.processConnectRequest Client attempting to establish new session at /127.0.0.1:58210
[junit4:junit4]   2> 4729 T720 oazs.ZooKeeperServer.finishSessionInit Established session 0x13c211fa3350004 with negotiated timeout 20000 for client /127.0.0.1:58210
[junit4:junit4]   2> 4729 T734 oaz.ClientCnxn$SendThread.onConnected Session establishment complete on server localhost.localdomain/127.0.0.1:36154, sessionid = 0x13c211fa3350004, negotiated timeout = 20000
[junit4:junit4]   2> 4729 T735 oascc.ConnectionManager.process Watcher org.apache.solr.common.cloud.ConnectionManager@bd8fcd name:ZooKeeperConnection Watcher:127.0.0.1:36154 got event WatchedEvent state:SyncConnected type:None path:null path:null type:None
[junit4:junit4]   2> 4729 T716 oascc.ConnectionManager.waitForConnected Client is connected to ZooKeeper
[junit4:junit4]   2> 4731 T721 oazs.PrepRequestProcessor.pRequest2Txn Processed session termination for sessionid: 0x13c211fa3350004
[junit4:junit4]   2> 4731 T718 oazs.NIOServerCnxn.closeSock Closed socket connection for client /127.0.0.1:58210 which had sessionid 0x13c211fa3350004
[junit4:junit4]   2> 4731 T735 oaz.ClientCnxn$EventThread.run EventThread shut down
[junit4:junit4]   2> 4731 T716 oaz.ZooKeeper.close Session: 0x13c211fa3350004 closed
[junit4:junit4]   2> 4732 T716 oascsi.HttpClientUtil.createClient Creating new http client, config:maxConnections=500&maxConnectionsPerHost=16&socketTimeout=60000&connTimeout=15000
[junit4:junit4]   2> 4734 T716 oaz.ZooKeeper.<init> Initiating client connection, connectString=127.0.0.1:36154/solr sessionTimeout=3000 watcher=org.apache.solr.common.cloud.ConnectionManager@d9efe6
[junit4:junit4]   2> 4735 T716 oascc.ConnectionManager.waitForConnected Waiting for client to connect to ZooKeeper
[junit4:junit4]   2> 4735 T736 oaz.ClientCnxn$SendThread.logStartConnect Opening socket connection to server localhost.localdomain/127.0.0.1:36154. Will not attempt to authenticate using SASL (access denied (javax.security.auth.AuthPermission getLoginConfiguration))
[junit4:junit4]   2> 4736 T736 oaz.ClientCnxn$SendThread.primeConnection Socket connection established to localhost.localdomain/127.0.0.1:36154, initiating session
[junit4:junit4]   2> 4736 T718 oazs.NIOServerCnxnFactory.run Accepted socket connection from /127.0.0.1:58211
[junit4:junit4]   2> 4736 T718 oazs.ZooKeeperServer.processConnectRequest Client attempting to establish new session at /127.0.0.1:58211
[junit4:junit4]   2> 4737 T736 oaz.ClientCnxn$SendThread.onConnected Session establishment complete on server localhost.localdomain/127.0.0.1:36154, sessionid = 0x13c211fa3350005, negotiated timeout = 3000
[junit4:junit4]   2> 4737 T720 oazs.ZooKeeperServer.finishSessionInit Established session 0x13c211fa3350005 with negotiated timeout 3000 for client /127.0.0.1:58211
[junit4:junit4]   2> 4737 T737 oascc.ConnectionManager.process Watcher org.apache.solr.common.cloud.ConnectionManager@d9efe6 name:ZooKeeperConnection Watcher:127.0.0.1:36154/solr got event WatchedEvent state:SyncConnected type:None path:null path:null type:None
[junit4:junit4]   2> 4737 T716 oascc.ConnectionManager.waitForConnected Client is connected to ZooKeeper
[junit4:junit4]   2> 4738 T721 oazs.PrepRequestProcessor.pRequest Got user-level KeeperException when processing sessionid:0x13c211fa3350005 type:create cxid:0x1 zxid:0x48 txntype:-1 reqpath:n/a Error Path:/solr/overseer Error:KeeperErrorCode = NodeExists for /solr/overseer
[junit4:junit4]   2> 4739 T721 oazs.PrepRequestProcessor.pRequest Got user-level KeeperException when processing sessionid:0x13c211fa3350005 type:create cxid:0x2 zxid:0x49 txntype:-1 reqpath:n/a Error Path:/solr/overseer Error:KeeperErrorCode = NodeExists for /solr/overseer
[junit4:junit4]   2> 4740 T716 oasc.ZkController.createEphemeralLiveNode Register node as live in ZooKeeper:/live_nodes/127.0.0.1:1662_solr
[junit4:junit4]   2> 4740 T721 oazs.PrepRequestProcessor.pRequest Got user-level KeeperException when processing sessionid:0x13c211fa3350005 type:delete cxid:0x4 zxid:0x4a txntype:-1 reqpath:n/a Error Path:/solr/live_nodes/127.0.0.1:1662_solr Error:KeeperErrorCode = NoNode for /solr/live_nodes/127.0.0.1:1662_solr
[junit4:junit4]   2> 4741 T716 oascc.SolrZkClient.makePath makePath: /live_nodes/127.0.0.1:1662_solr
[junit4:junit4]   2> 4743 T729 oascc.ZkStateReader$3.process Updating live nodes... (2)
[junit4:junit4]   2> 4743 T729 oascc.ZkStateReader$2.process A cluster state change: WatchedEvent state:SyncConnected type:NodeChildrenChanged path:/live_nodes, has occurred - updating... (live nodes size: 2)
[junit4:junit4]   2> 4745 T716 oascc.ZkStateReader.createClusterStateWatchersAndUpdate Updating cluster state from ZooKeeper... 
[junit4:junit4]   2> 4754 T738 oasc.CoreContainer.create Creating SolrCore 'collection1' using instanceDir: /mnt/ssd/jenkins/workspace/Lucene-Solr-trunk-Linux/solr/build/solr-core/test-files/solr/collection1
[junit4:junit4]   2> 4754 T738 oasc.ZkController.createCollectionZkNode Check for collection zkNode:collection1
[junit4:junit4]   2> 4755 T738 oasc.ZkController.createCollectionZkNode Collection zkNode exists
[junit4:junit4]   2> 4755 T738 oasc.ZkController.readConfigName Load collection config from:/collections/collection1
[junit4:junit4]   2> 4756 T738 oasc.SolrResourceLoader.<init> new SolrResourceLoader for directory: '/mnt/ssd/jenkins/workspace/Lucene-Solr-trunk-Linux/solr/build/solr-core/test-files/solr/collection1/'
[junit4:junit4]   2> 4756 T738 oasc.SolrResourceLoader.replaceClassLoader Adding 'file:/mnt/ssd/jenkins/workspace/Lucene-Solr-trunk-Linux/solr/build/solr-core/test-files/solr/collection1/lib/README' to classloader
[junit4:junit4]   2> 4757 T738 oasc.SolrResourceLoader.replaceClassLoader Adding 'file:/mnt/ssd/jenkins/workspace/Lucene-Solr-trunk-Linux/solr/build/solr-core/test-files/solr/collection1/lib/classes/' to classloader
[junit4:junit4]   2> 4790 T738 oasc.SolrConfig.<init> Using Lucene MatchVersion: LUCENE_50
[junit4:junit4]   2> 4845 T738 oasc.SolrConfig.<init> Loaded SolrConfig: solrconfig.xml
[junit4:junit4]   2> 4846 T738 oass.IndexSchema.readSchema Reading Solr Schema
[junit4:junit4]   2> 4850 T738 oass.IndexSchema.readSchema Schema name=test
[junit4:junit4]   2> 5310 T738 oass.OpenExchangeRatesOrgProvider.init Initialized with rates=open-exchange-rates.json, refreshInterval=1440.
[junit4:junit4]   2> 5321 T738 oass.IndexSchema.readSchema default search field in schema is text
[junit4:junit4]   2> 5324 T738 oass.IndexSchema.readSchema unique key field: id
[junit4:junit4]   2> 5342 T738 oass.FileExchangeRateProvider.reload Reloading exchange rates from file currency.xml
[junit4:junit4]   2> 5347 T738 oass.FileExchangeRateProvider.reload Reloading exchange rates from file currency.xml
[junit4:junit4]   2> 5353 T738 oass.OpenExchangeRatesOrgProvider.reload Reloading exchange rates from open-exchange-rates.json
[junit4:junit4]   2> 5356 T738 oass.OpenExchangeRatesOrgProvider.reload Reloading exchange rates from open-exchange-rates.json
[junit4:junit4]   2> 5358 T738 oasc.SolrCore.<init> [collection1] Opening new SolrCore at /mnt/ssd/jenkins/workspace/Lucene-Solr-trunk-Linux/solr/build/solr-core/test-files/solr/collection1/, dataDir=/mnt/ssd/jenkins/workspace/Lucene-Solr-trunk-Linux/solr/build/solr-core/test/J0/./solrtest-ClusterStateUpdateTest-1357765387058/data2/
[junit4:junit4]   2> 5358 T738 oasc.JmxMonitoredMap.<init> JMX monitoring is enabled. Adding Solr mbeans to JMX Server: com.sun.jmx.mbeanserver.JmxMBeanServer@a3d3b
[junit4:junit4]   2> 5359 T738 oasc.SolrCore.initDirectoryFactory org.apache.solr.core.MockDirectoryFactory
[junit4:junit4]   2> 5360 T738 oasc.CachingDirectoryFactory.get return new directory for /mnt/ssd/jenkins/workspace/Lucene-Solr-trunk-Linux/solr/build/solr-core/test/J0/./solrtest-ClusterStateUpdateTest-1357765387058/data2 forceNew:false
[junit4:junit4]   2> 5360 T738 oasc.CachingDirectoryFactory.close Releasing directory:/mnt/ssd/jenkins/workspace/Lucene-Solr-trunk-Linux/solr/build/solr-core/test/J0/./solrtest-ClusterStateUpdateTest-1357765387058/data2
[junit4:junit4]   2> 5360 T738 oasc.SolrCore.getNewIndexDir New index directory detected: old=null new=/mnt/ssd/jenkins/workspace/Lucene-Solr-trunk-Linux/solr/build/solr-core/test/J0/./solrtest-ClusterStateUpdateTest-1357765387058/data2/index/
[junit4:junit4]   2> 5361 T738 oasc.SolrCore.initIndex WARNING [collection1] Solr index directory '/mnt/ssd/jenkins/workspace/Lucene-Solr-trunk-Linux/solr/build/solr-core/test/J0/./solrtest-ClusterStateUpdateTest-1357765387058/data2/index' doesn't exist. Creating new index...
[junit4:junit4]   2> 5362 T738 oasc.CachingDirectoryFactory.get return new directory for /mnt/ssd/jenkins/workspace/Lucene-Solr-trunk-Linux/solr/build/solr-core/test/J0/./solrtest-ClusterStateUpdateTest-1357765387058/data2/index forceNew:false
[junit4:junit4]   2> 5364 T738 oasc.SolrDeletionPolicy.onCommit SolrDeletionPolicy.onCommit: commits:num=1
[junit4:junit4]   2> 		commit{dir=RateLimitedDirectoryWrapper(MockDirWrapper(org.apache.lucene.store.RAMDirectory@11be158 lockFactory=org.apache.lucene.store.NativeFSLockFactory@1525abc)),segFN=segments_1,generation=1,filenames=[segments_1]
[junit4:junit4]   2> 5364 T738 oasc.SolrDeletionPolicy.updateCommits newest commit = 1[segments_1]
[junit4:junit4]   2> 5365 T738 oasc.CachingDirectoryFactory.close Releasing directory:/mnt/ssd/jenkins/workspace/Lucene-Solr-trunk-Linux/solr/build/solr-core/test/J0/./solrtest-ClusterStateUpdateTest-1357765387058/data2/index
[junit4:junit4]   2> 5365 T738 oasc.SolrCore.initWriters created xml: solr.XMLResponseWriter
[junit4:junit4]   2> 5367 T738 oasup.UpdateRequestProcessorChain.init inserting DistributedUpdateProcessorFactory into updateRequestProcessorChain "dedupe"
[junit4:junit4]   2> 5368 T738 oasup.UpdateRequestProcessorChain.init inserting DistributedUpdateProcessorFactory into updateRequestProcessorChain "dedupe-allfields"
[junit4:junit4]   2> 5368 T738 oasup.UpdateRequestProcessorChain.init inserting DistributedUpdateProcessorFactory into updateRequestProcessorChain "stored_sig"
[junit4:junit4]   2> 5369 T738 oasup.UpdateRequestProcessorChain.init inserting DistributedUpdateProcessorFactory into updateRequestProcessorChain "uniq-fields"
[junit4:junit4]   2> 5370 T738 oasup.UpdateRequestProcessorChain.init inserting DistributedUpdateProcessorFactory into updateRequestProcessorChain "distrib-dup-test-chain-implicit"
[junit4:junit4]   2> 5370 T738 oasc.RequestHandlers.initHandlersFromConfig adding lazy requestHandler: solr.ReplicationHandler
[junit4:junit4]   2> 5371 T738 oasc.RequestHandlers.initHandlersFromConfig created /replication: solr.ReplicationHandler
[junit4:junit4]   2> 5371 T738 oasc.RequestHandlers.initHandlersFromConfig created standard: solr.StandardRequestHandler
[junit4:junit4]   2> 5372 T738 oasc.RequestHandlers.initHandlersFromConfig created /get: solr.RealTimeGetHandler
[junit4:junit4]   2> 5373 T738 oasc.RequestHandlers.initHandlersFromConfig created dismax: solr.SearchHandler
[junit4:junit4]   2> 5374 T738 oasc.RequestHandlers.initHandlersFromConfig created mock: org.apache.solr.core.MockQuerySenderListenerReqHandler
[junit4:junit4]   2> 5375 T738 oasc.RequestHandlers.initHandlersFromConfig created /admin/: org.apache.solr.handler.admin.AdminHandlers
[junit4:junit4]   2> 5375 T738 oasc.RequestHandlers.initHandlersFromConfig created defaults: solr.StandardRequestHandler
[junit4:junit4]   2> 5376 T738 oasc.RequestHandlers.initHandlersFromConfig adding lazy requestHandler: solr.StandardRequestHandler
[junit4:junit4]   2> 5376 T738 oasc.RequestHandlers.initHandlersFromConfig created lazy: solr.StandardRequestHandler
[junit4:junit4]   2> 5377 T738 oasc.RequestHandlers.initHandlersFromConfig created /update: solr.UpdateRequestHandler
[junit4:junit4]   2> 5378 T738 oasc.RequestHandlers.initHandlersFromConfig created /terms: org.apache.solr.handler.component.SearchHandler
[junit4:junit4]   2> 5379 T738 oasc.RequestHandlers.initHandlersFromConfig created spellCheckCompRH: org.apache.solr.handler.component.SearchHandler
[junit4:junit4]   2> 5380 T738 oasc.RequestHandlers.initHandlersFromConfig created spellCheckCompRH_Direct: org.apache.solr.handler.component.SearchHandler
[junit4:junit4]   2> 5380 T738 oasc.RequestHandlers.initHandlersFromConfig created spellCheckWithWordbreak: org.apache.solr.handler.component.SearchHandler
[junit4:junit4]   2> 5381 T738 oasc.RequestHandlers.initHandlersFromConfig created spellCheckWithWordbreak_Direct: org.apache.solr.handler.component.SearchHandler
[junit4:junit4]   2> 5382 T738 oasc.RequestHandlers.initHandlersFromConfig created spellCheckCompRH1: org.apache.solr.handler.component.SearchHandler
[junit4:junit4]   2> 5383 T738 oasc.RequestHandlers.initHandlersFromConfig created mltrh: org.apache.solr.handler.component.SearchHandler
[junit4:junit4]   2> 5384 T738 oasc.RequestHandlers.initHandlersFromConfig created tvrh: org.apache.solr.handler.component.SearchHandler
[junit4:junit4]   2> 5385 T738 oasc.RequestHandlers.initHandlersFromConfig created /mlt: solr.MoreLikeThisHandler
[junit4:junit4]   2> 5385 T738 oasc.RequestHandlers.initHandlersFromConfig created /debug/dump: solr.DumpRequestHandler
[junit4:junit4]   2> 5389 T738 oashl.XMLLoader.init xsltCacheLifetimeSeconds=60
[junit4:junit4]   2> 5391 T738 oasc.SolrCore.initDeprecatedSupport WARNING solrconfig.xml uses deprecated <admin/gettableFiles>, Please update your config to use the ShowFileRequestHandler.
[junit4:junit4]   2> 5392 T738 oasc.SolrCore.initDeprecatedSupport WARNING adding ShowFileRequestHandler with hidden files: [SCHEMA.XML, OLD_SYNONYMS.TXT, STOPWORDS.TXT, PROTWORDS.TXT, OPEN-EXCHANGE-RATES.JSON, SYNONYMS.TXT, CURRENCY.XML, MAPPING-ISOLATIN1ACCENT.TXT]
[junit4:junit4]   2> 5393 T738 oasc.CachingDirectoryFactory.close Releasing directory:/mnt/ssd/jenkins/workspace/Lucene-Solr-trunk-Linux/solr/build/solr-core/test/J0/./solrtest-ClusterStateUpdateTest-1357765387058/data2
[junit4:junit4]   2> 5394 T738 oass.SolrIndexSearcher.<init> Opening Searcher@128345a main
[junit4:junit4]   2> 5394 T738 oasu.CommitTracker.<init> Hard AutoCommit: disabled
[junit4:junit4]   2> 5394 T738 oasu.CommitTracker.<init> Soft AutoCommit: disabled
[junit4:junit4]   2> 5395 T738 oashc.SpellCheckComponent.inform Initializing spell checkers
[junit4:junit4]   2> 5398 T738 oass.DirectSolrSpellChecker.init init: {name=direct,classname=DirectSolrSpellChecker,field=lowerfilt,minQueryLength=3}
[junit4:junit4]   2> 5431 T739 oasc.SolrCore.registerSearcher [collection1] Registered new searcher Searcher@128345a main{StandardDirectoryReader(segments_1:1)}
[junit4:junit4]   2> 5439 T738 oasc.ZkController.publish publishing core=collection1 state=down
[junit4:junit4]   2> 5439 T738 oasc.ZkController.publish numShards not found on descriptor - reading it from system property
[junit4:junit4]   2> 6157 T730 oascc.ZkStateReader.updateClusterState Updating cloud state from ZooKeeper... 
[junit4:junit4]   2> 6159 T730 oasc.Overseer$ClusterStateUpdater.updateState Update state numShards=null message={
[junit4:junit4]   2> 	  "operation":"state",
[junit4:junit4]   2> 	  "numShards":null,
[junit4:junit4]   2> 	  "shard":"shard1",
[junit4:junit4]   2> 	  "roles":null,
[junit4:junit4]   2> 	  "state":"active",
[junit4:junit4]   2> 	  "core":"collection1",
[junit4:junit4]   2> 	  "collection":"collection1",
[junit4:junit4]   2> 	  "node_name":"127.0.0.1:1661_solr",
[junit4:junit4]   2> 	  "base_url":"http://127.0.0.1:1661/solr"}
[junit4:junit4]   2> 6165 T730 oasc.Overseer$ClusterStateUpdater.updateState Update state numShards=null message={
[junit4:junit4]   2> 	  "operation":"state",
[junit4:junit4]   2> 	  "numShards":null,
[junit4:junit4]   2> 	  "shard":null,
[junit4:junit4]   2> 	  "roles":null,
[junit4:junit4]   2> 	  "state":"down",
[junit4:junit4]   2> 	  "core":"collection1",
[junit4:junit4]   2> 	  "collection":"collection1",
[junit4:junit4]   2> 	  "node_name":"127.0.0.1:1662_solr",
[junit4:junit4]   2> 	  "base_url":"http://127.0.0.1:1662/solr"}
[junit4:junit4]   2> 6166 T730 oasc.Overseer$ClusterStateUpdater.updateState Collection already exists with numShards=1
[junit4:junit4]   2> 6166 T730 oasc.Overseer$ClusterStateUpdater.updateState Assigning new node to shard shard=shard1
[junit4:junit4]   2> 6172 T737 oascc.ZkStateReader$2.process A cluster state change: WatchedEvent state:SyncConnected type:NodeDataChanged path:/clusterstate.json, has occurred - updating... (live nodes size: 2)
[junit4:junit4]   2> 6172 T729 oascc.ZkStateReader$2.process A cluster state change: WatchedEvent state:SyncConnected type:NodeDataChanged path:/clusterstate.json, has occurred - updating... (live nodes size: 2)
[junit4:junit4]   2> 6441 T738 oasc.CoreContainer.registerCore registering core: collection1
[junit4:junit4]   2> 6442 T738 oasc.ZkController.register Register replica - core:collection1 address:http://127.0.0.1:1662/solr collection:collection1 shard:shard1
[junit4:junit4]   2> 6447 T738 oasc.ZkController.register We are http://127.0.0.1:1662/solr/collection1/ and leader is http://127.0.0.1:1661/solr/collection1/
[junit4:junit4]   2> 6447 T738 oasc.ZkController.checkRecovery WARNING Skipping recovery according to sys prop solrcloud.skip.autorecovery
[junit4:junit4]   2> 6448 T738 oasc.ZkController.publish publishing core=collection1 state=active
[junit4:junit4]   2> 6448 T738 oasc.ZkController.publish numShards not found on descriptor - reading it from system property
[junit4:junit4]   2> 6451 T738 oascc.ZkStateReader.updateClusterState Updating cloud state from ZooKeeper... 
[junit4:junit4]   2> 6453 T716 oasc.SolrResourceLoader.locateSolrHome JNDI not configured for solr (NoInitialContextEx)
[junit4:junit4]   2> 6454 T716 oasc.SolrResourceLoader.locateSolrHome using system property solr.solr.home: /mnt/ssd/jenkins/workspace/Lucene-Solr-trunk-Linux/solr/build/solr-core/test-files/solr
[junit4:junit4]   2> 6454 T716 oasc.CoreContainer$Initializer.initialize looking for solr.xml: /mnt/ssd/jenkins/workspace/Lucene-Solr-trunk-Linux/solr/build/solr-core/test-files/solr/solr.xml
[junit4:junit4]   2> 6455 T716 oasc.CoreContainer.<init> New CoreContainer 9993285
[junit4:junit4]   2> 6455 T716 oasc.CoreContainer.load Loading CoreContainer using Solr Home: '/mnt/ssd/jenkins/workspace/Lucene-Solr-trunk-Linux/solr/build/solr-core/test-files/solr/'
[junit4:junit4]   2> 6456 T716 oasc.SolrResourceLoader.<init> new SolrResourceLoader for directory: '/mnt/ssd/jenkins/workspace/Lucene-Solr-trunk-Linux/solr/build/solr-core/test-files/solr/'
[junit4:junit4]   2> 6474 T716 oashc.HttpShardHandlerFactory.getParameter Setting socketTimeout to: 60000
[junit4:junit4]   2> 6474 T716 oashc.HttpShardHandlerFactory.getParameter Setting urlScheme to: http://
[junit4:junit4]   2> 6474 T716 oashc.HttpShardHandlerFactory.getParameter Setting connTimeout to: 15000
[junit4:junit4]   2> 6474 T716 oashc.HttpShardHandlerFactory.getParameter Setting maxConnectionsPerHost to: 20
[junit4:junit4]   2> 6475 T716 oashc.HttpShardHandlerFactory.getParameter Setting corePoolSize to: 0
[junit4:junit4]   2> 6475 T716 oashc.HttpShardHandlerFactory.getParameter Setting maximumPoolSize to: 2147483647
[junit4:junit4]   2> 6475 T716 oashc.HttpShardHandlerFactory.getParameter Setting maxThreadIdleTime to: 5
[junit4:junit4]   2> 6475 T716 oashc.HttpShardHandlerFactory.getParameter Setting sizeOfQueue to: -1
[junit4:junit4]   2> 6476 T716 oashc.HttpShardHandlerFactory.getParameter Setting fairnessPolicy to: false
[junit4:junit4]   2> 6476 T716 oascsi.HttpClientUtil.createClient Creating new http client, config:maxConnectionsPerHost=20&maxConnections=10000&socketTimeout=60000&connTimeout=15000&retry=false
[junit4:junit4]   2> 6482 T716 oasc.CoreContainer.load Registering Log Listener
[junit4:junit4]   2> 6501 T716 oasc.CoreContainer.initZooKeeper Zookeeper client=127.0.0.1:36154/solr
[junit4:junit4]   2> 6501 T716 oasc.ZkController.checkChrootPath zkHost includes chroot
[junit4:junit4]   2> 6501 T716 oaz.ZooKeeper.<init> Initiating client connection, connectString=127.0.0.1:36154 sessionTimeout=60000 watcher=org.apache.solr.common.cloud.ConnectionManager@1043156
[junit4:junit4]   2> 6502 T716 oascc.ConnectionManager.waitForConnected Waiting for client to connect to ZooKeeper
[junit4:junit4]   2> 6502 T740 oaz.ClientCnxn$SendThread.logStartConnect Opening socket connection to server localhost.localdomain/127.0.0.1:36154. Will not attempt to authenticate using SASL (access denied (javax.security.auth.AuthPermission getLoginConfiguration))
[junit4:junit4]   2> 6503 T740 oaz.ClientCnxn$SendThread.primeConnection Socket connection established to localhost.localdomain/127.0.0.1:36154, initiating session
[junit4:junit4]   2> 6504 T718 oazs.NIOServerCnxnFactory.run Accepted socket connection from /127.0.0.1:58216
[junit4:junit4]   2> 6504 T718 oazs.ZooKeeperServer.processConnectRequest Client attempting to establish new session at /127.0.0.1:58216
[junit4:junit4]   2> 6506 T720 oazs.ZooKeeperServer.finishSessionInit Established session 0x13c211fa3350006 with negotiated timeout 20000 for client /127.0.0.1:58216
[junit4:junit4]   2> 6506 T740 oaz.ClientCnxn$SendThread.onConnected Session establishment complete on server localhost.localdomain/127.0.0.1:36154, sessionid = 0x13c211fa3350006, negotiated timeout = 20000
[junit4:junit4]   2> 6506 T741 oascc.ConnectionManager.process Watcher org.apache.solr.common.cloud.ConnectionManager@1043156 name:ZooKeeperConnection Watcher:127.0.0.1:36154 got event WatchedEvent state:SyncConnected type:None path:null path:null type:None
[junit4:junit4]   2> 6507 T716 oascc.ConnectionManager.waitForConnected Client is connected to ZooKeeper
[junit4:junit4]   2> 6509 T721 oazs.PrepRequestProcessor.pRequest2Txn Processed session termination for sessionid: 0x13c211fa3350006
[junit4:junit4]   2> 6510 T741 oaz.ClientCnxn$EventThread.run EventThread shut down
[junit4:junit4]   2> 6510 T718 oazs.NIOServerCnxn.closeSock Closed socket connection for client /127.0.0.1:58216 which had sessionid 0x13c211fa3350006
[junit4:junit4]   2> 6510 T716 oaz.ZooKeeper.close Session: 0x13c211fa3350006 closed
[junit4:junit4]   2> 6511 T716 oascsi.HttpClientUtil.createClient Creating new http client, config:maxConnections=500&maxConnectionsPerHost=16&socketTimeout=60000&connTimeout=15000
[junit4:junit4]   2> 6515 T716 oaz.ZooKeeper.<init> Initiating client connection, connectString=127.0.0.1:36154/solr sessionTimeout=3000 watcher=org.apache.solr.common.cloud.ConnectionManager@5c859e
[junit4:junit4]   2> 6517 T742 oaz.ClientCnxn$SendThread.logStartConnect Opening socket connection to server localhost.localdomain/127.0.0.1:36154. Will not attempt to authenticate using SASL (access denied (javax.security.auth.AuthPermission getLoginConfiguration))
[junit4:junit4]   2> 6516 T716 oascc.ConnectionManager.waitForConnected Waiting for client to connect to ZooKeeper
[junit4:junit4]   2> 6517 T742 oaz.ClientCnxn$SendThread.primeConnection Socket connection established to localhost.localdomain/127.0.0.1:36154, initiating session
[junit4:junit4]   2> 6518 T718 oazs.NIOServerCnxnFactory.run Accepted socket connection from /127.0.0.1:58217
[junit4:junit4]   2> 6518 T718 oazs.ZooKeeperServer.processConnectRequest Client attempting to establish new session at /127.0.0.1:58217
[junit4:junit4]   2> 6519 T720 oazs.ZooKeeperServer.finishSessionInit Established session 0x13c211fa3350007 with negotiated timeout 3000 for client /127.0.0.1:58217
[junit4:junit4]   2> 6519 T742 oaz.ClientCnxn$SendThread.onConnected Session establishment complete on server localhost.localdomain/127.0.0.1:36154, sessionid = 0x13c211fa3350007, negotiated timeout = 3000
[junit4:junit4]   2> 6520 T743 oascc.ConnectionManager.process Watcher org.apache.solr.common.cloud.ConnectionManager@5c859e name:ZooKeeperConnection Watcher:127.0.0.1:36154/solr got event WatchedEvent state:SyncConnected type:None path:null path:null type:None
[junit4:junit4]   2> 6520 T716 oascc.ConnectionManager.waitForConnected Client is connected to ZooKeeper
[junit4:junit4]   2> 6522 T721 oazs.PrepRequestProcessor.pRequest Got user-level KeeperException when processing sessionid:0x13c211fa3350007 type:create cxid:0x1 zxid:0x5a txntype:-1 reqpath:n/a Error Path:/solr/overseer Error:KeeperErrorCode = NodeExists for /solr/overseer
[junit4:junit4]   2> 6523 T721 oazs.PrepRequestProcessor.pRequest Got user-level KeeperException when processing sessionid:0x13c211fa3350007 type:create cxid:0x2 zxid:0x5b txntype:-1 reqpath:n/a Error Path:/solr/overseer Error:KeeperErrorCode = NodeExists for /solr/overseer
[junit4:junit4]   2> 6525 T716 oasc.ZkController.createEphemeralLiveNode Register node as live in ZooKeeper:/live_nodes/127.0.0.1:1663_solr
[junit4:junit4]   2> 6526 T721 oazs.PrepRequestProcessor.pRequest Got user-level KeeperException when processing sessionid:0x13c211fa3350007 type:delete cxid:0x4 zxid:0x5c txntype:-1 reqpath:n/a Error Path:/solr/live_nodes/127.0.0.1:1663_solr Error:KeeperErrorCode = NoNode for /solr/live_nodes/127.0.0.1:1663_solr
[junit4:junit4]   2> 6527 T716 oascc.SolrZkClient.makePath makePath: /live_nodes/127.0.0.1:1663_solr
[junit4:junit4]   2> 6530 T737 oascc.ZkStateReader$2.process A cluster state change: WatchedEvent state:SyncConnected type:NodeChildrenChanged path:/live_nodes, has occurred - updating... (live nodes size: 2)
[junit4:junit4]   2> 6530 T729 oascc.ZkStateReader$3.process Updating live nodes... (3)
[junit4:junit4]   2> 6531 T729 oascc.ZkStateReader$2.process A cluster state change: WatchedEvent state:SyncConnected type:NodeChildrenChanged path:/live_nodes, has occurred - updating... (live nodes size: 3)
[junit4:junit4]   2> 6533 T737 oascc.ZkStateReader$3.process Updating live nodes... (3)
[junit4:junit4]   2> 6536 T716 oascc.ZkStateReader.createClusterStateWatchersAndUpdate Updating cluster state from ZooKeeper... 
[junit4:junit4]   2> 6546 T744 oasc.CoreContainer.create Creating SolrCore 'collection1' using instanceDir: /mnt/ssd/jenkins/workspace/Lucene-Solr-trunk-Linux/solr/build/solr-core/test-files/solr/collection1
[junit4:junit4]   2> 6547 T744 oasc.ZkController.createCollectionZkNode Check for collection zkNode:collection1
[junit4:junit4]   2> 6548 T744 oasc.ZkController.createCollectionZkNode Collection zkNode exists
[junit4:junit4]   2> 6549 T744 oasc.ZkController.readConfigName Load collection config from:/collections/collection1
[junit4:junit4]   2> 6551 T744 oasc.SolrResourceLoader.<init> new SolrResourceLoader for directory: '/mnt/ssd/jenkins/workspace/Lucene-Solr-trunk-Linux/solr/build/solr-core/test-files/solr/collection1/'
[junit4:junit4]   2> 6552 T744 oasc.SolrResourceLoader.replaceClassLoader Adding 'file:/mnt/ssd/jenkins/workspace/Lucene-Solr-trunk-Linux/solr/build/solr-core/test-files/solr/collection1/lib/README' to classloader
[junit4:junit4]   2> 6552 T744 oasc.SolrResourceLoader.replaceClassLoader Adding 'file:/mnt/ssd/jenkins/workspace/Lucene-Solr-trunk-Linux/solr/build/solr-core/test-files/solr/collection1/lib/classes/' to classloader
[junit4:junit4]   2> 6612 T744 oasc.SolrConfig.<init> Using Lucene MatchVersion: LUCENE_50
[junit4:junit4]   2> 6672 T744 oasc.SolrConfig.<init> Loaded SolrConfig: solrconfig.xml
[junit4:junit4]   2> 6674 T744 oass.IndexSchema.readSchema Reading Solr Schema
[junit4:junit4]   2> 6678 T744 oass.IndexSchema.readSchema Schema name=test
[junit4:junit4]   2> 7147 T744 oass.OpenExchangeRatesOrgProvider.init Initialized with rates=open-exchange-rates.json, refreshInterval=1440.
[junit4:junit4]   2> 7156 T744 oass.IndexSchema.readSchema default search field in schema is text
[junit4:junit4]   2> 7160 T744 oass.IndexSchema.readSchema unique key field: id
[junit4:junit4]   2> 7176 T744 oass.FileExchangeRateProvider.reload Reloading exchange rates from file currency.xml
[junit4:junit4]   2> 7180 T744 oass.FileExchangeRateProvider.reload Reloading exchange rates from file currency.xml
[junit4:junit4]   2> 7184 T744 oass.OpenExchangeRatesOrgProvider.reload Reloading exchange rates from open-exchange-rates.json
[junit4:junit4]   2> 7185 T744 oass.OpenExchangeRatesOrgProvider.reload Reloading exchange rates from open-exchange-rates.json
[junit4:junit4]   2> 7186 T744 oasc.SolrCore.<init> [collection1] Opening new SolrCore at /mnt/ssd/jenkins/workspace/Lucene-Solr-trunk-Linux/solr/build/solr-core/test-files/solr/collection1/, dataDir=/mnt/ssd/jenkins/workspace/Lucene-Solr-trunk-Linux/solr/build/solr-core/test/J0/./solrtest-ClusterStateUpdateTest-1357765387058/data3/
[junit4:junit4]   2> 7187 T744 oasc.JmxMonitoredMap.<init> JMX monitoring is enabled. Adding Solr mbeans to JMX Server: com.sun.jmx.mbeanserver.JmxMBeanServer@a3d3b
[junit4:junit4]   2> 7187 T744 oasc.SolrCore.initDirectoryFactory org.apache.solr.core.MockDirectoryFactory
[junit4:junit4]   2> 7188 T744 oasc.CachingDirectoryFactory.get return new directory for /mnt/ssd/jenkins/workspace/Lucene-Solr-trunk-Linux/solr/build/solr-core/test/J0/./solrtest-ClusterStateUpdateTest-1357765387058/data3 forceNew:false
[junit4:junit4]   2> 7188 T744 oasc.CachingDirectoryFactory.close Releasing directory:/mnt/ssd/jenkins/workspace/Lucene-Solr-trunk-Linux/solr/build/solr-core/test/J0/./solrtest-ClusterStateUpdateTest-1357765387058/data3
[junit4:junit4]   2> 7188 T744 oasc.SolrCore.getNewIndexDir New index directory detected: old=null new=/mnt/ssd/jenkins/workspace/Lucene-Solr-trunk-Linux/solr/build/solr-core/test/J0/./solrtest-ClusterStateUpdateTest-1357765387058/data3/index/
[junit4:junit4]   2> 7189 T744 oasc.SolrCore.initIndex WARNING [collection1] Solr index directory '/mnt/ssd/jenkins/workspace/Lucene-Solr-trunk-Linux/solr/build/solr-core/test/J0/./solrtest-ClusterStateUpdateTest-1357765387058/data3/index' doesn't exist. Creating new index...
[junit4:junit4]   2> 7189 T744 oasc.CachingDirectoryFactory.get return new directory for /mnt/ssd/jenkins/workspace/Lucene-Solr-trunk-Linux/solr/build/solr-core/test/J0/./solrtest-ClusterStateUpdateTest-1357765387058/data3/index forceNew:false
[junit4:junit4]   2> 7191 T744 oasc.SolrDeletionPolicy.onCommit SolrDeletionPolicy.onCommit: commits:num=1
[junit4:junit4]   2> 		commit{dir=RateLimitedDirectoryWrapper(MockDirWrapper(org.apache.lucene.store.RAMDirectory@26de82 lockFactory=org.apache.lucene.store.NativeFSLockFactory@1b13c3f)),segFN=segments_1,generation=1,filenames=[segments_1]
[junit4:junit4]   2> 7191 T744 oasc.SolrDeletionPolicy.updateCommits newest commit = 1[segments_1]
[junit4:junit4]   2> 7192 T744 oasc.CachingDirectoryFactory.close Releasing directory:/mnt/ssd/jenkins/workspace/Lucene-Solr-trunk-Linux/solr/build/solr-core/test/J0/./solrtest-ClusterStateUpdateTest-1357765387058/data3/index
[junit4:junit4]   2> 7192 T744 oasc.SolrCore.initWriters created xml: solr.XMLResponseWriter
[junit4:junit4]   2> 7194 T744 oasup.UpdateRequestProcessorChain.init inserting DistributedUpdateProcessorFactory into updateRequestProcessorChain "dedupe"
[junit4:junit4]   2> 7195 T744 oasup.UpdateRequestProcessorChain.init inserting DistributedUpdateProcessorFactory into updateRequestProcessorChain "dedupe-allfields"
[junit4:junit4]   2> 7195 T744 oasup.UpdateRequestProcessorChain.init inserting DistributedUpdateProcessorFactory into updateRequestProcessorChain "stored_sig"
[junit4:junit4]   2> 7196 T744 oasup.UpdateRequestProcessorChain.init inserting DistributedUpdateProcessorFactory into updateRequestProcessorChain "uniq-fields"
[junit4:junit4]   2> 7197 T744 oasup.UpdateRequestProcessorChain.init inserting DistributedUpdateProcessorFactory into updateRequestProcessorChain "distrib-dup-test-chain-implicit"
[junit4:junit4]   2> 7197 T744 oasc.RequestHandlers.initHandlersFromConfig adding lazy requestHandler: solr.ReplicationHandler
[junit4:junit4]   2> 7198 T744 oasc.RequestHandlers.initHandlersFromConfig created /replication: solr.ReplicationHandler
[junit4:junit4]   2> 7198 T744 oasc.RequestHandlers.initHandlersFromConfig created standard: solr.StandardRequestHandler
[junit4:junit4]   2> 7199 T744 oasc.RequestHandlers.initHandlersFromConfig created /get: solr.RealTimeGetHandler
[junit4:junit4]   2> 7200 T744 oasc.RequestHandlers.initHandlersFromConfig created dismax: solr.SearchHandler
[junit4:junit4]   2> 7201 T744 oasc.RequestHandlers.initHandlersFromConfig created mock: org.apache.solr.core.MockQuerySenderListenerReqHandler
[junit4:junit4]   2> 7201 T744 oasc.RequestHandlers.initHandlersFromConfig created /admin/: org.apache.solr.handler.admin.AdminHandlers
[junit4:junit4]   2> 7202 T744 oasc.RequestHandlers.initHandlersFromConfig created defaults: solr.StandardRequestHandler
[junit4:junit4]   2> 7203 T744 oasc.RequestHandlers.initHandlersFromConfig adding lazy requestHandler: solr.StandardRequestHandler
[junit4:junit4]   2> 7203 T744 oasc.RequestHandlers.initHandlersFromConfig created lazy: solr.StandardRequestHandler
[junit4:junit4]   2> 7204 T744 oasc.RequestHandlers.initHandlersFromConfig created /update: solr.UpdateRequestHandler
[junit4:junit4]   2> 7205 T744 oasc.RequestHandlers.initHandlersFromConfig created /terms: org.apache.solr.handler.component.SearchHandler
[junit4:junit4]   2> 7205 T744 oasc.RequestHandlers.initHandlersFromConfig created spellCheckCompRH: org.apache.solr.handler.component.SearchHandler
[junit4:junit4]   2> 7206 T744 oasc.RequestHandlers.initHandlersFromConfig created spellCheckCompRH_Direct: org.apache.solr.handler.component.SearchHandler
[junit4:junit4]   2> 7206 T744 oasc.RequestHandlers.initHandlersFromConfig created spellCheckWithWordbreak: org.apache.solr.handler.component.SearchHandler
[junit4:junit4]   2> 7206 T744 oasc.RequestHandlers.initHandlersFromConfig created spellCheckWithWordbreak_Direct: org.apache.solr.handler.component.SearchHandler
[junit4:junit4]   2> 7207 T744 oasc.RequestHandlers.initHandlersFromConfig created spellCheckCompRH1: org.apache.solr.handler.component.SearchHandler
[junit4:junit4]   2> 7207 T744 oasc.RequestHandlers.initHandlersFromConfig created mltrh: org.apache.solr.handler.component.SearchHandler
[junit4:junit4]   2> 7208 T744 oasc.RequestHandlers.initHandlersFromConfig created tvrh: org.apache.solr.handler.component.SearchHandler
[junit4:junit4]   2> 7208 T744 oasc.RequestHandlers.initHandlersFromConfig created /mlt: solr.MoreLikeThisHandler
[junit4:junit4]   2> 7208 T744 oasc.RequestHandlers.initHandlersFromConfig created /debug/dump: solr.DumpRequestHandler
[junit4:junit4]   2> 7210 T744 oashl.XMLLoader.init xsltCacheLifetimeSeconds=60
[junit4:junit4]   2> 7211 T744 oasc.SolrCore.initDeprecatedSupport WARNING solrconfig.xml uses deprecated <admin/gettableFiles>, Please update your config to use the ShowFileRequestHandler.
[junit4:junit4]   2> 7212 T744 oasc.SolrCore.initDeprecatedSupport WARNING adding ShowFileRequestHandler with hidden files: [SCHEMA.XML, OLD_SYNONYMS.TXT, STOPWORDS.TXT, PROTWORDS.TXT, OPEN-EXCHANGE-RATES.JSON, SYNONYMS.TXT, CURRENCY.XML, MAPPING-ISOLATIN1ACCENT.TXT]
[junit4:junit4]   2> 7214 T744 oasc.CachingDirectoryFactory.close Releasing directory:/mnt/ssd/jenkins/workspace/Lucene-Solr-trunk-Linux/solr/build/solr-core/test/J0/./solrtest-ClusterStateUpdateTest-1357765387058/data3
[junit4:junit4]   2> 7214 T744 oass.SolrIndexSearcher.<init> Opening Searcher@147419d main
[junit4:junit4]   2> 7214 T744 oasu.CommitTracker.<init> Hard AutoCommit: disabled
[junit4:junit4]   2> 7215 T744 oasu.CommitTracker.<init> Soft AutoCommit: disabled
[junit4:junit4]   2> 7215 T744 oashc.SpellCheckComponent.inform Initializing spell checkers
[junit4:junit4]   2> 7219 T744 oass.DirectSolrSpellChecker.init init: {name=direct,classname=DirectSolrSpellChecker,field=lowerfilt,minQueryLength=3}
[junit4:junit4]   2> 7237 T745 oasc.SolrCore.registerSearcher [collection1] Registered new searcher Searcher@147419d main{StandardDirectoryReader(segments_1:1)}
[junit4:junit4]   2> 7244 T744 oasc.ZkController.publish publishing core=collection1 state=down
[junit4:junit4]   2> 7245 T744 oasc.ZkController.publish numShards not found on descriptor - reading it from system property
[junit4:junit4]   2> 7682 T730 oascc.ZkStateReader.updateClusterState Updating cloud state from ZooKeeper... 
[junit4:junit4]   2> 7684 T730 oasc.Overseer$ClusterStateUpdater.updateState Update state numShards=null message={
[junit4:junit4]   2> 	  "operation":"state",
[junit4:junit4]   2> 	  "numShards":null,
[junit4:junit4]   2> 	  "shard":"shard1",
[junit4:junit4]   2> 	  "roles":null,
[junit4:junit4]   2> 	  "state":"active",
[junit4:junit4]   2> 	  "core":"collection1",
[junit4:junit4]   2> 	  "collection":"collection1",
[junit4:junit4]   2> 	  "node_name":"127.0.0.1:1662_solr",
[junit4:junit4]   2> 	  "base_url":"http://127.0.0.1:1662/solr"}
[junit4:junit4]   2> 7689 T730 oasc.Overseer$ClusterStateUpdater.updateState Update state numShards=null message={
[junit4:junit4]   2> 	  "operation":"state",
[junit4:junit4]   2> 	  "numShards":null,
[junit4:junit4]   2> 	  "shard":null,
[junit4:junit4]   2> 	  "roles":null,
[junit4:junit4]   2> 	  "state":"down",
[junit4:junit4]   2> 	  "core":"collection1",
[junit4:junit4]   2> 	  "collection":"collection1",
[junit4:junit4]   2> 	  "node_name":"127.0.0.1:1663_solr",
[junit4:junit4]   2> 	  "base_url":"http://127.0.0.1:1663/solr"}
[junit4:junit4]   2> 7690 T730 oasc.Overseer$ClusterStateUpdater.updateState Collection already exists with numShards=1
[junit4:junit4]   2> 7690 T730 oasc.Overseer$ClusterStateUpdater.updateState Assigning new node to shard shard=shard1
[junit4:junit4]   2> 7696 T729 oascc.ZkStateReader$2.process A cluster state change: WatchedEvent state:SyncConnected type:NodeDataChanged path:/clusterstate.json, has occurred - updating... (live nodes size: 3)
[junit4:junit4]   2> 7696 T743 oascc.ZkStateReader$2.process A cluster state change: WatchedEvent state:SyncConnected type:NodeDataChanged path:/clusterstate.json, has occurred - updating... (live nodes size: 3)
[junit4:junit4]   2> 7696 T737 oascc.ZkStateReader$2.process A cluster state change: WatchedEvent state:SyncConnected type:NodeDataChanged path:/clusterstate.json, has occurred - updating... (live nodes size: 3)
[junit4:junit4]   2> 8247 T744 oasc.CoreContainer.registerCore registering core: collection1
[junit4:junit4]   2> 8247 T744 oasc.ZkController.register Register replica - core:collection1 address:http://127.0.0.1:1663/solr collection:collection1 shard:shard1
[junit4:junit4]   2> 8252 T744 oasc.ZkController.register We are http://127.0.0.1:1663/solr/collection1/ and leader is http://127.0.0.1:1661/solr/collection1/
[junit4:junit4]   2> 8253 T744 oasc.ZkController.checkRecovery WARNING Skipping recovery according to sys prop solrcloud.skip.autorecovery
[junit4:junit4]   2> 8253 T744 oasc.ZkController.publish publishing core=collection1 state=active
[junit4:junit4]   2> 8253 T744 oasc.ZkController.publish numShards not found on descriptor - reading it from system property
[junit4:junit4]   2> 8256 T744 oascc.ZkStateReader.updateClusterState Updating cloud state from ZooKeeper... 
[junit4:junit4]   2> 8257 T716 oasc.ClusterStateUpdateTest.setUp ####SETUP_END testCoreRegistration
[junit4:junit4]   2> 8258 T716 oaz.ZooKeeper.<init> Initiating client connection, connectString=127.0.0.1:36154/solr sessionTimeout=10000 watcher=org.apache.solr.common.cloud.ConnectionManager@1d9f14f
[junit4:junit4]   2> 8259 T716 oascc.ConnectionManager.waitForConnected Waiting for client to connect to ZooKeeper
[junit4:junit4]   2> 8260 T746 oaz.ClientCnxn$SendThread.logStartConnect Opening socket connection to server localhost.localdomain/127.0.0.1:36154. Will not attempt to authenticate using SASL (access denied (javax.security.auth.AuthPermission getLoginConfiguration))
[junit4:junit4]   2> 8261 T746 oaz.ClientCnxn$SendThread.primeConnection Socket connection established to localhost.localdomain/127.0.0.1:36154, initiating session
[junit4:junit4]   2> 8261 T718 oazs.NIOServerCnxnFactory.run Accepted socket connection from /127.0.0.1:58223
[junit4:junit4]   2> 8262 T718 oazs.ZooKeeperServer.processConnectRequest Client attempting to establish new session at /127.0.0.1:58223
[junit4:junit4]   2> 8263 T720 oazs.ZooKeeperServer.finishSessionInit Established session 0x13c211fa3350008 with negotiated timeout 10000 for client /127.0.0.1:58223
[junit4:junit4]   2> 8263 T746 oaz.ClientCnxn$SendThread.onConnected Session establishment complete on server localhost.localdomain/127.0.0.1:36154, sessionid = 0x13c211fa3350008, negotiated timeout = 10000
[junit4:junit4]   2> 8264 T747 oascc.ConnectionManager.process Watcher org.apache.solr.common.cloud.ConnectionManager@1d9f14f name:ZooKeeperConnection Watcher:127.0.0.1:36154/solr got event WatchedEvent state:SyncConnected type:None path:null path:null type:None
[junit4:junit4]   2> 8264 T716 oascc.ConnectionManager.waitForConnected Client is connected to ZooKeeper
[junit4:junit4]   2> 8265 T716 oascc.SolrZkClient.makePath makePath: /collections/testcore
[junit4:junit4]   2> 8269 T716 oascc.SolrZkClient.makePath makePath: /collections/testcore/shards
[junit4:junit4]   2> 8274 T721 oazs.PrepRequestProcessor.pRequest2Txn Processed session termination for sessionid: 0x13c211fa3350008
[junit4:junit4]   2> 8275 T747 oaz.ClientCnxn$EventThread.run EventThread shut down
[junit4:junit4]   2> 8275 T718 oazs.NIOServerCnxn.closeSock Closed socket connection for client /127.0.0.1:58223 which had sessionid 0x13c211fa3350008
[junit4:junit4]   2> 8275 T716 oaz.ZooKeeper.close Session: 0x13c211fa3350008 closed
[junit4:junit4]   2> 8276 T716 oasc.CoreContainer.create Creating SolrCore 'testcore' using instanceDir: /mnt/ssd/jenkins/workspace/Lucene-Solr-trunk-Linux/solr/build/solr-core/test-files/solr/testcore
[junit4:junit4]   2> 8277 T716 oasc.ZkController.createCollectionZkNode Check for collection zkNode:testcore
[junit4:junit4]   2> 8278 T716 oasc.ZkController.createCollectionZkNode Collection zkNode exists
[junit4:junit4]   2> 8279 T716 oasc.ZkController.readConfigName Load collection config from:/collections/testcore
[junit4:junit4]   2> 8281 T716 oasc.SolrResourceLoader.<init> new SolrResourceLoader for directory: '/mnt/ssd/jenkins/workspace/Lucene-Solr-trunk-Linux/solr/build/solr-core/test-files/solr/testcore/'
[junit4:junit4]   2> 8336 T716 oasc.SolrConfig.<init> Using Lucene MatchVersion: LUCENE_50
[junit4:junit4]   2> 8393 T716 oasc.SolrConfig.<init> Loaded SolrConfig: solrconfig.xml
[junit4:junit4]   2> 8394 T716 oass.IndexSchema.readSchema Reading Solr Schema
[junit4:junit4]   2> 8399 T716 oass.IndexSchema.readSchema Schema name=test
[junit4:junit4]   2> 8868 T716 oass.OpenExchangeRatesOrgProvider.init Initialized with rates=open-exchange-rates.json, refreshInterval=1440.
[junit4:junit4]   2> 8874 T716 oass.IndexSchema.readSchema default search field in schema is text
[junit4:junit4]   2> 8877 T716 oass.IndexSchema.readSchema unique key field: id
[junit4:junit4]   2> 8892 T716 oass.FileExchangeRateProvider.reload Reloading exchange rates from file currency.xml
[junit4:junit4]   2> 8896 T716 oass.FileExchangeRateProvider.reload Reloading exchange rates from file currency.xml
[junit4:junit4]   2> 8900 T716 oass.OpenExchangeRatesOrgProvider.reload Reloading exchange rates from open-exchange-rates.json
[junit4:junit4]   2> 8901 T716 oass.OpenExchangeRatesOrgProvider.reload Reloading exchange rates from open-exchange-rates.json
[junit4:junit4]   2> 8903 T716 oasc.SolrCore.<init> [testcore] Opening new SolrCore at /mnt/ssd/jenkins/workspace/Lucene-Solr-trunk-Linux/solr/build/solr-core/test-files/solr/testcore/, dataDir=/mnt/ssd/jenkins/workspace/Lucene-Solr-trunk-Linux/solr/build/solr-core/test/J0/./solrtest-ClusterStateUpdateTest-1357765387058/data4/
[junit4:junit4]   2> 8903 T716 oasc.JmxMonitoredMap.<init> JMX monitoring is enabled. Adding Solr mbeans to JMX Server: com.sun.jmx.mbeanserver.JmxMBeanServer@a3d3b
[junit4:junit4]   2> 8904 T716 oasc.SolrCore.initDirectoryFactory org.apache.solr.core.MockDirectoryFactory
[junit4:junit4]   2> 8904 T716 oasc.CachingDirectoryFactory.get return new directory for /mnt/ssd/jenkins/workspace/Lucene-Solr-trunk-Linux/solr/build/solr-core/test/J0/./solrtest-ClusterStateUpdateTest-1357765387058/data4 forceNew:false
[junit4:junit4]   2> 8904 T716 oasc.CachingDirectoryFactory.close Releasing directory:/mnt/ssd/jenkins/workspace/Lucene-Solr-trunk-Linux/solr/build/solr-core/test/J0/./solrtest-ClusterStateUpdateTest-1357765387058/data4
[junit4:junit4]   2> 8905 T716 oasc.SolrCore.getNewIndexDir New index directory detected: old=null new=/mnt/ssd/jenkins/workspace/Lucene-Solr-trunk-Linux/solr/build/solr-core/test/J0/./solrtest-ClusterStateUpdateTest-1357765387058/data4/index/
[junit4:junit4]   2> 8905 T716 oasc.SolrCore.initIndex WARNING [testcore] Solr index directory '/mnt/ssd/jenkins/workspace/Lucene-Solr-trunk-Linux/solr/build/solr-core/test/J0/./solrtest-ClusterStateUpdateTest-1357765387058/data4/index' doesn't exist. Creating new index...
[junit4:junit4]   2> 8905 T716 oasc.CachingDirectoryFactory.get return new directory for /mnt/ssd/jenkins/workspace/Lucene-Solr-trunk-Linux/solr/build/solr-core/test/J0/./solrtest-ClusterStateUpdateTest-1357765387058/data4/index forceNew:false
[junit4:junit4]   2> 8906 T716 oasc.SolrDeletionPolicy.onCommit SolrDeletionPolicy.onCommit: commits:num=1
[junit4:junit4]   2> 		commit{dir=RateLimitedDirectoryWrapper(BaseDirectoryWrapper(org.apache.lucene.store.RAMDirectory@15ca160 lockFactory=org.apache.lucene.store.NativeFSLockFactory@aa0831)),segFN=segments_1,generation=1,filenames=[segments_1]
[junit4:junit4]   2> 8907 T716 oasc.SolrDeletionPolicy.updateCommits newest commit = 1[segments_1]
[junit4:junit4]   2> 8907 T716 oasc.CachingDirectoryFactory.close Releasing directory:/mnt/ssd/jenkins/workspace/Lucene-Solr-trunk-Linux/solr/build/solr-core/test/J0/./solrtest-ClusterStateUpdateTest-1357765387058/data4/index
[junit4:junit4]   2> 8908 T716 oasc.SolrCore.initWriters created xml: solr.XMLResponseWriter
[junit4:junit4]   2> 8909 T716 oasup.UpdateRequestProcessorChain.init inserting DistributedUpdateProcessorFactory into updateRequestProcessorChain "dedupe"
[junit4:junit4]   2> 8910 T716 oasup.UpdateRequestProcessorChain.init inserting DistributedUpdateProcessorFactory into updateRequestProcessorChain "dedupe-allfields"
[junit4:junit4]   2> 8910 T716 oasup.UpdateRequestProcessorChain.init inserting DistributedUpdateProcessorFactory into updateRequestProcessorChain "stored_sig"
[junit4:junit4]   2> 8910 T716 oasup.UpdateRequestProcessorChain.init inserting DistributedUpdateProcessorFactory into updateRequestProcessorChain "uniq-fields"
[junit4:junit4]   2> 8911 T716 oasup.UpdateRequestProcessorChain.init inserting DistributedUpdateProcessorFactory into updateRequestProcessorChain "distrib-dup-test-chain-implicit"
[junit4:junit4]   2> 8911 T716 oasc.RequestHandlers.initHandlersFromConfig adding lazy requestHandler: solr.ReplicationHandler
[junit4:junit4]   2> 8912 T716 oasc.RequestHandlers.initHandlersFromConfig created /replication: solr.ReplicationHandler
[junit4:junit4]   2> 8919 T716 oasc.RequestHandlers.initHandlersFromConfig created standard: solr.StandardRequestHandler
[junit4:junit4]   2> 8920 T716 oasc.RequestHandlers.initHandlersFromConfig created /get: solr.RealTimeGetHandler
[junit4:junit4]   2> 8921 T716 oasc.RequestHandlers.initHandlersFromConfig created dismax: solr.SearchHandler
[junit4:junit4]   2> 8921 T716 oasc.RequestHandlers.initHandlersFromConfig created mock: org.apache.solr.core.MockQuerySenderListenerReqHandler
[junit4:junit4]   2> 8922 T716 oasc.RequestHandlers.initHandlersFromConfig created /admin/: org.apache.solr.handler.admin.AdminHandlers
[junit4:junit4]   2> 8922 T716 oasc.RequestHandlers.initHandlersFromConfig created defaults: solr.StandardRequestHandler
[junit4:junit4]   2> 8923 T716 oasc.RequestHandlers.initHandlersFromConfig adding lazy requestHandler: solr.StandardRequestHandler
[junit4:junit4]   2> 8923 T716 oasc.RequestHandlers.initHandlersFromConfig created lazy: solr.StandardRequestHandler
[junit4:junit4]   2> 8923 T716 oasc.RequestHandlers.initHandlersFromConfig created /update: solr.UpdateRequestHandler
[junit4:junit4]   2> 8924 T716 oasc.RequestHandlers.initHandlersFromConfig created /terms: org.apache.solr.handler.component.SearchHandler
[junit4:junit4]   2> 8925 T716 oasc.RequestHandlers.initHandlersFromConfig created spellCheckCompRH: org.apache.solr.handler.component.SearchHandler
[junit4:junit4]   2> 8925 T716 oasc.RequestHandlers.initHandlersFromConfig created spellCheckCompRH_Direct: org.apache.solr.handler.component.SearchHandler
[junit4:junit4]   2> 8926 T716 oasc.RequestHandlers.initHandlersFromConfig created spellCheckWithWordbreak: org.apache.solr.handler.component.SearchHandler
[junit4:junit4]   2> 8927 T716 oasc.RequestHandlers.initHandlersFromConfig created spellCheckWithWordbreak_Direct: org.apache.solr.handler.component.SearchHandler
[junit4:junit4]   2> 8927 T716 oasc.RequestHandlers.initHandlersFromConfig created spellCheckCompRH1: org.apache.solr.handler.component.SearchHandler
[junit4:junit4]   2> 8928 T716 oasc.RequestHandlers.initHandlersFromConfig created mltrh: org.apache.solr.handler.component.SearchHandler
[junit4:junit4]   2> 8929 T716 oasc.RequestHandlers.initHandlersFromConfig created tvrh: org.apache.solr.handler.component.SearchHandler
[junit4:junit4]   2> 8929 T716 oasc.RequestHandlers.initHandlersFromConfig created /mlt: solr.MoreLikeThisHandler
[junit4:junit4]   2> 8930 T716 oasc.RequestHandlers.initHandlersFromConfig created /debug/dump: solr.DumpRequestHandler
[junit4:junit4]   2> 8934 T716 oashl.XMLLoader.init xsltCacheLifetimeSeconds=60
[junit4:junit4]   2> 8937 T716 oasc.SolrCore.initDeprecatedSupport WARNING solrconfig.xml uses deprecated <admin/gettableFiles>, Please update your config to use the ShowFileRequestHandler.
[junit4:junit4]   2> 8938 T716 oasc.SolrCore.initDeprecatedSupport WARNING adding ShowFileRequestHandler with hidden files: [SCHEMA.XML, OLD_SYNONYMS.TXT, STOPWORDS.TXT, PROTWORDS.TXT, OPEN-EXCHANGE-RATES.JSON, SYNONYMS.TXT, CURRENCY.XML, MAPPING-ISOLATIN1ACCENT.TXT]
[junit4:junit4]   2> 8941 T716 oasc.CachingDirectoryFactory.close Releasing directory:/mnt/ssd/jenkins/workspace/Lucene-Solr-trunk-Linux/solr/build/solr-core/test/J0/./solrtest-ClusterStateUpdateTest-1357765387058/data4
[junit4:junit4]   2> 8942 T716 oass.SolrIndexSearcher.<init> Opening Searcher@15e15eb main
[junit4:junit4]   2> 8943 T716 oasu.CommitTracker.<init> Hard AutoCommit: disabled
[junit4:junit4]   2> 8943 T716 oasu.CommitTracker.<init> Soft AutoCommit: disabled
[junit4:junit4]   2> 8944 T716 oashc.SpellCheckComponent.inform Initializing spell checkers
[junit4:junit4]   2> 9205 T730 oascc.ZkStateReader.updateClusterState Updating cloud state from ZooKeeper... 
[junit4:junit4]   2> 9207 T730 oasc.Overseer$ClusterStateUpdater.updateState Update state numShards=null message={
[junit4:junit4]   2> 	  "operation":"state",
[junit4:junit4]   2> 	  "numShards":null,
[junit4:junit4]   2> 	  "shard":"shard1",
[junit4:junit4]   2> 	  "roles":null,
[junit4:junit4]   2> 	  "state":"active",
[junit4:junit4]   2> 	  "core":"collection1",
[junit4:junit4]   2> 	  "collection":"collection1",
[junit4:junit4]   2> 	  "node_name":"127.0.0.1:1663_solr",
[junit4:junit4]   2> 	  "base_url":"http://127.0.0.1:1663/solr"}
[junit4:junit4]   2> 10259 T742 oaz.ClientCnxn$SendThread.run Client session timed out, have not heard from server in 2001ms for sessionid 0x13c211fa3350007, closing socket connection and attempting reconnect
[junit4:junit4]   2> 10259 T718 oazs.NIOServerCnxn.doIO WARNING caught end of stream exception EndOfStreamException: Unable to read additional data from client sessionid 0x13c211fa3350007, likely client has closed socket
[junit4:junit4]   2> 	at org.apache.zookeeper.server.NIOServerCnxn.doIO(NIOServerCnxn.java:220)
[junit4:junit4]   2> 	at org.apache.zookeeper.server.NIOServerCnxnFactory.run(NIOServerCnxnFactory.java:208)
[junit4:junit4]   2> 	at java.lang.Thread.run(Thread.java:662)
[junit4:junit4]   2> 
[junit4:junit4]   2> 10260 T718 oazs.NIOServerCnxn.closeSock Closed socket connection for client /127.0.0.1:58217 which had sessionid 0x13c211fa3350007
[junit4:junit4]   2> 10360 T743 oascc.ConnectionManager.process Watcher org.apache.solr.common.cloud.ConnectionManager@5c859e name:ZooKeeperConnection Watcher:127.0.0.1:36154/solr got event WatchedEvent state:Disconnected type:None path:null path:null type:None
[junit4:junit4]   2> 10360 T743 oascc.ConnectionManager.process zkClient has disconnected
[junit4:junit4]   2> 10701 T736 oaz.ClientCnxn$SendThread.run Client session timed out, have not heard from server in 2001ms for sessionid 0x13c211fa3350005, closing socket connection and attempting reconnect
[junit4:junit4]   2> 10702 T718 oazs.NIOServerCnxn.doIO WARNING caught end of stream exception EndOfStreamException: Unable to read additional data from client sessionid 0x13c211fa3350005, likely client has closed socket
[junit4:junit4]   2> 	at org.apache.zookeeper.server.NIOServerCnxn.doIO(NIOServerCnxn.java:220)
[junit4:junit4]   2> 	at org.apache.zookeeper.server.NIOServerCnxnFactory.run(NIOServerCnxnFactory.java:208)
[junit4:junit4]   2> 	at java.lang.Thread.run(Thread.java:662)
[junit4:junit4]   2> 
[junit4:junit4]   2> 10703 T718 oazs.NIOServerCnxn.closeSock Closed socket connection for client /127.0.0.1:58211 which had sessionid 0x13c211fa3350005
[junit4:junit4]   2> 10802 T737 oascc.ConnectionManager.process Watcher org.apache.solr.common.cloud.ConnectionManager@d9efe6 name:ZooKeeperConnection Watcher:127.0.0.1:36154/solr got event WatchedEvent state:Disconnected type:None path:null path:null type:None
[junit4:junit4]   2> 10802 T737 oascc.ConnectionManager.process zkClient has disconnected
[junit4:junit4]   2> 11208 T728 oaz.ClientCnxn$SendThread.run Client session timed out, have not heard from server in 2002ms for sessionid 0x13c211fa3350003, closing socket connection and attempting reconnect
[junit4:junit4]   2> 11208 T718 oazs.NIOServerCnxn.doIO WARNING caught end of stream exception EndOfStreamException: Unable to read additional data from client sessionid 0x13c211fa3350003, likely client has closed socket
[junit4:junit4]   2> 	at org.apache.zookeeper.server.NIOServerCnxn.doIO(NIOServerCnxn.java:220)
[junit4:junit4]   2> 	at org.apache.zookeeper.server.NIOServerCnxnFactory.run(NIOServerCnxnFactory.java:208)
[junit4:junit4]   2> 	at java.lang.Thread.run(Thread.java:662)
[junit4:junit4]   2> 
[junit4:junit4]   2> 12945 T719 oazs.ZooKeeperServer.expire Expiring session 0x13c211fa3350005, timeout of 3000ms exceeded
[junit4:junit4]   2> 13171 T718 oazs.NIOServerCnxn.closeSock Closed socket connection for client /127.0.0.1:58202 which had sessionid 0x13c211fa3350003
[junit4:junit4]   2> 12653 T736 oaz.ClientCnxn$SendThread.logStartConnect Opening socket connection to server localhost.localdomain/127.0.0.1:36154. Will not attempt to authenticate using SASL (access denied (javax.security.auth.AuthPermission getLoginConfiguration))
[junit4:junit4]   2> 12606 T728 oaz.ClientCnxn$SendThread.logStartConnect Opening socket connection to server localhost.localdomain/127.0.0.1:36154. Will not attempt to authenticate using SASL (access denied (javax.security.auth.AuthPermission getLoginConfiguration))
[junit4:junit4]   2> 13172 T736 oaz.ClientCnxn$SendThread.primeConnection Socket connection established to localhost.localdomain/127.0.0.1:36154, initiating session
[junit4:junit4]   2> 13172 T728 oaz.ClientCnxn$SendThread.primeConnection Socket connection established to localhost.localdomain/127.0.0.1:36154, initiating session
[junit4:junit4]   2> 11959 T742 oaz.ClientCnxn$SendThread.logStartConnect Opening socket connection to server localhost.localdomain/127.0.0.1:36154. Will not attempt to authenticate using SASL (access denied (javax.security.auth.AuthPermission getLoginConfiguration))
[junit4:junit4]   2> 11309 T729 oascc.ConnectionManager.process Watcher org.apache.solr.common.cloud.ConnectionManager@cd3ffa name:ZooKeeperConnection Watcher:127.0.0.1:36154/solr got event WatchedEvent state:Disconnected type:None path:null path:null type:None
[junit4:junit4]   2> 13173 T742 oaz.ClientCnxn$SendThread.primeConnection Socket connection established to localhost.localdomain/127.0.0.1:36154, initiating session
[junit4:junit4]   2> 13172 T718 oazs.NIOServerCnxnFactory.run Accepted socket connection from /127.0.0.1:58224
[junit4:junit4]   2> 13171 T719 oazs.ZooKeeperServer.expire Expiring session 0x13c211fa3350007, timeout of 3000ms exceeded
[junit4:junit4]   2> 13174 T729 oascc.ConnectionManager.process zkClient has disconnected
[junit4:junit4]   2> 13176 T718 oazs.NIOServerCnxnFactory.run Accepted socket connection from /127.0.0.1:58225
[junit4:junit4]   2> 13176 T721 oazs.PrepRequestProcessor.pRequest2Txn Processed session termination for sessionid: 0x13c211fa3350005
[junit4:junit4]   2> 13177 T721 oazs.PrepRequestProcessor.pRequest2Txn Processed session termination for sessionid: 0x13c211fa3350007
[junit4:junit4]   2> 13176 T729 oasc.DistributedQueue$LatchChildWatcher.process Watcher fired on path: null state: Disconnected type None
[junit4:junit4]   2> 13177 T718 oazs.ZooKeeperServer.processConnectRequest Client attempting to renew session 0x13c211fa3350005 at /127.0.0.1:58224
[junit4:junit4]   2> 13178 T718 oazs.ZooKeeperServer.finishSessionInit Invalid session 0x13c211fa3350005 for client /127.0.0.1:58224, probably expired
[junit4:junit4]   2> 13178 T736 oaz.ClientCnxn$SendThread.run Unable to reconnect to ZooKeeper service, session 0x13c211fa3350005 has expired, closing socket connection
[junit4:junit4]   2> 13178 T737 oascc.ConnectionManager.process Watcher org.apache.solr.common.cloud.ConnectionManager@d9efe6 name:ZooKeeperConnection Watcher:127.0.0.1:36154/solr got event WatchedEvent state:Expired type:None path:null path:null type:None
[junit4:junit4]   2> 13179 T718 oazs.ZooKeeperServer.processConnectRequest Client attempting to renew session 0x13c211fa3350003 at /127.0.0.1:58225
[junit4:junit4]   2> 13179 T737 oascc.ConnectionManager.process Our previous ZooKeeper session was expired. Attempting to reconnect to recover relationship with ZooKeeper...
[junit4:junit4]   2> 13180 T737 oascc.DefaultConnectionStrategy.reconnect Connection expired - starting a new one...
[junit4:junit4]   2> 13180 T728 oaz.ClientCnxn$SendThread.onConnected Session establishment complete on server localhost.localdomain/127.0.0.1:36154, sessionid = 0x13c211fa3350003, negotiated timeout = 3000
[junit4:junit4]   2> 13180 T718 oazs.ZooKeeperServer.finishSessionInit Established session 0x13c211fa3350003 with negotiated timeout 3000 for client /127.0.0.1:58225
[junit4:junit4]   2> 13180 T737 oaz.ZooKeeper.<init> Initiating client connection, connectString=127.0.0.1:36154/solr sessionTimeout=3000 watcher=org.apache.solr.common.cloud.ConnectionManager@d9efe6
[junit4:junit4]   2> 13181 T729 oascc.ConnectionManager.process Watcher org.apache.solr.common.cloud.ConnectionManager@cd3ffa name:ZooKeeperConnection Watcher:127.0.0.1:36154/solr got event WatchedEvent state:SyncConnected type:None path:null path:null type:None
[junit4:junit4]   2> 13183 T729 oasc.DistributedQueue$LatchChildWatcher.process Watcher fired on path: null state: SyncConnected type None
[junit4:junit4]   2> 13182 T718 oazs.NIOServerCnxnFactory.run Accepted socket connection from /127.0.0.1:58226
[junit4:junit4]   2> 13183 T737 oascc.ConnectionManager.waitForConnected Waiting for client to connect to ZooKeeper
[junit4:junit4]   2> 13183 T749 oaz.ClientCnxn$SendThread.logStartConnect Opening socket connection to server localhost.localdomain/127.0.0.1:36154. Will not attempt to authenticate using SASL (access denied (javax.security.auth.AuthPermission getLoginConfiguration))
[junit4:junit4]   2> 13184 T718 oazs.NIOServerCnxn.closeSock Closed socket connection for client /127.0.0.1:58224 which had sessionid 0x13c211fa3350005
[junit4:junit4]   2> 13184 T749 oaz.ClientCnxn$SendThread.primeConnection Socket connection established to localhost.localdomain/127.0.0.1:36154, initiating session
[junit4:junit4]   2> 13184 T718 oazs.ZooKeeperServer.processConnectRequest Client attempting to renew session 0x13c211fa3350007 at /127.0.0.1:58226
[junit4:junit4]   2> 13185 T718 oazs.ZooKeeperServer.finishSessionInit Invalid session 0x13c211fa3350007 for client /127.0.0.1:58226, probably expired
[junit4:junit4]   2> 13185 T743 oascc.ConnectionManager.process Watcher org.apache.solr.common.cloud.ConnectionManager@5c859e name:ZooKeeperConnection Watcher:127.0.0.1:36154/solr got event WatchedEvent state:Expired type:None path:null path:null type:None
[junit4:junit4]   2> 13185 T742 oaz.ClientCnxn$SendThread.run Unable to reconnect to ZooKeeper service, session 0x13c211fa3350007 has expired, closing socket connection
[junit4:junit4]   2> 13186 T743 oascc.ConnectionManager.process Our previous ZooKeeper session was expired. Attempting to reconnect to recover relationship with ZooKeeper...
[junit4:junit4]   2> 13185 T718 oazs.NIOServerCnxn.closeSock Closed socket connection for client /127.0.0.1:58226 which had sessionid 0x13c211fa3350007
[junit4:junit4]   2> 13186 T743 oascc.DefaultConnectionStrategy.reconnect Connection expired - starting a new one...
[junit4:junit4]   2> 13187 T718 oazs.NIOServerCnxnFactory.run Accepted socket connection from /127.0.0.1:58227
[junit4:junit4]   2> 13187 T743 oaz.ZooKeeper.<init> Initiating client connection, connectString=127.0.0.1:36154/solr sessionTimeout=3000 watcher=org.apache.solr.common.cloud.ConnectionManager@5c859e
[junit4:junit4]   2> 13187 T718 oazs.ZooKeeperServer.processConnectRequest Client attempting to establish new session at /127.0.0.1:58227
[junit4:junit4]   2> 13188 T743 oascc.ConnectionManager.waitForConnected Waiting for client to connect to ZooKeeper
[junit4:junit4]   2> 13188 T751 oaz.ClientCnxn$SendThread.logStartConnect Opening socket connection to server localhost.localdomain/127.0.0.1:36154. Will not attempt to authenticate using SASL (access denied (javax.security.auth.AuthPermission getLoginConfiguration))
[junit4:junit4]   2> 13189 T751 oaz.ClientCnxn$SendThread.primeConnection Socket connection established to localhost.localdomain/127.0.0.1:36154, initiating session
[junit4:junit4]   2> 13189 T718 oazs.NIOServerCnxnFactory.run Accepted socket connection from /127.0.0.1:58228
[junit4:junit4]   2> 13189 T718 oazs.ZooKeeperServer.processConnectRequest Client attempting to establish new session at /127.0.0.1:58228
[junit4:junit4]   2> 15181 T728 oaz.ClientCnxn$SendThread.run Client session timed out, have not heard from server in 2001ms for sessionid 0x13c211fa3350003, closing socket connection and attempting reconnect
[junit4:junit4]   2> 15182 T718 oazs.NIOServerCnxn.doIO WARNING caught end of stream exception EndOfStreamException: Unable to read additional data from client sessionid 0x13c211fa3350003, likely client has closed socket
[junit4:junit4]   2> 	at org.apache.zookeeper.server.NIOServerCnxn.doIO(NIOServerCnxn.java:220)
[junit4:junit4]   2> 	at org.apache.zookeeper.server.NIOServerCnxnFactory.run(NIOServerCnxnFactory.java:208)
[junit4:junit4]   2> 	at java.lang.Thread.run(Thread.java:662)
[junit4:junit4]   2> 
[junit4:junit4]   2> 15183 T718 oazs.NIOServerCnxn.closeSock Closed socket connection for client /127.0.0.1:58225 which had sessionid 0x13c211fa3350003
[junit4:junit4]   2> 15282 T729 oascc.ConnectionManager.process Watcher org.apache.solr.common.cloud.ConnectionManager@cd3ffa name:ZooKeeperConnection Watcher:127.0.0.1:36154/solr got event WatchedEvent state:Disconnected type:None path:null path:null type:None
[junit4:junit4]   2> 15283 T729 oascc.ConnectionManager.process zkClient has disconnected
[junit4:junit4]   2> 15283 T729 oasc.DistributedQueue$LatchChildWatcher.process Watcher fired on path: null state: Disconnected type None
[junit4:junit4]   2> 15380 T720 oazsp.FileTxnLog.commit WARNING fsync-ing the write ahead log in SyncThread:0 took 6132ms which will adversely effect operation latency. See the ZooKeeper troubleshooting guide
[junit4:junit4]   2> 15381 T720 oazs.NIOServerCnxn.sendBuffer SEVERE Unexpected Exception:  java.nio.channels.CancelledKeyException
[junit4:junit4]   2> 	at sun.nio.ch.SelectionKeyImpl.ensureValid(SelectionKeyImpl.java:55)
[junit4:junit4]   2> 	at sun.nio.ch.SelectionKeyImpl.interestOps(SelectionKeyImpl.java:59)
[junit4:junit4]   2> 	at org.apache.zookeeper.server.NIOServerCnxn.sendBuffer(NIOServerCnxn.java:153)
[junit4:junit4]   2> 	at org.apache.zookeeper.server.NIOServerCnxn.sendResponse(NIOServerCnxn.java:1076)
[junit4:junit4]   2> 	at org.apache.zookeeper.server.FinalRequestProcessor.processRequest(FinalRequestProcessor.java:404)
[junit4:junit4]   2> 	at org.apache.zookeeper.server.SyncRequestProcessor.flush(SyncRequestProcessor.java:167)
[junit4:junit4]   2> 	at org.apache.zookeeper.server.SyncRequestProcessor.run(SyncRequestProcessor.java:101)
[junit4:junit4]   2> 
[junit4:junit4]   2> 15382 T720 oazs.NIOServerCnxn.sendBuffer SEVERE Unexpected Exception:  java.nio.channels.CancelledKeyException
[junit4:junit4]   2> 	at sun.nio.ch.SelectionKeyImpl.ensureValid(SelectionKeyImpl.java:55)
[junit4:junit4]   2> 	at sun.nio.ch.SelectionKeyImpl.interestOps(SelectionKeyImpl.java:59)
[junit4:junit4]   2> 	at org.apache.zookeeper.server.NIOServerCnxn.sendBuffer(NIOServerCnxn.java:153)
[junit4:junit4]   2> 	at org.apache.zookeeper.server.NIOServerCnxn.sendResponse(NIOServerCnxn.java:1076)
[junit4:junit4]   2> 	at org.apache.zookeeper.server.FinalRequestProcessor.processRequest(FinalRequestProcessor.java:170)
[junit4:junit4]   2> 	at org.apache.zookeeper.server.SyncRequestProcessor.run(SyncRequestProcessor.java:138)
[junit4:junit4]   2> 
[junit4:junit4]   2> 15383 T720 oazs.NIOServerCnxn.sendBuffer SEVERE Unexpected Exception:  java.nio.channels.CancelledKeyException
[junit4:junit4]   2> 	at sun.nio.ch.SelectionKeyImpl.ensureValid(SelectionKeyImpl.java:55)
[junit4:junit4]   2> 	at sun.nio.ch.SelectionKeyImpl.interestOps(SelectionKeyImpl.java:59)
[junit4:junit4]   2> 	at org.apache.zookeeper.server.NIOServerCnxn.sendBuffer(NIOServerCnxn.java:153)
[junit4:junit4]   2> 	at org.apache.zookeeper.server.NIOServerCnxn.sendResponse(NIOServerCnxn.java:1076)
[junit4:junit4]   2> 	at org.apache.zookeeper.server.FinalRequestProcessor.processRequest(FinalRequestProcessor.java:170)
[junit4:junit4]   2> 	at org.apache.zookeeper.server.SyncRequestProcessor.run(SyncRequestProcessor.java:138)
[junit4:junit4]   2> 
[junit4:junit4]   2> 15383 T716 oass.DirectSolrSpellChecker.init init: {name=direct,classname=DirectSolrSpellChecker,field=lowerfilt,minQueryLength=3}
[junit4:junit4]   2> 15383 T720 oazs.NIOServerCnxn.sendBuffer SEVERE Unexpected Exception:  java.nio.channels.CancelledKeyException
[junit4:junit4]   2> 	at sun.nio.ch.SelectionKeyImpl.ensureValid(SelectionKeyImpl.java:55)
[junit4:junit4]   2> 	at sun.nio.ch.SelectionKeyImpl.interestOps(SelectionKeyImpl.java:59)
[junit4:junit4]   2> 	at org.apache.zookeeper.server.NIOServerCnxn.sendBuffer(NIOServerCnxn.java:153)
[junit4:junit4]   2> 	at org.apache.zookeeper.server.NIOServerCnxn.sendResponse(NIOServerCnxn.java:1076)
[junit4:junit4]   2> 	at org.apache.zookeeper.server.FinalRequestProcessor.processRequest(FinalRequestProcessor.java:170)
[junit4:junit4]   2> 	at org.apache.zookeeper.server.SyncRequestProcessor.run(SyncRequestProcessor.java:138)
[junit4:junit4]   2> 
[junit4:junit4]   2> 15385 T720 oazs.NIOServerCnxn.sendBuffer SEVERE Unexpected Exception:  java.nio.channels.CancelledKeyException
[junit4:junit4]   2> 	at sun.nio.ch.SelectionKeyImpl.ensureValid(SelectionKeyImpl.java:55)
[junit4:junit4]   2> 	at sun.nio.ch.SelectionKeyImpl.interestOps(SelectionKeyImpl.java:59)
[junit4:junit4]   2> 	at org.apache.zookeeper.server.NIOServerCnxn.sendBuffer(NIOServerCnxn.java:153)
[junit4:junit4]   2> 	at org.apache.zookeeper.server.NIOServerCnxn.sendResponse(NIOServerCnxn.java:1076)
[junit4:junit4]   2> 	at org.apache.zookeeper.server.NIOServerCnxn.process(NIOServerCnxn.java:1113)
[junit4:junit4]   2> 	at org.apache.zookeeper.server.DataTree.setWatches(DataTree.java:1327)
[junit4:junit4]   2> 	at org.apache.zookeeper.server.ZKDatabase.setWatches(ZKDatabase.java:384)
[junit4:junit4]   2> 	at org.apache.zookeeper.server.FinalRequestProcessor.processRequest(FinalRequestProcessor.java:304)
[junit4:junit4]   2> 	at org.apache.zookeeper.server.SyncRequestProcessor.flush(SyncRequestProcessor.java:167)
[junit4:junit4]   2> 	at org.apache.zookeeper.server.SyncRequestProcessor.run(SyncRequestProcessor.java:101)
[junit4:junit4]   2> 
[junit4:junit4]   2> 15386 T720 oazs.NIOServerCnxn.sendBuffer SEVERE Unexpected Exception:  java.nio.channels.CancelledKeyException
[junit4:junit4]   2> 	at sun.nio.ch.SelectionKeyImpl.ensureValid(SelectionKeyImpl.java:55)
[junit4:junit4]   2> 	at sun.nio.ch.SelectionKeyImpl.interestOps(SelectionKeyImpl.java:59)
[junit4:junit4]   2> 	at org.apache.zookeeper.server.NIOServerCnxn.sendBuffer(NIOServerCnxn.java:153)
[junit4:junit4]   2> 	at org.apache.zookeeper.server.NIOServerCnxn.sendResponse(NIOServerCnxn.java:1076)
[junit4:junit4]   2> 	at org.apache.zookeeper.server.FinalRequestProcessor.processRequest(FinalRequestProcessor.java:404)
[junit4:junit4]   2> 	at org.apache.zookeeper.server.SyncRequestProcessor.flush(SyncRequestProcessor.java:167)
[junit4:junit4]   2> 	at org.apache.zookeeper.server.SyncRequestProcessor.run(SyncRequestProcessor.java:101)
[junit4:junit4]   2> 
[junit4:junit4]   2> 15387 T720 oazs.NIOServerCnxn.sendBuffer SEVERE Unexpected Exception:  java.nio.channels.CancelledKeyException
[junit4:junit4]   2> 	at sun.nio.ch.SelectionKeyImpl.ensureValid(SelectionKeyImpl.java:55)
[junit4:junit4]   2> 	at sun.nio.ch.SelectionKeyImpl.interestOps(SelectionKeyImpl.java:59)
[junit4:junit4]   2> 	at org.apache.zookeeper.server.NIOServerCnxn.sendBuffer(NIOServerCnxn.java:153)
[junit4:junit4]   2> 	at org.apache.zookeeper.server.NIOServerCnxn.sendResponse(NIOServerCnxn.java:1076)
[junit4:junit4]   2> 	at org.apache.zookeeper.server.FinalRequestProcessor.processRequest(FinalRequestProcessor.java:404)
[junit4:junit4]   2> 	at org.apache.zookeeper.server.SyncRequestProcessor.flush(SyncRequestProcessor.java:167)
[junit4:junit4]   2> 	at org.apache.zookeeper.server.SyncRequestProcessor.run(SyncRequestProcessor.java:101)
[junit4:junit4]   2> 
[junit4:junit4]   2> 15389 T720 oazs.ZooKeeperServer.finishSessionInit Established session 0x13c211fa3350009 with negotiated timeout 3000 for client /127.0.0.1:58227
[junit4:junit4]   2> 15389 T749 oaz.ClientCnxn$SendThread.onConnected Session establishment complete on server localhost.localdomain/127.0.0.1:36154, sessionid = 0x13c211fa3350009, negotiated timeout = 3000
[junit4:junit4]   2> 15389 T720 oazs.NIOServerCnxn.sendBuffer SEVERE Unexpected Exception:  java.nio.channels.CancelledKeyException
[junit4:junit4]   2> 	at sun.nio.ch.SelectionKeyImpl.ensureValid(SelectionKeyImpl.java:55)
[junit4:junit4]   2> 	at sun.nio.ch.SelectionKeyImpl.interestOps(SelectionKeyImpl.java:59)
[junit4:junit4]   2> 	at org.apache.zookeeper.server.NIOServerCnxn.sendBuffer(NIOServerCnxn.java:153)
[junit4:junit4]   2> 	at org.apache.zookeeper.server.NIOServerCnxn.sendResponse(NIOServerCnxn.java:1076)
[junit4:junit4]   2> 	at org.apache.zookeeper.server.FinalRequestProcessor.processRequest(FinalRequestProcessor.java:404)
[junit4:junit4]   2> 	at org.apache.zookeeper.server.SyncRequestProcessor.flush(SyncRequestProcessor.java:167)
[junit4:junit4]   2> 	at org.apache.zookeeper.server.SyncRequestProcessor.run(SyncRequestProcessor.java:101)
[junit4:junit4]   2> 
[junit4:junit4]   2> 15389 T750 oascc.ConnectionManager.process Watcher org.apache.solr.common.cloud.ConnectionManager@d9efe6 name:ZooKeeperConnection Watcher:127.0.0.1:36154/solr got event WatchedEvent state:SyncConnected type:None path:null path:null type:None
[junit4:junit4]   2> 15391 T737 oascc.ConnectionManager.waitForConnected Client is connected to ZooKeeper
[junit4:junit4]   2> 15391 T720 oazs.ZooKeeperServer.finishSessionInit Established session 0x13c211fa335000a with negotiated timeout 3000 for client /127.0.0.1:58228
[junit4:junit4]   2> 15391 T751 oaz.ClientCnxn$SendThread.onConnected Session establishment complete on server localhost.localdomain/127.0.0.1:36154, sessionid = 0x13c211fa335000a, negotiated timeout = 3000
[junit4:junit4]   2> 15391 T737 oascc.ConnectionManager$1.update Connection with ZooKeeper reestablished.
[junit4:junit4]   2> 15391 T720 oazs.NIOServerCnxn.sendBuffer SEVERE Unexpected Exception:  java.nio.channels.CancelledKeyException
[junit4:junit4]   2> 	at sun.nio.ch.SelectionKeyImpl.ensureValid(SelectionKeyImpl.java:55)
[junit4:junit4]   2> 	at sun.nio.ch.SelectionKeyImpl.interestOps(SelectionKeyImpl.java:59)
[junit4:junit4]   2> 	at org.apache.zookeeper.server.NIOServerCnxn.sendBuffer(NIOServerCnxn.java:153)
[junit4:junit4]   2> 	at org.apache.zookeeper.server.NIOServerCnxn.sendResponse(NIOServerCnxn.java:1076)
[junit4:junit4]   2> 	at org.apache.zookeeper.server.FinalRequestProcessor.processRequest(FinalRequestProcessor.java:170)
[junit4:junit4]   2> 	at org.apache.zookeeper.server.SyncRequestProcessor.flush(SyncRequestProcessor.java:167)
[junit4:junit4]   2> 	at org.apache.zookeeper.server.SyncRequestProcessor.run(SyncRequestProcessor.java:101)
[junit4:junit4]   2> 
[junit4:junit4]   2> 15392 T752 oascc.ConnectionManager.process Watcher org.apache.solr.common.cloud.ConnectionManager@5c859e name:ZooKeeperConnection Watcher:127.0.0.1:36154/solr got event WatchedEvent state:SyncConnected type:None path:null path:null type:None
[junit4:junit4]   2> 15392 T737 oasc.ZkController.publish publishing core=collection1 state=down
[junit4:junit4]   2> 15394 T743 oascc.ConnectionManager.waitForConnected Client is connected to ZooKeeper
[junit4:junit4]   2> 15394 T737 oasc.ZkController.publish numShards not found on descriptor - reading it from system property
[junit4:junit4]   2> 15394 T743 oascc.ConnectionManager$1.update Connection with ZooKeeper reestablished.
[junit4:junit4]   2> 15395 T743 oasc.ZkController.publish publishing core=collection1 state=down
[junit4:junit4]   2> 15396 T743 oasc.ZkController.publish numShards not found on descriptor - reading it from system property
[junit4:junit4]   2> 15401 T737 oascc.ZkStateReader.createClusterStateWatchersAndUpdate Updating cluster state from ZooKeeper... 
[junit4:junit4]   2> 15402 T743 oascc.ZkStateReader.createClusterStateWatchersAndUpdate Updating cluster state from ZooKeeper... 
[junit4:junit4]   2> 15403 T737 oasc.ZkController.createEphemeralLiveNode Register node as live in ZooKeeper:/live_nodes/127.0.0.1:1662_solr
[junit4:junit4]   2> 15404 T721 oazs.PrepRequestProcessor.pRequest Got user-level KeeperException when processing sessionid:0x13c211fa3350009 type:delete cxid:0xb zxid:0x77 txntype:-1 reqpath:n/a Error Path:/solr/live_nodes/127.0.0.1:1662_solr Error:KeeperErrorCode = NoNode for /solr/live_nodes/127.0.0.1:1662_solr
[junit4:junit4]   2> 15404 T743 oasc.ZkController.createEphemeralLiveNode Register node as live in ZooKeeper:/live_nodes/127.0.0.1:1663_solr
[junit4:junit4]   2> 15405 T721 oazs.PrepRequestProcessor.pRequest Got user-level KeeperException when processing sessionid:0x13c211fa335000a type:delete cxid:0xb zxid:0x78 txntype:-1 reqpath:n/a Error Path:/solr/live_nodes/127.0.0.1:1663_solr Error:KeeperErrorCode = NoNode for /solr/live_nodes/127.0.0.1:1663_solr
[junit4:junit4]   2> 15405 T737 oascc.SolrZkClient.makePath makePath: /live_nodes/127.0.0.1:1662_solr
[junit4:junit4]   2> 15406 T743 oascc.SolrZkClient.makePath makePath: /live_nodes/127.0.0.1:1663_solr
[junit4:junit4]   2> 15408 T750 oascc.ZkStateReader$3.process Updating live nodes... (3)
[junit4:junit4]   2> 15408 T752 oascc.ZkStateReader$3.process Updating live nodes... (3)
[junit4:junit4]   2> 15409 T737 oasc.ZkController.register Register replica - core:collection1 address:http://127.0.0.1:1662/solr collection:collection1 shard:shard1
[junit4:junit4]   2> 15409 T743 oasc.ZkController.register Register replica - core:collection1 address:http://127.0.0.1:1663/solr collection:collection1 shard:shard1
[junit4:junit4]   2> 15414 T737 oasc.ZkController.register We are http://127.0.0.1:1662/solr/collection1/ and leader is http://127.0.0.1:1661/solr/collection1/
[junit4:junit4]   2> 15414 T737 oasc.ZkController.checkRecovery WARNING Skipping recovery according to sys prop solrcloud.skip.autorecovery
[junit4:junit4]   2> 15414 T743 oasc.ZkController.register We are http://127.0.0.1:1663/solr/collection1/ and leader is http://127.0.0.1:1661/solr/collection1/
[junit4:junit4]   2> 15415 T737 oasc.ZkController.publish publishing core=collection1 state=active
[junit4:junit4]   2> 15415 T743 oasc.ZkController.checkRecovery WARNING Skipping recovery according to sys prop solrcloud.skip.autorecovery
[junit4:junit4]   2> 15416 T737 oasc.ZkController.publish numShards not found on descriptor - reading it from system property
[junit4:junit4]   2> 15416 T743 oasc.ZkController.publish publishing core=collection1 state=active
[junit4:junit4]   2> 15417 T743 oasc.ZkController.publish numShards not found on descriptor - reading it from system property
[junit4:junit4]   2> 15419 T737 oascc.ZkStateReader.updateClusterState Updating cloud state from ZooKeeper... 
[junit4:junit4]   2> 15420 T743 oascc.ZkStateReader.updateClusterState Updating cloud state from ZooKeeper... 
[junit4:junit4]   2> 15420 T737 oascc.DefaultConnectionStrategy.reconnect Reconnected to ZooKeeper
[junit4:junit4]   2> 15421 T737 oascc.ConnectionManager.process Connected:true
[junit4:junit4]   2> 15421 T743 oascc.DefaultConnectionStrategy.reconnect Reconnected to ZooKeeper
[junit4:junit4]   2> 15421 T737 oaz.ClientCnxn$EventThread.run EventThread shut down
[junit4:junit4]   2> 15421 T743 oascc.ConnectionManager.process Connected:true
[junit4:junit4]   2> 15422 T748 oasc.SolrCore.registerSearcher [testcore] Registered new searcher Searcher@15e15eb main{StandardDirectoryReader(segments_1:1)}
[junit4:junit4]   2> 15422 T743 oaz.ClientCnxn$EventThread.run EventThread shut down
[junit4:junit4]   2> 15430 T716 oasc.ZkController.publish publishing core=testcore state=down
[junit4:junit4]   2> 15430 T716 oasc.ZkController.publish numShards not found on descriptor - reading it from system property
[junit4:junit4]   2> 16582 T730 oasc.Overseer$ClusterStateUpdater.run WARNING Overseer cannot talk to ZK
[junit4:junit4]   2> 17009 T728 oaz.ClientCnxn$SendThread.logStartConnect Opening socket connection to server localhost.localdomain/127.0.0.1:36154. Will not attempt to authenticate using SASL (access denied (javax.security.auth.AuthPermission getLoginConfiguration))
[junit4:junit4]   2> 17009 T728 oaz.ClientCnxn$SendThread.primeConnection Socket connection established to localhost.localdomain/127.0.0.1:36154, initiating session
[junit4:junit4]   2> 17010 T718 oazs.NIOServerCnxnFactory.run Accepted socket connection from /127.0.0.1:58229
[junit4:junit4]   2> 17010 T718 oazs.ZooKeeperServer.processConnectRequest Client attempting to renew session 0x13c211fa3350003 at /127.0.0.1:58229
[junit4:junit4]   2> 17011 T718 oazs.ZooKeeperServer.finishSessionInit Established session 0x13c211fa3350003 with negotiated timeout 3000 for client /127.0.0.1:58229
[junit4:junit4]   2> 17011 T728 oaz.ClientCnxn$SendThread.onConnected Session establishment complete on server localhost.localdomain/127.0.0.1:36154, sessionid = 0x13c211fa3350003, negotiated timeout = 3000
[junit4:junit4]   2> 17012 T729 oascc.ConnectionManager.process Watcher org.apache.solr.common.cloud.ConnectionManager@cd3ffa name:ZooKeeperConnection Watcher:127.0.0.1:36154/solr got event WatchedEvent state:SyncConnected type:None path:null path:null type:None
[junit4:junit4]   2> 17012 T729 oasc.DistributedQueue$LatchChildWatcher.process Watcher fired on path: null state: SyncConnected type None
[junit4:junit4]   2> 17013 T729 oascc.ZkStateReader$3.process Updating live nodes... (3)
[junit4:junit4]   2> 17014 T729 oascc.ZkStateReader$2.process A cluster state change: WatchedEvent state:SyncConnected type:NodeChildrenChanged path:/live_nodes, has occurred - updating... (live nodes size: 3)
[junit4:junit4]   2> 337053 T716 oasc.CoreContainer.shutdown Shutting down CoreContainer instance=24458669
[junit4:junit4]   2> 337053 T716 oasc.SolrCore.close [collection1]  CLOSING SolrCore org.apache.solr.core.SolrCore@11e8a97
[junit4:junit4]   2> 337063 T716 oasu.DirectUpdateHandler2.close closing DirectUpdateHandler2{commits=0,autocommits=0,soft autocommits=0,optimizes=0,rollbacks=0,expungeDeletes=0,docsPending=0,adds=0,deletesById=0,deletesByQuery=0,errors=0,cumulative_adds=0,cumulative_deletesById=0,cumulative_deletesByQuery=0,cumulative_errors=0}
[junit4:junit4]   2> 337064 T716 oasc.SolrCore.decrefSolrCoreState Closing SolrCoreState
[junit4:junit4]   2> 337064 T716 oasu.DefaultSolrCoreState.closeIndexWriter SolrCoreState ref count has reached 0 - closing IndexWriter
[junit4:junit4]   2> 337064 T716 oasu.DefaultSolrCoreState.closeIndexWriter closing IndexWriter with IndexWriterCloser
[junit4:junit4]   2> 337065 T716 oasc.SolrCore.closeSearcher [collection1] Closing main searcher on request.
[junit4:junit4]   2> 337065 T716 oasc.CachingDirectoryFactory.close Releasing directory:/mnt/ssd/jenkins/workspace/Lucene-Solr-trunk-Linux/solr/build/solr-core/test/J0/./solrtest-ClusterStateUpdateTest-1357765387058/data1/index
[junit4:junit4]   2> 337065 T716 oasc.CachingDirectoryFactory.close Closing directory when closing factory:/mnt/ssd/jenkins/workspace/Lucene-Solr-trunk-Linux/solr/build/solr-core/test/J0/./solrtest-ClusterStateUpdateTest-1357765387058/data1/index
[junit4:junit4]   2> 337066 T716 oasc.CachingDirectoryFactory.closeDirectory Closing directory:/mnt/ssd/jenkins/workspace/Lucene-Solr-trunk-Linux/solr/build/solr-core/test/J0/./solrtest-ClusterStateUpdateTest-1357765387058/data1/index
[junit4:junit4]   2> 337066 T716 oasc.CachingDirectoryFactory.close Closing directory when closing factory:/mnt/ssd/jenkins/workspace/Lucene-Solr-trunk-Linux/solr/build/solr-core/test/J0/./solrtest-ClusterStateUpdateTest-1357765387058/data1
[junit4:junit4]   2> 337066 T716 oasc.CachingDirectoryFactory.closeDirectory Closing directory:/mnt/ssd/jenkins/workspace/Lucene-Solr-trunk-Linux/solr/build/solr-core/test/J0/./solrtest-ClusterStateUpdateTest-1357765387058/data1
[junit4:junit4]   2> 337067 T721 oazs.PrepRequestProcessor.pRequest2Txn Processed session termination for sessionid: 0x13c211fa3350003
[junit4:junit4]   2> 337081 T716 oaz.ZooKeeper.close Session: 0x13c211fa3350003 closed
[junit4:junit4]   2> 337081 T718 oazs.NIOServerCnxn.closeSock Closed socket connection for client /127.0.0.1:58229 which had sessionid 0x13c211fa3350003
[junit4:junit4]   2> 337081 T716 oasc.CoreContainer.shutdown Shutting down CoreContainer instance=9643629
[junit4:junit4]   2> 337081 T721 oazs.PrepRequestProcessor.pRequest Got user-level KeeperException when processing sessionid:0x13c211fa3350009 type:delete cxid:0x1a zxid:0x81 txntype:-1 reqpath:n/a Error Path:/solr/overseer_elect/leader Error:KeeperErrorCode = NoNode for /solr/overseer_elect/leader
[junit4:junit4]   2> 337082 T716 oasc.SolrCore.close [collection1]  CLOSING SolrCore org.apache.solr.core.SolrCore@54f254
[junit4:junit4]   2> 337082 T752 oascc.ZkStateReader$3.process Updating live nodes... (2)
[junit4:junit4]   2> 337087 T716 oasu.DirectUpdateHandler2.close closing DirectUpdateHandler2{commits=0,autocommits=0,soft autocommits=0,optimizes=0,rollbacks=0,expungeDeletes=0,docsPending=0,adds=0,deletesById=0,deletesByQuery=0,errors=0,cumulative_adds=0,cumulative_deletesById=0,cumulative_deletesByQuery=0,cumulative_errors=0}
[junit4:junit4]   2> 337087 T716 oasc.SolrCore.decrefSolrCoreState Closing SolrCoreState
[junit4:junit4]   2> 337087 T716 oasu.DefaultSolrCoreState.closeIndexWriter SolrCoreState ref count has reached 0 - closing IndexWriter
[junit4:junit4]   2> 337087 T716 oasu.DefaultSolrCoreState.closeIndexWriter closing IndexWriter with IndexWriterCloser
[junit4:junit4]   2> 337088 T716 oasc.SolrCore.closeSearcher [collection1] Closing main searcher on request.
[junit4:junit4]   2> 337088 T716 oasc.CachingDirectoryFactory.close Releasing directory:/mnt/ssd/jenkins/workspace/Lucene-Solr-trunk-Linux/solr/build/solr-core/test/J0/./solrtest-ClusterStateUpdateTest-1357765387058/data2/index
[junit4:junit4]   2> 337088 T716 oasc.CachingDirectoryFactory.close Closing directory when closing factory:/mnt/ssd/jenkins/workspace/Lucene-Solr-trunk-Linux/solr/build/solr-core/test/J0/./solrtest-ClusterStateUpdateTest-1357765387058/data2/index
[junit4:junit4]   2> 337089 T716 oasc.CachingDirectoryFactory.closeDirectory Closing directory:/mnt/ssd/jenkins/workspace/Lucene-Solr-trunk-Linux/solr/build/solr-core/test/J0/./solrtest-ClusterStateUpdateTest-1357765387058/data2/index
[junit4:junit4]   2> 337089 T716 oasc.CachingDirectoryFactory.close Closing directory when closing factory:/mnt/ssd/jenkins/workspace/Lucene-Solr-trunk-Linux/solr/build/solr-core/test/J0/./solrtest-ClusterStateUpdateTest-1357765387058/data2
[junit4:junit4]   2> 337089 T716 oasc.CachingDirectoryFactory.closeDirectory Closing directory:/mnt/ssd/jenkins/workspace/Lucene-Solr-trunk-Linux/solr/build/solr-core/test/J0/./solrtest-ClusterStateUpdateTest-1357765387058/data2
[junit4:junit4]   2> 337090 T721 oazs.PrepRequestProcessor.pRequest2Txn Processed session termination for sessionid: 0x13c211fa3350009
[junit4:junit4]   2> 337101 T750 oascc.SolrZkClient.makePath makePath: /overseer_elect/leader
[junit4:junit4]   2> 337121 T718 oazs.NIOServerCnxn.closeSock Closed socket connection for client /127.0.0.1:58227 which had sessionid 0x13c211fa3350009
[junit4:junit4]   2> 337121 T716 oaz.ZooKeeper.close Session: 0x13c211fa3350009 closed
[junit4:junit4]   2> 337121 T716 oasc.CoreContainer.shutdown Shutting down CoreContainer instance=9993285
[junit4:junit4]   2> 337121 T752 oascc.ZkStateReader$3.process Updating live nodes... (1)
[junit4:junit4]   2> 337122 T716 oasc.SolrCore.close [collection1]  CLOSING SolrCore org.apache.solr.core.SolrCore@f5a785
[junit4:junit4]   2> 337122 T721 oazs.PrepRequestProcessor.pRequest Got user-level KeeperException when processing sessionid:0x13c211fa335000a type:delete cxid:0x1c zxid:0x83 txntype:-1 reqpath:n/a Error Path:/solr/overseer_elect/leader Error:KeeperErrorCode = NoNode for /solr/overseer_elect/leader
[junit4:junit4]   2> 337131 T716 oasu.DirectUpdateHandler2.close closing DirectUpdateHandler2{commits=0,autocommits=0,soft autocommits=0,optimizes=0,rollbacks=0,expungeDeletes=0,docsPending=0,adds=0,deletesById=0,deletesByQuery=0,errors=0,cumulative_adds=0,cumulative_deletesById=0,cumulative_deletesByQuery=0,cumulative_errors=0}
[junit4:junit4]   2> 337131 T716 oasc.SolrCore.decrefSolrCoreState Closing SolrCoreState
[junit4:junit4]   2> 337131 T716 oasu.DefaultSolrCoreState.closeIndexWriter SolrCoreState ref count has reached 0 - closing IndexWriter
[junit4:junit4]   2> 337131 T716 oasu.DefaultSolrCoreState.closeIndexWriter closing IndexWriter with IndexWriterCloser
[junit4:junit4]   2> 337132 T716 oasc.SolrCore.closeSearcher [collection1] Closing main searcher on request.
[junit4:junit4]   2> 337132 T716 oasc.CachingDirectoryFactory.close Releasing directory:/mnt/ssd/jenkins/workspace/Lucene-Solr-trunk-Linux/solr/build/solr-core/test/J0/./solrtest-ClusterStateUpdateTest-1357765387058/data3/index
[junit4:junit4]   2> 337133 T716 oasc.CachingDirectoryFactory.close Closing directory when closing factory:/mnt/ssd/jenkins/workspace/Lucene-Solr-trunk-Linux/solr/build/solr-core/test/J0/./solrtest-ClusterStateUpdateTest-1357765387058/data3/index
[junit4:junit4]   2> 337133 T716 oasc.CachingDirectoryFactory.closeDirectory Closing directory:/mnt/ssd/jenkins/workspace/Lucene-Solr-trunk-Linux/solr/build/solr-core/test/J0/./solrtest-ClusterStateUpdateTest-1357765387058/data3/index
[junit4:junit4]   2> 337133 T716 oasc.CachingDirectoryFactory.close Closing directory when closing factory:/mnt/ssd/jenkins/workspace/Lucene-Solr-trunk-Linux/solr/build/solr-core/test/J0/./solrtest-ClusterStateUpdateTest-1357765387058/data3
[junit4:junit4]   2> 337134 T716 oasc.CachingDirectoryFactory.closeDirectory Closing directory:/mnt/ssd/jenkins/workspace/Lucene-Solr-trunk-Linux/solr/build/solr-core/test/J0/./solrtest-ClusterStateUpdateTest-1357765387058/data3
[junit4:junit4]   2> 337135 T721 oazs.PrepRequestProcessor.pRequest2Txn Processed session termination for sessionid: 0x13c211fa335000a
[junit4:junit4]   2> 337140 T752 oascc.SolrZkClient.makePath makePath: /overseer_elect/leader
[junit4:junit4]   2> 337161 T718 oazs.NIOServerCnxn.closeSock Closed socket connection for client /127.0.0.1:58228 which had sessionid 0x13c211fa335000a
[junit4:junit4]   2> 337161 T716 oaz.ZooKeeper.close Session: 0x13c211fa335000a closed
[junit4:junit4]   2> 337161 T716 oazs.ZooKeeperServer.shutdown shutting down
[junit4:junit4]   2> 337161 T716 oazs.SessionTrackerImpl.shutdown Shutting down
[junit4:junit4]   2> 337162 T716 oazs.PrepRequestProcessor.shutdown Shutting down
[junit4:junit4]   2> 337162 T721 oazs.PrepRequestProcessor.run PrepRequestProcessor exited loop!
[junit4:junit4]   2> 337162 T716 oazs.SyncRequestProcessor.shutdown Shutting down
[junit4:junit4]   2> 337163 T720 oazs.SyncRequestProcessor.run SyncRequestProcessor exited!
[junit4:junit4]   2> 337163 T716 oazs.FinalRequestProcessor.shutdown shutdown of request processor complete
[junit4:junit4]   2> 337164 T716 oasc.ZkTestServer.send4LetterWord connecting to 127.0.0.1:36154 36154
[junit4:junit4]   2> 337164 T718 oazs.NIOServerCnxnFactory.run NIOServerCnxn factory exited run method
[junit4:junit4]   2> 337165 T716 oazs.ZooKeeperServer.shutdown shutting down
[junit4:junit4]   2> 337165 T716 oazs.SessionTrackerImpl.shutdown Shutting down
[junit4:junit4]   2> 337165 T716 oazs.PrepRequestProcessor.shutdown Shutting down
[junit4:junit4]   2> 337166 T716 oazs.SyncRequestProcessor.shutdown Shutting down
[junit4:junit4]   2> 337166 T716 oazs.FinalRequestProcessor.shutdown shutdown of request processor complete
[junit4:junit4]   2> 337166 T716 oas.SolrTestCaseJ4.tearDown ###Ending testCoreRegistration
[junit4:junit4]   1> client port:0.0.0.0/0.0.0.0:0
[junit4:junit4]   2> NOTE: reproduce with: ant test  -Dtestcase=ClusterStateUpdateTest -Dtests.method=testCoreRegistration -Dtests.seed=DC130EEEFAE7E940 -Dtests.multiplier=3 -Dtests.slow=true -Dtests.locale=sk_SK -Dtests.timezone=America/Thule -Dtests.file.encoding=UTF-8
[junit4:junit4] ERROR    337s J0 | ClusterStateUpdateTest.testCoreRegistration <<<
[junit4:junit4]    > Throwable #1: org.apache.solr.common.SolrException: Could not get shard_id for core: testcore coreNodeName:127.0.0.1:1661_solr_testcore
[junit4:junit4]    > 	at __randomizedtesting.SeedInfo.seed([DC130EEEFAE7E940:62986841839DE775]:0)
[junit4:junit4]    > 	at org.apache.solr.cloud.ZkController.doGetShardIdProcess(ZkController.java:1123)
[junit4:junit4]    > 	at org.apache.solr.cloud.ZkController.preRegister(ZkController.java:1181)
[junit4:junit4]    > 	at org.apache.solr.core.CoreContainer.registerCore(CoreContainer.java:841)
[junit4:junit4]    > 	at org.apache.solr.core.CoreContainer.register(CoreContainer.java:821)
[junit4:junit4]    > 	at org.apache.solr.core.CoreContainer.register(CoreContainer.java:923)
[junit4:junit4]    > 	at org.apache.solr.cloud.ClusterStateUpdateTest.testCoreRegistration(ClusterStateUpdateTest.java:162)
[junit4:junit4]    > 	at sun.reflect.NativeMethodAccessorImpl.invoke0(Native Method)
[junit4:junit4]    > 	at sun.reflect.NativeMethodAccessorImpl.invoke(NativeMethodAccessorImpl.java:39)
[junit4:junit4]    > 	at sun.reflect.DelegatingMethodAccessorImpl.invoke(DelegatingMethodAccessorImpl.java:25)
[junit4:junit4]    > 	at java.lang.reflect.Method.invoke(Method.java:597)
[junit4:junit4]    > 	at com.carrotsearch.randomizedtesting.RandomizedRunner.invoke(RandomizedRunner.java:1559)
[junit4:junit4]    > 	at com.carrotsearch.randomizedtesting.RandomizedRunner.access$600(RandomizedRunner.java:79)
[junit4:junit4]    > 	at com.carrotsearch.randomizedtesting.RandomizedRunner$6.evaluate(RandomizedRunner.java:737)
[junit4:junit4]    > 	at com.carrotsearch.randomizedtesting.RandomizedRunner$7.evaluate(RandomizedRunner.java:773)
[junit4:junit4]    > 	at com.carrotsearch.randomizedtesting.RandomizedRunner$8.evaluate(RandomizedRunner.java:787)
[junit4:junit4]    > 	at com.carrotsearch.randomizedtesting.rules.SystemPropertiesRestoreRule$1.evaluate(SystemPropertiesRestoreRule.java:53)
[junit4:junit4]    > 	at org.apache.lucene.util.TestRuleSetupTeardownChained$1.evaluate(TestRuleSetupTeardownChained.java:50)
[junit4:junit4]    > 	at org.apache.lucene.util.TestRuleFieldCacheSanity$1.evaluate(TestRuleFieldCacheSanity.java:51)
[junit4:junit4]    > 	at org.apache.lucene.util.AbstractBeforeAfterRule$1.evaluate(AbstractBeforeAfterRule.java:46)
[junit4:junit4]    > 	at com.carrotsearch.randomizedtesting.rules.SystemPropertiesInvariantRule$1.evaluate(SystemPropertiesInvariantRule.java:55)
[junit4:junit4]    > 	at org.apache.lucene.util.TestRuleThreadAndTestName$1.evaluate(TestRuleThreadAndTestName.java:49)
[junit4:junit4]    > 	at org.apache.lucene.util.TestRuleIgnoreAfterMaxFailures$1.evaluate(TestRuleIgnoreAfterMaxFailures.java:70)
[junit4:junit4]    > 	at org.apache.lucene.util.TestRuleMarkFailure$1.evaluate(TestRuleMarkFailure.java:48)
[junit4:junit4]    > 	at com.carrotsearch.randomizedtesting.rules.StatementAdapter.evaluate(StatementAdapter.java:36)
[junit4:junit4]    > 	at com.carrotsearch.randomizedtesting.ThreadLeakControl$StatementRunner.run(ThreadLeakControl.java:358)
[junit4:junit4]    > 	at com.carrotsearch.randomizedtesting.ThreadLeakControl.forkTimeoutingTask(ThreadLeakControl.java:782)
[junit4:junit4]    > 	at com.carrotsearch.randomizedtesting.ThreadLeakControl$3.evaluate(ThreadLeakControl.java:442)
[junit4:junit4]    > 	at com.carrotsearch.randomizedtesting.RandomizedRunner.runSingleTest(RandomizedRunner.java:746)
[junit4:junit4]    > 	at com.carrotsearch.randomizedtesting.RandomizedRunner$3.evaluate(RandomizedRunner.java:648)
[junit4:junit4]    > 	at com.carrotsearch.randomizedtesting.RandomizedRunner$4.evaluate(RandomizedRunner.java:682)
[junit4:junit4]    > 	at com.carrotsearch.randomizedtesting.RandomizedRunner$5.evaluate(RandomizedRunner.java:693)
[junit4:junit4]    > 	at com.carrotsearch.randomizedtesting.rules.StatementAdapter.evaluate(StatementAdapter.java:36)
[junit4:junit4]    > 	at com.carrotsearch.randomizedtesting.rules.SystemPropertiesRestoreRule$1.evaluate(SystemPropertiesRestoreRule.java:53)
[junit4:junit4]    > 	at org.apache.lucene.util.AbstractBeforeAfterRule$1.evaluate(AbstractBeforeAfterRule.java:46)
[junit4:junit4]    > 	at org.apache.lucene.util.TestRuleStoreClassName$1.evaluate(TestRuleStoreClassName.java:42)
[junit4:junit4]    > 	at com.carrotsearch.randomizedtesting.rules.SystemPropertiesInvariantRule$1.evaluate(SystemPropertiesInvariantRule.java:55)
[junit4:junit4]    > 	at com.carrotsearch.randomizedtesting.rules.NoShadowingOrOverridesOnMethodsRule$1.evaluate(NoShadowingOrOverridesOnMethodsRule.java:39)
[junit4:junit4]    > 	at com.carrotsearch.randomizedtesting.rules.NoShadowingOrOverridesOnMethodsRule$1.evaluate(NoShadowingOrOverridesOnMethodsRule.java:39)
[junit4:junit4]    > 	at com.carrotsearch.randomizedtesting.rules.StatementAdapter.evaluate(StatementAdapter.java:36)
[junit4:junit4]    > 	at org.apache.lucene.util.TestRuleAssertionsRequired$1.evaluate(TestRuleAssertionsRequired.java:43)
[junit4:junit4]    > 	at org.apache.lucene.util.TestRuleMarkFailure$1.evaluate(TestRuleMarkFailure.java:48)
[junit4:junit4]    > 	at org.apache.lucene.util.TestRuleIgnoreAfterMaxFailures$1.evaluate(TestRuleIgnoreAfterMaxFailures.java:70)
[junit4:junit4]    > 	at org.apache.lucene.util.TestRuleIgnoreTestSuites$1.evaluate(TestRuleIgnoreTestSuites.java:55)
[junit4:junit4]    > 	at com.carrotsearch.randomizedtesting.rules.StatementAdapter.evaluate(StatementAdapter.java:36)
[junit4:junit4]    > 	at com.carrotsearch.randomizedtesting.ThreadLeakControl$StatementRunner.run(ThreadLeakControl.java:358)
[junit4:junit4]    > 	at java.lang.Thread.run(Thread.java:662)
[junit4:junit4]   2> 337174 T716 oas.SolrTestCaseJ4.deleteCore ###deleteCore
[junit4:junit4]   2> 337944 T719 oazs.SessionTrackerImpl.run SessionTrackerImpl exited loop!
[junit4:junit4]   2> 338381 T729 oascc.ZkStateReader$3.process WARNING ZooKeeper watch triggered, but Solr cannot talk to ZK
[junit4:junit4]   2> 338381 T729 oascc.ZkStateReader$2.process A cluster state change: WatchedEvent state:SyncConnected type:NodeChildrenChanged path:/live_nodes, has occurred - updating... (live nodes size: 3)
[junit4:junit4]   2> 338382 T729 oascc.ZkStateReader$2.process WARNING ZooKeeper watch triggered, but Solr cannot talk to ZK
[junit4:junit4]   2> 338382 T729 oaz.ClientCnxn$EventThread.run EventThread shut down
[junit4:junit4]   2> 338401 T750 oasc.LeaderElector$1.process WARNING  org.apache.zookeeper.KeeperException$ConnectionLossException: KeeperErrorCode = ConnectionLoss for /overseer_elect
[junit4:junit4]   2> 	at org.apache.zookeeper.KeeperException.create(KeeperException.java:99)
[junit4:junit4]   2> 	at org.apache.zookeeper.KeeperException.create(KeeperException.java:51)
[junit4:junit4]   2> 	at org.apache.zookeeper.ZooKeeper.exists(ZooKeeper.java:1041)
[junit4:junit4]   2> 	at org.apache.solr.common.cloud.SolrZkClient$3.execute(SolrZkClient.java:185)
[junit4:junit4]   2> 	at org.apache.solr.common.cloud.SolrZkClient$3.execute(SolrZkClient.java:182)
[junit4:junit4]   2> 	at org.apache.solr.common.cloud.ZkCmdExecutor.retryOperation(ZkCmdExecutor.java:65)
[junit4:junit4]   2> 	at org.apache.solr.common.cloud.SolrZkClient.exists(SolrZkClient.java:182)
[junit4:junit4]   2> 	at org.apache.solr.common.cloud.SolrZkClient.makePath(SolrZkClient.java:393)
[junit4:junit4]   2> 	at org.apache.solr.common.cloud.SolrZkClient.makePath(SolrZkClient.java:362)
[junit4:junit4]   2> 	at org.apache.solr.common.cloud.SolrZkClient.makePath(SolrZkClient.java:349)
[junit4:junit4]   2> 	at org.apache.solr.cloud.OverseerElectionContext.runLeaderProcess(ElectionContext.java:403)
[junit4:junit4]   2> 	at org.apache.solr.cloud.LeaderElector.runIamLeaderProcess(LeaderElector.java:156)
[junit4:junit4]   2> 	at org.apache.solr.cloud.LeaderElector.checkIfIamLeader(LeaderElector.java:100)
[junit4:junit4]   2> 	at org.apache.solr.cloud.LeaderElector.access$000(LeaderElector.java:55)
[junit4:junit4]   2> 	at org.apache.solr.cloud.LeaderElector$1.process(LeaderElector.java:129)
[junit4:junit4]   2> 	at org.apache.zookeeper.ClientCnxn$EventThread.processEvent(ClientCnxn.java:519)
[junit4:junit4]   2> 	at org.apache.zookeeper.ClientCnxn$EventThread.run(ClientCnxn.java:495)
[junit4:junit4]   2> 
[junit4:junit4]   2> 338402 T750 oasc.LeaderElector$1.process WARNING  org.apache.zookeeper.KeeperException$SessionExpiredException: KeeperErrorCode = Session expired for /collections/collection1/leader_elect/shard1/election
[junit4:junit4]   2> 	at org.apache.zookeeper.KeeperException.create(KeeperException.java:127)
[junit4:junit4]   2> 	at org.apache.zookeeper.KeeperException.create(KeeperException.java:51)
[junit4:junit4]   2> 	at org.apache.zookeeper.ZooKeeper.getChildren(ZooKeeper.java:1468)
[junit4:junit4]   2> 	at org.apache.solr.common.cloud.SolrZkClient$6.execute(SolrZkClient.java:236)
[junit4:junit4]   2> 	at org.apache.solr.common.cloud.SolrZkClient$6.execute(SolrZkClient.java:233)
[junit4:junit4]   2> 	at org.apache.solr.common.cloud.ZkCmdExecutor.retryOperation(ZkCmdExecutor.java:65)
[junit4:junit4]   2> 	at org.apache.solr.common.cloud.SolrZkClient.getChildren(SolrZkClient.java:233)
[junit4:junit4]   2> 	at org.apache.solr.cloud.LeaderElector.checkIfIamLeader(LeaderElector.java:84)
[junit4:junit4]   2> 	at org.apache.solr.cloud.LeaderElector.access$000(LeaderElector.java:55)
[junit4:junit4]   2> 	at org.apache.solr.cloud.LeaderElector$1.process(LeaderElector.java:129)
[junit4:junit4]   2> 	at org.apache.zookeeper.ClientCnxn$EventThread.processEvent(ClientCnxn.java:519)
[junit4:junit4]   2> 	at org.apache.zookeeper.ClientCnxn$EventThread.run(ClientCnxn.java:495)
[junit4:junit4]   2> 
[junit4:junit4]   2> 338402 T750 oascc.ZkStateReader$3.process WARNING ZooKeeper watch triggered, but Solr cannot talk to ZK
[junit4:junit4]   2> 338402 T750 oaz.ClientCnxn$EventThread.run EventThread shut down
[junit4:junit4]   2> 338441 T752 oasc.LeaderElector$1.process WARNING  org.apache.zookeeper.KeeperException$ConnectionLossException: KeeperErrorCode = ConnectionLoss for /overseer_elect
[junit4:junit4]   2> 	at org.apache.zookeeper.KeeperException.create(KeeperException.java:99)
[junit4:junit4]   2> 	at org.apache.zookeeper.KeeperException.create(KeeperException.java:51)
[junit4:junit4]   2> 	at org.apache.zookeeper.ZooKeeper.exists(ZooKeeper.java:1041)
[junit4:junit4]   2> 	at org.apache.solr.common.cloud.SolrZkClient$3.execute(SolrZkClient.java:185)
[junit4:junit4]   2> 	at org.apache.solr.common.cloud.SolrZkClient$3.execute(SolrZkClient.java:182)
[junit4:junit4]   2> 	at org.apache.solr.common.cloud.ZkCmdExecutor.retryOperation(ZkCmdExecutor.java:65)
[junit4:junit4]   2> 	at org.apache.solr.common.cloud.SolrZkClient.exists(SolrZkClient.java:182)
[junit4:junit4]   2> 	at org.apache.solr.common.cloud.SolrZkClient.makePath(SolrZkClient.java:393)
[junit4:junit4]   2> 	at org.apache.solr.common.cloud.SolrZkClient.makePath(SolrZkClient.java:362)
[junit4:junit4]   2> 	at org.apache.solr.common.cloud.SolrZkClient.makePath(SolrZkClient.java:349)
[junit4:junit4]   2> 	at org.apache.solr.cloud.OverseerElectionContext.runLeaderProcess(ElectionContext.java:403)
[junit4:junit4]   2> 	at org.apache.solr.cloud.LeaderElector.runIamLeaderProcess(LeaderElector.java:156)
[junit4:junit4]   2> 	at org.apache.solr.cloud.LeaderElector.checkIfIamLeader(LeaderElector.java:100)
[junit4:junit4]   2> 	at org.apache.solr.cloud.LeaderElector.access$000(LeaderElector.java:55)
[junit4:junit4]   2> 	at org.apache.solr.cloud.LeaderElector$1.process(LeaderElector.java:129)
[junit4:junit4]   2> 	at org.apache.zookeeper.ClientCnxn$EventThread.processEvent(ClientCnxn.java:519)
[junit4:junit4]   2> 	at org.apache.zookeeper.ClientCnxn$EventThread.run(ClientCnxn.java:495)
[junit4:junit4]   2> 
[junit4:junit4]   2> 338441 T752 oasc.LeaderElector$1.process WARNING  org.apache.zookeeper.KeeperException$SessionExpiredException: KeeperErrorCode = Session expired for /collections/collection1/leader_elect/shard1/election
[junit4:junit4]   2> 	at org.apache.zookeeper.KeeperException.create(KeeperException.java:127)
[junit4:junit4]   2> 	at org.apache.zookeeper.KeeperException.create(KeeperException.java:51)
[junit4:junit4]   2> 	at org.apache.zookeeper.ZooKeeper.getChildren(ZooKeeper.java:1468)
[junit4:junit4]   2> 	at org.apache.solr.common.cloud.SolrZkClient$6.execute(SolrZkClient.java:236)
[junit4:junit4]   2> 	at org.apache.solr.common.cloud.SolrZkClient$6.execute(SolrZkClient.java:233)
[junit4:junit4]   2> 	at org.apache.solr.common.cloud.ZkCmdExecutor.retryOperation(ZkCmdExecutor.java:65)
[junit4:junit4]   2> 	at org.apache.solr.common.cloud.SolrZkClient.getChildren(SolrZkClient.java:233)
[junit4:junit4]   2> 	at org.apache.solr.cloud.LeaderElector.checkIfIamLeader(LeaderElector.java:84)
[junit4:junit4]   2> 	at org.apache.solr.cloud.LeaderElector.access$000(LeaderElector.java:55)
[junit4:junit4]   2> 	at org.apache.solr.cloud.LeaderElector$1.process(LeaderElector.java:129)
[junit4:junit4]   2> 	at org.apache.zookeeper.ClientCnxn$EventThread.processEvent(ClientCnxn.java:519)
[junit4:junit4]   2> 	at org.apache.zookeeper.ClientCnxn$EventThread.run(ClientCnxn.java:495)
[junit4:junit4]   2> 
[junit4:junit4]   2> 338442 T752 oascc.ZkStateReader$3.process WARNING ZooKeeper watch triggered, but Solr cannot talk to ZK
[junit4:junit4]   2> 338442 T752 oaz.ClientCnxn$EventThread.run EventThread shut down
[junit4:junit4]   2> 458197 T716 oas.SolrTestCaseJ4.endTrackingSearchers SEVERE ERROR: SolrIndexSearcher opens=4 closes=3
[junit4:junit4]   2> 458200 T715 ccr.ThreadLeakControl.checkThreadLeaks WARNING Will linger awaiting termination of 1 leaked thread(s).
[junit4:junit4]   2> 478254 T715 ccr.ThreadLeakControl.checkThreadLeaks SEVERE 1 thread leaked from SUITE scope at org.apache.solr.cloud.ClusterStateUpdateTest: 
[junit4:junit4]   2> 	   1) Thread[id=748, name=searcherExecutor-284-thread-1, state=WAITING, group=TGRP-ClusterStateUpdateTest]
[junit4:junit4]   2> 	        at sun.misc.Unsafe.park(Native Method)
[junit4:junit4]   2> 	        at java.util.concurrent.locks.LockSupport.park(LockSupport.java:156)
[junit4:junit4]   2> 	        at java.util.concurrent.locks.AbstractQueuedSynchronizer$ConditionObject.await(AbstractQueuedSynchronizer.java:1987)
[junit4:junit4]   2> 	        at java.util.concurrent.LinkedBlockingQueue.take(LinkedBlockingQueue.java:399)
[junit4:junit4]   2> 	        at java.util.concurrent.ThreadPoolExecutor.getTask(ThreadPoolExecutor.java:947)
[junit4:junit4]   2> 	        at java.util.concurrent.ThreadPoolExecutor$Worker.run(ThreadPoolExecutor.java:907)
[junit4:junit4]   2> 	        at java.lang.Thread.run(Thread.java:662)
[junit4:junit4]   2> 478254 T715 ccr.ThreadLeakControl.tryToInterruptAll Starting to interrupt leaked threads:
[junit4:junit4]   2> 	   1) Thread[id=748, name=searcherExecutor-284-thread-1, state=WAITING, group=TGRP-ClusterStateUpdateTest]
[junit4:junit4]   2> 481256 T715 ccr.ThreadLeakControl.tryToInterruptAll SEVERE There are still zombie threads that couldn't be terminated:
[junit4:junit4]   2> 	   1) Thread[id=748, name=searcherExecutor-284-thread-1, state=WAITING, group=TGRP-ClusterStateUpdateTest]
[junit4:junit4]   2> 	        at sun.misc.Unsafe.park(Native Method)
[junit4:junit4]   2> 	        at java.util.concurrent.locks.LockSupport.park(LockSupport.java:156)
[junit4:junit4]   2> 	        at java.util.concurrent.locks.AbstractQueuedSynchronizer$ConditionObject.await(AbstractQueuedSynchronizer.java:1987)
[junit4:junit4]   2> 	        at java.util.concurrent.LinkedBlockingQueue.take(LinkedBlockingQueue.java:399)
[junit4:junit4]   2> 	        at java.util.concurrent.ThreadPoolExecutor.getTask(ThreadPoolExecutor.java:947)
[junit4:junit4]   2> 	        at java.util.concurrent.ThreadPoolExecutor$Worker.run(ThreadPoolExecutor.java:907)
[junit4:junit4]   2> 	        at java.lang.Thread.run(Thread.java:662)
[junit4:junit4]   2> NOTE: test params are: codec=HighCompressionCompressingStoredFields(storedFieldsFormat=CompressingStoredFieldsFormat(compressionMode=HIGH_COMPRESSION, chunkSize=269)), sim=DefaultSimilarity, locale=sk_SK, timezone=America/Thule
[junit4:junit4]   2> NOTE: Linux 3.2.0-35-generic i386/Sun Microsystems Inc. 1.6.0_38 (32-bit)/cpus=8,threads=2,free=33497872,total=95203328
[junit4:junit4]   2> NOTE: All tests run in this JVM: [HighlighterConfigTest, DistributedTermsComponentTest, LoggingHandlerTest, ShardRoutingTest, DirectUpdateHandlerOptimizeTest, ExternalFileFieldSortTest, TestFiltering, DirectSolrConnectionTest, TestRandomFaceting, ScriptEngineTest, SystemInfoHandlerTest, TestExtendedDismaxParser, NoCacheHeaderTest, TestComponentsName, CoreAdminHandlerTest, PluginInfoTest, TestAtomicUpdateErrorCases, TestElisionMultitermQuery, TestQuerySenderNoQuery, CoreContainerCoreInitFailuresTest, ChaosMonkeySafeLeaderTest, ResponseLogComponentTest, CSVRequestHandlerTest, TestNumberUtils, TestCollationField, RequestHandlersTest, ChaosMonkeyNothingIsSafeTest, TestLFUCache, ClusterStateUpdateTest]
[junit4:junit4]   2> NOTE: reproduce with: ant test  -Dtestcase=ClusterStateUpdateTest -Dtests.seed=DC130EEEFAE7E940 -Dtests.multiplier=3 -Dtests.slow=true -Dtests.locale=sk_SK -Dtests.timezone=America/Thule -Dtests.file.encoding=UTF-8
[junit4:junit4] ERROR   0.00s J0 | ClusterStateUpdateTest (suite) <<<
[junit4:junit4]    > Throwable #1: java.lang.AssertionError: ERROR: SolrIndexSearcher opens=4 closes=3
[junit4:junit4]    > 	at __randomizedtesting.SeedInfo.seed([DC130EEEFAE7E940]:0)
[junit4:junit4]    > 	at org.junit.Assert.fail(Assert.java:93)
[junit4:junit4]    > 	at org.apache.solr.SolrTestCaseJ4.endTrackingSearchers(SolrTestCaseJ4.java:246)
[junit4:junit4]    > 	at org.apache.solr.SolrTestCaseJ4.afterClass(SolrTestCaseJ4.java:97)
[junit4:junit4]    > 	at sun.reflect.NativeMethodAccessorImpl.invoke0(Native Method)
[junit4:junit4]    > 	at sun.reflect.NativeMethodAccessorImpl.invoke(NativeMethodAccessorImpl.java:39)
[junit4:junit4]    > 	at sun.reflect.DelegatingMethodAccessorImpl.invoke(DelegatingMethodAccessorImpl.java:25)
[junit4:junit4]    > 	at java.lang.reflect.Method.invoke(Method.java:597)
[junit4:junit4]    > 	at com.carrotsearch.randomizedtesting.RandomizedRunner.invoke(RandomizedRunner.java:1559)
[junit4:junit4]    > 	at com.carrotsearch.randomizedtesting.RandomizedRunner.access$600(RandomizedRunner.java:79)
[junit4:junit4]    > 	at com.carrotsearch.randomizedtesting.RandomizedRunner$5.evaluate(RandomizedRunner.java:700)
[junit4:junit4]    > 	at com.carrotsearch.randomizedtesting.rules.StatementAdapter.evaluate(StatementAdapter.java:36)
[junit4:junit4]    > 	at com.carrotsearch.randomizedtesting.rules.SystemPropertiesRestoreRule$1.evaluate(SystemPropertiesRestoreRule.java:53)
[junit4:junit4]    > 	at org.apache.lucene.util.AbstractBeforeAfterRule$1.evaluate(AbstractBeforeAfterRule.java:46)
[junit4:junit4]    > 	at org.apache.lucene.util.TestRuleStoreClassName$1.evaluate(TestRuleStoreClassName.java:42)
[junit4:junit4]    > 	at com.carrotsearch.randomizedtesting.rules.SystemPropertiesInvariantRule$1.evaluate(SystemPropertiesInvariantRule.java:55)
[junit4:junit4]    > 	at com.carrotsearch.randomizedtesting.rules.NoShadowingOrOverridesOnMethodsRule$1.evaluate(NoShadowingOrOverridesOnMethodsRule.java:39)
[junit4:junit4]    > 	at com.carrotsearch.randomizedtesting.rules.NoShadowingOrOverridesOnMethodsRule$1.evaluate(NoShadowingOrOverridesOnMethodsRule.java:39)
[junit4:junit4]    > 	at com.carrotsearch.randomizedtesting.rules.StatementAdapter.evaluate(StatementAdapter.java:36)
[junit4:junit4]    > 	at org.apache.lucene.util.TestRuleAssertionsRequired$1.evaluate(TestRuleAssertionsRequired.java:43)
[junit4:junit4]    > 	at org.apache.lucene.util.TestRuleMarkFailure$1.evaluate(TestRuleMarkFailure.java:48)
[junit4:junit4]    > 	at org.apache.lucene.util.TestRuleIgnoreAfterMaxFailures$1.evaluate(TestRuleIgnoreAfterMaxFailures.java:70)
[junit4:junit4]    > 	at org.apache.lucene.util.TestRuleIgnoreTestSuites$1.evaluate(TestRuleIgnoreTestSuites.java:55)
[junit4:junit4]    > 	at com.carrotsearch.randomizedtesting.rules.StatementAdapter.evaluate(StatementAdapter.java:36)
[junit4:junit4]    > 	at com.carrotsearch.randomizedtesting.ThreadLeakControl$StatementRunner.run(ThreadLeakControl.java:358)
[junit4:junit4]    > 	at java.lang.Thread.run(Thread.java:662)
[junit4:junit4]    > Throwable #2: com.carrotsearch.randomizedtesting.ThreadLeakError: 1 thread leaked from SUITE scope at org.apache.solr.cloud.ClusterStateUpdateTest: 
[junit4:junit4]    >    1) Thread[id=748, name=searcherExecutor-284-thread-1, state=WAITING, group=TGRP-ClusterStateUpdateTest]
[junit4:junit4]    >         at sun.misc.Unsafe.park(Native Method)
[junit4:junit4]    >         at java.util.concurrent.locks.LockSupport.park(LockSupport.java:156)
[junit4:junit4]    >         at java.util.concurrent.locks.AbstractQueuedSynchronizer$ConditionObject.await(AbstractQueuedSynchronizer.java:1987)
[junit4:junit4]    >         at java.util.concurrent.LinkedBlockingQueue.take(LinkedBlockingQueue.java:399)
[junit4:junit4]    >         at java.util.concurrent.ThreadPoolExecutor.getTask(ThreadPoolExecutor.java:947)
[junit4:junit4]    >         at java.util.concurrent.ThreadPoolExecutor$Worker.run(ThreadPoolExecutor.java:907)
[junit4:junit4]    >         at java.lang.Thread.run(Thread.java:662)
[junit4:junit4]    > 	at __randomizedtesting.SeedInfo.seed([DC130EEEFAE7E940]:0)
[junit4:junit4]    > Throwable #3: com.carrotsearch.randomizedtesting.ThreadLeakError: There are still zombie threads that couldn't be terminated:
[junit4:junit4]    >    1) Thread[id=748, name=searcherExecutor-284-thread-1, state=WAITING, group=TGRP-ClusterStateUpdateTest]
[junit4:junit4]    >         at sun.misc.Unsafe.park(Native Method)
[junit4:junit4]    >         at java.util.concurrent.locks.LockSupport.park(LockSupport.java:156)
[junit4:junit4]    >         at java.util.concurrent.locks.AbstractQueuedSynchronizer$ConditionObject.await(AbstractQueuedSynchronizer.java:1987)
[junit4:junit4]    >         at java.util.concurrent.LinkedBlockingQueue.take(LinkedBlockingQueue.java:399)
[junit4:junit4]    >         at java.util.concurrent.ThreadPoolExecutor.getTask(ThreadPoolExecutor.java:947)
[junit4:junit4]    >         at java.util.concurrent.ThreadPoolExecutor$Worker.run(ThreadPoolExecutor.java:907)
[junit4:junit4]    >         at java.lang.Thread.run(Thread.java:662)
[junit4:junit4]    > 	at __randomizedtesting.SeedInfo.seed([DC130EEEFAE7E940]:0)
[junit4:junit4] Completed on J0 in 481.29s, 1 test, 1 failure, 3 errors <<< FAILURES!

[...truncated 464 lines...]
BUILD FAILED
/mnt/ssd/jenkins/workspace/Lucene-Solr-trunk-Linux/build.xml:353: The following error occurred while executing this line:
/mnt/ssd/jenkins/workspace/Lucene-Solr-trunk-Linux/build.xml:39: The following error occurred while executing this line:
/mnt/ssd/jenkins/workspace/Lucene-Solr-trunk-Linux/solr/build.xml:178: The following error occurred while executing this line:
/mnt/ssd/jenkins/workspace/Lucene-Solr-trunk-Linux/solr/common-build.xml:428: The following error occurred while executing this line:
/mnt/ssd/jenkins/workspace/Lucene-Solr-trunk-Linux/lucene/common-build.xml:1176: The following error occurred while executing this line:
/mnt/ssd/jenkins/workspace/Lucene-Solr-trunk-Linux/lucene/common-build.xml:841: There were test failures: 246 suites, 1029 tests, 3 suite-level errors, 1 error, 640 ignored (4 assumptions)

Total time: 29 minutes 57 seconds
Build step 'Invoke Ant' marked build as failure
Archiving artifacts
Recording test results
Description set: Java: 32bit/jdk1.6.0_38 -client -XX:+UseSerialGC
Email was triggered for: Failure
Sending email for trigger: Failure



Mime
View raw message