lucene-dev mailing list archives

Site index · List index
Message view « Date » · « Thread »
Top « Date » · « Thread »
From Apache Jenkins Server <jenk...@builds.apache.org>
Subject [JENKINS] Lucene-Solr-Tests-4.x-Java6 - Build # 1140 - Failure
Date Wed, 19 Dec 2012 13:23:24 GMT
Build: https://builds.apache.org/job/Lucene-Solr-Tests-4.x-Java6/1140/

2 tests failed.
REGRESSION:  org.apache.solr.cloud.SyncSliceTest.testDistribSearch

Error Message:


Stack Trace:
java.lang.AssertionError
	at __randomizedtesting.SeedInfo.seed([D9AE348A908796F4:5848BA92E7D8F6C8]:0)
	at org.junit.Assert.fail(Assert.java:92)
	at org.junit.Assert.assertTrue(Assert.java:43)
	at org.junit.Assert.assertNotNull(Assert.java:526)
	at org.junit.Assert.assertNotNull(Assert.java:537)
	at org.apache.solr.cloud.SyncSliceTest.doTest(SyncSliceTest.java:211)
	at org.apache.solr.BaseDistributedSearchTestCase.testDistribSearch(BaseDistributedSearchTestCase.java:794)
	at sun.reflect.NativeMethodAccessorImpl.invoke0(Native Method)
	at sun.reflect.NativeMethodAccessorImpl.invoke(NativeMethodAccessorImpl.java:57)
	at sun.reflect.DelegatingMethodAccessorImpl.invoke(DelegatingMethodAccessorImpl.java:43)
	at java.lang.reflect.Method.invoke(Method.java:616)
	at com.carrotsearch.randomizedtesting.RandomizedRunner.invoke(RandomizedRunner.java:1559)
	at com.carrotsearch.randomizedtesting.RandomizedRunner.access$600(RandomizedRunner.java:79)
	at com.carrotsearch.randomizedtesting.RandomizedRunner$6.evaluate(RandomizedRunner.java:737)
	at com.carrotsearch.randomizedtesting.RandomizedRunner$7.evaluate(RandomizedRunner.java:773)
	at com.carrotsearch.randomizedtesting.RandomizedRunner$8.evaluate(RandomizedRunner.java:787)
	at com.carrotsearch.randomizedtesting.rules.SystemPropertiesRestoreRule$1.evaluate(SystemPropertiesRestoreRule.java:53)
	at org.apache.lucene.util.TestRuleSetupTeardownChained$1.evaluate(TestRuleSetupTeardownChained.java:50)
	at org.apache.lucene.util.TestRuleFieldCacheSanity$1.evaluate(TestRuleFieldCacheSanity.java:51)
	at org.apache.lucene.util.AbstractBeforeAfterRule$1.evaluate(AbstractBeforeAfterRule.java:46)
	at com.carrotsearch.randomizedtesting.rules.SystemPropertiesInvariantRule$1.evaluate(SystemPropertiesInvariantRule.java:55)
	at org.apache.lucene.util.TestRuleThreadAndTestName$1.evaluate(TestRuleThreadAndTestName.java:49)
	at org.apache.lucene.util.TestRuleIgnoreAfterMaxFailures$1.evaluate(TestRuleIgnoreAfterMaxFailures.java:70)
	at org.apache.lucene.util.TestRuleMarkFailure$1.evaluate(TestRuleMarkFailure.java:48)
	at com.carrotsearch.randomizedtesting.rules.StatementAdapter.evaluate(StatementAdapter.java:36)
	at com.carrotsearch.randomizedtesting.ThreadLeakControl$StatementRunner.run(ThreadLeakControl.java:358)
	at com.carrotsearch.randomizedtesting.ThreadLeakControl.forkTimeoutingTask(ThreadLeakControl.java:782)
	at com.carrotsearch.randomizedtesting.ThreadLeakControl$3.evaluate(ThreadLeakControl.java:442)
	at com.carrotsearch.randomizedtesting.RandomizedRunner.runSingleTest(RandomizedRunner.java:746)
	at com.carrotsearch.randomizedtesting.RandomizedRunner$3.evaluate(RandomizedRunner.java:648)
	at com.carrotsearch.randomizedtesting.RandomizedRunner$4.evaluate(RandomizedRunner.java:682)
	at com.carrotsearch.randomizedtesting.RandomizedRunner$5.evaluate(RandomizedRunner.java:693)
	at com.carrotsearch.randomizedtesting.rules.StatementAdapter.evaluate(StatementAdapter.java:36)
	at com.carrotsearch.randomizedtesting.rules.SystemPropertiesRestoreRule$1.evaluate(SystemPropertiesRestoreRule.java:53)
	at org.apache.lucene.util.AbstractBeforeAfterRule$1.evaluate(AbstractBeforeAfterRule.java:46)
	at org.apache.lucene.util.TestRuleStoreClassName$1.evaluate(TestRuleStoreClassName.java:42)
	at com.carrotsearch.randomizedtesting.rules.SystemPropertiesInvariantRule$1.evaluate(SystemPropertiesInvariantRule.java:55)
	at com.carrotsearch.randomizedtesting.rules.NoShadowingOrOverridesOnMethodsRule$1.evaluate(NoShadowingOrOverridesOnMethodsRule.java:39)
	at com.carrotsearch.randomizedtesting.rules.NoShadowingOrOverridesOnMethodsRule$1.evaluate(NoShadowingOrOverridesOnMethodsRule.java:39)
	at com.carrotsearch.randomizedtesting.rules.StatementAdapter.evaluate(StatementAdapter.java:36)
	at org.apache.lucene.util.TestRuleAssertionsRequired$1.evaluate(TestRuleAssertionsRequired.java:43)
	at org.apache.lucene.util.TestRuleMarkFailure$1.evaluate(TestRuleMarkFailure.java:48)
	at org.apache.lucene.util.TestRuleIgnoreAfterMaxFailures$1.evaluate(TestRuleIgnoreAfterMaxFailures.java:70)
	at org.apache.lucene.util.TestRuleIgnoreTestSuites$1.evaluate(TestRuleIgnoreTestSuites.java:55)
	at com.carrotsearch.randomizedtesting.rules.StatementAdapter.evaluate(StatementAdapter.java:36)
	at com.carrotsearch.randomizedtesting.ThreadLeakControl$StatementRunner.run(ThreadLeakControl.java:358)
	at java.lang.Thread.run(Thread.java:679)


REGRESSION:  org.apache.solr.handler.component.DistributedMLTComponentTest.testDistribSearch

Error Message:
Server at http://127.0.0.1:19246/fw_g/xc returned non ok status:500, message:Server Error

Stack Trace:
org.apache.solr.common.SolrException: Server at http://127.0.0.1:19246/fw_g/xc returned non ok status:500, message:Server Error
	at __randomizedtesting.SeedInfo.seed([D9AE348A908796F4:5848BA92E7D8F6C8]:0)
	at org.apache.solr.client.solrj.impl.HttpSolrServer.request(HttpSolrServer.java:372)
	at org.apache.solr.client.solrj.impl.HttpSolrServer.request(HttpSolrServer.java:181)
	at org.apache.solr.client.solrj.request.QueryRequest.process(QueryRequest.java:90)
	at org.apache.solr.client.solrj.SolrServer.query(SolrServer.java:301)
	at org.apache.solr.BaseDistributedSearchTestCase.queryServer(BaseDistributedSearchTestCase.java:470)
	at org.apache.solr.BaseDistributedSearchTestCase.query(BaseDistributedSearchTestCase.java:493)
	at org.apache.solr.BaseDistributedSearchTestCase.query(BaseDistributedSearchTestCase.java:475)
	at org.apache.solr.handler.component.DistributedMLTComponentTest.doTest(DistributedMLTComponentTest.java:119)
	at org.apache.solr.BaseDistributedSearchTestCase.testDistribSearch(BaseDistributedSearchTestCase.java:794)
	at sun.reflect.NativeMethodAccessorImpl.invoke0(Native Method)
	at sun.reflect.NativeMethodAccessorImpl.invoke(NativeMethodAccessorImpl.java:57)
	at sun.reflect.DelegatingMethodAccessorImpl.invoke(DelegatingMethodAccessorImpl.java:43)
	at java.lang.reflect.Method.invoke(Method.java:616)
	at com.carrotsearch.randomizedtesting.RandomizedRunner.invoke(RandomizedRunner.java:1559)
	at com.carrotsearch.randomizedtesting.RandomizedRunner.access$600(RandomizedRunner.java:79)
	at com.carrotsearch.randomizedtesting.RandomizedRunner$6.evaluate(RandomizedRunner.java:737)
	at com.carrotsearch.randomizedtesting.RandomizedRunner$7.evaluate(RandomizedRunner.java:773)
	at com.carrotsearch.randomizedtesting.RandomizedRunner$8.evaluate(RandomizedRunner.java:787)
	at com.carrotsearch.randomizedtesting.rules.SystemPropertiesRestoreRule$1.evaluate(SystemPropertiesRestoreRule.java:53)
	at org.apache.lucene.util.TestRuleSetupTeardownChained$1.evaluate(TestRuleSetupTeardownChained.java:50)
	at org.apache.lucene.util.TestRuleFieldCacheSanity$1.evaluate(TestRuleFieldCacheSanity.java:51)
	at org.apache.lucene.util.AbstractBeforeAfterRule$1.evaluate(AbstractBeforeAfterRule.java:46)
	at com.carrotsearch.randomizedtesting.rules.SystemPropertiesInvariantRule$1.evaluate(SystemPropertiesInvariantRule.java:55)
	at org.apache.lucene.util.TestRuleThreadAndTestName$1.evaluate(TestRuleThreadAndTestName.java:49)
	at org.apache.lucene.util.TestRuleIgnoreAfterMaxFailures$1.evaluate(TestRuleIgnoreAfterMaxFailures.java:70)
	at org.apache.lucene.util.TestRuleMarkFailure$1.evaluate(TestRuleMarkFailure.java:48)
	at com.carrotsearch.randomizedtesting.rules.StatementAdapter.evaluate(StatementAdapter.java:36)
	at com.carrotsearch.randomizedtesting.ThreadLeakControl$StatementRunner.run(ThreadLeakControl.java:358)
	at com.carrotsearch.randomizedtesting.ThreadLeakControl.forkTimeoutingTask(ThreadLeakControl.java:782)
	at com.carrotsearch.randomizedtesting.ThreadLeakControl$3.evaluate(ThreadLeakControl.java:442)
	at com.carrotsearch.randomizedtesting.RandomizedRunner.runSingleTest(RandomizedRunner.java:746)
	at com.carrotsearch.randomizedtesting.RandomizedRunner$3.evaluate(RandomizedRunner.java:648)
	at com.carrotsearch.randomizedtesting.RandomizedRunner$4.evaluate(RandomizedRunner.java:682)
	at com.carrotsearch.randomizedtesting.RandomizedRunner$5.evaluate(RandomizedRunner.java:693)
	at com.carrotsearch.randomizedtesting.rules.StatementAdapter.evaluate(StatementAdapter.java:36)
	at com.carrotsearch.randomizedtesting.rules.SystemPropertiesRestoreRule$1.evaluate(SystemPropertiesRestoreRule.java:53)
	at org.apache.lucene.util.AbstractBeforeAfterRule$1.evaluate(AbstractBeforeAfterRule.java:46)
	at org.apache.lucene.util.TestRuleStoreClassName$1.evaluate(TestRuleStoreClassName.java:42)
	at com.carrotsearch.randomizedtesting.rules.SystemPropertiesInvariantRule$1.evaluate(SystemPropertiesInvariantRule.java:55)
	at com.carrotsearch.randomizedtesting.rules.NoShadowingOrOverridesOnMethodsRule$1.evaluate(NoShadowingOrOverridesOnMethodsRule.java:39)
	at com.carrotsearch.randomizedtesting.rules.NoShadowingOrOverridesOnMethodsRule$1.evaluate(NoShadowingOrOverridesOnMethodsRule.java:39)
	at com.carrotsearch.randomizedtesting.rules.StatementAdapter.evaluate(StatementAdapter.java:36)
	at org.apache.lucene.util.TestRuleAssertionsRequired$1.evaluate(TestRuleAssertionsRequired.java:43)
	at org.apache.lucene.util.TestRuleMarkFailure$1.evaluate(TestRuleMarkFailure.java:48)
	at org.apache.lucene.util.TestRuleIgnoreAfterMaxFailures$1.evaluate(TestRuleIgnoreAfterMaxFailures.java:70)
	at org.apache.lucene.util.TestRuleIgnoreTestSuites$1.evaluate(TestRuleIgnoreTestSuites.java:55)
	at com.carrotsearch.randomizedtesting.rules.StatementAdapter.evaluate(StatementAdapter.java:36)
	at com.carrotsearch.randomizedtesting.ThreadLeakControl$StatementRunner.run(ThreadLeakControl.java:358)
	at java.lang.Thread.run(Thread.java:679)




Build Log:
[...truncated 8626 lines...]
[junit4:junit4] Suite: org.apache.solr.handler.component.DistributedMLTComponentTest
[junit4:junit4]   2> 0 T2504 oas.BaseDistributedSearchTestCase.initHostContext Setting hostContext system property: /fw_g/xc
[junit4:junit4]   2> 6 T2504 oas.SolrTestCaseJ4.setUp ###Starting testDistribSearch
[junit4:junit4]   2> 10 T2504 oejs.Server.doStart jetty-8.1.8.v20121106
[junit4:junit4]   2> 38 T2504 oejs.AbstractConnector.doStart Started SocketConnector@127.0.0.1:49321
[junit4:junit4]   2> 39 T2504 oasc.SolrResourceLoader.locateSolrHome JNDI not configured for solr (NoInitialContextEx)
[junit4:junit4]   2> 40 T2504 oasc.SolrResourceLoader.locateSolrHome using system property solr.solr.home: /usr/home/hudson/hudson-slave/workspace/Lucene-Solr-Tests-4.x-Java6/solr/build/solr-core/test-files/solr
[junit4:junit4]   2> 41 T2504 oasc.SolrResourceLoader.<init> new SolrResourceLoader for deduced Solr Home: '/usr/home/hudson/hudson-slave/workspace/Lucene-Solr-Tests-4.x-Java6/solr/build/solr-core/test-files/solr/'
[junit4:junit4]   2> 84 T2504 oass.SolrDispatchFilter.init SolrDispatchFilter.init()
[junit4:junit4]   2> 85 T2504 oasc.SolrResourceLoader.locateSolrHome JNDI not configured for solr (NoInitialContextEx)
[junit4:junit4]   2> 86 T2504 oasc.SolrResourceLoader.locateSolrHome using system property solr.solr.home: /usr/home/hudson/hudson-slave/workspace/Lucene-Solr-Tests-4.x-Java6/solr/build/solr-core/test-files/solr
[junit4:junit4]   2> 87 T2504 oasc.CoreContainer$Initializer.initialize looking for solr.xml: /usr/home/hudson/hudson-slave/workspace/Lucene-Solr-Tests-4.x-Java6/solr/build/solr-core/test-files/solr/solr.xml
[junit4:junit4]   2> 87 T2504 oasc.CoreContainer.<init> New CoreContainer 1642354014
[junit4:junit4]   2> 88 T2504 oasc.CoreContainer.load Loading CoreContainer using Solr Home: '/usr/home/hudson/hudson-slave/workspace/Lucene-Solr-Tests-4.x-Java6/solr/build/solr-core/test-files/solr/'
[junit4:junit4]   2> 89 T2504 oasc.SolrResourceLoader.<init> new SolrResourceLoader for directory: '/usr/home/hudson/hudson-slave/workspace/Lucene-Solr-Tests-4.x-Java6/solr/build/solr-core/test-files/solr/'
[junit4:junit4]   2> 112 T2504 oashc.HttpShardHandlerFactory.getParameter Setting socketTimeout to: 30000
[junit4:junit4]   2> 113 T2504 oashc.HttpShardHandlerFactory.getParameter Setting urlScheme to: http://
[junit4:junit4]   2> 113 T2504 oashc.HttpShardHandlerFactory.getParameter Setting connTimeout to: 15000
[junit4:junit4]   2> 114 T2504 oashc.HttpShardHandlerFactory.getParameter Setting maxConnectionsPerHost to: 20
[junit4:junit4]   2> 115 T2504 oashc.HttpShardHandlerFactory.getParameter Setting corePoolSize to: 0
[junit4:junit4]   2> 115 T2504 oashc.HttpShardHandlerFactory.getParameter Setting maximumPoolSize to: 2147483647
[junit4:junit4]   2> 116 T2504 oashc.HttpShardHandlerFactory.getParameter Setting maxThreadIdleTime to: 5
[junit4:junit4]   2> 117 T2504 oashc.HttpShardHandlerFactory.getParameter Setting sizeOfQueue to: -1
[junit4:junit4]   2> 117 T2504 oashc.HttpShardHandlerFactory.getParameter Setting fairnessPolicy to: false
[junit4:junit4]   2> 118 T2504 oascsi.HttpClientUtil.createClient Creating new http client, config:maxConnectionsPerHost=20&maxConnections=10000&socketTimeout=30000&connTimeout=15000&retry=false
[junit4:junit4]   2> 138 T2504 oasc.CoreContainer.load Registering Log Listener
[junit4:junit4]   2> 162 T2515 oasc.CoreContainer.create Creating SolrCore 'collection1' using instanceDir: /usr/home/hudson/hudson-slave/workspace/Lucene-Solr-Tests-4.x-Java6/solr/build/solr-core/test-files/solr/collection1
[junit4:junit4]   2> 163 T2515 oasc.SolrResourceLoader.<init> new SolrResourceLoader for directory: '/usr/home/hudson/hudson-slave/workspace/Lucene-Solr-Tests-4.x-Java6/solr/build/solr-core/test-files/solr/collection1/'
[junit4:junit4]   2> 165 T2515 oasc.SolrResourceLoader.replaceClassLoader Adding 'file:/usr/home/hudson/hudson-slave/workspace/Lucene-Solr-Tests-4.x-Java6/solr/build/solr-core/test-files/solr/collection1/lib/README' to classloader
[junit4:junit4]   2> 165 T2515 oasc.SolrResourceLoader.replaceClassLoader Adding 'file:/usr/home/hudson/hudson-slave/workspace/Lucene-Solr-Tests-4.x-Java6/solr/build/solr-core/test-files/solr/collection1/lib/classes/' to classloader
[junit4:junit4]   2> 209 T2515 oasc.SolrConfig.<init> Using Lucene MatchVersion: LUCENE_41
[junit4:junit4]   2> 269 T2515 oasc.SolrConfig.<init> Loaded SolrConfig: solrconfig.xml
[junit4:junit4]   2> 270 T2515 oass.IndexSchema.readSchema Reading Solr Schema
[junit4:junit4]   2> 276 T2515 oass.IndexSchema.readSchema Schema name=test
[junit4:junit4]   2> 853 T2515 oass.OpenExchangeRatesOrgProvider.init Initialized with rates=open-exchange-rates.json, refreshInterval=1440.
[junit4:junit4]   2> 865 T2515 oass.IndexSchema.readSchema default search field in schema is text
[junit4:junit4]   2> 869 T2515 oass.IndexSchema.readSchema unique key field: id
[junit4:junit4]   2> 878 T2515 oass.FileExchangeRateProvider.reload Reloading exchange rates from file currency.xml
[junit4:junit4]   2> 883 T2515 oass.FileExchangeRateProvider.reload Reloading exchange rates from file currency.xml
[junit4:junit4]   2> 887 T2515 oass.OpenExchangeRatesOrgProvider.reload Reloading exchange rates from open-exchange-rates.json
[junit4:junit4]   2> 888 T2515 oass.OpenExchangeRatesOrgProvider.reload Reloading exchange rates from open-exchange-rates.json
[junit4:junit4]   2> 889 T2515 oasc.SolrCore.<init> [collection1] Opening new SolrCore at /usr/home/hudson/hudson-slave/workspace/Lucene-Solr-Tests-4.x-Java6/solr/build/solr-core/test-files/solr/collection1/, dataDir=./org.apache.solr.handler.component.DistributedMLTComponentTest-1355923282220/control/data/
[junit4:junit4]   2> 889 T2515 oasc.JmxMonitoredMap.<init> JMX monitoring is enabled. Adding Solr mbeans to JMX Server: com.sun.jmx.mbeanserver.JmxMBeanServer@729b1670
[junit4:junit4]   2> 890 T2515 oasc.SolrCore.initDirectoryFactory org.apache.solr.core.MockDirectoryFactory
[junit4:junit4]   2> 891 T2515 oasc.CachingDirectoryFactory.get return new directory for /usr/home/hudson/hudson-slave/workspace/Lucene-Solr-Tests-4.x-Java6/solr/build/solr-core/test/J1/./org.apache.solr.handler.component.DistributedMLTComponentTest-1355923282220/control/data forceNew:false
[junit4:junit4]   2> 891 T2515 oasc.CachingDirectoryFactory.close Releasing directory:/usr/home/hudson/hudson-slave/workspace/Lucene-Solr-Tests-4.x-Java6/solr/build/solr-core/test/J1/./org.apache.solr.handler.component.DistributedMLTComponentTest-1355923282220/control/data
[junit4:junit4]   2> 891 T2515 oasc.SolrCore.getNewIndexDir New index directory detected: old=null new=./org.apache.solr.handler.component.DistributedMLTComponentTest-1355923282220/control/data/index/
[junit4:junit4]   2> 892 T2515 oasc.SolrCore.initIndex WARNING [collection1] Solr index directory './org.apache.solr.handler.component.DistributedMLTComponentTest-1355923282220/control/data/index' doesn't exist. Creating new index...
[junit4:junit4]   2> 893 T2515 oasc.CachingDirectoryFactory.get return new directory for /usr/home/hudson/hudson-slave/workspace/Lucene-Solr-Tests-4.x-Java6/solr/build/solr-core/test/J1/./org.apache.solr.handler.component.DistributedMLTComponentTest-1355923282220/control/data/index forceNew:false
[junit4:junit4]   2> 896 T2515 oasc.SolrDeletionPolicy.onCommit SolrDeletionPolicy.onCommit: commits:num=1
[junit4:junit4]   2> 		commit{dir=RateLimitedDirectoryWrapper(MockDirWrapper(org.apache.lucene.store.RAMDirectory@74874cec lockFactory=org.apache.lucene.store.NativeFSLockFactory@7768d3a6)),segFN=segments_1,generation=1,filenames=[segments_1]
[junit4:junit4]   2> 896 T2515 oasc.SolrDeletionPolicy.updateCommits newest commit = 1[segments_1]
[junit4:junit4]   2> 897 T2515 oasc.CachingDirectoryFactory.close Releasing directory:/usr/home/hudson/hudson-slave/workspace/Lucene-Solr-Tests-4.x-Java6/solr/build/solr-core/test/J1/./org.apache.solr.handler.component.DistributedMLTComponentTest-1355923282220/control/data/index
[junit4:junit4]   2> 897 T2515 oasc.SolrCore.initWriters created xml: solr.XMLResponseWriter
[junit4:junit4]   2> 899 T2515 oasup.UpdateRequestProcessorChain.init inserting DistributedUpdateProcessorFactory into updateRequestProcessorChain "dedupe"
[junit4:junit4]   2> 900 T2515 oasup.UpdateRequestProcessorChain.init inserting DistributedUpdateProcessorFactory into updateRequestProcessorChain "dedupe-allfields"
[junit4:junit4]   2> 900 T2515 oasup.UpdateRequestProcessorChain.init inserting DistributedUpdateProcessorFactory into updateRequestProcessorChain "stored_sig"
[junit4:junit4]   2> 900 T2515 oasup.UpdateRequestProcessorChain.init inserting DistributedUpdateProcessorFactory into updateRequestProcessorChain "uniq-fields"
[junit4:junit4]   2> 901 T2515 oasup.UpdateRequestProcessorChain.init inserting DistributedUpdateProcessorFactory into updateRequestProcessorChain "distrib-dup-test-chain-implicit"
[junit4:junit4]   2> 901 T2515 oasc.RequestHandlers.initHandlersFromConfig adding lazy requestHandler: solr.ReplicationHandler
[junit4:junit4]   2> 902 T2515 oasc.RequestHandlers.initHandlersFromConfig created /replication: solr.ReplicationHandler
[junit4:junit4]   2> 903 T2515 oasc.RequestHandlers.initHandlersFromConfig created standard: solr.StandardRequestHandler
[junit4:junit4]   2> 904 T2515 oasc.RequestHandlers.initHandlersFromConfig created /get: solr.RealTimeGetHandler
[junit4:junit4]   2> 904 T2515 oasc.RequestHandlers.initHandlersFromConfig created dismax: solr.SearchHandler
[junit4:junit4]   2> 905 T2515 oasc.RequestHandlers.initHandlersFromConfig created mock: org.apache.solr.core.MockQuerySenderListenerReqHandler
[junit4:junit4]   2> 906 T2515 oasc.RequestHandlers.initHandlersFromConfig created /admin/: org.apache.solr.handler.admin.AdminHandlers
[junit4:junit4]   2> 907 T2515 oasc.RequestHandlers.initHandlersFromConfig created defaults: solr.StandardRequestHandler
[junit4:junit4]   2> 907 T2515 oasc.RequestHandlers.initHandlersFromConfig adding lazy requestHandler: solr.StandardRequestHandler
[junit4:junit4]   2> 907 T2515 oasc.RequestHandlers.initHandlersFromConfig created lazy: solr.StandardRequestHandler
[junit4:junit4]   2> 908 T2515 oasc.RequestHandlers.initHandlersFromConfig created /update: solr.UpdateRequestHandler
[junit4:junit4]   2> 909 T2515 oasc.RequestHandlers.initHandlersFromConfig created /terms: org.apache.solr.handler.component.SearchHandler
[junit4:junit4]   2> 910 T2515 oasc.RequestHandlers.initHandlersFromConfig created spellCheckCompRH: org.apache.solr.handler.component.SearchHandler
[junit4:junit4]   2> 911 T2515 oasc.RequestHandlers.initHandlersFromConfig created spellCheckCompRH_Direct: org.apache.solr.handler.component.SearchHandler
[junit4:junit4]   2> 912 T2515 oasc.RequestHandlers.initHandlersFromConfig created spellCheckWithWordbreak: org.apache.solr.handler.component.SearchHandler
[junit4:junit4]   2> 913 T2515 oasc.RequestHandlers.initHandlersFromConfig created spellCheckWithWordbreak_Direct: org.apache.solr.handler.component.SearchHandler
[junit4:junit4]   2> 913 T2515 oasc.RequestHandlers.initHandlersFromConfig created spellCheckCompRH1: org.apache.solr.handler.component.SearchHandler
[junit4:junit4]   2> 914 T2515 oasc.RequestHandlers.initHandlersFromConfig created mltrh: org.apache.solr.handler.component.SearchHandler
[junit4:junit4]   2> 915 T2515 oasc.RequestHandlers.initHandlersFromConfig created tvrh: org.apache.solr.handler.component.SearchHandler
[junit4:junit4]   2> 916 T2515 oasc.RequestHandlers.initHandlersFromConfig created /mlt: solr.MoreLikeThisHandler
[junit4:junit4]   2> 917 T2515 oasc.RequestHandlers.initHandlersFromConfig created /debug/dump: solr.DumpRequestHandler
[junit4:junit4]   2> 924 T2515 oashl.XMLLoader.init xsltCacheLifetimeSeconds=60
[junit4:junit4]   2> 929 T2515 oasc.SolrCore.initDeprecatedSupport WARNING solrconfig.xml uses deprecated <admin/gettableFiles>, Please update your config to use the ShowFileRequestHandler.
[junit4:junit4]   2> 931 T2515 oasc.SolrCore.initDeprecatedSupport WARNING adding ShowFileRequestHandler with hidden files: [THROW.ERROR.ON.ADD.UPDATEPROCESSOR.JS, SOLRCONFIG-HIGHLIGHT.XML, SCHEMA-REQUIRED-FIELDS.XML, SCHEMA-REPLICATION2.XML, BAD-SCHEMA-DUP-DYNAMICFIELD.XML, SCHEMA-MINIMAL.XML, TRIVIAL.UPDATEPROCESSOR1.JS, SOLRCONFIG-CACHING.XML, SOLRCONFIG-REPEATER.XML, CURRENCY.XML, SOLRCONFIG-MERGEPOLICY.XML, BAD-SCHEMA-NONTEXT-ANALYZER.XML, SOLRCONFIG-TLOG.XML, SOLRCONFIG-MASTER.XML, BAD-SCHEMA-UNIQUEKEY-MULTIVALUED.XML, SCHEMA11.XML, SOLRCONFIG-BASIC.XML, DA_COMPOUNDDICTIONARY.TXT, MISSLEADING.EXTENSION.UPDATEPROCESSOR.JS.TXT, SCHEMA-COPYFIELD-TEST.XML, SOLRCONFIG-SLAVE.XML, ELEVATE.XML, SOLRCONFIG-PROPINJECT-INDEXDEFAULT.XML, TRIVIAL.UPDATEPROCESSOR0.JS, BAD-SOLRCONFIG-BOGUS-SCRIPTENGINE-NAME.XML, SCHEMA-IB.XML, SCHEMA-CHARFILTERS.XML, SOLRCONFIG-QUERYSENDER.XML, SOLRCONFIG-SNIPPET-PROCESSOR.XML, SCHEMA-REPLICATION1.XML, DA_UTF8.XML, CONDITIONAL.UPDATEPROCESSOR.JS, MISSING.FUNCTIONS.UPDATEPROCESSOR.JS, SOLRCONFIG-ENABLEPLUGIN.XML, HYPHENATION.DTD, SCHEMA-PHRASESUGGEST.XML, STEMDICT.TXT, HUNSPELL-TEST.AFF, SCHEMA-SNIPPET-TYPE.XML, STOPTYPES-1.TXT, STOPWORDSWRONGENCODING.TXT, SCHEMA-NUMERIC.XML, SOLRCONFIG-TRANSFORMERS.XML, SOLRCONFIG-PROPINJECT.XML, BAD-SCHEMA-NOT-INDEXED-BUT-TF.XML, SOLRCONFIG-SIMPLELOCK.XML, WDFTYPES.TXT, STOPTYPES-2.TXT, SCHEMA-REVERSED.XML, BAD-SCHEMA-CURRENCY-FT-MULTIVALUED.XML, SOLRCONFIG-SPELLCHECKCOMPONENT.XML, SOLRCONFIG-PHRASESUGGEST.XML, SCHEMA-DFR.XML, BAD-SCHEMA-CURRENCY-MULTIVALUED.XML, BAD-SCHEMA-NOT-INDEXED-BUT-POS.XML, KEEP-1.TXT, OPEN-EXCHANGE-RATES.JSON, SCHEMA-SPATIAL.XML, STOPWITHBOM.TXT, SCHEMA-BINARYFIELD.XML, SOLRCONFIG-SPELLCHECKER.XML, SOLRCONFIG-UPDATE-PROCESSOR-CHAINS.XML, BAD-SCHEMA-OMIT-TF-BUT-NOT-POS.XML, BAD-SCHEMA-DUP-FIELDTYPE.XML, SCHEMA-XINCLUDE.XML, SOLRCONFIG-MASTER1.XML, SCHEMA-BEHAVIOR.XML, SYNONYMS.TXT, BAD-SCHEMA-CURRENCY-DYNAMIC-MULTIVALUED.XML, SCHEMA.XML, SCHEMA_CODEC.XML, SOLRCONFIG-SOLR-749.XML, SOLRCONFIG-MASTER1-KEEPONEBACKUP.XML, SCHEMA-EFF.XML, STOP-2.TXT, SOLRCONFIG-FUNCTIONQUERY.XML, SCHEMA-LMDIRICHLET.XML, SOLRCONFIG-TERMINDEX.XML, SOLRCONFIG-ELEVATE.XML, SCHEMA-FOLDING.XML, STOPWORDS.TXT, SCHEMA-STOP-KEEP.XML, FUZZYSUGGEST.TXT, BAD-SCHEMA-NOT-INDEXED-BUT-NORMS.XML, SOLRCONFIG-SOLCOREPROPERTIES.XML, STOP-1.TXT, SOLRCONFIG-MASTER2.XML, SCHEMA-SPELLCHECKER.XML, SOLRCONFIG-RESPONSE-LOG-COMPONENT.XML, SOLRCONFIG-LAZYWRITER.XML, SCHEMA-LUCENEMATCHVERSION.XML, BAD-MP-SOLRCONFIG.XML, FRENCHARTICLES.TXT, SCHEMA15.XML, SOLRCONFIG-REQHANDLER.INCL, SCHEMASURROUND.XML, SCHEMA-COLLATEFILTER.XML, SOLRCONFIG-MASTER3.XML, HUNSPELL-TEST.DIC, SOLRCONFIG-XINCLUDE.XML, BAD-SCHEMA-CODEC-GLOBAL-VS-FT-MISMATCH.XML, SOLRCONFIG-SLAVE1.XML, SOLRCONFIG-DELPOLICY1.XML, SCHEMA-SIM.XML, SCHEMA-SNIPPET-FIELD.XML, SCHEMA-COLLATE.XML, STOP-SNOWBALL.TXT, BAD-SCHEMA-SIM-GLOBAL-VS-FT-MISMATCH.XML, PROTWORDS.TXT, SCHEMA-TRIE.XML, SOLRCONFIG_CODEC.XML, BAD-SOLRCONFIG-INVALID-SCRIPTFILE.XML, JASUGGEST.TXT, SCHEMA-TFIDF.XML, SOLRCONFIG-SCRIPT-UPDATEPROCESSOR.XML, SCHEMA-LMJELINEKMERCER.XML, PHRASESUGGEST.TXT, BAD-SOLRCONFIG-MISSING-SCRIPTFILE.XML, SOLRCONFIG-BASIC-LUCENEVERSION31.XML, BAD-SCHEMA-UNIQUEKEY-USES-DEFAULT.XML, OLD_SYNONYMS.TXT, SOLRCONFIG-DELPOLICY2.XML, SOLRCONFIG-NATIVELOCK.XML, XSLT, BAD-SCHEMA-DUP-FIELD.XML, SOLRCONFIG-NOCACHE.XML, SCHEMA-BM25.XML, ADDFIELDS.UPDATEPROCESSOR.JS, SOLRCONFIG-ALTDIRECTORY.XML, SOLRCONFIG-QUERYSENDER-NOQUERY.XML, COMPOUNDDICTIONARY.TXT, SOLRCONFIG_PERF.XML, SOLRCONFIG-INDEXCONFIG.XML, SCHEMA-NOT-REQUIRED-UNIQUE-KEY.XML, BAD-SCHEMA-ANALYZER-CLASS-AND-NESTED.XML, KEEP-2.TXT, SCHEMA12.XML, BAD-SCHEMA-UNIQUEKEY-IS-COPYFIELD-DEST.XML, MAPPING-ISOLATIN1ACCENT.TXT, BAD_SOLRCONFIG.XML, BAD-SCHEMA-EXTERNAL-FILEFIELD.XML]
[junit4:junit4]   2> 934 T2515 oasc.CachingDirectoryFactory.close Releasing directory:/usr/home/hudson/hudson-slave/workspace/Lucene-Solr-Tests-4.x-Java6/solr/build/solr-core/test/J1/./org.apache.solr.handler.component.DistributedMLTComponentTest-1355923282220/control/data
[junit4:junit4]   2> 934 T2515 oass.SolrIndexSearcher.<init> Opening Searcher@53e52a6e main
[junit4:junit4]   2> 935 T2515 oasu.CommitTracker.<init> Hard AutoCommit: disabled
[junit4:junit4]   2> 935 T2515 oasu.CommitTracker.<init> Soft AutoCommit: disabled
[junit4:junit4]   2> 936 T2515 oashc.SpellCheckComponent.inform Initializing spell checkers
[junit4:junit4]   2> 968 T2515 oass.DirectSolrSpellChecker.init init: {name=direct,classname=DirectSolrSpellChecker,field=lowerfilt,minQueryLength=3}
[junit4:junit4]   2> 1017 T2516 oasc.SolrCore.registerSearcher [collection1] Registered new searcher Searcher@53e52a6e main{StandardDirectoryReader(segments_1:1)}
[junit4:junit4]   2> 1019 T2515 oasc.CoreContainer.registerCore registering core: collection1
[junit4:junit4]   2> 1019 T2504 oass.SolrDispatchFilter.init user.dir=/usr/home/hudson/hudson-slave/workspace/Lucene-Solr-Tests-4.x-Java6/solr/build/solr-core/test/J1
[junit4:junit4]   2> 1020 T2504 oass.SolrDispatchFilter.init SolrDispatchFilter.init() done
[junit4:junit4]   2> 1021 T2504 oascsi.HttpClientUtil.createClient Creating new http client, config:maxConnections=128&maxConnectionsPerHost=32&followRedirects=false
[junit4:junit4]   2> 1038 T2504 oejs.Server.doStart jetty-8.1.8.v20121106
[junit4:junit4]   2> 1041 T2504 oejs.AbstractConnector.doStart Started SocketConnector@127.0.0.1:19246
[junit4:junit4]   2> 1042 T2504 oasc.SolrResourceLoader.locateSolrHome JNDI not configured for solr (NoInitialContextEx)
[junit4:junit4]   2> 1043 T2504 oasc.SolrResourceLoader.locateSolrHome using system property solr.solr.home: /usr/home/hudson/hudson-slave/workspace/Lucene-Solr-Tests-4.x-Java6/solr/build/solr-core/test-files/solr
[junit4:junit4]   2> 1044 T2504 oasc.SolrResourceLoader.<init> new SolrResourceLoader for deduced Solr Home: '/usr/home/hudson/hudson-slave/workspace/Lucene-Solr-Tests-4.x-Java6/solr/build/solr-core/test-files/solr/'
[junit4:junit4]   2> 1079 T2504 oass.SolrDispatchFilter.init SolrDispatchFilter.init()
[junit4:junit4]   2> 1080 T2504 oasc.SolrResourceLoader.locateSolrHome JNDI not configured for solr (NoInitialContextEx)
[junit4:junit4]   2> 1080 T2504 oasc.SolrResourceLoader.locateSolrHome using system property solr.solr.home: /usr/home/hudson/hudson-slave/workspace/Lucene-Solr-Tests-4.x-Java6/solr/build/solr-core/test-files/solr
[junit4:junit4]   2> 1081 T2504 oasc.CoreContainer$Initializer.initialize looking for solr.xml: /usr/home/hudson/hudson-slave/workspace/Lucene-Solr-Tests-4.x-Java6/solr/build/solr-core/test-files/solr/solr.xml
[junit4:junit4]   2> 1082 T2504 oasc.CoreContainer.<init> New CoreContainer 1888151652
[junit4:junit4]   2> 1083 T2504 oasc.CoreContainer.load Loading CoreContainer using Solr Home: '/usr/home/hudson/hudson-slave/workspace/Lucene-Solr-Tests-4.x-Java6/solr/build/solr-core/test-files/solr/'
[junit4:junit4]   2> 1083 T2504 oasc.SolrResourceLoader.<init> new SolrResourceLoader for directory: '/usr/home/hudson/hudson-slave/workspace/Lucene-Solr-Tests-4.x-Java6/solr/build/solr-core/test-files/solr/'
[junit4:junit4]   2> 1106 T2504 oashc.HttpShardHandlerFactory.getParameter Setting socketTimeout to: 30000
[junit4:junit4]   2> 1107 T2504 oashc.HttpShardHandlerFactory.getParameter Setting urlScheme to: http://
[junit4:junit4]   2> 1108 T2504 oashc.HttpShardHandlerFactory.getParameter Setting connTimeout to: 15000
[junit4:junit4]   2> 1108 T2504 oashc.HttpShardHandlerFactory.getParameter Setting maxConnectionsPerHost to: 20
[junit4:junit4]   2> 1109 T2504 oashc.HttpShardHandlerFactory.getParameter Setting corePoolSize to: 0
[junit4:junit4]   2> 1109 T2504 oashc.HttpShardHandlerFactory.getParameter Setting maximumPoolSize to: 2147483647
[junit4:junit4]   2> 1110 T2504 oashc.HttpShardHandlerFactory.getParameter Setting maxThreadIdleTime to: 5
[junit4:junit4]   2> 1111 T2504 oashc.HttpShardHandlerFactory.getParameter Setting sizeOfQueue to: -1
[junit4:junit4]   2> 1111 T2504 oashc.HttpShardHandlerFactory.getParameter Setting fairnessPolicy to: false
[junit4:junit4]   2> 1112 T2504 oascsi.HttpClientUtil.createClient Creating new http client, config:maxConnectionsPerHost=20&maxConnections=10000&socketTimeout=30000&connTimeout=15000&retry=false
[junit4:junit4]   2> 1128 T2504 oasc.CoreContainer.load Registering Log Listener
[junit4:junit4]   2> 1152 T2526 oasc.CoreContainer.create Creating SolrCore 'collection1' using instanceDir: /usr/home/hudson/hudson-slave/workspace/Lucene-Solr-Tests-4.x-Java6/solr/build/solr-core/test-files/solr/collection1
[junit4:junit4]   2> 1153 T2526 oasc.SolrResourceLoader.<init> new SolrResourceLoader for directory: '/usr/home/hudson/hudson-slave/workspace/Lucene-Solr-Tests-4.x-Java6/solr/build/solr-core/test-files/solr/collection1/'
[junit4:junit4]   2> 1154 T2526 oasc.SolrResourceLoader.replaceClassLoader Adding 'file:/usr/home/hudson/hudson-slave/workspace/Lucene-Solr-Tests-4.x-Java6/solr/build/solr-core/test-files/solr/collection1/lib/README' to classloader
[junit4:junit4]   2> 1154 T2526 oasc.SolrResourceLoader.replaceClassLoader Adding 'file:/usr/home/hudson/hudson-slave/workspace/Lucene-Solr-Tests-4.x-Java6/solr/build/solr-core/test-files/solr/collection1/lib/classes/' to classloader
[junit4:junit4]   2> 1188 T2526 oasc.SolrConfig.<init> Using Lucene MatchVersion: LUCENE_41
[junit4:junit4]   2> 1234 T2526 oasc.SolrConfig.<init> Loaded SolrConfig: solrconfig.xml
[junit4:junit4]   2> 1235 T2526 oass.IndexSchema.readSchema Reading Solr Schema
[junit4:junit4]   2> 1240 T2526 oass.IndexSchema.readSchema Schema name=test
[junit4:junit4]   2> 1637 T2526 oass.OpenExchangeRatesOrgProvider.init Initialized with rates=open-exchange-rates.json, refreshInterval=1440.
[junit4:junit4]   2> 1644 T2526 oass.IndexSchema.readSchema default search field in schema is text
[junit4:junit4]   2> 1647 T2526 oass.IndexSchema.readSchema unique key field: id
[junit4:junit4]   2> 1653 T2526 oass.FileExchangeRateProvider.reload Reloading exchange rates from file currency.xml
[junit4:junit4]   2> 1656 T2526 oass.FileExchangeRateProvider.reload Reloading exchange rates from file currency.xml
[junit4:junit4]   2> 1659 T2526 oass.OpenExchangeRatesOrgProvider.reload Reloading exchange rates from open-exchange-rates.json
[junit4:junit4]   2> 1659 T2526 oass.OpenExchangeRatesOrgProvider.reload Reloading exchange rates from open-exchange-rates.json
[junit4:junit4]   2> 1660 T2526 oasc.SolrCore.<init> [collection1] Opening new SolrCore at /usr/home/hudson/hudson-slave/workspace/Lucene-Solr-Tests-4.x-Java6/solr/build/solr-core/test-files/solr/collection1/, dataDir=./org.apache.solr.handler.component.DistributedMLTComponentTest-1355923282220/shard0/data/
[junit4:junit4]   2> 1660 T2526 oasc.JmxMonitoredMap.<init> JMX monitoring is enabled. Adding Solr mbeans to JMX Server: com.sun.jmx.mbeanserver.JmxMBeanServer@729b1670
[junit4:junit4]   2> 1660 T2526 oasc.SolrCore.initDirectoryFactory org.apache.solr.core.MockDirectoryFactory
[junit4:junit4]   2> 1661 T2526 oasc.CachingDirectoryFactory.get return new directory for /usr/home/hudson/hudson-slave/workspace/Lucene-Solr-Tests-4.x-Java6/solr/build/solr-core/test/J1/./org.apache.solr.handler.component.DistributedMLTComponentTest-1355923282220/shard0/data forceNew:false
[junit4:junit4]   2> 1661 T2526 oasc.CachingDirectoryFactory.close Releasing directory:/usr/home/hudson/hudson-slave/workspace/Lucene-Solr-Tests-4.x-Java6/solr/build/solr-core/test/J1/./org.apache.solr.handler.component.DistributedMLTComponentTest-1355923282220/shard0/data
[junit4:junit4]   2> 1661 T2526 oasc.SolrCore.getNewIndexDir New index directory detected: old=null new=./org.apache.solr.handler.component.DistributedMLTComponentTest-1355923282220/shard0/data/index/
[junit4:junit4]   2> 1662 T2526 oasc.SolrCore.initIndex WARNING [collection1] Solr index directory './org.apache.solr.handler.component.DistributedMLTComponentTest-1355923282220/shard0/data/index' doesn't exist. Creating new index...
[junit4:junit4]   2> 1663 T2526 oasc.CachingDirectoryFactory.get return new directory for /usr/home/hudson/hudson-slave/workspace/Lucene-Solr-Tests-4.x-Java6/solr/build/solr-core/test/J1/./org.apache.solr.handler.component.DistributedMLTComponentTest-1355923282220/shard0/data/index forceNew:false
[junit4:junit4]   2> 1665 T2526 oasc.SolrDeletionPolicy.onCommit SolrDeletionPolicy.onCommit: commits:num=1
[junit4:junit4]   2> 		commit{dir=RateLimitedDirectoryWrapper(MockDirWrapper(org.apache.lucene.store.RAMDirectory@715d8b95 lockFactory=org.apache.lucene.store.NativeFSLockFactory@78279750)),segFN=segments_1,generation=1,filenames=[segments_1]
[junit4:junit4]   2> 1666 T2526 oasc.SolrDeletionPolicy.updateCommits newest commit = 1[segments_1]
[junit4:junit4]   2> 1666 T2526 oasc.CachingDirectoryFactory.close Releasing directory:/usr/home/hudson/hudson-slave/workspace/Lucene-Solr-Tests-4.x-Java6/solr/build/solr-core/test/J1/./org.apache.solr.handler.component.DistributedMLTComponentTest-1355923282220/shard0/data/index
[junit4:junit4]   2> 1666 T2526 oasc.SolrCore.initWriters created xml: solr.XMLResponseWriter
[junit4:junit4]   2> 1667 T2526 oasup.UpdateRequestProcessorChain.init inserting DistributedUpdateProcessorFactory into updateRequestProcessorChain "dedupe"
[junit4:junit4]   2> 1668 T2526 oasup.UpdateRequestProcessorChain.init inserting DistributedUpdateProcessorFactory into updateRequestProcessorChain "dedupe-allfields"
[junit4:junit4]   2> 1668 T2526 oasup.UpdateRequestProcessorChain.init inserting DistributedUpdateProcessorFactory into updateRequestProcessorChain "stored_sig"
[junit4:junit4]   2> 1668 T2526 oasup.UpdateRequestProcessorChain.init inserting DistributedUpdateProcessorFactory into updateRequestProcessorChain "uniq-fields"
[junit4:junit4]   2> 1669 T2526 oasup.UpdateRequestProcessorChain.init inserting DistributedUpdateProcessorFactory into updateRequestProcessorChain "distrib-dup-test-chain-implicit"
[junit4:junit4]   2> 1669 T2526 oasc.RequestHandlers.initHandlersFromConfig adding lazy requestHandler: solr.ReplicationHandler
[junit4:junit4]   2> 1669 T2526 oasc.RequestHandlers.initHandlersFromConfig created /replication: solr.ReplicationHandler
[junit4:junit4]   2> 1670 T2526 oasc.RequestHandlers.initHandlersFromConfig created standard: solr.StandardRequestHandler
[junit4:junit4]   2> 1671 T2526 oasc.RequestHandlers.initHandlersFromConfig created /get: solr.RealTimeGetHandler
[junit4:junit4]   2> 1671 T2526 oasc.RequestHandlers.initHandlersFromConfig created dismax: solr.SearchHandler
[junit4:junit4]   2> 1672 T2526 oasc.RequestHandlers.initHandlersFromConfig created mock: org.apache.solr.core.MockQuerySenderListenerReqHandler
[junit4:junit4]   2> 1672 T2526 oasc.RequestHandlers.initHandlersFromConfig created /admin/: org.apache.solr.handler.admin.AdminHandlers
[junit4:junit4]   2> 1673 T2526 oasc.RequestHandlers.initHandlersFromConfig created defaults: solr.StandardRequestHandler
[junit4:junit4]   2> 1673 T2526 oasc.RequestHandlers.initHandlersFromConfig adding lazy requestHandler: solr.StandardRequestHandler
[junit4:junit4]   2> 1673 T2526 oasc.RequestHandlers.initHandlersFromConfig created lazy: solr.StandardRequestHandler
[junit4:junit4]   2> 1674 T2526 oasc.RequestHandlers.initHandlersFromConfig created /update: solr.UpdateRequestHandler
[junit4:junit4]   2> 1675 T2526 oasc.RequestHandlers.initHandlersFromConfig created /terms: org.apache.solr.handler.component.SearchHandler
[junit4:junit4]   2> 1675 T2526 oasc.RequestHandlers.initHandlersFromConfig created spellCheckCompRH: org.apache.solr.handler.component.SearchHandler
[junit4:junit4]   2> 1676 T2526 oasc.RequestHandlers.initHandlersFromConfig created spellCheckCompRH_Direct: org.apache.solr.handler.component.SearchHandler
[junit4:junit4]   2> 1677 T2526 oasc.RequestHandlers.initHandlersFromConfig created spellCheckWithWordbreak: org.apache.solr.handler.component.SearchHandler
[junit4:junit4]   2> 1677 T2526 oasc.RequestHandlers.initHandlersFromConfig created spellCheckWithWordbreak_Direct: org.apache.solr.handler.component.SearchHandler
[junit4:junit4]   2> 1678 T2526 oasc.RequestHandlers.initHandlersFromConfig created spellCheckCompRH1: org.apache.solr.handler.component.SearchHandler
[junit4:junit4]   2> 1678 T2526 oasc.RequestHandlers.initHandlersFromConfig created mltrh: org.apache.solr.handler.component.SearchHandler
[junit4:junit4]   2> 1679 T2526 oasc.RequestHandlers.initHandlersFromConfig created tvrh: org.apache.solr.handler.component.SearchHandler
[junit4:junit4]   2> 1680 T2526 oasc.RequestHandlers.initHandlersFromConfig created /mlt: solr.MoreLikeThisHandler
[junit4:junit4]   2> 1680 T2526 oasc.RequestHandlers.initHandlersFromConfig created /debug/dump: solr.DumpRequestHandler
[junit4:junit4]   2> 1685 T2526 oashl.XMLLoader.init xsltCacheLifetimeSeconds=60
[junit4:junit4]   2> 1688 T2526 oasc.SolrCore.initDeprecatedSupport WARNING solrconfig.xml uses deprecated <admin/gettableFiles>, Please update your config to use the ShowFileRequestHandler.
[junit4:junit4]   2> 1689 T2526 oasc.SolrCore.initDeprecatedSupport WARNING adding ShowFileRequestHandler with hidden files: [THROW.ERROR.ON.ADD.UPDATEPROCESSOR.JS, SOLRCONFIG-HIGHLIGHT.XML, SCHEMA-REQUIRED-FIELDS.XML, SCHEMA-REPLICATION2.XML, BAD-SCHEMA-DUP-DYNAMICFIELD.XML, SCHEMA-MINIMAL.XML, TRIVIAL.UPDATEPROCESSOR1.JS, SOLRCONFIG-CACHING.XML, SOLRCONFIG-REPEATER.XML, CURRENCY.XML, SOLRCONFIG-MERGEPOLICY.XML, BAD-SCHEMA-NONTEXT-ANALYZER.XML, SOLRCONFIG-TLOG.XML, SOLRCONFIG-MASTER.XML, BAD-SCHEMA-UNIQUEKEY-MULTIVALUED.XML, SCHEMA11.XML, SOLRCONFIG-BASIC.XML, DA_COMPOUNDDICTIONARY.TXT, MISSLEADING.EXTENSION.UPDATEPROCESSOR.JS.TXT, SCHEMA-COPYFIELD-TEST.XML, SOLRCONFIG-SLAVE.XML, ELEVATE.XML, SOLRCONFIG-PROPINJECT-INDEXDEFAULT.XML, TRIVIAL.UPDATEPROCESSOR0.JS, BAD-SOLRCONFIG-BOGUS-SCRIPTENGINE-NAME.XML, SCHEMA-IB.XML, SCHEMA-CHARFILTERS.XML, SOLRCONFIG-QUERYSENDER.XML, SOLRCONFIG-SNIPPET-PROCESSOR.XML, SCHEMA-REPLICATION1.XML, DA_UTF8.XML, CONDITIONAL.UPDATEPROCESSOR.JS, MISSING.FUNCTIONS.UPDATEPROCESSOR.JS, SOLRCONFIG-ENABLEPLUGIN.XML, HYPHENATION.DTD, SCHEMA-PHRASESUGGEST.XML, STEMDICT.TXT, HUNSPELL-TEST.AFF, SCHEMA-SNIPPET-TYPE.XML, STOPTYPES-1.TXT, STOPWORDSWRONGENCODING.TXT, SCHEMA-NUMERIC.XML, SOLRCONFIG-TRANSFORMERS.XML, SOLRCONFIG-PROPINJECT.XML, BAD-SCHEMA-NOT-INDEXED-BUT-TF.XML, SOLRCONFIG-SIMPLELOCK.XML, WDFTYPES.TXT, STOPTYPES-2.TXT, SCHEMA-REVERSED.XML, BAD-SCHEMA-CURRENCY-FT-MULTIVALUED.XML, SOLRCONFIG-SPELLCHECKCOMPONENT.XML, SOLRCONFIG-PHRASESUGGEST.XML, SCHEMA-DFR.XML, BAD-SCHEMA-CURRENCY-MULTIVALUED.XML, BAD-SCHEMA-NOT-INDEXED-BUT-POS.XML, KEEP-1.TXT, OPEN-EXCHANGE-RATES.JSON, SCHEMA-SPATIAL.XML, STOPWITHBOM.TXT, SCHEMA-BINARYFIELD.XML, SOLRCONFIG-SPELLCHECKER.XML, SOLRCONFIG-UPDATE-PROCESSOR-CHAINS.XML, BAD-SCHEMA-OMIT-TF-BUT-NOT-POS.XML, BAD-SCHEMA-DUP-FIELDTYPE.XML, SCHEMA-XINCLUDE.XML, SOLRCONFIG-MASTER1.XML, SCHEMA-BEHAVIOR.XML, SYNONYMS.TXT, BAD-SCHEMA-CURRENCY-DYNAMIC-MULTIVALUED.XML, SCHEMA.XML, SCHEMA_CODEC.XML, SOLRCONFIG-SOLR-749.XML, SOLRCONFIG-MASTER1-KEEPONEBACKUP.XML, SCHEMA-EFF.XML, STOP-2.TXT, SOLRCONFIG-FUNCTIONQUERY.XML, SCHEMA-LMDIRICHLET.XML, SOLRCONFIG-TERMINDEX.XML, SOLRCONFIG-ELEVATE.XML, SCHEMA-FOLDING.XML, STOPWORDS.TXT, SCHEMA-STOP-KEEP.XML, FUZZYSUGGEST.TXT, BAD-SCHEMA-NOT-INDEXED-BUT-NORMS.XML, SOLRCONFIG-SOLCOREPROPERTIES.XML, STOP-1.TXT, SOLRCONFIG-MASTER2.XML, SCHEMA-SPELLCHECKER.XML, SOLRCONFIG-RESPONSE-LOG-COMPONENT.XML, SOLRCONFIG-LAZYWRITER.XML, SCHEMA-LUCENEMATCHVERSION.XML, BAD-MP-SOLRCONFIG.XML, FRENCHARTICLES.TXT, SCHEMA15.XML, SOLRCONFIG-REQHANDLER.INCL, SCHEMASURROUND.XML, SCHEMA-COLLATEFILTER.XML, SOLRCONFIG-MASTER3.XML, HUNSPELL-TEST.DIC, SOLRCONFIG-XINCLUDE.XML, BAD-SCHEMA-CODEC-GLOBAL-VS-FT-MISMATCH.XML, SOLRCONFIG-SLAVE1.XML, SOLRCONFIG-DELPOLICY1.XML, SCHEMA-SIM.XML, SCHEMA-SNIPPET-FIELD.XML, SCHEMA-COLLATE.XML, STOP-SNOWBALL.TXT, BAD-SCHEMA-SIM-GLOBAL-VS-FT-MISMATCH.XML, PROTWORDS.TXT, SCHEMA-TRIE.XML, SOLRCONFIG_CODEC.XML, BAD-SOLRCONFIG-INVALID-SCRIPTFILE.XML, JASUGGEST.TXT, SCHEMA-TFIDF.XML, SOLRCONFIG-SCRIPT-UPDATEPROCESSOR.XML, SCHEMA-LMJELINEKMERCER.XML, PHRASESUGGEST.TXT, BAD-SOLRCONFIG-MISSING-SCRIPTFILE.XML, SOLRCONFIG-BASIC-LUCENEVERSION31.XML, BAD-SCHEMA-UNIQUEKEY-USES-DEFAULT.XML, OLD_SYNONYMS.TXT, SOLRCONFIG-DELPOLICY2.XML, SOLRCONFIG-NATIVELOCK.XML, XSLT, BAD-SCHEMA-DUP-FIELD.XML, SOLRCONFIG-NOCACHE.XML, SCHEMA-BM25.XML, ADDFIELDS.UPDATEPROCESSOR.JS, SOLRCONFIG-ALTDIRECTORY.XML, SOLRCONFIG-QUERYSENDER-NOQUERY.XML, COMPOUNDDICTIONARY.TXT, SOLRCONFIG_PERF.XML, SOLRCONFIG-INDEXCONFIG.XML, SCHEMA-NOT-REQUIRED-UNIQUE-KEY.XML, BAD-SCHEMA-ANALYZER-CLASS-AND-NESTED.XML, KEEP-2.TXT, SCHEMA12.XML, BAD-SCHEMA-UNIQUEKEY-IS-COPYFIELD-DEST.XML, MAPPING-ISOLATIN1ACCENT.TXT, BAD_SOLRCONFIG.XML, BAD-SCHEMA-EXTERNAL-FILEFIELD.XML]
[junit4:junit4]   2> 1691 T2526 oasc.CachingDirectoryFactory.close Releasing directory:/usr/home/hudson/hudson-slave/workspace/Lucene-Solr-Tests-4.x-Java6/solr/build/solr-core/test/J1/./org.apache.solr.handler.component.DistributedMLTComponentTest-1355923282220/shard0/data
[junit4:junit4]   2> 1692 T2526 oass.SolrIndexSearcher.<init> Opening Searcher@31218930 main
[junit4:junit4]   2> 1692 T2526 oasu.CommitTracker.<init> Hard AutoCommit: disabled
[junit4:junit4]   2> 1692 T2526 oasu.CommitTracker.<init> Soft AutoCommit: disabled
[junit4:junit4]   2> 1693 T2526 oashc.SpellCheckComponent.inform Initializing spell checkers
[junit4:junit4]   2> 1723 T2526 oass.DirectSolrSpellChecker.init init: {name=direct,classname=DirectSolrSpellChecker,field=lowerfilt,minQueryLength=3}
[junit4:junit4]   2> 1768 T2527 oasc.SolrCore.registerSearcher [collection1] Registered new searcher Searcher@31218930 main{StandardDirectoryReader(segments_1:1)}
[junit4:junit4]   2> 1771 T2526 oasc.CoreContainer.registerCore registering core: collection1
[junit4:junit4]   2> 1771 T2504 oass.SolrDispatchFilter.init user.dir=/usr/home/hudson/hudson-slave/workspace/Lucene-Solr-Tests-4.x-Java6/solr/build/solr-core/test/J1
[junit4:junit4]   2> 1773 T2504 oass.SolrDispatchFilter.init SolrDispatchFilter.init() done
[junit4:junit4]   2> 1773 T2504 oascsi.HttpClientUtil.createClient Creating new http client, config:maxConnections=128&maxConnectionsPerHost=32&followRedirects=false
[junit4:junit4]   2> 1790 T2504 oejs.Server.doStart jetty-8.1.8.v20121106
[junit4:junit4]   2> 1793 T2504 oejs.AbstractConnector.doStart Started SocketConnector@127.0.0.1:29638
[junit4:junit4]   2> 1794 T2504 oasc.SolrResourceLoader.locateSolrHome JNDI not configured for solr (NoInitialContextEx)
[junit4:junit4]   2> 1795 T2504 oasc.SolrResourceLoader.locateSolrHome using system property solr.solr.home: /usr/home/hudson/hudson-slave/workspace/Lucene-Solr-Tests-4.x-Java6/solr/build/solr-core/test-files/solr
[junit4:junit4]   2> 1796 T2504 oasc.SolrResourceLoader.<init> new SolrResourceLoader for deduced Solr Home: '/usr/home/hudson/hudson-slave/workspace/Lucene-Solr-Tests-4.x-Java6/solr/build/solr-core/test-files/solr/'
[junit4:junit4]   2> 1830 T2504 oass.SolrDispatchFilter.init SolrDispatchFilter.init()
[junit4:junit4]   2> 1832 T2504 oasc.SolrResourceLoader.locateSolrHome JNDI not configured for solr (NoInitialContextEx)
[junit4:junit4]   2> 1832 T2504 oasc.SolrResourceLoader.locateSolrHome using system property solr.solr.home: /usr/home/hudson/hudson-slave/workspace/Lucene-Solr-Tests-4.x-Java6/solr/build/solr-core/test-files/solr
[junit4:junit4]   2> 1833 T2504 oasc.CoreContainer$Initializer.initialize looking for solr.xml: /usr/home/hudson/hudson-slave/workspace/Lucene-Solr-Tests-4.x-Java6/solr/build/solr-core/test-files/solr/solr.xml
[junit4:junit4]   2> 1834 T2504 oasc.CoreContainer.<init> New CoreContainer 122726236
[junit4:junit4]   2> 1834 T2504 oasc.CoreContainer.load Loading CoreContainer using Solr Home: '/usr/home/hudson/hudson-slave/workspace/Lucene-Solr-Tests-4.x-Java6/solr/build/solr-core/test-files/solr/'
[junit4:junit4]   2> 1835 T2504 oasc.SolrResourceLoader.<init> new SolrResourceLoader for directory: '/usr/home/hudson/hudson-slave/workspace/Lucene-Solr-Tests-4.x-Java6/solr/build/solr-core/test-files/solr/'
[junit4:junit4]   2> 1858 T2504 oashc.HttpShardHandlerFactory.getParameter Setting socketTimeout to: 30000
[junit4:junit4]   2> 1859 T2504 oashc.HttpShardHandlerFactory.getParameter Setting urlScheme to: http://
[junit4:junit4]   2> 1860 T2504 oashc.HttpShardHandlerFactory.getParameter Setting connTimeout to: 15000
[junit4:junit4]   2> 1861 T2504 oashc.HttpShardHandlerFactory.getParameter Setting maxConnectionsPerHost to: 20
[junit4:junit4]   2> 1861 T2504 oashc.HttpShardHandlerFactory.getParameter Setting corePoolSize to: 0
[junit4:junit4]   2> 1862 T2504 oashc.HttpShardHandlerFactory.getParameter Setting maximumPoolSize to: 2147483647
[junit4:junit4]   2> 1863 T2504 oashc.HttpShardHandlerFactory.getParameter Setting maxThreadIdleTime to: 5
[junit4:junit4]   2> 1864 T2504 oashc.HttpShardHandlerFactory.getParameter Setting sizeOfQueue to: -1
[junit4:junit4]   2> 1864 T2504 oashc.HttpShardHandlerFactory.getParameter Setting fairnessPolicy to: false
[junit4:junit4]   2> 1865 T2504 oascsi.HttpClientUtil.createClient Creating new http client, config:maxConnectionsPerHost=20&maxConnections=10000&socketTimeout=30000&connTimeout=15000&retry=false
[junit4:junit4]   2> 1896 T2504 oasc.CoreContainer.load Registering Log Listener
[junit4:junit4]   2> 1920 T2537 oasc.CoreContainer.create Creating SolrCore 'collection1' using instanceDir: /usr/home/hudson/hudson-slave/workspace/Lucene-Solr-Tests-4.x-Java6/solr/build/solr-core/test-files/solr/collection1
[junit4:junit4]   2> 1921 T2537 oasc.SolrResourceLoader.<init> new SolrResourceLoader for directory: '/usr/home/hudson/hudson-slave/workspace/Lucene-Solr-Tests-4.x-Java6/solr/build/solr-core/test-files/solr/collection1/'
[junit4:junit4]   2> 1921 T2537 oasc.SolrResourceLoader.replaceClassLoader Adding 'file:/usr/home/hudson/hudson-slave/workspace/Lucene-Solr-Tests-4.x-Java6/solr/build/solr-core/test-files/solr/collection1/lib/README' to classloader
[junit4:junit4]   2> 1922 T2537 oasc.SolrResourceLoader.replaceClassLoader Adding 'file:/usr/home/hudson/hudson-slave/workspace/Lucene-Solr-Tests-4.x-Java6/solr/build/solr-core/test-files/solr/collection1/lib/classes/' to classloader
[junit4:junit4]   2> 1956 T2537 oasc.SolrConfig.<init> Using Lucene MatchVersion: LUCENE_41
[junit4:junit4]   2> 2018 T2537 oasc.SolrConfig.<init> Loaded SolrConfig: solrconfig.xml
[junit4:junit4]   2> 2019 T2537 oass.IndexSchema.readSchema Reading Solr Schema
[junit4:junit4]   2> 2025 T2537 oass.IndexSchema.readSchema Schema name=test
[junit4:junit4]   2> 2568 T2537 oass.OpenExchangeRatesOrgProvider.init Initialized with rates=open-exchange-rates.json, refreshInterval=1440.
[junit4:junit4]   2> 2575 T2537 oass.IndexSchema.readSchema default search field in schema is text
[junit4:junit4]   2> 2578 T2537 oass.IndexSchema.readSchema unique key field: id
[junit4:junit4]   2> 2584 T2537 oass.FileExchangeRateProvider.reload Reloading exchange rates from file currency.xml
[junit4:junit4]   2> 2587 T2537 oass.FileExchangeRateProvider.reload Reloading exchange rates from file currency.xml
[junit4:junit4]   2> 2589 T2537 oass.OpenExchangeRatesOrgProvider.reload Reloading exchange rates from open-exchange-rates.json
[junit4:junit4]   2> 2590 T2537 oass.OpenExchangeRatesOrgProvider.reload Reloading exchange rates from open-exchange-rates.json
[junit4:junit4]   2> 2590 T2537 oasc.SolrCore.<init> [collection1] Opening new SolrCore at /usr/home/hudson/hudson-slave/workspace/Lucene-Solr-Tests-4.x-Java6/solr/build/solr-core/test-files/solr/collection1/, dataDir=./org.apache.solr.handler.component.DistributedMLTComponentTest-1355923282220/shard1/data/
[junit4:junit4]   2> 2591 T2537 oasc.JmxMonitoredMap.<init> JMX monitoring is enabled. Adding Solr mbeans to JMX Server: com.sun.jmx.mbeanserver.JmxMBeanServer@729b1670
[junit4:junit4]   2> 2591 T2537 oasc.SolrCore.initDirectoryFactory org.apache.solr.core.MockDirectoryFactory
[junit4:junit4]   2> 2592 T2537 oasc.CachingDirectoryFactory.get return new directory for /usr/home/hudson/hudson-slave/workspace/Lucene-Solr-Tests-4.x-Java6/solr/build/solr-core/test/J1/./org.apache.solr.handler.component.DistributedMLTComponentTest-1355923282220/shard1/data forceNew:false
[junit4:junit4]   2> 2592 T2537 oasc.CachingDirectoryFactory.close Releasing directory:/usr/home/hudson/hudson-slave/workspace/Lucene-Solr-Tests-4.x-Java6/solr/build/solr-core/test/J1/./org.apache.solr.handler.component.DistributedMLTComponentTest-1355923282220/shard1/data
[junit4:junit4]   2> 2592 T2537 oasc.SolrCore.getNewIndexDir New index directory detected: old=null new=./org.apache.solr.handler.component.DistributedMLTComponentTest-1355923282220/shard1/data/index/
[junit4:junit4]   2> 2593 T2537 oasc.SolrCore.initIndex WARNING [collection1] Solr index directory './org.apache.solr.handler.component.DistributedMLTComponentTest-1355923282220/shard1/data/index' doesn't exist. Creating new index...
[junit4:junit4]   2> 2593 T2537 oasc.CachingDirectoryFactory.get return new directory for /usr/home/hudson/hudson-slave/workspace/Lucene-Solr-Tests-4.x-Java6/solr/build/solr-core/test/J1/./org.apache.solr.handler.component.DistributedMLTComponentTest-1355923282220/shard1/data/index forceNew:false
[junit4:junit4]   2> 2596 T2537 oasc.SolrDeletionPolicy.onCommit SolrDeletionPolicy.onCommit: commits:num=1
[junit4:junit4]   2> 		commit{dir=RateLimitedDirectoryWrapper(MockDirWrapper(org.apache.lucene.store.RAMDirectory@7eb8044 lockFactory=org.apache.lucene.store.NativeFSLockFactory@49a5d96c)),segFN=segments_1,generation=1,filenames=[segments_1]
[junit4:junit4]   2> 2596 T2537 oasc.SolrDeletionPolicy.updateCommits newest commit = 1[segments_1]
[junit4:junit4]   2> 2596 T2537 oasc.CachingDirectoryFactory.close Releasing directory:/usr/home/hudson/hudson-slave/workspace/Lucene-Solr-Tests-4.x-Java6/solr/build/solr-core/test/J1/./org.apache.solr.handler.component.DistributedMLTComponentTest-1355923282220/shard1/data/index
[junit4:junit4]   2> 2597 T2537 oasc.SolrCore.initWriters created xml: solr.XMLResponseWriter
[junit4:junit4]   2> 2598 T2537 oasup.UpdateRequestProcessorChain.init inserting DistributedUpdateProcessorFactory into updateRequestProcessorChain "dedupe"
[junit4:junit4]   2> 2598 T2537 oasup.UpdateRequestProcessorChain.init inserting DistributedUpdateProcessorFactory into updateRequestProcessorChain "dedupe-allfields"
[junit4:junit4]   2> 2598 T2537 oasup.UpdateRequestProcessorChain.init inserting DistributedUpdateProcessorFactory into updateRequestProcessorChain "stored_sig"
[junit4:junit4]   2> 2599 T2537 oasup.UpdateRequestProcessorChain.init inserting DistributedUpdateProcessorFactory into updateRequestProcessorChain "uniq-fields"
[junit4:junit4]   2> 2599 T2537 oasup.UpdateRequestProcessorChain.init inserting DistributedUpdateProcessorFactory into updateRequestProcessorChain "distrib-dup-test-chain-implicit"
[junit4:junit4]   2> 2599 T2537 oasc.RequestHandlers.initHandlersFromConfig adding lazy requestHandler: solr.ReplicationHandler
[junit4:junit4]   2> 2600 T2537 oasc.RequestHandlers.initHandlersFromConfig created /replication: solr.ReplicationHandler
[junit4:junit4]   2> 2600 T2537 oasc.RequestHandlers.initHandlersFromConfig created standard: solr.StandardRequestHandler
[junit4:junit4]   2> 2601 T2537 oasc.RequestHandlers.initHandlersFromConfig created /get: solr.RealTimeGetHandler
[junit4:junit4]   2> 2602 T2537 oasc.RequestHandlers.initHandlersFromConfig created dismax: solr.SearchHandler
[junit4:junit4]   2> 2602 T2537 oasc.RequestHandlers.initHandlersFromConfig created mock: org.apache.solr.core.MockQuerySenderListenerReqHandler
[junit4:junit4]   2> 2603 T2537 oasc.RequestHandlers.initHandlersFromConfig created /admin/: org.apache.solr.handler.admin.AdminHandlers
[junit4:junit4]   2> 2603 T2537 oasc.RequestHandlers.initHandlersFromConfig created defaults: solr.StandardRequestHandler
[junit4:junit4]   2> 2603 T2537 oasc.RequestHandlers.initHandlersFromConfig adding lazy requestHandler: solr.StandardRequestHandler
[junit4:junit4]   2> 2604 T2537 oasc.RequestHandlers.initHandlersFromConfig created lazy: solr.StandardRequestHandler
[junit4:junit4]   2> 2604 T2537 oasc.RequestHandlers.initHandlersFromConfig created /update: solr.UpdateRequestHandler
[junit4:junit4]   2> 2605 T2537 oasc.RequestHandlers.initHandlersFromConfig created /terms: org.apache.solr.handler.component.SearchHandler
[junit4:junit4]   2> 2606 T2537 oasc.RequestHandlers.initHandlersFromConfig created spellCheckCompRH: org.apache.solr.handler.component.SearchHandler
[junit4:junit4]   2> 2606 T2537 oasc.RequestHandlers.initHandlersFromConfig created spellCheckCompRH_Direct: org.apache.solr.handler.component.SearchHandler
[junit4:junit4]   2> 2607 T2537 oasc.RequestHandlers.initHandlersFromConfig created spellCheckWithWordbreak: org.apache.solr.handler.component.SearchHandler
[junit4:junit4]   2> 2607 T2537 oasc.RequestHandlers.initHandlersFromConfig created spellCheckWithWordbreak_Direct: org.apache.solr.handler.component.SearchHandler
[junit4:junit4]   2> 2608 T2537 oasc.RequestHandlers.initHandlersFromConfig created spellCheckCompRH1: org.apache.solr.handler.component.SearchHandler
[junit4:junit4]   2> 2609 T2537 oasc.RequestHandlers.initHandlersFromConfig created mltrh: org.apache.solr.handler.component.SearchHandler
[junit4:junit4]   2> 2609 T2537 oasc.RequestHandlers.initHandlersFromConfig created tvrh: org.apache.solr.handler.component.SearchHandler
[junit4:junit4]   2> 2610 T2537 oasc.RequestHandlers.initHandlersFromConfig created /mlt: solr.MoreLikeThisHandler
[junit4:junit4]   2> 2610 T2537 oasc.RequestHandlers.initHandlersFromConfig created /debug/dump: solr.DumpRequestHandler
[junit4:junit4]   2> 2615 T2537 oashl.XMLLoader.init xsltCacheLifetimeSeconds=60
[junit4:junit4]   2> 2618 T2537 oasc.SolrCore.initDeprecatedSupport WARNING solrconfig.xml uses deprecated <admin/gettableFiles>, Please update your config to use the ShowFileRequestHandler.
[junit4:junit4]   2> 2620 T2537 oasc.SolrCore.initDeprecatedSupport WARNING adding ShowFileRequestHandler with hidden files: [THROW.ERROR.ON.ADD.UPDATEPROCESSOR.JS, SOLRCONFIG-HIGHLIGHT.XML, SCHEMA-REQUIRED-FIELDS.XML, SCHEMA-REPLICATION2.XML, BAD-SCHEMA-DUP-DYNAMICFIELD.XML, SCHEMA-MINIMAL.XML, TRIVIAL.UPDATEPROCESSOR1.JS, SOLRCONFIG-CACHING.XML, SOLRCONFIG-REPEATER.XML, CURRENCY.XML, SOLRCONFIG-MERGEPOLICY.XML, BAD-SCHEMA-NONTEXT-ANALYZER.XML, SOLRCONFIG-TLOG.XML, SOLRCONFIG-MASTER.XML, BAD-SCHEMA-UNIQUEKEY-MULTIVALUED.XML, SCHEMA11.XML, SOLRCONFIG-BASIC.XML, DA_COMPOUNDDICTIONARY.TXT, MISSLEADING.EXTENSION.UPDATEPROCESSOR.JS.TXT, SCHEMA-COPYFIELD-TEST.XML, SOLRCONFIG-SLAVE.XML, ELEVATE.XML, SOLRCONFIG-PROPINJECT-INDEXDEFAULT.XML, TRIVIAL.UPDATEPROCESSOR0.JS, BAD-SOLRCONFIG-BOGUS-SCRIPTENGINE-NAME.XML, SCHEMA-IB.XML, SCHEMA-CHARFILTERS.XML, SOLRCONFIG-QUERYSENDER.XML, SOLRCONFIG-SNIPPET-PROCESSOR.XML, SCHEMA-REPLICATION1.XML, DA_UTF8.XML, CONDITIONAL.UPDATEPROCESSOR.JS, MISSING.FUNCTIONS.UPDATEPROCESSOR.JS, SOLRCONFIG-ENABLEPLUGIN.XML, HYPHENATION.DTD, SCHEMA-PHRASESUGGEST.XML, STEMDICT.TXT, HUNSPELL-TEST.AFF, SCHEMA-SNIPPET-TYPE.XML, STOPTYPES-1.TXT, STOPWORDSWRONGENCODING.TXT, SCHEMA-NUMERIC.XML, SOLRCONFIG-TRANSFORMERS.XML, SOLRCONFIG-PROPINJECT.XML, BAD-SCHEMA-NOT-INDEXED-BUT-TF.XML, SOLRCONFIG-SIMPLELOCK.XML, WDFTYPES.TXT, STOPTYPES-2.TXT, SCHEMA-REVERSED.XML, BAD-SCHEMA-CURRENCY-FT-MULTIVALUED.XML, SOLRCONFIG-SPELLCHECKCOMPONENT.XML, SOLRCONFIG-PHRASESUGGEST.XML, SCHEMA-DFR.XML, BAD-SCHEMA-CURRENCY-MULTIVALUED.XML, BAD-SCHEMA-NOT-INDEXED-BUT-POS.XML, KEEP-1.TXT, OPEN-EXCHANGE-RATES.JSON, SCHEMA-SPATIAL.XML, STOPWITHBOM.TXT, SCHEMA-BINARYFIELD.XML, SOLRCONFIG-SPELLCHECKER.XML, SOLRCONFIG-UPDATE-PROCESSOR-CHAINS.XML, BAD-SCHEMA-OMIT-TF-BUT-NOT-POS.XML, BAD-SCHEMA-DUP-FIELDTYPE.XML, SCHEMA-XINCLUDE.XML, SOLRCONFIG-MASTER1.XML, SCHEMA-BEHAVIOR.XML, SYNONYMS.TXT, BAD-SCHEMA-CURRENCY-DYNAMIC-MULTIVALUED.XML, SCHEMA.XML, SCHEMA_CODEC.XML, SOLRCONFIG-SOLR-749.XML, SOLRCONFIG-MASTER1-KEEPONEBACKUP.XML, SCHEMA-EFF.XML, STOP-2.TXT, SOLRCONFIG-FUNCTIONQUERY.XML, SCHEMA-LMDIRICHLET.XML, SOLRCONFIG-TERMINDEX.XML, SOLRCONFIG-ELEVATE.XML, SCHEMA-FOLDING.XML, STOPWORDS.TXT, SCHEMA-STOP-KEEP.XML, FUZZYSUGGEST.TXT, BAD-SCHEMA-NOT-INDEXED-BUT-NORMS.XML, SOLRCONFIG-SOLCOREPROPERTIES.XML, STOP-1.TXT, SOLRCONFIG-MASTER2.XML, SCHEMA-SPELLCHECKER.XML, SOLRCONFIG-RESPONSE-LOG-COMPONENT.XML, SOLRCONFIG-LAZYWRITER.XML, SCHEMA-LUCENEMATCHVERSION.XML, BAD-MP-SOLRCONFIG.XML, FRENCHARTICLES.TXT, SCHEMA15.XML, SOLRCONFIG-REQHANDLER.INCL, SCHEMASURROUND.XML, SCHEMA-COLLATEFILTER.XML, SOLRCONFIG-MASTER3.XML, HUNSPELL-TEST.DIC, SOLRCONFIG-XINCLUDE.XML, BAD-SCHEMA-CODEC-GLOBAL-VS-FT-MISMATCH.XML, SOLRCONFIG-SLAVE1.XML, SOLRCONFIG-DELPOLICY1.XML, SCHEMA-SIM.XML, SCHEMA-SNIPPET-FIELD.XML, SCHEMA-COLLATE.XML, STOP-SNOWBALL.TXT, BAD-SCHEMA-SIM-GLOBAL-VS-FT-MISMATCH.XML, PROTWORDS.TXT, SCHEMA-TRIE.XML, SOLRCONFIG_CODEC.XML, BAD-SOLRCONFIG-INVALID-SCRIPTFILE.XML, JASUGGEST.TXT, SCHEMA-TFIDF.XML, SOLRCONFIG-SCRIPT-UPDATEPROCESSOR.XML, SCHEMA-LMJELINEKMERCER.XML, PHRASESUGGEST.TXT, BAD-SOLRCONFIG-MISSING-SCRIPTFILE.XML, SOLRCONFIG-BASIC-LUCENEVERSION31.XML, BAD-SCHEMA-UNIQUEKEY-USES-DEFAULT.XML, OLD_SYNONYMS.TXT, SOLRCONFIG-DELPOLICY2.XML, SOLRCONFIG-NATIVELOCK.XML, XSLT, BAD-SCHEMA-DUP-FIELD.XML, SOLRCONFIG-NOCACHE.XML, SCHEMA-BM25.XML, ADDFIELDS.UPDATEPROCESSOR.JS, SOLRCONFIG-ALTDIRECTORY.XML, SOLRCONFIG-QUERYSENDER-NOQUERY.XML, COMPOUNDDICTIONARY.TXT, SOLRCONFIG_PERF.XML, SOLRCONFIG-INDEXCONFIG.XML, SCHEMA-NOT-REQUIRED-UNIQUE-KEY.XML, BAD-SCHEMA-ANALYZER-CLASS-AND-NESTED.XML, KEEP-2.TXT, SCHEMA12.XML, BAD-SCHEMA-UNIQUEKEY-IS-COPYFIELD-DEST.XML, MAPPING-ISOLATIN1ACCENT.TXT, BAD_SOLRCONFIG.XML, BAD-SCHEMA-EXTERNAL-FILEFIELD.XML]
[junit4:junit4]   2> 2622 T2537 oasc.CachingDirectoryFactory.close Releasing directory:/usr/home/hudson/hudson-slave/workspace/Lucene-Solr-Tests-4.x-Java6/solr/build/solr-core/test/J1/./org.apache.solr.handler.component.DistributedMLTComponentTest-1355923282220/shard1/data
[junit4:junit4]   2> 2622 T2537 oass.SolrIndexSearcher.<init> Opening Searcher@a845241 main
[junit4:junit4]   2> 2622 T2537 oasu.CommitTracker.<init> Hard AutoCommit: disabled
[junit4:junit4]   2> 2623 T2537 oasu.CommitTracker.<init> Soft AutoCommit: disabled
[junit4:junit4]   2> 2623 T2537 oashc.SpellCheckComponent.inform Initializing spell checkers
[junit4:junit4]   2> 2628 T2537 oass.DirectSolrSpellChecker.init init: {name=direct,classname=DirectSolrSpellChecker,field=lowerfilt,minQueryLength=3}
[junit4:junit4]   2> 2674 T2538 oasc.SolrCore.registerSearcher [collection1] Registered new searcher Searcher@a845241 main{StandardDirectoryReader(segments_1:1)}
[junit4:junit4]   2> 2677 T2537 oasc.CoreContainer.registerCore registering core: collection1
[junit4:junit4]   2> 2677 T2504 oass.SolrDispatchFilter.init user.dir=/usr/home/hudson/hudson-slave/workspace/Lucene-Solr-Tests-4.x-Java6/solr/build/solr-core/test/J1
[junit4:junit4]   2> 2678 T2504 oass.SolrDispatchFilter.init SolrDispatchFilter.init() done
[junit4:junit4]   2> 2679 T2504 oascsi.HttpClientUtil.createClient Creating new http client, config:maxConnections=128&maxConnectionsPerHost=32&followRedirects=false
[junit4:junit4]   2> ASYNC  NEW_CORE C180 name=collection1 org.apache.solr.core.SolrCore@40badc7b
[junit4:junit4]   2> 2700 T2511 C180 oasu.DirectUpdateHandler2.deleteAll [collection1] REMOVING ALL DOCUMENTS FROM INDEX
[junit4:junit4]   2> 2701 T2511 C180 oasc.CachingDirectoryFactory.close Releasing directory:/usr/home/hudson/hudson-slave/workspace/Lucene-Solr-Tests-4.x-Java6/solr/build/solr-core/test/J1/./org.apache.solr.handler.component.DistributedMLTComponentTest-1355923282220/control/data
[junit4:junit4]   2> 2703 T2511 C180 oasc.SolrDeletionPolicy.onInit SolrDeletionPolicy.onInit: commits:num=1
[junit4:junit4]   2> 		commit{dir=RateLimitedDirectoryWrapper(MockDirWrapper(org.apache.lucene.store.RAMDirectory@74874cec lockFactory=org.apache.lucene.store.NativeFSLockFactory@7768d3a6)),segFN=segments_1,generation=1,filenames=[segments_1]
[junit4:junit4]   2> 2703 T2511 C180 oasc.SolrDeletionPolicy.updateCommits newest commit = 1[segments_1]
[junit4:junit4]   2> 2704 T2511 C180 UPDATE [collection1] webapp=/fw_g/xc path=/update params={wt=javabin&version=2} {deleteByQuery=*:*} 0 4
[junit4:junit4]   2> ASYNC  NEW_CORE C181 name=collection1 org.apache.solr.core.SolrCore@18d68de9
[junit4:junit4]   2> 2708 T2519 C181 oasu.DirectUpdateHandler2.deleteAll [collection1] REMOVING ALL DOCUMENTS FROM INDEX
[junit4:junit4]   2> 2709 T2519 C181 oasc.CachingDirectoryFactory.close Releasing directory:/usr/home/hudson/hudson-slave/workspace/Lucene-Solr-Tests-4.x-Java6/solr/build/solr-core/test/J1/./org.apache.solr.handler.component.DistributedMLTComponentTest-1355923282220/shard0/data
[junit4:junit4]   2> 2711 T2519 C181 oasc.SolrDeletionPolicy.onInit SolrDeletionPolicy.onInit: commits:num=1
[junit4:junit4]   2> 		commit{dir=RateLimitedDirectoryWrapper(MockDirWrapper(org.apache.lucene.store.RAMDirectory@715d8b95 lockFactory=org.apache.lucene.store.NativeFSLockFactory@78279750)),segFN=segments_1,generation=1,filenames=[segments_1]
[junit4:junit4]   2> 2711 T2519 C181 oasc.SolrDeletionPolicy.updateCommits newest commit = 1[segments_1]
[junit4:junit4]   2> 2711 T2519 C181 UPDATE [collection1] webapp=/fw_g/xc path=/update params={wt=javabin&version=2} {deleteByQuery=*:*} 0 3
[junit4:junit4]   2> ASYNC  NEW_CORE C182 name=collection1 org.apache.solr.core.SolrCore@3fa377b8
[junit4:junit4]   2> 2718 T2530 C182 oasu.DirectUpdateHandler2.deleteAll [collection1] REMOVING ALL DOCUMENTS FROM INDEX
[junit4:junit4]   2> 2719 T2530 C182 oasc.CachingDirectoryFactory.close Releasing directory:/usr/home/hudson/hudson-slave/workspace/Lucene-Solr-Tests-4.x-Java6/solr/build/solr-core/test/J1/./org.apache.solr.handler.component.DistributedMLTComponentTest-1355923282220/shard1/data
[junit4:junit4]   2> 2721 T2530 C182 oasc.SolrDeletionPolicy.onInit SolrDeletionPolicy.onInit: commits:num=1
[junit4:junit4]   2> 		commit{dir=RateLimitedDirectoryWrapper(MockDirWrapper(org.apache.lucene.store.RAMDirectory@7eb8044 lockFactory=org.apache.lucene.store.NativeFSLockFactory@49a5d96c)),segFN=segments_1,generation=1,filenames=[segments_1]
[junit4:junit4]   2> 2722 T2530 C182 oasc.SolrDeletionPolicy.updateCommits newest commit = 1[segments_1]
[junit4:junit4]   2> 2722 T2530 C182 UPDATE [collection1] webapp=/fw_g/xc path=/update params={wt=javabin&version=2} {deleteByQuery=*:*} 0 4
[junit4:junit4]   2> 2726 T2511 C180 UPDATE [collection1] webapp=/fw_g/xc path=/update params={wt=javabin&version=2} {add=[1]} 0 1
[junit4:junit4]   2> 2730 T2530 C182 UPDATE [collection1] webapp=/fw_g/xc path=/update params={wt=javabin&version=2} {add=[1]} 0 1
[junit4:junit4]   2> 2733 T2511 C180 UPDATE [collection1] webapp=/fw_g/xc path=/update params={wt=javabin&version=2} {add=[2]} 0 0
[junit4:junit4]   2> 2737 T2519 C181 UPDATE [collection1] webapp=/fw_g/xc path=/update params={wt=javabin&version=2} {add=[2]} 0 1
[junit4:junit4]   2> 2739 T2511 C180 UPDATE [collection1] webapp=/fw_g/xc path=/update params={wt=javabin&version=2} {add=[3]} 0 0
[junit4:junit4]   2> 2742 T2530 C182 UPDATE [collection1] webapp=/fw_g/xc path=/update params={wt=javabin&version=2} {add=[3]} 0 0
[junit4:junit4]   2> 2745 T2511 C180 UPDATE [collection1] webapp=/fw_g/xc path=/update params={wt=javabin&version=2} {add=[4]} 0 0
[junit4:junit4]   2> 2748 T2519 C181 UPDATE [collection1] webapp=/fw_g/xc path=/update params={wt=javabin&version=2} {add=[4]} 0 0
[junit4:junit4]   2> 2751 T2511 C180 UPDATE [collection1] webapp=/fw_g/xc path=/update params={wt=javabin&version=2} {add=[5]} 0 0
[junit4:junit4]   2> 2754 T2530 C182 UPDATE [collection1] webapp=/fw_g/xc path=/update params={wt=javabin&version=2} {add=[5]} 0 0
[junit4:junit4]   2> 2757 T2511 C180 UPDATE [collection1] webapp=/fw_g/xc path=/update params={wt=javabin&version=2} {add=[6]} 0 0
[junit4:junit4]   2> 2760 T2519 C181 UPDATE [collection1] webapp=/fw_g/xc path=/update params={wt=javabin&version=2} {add=[6]} 0 0
[junit4:junit4]   2> 2763 T2511 C180 UPDATE [collection1] webapp=/fw_g/xc path=/update params={wt=javabin&version=2} {add=[7]} 0 0
[junit4:junit4]   2> 2766 T2530 C182 UPDATE [collection1] webapp=/fw_g/xc path=/update params={wt=javabin&version=2} {add=[7]} 0 0
[junit4:junit4]   2> 2769 T2511 C180 UPDATE [collection1] webapp=/fw_g/xc path=/update params={wt=javabin&version=2} {add=[8]} 0 0
[junit4:junit4]   2> 2772 T2519 C181 UPDATE [collection1] webapp=/fw_g/xc path=/update params={wt=javabin&version=2} {add=[8]} 0 0
[junit4:junit4]   2> 2775 T2511 C180 UPDATE [collection1] webapp=/fw_g/xc path=/update params={wt=javabin&version=2} {add=[9]} 0 0
[junit4:junit4]   2> 2777 T2530 C182 UPDATE [collection1] webapp=/fw_g/xc path=/update params={wt=javabin&version=2} {add=[9]} 0 0
[junit4:junit4]   2> 2781 T2511 C180 UPDATE [collection1] webapp=/fw_g/xc path=/update params={wt=javabin&version=2} {add=[10]} 0 1
[junit4:junit4]   2> 2784 T2530 C182 UPDATE [collection1] webapp=/fw_g/xc path=/update params={wt=javabin&version=2} {add=[10]} 0 0
[junit4:junit4]   2> 2787 T2511 C180 UPDATE [collection1] webapp=/fw_g/xc path=/update params={wt=javabin&version=2} {add=[12]} 0 0
[junit4:junit4]   2> 2790 T2530 C182 UPDATE [collection1] webapp=/fw_g/xc path=/update params={wt=javabin&version=2} {add=[12]} 0 0
[junit4:junit4]   2> 2793 T2511 C180 UPDATE [collection1] webapp=/fw_g/xc path=/update params={wt=javabin&version=2} {add=[13]} 0 0
[junit4:junit4]   2> 2796 T2519 C181 UPDATE [collection1] webapp=/fw_g/xc path=/update params={wt=javabin&version=2} {add=[13]} 0 0
[junit4:junit4]   2> 2799 T2511 C180 UPDATE [collection1] webapp=/fw_g/xc path=/update params={wt=javabin&version=2} {add=[14]} 0 0
[junit4:junit4]   2> 2802 T2530 C182 UPDATE [collection1] webapp=/fw_g/xc path=/update params={wt=javabin&version=2} {add=[14]} 0 0
[junit4:junit4]   2> 2805 T2511 C180 UPDATE [collection1] webapp=/fw_g/xc path=/update params={wt=javabin&version=2} {add=[15]} 0 0
[junit4:junit4]   2> 2808 T2519 C181 UPDATE [collection1] webapp=/fw_g/xc path=/update params={wt=javabin&version=2} {add=[15]} 0 0
[junit4:junit4]   2> 2811 T2511 C180 UPDATE [collection1] webapp=/fw_g/xc path=/update params={wt=javabin&version=2} {add=[16]} 0 0
[junit4:junit4]   2> 2814 T2530 C182 UPDATE [collection1] webapp=/fw_g/xc path=/update params={wt=javabin&version=2} {add=[16]} 0 0
[junit4:junit4]   2> 2817 T2511 C180 UPDATE [collection1] webapp=/fw_g/xc path=/update params={wt=javabin&version=2} {add=[17]} 0 0
[junit4:junit4]   2> 2820 T2519 C181 UPDATE [collection1] webapp=/fw_g/xc path=/update params={wt=javabin&version=2} {add=[17]} 0 0
[junit4:junit4]   2> 2823 T2511 C180 UPDATE [collection1] webapp=/fw_g/xc path=/update params={wt=javabin&version=2} {add=[18]} 0 0
[junit4:junit4]   2> 2828 T2530 C182 UPDATE [collection1] webapp=/fw_g/xc path=/update params={wt=javabin&version=2} {add=[18]} 0 2
[junit4:junit4]   2> 2830 T2511 C180 UPDATE [collection1] webapp=/fw_g/xc path=/update params={wt=javabin&version=2} {add=[19]} 0 0
[junit4:junit4]   2> 2833 T2519 C181 UPDATE [collection1] webapp=/fw_g/xc path=/update params={wt=javabin&version=2} {add=[19]} 0 0
[junit4:junit4]   2> 2836 T2511 C180 UPDATE [collection1] webapp=/fw_g/xc path=/update params={wt=javabin&version=2} {add=[20]} 0 0
[junit4:junit4]   2> 2839 T2519 C181 UPDATE [collection1] webapp=/fw_g/xc path=/update params={wt=javabin&version=2} {add=[20]} 0 0
[junit4:junit4]   2> 2843 T2511 C180 UPDATE [collection1] webapp=/fw_g/xc path=/update params={wt=javabin&version=2} {add=[21]} 0 1
[junit4:junit4]   2> 2847 T2530 C182 UPDATE [collection1] webapp=/fw_g/xc path=/update params={wt=javabin&version=2} {add=[21]} 0 1
[junit4:junit4]   2> 2849 T2511 C180 UPDATE [collection1] webapp=/fw_g/xc path=/update params={wt=javabin&version=2} {add=[22]} 0 0
[junit4:junit4]   2> 2853 T2519 C181 UPDATE [collection1] webapp=/fw_g/xc path=/update params={wt=javabin&version=2} {add=[22]} 0 1
[junit4:junit4]   2> 2856 T2511 C180 UPDATE [collection1] webapp=/fw_g/xc path=/update params={wt=javabin&version=2} {add=[23]} 0 0
[junit4:junit4]   2> 2860 T2530 C182 UPDATE [collection1] webapp=/fw_g/xc path=/update params={wt=javabin&version=2} {add=[23]} 0 1
[junit4:junit4]   2> 2862 T2511 C180 UPDATE [collection1] webapp=/fw_g/xc path=/update params={wt=javabin&version=2} {add=[24]} 0 0
[junit4:junit4]   2> 2865 T2519 C181 UPDATE [collection1] webapp=/fw_g/xc path=/update params={wt=javabin&version=2} {add=[24]} 0 0
[junit4:junit4]   2> 2868 T2511 C180 UPDATE [collection1] webapp=/fw_g/xc path=/update params={wt=javabin&version=2} {add=[25]} 0 0
[junit4:junit4]   2> 2871 T2530 C182 UPDATE [collection1] webapp=/fw_g/xc path=/update params={wt=javabin&version=2} {add=[25]} 0 0
[junit4:junit4]   2> 2874 T2511 C180 oasu.DirectUpdateHandler2.commit start commit{flags=0,_version_=0,optimize=false,openSearcher=true,waitSearcher=true,expungeDeletes=false,softCommit=false}
[junit4:junit4]   2> 2877 T2511 C180 oasc.SolrDeletionPolicy.onCommit SolrDeletionPolicy.onCommit: commits:num=2
[junit4:junit4]   2> 		commit{dir=RateLimitedDirectoryWrapper(MockDirWrapper(org.apache.lucene.store.RAMDirectory@74874cec lockFactory=org.apache.lucene.store.NativeFSLockFactory@7768d3a6)),segFN=segments_1,generation=1,filenames=[segments_1]
[junit4:junit4]   2> 		commit{dir=RateLimitedDirectoryWrapper(MockDirWrapper(org.apache.lucene.store.RAMDirectory@74874cec lockFactory=org.apache.lucene.store.NativeFSLockFactory@7768d3a6)),segFN=segments_2,generation=2,filenames=[_2.si, _1.frq, _1.fnm, _2.tim, _2_nrm.cfe, _2_nrm.cfs, _0.si, _0.prx, _1.tip, _1.tim, _1_nrm.cfs, _0.fnm, _2.prx, _2.fdt, _2.frq, _0_nrm.cfs, _2.fdx, _2.fnm, _1_nrm.cfe, _1.prx, _1.fdx, _2.tip, _1.fdt, _1.si, _0.frq, _0.tim, _0_nrm.cfe, segments_2, _0.fdx, _0.tip, _0.fdt]
[junit4:junit4]   2> 2877 T2511 C180 oasc.SolrDeletionPolicy.updateCommits newest commit = 2[_2.si, _1.frq, _1.fnm, _2.tim, _2_nrm.cfe, _2_nrm.cfs, _0.si, _0.prx, _1.tip, _1.tim, _1_nrm.cfs, _0.fnm, _2.prx, _2.fdt, _2.frq, _0_nrm.cfs, _2.fdx, _2.fnm, _1_nrm.cfe, _1.prx, _1.fdx, _2.tip, _1.fdt, _1.si, _0.frq, _0.tim, _0_nrm.cfe, segments_2, _0.fdx, _0.tip, _0.fdt]
[junit4:junit4]   2> 2877 T2511 C180 oasc.CachingDirectoryFactory.close Releasing directory:/usr/home/hudson/hudson-slave/workspace/Lucene-Solr-Tests-4.x-Java6/solr/build/solr-core/test/J1/./org.apache.solr.handler.component.DistributedMLTComponentTest-1355923282220/control/data
[junit4:junit4]   2> 2879 T2511 C180 oass.SolrIndexSearcher.<init> Opening Searcher@68fad9b7 main
[junit4:junit4]   2> 2880 T2511 C180 oasu.DirectUpdateHandler2.commit end_commit_flush
[junit4:junit4]   2> 2881 T2516 oasc.SolrCore.registerSearcher [collection1] Registered new searcher Searcher@68fad9b7 main{StandardDirectoryReader(segments_2:8 _0(4.1):C10 _1(4.1):C10 _2(4.1):C4)}
[junit4:junit4]   2> 2881 T2516 oasc.CachingDirectoryFactory.close Releasing directory:/usr/home/hudson/hudson-slave/workspace/Lucene-Solr-Tests-4.x-Java6/solr/build/solr-core/test/J1/./org.apache.solr.handler.component.DistributedMLTComponentTest-1355923282220/control/data/index
[junit4:junit4]   2> 2881 T2511 C180 UPDATE [collection1] webapp=/fw_g/xc path=/update params={waitSearcher=true&wt=javabin&commit=true&softCommit=false&version=2} {commit=} 0 7
[junit4:junit4]   2> 2884 T2519 C181 oasu.DirectUpdateHandler2.commit start commit{flags=0,_version_=0,optimize=false,openSearcher=true,waitSearcher=true,expungeDeletes=false,softCommit=false}
[junit4:junit4]   2> 2886 T2519 C181 oasc.SolrDeletionPolicy.onCommit SolrDeletionPolicy.onCommit: commits:num=2
[junit4:junit4]   2> 		commit{dir=RateLimitedDirectoryWrapper(MockDirWrapper(org.apache.lucene.store.RAMDirectory@715d8b95 lockFactory=org.apache.lucene.store.NativeFSLockFactory@78279750)),segFN=segments_1,generation=1,filenames=[segments_1]
[junit4:junit4]   2> 		commit{dir=RateLimitedDirectoryWrapper(MockDirWrapper(org.apache.lucene.store.RAMDirectory@715d8b95 lockFactory=org.apache.lucene.store.NativeFSLockFactory@78279750)),segFN=segments_2,generation=2,filenames=[_1_nrm.cfs, _0.fnm, _1.frq, _0_nrm.cfs, _1.fnm, _1_nrm.cfe, _1.fdx, _1.prx, _1.fdt, _1.si, _0_nrm.cfe, _0.tim, _0.frq, segments_2, _0.fdx, _0.si, _1.tip, _0.tip, _0.prx, _1.tim, _0.fdt]
[junit4:junit4]   2> 2886 T2519 C181 oasc.SolrDeletionPolicy.updateCommits newest commit = 2[_1_nrm.cfs, _0.fnm, _1.frq, _0_nrm.cfs, _1.fnm, _1_nrm.cfe, _1.fdx, _1.prx, _1.fdt, _1.si, _0_nrm.cfe, _0.tim, _0.frq, segments_2, _0.fdx, _0.si, _1.tip, _0.tip, _0.prx, _1.tim, _0.fdt]
[junit4:junit4]   2> 2887 T2519 C181 oasc.CachingDirectoryFactory.close Releasing directory:/usr/home/hudson/hudson-slave/workspace/Lucene-Solr-Tests-4.x-Java6/solr/build/solr-core/test/J1/./org.apache.solr.handler.component.DistributedMLTComponentTest-1355923282220/shard0/data
[junit4:junit4]   2> 2888 T2519 C181 oass.SolrIndexSearcher.<init> Opening Searcher@2a96d25e main
[junit4:junit4]   2> 2888 T2519 C181 oasu.DirectUpdateHandler2.commit end_commit_flush
[junit4:junit4]   2> 2889 T2527 oasc.SolrCore.registerSearcher [collection1] Registered new searcher Searcher@2a96d25e main{StandardDirectoryReader(segments_2:6 _0(4.1):C10 _1(4.1):C1)}
[junit4:junit4]   2> 2889 T2527 oasc.CachingDirectoryFactory.close Releasing directory:/usr/home/hudson/hudson-slave/workspace/Lucene-Solr-Tests-4.x-Java6/solr/build/solr-core/test/J1/./org.apache.solr.handler.component.DistributedMLTComponentTest-1355923282220/shard0/data/index
[junit4:junit4]   2> 2890 T2519 C181 UPDATE [collection1] webapp=/fw_g/xc path=/update params={waitSearcher=true&wt=javabin&commit=true&softCommit=false&version=2} {commit=} 0 6
[junit4:junit4]   2> 2892 T2530 C182 oasu.DirectUpdateHandler2.commit start commit{flags=0,_version_=0,optimize=false,openSearcher=true,waitSearcher=true,expungeDeletes=false,softCommit=false}
[junit4:junit4]   2> 2895 T2530 C182 oasc.SolrDeletionPolicy.onCommit SolrDeletionPolicy.onCommit: commits:num=2
[junit4:junit4]   2> 		commit{dir=RateLimitedDirectoryWrapper(MockDirWrapper(org.apache.lucene.store.RAMDirectory@7eb8044 lockFactory=org.apache.lucene.store.NativeFSLockFactory@49a5d96c)),segFN=segments_1,generation=1,filenames=[segments_1]
[junit4:junit4]   2> 		commit{dir=RateLimitedDirectoryWrapper(MockDirWrapper(org.apache.lucene.store.RAMDirectory@7eb8044 lockFactory=org.apache.lucene.store.NativeFSLockFactory@49a5d96c)),segFN=segments_2,generation=2,filenames=[_1_nrm.cfs, _0.fnm, _1.frq, _0_nrm.cfs, _1.fnm, _1_nrm.cfe, _1.fdx, _1.prx, _1.fdt, _1.si, _0_nrm.cfe, _0.tim, _0.frq, segments_2, _0.fdx, _0.si, _1.tip, _0.tip, _0.prx, _1.tim, _0.fdt]
[junit4:junit4]   2> 2895 T2530 C182 oasc.SolrDeletionPolicy.updateCommits newest commit = 2[_1_nrm.cfs, _0.fnm, _1.frq, _0_nrm.cfs, _1.fnm, _1_nrm.cfe, _1.fdx, _1.prx, _1.fdt, _1.si, _0_nrm.cfe, _0.tim, _0.frq, segments_2, _0.fdx, _0.si, _1.tip, _0.tip, _0.prx, _1.tim, _0.fdt]
[junit4:junit4]   2> 2896 T2530 C182 oasc.CachingDirectoryFactory.close Releasing directory:/usr/home/hudson/hudson-slave/workspace/Lucene-Solr-Tests-4.x-Java6/solr/build/solr-core/test/J1/./org.apache.solr.handler.component.DistributedMLTComponentTest-1355923282220/shard1/data
[junit4:junit4]   2> 2898 T2530 C182 oass.SolrIndexSearcher.<init> Opening Searcher@21f962f9 main
[junit4:junit4]   2> 2898 T2530 C182 oasu.DirectUpdateHandler2.commit end_commit_flush
[junit4:junit4]   2> 2899 T2538 oasc.SolrCore.registerSearcher [collection1] Registered new searcher Searcher@21f962f9 main{StandardDirectoryReader(segments_2:6 _0(4.1):C10 _1(4.1):C3)}
[junit4:junit4]   2> 2900 T2538 oasc.CachingDirectoryFactory.close Releasing directory:/usr/home/hudson/hudson-slave/workspace/Lucene-Solr-Tests-4.x-Java6/solr/build/solr-core/test/J1/./org.apache.solr.handler.component.DistributedMLTComponentTest-1355923282220/shard1/data/index
[junit4:junit4]   2> 2900 T2530 C182 UPDATE [collection1] webapp=/fw_g/xc path=/update params={waitSearcher=true&wt=javabin&commit=true&softCommit=false&version=2} {commit=} 0 8
[junit4:junit4]   2> 2916 T2511 C180 REQ [collection1] webapp=/fw_g/xc path=/select params={mlt.fl=lowerfilt&shards.qt=mltrh&q=match_none&mlt=true&distrib=false&qt=mltrh&wt=javabin&version=2} hits=0 status=0 QTime=13 
[junit4:junit4]   2> 2956 T2520 C181 REQ [collection1] webapp=/fw_g/xc path=/select params={mlt.fl=lowerfilt&shards.qt=mltrh&mlt=true&distrib=false&wt=javabin&rows=10&version=2&NOW=1355923285131&shard.url=[ff01::083]:33332/fw_g/xc|127.0.0.1:19246/fw_g/xc&fl=id,score&start=0&q=match_none&isShard=true&qt=mltrh&fsv=true} hits=0 status=0 QTime=1 
[junit4:junit4]   2> 2959 T2531 C182 REQ [collection1] webapp=/fw_g/xc path=/select params={mlt.fl=lowerfilt&shards.qt=mltrh&mlt=true&distrib=false&wt=javabin&rows=10&version=2&NOW=1355923285131&shard.url=[ff01::083]:33332/fw_g/xc|127.0.0.1:29638/fw_g/xc|[ff01::114]:33332/fw_g/xc&fl=id,score&start=0&q=match_none&isShard=true&qt=mltrh&fsv=true} hits=0 status=0 QTime=0 
[junit4:junit4]   2> 2960 T2519 C181 REQ [collection1] webapp=/fw_g/xc path=/select params={mlt.fl=lowerfilt&shards=[ff01::083]:33332/fw_g/xc|127.0.0.1:19246/fw_g/xc,[ff01::083]:33332/fw_g/xc|127.0.0.1:29638/fw_g/xc|[ff01::114]:33332/fw_g/xc&shards.qt=mltrh&q=match_none&mlt=true&qt=mltrh&wt=javabin&version=2} hits=0 status=0 QTime=41 
[junit4:junit4]   2> 2968 T2511 C180 REQ [collection1] webapp=/fw_g/xc path=/select params={mlt.fl=lowerfilt&shards.qt=mltrh&q=lowerfilt:sonata&mlt=true&distrib=false&qt=mltrh&wt=javabin&version=2} hits=1 status=0 QTime=5 
[junit4:junit4]   2> 2975 T2521 C181 REQ [collection1] webapp=/fw_g/xc path=/select params={mlt.fl=lowerfilt&shards.qt=mltrh&mlt=true&distrib=false&wt=javabin&rows=10&version=2&NOW=1355923285183&shard.url=127.0.0.1:19246/fw_g/xc&fl=id,score&start=0&q=lowerfilt:sonata&isShard=true&qt=mltrh&fsv=true} hits=1 status=0 QTime=1 
[junit4:junit4]   2> 2978 T2532 C182 REQ [collection1] webapp=/fw_g/xc path=/select params={mlt.fl=lowerfilt&shards.qt=mltrh&mlt=true&distrib=false&wt=javabin&rows=10&version=2&NOW=1355923285183&shard.url=127.0.0.1:29638/fw_g/xc|[ff01::213]:33332/fw_g/xc|[ff01::083]:33332/fw_g/xc&fl=id,score&start=0&q=lowerfilt:sonata&isShard=true&qt=mltrh&fsv=true} hits=0 status=0 QTime=1 
[junit4:junit4]   2> 2981 T2521 C181 REQ [collection1] webapp=/fw_g/xc path=/select params={mlt.fl=lowerfilt&shards.qt=mltrh&ids=8&mlt=true&distrib=false&wt=javabin&version=2&shard.url=127.0.0.1:19246/fw_g/xc&NOW=1355923285183&q=lowerfilt:sonata&qt=mltrh&isShard=true} status=0 QTime=0 
[junit4:junit4]   2> 2982 T2530 C182 REQ [collection1] webapp=/fw_g/xc path=/select params={mlt.fl=lowerfilt&shards=127.0.0.1:19246/fw_g/xc,127.0.0.1:29638/fw_g/xc|[ff01::213]:33332/fw_g/xc|[ff01::083]:33332/fw_g/xc&shards.qt=mltrh&q=lowerfilt:sonata&mlt=true&qt=mltrh&wt=javabin&version=2} hits=1 status=0 QTime=11 
[junit4:junit4]   2> 2987 T2511 C180 REQ [collection1] webapp=/fw_g/xc path=/select params={fl=id&sort=id+desc&mlt.fl=lowerfilt&shards.qt=mltrh&q=lowerfilt:moon&mlt=true&distrib=false&qt=mltrh&wt=javabin&version=2} hits=2 status=0 QTime=2 
[junit4:junit4]   2> 2993 T2531 C182 REQ [collection1] webapp=/fw_g/xc path=/select params={sort=id+desc&mlt.fl=lowerfilt&shards.qt=mltrh&mlt=true&distrib=false&wt=javabin&rows=10&version=2&fl=id&shard.url=127.0.0.1:29638/fw_g/xc&NOW=1355923285202&start=0&q=lowerfilt:moon&qt=mltrh&isShard=true&fsv=true} hits=1 status=0 QTime=1 
[junit4:junit4]   2> 2994 T2520 C181 REQ [collection1] webapp=/fw_g/xc path=/select params={sort=id+desc&mlt.fl=lowerfilt&shards.qt=mltrh&mlt=true&distrib=false&wt=javabin&rows=10&version=2&fl=id&shard.url=127.0.0.1:19246/fw_g/xc|[ff01::083]:33332/fw_g/xc&NOW=1355923285202&start=0&q=lowerfilt:moon&qt=mltrh&isShard=true&fsv=true} hits=1 status=0 QTime=2 
[junit4:junit4]   2> 2999 T2520 C181 REQ [collection1] webapp=/fw_g/xc path=/select params={sort=score+desc&mlt.fl=lowerfilt&shards.qt=mltrh&mlt.dist.id=17&mlt=true&distrib=false&wt=javabin&rows=20&version=2&fl=score,id&shard.url=127.0.0.1:19246/fw_g/xc|[ff01::083]:33332/fw_g/xc&NOW=1355923285202&start=0&q=%2B(lowerfilt:the)+-id:17&qt=mltrh&isShard=true} hits=6 status=0 QTime=2 
[junit4:junit4]   2> 2999 T2531 C182 REQ [collection1] webapp=/fw_g/xc path=/select params={sort=score+desc&mlt.fl=lowerfilt&shards.qt=mltrh&mlt.dist.id=17&mlt=true&distrib=false&wt=javabin&rows=20&version=2&fl=score,id&shard.url=127.0.0.1:29638/fw_g/xc&NOW=1355923285202&start=0&q=%2B(lowerfilt:the)+-id:17&qt=mltrh&isShard=true} hits=7 status=0 QTime=2 
[junit4:junit4]   2> 3000 T2519 C181 oashc.MoreLikeThisComponent.handleResponses MLT Query returned: {responseHeader={status=0,QTime=2},response={numFound=6,start=0,maxScore=0.58267975,docs=[SolrDocument{id=13, score=0.58267975}, SolrDocument{id=15, score=0.58267975}, SolrDocument{id=19, score=0.58267975}, SolrDocument{id=20, score=0.58267975}, SolrDocument{id=22, score=0.58267975}, SolrDocument{id=24, score=0.58267975}]},moreLikeThis={13={numFound=6,start=0,docs=[SolrDocument{id=15}, SolrDocument{id=19}, SolrDocument{id=20}, SolrDocument{id=22}, SolrDocument{id=24}, SolrDocument{id=17}]},15={numFound=6,start=0,docs=[SolrDocument{id=13}, SolrDocument{id=19}, SolrDocument{id=20}, SolrDocument{id=22}, SolrDocument{id=24}, SolrDocument{id=17}]},19={numFound=6,start=0,docs=[SolrDocument{id=13}, SolrDocument{id=15}, SolrDocument{id=20}, SolrDocument{id=22}, SolrDocument{id=24}, SolrDocument{id=17}]},20={numFound=6,start=0,docs=[SolrDocument{id=13}, SolrDocument{id=15}, SolrDocument{id=19}, SolrDocument{id=22}, SolrDocument{id=24}, SolrDocument{id=17}]},22={numFound=6,start=0,docs=[SolrDocument{id=13}, SolrDocument{id=15}, SolrDocument{id=19}, SolrDocument{id=20}, SolrDocument{id=24}, SolrDocument{id=17}]},24={numFound=6,start=0,docs=[SolrDocument{id=13}, SolrDocument{id=15}, SolrDocument{id=19}, SolrDocument{id=20}, SolrDocument{id=22}, SolrDocument{id=17}]}}}
[junit4:junit4]   2> 3001 T2519 C181 oashc.MoreLikeThisComponent.handleResponses MLT Query returned: {responseHeader={status=0,QTime=2},response={numFound=7,start=0,maxScore=0.6565079,docs=[SolrDocument{id=14, score=0.6565079}, SolrDocument{id=16, score=0.6565079}, SolrDocument{id=18, score=0.6565079}, SolrDocument{id=21, score=0.6565079}, SolrDocument{id=23, score=0.6565079}, SolrDocument{id=7, score=0.5570654}, SolrDocument{id=9, score=0.5252063}]},moreLikeThis={14={numFound=6,start=0,docs=[SolrDocument{id=16}, SolrDocument{id=18}, SolrDocument{id=21}, SolrDocument{id=23}, SolrDocument{id=7}, SolrDocument{id=9}]},16={numFound=6,start=0,docs=[SolrDocument{id=14}, SolrDocument{id=18}, SolrDocument{id=21}, SolrDocument{id=23}, SolrDocument{id=7}, SolrDocument{id=9}]},18={numFound=6,start=0,docs=[SolrDocument{id=14}, SolrDocument{id=16}, SolrDocument{id=21}, SolrDocument{id=23}, SolrDocument{id=7}, SolrDocument{id=9}]},21={numFound=6,start=0,docs=[SolrDocument{id=14}, SolrDocument{id=16}, SolrDocument{id=18}, SolrDocument{id=23}, SolrDocument{id=7}, SolrDocument{id=9}]},23={numFound=6,start=0,docs=[SolrDocument{id=14}, SolrDocument{id=16}, SolrDocument{id=18}, SolrDocument{id=21}, SolrDocument{id=7}, SolrDocument{id=9}]},7={numFound=0,start=0,docs=[]},9={numFound=6,start=0,docs=[SolrDocument{id=14}, SolrDocument{id=16}, SolrDocument{id=18}, SolrDocument{id=21}, SolrDocument{id=23}, SolrDocument{id=7}]}}}
[junit4:junit4]   2> 3003 T2520 C181 REQ [collection1] webapp=/fw_g/xc path=/select params={mlt.fl=lowerfilt&shards.qt=mltrh&ids=17&mlt=true&distrib=false&wt=javabin&version=2&fl=id&shard.url=127.0.0.1:19246/fw_g/xc|[ff01::083]:33332/fw_g/xc&NOW=1355923285202&q=lowerfilt:moon&qt=mltrh&isShard=true} status=0 QTime=0 
[junit4:junit4]   2> 3003 T2531 C182 REQ [collection1] webapp=/fw_g/xc path=/select params={mlt.fl=lowerfilt&shards.qt=mltrh&ids=7&mlt=true&distrib=false&wt=javabin&version=2&fl=id&shard.url=127.0.0.1:29638/fw_g/xc&NOW=1355923285202&q=lowerfilt:moon&qt=mltrh&isShard=true} status=0 QTime=0 
[junit4:junit4]   2> 3004 T2519 C181 oashc.MoreLikeThisComponent.finishStage MLT: results added for key: 17 documents: {numFound=6,start=0,maxScore=0.58267975,docs=[SolrDocument{id=13, score=0.58267975}, SolrDocument{id=15, score=0.58267975}, SolrDocument{id=19, score=0.58267975}, SolrDocument{id=20, score=0.58267975}, SolrDocument{id=22, score=0.58267975}, SolrDocument{id=24, score=0.58267975}]}
[junit4:junit4]   2> 3005 T2519 C181 oashc.MoreLikeThisComponent.finishStage MLT: results added for key: 17 documents: {numFound=7,start=0,maxScore=0.6565079,docs=[SolrDocument{id=14, score=0.6565079}, SolrDocument{id=16, score=0.6565079}, SolrDocument{id=18, score=0.6565079}, SolrDocument{id=21, score=0.6565079}, SolrDocument{id=23, score=0.6565079}, SolrDocument{id=7, score=0.5570654}, SolrDocument{id=9, score=0.5252063}]}
[junit4:junit4]   2> 3010 T2519 C181 REQ [collection1] webapp=/fw_g/xc path=/select params={fl=id&sort=id+desc&mlt.fl=lowerfilt&shards=127.0.0.1:19246/fw_g/xc|[ff01::083]:33332/fw_g/xc,127.0.0.1:29638/fw_g/xc&shards.qt=mltrh&q=lowerfilt:moon&mlt=true&qt=mltrh&wt=javabin&version=2} hits=2 status=0 QTime=20 
[junit4:junit4]   2> 3018 T2511 C180 REQ [collection1] webapp=/fw_g/xc path=/select params={fl=id&sort=id+desc&mlt.fl=lowerfilt&shards.qt=mltrh&q=lowerfilt:fox&mlt=true&distrib=false&qt=mltrh&wt=javabin&version=2} hits=13 status=0 QTime=5 
[junit4:junit4]   2> 3024 T2520 C181 REQ [collection1] webapp=/fw_g/xc path=/select params={sort=id+desc&mlt.fl=lowerfilt&shards.qt=mltrh&mlt=true&distrib=false&wt=javabin&rows=10&version=2&fl=id&shard.url=127.0.0.1:19246/fw_g/xc&NOW=1355923285233&start=0&q=lowerfilt:fox&qt=mltrh&isShard=true&fsv=true} hits=7 status=0 QTime=1 
[junit4:junit4]   2> 3027 T2531 C182 REQ [collection1] webapp=/fw_g/xc path=/select params={sort=id+desc&mlt.fl=lowerfilt&shards.qt=mltrh&mlt=true&distrib=false&wt=javabin&rows=10&version=2&fl=id&shard.url=[ff01::083]:33332/fw_g/xc|127.0.0.1:29638/fw_g/xc|[ff01::213]:33332/fw_g/xc&NOW=1355923285233&start=0&q=lowerfilt:fox&qt=mltrh&isShard=true&fsv=true} hits=6 status=0 QTime=1 
[junit4:junit4]   2> 3033 T2531 C182 REQ [collection1] webapp=/fw_g/xc path=/select params={sort=score+desc&mlt.fl=lowerfilt&shards.qt=mltrh&mlt.dist.id=24&mlt=true&distrib=false&wt=javabin&rows=20&version=2&fl=score,id&shard.url=[ff01::083]:33332/fw_g/xc|127.0.0.1:29638/fw_g/xc|[ff01::213]:33332/fw_g/xc&NOW=1355923285233&start=0&q=%2B(lowerfilt:the)+-id:24&qt=mltrh&isShard=true} hits=7 status=0 QTime=3 
[junit4:junit4]   2> 3034 T2520 C181 REQ [collection1] webapp=/fw_g/xc path=/select params={sort=score+desc&mlt.fl=lowerfilt&shards.qt=mltrh&mlt.dist.id=24&mlt=true&distrib=false&wt=javabin&rows=20&version=2&fl=score,id&shard.url=127.0.0.1:19246/fw_g/xc&NOW=1355923285233&start=0&q=%2B(lowerfilt:the)+-id:24&qt=mltrh&isShard=true} hits=6 status=0 QTime=4 
[junit4:junit4]   2> 3036 T2535 C182 REQ [collection1] webapp=/fw_g/xc path=/select params={mlt.fl=lowerfilt&sort=score+desc&shards.qt=mltrh&mlt.dist.id=19&mlt=true&distrib=false&wt=javabin&rows=20&version=2&shard.url=[ff01::083]:33332/fw_g/xc|127.0.0.1:29638/fw_g/xc|[ff01::213]:33332/fw_g/xc&fl=score,id&NOW=1355923285233&start=0&q=%2B(lowerfilt:the)+-id:19&isShard=true&qt=mltrh} hits=7 status=0 QTime=4 
[junit4:junit4]   2> 3036 T2519 C181 oashc.MoreLikeThisComponent.handleResponses MLT Query returned: {responseHeader={status=0,QTime=3},response={numFound=7,start=0,maxScore=0.6565079,docs=[SolrDocument{id=14, score=0.6565079}, SolrDocument{id=16, score=0.6565079}, SolrDocument{id=18, score=0.6565079}, SolrDocument{id=21, score=0.6565079}, SolrDocument{id=23, score=0.6565079}, SolrDocument{id=7, score=0.5570654}, SolrDocument{id=9, score=0.5252063}]},moreLikeThis={14={numFound=6,start=0,docs=[SolrDocument{id=16}, SolrDocument{id=18}, SolrDocument{id=21}, SolrDocument{id=23}, SolrDocument{id=7}, SolrDocument{id=9}]},16={numFound=6,start=0,docs=[SolrDocument{id=14}, SolrDocument{id=18}, SolrDocument{id=21}, SolrDocument{id=23}, SolrDocument{id=7}, SolrDocument{id=9}]},18={numFound=6,start=0,docs=[SolrDocument{id=14}, SolrDocument{id=16}, SolrDocument{id=21}, SolrDocument{id=23}, SolrDocument{id=7}, SolrDocument{id=9}]},21={numFound=6,start=0,docs=[SolrDocument{id=14}, SolrDocument{id=16}, SolrDocument{id=18}, SolrDocument{id=23}, SolrDocument{id=7}, SolrDocument{id=9}]},23={numFound=6,start=0,docs=[SolrDocument{id=14}, SolrDocument{id=16}, SolrDocument{id=18}, SolrDocument{id=21}, SolrDocument{id=7}, SolrDocument{id=9}]},7={numFound=0,start=0,docs=[]},9={numFound=6,start=0,docs=[SolrDocument{id=14}, SolrDocument{id=16}, SolrDocument{id=18}, SolrDocument{id=21}, SolrDocument{id=23}, SolrDocument{id=7}]}}}
[junit4:junit4]   2> 3037 T2519 C181 oashc.MoreLikeThisComponent.handleResponses MLT Query returned: {responseHeader={status=0,QTime=4},response={numFound=6,start=0,maxScore=0.58267975,docs=[SolrDocument{id=13, score=0.58267975}, SolrDocument{id=15, score=0.58267975}, SolrDocument{id=19, score=0.58267975}, SolrDocument{id=20, score=0.58267975}, SolrDocument{id=22, score=0.58267975}, SolrDocument{id=17, score=0.4661438}]},moreLikeThis={13={numFound=6,start=0,docs=[SolrDocument{id=15}, SolrDocument{id=19}, SolrDocument{id=20}, SolrDocument{id=22}, SolrDocument{id=24}, SolrDocument{id=17}]},15={numFound=6,start=0,docs=[SolrDocument{id=13}, SolrDocument{id=19}, SolrDocument{id=20}, SolrDocument{id=22}, SolrDocument{id=24}, SolrDocument{id=17}]},19={numFound=6,start=0,docs=[SolrDocument{id=13}, SolrDocument{id=15}, SolrDocument{id=20}, SolrDocument{id=22}, SolrDocument{id=24}, SolrDocument{id=17}]},20={numFound=6,start=0,docs=[SolrDocument{id=13}, SolrDocument{id=15}, SolrDocument{id=19}, SolrDocument{id=22}, SolrDocument{id=24}, SolrDocument{id=17}]},22={numFound=6,start=0,docs=[SolrDocument{id=13}, SolrDocument{id=15}, SolrDocument{id=19}, SolrDocument{id=20}, SolrDocument{id=24}, SolrDocument{id=17}]},17={numFound=6,start=0,docs=[SolrDocument{id=13}, SolrDocument{id=15}, SolrDocument{id=19}, SolrDocument{id=20}, SolrDocument{id=22}, SolrDocument{id=24}]}}}
[junit4:junit4]   2> 3037 T2536 C182 REQ [collection1] webapp=/fw_g/xc path=/select params={mlt.fl=lowerfilt&sort=score+desc&shards.qt=mltrh&mlt.dist.id=15&mlt=true&distrib=false&wt=javabin&rows=20&version=2&shard.url=[ff01::083]:33332/fw_g/xc|127.0.0.1:29638/fw_g/xc|[ff01::213]:33332/fw_g/xc&fl=score,id&NOW=1355923285233&start=0&q=%2B(lowerfilt:the)+-id:15&isShard=true&qt=mltrh} hits=7 status=0 QTime=5 
[junit4:junit4]   2> 3038 T2523 C181 REQ [collection1] webapp=/fw_g/xc path=/select params={mlt.fl=lowerfilt&sort=score+desc&shards.qt=mltrh&mlt.dist.id=20&mlt=true&distrib=false&wt=javabin&rows=20&version=2&shard.url=127.0.0.1:19246/fw_g/xc&fl=score,id&NOW=1355923285233&start=0&q=%2B(lowerfilt:the)+-id:20&isShard=true&qt=mltrh} hits=6 status=0 QTime=7 
[junit4:junit4]   2> 3039 T2534 C182 REQ [collection1] webapp=/fw_g/xc path=/select params={mlt.fl=lowerfilt&sort=score+desc&shards.qt=mltrh&mlt.dist.id=20&mlt=true&distrib=false&wt=javabin&rows=20&version=2&shard.url=[ff01::083]:33332/fw_g/xc|127.0.0.1:29638/fw_g/xc|[ff01::213]:33332/fw_g/xc&fl=score,id&NOW=1355923285233&start=0&q=%2B(lowerfilt:the)+-id:20&isShard=true&qt=mltrh} hits=7 status=0 QTime=9 
[junit4:junit4]   2> 3039 T2577 C182 REQ [collection1] webapp=/fw_g/xc path=/select params={mlt.fl=lowerfilt&sort=score+desc&shards.qt=mltrh&mlt.dist.id=16&mlt=true&distrib=false&wt=javabin&rows=20&version=2&shard.url=[ff01::083]:33332/fw_g/xc|127.0.0.1:29638/fw_g/xc|[ff01::213]:33332/fw_g/xc&fl=score,id&NOW=1355923285233&start=0&q=%2B(lowerfilt:the)+-id:16&isShard=true&qt=mltrh} hits=6 status=0 QTime=3 
[junit4:junit4]   2> 3039 T2562 C182 REQ [collection1] webapp=/fw_g/xc path=/select params={mlt.fl=lowerfilt&sort=score+desc&shards.qt=mltrh&mlt.dist.id=17&mlt=true&distrib=false&wt=javabin&rows=20&version=2&shard.url=[ff01::083]:33332/fw_g/xc|127.0.0.1:29638/fw_g/xc|[ff01::213]:33332/fw_g/xc&fl=score,id&NOW=1355923285233&start=0&q=%2B(lowerfilt:the)+-id:17&isShard=true&qt=mltrh} hits=7 status=0 QTime=7 
[junit4:junit4]   2> 3039 T2525 C181 REQ [collection1] webapp=/fw_g/xc path=/select params={mlt.fl=lowerfilt&sort=score+desc&shards.qt=mltrh&mlt.dist.id=17&mlt=true&distrib=false&wt=javabin&rows=20&version=2&shard.url=127.0.0.1:19246/fw_g/xc&fl=score,id&NOW=1355923285233&start=0&q=%2B(lowerfilt:the)+-id:17&isShard=true&qt=mltrh} hits=6 status=0 QTime=6 
[junit4:junit4]   2> 3040 T2522 C181 REQ [collection1] webapp=/fw_g/xc path=/select params={mlt.fl=lowerfilt&sort=score+desc&shards.qt=mltrh&mlt.dist.id=22&mlt=true&distrib=false&wt=javabin&rows=20&version=2&shard.url=127.0.0.1:19246/fw_g/xc&fl=score,id&NOW=1355923285233&start=0&q=%2B(lowerfilt:the)+-id:22&isShard=true&qt=mltrh} hits=6 status=0 QTime=10 
[junit4:junit4]   2> 3040 T2565 C181 REQ [collection1] webapp=/fw_g/xc path=/select params={mlt.fl=lowerfilt&sort=score+desc&shards.qt=mltrh&mlt.dist.id=15&mlt=true&distrib=false&wt=javabin&rows=20&version=2&shard.url=127.0.0.1:19246/fw_g/xc&fl=score,id&NOW=1355923285233&start=0&q=%2B(lowerfilt:the)+-id:15&isShard=true&qt=mltrh} hits=6 status=0 QTime=6 
[junit4:junit4]   2> 3040 T2519 C181 oashc.MoreLikeThisComponent.handleResponses MLT Query returned: {responseHeader={status=0,QTime=7},response={numFound=6,start=0,maxScore=0.58267975,docs=[SolrDocument{id=13, score=0.58267975}, SolrDocument{id=15, score=0.58267975}, SolrDocument{id=19, score=0.58267975}, SolrDocument{id=22, score=0.58267975}, SolrDocument{id=24, score=0.58267975}, SolrDocument{id=17, score=0.4661438}]},moreLikeThis={13={numFound=6,start=0,docs=[SolrDocument{id=15}, SolrDocument{id=19}, SolrDocument{id=20}, SolrDocument{id=22}, SolrDocument{id=24}, SolrDocument{id=17}]},15={numFound=6,start=0,docs=[SolrDocument{id=13}, SolrDocument{id=19}, SolrDocument{id=20}, SolrDocument{id=22}, SolrDocument{id=24}, SolrDocument{id=17}]},19={numFound=6,start=0,docs=[SolrDocument{id=13}, SolrDocument{id=15}, SolrDocument{id=20}, SolrDocument{id=22}, SolrDocument{id=24}, SolrDocument{id=17}]},22={numFound=6,start=0,docs=[SolrDocument{id=13}, SolrDocument{id=15}, SolrDocument{id=19}, SolrDocument{id=20}, SolrDocument{id=24}, SolrDocument{id=17}]},24={numFound=6,start=0,docs=[SolrDocument{id=13}, SolrDocument{id=15}, SolrDocument{id=19}, SolrDocument{id=20}, SolrDocument{id=22}, SolrDocument{id=17}]},17={numFound=6,start=0,docs=[SolrDocument{id=13}, SolrDocument{id=15}, SolrDocument{id=19}, SolrDocument{id=20}, SolrDocument{id=22}, SolrDocument{id=24}]}}}
[junit4:junit4]   2> 3041 T2576 C181 REQ [collection1] webapp=/fw_g/xc path=/select params={mlt.fl=lowerfilt&sort=score+desc&shards.qt=mltrh&mlt.dist.id=21&mlt=true&distrib=false&wt=javabin&rows=20&version=2&shard.url=127.0.0.1:19246/fw_g/xc&fl=score,id&NOW=1355923285233&start=0&q=%2B(lowerfilt:the)+-id:21&isShard=true&qt=mltrh} hits=7 status=0 QTime=6 
[junit4:junit4]   2> 3041 T2567 C182 REQ [collection1] webapp=/fw_g/xc path=/select params={mlt.fl=lowerfilt&sort=score+desc&shards.qt=mltrh&mlt.dist.id=21&mlt=true&distrib=false&wt=javabin&rows=20&version=2&shard.url=[ff01::083]:33332/fw_g/xc|127.0.0.1:29638/fw_g/xc|[ff01::213]:33332/fw_g/xc&fl=score,id&NOW=1355923285233&start=0&q=%2B(lowerfilt:the)+-id:21&isShard=true&qt=mltrh} hits=6 status=0 QTime=7 
[junit4:junit4]   2> 3042 T2519 C181 oashc.MoreLikeThisComponent.handleResponses MLT Query returned: {responseHeader={status=0,QTime=9},response={numFound=7,start=0,maxScore=0.6565079,docs=[SolrDocument{id=14, score=0.6565079}, SolrDocument{id=16, score=0.6565079}, SolrDocument{id=18, score=0.6565079}, SolrDocument{id=21, score=0.6565079}, SolrDocument{id=23, score=0.6565079}, SolrDocument{id=7, score=0.5570654}, SolrDocument{id=9, score=0.5252063}]},moreLikeThis={14={numFound=6,start=0,docs=[SolrDocument{id=16}, SolrDocument{id=18}, SolrDocument{id=21}, SolrDocument{id=23}, SolrDocument{id=7}, SolrDocument{id=9}]},16={numFound=6,start=0,docs=[SolrDocument{id=14}, SolrDocument{id=18}, SolrDocument{id=21}, SolrDocument{id=23}, SolrDocument{id=7}, SolrDocument{id=9}]},18={numFound=6,start=0,docs=[SolrDocument{id=14}, SolrDocument{id=16}, SolrDocument{id=21}, SolrDocument{id=23}, SolrDocument{id=7}, SolrDocument{id=9}]},21={numFound=6,start=0,docs=[SolrDocument{id=14}, SolrDocument{id=16}, SolrDocument{id=18}, SolrDocument{id=23}, SolrDocument{id=7}, SolrDocument{id=9}]},23={numFound=6,start=0,docs=[SolrDocument{id=14}, SolrDocument{id=16}, SolrDocument{id=18}, SolrDocument{id=21}, SolrDocument{id=7}, SolrDocument{id=9}]},7={numFound=0,start=0,docs=[]},9={numFound=6,start=0,docs=[SolrDocument{id=14}, SolrDocument{id=16}, SolrDocument{id=18}, SolrDocument{id=21}, SolrDocument{id=23}, SolrDocument{id=7}]}}}
[junit4:junit4]   2> 3042 T2533 C182 REQ [collection1] webapp=/fw_g/xc path=/select params={mlt.fl=lowerfilt&sort=score+desc&shards.qt=mltrh&mlt.dist.id=22&mlt=true&distrib=false&wt=javabin&rows=20&version=2&shard.url=[ff01::083]:33332/fw_g/xc|127.0.0.1:29638/fw_g/xc|[ff01::213]:33332/fw_g/xc&fl=score,id&NOW=1355923285233&start=0&q=%2B(lowerfilt:the)+-id:22&isShard=true&qt=mltrh} hits=7 status=0 QTime=12 
[junit4:junit4]   2> 3042 T2575 C182 REQ [collection1] webapp=/fw_g/xc path=/select params={mlt.fl=lowerfilt&sort=score+desc&shards.qt=mltrh&mlt.dist.id=23&mlt=true&distrib=false&wt=javabin&rows=20&version=2&shard.url=[ff01::083]:33332/fw_g/xc|127.0.0.1:29638/fw_g/xc|[ff01::213]:33332/fw_g/xc&fl=score,id&NOW=1355923285233&start=0&q=%2B(lowerfilt:the)+-id:23&isShard=true&qt=mltrh} hits=6 status=0 QTime=7 
[junit4:junit4]   2> 3042 T2564 C182 REQ [collection1] webapp=/fw_g/xc path=/select params={mlt.fl=lowerfilt&sort=score+desc&shards.qt=mltrh&mlt.dist.id=13&mlt=true&distrib=false&wt=javabin&rows=20&version=2&shard.url=[ff01::083]:33332/fw_g/xc|127.0.0.1:29638/fw_g/xc|[ff01::213]:33332/fw_g/xc&fl=score,id&NOW=1355923285233&start=0&q=%2B(lowerfilt:the)+-id:13&isShard=true&qt=mltrh} hits=7 status=0 QTime=8 
[junit4:junit4]   2> 3043 T2578 C181 REQ [collection1] webapp=/fw_g/xc path=/select params={mlt.fl=lowerfilt&sort=score+desc&shards.qt=mltrh&mlt.dist.id=18&mlt=true&distrib=false&wt=javabin&rows=20&version=2&shard.url=127.0.0.1:19246/fw_g/xc&fl=score,id&NOW=1355923285233&start=0&q=%2B(lowerfilt:the)+-id:18&isShard=true&qt=mltrh} hits=7 status=0 QTime=7 
[junit4:junit4]   2> 3043 T2519 C181 oashc.MoreLikeThisComponent.handleResponses MLT Query returned: {responseHeader={status=0,QTime=7},response={numFound=7,start=0,maxScore=0.6565079,docs=[SolrDocument{id=14, score=0.6565079}, SolrDocument{id=16, score=0.6565079}, SolrDocument{id=18, score=0.6565079}, SolrDocument{id=21, score=0.6565079}, SolrDocument{id=23, score=0.6565079}, SolrDocument{id=7, score=0.5570654}, SolrDocument{id=9, score=0.5252063}]},moreLikeThis={14={numFound=6,start=0,docs=[SolrDocument{id=16}, SolrDocument{id=18}, SolrDocument{id=21}, SolrDocument{id=23}, SolrDocument{id=7}, SolrDocument{id=9}]},16={numFound=6,start=0,docs=[SolrDocument{id=14}, SolrDocument{id=18}, SolrDocument{id=21}, SolrDocument{id=23}, SolrDocument{id=7}, SolrDocument{id=9}]},18={numFound=6,start=0,docs=[SolrDocument{id=14}, SolrDocument{id=16}, SolrDocument{id=21}, SolrDocument{id=23}, SolrDocument{id=7}, SolrDocument{id=9}]},21={numFound=6,start=0,docs=[SolrDocument{id=14}, SolrDocument{id=16}, SolrDocument{id=18}, SolrDocument{id=23}, SolrDocument{id=7}, SolrDocument{id=9}]},23={numFound=6,start=0,docs=[SolrDocument{id=14}, SolrDocument{id=16}, SolrDocument{id=18}, SolrDocument{id=21}, SolrDocument{id=7}, SolrDocument{id=9}]},7={numFound=0,start=0,docs=[]},9={numFound=6,start=0,docs=[SolrDocument{id=14}, SolrDocument{id=16}, SolrDocument{id=18}, SolrDocument{id=21}, SolrDocument{id=23}, SolrDocument{id=7}]}}}
[junit4:junit4]   2> 3043 T2574 C181 REQ [collection1] webapp=/fw_g/xc path=/select params={mlt.fl=lowerfilt&sort=score+desc&shards.qt=mltrh&mlt.dist.id=23&mlt=true&distrib=false&wt=javabin&rows=20&version=2&shard.url=127.0.0.1:19246/fw_g/xc&fl=score,id&NOW=1355923285233&start=0&q=%2B(lowerfilt:the)+-id:23&isShard=true&qt=mltrh} hits=7 status=0 QTime=8 
[junit4:junit4]   2> 3043 T2580 C181 REQ [collection1] webapp=/fw_g/xc path=/select params={mlt.fl=lowerfilt&sort=score+desc&shards.qt=mltrh&mlt.dist.id=9&mlt=true&distrib=false&wt=javabin&rows=20&version=2&shard.url=127.0.0.1:19246/fw_g/xc&fl=score,id&NOW=1355923285233&start=0&q=%2B(lowerfilt:the)+-id:9&isShard=true&qt=mltrh} hits=7 status=0 QTime=7 
[junit4:junit4]   2> 3044 T2583 C182 REQ [collection1] webapp=/fw_g/xc path=/select params={mlt.fl=lowerfilt&sort=score+desc&shards.qt=mltrh&mlt.dist.id=9&mlt=true&distrib=false&wt=javabin&rows=20&version=2&shard.url=[ff01::083]:33332/fw_g/xc|127.0.0.1:29638/fw_g/xc|[ff01::213]:33332/fw_g/xc&fl=score,id&NOW=1355923285233&start=0&q=%2B(lowerfilt:the)+-id:9&isShard=true&qt=mltrh} hits=6 status=0 QTime=7 
[junit4:junit4]   2> 3044 T2582 C181 REQ [collection1] webapp=/fw_g/xc path=/select params={mlt.fl=lowerfilt&sort=score+desc&shards.qt=mltrh&mlt.dist.id=16&mlt=true&distrib=false&wt=javabin&rows=20&version=2&shard.url=127.0.0.1:19246/fw_g/xc&fl=score,id&NOW=1355923285233&start=0&q=%2B(lowerfilt:the)+-id:16&isShard=true&qt=mltrh} hits=7 status=0 QTime=7 
[junit4:junit4]   2> 3044 T2524 C181 REQ [collection1] webapp=/fw_g/xc path=/select params={mlt.fl=lowerfilt&sort=score+desc&shards.qt=mltrh&mlt.dist.id=19&mlt=true&distrib=false&wt=javabin&rows=20&version=2&shard.url=127.0.0.1:19246/fw_g/xc&fl=score,id&NOW=1355923285233&start=0&q=%2B(lowerfilt:the)+-id:19&isShard=true&qt=mltrh} hits=6 status=0 QTime=12 
[junit4:junit4]   2> 3044 T2572 C181 REQ [collection1] webapp=/fw_g/xc path=/select params={mlt.fl=lowerfilt&sort=score+desc&shards.qt=mltrh&mlt.dist.id=13&mlt=true&distrib=false&wt=javabin&rows=20&version=2&shard.url=127.0.0.1:19246/fw_g/xc&fl=score,id&NOW=1355923285233&start=0&q=%2B(lowerfilt:the)+-id:13&isShard=true&qt=mltrh} hits=6 status=0 QTime=9 
[junit4:junit4]   2> 3043 T2581 C182 REQ [collection1] webapp=/fw_g/xc path=/select params={mlt.fl=lowerfilt&sort=score+desc&shards.qt=mltrh&mlt.dist.id=14&mlt=true&distrib=false&wt=javabin&rows=20&version=2&shard.url=[ff01::083]:33332/fw_g/xc|127.0.0.1:29638/fw_g/xc|[ff01::213]:33332/fw_g/xc&fl=score,id&NOW=1355923285233&start=0&q=%2B(lowerfilt:the)+-id:14&isShard=true&qt=mltrh} hits=6 status=0 QTime=7 
[junit4:junit4]   2> 3043 T2579 C182 REQ [collection1] webapp=/fw_g/xc path=/select params={mlt.fl=lowerfilt&sort=score+desc&shards.qt=mltrh&mlt.dist.id=18&mlt=true&distrib=false&wt=javabin&rows=20&version=2&shard.url=[ff01::083]:33332/fw_g/xc|127.0.0.1:29638/fw_g/xc|[ff01::213]:33332/fw_g/xc&fl=score,id&NOW=1355923285233&start=0&q=%2B(lowerfilt:the)+-id:18&isShard=true&qt=mltrh} hits=6 status=0 QTime=7 
[junit4:junit4]   2> 3044 T2519 C181 oashc.MoreLikeThisComponent.handleResponses MLT Query returned: {responseHeader={status=0,QTime=6},response={numFound=6,start=0,maxScore=0.58267975,docs=[SolrDocument{id=13, score=0.58267975}, SolrDocument{id=15, score=0.58267975}, SolrDocument{id=19, score=0.58267975}, SolrDocument{id=20, score=0.58267975}, SolrDocument{id=22, score=0.58267975}, SolrDocument{id=24, score=0.58267975}]},moreLikeThis={13={numFound=6,start=0,docs=[SolrDocument{id=15}, SolrDocument{id=19}, SolrDocument{id=20}, SolrDocument{id=22}, SolrDocument{id=24}, SolrDocument{id=17}]},15={numFound=6,start=0,docs=[SolrDocument{id=13}, SolrDocument{id=19}, SolrDocument{id=20}, SolrDocument{id=22}, SolrDocument{id=24}, SolrDocument{id=17}]},19={numFound=6,start=0,docs=[SolrDocument{id=13}, SolrDocument{id=15}, SolrDocument{id=20}, SolrDocument{id=22}, SolrDocument{id=24}, SolrDocument{id=17}]},20={numFound=6,start=0,docs=[SolrDocument{id=13}, SolrDocument{id=15}, SolrDocument{id=19}, SolrDocument{id=22}, SolrDocument{id=24}, SolrDocument{id=17}]},22={numFound=6,start=0,docs=[SolrDocument{id=13}, SolrDocument{id=15}, SolrDocument{id=19}, SolrDocument{id=20}, SolrDocument{id=24}, SolrDocument{id=17}]},24={numFound=6,start=0,docs=[SolrDocument{id=13}, SolrDocument{id=15}, SolrDocument{id=19}, SolrDocument{id=20}, SolrDocument{id=22}, SolrDocument{id=17}]}}}
[junit4:junit4]   2> 3047 T2519 C181 oashc.MoreLikeThisComponent.handleResponses MLT Query returned: {responseHeader={status=0,QTime=5},response={numFound=7,start=0,maxScore=0.6565079,docs=[SolrDocument{id=14, score=0.6565079}, SolrDocument{id=16, score=0.6565079}, SolrDocument{id=18, score=0.6565079}, SolrDocument{id=21, score=0.6565079}, SolrDocument{id=23, score=0.6565079}, SolrDocument{id=7, score=0.5570654}, SolrDocument{id=9, score=0.5252063}]},moreLikeThis={14={numFound=6,start=0,docs=[SolrDocument{id=16}, SolrDocument{id=18}, SolrDocument{id=21}, SolrDocument{id=23}, SolrDocument{id=7}, SolrDocument{id=9}]},16={numFound=6,start=0,docs=[SolrDocument{id=14}, SolrDocument{id=18}, SolrDocument{id=21}, SolrDocument{id=23}, SolrDocument{id=7}, SolrDocument{id=9}]},18={numFound=6,start=0,docs=[SolrDocument{id=14}, SolrDocument{id=16}, SolrDocument{id=21}, SolrDocument{id=23}, SolrDocument{id=7}, SolrDocument{id=9}]},21={numFound=6,start=0,docs=[SolrDocument{id=14}, SolrDocument{id=16}, SolrDocument{id=18}, SolrDocument{id=23}, SolrDocument{id=7}, SolrDocument{id=9}]},23={numFound=6,start=0,docs=[SolrDocument{id=14}, SolrDocument{id=16}, SolrDocument{id=18}, SolrDocument{id=21}, SolrDocument{id=7}, SolrDocument{id=9}]},7={numFound=0,start=0,docs=[]},9={numFound=6,start=0,docs=[SolrDocument{id=14}, SolrDocument{id=16}, SolrDocument{id=18}, SolrDocument{id=21}, SolrDocument{id=23}, SolrDocument{id=7}]}}}
[junit4:junit4]   2> 3048 T2519 C181 oashc.MoreLikeThisComponent.handleResponses MLT Query returned: {responseHeader={status=0,QTime=6},response={numFound=6,start=0,maxScore=0.58267975,docs=[SolrDocument{id=13, score=0.58267975}, SolrDocument{id=19, score=0.58267975}, SolrDocument{id=20, score=0.58267975}, SolrDocument{id=22, score=0.58267975}, SolrDocument{id=24, score=0.58267975}, SolrDocument{id=17, score=0.4661438}]},moreLikeThis={13={numFound=6,start=0,docs=[SolrDocument{id=15}, SolrDocument{id=19}, SolrDocument{id=20}, SolrDocument{id=22}, SolrDocument{id=24}, SolrDocument{id=17}]},19={numFound=6,start=0,docs=[SolrDocument{id=13}, SolrDocument{id=15}, SolrDocument{id=20}, SolrDocument{id=22}, SolrDocument{id=24}, SolrDocument{id=17}]},20={numFound=6,start=0,docs=[SolrDocument{id=13}, SolrDocument{id=15}, SolrDocument{id=19}, SolrDocument{id=22}, SolrDocument{id=24}, SolrDocument{id=17}]},22={numFound=6,start=0,docs=[SolrDocument{id=13}, SolrDocument{id=15}, SolrDocument{id=19}, SolrDocument{id=20}, SolrDocument{id=24}, SolrDocument{id=17}]},24={numFound=6,start=0,docs=[SolrDocument{id=13}, SolrDocument{id=15}, SolrDocument{id=19}, SolrDocument{id=20}, SolrDocument{id=22}, SolrDocument{id=17}]},17={numFound=6,start=0,docs=[SolrDocument{id=13}, SolrDocument{id=15}, SolrDocument{id=19}, SolrDocument{id=20}, SolrDocument{id=22}, SolrDocument{id=24}]}}}
[junit4:junit4]   2> 3048 T2519 C181 oashc.MoreLikeThisComponent.handleResponses MLT Query returned: {responseHeader={status=0,QTime=6},response={numFound=7,start=0,maxScore=0.58267975,docs=[SolrDocument{id=13, score=0.58267975}, SolrDocument{id=15, score=0.58267975}, SolrDocument{id=19, score=0.58267975}, SolrDocument{id=20, score=0.58267975}, SolrDocument{id=22, score=0.58267975}, SolrDocument{id=24, score=0.58267975}, SolrDocument{id=17, score=0.4661438}]},moreLikeThis={13={numFound=6,start=0,docs=[SolrDocument{id=15}, SolrDocument{id=19}, SolrDocument{id=20}, SolrDocument{id=22}, SolrDocument{id=24}, SolrDocument{id=17}]},15={numFound=6,start=0,docs=[SolrDocument{id=13}, SolrDocument{id=19}, SolrDocument{id=20}, SolrDocument{id=22}, SolrDocument{id=24}, SolrDocument{id=17}]},19={numFound=6,start=0,docs=[SolrDocument{id=13}, SolrDocument{id=15}, SolrDocument{id=20}, SolrDocument{id=22}, SolrDocument{id=24}, SolrDocument{id=17}]},20={numFound=6,start=0,docs=[SolrDocument{id=13}, SolrDocument{id=15}, SolrDocument{id=19}, SolrDocument{id=22}, SolrDocument{id=24}, SolrDocument{id=17}]},22={numFound=6,start=0,docs=[SolrDocument{id=13}, SolrDocument{id=15}, SolrDocument{id=19}, SolrDocument{id=20}, SolrDocument{id=24}, SolrDocument{id=17}]},24={numFound=6,start=0,docs=[SolrDocument{id=13}, SolrDocument{id=15}, SolrDocument{id=19}, SolrDocument{id=20}, SolrDocument{id=22}, SolrDocument{id=17}]},17={numFound=6,start=0,docs=[SolrDocument{id=13}, SolrDocument{id=15}, SolrDocument{id=19}, SolrDocument{id=20}, SolrDocument{id=22}, SolrDocument{id=24}]}}}
[junit4:junit4]   2> 3049 T2519 C181 oashc.MoreLikeThisComponent.handleResponses MLT Query returned: {responseHeader={status=0,QTime=7},response={numFound=6,start=0,maxScore=0.6565079,docs=[SolrDocument{id=14, score=0.6565079}, SolrDocument{id=16, score=0.6565079}, SolrDocument{id=18, score=0.6565079}, SolrDocument{id=23, score=0.6565079}, SolrDocument{id=7, score=0.5570654}, SolrDocument{id=9, score=0.5252063}]},moreLikeThis={14={numFound=6,start=0,docs=[SolrDocument{id=16}, SolrDocument{id=18}, SolrDocument{id=21}, SolrDocument{id=23}, SolrDocument{id=7}, SolrDocument{id=9}]},16={numFound=6,start=0,docs=[SolrDocument{id=14}, SolrDocument{id=18}, SolrDocument{id=21}, SolrDocument{id=23}, SolrDocument{id=7}, SolrDocument{id=9}]},18={numFound=6,start=0,docs=[SolrDocument{id=14}, SolrDocument{id=16}, SolrDocument{id=21}, SolrDocument{id=23}, SolrDocument{id=7}, SolrDocument{id=9}]},23={numFound=6,start=0,docs=[SolrDocument{id=14}, SolrDocument{id=16}, SolrDocument{id=18}, SolrDocument{id=21}, SolrDocument{id=7}, SolrDocument{id=9}]},7={numFound=0,start=0,docs=[]},9={numFound=6,start=0,docs=[SolrDocument{id=14}, SolrDocument{id=16}, SolrDocument{id=18}, SolrDocument{id=21}, SolrDocument{id=23}, SolrDocument{id=7}]}}}
[junit4:junit4]   2> 3050 T2519 C181 oashc.MoreLikeThisComponent.handleResponses MLT Query returned: {responseHeader={status=0,QTime=10},response={numFound=6,start=0,maxScore=0.58267975,docs=[SolrDocument{id=13, score=0.58267975}, SolrDocument{id=15, score=0.58267975}, SolrDocument{id=19, score=0.58267975}, SolrDocument{id=20, score=0.58267975}, SolrDocument{id=24, score=0.58267975}, SolrDocument{id=17, score=0.4661438}]},moreLikeThis={13={numFound=6,start=0,docs=[SolrDocument{id=15}, SolrDocument{id=19}, SolrDocument{id=20}, SolrDocument{id=22}, SolrDocument{id=24}, SolrDocument{id=17}]},15={numFound=6,start=0,docs=[SolrDocument{id=13}, SolrDocument{id=19}, SolrDocument{id=20}, SolrDocument{id=22}, SolrDocument{id=24}, SolrDocument{id=17}]},19={numFound=6,start=0,docs=[SolrDocument{id=13}, SolrDocument{id=15}, SolrDocument{id=20}, SolrDocument{id=22}, SolrDocument{id=24}, SolrDocument{id=17}]},20={numFound=6,start=0,docs=[SolrDocument{id=13}, SolrDocument{id=15}, SolrDocument{id=19}, SolrDocument{id=22}, SolrDocument{id=24}, SolrDocument{id=17}]},24={numFound=6,start=0,docs=[SolrDocument{id=13}, SolrDocument{id=15}, SolrDocument{id=19}, SolrDocument{id=20}, SolrDocument{id=22}, SolrDocument{id=17}]},17={numFound=6,start=0,docs=[SolrDocument{id=13}, SolrDocument{id=15}, SolrDocument{id=19}, SolrDocument{id=20}, SolrDocument{id=22}, SolrDocument{id=24}]}}}
[junit4:junit4]   2> 3050 T2519 C181 oashc.MoreLikeThisComponent.handleResponses MLT Query returned: {responseHeader={status=0,QTime=12},response={numFound=7,start=0,maxScore=0.6565079,docs=[SolrDocument{id=14, score=0.6565079}, SolrDocument{id=16, score=0.6565079}, SolrDocument{id=18, score=0.6565079}, SolrDocument{id=21, score=0.6565079}, SolrDocument{id=23, score=0.6565079}, SolrDocument{id=7, score=0.5570654}, SolrDocument{id=9, score=0.5252063}]},moreLikeThis={14={numFound=6,start=0,docs=[SolrDocument{id=16}, SolrDocument{id=18}, SolrDocument{id=21}, SolrDocument{id=23}, SolrDocument{id=7}, SolrDocument{id=9}]},16={numFound=6,start=0,docs=[SolrDocument{id=14}, SolrDocument{id=18}, SolrDocument{id=21}, SolrDocument{id=23}, SolrDocument{id=7}, SolrDocument{id=9}]},18={numFound=6,start=0,docs=[SolrDocument{id=14}, SolrDocument{id=16}, SolrDocument{id=21}, SolrDocument{id=23}, SolrDocument{id=7}, SolrDocument{id=9}]},21={numFound=6,start=0,docs=[SolrDocument{id=14}, SolrDocument{id=16}, SolrDocument{id=18}, SolrDocument{id=23}, SolrDocument{id=7}, SolrDocument{id=9}]},23={numFound=6,start=0,docs=[SolrDocument{id=14}, SolrDocument{id=16}, SolrDocument{id=18}, SolrDocument{id=21}, SolrDocument{id=7}, SolrDocument{id=9}]},7={numFound=0,start=0,docs=[]},9={numFound=6,start=0,docs=[SolrDocument{id=14}, SolrDocument{id=16}, SolrDocument{id=18}, SolrDocument{id=21}, SolrDocument{id=23}, SolrDocument{id=7}]}}}
[junit4:junit4]   2> 3051 T2519 C181 oashc.MoreLikeThisComponent.handleResponses MLT Query returned: {responseHeader={status=0,QTime=7},response={numFound=6,start=0,maxScore=0.6565079,docs=[SolrDocument{id=14, score=0.6565079}, SolrDocument{id=16, score=0.6565079}, SolrDocument{id=18, score=0.6565079}, SolrDocument{id=21, score=0.6565079}, SolrDocument{id=7, score=0.5570654}, SolrDocument{id=9, score=0.5252063}]},moreLikeThis={14={numFound=6,start=0,docs=[SolrDocument{id=16}, SolrDocument{id=18}, SolrDocument{id=21}, SolrDocument{id=23}, SolrDocument{id=7}, SolrDocument{id=9}]},16={numFound=6,start=0,docs=[SolrDocument{id=14}, SolrDocument{id=18}, SolrDocument{id=21}, SolrDocument{id=23}, SolrDocument{id=7}, SolrDocument{id=9}]},18={numFound=6,start=0,docs=[SolrDocument{id=14}, SolrDocument{id=16}, SolrDocument{id=21}, SolrDocument{id=23}, SolrDocument{id=7}, SolrDocument{id=9}]},21={numFound=6,start=0,docs=[SolrDocument{id=14}, SolrDocument{id=16}, SolrDocument{id=18}, SolrDocument{id=23}, SolrDocument{id=7}, SolrDocument{id=9}]},7={numFound=0,start=0,docs=[]},9={numFound=6,start=0,docs=[SolrDocument{id=14}, SolrDocument{id=16}, SolrDocument{id=18}, SolrDocument{id=21}, SolrDocument{id=23}, SolrDocument{id=7}]}}}
[junit4:junit4]   2> 3052 T2519 C181 oashc.MoreLikeThisComponent.handleResponses MLT Query returned: {responseHeader={status=0,QTime=8},response={numFound=7,start=0,maxScore=0.58267975,docs=[SolrDocument{id=13, score=0.58267975}, SolrDocument{id=15, score=0.58267975}, SolrDocument{id=19, score=0.58267975}, SolrDocument{id=20, score=0.58267975}, SolrDocument{id=22, score=0.58267975}, SolrDocument{id=24, score=0.58267975}, SolrDocument{id=17, score=0.4661438}]},moreLikeThis={13={numFound=6,start=0,docs=[SolrDocument{id=15}, SolrDocument{id=19}, SolrDocument{id=20}, SolrDocument{id=22}, SolrDocument{id=24}, SolrDocument{id=17}]},15={numFound=6,start=0,docs=[SolrDocument{id=13}, SolrDocument{id=19}, SolrDocument{id=20}, SolrDocument{id=22}, SolrDocument{id=24}, SolrDocument{id=17}]},19={numFound=6,start=0,docs=[SolrDocument{id=13}, SolrDocument{id=15}, SolrDocument{id=20}, SolrDocument{id=22}, SolrDocument{id=24}, SolrDocument{id=17}]},20={numFound=6,start=0,docs=[SolrDocument{id=13}, SolrDocument{id=15}, SolrDocument{id=19}, SolrDocument{id=22}, SolrDocument{id=24}, SolrDocument{id=17}]},22={numFound=6,start=0,docs=[SolrDocument{id=13}, SolrDocument{id=15}, SolrDocument{id=19}, SolrDocument{id=20}, SolrDocument{id=24}, SolrDocument{id=17}]},24={numFound=6,start=0,docs=[SolrDocument{id=13}, SolrDocument{id=15}, SolrDocument{id=19}, SolrDocument{id=20}, SolrDocument{id=22}, SolrDocument{id=17}]},17={numFound=6,start=0,docs=[SolrDocument{id=13}, SolrDocument{id=15}, SolrDocument{id=19}, SolrDocument{id=20}, SolrDocument{id=22}, SolrDocument{id=24}]}}}
[junit4:junit4]   2> 3052 T2519 C181 oashc.MoreLikeThisComponent.handleResponses MLT Query returned: {responseHeader={status=0,QTime=7},response={numFound=7,start=0,maxScore=0.58267975,docs=[SolrDocument{id=13, score=0.58267975}, SolrDocument{id=15, score=0.58267975}, SolrDocument{id=19, score=0.58267975}, SolrDocument{id=20, score=0.58267975}, SolrDocument{id=22, score=0.58267975}, SolrDocument{id=24, score=0.58267975}, SolrDocument{id=17, score=0.4661438}]},moreLikeThis={13={numFound=6,start=0,docs=[SolrDocument{id=15}, SolrDocument{id=19}, SolrDocument{id=20}, SolrDocument{id=22}, SolrDocument{id=24}, SolrDocument{id=17}]},15={numFound=6,start=0,docs=[SolrDocument{id=13}, SolrDocument{id=19}, SolrDocument{id=20}, SolrDocument{id=22}, SolrDocument{id=24}, SolrDocument{id=17}]},19={numFound=6,start=0,docs=[SolrDocument{id=13}, SolrDocument{id=15}, SolrDocument{id=20}, SolrDocument{id=22}, SolrDocument{id=24}, SolrDocument{id=17}]},20={numFound=6,start=0,docs=[SolrDocument{id=13}, SolrDocument{id=15}, SolrDocument{id=19}, SolrDocument{id=22}, SolrDocument{id=24}, SolrDocument{id=17}]},22={numFound=6,start=0,docs=[SolrDocument{id=13}, SolrDocument{id=15}, SolrDocument{id=19}, SolrDocument{id=20}, SolrDocument{id=24}, SolrDocument{id=17}]},24={numFound=6,start=0,docs=[SolrDocument{id=13}, SolrDocument{id=15}, SolrDocument{id=19}, SolrDocument{id=20}, SolrDocument{id=22}, SolrDocument{id=17}]},17={numFound=6,start=0,docs=[SolrDocument{id=13}, SolrDocument{id=15}, SolrDocument{id=19}, SolrDocument{id=20}, SolrDocument{id=22}, SolrDocument{id=24}]}}}
[junit4:junit4]   2> 3053 T2519 C181 oashc.MoreLikeThisComponent.handleResponses MLT Query returned: {responseHeader={status=0,QTime=7},response={numFound=6,start=0,maxScore=0.6565079,docs=[SolrDocument{id=14, score=0.6565079}, SolrDocument{id=16, score=0.6565079}, SolrDocument{id=18, score=0.6565079}, SolrDocument{id=21, score=0.6565079}, SolrDocument{id=23, score=0.6565079}, SolrDocument{id=7, score=0.5570654}]},moreLikeThis={14={numFound=6,start=0,docs=[SolrDocument{id=16}, SolrDocument{id=18}, SolrDocument{id=21}, SolrDocument{id=23}, SolrDocument{id=7}, SolrDocument{id=9}]},16={numFound=6,start=0,docs=[SolrDocument{id=14}, SolrDocument{id=18}, SolrDocument{id=21}, SolrDocument{id=23}, SolrDocument{id=7}, SolrDocument{id=9}]},18={numFound=6,start=0,docs=[SolrDocument{id=14}, SolrDocument{id=16}, SolrDocument{id=21}, SolrDocument{id=23}, SolrDocument{id=7}, SolrDocument{id=9}]},21={numFound=6,start=0,docs=[SolrDocument{id=14}, SolrDocument{id=16}, SolrDocument{id=18}, SolrDocument{id=23}, SolrDocument{id=7}, SolrDocument{id=9}]},23={numFound=6,start=0,docs=[SolrDocument{id=14}, SolrDocument{id=16}, SolrDocument{id=18}, SolrDocument{id=21}, SolrDocument{id=7}, SolrDocument{id=9}]},7={numFound=0,start=0,docs=[]}}}
[junit4:junit4]   2> 3054 T2519 C181 oashc.MoreLikeThisComponent.handleResponses MLT Query returned: {responseHeader={status=0,QTime=3},response={numFound=6,start=0,maxScore=0.6565079,docs=[SolrDocument{id=14, score=0.6565079}, SolrDocument{id=18, score=0.6565079}, SolrDocument{id=21, score=0.6565079}, SolrDocument{id=23, score=0.6565079}, SolrDocument{id=7, score=0.5570654}, SolrDocument{id=9, score=0.5252063}]},moreLikeThis={14={numFound=6,start=0,docs=[SolrDocument{id=16}, SolrDocument{id=18}, SolrDocument{id=21}, SolrDocument{id=23}, SolrDocument{id=7}, SolrDocument{id=9}]},18={numFound=6,start=0,docs=[SolrDocument{id=14}, SolrDocument{id=16}, SolrDocument{id=21}, SolrDocument{id=23}, SolrDocument{id=7}, SolrDocument{id=9}]},21={numFound=6,start=0,docs=[SolrDocument{id=14}, SolrDocument{id=16}, SolrDocument{id=18}, SolrDocument{id=23}, SolrDocument{id=7}, SolrDocument{id=9}]},23={numFound=6,start=0,docs=[SolrDocument{id=14}, SolrDocument{id=16}, SolrDocument{id=18}, SolrDocument{id=21}, SolrDocument{id=7}, SolrDocument{id=9}]},7={numFound=0,start=0,docs=[]},9={numFound=6,start=0,docs=[SolrDocument{id=14}, SolrDocument{id=16}, SolrDocument{id=18}, SolrDocument{id=21}, SolrDocument{id=23}, SolrDocument{id=7}]}}}
[junit4:junit4]   2> 3054 T2519 C181 oashc.MoreLikeThisComponent.handleResponses MLT Query returned: {responseHeader={status=0,QTime=7},response={numFound=7,start=0,maxScore=0.58267975,docs=[SolrDocument{id=13, score=0.58267975}, SolrDocument{id=15, score=0.58267975}, SolrDocument{id=19, score=0.58267975}, SolrDocument{id=20, score=0.58267975}, SolrDocument{id=22, score=0.58267975}, SolrDocument{id=24, score=0.58267975}, SolrDocument{id=17, score=0.4661438}]},moreLikeThis={13={numFound=6,start=0,docs=[SolrDocument{id=15}, SolrDocument{id=19}, SolrDocument{id=20}, SolrDocument{id=22}, SolrDocument{id=24}, SolrDocument{id=17}]},15={numFound=6,start=0,docs=[SolrDocument{id=13}, SolrDocument{id=19}, SolrDocument{id=20}, SolrDocument{id=22}, SolrDocument{id=24}, SolrDocument{id=17}]},19={numFound=6,start=0,docs=[SolrDocument{id=13}, SolrDocument{id=15}, SolrDocument{id=20}, SolrDocument{id=22}, SolrDocument{id=24}, SolrDocument{id=17}]},20={numFound=6,start=0,docs=[SolrDocument{id=13}, SolrDocument{id=15}, SolrDocument{id=19}, SolrDocument{id=22}, SolrDocument{id=24}, SolrDocument{id=17}]},22={numFound=6,start=0,docs=[SolrDocument{id=13}, SolrDocument{id=15}, SolrDocument{id=19}, SolrDocument{id=20}, SolrDocument{id=24}, SolrDocument{id=17}]},24={numFound=6,start=0,docs=[SolrDocument{id=13}, SolrDocument{id=15}, SolrDocument{id=19}, SolrDocument{id=20}, SolrDocument{id=22}, SolrDocument{id=17}]},17={numFound=6,start=0,docs=[SolrDocument{id=13}, SolrDocument{id=15}, SolrDocument{id=19}, SolrDocument{id=20}, SolrDocument{id=22}, SolrDocument{id=24}]}}}
[junit4:junit4]   2> 3055 T2519 C181 oashc.MoreLikeThisComponent.handleResponses MLT Query returned: {responseHeader={status=0,QTime=4},response={numFound=7,start=0,maxScore=0.6565079,docs=[SolrDocument{id=14, score=0.6565079}, SolrDocument{id=16, score=0.6565079}, SolrDocument{id=18, score=0.6565079}, SolrDocument{id=21, score=0.6565079}, SolrDocument{id=23, score=0.6565079}, SolrDocument{id=7, score=0.5570654}, SolrDocument{id=9, score=0.5252063}]},moreLikeThis={14={numFound=6,start=0,docs=[SolrDocument{id=16}, SolrDocument{id=18}, SolrDocument{id=21}, SolrDocument{id=23}, SolrDocument{id=7}, SolrDocument{id=9}]},16={numFound=6,start=0,docs=[SolrDocument{id=14}, SolrDocument{id=18}, SolrDocument{id=21}, SolrDocument{id=23}, SolrDocument{id=7}, SolrDocument{id=9}]},18={numFound=6,start=0,docs=[SolrDocument{id=14}, SolrDocument{id=16}, SolrDocument{id=21}, SolrDocument{id=23}, SolrDocument{id=7}, SolrDocument{id=9}]},21={numFound=6,start=0,docs=[SolrDocument{id=14}, SolrDocument{id=16}, SolrDocument{id=18}, SolrDocument{id=23}, SolrDocument{id=7}, SolrDocument{id=9}]},23={numFound=6,start=0,docs=[SolrDocument{id=14}, SolrDocument{id=16}, SolrDocument{id=18}, SolrDocument{id=21}, SolrDocument{id=7}, SolrDocument{id=9}]},7={numFound=0,start=0,docs=[]},9={numFound=6,start=0,docs=[SolrDocument{id=14}, SolrDocument{id=16}, SolrDocument{id=18}, SolrDocument{id=21}, SolrDocument{id=23}, SolrDocument{id=7}]}}}
[junit4:junit4]   2> 3056 T2519 C181 oashc.MoreLikeThisComponent.handleResponses MLT Query returned: {responseHeader={status=0,QTime=12},response={numFound=6,start=0,maxScore=0.58267975,docs=[SolrDocument{id=13, score=0.58267975}, SolrDocument{id=15, score=0.58267975}, SolrDocument{id=20, score=0.58267975}, SolrDocument{id=22, score=0.58267975}, SolrDocument{id=24, score=0.58267975}, SolrDocument{id=17, score=0.4661438}]},moreLikeThis={13={numFound=6,start=0,docs=[SolrDocument{id=15}, SolrDocument{id=19}, SolrDocument{id=20}, SolrDocument{id=22}, SolrDocument{id=24}, SolrDocument{id=17}]},15={numFound=6,start=0,docs=[SolrDocument{id=13}, SolrDocument{id=19}, SolrDocument{id=20}, SolrDocument{id=22}, SolrDocument{id=24}, SolrDocument{id=17}]},20={numFound=6,start=0,docs=[SolrDocument{id=13}, SolrDocument{id=15}, SolrDocument{id=19}, SolrDocument{id=22}, SolrDocument{id=24}, SolrDocument{id=17}]},22={numFound=6,start=0,docs=[SolrDocument{id=13}, SolrDocument{id=15}, SolrDocument{id=19}, SolrDocument{id=20}, SolrDocument{id=24}, SolrDocument{id=17}]},24={numFound=6,start=0,docs=[SolrDocument{id=13}, SolrDocument{id=15}, SolrDocument{id=19}, SolrDocument{id=20}, SolrDocument{id=22}, SolrDocument{id=17}]},17={numFound=6,start=0,docs=[SolrDocument{id=13}, SolrDocument{id=15}, SolrDocument{id=19}, SolrDocument{id=20}, SolrDocument{id=22}, SolrDocument{id=24}]}}}
[junit4:junit4]   2> 3056 T2519 C181 oashc.MoreLikeThisComponent.handleResponses MLT Query returned: {responseHeader={status=0,QTime=8},response={numFound=7,start=0,maxScore=0.6565079,docs=[SolrDocument{id=14, score=0.6565079}, SolrDocument{id=16, score=0.6565079}, SolrDocument{id=18, score=0.6565079}, SolrDocument{id=21, score=0.6565079}, SolrDocument{id=23, score=0.6565079}, SolrDocument{id=7, score=0.5570654}, SolrDocument{id=9, score=0.5252063}]},moreLikeThis={14={numFound=6,start=0,docs=[SolrDocument{id=16}, SolrDocument{id=18}, SolrDocument{id=21}, SolrDocument{id=23}, SolrDocument{id=7}, SolrDocument{id=9}]},16={numFound=6,start=0,docs=[SolrDocument{id=14}, SolrDocument{id=18}, SolrDocument{id=21}, SolrDocument{id=23}, SolrDocument{id=7}, SolrDocument{id=9}]},18={numFound=6,start=0,docs=[SolrDocument{id=14}, SolrDocument{id=16}, SolrDocument{id=21}, SolrDocument{id=23}, SolrDocument{id=7}, SolrDocument{id=9}]},21={numFound=6,start=0,docs=[SolrDocument{id=14}, SolrDocument{id=16}, SolrDocument{id=18}, SolrDocument{id=23}, SolrDocument{id=7}, SolrDocument{id=9}]},23={numFound=6,start=0,docs=[SolrDocument{id=14}, SolrDocument{id=16}, SolrDocument{id=18}, SolrDocument{id=21}, SolrDocument{id=7}, SolrDocument{id=9}]},7={numFound=0,start=0,docs=[]},9={numFound=6,start=0,docs=[SolrDocument{id=14}, SolrDocument{id=16}, SolrDocument{id=18}, SolrDocument{id=21}, SolrDocument{id=23}, SolrDocument{id=7}]}}}
[junit4:junit4]   2> 3057 T2519 C181 oashc.MoreLikeThisComponent.handleResponses MLT Query returned: {responseHeader={status=0,QTime=9},response={numFound=6,start=0,maxScore=0.58267975,docs=[SolrDocument{id=15, score=0.58267975}, SolrDocument{id=19, score=0.58267975}, SolrDocument{id=20, score=0.58267975}, SolrDocument{id=22, score=0.58267975}, SolrDocument{id=24, score=0.58267975}, SolrDocument{id=17, score=0.4661438}]},moreLikeThis={15={numFound=6,start=0,docs=[SolrDocument{id=13}, SolrDocument{id=19}, SolrDocument{id=20}, SolrDocument{id=22}, SolrDocument{id=24}, SolrDocument{id=17}]},19={numFound=6,start=0,docs=[SolrDocument{id=13}, SolrDocument{id=15}, SolrDocument{id=20}, SolrDocument{id=22}, SolrDocument{id=24}, SolrDocument{id=17}]},20={numFound=6,start=0,docs=[SolrDocument{id=13}, SolrDocument{id=15}, SolrDocument{id=19}, SolrDocument{id=22}, SolrDocument{id=24}, SolrDocument{id=17}]},22={numFound=6,start=0,docs=[SolrDocument{id=13}, SolrDocument{id=15}, SolrDocument{id=19}, SolrDocument{id=20}, SolrDocument{id=24}, SolrDocument{id=17}]},24={numFound=6,start=0,docs=[SolrDocument{id=13}, SolrDocument{id=15}, SolrDocument{id=19}, SolrDocument{id=20}, SolrDocument{id=22}, SolrDocument{id=17}]},17={numFound=6,start=0,docs=[SolrDocument{id=13}, SolrDocument{id=15}, SolrDocument{id=19}, SolrDocument{id=20}, SolrDocument{id=22}, SolrDocument{id=24}]}}}
[junit4:junit4]   2> 3058 T2519 C181 oashc.MoreLikeThisComponent.handleResponses MLT Query returned: {responseHeader={status=0,QTime=7},response={numFound=7,start=0,maxScore=0.58267975,docs=[SolrDocument{id=13, score=0.58267975}, SolrDocument{id=15, score=0.58267975}, SolrDocument{id=19, score=0.58267975}, SolrDocument{id=20, score=0.58267975}, SolrDocument{id=22, score=0.58267975}, SolrDocument{id=24, score=0.58267975}, SolrDocument{id=17, score=0.4661438}]},moreLikeThis={13={numFound=6,start=0,docs=[SolrDocument{id=15}, SolrDocument{id=19}, SolrDocument{id=20}, SolrDocument{id=22}, SolrDocument{id=24}, SolrDocument{id=17}]},15={numFound=6,start=0,docs=[SolrDocument{id=13}, SolrDocument{id=19}, SolrDocument{id=20}, SolrDocument{id=22}, SolrDocument{id=24}, SolrDocument{id=17}]},19={numFound=6,start=0,docs=[SolrDocument{id=13}, SolrDocument{id=15}, SolrDocument{id=20}, SolrDocument{id=22}, SolrDocument{id=24}, SolrDocument{id=17}]},20={numFound=6,start=0,docs=[SolrDocument{id=13}, SolrDocument{id=15}, SolrDocument{id=19}, SolrDocument{id=22}, SolrDocument{id=24}, SolrDocument{id=17}]},22={numFound=6,start=0,docs=[SolrDocument{id=13}, SolrDocument{id=15}, SolrDocument{id=19}, SolrDocument{id=20}, SolrDocument{id=24}, SolrDocument{id=17}]},24={numFound=6,start=0,docs=[SolrDocument{id=13}, SolrDocument{id=15}, SolrDocument{id=19}, SolrDocument{id=20}, SolrDocument{id=22}, SolrDocument{id=17}]},17={numFound=6,start=0,docs=[SolrDocument{id=13}, SolrDocument{id=15}, SolrDocument{id=19}, SolrDocument{id=20}, SolrDocument{id=22}, SolrDocument{id=24}]}}}
[junit4:junit4]   2> 3058 T2519 C181 oashc.MoreLikeThisComponent.handleResponses MLT Query returned: {responseHeader={status=0,QTime=7},response={numFound=6,start=0,maxScore=0.6565079,docs=[SolrDocument{id=14, score=0.6565079}, SolrDocument{id=16, score=0.6565079}, SolrDocument{id=21, score=0.6565079}, SolrDocument{id=23, score=0.6565079}, SolrDocument{id=7, score=0.5570654}, SolrDocument{id=9, score=0.5252063}]},moreLikeThis={14={numFound=6,start=0,docs=[SolrDocument{id=16}, SolrDocument{id=18}, SolrDocument{id=21}, SolrDocument{id=23}, SolrDocument{id=7}, SolrDocument{id=9}]},16={numFound=6,start=0,docs=[SolrDocument{id=14}, SolrDocument{id=18}, SolrDocument{id=21}, SolrDocument{id=23}, SolrDocument{id=7}, SolrDocument{id=9}]},21={numFound=6,start=0,docs=[SolrDocument{id=14}, SolrDocument{id=16}, SolrDocument{id=18}, SolrDocument{id=23}, SolrDocument{id=7}, SolrDocument{id=9}]},23={numFound=6,start=0,docs=[SolrDocument{id=14}, SolrDocument{id=16}, SolrDocument{id=18}, SolrDocument{id=21}, SolrDocument{id=7}, SolrDocument{id=9}]},7={numFound=0,start=0,docs=[]},9={numFound=6,start=0,docs=[SolrDocument{id=14}, SolrDocument{id=16}, SolrDocument{id=18}, SolrDocument{id=21}, SolrDocument{id=23}, SolrDocument{id=7}]}}}
[junit4:junit4]   2> 33038 T2519 C181 oasc.SolrException.log SEVERE org.apache.solr.common.SolrException: org.apache.solr.client.solrj.SolrServerException: Timeout occured while waiting response from server at: http://127.0.0.1:19246/fw_g/xc
[junit4:junit4]   2> 		at org.apache.solr.handler.component.SearchHandler.handleRequestBody(SearchHandler.java:302)
[junit4:junit4]   2> 		at org.apache.solr.handler.RequestHandlerBase.handleRequest(RequestHandlerBase.java:146)
[junit4:junit4]   2> 		at org.apache.solr.core.SolrCore.execute(SolrCore.java:1819)
[junit4:junit4]   2> 		at org.apache.solr.servlet.SolrDispatchFilter.execute(SolrDispatchFilter.java:458)
[junit4:junit4]   2> 		at org.apache.solr.servlet.SolrDispatchFilter.doFilter(SolrDispatchFilter.java:279)
[junit4:junit4]   2> 		at org.eclipse.jetty.servlet.ServletHandler$CachedChain.doFilter(ServletHandler.java:1307)
[junit4:junit4]   2> 		at org.apache.solr.client.solrj.embedded.JettySolrRunner$DebugFilter.doFilter(JettySolrRunner.java:116)
[junit4:junit4]   2> 		at org.eclipse.jetty.servlet.ServletHandler$CachedChain.doFilter(ServletHandler.java:1307)
[junit4:junit4]   2> 		at org.eclipse.jetty.servlet.ServletHandler.doHandle(ServletHandler.java:453)
[junit4:junit4]   2> 		at org.eclipse.jetty.server.session.SessionHandler.doHandle(SessionHandler.java:229)
[junit4:junit4]   2> 		at org.eclipse.jetty.server.handler.ScopedHandler.handle(ScopedHandler.java:137)
[junit4:junit4]   2> 		at org.eclipse.jetty.server.handler.GzipHandler.handle(GzipHandler.java:275)
[junit4:junit4]   2> 		at org.eclipse.jetty.server.handler.ContextHandler.doHandle(ContextHandler.java:1074)
[junit4:junit4]   2> 		at org.eclipse.jetty.servlet.ServletHandler.doScope(ServletHandler.java:382)
[junit4:junit4]   2> 		at org.eclipse.jetty.server.session.SessionHandler.doScope(SessionHandler.java:193)
[junit4:junit4]   2> 		at org.eclipse.jetty.server.handler.ContextHandler.doScope(ContextHandler.java:1006)
[junit4:junit4]   2> 		at org.eclipse.jetty.server.handler.ScopedHandler.handle(ScopedHandler.java:135)
[junit4:junit4]   2> 		at org.eclipse.jetty.server.handler.HandlerWrapper.handle(HandlerWrapper.java:116)
[junit4:junit4]   2> 		at org.eclipse.jetty.server.Server.handle(Server.java:365)
[junit4:junit4]   2> 		at org.eclipse.jetty.server.AbstractHttpConnection.handleRequest(AbstractHttpConnection.java:485)
[junit4:junit4]   2> 		at org.eclipse.jetty.server.BlockingHttpConnection.handleRequest(BlockingHttpConnection.java:53)
[junit4:junit4]   2> 		at org.eclipse.jetty.server.AbstractHttpConnection.headerComplete(AbstractHttpConnection.java:926)
[junit4:junit4]   2> 		at org.eclipse.jetty.server.AbstractHttpConnection$RequestHandler.headerComplete(AbstractHttpConnection.java:988)
[junit4:junit4]   2> 		at org.eclipse.jetty.http.HttpParser.parseNext(HttpParser.java:635)
[junit4:junit4]   2> 		at org.eclipse.jetty.http.HttpParser.parseAvailable(HttpParser.java:235)
[junit4:junit4]   2> 		at org.eclipse.jetty.server.BlockingHttpConnection.handle(BlockingHttpConnection.java:72)
[junit4:junit4]   2> 		at org.eclipse.jetty.server.bio.SocketConnector$ConnectorEndPoint.run(SocketConnector.java:264)
[junit4:junit4]   2> 		at org.eclipse.jetty.util.thread.QueuedThreadPool.runJob(QueuedThreadPool.java:608)
[junit4:junit4]   2> 		at org.eclipse.jetty.util.thread.QueuedThreadPool$3.run(QueuedThreadPool.java:543)
[junit4:junit4]   2> 		at java.lang.Thread.run(Thread.java:679)
[junit4:junit4]   2> 	Caused by: org.apache.solr.client.solrj.SolrServerException: Timeout occured while waiting response from server at: http://127.0.0.1:19246/fw_g/xc
[junit4:junit4]   2> 		at org.apache.solr.client.solrj.impl.HttpSolrServer.request(HttpSolrServer.java:409)
[junit4:junit4]   2> 		at org.apache.solr.client.solrj.impl.HttpSolrServer.request(HttpSolrServer.java:181)
[junit4:junit4]   2> 		at org.apache.solr.handler.component.HttpShardHandler$1.call(HttpShardHandler.java:169)
[junit4:junit4]   2> 		at org.apache.solr.handler.component.HttpShardHandler$1.call(HttpShardHandler.java:135)
[junit4:junit4]   2> 		at java.util.concurrent.FutureTask$Sync.innerRun(FutureTask.java:334)
[junit4:junit4]   2> 		at java.util.concurrent.FutureTask.run(FutureTask.java:166)
[junit4:junit4]   2> 		at java.util.concurrent.Executors$RunnableAdapter.call(Executors.java:471)
[junit4:junit4]   2> 		at java.util.concurrent.FutureTask$Sync.innerRun(FutureTask.java:334)
[junit4:junit4]   2> 		at java.util.concurrent.FutureTask.run(FutureTask.java:166)
[junit4:junit4]   2> 		at java.util.concurrent.ThreadPoolExecutor.runWorker(ThreadPoolExecutor.java:1110)
[junit4:junit4]   2> 		at java.util.concurrent.ThreadPoolExecutor$Worker.run(ThreadPoolExecutor.java:603)
[junit4:junit4]   2> 		... 1 more
[junit4:junit4]   2> 	Caused by: java.net.SocketTimeoutException: Read timed out
[junit4:junit4]   2> 		at java.net.SocketInputStream.socketRead0(Native Method)
[junit4:junit4]   2> 		at java.net.SocketInputStream.read(SocketInputStream.java:146)
[junit4:junit4]   2> 		at org.apache.http.impl.io.AbstractSessionInputBuffer.fillBuffer(AbstractSessionInputBuffer.java:149)
[junit4:junit4]   2> 		at org.apache.http.impl.io.SocketInputBuffer.fillBuffer(SocketInputBuffer.java:111)
[junit4:junit4]   2> 		at org.apache.http.impl.io.AbstractSessionInputBuffer.readLine(AbstractSessionInputBuffer.java:264)
[junit4:junit4]   2> 		at org.apache.http.impl.conn.DefaultResponseParser.parseHead(DefaultResponseParser.java:98)
[junit4:junit4]   2> 		at org.apache.http.impl.io.AbstractMessageParser.parse(AbstractMessageParser.java:252)
[junit4:junit4]   2> 		at org.apache.http.impl.AbstractHttpClientConnection.receiveResponseHeader(AbstractHttpClientConnection.java:282)
[junit4:junit4]   2> 		at org.apache.http.impl.conn.DefaultClientConnection.receiveResponseHeader(DefaultClientConnection.java:247)
[junit4:junit4]   2> 		at org.apache.http.impl.conn.AbstractClientConnAdapter.receiveResponseHeader(AbstractClientConnAdapter.java:216)
[junit4:junit4]   2> 		at org.apache.http.protocol.HttpRequestExecutor.doReceiveResponse(HttpRequestExecutor.java:298)
[junit4:junit4]   2> 		at org.apache.http.protocol.HttpRequestExecutor.execute(HttpRequestExecutor.java:125)
[junit4:junit4]   2> 		at org.apache.http.impl.client.DefaultRequestDirector.tryExecute(DefaultRequestDirector.java:647)
[junit4:junit4]   2> 		at org.apache.http.impl.client.DefaultRequestDirector.execute(DefaultRequestDirector.java:464)
[junit4:junit4]   2> 		at org.apache.http.impl.client.AbstractHttpClient.execute(AbstractHttpClient.java:820)
[junit4:junit4]   2> 		at org.apache.http.impl.client.AbstractHttpClient.execute(AbstractHttpClient.java:754)
[junit4:junit4]   2> 		at org.apache.http.impl.client.AbstractHttpClient.execute(AbstractHttpClient.java:732)
[junit4:junit4]   2> 		at org.apache.solr.client.solrj.impl.HttpSolrServer.request(HttpSolrServer.java:352)
[junit4:junit4]   2> 		... 11 more
[junit4:junit4]   2> 	
[junit4:junit4]   2> 33040 T2519 C181 REQ [collection1] webapp=/fw_g/xc path=/select params={fl=id&sort=id+desc&mlt.fl=lowerfilt&shards=127.0.0.1:19246/fw_g/xc,[ff01::083]:33332/fw_g/xc|127.0.0.1:29638/fw_g/xc|[ff01::213]:33332/fw_g/xc&shards.qt=mltrh&q=lowerfilt:fox&mlt=true&qt=mltrh&wt=javabin&version=2} hits=13 status=500 QTime=30019 
[junit4:junit4]   2> 33040 T2519 C181 oasc.SolrException.log SEVERE null:org.apache.solr.common.SolrException: org.apache.solr.client.solrj.SolrServerException: Timeout occured while waiting response from server at: http://127.0.0.1:19246/fw_g/xc
[junit4:junit4]   2> 		at org.apache.solr.handler.component.SearchHandler.handleRequestBody(SearchHandler.java:302)
[junit4:junit4]   2> 		at org.apache.solr.handler.RequestHandlerBase.handleRequest(RequestHandlerBase.java:146)
[junit4:junit4]   2> 		at org.apache.solr.core.SolrCore.execute(SolrCore.java:1819)
[junit4:junit4]   2> 		at org.apache.solr.servlet.SolrDispatchFilter.execute(SolrDispatchFilter.java:458)
[junit4:junit4]   2> 		at org.apache.solr.servlet.SolrDispatchFilter.doFilter(SolrDispatchFilter.java:279)
[junit4:junit4]   2> 		at org.eclipse.jetty.servlet.ServletHandler$CachedChain.doFilter(ServletHandler.java:1307)
[junit4:junit4]   2> 		at org.apache.solr.client.solrj.embedded.JettySolrRunner$DebugFilter.doFilter(JettySolrRunner.java:116)
[junit4:junit4]   2> 		at org.eclipse.jetty.servlet.ServletHandler$CachedChain.doFilter(ServletHandler.java:1307)
[junit4:junit4]   2> 		at org.eclipse.jetty.servlet.ServletHandler.doHandle(ServletHandler.java:453)
[junit4:junit4]   2> 		at org.eclipse.jetty.server.session.SessionHandler.doHandle(SessionHandler.java:229)
[junit4:junit4]   2> 		at org.eclipse.jetty.server.handler.ScopedHandler.handle(ScopedHandler.java:137)
[junit4:junit4]   2> 		at org.eclipse.jetty.server.handler.GzipHandler.handle(GzipHandler.java:275)
[junit4:junit4]   2> 		at org.eclipse.jetty.server.handler.ContextHandler.doHandle(ContextHandler.java:1074)
[junit4:junit4]   2> 		at org.eclipse.jetty.servlet.ServletHandler.doScope(ServletHandler.java:382)
[junit4:junit4]   2> 		at org.eclipse.jetty.server.session.SessionHandler.doScope(SessionHandler.java:193)
[junit4:junit4]   2> 		at org.eclipse.jetty.server.handler.ContextHandler.doScope(ContextHandler.java:1006)
[junit4:junit4]   2> 		at org.eclipse.jetty.server.handler.ScopedHandler.handle(ScopedHandler.java:135)
[junit4:junit4]   2> 		at org.eclipse.jetty.server.handler.HandlerWrapper.handle(HandlerWrapper.java:116)
[junit4:junit4]   2> 		at org.eclipse.jetty.server.Server.handle(Server.java:365)
[junit4:junit4]   2> 		at org.eclipse.jetty.server.AbstractHttpConnection.handleRequest(AbstractHttpConnection.java:485)
[junit4:junit4]   2> 		at org.eclipse.jetty.server.BlockingHttpConnection.handleRequest(BlockingHttpConnection.java:53)
[junit4:junit4]   2> 		at org.eclipse.jetty.server.AbstractHttpConnection.headerComplete(AbstractHttpConnection.java:926)
[junit4:junit4]   2> 		at org.eclipse.jetty.server.AbstractHttpConnection$RequestHandler.headerComplete(AbstractHttpConnection.java:988)
[junit4:junit4]   2> 		at org.eclipse.jetty.http.HttpParser.parseNext(HttpParser.java:635)
[junit4:junit4]   2> 		at org.eclipse.jetty.http.HttpParser.parseAvailable(HttpParser.java:235)
[junit4:junit4]   2> 		at org.eclipse.jetty.server.BlockingHttpConnection.handle(BlockingHttpConnection.java:72)
[junit4:junit4]   2> 		at org.eclipse.jetty.server.bio.SocketConnector$ConnectorEndPoint.run(SocketConnector.java:264)
[junit4:junit4]   2> 		at org.eclipse.jetty.util.thread.QueuedThreadPool.runJob(QueuedThreadPool.java:608)
[junit4:junit4]   2> 		at org.eclipse.jetty.util.thread.QueuedThreadPool$3.run(QueuedThreadPool.java:543)
[junit4:junit4]   2> 		at java.lang.Thread.run(Thread.java:679)
[junit4:junit4]   2> 	Caused by: org.apache.solr.client.solrj.SolrServerException: Timeout occured while waiting response from server at: http://127.0.0.1:19246/fw_g/xc
[junit4:junit4]   2> 		at org.apache.solr.client.solrj.impl.HttpSolrServer.request(HttpSolrServer.java:409)
[junit4:junit4]   2> 		at org.apache.solr.client.solrj.impl.HttpSolrServer.request(HttpSolrServer.java:181)
[junit4:junit4]   2> 		at org.apache.solr.handler.component.HttpShardHandler$1.call(HttpShardHandler.java:169)
[junit4:junit4]   2> 		at org.apache.solr.handler.component.HttpShardHandler$1.call(HttpShardHandler.java:135)
[junit4:junit4]   2> 		at java.util.concurrent.FutureTask$Sync.innerRun(FutureTask.java:334)
[junit4:junit4]   2> 		at java.util.concurrent.FutureTask.run(FutureTask.java:166)
[junit4:junit4]   2> 		at java.util.concurrent.Executors$RunnableAdapter.call(Executors.java:471)
[junit4:junit4]   2> 		at java.util.concurrent.FutureTask$Sync.innerRun(FutureTask.java:334)
[junit4:junit4]   2> 		at java.util.concurrent.FutureTask.run(FutureTask.java:166)
[junit4:junit4]   2> 		at java.util.concurrent.ThreadPoolExecutor.runWorker(ThreadPoolExecutor.java:1110)
[junit4:junit4]   2> 		at java.util.concurrent.ThreadPoolExecutor$Worker.run(ThreadPoolExecutor.java:603)
[junit4:junit4]   2> 		... 1 more
[junit4:junit4]   2> 	Caused by: java.net.SocketTimeoutException: Read timed out
[junit4:junit4]   2> 		at java.net.SocketInputStream.socketRead0(Native Method)
[junit4:junit4]   2> 		at java.net.SocketInputStream.read(SocketInputStream.java:146)
[junit4:junit4]   2> 		at org.apache.http.impl.io.AbstractSessionInputBuffer.fillBuffer(AbstractSessionInputBuffer.java:149)
[junit4:junit4]   2> 		at org.apache.http.impl.io.SocketInputBuffer.fillBuffer(SocketInputBuffer.java:111)
[junit4:junit4]   2> 		at org.apache.http.impl.io.AbstractSessionInputBuffer.readLine(AbstractSessionInputBuffer.java:264)
[junit4:junit4]   2> 		at org.apache.http.impl.conn.DefaultResponseParser.parseHead(DefaultResponseParser.java:98)
[junit4:junit4]   2> 		at org.apache.http.impl.io.AbstractMessageParser.parse(AbstractMessageParser.java:252)
[junit4:junit4]   2> 		at org.apache.http.impl.AbstractHttpClientConnection.receiveResponseHeader(AbstractHttpClientConnection.java:282)
[junit4:junit4]   2> 		at org.apache.http.impl.conn.DefaultClientConnection.receiveResponseHeader(DefaultClientConnection.java:247)
[junit4:junit4]   2> 		at org.apache.http.impl.conn.AbstractClientConnAdapter.receiveResponseHeader(AbstractClientConnAdapter.java:216)
[junit4:junit4]   2> 		at org.apache.http.protocol.HttpRequestExecutor.doReceiveResponse(HttpRequestExecutor.java:298)
[junit4:junit4]   2> 		at org.apache.http.protocol.HttpRequestExecutor.execute(HttpRequestExecutor.java:125)
[junit4:junit4]   2> 		at org.apache.http.impl.client.DefaultRequestDirector.tryExecute(DefaultRequestDirector.java:647)
[junit4:junit4]   2> 		at org.apache.http.impl.client.DefaultRequestDirector.execute(DefaultRequestDirector.java:464)
[junit4:junit4]   2> 		at org.apache.http.impl.client.AbstractHttpClient.execute(AbstractHttpClient.java:820)
[junit4:junit4]   2> 		at org.apache.http.impl.client.AbstractHttpClient.execute(AbstractHttpClient.java:754)
[junit4:junit4]   2> 		at org.apache.http.impl.client.AbstractHttpClient.execute(AbstractHttpClient.java:732)
[junit4:junit4]   2> 		at org.apache.solr.client.solrj.impl.HttpSolrServer.request(HttpSolrServer.java:352)
[junit4:junit4]   2> 		... 11 more
[junit4:junit4]   2> 	
[junit4:junit4]   2> 33042 T2504 oasc.CoreContainer.shutdown Shutting down CoreContainer instance=1642354014
[junit4:junit4]   2> 33043 T2504 oasc.SolrCore.close [collection1]  CLOSING SolrCore org.apache.solr.core.SolrCore@40badc7b
[junit4:junit4]   2> 33047 T2504 oasu.DirectUpdateHandler2.close closing DirectUpdateHandler2{commits=1,autocommits=0,soft autocommits=0,optimizes=0,rollbacks=0,expungeDeletes=0,docsPending=0,adds=0,deletesById=0,deletesByQuery=0,errors=0,cumulative_adds=24,cumulative_deletesById=0,cumulative_deletesByQuery=1,cumulative_errors=0}
[junit4:junit4]   2> 33049 T2504 oasc.SolrCore.decrefSolrCoreState Closing SolrCoreState
[junit4:junit4]   2> 33050 T2504 oasu.DefaultSolrCoreState.closeIndexWriter SolrCoreState ref count has reached 0 - closing IndexWriter
[junit4:junit4]   2> 33050 T2504 oasu.DefaultSolrCoreState.closeIndexWriter closing IndexWriter with IndexWriterCloser
[junit4:junit4]   2> 33052 T2504 C180 oasc.CachingDirectoryFactory.close Releasing directory:/usr/home/hudson/hudson-slave/workspace/Lucene-Solr-Tests-4.x-Java6/solr/build/solr-core/test/J1/./org.apache.solr.handler.component.DistributedMLTComponentTest-1355923282220/control/data/index
[junit4:junit4]   2> 33053 T2504 oasc.SolrCore.closeSearcher [collection1] Closing main searcher on request.
[junit4:junit4]   2> 33053 T2504 oasc.CachingDirectoryFactory.close Releasing directory:/usr/home/hudson/hudson-slave/workspace/Lucene-Solr-Tests-4.x-Java6/solr/build/solr-core/test/J1/./org.apache.solr.handler.component.DistributedMLTComponentTest-1355923282220/control/data/index
[junit4:junit4]   2> 33054 T2504 oasc.CachingDirectoryFactory.close Closing directory when closing factory:/usr/home/hudson/hudson-slave/workspace/Lucene-Solr-Tests-4.x-Java6/solr/build/solr-core/test/J1/./org.apache.solr.handler.component.DistributedMLTComponentTest-1355923282220/control/data/index
[junit4:junit4]   2> 33054 T2504 oasc.CachingDirectoryFactory.closeDirectory Closing directory:/usr/home/hudson/hudson-slave/workspace/Lucene-Solr-Tests-4.x-Java6/solr/build/solr-core/test/J1/./org.apache.solr.handler.component.DistributedMLTComponentTest-1355923282220/control/data/index
[junit4:junit4]   2> 33055 T2504 oasc.CachingDirectoryFactory.close Closing directory when closing factory:/usr/home/hudson/hudson-slave/workspace/Lucene-Solr-Tests-4.x-Java6/solr/build/solr-core/test/J1/./org.apache.solr.handler.component.DistributedMLTComponentTest-1355923282220/control/data
[junit4:junit4]   2> 33055 T2504 oasc.CachingDirectoryFactory.closeDirectory Closing directory:/usr/home/hudson/hudson-slave/workspace/Lucene-Solr-Tests-4.x-Java6/solr/build/solr-core/test/J1/./org.apache.solr.handler.component.DistributedMLTComponentTest-1355923282220/control/data
[junit4:junit4]   2> 33056 T2504 oejsh.ContextHandler.doStop stopped o.e.j.s.ServletContextHandler{/fw_g/xc,null}
[junit4:junit4]   2> 33108 T2504 oasc.CoreContainer.shutdown Shutting down CoreContainer instance=1888151652
[junit4:junit4]   2> 33110 T2504 oasc.SolrCore.close [collection1]  CLOSING SolrCore org.apache.solr.core.SolrCore@18d68de9
[junit4:junit4]   2> 33118 T2504 oasu.DirectUpdateHandler2.close closing DirectUpdateHandler2{commits=1,autocommits=0,soft autocommits=0,optimizes=0,rollbacks=0,expungeDeletes=0,docsPending=0,adds=0,deletesById=0,deletesByQuery=0,errors=0,cumulative_adds=11,cumulative_deletesById=0,cumulative_deletesByQuery=1,cumulative_errors=0}
[junit4:junit4]   2> 33121 T2504 oasc.SolrCore.decrefSolrCoreState Closing SolrCoreState
[junit4:junit4]   2> 33122 T2504 oasu.DefaultSolrCoreState.closeIndexWriter SolrCoreState ref count has reached 0 - closing IndexWriter
[junit4:junit4]   2> 33123 T2504 oasu.DefaultSolrCoreState.closeIndexWriter closing IndexWriter with IndexWriterCloser
[junit4:junit4]   2> 33126 T2504 C181 oasc.CachingDirectoryFactory.close Releasing directory:/usr/home/hudson/hudson-slave/workspace/Lucene-Solr-Tests-4.x-Java6/solr/build/solr-core/test/J1/./org.apache.solr.handler.component.DistributedMLTComponentTest-1355923282220/shard0/data/index
[junit4:junit4]   2> 33127 T2504 oasc.SolrCore.closeSearcher [collection1] Closing main searcher on request.
[junit4:junit4]   2> 33128 T2504 oasc.CachingDirectoryFactory.close Releasing directory:/usr/home/hudson/hudson-slave/workspace/Lucene-Solr-Tests-4.x-Java6/solr/build/solr-core/test/J1/./org.apache.solr.handler.component.DistributedMLTComponentTest-1355923282220/shard0/data/index
[junit4:junit4]   2> 33128 T2504 oasc.CachingDirectoryFactory.close Closing directory when closing factory:/usr/home/hudson/hudson-slave/workspace/Lucene-Solr-Tests-4.x-Java6/solr/build/solr-core/test/J1/./org.apache.solr.handler.component.DistributedMLTComponentTest-1355923282220/shard0/data/index
[junit4:junit4]   2> 33129 T2504 oasc.CachingDirectoryFactory.closeDirectory Closing directory:/usr/home/hudson/hudson-slave/workspace/Lucene-Solr-Tests-4.x-Java6/solr/build/solr-core/test/J1/./org.apache.solr.handler.component.DistributedMLTComponentTest-1355923282220/shard0/data/index
[junit4:junit4]   2> 33130 T2504 oasc.CachingDirectoryFactory.close Closing directory when closing factory:/usr/home/hudson/hudson-slave/workspace/Lucene-Solr-Tests-4.x-Java6/solr/build/solr-core/test/J1/./org.apache.solr.handler.component.DistributedMLTComponentTest-1355923282220/shard0/data
[junit4:junit4]   2> 33130 T2504 oasc.CachingDirectoryFactory.closeDirectory Closing directory:/usr/home/hudson/hudson-slave/workspace/Lucene-Solr-Tests-4.x-Java6/solr/build/solr-core/test/J1/./org.apache.solr.handler.component.DistributedMLTComponentTest-1355923282220/shard0/data
[junit4:junit4]   2> 33132 T2504 oejsh.ContextHandler.doStop stopped o.e.j.s.ServletContextHandler{/fw_g/xc,null}
[junit4:junit4]   2> 33185 T2504 oasc.CoreContainer.shutdown Shutting down CoreContainer instance=122726236
[junit4:junit4]   2> 33186 T2504 oasc.SolrCore.close [collection1]  CLOSING SolrCore org.apache.solr.core.SolrCore@3fa377b8
[junit4:junit4]   2> 33193 T2504 oasu.DirectUpdateHandler2.close closing DirectUpdateHandler2{commits=1,autocommits=0,soft autocommits=0,optimizes=0,rollbacks=0,expungeDeletes=0,docsPending=0,adds=0,deletesById=0,deletesByQuery=0,errors=0,cumulative_adds=13,cumulative_deletesById=0,cumulative_deletesByQuery=1,cumulative_errors=0}
[junit4:junit4]   2> 33217 T2504 oasc.SolrCore.decrefSolrCoreState Closing SolrCoreState
[junit4:junit4]   2> 33218 T2504 oasu.DefaultSolrCoreState.closeIndexWriter SolrCoreState ref count has reached 0 - closing IndexWriter
[junit4:junit4]   2> 33219 T2504 oasu.DefaultSolrCoreState.closeIndexWriter closing IndexWriter with IndexWriterCloser
[junit4:junit4]   2> 33220 T2504 C182 oasc.CachingDirectoryFactory.close Releasing directory:/usr/home/hudson/hudson-slave/workspace/Lucene-Solr-Tests-4.x-Java6/solr/build/solr-core/test/J1/./org.apache.solr.handler.component.DistributedMLTComponentTest-1355923282220/shard1/data/index
[junit4:junit4]   2> 33221 T2504 oasc.SolrCore.closeSearcher [collection1] Closing main searcher on request.
[junit4:junit4]   2> 33221 T2504 oasc.CachingDirectoryFactory.close Releasing directory:/usr/home/hudson/hudson-slave/workspace/Lucene-Solr-Tests-4.x-Java6/solr/build/solr-core/test/J1/./org.apache.solr.handler.component.DistributedMLTComponentTest-1355923282220/shard1/data/index
[junit4:junit4]   2> 33222 T2504 oasc.CachingDirectoryFactory.close Closing directory when closing factory:/usr/home/hudson/hudson-slave/workspace/Lucene-Solr-Tests-4.x-Java6/solr/build/solr-core/test/J1/./org.apache.solr.handler.component.DistributedMLTComponentTest-1355923282220/shard1/data
[junit4:junit4]   2> 33222 T2504 oasc.CachingDirectoryFactory.closeDirectory Closing directory:/usr/home/hudson/hudson-slave/workspace/Lucene-Solr-Tests-4.x-Java6/solr/build/solr-core/test/J1/./org.apache.solr.handler.component.DistributedMLTComponentTest-1355923282220/shard1/data
[junit4:junit4]   2> 33223 T2504 oasc.CachingDirectoryFactory.close Closing directory when closing factory:/usr/home/hudson/hudson-slave/workspace/Lucene-Solr-Tests-4.x-Java6/solr/build/solr-core/test/J1/./org.apache.solr.handler.component.DistributedMLTComponentTest-1355923282220/shard1/data/index
[junit4:junit4]   2> 33223 T2504 oasc.CachingDirectoryFactory.closeDirectory Closing directory:/usr/home/hudson/hudson-slave/workspace/Lucene-Solr-Tests-4.x-Java6/solr/build/solr-core/test/J1/./org.apache.solr.handler.component.DistributedMLTComponentTest-1355923282220/shard1/data/index
[junit4:junit4]   2> 33224 T2504 oejsh.ContextHandler.doStop stopped o.e.j.s.ServletContextHandler{/fw_g/xc,null}
[junit4:junit4]   2> 33328 T2504 oas.SolrTestCaseJ4.tearDown ###Ending testDistribSearch
[junit4:junit4]   2> NOTE: reproduce with: ant test  -Dtestcase=DistributedMLTComponentTest -Dtests.method=testDistribSearch -Dtests.seed=D9AE348A908796F4 -Dtests.multiplier=3 -Dtests.slow=true -Dtests.locale=zh_TW -Dtests.timezone=Pacific/Galapagos -Dtests.file.encoding=ISO-8859-1
[junit4:junit4] ERROR   33.4s J1 | DistributedMLTComponentTest.testDistribSearch <<<
[junit4:junit4]    > Throwable #1: org.apache.solr.common.SolrException: Server at http://127.0.0.1:19246/fw_g/xc returned non ok status:500, message:Server Error
[junit4:junit4]    > 	at __randomizedtesting.SeedInfo.seed([D9AE348A908796F4:5848BA92E7D8F6C8]:0)
[junit4:junit4]    > 	at org.apache.solr.client.solrj.impl.HttpSolrServer.request(HttpSolrServer.java:372)
[junit4:junit4]    > 	at org.apache.solr.client.solrj.impl.HttpSolrServer.request(HttpSolrServer.java:181)
[junit4:junit4]    > 	at org.apache.solr.client.solrj.request.QueryRequest.process(QueryRequest.java:90)
[junit4:junit4]    > 	at org.apache.solr.client.solrj.SolrServer.query(SolrServer.java:301)
[junit4:junit4]    > 	at org.apache.solr.BaseDistributedSearchTestCase.queryServer(BaseDistributedSearchTestCase.java:470)
[junit4:junit4]    > 	at org.apache.solr.BaseDistributedSearchTestCase.query(BaseDistributedSearchTestCase.java:493)
[junit4:junit4]    > 	at org.apache.solr.BaseDistributedSearchTestCase.query(BaseDistributedSearchTestCase.java:475)
[junit4:junit4]    > 	at org.apache.solr.handler.component.DistributedMLTComponentTest.doTest(DistributedMLTComponentTest.java:119)
[junit4:junit4]    > 	at org.apache.solr.BaseDistributedSearchTestCase.testDistribSearch(BaseDistributedSearchTestCase.java:794)
[junit4:junit4]    > 	at sun.reflect.NativeMethodAccessorImpl.invoke0(Native Method)
[junit4:junit4]    > 	at sun.reflect.NativeMethodAccessorImpl.invoke(NativeMethodAccessorImpl.java:57)
[junit4:junit4]    > 	at sun.reflect.DelegatingMethodAccessorImpl.invoke(DelegatingMethodAccessorImpl.java:43)
[junit4:junit4]    > 	at java.lang.reflect.Method.invoke(Method.java:616)
[junit4:junit4]    > 	at com.carrotsearch.randomizedtesting.RandomizedRunner.invoke(RandomizedRunner.java:1559)
[junit4:junit4]    > 	at com.carrotsearch.randomizedtesting.RandomizedRunner.access$600(RandomizedRunner.java:79)
[junit4:junit4]    > 	at com.carrotsearch.randomizedtesting.RandomizedRunner$6.evaluate(RandomizedRunner.java:737)
[junit4:junit4]    > 	at com.carrotsearch.randomizedtesting.RandomizedRunner$7.evaluate(RandomizedRunner.java:773)
[junit4:junit4]    > 	at com.carrotsearch.randomizedtesting.RandomizedRunner$8.evaluate(RandomizedRunner.java:787)
[junit4:junit4]    > 	at com.carrotsearch.randomizedtesting.rules.SystemPropertiesRestoreRule$1.evaluate(SystemPropertiesRestoreRule.java:53)
[junit4:junit4]    > 	at org.apache.lucene.util.TestRuleSetupTeardownChained$1.evaluate(TestRuleSetupTeardownChained.java:50)
[junit4:junit4]    > 	at org.apache.lucene.util.TestRuleFieldCacheSanity$1.evaluate(TestRuleFieldCacheSanity.java:51)
[junit4:junit4]    > 	at org.apache.lucene.util.AbstractBeforeAfterRule$1.evaluate(AbstractBeforeAfterRule.java:46)
[junit4:junit4]    > 	at com.carrotsearch.randomizedtesting.rules.SystemPropertiesInvariantRule$1.evaluate(SystemPropertiesInvariantRule.java:55)
[junit4:junit4]    > 	at org.apache.lucene.util.TestRuleThreadAndTestName$1.evaluate(TestRuleThreadAndTestName.java:49)
[junit4:junit4]    > 	at org.apache.lucene.util.TestRuleIgnoreAfterMaxFailures$1.evaluate(TestRuleIgnoreAfterMaxFailures.java:70)
[junit4:junit4]    > 	at org.apache.lucene.util.TestRuleMarkFailure$1.evaluate(TestRuleMarkFailure.java:48)
[junit4:junit4]    > 	at com.carrotsearch.randomizedtesting.rules.StatementAdapter.evaluate(StatementAdapter.java:36)
[junit4:junit4]    > 	at com.carrotsearch.randomizedtesting.ThreadLeakControl$StatementRunner.run(ThreadLeakControl.java:358)
[junit4:junit4]    > 	at com.carrotsearch.randomizedtesting.ThreadLeakControl.forkTimeoutingTask(ThreadLeakControl.java:782)
[junit4:junit4]    > 	at com.carrotsearch.randomizedtesting.ThreadLeakControl$3.evaluate(ThreadLeakControl.java:442)
[junit4:junit4]    > 	at com.carrotsearch.randomizedtesting.RandomizedRunner.runSingleTest(RandomizedRunner.java:746)
[junit4:junit4]    > 	at com.carrotsearch.randomizedtesting.RandomizedRunner$3.evaluate(RandomizedRunner.java:648)
[junit4:junit4]    > 	at com.carrotsearch.randomizedtesting.RandomizedRunner$4.evaluate(RandomizedRunner.java:682)
[junit4:junit4]    > 	at com.carrotsearch.randomizedtesting.RandomizedRunner$5.evaluate(RandomizedRunner.java:693)
[junit4:junit4]    > 	at com.carrotsearch.randomizedtesting.rules.StatementAdapter.evaluate(StatementAdapter.java:36)
[junit4:junit4]    > 	at com.carrotsearch.randomizedtesting.rules.SystemPropertiesRestoreRule$1.evaluate(SystemPropertiesRestoreRule.java:53)
[junit4:junit4]    > 	at org.apache.lucene.util.AbstractBeforeAfterRule$1.evaluate(AbstractBeforeAfterRule.java:46)
[junit4:junit4]    > 	at org.apache.lucene.util.TestRuleStoreClassName$1.evaluate(TestRuleStoreClassName.java:42)
[junit4:junit4]    > 	at com.carrotsearch.randomizedtesting.rules.SystemPropertiesInvariantRule$1.evaluate(SystemPropertiesInvariantRule.java:55)
[junit4:junit4]    > 	at com.carrotsearch.randomizedtesting.rules.NoShadowingOrOverridesOnMethodsRule$1.evaluate(NoShadowingOrOverridesOnMethodsRule.java:39)
[junit4:junit4]    > 	at com.carrotsearch.randomizedtesting.rules.NoShadowingOrOverridesOnMethodsRule$1.evaluate(NoShadowingOrOverridesOnMethodsRule.java:39)
[junit4:junit4]    > 	at com.carrotsearch.randomizedtesting.rules.StatementAdapter.evaluate(StatementAdapter.java:36)
[junit4:junit4]    > 	at org.apache.lucene.util.TestRuleAssertionsRequired$1.evaluate(TestRuleAssertionsRequired.java:43)
[junit4:junit4]    > 	at org.apache.lucene.util.TestRuleMarkFailure$1.evaluate(TestRuleMarkFailure.java:48)
[junit4:junit4]    > 	at org.apache.lucene.util.TestRuleIgnoreAfterMaxFailures$1.evaluate(TestRuleIgnoreAfterMaxFailures.java:70)
[junit4:junit4]    > 	at org.apache.lucene.util.TestRuleIgnoreTestSuites$1.evaluate(TestRuleIgnoreTestSuites.java:55)
[junit4:junit4]    > 	at com.carrotsearch.randomizedtesting.rules.StatementAdapter.evaluate(StatementAdapter.java:36)
[junit4:junit4]    > 	at com.carrotsearch.randomizedtesting.ThreadLeakControl$StatementRunner.run(ThreadLeakControl.java:358)
[junit4:junit4]    > 	at java.lang.Thread.run(Thread.java:679)
[junit4:junit4]   2> 33353 T2504 oas.SolrTestCaseJ4.deleteCore ###deleteCore
[junit4:junit4]   2> NOTE: test params are: codec=Appending, sim=RandomSimilarityProvider(queryNorm=true,coord=crazy): {}, locale=zh_TW, timezone=Pacific/Galapagos
[junit4:junit4]   2> NOTE: FreeBSD 9.0-RELEASE amd64/Sun Microsystems Inc. 1.6.0_32 (64-bit)/cpus=16,threads=1,free=177111592,total=443678720
[junit4:junit4]   2> NOTE: All tests run in this JVM: [TestQueryUtils, HighlighterTest, SignatureUpdateProcessorFactoryTest, TestStressVersions, TestSolrCoreProperties, PeerSyncTest, TestSolrIndexConfig, CoreContainerCoreInitFailuresTest, TestOmitPositions, BasicZkTest, EchoParamsTest, TestPhraseSuggestions, TestDistributedSearch, TestCSVResponseWriter, TestAtomicUpdateErrorCases, TestHashPartitioner, TestFunctionQuery, TestRemoteStreaming, TestRecovery, TestElisionMultitermQuery, AnalysisAfterCoreReloadTest, TestSolrDeletionPolicy1, PrimUtilsTest, TestDFRSimilarityFactory, ZkSolrClientTest, DistributedQueryElevationComponentTest, ShowFileRequestHandlerTest, OutputWriterTest, LegacyHTMLStripCharFilterTest, StandardRequestHandlerTest, DirectSolrSpellCheckerTest, UUIDFieldTest, ScriptEngineTest, ConvertedLegacyTest, TestUpdate, TestDocSet, MultiTermTest, FieldMutatingUpdateProcessorTest, TestSolr4Spatial, TestValueSourceCache, URLClassifyProcessorTest, DisMaxRequestHandlerTest, RequiredFieldsTest, ClusterStateUpdateTest, DocumentAnalysisRequestHandlerTest, TestBinaryField, QueryEqualityTest, SchemaVersionSpecificBehaviorTest, TestCSVLoader, BasicFunctionalityTest, TestSort, TestPluginEnable, TestFoldingMultitermQuery, ExternalFileFieldSortTest, FileUtilsTest, SuggesterTest, LukeRequestHandlerTest, TestTrie, BasicDistributedZkTest, FullSolrCloudDistribCmdsTest, TestReplicationHandler, TestDistributedGrouping, TestFaceting, TestJoin, IndexSchemaTest, QueryParsingTest, DistanceFunctionTest, XsltUpdateRequestHandlerTest, FieldAnalysisRequestHandlerTest, TermVectorComponentTest, JsonLoaderTest, DirectUpdateHandlerOptimizeTest, SolrPluginUtilsTest, TestReversedWildcardFilterFactory, DebugComponentTest, ReturnFieldsTest, TestArbitraryIndexDir, SolrCmdDistributorTest, SolrCoreCheckLockOnStartupTest, TestPropInject, NoCacheHeaderTest, PrimitiveFieldTypeTest, TestSolrDeletionPolicy2, DefaultValueUpdateProcessorTest, TestLFUCache, SolrIndexConfigTest, TestNumberUtils, TestBM25SimilarityFactory, TestIBSimilarityFactory, TimeZoneUtilsTest, PluginInfoTest, ResourceLoaderTest, TestSolrXMLSerializer, DOMUtilTest, RAMDirectoryFactoryTest, PreAnalyzedFieldTest, CircularListTest, TestDocumentBuilder, TestCharFilters, TestCollationKeyRangeQueries, OverseerCollectionProcessorTest, ShardRoutingTest, TestZkChroot, ZkCLITest, TestLazyCores, DistributedMLTComponentTest]
[junit4:junit4] Completed on J1 in 33.37s, 1 test, 1 error <<< FAILURES!

[...truncated 14 lines...]
[junit4:junit4] Suite: org.apache.solr.cloud.SyncSliceTest
[junit4:junit4]   2> 0 T2690 oas.BaseDistributedSearchTestCase.initHostContext Setting hostContext system property: /
[junit4:junit4]   2> 5 T2690 oas.SolrTestCaseJ4.setUp ###Starting testDistribSearch
[junit4:junit4]   2> Creating dataDir: /usr/home/hudson/hudson-slave/workspace/Lucene-Solr-Tests-4.x-Java6/solr/build/solr-core/test/J0/./solrtest-SyncSliceTest-1355923206646
[junit4:junit4]   2> 6 T2690 oasc.ZkTestServer.run STARTING ZK TEST SERVER
[junit4:junit4]   2> 7 T2691 oasc.ZkTestServer$ZKServerMain.runFromConfig Starting server
[junit4:junit4]   2> 10 T2691 oazs.ZooKeeperServer.setTickTime tickTime set to 1000
[junit4:junit4]   2> 10 T2691 oazs.ZooKeeperServer.setMinSessionTimeout minSessionTimeout set to -1
[junit4:junit4]   2> 10 T2691 oazs.ZooKeeperServer.setMaxSessionTimeout maxSessionTimeout set to -1
[junit4:junit4]   2> 11 T2691 oazs.NIOServerCnxnFactory.configure binding to port 0.0.0.0/0.0.0.0:0
[junit4:junit4]   2> 12 T2691 oazsp.FileTxnSnapLog.save Snapshotting: 0x0 to /usr/home/hudson/hudson-slave/workspace/Lucene-Solr-Tests-4.x-Java6/solr/build/solr-core/test/J0/./org.apache.solr.cloud.SyncSliceTest-1355923206645/zookeeper/server1/data/version-2/snapshot.0
[junit4:junit4]   2> 108 T2690 oasc.ZkTestServer.run start zk server on port:28299
[junit4:junit4]   2> 109 T2690 oaz.ZooKeeper.<init> Initiating client connection, connectString=127.0.0.1:28299 sessionTimeout=10000 watcher=org.apache.solr.common.cloud.ConnectionManager@29ba8611
[junit4:junit4]   2> 110 T2690 oascc.ConnectionManager.waitForConnected Waiting for client to connect to ZooKeeper
[junit4:junit4]   2> 110 T2696 oaz.ClientCnxn$SendThread.logStartConnect Opening socket connection to server localhost/127.0.0.1:28299. Will not attempt to authenticate using SASL (access denied (javax.security.auth.AuthPermission getLoginConfiguration))
[junit4:junit4]   2> 111 T2696 oaz.ClientCnxn$SendThread.primeConnection Socket connection established to localhost/127.0.0.1:28299, initiating session
[junit4:junit4]   2> 111 T2692 oazs.NIOServerCnxnFactory.run Accepted socket connection from /140.211.11.196:28300
[junit4:junit4]   2> 111 T2692 oazs.ZooKeeperServer.processConnectRequest Client attempting to establish new session at /140.211.11.196:28300
[junit4:junit4]   2> 112 T2694 oazsp.FileTxnLog.append Creating new log file: log.1
[junit4:junit4]   2> 114 T2694 oazs.ZooKeeperServer.finishSessionInit Established session 0x13bb35231fc0000 with negotiated timeout 10000 for client /140.211.11.196:28300
[junit4:junit4]   2> 114 T2696 oaz.ClientCnxn$SendThread.onConnected Session establishment complete on server localhost/127.0.0.1:28299, sessionid = 0x13bb35231fc0000, negotiated timeout = 10000
[junit4:junit4]   2> 115 T2697 oascc.ConnectionManager.process Watcher org.apache.solr.common.cloud.ConnectionManager@29ba8611 name:ZooKeeperConnection Watcher:127.0.0.1:28299 got event WatchedEvent state:SyncConnected type:None path:null path:null type:None
[junit4:junit4]   2> 115 T2690 oascc.ConnectionManager.waitForConnected Client is connected to ZooKeeper
[junit4:junit4]   2> 115 T2690 oascc.SolrZkClient.makePath makePath: /solr
[junit4:junit4]   2> 118 T2695 oazs.PrepRequestProcessor.pRequest2Txn Processed session termination for sessionid: 0x13bb35231fc0000
[junit4:junit4]   2> 119 T2697 oaz.ClientCnxn$EventThread.run EventThread shut down
[junit4:junit4]   2> 119 T2692 oazs.NIOServerCnxn.closeSock Closed socket connection for client /140.211.11.196:28300 which had sessionid 0x13bb35231fc0000
[junit4:junit4]   2> 119 T2690 oaz.ZooKeeper.close Session: 0x13bb35231fc0000 closed
[junit4:junit4]   2> 120 T2690 oaz.ZooKeeper.<init> Initiating client connection, connectString=127.0.0.1:28299/solr sessionTimeout=10000 watcher=org.apache.solr.common.cloud.ConnectionManager@49a6e1c9
[junit4:junit4]   2> 121 T2690 oascc.ConnectionManager.waitForConnected Waiting for client to connect to ZooKeeper
[junit4:junit4]   2> 121 T2698 oaz.ClientCnxn$SendThread.logStartConnect Opening socket connection to server localhost/127.0.0.1:28299. Will not attempt to authenticate using SASL (access denied (javax.security.auth.AuthPermission getLoginConfiguration))
[junit4:junit4]   2> 122 T2698 oaz.ClientCnxn$SendThread.primeConnection Socket connection established to localhost/127.0.0.1:28299, initiating session
[junit4:junit4]   2> 122 T2692 oazs.NIOServerCnxnFactory.run Accepted socket connection from /140.211.11.196:28301
[junit4:junit4]   2> 122 T2692 oazs.ZooKeeperServer.processConnectRequest Client attempting to establish new session at /140.211.11.196:28301
[junit4:junit4]   2> 128 T2694 oazs.ZooKeeperServer.finishSessionInit Established session 0x13bb35231fc0001 with negotiated timeout 10000 for client /140.211.11.196:28301
[junit4:junit4]   2> 129 T2698 oaz.ClientCnxn$SendThread.onConnected Session establishment complete on server localhost/127.0.0.1:28299, sessionid = 0x13bb35231fc0001, negotiated timeout = 10000
[junit4:junit4]   2> 129 T2699 oascc.ConnectionManager.process Watcher org.apache.solr.common.cloud.ConnectionManager@49a6e1c9 name:ZooKeeperConnection Watcher:127.0.0.1:28299/solr got event WatchedEvent state:SyncConnected type:None path:null path:null type:None
[junit4:junit4]   2> 129 T2690 oascc.ConnectionManager.waitForConnected Client is connected to ZooKeeper
[junit4:junit4]   2> 130 T2690 oascc.SolrZkClient.makePath makePath: /collections/collection1
[junit4:junit4]   2> 133 T2690 oascc.SolrZkClient.makePath makePath: /collections/collection1/shards
[junit4:junit4]   2> 143 T2690 oascc.SolrZkClient.makePath makePath: /collections/control_collection
[junit4:junit4]   2> 145 T2690 oascc.SolrZkClient.makePath makePath: /collections/control_collection/shards
[junit4:junit4]   2> 148 T2690 oasc.AbstractZkTestCase.putConfig put /usr/home/hudson/hudson-slave/workspace/Lucene-Solr-Tests-4.x-Java6/solr/build/solr-core/test-files/solr/collection1/conf/solrconfig.xml to /configs/conf1/solrconfig.xml
[junit4:junit4]   2> 159 T2690 oascc.SolrZkClient.makePath makePath: /configs/conf1/solrconfig.xml
[junit4:junit4]   2> 198 T2690 oasc.AbstractZkTestCase.putConfig put /usr/home/hudson/hudson-slave/workspace/Lucene-Solr-Tests-4.x-Java6/solr/build/solr-core/test-files/solr/collection1/conf/schema.xml to /configs/conf1/schema.xml
[junit4:junit4]   2> 199 T2690 oascc.SolrZkClient.makePath makePath: /configs/conf1/schema.xml
[junit4:junit4]   2> 305 T2690 oasc.AbstractZkTestCase.putConfig put /usr/home/hudson/hudson-slave/workspace/Lucene-Solr-Tests-4.x-Java6/solr/build/solr-core/test-files/solr/collection1/conf/stopwords.txt to /configs/conf1/stopwords.txt
[junit4:junit4]   2> 306 T2690 oascc.SolrZkClient.makePath makePath: /configs/conf1/stopwords.txt
[junit4:junit4]   2> 333 T2690 oasc.AbstractZkTestCase.putConfig put /usr/home/hudson/hudson-slave/workspace/Lucene-Solr-Tests-4.x-Java6/solr/build/solr-core/test-files/solr/collection1/conf/protwords.txt to /configs/conf1/protwords.txt
[junit4:junit4]   2> 334 T2690 oascc.SolrZkClient.makePath makePath: /configs/conf1/protwords.txt
[junit4:junit4]   2> 338 T2690 oasc.AbstractZkTestCase.putConfig put /usr/home/hudson/hudson-slave/workspace/Lucene-Solr-Tests-4.x-Java6/solr/build/solr-core/test-files/solr/collection1/conf/currency.xml to /configs/conf1/currency.xml
[junit4:junit4]   2> 338 T2690 oascc.SolrZkClient.makePath makePath: /configs/conf1/currency.xml
[junit4:junit4]   2> 366 T2690 oasc.AbstractZkTestCase.putConfig put /usr/home/hudson/hudson-slave/workspace/Lucene-Solr-Tests-4.x-Java6/solr/build/solr-core/test-files/solr/collection1/conf/open-exchange-rates.json to /configs/conf1/open-exchange-rates.json
[junit4:junit4]   2> 367 T2690 oascc.SolrZkClient.makePath makePath: /configs/conf1/open-exchange-rates.json
[junit4:junit4]   2> 392 T2690 oasc.AbstractZkTestCase.putConfig put /usr/home/hudson/hudson-slave/workspace/Lucene-Solr-Tests-4.x-Java6/solr/build/solr-core/test-files/solr/collection1/conf/mapping-ISOLatin1Accent.txt to /configs/conf1/mapping-ISOLatin1Accent.txt
[junit4:junit4]   2> 393 T2690 oascc.SolrZkClient.makePath makePath: /configs/conf1/mapping-ISOLatin1Accent.txt
[junit4:junit4]   2> 437 T2690 oasc.AbstractZkTestCase.putConfig put /usr/home/hudson/hudson-slave/workspace/Lucene-Solr-Tests-4.x-Java6/solr/build/solr-core/test-files/solr/collection1/conf/old_synonyms.txt to /configs/conf1/old_synonyms.txt
[junit4:junit4]   2> 439 T2690 oascc.SolrZkClient.makePath makePath: /configs/conf1/old_synonyms.txt
[junit4:junit4]   2> 448 T2690 oasc.AbstractZkTestCase.putConfig put /usr/home/hudson/hudson-slave/workspace/Lucene-Solr-Tests-4.x-Java6/solr/build/solr-core/test-files/solr/collection1/conf/synonyms.txt to /configs/conf1/synonyms.txt
[junit4:junit4]   2> 448 T2690 oascc.SolrZkClient.makePath makePath: /configs/conf1/synonyms.txt
[junit4:junit4]   2> 455 T2695 oazs.PrepRequestProcessor.pRequest2Txn Processed session termination for sessionid: 0x13bb35231fc0001
[junit4:junit4]   2> 462 T2699 oaz.ClientCnxn$EventThread.run EventThread shut down
[junit4:junit4]   2> 462 T2690 oaz.ZooKeeper.close Session: 0x13bb35231fc0001 closed
[junit4:junit4]   2> 462 T2692 oazs.NIOServerCnxn.closeSock Closed socket connection for client /140.211.11.196:28301 which had sessionid 0x13bb35231fc0001
[junit4:junit4]   2> 750 T2690 oejs.Server.doStart jetty-8.1.8.v20121106
[junit4:junit4]   2> 755 T2690 oejs.AbstractConnector.doStart Started SocketConnector@127.0.0.1:28302
[junit4:junit4]   2> 756 T2690 oasc.SolrResourceLoader.locateSolrHome JNDI not configured for solr (NoInitialContextEx)
[junit4:junit4]   2> 757 T2690 oasc.SolrResourceLoader.locateSolrHome using system property solr.solr.home: /usr/home/hudson/hudson-slave/workspace/Lucene-Solr-Tests-4.x-Java6/solr/build/solr-core/test/J0/./org.apache.solr.cloud.SyncSliceTest-controljetty-1355923207103
[junit4:junit4]   2> 757 T2690 oasc.SolrResourceLoader.<init> new SolrResourceLoader for deduced Solr Home: '/usr/home/hudson/hudson-slave/workspace/Lucene-Solr-Tests-4.x-Java6/solr/build/solr-core/test/J0/./org.apache.solr.cloud.SyncSliceTest-controljetty-1355923207103/'
[junit4:junit4]   2> 799 T2690 oass.SolrDispatchFilter.init SolrDispatchFilter.init()
[junit4:junit4]   2> 800 T2690 oasc.SolrResourceLoader.locateSolrHome JNDI not configured for solr (NoInitialContextEx)
[junit4:junit4]   2> 800 T2690 oasc.SolrResourceLoader.locateSolrHome using system property solr.solr.home: /usr/home/hudson/hudson-slave/workspace/Lucene-Solr-Tests-4.x-Java6/solr/build/solr-core/test/J0/./org.apache.solr.cloud.SyncSliceTest-controljetty-1355923207103
[junit4:junit4]   2> 801 T2690 oasc.CoreContainer$Initializer.initialize looking for solr.xml: /usr/home/hudson/hudson-slave/workspace/Lucene-Solr-Tests-4.x-Java6/solr/build/solr-core/test/J0/./org.apache.solr.cloud.SyncSliceTest-controljetty-1355923207103/solr.xml
[junit4:junit4]   2> 802 T2690 oasc.CoreContainer.<init> New CoreContainer 1198346026
[junit4:junit4]   2> 802 T2690 oasc.CoreContainer.load Loading CoreContainer using Solr Home: '/usr/home/hudson/hudson-slave/workspace/Lucene-Solr-Tests-4.x-Java6/solr/build/solr-core/test/J0/./org.apache.solr.cloud.SyncSliceTest-controljetty-1355923207103/'
[junit4:junit4]   2> 803 T2690 oasc.SolrResourceLoader.<init> new SolrResourceLoader for directory: '/usr/home/hudson/hudson-slave/workspace/Lucene-Solr-Tests-4.x-Java6/solr/build/solr-core/test/J0/./org.apache.solr.cloud.SyncSliceTest-controljetty-1355923207103/'
[junit4:junit4]   2> 829 T2690 oashc.HttpShardHandlerFactory.getParameter Setting socketTimeout to: 30000
[junit4:junit4]   2> 830 T2690 oashc.HttpShardHandlerFactory.getParameter Setting urlScheme to: http://
[junit4:junit4]   2> 831 T2690 oashc.HttpShardHandlerFactory.getParameter Setting connTimeout to: 15000
[junit4:junit4]   2> 831 T2690 oashc.HttpShardHandlerFactory.getParameter Setting maxConnectionsPerHost to: 20
[junit4:junit4]   2> 832 T2690 oashc.HttpShardHandlerFactory.getParameter Setting corePoolSize to: 0
[junit4:junit4]   2> 832 T2690 oashc.HttpShardHandlerFactory.getParameter Setting maximumPoolSize to: 2147483647
[junit4:junit4]   2> 833 T2690 oashc.HttpShardHandlerFactory.getParameter Setting maxThreadIdleTime to: 5
[junit4:junit4]   2> 833 T2690 oashc.HttpShardHandlerFactory.getParameter Setting sizeOfQueue to: -1
[junit4:junit4]   2> 834 T2690 oashc.HttpShardHandlerFactory.getParameter Setting fairnessPolicy to: false
[junit4:junit4]   2> 835 T2690 oascsi.HttpClientUtil.createClient Creating new http client, config:maxConnectionsPerHost=20&maxConnections=10000&socketTimeout=30000&connTimeout=15000&retry=false
[junit4:junit4]   2> 855 T2690 oasc.CoreContainer.load Registering Log Listener
[junit4:junit4]   2> 874 T2690 oasc.CoreContainer.initZooKeeper Zookeeper client=127.0.0.1:28299/solr
[junit4:junit4]   2> 875 T2690 oasc.ZkController.checkChrootPath zkHost includes chroot
[junit4:junit4]   2> 876 T2690 oaz.ZooKeeper.<init> Initiating client connection, connectString=127.0.0.1:28299 sessionTimeout=60000 watcher=org.apache.solr.common.cloud.ConnectionManager@58584013
[junit4:junit4]   2> 877 T2690 oascc.ConnectionManager.waitForConnected Waiting for client to connect to ZooKeeper
[junit4:junit4]   2> 878 T2709 oaz.ClientCnxn$SendThread.logStartConnect Opening socket connection to server localhost/127.0.0.1:28299. Will not attempt to authenticate using SASL (access denied (javax.security.auth.AuthPermission getLoginConfiguration))
[junit4:junit4]   2> 878 T2709 oaz.ClientCnxn$SendThread.primeConnection Socket connection established to localhost/127.0.0.1:28299, initiating session
[junit4:junit4]   2> 879 T2692 oazs.NIOServerCnxnFactory.run Accepted socket connection from /140.211.11.196:28304
[junit4:junit4]   2> 879 T2692 oazs.ZooKeeperServer.processConnectRequest Client attempting to establish new session at /140.211.11.196:28304
[junit4:junit4]   2> 881 T2694 oazs.ZooKeeperServer.finishSessionInit Established session 0x13bb35231fc0002 with negotiated timeout 20000 for client /140.211.11.196:28304
[junit4:junit4]   2> 881 T2709 oaz.ClientCnxn$SendThread.onConnected Session establishment complete on server localhost/127.0.0.1:28299, sessionid = 0x13bb35231fc0002, negotiated timeout = 20000
[junit4:junit4]   2> 881 T2710 oascc.ConnectionManager.process Watcher org.apache.solr.common.cloud.ConnectionManager@58584013 name:ZooKeeperConnection Watcher:127.0.0.1:28299 got event WatchedEvent state:SyncConnected type:None path:null path:null type:None
[junit4:junit4]   2> 882 T2690 oascc.ConnectionManager.waitForConnected Client is connected to ZooKeeper
[junit4:junit4]   2> 883 T2695 oazs.PrepRequestProcessor.pRequest2Txn Processed session termination for sessionid: 0x13bb35231fc0002
[junit4:junit4]   2> 884 T2710 oaz.ClientCnxn$EventThread.run EventThread shut down
[junit4:junit4]   2> 884 T2692 oazs.NIOServerCnxn.closeSock Closed socket connection for client /140.211.11.196:28304 which had sessionid 0x13bb35231fc0002
[junit4:junit4]   2> 884 T2690 oaz.ZooKeeper.close Session: 0x13bb35231fc0002 closed
[junit4:junit4]   2> 885 T2690 oascsi.HttpClientUtil.createClient Creating new http client, config:maxConnections=500&maxConnectionsPerHost=16&socketTimeout=15000&connTimeout=30000
[junit4:junit4]   2> 894 T2690 oaz.ZooKeeper.<init> Initiating client connection, connectString=127.0.0.1:28299/solr sessionTimeout=30000 watcher=org.apache.solr.common.cloud.ConnectionManager@30c89daf
[junit4:junit4]   2> 895 T2690 oascc.ConnectionManager.waitForConnected Waiting for client to connect to ZooKeeper
[junit4:junit4]   2> 895 T2711 oaz.ClientCnxn$SendThread.logStartConnect Opening socket connection to server localhost/127.0.0.1:28299. Will not attempt to authenticate using SASL (access denied (javax.security.auth.AuthPermission getLoginConfiguration))
[junit4:junit4]   2> 896 T2711 oaz.ClientCnxn$SendThread.primeConnection Socket connection established to localhost/127.0.0.1:28299, initiating session
[junit4:junit4]   2> 896 T2692 oazs.NIOServerCnxnFactory.run Accepted socket connection from /140.211.11.196:28305
[junit4:junit4]   2> 896 T2692 oazs.ZooKeeperServer.processConnectRequest Client attempting to establish new session at /140.211.11.196:28305
[junit4:junit4]   2> 898 T2694 oazs.ZooKeeperServer.finishSessionInit Established session 0x13bb35231fc0003 with negotiated timeout 20000 for client /140.211.11.196:28305
[junit4:junit4]   2> 898 T2711 oaz.ClientCnxn$SendThread.onConnected Session establishment complete on server localhost/127.0.0.1:28299, sessionid = 0x13bb35231fc0003, negotiated timeout = 20000
[junit4:junit4]   2> 898 T2712 oascc.ConnectionManager.process Watcher org.apache.solr.common.cloud.ConnectionManager@30c89daf name:ZooKeeperConnection Watcher:127.0.0.1:28299/solr got event WatchedEvent state:SyncConnected type:None path:null path:null type:None
[junit4:junit4]   2> 898 T2690 oascc.ConnectionManager.waitForConnected Client is connected to ZooKeeper
[junit4:junit4]   2> 901 T2695 oazs.PrepRequestProcessor.pRequest Got user-level KeeperException when processing sessionid:0x13bb35231fc0003 type:create cxid:0x2 zxid:0x1a txntype:-1 reqpath:n/a Error Path:/solr/overseer Error:KeeperErrorCode = NodeExists for /solr/overseer
[junit4:junit4]   2> 902 T2690 oascc.SolrZkClient.makePath makePath: /live_nodes
[junit4:junit4]   2> 904 T2690 oasc.ZkController.createEphemeralLiveNode Register node as live in ZooKeeper:/live_nodes/127.0.0.1:28302_
[junit4:junit4]   2> 905 T2695 oazs.PrepRequestProcessor.pRequest Got user-level KeeperException when processing sessionid:0x13bb35231fc0003 type:delete cxid:0x7 zxid:0x1c txntype:-1 reqpath:n/a Error Path:/solr/live_nodes/127.0.0.1:28302_ Error:KeeperErrorCode = NoNode for /solr/live_nodes/127.0.0.1:28302_
[junit4:junit4]   2> 906 T2690 oascc.SolrZkClient.makePath makePath: /live_nodes/127.0.0.1:28302_
[junit4:junit4]   2> 909 T2690 oascc.SolrZkClient.makePath makePath: /overseer_elect/election
[junit4:junit4]   2> 947 T2695 oazs.PrepRequestProcessor.pRequest Got user-level KeeperException when processing sessionid:0x13bb35231fc0003 type:delete cxid:0x15 zxid:0x21 txntype:-1 reqpath:n/a Error Path:/solr/overseer_elect/leader Error:KeeperErrorCode = NoNode for /solr/overseer_elect/leader
[junit4:junit4]   2> 963 T2690 oascc.SolrZkClient.makePath makePath: /overseer_elect/leader
[junit4:junit4]   2> 973 T2690 oasc.Overseer.start Overseer (id=88861783271145475-127.0.0.1:28302_-n_0000000000) starting
[junit4:junit4]   2> 973 T2695 oazs.PrepRequestProcessor.pRequest Got user-level KeeperException when processing sessionid:0x13bb35231fc0003 type:create cxid:0x1a zxid:0x23 txntype:-1 reqpath:n/a Error Path:/solr/overseer Error:KeeperErrorCode = NodeExists for /solr/overseer
[junit4:junit4]   2> 985 T2695 oazs.PrepRequestProcessor.pRequest Got user-level KeeperException when processing sessionid:0x13bb35231fc0003 type:create cxid:0x1b zxid:0x24 txntype:-1 reqpath:n/a Error Path:/solr/overseer Error:KeeperErrorCode = NodeExists for /solr/overseer
[junit4:junit4]   2> 1002 T2695 oazs.PrepRequestProcessor.pRequest Got user-level KeeperException when processing sessionid:0x13bb35231fc0003 type:create cxid:0x1c zxid:0x25 txntype:-1 reqpath:n/a Error Path:/solr/overseer Error:KeeperErrorCode = NodeExists for /solr/overseer
[junit4:junit4]   2> 1004 T2695 oazs.PrepRequestProcessor.pRequest Got user-level KeeperException when processing sessionid:0x13bb35231fc0003 type:create cxid:0x1d zxid:0x26 txntype:-1 reqpath:n/a Error Path:/solr/overseer Error:KeeperErrorCode = NodeExists for /solr/overseer
[junit4:junit4]   2> 1015 T2714 oasc.OverseerCollectionProcessor.run Process current queue of collection messages
[junit4:junit4]   2> 1016 T2690 oascc.SolrZkClient.makePath makePath: /clusterstate.json
[junit4:junit4]   2> 1031 T2690 oascc.ZkStateReader.createClusterStateWatchersAndUpdate Updating cluster state from ZooKeeper... 
[junit4:junit4]   2> 1033 T2713 oasc.Overseer$ClusterStateUpdater.run Starting to work on the main queue
[junit4:junit4]   2> 1040 T2715 oasc.CoreContainer.create Creating SolrCore 'collection1' using instanceDir: /usr/home/hudson/hudson-slave/workspace/Lucene-Solr-Tests-4.x-Java6/solr/build/solr-core/test/J0/./org.apache.solr.cloud.SyncSliceTest-controljetty-1355923207103/collection1
[junit4:junit4]   2> 1040 T2715 oasc.ZkController.createCollectionZkNode Check for collection zkNode:control_collection
[junit4:junit4]   2> 1041 T2715 oasc.ZkController.createCollectionZkNode Collection zkNode exists
[junit4:junit4]   2> 1041 T2715 oasc.ZkController.readConfigName Load collection config from:/collections/control_collection
[junit4:junit4]   2> 1042 T2715 oasc.SolrResourceLoader.<init> new SolrResourceLoader for directory: '/usr/home/hudson/hudson-slave/workspace/Lucene-Solr-Tests-4.x-Java6/solr/build/solr-core/test/J0/./org.apache.solr.cloud.SyncSliceTest-controljetty-1355923207103/collection1/'
[junit4:junit4]   2> 1044 T2715 oasc.SolrResourceLoader.replaceClassLoader Adding 'file:/usr/home/hudson/hudson-slave/workspace/Lucene-Solr-Tests-4.x-Java6/solr/build/solr-core/test/J0/org.apache.solr.cloud.SyncSliceTest-controljetty-1355923207103/collection1/lib/classes/' to classloader
[junit4:junit4]   2> 1044 T2715 oasc.SolrResourceLoader.replaceClassLoader Adding 'file:/usr/home/hudson/hudson-slave/workspace/Lucene-Solr-Tests-4.x-Java6/solr/build/solr-core/test/J0/org.apache.solr.cloud.SyncSliceTest-controljetty-1355923207103/collection1/lib/README' to classloader
[junit4:junit4]   2> 1102 T2715 oasc.SolrConfig.<init> Using Lucene MatchVersion: LUCENE_41
[junit4:junit4]   2> 1176 T2715 oasc.SolrConfig.<init> Loaded SolrConfig: solrconfig.xml
[junit4:junit4]   2> 1276 T2715 oass.IndexSchema.readSchema Reading Solr Schema
[junit4:junit4]   2> 1282 T2715 oass.IndexSchema.readSchema Schema name=test
[junit4:junit4]   2> 1908 T2715 oass.OpenExchangeRatesOrgProvider.init Initialized with rates=open-exchange-rates.json, refreshInterval=1440.
[junit4:junit4]   2> 1920 T2715 oass.IndexSchema.readSchema default search field in schema is text
[junit4:junit4]   2> 1924 T2715 oass.IndexSchema.readSchema unique key field: id
[junit4:junit4]   2> 1935 T2715 oass.FileExchangeRateProvider.reload Reloading exchange rates from file currency.xml
[junit4:junit4]   2> 1939 T2715 oass.FileExchangeRateProvider.reload Reloading exchange rates from file currency.xml
[junit4:junit4]   2> 1943 T2715 oass.OpenExchangeRatesOrgProvider.reload Reloading exchange rates from open-exchange-rates.json
[junit4:junit4]   2> 1944 T2715 oass.OpenExchangeRatesOrgProvider.reload Reloading exchange rates from open-exchange-rates.json
[junit4:junit4]   2> 1945 T2715 oasc.SolrCore.<init> [collection1] Opening new SolrCore at /usr/home/hudson/hudson-slave/workspace/Lucene-Solr-Tests-4.x-Java6/solr/build/solr-core/test/J0/./org.apache.solr.cloud.SyncSliceTest-controljetty-1355923207103/collection1/, dataDir=./org.apache.solr.cloud.SyncSliceTest-1355923206645/control/data/
[junit4:junit4]   2> 1946 T2715 oasc.JmxMonitoredMap.<init> JMX monitoring is enabled. Adding Solr mbeans to JMX Server: com.sun.jmx.mbeanserver.JmxMBeanServer@b07108e
[junit4:junit4]   2> 1946 T2715 oasc.SolrCore.initDirectoryFactory solr.StandardDirectoryFactory
[junit4:junit4]   2> 1948 T2715 oasc.CachingDirectoryFactory.get return new directory for /usr/home/hudson/hudson-slave/workspace/Lucene-Solr-Tests-4.x-Java6/solr/build/solr-core/test/J0/./org.apache.solr.cloud.SyncSliceTest-1355923206645/control/data forceNew:false
[junit4:junit4]   2> 1949 T2715 oasc.CachingDirectoryFactory.close Releasing directory:/usr/home/hudson/hudson-slave/workspace/Lucene-Solr-Tests-4.x-Java6/solr/build/solr-core/test/J0/./org.apache.solr.cloud.SyncSliceTest-1355923206645/control/data
[junit4:junit4]   2> 1949 T2715 oasc.SolrCore.getNewIndexDir New index directory detected: old=null new=./org.apache.solr.cloud.SyncSliceTest-1355923206645/control/data/index/
[junit4:junit4]   2> 1950 T2715 oasc.SolrCore.initIndex WARNING [collection1] Solr index directory './org.apache.solr.cloud.SyncSliceTest-1355923206645/control/data/index' doesn't exist. Creating new index...
[junit4:junit4]   2> 1951 T2715 oasc.CachingDirectoryFactory.get return new directory for /usr/home/hudson/hudson-slave/workspace/Lucene-Solr-Tests-4.x-Java6/solr/build/solr-core/test/J0/./org.apache.solr.cloud.SyncSliceTest-1355923206645/control/data/index forceNew:false
[junit4:junit4]   2> 1956 T2715 oasc.SolrDeletionPolicy.onCommit SolrDeletionPolicy.onCommit: commits:num=1
[junit4:junit4]   2> 		commit{dir=RateLimitedDirectoryWrapper(org.apache.lucene.store.NIOFSDirectory@/usr/home/hudson/hudson-slave/workspace/Lucene-Solr-Tests-4.x-Java6/solr/build/solr-core/test/J0/org.apache.solr.cloud.SyncSliceTest-1355923206645/control/data/index lockFactory=org.apache.lucene.store.NativeFSLockFactory@6a38c63e),segFN=segments_1,generation=1,filenames=[segments_1]
[junit4:junit4]   2> 1957 T2715 oasc.SolrDeletionPolicy.updateCommits newest commit = 1[segments_1]
[junit4:junit4]   2> 1958 T2715 oasc.CachingDirectoryFactory.close Releasing directory:/usr/home/hudson/hudson-slave/workspace/Lucene-Solr-Tests-4.x-Java6/solr/build/solr-core/test/J0/./org.apache.solr.cloud.SyncSliceTest-1355923206645/control/data/index
[junit4:junit4]   2> 1958 T2715 oasc.SolrCore.initWriters created xml: solr.XMLResponseWriter
[junit4:junit4]   2> 1959 T2715 oasup.UpdateRequestProcessorChain.init inserting DistributedUpdateProcessorFactory into updateRequestProcessorChain "dedupe"
[junit4:junit4]   2> 1960 T2715 oasup.UpdateRequestProcessorChain.init inserting DistributedUpdateProcessorFactory into updateRequestProcessorChain "dedupe-allfields"
[junit4:junit4]   2> 1960 T2715 oasup.UpdateRequestProcessorChain.init inserting DistributedUpdateProcessorFactory into updateRequestProcessorChain "stored_sig"
[junit4:junit4]   2> 1961 T2715 oasup.UpdateRequestProcessorChain.init inserting DistributedUpdateProcessorFactory into updateRequestProcessorChain "uniq-fields"
[junit4:junit4]   2> 1961 T2715 oasup.UpdateRequestProcessorChain.init inserting DistributedUpdateProcessorFactory into updateRequestProcessorChain "distrib-dup-test-chain-implicit"
[junit4:junit4]   2> 1962 T2715 oasc.RequestHandlers.initHandlersFromConfig adding lazy requestHandler: solr.ReplicationHandler
[junit4:junit4]   2> 1962 T2715 oasc.RequestHandlers.initHandlersFromConfig created /replication: solr.ReplicationHandler
[junit4:junit4]   2> 1963 T2715 oasc.RequestHandlers.initHandlersFromConfig created standard: solr.StandardRequestHandler
[junit4:junit4]   2> 1964 T2715 oasc.RequestHandlers.initHandlersFromConfig created /get: solr.RealTimeGetHandler
[junit4:junit4]   2> 1965 T2715 oasc.RequestHan

[...truncated too long message...]

)
[junit4:junit4]    > 	at org.junit.Assert.assertNotNull(Assert.java:537)
[junit4:junit4]    > 	at org.apache.solr.cloud.SyncSliceTest.doTest(SyncSliceTest.java:211)
[junit4:junit4]    > 	at org.apache.solr.BaseDistributedSearchTestCase.testDistribSearch(BaseDistributedSearchTestCase.java:794)
[junit4:junit4]    > 	at sun.reflect.NativeMethodAccessorImpl.invoke0(Native Method)
[junit4:junit4]    > 	at sun.reflect.NativeMethodAccessorImpl.invoke(NativeMethodAccessorImpl.java:57)
[junit4:junit4]    > 	at sun.reflect.DelegatingMethodAccessorImpl.invoke(DelegatingMethodAccessorImpl.java:43)
[junit4:junit4]    > 	at java.lang.reflect.Method.invoke(Method.java:616)
[junit4:junit4]    > 	at com.carrotsearch.randomizedtesting.RandomizedRunner.invoke(RandomizedRunner.java:1559)
[junit4:junit4]    > 	at com.carrotsearch.randomizedtesting.RandomizedRunner.access$600(RandomizedRunner.java:79)
[junit4:junit4]    > 	at com.carrotsearch.randomizedtesting.RandomizedRunner$6.evaluate(RandomizedRunner.java:737)
[junit4:junit4]    > 	at com.carrotsearch.randomizedtesting.RandomizedRunner$7.evaluate(RandomizedRunner.java:773)
[junit4:junit4]    > 	at com.carrotsearch.randomizedtesting.RandomizedRunner$8.evaluate(RandomizedRunner.java:787)
[junit4:junit4]    > 	at com.carrotsearch.randomizedtesting.rules.SystemPropertiesRestoreRule$1.evaluate(SystemPropertiesRestoreRule.java:53)
[junit4:junit4]    > 	at org.apache.lucene.util.TestRuleSetupTeardownChained$1.evaluate(TestRuleSetupTeardownChained.java:50)
[junit4:junit4]    > 	at org.apache.lucene.util.TestRuleFieldCacheSanity$1.evaluate(TestRuleFieldCacheSanity.java:51)
[junit4:junit4]    > 	at org.apache.lucene.util.AbstractBeforeAfterRule$1.evaluate(AbstractBeforeAfterRule.java:46)
[junit4:junit4]    > 	at com.carrotsearch.randomizedtesting.rules.SystemPropertiesInvariantRule$1.evaluate(SystemPropertiesInvariantRule.java:55)
[junit4:junit4]    > 	at org.apache.lucene.util.TestRuleThreadAndTestName$1.evaluate(TestRuleThreadAndTestName.java:49)
[junit4:junit4]    > 	at org.apache.lucene.util.TestRuleIgnoreAfterMaxFailures$1.evaluate(TestRuleIgnoreAfterMaxFailures.java:70)
[junit4:junit4]    > 	at org.apache.lucene.util.TestRuleMarkFailure$1.evaluate(TestRuleMarkFailure.java:48)
[junit4:junit4]    > 	at com.carrotsearch.randomizedtesting.rules.StatementAdapter.evaluate(StatementAdapter.java:36)
[junit4:junit4]    > 	at com.carrotsearch.randomizedtesting.ThreadLeakControl$StatementRunner.run(ThreadLeakControl.java:358)
[junit4:junit4]    > 	at com.carrotsearch.randomizedtesting.ThreadLeakControl.forkTimeoutingTask(ThreadLeakControl.java:782)
[junit4:junit4]    > 	at com.carrotsearch.randomizedtesting.ThreadLeakControl$3.evaluate(ThreadLeakControl.java:442)
[junit4:junit4]    > 	at com.carrotsearch.randomizedtesting.RandomizedRunner.runSingleTest(RandomizedRunner.java:746)
[junit4:junit4]    > 	at com.carrotsearch.randomizedtesting.RandomizedRunner$3.evaluate(RandomizedRunner.java:648)
[junit4:junit4]    > 	at com.carrotsearch.randomizedtesting.RandomizedRunner$4.evaluate(RandomizedRunner.java:682)
[junit4:junit4]    > 	at com.carrotsearch.randomizedtesting.RandomizedRunner$5.evaluate(RandomizedRunner.java:693)
[junit4:junit4]    > 	at com.carrotsearch.randomizedtesting.rules.StatementAdapter.evaluate(StatementAdapter.java:36)
[junit4:junit4]    > 	at com.carrotsearch.randomizedtesting.rules.SystemPropertiesRestoreRule$1.evaluate(SystemPropertiesRestoreRule.java:53)
[junit4:junit4]    > 	at org.apache.lucene.util.AbstractBeforeAfterRule$1.evaluate(AbstractBeforeAfterRule.java:46)
[junit4:junit4]    > 	at org.apache.lucene.util.TestRuleStoreClassName$1.evaluate(TestRuleStoreClassName.java:42)
[junit4:junit4]    > 	at com.carrotsearch.randomizedtesting.rules.SystemPropertiesInvariantRule$1.evaluate(SystemPropertiesInvariantRule.java:55)
[junit4:junit4]    > 	at com.carrotsearch.randomizedtesting.rules.NoShadowingOrOverridesOnMethodsRule$1.evaluate(NoShadowingOrOverridesOnMethodsRule.java:39)
[junit4:junit4]    > 	at com.carrotsearch.randomizedtesting.rules.NoShadowingOrOverridesOnMethodsRule$1.evaluate(NoShadowingOrOverridesOnMethodsRule.java:39)
[junit4:junit4]    > 	at com.carrotsearch.randomizedtesting.rules.StatementAdapter.evaluate(StatementAdapter.java:36)
[junit4:junit4]    > 	at org.apache.lucene.util.TestRuleAssertionsRequired$1.evaluate(TestRuleAssertionsRequired.java:43)
[junit4:junit4]    > 	at org.apache.lucene.util.TestRuleMarkFailure$1.evaluate(TestRuleMarkFailure.java:48)
[junit4:junit4]    > 	at org.apache.lucene.util.TestRuleIgnoreAfterMaxFailures$1.evaluate(TestRuleIgnoreAfterMaxFailures.java:70)
[junit4:junit4]    > 	at org.apache.lucene.util.TestRuleIgnoreTestSuites$1.evaluate(TestRuleIgnoreTestSuites.java:55)
[junit4:junit4]    > 	at com.carrotsearch.randomizedtesting.rules.StatementAdapter.evaluate(StatementAdapter.java:36)
[junit4:junit4]    > 	at com.carrotsearch.randomizedtesting.ThreadLeakControl$StatementRunner.run(ThreadLeakControl.java:358)
[junit4:junit4]    > 	at java.lang.Thread.run(Thread.java:679)
[junit4:junit4]   2> 142782 T2690 oas.SolrTestCaseJ4.deleteCore ###deleteCore
[junit4:junit4]   2> NOTE: test params are: codec=Lucene41: {range_facet_l=Pulsing41(freqCutoff=19 minBlockSize=91 maxBlockSize=230), text=PostingsFormat(name=Lucene41WithOrds), _version_=MockFixedIntBlock(blockSize=549), rnd_b=MockVariableIntBlock(baseBlockSize=30), intDefault=MockFixedIntBlock(blockSize=549), id=MockVariableIntBlock(baseBlockSize=30), timestamp=Pulsing41(freqCutoff=19 minBlockSize=91 maxBlockSize=230), a_t=Pulsing41(freqCutoff=19 minBlockSize=91 maxBlockSize=230), range_facet_sl=MockVariableIntBlock(baseBlockSize=30), range_facet_si=Pulsing41(freqCutoff=19 minBlockSize=91 maxBlockSize=230), other_tl1=MockFixedIntBlock(blockSize=549), multiDefault=Pulsing41(freqCutoff=19 minBlockSize=91 maxBlockSize=230), a_si=MockFixedIntBlock(blockSize=549)}, sim=RandomSimilarityProvider(queryNorm=true,coord=yes): {}, locale=es_BO, timezone=America/Paramaribo
[junit4:junit4]   2> NOTE: FreeBSD 9.0-RELEASE amd64/Sun Microsystems Inc. 1.6.0_32 (64-bit)/cpus=16,threads=2,free=236499064,total=517275648
[junit4:junit4]   2> NOTE: All tests run in this JVM: [TestRangeQuery, CollectionsAPIDistributedZkTest, CacheHeaderTest, SortByFunctionTest, TestCoreContainer, DirectSolrConnectionTest, SpellPossibilityIteratorTest, TestQuerySenderNoQuery, WordBreakSolrSpellCheckerTest, TestPerFieldSimilarity, TestSuggestSpellingConverter, SimpleFacetsTest, CurrencyFieldTest, BasicDistributedZk2Test, TestCollationField, NumericFieldsTest, TestSearchPerf, DateFieldTest, TestPHPSerializedResponseWriter, UpdateRequestProcessorFactoryTest, IndexBasedSpellCheckerTest, TestLMJelinekMercerSimilarityFactory, TestQueryTypes, DateMathParserTest, HighlighterConfigTest, TestXIncludeConfig, ClusterStateTest, SolrRequestParserTest, CopyFieldTest, TestSolrQueryParser, BinaryUpdateRequestHandlerTest, SystemInfoHandlerTest, CSVRequestHandlerTest, AlternateDirectoryTest, TestJmxMonitoredMap, TestIndexingPerformance, AutoCommitTest, TestReload, ResponseLogComponentTest, TestRandomFaceting, CoreAdminHandlerTest, TestAnalyzedSuggestions, MoreLikeThisHandlerTest, ZkControllerTest, LeaderElectionIntegrationTest, TestBadConfig, SpellCheckComponentTest, NotRequiredUniqueKeyTest, FileBasedSpellCheckerTest, SuggesterFSTTest, SOLR749Test, TestBinaryResponseWriter, SearchHandlerTest, MinimalSchemaTest, OverseerTest, RecoveryZkTest, LeaderElectionTest, DistributedSpellCheckComponentTest, TestRealTimeGet, SpellCheckCollatorTest, TestExtendedDismaxParser, SoftAutoCommitTest, DistributedTermsComponentTest, StatsComponentTest, SolrCoreTest, DirectUpdateHandlerTest, TestMultiCoreConfBootstrap, TestGroupingSearch, TestFiltering, QueryElevationComponentTest, TestJmxIntegration, SampleTest, TestIndexSearcher, TestWordDelimiterFilterFactory, PolyFieldTest, SpatialFilterTest, DocumentBuilderTest, MBeansHandlerTest, TestPseudoReturnFields, TermsComponentTest, SolrInfoMBeanTest, XmlUpdateRequestHandlerTest, PingRequestHandlerTest, SuggesterWFSTTest, TestSurroundQueryParser, IndexSchemaRuntimeFieldTest, FastVectorHighlighterTest, JSONWriterTest, RequestHandlersTest, LoggingHandlerTest, SuggesterTSTTest, UniqFieldsUpdateProcessorFactoryTest, UpdateParamsTest, BadIndexSchemaTest, TestLuceneMatchVersion, TestWriterPerf, BadComponentTest, TestPropInjectDefaults, TestMergePolicyConfig, TestQuerySenderListener, IndexReaderFactoryTest, TestConfig, TestLMDirichletSimilarityFactory, TestCodecSupport, TestDefaultSimilarityFactory, TestFastLRUCache, OpenExchangeRatesOrgProviderTest, TestSystemIdResolver, SpellingQueryConverterTest, TestLRUCache, TestUtils, ZkNodePropsTest, PathHierarchyTokenizerFactoryTest, ShardRoutingCustomTest, SyncSliceTest]
[junit4:junit4] Completed on J0 in 142.81s, 1 test, 1 failure <<< FAILURES!

[...truncated 32 lines...]
BUILD FAILED
/usr/home/hudson/hudson-slave/workspace/Lucene-Solr-Tests-4.x-Java6/build.xml:353: The following error occurred while executing this line:
/usr/home/hudson/hudson-slave/workspace/Lucene-Solr-Tests-4.x-Java6/build.xml:39: The following error occurred while executing this line:
/usr/home/hudson/hudson-slave/workspace/Lucene-Solr-Tests-4.x-Java6/solr/build.xml:178: The following error occurred while executing this line:
/usr/home/hudson/hudson-slave/workspace/Lucene-Solr-Tests-4.x-Java6/solr/common-build.xml:438: The following error occurred while executing this line:
/usr/home/hudson/hudson-slave/workspace/Lucene-Solr-Tests-4.x-Java6/lucene/common-build.xml:1175: The following error occurred while executing this line:
/usr/home/hudson/hudson-slave/workspace/Lucene-Solr-Tests-4.x-Java6/lucene/common-build.xml:840: There were test failures: 244 suites, 1011 tests, 1 error, 1 failure, 21 ignored (3 assumptions)

Total time: 32 minutes 16 seconds
Build step 'Invoke Ant' marked build as failure
Archiving artifacts
Recording test results
Email was triggered for: Failure
Sending email for trigger: Failure



Mime
View raw message