lucene-dev mailing list archives

Site index · List index
Message view « Date » · « Thread »
Top « Date » · « Thread »
From Apache Jenkins Server <jenk...@builds.apache.org>
Subject [JENKINS] Lucene-Solr-NightlyTests-4.x - Build # 112 - Failure
Date Sun, 02 Dec 2012 20:10:13 GMT
Build: https://builds.apache.org/job/Lucene-Solr-NightlyTests-4.x/112/

2 tests failed.
REGRESSION:  org.apache.lucene.index.TestBagOfPositions.test

Error Message:
Test abandoned because suite timeout was reached.

Stack Trace:
java.lang.Exception: Test abandoned because suite timeout was reached.
	at __randomizedtesting.SeedInfo.seed([E4E0F4496BBBE86F]:0)


FAILED:  junit.framework.TestSuite.org.apache.lucene.index.TestBagOfPositions

Error Message:
Suite timeout exceeded (>= 7200000 msec).

Stack Trace:
java.lang.Exception: Suite timeout exceeded (>= 7200000 msec).
	at __randomizedtesting.SeedInfo.seed([E4E0F4496BBBE86F]:0)




Build Log:
[...truncated 1360 lines...]
[junit4:junit4] Suite: org.apache.lucene.index.TestBagOfPositions
[junit4:junit4]   2> 2012-12-3 2:05:06 com.carrotsearch.randomizedtesting.ThreadLeakControl$2
evaluate
[junit4:junit4]   2> WARNING: Suite execution timed out: org.apache.lucene.index.TestBagOfPositions
[junit4:junit4]   2> ==== jstack at approximately timeout time ====
[junit4:junit4]   2> "Thread-319" ID=415 RUNNABLE
[junit4:junit4]   2> 	at org.apache.lucene.store.MockIndexOutputWrapper.writeBytes(MockIndexOutputWrapper.java:118)
[junit4:junit4]   2> 	at org.apache.lucene.store.MockIndexOutputWrapper.writeByte(MockIndexOutputWrapper.java:73)
[junit4:junit4]   2> 	at org.apache.lucene.store.DataOutput.writeInt(DataOutput.java:70)
[junit4:junit4]   2> 	at org.apache.lucene.store.DataOutput.writeLong(DataOutput.java:205)
[junit4:junit4]   2> 	at org.apache.lucene.codecs.lucene40.Lucene40TermVectorsWriter.addRawDocuments(Lucene40TermVectorsWriter.java:298)
[junit4:junit4]   2> 	at org.apache.lucene.codecs.lucene40.Lucene40TermVectorsWriter.copyVectorsNoDeletions(Lucene40TermVectorsWriter.java:407)
[junit4:junit4]   2> 	at org.apache.lucene.codecs.lucene40.Lucene40TermVectorsWriter.merge(Lucene40TermVectorsWriter.java:330)
[junit4:junit4]   2> 	at org.apache.lucene.index.SegmentMerger.mergeVectors(SegmentMerger.java:261)
[junit4:junit4]   2> 	at org.apache.lucene.index.SegmentMerger.merge(SegmentMerger.java:115)
[junit4:junit4]   2> 	at org.apache.lucene.index.IndexWriter.mergeMiddle(IndexWriter.java:3682)
[junit4:junit4]   2> 	at org.apache.lucene.index.IndexWriter.merge(IndexWriter.java:3288)
[junit4:junit4]   2> 	at org.apache.lucene.index.SerialMergeScheduler.merge(SerialMergeScheduler.java:40)
[junit4:junit4]   2> 	- locked org.apache.lucene.index.SerialMergeScheduler@4f20a4cb
[junit4:junit4]   2> 	at org.apache.lucene.index.IndexWriter.maybeMerge(IndexWriter.java:1825)
[junit4:junit4]   2> 	at org.apache.lucene.index.IndexWriter.updateDocuments(IndexWriter.java:1236)
[junit4:junit4]   2> 	at org.apache.lucene.index.IndexWriter.addDocuments(IndexWriter.java:1186)
[junit4:junit4]   2> 	at org.apache.lucene.index.RandomIndexWriter.addDocument(RandomIndexWriter.java:172)
[junit4:junit4]   2> 	at org.apache.lucene.index.RandomIndexWriter.addDocument(RandomIndexWriter.java:160)
[junit4:junit4]   2> 	at org.apache.lucene.index.TestBagOfPositions$1.run(TestBagOfPositions.java:117)
[junit4:junit4]   2> 
[junit4:junit4]   2> "TEST-TestBagOfPositions.test-seed#[E4E0F4496BBBE86F]" ID=414 WAITING
on org.apache.lucene.index.TestBagOfPositions$1@36e5c19f
[junit4:junit4]   2> 	at java.lang.Object.wait(Native Method)
[junit4:junit4]   2> 	- waiting on org.apache.lucene.index.TestBagOfPositions$1@36e5c19f
[junit4:junit4]   2> 	at java.lang.Thread.join(Thread.java:1203)
[junit4:junit4]   2> 	at java.lang.Thread.join(Thread.java:1256)
[junit4:junit4]   2> 	at org.apache.lucene.index.TestBagOfPositions.test(TestBagOfPositions.java:128)
[junit4:junit4]   2> 	at sun.reflect.NativeMethodAccessorImpl.invoke0(Native Method)
[junit4:junit4]   2> 	at sun.reflect.NativeMethodAccessorImpl.invoke(NativeMethodAccessorImpl.java:57)
[junit4:junit4]   2> 	at sun.reflect.DelegatingMethodAccessorImpl.invoke(DelegatingMethodAccessorImpl.java:43)
[junit4:junit4]   2> 	at java.lang.reflect.Method.invoke(Method.java:616)
[junit4:junit4]   2> 	at com.carrotsearch.randomizedtesting.RandomizedRunner.invoke(RandomizedRunner.java:1559)
[junit4:junit4]   2> 	at com.carrotsearch.randomizedtesting.RandomizedRunner.access$600(RandomizedRunner.java:79)
[junit4:junit4]   2> 	at com.carrotsearch.randomizedtesting.RandomizedRunner$6.evaluate(RandomizedRunner.java:737)
[junit4:junit4]   2> 	at com.carrotsearch.randomizedtesting.RandomizedRunner$7.evaluate(RandomizedRunner.java:773)
[junit4:junit4]   2> 	at com.carrotsearch.randomizedtesting.RandomizedRunner$8.evaluate(RandomizedRunner.java:787)
[junit4:junit4]   2> 	at org.apache.lucene.util.TestRuleSetupTeardownChained$1.evaluate(TestRuleSetupTeardownChained.java:50)
[junit4:junit4]   2> 	at org.apache.lucene.util.TestRuleFieldCacheSanity$1.evaluate(TestRuleFieldCacheSanity.java:51)
[junit4:junit4]   2> 	at org.apache.lucene.util.AbstractBeforeAfterRule$1.evaluate(AbstractBeforeAfterRule.java:45)
[junit4:junit4]   2> 	at com.carrotsearch.randomizedtesting.rules.SystemPropertiesInvariantRule$1.evaluate(SystemPropertiesInvariantRule.java:55)
[junit4:junit4]   2> 	at org.apache.lucene.util.TestRuleThreadAndTestName$1.evaluate(TestRuleThreadAndTestName.java:48)
[junit4:junit4]   2> 	at org.apache.lucene.util.TestRuleIgnoreAfterMaxFailures$1.evaluate(TestRuleIgnoreAfterMaxFailures.java:70)
[junit4:junit4]   2> 	at org.apache.lucene.util.TestRuleMarkFailure$1.evaluate(TestRuleMarkFailure.java:48)
[junit4:junit4]   2> 	at com.carrotsearch.randomizedtesting.rules.StatementAdapter.evaluate(StatementAdapter.java:36)
[junit4:junit4]   2> 	at com.carrotsearch.randomizedtesting.ThreadLeakControl$StatementRunner.run(ThreadLeakControl.java:358)
[junit4:junit4]   2> 	at com.carrotsearch.randomizedtesting.ThreadLeakControl.forkTimeoutingTask(ThreadLeakControl.java:782)
[junit4:junit4]   2> 	at com.carrotsearch.randomizedtesting.ThreadLeakControl$3.evaluate(ThreadLeakControl.java:442)
[junit4:junit4]   2> 	at com.carrotsearch.randomizedtesting.RandomizedRunner.runSingleTest(RandomizedRunner.java:746)
[junit4:junit4]   2> 	at com.carrotsearch.randomizedtesting.RandomizedRunner$3.evaluate(RandomizedRunner.java:648)
[junit4:junit4]   2> 	at com.carrotsearch.randomizedtesting.RandomizedRunner$4.evaluate(RandomizedRunner.java:682)
[junit4:junit4]   2> 	at com.carrotsearch.randomizedtesting.RandomizedRunner$5.evaluate(RandomizedRunner.java:693)
[junit4:junit4]   2> 	at org.apache.lucene.util.AbstractBeforeAfterRule$1.evaluate(AbstractBeforeAfterRule.java:45)
[junit4:junit4]   2> 	at org.apache.lucene.util.TestRuleStoreClassName$1.evaluate(TestRuleStoreClassName.java:42)
[junit4:junit4]   2> 	at com.carrotsearch.randomizedtesting.rules.SystemPropertiesInvariantRule$1.evaluate(SystemPropertiesInvariantRule.java:55)
[junit4:junit4]   2> 	at com.carrotsearch.randomizedtesting.rules.NoShadowingOrOverridesOnMethodsRule$1.evaluate(NoShadowingOrOverridesOnMethodsRule.java:39)
[junit4:junit4]   2> 	at com.carrotsearch.randomizedtesting.rules.NoShadowingOrOverridesOnMethodsRule$1.evaluate(NoShadowingOrOverridesOnMethodsRule.java:39)
[junit4:junit4]   2> 	at com.carrotsearch.randomizedtesting.rules.StatementAdapter.evaluate(StatementAdapter.java:36)
[junit4:junit4]   2> 	at org.apache.lucene.util.TestRuleAssertionsRequired$1.evaluate(TestRuleAssertionsRequired.java:43)
[junit4:junit4]   2> 	at org.apache.lucene.util.TestRuleMarkFailure$1.evaluate(TestRuleMarkFailure.java:48)
[junit4:junit4]   2> 	at org.apache.lucene.util.TestRuleIgnoreAfterMaxFailures$1.evaluate(TestRuleIgnoreAfterMaxFailures.java:70)
[junit4:junit4]   2> 	at org.apache.lucene.util.TestRuleIgnoreTestSuites$1.evaluate(TestRuleIgnoreTestSuites.java:55)
[junit4:junit4]   2> 	at com.carrotsearch.randomizedtesting.rules.StatementAdapter.evaluate(StatementAdapter.java:36)
[junit4:junit4]   2> 	at com.carrotsearch.randomizedtesting.ThreadLeakControl$StatementRunner.run(ThreadLeakControl.java:358)
[junit4:junit4]   2> 	at java.lang.Thread.run(Thread.java:679)
[junit4:junit4]   2> 
[junit4:junit4]   2> "SUITE-TestBagOfPositions-seed#[E4E0F4496BBBE86F]" ID=413 RUNNABLE
[junit4:junit4]   2> 	at sun.management.ThreadImpl.dumpThreads0(Native Method)
[junit4:junit4]   2> 	at sun.management.ThreadImpl.dumpAllThreads(ThreadImpl.java:392)
[junit4:junit4]   2> 	at com.carrotsearch.randomizedtesting.ThreadLeakControl.formatThreadStacksFull(ThreadLeakControl.java:655)
[junit4:junit4]   2> 	at com.carrotsearch.randomizedtesting.ThreadLeakControl.access$800(ThreadLeakControl.java:60)
[junit4:junit4]   2> 	at com.carrotsearch.randomizedtesting.ThreadLeakControl$2.evaluate(ThreadLeakControl.java:396)
[junit4:junit4]   2> 	- locked java.lang.Object@68233402
[junit4:junit4]   2> 	at com.carrotsearch.randomizedtesting.RandomizedRunner.runSuite(RandomizedRunner.java:556)
[junit4:junit4]   2> 	at com.carrotsearch.randomizedtesting.RandomizedRunner.access$200(RandomizedRunner.java:79)
[junit4:junit4]   2> 	at com.carrotsearch.randomizedtesting.RandomizedRunner$1.run(RandomizedRunner.java:492)
[junit4:junit4]   2> 
[junit4:junit4]   2> "Signal Dispatcher" ID=4 RUNNABLE
[junit4:junit4]   2> 
[junit4:junit4]   2> "Finalizer" ID=3 WAITING on java.lang.ref.ReferenceQueue$Lock@5f2ba4b7
[junit4:junit4]   2> 	at java.lang.Object.wait(Native Method)
[junit4:junit4]   2> 	- waiting on java.lang.ref.ReferenceQueue$Lock@5f2ba4b7
[junit4:junit4]   2> 	at java.lang.ref.ReferenceQueue.remove(ReferenceQueue.java:133)
[junit4:junit4]   2> 	at java.lang.ref.ReferenceQueue.remove(ReferenceQueue.java:149)
[junit4:junit4]   2> 	at java.lang.ref.Finalizer$FinalizerThread.run(Finalizer.java:177)
[junit4:junit4]   2> 
[junit4:junit4]   2> "Reference Handler" ID=2 WAITING on java.lang.ref.Reference$Lock@2a4b1b31
[junit4:junit4]   2> 	at java.lang.Object.wait(Native Method)
[junit4:junit4]   2> 	- waiting on java.lang.ref.Reference$Lock@2a4b1b31
[junit4:junit4]   2> 	at java.lang.Object.wait(Object.java:502)
[junit4:junit4]   2> 	at java.lang.ref.Reference$ReferenceHandler.run(Reference.java:133)
[junit4:junit4]   2> 
[junit4:junit4]   2> "main" ID=1 WAITING on com.carrotsearch.randomizedtesting.RandomizedRunner$1@6a6832b1
[junit4:junit4]   2> 	at java.lang.Object.wait(Native Method)
[junit4:junit4]   2> 	- waiting on com.carrotsearch.randomizedtesting.RandomizedRunner$1@6a6832b1
[junit4:junit4]   2> 	at java.lang.Thread.join(Thread.java:1203)
[junit4:junit4]   2> 	at java.lang.Thread.join(Thread.java:1256)
[junit4:junit4]   2> 	at com.carrotsearch.randomizedtesting.RandomizedRunner.runSuite(RandomizedRunner.java:502)
[junit4:junit4]   2> 	at com.carrotsearch.randomizedtesting.RandomizedRunner.run(RandomizedRunner.java:399)
[junit4:junit4]   2> 	at com.carrotsearch.ant.tasks.junit4.slave.SlaveMain.execute(SlaveMain.java:161)
[junit4:junit4]   2> 	at com.carrotsearch.ant.tasks.junit4.slave.SlaveMain.main(SlaveMain.java:255)
[junit4:junit4]   2> 	at com.carrotsearch.ant.tasks.junit4.slave.SlaveMainSafe.main(SlaveMainSafe.java:12)
[junit4:junit4]   2> 
[junit4:junit4]   2> ^^==============================================
[junit4:junit4]   2> 
[junit4:junit4]   2> NOTE: download the large Jenkins line-docs file by running 'ant get-jenkins-line-docs'
in the lucene directory.
[junit4:junit4]   2> NOTE: reproduce with: ant test  -Dtestcase=TestBagOfPositions -Dtests.method=test
-Dtests.seed=E4E0F4496BBBE86F -Dtests.multiplier=3 -Dtests.nightly=true -Dtests.slow=true
-Dtests.linedocsfile=/home/hudson/lucene-data/enwiki.random.lines.txt -Dtests.locale=bg_BG
-Dtests.timezone=Etc/GMT-6 -Dtests.file.encoding=ISO-8859-1
[junit4:junit4] ERROR   7200s J0 | TestBagOfPositions.test <<<
[junit4:junit4]    > Throwable #1: java.lang.Exception: Test abandoned because suite timeout
was reached.
[junit4:junit4]    > 	at __randomizedtesting.SeedInfo.seed([E4E0F4496BBBE86F]:0)
[junit4:junit4]   2> 2012-12-3 2:05:06 com.carrotsearch.randomizedtesting.ThreadLeakControl
checkThreadLeaks
[junit4:junit4]   2> WARNING: Will linger awaiting termination of 2 leaked thread(s).
[junit4:junit4]   2> 2012-12-3 2:05:26 com.carrotsearch.randomizedtesting.ThreadLeakControl
checkThreadLeaks
[junit4:junit4]   2> SEVERE: 2 threads leaked from SUITE scope at org.apache.lucene.index.TestBagOfPositions:

[junit4:junit4]   2>    1) Thread[id=414, name=TEST-TestBagOfPositions.test-seed#[E4E0F4496BBBE86F],
state=WAITING, group=TGRP-TestBagOfPositions]
[junit4:junit4]   2>         at java.lang.Object.wait(Native Method)
[junit4:junit4]   2>         at java.lang.Thread.join(Thread.java:1203)
[junit4:junit4]   2>         at java.lang.Thread.join(Thread.java:1256)
[junit4:junit4]   2>         at org.apache.lucene.index.TestBagOfPositions.test(TestBagOfPositions.java:128)
[junit4:junit4]   2>         at sun.reflect.NativeMethodAccessorImpl.invoke0(Native Method)
[junit4:junit4]   2>         at sun.reflect.NativeMethodAccessorImpl.invoke(NativeMethodAccessorImpl.java:57)
[junit4:junit4]   2>         at sun.reflect.DelegatingMethodAccessorImpl.invoke(DelegatingMethodAccessorImpl.java:43)
[junit4:junit4]   2>         at java.lang.reflect.Method.invoke(Method.java:616)
[junit4:junit4]   2>         at com.carrotsearch.randomizedtesting.RandomizedRunner.invoke(RandomizedRunner.java:1559)
[junit4:junit4]   2>         at com.carrotsearch.randomizedtesting.RandomizedRunner.access$600(RandomizedRunner.java:79)
[junit4:junit4]   2>         at com.carrotsearch.randomizedtesting.RandomizedRunner$6.evaluate(RandomizedRunner.java:737)
[junit4:junit4]   2>         at com.carrotsearch.randomizedtesting.RandomizedRunner$7.evaluate(RandomizedRunner.java:773)
[junit4:junit4]   2>         at com.carrotsearch.randomizedtesting.RandomizedRunner$8.evaluate(RandomizedRunner.java:787)
[junit4:junit4]   2>         at org.apache.lucene.util.TestRuleSetupTeardownChained$1.evaluate(TestRuleSetupTeardownChained.java:50)
[junit4:junit4]   2>         at org.apache.lucene.util.TestRuleFieldCacheSanity$1.evaluate(TestRuleFieldCacheSanity.java:51)
[junit4:junit4]   2>         at org.apache.lucene.util.AbstractBeforeAfterRule$1.evaluate(AbstractBeforeAfterRule.java:45)
[junit4:junit4]   2>         at com.carrotsearch.randomizedtesting.rules.SystemPropertiesInvariantRule$1.evaluate(SystemPropertiesInvariantRule.java:55)
[junit4:junit4]   2>         at org.apache.lucene.util.TestRuleThreadAndTestName$1.evaluate(TestRuleThreadAndTestName.java:48)
[junit4:junit4]   2>         at org.apache.lucene.util.TestRuleIgnoreAfterMaxFailures$1.evaluate(TestRuleIgnoreAfterMaxFailures.java:70)
[junit4:junit4]   2>         at org.apache.lucene.util.TestRuleMarkFailure$1.evaluate(TestRuleMarkFailure.java:48)
[junit4:junit4]   2>         at com.carrotsearch.randomizedtesting.rules.StatementAdapter.evaluate(StatementAdapter.java:36)
[junit4:junit4]   2>         at com.carrotsearch.randomizedtesting.ThreadLeakControl$StatementRunner.run(ThreadLeakControl.java:358)
[junit4:junit4]   2>         at com.carrotsearch.randomizedtesting.ThreadLeakControl.forkTimeoutingTask(ThreadLeakControl.java:782)
[junit4:junit4]   2>         at com.carrotsearch.randomizedtesting.ThreadLeakControl$3.evaluate(ThreadLeakControl.java:442)
[junit4:junit4]   2>         at com.carrotsearch.randomizedtesting.RandomizedRunner.runSingleTest(RandomizedRunner.java:746)
[junit4:junit4]   2>         at com.carrotsearch.randomizedtesting.RandomizedRunner$3.evaluate(RandomizedRunner.java:648)
[junit4:junit4]   2>         at com.carrotsearch.randomizedtesting.RandomizedRunner$4.evaluate(RandomizedRunner.java:682)
[junit4:junit4]   2>         at com.carrotsearch.randomizedtesting.RandomizedRunner$5.evaluate(RandomizedRunner.java:693)
[junit4:junit4]   2>         at org.apache.lucene.util.AbstractBeforeAfterRule$1.evaluate(AbstractBeforeAfterRule.java:45)
[junit4:junit4]   2>         at org.apache.lucene.util.TestRuleStoreClassName$1.evaluate(TestRuleStoreClassName.java:42)
[junit4:junit4]   2>         at com.carrotsearch.randomizedtesting.rules.SystemPropertiesInvariantRule$1.evaluate(SystemPropertiesInvariantRule.java:55)
[junit4:junit4]   2>         at com.carrotsearch.randomizedtesting.rules.NoShadowingOrOverridesOnMethodsRule$1.evaluate(NoShadowingOrOverridesOnMethodsRule.java:39)
[junit4:junit4]   2>         at com.carrotsearch.randomizedtesting.rules.NoShadowingOrOverridesOnMethodsRule$1.evaluate(NoShadowingOrOverridesOnMethodsRule.java:39)
[junit4:junit4]   2>         at com.carrotsearch.randomizedtesting.rules.StatementAdapter.evaluate(StatementAdapter.java:36)
[junit4:junit4]   2>         at org.apache.lucene.util.TestRuleAssertionsRequired$1.evaluate(TestRuleAssertionsRequired.java:43)
[junit4:junit4]   2>         at org.apache.lucene.util.TestRuleMarkFailure$1.evaluate(TestRuleMarkFailure.java:48)
[junit4:junit4]   2>         at org.apache.lucene.util.TestRuleIgnoreAfterMaxFailures$1.evaluate(TestRuleIgnoreAfterMaxFailures.java:70)
[junit4:junit4]   2>         at org.apache.lucene.util.TestRuleIgnoreTestSuites$1.evaluate(TestRuleIgnoreTestSuites.java:55)
[junit4:junit4]   2>         at com.carrotsearch.randomizedtesting.rules.StatementAdapter.evaluate(StatementAdapter.java:36)
[junit4:junit4]   2>         at com.carrotsearch.randomizedtesting.ThreadLeakControl$StatementRunner.run(ThreadLeakControl.java:358)
[junit4:junit4]   2>         at java.lang.Thread.run(Thread.java:679)
[junit4:junit4]   2>    2) Thread[id=415, name=Thread-319, state=TIMED_WAITING, group=TGRP-TestBagOfPositions]
[junit4:junit4]   2>         at java.lang.Thread.sleep(Native Method)
[junit4:junit4]   2>         at java.lang.Thread.sleep(Thread.java:319)
[junit4:junit4]   2>         at org.apache.lucene.store.RateLimiter$SimpleRateLimiter.pause(RateLimiter.java:108)
[junit4:junit4]   2>         at org.apache.lucene.store.RateLimitedIndexOutput.flushBuffer(RateLimitedIndexOutput.java:45)
[junit4:junit4]   2>         at org.apache.lucene.store.BufferedIndexOutput.flushBuffer(BufferedIndexOutput.java:90)
[junit4:junit4]   2>         at org.apache.lucene.store.BufferedIndexOutput.flush(BufferedIndexOutput.java:79)
[junit4:junit4]   2>         at org.apache.lucene.store.RateLimitedIndexOutput.flush(RateLimitedIndexOutput.java:69)
[junit4:junit4]   2>         at org.apache.lucene.store.BufferedIndexOutput.writeBytes(BufferedIndexOutput.java:69)
[junit4:junit4]   2>         at org.apache.lucene.store.DataOutput.copyBytes(DataOutput.java:255)
[junit4:junit4]   2>         at org.apache.lucene.store.MockIndexOutputWrapper.copyBytes(MockIndexOutputWrapper.java:154)
[junit4:junit4]   2>         at org.apache.lucene.codecs.lucene40.Lucene40TermVectorsWriter.addRawDocuments(Lucene40TermVectorsWriter.java:302)
[junit4:junit4]   2>         at org.apache.lucene.codecs.lucene40.Lucene40TermVectorsWriter.copyVectorsNoDeletions(Lucene40TermVectorsWriter.java:407)
[junit4:junit4]   2>         at org.apache.lucene.codecs.lucene40.Lucene40TermVectorsWriter.merge(Lucene40TermVectorsWriter.java:330)
[junit4:junit4]   2>         at org.apache.lucene.index.SegmentMerger.mergeVectors(SegmentMerger.java:261)
[junit4:junit4]   2>         at org.apache.lucene.index.SegmentMerger.merge(SegmentMerger.java:115)
[junit4:junit4]   2>         at org.apache.lucene.index.IndexWriter.mergeMiddle(IndexWriter.java:3682)
[junit4:junit4]   2>         at org.apache.lucene.index.IndexWriter.merge(IndexWriter.java:3288)
[junit4:junit4]   2>         at org.apache.lucene.index.SerialMergeScheduler.merge(SerialMergeScheduler.java:40)
[junit4:junit4]   2>         at org.apache.lucene.index.IndexWriter.maybeMerge(IndexWriter.java:1825)
[junit4:junit4]   2>         at org.apache.lucene.index.IndexWriter.updateDocument(IndexWriter.java:1462)
[junit4:junit4]   2>         at org.apache.lucene.index.IndexWriter.addDocument(IndexWriter.java:1126)
[junit4:junit4]   2>         at org.apache.lucene.index.RandomIndexWriter.addDocument(RandomIndexWriter.java:201)
[junit4:junit4]   2>         at org.apache.lucene.index.RandomIndexWriter.addDocument(RandomIndexWriter.java:160)
[junit4:junit4]   2>         at org.apache.lucene.index.TestBagOfPositions$1.run(TestBagOfPositions.java:117)
[junit4:junit4]   2> 2012-12-3 2:05:26 com.carrotsearch.randomizedtesting.ThreadLeakControl
tryToInterruptAll
[junit4:junit4]   2> INFO: Starting to interrupt leaked threads:
[junit4:junit4]   2>    1) Thread[id=414, name=TEST-TestBagOfPositions.test-seed#[E4E0F4496BBBE86F],
state=WAITING, group=TGRP-TestBagOfPositions]
[junit4:junit4]   2>    2) Thread[id=415, name=Thread-319, state=TIMED_WAITING, group=TGRP-TestBagOfPositions]
[junit4:junit4]   2> 2012-12-3 2:05:26 com.carrotsearch.randomizedtesting.ThreadLeakControl
tryToInterruptAll
[junit4:junit4]   2> INFO: All leaked threads terminated.
[junit4:junit4]   2> NOTE: test params are: codec=Lucene41: {field=PostingsFormat(name=TestBloomFilteredLucene41Postings)},
sim=RandomSimilarityProvider(queryNorm=true,coord=crazy): {}, locale=bg_BG, timezone=Etc/GMT-6
[junit4:junit4]   2> NOTE: FreeBSD 9.0-RELEASE amd64/Sun Microsystems Inc. 1.6.0_32 (64-bit)/cpus=16,threads=1,free=115354816,total=303104000
[junit4:junit4]   2> NOTE: All tests run in this JVM: [TestMultiThreadTermVectors, TestIndexWriterOnJRECrash,
TestIndexWriterForceMerge, TestFastCompressionMode, TestSnapshotDeletionPolicy, TestDateFilter,
TestSubScorerFreqs, TestTopDocsCollector, TestWorstCaseTestBehavior, Nested, TestMergeSchedulerExternal,
TestIndexableField, TestFlushByRamOrCountsPolicy, TestMatchAllDocsQuery, TestPrefixQuery,
TestDemo, TestPerFieldPostingsFormat2, TestComplexExplanations, TestMultiLevelSkipList, Test2BTerms,
Nested, Nested, TestCrash, TestAutomatonQueryUnicode, TestDeterminism, TestParallelReaderEmptyIndex,
TestSumDocFreq, TestSimilarityBase, TestWindowsMMap, TestConcurrentMergeScheduler, TestSearchForDuplicates,
TestBitVector, TestImpersonation, TestArrayUtil, TestNumericUtils, TestFuzzyQuery, TestDocBoost,
TestRecyclingIntBlockAllocator, TestIndexCommit, TestBagOfPositions]
[junit4:junit4]   2> NOTE: download the large Jenkins line-docs file by running 'ant get-jenkins-line-docs'
in the lucene directory.
[junit4:junit4]   2> NOTE: reproduce with: ant test  -Dtestcase=TestBagOfPositions -Dtests.seed=E4E0F4496BBBE86F
-Dtests.multiplier=3 -Dtests.nightly=true -Dtests.slow=true -Dtests.linedocsfile=/home/hudson/lucene-data/enwiki.random.lines.txt
-Dtests.locale=bg_BG -Dtests.timezone=Etc/GMT-6 -Dtests.file.encoding=ISO-8859-1
[junit4:junit4] ERROR   0.00s J0 | TestBagOfPositions (suite) <<<
[junit4:junit4]    > Throwable #1: java.lang.Exception: Suite timeout exceeded (>= 7200000
msec).
[junit4:junit4]    > 	at __randomizedtesting.SeedInfo.seed([E4E0F4496BBBE86F]:0)
[junit4:junit4] Completed on J0 in 7220.37s, 1 test, 2 errors <<< FAILURES!

[...truncated 141 lines...]
BUILD FAILED
/usr/home/hudson/hudson-slave/workspace/Lucene-Solr-NightlyTests-4.x/build.xml:335: The following
error occurred while executing this line:
/usr/home/hudson/hudson-slave/workspace/Lucene-Solr-NightlyTests-4.x/build.xml:39: The following
error occurred while executing this line:
/usr/home/hudson/hudson-slave/workspace/Lucene-Solr-NightlyTests-4.x/lucene/build.xml:50:
The following error occurred while executing this line:
/usr/home/hudson/hudson-slave/workspace/Lucene-Solr-NightlyTests-4.x/lucene/common-build.xml:1163:
The following error occurred while executing this line:
/usr/home/hudson/hudson-slave/workspace/Lucene-Solr-NightlyTests-4.x/lucene/common-build.xml:827:
There were test failures: 328 suites, 1895 tests, 1 suite-level error, 1 error, 14 ignored
(2 assumptions)

Total time: 126 minutes 51 seconds
Build step 'Invoke Ant' marked build as failure
Archiving artifacts
Recording test results
Email was triggered for: Failure
Sending email for trigger: Failure



Mime
View raw message