lucene-dev mailing list archives

Site index · List index
Message view « Date » · « Thread »
Top « Date » · « Thread »
From Apache Jenkins Server <jenk...@builds.apache.org>
Subject [JENKINS] Lucene-Solr-Tests-trunk-java7 - Build # 3562 - Failure
Date Wed, 19 Dec 2012 12:35:02 GMT
Build: https://builds.apache.org/job/Lucene-Solr-Tests-trunk-java7/3562/

1 tests failed.
REGRESSION:  org.apache.solr.cloud.BasicDistributedZkTest.testDistribSearch

Error Message:
No registered leader was found, collection:unloadcollection slice:shard1

Stack Trace:
org.apache.solr.common.SolrException: No registered leader was found, collection:unloadcollection slice:shard1
	at __randomizedtesting.SeedInfo.seed([16AC7ADD38A4D5F:808C49B5A4D52D63]:0)
	at org.apache.solr.common.cloud.ZkStateReader.getLeaderRetry(ZkStateReader.java:429)
	at org.apache.solr.common.cloud.ZkStateReader.getLeaderUrl(ZkStateReader.java:403)
	at org.apache.solr.cloud.BasicDistributedZkTest.testCoreUnloadAndLeaders(BasicDistributedZkTest.java:564)
	at org.apache.solr.cloud.BasicDistributedZkTest.doTest(BasicDistributedZkTest.java:337)
	at org.apache.solr.BaseDistributedSearchTestCase.testDistribSearch(BaseDistributedSearchTestCase.java:794)
	at sun.reflect.NativeMethodAccessorImpl.invoke0(Native Method)
	at sun.reflect.NativeMethodAccessorImpl.invoke(NativeMethodAccessorImpl.java:57)
	at sun.reflect.DelegatingMethodAccessorImpl.invoke(DelegatingMethodAccessorImpl.java:43)
	at java.lang.reflect.Method.invoke(Method.java:601)
	at com.carrotsearch.randomizedtesting.RandomizedRunner.invoke(RandomizedRunner.java:1559)
	at com.carrotsearch.randomizedtesting.RandomizedRunner.access$600(RandomizedRunner.java:79)
	at com.carrotsearch.randomizedtesting.RandomizedRunner$6.evaluate(RandomizedRunner.java:737)
	at com.carrotsearch.randomizedtesting.RandomizedRunner$7.evaluate(RandomizedRunner.java:773)
	at com.carrotsearch.randomizedtesting.RandomizedRunner$8.evaluate(RandomizedRunner.java:787)
	at com.carrotsearch.randomizedtesting.rules.SystemPropertiesRestoreRule$1.evaluate(SystemPropertiesRestoreRule.java:53)
	at org.apache.lucene.util.TestRuleSetupTeardownChained$1.evaluate(TestRuleSetupTeardownChained.java:50)
	at org.apache.lucene.util.TestRuleFieldCacheSanity$1.evaluate(TestRuleFieldCacheSanity.java:51)
	at org.apache.lucene.util.AbstractBeforeAfterRule$1.evaluate(AbstractBeforeAfterRule.java:46)
	at com.carrotsearch.randomizedtesting.rules.SystemPropertiesInvariantRule$1.evaluate(SystemPropertiesInvariantRule.java:55)
	at org.apache.lucene.util.TestRuleThreadAndTestName$1.evaluate(TestRuleThreadAndTestName.java:49)
	at org.apache.lucene.util.TestRuleIgnoreAfterMaxFailures$1.evaluate(TestRuleIgnoreAfterMaxFailures.java:70)
	at org.apache.lucene.util.TestRuleMarkFailure$1.evaluate(TestRuleMarkFailure.java:48)
	at com.carrotsearch.randomizedtesting.rules.StatementAdapter.evaluate(StatementAdapter.java:36)
	at com.carrotsearch.randomizedtesting.ThreadLeakControl$StatementRunner.run(ThreadLeakControl.java:358)
	at com.carrotsearch.randomizedtesting.ThreadLeakControl.forkTimeoutingTask(ThreadLeakControl.java:782)
	at com.carrotsearch.randomizedtesting.ThreadLeakControl$3.evaluate(ThreadLeakControl.java:442)
	at com.carrotsearch.randomizedtesting.RandomizedRunner.runSingleTest(RandomizedRunner.java:746)
	at com.carrotsearch.randomizedtesting.RandomizedRunner$3.evaluate(RandomizedRunner.java:648)
	at com.carrotsearch.randomizedtesting.RandomizedRunner$4.evaluate(RandomizedRunner.java:682)
	at com.carrotsearch.randomizedtesting.RandomizedRunner$5.evaluate(RandomizedRunner.java:693)
	at com.carrotsearch.randomizedtesting.rules.StatementAdapter.evaluate(StatementAdapter.java:36)
	at com.carrotsearch.randomizedtesting.rules.SystemPropertiesRestoreRule$1.evaluate(SystemPropertiesRestoreRule.java:53)
	at org.apache.lucene.util.AbstractBeforeAfterRule$1.evaluate(AbstractBeforeAfterRule.java:46)
	at org.apache.lucene.util.TestRuleStoreClassName$1.evaluate(TestRuleStoreClassName.java:42)
	at com.carrotsearch.randomizedtesting.rules.SystemPropertiesInvariantRule$1.evaluate(SystemPropertiesInvariantRule.java:55)
	at com.carrotsearch.randomizedtesting.rules.NoShadowingOrOverridesOnMethodsRule$1.evaluate(NoShadowingOrOverridesOnMethodsRule.java:39)
	at com.carrotsearch.randomizedtesting.rules.NoShadowingOrOverridesOnMethodsRule$1.evaluate(NoShadowingOrOverridesOnMethodsRule.java:39)
	at com.carrotsearch.randomizedtesting.rules.StatementAdapter.evaluate(StatementAdapter.java:36)
	at org.apache.lucene.util.TestRuleAssertionsRequired$1.evaluate(TestRuleAssertionsRequired.java:43)
	at org.apache.lucene.util.TestRuleMarkFailure$1.evaluate(TestRuleMarkFailure.java:48)
	at org.apache.lucene.util.TestRuleIgnoreAfterMaxFailures$1.evaluate(TestRuleIgnoreAfterMaxFailures.java:70)
	at org.apache.lucene.util.TestRuleIgnoreTestSuites$1.evaluate(TestRuleIgnoreTestSuites.java:55)
	at com.carrotsearch.randomizedtesting.rules.StatementAdapter.evaluate(StatementAdapter.java:36)
	at com.carrotsearch.randomizedtesting.ThreadLeakControl$StatementRunner.run(ThreadLeakControl.java:358)
	at java.lang.Thread.run(Thread.java:722)




Build Log:
[...truncated 9340 lines...]
[junit4:junit4] Suite: org.apache.solr.cloud.BasicDistributedZkTest
[junit4:junit4]   2> 0 T960 oas.BaseDistributedSearchTestCase.initHostContext Setting hostContext system property: /k/a
[junit4:junit4]   2> 6 T960 oas.SolrTestCaseJ4.setUp ###Starting testDistribSearch
[junit4:junit4]   2> Creating dataDir: /usr/home/hudson/hudson-slave/workspace/Lucene-Solr-Tests-trunk-java7/solr/build/solr-core/test/J0/./solrtest-BasicDistributedZkTest-1355919973665
[junit4:junit4]   2> 7 T960 oasc.ZkTestServer.run STARTING ZK TEST SERVER
[junit4:junit4]   2> 8 T961 oasc.ZkTestServer$ZKServerMain.runFromConfig Starting server
[junit4:junit4]   2> 10 T961 oazs.ZooKeeperServer.setTickTime tickTime set to 1000
[junit4:junit4]   2> 11 T961 oazs.ZooKeeperServer.setMinSessionTimeout minSessionTimeout set to -1
[junit4:junit4]   2> 11 T961 oazs.ZooKeeperServer.setMaxSessionTimeout maxSessionTimeout set to -1
[junit4:junit4]   2> 11 T961 oazs.NIOServerCnxnFactory.configure binding to port 0.0.0.0/0.0.0.0:0
[junit4:junit4]   2> 12 T961 oazsp.FileTxnSnapLog.save Snapshotting: 0x0 to /usr/home/hudson/hudson-slave/workspace/Lucene-Solr-Tests-trunk-java7/solr/build/solr-core/test/J0/./org.apache.solr.cloud.BasicDistributedZkTest-1355919973665/zookeeper/server1/data/version-2/snapshot.0
[junit4:junit4]   2> 109 T960 oasc.ZkTestServer.run start zk server on port:40979
[junit4:junit4]   2> 110 T960 oaz.ZooKeeper.<init> Initiating client connection, connectString=127.0.0.1:40979 sessionTimeout=10000 watcher=org.apache.solr.common.cloud.ConnectionManager@36d0ddcb
[junit4:junit4]   2> 110 T960 oascc.ConnectionManager.waitForConnected Waiting for client to connect to ZooKeeper
[junit4:junit4]   2> 111 T966 oaz.ClientCnxn$SendThread.logStartConnect Opening socket connection to server localhost/127.0.0.1:40979. Will not attempt to authenticate using SASL (access denied ("javax.security.auth.AuthPermission" "getLoginConfiguration"))
[junit4:junit4]   2> 112 T966 oaz.ClientCnxn$SendThread.primeConnection Socket connection established to localhost/127.0.0.1:40979, initiating session
[junit4:junit4]   2> 112 T962 oazs.NIOServerCnxnFactory.run Accepted socket connection from /140.211.11.196:64170
[junit4:junit4]   2> 112 T962 oazs.ZooKeeperServer.processConnectRequest Client attempting to establish new session at /140.211.11.196:64170
[junit4:junit4]   2> 113 T964 oazsp.FileTxnLog.append Creating new log file: log.1
[junit4:junit4]   2> 115 T964 oazs.ZooKeeperServer.finishSessionInit Established session 0x13bb320dd270000 with negotiated timeout 10000 for client /140.211.11.196:64170
[junit4:junit4]   2> 115 T966 oaz.ClientCnxn$SendThread.onConnected Session establishment complete on server localhost/127.0.0.1:40979, sessionid = 0x13bb320dd270000, negotiated timeout = 10000
[junit4:junit4]   2> 116 T967 oascc.ConnectionManager.process Watcher org.apache.solr.common.cloud.ConnectionManager@36d0ddcb name:ZooKeeperConnection Watcher:127.0.0.1:40979 got event WatchedEvent state:SyncConnected type:None path:null path:null type:None
[junit4:junit4]   2> 116 T960 oascc.ConnectionManager.waitForConnected Client is connected to ZooKeeper
[junit4:junit4]   2> 117 T960 oascc.SolrZkClient.makePath makePath: /solr
[junit4:junit4]   2> 120 T965 oazs.PrepRequestProcessor.pRequest2Txn Processed session termination for sessionid: 0x13bb320dd270000
[junit4:junit4]   2> 121 T967 oaz.ClientCnxn$EventThread.run EventThread shut down
[junit4:junit4]   2> 122 T962 oazs.NIOServerCnxn.closeSock Closed socket connection for client /140.211.11.196:64170 which had sessionid 0x13bb320dd270000
[junit4:junit4]   2> 121 T960 oaz.ZooKeeper.close Session: 0x13bb320dd270000 closed
[junit4:junit4]   2> 123 T960 oaz.ZooKeeper.<init> Initiating client connection, connectString=127.0.0.1:40979/solr sessionTimeout=10000 watcher=org.apache.solr.common.cloud.ConnectionManager@67250963
[junit4:junit4]   2> 124 T960 oascc.ConnectionManager.waitForConnected Waiting for client to connect to ZooKeeper
[junit4:junit4]   2> 124 T968 oaz.ClientCnxn$SendThread.logStartConnect Opening socket connection to server localhost/127.0.0.1:40979. Will not attempt to authenticate using SASL (access denied ("javax.security.auth.AuthPermission" "getLoginConfiguration"))
[junit4:junit4]   2> 125 T968 oaz.ClientCnxn$SendThread.primeConnection Socket connection established to localhost/127.0.0.1:40979, initiating session
[junit4:junit4]   2> 125 T962 oazs.NIOServerCnxnFactory.run Accepted socket connection from /140.211.11.196:25202
[junit4:junit4]   2> 125 T962 oazs.ZooKeeperServer.processConnectRequest Client attempting to establish new session at /140.211.11.196:25202
[junit4:junit4]   2> 126 T964 oazs.ZooKeeperServer.finishSessionInit Established session 0x13bb320dd270001 with negotiated timeout 10000 for client /140.211.11.196:25202
[junit4:junit4]   2> 126 T968 oaz.ClientCnxn$SendThread.onConnected Session establishment complete on server localhost/127.0.0.1:40979, sessionid = 0x13bb320dd270001, negotiated timeout = 10000
[junit4:junit4]   2> 127 T969 oascc.ConnectionManager.process Watcher org.apache.solr.common.cloud.ConnectionManager@67250963 name:ZooKeeperConnection Watcher:127.0.0.1:40979/solr got event WatchedEvent state:SyncConnected type:None path:null path:null type:None
[junit4:junit4]   2> 127 T960 oascc.ConnectionManager.waitForConnected Client is connected to ZooKeeper
[junit4:junit4]   2> 128 T960 oascc.SolrZkClient.makePath makePath: /collections/collection1
[junit4:junit4]   2> 132 T960 oascc.SolrZkClient.makePath makePath: /collections/collection1/shards
[junit4:junit4]   2> 136 T960 oascc.SolrZkClient.makePath makePath: /collections/control_collection
[junit4:junit4]   2> 139 T960 oascc.SolrZkClient.makePath makePath: /collections/control_collection/shards
[junit4:junit4]   2> 143 T960 oasc.AbstractZkTestCase.putConfig put /usr/home/hudson/hudson-slave/workspace/Lucene-Solr-Tests-trunk-java7/solr/build/solr-core/test-files/solr/collection1/conf/solrconfig.xml to /configs/conf1/solrconfig.xml
[junit4:junit4]   2> 144 T960 oascc.SolrZkClient.makePath makePath: /configs/conf1/solrconfig.xml
[junit4:junit4]   2> 151 T960 oasc.AbstractZkTestCase.putConfig put /usr/home/hudson/hudson-slave/workspace/Lucene-Solr-Tests-trunk-java7/solr/build/solr-core/test-files/solr/collection1/conf/schema.xml to /configs/conf1/schema.xml
[junit4:junit4]   2> 152 T960 oascc.SolrZkClient.makePath makePath: /configs/conf1/schema.xml
[junit4:junit4]   2> 259 T960 oasc.AbstractZkTestCase.putConfig put /usr/home/hudson/hudson-slave/workspace/Lucene-Solr-Tests-trunk-java7/solr/build/solr-core/test-files/solr/collection1/conf/stopwords.txt to /configs/conf1/stopwords.txt
[junit4:junit4]   2> 260 T960 oascc.SolrZkClient.makePath makePath: /configs/conf1/stopwords.txt
[junit4:junit4]   2> 273 T960 oasc.AbstractZkTestCase.putConfig put /usr/home/hudson/hudson-slave/workspace/Lucene-Solr-Tests-trunk-java7/solr/build/solr-core/test-files/solr/collection1/conf/protwords.txt to /configs/conf1/protwords.txt
[junit4:junit4]   2> 274 T960 oascc.SolrZkClient.makePath makePath: /configs/conf1/protwords.txt
[junit4:junit4]   2> 280 T960 oasc.AbstractZkTestCase.putConfig put /usr/home/hudson/hudson-slave/workspace/Lucene-Solr-Tests-trunk-java7/solr/build/solr-core/test-files/solr/collection1/conf/currency.xml to /configs/conf1/currency.xml
[junit4:junit4]   2> 281 T960 oascc.SolrZkClient.makePath makePath: /configs/conf1/currency.xml
[junit4:junit4]   2> 288 T960 oasc.AbstractZkTestCase.putConfig put /usr/home/hudson/hudson-slave/workspace/Lucene-Solr-Tests-trunk-java7/solr/build/solr-core/test-files/solr/collection1/conf/open-exchange-rates.json to /configs/conf1/open-exchange-rates.json
[junit4:junit4]   2> 289 T960 oascc.SolrZkClient.makePath makePath: /configs/conf1/open-exchange-rates.json
[junit4:junit4]   2> 298 T960 oasc.AbstractZkTestCase.putConfig put /usr/home/hudson/hudson-slave/workspace/Lucene-Solr-Tests-trunk-java7/solr/build/solr-core/test-files/solr/collection1/conf/mapping-ISOLatin1Accent.txt to /configs/conf1/mapping-ISOLatin1Accent.txt
[junit4:junit4]   2> 299 T960 oascc.SolrZkClient.makePath makePath: /configs/conf1/mapping-ISOLatin1Accent.txt
[junit4:junit4]   2> 306 T960 oasc.AbstractZkTestCase.putConfig put /usr/home/hudson/hudson-slave/workspace/Lucene-Solr-Tests-trunk-java7/solr/build/solr-core/test-files/solr/collection1/conf/old_synonyms.txt to /configs/conf1/old_synonyms.txt
[junit4:junit4]   2> 307 T960 oascc.SolrZkClient.makePath makePath: /configs/conf1/old_synonyms.txt
[junit4:junit4]   2> 316 T960 oasc.AbstractZkTestCase.putConfig put /usr/home/hudson/hudson-slave/workspace/Lucene-Solr-Tests-trunk-java7/solr/build/solr-core/test-files/solr/collection1/conf/synonyms.txt to /configs/conf1/synonyms.txt
[junit4:junit4]   2> 317 T960 oascc.SolrZkClient.makePath makePath: /configs/conf1/synonyms.txt
[junit4:junit4]   2> 324 T965 oazs.PrepRequestProcessor.pRequest2Txn Processed session termination for sessionid: 0x13bb320dd270001
[junit4:junit4]   2> 325 T969 oaz.ClientCnxn$EventThread.run EventThread shut down
[junit4:junit4]   2> 325 T960 oaz.ZooKeeper.close Session: 0x13bb320dd270001 closed
[junit4:junit4]   2> 325 T962 oazs.NIOServerCnxn.closeSock Closed socket connection for client /140.211.11.196:25202 which had sessionid 0x13bb320dd270001
[junit4:junit4]   2> 440 T960 oejs.Server.doStart jetty-8.1.8.v20121106
[junit4:junit4]   2> 444 T960 oejs.AbstractConnector.doStart Started SocketConnector@127.0.0.1:27534
[junit4:junit4]   2> 445 T960 oasc.SolrResourceLoader.locateSolrHome JNDI not configured for solr (NoInitialContextEx)
[junit4:junit4]   2> 445 T960 oasc.SolrResourceLoader.locateSolrHome using system property solr.solr.home: /usr/home/hudson/hudson-slave/workspace/Lucene-Solr-Tests-trunk-java7/solr/build/solr-core/test/J0/./org.apache.solr.cloud.BasicDistributedZkTest-controljetty-1355919973984
[junit4:junit4]   2> 446 T960 oasc.SolrResourceLoader.<init> new SolrResourceLoader for deduced Solr Home: '/usr/home/hudson/hudson-slave/workspace/Lucene-Solr-Tests-trunk-java7/solr/build/solr-core/test/J0/./org.apache.solr.cloud.BasicDistributedZkTest-controljetty-1355919973984/'
[junit4:junit4]   2> 482 T960 oass.SolrDispatchFilter.init SolrDispatchFilter.init()
[junit4:junit4]   2> 483 T960 oasc.SolrResourceLoader.locateSolrHome JNDI not configured for solr (NoInitialContextEx)
[junit4:junit4]   2> 483 T960 oasc.SolrResourceLoader.locateSolrHome using system property solr.solr.home: /usr/home/hudson/hudson-slave/workspace/Lucene-Solr-Tests-trunk-java7/solr/build/solr-core/test/J0/./org.apache.solr.cloud.BasicDistributedZkTest-controljetty-1355919973984
[junit4:junit4]   2> 484 T960 oasc.CoreContainer$Initializer.initialize looking for solr.xml: /usr/home/hudson/hudson-slave/workspace/Lucene-Solr-Tests-trunk-java7/solr/build/solr-core/test/J0/./org.apache.solr.cloud.BasicDistributedZkTest-controljetty-1355919973984/solr.xml
[junit4:junit4]   2> 484 T960 oasc.CoreContainer.<init> New CoreContainer 358761778
[junit4:junit4]   2> 485 T960 oasc.CoreContainer.load Loading CoreContainer using Solr Home: '/usr/home/hudson/hudson-slave/workspace/Lucene-Solr-Tests-trunk-java7/solr/build/solr-core/test/J0/./org.apache.solr.cloud.BasicDistributedZkTest-controljetty-1355919973984/'
[junit4:junit4]   2> 485 T960 oasc.SolrResourceLoader.<init> new SolrResourceLoader for directory: '/usr/home/hudson/hudson-slave/workspace/Lucene-Solr-Tests-trunk-java7/solr/build/solr-core/test/J0/./org.apache.solr.cloud.BasicDistributedZkTest-controljetty-1355919973984/'
[junit4:junit4]   2> 506 T960 oashc.HttpShardHandlerFactory.getParameter Setting socketTimeout to: 30000
[junit4:junit4]   2> 507 T960 oashc.HttpShardHandlerFactory.getParameter Setting urlScheme to: http://
[junit4:junit4]   2> 507 T960 oashc.HttpShardHandlerFactory.getParameter Setting connTimeout to: 15000
[junit4:junit4]   2> 508 T960 oashc.HttpShardHandlerFactory.getParameter Setting maxConnectionsPerHost to: 20
[junit4:junit4]   2> 508 T960 oashc.HttpShardHandlerFactory.getParameter Setting corePoolSize to: 0
[junit4:junit4]   2> 508 T960 oashc.HttpShardHandlerFactory.getParameter Setting maximumPoolSize to: 2147483647
[junit4:junit4]   2> 509 T960 oashc.HttpShardHandlerFactory.getParameter Setting maxThreadIdleTime to: 5
[junit4:junit4]   2> 509 T960 oashc.HttpShardHandlerFactory.getParameter Setting sizeOfQueue to: -1
[junit4:junit4]   2> 510 T960 oashc.HttpShardHandlerFactory.getParameter Setting fairnessPolicy to: false
[junit4:junit4]   2> 510 T960 oascsi.HttpClientUtil.createClient Creating new http client, config:maxConnectionsPerHost=20&maxConnections=10000&socketTimeout=30000&connTimeout=15000&retry=false
[junit4:junit4]   2> 527 T960 oasc.CoreContainer.load Registering Log Listener
[junit4:junit4]   2> 541 T960 oasc.CoreContainer.initZooKeeper Zookeeper client=127.0.0.1:40979/solr
[junit4:junit4]   2> 542 T960 oasc.ZkController.checkChrootPath zkHost includes chroot
[junit4:junit4]   2> 543 T960 oaz.ZooKeeper.<init> Initiating client connection, connectString=127.0.0.1:40979 sessionTimeout=60000 watcher=org.apache.solr.common.cloud.ConnectionManager@7c7a6ea8
[junit4:junit4]   2> 544 T960 oascc.ConnectionManager.waitForConnected Waiting for client to connect to ZooKeeper
[junit4:junit4]   2> 544 T979 oaz.ClientCnxn$SendThread.logStartConnect Opening socket connection to server localhost/127.0.0.1:40979. Will not attempt to authenticate using SASL (access denied ("javax.security.auth.AuthPermission" "getLoginConfiguration"))
[junit4:junit4]   2> 545 T979 oaz.ClientCnxn$SendThread.primeConnection Socket connection established to localhost/127.0.0.1:40979, initiating session
[junit4:junit4]   2> 545 T962 oazs.NIOServerCnxnFactory.run Accepted socket connection from /140.211.11.196:22827
[junit4:junit4]   2> 545 T962 oazs.ZooKeeperServer.processConnectRequest Client attempting to establish new session at /140.211.11.196:22827
[junit4:junit4]   2> 551 T964 oazs.ZooKeeperServer.finishSessionInit Established session 0x13bb320dd270002 with negotiated timeout 20000 for client /140.211.11.196:22827
[junit4:junit4]   2> 551 T979 oaz.ClientCnxn$SendThread.onConnected Session establishment complete on server localhost/127.0.0.1:40979, sessionid = 0x13bb320dd270002, negotiated timeout = 20000
[junit4:junit4]   2> 552 T980 oascc.ConnectionManager.process Watcher org.apache.solr.common.cloud.ConnectionManager@7c7a6ea8 name:ZooKeeperConnection Watcher:127.0.0.1:40979 got event WatchedEvent state:SyncConnected type:None path:null path:null type:None
[junit4:junit4]   2> 552 T960 oascc.ConnectionManager.waitForConnected Client is connected to ZooKeeper
[junit4:junit4]   2> 554 T965 oazs.PrepRequestProcessor.pRequest2Txn Processed session termination for sessionid: 0x13bb320dd270002
[junit4:junit4]   2> 559 T980 oaz.ClientCnxn$EventThread.run EventThread shut down
[junit4:junit4]   2> 559 T960 oaz.ZooKeeper.close Session: 0x13bb320dd270002 closed
[junit4:junit4]   2> 559 T962 oazs.NIOServerCnxn.closeSock Closed socket connection for client /140.211.11.196:22827 which had sessionid 0x13bb320dd270002
[junit4:junit4]   2> 560 T960 oascsi.HttpClientUtil.createClient Creating new http client, config:maxConnections=500&maxConnectionsPerHost=16&socketTimeout=15000&connTimeout=30000
[junit4:junit4]   2> 569 T960 oaz.ZooKeeper.<init> Initiating client connection, connectString=127.0.0.1:40979/solr sessionTimeout=30000 watcher=org.apache.solr.common.cloud.ConnectionManager@556e7c01
[junit4:junit4]   2> 570 T960 oascc.ConnectionManager.waitForConnected Waiting for client to connect to ZooKeeper
[junit4:junit4]   2> 571 T981 oaz.ClientCnxn$SendThread.logStartConnect Opening socket connection to server localhost/127.0.0.1:40979. Will not attempt to authenticate using SASL (access denied ("javax.security.auth.AuthPermission" "getLoginConfiguration"))
[junit4:junit4]   2> 571 T981 oaz.ClientCnxn$SendThread.primeConnection Socket connection established to localhost/127.0.0.1:40979, initiating session
[junit4:junit4]   2> 572 T962 oazs.NIOServerCnxnFactory.run Accepted socket connection from /140.211.11.196:36604
[junit4:junit4]   2> 572 T962 oazs.ZooKeeperServer.processConnectRequest Client attempting to establish new session at /140.211.11.196:36604
[junit4:junit4]   2> 573 T964 oazs.ZooKeeperServer.finishSessionInit Established session 0x13bb320dd270003 with negotiated timeout 20000 for client /140.211.11.196:36604
[junit4:junit4]   2> 573 T981 oaz.ClientCnxn$SendThread.onConnected Session establishment complete on server localhost/127.0.0.1:40979, sessionid = 0x13bb320dd270003, negotiated timeout = 20000
[junit4:junit4]   2> 573 T982 oascc.ConnectionManager.process Watcher org.apache.solr.common.cloud.ConnectionManager@556e7c01 name:ZooKeeperConnection Watcher:127.0.0.1:40979/solr got event WatchedEvent state:SyncConnected type:None path:null path:null type:None
[junit4:junit4]   2> 574 T960 oascc.ConnectionManager.waitForConnected Client is connected to ZooKeeper
[junit4:junit4]   2> 576 T965 oazs.PrepRequestProcessor.pRequest Got user-level KeeperException when processing sessionid:0x13bb320dd270003 type:create cxid:0x2 zxid:0x1a txntype:-1 reqpath:n/a Error Path:/solr/overseer Error:KeeperErrorCode = NodeExists for /solr/overseer
[junit4:junit4]   2> 578 T960 oascc.SolrZkClient.makePath makePath: /live_nodes
[junit4:junit4]   2> 580 T960 oasc.ZkController.createEphemeralLiveNode Register node as live in ZooKeeper:/live_nodes/127.0.0.1:27534_k%2Fa
[junit4:junit4]   2> 581 T965 oazs.PrepRequestProcessor.pRequest Got user-level KeeperException when processing sessionid:0x13bb320dd270003 type:delete cxid:0x7 zxid:0x1c txntype:-1 reqpath:n/a Error Path:/solr/live_nodes/127.0.0.1:27534_k%2Fa Error:KeeperErrorCode = NoNode for /solr/live_nodes/127.0.0.1:27534_k%2Fa
[junit4:junit4]   2> 590 T960 oascc.SolrZkClient.makePath makePath: /live_nodes/127.0.0.1:27534_k%2Fa
[junit4:junit4]   2> 593 T960 oascc.SolrZkClient.makePath makePath: /overseer_elect/election
[junit4:junit4]   2> 602 T965 oazs.PrepRequestProcessor.pRequest Got user-level KeeperException when processing sessionid:0x13bb320dd270003 type:delete cxid:0x15 zxid:0x21 txntype:-1 reqpath:n/a Error Path:/solr/overseer_elect/leader Error:KeeperErrorCode = NoNode for /solr/overseer_elect/leader
[junit4:junit4]   2> 611 T960 oascc.SolrZkClient.makePath makePath: /overseer_elect/leader
[junit4:junit4]   2> 614 T960 oasc.Overseer.start Overseer (id=88861571394502659-127.0.0.1:27534_k%2Fa-n_0000000000) starting
[junit4:junit4]   2> 615 T965 oazs.PrepRequestProcessor.pRequest Got user-level KeeperException when processing sessionid:0x13bb320dd270003 type:create cxid:0x1a zxid:0x23 txntype:-1 reqpath:n/a Error Path:/solr/overseer Error:KeeperErrorCode = NodeExists for /solr/overseer
[junit4:junit4]   2> 616 T965 oazs.PrepRequestProcessor.pRequest Got user-level KeeperException when processing sessionid:0x13bb320dd270003 type:create cxid:0x1b zxid:0x24 txntype:-1 reqpath:n/a Error Path:/solr/overseer Error:KeeperErrorCode = NodeExists for /solr/overseer
[junit4:junit4]   2> 624 T965 oazs.PrepRequestProcessor.pRequest Got user-level KeeperException when processing sessionid:0x13bb320dd270003 type:create cxid:0x1c zxid:0x25 txntype:-1 reqpath:n/a Error Path:/solr/overseer Error:KeeperErrorCode = NodeExists for /solr/overseer
[junit4:junit4]   2> 625 T965 oazs.PrepRequestProcessor.pRequest Got user-level KeeperException when processing sessionid:0x13bb320dd270003 type:create cxid:0x1d zxid:0x26 txntype:-1 reqpath:n/a Error Path:/solr/overseer Error:KeeperErrorCode = NodeExists for /solr/overseer
[junit4:junit4]   2> 626 T984 oasc.OverseerCollectionProcessor.run Process current queue of collection messages
[junit4:junit4]   2> 627 T960 oascc.SolrZkClient.makePath makePath: /clusterstate.json
[junit4:junit4]   2> 630 T960 oascc.ZkStateReader.createClusterStateWatchersAndUpdate Updating cluster state from ZooKeeper... 
[junit4:junit4]   2> 632 T983 oasc.Overseer$ClusterStateUpdater.run Starting to work on the main queue
[junit4:junit4]   2> 637 T985 oasc.CoreContainer.create Creating SolrCore 'collection1' using instanceDir: /usr/home/hudson/hudson-slave/workspace/Lucene-Solr-Tests-trunk-java7/solr/build/solr-core/test/J0/./org.apache.solr.cloud.BasicDistributedZkTest-controljetty-1355919973984/collection1
[junit4:junit4]   2> 637 T985 oasc.ZkController.createCollectionZkNode Check for collection zkNode:control_collection
[junit4:junit4]   2> 638 T985 oasc.ZkController.createCollectionZkNode Collection zkNode exists
[junit4:junit4]   2> 638 T985 oasc.ZkController.readConfigName Load collection config from:/collections/control_collection
[junit4:junit4]   2> 639 T985 oasc.SolrResourceLoader.<init> new SolrResourceLoader for directory: '/usr/home/hudson/hudson-slave/workspace/Lucene-Solr-Tests-trunk-java7/solr/build/solr-core/test/J0/./org.apache.solr.cloud.BasicDistributedZkTest-controljetty-1355919973984/collection1/'
[junit4:junit4]   2> 640 T985 oasc.SolrResourceLoader.replaceClassLoader Adding 'file:/usr/home/hudson/hudson-slave/workspace/Lucene-Solr-Tests-trunk-java7/solr/build/solr-core/test/J0/org.apache.solr.cloud.BasicDistributedZkTest-controljetty-1355919973984/collection1/lib/README' to classloader
[junit4:junit4]   2> 641 T985 oasc.SolrResourceLoader.replaceClassLoader Adding 'file:/usr/home/hudson/hudson-slave/workspace/Lucene-Solr-Tests-trunk-java7/solr/build/solr-core/test/J0/org.apache.solr.cloud.BasicDistributedZkTest-controljetty-1355919973984/collection1/lib/classes/' to classloader
[junit4:junit4]   2> 682 T985 oasc.SolrConfig.<init> Using Lucene MatchVersion: LUCENE_50
[junit4:junit4]   2> 732 T985 oasc.SolrConfig.<init> Loaded SolrConfig: solrconfig.xml
[junit4:junit4]   2> 833 T985 oass.IndexSchema.readSchema Reading Solr Schema
[junit4:junit4]   2> 838 T985 oass.IndexSchema.readSchema Schema name=test
[junit4:junit4]   2> 1406 T985 oass.OpenExchangeRatesOrgProvider.init Initialized with rates=open-exchange-rates.json, refreshInterval=1440.
[junit4:junit4]   2> 1417 T985 oass.IndexSchema.readSchema default search field in schema is text
[junit4:junit4]   2> 1422 T985 oass.IndexSchema.readSchema unique key field: id
[junit4:junit4]   2> 1440 T985 oass.FileExchangeRateProvider.reload Reloading exchange rates from file currency.xml
[junit4:junit4]   2> 1445 T985 oass.FileExchangeRateProvider.reload Reloading exchange rates from file currency.xml
[junit4:junit4]   2> 1451 T985 oass.OpenExchangeRatesOrgProvider.reload Reloading exchange rates from open-exchange-rates.json
[junit4:junit4]   2> 1453 T985 oass.OpenExchangeRatesOrgProvider.reload Reloading exchange rates from open-exchange-rates.json
[junit4:junit4]   2> 1455 T985 oasc.SolrCore.<init> [collection1] Opening new SolrCore at /usr/home/hudson/hudson-slave/workspace/Lucene-Solr-Tests-trunk-java7/solr/build/solr-core/test/J0/./org.apache.solr.cloud.BasicDistributedZkTest-controljetty-1355919973984/collection1/, dataDir=./org.apache.solr.cloud.BasicDistributedZkTest-1355919973665/control/data/
[junit4:junit4]   2> 1455 T985 oasc.JmxMonitoredMap.<init> JMX monitoring is enabled. Adding Solr mbeans to JMX Server: com.sun.jmx.mbeanserver.JmxMBeanServer@380d8f5c
[junit4:junit4]   2> 1456 T985 oasc.SolrCore.initDirectoryFactory solr.NRTCachingDirectoryFactory
[junit4:junit4]   2> 1457 T985 oasc.CachingDirectoryFactory.get return new directory for /usr/home/hudson/hudson-slave/workspace/Lucene-Solr-Tests-trunk-java7/solr/build/solr-core/test/J0/./org.apache.solr.cloud.BasicDistributedZkTest-1355919973665/control/data forceNew:false
[junit4:junit4]   2> 1458 T985 oasc.CachingDirectoryFactory.close Releasing directory:/usr/home/hudson/hudson-slave/workspace/Lucene-Solr-Tests-trunk-java7/solr/build/solr-core/test/J0/./org.apache.solr.cloud.BasicDistributedZkTest-1355919973665/control/data
[junit4:junit4]   2> 1458 T985 oasc.SolrCore.getNewIndexDir New index directory detected: old=null new=./org.apache.solr.cloud.BasicDistributedZkTest-1355919973665/control/data/index/
[junit4:junit4]   2> 1459 T985 oasc.SolrCore.initIndex WARNING [collection1] Solr index directory './org.apache.solr.cloud.BasicDistributedZkTest-1355919973665/control/data/index' doesn't exist. Creating new index...
[junit4:junit4]   2> 1460 T985 oasc.CachingDirectoryFactory.get return new directory for /usr/home/hudson/hudson-slave/workspace/Lucene-Solr-Tests-trunk-java7/solr/build/solr-core/test/J0/./org.apache.solr.cloud.BasicDistributedZkTest-1355919973665/control/data/index forceNew:false
[junit4:junit4]   2> 1467 T985 oasc.SolrDeletionPolicy.onCommit SolrDeletionPolicy.onCommit: commits:num=1
[junit4:junit4]   2> 		commit{dir=RateLimitedDirectoryWrapper(NRTCachingDirectory(org.apache.lucene.store.NIOFSDirectory@/usr/home/hudson/hudson-slave/workspace/Lucene-Solr-Tests-trunk-java7/solr/build/solr-core/test/J0/org.apache.solr.cloud.BasicDistributedZkTest-1355919973665/control/data/index lockFactory=org.apache.lucene.store.NativeFSLockFactory@1911ba2b; maxCacheMB=48.0 maxMergeSizeMB=4.0)),segFN=segments_1,generation=1,filenames=[segments_1]
[junit4:junit4]   2> 1468 T985 oasc.SolrDeletionPolicy.updateCommits newest commit = 1[segments_1]
[junit4:junit4]   2> 1469 T985 oasc.CachingDirectoryFactory.close Releasing directory:/usr/home/hudson/hudson-slave/workspace/Lucene-Solr-Tests-trunk-java7/solr/build/solr-core/test/J0/./org.apache.solr.cloud.BasicDistributedZkTest-1355919973665/control/data/index
[junit4:junit4]   2> 1469 T985 oasc.SolrCore.initWriters created xml: solr.XMLResponseWriter
[junit4:junit4]   2> 1471 T985 oasup.UpdateRequestProcessorChain.init inserting DistributedUpdateProcessorFactory into updateRequestProcessorChain "dedupe"
[junit4:junit4]   2> 1472 T985 oasup.UpdateRequestProcessorChain.init inserting DistributedUpdateProcessorFactory into updateRequestProcessorChain "dedupe-allfields"
[junit4:junit4]   2> 1472 T985 oasup.UpdateRequestProcessorChain.init inserting DistributedUpdateProcessorFactory into updateRequestProcessorChain "stored_sig"
[junit4:junit4]   2> 1473 T985 oasup.UpdateRequestProcessorChain.init inserting DistributedUpdateProcessorFactory into updateRequestProcessorChain "uniq-fields"
[junit4:junit4]   2> 1473 T985 oasup.UpdateRequestProcessorChain.init inserting DistributedUpdateProcessorFactory into updateRequestProcessorChain "distrib-dup-test-chain-implicit"
[junit4:junit4]   2> 1474 T985 oasc.RequestHandlers.initHandlersFromConfig adding lazy requestHandler: solr.ReplicationHandler
[junit4:junit4]   2> 1474 T985 oasc.RequestHandlers.initHandlersFromConfig created /replication: solr.ReplicationHandler
[junit4:junit4]   2> 1475 T985 oasc.RequestHandlers.initHandlersFromConfig created standard: solr.StandardRequestHandler
[junit4:junit4]   2> 1476 T985 oasc.RequestHandlers.initHandlersFromConfig created /get: solr.RealTimeGetHandler
[junit4:junit4]   2> 1478 T985 oasc.RequestHandlers.initHandlersFromConfig created dismax: solr.SearchHandler
[junit4:junit4]   2> 1479 T985 oasc.RequestHandlers.initHandlersFromConfig created mock: org.apache.solr.core.MockQuerySenderListenerReqHandler
[junit4:junit4]   2> 1480 T985 oasc.RequestHandlers.initHandlersFromConfig created /admin/: org.apache.solr.handler.admin.AdminHandlers
[junit4:junit4]   2> 1481 T985 oasc.RequestHandlers.initHandlersFromConfig created defaults: solr.StandardRequestHandler
[junit4:junit4]   2> 1481 T985 oasc.RequestHandlers.initHandlersFromConfig adding lazy requestHandler: solr.StandardRequestHandler
[junit4:junit4]   2> 1481 T985 oasc.RequestHandlers.initHandlersFromConfig created lazy: solr.StandardRequestHandler
[junit4:junit4]   2> 1482 T985 oasc.RequestHandlers.initHandlersFromConfig created /update: solr.UpdateRequestHandler
[junit4:junit4]   2> 1483 T985 oasc.RequestHandlers.initHandlersFromConfig created /terms: org.apache.solr.handler.component.SearchHandler
[junit4:junit4]   2> 1484 T985 oasc.RequestHandlers.initHandlersFromConfig created spellCheckCompRH: org.apache.solr.handler.component.SearchHandler
[junit4:junit4]   2> 1485 T985 oasc.RequestHandlers.initHandlersFromConfig created spellCheckCompRH_Direct: org.apache.solr.handler.component.SearchHandler
[junit4:junit4]   2> 1486 T985 oasc.RequestHandlers.initHandlersFromConfig created spellCheckWithWordbreak: org.apache.solr.handler.component.SearchHandler
[junit4:junit4]   2> 1487 T985 oasc.RequestHandlers.initHandlersFromConfig created spellCheckWithWordbreak_Direct: org.apache.solr.handler.component.SearchHandler
[junit4:junit4]   2> 1488 T985 oasc.RequestHandlers.initHandlersFromConfig created spellCheckCompRH1: org.apache.solr.handler.component.SearchHandler
[junit4:junit4]   2> 1489 T985 oasc.RequestHandlers.initHandlersFromConfig created mltrh: org.apache.solr.handler.component.SearchHandler
[junit4:junit4]   2> 1490 T985 oasc.RequestHandlers.initHandlersFromConfig created tvrh: org.apache.solr.handler.component.SearchHandler
[junit4:junit4]   2> 1491 T985 oasc.RequestHandlers.initHandlersFromConfig created /mlt: solr.MoreLikeThisHandler
[junit4:junit4]   2> 1492 T985 oasc.RequestHandlers.initHandlersFromConfig created /debug/dump: solr.DumpRequestHandler
[junit4:junit4]   2> 1506 T985 oashl.XMLLoader.init xsltCacheLifetimeSeconds=60
[junit4:junit4]   2> 1511 T985 oasc.SolrCore.initDeprecatedSupport WARNING solrconfig.xml uses deprecated <admin/gettableFiles>, Please update your config to use the ShowFileRequestHandler.
[junit4:junit4]   2> 1513 T985 oasc.SolrCore.initDeprecatedSupport WARNING adding ShowFileRequestHandler with hidden files: [SCHEMA.XML, OLD_SYNONYMS.TXT, STOPWORDS.TXT, PROTWORDS.TXT, OPEN-EXCHANGE-RATES.JSON, SYNONYMS.TXT, CURRENCY.XML, MAPPING-ISOLATIN1ACCENT.TXT]
[junit4:junit4]   2> 1516 T985 oasc.CachingDirectoryFactory.close Releasing directory:/usr/home/hudson/hudson-slave/workspace/Lucene-Solr-Tests-trunk-java7/solr/build/solr-core/test/J0/./org.apache.solr.cloud.BasicDistributedZkTest-1355919973665/control/data
[junit4:junit4]   2> 1518 T985 oass.SolrIndexSearcher.<init> Opening Searcher@79daf9a main
[junit4:junit4]   2> 1519 T985 oasu.CommitTracker.<init> Hard AutoCommit: disabled
[junit4:junit4]   2> 1520 T985 oasu.CommitTracker.<init> Soft AutoCommit: disabled
[junit4:junit4]   2> 1520 T985 oashc.SpellCheckComponent.inform Initializing spell checkers
[junit4:junit4]   2> 1528 T985 oass.DirectSolrSpellChecker.init init: {name=direct,classname=DirectSolrSpellChecker,field=lowerfilt,minQueryLength=3}
[junit4:junit4]   2> 1592 T986 oasc.SolrCore.registerSearcher [collection1] Registered new searcher Searcher@79daf9a main{StandardDirectoryReader(segments_1:1)}
[junit4:junit4]   2> 1596 T985 oasc.ZkController.publish publishing core=collection1 state=down
[junit4:junit4]   2> 1596 T985 oasc.ZkController.publish numShards not found on descriptor - reading it from system property
[junit4:junit4]   2> 1597 T965 oazs.PrepRequestProcessor.pRequest Got user-level KeeperException when processing sessionid:0x13bb320dd270003 type:create cxid:0x53 zxid:0x29 txntype:-1 reqpath:n/a Error Path:/solr/overseer/queue Error:KeeperErrorCode = NoNode for /solr/overseer/queue
[junit4:junit4]   2> 1638 T983 oascc.ZkStateReader.updateClusterState Updating cloud state from ZooKeeper... 
[junit4:junit4]   2> 1639 T983 oasc.Overseer$ClusterStateUpdater.updateState Update state numShards=1 message={
[junit4:junit4]   2> 	  "operation":"state",
[junit4:junit4]   2> 	  "numShards":"1",
[junit4:junit4]   2> 	  "shard":null,
[junit4:junit4]   2> 	  "roles":null,
[junit4:junit4]   2> 	  "state":"down",
[junit4:junit4]   2> 	  "core":"collection1",
[junit4:junit4]   2> 	  "collection":"control_collection",
[junit4:junit4]   2> 	  "node_name":"127.0.0.1:27534_k%2Fa",
[junit4:junit4]   2> 	  "base_url":"http://127.0.0.1:27534/k/a"}
[junit4:junit4]   2> 1639 T983 oasc.Overseer$ClusterStateUpdater.createCollection Create collection control_collection with numShards 1
[junit4:junit4]   2> 1639 T983 oasc.Overseer$ClusterStateUpdater.updateState Assigning new node to shard shard=shard1
[junit4:junit4]   2> 1640 T965 oazs.PrepRequestProcessor.pRequest Got user-level KeeperException when processing sessionid:0x13bb320dd270003 type:create cxid:0x5b zxid:0x2c txntype:-1 reqpath:n/a Error Path:/solr/overseer/queue-work Error:KeeperErrorCode = NoNode for /solr/overseer/queue-work
[junit4:junit4]   2> 1655 T982 oascc.ZkStateReader$2.process A cluster state change: WatchedEvent state:SyncConnected type:NodeDataChanged path:/clusterstate.json, has occurred - updating... (live nodes size: 1)
[junit4:junit4]   2> 2110 T985 oasc.CoreContainer.registerCore registering core: collection1
[junit4:junit4]   2> 2110 T985 oasc.ZkController.register Register replica - core:collection1 address:http://127.0.0.1:27534/k/a collection:control_collection shard:shard1
[junit4:junit4]   2> 2112 T985 oascc.SolrZkClient.makePath makePath: /collections/control_collection/leader_elect/shard1/election
[junit4:junit4]   2> 2217 T965 oazs.PrepRequestProcessor.pRequest Got user-level KeeperException when processing sessionid:0x13bb320dd270003 type:delete cxid:0x78 zxid:0x36 txntype:-1 reqpath:n/a Error Path:/solr/collections/control_collection/leaders Error:KeeperErrorCode = NoNode for /solr/collections/control_collection/leaders
[junit4:junit4]   2> 2229 T985 oasc.ShardLeaderElectionContext.runLeaderProcess Running the leader process.
[junit4:junit4]   2> 2230 T965 oazs.PrepRequestProcessor.pRequest Got user-level KeeperException when processing sessionid:0x13bb320dd270003 type:create cxid:0x79 zxid:0x37 txntype:-1 reqpath:n/a Error Path:/solr/overseer Error:KeeperErrorCode = NodeExists for /solr/overseer
[junit4:junit4]   2> 2233 T985 oasc.ShardLeaderElectionContext.waitForReplicasToComeUp Enough replicas found to continue.
[junit4:junit4]   2> 2233 T985 oasc.ShardLeaderElectionContext.runLeaderProcess I may be the new leader - try and sync
[junit4:junit4]   2> 2233 T985 oasc.SyncStrategy.sync Sync replicas to http://127.0.0.1:27534/k/a/collection1/
[junit4:junit4]   2> 2234 T985 oasc.SyncStrategy.syncReplicas Sync Success - now sync replicas to me
[junit4:junit4]   2> 2234 T985 oasc.SyncStrategy.syncToMe http://127.0.0.1:27534/k/a/collection1/ has no replicas
[junit4:junit4]   2> 2234 T985 oasc.ShardLeaderElectionContext.runLeaderProcess I am the new leader: http://127.0.0.1:27534/k/a/collection1/
[junit4:junit4]   2> 2235 T985 oascc.SolrZkClient.makePath makePath: /collections/control_collection/leaders/shard1
[junit4:junit4]   2> 2261 T965 oazs.PrepRequestProcessor.pRequest Got user-level KeeperException when processing sessionid:0x13bb320dd270003 type:create cxid:0x83 zxid:0x3b txntype:-1 reqpath:n/a Error Path:/solr/overseer Error:KeeperErrorCode = NodeExists for /solr/overseer
[junit4:junit4]   2> 2719 T983 oascc.ZkStateReader.updateClusterState Updating cloud state from ZooKeeper... 
[junit4:junit4]   2> 2740 T982 oascc.ZkStateReader$2.process A cluster state change: WatchedEvent state:SyncConnected type:NodeDataChanged path:/clusterstate.json, has occurred - updating... (live nodes size: 1)
[junit4:junit4]   2> 2757 T985 oasc.ZkController.register We are http://127.0.0.1:27534/k/a/collection1/ and leader is http://127.0.0.1:27534/k/a/collection1/
[junit4:junit4]   2> 2757 T985 oasc.ZkController.register No LogReplay needed for core=collection1 baseURL=http://127.0.0.1:27534/k/a
[junit4:junit4]   2> 2757 T985 oasc.ZkController.checkRecovery I am the leader, no recovery necessary
[junit4:junit4]   2> 2758 T985 oasc.ZkController.publish publishing core=collection1 state=active
[junit4:junit4]   2> 2758 T985 oasc.ZkController.publish numShards not found on descriptor - reading it from system property
[junit4:junit4]   2> 2760 T985 oascc.ZkStateReader.updateClusterState Updating cloud state from ZooKeeper... 
[junit4:junit4]   2> 2761 T960 oass.SolrDispatchFilter.init user.dir=/usr/home/hudson/hudson-slave/workspace/Lucene-Solr-Tests-trunk-java7/solr/build/solr-core/test/J0
[junit4:junit4]   2> 2762 T960 oass.SolrDispatchFilter.init SolrDispatchFilter.init() done
[junit4:junit4]   2> 2762 T960 oascsi.HttpClientUtil.createClient Creating new http client, config:maxConnections=128&maxConnectionsPerHost=32&followRedirects=false
[junit4:junit4]   2> 2772 T960 oascsi.HttpClientUtil.createClient Creating new http client, config:
[junit4:junit4]   2> 2780 T960 oaz.ZooKeeper.<init> Initiating client connection, connectString=127.0.0.1:40979/solr sessionTimeout=10000 watcher=org.apache.solr.common.cloud.ConnectionManager@46a66bdb
[junit4:junit4]   2> 2782 T960 oascc.ConnectionManager.waitForConnected Waiting for client to connect to ZooKeeper
[junit4:junit4]   2> 2782 T987 oaz.ClientCnxn$SendThread.logStartConnect Opening socket connection to server localhost/127.0.0.1:40979. Will not attempt to authenticate using SASL (access denied ("javax.security.auth.AuthPermission" "getLoginConfiguration"))
[junit4:junit4]   2> 2783 T987 oaz.ClientCnxn$SendThread.primeConnection Socket connection established to localhost/127.0.0.1:40979, initiating session
[junit4:junit4]   2> 2783 T962 oazs.NIOServerCnxnFactory.run Accepted socket connection from /140.211.11.196:20534
[junit4:junit4]   2> 2783 T962 oazs.ZooKeeperServer.processConnectRequest Client attempting to establish new session at /140.211.11.196:20534
[junit4:junit4]   2> 2785 T964 oazs.ZooKeeperServer.finishSessionInit Established session 0x13bb320dd270004 with negotiated timeout 10000 for client /140.211.11.196:20534
[junit4:junit4]   2> 2785 T987 oaz.ClientCnxn$SendThread.onConnected Session establishment complete on server localhost/127.0.0.1:40979, sessionid = 0x13bb320dd270004, negotiated timeout = 10000
[junit4:junit4]   2> 2785 T988 oascc.ConnectionManager.process Watcher org.apache.solr.common.cloud.ConnectionManager@46a66bdb name:ZooKeeperConnection Watcher:127.0.0.1:40979/solr got event WatchedEvent state:SyncConnected type:None path:null path:null type:None
[junit4:junit4]   2> 2785 T960 oascc.ConnectionManager.waitForConnected Client is connected to ZooKeeper
[junit4:junit4]   2> 2787 T960 oascc.ZkStateReader.createClusterStateWatchersAndUpdate Updating cluster state from ZooKeeper... 
[junit4:junit4]   2> 2795 T960 oasc.ChaosMonkey.monkeyLog monkey: init - expire sessions:true cause connection loss:true
[junit4:junit4]   2> 2911 T960 oejs.Server.doStart jetty-8.1.8.v20121106
[junit4:junit4]   2> 2914 T960 oejs.AbstractConnector.doStart Started SocketConnector@127.0.0.1:56415
[junit4:junit4]   2> 2915 T960 oasc.SolrResourceLoader.locateSolrHome JNDI not configured for solr (NoInitialContextEx)
[junit4:junit4]   2> 2916 T960 oasc.SolrResourceLoader.locateSolrHome using system property solr.solr.home: /usr/home/hudson/hudson-slave/workspace/Lucene-Solr-Tests-trunk-java7/solr/build/solr-core/test/J0/./org.apache.solr.cloud.BasicDistributedZkTest-jetty1-1355919976454
[junit4:junit4]   2> 2916 T960 oasc.SolrResourceLoader.<init> new SolrResourceLoader for deduced Solr Home: '/usr/home/hudson/hudson-slave/workspace/Lucene-Solr-Tests-trunk-java7/solr/build/solr-core/test/J0/./org.apache.solr.cloud.BasicDistributedZkTest-jetty1-1355919976454/'
[junit4:junit4]   2> 2947 T960 oass.SolrDispatchFilter.init SolrDispatchFilter.init()
[junit4:junit4]   2> 2948 T960 oasc.SolrResourceLoader.locateSolrHome JNDI not configured for solr (NoInitialContextEx)
[junit4:junit4]   2> 2948 T960 oasc.SolrResourceLoader.locateSolrHome using system property solr.solr.home: /usr/home/hudson/hudson-slave/workspace/Lucene-Solr-Tests-trunk-java7/solr/build/solr-core/test/J0/./org.apache.solr.cloud.BasicDistributedZkTest-jetty1-1355919976454
[junit4:junit4]   2> 2949 T960 oasc.CoreContainer$Initializer.initialize looking for solr.xml: /usr/home/hudson/hudson-slave/workspace/Lucene-Solr-Tests-trunk-java7/solr/build/solr-core/test/J0/./org.apache.solr.cloud.BasicDistributedZkTest-jetty1-1355919976454/solr.xml
[junit4:junit4]   2> 2949 T960 oasc.CoreContainer.<init> New CoreContainer 482310900
[junit4:junit4]   2> 2950 T960 oasc.CoreContainer.load Loading CoreContainer using Solr Home: '/usr/home/hudson/hudson-slave/workspace/Lucene-Solr-Tests-trunk-java7/solr/build/solr-core/test/J0/./org.apache.solr.cloud.BasicDistributedZkTest-jetty1-1355919976454/'
[junit4:junit4]   2> 2950 T960 oasc.SolrResourceLoader.<init> new SolrResourceLoader for directory: '/usr/home/hudson/hudson-slave/workspace/Lucene-Solr-Tests-trunk-java7/solr/build/solr-core/test/J0/./org.apache.solr.cloud.BasicDistributedZkTest-jetty1-1355919976454/'
[junit4:junit4]   2> 2972 T960 oashc.HttpShardHandlerFactory.getParameter Setting socketTimeout to: 30000
[junit4:junit4]   2> 2973 T960 oashc.HttpShardHandlerFactory.getParameter Setting urlScheme to: http://
[junit4:junit4]   2> 2974 T960 oashc.HttpShardHandlerFactory.getParameter Setting connTimeout to: 15000
[junit4:junit4]   2> 2974 T960 oashc.HttpShardHandlerFactory.getParameter Setting maxConnectionsPerHost to: 20
[junit4:junit4]   2> 2975 T960 oashc.HttpShardHandlerFactory.getParameter Setting corePoolSize to: 0
[junit4:junit4]   2> 2975 T960 oashc.HttpShardHandlerFactory.getParameter Setting maximumPoolSize to: 2147483647
[junit4:junit4]   2> 2976 T960 oashc.HttpShardHandlerFactory.getParameter Setting maxThreadIdleTime to: 5
[junit4:junit4]   2> 2976 T960 oashc.HttpShardHandlerFactory.getParameter Setting sizeOfQueue to: -1
[junit4:junit4]   2> 2976 T960 oashc.HttpShardHandlerFactory.getParameter Setting fairnessPolicy to: false
[junit4:junit4]   2> 2977 T960 oascsi.HttpClientUtil.createClient Creating new http client, config:maxConnectionsPerHost=20&maxConnections=10000&socketTimeout=30000&connTimeout=15000&retry=false
[junit4:junit4]   2> 2992 T960 oasc.CoreContainer.load Registering Log Listener
[junit4:junit4]   2> 3007 T960 oasc.CoreContainer.initZooKeeper Zookeeper client=127.0.0.1:40979/solr
[junit4:junit4]   2> 3008 T960 oasc.ZkController.checkChrootPath zkHost includes chroot
[junit4:junit4]   2> 3009 T960 oaz.ZooKeeper.<init> Initiating client connection, connectString=127.0.0.1:40979 sessionTimeout=60000 watcher=org.apache.solr.common.cloud.ConnectionManager@f57c5cb
[junit4:junit4]   2> 3010 T960 oascc.ConnectionManager.waitForConnected Waiting for client to connect to ZooKeeper
[junit4:junit4]   2> 3010 T998 oaz.ClientCnxn$SendThread.logStartConnect Opening socket connection to server localhost/127.0.0.1:40979. Will not attempt to authenticate using SASL (access denied ("javax.security.auth.AuthPermission" "getLoginConfiguration"))
[junit4:junit4]   2> 3012 T998 oaz.ClientCnxn$SendThread.primeConnection Socket connection established to localhost/127.0.0.1:40979, initiating session
[junit4:junit4]   2> 3013 T962 oazs.NIOServerCnxnFactory.run Accepted socket connection from /140.211.11.196:26889
[junit4:junit4]   2> 3014 T962 oazs.ZooKeeperServer.processConnectRequest Client attempting to establish new session at /140.211.11.196:26889
[junit4:junit4]   2> 3017 T964 oazs.ZooKeeperServer.finishSessionInit Established session 0x13bb320dd270005 with negotiated timeout 20000 for client /140.211.11.196:26889
[junit4:junit4]   2> 3018 T998 oaz.ClientCnxn$SendThread.onConnected Session establishment complete on server localhost/127.0.0.1:40979, sessionid = 0x13bb320dd270005, negotiated timeout = 20000
[junit4:junit4]   2> 3019 T999 oascc.ConnectionManager.process Watcher org.apache.solr.common.cloud.ConnectionManager@f57c5cb name:ZooKeeperConnection Watcher:127.0.0.1:40979 got event WatchedEvent state:SyncConnected type:None path:null path:null type:None
[junit4:junit4]   2> 3019 T960 oascc.ConnectionManager.waitForConnected Client is connected to ZooKeeper
[junit4:junit4]   2> 3021 T965 oazs.PrepRequestProcessor.pRequest2Txn Processed session termination for sessionid: 0x13bb320dd270005
[junit4:junit4]   2> 3032 T999 oaz.ClientCnxn$EventThread.run EventThread shut down
[junit4:junit4]   2> 3032 T962 oazs.NIOServerCnxn.closeSock Closed socket connection for client /140.211.11.196:26889 which had sessionid 0x13bb320dd270005
[junit4:junit4]   2> 3032 T960 oaz.ZooKeeper.close Session: 0x13bb320dd270005 closed
[junit4:junit4]   2> 3033 T960 oascsi.HttpClientUtil.createClient Creating new http client, config:maxConnections=500&maxConnectionsPerHost=16&socketTimeout=15000&connTimeout=30000
[junit4:junit4]   2> 3044 T960 oaz.ZooKeeper.<init> Initiating client connection, connectString=127.0.0.1:40979/solr sessionTimeout=30000 watcher=org.apache.solr.common.cloud.ConnectionManager@29860308
[junit4:junit4]   2> 3045 T960 oascc.ConnectionManager.waitForConnected Waiting for client to connect to ZooKeeper
[junit4:junit4]   2> 3046 T1000 oaz.ClientCnxn$SendThread.logStartConnect Opening socket connection to server localhost/127.0.0.1:40979. Will not attempt to authenticate using SASL (access denied ("javax.security.auth.AuthPermission" "getLoginConfiguration"))
[junit4:junit4]   2> 3046 T1000 oaz.ClientCnxn$SendThread.primeConnection Socket connection established to localhost/127.0.0.1:40979, initiating session
[junit4:junit4]   2> 3047 T962 oazs.NIOServerCnxnFactory.run Accepted socket connection from /140.211.11.196:10780
[junit4:junit4]   2> 3047 T962 oazs.ZooKeeperServer.processConnectRequest Client attempting to establish new session at /140.211.11.196:10780
[junit4:junit4]   2> 3049 T964 oazs.ZooKeeperServer.finishSessionInit Established session 0x13bb320dd270006 with negotiated timeout 20000 for client /140.211.11.196:10780
[junit4:junit4]   2> 3049 T1000 oaz.ClientCnxn$SendThread.onConnected Session establishment complete on server localhost/127.0.0.1:40979, sessionid = 0x13bb320dd270006, negotiated timeout = 20000
[junit4:junit4]   2> 3049 T1001 oascc.ConnectionManager.process Watcher org.apache.solr.common.cloud.ConnectionManager@29860308 name:ZooKeeperConnection Watcher:127.0.0.1:40979/solr got event WatchedEvent state:SyncConnected type:None path:null path:null type:None
[junit4:junit4]   2> 3049 T960 oascc.ConnectionManager.waitForConnected Client is connected to ZooKeeper
[junit4:junit4]   2> 3051 T965 oazs.PrepRequestProcessor.pRequest Got user-level KeeperException when processing sessionid:0x13bb320dd270006 type:create cxid:0x1 zxid:0x49 txntype:-1 reqpath:n/a Error Path:/solr/overseer Error:KeeperErrorCode = NodeExists for /solr/overseer
[junit4:junit4]   2> 3052 T965 oazs.PrepRequestProcessor.pRequest Got user-level KeeperException when processing sessionid:0x13bb320dd270006 type:create cxid:0x2 zxid:0x4a txntype:-1 reqpath:n/a Error Path:/solr/overseer Error:KeeperErrorCode = NodeExists for /solr/overseer
[junit4:junit4]   2> 3060 T960 oasc.ZkController.createEphemeralLiveNode Register node as live in ZooKeeper:/live_nodes/127.0.0.1:56415_k%2Fa
[junit4:junit4]   2> 3062 T965 oazs.PrepRequestProcessor.pRequest Got user-level KeeperException when processing sessionid:0x13bb320dd270006 type:delete cxid:0x4 zxid:0x4b txntype:-1 reqpath:n/a Error Path:/solr/live_nodes/127.0.0.1:56415_k%2Fa Error:KeeperErrorCode = NoNode for /solr/live_nodes/127.0.0.1:56415_k%2Fa
[junit4:junit4]   2> 3068 T960 oascc.SolrZkClient.makePath makePath: /live_nodes/127.0.0.1:56415_k%2Fa
[junit4:junit4]   2> 3071 T982 oascc.ZkStateReader$2.process A cluster state change: WatchedEvent state:SyncConnected type:NodeChildrenChanged path:/live_nodes, has occurred - updating... (live nodes size: 1)
[junit4:junit4]   2> 3071 T988 oascc.ZkStateReader$3.process Updating live nodes... (2)
[junit4:junit4]   2> 3073 T982 oascc.ZkStateReader$3.process Updating live nodes... (2)
[junit4:junit4]   2> 3079 T960 oascc.ZkStateReader.createClusterStateWatchersAndUpdate Updating cluster state from ZooKeeper... 
[junit4:junit4]   2> 3088 T1002 oasc.CoreContainer.create Creating SolrCore 'collection1' using instanceDir: /usr/home/hudson/hudson-slave/workspace/Lucene-Solr-Tests-trunk-java7/solr/build/solr-core/test/J0/./org.apache.solr.cloud.BasicDistributedZkTest-jetty1-1355919976454/collection1
[junit4:junit4]   2> 3088 T1002 oasc.ZkController.createCollectionZkNode Check for collection zkNode:collection1
[junit4:junit4]   2> 3089 T1002 oasc.ZkController.createCollectionZkNode Collection zkNode exists
[junit4:junit4]   2> 3090 T1002 oasc.ZkController.readConfigName Load collection config from:/collections/collection1
[junit4:junit4]   2> 3091 T1002 oasc.SolrResourceLoader.<init> new SolrResourceLoader for directory: '/usr/home/hudson/hudson-slave/workspace/Lucene-Solr-Tests-trunk-java7/solr/build/solr-core/test/J0/./org.apache.solr.cloud.BasicDistributedZkTest-jetty1-1355919976454/collection1/'
[junit4:junit4]   2> 3092 T1002 oasc.SolrResourceLoader.replaceClassLoader Adding 'file:/usr/home/hudson/hudson-slave/workspace/Lucene-Solr-Tests-trunk-java7/solr/build/solr-core/test/J0/org.apache.solr.cloud.BasicDistributedZkTest-jetty1-1355919976454/collection1/lib/README' to classloader
[junit4:junit4]   2> 3092 T1002 oasc.SolrResourceLoader.replaceClassLoader Adding 'file:/usr/home/hudson/hudson-slave/workspace/Lucene-Solr-Tests-trunk-java7/solr/build/solr-core/test/J0/org.apache.solr.cloud.BasicDistributedZkTest-jetty1-1355919976454/collection1/lib/classes/' to classloader
[junit4:junit4]   2> 3131 T1002 oasc.SolrConfig.<init> Using Lucene MatchVersion: LUCENE_50
[junit4:junit4]   2> 3181 T1002 oasc.SolrConfig.<init> Loaded SolrConfig: solrconfig.xml
[junit4:junit4]   2> 3255 T983 oascc.ZkStateReader.updateClusterState Updating cloud state from ZooKeeper... 
[junit4:junit4]   2> 3256 T983 oasc.Overseer$ClusterStateUpdater.updateState Update state numShards=1 message={
[junit4:junit4]   2> 	  "operation":"state",
[junit4:junit4]   2> 	  "numShards":"1",
[junit4:junit4]   2> 	  "shard":"shard1",
[junit4:junit4]   2> 	  "roles":null,
[junit4:junit4]   2> 	  "state":"active",
[junit4:junit4]   2> 	  "core":"collection1",
[junit4:junit4]   2> 	  "collection":"control_collection",
[junit4:junit4]   2> 	  "node_name":"127.0.0.1:27534_k%2Fa",
[junit4:junit4]   2> 	  "base_url":"http://127.0.0.1:27534/k/a"}
[junit4:junit4]   2> 3270 T988 oascc.ZkStateReader$2.process A cluster state change: WatchedEvent state:SyncConnected type:NodeDataChanged path:/clusterstate.json, has occurred - updating... (live nodes size: 2)
[junit4:junit4]   2> 3270 T982 oascc.ZkStateReader$2.process A cluster state change: WatchedEvent state:SyncConnected type:NodeDataChanged path:/clusterstate.json, has occurred - updating... (live nodes size: 2)
[junit4:junit4]   2> 3282 T1001 oascc.ZkStateReader$2.process A cluster state change: WatchedEvent state:SyncConnected type:NodeDataChanged path:/clusterstate.json, has occurred - updating... (live nodes size: 2)
[junit4:junit4]   2> 3282 T1002 oass.IndexSchema.readSchema Reading Solr Schema
[junit4:junit4]   2> 3288 T1002 oass.IndexSchema.readSchema Schema name=test
[junit4:junit4]   2> 3853 T1002 oass.OpenExchangeRatesOrgProvider.init Initialized with rates=open-exchange-rates.json, refreshInterval=1440.
[junit4:junit4]   2> 3864 T1002 oass.IndexSchema.readSchema default search field in schema is text
[junit4:junit4]   2> 3869 T1002 oass.IndexSchema.readSchema unique key field: id
[junit4:junit4]   2> 3885 T1002 oass.FileExchangeRateProvider.reload Reloading exchange rates from file currency.xml
[junit4:junit4]   2> 3890 T1002 oass.FileExchangeRateProvider.reload Reloading exchange rates from file currency.xml
[junit4:junit4]   2> 3896 T1002 oass.OpenExchangeRatesOrgProvider.reload Reloading exchange rates from open-exchange-rates.json
[junit4:junit4]   2> 3897 T1002 oass.OpenExchangeRatesOrgProvider.reload Reloading exchange rates from open-exchange-rates.json
[junit4:junit4]   2> 3898 T1002 oasc.SolrCore.<init> [collection1] Opening new SolrCore at /usr/home/hudson/hudson-slave/workspace/Lucene-Solr-Tests-trunk-java7/solr/build/solr-core/test/J0/./org.apache.solr.cloud.BasicDistributedZkTest-jetty1-1355919976454/collection1/, dataDir=./org.apache.solr.cloud.BasicDistributedZkTest-1355919973665/jetty1/
[junit4:junit4]   2> 3899 T1002 oasc.JmxMonitoredMap.<init> JMX monitoring is enabled. Adding Solr mbeans to JMX Server: com.sun.jmx.mbeanserver.JmxMBeanServer@380d8f5c
[junit4:junit4]   2> 3899 T1002 oasc.SolrCore.initDirectoryFactory solr.NRTCachingDirectoryFactory
[junit4:junit4]   2> 3900 T1002 oasc.CachingDirectoryFactory.get return new directory for /usr/home/hudson/hudson-slave/workspace/Lucene-Solr-Tests-trunk-java7/solr/build/solr-core/test/J0/./org.apache.solr.cloud.BasicDistributedZkTest-1355919973665/jetty1 forceNew:false
[junit4:junit4]   2> 3901 T1002 oasc.CachingDirectoryFactory.close Releasing directory:/usr/home/hudson/hudson-slave/workspace/Lucene-Solr-Tests-trunk-java7/solr/build/solr-core/test/J0/./org.apache.solr.cloud.BasicDistributedZkTest-1355919973665/jetty1
[junit4:junit4]   2> 3901 T1002 oasc.SolrCore.getNewIndexDir New index directory detected: old=null new=./org.apache.solr.cloud.BasicDistributedZkTest-1355919973665/jetty1/index/
[junit4:junit4]   2> 3902 T1002 oasc.SolrCore.initIndex WARNING [collection1] Solr index directory './org.apache.solr.cloud.BasicDistributedZkTest-1355919973665/jetty1/index' doesn't exist. Creating new index...
[junit4:junit4]   2> 3903 T1002 oasc.CachingDirectoryFactory.get return new directory for /usr/home/hudson/hudson-slave/workspace/Lucene-Solr-Tests-trunk-java7/solr/build/solr-core/test/J0/./org.apache.solr.cloud.BasicDistributedZkTest-1355919973665/jetty1/index forceNew:false
[junit4:junit4]   2> 3937 T1002 oasc.SolrDeletionPolicy.onCommit SolrDeletionPolicy.onCommit: commits:num=1
[junit4:junit4]   2> 		commit{dir=RateLimitedDirectoryWrapper(NRTCachingDirectory(org.apache.lucene.store.NIOFSDirectory@/usr/home/hudson/hudson-slave/workspace/Lucene-Solr-Tests-trunk-java7/solr/build/solr-core/test/J0/org.apache.solr.cloud.BasicDistributedZkTest-1355919973665/jetty1/index lockFactory=org.apache.lucene.store.NativeFSLockFactory@7c952fde; maxCacheMB=48.0 maxMergeSizeMB=4.0)),segFN=segments_1,generation=1,filenames=[segments_1]
[junit4:junit4]   2> 3937 T1002 oasc.SolrDeletionPolicy.updateCommits newest commit = 1[segments_1]
[junit4:junit4]   2> 3938 T1002 oasc.CachingDirectoryFactory.close Releasing directory:/usr/home/hudson/hudson-slave/workspace/Lucene-Solr-Tests-trunk-java7/solr/build/solr-core/test/J0/./org.apache.solr.cloud.BasicDistributedZkTest-1355919973665/jetty1/index
[junit4:junit4]   2> 3939 T1002 oasc.SolrCore.initWriters created xml: solr.XMLResponseWriter
[junit4:junit4]   2> 3941 T1002 oasup.UpdateRequestProcessorChain.init inserting DistributedUpdateProcessorFactory into updateRequestProcessorChain "dedupe"
[junit4:junit4]   2> 3942 T1002 oasup.UpdateRequestProcessorChain.init inserting DistributedUpdateProcessorFactory into updateRequestProcessorChain "dedupe-allfields"
[junit4:junit4]   2> 3942 T1002 oasup.UpdateRequestProcessorChain.init inserting DistributedUpdateProcessorFactory into updateRequestProcessorChain "stored_sig"
[junit4:junit4]   2> 3943 T1002 oasup.UpdateRequestProcessorChain.init inserting DistributedUpdateProcessorFactory into updateRequestProcessorChain "uniq-fields"
[junit4:junit4]   2> 3943 T1002 oasup.UpdateRequestProcessorChain.init inserting DistributedUpdateProcessorFactory into updateRequestProcessorChain "distrib-dup-test-chain-implicit"
[junit4:junit4]   2> 3944 T1002 oasc.RequestHandlers.initHandlersFromConfig adding lazy requestHandler: solr.ReplicationHandler
[junit4:junit4]   2> 3944 T1002 oasc.RequestHandlers.initHandlersFromConfig created /replication: solr.ReplicationHandler
[junit4:junit4]   2> 3945 T1002 oasc.RequestHandlers.initHandlersFromConfig created standard: solr.StandardRequestHandler
[junit4:junit4]   2> 3946 T1002 oasc.RequestHandlers.initHandlersFromConfig created /get: solr.RealTimeGetHandler
[junit4:junit4]   2> 3948 T1002 oasc.RequestHandlers.initHandlersFromConfig created dismax: solr.SearchHandler
[junit4:junit4]   2> 3949 T1002 oasc.RequestHandlers.initHandlersFromConfig created mock: org.apache.solr.core.MockQuerySenderListenerReqHandler
[junit4:junit4]   2> 3949 T1002 oasc.RequestHandlers.initHandlersFromConfig created /admin/: org.apache.solr.handler.admin.AdminHandlers
[junit4:junit4]   2> 3950 T1002 oasc.RequestHandlers.initHandlersFromConfig created defaults: solr.StandardRequestHandler
[junit4:junit4]   2> 3951 T1002 oasc.RequestHandlers.initHandlersFromConfig adding lazy requestHandler: solr.StandardRequestHandler
[junit4:junit4]   2> 3951 T1002 oasc.RequestHandlers.initHandlersFromConfig created lazy: solr.StandardRequestHandler
[junit4:junit4]   2> 3952 T1002 oasc.RequestHandlers.initHandlersFromConfig created /update: solr.UpdateRequestHandler
[junit4:junit4]   2> 3953 T1002 oasc.RequestHandlers.initHandlersFromConfig created /terms: org.apache.solr.handler.component.SearchHandler
[junit4:junit4]   2> 3954 T1002 oasc.RequestHandlers.initHandlersFromConfig created spellCheckCompRH: org.apache.solr.handler.component.SearchHandler
[junit4:junit4]   2> 3955 T1002 oasc.RequestHandlers.initHandlersFromConfig created spellCheckCompRH_Direct: org.apache.solr.handler.component.SearchHandler
[junit4:junit4]   2> 3956 T1002 oasc.RequestHandlers.initHandlersFromConfig created spellCheckWithWordbreak: org.apache.solr.handler.component.SearchHandler
[junit4:junit4]   2> 3958 T1002 oasc.RequestHandlers.initHandlersFromConfig created spellCheckWithWordbreak_Direct: org.apache.solr.handler.component.SearchHandler
[junit4:junit4]   2> 3959 T1002 oasc.RequestHandlers.initHandlersFromConfig created spellCheckCompRH1: org.apache.solr.handler.component.SearchHandler
[junit4:junit4]   2> 3960 T1002 oasc.RequestHandlers.initHandlersFromConfig created mltrh: org.apache.solr.handler.component.SearchHandler
[junit4:junit4]   2> 3961 T1002 oasc.RequestHandlers.initHandlersFromConfig created tvrh: org.apache.solr.handler.component.SearchHandler
[junit4:junit4]   2> 3962 T1002 oasc.RequestHandlers.initHandlersFromConfig created /mlt: solr.MoreLikeThisHandler
[junit4:junit4]   2> 3963 T1002 oasc.RequestHandlers.initHandlersFromConfig created /debug/dump: solr.DumpRequestHandler
[junit4:junit4]   2> 3976 T1002 oashl.XMLLoader.init xsltCacheLifetimeSeconds=60
[junit4:junit4]   2> 3981 T1002 oasc.SolrCore.initDeprecatedSupport WARNING solrconfig.xml uses deprecated <admin/gettableFiles>, Please update your config to use the ShowFileRequestHandler.
[junit4:junit4]   2> 3983 T1002 oasc.SolrCore.initDeprecatedSupport WARNING adding ShowFileRequestHandler with hidden files: [SCHEMA.XML, OLD_SYNONYMS.TXT, STOPWORDS.TXT, PROTWORDS.TXT, OPEN-EXCHANGE-RATES.JSON, SYNONYMS.TXT, CURRENCY.XML, MAPPING-ISOLATIN1ACCENT.TXT]
[junit4:junit4]   2> 3986 T1002 oasc.CachingDirectoryFactory.close Releasing directory:/usr/home/hudson/hudson-slave/workspace/Lucene-Solr-Tests-trunk-java7/solr/build/solr-core/test/J0/./org.apache.solr.cloud.BasicDistributedZkTest-1355919973665/jetty1
[junit4:junit4]   2> 3988 T1002 oass.SolrIndexSearcher.<init> Opening Searcher@2ac4ed79 main
[junit4:junit4]   2> 3989 T1002 oasu.CommitTracker.<init> Hard AutoCommit: disabled
[junit4:junit4]   2> 3989 T1002 oasu.CommitTracker.<init> Soft AutoCommit: disabled
[junit4:junit4]   2> 3990 T1002 oashc.SpellCheckComponent.inform Initializing spell checkers
[junit4:junit4]   2> 3997 T1002 oass.DirectSolrSpellChecker.init init: {name=direct,classname=DirectSolrSpellChecker,field=lowerfilt,minQueryLength=3}
[junit4:junit4]   2> 4083 T1003 oasc.SolrCore.registerSearcher [collection1] Registered new searcher Searcher@2ac4ed79 main{StandardDirectoryReader(segments_1:1)}
[junit4:junit4]   2> 4086 T1002 oasc.ZkController.publish publishing core=collection1 state=down
[junit4:junit4]   2> 4087 T1002 oasc.ZkController.publish numShards not found on descriptor - reading it from system property
[junit4:junit4]   2> 4278 T983 oascc.ZkStateReader.updateClusterState Updating cloud state from ZooKeeper... 
[junit4:junit4]   2> 4278 T983 oasc.Overseer$ClusterStateUpdater.updateState Update state numShards=2 message={
[junit4:junit4]   2> 	  "operation":"state",
[junit4:junit4]   2> 	  "numShards":"2",
[junit4:junit4]   2> 	  "shard":null,
[junit4:junit4]   2> 	  "roles":null,
[junit4:junit4]   2> 	  "state":"down",
[junit4:junit4]   2> 	  "core":"collection1",
[junit4:junit4]   2> 	  "collection":"collection1",
[junit4:junit4]   2> 	  "node_name":"127.0.0.1:56415_k%2Fa",
[junit4:junit4]   2> 	  "base_url":"http://127.0.0.1:56415/k/a"}
[junit4:junit4]   2> 4279 T983 oasc.Overseer$ClusterStateUpdater.createCollection Create collection collection1 with numShards 2
[junit4:junit4]   2> 4279 T983 oasc.Overseer$ClusterStateUpdater.updateState Assigning new node to shard shard=shard1
[junit4:junit4]   2> 4292 T982 oascc.ZkStateReader$2.process A cluster state change: WatchedEvent state:SyncConnected type:NodeDataChanged path:/clusterstate.json, has occurred - updating... (live nodes size: 2)
[junit4:junit4]   2> 4292 T1001 oascc.ZkStateReader$2.process A cluster state change: WatchedEvent state:SyncConnected type:NodeDataChanged path:/clusterstate.json, has occurred - updating... (live nodes size: 2)
[junit4:junit4]   2> 4292 T988 oascc.ZkStateReader$2.process A cluster state change: WatchedEvent state:SyncConnected type:NodeDataChanged path:/clusterstate.json, has occurred - updating... (live nodes size: 2)
[junit4:junit4]   2> 4589 T1002 oasc.CoreContainer.registerCore registering core: collection1
[junit4:junit4]   2> 4589 T1002 oasc.ZkController.register Register replica - core:collection1 address:http://127.0.0.1:56415/k/a collection:collection1 shard:shard1
[junit4:junit4]   2> 4590 T1002 oascc.SolrZkClient.makePath makePath: /collections/collection1/leader_elect/shard1/election
[junit4:junit4]   2> 4607 T965 oazs.PrepRequestProcessor.pRequest Got user-level KeeperException when processing sessionid:0x13bb320dd270006 type:delete cxid:0x45 zxid:0x5b txntype:-1 reqpath:n/a Error Path:/solr/collections/collection1/leaders Error:KeeperErrorCode = NoNode for /solr/collections/collection1/leaders
[junit4:junit4]   2> 4608 T1002 oasc.ShardLeaderElectionContext.runLeaderProcess Running the leader process.
[junit4:junit4]   2> 4609 T965 oazs.PrepRequestProcessor.pRequest Got user-level KeeperException when processing sessionid:0x13bb320dd270006 type:create cxid:0x46 zxid:0x5c txntype:-1 reqpath:n/a Error Path:/solr/overseer Error:KeeperErrorCode = NodeExists for /solr/overseer
[junit4:junit4]   2> 4611 T1002 oasc.ShardLeaderElectionContext.waitForReplicasToComeUp Enough replicas found to continue.
[junit4:junit4]   2> 4611 T1002 oasc.ShardLeaderElectionContext.runLeaderProcess I may be the new leader - try and sync
[junit4:junit4]   2> 4612 T1002 oasc.SyncStrategy.sync Sync replicas to http://127.0.0.1:56415/k/a/collection1/
[junit4:junit4]   2> 4612 T1002 oasc.SyncStrategy.syncReplicas Sync Success - now sync replicas to me
[junit4:junit4]   2> 4612 T1002 oasc.SyncStrategy.syncToMe http://127.0.0.1:56415/k/a/collection1/ has no replicas
[junit4:junit4]   2> 4612 T1002 oasc.ShardLeaderElectionContext.runLeaderProcess I am the new leader: http://127.0.0.1:56415/k/a/collection1/
[junit4:junit4]   2> 4613 T1002 oascc.SolrZkClient.makePath makePath: /collections/collection1/leaders/shard1
[junit4:junit4]   2> 4617 T965 oazs.PrepRequestProcessor.pRequest Got user-level KeeperException when processing sessionid:0x13bb320dd270006 type:create cxid:0x50 zxid:0x60 txntype:-1 reqpath:n/a Error Path:/solr/overseer Error:KeeperErrorCode = NodeExists for /solr/overseer
[junit4:junit4]   2> 4805 T983 oascc.ZkStateReader.updateClusterState Updating cloud state from ZooKeeper... 
[junit4:junit4]   2> 4819 T982 oascc.ZkStateReader$2.process A cluster state change: WatchedEvent state:SyncConnected type:NodeDataChanged path:/clusterstate.json, has occurred - updating... (live nodes size: 2)
[junit4:junit4]   2> 4819 T988 oascc.ZkStateReader$2.process A cluster state change: WatchedEvent state:SyncConnected type:NodeDataChanged path:/clusterstate.json, has occurred - updating... (live nodes size: 2)
[junit4:junit4]   2> 4819 T1001 oascc.ZkStateReader$2.process A cluster state change: WatchedEvent state:SyncConnected type:NodeDataChanged path:/clusterstate.json, has occurred - updating... (live nodes size: 2)
[junit4:junit4]   2> 4823 T1002 oasc.ZkController.register We are http://127.0.0.1:56415/k/a/collection1/ and leader is http://127.0.0.1:56415/k/a/collection1/
[junit4:junit4]   2> 4823 T1002 oasc.ZkController.register No LogReplay needed for core=collection1 baseURL=http://127.0.0.1:56415/k/a
[junit4:junit4]   2> 4823 T1002 oasc.ZkController.checkRecovery I am the leader, no recovery necessary
[junit4:junit4]   2> 4824 T1002 oasc.ZkController.publish publishing core=collection1 state=active
[junit4:junit4]   2> 4824 T1002 oasc.ZkController.publish numShards not found on descriptor - reading it from system property
[junit4:junit4]   2> 4825 T1002 oascc.ZkStateReader.updateClusterState Updating cloud state from ZooKeeper... 
[junit4:junit4]   2> 4826 T960 oass.SolrDispatchFilter.init user.dir=/usr/home/hudson/hudson-slave/workspace/Lucene-Solr-Tests-trunk-java7/solr/build/solr-core/test/J0
[junit4:junit4]   2> 4827 T960 oass.SolrDispatchFilter.init SolrDispatchFilter.init() done
[junit4:junit4]   2> 4828 T960 oascsi.HttpClientUtil.createClient Creating new http client, config:maxConnections=128&maxConnectionsPerHost=32&followRedirects=false
[junit4:junit4]   2> 4949 T960 oejs.Server.doStart jetty-8.1.8.v20121106
[junit4:junit4]   2> 4952 T960 oejs.AbstractConnector.doStart Started SocketConnector@127.0.0.1:47618
[junit4:junit4]   2> 4953 T960 oasc.SolrResourceLoader.locateSolrHome JNDI not configured for solr (NoInitialContextEx)
[junit4:junit4]   2> 4954 T960 oasc.SolrResourceLoader.locateSolrHome using system property solr.solr.home: /usr/home/hudson/hudson-slave/workspace/Lucene-Solr-Tests-trunk-java7/solr/build/solr-core/test/J0/./org.apache.solr.cloud.BasicDistributedZkTest-jetty2-1355919978496
[junit4:junit4]   2> 4954 T960 oasc.SolrResourceLoader.<init> new SolrResourceLoader for deduced Solr Home: '/usr/home/hudson/hudson-slave/workspace/Lucene-Solr-Tests-trunk-java7/solr/build/solr-core/test/J0/./org.apache.solr.cloud.BasicDistributedZkTest-jetty2-1355919978496/'
[junit4:junit4]   2> 4982 T960 oass.SolrDispatchFilter.init SolrDispatchFilter.init()
[junit4:junit4]   2> 4983 T960 oasc.SolrResourceLoader.locateSolrHome JNDI not configured for solr (NoInitialContextEx)
[junit4:junit4]   2> 4984 T960 oasc.SolrResourceLoader.locateSolrHome using system property solr.solr.home: /usr/home/hudson/hudson-slave/workspace/Lucene-Solr-Tests-trunk-java7/solr/build/solr-core/test/J0/./org.apache.solr.cloud.BasicDistributedZkTest-jetty2-1355919978496
[junit4:junit4]   2> 4984 T960 oasc.CoreContainer$Initializer.initialize looking for solr.xml: /usr/home/hudson/hudson-slave/workspace/Lucene-Solr-Tests-trunk-java7/solr/build/solr-core/test/J0/./org.apache.solr.cloud.BasicDistributedZkTest-jetty2-1355919978496/solr.xml
[junit4:junit4]   2> 4985 T960 oasc.CoreContainer.<init> New CoreContainer 1087774849
[junit4:junit4]   2> 4985 T960 oasc.CoreContainer.load Loading CoreContainer using Solr Home: '/usr/home/hudson/hudson-slave/workspace/Lucene-Solr-Tests-trunk-java7/solr/build/solr-core/test/J0/./org.apache.solr.cloud.BasicDistributedZkTest-jetty2-1355919978496/'
[junit4:junit4]   2> 4986 T960 oasc.SolrResourceLoader.<init> new SolrResourceLoader for directory: '/usr/home/hudson/hudson-slave/workspace/Lucene-Solr-Tests-trunk-java7/solr/build/solr-core/test/J0/./org.apache.solr.cloud.BasicDistributedZkTest-jetty2-1355919978496/'
[junit4:junit4]   2> 5007 T960 oashc.HttpShardHandlerFactory.getParameter Setting socketTimeout to: 30000
[junit4:junit4]   2> 5008 T960 oashc.HttpShardHandlerFactory.getParameter Setting urlScheme to: http://
[junit4:junit4]   2> 5008 T960 oashc.HttpShardHandlerFactory.getParameter Setting connTimeout to: 15000
[junit4:junit4]   2> 5009 T960 oashc.HttpShardHandlerFactory.getParameter Setting maxConnectionsPerHost to: 20
[junit4:junit4]   2> 5009 T960 oashc.HttpShardHandlerFactory.getParameter Setting corePoolSize to: 0
[junit4:junit4]   2> 5010 T960 oashc.HttpShardHandlerFactory.getParameter Setting maximumPoolSize to: 2147483647
[junit4:junit4]   2> 5010 T960 oashc.HttpShardHandlerFactory.getParameter Setting maxThreadIdleTime to: 5
[junit4:junit4]   2> 5010 T960 oashc.HttpShardHandlerFactory.getParameter Setting sizeOfQueue to: -1
[junit4:junit4]   2> 5011 T960 oashc.HttpShardHandlerFactory.getParameter Setting fairnessPolicy to: false
[junit4:junit4]   2> 5011 T960 oascsi.HttpClientUtil.createClient Creating new http client, config:maxConnectionsPerHost=20&maxConnections=10000&socketTimeout=30000&connTimeout=15000&retry=false
[junit4:junit4]   2> 5028 T960 oasc.CoreContainer.load Registering Log Listener
[junit4:junit4]   2> 5043 T960 oasc.CoreContainer.initZooKeeper Zookeeper client=127.0.0.1:40979/solr
[junit4:junit4]   2> 5044 T960 oasc.ZkController.checkChrootPath zkHost includes chroot
[junit4:junit4]   2> 5045 T960 oaz.ZooKeeper.<init> Initiating client connection, connectString=127.0.0.1:40979 sessionTimeout=60000 watcher=org.apache.solr.common.cloud.ConnectionManager@2bf4b016
[junit4:junit4]   2> 5046 T960 oascc.ConnectionManager.waitForConnected Waiting for client to connect to ZooKeeper
[junit4:junit4]   2> 5046 T1013 oaz.ClientCnxn$SendThread.logStartConnect Opening socket connection to server localhost/127.0.0.1:40979. Will not attempt to authenticate using SASL (access denied ("javax.security.auth.AuthPermission" "getLoginConfiguration"))
[junit4:junit4]   2> 5047 T1013 oaz.ClientCnxn$SendThread.primeConnection Socket connection established to localhost/127.0.0.1:40979, initiating session
[junit4:junit4]   2> 5047 T962 oazs.NIOServerCnxnFactory.run Accepted socket connection from /140.211.11.196:62517
[junit4:junit4]   2> 5048 T962 oazs.ZooKeeperServer.processConnectRequest Client attempting to establish new session at /140.211.11.196:62517
[junit4:junit4]   2> 5050 T964 oazs.ZooKeeperServer.finishSessionInit Established session 0x13bb320dd270007 with negotiated timeout 20000 for client /140.211.11.196:62517
[junit4:junit4]   2> 5050 T1013 oaz.ClientCnxn$SendThread.onConnected Session establishment complete on server localhost/127.0.0.1:40979, sessionid = 0x13bb320dd270007, negotiated timeout = 20000
[junit4:junit4]   2> 5050 T1014 oascc.ConnectionManager.process Watcher org.apache.solr.common.cloud.ConnectionManager@2bf4b016 name:ZooKeeperConnection Watcher:127.0.0.1:40979 got event WatchedEvent state:SyncConnected type:None path:null path:null type:None
[junit4:junit4]   2> 5050 T960 oascc.ConnectionManager.waitForConnected Client is connected to ZooKeeper
[junit4:junit4]   2> 5052 T965 oazs.PrepRequestProcessor.pRequest2Txn Processed session termination for sessionid: 0x13bb320dd270007
[junit4:junit4]   2> 5053 T1014 oaz.ClientCnxn$EventThread.run EventThread shut down
[junit4:junit4]   2> 5053 T962 oazs.NIOServerCnxn.closeSock Closed socket connection for client /140.211.11.196:62517 which had sessionid 0x13bb320dd270007
[junit4:junit4]   2> 5053 T960 oaz.ZooKeeper.close Session: 0x13bb320dd270007 closed
[junit4:junit4]   2> 5054 T960 oascsi.HttpClientUtil.createClient Creating new http client, config:maxConnections=500&maxConnectionsPerHost=16&socketTimeout=15000&connTimeout=30000
[junit4:junit4]   2> 5061 T960 oaz.ZooKeeper.<init> Initiating client connection, connectString=127.0.0.1:40979/solr sessionTimeout=30000 watcher=org.apache.solr.common.cloud.ConnectionManager@1d981d23
[junit4:junit4]   2> 5062 T960 oascc.ConnectionManager.waitForConnected Waiting for client to connect to ZooKeeper
[junit4:junit4]   2> 5063 T1015 oaz.ClientCnxn$SendThread.logStartConnect Opening socket connection to server localhost/127.0.0.1:40979. Will not attempt to authenticate using SASL (access denied ("javax.security.auth.AuthPermission" "getLoginConfiguration"))
[junit4:junit4]   2> 5064 T1015 oaz.ClientCnxn$SendThread.primeConnection Socket connection established to localhost/127.0.0.1:40979, initiating session
[junit4:junit4]   2> 5064 T962 oazs.NIOServerCnxnFactory.run Accepted socket connection from /140.211.11.196:64879
[junit4:junit4]   2> 5064 T962 oazs.ZooKeeperServer.processConnectRequest Client attempting to establish new session at /140.211.11.196:64879
[junit4:junit4]   2> 5066 T964 oazs.ZooKeeperServer.finishSessionInit Established session 0x13bb320dd270008 with negotiated timeout 20000 for client /140.211.11.196:64879
[junit4:junit4]   2> 5066 T1015 oaz.ClientCnxn$SendThread.onConnected Session establishment complete on server localhost/127.0.0.1:40979, sessionid = 0x13bb320dd270008, negotiated timeout = 20000
[junit4:junit4]   2> 5066 T1016 oascc.ConnectionManager.process Watcher org.apache.solr.common.cloud.ConnectionManager@1d981d23 name:ZooKeeperConnection Watcher:127.0.0.1:40979/solr got event WatchedEvent state:SyncConnected type:None path:null path:null type:None
[junit4:junit4]   2> 5066 T960 oascc.ConnectionManager.waitForConnected Client is connected to ZooKeeper
[junit4:junit4]   2> 5067 T965 oazs.PrepRequestProcessor.pRequest Got user-level KeeperException when processing sessionid:0x13bb320dd270008 type:create cxid:0x1 zxid:0x6d txntype:-1 reqpath:n/a Error Path:/solr/overseer Error:KeeperErrorCode = NodeExists for /solr/overseer
[junit4:junit4]   2> 5069 T965 oazs.PrepRequestProcessor.pRequest Got user-level KeeperException when processing sessionid:0x13bb320dd270008 type:create cxid:0x2 zxid:0x6e txntype:-1 reqpath:n/a Error Path:/solr/overseer Error:KeeperErrorCode = NodeExists for /solr/overseer
[junit4:junit4]   2> 5077 T960 oasc.ZkController.createEphemeralLiveNode Register node as live in ZooKeeper:/live_nodes/127.0.0.1:47618_k%2Fa
[junit4:junit4]   2> 5078 T965 oazs.PrepRequestProcessor.pRequest Got user-level KeeperException when processing sessionid:0x13bb320dd270008 type:delete cxid:0x4 zxid:0x6f txntype:-1 reqpath:n/a Error Path:/solr/live_nodes/127.0.0.1:47618_k%2Fa Error:KeeperErrorCode = NoNode for /solr/live_nodes/127.0.0.1:47618_k%2Fa
[junit4:junit4]   2> 5079 T960 oascc.SolrZkClient.makePath makePath: /live_nodes/127.0.0.1:47618_k%2Fa
[junit4:junit4]   2> 5081 T982 oascc.ZkStateReader$2.process A cluster state change: WatchedEvent state:SyncConnected type:NodeChildrenChanged path:/live_nodes, has occurred - updating... (live nodes size: 2)
[junit4:junit4]   2> 5081 T1001 oascc.ZkStateReader$2.process A cluster state change: WatchedEvent state:SyncConnected type:NodeChildrenChanged path:/live_nodes, has occurred - updating... (live nodes size: 2)
[junit4:junit4]   2> 5082 T988 oascc.ZkStateReader$3.process Updating live nodes... (3)
[junit4:junit4]   2> 5082 T988 oascc.ZkStateReader$2.process A cluster state change: WatchedEvent state:SyncConnected type:NodeChildrenChanged path:/live_nodes, has occurred - updating... (live nodes size: 3)
[junit4:junit4]   2> 5090 T982 oascc.ZkStateReader$3.process Updating live nodes... (3)
[junit4:junit4]   2> 5090 T1001 oascc.ZkStateReader$3.process Updating live nodes... (3)
[junit4:junit4]   2> 5091 T960 oascc.ZkStateReader.createClusterStateWatchersAndUpdate Updating cluster state from ZooKeeper... 
[junit4:junit4]   2> 5098 T1017 oasc.CoreContainer.create Creating SolrCore 'collection1' using instanceDir: /usr/home/hudson/hudson-slave/workspace/Lucene-Solr-Tests-trunk-java7/solr/build/solr-core/test/J0/./org.apache.solr.cloud.BasicDistributedZkTest-jetty2-1355919978496/collection1
[junit4:junit4]   2> 5098 T1017 oasc.ZkController.createCollectionZkNode Check for collection zkNode:collection1
[junit4:junit4]   2> 5099 T1017 oasc.ZkController.createCollectionZkNode Collection zkNode exists
[junit4:junit4]   2> 5099 T1017 oasc.ZkController.readConfigName Load collection config from:/collections/collection1
[junit4:junit4]   2> 5101 T1017 oasc.SolrResourceLoader.<init> new SolrResourceLoader for directory: '/usr/home/hudson/hudson-slave/workspace/Lucene-Solr-Tests-trunk-java7/solr/build/solr-core/test/J0/./org.apache.solr.cloud.BasicDistributedZkTest-jetty2-1355919978496/collection1/'
[junit4:junit4]   2> 5102 T1017 oasc.SolrResourceLoader.replaceClassLoader Adding 'file:/usr/home/hudson/hudson-slave/workspace/Lucene-Solr-Tests-trunk-java7/solr/build/solr-core/test/J0/org.apache.solr.cloud.BasicDistributedZkTest-jetty2-1355919978496/collection1/lib/classes/' to classloader
[junit4:junit4]   2> 5102 T1017 oasc.SolrResourceLoader.replaceClassLoader Adding 'file:/usr/home/hudson/hudson-slave/workspace/Lucene-Solr-Tests-trunk-java7/solr/build/solr-core/test/J0/org.apache.solr.cloud.BasicDistributedZkTest-jetty2-1355919978496/collection1/lib/README' to classloader
[junit4:junit4]   2> 5141 T1017 oasc.SolrConfig.<init> Using Lucene MatchVersion: LUCENE_50
[junit4:junit4]   2> 5192 T1017 oasc.SolrConfig.<init> Loaded SolrConfig: solrconfig.xml
[junit4:junit4]   2> 5293 T1017 oass.IndexSchema.readSchema Reading Solr Schema
[junit4:junit4]   2> 5301 T1017 oass.IndexSchema.readSchema Schema name=test
[junit4:junit4]   2> 5325 T983 oascc.ZkStateReader.updateClusterState Updating cloud state from ZooKeeper... 
[junit4:junit4]   2> 5326 T983 oasc.Overseer$ClusterStateUpdater.updateState Update state numShards=2 message={
[junit4:junit4]   2> 	  "operation":"state",
[junit4:junit4]   2> 	  "numShards":"2",
[junit4:junit4]   2> 	  "shard":"shard1",
[junit4:junit4]   2> 	  "roles":null,
[junit4:junit4]   2> 	  "state":"active",
[junit4:junit4]   2> 	  "core":"collection1",
[junit4:junit4]   2> 	  "collection":"collection1",
[junit4:junit4]   2> 	  "node_name":"127.0.0.1:56415_k%2Fa",
[junit4:junit4]   2> 	  "base_url":"http://127.0.0.1:56415/k/a"}
[junit4:junit4]   2> 5339 T982 oascc.ZkStateReader$2.process A cluster state change: WatchedEvent state:SyncConnected type:NodeDataChanged path:/clusterstate.json, has occurred - updating... (live nodes size: 3)
[junit4:junit4]   2> 5339 T1001 oascc.ZkStateReader$2.process A cluster state change: WatchedEvent state:SyncConnected type:NodeDataChanged path:/clusterstate.json, has occurred - updating... (live nodes size: 3)
[junit4:junit4]   2> 5339 T1016 oascc.ZkStateReader$2.process A cluster state change: WatchedEvent state:SyncConnected type:NodeDataChanged path:/clusterstate.json, has occurred - updating... (live nodes size: 3)
[junit4:junit4]   2> 5339 T988 oascc.ZkStateReader$2.process A cluster state change: WatchedEvent state:SyncConnected type:NodeDataChanged path:/clusterstate.json, has occurred - updating... (live nodes size: 3)
[junit4:junit4]   2> 5974 T1017 oass.OpenExchangeRatesOrgProvider.init Initialized with rates=open-exchange-rates.json, refreshInterval=1440.
[junit4:junit4]   2> 5985 T1017 oass.IndexSchema.readSchema default search field in schema is text
[junit4:junit4]   2> 5989 T1017 oass.IndexSchema.readSchema unique key field: id
[junit4:junit4]   2> 6003 T1017 oass.FileExchangeRateProvider.reload Reloading exchange rates from file currency.xml
[junit4:junit4]   2> 6007 T1017 oass.FileExchangeRateProvider.reload Reloading exchange rates from file currency.xml
[junit4:junit4]   2> 6011 T1017 oass.OpenExchangeRatesOrgProvider.reload Reloading exchange rates from open-exchange-rates.json
[junit4:junit4]   2> 6013 T1017 oass.OpenExchangeRatesOrgProvider.reload Reloading exchange rates from open-exchange-rates.json
[junit4:junit4]   2> 6014 T1017 oasc.SolrCore.<init> [collection1] Opening new SolrCore at /usr/home/hudson/hudson-slave/workspace/Lucene-Solr-Tests-trunk-java7/solr/build/solr-core/test/J0/./org.apache.solr.cloud.BasicDistributedZkTest-jetty2-1355919978496/collection1/, dataDir=./org.apache.solr.cloud.BasicDistributedZkTest-1355919973665/jetty2/
[junit4:junit4]   2> 6014 T1017 oasc.JmxMonitoredMap.<init> JMX monitoring is enabled. Adding Solr mbeans to JMX Server: com.sun.jmx.mbeanserver.JmxMBeanServer@380d8f5c
[junit4:junit4]   2> 6015 T1017 oasc.SolrCore.initDirectoryFactory solr.NRTCachingDirectoryFactory
[junit4:junit4]   2> 6015 T1017 oasc.CachingDirectoryFactory.get return new directory for /usr/home/hudson/hudson-slave/workspace/Lucene-Solr-Tests-trunk-java7/solr/build/solr-core/test/J0/./org.apache.solr.cloud.BasicDistributedZkTest-1355919973665/jetty2 forceNew:false
[junit4:junit4]   2> 6016 T1017 oasc.CachingDirectoryFactory.close Releasing directory:/usr/home/hudson/hudson-slave/workspace/Lucene-Solr-Tests-trunk-java7/solr/build/solr-core/test/J0/./org.apache.solr.cloud.BasicDistributedZkTest-1355919973665/jetty2
[junit4:junit4]   2> 6016 T1017 oasc.SolrCore.getNewIndexDir New index directory detected: old=null new=./org.apache.solr.cloud.BasicDistributedZkTest-1355919973665/jetty2/index/
[junit4:junit4]   2> 6017 T1017 oasc.SolrCore.initIndex WARNING [collection1] Solr index directory './org.apache.solr.cloud.BasicDistributedZkTest-1355919973665/jetty2/index' doesn't exist. Creating new index...
[junit4:junit4]   2> 6018 T1017 oasc.CachingDirectoryFactory.get return new directory for /usr/home/hudson/hudson-slave/workspace/Lucene-Solr-Tests-trunk-java7/solr/build/solr-core/test/J0/./org.apache.solr.cloud.BasicDistributedZkTest-1355919973665/jetty2/index forceNew:false
[junit4:junit4]   2> 6023 T1017 oasc.SolrDeletionPolicy.onCommit SolrDeletionPolicy.onCommit: commits:num=1
[junit4:junit4]   2> 		commit{dir=RateLimitedDirectoryWrapper(NRTCachingDirectory(org.apache.lucene.store.NIOFSDirectory@/usr/home/hudson/hudson-slave/workspace/Lucene-Solr-Tests-trunk-java7/solr/build/solr-core/test/J0/org.apache.solr.cloud.BasicDistributedZkTest-1355919973665/jetty2/index lockFactory=org.apache.lucene.store.NativeFSLockFactory@3d049124; maxCacheMB=48.0 maxMergeSizeMB=4.0)),segFN=segments_1,generation=1,filenames=[segments_1]
[junit4:junit4]   2> 6023 T1017 oasc.SolrDeletionPolicy.updateCommits newest commit = 1[segments_1]
[junit4:junit4]   2> 6024 T1017 oasc.CachingDirectoryFactory.close Releasing directory:/usr/home/hudson/hudson-slave/workspace/Lucene-Solr-Tests-trunk-java7/solr/build/solr-core/test/J0/./org.apache.solr.cloud.BasicDistributedZkTest-1355919973665/jetty2/index
[junit4:junit4]   2> 6024 T1017 oasc.SolrCore.initWriters created xml: solr.XMLResponseWriter
[junit4:junit4]   2> 6026 T1017 oasup.UpdateRequestProcessorChain.init inserting DistributedUpdateProcessorFactory into updateRequestProcessorChain "dedupe"
[junit4:junit4]   2> 6026 T1017 oasup.UpdateRequestProcessorChain.init inserting DistributedUpdateProcessorFactory into updateRequestProcessorChain "dedupe-allfields"
[junit4:junit4]   2> 6027 T1017 oasup.UpdateRequestProcessorChain.init inserting DistributedUpdateProcessorFactory into updateRequestProcessorChain "stored_sig"
[junit4:junit4]   2> 6027 T1017 oasup.UpdateRequestProcessorChain.init inserting DistributedUpdateProcessorFactory into updateRequestProcessorChain "uniq-fields"
[junit4:junit4]   2> 6027 T1017 oasup.UpdateRequestProcessorChain.init inserting DistributedUpdateProcessorFactory into updateRequestProcessorChain "distrib-dup-test-chain-implicit"
[junit4:junit4]   2> 6028 T1017 oasc.RequestHandlers.initHandlersFromConfig adding lazy requestHandler: solr.ReplicationHandler
[junit4:junit4]   2> 6028 T1017 oasc.RequestHandlers.initHandlersFromConfig created /replication: solr.ReplicationHandler
[junit4:junit4]   2> 6029 T1017 oasc.RequestHandlers.initHandlersFromConfig created standard: solr.StandardRequestHandler
[junit4:junit4]   2> 6030 T1017 oasc.RequestHandlers.initHandlersFromConfig created /get: solr.RealTimeGetHandler
[junit4:junit4]   2> 6030 T1017 oasc.RequestHandlers.initHandlersFromConfig created dismax: solr.SearchHandler
[junit4:junit4]   2> 6031 T1017 oasc.RequestHandlers.initHandlersFromConfig created mock: org.apache.solr.core.MockQuerySenderListenerReqHandler
[junit4:junit4]   2> 6032 T1017 oasc.RequestHandlers.initHandlersFromConfig created /admin/: org.apache.solr.handler.admin.AdminHandlers
[junit4:junit4]   2> 6032 T1017 oasc.RequestHandlers.initHandlersFromConfig created defaults: solr.StandardRequestHandler
[junit4:junit4]   2> 6033 T1017 oasc.RequestHandlers.initHandlersFromConfig adding lazy requestHandler: solr.StandardRequestHandler
[junit4:junit4]   2> 6033 T1017 oasc.RequestHandlers.initHandlersFromConfig created lazy: solr.StandardRequestHandler
[junit4:junit4]   2> 6034 T1017 oasc.RequestHandlers.initHandlersFromConfig created /update: solr.UpdateRequestHandler
[junit4:junit4]   2> 6035 T1017 oasc.RequestHandlers.initHandlersFromConfig created /terms: org.apache.solr.handler.component.SearchHandler
[junit4:junit4]   2> 6035 T1017 oasc.RequestHandlers.initHandlersFromConfig created spellCheckCompRH: org.apache.solr.handler.component.SearchHandler
[junit4:junit4]   2> 6036 T1017 oasc.RequestHandlers.initHandlersFromConfig created spellCheckCompRH_Direct: org.apache.solr.handler.component.SearchHandler
[junit4:junit4]   2> 6037 T1017 oasc.RequestHandlers.initHandlersFromConfig created spellCheckWithWordbreak: org.apache.solr.handler.component.SearchHandler
[junit4:junit4]   2> 6038 T1017 oasc.RequestHandlers.initHandlersFromConfig created spellCheckWithWordbreak_Direct: org.apache.solr.handler.component.SearchHandler
[junit4:junit4]   2> 6040 T1017 oasc.RequestHandlers.initHandlersFromConfig created spellCheckCompRH1: org.apache.solr.handler.component.SearchHandler
[junit4:junit4]   2> 6041 T1017 oasc.RequestHandlers.initHandlersFromConfig created mltrh: org.apache.solr.handler.component.SearchHandler
[junit4:junit4]   2> 6042 T1017 oasc.RequestHandlers.initHandlersFromConfig created tvrh: org.apache.solr.handler.component.SearchHandler
[junit4:junit4]   2> 6043 T1017 oasc.RequestHandlers.initHandlersFromConfig created /mlt: solr.MoreLikeThisHandler
[junit4:junit4]   2> 6044 T1017 oasc.RequestHandlers.initHandlersFromConfig created /debug/dump: solr.DumpRequestHandler
[junit4:junit4]   2> 6053 T1017 oashl.XMLLoader.init xsltCacheLifetimeSeconds=60
[junit4:junit4]   2> 6056 T1017 oasc.SolrCore.initDeprecatedSupport WARNING solrconfig.xml uses deprecated <admin/gettableFiles>, Please update your config to use the ShowFileRequestHandler.
[junit4:junit4]   2> 6058 T1017 oasc.SolrCore.initDeprecatedSupport WARNING adding ShowFileRequestHandler with hidden files: [SCHEMA.XML, OLD_SYNONYMS.TXT, STOPWORDS.TXT, PROTWORDS.TXT, OPEN-EXCHANGE-RATES.JSON, SYNONYMS.TXT, CURRENCY.XML, MAPPING-ISOLATIN1ACCENT.TXT]
[junit4:junit4]   2> 6060 T1017 oasc.CachingDirectoryFactory.close Releasing directory:/usr/home/hudson/hudson-slave/workspace/Lucene-Solr-Tests-trunk-java7/solr/build/solr-core/test/J0/./org.apache.solr.cloud.BasicDistributedZkTest-1355919973665/jetty2
[junit4:junit4]   2> 6061 T1017 oass.SolrIndexSearcher.<init> Opening Searcher@105c593e main
[junit4:junit4]   2> 6062 T1017 oasu.CommitTracker.<init> Hard AutoCommit: disabled
[junit4:junit4]   2> 6062 T1017 oasu.CommitTracker.<init> Soft AutoCommit: disabled
[junit4:junit4]   2> 6063 T1017 oashc.SpellCheckComponent.inform Initializing spell checkers
[junit4:junit4]   2> 6068 T1017 oass.DirectSolrSpellChecker.init init: {name=direct,classname=DirectSolrSpellChecker,field=lowerfilt,minQueryLength=3}
[junit4:junit4]   2> 6108 T1018 oasc.SolrCore.registerSearcher [collection1] Registered new searcher Searcher@105c593e main{StandardDirectoryReader(segments_1:1)}
[junit4:junit4]   2> 6112 T1017 oasc.ZkController.publish publishing core=collection1 state=down
[junit4:junit4]   2> 6112 T1017 oasc.ZkController.publish numShards not found on descriptor - reading it from system property
[junit4:junit4]   2> 6347 T983 oascc.ZkStateReader.updateClusterState Updating cloud state from ZooKeeper... 
[junit4:junit4]   2> 6347 T983 oasc.Overseer$ClusterStateUpdater.updateState Update state numShards=2 message={
[junit4:junit4]   2> 	  "operation":"state",
[junit4:junit4]   2> 	  "numShards":"2",
[junit4:junit4]   2> 	  "shard":null,
[junit4:junit4]   2> 	  "roles":null,
[junit4:junit4]   2> 	  "state":"down",
[junit4:junit4]   2> 	  "core":"collection1",
[junit4:junit4]   2> 	  "collection":"collection1",
[junit4:junit4]   2> 	  "node_name":"127.0.0.1:47618_k%2Fa",
[junit4:junit4]   2> 	  "base_url":"http://127.0.0.1:47618/k/a"}
[junit4:junit4]   2> 6348 T983 oasc.Overseer$ClusterStateUpdater.updateState Collection already exists with numShards=2
[junit4:junit4]   2> 6348 T983 oasc.Overseer$ClusterStateUpdater.updateState Assigning new node to shard shard=shard2
[junit4:junit4]   2> 6362 T1016 oascc.ZkStateReader$2.process A cluster state change: WatchedEvent state:SyncConnected type:NodeDataChanged path:/clusterstate.json, has occurred - updating... (live nodes size: 3)
[junit4:junit4]   2> 6362 T988 oascc.ZkStateReader$2.process A cluster state change: WatchedEvent state:SyncConnected type:NodeDataChanged path:/clusterstate.json, has occurred - updating... (live nodes size: 3)
[junit4:junit4]   2> 6362 T1001 oascc.ZkStateReader$2.process A cluster state change: WatchedEvent state:SyncConnected type:NodeDataChanged path:/clusterstate.json, has occurred - updating... (live nodes size: 3)
[junit4:junit4]   2> 6362 T982 oascc.ZkStateReader$2.process A cluster state change: WatchedEvent state:SyncConnected type:NodeDataChanged path:/clusterstate.json, has occurred - updating... (live nodes size: 3)
[junit4:junit4]   2> 6615 T1017 oasc.CoreContainer.registerCore registering core: collection1
[junit4:junit4]   2> 6615 T1017 oasc.ZkController.register Register replica - core:collection1 address:http://127.0.0.1:47618/k/a collection:collection1 shard:shard2
[junit4:junit4]   2> 6616 T1017 oascc.SolrZkClient.makePath makePath: /collections/collection1/leader_elect/shard2/election
[junit4:junit4]   2> 6638 T965 oazs.PrepRequestProcessor.pRequest Got user-level KeeperException when processing sessionid:0x13bb320dd270008 type:delete cxid:0x44 zxid:0x7e txntype:-1 reqpath:n/a Error Path:/solr/collections/collection1/leaders/shard2 Error:KeeperErrorCode = NoNode for /solr/collections/collection1/leaders/shard2
[junit4:junit4]   2> 6639 T1017 oasc.ShardLeaderElectionContext.runLeaderProcess Running the leader process.
[junit4:junit4]   2> 6640 T965 oazs.PrepRequestProcessor.pRequest Got user-level KeeperException when processing sessionid:0x13bb320dd270008 type:create cxid:0x45 zxid:0x7f txntype:-1 reqpath:n/a Error Path:/solr/overseer Error:KeeperErrorCode = NodeExists for /solr/overseer
[junit4:junit4]   2> 6651 T1017 oasc.ShardLeaderElectionContext.waitForReplicasToComeUp Enough replicas found to continue.
[junit4:junit4]   2> 6651 T1017 oasc.ShardLeaderElectionContext.runLeaderProcess I may be the new leader - try and sync
[junit4:junit4]   2> 6652 T1017 oasc.SyncStrategy.sync Sync replicas to http://127.0.0.1:47618/k/a/collection1/
[junit4:junit4]   2> 6652 T1017 oasc.SyncStrategy.syncReplicas Sync Success - now sync replicas to me
[junit4:junit4]   2> 6652 T1017 oasc.SyncStrategy.syncToMe http://127.0.0.1:47618/k/a/collection1/ has no replicas
[junit4:junit4]   2> 6652 T1017 oasc.ShardLeaderElectionContext.runLeaderProcess I am the new leader: http://127.0.0.1:47618/k/a/collection1/
[junit4:junit4]   2> 6653 T1017 oascc.SolrZkClient.makePath makePath: /collections/collection1/leaders/shard2
[junit4:junit4]   2> 6656 T965 oazs.PrepRequestProcessor.pRequest Got user-level KeeperException when processing sessionid:0x13bb320dd270008 type:create cxid:0x4e zxid:0x82 txntype:-1 reqpath:n/a Error Path:/solr/overseer Error:KeeperErrorCode = NodeExists for /solr/overseer
[junit4:junit4]   2> 6867 T983 oascc.ZkStateReader.updateClusterState Updating cloud state from ZooKeeper... 
[junit4:junit4]   2> 6883 T982 oascc.ZkStateReader$2.process A cluster state change: WatchedEvent state:SyncConnected type:NodeDataChanged path:/clusterstate.json, has occurred - updating... (live nodes size: 3)
[junit4:junit4]   2> 6883 T1001 oascc.ZkStateReader$2.process A cluster state change: WatchedEvent state:SyncConnected type:NodeDataChanged path:/clusterstate.json, has occurred - updating... (live nodes size: 3)
[junit4:junit4]   2> 6884 T1016 oascc.ZkStateReader$2.process A cluster state change: WatchedEvent state:SyncConnected type:NodeDataChanged path:/clusterstate.json, has occurred - updating... (live nodes size: 3)
[junit4:junit4]   2> 6884 T988 oascc.ZkStateReader$2.process A cluster state change: WatchedEvent state:SyncConnected type:NodeDataChanged path:/clusterstate.json, has occurred - updating... (live nodes size: 3)
[junit4:junit4]   2> 6919 T1017 oasc.ZkController.register We are http://127.0.0.1:47618/k/a/collection1/ and leader is http://127.0.0.1:47618/k/a/collection1/
[junit4:junit4]   2> 6919 T1017 oasc.ZkController.register No LogReplay needed for core=collection1 baseURL=http://127.0.0.1:47618/k/a
[junit4:junit4]   2> 6919 T1017 oasc.ZkController.checkRecovery I am the leader, no recovery necessary
[junit4:junit4]   2> 6920 T1017 oasc.ZkController.publish publishing core=collection1 state=active
[junit4:junit4]   2> 6920 T1017 oasc.ZkController.publish numShards not found on descriptor - reading it from system property
[junit4:junit4]   2> 6922 T1017 oascc.ZkStateReader.updateClusterState Updating cloud state from ZooKeeper... 
[junit4:junit4]   2> 6923 T960 oass.SolrDispatchFilter.init user.dir=/usr/home/hudson/hudson-slave/workspace/Lucene-Solr-Tests-trunk-java7/solr/build/solr-core/test/J0
[junit4:junit4]   2> 6924 T960 oass.SolrDispatchFilter.init SolrDispatchFilter.init() done
[junit4:junit4]   2> 6925 T960 oascsi.HttpClientUtil.createClient Creating new http client, config:maxConnections=128&maxConnectionsPerHost=32&followRedirects=false
[junit4:junit4]   2> 7059 T960 oejs.Server.doStart jetty-8.1.8.v20121106
[junit4:junit4]   2> 7065 T960 oejs.AbstractConnector.doStart Started SocketConnector@127.0.0.1:60039
[junit4:junit4]   2> 7067 T960 oasc.SolrResourceLoader.locateSolrHome JNDI not configured for solr (NoInitialContextEx)
[junit4:junit4]   2> 7068 T960 oasc.SolrResourceLoader.locateSolrHome using system property solr.solr.home: /usr/home/hudson/hudson-slave/workspace/Lucene-Solr-Tests-trunk-java7/solr/build/solr-core/test/J0/./org.apache.solr.cloud.BasicDistributedZkTest-jetty3-1355919980596
[junit4:junit4]   2> 7069 T960 oasc.SolrResourceLoader.<init> new SolrResourceLoader for deduced Solr Home: '/usr/home/hudson/hudson-slave/workspace/Lucene-Solr-Tests-trunk-java7/solr/build/solr-core/test/J0/./org.apache.solr.cloud.BasicDistributedZkTest-jetty3-1355919980596/'
[junit4:junit4]   2> 7113 T960 oass.SolrDispatchFilter.init SolrDispatchFilter.init()
[junit4:junit4]   2> 7114 T960 oasc.SolrResourceLoader.locateSolrHome JNDI not configured for solr (NoInitialContextEx)
[junit4:junit4]   2> 7115 T960 oasc.SolrResourceLoader.locateSolrHome using system property solr.solr.home: /usr/home/hudson/hudson-slave/workspace/Lucene-Solr-Tests-trunk-java7/solr/build/solr-core/test/J0/./org.apache.solr.cloud.BasicDistributedZkTest-jetty3-1355919980596
[junit4:junit4]   2> 7115 T960 oasc.CoreContainer$Initializer.initialize looking for solr.xml: /usr/home/hudson/hudson-slave/workspace/Lucene-Solr-Tests-trunk-java7/solr/build/solr-core/test/J0/./org.apache.solr.cloud.BasicDistributedZkTest-jetty3-1355919980596/solr.xml
[junit4:junit4]   2> 7116 T960 oasc.CoreContainer.<init> New CoreContainer 661733498
[junit4:junit4]   2> 7117 T960 oasc.CoreContainer.load Loading CoreContainer using Solr Home: '/usr/home/hudson/hudson-slave/workspace/Lucene-Solr-Tests-trunk-java7/solr/build/solr-core/test/J0/./org.apache.solr.cloud.BasicDistributedZkTest-jetty3-1355919980596/'
[junit4:junit4]   2> 7117 T960 oasc.SolrResourceLoader.<init> new SolrResourceLoader for directory: '/usr/home/hudson/hudson-slave/workspace/Lucene-Solr-Tests-trunk-java7/solr/build/solr-core/test/J0/./org.apache.solr.cloud.BasicDistributedZkTest-jetty3-1355919980596/'
[junit4:junit4]   2> 7150 T960 oashc.HttpShardHandlerFactory.getParameter Setting socketTimeout to: 30000
[junit4:junit4]   2> 7151 T960 oashc.HttpShardHandlerFactory.getParameter Setting urlScheme to: http://
[junit4:junit4]   2> 7152 T960 oashc.HttpShardHandlerFactory.getParameter Setting connTimeout to: 15000
[junit4:junit4]   2> 7152 T960 oashc.HttpShardHandlerFactory.getParameter Setting maxConnectionsPerHost to: 20
[junit4:junit4]   2> 7153 T960 oashc.HttpShardHandlerFactory.getParameter Setting corePoolSize to: 0
[junit4:junit4]   2> 7154 T960 oashc.HttpShardHandlerFactory.getParameter Setting maximumPoolSize to: 2147483647
[junit4:junit4]   2> 7154 T960 oashc.HttpShardHandlerFactory.getParameter Setting maxThreadIdleTime to: 5
[junit4:junit4]   2> 7155 T960 oashc.HttpShardHandlerFactory.getParameter Setting sizeOfQueue to: -1
[junit4:junit4]   2> 7156 T960 oashc.HttpShardHandlerFactory.getParameter Setting fairnessPolicy to: false
[junit4:junit4]   2> 7156 T960 oascsi.HttpClientUtil.createClient Creating new http client, config:maxConnectionsPerHost=20&maxConnections=10000&socketTimeout=30000&connTimeout=15000&retry=false
[junit4:junit4]   2> 7181 T960 oasc.CoreContainer.load Registering Log Listener
[junit4:junit4]   2> 7201 T960 oasc.CoreContainer.initZooKeeper Zookeeper client=127.0.0.1:40979/solr
[junit4:junit4]   2> 7202 T960 oasc.ZkController.checkChrootPath zkHost includes chroot
[junit4:junit4]   2> 7203 T960 oaz.ZooKeeper.<init> Initiating client connection, connectString=127.0.0.1:40979 sessionTimeout=60000 watcher=org.apache.solr.common.cloud.ConnectionManager@5849fd1d
[junit4:junit4]   2> 7204 T960 oascc.ConnectionManager.waitForConnected Waiting for client to connect to ZooKeeper
[junit4:junit4]   2> 7205 T1028 oaz.ClientCnxn$SendThread.logStartConnect Opening socket connection to server localhost/127.0.0.1:40979. Will not attempt to authenticate using SASL (access denied ("javax.security.auth.AuthPermission" "getLoginConfiguration"))
[junit4:junit4]   2> 7206 T1028 oaz.ClientCnxn$SendThread.primeConnection Socket connection established to localhost/127.0.0.1:40979, initiating session
[junit4:junit4]   2> 7206 T962 oazs.NIOServerCnxnFactory.run Accepted socket connection from /140.211.11.196:54655
[junit4:junit4]   2> 7206 T962 oazs.ZooKeeperServer.processConnectRequest Client attempting to establish new session at /140.211.11.196:54655
[junit4:junit4]   2> 7235 T964 oazs.ZooKeeperServer.finishSessionInit Established session 0x13bb320dd270009 with negotiated timeout 20000 for client /140.211.11.196:54655
[junit4:junit4]   2> 7235 T1028 oaz.ClientCnxn$SendThread.onConnected Session establishment complete on server localhost/127.0.0.1:40979, sessionid = 0x13bb320dd270009, negotiated timeout = 20000
[junit4:junit4]   2> 7235 T1029 oascc.ConnectionManager.process Watcher org.apache.solr.common.cloud.ConnectionManager@5849fd1d name:ZooKeeperConnection Watcher:127.0.0.1:40979 got event WatchedEvent state:SyncConnected type:None path:null path:null type:None
[junit4:junit4]   2> 7236 T960 oascc.ConnectionManager.waitForConnected Client is connected to ZooKeeper
[junit4:junit4]   2> 7238 T965 oazs.PrepRequestProcessor.pRequest2Txn Processed session termination for sessionid: 0x13bb320dd270009
[junit4:junit4]   2> 7283 T1029 oaz.ClientCnxn$EventThread.run EventThread shut down
[junit4:junit4]   2> 7283 T962 oazs.NIOServerCnxn.closeSock Closed socket connection for client /140.211.11.196:54655 which had sessionid 0x13bb320dd270009
[junit4:junit4]   2> 7283 T960 oaz.ZooKeeper.close Session: 0x13bb320dd270009 closed
[junit4:junit4]   2> 7284 T960 oascsi.HttpClientUtil.createClient Creating new http client, config:maxConnections=500&maxConnectionsPerHost=16&socketTimeout=15000&connTimeout=30000
[junit4:junit4]   2> 7293 T960 oaz.ZooKeeper.<init> Initiating client connection, connectString=127.0.0.1:40979/solr sessionTimeout=30000 watcher=org.apache.solr.common.cloud.ConnectionManager@57e3b528
[junit4:junit4]   2> 7294 T960 oascc.ConnectionManager.waitForConnected Waiting for client to connect to ZooKeeper
[junit4:junit4]   2> 7295 T1030 oaz.ClientCnxn$SendThread.logStartConnect Opening socket connection to server localhost/127.0.0.1:40979. Will not attempt to authenticate using SASL (access denied ("javax.security.auth.AuthPermission" "getLoginConfiguration"))
[junit4:junit4]   2> 7295 T1030 oaz.ClientCnxn$SendThread.primeConnection Socket connection established to localhost/127.0.0.1:40979, initiating session
[junit4:junit4]   2> 7295 T962 oazs.NIOServerCnxnFactory.run Accepted socket connection from /140.211.11.196:35310
[junit4:junit4]   2> 7296 T962 oazs.ZooKeeperServer.processConnectRequest Client attempting to establish new session at /140.211.11.196:35310
[junit4:junit4]   2> 7297 T964 oazs.ZooKeeperServer.finishSessionInit Established session 0x13bb320dd27000a with negotiated timeout 20000 for client /140.211.11.196:35310
[junit4:junit4]   2> 7297 T1030 oaz.ClientCnxn$SendThread.onConnected Session establishment complete on server localhost/127.0.0.1:40979, sessionid = 0x13bb320dd27000a, negotiated timeout = 20000
[junit4:junit4]   2> 7298 T1031 oascc.ConnectionManager.process Watcher org.apache.solr.common.cloud.ConnectionManager@57e3b528 name:ZooKeeperConnection Watcher:127.0.0.1:40979/solr got event WatchedEvent state:SyncConnected type:None path:null path:null type:None
[junit4:junit4]   2> 7298 T960 oascc.ConnectionManager.waitForConnected Client is connected to ZooKeeper
[junit4:junit4]   2> 7299 T965 oazs.PrepRequestProcessor.pRequest Got user-level KeeperException when processing sessionid:0x13bb320dd27000a type:create cxid:0x1 zxid:0x8f txntype:-1 reqpath:n/a Error Path:/solr/overseer Error:KeeperErrorCode = NodeExists for /solr/overseer
[junit4:junit4]   2> 7355 T965 oazs.PrepRequestProcessor.pRequest Got user-level KeeperException when processing sessionid:0x13bb320dd27000a type:create cxid:0x2 zxid:0x90 txntype:-1 reqpath:n/a Error Path:/solr/overseer Error:KeeperErrorCode = NodeExists for /solr/overseer
[junit4:junit4]   2> 7358 T960 oasc.ZkController.createEphemeralLiveNode Register node as live in ZooKeeper:/live_nodes/127.0.0.1:60039_k%2Fa
[junit4:junit4]   2> 7359 T965 oazs.PrepRequestProcessor.pRequest Got user-level KeeperException when processing sessionid:0x13bb320dd27000a type:delete cxid:0x4 zxid:0x91 txntype:-1 reqpath:n/a Error Path:/solr/live_nodes/127.0.0.1:60039_k%2Fa Error:KeeperErrorCode = NoNode for /solr/live_nodes/127.0.0.1:60039_k%2Fa
[junit4:junit4]   2> 7385 T960 oascc.SolrZkClient.makePath makePath: /live_nodes/127.0.0.1:60039_k%2Fa
[junit4:junit4]   2> 7388 T1001 oascc.ZkStateReader$2.process A cluster state change: WatchedEvent state:SyncConnected type:NodeChildrenChanged path:/live_nodes, has occurred - updating... (live nodes size: 3)
[junit4:junit4]   2> 7388 T982 oascc.ZkStateReader$2.process A cluster state change: WatchedEvent state:SyncConnected type:NodeChildrenChanged path:/live_nodes, has occurred - updating... (live nodes size: 3)
[junit4:junit4]   2> 7388 T988 oascc.ZkStateReader$3.process Updating live nodes... (4)
[junit4:junit4]   2> 7388 T1016 oascc.ZkStateReader$3.process Updating live nodes... (4)
[junit4:junit4]   2> 7389 T988 oascc.ZkStateReader$2.process A cluster state change: WatchedEvent state:SyncConnected type:NodeChildrenChanged path:/live_nodes, has occurred - updating... (live nodes size: 4)
[junit4:junit4]   2> 7389 T1016 oascc.ZkStateReader$2.process A cluster state change: WatchedEvent state:SyncConnected type:NodeChildrenChanged path:/live_nodes, has occurred - updating... (live nodes size: 4)
[junit4:junit4]   2> 7390 T982 oascc.ZkStateReader$3.process Updating live nodes... (4)
[junit4:junit4]   2> 7390 T1001 oascc.ZkStateReader$3.process Updating live nodes... (4)
[junit4:junit4]   2> 7392 T960 oascc.ZkStateReader.createClusterStateWatchersAndUpdate Updating cluster state from ZooKeeper... 
[junit4:junit4]   2> 7397 T983 oascc.ZkStateReader.updateClusterState Updating cloud state from ZooKeeper... 
[junit4:junit4]   2> 7398 T983 oasc.Overseer$ClusterStateUpdater.updateState Update state numShards=2 message={
[junit4:junit4]   2> 	  "operation":"state",
[junit4:junit4]   2> 	  "numShards":"2",
[junit4:junit4]   2> 	  "shard":"shard2",
[junit4:junit4]   2> 	  "roles":null,
[junit4:junit4]   2> 	  "state":"active",
[junit4:junit4]   2> 	  "core":"collection1",
[junit4:junit4]   2> 	  "collection":"collection1",
[junit4:junit4]   2> 	  "node_name":"127.0.0.1:47618_k%2Fa",
[junit4:junit4]   2> 	  "base_url":"http://127.0.0.1:47618/k/a"}
[junit4:junit4]   2> 7399 T1032 oasc.CoreContainer.create Creating SolrCore 'collection1' using instanceDir: /usr/home/hudson/hudson-slave/workspace/Lucene-Solr-Tests-trunk-java7/solr/build/solr-core/test/J0/./org.apache.solr.cloud.BasicDistributedZkTest-jetty3-1355919980596/collection1
[junit4:junit4]   2> 7399 T1032 oasc.ZkController.createCollectionZkNode Check for collection zkNode:collection1
[junit4:junit4]   2> 7425 T1032 oasc.ZkController.createCollectionZkNode Collection zkNode exists
[junit4:junit4]   2> 7426 T1032 oasc.ZkController.readConfigName Load collection config from:/collections/collection1
[junit4:junit4]   2> 7428 T1032 oasc.SolrResourceLoader.<init> new SolrResourceLoader for directory: '/usr/home/hudson/hudson-slave/workspace/Lucene-Solr-Tests-trunk-java7/solr/build/solr-core/test/J0/./org.apache.solr.cloud.BasicDistributedZkTest-jetty3-1355919980596/collection1/'
[junit4:junit4]   2> 7429 T1032 oasc.SolrResourceLoader.replaceClassLoader Adding 'file:/usr/home/hudson/hudson-slave/workspace/Lucene-Solr-Tests-trunk-java7/solr/build/solr-core/test/J0/org.apache.solr.cloud.BasicDistributedZkTest-jetty3-1355919980596/collection1/lib/classes/' to classloader
[junit4:junit4]   2> 7430 T982 oascc.ZkStateReader$2.process A cluster state change: WatchedEvent state:SyncConnected type:NodeDataChanged path:/clusterstate.json, has occurred - updating... (live nodes size: 4)
[junit4:junit4]   2> 7430 T988 oascc.ZkStateReader$2.process A cluster state change: WatchedEvent state:SyncConnected type:NodeDataChanged path:/clusterstate.json, has occurred - updating... (live nodes size: 4)
[junit4:junit4]   2> 7430 T1032 oasc.SolrResourceLoader.replaceClassLoader Adding 'file:/usr/home/hudson/hudson-slave/workspace/Lucene-Solr-Tests-trunk-java7/solr/build/solr-core/test/J0/org.apache.solr.cloud.BasicDistributedZkTest-jetty3-1355919980596/collection1/lib/README' to classloader
[junit4:junit4]   2> 7430 T1031 oascc.ZkStateReader$2.process A cluster state change: WatchedEvent state:SyncConnected type:NodeDataChanged path:/clusterstate.json, has occurred - updating... (live nodes size: 4)
[junit4:junit4]   2> 7430 T1016 oascc.ZkStateReader$2.process A cluster state change: WatchedEvent state:SyncConnected type:NodeDataChanged path:/clusterstate.json, has occurred - updating... (live nodes size: 4)
[junit4:junit4]   2> 7430 T1001 oascc.ZkStateReader$2.process A cluster state change: WatchedEvent state:SyncConnected type:NodeDataChanged path:/clusterstate.json, has occurred - updating... (live nodes size: 4)
[junit4:junit4]   2> 7470 T1032 oasc.SolrConfig.<init> Using Lucene MatchVersion: LUCENE_50
[junit4:junit4]   2> 7521 T1032 oasc.SolrConfig.<init> Loaded SolrConfig: solrconfig.xml
[junit4:junit4]   2> 7622 T1032 oass.IndexSchema.readSchema Reading Solr Schema
[junit4:junit4]   2> 7631 T1032 oass.IndexSchema.readSchema Schema name=test
[junit4:junit4]   2> 8098 T1032 oass.OpenExchangeRatesOrgProvider.init Initialized with rates=open-exchange-rates.json, refreshInterval=1440.
[junit4:junit4]   2> 8107 T1032 oass.IndexSchema.readSchema default search field in schema is text
[junit4:junit4]   2> 8110 T1032 oass.IndexSchema.readSchema unique key field: id
[junit4:junit4]   2> 8123 T1032 oass.FileExchangeRateProvider.reload Reloading exchange rates from file currency.xml
[junit4:junit4]   2> 8128 T1032 oass.FileExchangeRateProvider.reload Reloading exchange rates from file currency.xml
[junit4:junit4]   2> 8133 T1032 oass.OpenExchangeRatesOrgProvider.reload Reloading exchange rates from open-exchange-rates.json
[junit4:junit4]   2> 8135 T1032 oass.OpenExchangeRatesOrgProvider.reload Reloading exchange rates from open-exchange-rates.json
[junit4:junit4]   2> 8136 T1032 oasc.SolrCore.<init> [collection1] Opening new SolrCore at /usr/home/hudson/hudson-slave/workspace/Lucene-Solr-Tests-trunk-java7/solr/build/solr-core/test/J0/./org.apache.solr.cloud.BasicDistributedZkTest-jetty3-1355919980596/collection1/, dataDir=./org.apache.solr.cloud.BasicDistributedZkTest-1355919973665/jetty3/
[junit4:junit4]   2> 8136 T1032 oasc.JmxMonitoredMap.<init> JMX monitoring is enabled. Adding Solr mbeans to JMX Server: com.sun.jmx.mbeanserver.JmxMBeanServer@380d8f5c
[junit4:junit4]   2> 8137 T1032 oasc.SolrCore.initDirectoryFactory solr.NRTCachingDirectoryFactory
[junit4:junit4]   2> 8138 T1032 oasc.CachingDirectoryFactory.get return new directory for /usr/home/hudson/hudson-slave/workspace/Lucene-Solr-Tests-trunk-java7/solr/build/solr-core/test/J0/./org.apache.solr.cloud.BasicDistributedZkTest-1355919973665/jetty3 forceNew:false
[junit4:junit4]   2> 8138 T1032 oasc.CachingDirectoryFactory.close Releasing directory:/usr/home/hudson/hudson-slave/workspace/Lucene-Solr-Tests-trunk-java7/solr/build/solr-core/test/J0/./org.apache.solr.cloud.BasicDistributedZkTest-1355919973665/jetty3
[junit4:junit4]   2> 8139 T1032 oasc.SolrCore.getNewIndexDir New index directory detected: old=null new=./org.apache.solr.cloud.BasicDistributedZkTest-1355919973665/jetty3/index/
[junit4:junit4]   2> 8139 T1032 oasc.SolrCore.initIndex WARNING [collection1] Solr index directory './org.apache.solr.cloud.BasicDistributedZkTest-1355919973665/jetty3/index' doesn't exist. Creating new index...
[junit4:junit4]   2> 8140 T1032 oasc.CachingDirectoryFactory.get return new directory for /usr/home/hudson/hudson-slave/workspace/Lucene-Solr-Tests-trunk-java7/solr/build/solr-core/test/J0/./org.apache.solr.cloud.BasicDistributedZkTest-1355919973665/jetty3/index forceNew:false
[junit4:junit4]   2> 8145 T1032 oasc.SolrDeletionPolicy.onCommit SolrDeletionPolicy.onCommit: commits:num=1
[junit4:junit4]   2> 		commit{dir=RateLimitedDirectoryWrapper(NRTCachingDirectory(org.apache.lucene.store.NIOFSDirectory@/usr/home/hudson/hudson-slave/workspace/Lucene-Solr-Tests-trunk-java7/solr/build/solr-core/test/J0/org.apache.solr.cloud.BasicDistributedZkTest-1355919973665/jetty3/index lockFactory=org.apache.lucene.store.NativeFSLockFactory@716ff73e; maxCacheMB=48.0 maxMergeSizeMB=4.0)),segFN=segments_1,generation=1,filenames=[segments_1]
[junit4:junit4]   2> 8145 T1032 oasc.SolrDeletionPolicy.updateCommits newest commit = 1[segments_1]
[junit4:junit4]   2> 8146 T1032 oasc.CachingDirectoryFactory.close Releasing directory:/usr/home/hudson/hudson-slave/workspace/Lucene-Solr-Tests-trunk-java7/solr/build/solr-core/test/J0/./org.apache.solr.cloud.BasicDistributedZkTest-1355919973665/jetty3/index
[junit4:junit4]   2> 8146 T1032 oasc.SolrCore.initWriters created xml: solr.XMLResponseWriter
[junit4:junit4]   2> 8148 T1032 oasup.UpdateRequestProcessorChain.init inserting DistributedUpdateProcessorFactory into updateRequestProcessorChain "dedupe"
[junit4:junit4]   2> 8149 T1032 oasup.UpdateRequestProcessorChain.init inserting DistributedUpdateProcessorFactory into updateRequestProcessorChain "dedupe-allfields"
[junit4:junit4]   2> 8149 T1032 oasup.UpdateRequestProcessorChain.init inserting DistributedUpdateProcessorFactory into updateRequestProcessorChain "stored_sig"
[junit4:junit4]   2> 8149 T1032 oasup.UpdateRequestProcessorChain.init inserting DistributedUpdateProcessorFactory into updateRequestProcessorChain "uniq-fields"
[junit4:junit4]   2> 8150 T1032 oasup.UpdateRequestProcessorChain.init inserting DistributedUpdateProcessorFactory into updateRequestProcessorChain "distrib-dup-test-chain-implicit"
[junit4:junit4]   2> 8150 T1032 oasc.RequestHandlers.initHandlersFromConfig adding lazy requestHandler: solr.ReplicationHandler
[junit4:junit4]   2> 8150 T1032 oasc.RequestHandlers.initHandlersFromConfig created /replication: solr.ReplicationHandler
[junit4:junit4]   2> 8151 T1032 oasc.RequestHandlers.initHandlersFromConfig created standard: solr.StandardRequestHandler
[junit4:junit4]   2> 8152 T1032 oasc.RequestHandlers.initHandlersFromConfig created /get: solr.RealTimeGetHandler
[junit4:junit4]   2> 8153 T1032 oasc.RequestHandlers.initHandlersFromConfig created dismax: solr.SearchHandler
[junit4:junit4]   2> 8155 T1032 oasc.RequestHandlers.initHandlersFromConfig created mock: org.apache.solr.core.MockQuerySenderListenerReqHandler
[junit4:junit4]   2> 8155 T1032 oasc.RequestHandlers.initHandlersFromConfig created /admin/: org.apache.solr.handler.admin.AdminHandlers
[junit4:junit4]   2> 8156 T1032 oasc.RequestHandlers.initHandlersFromConfig created defaults: solr.StandardRequestHandler
[junit4:junit4]   2> 8156 T1032 oasc.RequestHandlers.initHandlersFromConfig adding lazy requestHandler: solr.StandardRequestHandler
[junit4:junit4]   2> 8157 T1032 oasc.RequestHandlers.initHandlersFromConfig created lazy: solr.StandardRequestHandler
[junit4:junit4]   2> 8157 T1032 oasc.RequestHandlers.initHandlersFromConfig created /update: solr.UpdateRequestHandler
[junit4:junit4]   2> 8158 T1032 oasc.RequestHandlers.initHandlersFromConfig created /terms: org.apache.solr.handler.component.SearchHandler
[junit4:junit4]   2> 8159 T1032 oasc.RequestHandlers.initHandlersFromConfig created spellCheckCompRH: org.apache.solr.handler.component.SearchHandler
[junit4:junit4]   2> 8160 T1032 oasc.RequestHandlers.initHandlersFromConfig created spellCheckCompRH_Direct: org.apache.solr.handler.component.SearchHandler
[junit4:junit4]   2> 8161 T1032 oasc.RequestHandlers.initHandlersFromConfig created spellCheckWithWordbreak: org.apache.solr.handler.component.SearchHandler
[junit4:junit4]   2> 8161 T1032 oasc.RequestHandlers.initHandlersFromConfig created spellCheckWithWordbreak_Direct: org.apache.solr.handler.component.SearchHandler
[junit4:junit4]   2> 8162 T1032 oasc.RequestHandlers.initHandlersFromConfig created spellCheckCompRH1: org.apache.solr.handler.component.SearchHandler
[junit4:junit4]   2> 8163 T1032 oasc.RequestHandlers.initHandlersFromConfig created mltrh: org.apache.solr.handler.component.SearchHandler
[junit4:junit4]   2> 8164 T1032 oasc.RequestHandlers.initHandlersFromConfig created tvrh: org.apache.solr.handler.component.SearchHandler
[junit4:junit4]   2> 8164 T1032 oasc.RequestHandlers.initHandlersFromConfig created /mlt: solr.MoreLikeThisHandler
[junit4:junit4]   2> 8165 T1032 oasc.RequestHandlers.initHandlersFromConfig created /debug/dump: solr.DumpRequestHandler
[junit4:junit4]   2> 8174 T1032 oashl.XMLLoader.init xsltCacheLifetimeSeconds=60
[junit4:junit4]   2> 8178 T1032 oasc.SolrCore.initDeprecatedSupport WARNING solrconfig.xml uses deprecated <admin/gettableFiles>, Please update your config to use the ShowFileRequestHandler.
[junit4:junit4]   2> 8180 T1032 oasc.SolrCore.initDeprecatedSupport WARNING adding ShowFileRequestHandler with hidden files: [SCHEMA.XML, OLD_SYNONYMS.TXT, STOPWORDS.TXT, PROTWORDS.TXT, OPEN-EXCHANGE-RATES.JSON, SYNONYMS.TXT, CURRENCY.XML, MAPPING-ISOLATIN1ACCENT.TXT]
[junit4:junit4]   2> 8182 T1032 oasc.CachingDirectoryFactory.close Releasing directory:/usr/home/hudson/hudson-slave/workspace/Lucene-Solr-Tests-trunk-java7/solr/build/solr-core/test/J0/./org.apache.solr.cloud.BasicDistributedZkTest-1355919973665/jetty3
[junit4:junit4]   2> 8184 T1032 oass.SolrIndexSearcher.<init> Opening Searcher@4c873d2d main
[junit4:junit4]   2> 8185 T1032 oasu.CommitTracker.<init> Hard AutoCommit: disabled
[junit4:junit4]   2> 8185 T1032 oasu.CommitTracker.<init> Soft AutoCommit: disabled
[junit4:junit4]   2> 8186 T1032 oashc.SpellCheckComponent.inform Initializing spell checkers
[junit4:junit4]   2> 8191 T1032 oass.DirectSolrSpellChecker.init init: {name=direct,classname=DirectSolrSpellChecker,field=lowerfilt,minQueryLength=3}
[junit4:junit4]   2> 8244 T1033 oasc.SolrCore.registerSearcher [collection1] Registered new searcher Searcher@4c873d2d main{StandardDirectoryReader(segments_1:1)}
[junit4:junit4]   2> 8248 T1032 oasc.ZkController.publish publishing core=collection1 state=down
[junit4:junit4]   2> 8248 T1032 oasc.ZkController.publish numShards not found on descriptor - reading it from system property
[junit4:junit4]   2> 8444 T983 oascc.ZkStateReader.updateClusterState Updating cloud state from ZooKeeper... 
[junit4:junit4]   2> 8445 T983 oasc.Overseer$ClusterStateUpdater.updateState Update state numShards=2 message={
[junit4:junit4]   2> 	  "operation":"state",
[junit4:junit4]   2> 	  "numShards":"2",
[junit4:junit4]   2> 	  "shard":null,
[junit4:junit4]   2> 	  "roles":null,
[junit4:junit4]   2> 	  "state":"down",
[junit4:junit4]   2> 	  "core":"collection1",
[junit4:junit4]   2> 	  "collection":"collection1",
[junit4:junit4]   2> 	  "node_name":"127.0.0.1:60039_k%2Fa",
[junit4:junit4]   2> 	  "base_url":"http://127.0.0.1:60039/k/a"}
[junit4:junit4]   2> 8445 T983 oasc.Overseer$ClusterStateUpdater.updateState Collection already exists with numShards=2
[junit4:junit4]   2> 8445 T983 oasc.Overseer$ClusterStateUpdater.updateState Assigning new node to shard shard=shard1
[junit4:junit4]   2> 8458 T982 oascc.ZkStateReader$2.process A cluster state change: WatchedEvent state:SyncConnected type:NodeDataChanged path:/clusterstate.json, has occurred - updating... (live nodes size: 4)
[junit4:junit4]   2> 8458 T1001 oascc.ZkStateReader$2.process A cluster state change: WatchedEvent state:SyncConnected type:NodeDataChanged path:/clusterstate.json, has occurred - updating... (live nodes size: 4)
[junit4:junit4]   2> 8458 T1016 oascc.ZkStateReader$2.process A cluster state change: WatchedEvent state:SyncConnected type:NodeDataChanged path:/clusterstate.json, has occurred - updating... (live nodes size: 4)
[junit4:junit4]   2> 8458 T988 oascc.ZkStateReader$2.process A cluster state change: WatchedEvent state:SyncConnected type:NodeDataChanged path:/clusterstate.json, has occurred - updating... (live nodes size: 4)
[junit4:junit4]   2> 8458 T1031 oascc.ZkStateReader$2.process A cluster state change: WatchedEvent state:SyncConnected type:NodeDataChanged path:/clusterstate.json, has occurred - updating... (live nodes size: 4)
[junit4:junit4]   2> 8751 T1032 oasc.CoreContainer.registerCore registering core: collection1
[junit4:junit4]   2> 8751 T1032 oasc.ZkController.register Register replica - core:collection1 address:http://127.0.0.1:60039/k/a collection:collection1 shard:shard1
[junit4:junit4]   2> 8761 T1032 oasc.ZkController.register We are http://127.0.0.1:60039/k/a/collection1/ and leader is http://127.0.0.1:56415/k/a/collection1/
[junit4:junit4]   2> 8762 T1032 oasc.ZkController.register No LogReplay needed for core=collection1 baseURL=http://127.0.0.1:60039/k/a
[junit4:junit4]   2> 8762 T1032 oasc.ZkController.checkRecovery Core needs to recover:collection1
[junit4:junit4]   2> 8762 T1032 oasu.DefaultSolrCoreState.doRecovery Running recovery - first canceling any ongoing recovery
[junit4:junit4]   2> ASYNC  NEW_CORE C45 name=collection1 org.apache.solr.core.SolrCore@1ef37f19 url=http://127.0.0.1:60039/k/a/collection1 node=127.0.0.1:60039_k%2Fa C45_STATE=coll:collection1 core:collection1 props:{shard=null, roles=null, state=down, core=collection1, collection=collection1, node_name=127.0.0.1:60039_k%2Fa, base_url=http://127.0.0.1:60039/k/a}
[junit4:junit4]   2> 8763 T1034 C45 P60039 oasc.RecoveryStrategy.run Starting recovery process.  core=collection1 recoveringAfterStartup=true
[junit4:junit4]   2> 8763 T1032 oascc.ZkStateReader.updateClusterState Updating cloud state from ZooKeeper... 
[junit4:junit4]   2> 8764 T1034 C45 P60039 oasc.RecoveryStrategy.doRecovery ###### startupVersions=[]
[junit4:junit4]   2> 8764 T1034 C45 P60039 oasc.ZkController.publish publishing core=collection1 state=recovering
[junit4:junit4]   2> 8764 T1034 C45 P60039 oasc.ZkController.publish numShards not found on descriptor - reading it from system property
[junit4:junit4]   2> 8765 T960 oass.SolrDispatchFilter.init user.dir=/usr/home/hudson/hudson-slave/workspace/Lucene-Solr-Tests-trunk-java7/solr/build/solr-core/test/J0
[junit4:junit4]   2> 8765 T960 oass.SolrDispatchFilter.init SolrDispatchFilter.init() done
[junit4:junit4]   2> 8766 T1034 C45 P60039 oasc.RecoveryStrategy.doRecovery Attempting to PeerSync from http://127.0.0.1:56415/k/a/collection1/ core=collection1 - recoveringAfterStartup=true
[junit4:junit4]   2> 8766 T1034 C45 P60039 oasu.PeerSync.sync PeerSync: core=collection1 url=http://127.0.0.1:60039/k/a START replicas=[http://127.0.0.1:56415/k/a/collection1/] nUpdates=100
[junit4:junit4]   2> 8766 T960 oascsi.HttpClientUtil.createClient Creating new http client, config:maxConnections=128&maxConnectionsPerHost=32&followRedirects=false
[junit4:junit4]   2> 8767 T1034 C45 P60039 oasu.PeerSync.sync WARNING no frame of reference to tell of we've missed updates
[junit4:junit4]   2> 8767 T1034 C45 P60039 oasc.RecoveryStrategy.doRecovery PeerSync Recovery was not successful - trying replication. core=collection1
[junit4:junit4]   2> 8767 T1034 C45 P60039 oasc.RecoveryStrategy.doRecovery Starting Replication Recovery. core=collection1
[junit4:junit4]   2> 8767 T1034 C45 P60039 oascsi.HttpClientUtil.createClient Creating new http client, config:maxConnections=128&maxConnectionsPerHost=32&followRedirects=false
[junit4:junit4]   2> ASYNC  NEW_CORE C46 name=collection1 org.apache.solr.core.SolrCore@3f428008 url=http://127.0.0.1:56415/k/a/collection1 node=127.0.0.1:56415_k%2Fa C46_STATE=coll:collection1 core:collection1 props:{shard=shard1, roles=null, state=active, core=collection1, collection=collection1, node_name=127.0.0.1:56415_k%2Fa, base_url=http://127.0.0.1:56415/k/a, leader=true}
[junit4:junit4]   2> 8777 T991 C46 P56415 REQ /get {distrib=false&qt=/get&wt=javabin&version=2&getVersions=100} status=0 QTime=1 
[junit4:junit4]   2> 8897 T960 oejs.Server.doStart jetty-8.1.8.v20121106
[junit4:junit4]   2> 8900 T960 oejs.AbstractConnector.doStart Started SocketConnector@127.0.0.1:30877
[junit4:junit4]   2> 8901 T960 oasc.SolrResourceLoader.locateSolrHome JNDI not configured for solr (NoInitialContextEx)
[junit4:junit4]   2> 8901 T960 oasc.SolrResourceLoader.locateSolrHome using system property solr.solr.home: /usr/home/hudson/hudson-slave/workspace/Lucene-Solr-Tests-trunk-java7/solr/build/solr-core/test/J0/./org.apache.solr.cloud.BasicDistributedZkTest-jetty4-1355919982442
[junit4:junit4]   2> 8902 T960 oasc.SolrResourceLoader.<init> new SolrResourceLoader for deduced Solr Home: '/usr/home/hudson/hudson-slave/workspace/Lucene-Solr-Tests-trunk-java7/solr/build/solr-core/test/J0/./org.apache.solr.cloud.BasicDistributedZkTest-jetty4-1355919982442/'
[junit4:junit4]   2> 8931 T960 oass.SolrDispatchFilter.init SolrDispatchFilter.init()
[junit4:junit4]   2> 8932 T960 oasc.SolrResourceLoader.locateSolrHome JNDI not configured for solr (NoInitialContextEx)
[junit4:junit4]   2> 8933 T960 oasc.SolrResourceLoader.locateSolrHome using system property solr.solr.home: /usr/home/hudson/hudson-slave/workspace/Lucene-Solr-Tests-trunk-java7/solr/build/solr-core/test/J0/./org.apache.solr.cloud.BasicDistributedZkTest-jetty4-1355919982442
[junit4:junit4]   2> 8933 T960 oasc.CoreContainer$Initializer.initialize looking for solr.xml: /usr/home/hudson/hudson-slave/workspace/Lucene-Solr-Tests-trunk-java7/solr/build/solr-core/test/J0/./org.apache.solr.cloud.BasicDistributedZkTest-jetty4-1355919982442/solr.xml
[junit4:junit4]   2> 8933 T960 oasc.CoreContainer.<init> New CoreContainer 930500201
[junit4:junit4]   2> 8934 T960 oasc.CoreContainer.load Loading CoreContainer using Solr Home: '/usr/home/hudson/hudson-slave/workspace/Lucene-Solr-Tests-trunk-java7/solr/build/solr-core/test/J0/./org.apache.solr.cloud.BasicDistributedZkTest-jetty4-1355919982442/'
[junit4:junit4]   2> 8934 T960 oasc.SolrResourceLoader.<init> new SolrResourceLoader for directory: '/usr/home/hudson/hudson-slave/workspace/Lucene-Solr-Tests-trunk-java7/solr/build/solr-core/test/J0/./org.apache.solr.cloud.BasicDistributedZkTest-jetty4-1355919982442/'
[junit4:junit4]   2> 8956 T960 oashc.HttpShardHandlerFactory.getParameter Setting socketTimeout to: 30000
[junit4:junit4]   2> 8957 T960 oashc.HttpShardHandlerFactory.getParameter Setting urlScheme to: http://
[junit4:junit4]   2> 8957 T960 oashc.HttpShardHandlerFactory.getParameter Setting connTimeout to: 15000
[junit4:junit4]   2> 8957 T960 oashc.HttpShardHandlerFactory.getParameter Setting maxConnectionsPerHost to: 20
[junit4:junit4]   2> 8958 T960 oashc.HttpShardHandlerFactory.getParameter Setting corePoolSize to: 0
[junit4:junit4]   2> 8958 T960 oashc.HttpShardHandlerFactory.getParameter Setting maximumPoolSize to: 2147483647
[junit4:junit4]   2> 8959 T960 oashc.HttpShardHandlerFactory.getParameter Setting maxThreadIdleTime to: 5
[junit4:junit4]   2> 8959 T960 oashc.HttpShardHandlerFactory.getParameter Setting sizeOfQueue to: -1
[junit4:junit4]   2> 8960 T960 oashc.HttpShardHandlerFactory.getParameter Setting fairnessPolicy to: false
[junit4:junit4]   2> 8960 T960 oascsi.HttpClientUtil.createClient Creating new http client, config:maxConnectionsPerHost=20&maxConnections=10000&socketTimeout=30000&connTimeout=15000&retry=false
[junit4:junit4]   2> 8963 T983 oascc.ZkStateReader.updateClusterState Updating cloud state from ZooKeeper... 
[junit4:junit4]   2> 8964 T983 oasc.Overseer$ClusterStateUpdater.updateState Update state numShards=2 message={
[junit4:junit4]   2> 	  "operation":"state",
[junit4:junit4]   2> 	  "numShards":"2",
[junit4:junit4]   2> 	  "shard":"shard1",
[junit4:junit4]   2> 	  "roles":null,
[junit4:junit4]   2> 	  "state":"recovering",
[junit4:junit4]   2> 	  "core":"collection1",
[junit4:junit4]   2> 	  "collection":"collection1",
[junit4:junit4]   2> 	  "node_name":"127.0.0.1:60039_k%2Fa",
[junit4:junit4]   2> 	  "base_url":"http://127.0.0.1:60039/k/a"}
[junit4:junit4]   2> 8980 T960 oasc.CoreContainer.load Registering Log Listener
[junit4:junit4]   2> 8981 T982 oascc.ZkStateReader$2.process A cluster state change: WatchedEvent state:SyncConnected type:NodeDataChanged path:/clusterstate.json, has occurred - updating... (live nodes size: 4)
[junit4:junit4]   2> 8982 T1001 oascc.ZkStateReader$2.process A cluster state change: WatchedEvent state:SyncConnected type:NodeDataChanged path:/clusterstate.json, has occurred - updating... (live nodes size: 4)
[junit4:junit4]   2> 8982 T988 oascc.ZkStateReader$2.process A cluster state change: WatchedEvent state:SyncConnected type:NodeDataChanged path:/clusterstate.json, has occurred - updating... (live nodes size: 4)
[junit4:junit4]   2> 8982 T1031 oascc.ZkStateReader$2.process A cluster state change: WatchedEvent state:SyncConnected type:NodeDataChanged path:/clusterstate.json, has occurred - updating... (live nodes size: 4)
[junit4:junit4]   2> 8981 T1016 oascc.ZkStateReader$2.process A cluster state change: WatchedEvent state:SyncConnected type:NodeDataChanged path:/clusterstate.json, has occurred - updating... (live nodes size: 4)
[junit4:junit4]   2> 8996 T960 oasc.CoreContainer.initZooKeeper Zookeeper client=127.0.0.1:40979/solr
[junit4:junit4]   2> 8997 T960 oasc.ZkController.checkChrootPath zkHost includes chroot
[junit4:junit4]   2> 8997 T960 oaz.ZooKeeper.<init> Initiating client connection, connectString=127.0.0.1:40979 sessionTimeout=60000 watcher=org.apache.solr.common.cloud.ConnectionManager@2e552a5e
[junit4:junit4]   2> 8998 T960 oascc.ConnectionManager.waitForConnected Waiting for client to connect to ZooKeeper
[junit4:junit4]   2> 8999 T1045 oaz.ClientCnxn$SendThread.logStartConnect Opening socket connection to server localhost/127.0.0.1:40979. Will not attempt to authenticate using SASL (access denied ("javax.security.auth.AuthPermission" "getLoginConfiguration"))
[junit4:junit4]   2> 8999 T1045 oaz.ClientCnxn$SendThread.primeConnection Socket connection established to localhost/127.0.0.1:40979, initiating session
[junit4:junit4]   2> 8999 T962 oazs.NIOServerCnxnFactory.run Accepted socket connection from /140.211.11.196:40549
[junit4:junit4]   2> 9000 T962 oazs.ZooKeeperServer.processConnectRequest Client attempting to establish new session at /140.211.11.196:40549
[junit4:junit4]   2> 9002 T964 oazs.ZooKeeperServer.finishSessionInit Established session 0x13bb320dd27000b with negotiated timeout 20000 for client /140.211.11.196:40549
[junit4:junit4]   2> 9002 T1045 oaz.ClientCnxn$SendThread.onConnected Session establishment complete on server localhost/127.0.0.1:40979, sessionid = 0x13bb320dd27000b, negotiated timeout = 20000
[junit4:junit4]   2> 9002 T1046 oascc.ConnectionManager.process Watcher org.apache.solr.common.cloud.ConnectionManager@2e552a5e name:ZooKeeperConnection Watcher:127.0.0.1:40979 got event WatchedEvent state:SyncConnected type:None path:null path:null type:None
[junit4:junit4]   2> 9003 T960 oascc.ConnectionManager.waitForConnected Client is connected to ZooKeeper
[junit4:junit4]   2> 9004 T965 oazs.PrepRequestProcessor.pRequest2Txn Processed session termination for sessionid: 0x13bb320dd27000b
[junit4:junit4]   2> 9005 T1046 oaz.ClientCnxn$EventThread.run EventThread shut down
[junit4:junit4]   2> 9005 T962 oazs.NIOServerCnxn.closeSock Closed socket connection for client /140.211.11.196:40549 which had sessionid 0x13bb320dd27000b
[junit4:junit4]   2> 9005 T960 oaz.ZooKeeper.close Session: 0x13bb320dd27000b closed
[junit4:junit4]   2> 9006 T960 oascsi.HttpClientUtil.createClient Creating new http client, config:maxConnections=500&maxConnectionsPerHost=16&socketTimeout=15000&connTimeout=30000
[junit4:junit4]   2> 9014 T960 oaz.ZooKeeper.<init> Initiating client connection, connectString=127.0.0.1:40979/solr sessionTimeout=30000 watcher=org.apache.solr.common.cloud.ConnectionManager@380e95c1
[junit4:junit4]   2> 9015 T960 oascc.ConnectionManager.waitForConnected Waiting for client to connect to ZooKeeper
[junit4:junit4]   2> 9015 T1047 oaz.ClientCnxn$SendThread.logStartConnect Opening socket connection to server localhost/127.0.0.1:40979. Will not attempt to authenticate using SASL (access denied ("javax.security.auth.AuthPermission" "getLoginConfiguration"))
[junit4:junit4]   2> 9016 T1047 oaz.ClientCnxn$SendThread.primeConnection Socket connection established to localhost/127.0.0.1:40979, initiating session
[junit4:junit4]   2> 9016 T962 oazs.NIOServerCnxnFactory.run Accepted socket connection from /140.211.11.196:61017
[junit4:junit4]   2> 9017 T962 oazs.ZooKeeperServer.processConnectRequest Client attempting to establish new session at /140.211.11.196:61017
[junit4:junit4]   2> 9018 T964 oazs.ZooKeeperServer.finishSessionInit Established session 0x13bb320dd27000c with negotiated timeout 20000 for client /140.211.11.196:61017
[junit4:junit4]   2> 9018 T1047 oaz.ClientCnxn$SendThread.onConnected Session establishment complete on server localhost/127.0.0.1:40979, sessionid = 0x13bb320dd27000c, negotiated timeout = 20000
[junit4:junit4]   2> 9019 T1048 oascc.ConnectionManager.process Watcher org.apache.solr.common.cloud.ConnectionManager@380e95c1 name:ZooKeeperConnection Watcher:127.0.0.1:40979/solr got event WatchedEvent state:SyncConnected type:None path:null path:null type:None
[junit4:junit4]   2> 9019 T960 oascc.ConnectionManager.waitForConnected Client is connected to ZooKeeper
[junit4:junit4]   2> 9020 T965 oazs.PrepRequestProcessor.pRequest Got user-level KeeperException when processing sessionid:0x13bb320dd27000c type:create cxid:0x1 zxid:0xa6 txntype:-1 reqpath:n/a Error Path:/solr/overseer Error:KeeperErrorCode = NodeExists for /solr/overseer
[junit4:junit4]   2> 9022 T965 oazs.PrepRequestProcessor.pRequest Got user-level KeeperException when processing sessionid:0x13bb320dd27000c type:create cxid:0x2 zxid:0xa7 txntype:-1 reqpath:n/a Error Path:/solr/overseer Error:KeeperErrorCode = NodeExists for /solr/overseer
[junit4:junit4]   2> 9023 T960 oasc.ZkController.createEphemeralLiveNode Register node as live in ZooKeeper:/live_nodes/127.0.0.1:30877_k%2Fa
[junit4:junit4]   2> 9024 T965 oazs.PrepRequestProcessor.pRequest Got user-level KeeperException when processing sessionid:0x13bb320dd27000c type:delete cxid:0x4 zxid:0xa8 txntype:-1 reqpath:n/a Error Path:/solr/live_nodes/127.0.0.1:30877_k%2Fa Error:KeeperErrorCode = NoNode for /solr/live_nodes/127.0.0.1:30877_k%2Fa
[junit4:junit4]   2> 9032 T960 oascc.SolrZkClient.makePath makePath: /live_nodes/127.0.0.1:30877_k%2Fa
[junit4:junit4]   2> 9035 T1001 oascc.ZkStateReader$2.process A cluster state change: WatchedEvent state:SyncConnected type:NodeChildrenChanged path:/live_nodes, has occurred - updating... (live nodes size: 4)
[junit4:junit4]   2> 9035 T982 oascc.ZkStateReader$2.process A cluster state change: WatchedEvent state:SyncConnected type:NodeChildrenChanged path:/live_nodes, has occurred - updating... (live nodes size: 4)
[junit4:junit4]   2> 9036 T988 oascc.ZkStateReader$3.process Updating live nodes... (5)
[junit4:junit4]   2> 9036 T1031 oascc.ZkStateReader$3.process Updating live nodes... (5)
[junit4:junit4]   2> 9036 T1016 oascc.ZkStateReader$3.process Updating live nodes... (5)
[junit4:junit4]   2> 9037 T988 oascc.ZkStateReader$2.process A cluster state change: WatchedEvent state:SyncConnected type:NodeChildrenChanged path:/live_nodes, has occurred - updating... (live nodes size: 5)
[junit4:junit4]   2> 9037 T1031 oascc.ZkStateReader$2.process A cluster state change: WatchedEvent state:SyncConnected type:NodeChildrenChanged path:/live_nodes, has occurred - updating... (live nodes size: 5)
[junit4:junit4]   2> 9037 T1016 oascc.ZkStateReader$2.process A cluster state change: WatchedEvent state:SyncConnected type:NodeChildrenChanged path:/live_nodes, has occurred - updating... (live nodes size: 5)
[junit4:junit4]   2> 9038 T1001 oascc.ZkStateReader$3.process Updating live nodes... (5)
[junit4:junit4]   2> 9038 T982 oascc.ZkStateReader$3.process Updating live nodes... (5)
[junit4:junit4]   2> 9040 T960 oascc.ZkStateReader.createClusterStateWatchersAndUpdate Updating cluster state from ZooKeeper... 
[junit4:junit4]   2> 9048 T1049 oasc.CoreContainer.create Creating SolrCore 'collection1' using instanceDir: /usr/home/hudson/hudson-slave/workspace/Lucene-Solr-Tests-trunk-java7/solr/build/solr-core/test/J0/./org.apache.solr.cloud.BasicDistributedZkTest-jetty4-1355919982442/collection1
[junit4:junit4]   2> 9048 T1049 oasc.ZkController.createCollectionZkNode Check for collection zkNode:collection1
[junit4:junit4]   2> 9049 T1049 oasc.ZkController.createCollectionZkNode Collection zkNode exists
[junit4:junit4]   2> 9049 T1049 oasc.ZkController.readConfigName Load collection config from:/collections/collection1
[junit4:junit4]   2> 9051 T1049 oasc.SolrResourceLoader.<init> new SolrResourceLoader for directory: '/usr/home/hudson/hudson-slave/workspace/Lucene-Solr-Tests-trunk-java7/solr/build/solr-core/test/J0/./org.apache.solr.cloud.BasicDistributedZkTest-jetty4-1355919982442/collection1/'
[junit4:junit4]   2> 9052 T1049 oasc.SolrResourceLoader.replaceClassLoader Adding 'file:/usr/home/hudson/hudson-slave/workspace/Lucene-Solr-Tests-trunk-java7/solr/build/solr-core/test/J0/org.apache.solr.cloud.BasicDistributedZkTest-jetty4-1355919982442/collection1/lib/classes/' to classloader
[junit4:junit4]   2> 9053 T1049 oasc.SolrResourceLoader.replaceClassLoader Adding 'file:/usr/home/hudson/hudson-slave/workspace/Lucene-Solr-Tests-trunk-java7/solr/build/solr-core/test/J0/org.apache.solr.cloud.BasicDistributedZkTest-jetty4-1355919982442/collection1/lib/README' to classloader
[junit4:junit4]   2> 9106 T1049 oasc.SolrConfig.<init> Using Lucene MatchVersion: LUCENE_50
[junit4:junit4]   2> 9192 T1049 oasc.SolrConfig.<init> Loaded SolrConfig: solrconfig.xml
[junit4:junit4]   2> 9293 T1049 oass.IndexSchema.readSchema Reading Solr Schema
[junit4:junit4]   2> 9299 T1049 oass.IndexSchema.readSchema Schema name=test
[junit4:junit4]   2> 9779 T1049 oass.OpenExchangeRatesOrgProvider.init Initialized with rates=open-exchange-rates.json, refreshInterval=1440.
[junit4:junit4]   2> 9792 T1049 oass.IndexSchema.readSchema default search field in schema is text
[junit4:junit4]   2> 9796 T1049 oass.IndexSchema.readSchema unique key field: id
[junit4:junit4]   2> 9812 T1049 oass.FileExchangeRateProvider.reload Reloading exchange rates from file currency.xml
[junit4:junit4]   2> 9818 T1049 oass.FileExchangeRateProvider.reload Reloading exchange rates from file currency.xml
[junit4:junit4]   2> 9823 T1049 oass.OpenExchangeRatesOrgProvider.reload Reloading exchange rates from open-exchange-rates.json
[junit4:junit4]   2> 9825 T1049 oass.OpenExchangeRatesOrgProvider.reload Reloading exchange rates from open-exchange-rates.json
[junit4:junit4]   2> 9826 T1049 oasc.SolrCore.<init> [collection1] Opening new SolrCore at /usr/home/hudson/hudson-slave/workspace/Lucene-Solr-Tests-trunk-java7/solr/build/solr-core/test/J0/./org.apache.solr.cloud.BasicDistributedZkTest-jetty4-1355919982442/collection1/, dataDir=./org.apache.solr.cloud.BasicDistributedZkTest-1355919973665/jetty4/
[junit4:junit4]   2> 9827 T1049 oasc.JmxMonitoredMap.<init> JMX monitoring is enabled. Adding Solr mbeans to JMX Server: com.sun.jmx.mbeanserver.JmxMBeanServer@380d8f5c
[junit4:junit4]   2> 9827 T1049 oasc.SolrCore.initDirectoryFactory solr.NRTCachingDirectoryFactory
[junit4:junit4]   2> 9828 T1049 oasc.CachingDirectoryFactory.get return new directory for /usr/home/hudson/hudson-slave/workspace/Lucene-Solr-Tests-trunk-java7/solr/build/solr-core/test/J0/./org.apache.solr.cloud.BasicDistributedZkTest-1355919973665/jetty4 forceNew:false
[junit4:junit4]   2> 9829 T1049 oasc.CachingDirectoryFactory.close Releasing directory:/usr/home/hudson/hudson-slave/workspace/Lucene-Solr-Tests-trunk-java7/solr/build/solr-core/test/J0/./org.apache.solr.cloud.BasicDistributedZkTest-1355919973665/jetty4
[junit4:junit4]   2> 9829 T1049 oasc.SolrCore.getNewIndexDir New index directory detected: old=null new=./org.apache.solr.cloud.BasicDistributedZkTest-1355919973665/jetty4/index/
[junit4:junit4]   2> 9830 T1049 oasc.SolrCore.initIndex WARNING [collection1] Solr index directory './org.apache.solr.cloud.BasicDistributedZkTest-1355919973665/jetty4/index' doesn't exist. Creating new index...
[junit4:junit4]   2> 9831 T1049 oasc.CachingDirectoryFactory.get return new directory for /usr/home/hudson/hudson-slave/workspace/Lucene-Solr-Tests-trunk-java7/solr/build/solr-core/test/J0/./org.apache.solr.cloud.BasicDistributedZkTest-1355919973665/jetty4/index forceNew:false
[junit4:junit4]   2> 9837 T1049 oasc.SolrDeletionPolicy.onCommit SolrDeletionPolicy.onCommit: commits:num=1
[junit4:junit4]   2> 		commit{dir=RateLimitedDirectoryWrapper(NRTCachingDirectory(org.apache.lucene.store.NIOFSDirectory@/usr/home/hudson/hudson-slave/workspace/Lucene-Solr-Tests-trunk-java7/solr/build/solr-core/test/J0/org.apache.solr.cloud.BasicDistributedZkTest-1355919973665/jetty4/index lockFactory=org.apache.lucene.store.NativeFSLockFactory@21e6d3a7; maxCacheMB=48.0 maxMergeSizeMB=4.0)),segFN=segments_1,generation=1,filenames=[segments_1]
[junit4:junit4]   2> 9838 T1049 oasc.SolrDeletionPolicy.updateCommits newest commit = 1[segments_1]
[junit4:junit4]   2> 9839 T1049 oasc.CachingDirectoryFactory.close Releasing directory:/usr/home/hudson/hudson-slave/workspace/Lucene-Solr-Tests-trunk-java7/solr/build/solr-core/test/J0/./org.apache.solr.cloud.BasicDistributedZkTest-1355919973665/jetty4/index
[junit4:junit4]   2> 9839 T1049 oasc.SolrCore.initWriters created xml: solr.XMLResponseWriter
[junit4:junit4]   2> 9842 T1049 oasup.UpdateRequestProcessorChain.init inserting DistributedUpdateProcessorFactory into updateRequestProcessorChain "dedupe"
[junit4:junit4]   2> 9842 T1049 oasup.UpdateRequestProcessorChain.init inserting DistributedUpdateProcessorFactory into updateRequestProcessorChain "dedupe-allfields"
[junit4:junit4]   2> 9843 T1049 oasup.UpdateRequestProcessorChain.init inserting DistributedUpdateProcessorFactory into updateRequestProcessorChain "stored_sig"
[junit4:junit4]   2> 9843 T1049 oasup.UpdateRequestProcessorChain.init inserting DistributedUpdateProcessorFactory into updateRequestProcessorChain "uniq-fields"
[junit4:junit4]   2> 9844 T1049 oasup.UpdateRequestProcessorChain.init inserting DistributedUpdateProcessorFactory into updateRequestProcessorChain "distrib-dup-test-chain-implicit"
[junit4:junit4]   2> 9844 T1049 oasc.RequestHandlers.initHandlersFromConfig adding lazy requestHandler: solr.ReplicationHandler
[junit4:junit4]   2> 9845 T1049 oasc.RequestHandlers.initHandlersFromConfig created /replication: solr.ReplicationHandler
[junit4:junit4]   2> 9846 T1049 oasc.RequestHandlers.initHandlersFromConfig created standard: solr.StandardRequestHandler
[junit4:junit4]   2> 9847 T1049 oasc.RequestHandlers.initHandlersFromConfig created /get: solr.RealTimeGetHandler
[junit4:junit4]   2> 9848 T1049 oasc.RequestHandlers.initHandlersFromConfig created dismax: solr.SearchHandler
[junit4:junit4]   2> 9849 T1049 oasc.RequestHandlers.initHandlersFromConfig created mock: org.apache.solr.core.MockQuerySenderListenerReqHandler
[junit4:junit4]   2> 9850 T1049 oasc.RequestHandlers.initHandlersFromConfig created /admin/: org.apache.solr.handler.admin.AdminHandlers
[junit4:junit4]   2> 9851 T1049 oasc.RequestHandlers.initHandlersFromConfig created defaults: solr.StandardRequestHandler
[junit4:junit4]   2> 9851 T1049 oasc.RequestHandlers.initHandlersFromConfig adding lazy requestHandler: solr.StandardRequestHandler
[junit4:junit4]   2> 9852 T1049 oasc.RequestHandlers.initHandlersFromConfig created lazy: solr.StandardRequestHandler
[junit4:junit4]   2> 9853 T1049 oasc.RequestHandlers.initHandlersFromConfig created /update: solr.UpdateRequestHandler
[junit4:junit4]   2> 9854 T1049 oasc.RequestHandlers.initHandlersFromConfig created /terms: org.apache.solr.handler.component.SearchHandler
[junit4:junit4]   2> 9855 T1049 oasc.RequestHandlers.initHandlersFromConfig created spellCheckCompRH: org.apache.solr.handler.component.SearchHandler
[junit4:junit4]   2> 9857 T1049 oasc.RequestHandlers.initHandlersFromConfig created spellCheckCompRH_Direct: org.apache.solr.handler.component.SearchHandler
[junit4:junit4]   2> 9858 T1049 oasc.RequestHandlers.initHandlersFromConfig created spellCheckWithWordbreak: org.apache.solr.handler.component.SearchHandler
[junit4:junit4]   2> 9859 T1049 oasc.RequestHandlers.initHandlersFromConfig created spellCheckWithWordbreak_Direct: org.apache.solr.handler.component.SearchHandler
[junit4:junit4]   2> 9860 T1049 oasc.RequestHandlers.initHandlersFromConfig created spellCheckCompRH1: org.apache.solr.handler.component.SearchHandler
[junit4:junit4]   2> 9861 T1049 oasc.RequestHandlers.initHandlersFromConfig created mltrh: org.apache.solr.handler.component.SearchHandler
[junit4:junit4]   2> 9862 T1049 oasc.RequestHandlers.initHandlersFromConfig created tvrh: org.apache.solr.handler.component.SearchHandler
[junit4:junit4]   2> 9863 T1049 oasc.RequestHandlers.initHandlersFromConfig created /mlt: solr.MoreLikeThisHandler
[junit4:junit4]   2> 9864 T1049 oasc.RequestHandlers.initHandlersFromConfig created /debug/dump: solr.DumpRequestHandler
[junit4:junit4]   2> 9878 T1049 oashl.XMLLoader.init xsltCacheLifetimeSeconds=60
[junit4:junit4]   2> 9884 T1049 oasc.SolrCore.initDeprecatedSupport WARNING solrconfig.xml uses deprecated <admin/gettableFiles>, Please update your config to use the ShowFileRequestHandler.
[junit4:junit4]   2> 9887 T1049 oasc.SolrCore.initDeprecatedSupport WARNING adding ShowFileRequestHandler with hidden files: [SCHEMA.XML, OLD_SYNONYMS.TXT, STOPWORDS.TXT, PROTWORDS.TXT, OPEN-EXCHANGE-RATES.JSON, SYNONYMS.TXT, CURRENCY.XML, MAPPING-ISOLATIN1ACCENT.TXT]
[junit4:junit4]   2> 9890 T1049 oasc.CachingDirectoryFactory.close Releasing directory:/usr/home/hudson/hudson-slave/workspace/Lucene-Solr-Tests-trunk-java7/solr/build/solr-core/test/J0/./org.apache.solr.cloud.BasicDistributedZkTest-1355919973665/jetty4
[junit4:junit4]   2> 9892 T1049 oass.SolrIndexSearcher.<init> Opening Searcher@bc2c386 main
[junit4:junit4]   2> 9893 T1049 oasu.CommitTracker.<init> Hard AutoCommit: disabled
[junit4:junit4]   2> 9893 T1049 oasu.CommitTracker.<init> Soft AutoCommit: disabled
[junit4:junit4]   2> 9894 T1049 oashc.SpellCheckComponent.inform Initializing spell checkers
[junit4:junit4]   2> 9901 T1049 oass.DirectSolrSpellChecker.init init: {name=direct,classname=DirectSolrSpellChecker,field=lowerfilt,minQueryLength=3}
[junit4:junit4]   2> 9961 T1050 oasc.SolrCore.registerSearcher [collection1] Registered new searcher Searcher@bc2c386 main{StandardDirectoryReader(segments_1:1)}
[junit4:junit4]   2> 9967 T1049 oasc.ZkController.publish publishing core=collection1 state=down
[junit4:junit4]   2> 9968 T1049 oasc.ZkController.publish numShards not found on descriptor - reading it from system property
[junit4:junit4]   2> 9990 T983 oascc.ZkStateReader.updateClusterState Updating cloud state from ZooKeeper... 
[junit4:junit4]   2> 9991 T983 oasc.Overseer$ClusterStateUpdater.updateState Update state numShards=2 message={
[junit4:junit4]   2> 	  "operation":"state",
[junit4:junit4]   2> 	  "numShards":"2",
[junit4:junit4]   2> 	  "shard":null,
[junit4:junit4]   2> 	  "roles":null,
[junit4:junit4]   2> 	  "state":"down",
[junit4:junit4]   2> 	  "core":"collection1",
[junit4:junit4]   2> 	  "collection":"collection1",
[junit4:junit4]   2> 	  "node_name":"127.0.0.1:30877_k%2Fa",
[junit4:junit4]   2> 	  "base_url":"http://127.0.0.1:30877/k/a"}
[junit4:junit4]   2> 9991 T983 oasc.Overseer$ClusterStateUpdater.updateState Collection already exists with numShards=2
[junit4:junit4]   2> 9991 T983 oasc.Overseer$ClusterStateUpdater.updateState Assigning new node to shard shard=shard2
[junit4:junit4]   2> 10003 T982 oascc.ZkStateReader$2.process A cluster state change: WatchedEvent state:SyncConnected type:NodeDataChanged path:/clusterstate.json, has occurred - updating... (live nodes size: 5)
[junit4:junit4]   2> 10003 T988 oascc.ZkStateReader$2.process A cluster state change: WatchedEvent state:SyncConnected type:NodeDataChanged path:/clusterstate.json, has occurred - updating... (live nodes size: 5)
[junit4:junit4]   2> 10003 T1016 oascc.ZkStateReader$2.process A cluster state change: WatchedEvent state:SyncConnected type:NodeDataChanged path:/clusterstate.json, has occurred - updating... (live nodes size: 5)
[junit4:junit4]   2> 10003 T1001 oascc.ZkStateReader$2.process A cluster state change: WatchedEvent state:SyncConnected type:NodeDataChanged path:/clusterstate.json, has occurred - updating... (live nodes size: 5)
[junit4:junit4]   2> 10003 T1031 oascc.ZkStateReader$2.process A cluster state change: WatchedEvent state:SyncConnected type:NodeDataChanged path:/clusterstate.json, has occurred - updating... (live nodes size: 5)
[junit4:junit4]   2> 10003 T1048 oascc.ZkStateReader$2.process A cluster state change: WatchedEvent state:SyncConnected type:NodeDataChanged path:/clusterstate.json, has occurred - updating... (live nodes size: 5)
[junit4:junit4]   2> 10471 T1049 oasc.CoreContainer.registerCore registering core: collection1
[junit4:junit4]   2> 10471 T1049 oasc.ZkController.register Register replica - core:collection1 address:http://127.0.0.1:30877/k/a collection:collection1 shard:shard2
[junit4:junit4]   2> 10475 T1049 oasc.ZkController.register We are http://127.0.0.1:30877/k/a/collection1/ and leader is http://127.0.0.1:47618/k/a/collection1/
[junit4:junit4]   2> 10475 T1049 oasc.ZkController.register No LogReplay needed for core=collection1 baseURL=http://127.0.0.1:30877/k/a
[junit4:junit4]   2> 10476 T1049 oasc.ZkController.checkRecovery Core needs to recover:collection1
[junit4:junit4]   2> 10476 T1049 oasu.DefaultSolrCoreState.doRecovery Running recovery - first canceling any ongoing recovery
[junit4:junit4]   2> ASYNC  NEW_CORE C47 name=collection1 org.apache.solr.core.SolrCore@31641402 url=http://127.0.0.1:30877/k/a/collection1 node=127.0.0.1:30877_k%2Fa C47_STATE=coll:collection1 core:collection1 props:{shard=null, roles=null, state=down, core=collection1, collection=collection1, node_name=127.0.0.1:30877_k%2Fa, base_url=http://127.0.0.1:30877/k/a}
[junit4:junit4]   2> 10476 T1051 C47 P30877 oasc.RecoveryStrategy.run Starting recovery process.  core=collection1 recoveringAfterStartup=true
[junit4:junit4]   2> 10477 T1051 C47 P30877 oasc.RecoveryStrategy.doRecovery ###### startupVersions=[]
[junit4:junit4]   2> 10477 T1049 oascc.ZkStateReader.updateClusterState Updating cloud state from ZooKeeper... 
[junit4:junit4]   2> 10477 T1051 C47 P30877 oasc.ZkController.publish publishing core=collection1 state=recovering
[junit4:junit4]   2> 10477 T1051 C47 P30877 oasc.ZkController.publish numShards not found on descriptor - reading it from system property
[junit4:junit4]   2> 10478 T960 oass.SolrDispatchFilter.init user.dir=/usr/home/hudson/hudson-slave/workspace/Lucene-Solr-Tests-trunk-java7/solr/build/solr-core/test/J0
[junit4:junit4]   2> 10479 T960 oass.SolrDispatchFilter.init SolrDispatchFilter.init() done
[junit4:junit4]   2> 10479 T1051 C47 P30877 oasc.RecoveryStrategy.doRecovery Attempting to PeerSync from http://127.0.0.1:47618/k/a/collection1/ core=collection1 - recoveringAfterStartup=true
[junit4:junit4]   2> 10480 T960 oascsi.HttpClientUtil.createClient Creating new http client, config:maxConnections=128&maxConnectionsPerHost=32&followRedirects=false
[junit4:junit4]   2> 10480 T1051 C47 P30877 oasu.PeerSync.sync PeerSync: core=collection1 url=http://127.0.0.1:30877/k/a START replicas=[http://127.0.0.1:47618/k/a/collection1/] nUpdates=100
[junit4:junit4]   2> 10480 T1051 C47 P30877 oasu.PeerSync.sync WARNING no frame of reference to tell of we've missed updates
[junit4:junit4]   2> 10481 T1051 C47 P30877 oasc.RecoveryStrategy.doRecovery PeerSync Recovery was not successful - trying replication. core=collection1
[junit4:junit4]   2> 10481 T1051 C47 P30877 oasc.RecoveryStrategy.doRecovery Starting Replication Recovery. core=collection1
[junit4:junit4]   2> 10481 T1051 C47 P30877 oascsi.HttpClientUtil.createClient Creating new http client, config:maxConnections=128&maxConnectionsPerHost=32&followRedirects=false
[junit4:junit4]   2> ASYNC  NEW_CORE C48 name=collection1 org.apache.solr.core.SolrCore@4500a532 url=http://127.0.0.1:47618/k/a/collection1 node=127.0.0.1:47618_k%2Fa C48_STATE=coll:collection1 core:collection1 props:{shard=shard2, roles=null, state=active, core=collection1, collection=collection1, node_name=127.0.0.1:47618_k%2Fa, base_url=http://127.0.0.1:47618/k/a, leader=true}
[junit4:junit4]   2> 10488 T1006 C48 P47618 REQ /get {distrib=false&qt=/get&wt=javabin&version=2&getVersions=100} status=0 QTime=0 
[junit4:junit4]   2> 10498 T960 oascc.ZkStateReader.updateClusterState Updating cloud state from ZooKeeper... 
[junit4:junit4]   2> 10500 T960 oasc.AbstractDistribZkTestBase.waitForRecoveriesToFinish Wait for recoveries to finish - collection: collection1 failOnTimeout:true timeout (sec):540
[junit4:junit4]   2> 10501 T960 oascc.ZkStateReader.updateClusterState Updating cloud state from ZooKeeper... 
[junit4:junit4]   2> 10508 T983 oascc.ZkStateReader.updateClusterState Updating cloud state from ZooKeeper... 
[junit4:junit4]   2> 10509 T983 oasc.Overseer$ClusterStateUpdater.updateState Update state numShards=2 message={
[junit4:junit4]   2> 	  "operation":"state",
[junit4:junit4]   2> 	  "numShards":"2",
[junit4:junit4]   2> 	  "shard":"shard2",
[junit4:junit4]   2> 	  "roles":null,
[junit4:junit4]   2> 	  "state":"recovering",
[junit4:junit4]   2> 	  "core":"collection1",
[junit4:junit4]   2> 	  "collection":"collection1",
[junit4:junit4]   2> 	  "node_name":"127.0.0.1:30877_k%2Fa",
[junit4:junit4]   2> 	  "base_url":"http://127.0.0.1:30877/k/a"}
[junit4:junit4]   2> 10522 T1001 oascc.ZkStateReader$2.process A cluster state change: WatchedEvent state:SyncConnected type:NodeDataChanged path:/clusterstate.json, has occurred - updating... (live nodes size: 5)
[junit4:junit4]   2> 10522 T1048 oascc.ZkStateReader$2.process A cluster state change: WatchedEvent state:SyncConnected type:NodeDataChanged path:/clusterstate.json, has occurred - updating... (live nodes size: 5)
[junit4:junit4]   2> 10522 T1016 oascc.ZkStateReader$2.process A cluster state change: WatchedEvent state:SyncConnected type:NodeDataChanged path:/clusterstate.json, has occurred - updating... (live nodes size: 5)
[junit4:junit4]   2> 10522 T988 oascc.ZkStateReader$2.process A cluster state change: WatchedEvent state:SyncConnected type:NodeDataChanged path:/clusterstate.json, has occurred - updating... (live nodes size: 5)
[junit4:junit4]   2> 10522 T1031 oascc.ZkStateReader$2.process A cluster state change: WatchedEvent state:SyncConnected type:NodeDataChanged path:/clusterstate.json, has occurred - updating... (live nodes size: 5)
[junit4:junit4]   2> 10522 T982 oascc.ZkStateReader$2.process A cluster state change: WatchedEvent state:SyncConnected type:NodeDataChanged path:/clusterstate.json, has occurred - updating... (live nodes size: 5)
[junit4:junit4]   2> 11503 T960 oascc.ZkStateReader.updateClusterState Updating cloud state from ZooKeeper... 
[junit4:junit4]   2>  C45_STATE=coll:collection1 core:collection1 props:{shard=shard1, roles=null, state=recovering, core=collection1, collection=collection1, node_name=127.0.0.1:60039_k%2Fa, base_url=http://127.0.0.1:60039/k/a}
[junit4:junit4]   2> 11788 T1034 C45 P60039 oasc.RecoveryStrategy.doRecovery Begin buffering updates. core=collection1
[junit4:junit4]   2> 11788 T1034 C45 P60039 oasu.UpdateLog.bufferUpdates Starting to buffer updates. FSUpdateLog{state=ACTIVE, tlog=null}
[junit4:junit4]   2> 11788 T1034 C45 P60039 oasc.RecoveryStrategy.replicate Attempting to replicate from http://127.0.0.1:56415/k/a/collection1/. core=collection1
[junit4:junit4]   2> 11789 T1034 C45 P60039 oascsi.HttpClientUtil.createClient Creating new http client, config:maxConnections=128&maxConnectionsPerHost=32&followRedirects=false
[junit4:junit4]   2> 11797 T993 C46 P56415 oasu.DirectUpdateHandler2.commit start commit{flags=0,_version_=0,optimize=false,openSearcher=false,waitSearcher=true,expungeDeletes=false,softCommit=false}
[junit4:junit4]   2> 11803 T993 C46 P56415 oasc.CachingDirectoryFactory.close Releasing directory:/usr/home/hudson/hudson-slave/workspace/Lucene-Solr-Tests-trunk-java7/solr/build/solr-core/test/J0/./org.apache.solr.cloud.BasicDistributedZkTest-1355919973665/jetty1
[junit4:junit4]   2> 11812 T993 C46 P56415 oasc.SolrDeletionPolicy.onInit SolrDeletionPolicy.onInit: commits:num=1
[junit4:junit4]   2> 		commit{dir=RateLimitedDirectoryWrapper(NRTCachingDirectory(org.apache.lucene.store.NIOFSDirectory@/usr/home/hudson/hudson-slave/workspace/Lucene-Solr-Tests-trunk-java7/solr/build/solr-core/test/J0/org.apache.solr.cloud.BasicDistributedZkTest-1355919973665/jetty1/index lockFactory=org.apache.lucene.store.NativeFSLockFactory@7c952fde; maxCacheMB=48.0 maxMergeSizeMB=4.0)),segFN=segments_1,generation=1,filenames=[segments_1]
[junit4:junit4]   2> 11823 T993 C46 P56415 oasc.SolrDeletionPolicy.updateCommits newest commit = 1[segments_1]
[junit4:junit4]   2> 11852 T993 C46 P56415 oasc.SolrDeletionPolicy.onCommit SolrDeletionPolicy.onCommit: commits:num=2
[junit4:junit4]   2> 		commit{dir=RateLimitedDirectoryWrapper(NRTCachingDirectory(org.apache.lucene.store.NIOFSDirectory@/usr/home/hudson/hudson-slave/workspace/Lucene-Solr-Tests-trunk-java7/solr/build/solr-core/test/J0/org.apache.solr.cloud.BasicDistributedZkTest-1355919973665/jetty1/index lockFactory=org.apache.lucene.store.NativeFSLockFactory@7c952fde; maxCacheMB=48.0 maxMergeSizeMB=4.0)),segFN=segments_1,generation=1,filenames=[segments_1]
[junit4:junit4]   2> 		commit{dir=RateLimitedDirectoryWrapper(NRTCachingDirectory(org.apache.lucene.store.NIOFSDirectory@/usr/home/hudson/hudson-slave/workspace/Lucene-Solr-Tests-trunk-java7/solr/build/solr-core/test/J0/org.apache.solr.cloud.BasicDistributedZkTest-1355919973665/jetty1/index lockFactory=org.apache.lucene.store.NativeFSLockFactory@7c952fde; maxCacheMB=48.0 maxMergeSizeMB=4.0)),segFN=segments_2,generation=2,filenames=[segments_2]
[junit4:junit4]   2> 11853 T993 C46 P56415 oasc.SolrDeletionPolicy.updateCommits newest commit = 2[segments_2]
[junit4:junit4]   2> 11854 T993 C46 P56415 oasc.CachingDirectoryFactory.close Releasing directory:/usr/home/hudson/hudson-slave/workspace/Lucene-Solr-Tests-trunk-java7/solr/build/solr-core/test/J0/./org.apache.solr.cloud.BasicDistributedZkTest-1355919973665/jetty1
[junit4:junit4]   2> 11855 T993 C46 P56415 oass.SolrIndexSearcher.<init> Opening Searcher@3fcb7fc2 realtime
[junit4:junit4]   2> 11855 T993 C46 P56415 oasu.DirectUpdateHandler2.commit end_commit_flush
[junit4:junit4]   2> 11855 T993 C46 P56415 /update {waitSearcher=true&openSearcher=false&commit=true&commit_end_point=true&wt=javabin&softCommit=false&version=2} {commit=} 0 58
[junit4:junit4]   2> 11857 T1034 C45 P60039 oash.ReplicationHandler.inform Commits will be reserved for  10000
[junit4:junit4]   2> 11857 T1034 C45 P60039 oash.SnapPuller.<init>  No value set for 'pollInterval'. Timer Task not started.
[junit4:junit4]   2> 11861 T994 C46 P56415 oash.ReplicationHandler.inform Commits will be reserved for  10000
[junit4:junit4]   2> 11862 T994 C46 P56415 REQ /replication {command=indexversion&wt=javabin&qt=/replication&version=2} status=0 QTime=4 
[junit4:junit4]   2> 11862 T1034 C45 P60039 oash.SnapPuller.fetchLatestIndex Master's generation: 2
[junit4:junit4]   2> 11863 T1034 C45 P60039 oash.SnapPuller.fetchLatestIndex Slave's generation: 1
[junit4:junit4]   2> 11863 T1034 C45 P60039 oash.SnapPuller.fetchLatestIndex Starting replication process
[junit4:junit4]   2> 11865 T994 C46 P56415 oasc.CachingDirectoryFactory.close Releasing directory:/usr/home/hudson/hudson-slave/workspace/Lucene-Solr-Tests-trunk-java7/solr/build/solr-core/test/J0/./org.apache.solr.cloud.BasicDistributedZkTest-1355919973665/jetty1
[junit4:junit4]   2> 11866 T994 C46 P56415 oasc.CachingDirectoryFactory.close Releasing directory:/usr/home/hudson/hudson-slave/workspace/Lucene-Solr-Tests-trunk-java7/solr/build/solr-core/test/J0/./org.apache.solr.cloud.BasicDistributedZkTest-1355919973665/jetty1/index
[junit4:junit4]   2> 11867 T994 C46 P56415 REQ /replication {command=filelist&generation=2&wt=javabin&qt=/replication&version=2} status=0 QTime=2 
[junit4:junit4]   2> 11867 T1034 C45 P60039 oash.SnapPuller.fetchLatestIndex Number of files in latest index in master: 1
[junit4:junit4]   2> 11869 T1034 C45 P60039 oasc.CachingDirectoryFactory.get return new directory for /usr/home/hudson/hudson-slave/workspace/Lucene-Solr-Tests-trunk-java7/solr/build/solr-core/test/J0/./org.apache.solr.cloud.BasicDistributedZkTest-1355919973665/jetty3/index.20121219122625526 forceNew:false
[junit4:junit4]   2> 11869 T1034 C45 P60039 oasc.CachingDirectoryFactory.close Releasing directory:/usr/home/hudson/hudson-slave/workspace/Lucene-Solr-Tests-trunk-java7/solr/build/solr-core/test/J0/./org.apache.solr.cloud.BasicDistributedZkTest-1355919973665/jetty3
[junit4:junit4]   2> 11870 T1034 C45 P60039 oash.SnapPuller.fetchLatestIndex Starting download to RateLimitedDirectoryWrapper(NRTCachingDirectory(org.apache.lucene.store.NIOFSDirectory@/usr/home/hudson/hudson-slave/workspace/Lucene-Solr-Tests-trunk-java7/solr/build/solr-core/test/J0/org.apache.solr.cloud.BasicDistributedZkTest-1355919973665/jetty3/index.20121219122625526 lockFactory=org.apache.lucene.store.NativeFSLockFactory@679dbc7f; maxCacheMB=48.0 maxMergeSizeMB=4.0)) fullCopy=true
[junit4:junit4]   2> 11873 T994 C46 P56415 REQ /replication {file=segments_2&command=filecontent&checksum=true&generation=2&qt=/replication&wt=filestream} status=0 QTime=0 
[junit4:junit4]   2> 11876 T1034 C45 P60039 oasc.CachingDirectoryFactory.close Releasing directory:/usr/home/hudson/hudson-slave/workspace/Lucene-Solr-Tests-trunk-java7/solr/build/solr-core/test/J0/./org.apache.solr.cloud.BasicDistributedZkTest-1355919973665/jetty3/index
[junit4:junit4]   2> 11876 T1034 C45 P60039 oash.SnapPuller.fetchLatestIndex Total time taken for download : 0 secs
[junit4:junit4]   2> 11876 T1034 C45 P60039 oash.SnapPuller.modifyIndexProps New index installed. Updating index properties... index=index.20121219122625526
[junit4:junit4]   2> 11877 T1034 C45 P60039 oasc.CachingDirectoryFactory.close Releasing directory:/usr/home/hudson/hudson-slave/workspace/Lucene-Solr-Tests-trunk-java7/solr/build/solr-core/test/J0/./org.apache.solr.cloud.BasicDistributedZkTest-1355919973665/jetty3
[junit4:junit4]   2> 11878 T1034 C45 P60039 oasc.CachingDirectoryFactory.close Releasing directory:/usr/home/hudson/hudson-slave/workspace/Lucene-Solr-Tests-trunk-java7/solr/build/solr-core/test/J0/./org.apache.solr.cloud.BasicDistributedZkTest-1355919973665/jetty3
[junit4:junit4]   2> 11878 T1034 C45 P60039 oasc.SolrCore.getNewIndexDir New index directory detected: old=./org.apache.solr.cloud.BasicDistributedZkTest-1355919973665/jetty3/index/ new=./org.apache.solr.cloud.BasicDistributedZkTest-1355919973665/jetty3/index.20121219122625526
[junit4:junit4]   2> 11880 T1034 C45 P60039 oasc.SolrDeletionPolicy.onInit SolrDeletionPolicy.onInit: commits:num=1
[junit4:junit4]   2> 		commit{dir=RateLimitedDirectoryWrapper(NRTCachingDirectory(org.apache.lucene.store.NIOFSDirectory@/usr/home/hudson/hudson-slave/workspace/Lucene-Solr-Tests-trunk-java7/solr/build/solr-core/test/J0/org.apache.solr.cloud.BasicDistributedZkTest-1355919973665/jetty3/index.20121219122625526 lockFactory=org.apache.lucene.store.NativeFSLockFactory@679dbc7f; maxCacheMB=48.0 maxMergeSizeMB=4.0)),segFN=segments_2,generation=2,filenames=[segments_2]
[junit4:junit4]   2> 11881 T1034 C45 P60039 oasc.SolrDeletionPolicy.updateCommits newest commit = 2[segments_2]
[junit4:junit4]   2> 11882 T1034 C45 P60039 oasc.CachingDirectoryFactory.close Releasing directory:/usr/home/hudson/hudson-slave/workspace/Lucene-Solr-Tests-trunk-java7/solr/build/solr-core/test/J0/./org.apache.solr.cloud.BasicDistributedZkTest-1355919973665/jetty3
[junit4:junit4]   2> 11882 T1034 C45 P60039 oasu.DefaultSolrCoreState.newIndexWriter Creating new IndexWriter...
[junit4:junit4]   2> 11882 T1034 C45 P60039 oasu.DefaultSolrCoreState.newIndexWriter Waiting until IndexWriter is unused... core=collection1
[junit4:junit4]   2> 11883 T1034 C45 P60039 oasu.DefaultSolrCoreState.newIndexWriter Rollback old IndexWriter... core=collection1
[junit4:junit4]   2> 11883 T1034 C45 P60039 oasc.CachingDirectoryFactory.close Releasing directory:/usr/home/hudson/hudson-slave/workspace/Lucene-Solr-Tests-trunk-java7/solr/build/solr-core/test/J0/./org.apache.solr.cloud.BasicDistributedZkTest-1355919973665/jetty3/index.20121219122625526
[junit4:junit4]   2> 11884 T1034 C45 P60039 oasc.CachingDirectoryFactory.close Releasing directory:/usr/home/hudson/hudson-slave/workspace/Lucene-Solr-Tests-trunk-java7/solr/build/solr-core/test/J0/./org.apache.solr.cloud.BasicDistributedZkTest-1355919973665/jetty3
[junit4:junit4]   2> 11886 T1034 C45 P60039 oasc.SolrDeletionPolicy.onInit SolrDeletionPolicy.onInit: commits:num=1
[junit4:junit4]   2> 		commit{dir=RateLimitedDirectoryWrapper(NRTCachingDirectory(org.apache.lucene.store.NIOFSDirectory@/usr/home/hudson/hudson-slave/workspace/Lucene-Solr-Tests-trunk-java7/solr/build/solr-core/test/J0/org.apache.solr.cloud.BasicDistributedZkTest-1355919973665/jetty3/index.20121219122625526 lockFactory=org.apache.lucene.store.NativeFSLockFactory@679dbc7f; maxCacheMB=48.0 maxMergeSizeMB=4.0)),segFN=segments_2,generation=2,filenames=[segments_2]
[junit4:junit4]   2> 11886 T1034 C45 P60039 oasc.SolrDeletionPolicy.updateCommits newest commit = 2[segments_2]
[junit4:junit4]   2> 11886 T1034 C45 P60039 oasu.DefaultSolrCoreState.newIndexWriter New IndexWriter is ready to be used.
[junit4:junit4]   2> 11887 T1034 C45 P60039 oasc.CachingDirectoryFactory.close Releasing directory:/usr/home/hudson/hudson-slave/workspace/Lucene-Solr-Tests-trunk-java7/solr/build/solr-core/test/J0/./org.apache.solr.cloud.BasicDistributedZkTest-1355919973665/jetty3
[junit4:junit4]   2> 11887 T1034 C45 P60039 oass.SolrIndexSearcher.<init> Opening Searcher@675b8c90 main
[junit4:junit4]   2> 11888 T1033 oasc.SolrCore.registerSearcher [collection1] Registered new searcher Searcher@675b8c90 main{StandardDirectoryReader(segments_2:1:nrt)}
[junit4:junit4]   2> 11889 T1033 oasc.CachingDirectoryFactory.close Releasing directory:/usr/home/hudson/hudson-slave/workspace/Lucene-Solr-Tests-trunk-java7/solr/build/solr-core/test/J0/./org.apache.solr.cloud.BasicDistributedZkTest-1355919973665/jetty3/index
[junit4:junit4]   2> 11889 T1034 C45 P60039 oasu.DirectUpdateHandler2.commit start commit{flags=0,_version_=0,optimize=false,openSearcher=false,waitSearcher=false,expungeDeletes=false,softCommit=false}
[junit4:junit4]   2> 11892 T1034 C45 P60039 oasc.SolrDeletionPolicy.onCommit SolrDeletionPolicy.onCommit: commits:num=2
[junit4:junit4]   2> 		commit{dir=RateLimitedDirectoryWrapper(NRTCachingDirectory(org.apache.lucene.store.NIOFSDirectory@/usr/home/hudson/hudson-slave/workspace/Lucene-Solr-Tests-trunk-java7/solr/build/solr-core/test/J0/org.apache.solr.cloud.BasicDistributedZkTest-1355919973665/jetty3/index.20121219122625526 lockFactory=org.apache.lucene.store.NativeFSLockFactory@679dbc7f; maxCacheMB=48.0 maxMergeSizeMB=4.0)),segFN=segments_2,generation=2,filenames=[segments_2]
[junit4:junit4]   2> 		commit{dir=RateLimitedDirectoryWrapper(NRTCachingDirectory(org.apache.lucene.store.NIOFSDirectory@/usr/home/hudson/hudson-slave/workspace/Lucene-Solr-Tests-trunk-java7/solr/build/solr-core/test/J0/org.apache.solr.cloud.BasicDistributedZkTest-1355919973665/jetty3/index.20121219122625526 lockFactory=org.apache.lucene.store.NativeFSLockFactory@679dbc7f; maxCacheMB=48.0 maxMergeSizeMB=4.0)),segFN=segments_3,generation=3,filenames=[segments_3]
[junit4:junit4]   2> 11892 T1034 C45 P60039 oasc.SolrDeletionPolicy.updateCommits newest commit = 3[segments_3]
[junit4:junit4]   2> 11893 T1034 C45 P60039 oasc.CachingDirectoryFactory.close Releasing directory:/usr/home/hudson/hudson-slave/workspace/Lucene-Solr-Tests-trunk-java7/solr/build/solr-core/test/J0/./org.apache.solr.cloud.BasicDistributedZkTest-1355919973665/jetty3
[junit4:junit4]   2> 11893 T1034 C45 P60039 oasu.DirectUpdateHandler2.commit end_commit_flush
[junit4:junit4]   2> 11893 T1034 C45 P60039 oasc.CachingDirectoryFactory.close Releasing directory:/usr/home/hudson/hudson-slave/workspace/Lucene-Solr-Tests-trunk-java7/solr/build/solr-core/test/J0/./org.apache.solr.cloud.BasicDistributedZkTest-1355919973665/jetty3/index.20121219122625526
[junit4:junit4]   2> 11893 T1034 C45 P60039 oasc.CachingDirectoryFactory.close Releasing directory:/usr/home/hudson/hudson-slave/workspace/Lucene-Solr-Tests-trunk-java7/solr/build/solr-core/test/J0/./org.apache.solr.cloud.BasicDistributedZkTest-1355919973665/jetty3/index
[junit4:junit4]   2> 11893 T1034 C45 P60039 oasc.RecoveryStrategy.replay No replay needed. core=collection1
[junit4:junit4]   2> 11894 T1034 C45 P60039 oasc.RecoveryStrategy.doRecovery Replication Recovery was successful - registering as Active. core=collection1
[junit4:junit4]   2> 11894 T1034 C45 P60039 oasc.ZkController.publish publishing core=collection1 state=active
[junit4:junit4]   2> 11894 T1034 C45 P60039 oasc.ZkController.publish numShards not found on descriptor - reading it from system property
[junit4:junit4]   2> 11902 T1034 C45 P60039 oasc.RecoveryStrategy.doRecovery Finished recovery process. core=collection1
[junit4:junit4]   2> 12031 T983 oascc.ZkStateReader.updateClusterState Updating cloud state from ZooKeeper... 
[junit4:junit4]   2> 12032 T983 oasc.Overseer$ClusterStateUpdater.updateState Update state numShards=2 message={
[junit4:junit4]   2> 	  "operation":"state",
[junit4:junit4]   2> 	  "numShards":"2",
[junit4:junit4]   2> 	  "shard":"shard1",
[junit4:junit4]   2> 	  "roles":null,
[junit4:junit4]   2> 	  "state":"active",
[junit4:junit4]   2> 	  "core":"collection1",
[junit4:junit4]   2> 	  "collection":"collection1",
[junit4:junit4]   2> 	  "node_name":"127.0.0.1:60039_k%2Fa",
[junit4:junit4]   2> 	  "base_url":"http://127.0.0.1:60039/k/a"}
[junit4:junit4]   2> 12046 T1001 oascc.ZkStateReader$2.process A cluster state change: WatchedEvent state:SyncConnected type:NodeDataChanged path:/clusterstate.json, has occurred - updating... (live nodes size: 5)
[junit4:junit4]   2> 12046 T1016 oascc.ZkStateReader$2.process A cluster state change: WatchedEvent state:SyncConnected type:NodeDataChanged path:/clusterstate.json, has occurred - updating... (live nodes size: 5)
[junit4:junit4]   2> 12046 T982 oascc.ZkStateReader$2.process A cluster state change: WatchedEvent state:SyncConnected type:NodeDataChanged path:/clusterstate.json, has occurred - updating... (live nodes size: 5)
[junit4:junit4]   2> 12046 T1048 oascc.ZkStateReader$2.process A cluster state change: WatchedEvent state:SyncConnected type:NodeDataChanged path:/clusterstate.json, has occurred - updating... (live nodes size: 5)
[junit4:junit4]   2> 12046 T1031 oascc.ZkStateReader$2.process A cluster state change: WatchedEvent state:SyncConnected type:NodeDataChanged path:/clusterstate.json, has occurred - updating... (live nodes size: 5)
[junit4:junit4]   2> 12046 T988 oascc.ZkStateReader$2.process A cluster state change: WatchedEvent state:SyncConnected type:NodeDataChanged path:/clusterstate.json, has occurred - updating... (live nodes size: 5)
[junit4:junit4]   2> 12507 T960 oascc.ZkStateReader.updateClusterState Updating cloud state from ZooKeeper... 
[junit4:junit4]   2>  C47_STATE=coll:collection1 core:collection1 props:{shard=shard2, roles=null, state=recovering, core=collection1, collection=collection1, node_name=127.0.0.1:30877_k%2Fa, base_url=http://127.0.0.1:30877/k/a}
[junit4:junit4]   2> 13501 T1051 C47 P30877 oasc.RecoveryStrategy.doRecovery Begin buffering updates. core=collection1
[junit4:junit4]   2> 13501 T1051 C47 P30877 oasu.UpdateLog.bufferUpdates Starting to buffer updates. FSUpdateLog{state=ACTIVE, tlog=null}
[junit4:junit4]   2> 13501 T1051 C47 P30877 oasc.RecoveryStrategy.replicate Attempting to replicate from http://127.0.0.1:47618/k/a/collection1/. core=collection1
[junit4:junit4]   2> 13501 T1051 C47 P30877 oascsi.HttpClientUtil.createClient Creating new http client, config:maxConnections=128&maxConnectionsPerHost=32&followRedirects=false
[junit4:junit4]   2> 13510 T960 oascc.ZkStateReader.updateClusterState Updating cloud state from ZooKeeper... 
[junit4:junit4]   2> 13513 T1008 C48 P47618 oasu.DirectUpdateHandler2.commit start commit{flags=0,_version_=0,optimize=false,openSearcher=false,waitSearcher=true,expungeDeletes=false,softCommit=false}
[junit4:junit4]   2> 13514 T1008 C48 P47618 oasc.CachingDirectoryFactory.close Releasing directory:/usr/home/hudson/hudson-slave/workspace/Lucene-Solr-Tests-trunk-java7/solr/build/solr-core/test/J0/./org.apache.solr.cloud.BasicDistributedZkTest-1355919973665/jetty2
[junit4:junit4]   2> 13517 T1008 C48 P47618 oasc.SolrDeletionPolicy.onInit SolrDeletionPolicy.onInit: commits:num=1
[junit4:junit4]   2> 		commit{dir=RateLimitedDirectoryWrapper(NRTCachingDirectory(org.apache.lucene.store.NIOFSDirectory@/usr/home/hudson/hudson-slave/workspace/Lucene-Solr-Tests-trunk-java7/solr/build/solr-core/test/J0/org.apache.solr.cloud.BasicDistributedZkTest-1355919973665/jetty2/index lockFactory=org.apache.lucene.store.NativeFSLockFactory@3d049124; maxCacheMB=48.0 maxMergeSizeMB=4.0)),segFN=segments_1,generation=1,filenames=[segments_1]
[junit4:junit4]   2> 13517 T1008 C48 P47618 oasc.SolrDeletionPolicy.updateCommits newest commit = 1[segments_1]
[junit4:junit4]   2> 13546 T1008 C48 P47618 oasc.SolrDeletionPolicy.onCommit SolrDeletionPolicy.onCommit: commits:num=2
[junit4:junit4]   2> 		commit{dir=RateLimitedDirectoryWrapper(NRTCachingDirectory(org.apache.lucene.store.NIOFSDirectory@/usr/home/hudson/hudson-slave/workspace/Lucene-Solr-Tests-trunk-java7/solr/build/solr-core/test/J0/org.apache.solr.cloud.BasicDistributedZkTest-1355919973665/jetty2/index lockFactory=org.apache.lucene.store.NativeFSLockFactory@3d049124; maxCacheMB=48.0 maxMergeSizeMB=4.0)),segFN=segments_1,generation=1,filenames=[segments_1]
[junit4:junit4]   2> 		commit{dir=RateLimitedDirectoryWrapper(NRTCachingDirectory(org.apache.lucene.store.NIOFSDirectory@/usr/home/hudson/hudson-slave/workspace/Lucene-Solr-Tests-trunk-java7/solr/build/solr-core/test/J0/org.apache.solr.cloud.BasicDistributedZkTest-1355919973665/jetty2/index lockFactory=org.apache.lucene.store.NativeFSLockFactory@3d049124; maxCacheMB=48.0 maxMergeSizeMB=4.0)),segFN=segments_2,generation=2,filenames=[segments_2]
[junit4:junit4]   2> 13546 T1008 C48 P47618 oasc.SolrDeletionPolicy.updateCommits newest commit = 2[segments_2]
[junit4:junit4]   2> 13547 T1008 C48 P47618 oasc.CachingDirectoryFactory.close Releasing directory:/usr/home/hudson/hudson-slave/workspace/Lucene-Solr-Tests-trunk-java7/solr/build/solr-core/test/J0/./org.apache.solr.cloud.BasicDistributedZkTest-1355919973665/jetty2
[junit4:junit4]   2> 13548 T1008 C48 P47618 oass.SolrIndexSearcher.<init> Opening Searcher@5d44043 realtime
[junit4:junit4]   2> 13548 T1008 C48 P47618 oasu.DirectUpdateHandler2.commit end_commit_flush
[junit4:junit4]   2> 13548 T1008 C48 P47618 /update {waitSearcher=true&openSearcher=false&commit=true&commit_end_point=true&wt=javabin&softCommit=false&version=2} {commit=} 0 35
[junit4:junit4]   2> 13550 T1051 C47 P30877 oash.ReplicationHandler.inform Commits will be reserved for  10000
[junit4:junit4]   2> 13550 T1051 C47 P30877 oash.SnapPuller.<init>  No value set for 'pollInterval'. Timer Task not started.
[junit4:junit4]   2> 13552 T1009 C48 P47618 oash.ReplicationHandler.inform Commits will be reserved for  10000
[junit4:junit4]   2> 13553 T1009 C48 P47618 REQ /replication {command=indexversion&wt=javabin&qt=/replication&version=2} status=0 QTime=2 
[junit4:junit4]   2> 13553 T1051 C47 P30877 oash.SnapPuller.fetchLatestIndex Master's generation: 2
[junit4:junit4]   2> 13553 T1051 C47 P30877 oash.SnapPuller.fetchLatestIndex Slave's generation: 1
[junit4:junit4]   2> 13553 T1051 C47 P30877 oash.SnapPuller.fetchLatestIndex Starting replication process
[junit4:junit4]   2> 13557 T1009 C48 P47618 oasc.CachingDirectoryFactory.close Releasing directory:/usr/home/hudson/hudson-slave/workspace/Lucene-Solr-Tests-trunk-java7/solr/build/solr-core/test/J0/./org.apache.solr.cloud.BasicDistributedZkTest-1355919973665/jetty2
[junit4:junit4]   2> 13557 T1009 C48 P47618 oasc.CachingDirectoryFactory.close Releasing directory:/usr/home/hudson/hudson-slave/workspace/Lucene-Solr-Tests-trunk-java7/solr/build/solr-core/test/J0/./org.apache.solr.cloud.BasicDistributedZkTest-1355919973665/jetty2/index
[junit4:junit4]   2> 13558 T1009 C48 P47618 REQ /replication {command=filelist&generation=2&wt=javabin&qt=/replication&version=2} status=0 QTime=2 
[junit4:junit4]   2> 13558 T1051 C47 P30877 oash.SnapPuller.fetchLatestIndex Number of files in latest index in master: 1
[junit4:junit4]   2> 13559 T1051 C47 P30877 oasc.CachingDirectoryFactory.get return new directory for /usr/home/hudson/hudson-slave/workspace/Lucene-Solr-Tests-trunk-java7/solr/build/solr-core/test/J0/./org.apache.solr.cloud.BasicDistributedZkTest-1355919973665/jetty4/index.20121219122627217 forceNew:false
[junit4:junit4]   2> 13560 T1051 C47 P30877 oasc.CachingDirectoryFactory.close Releasing directory:/usr/home/hudson/hudson-slave/workspace/Lucene-Solr-Tests-trunk-java7/solr/build/solr-core/test/J0/./org.apache.solr.cloud.BasicDistributedZkTest-1355919973665/jetty4
[junit4:junit4]   2> 13560 T1051 C47 P30877 oash.SnapPuller.fetchLatestIndex Starting download to RateLimitedDirectoryWrapper(NRTCachingDirectory(org.apache.lucene.store.NIOFSDirectory@/usr/home/hudson/hudson-slave/workspace/Lucene-Solr-Tests-trunk-java7/solr/build/solr-core/test/J0/org.apache.solr.cloud.BasicDistributedZkTest-1355919973665/jetty4/index.20121219122627217 lockFactory=org.apache.lucene.store.NativeFSLockFactory@67372c09; maxCacheMB=48.0 maxMergeSizeMB=4.0)) fullCopy=true
[junit4:junit4]   2> 13563 T1009 C48 P47618 REQ /replication {file=segments_2&command=filecontent&checksum=true&generation=2&qt=/replication&wt=filestream} status=0 QTime=0 
[junit4:junit4]   2> 13565 T1051 C47 P30877 oasc.CachingDirectoryFactory.close Releasing directory:/usr/home/hudson/hudson-slave/workspace/Lucene-Solr-Tests-trunk-java7/solr/build/solr-core/test/J0/./org.apache.solr.cloud.BasicDistributedZkTest-1355919973665/jetty4/index
[junit4:junit4]   2> 13565 T1051 C47 P30877 oash.SnapPuller.fetchLatestIndex Total time taken for download : 0 secs
[junit4:junit4]   2> 13565 T1051 C47 P30877 oash.SnapPuller.modifyIndexProps New index installed. Updating index properties... index=index.20121219122627217
[junit4:junit4]   2> 13566 T1051 C47 P30877 oasc.CachingDirectoryFactory.close Releasing directory:/usr/home/hudson/hudson-slave/workspace/Lucene-Solr-Tests-trunk-java7/solr/build/solr-core/test/J0/./org.apache.solr.cloud.BasicDistributedZkTest-1355919973665/jetty4
[junit4:junit4]   2> 13567 T1051 C47 P30877 oasc.CachingDirectoryFactory.close Releasing directory:/usr/home/hudson/hudson-slave/workspace/Lucene-Solr-Tests-trunk-java7/solr/build/solr-core/test/J0/./org.apache.solr.cloud.BasicDistributedZkTest-1355919973665/jetty4
[junit4:junit4]   2> 13567 T1051 C47 P30877 oasc.SolrCore.getNewIndexDir New index directory detected: old=./org.apache.solr.cloud.BasicDistributedZkTest-1355919973665/jetty4/index/ new=./org.apache.solr.cloud.BasicDistributedZkTest-1355919973665/jetty4/index.20121219122627217
[junit4:junit4]   2> 13570 T1051 C47 P30877 oasc.SolrDeletionPolicy.onInit SolrDeletionPolicy.onInit: commits:num=1
[junit4:junit4]   2> 		commit{dir=RateLimitedDirectoryWrapper(NRTCachingDirectory(org.apache.lucene.store.NIOFSDirectory@/usr/home/hudson/hudson-slave/workspace/Lucene-Solr-Tests-trunk-java7/solr/build/solr-core/test/J0/org.apache.solr.cloud.BasicDistributedZkTest-1355919973665/jetty4/index.20121219122627217 lockFactory=org.apache.lucene.store.NativeFSLockFactory@67372c09; maxCacheMB=48.0 maxMergeSizeMB=4.0)),segFN=segments_2,generation=2,filenames=[segments_2]
[junit4:junit4]   2> 13570 T1051 C47 P30877 oasc.SolrDeletionPolicy.updateCommits newest commit = 2[segments_2]
[junit4:junit4]   2> 13571 T1051 C47 P30877 oasc.CachingDirectoryFactory.close Releasing directory:/usr/home/hudson/hudson-slave/workspace/Lucene-Solr-Tests-trunk-java7/solr/build/solr-core/test/J0/./org.apache.solr.cloud.BasicDistributedZkTest-1355919973665/jetty4
[junit4:junit4]   2> 13572 T1051 C47 P30877 oasu.DefaultSolrCoreState.newIndexWriter Creating new IndexWriter...
[junit4:junit4]   2> 13572 T1051 C47 P30877 oasu.DefaultSolrCoreState.newIndexWriter Waiting until IndexWriter is unused... core=collection1
[junit4:junit4]   2> 13572 T1051 C47 P30877 oasu.DefaultSolrCoreState.newIndexWriter Rollback old IndexWriter... core=collection1
[junit4:junit4]   2> 13573 T1051 C47 P30877 oasc.CachingDirectoryFactory.close Releasing directory:/usr/home/hudson/hudson-slave/workspace/Lucene-Solr-Tests-trunk-java7/solr/build/solr-core/test/J0/./org.apache.solr.cloud.BasicDistributedZkTest-1355919973665/jetty4/index.20121219122627217
[junit4:junit4]   2> 13573 T1051 C47 P30877 oasc.CachingDirectoryFactory.close Releasing directory:/usr/home/hudson/hudson-slave/workspace/Lucene-Solr-Tests-trunk-java7/solr/build/solr-core/test/J0/./org.apache.solr.cloud.BasicDistributedZkTest-1355919973665/jetty4
[junit4:junit4]   2> 13576 T1051 C47 P30877 oasc.SolrDeletionPolicy.onInit SolrDeletionPolicy.onInit: commits:num=1
[junit4:junit4]   2> 		commit{dir=RateLimitedDirectoryWrapper(NRTCachingDirectory(org.apache.lucene.store.NIOFSDirectory@/usr/home/hudson/hudson-slave/workspace/Lucene-Solr-Tests-trunk-java7/solr/build/solr-core/test/J0/org.apache.solr.cloud.BasicDistributedZkTest-1355919973665/jetty4/index.20121219122627217 lockFactory=org.apache.lucene.store.NativeFSLockFactory@67372c09; maxCacheMB=48.0 maxMergeSizeMB=4.0)),segFN=segments_2,generation=2,filenames=[segments_2]
[junit4:junit4]   2> 13576 T1051 C47 P30877 oasc.SolrDeletionPolicy.updateCommits newest commit = 2[segments_2]
[junit4:junit4]   2> 13576 T1051 C47 P30877 oasu.DefaultSolrCoreState.newIndexWriter New IndexWriter is ready to be used.
[junit4:junit4]   2> 13577 T1051 C47 P30877 oasc.CachingDirectoryFactory.close Releasing directory:/usr/home/hudson/hudson-slave/workspace/Lucene-Solr-Tests-trunk-java7/solr/build/solr-core/test/J0/./org.apache.solr.cloud.BasicDistributedZkTest-1355919973665/jetty4
[junit4:junit4]   2> 13577 T1051 C47 P30877 oass.SolrIndexSearcher.<init> Opening Searcher@6335320f main
[junit4:junit4]   2> 13579 T1050 oasc.SolrCore.registerSearcher [collection1] Registered new searcher Searcher@6335320f main{StandardDirectoryReader(segments_2:1:nrt)}
[junit4:junit4]   2> 13579 T1050 oasc.CachingDirectoryFactory.close Releasing directory:/usr/home/hudson/hudson-slave/workspace/Lucene-Solr-Tests-trunk-java7/solr/build/solr-core/test/J0/./org.apache.solr.cloud.BasicDistributedZkTest-1355919973665/jetty4/index
[junit4:junit4]   2> 13580 T1051 C47 P30877 oasu.DirectUpdateHandler2.commit start commit{flags=0,_version_=0,optimize=false,openSearcher=false,waitSearcher=false,expungeDeletes=false,softCommit=false}
[junit4:junit4]   2> 13582 T1051 C47 P30877 oasc.SolrDeletionPolicy.onCommit SolrDeletionPolicy.onCommit: commits:num=2
[junit4:junit4]   2> 		commit{dir=RateLimitedDirectoryWrapper(NRTCachingDirectory(org.apache.lucene.store.NIOFSDirectory@/usr/home/hudson/hudson-slave/workspace/Lucene-Solr-Tests-trunk-java7/solr/build/solr-core/test/J0/org.apache.solr.cloud.BasicDistributedZkTest-1355919973665/jetty4/index.20121219122627217 lockFactory=org.apache.lucene.store.NativeFSLockFactory@67372c09; maxCacheMB=48.0 maxMergeSizeMB=4.0)),segFN=segments_2,generation=2,filenames=[segments_2]
[junit4:junit4]   2> 		commit{dir=RateLimitedDirectoryWrapper(NRTCachingDirectory(org.apache.lucene.store.NIOFSDirectory@/usr/home/hudson/hudson-slave/workspace/Lucene-Solr-Tests-trunk-java7/solr/build/solr-core/test/J0/org.apache.solr.cloud.BasicDistributedZkTest-1355919973665/jetty4/index.20121219122627217 lockFactory=org.apache.lucene.store.NativeFSLockFactory@67372c09; maxCacheMB=48.0 maxMergeSizeMB=4.0)),segFN=segments_3,generation=3,filenames=[segments_3]
[junit4:junit4]   2> 13583 T1051 C47 P30877 oasc.SolrDeletionPolicy.updateCommits newest commit = 3[segments_3]
[junit4:junit4]   2> 13584 T1051 C47 P30877 oasc.CachingDirectoryFactory.close Releasing directory:/usr/home/hudson/hudson-slave/workspace/Lucene-Solr-Tests-trunk-java7/solr/build/solr-core/test/J0/./org.apache.solr.cloud.BasicDistributedZkTest-1355919973665/jetty4
[junit4:junit4]   2> 13584 T1051 C47 P30877 oasu.DirectUpdateHandler2.commit end_commit_flush
[junit4:junit4]   2> 13584 T1051 C47 P30877 oasc.CachingDirectoryFactory.close Releasing directory:/usr/home/hudson/hudson-slave/workspace/Lucene-Solr-Tests-trunk-java7/solr/build/solr-core/test/J0/./org.apache.solr.cloud.BasicDistributedZkTest-1355919973665/jetty4/index.20121219122627217
[junit4:junit4]   2> 13584 T1051 C47 P30877 oasc.CachingDirectoryFactory.close Releasing directory:/usr/home/hudson/hudson-slave/workspace/Lucene-Solr-Tests-trunk-java7/solr/build/solr-core/test/J0/./org.apache.solr.cloud.BasicDistributedZkTest-1355919973665/jetty4/index
[junit4:junit4]   2> 13585 T1051 C47 P30877 oasc.RecoveryStrategy.replay No replay needed. core=collection1
[junit4:junit4]   2> 13585 T1051 C47 P30877 oasc.RecoveryStrategy.doRecovery Replication Recovery was successful - registering as Active. core=collection1
[junit4:junit4]   2> 13585 T1051 C47 P30877 oasc.ZkController.publish publishing core=collection1 state=active
[junit4:junit4]   2> 13585 T1051 C47 P30877 oasc.ZkController.publish numShards not found on descriptor - reading it from system property
[junit4:junit4]   2> 13587 T1051 C47 P30877 oasc.RecoveryStrategy.doRecovery Finished recovery process. core=collection1
[junit4:junit4]   2> 14056 T983 oascc.ZkStateReader.updateClusterState Updating cloud state from ZooKeeper... 
[junit4:junit4]   2> 14057 T983 oasc.Overseer$ClusterStateUpdater.updateState Update state numShards=2 message={
[junit4:junit4]   2> 	  "operation":"state",
[junit4:junit4]   2> 	  "numShards":"2",
[junit4:junit4]   2> 	  "shard":"shard2",
[junit4:junit4]   2> 	  "roles":null,
[junit4:junit4]   2> 	  "state":"active",
[junit4:junit4]   2> 	  "core":"collection1",
[junit4:junit4]   2> 	  "collection":"collection1",
[junit4:junit4]   2> 	  "node_name":"127.0.0.1:30877_k%2Fa",
[junit4:junit4]   2> 	  "base_url":"http://127.0.0.1:30877/k/a"}
[junit4:junit4]   2> 14070 T1001 oascc.ZkStateReader$2.process A cluster state change: WatchedEvent state:SyncConnected type:NodeDataChanged path:/clusterstate.json, has occurred - updating... (live nodes size: 5)
[junit4:junit4]   2> 14071 T982 oascc.ZkStateReader$2.process A cluster state change: WatchedEvent state:SyncConnected type:NodeDataChanged path:/clusterstate.json, has occurred - updating... (live nodes size: 5)
[junit4:junit4]   2> 14071 T1016 oascc.ZkStateReader$2.process A cluster state change: WatchedEvent state:SyncConnected type:NodeDat

[...truncated too long message...]

r.common.cloud.ZkStateReader.getLeaderRetry(ZkStateReader.java:429)
[junit4:junit4]    > 	at org.apache.solr.common.cloud.ZkStateReader.getLeaderUrl(ZkStateReader.java:403)
[junit4:junit4]    > 	at org.apache.solr.cloud.BasicDistributedZkTest.testCoreUnloadAndLeaders(BasicDistributedZkTest.java:564)
[junit4:junit4]    > 	at org.apache.solr.cloud.BasicDistributedZkTest.doTest(BasicDistributedZkTest.java:337)
[junit4:junit4]    > 	at org.apache.solr.BaseDistributedSearchTestCase.testDistribSearch(BaseDistributedSearchTestCase.java:794)
[junit4:junit4]    > 	at sun.reflect.NativeMethodAccessorImpl.invoke0(Native Method)
[junit4:junit4]    > 	at sun.reflect.NativeMethodAccessorImpl.invoke(NativeMethodAccessorImpl.java:57)
[junit4:junit4]    > 	at sun.reflect.DelegatingMethodAccessorImpl.invoke(DelegatingMethodAccessorImpl.java:43)
[junit4:junit4]    > 	at java.lang.reflect.Method.invoke(Method.java:601)
[junit4:junit4]    > 	at com.carrotsearch.randomizedtesting.RandomizedRunner.invoke(RandomizedRunner.java:1559)
[junit4:junit4]    > 	at com.carrotsearch.randomizedtesting.RandomizedRunner.access$600(RandomizedRunner.java:79)
[junit4:junit4]    > 	at com.carrotsearch.randomizedtesting.RandomizedRunner$6.evaluate(RandomizedRunner.java:737)
[junit4:junit4]    > 	at com.carrotsearch.randomizedtesting.RandomizedRunner$7.evaluate(RandomizedRunner.java:773)
[junit4:junit4]    > 	at com.carrotsearch.randomizedtesting.RandomizedRunner$8.evaluate(RandomizedRunner.java:787)
[junit4:junit4]    > 	at com.carrotsearch.randomizedtesting.rules.SystemPropertiesRestoreRule$1.evaluate(SystemPropertiesRestoreRule.java:53)
[junit4:junit4]    > 	at org.apache.lucene.util.TestRuleSetupTeardownChained$1.evaluate(TestRuleSetupTeardownChained.java:50)
[junit4:junit4]    > 	at org.apache.lucene.util.TestRuleFieldCacheSanity$1.evaluate(TestRuleFieldCacheSanity.java:51)
[junit4:junit4]    > 	at org.apache.lucene.util.AbstractBeforeAfterRule$1.evaluate(AbstractBeforeAfterRule.java:46)
[junit4:junit4]    > 	at com.carrotsearch.randomizedtesting.rules.SystemPropertiesInvariantRule$1.evaluate(SystemPropertiesInvariantRule.java:55)
[junit4:junit4]    > 	at org.apache.lucene.util.TestRuleThreadAndTestName$1.evaluate(TestRuleThreadAndTestName.java:49)
[junit4:junit4]    > 	at org.apache.lucene.util.TestRuleIgnoreAfterMaxFailures$1.evaluate(TestRuleIgnoreAfterMaxFailures.java:70)
[junit4:junit4]    > 	at org.apache.lucene.util.TestRuleMarkFailure$1.evaluate(TestRuleMarkFailure.java:48)
[junit4:junit4]    > 	at com.carrotsearch.randomizedtesting.rules.StatementAdapter.evaluate(StatementAdapter.java:36)
[junit4:junit4]    > 	at com.carrotsearch.randomizedtesting.ThreadLeakControl$StatementRunner.run(ThreadLeakControl.java:358)
[junit4:junit4]    > 	at com.carrotsearch.randomizedtesting.ThreadLeakControl.forkTimeoutingTask(ThreadLeakControl.java:782)
[junit4:junit4]    > 	at com.carrotsearch.randomizedtesting.ThreadLeakControl$3.evaluate(ThreadLeakControl.java:442)
[junit4:junit4]    > 	at com.carrotsearch.randomizedtesting.RandomizedRunner.runSingleTest(RandomizedRunner.java:746)
[junit4:junit4]    > 	at com.carrotsearch.randomizedtesting.RandomizedRunner$3.evaluate(RandomizedRunner.java:648)
[junit4:junit4]    > 	at com.carrotsearch.randomizedtesting.RandomizedRunner$4.evaluate(RandomizedRunner.java:682)
[junit4:junit4]    > 	at com.carrotsearch.randomizedtesting.RandomizedRunner$5.evaluate(RandomizedRunner.java:693)
[junit4:junit4]    > 	at com.carrotsearch.randomizedtesting.rules.StatementAdapter.evaluate(StatementAdapter.java:36)
[junit4:junit4]    > 	at com.carrotsearch.randomizedtesting.rules.SystemPropertiesRestoreRule$1.evaluate(SystemPropertiesRestoreRule.java:53)
[junit4:junit4]    > 	at org.apache.lucene.util.AbstractBeforeAfterRule$1.evaluate(AbstractBeforeAfterRule.java:46)
[junit4:junit4]    > 	at org.apache.lucene.util.TestRuleStoreClassName$1.evaluate(TestRuleStoreClassName.java:42)
[junit4:junit4]    > 	at com.carrotsearch.randomizedtesting.rules.SystemPropertiesInvariantRule$1.evaluate(SystemPropertiesInvariantRule.java:55)
[junit4:junit4]    > 	at com.carrotsearch.randomizedtesting.rules.NoShadowingOrOverridesOnMethodsRule$1.evaluate(NoShadowingOrOverridesOnMethodsRule.java:39)
[junit4:junit4]    > 	at com.carrotsearch.randomizedtesting.rules.NoShadowingOrOverridesOnMethodsRule$1.evaluate(NoShadowingOrOverridesOnMethodsRule.java:39)
[junit4:junit4]    > 	at com.carrotsearch.randomizedtesting.rules.StatementAdapter.evaluate(StatementAdapter.java:36)
[junit4:junit4]    > 	at org.apache.lucene.util.TestRuleAssertionsRequired$1.evaluate(TestRuleAssertionsRequired.java:43)
[junit4:junit4]    > 	at org.apache.lucene.util.TestRuleMarkFailure$1.evaluate(TestRuleMarkFailure.java:48)
[junit4:junit4]    > 	at org.apache.lucene.util.TestRuleIgnoreAfterMaxFailures$1.evaluate(TestRuleIgnoreAfterMaxFailures.java:70)
[junit4:junit4]    > 	at org.apache.lucene.util.TestRuleIgnoreTestSuites$1.evaluate(TestRuleIgnoreTestSuites.java:55)
[junit4:junit4]    > 	at com.carrotsearch.randomizedtesting.rules.StatementAdapter.evaluate(StatementAdapter.java:36)
[junit4:junit4]    > 	at com.carrotsearch.randomizedtesting.ThreadLeakControl$StatementRunner.run(ThreadLeakControl.java:358)
[junit4:junit4]    > 	at java.lang.Thread.run(Thread.java:722)
[junit4:junit4]   2> 309381 T960 oas.SolrTestCaseJ4.deleteCore ###deleteCore
[junit4:junit4]   2> 309877 T959 ccr.ThreadLeakControl.checkThreadLeaks WARNING Will linger awaiting termination of 1 leaked thread(s).
[junit4:junit4]   2> NOTE: test params are: codec=Lucene41: {n_f1=PostingsFormat(name=Direct), foo_b=Pulsing41(freqCutoff=3 minBlockSize=95 maxBlockSize=233), cat=Pulsing41(freqCutoff=11 minBlockSize=95 maxBlockSize=233), foo_d=PostingsFormat(name=MockRandom), foo_f=Pulsing41(freqCutoff=3 minBlockSize=95 maxBlockSize=233), n_tl1=PostingsFormat(name=Direct), n_d1=Pulsing41(freqCutoff=11 minBlockSize=95 maxBlockSize=233), rnd_b=PostingsFormat(name=MockRandom), intDefault=PostingsFormat(name=Direct), n_td1=PostingsFormat(name=Direct), timestamp=Pulsing41(freqCutoff=11 minBlockSize=95 maxBlockSize=233), id=PostingsFormat(name=MockRandom), range_facet_sl=PostingsFormat(name=MockRandom), range_facet_si=Pulsing41(freqCutoff=11 minBlockSize=95 maxBlockSize=233), oddField_s=PostingsFormat(name=MockRandom), sequence_i=PostingsFormat(name=MockRandom), name=PostingsFormat(name=MockRandom), foo_i=PostingsFormat(name=Direct), regex_dup_B_s=Pulsing41(freqCutoff=11 minBlockSize=95 maxBlockSize=233), multiDefault=Pulsing41(freqCutoff=11 minBlockSize=95 maxBlockSize=233), n_tf1=Pulsing41(freqCutoff=11 minBlockSize=95 maxBlockSize=233), n_dt1=PostingsFormat(name=Direct), genre_s=PostingsFormat(name=MockRandom), author_t=PostingsFormat(name=Direct), n_ti1=PostingsFormat(name=MockRandom), range_facet_l=Pulsing41(freqCutoff=11 minBlockSize=95 maxBlockSize=233), text=Pulsing41(freqCutoff=3 minBlockSize=95 maxBlockSize=233), _version_=PostingsFormat(name=Direct), val_i=PostingsFormat(name=MockRandom), SubjectTerms_mfacet=PostingsFormat(name=Direct), series_t=PostingsFormat(name=Direct), a_t=Pulsing41(freqCutoff=11 minBlockSize=95 maxBlockSize=233), n_tdt1=PostingsFormat(name=Direct), regex_dup_A_s=Pulsing41(freqCutoff=3 minBlockSize=95 maxBlockSize=233), price=Pulsing41(freqCutoff=3 minBlockSize=95 maxBlockSize=233), other_tl1=PostingsFormat(name=Direct), n_l1=Pulsing41(freqCutoff=11 minBlockSize=95 maxBlockSize=233), a_si=PostingsFormat(name=Direct), inStock=Pulsing41(freqCutoff=3 minBlockSize=95 maxBlockSize=233)}, sim=DefaultSimilarity, locale=ru, timezone=Africa/Ouagadougou
[junit4:junit4]   2> NOTE: FreeBSD 9.0-RELEASE amd64/Oracle Corporation 1.7.0_09 (64-bit)/cpus=16,threads=1,free=247084960,total=536870912
[junit4:junit4]   2> NOTE: All tests run in this JVM: [MBeansHandlerTest, SpatialFilterTest, SpellCheckComponentTest, OverseerCollectionProcessorTest, TestCoreContainer, TestFastLRUCache, TestXIncludeConfig, SearchHandlerTest, SystemInfoHandlerTest, TestCollationField, CacheHeaderTest, TestIndexingPerformance, CircularListTest, ClusterStateTest, MinimalSchemaTest, SolrPluginUtilsTest, TestRTGBase, TermsComponentTest, NoCacheHeaderTest, SolrRequestParserTest, LeaderElectionIntegrationTest, TestJoin, DistributedSpellCheckComponentTest, TestFiltering, TestSuggestSpellingConverter, DistanceFunctionTest, DirectSolrConnectionTest, SOLR749Test, TestBadConfig, TestPHPSerializedResponseWriter, BadComponentTest, DirectUpdateHandlerOptimizeTest, AlternateDirectoryTest, TestNumberUtils, DateMathParserTest, TestIBSimilarityFactory, CurrencyFieldTest, FieldAnalysisRequestHandlerTest, TestRandomFaceting, CoreAdminHandlerTest, TermVectorComponentDistributedTest, HighlighterConfigTest, BasicDistributedZk2Test, BasicDistributedZkTest]
[junit4:junit4] Completed on J0 in 310.41s, 1 test, 1 error <<< FAILURES!

[...truncated 108 lines...]
BUILD FAILED
/usr/home/hudson/hudson-slave/workspace/Lucene-Solr-Tests-trunk-java7/build.xml:353: The following error occurred while executing this line:
/usr/home/hudson/hudson-slave/workspace/Lucene-Solr-Tests-trunk-java7/build.xml:39: The following error occurred while executing this line:
/usr/home/hudson/hudson-slave/workspace/Lucene-Solr-Tests-trunk-java7/solr/build.xml:178: The following error occurred while executing this line:
/usr/home/hudson/hudson-slave/workspace/Lucene-Solr-Tests-trunk-java7/solr/common-build.xml:438: The following error occurred while executing this line:
/usr/home/hudson/hudson-slave/workspace/Lucene-Solr-Tests-trunk-java7/lucene/common-build.xml:1175: The following error occurred while executing this line:
/usr/home/hudson/hudson-slave/workspace/Lucene-Solr-Tests-trunk-java7/lucene/common-build.xml:840: There were test failures: 243 suites, 1008 tests, 1 error, 21 ignored (3 assumptions)

Total time: 35 minutes 1 second
Build step 'Invoke Ant' marked build as failure
Archiving artifacts
Recording test results
Email was triggered for: Failure
Sending email for trigger: Failure



Mime
View raw message