lucene-dev mailing list archives

Site index · List index
Message view « Date » · « Thread »
Top « Date » · « Thread »
From Apache Jenkins Server <jenk...@builds.apache.org>
Subject [JENKINS] Lucene-Solr-Tests-trunk-java7 - Build # 3557 - Still Failing
Date Mon, 17 Dec 2012 06:21:18 GMT
Build: https://builds.apache.org/job/Lucene-Solr-Tests-trunk-java7/3557/

3 tests failed.
REGRESSION:  org.apache.solr.cloud.BasicDistributedZkTest.testDistribSearch

Error Message:
Timeout occured while waiting response from server at: http://127.0.0.1:20810/nud/i/awholynewcollection_2

Stack Trace:
org.apache.solr.client.solrj.SolrServerException: Timeout occured while waiting response from server at: http://127.0.0.1:20810/nud/i/awholynewcollection_2
	at __randomizedtesting.SeedInfo.seed([C521A92A7DD5CCA0:44C727320A8AAC9C]:0)
	at org.apache.solr.client.solrj.impl.HttpSolrServer.request(HttpSolrServer.java:409)
	at org.apache.solr.client.solrj.impl.HttpSolrServer.request(HttpSolrServer.java:181)
	at org.apache.solr.client.solrj.request.QueryRequest.process(QueryRequest.java:90)
	at org.apache.solr.client.solrj.SolrServer.query(SolrServer.java:301)
	at org.apache.solr.cloud.BasicDistributedZkTest.waitForNon403or404or503(BasicDistributedZkTest.java:1093)
	at org.apache.solr.cloud.BasicDistributedZkTest.testCollectionsAPI(BasicDistributedZkTest.java:802)
	at org.apache.solr.cloud.BasicDistributedZkTest.doTest(BasicDistributedZkTest.java:352)
	at org.apache.solr.BaseDistributedSearchTestCase.testDistribSearch(BaseDistributedSearchTestCase.java:794)
	at sun.reflect.NativeMethodAccessorImpl.invoke0(Native Method)
	at sun.reflect.NativeMethodAccessorImpl.invoke(NativeMethodAccessorImpl.java:57)
	at sun.reflect.DelegatingMethodAccessorImpl.invoke(DelegatingMethodAccessorImpl.java:43)
	at java.lang.reflect.Method.invoke(Method.java:601)
	at com.carrotsearch.randomizedtesting.RandomizedRunner.invoke(RandomizedRunner.java:1559)
	at com.carrotsearch.randomizedtesting.RandomizedRunner.access$600(RandomizedRunner.java:79)
	at com.carrotsearch.randomizedtesting.RandomizedRunner$6.evaluate(RandomizedRunner.java:737)
	at com.carrotsearch.randomizedtesting.RandomizedRunner$7.evaluate(RandomizedRunner.java:773)
	at com.carrotsearch.randomizedtesting.RandomizedRunner$8.evaluate(RandomizedRunner.java:787)
	at com.carrotsearch.randomizedtesting.rules.SystemPropertiesRestoreRule$1.evaluate(SystemPropertiesRestoreRule.java:53)
	at org.apache.lucene.util.TestRuleSetupTeardownChained$1.evaluate(TestRuleSetupTeardownChained.java:50)
	at org.apache.lucene.util.TestRuleFieldCacheSanity$1.evaluate(TestRuleFieldCacheSanity.java:51)
	at org.apache.lucene.util.AbstractBeforeAfterRule$1.evaluate(AbstractBeforeAfterRule.java:46)
	at com.carrotsearch.randomizedtesting.rules.SystemPropertiesInvariantRule$1.evaluate(SystemPropertiesInvariantRule.java:55)
	at org.apache.lucene.util.TestRuleThreadAndTestName$1.evaluate(TestRuleThreadAndTestName.java:49)
	at org.apache.lucene.util.TestRuleIgnoreAfterMaxFailures$1.evaluate(TestRuleIgnoreAfterMaxFailures.java:70)
	at org.apache.lucene.util.TestRuleMarkFailure$1.evaluate(TestRuleMarkFailure.java:48)
	at com.carrotsearch.randomizedtesting.rules.StatementAdapter.evaluate(StatementAdapter.java:36)
	at com.carrotsearch.randomizedtesting.ThreadLeakControl$StatementRunner.run(ThreadLeakControl.java:358)
	at com.carrotsearch.randomizedtesting.ThreadLeakControl.forkTimeoutingTask(ThreadLeakControl.java:782)
	at com.carrotsearch.randomizedtesting.ThreadLeakControl$3.evaluate(ThreadLeakControl.java:442)
	at com.carrotsearch.randomizedtesting.RandomizedRunner.runSingleTest(RandomizedRunner.java:746)
	at com.carrotsearch.randomizedtesting.RandomizedRunner$3.evaluate(RandomizedRunner.java:648)
	at com.carrotsearch.randomizedtesting.RandomizedRunner$4.evaluate(RandomizedRunner.java:682)
	at com.carrotsearch.randomizedtesting.RandomizedRunner$5.evaluate(RandomizedRunner.java:693)
	at com.carrotsearch.randomizedtesting.rules.StatementAdapter.evaluate(StatementAdapter.java:36)
	at com.carrotsearch.randomizedtesting.rules.SystemPropertiesRestoreRule$1.evaluate(SystemPropertiesRestoreRule.java:53)
	at org.apache.lucene.util.AbstractBeforeAfterRule$1.evaluate(AbstractBeforeAfterRule.java:46)
	at org.apache.lucene.util.TestRuleStoreClassName$1.evaluate(TestRuleStoreClassName.java:42)
	at com.carrotsearch.randomizedtesting.rules.SystemPropertiesInvariantRule$1.evaluate(SystemPropertiesInvariantRule.java:55)
	at com.carrotsearch.randomizedtesting.rules.NoShadowingOrOverridesOnMethodsRule$1.evaluate(NoShadowingOrOverridesOnMethodsRule.java:39)
	at com.carrotsearch.randomizedtesting.rules.NoShadowingOrOverridesOnMethodsRule$1.evaluate(NoShadowingOrOverridesOnMethodsRule.java:39)
	at com.carrotsearch.randomizedtesting.rules.StatementAdapter.evaluate(StatementAdapter.java:36)
	at org.apache.lucene.util.TestRuleAssertionsRequired$1.evaluate(TestRuleAssertionsRequired.java:43)
	at org.apache.lucene.util.TestRuleMarkFailure$1.evaluate(TestRuleMarkFailure.java:48)
	at org.apache.lucene.util.TestRuleIgnoreAfterMaxFailures$1.evaluate(TestRuleIgnoreAfterMaxFailures.java:70)
	at org.apache.lucene.util.TestRuleIgnoreTestSuites$1.evaluate(TestRuleIgnoreTestSuites.java:55)
	at com.carrotsearch.randomizedtesting.rules.StatementAdapter.evaluate(StatementAdapter.java:36)
	at com.carrotsearch.randomizedtesting.ThreadLeakControl$StatementRunner.run(ThreadLeakControl.java:358)
	at java.lang.Thread.run(Thread.java:722)
Caused by: java.net.SocketTimeoutException: Read timed out
	at java.net.SocketInputStream.socketRead0(Native Method)
	at java.net.SocketInputStream.read(SocketInputStream.java:150)
	at java.net.SocketInputStream.read(SocketInputStream.java:121)
	at org.apache.http.impl.io.AbstractSessionInputBuffer.fillBuffer(AbstractSessionInputBuffer.java:149)
	at org.apache.http.impl.io.SocketInputBuffer.fillBuffer(SocketInputBuffer.java:111)
	at org.apache.http.impl.io.AbstractSessionInputBuffer.readLine(AbstractSessionInputBuffer.java:264)
	at org.apache.http.impl.conn.DefaultResponseParser.parseHead(DefaultResponseParser.java:98)
	at org.apache.http.impl.io.AbstractMessageParser.parse(AbstractMessageParser.java:252)
	at org.apache.http.impl.AbstractHttpClientConnection.receiveResponseHeader(AbstractHttpClientConnection.java:282)
	at org.apache.http.impl.conn.DefaultClientConnection.receiveResponseHeader(DefaultClientConnection.java:247)
	at org.apache.http.impl.conn.AbstractClientConnAdapter.receiveResponseHeader(AbstractClientConnAdapter.java:216)
	at org.apache.http.protocol.HttpRequestExecutor.doReceiveResponse(HttpRequestExecutor.java:298)
	at org.apache.http.protocol.HttpRequestExecutor.execute(HttpRequestExecutor.java:125)
	at org.apache.http.impl.client.DefaultRequestDirector.tryExecute(DefaultRequestDirector.java:647)
	at org.apache.http.impl.client.DefaultRequestDirector.execute(DefaultRequestDirector.java:464)
	at org.apache.http.impl.client.AbstractHttpClient.execute(AbstractHttpClient.java:820)
	at org.apache.http.impl.client.AbstractHttpClient.execute(AbstractHttpClient.java:754)
	at org.apache.http.impl.client.AbstractHttpClient.execute(AbstractHttpClient.java:732)
	at org.apache.solr.client.solrj.impl.HttpSolrServer.request(HttpSolrServer.java:352)
	... 47 more


REGRESSION:  org.apache.solr.cloud.SyncSliceTest.testDistribSearch

Error Message:


Stack Trace:
java.lang.AssertionError
	at __randomizedtesting.SeedInfo.seed([C521A92A7DD5CCA0:44C727320A8AAC9C]:0)
	at org.junit.Assert.fail(Assert.java:92)
	at org.junit.Assert.assertTrue(Assert.java:43)
	at org.junit.Assert.assertNotNull(Assert.java:526)
	at org.junit.Assert.assertNotNull(Assert.java:537)
	at org.apache.solr.cloud.SyncSliceTest.doTest(SyncSliceTest.java:211)
	at org.apache.solr.BaseDistributedSearchTestCase.testDistribSearch(BaseDistributedSearchTestCase.java:794)
	at sun.reflect.NativeMethodAccessorImpl.invoke0(Native Method)
	at sun.reflect.NativeMethodAccessorImpl.invoke(NativeMethodAccessorImpl.java:57)
	at sun.reflect.DelegatingMethodAccessorImpl.invoke(DelegatingMethodAccessorImpl.java:43)
	at java.lang.reflect.Method.invoke(Method.java:601)
	at com.carrotsearch.randomizedtesting.RandomizedRunner.invoke(RandomizedRunner.java:1559)
	at com.carrotsearch.randomizedtesting.RandomizedRunner.access$600(RandomizedRunner.java:79)
	at com.carrotsearch.randomizedtesting.RandomizedRunner$6.evaluate(RandomizedRunner.java:737)
	at com.carrotsearch.randomizedtesting.RandomizedRunner$7.evaluate(RandomizedRunner.java:773)
	at com.carrotsearch.randomizedtesting.RandomizedRunner$8.evaluate(RandomizedRunner.java:787)
	at com.carrotsearch.randomizedtesting.rules.SystemPropertiesRestoreRule$1.evaluate(SystemPropertiesRestoreRule.java:53)
	at org.apache.lucene.util.TestRuleSetupTeardownChained$1.evaluate(TestRuleSetupTeardownChained.java:50)
	at org.apache.lucene.util.TestRuleFieldCacheSanity$1.evaluate(TestRuleFieldCacheSanity.java:51)
	at org.apache.lucene.util.AbstractBeforeAfterRule$1.evaluate(AbstractBeforeAfterRule.java:46)
	at com.carrotsearch.randomizedtesting.rules.SystemPropertiesInvariantRule$1.evaluate(SystemPropertiesInvariantRule.java:55)
	at org.apache.lucene.util.TestRuleThreadAndTestName$1.evaluate(TestRuleThreadAndTestName.java:49)
	at org.apache.lucene.util.TestRuleIgnoreAfterMaxFailures$1.evaluate(TestRuleIgnoreAfterMaxFailures.java:70)
	at org.apache.lucene.util.TestRuleMarkFailure$1.evaluate(TestRuleMarkFailure.java:48)
	at com.carrotsearch.randomizedtesting.rules.StatementAdapter.evaluate(StatementAdapter.java:36)
	at com.carrotsearch.randomizedtesting.ThreadLeakControl$StatementRunner.run(ThreadLeakControl.java:358)
	at com.carrotsearch.randomizedtesting.ThreadLeakControl.forkTimeoutingTask(ThreadLeakControl.java:782)
	at com.carrotsearch.randomizedtesting.ThreadLeakControl$3.evaluate(ThreadLeakControl.java:442)
	at com.carrotsearch.randomizedtesting.RandomizedRunner.runSingleTest(RandomizedRunner.java:746)
	at com.carrotsearch.randomizedtesting.RandomizedRunner$3.evaluate(RandomizedRunner.java:648)
	at com.carrotsearch.randomizedtesting.RandomizedRunner$4.evaluate(RandomizedRunner.java:682)
	at com.carrotsearch.randomizedtesting.RandomizedRunner$5.evaluate(RandomizedRunner.java:693)
	at com.carrotsearch.randomizedtesting.rules.StatementAdapter.evaluate(StatementAdapter.java:36)
	at com.carrotsearch.randomizedtesting.rules.SystemPropertiesRestoreRule$1.evaluate(SystemPropertiesRestoreRule.java:53)
	at org.apache.lucene.util.AbstractBeforeAfterRule$1.evaluate(AbstractBeforeAfterRule.java:46)
	at org.apache.lucene.util.TestRuleStoreClassName$1.evaluate(TestRuleStoreClassName.java:42)
	at com.carrotsearch.randomizedtesting.rules.SystemPropertiesInvariantRule$1.evaluate(SystemPropertiesInvariantRule.java:55)
	at com.carrotsearch.randomizedtesting.rules.NoShadowingOrOverridesOnMethodsRule$1.evaluate(NoShadowingOrOverridesOnMethodsRule.java:39)
	at com.carrotsearch.randomizedtesting.rules.NoShadowingOrOverridesOnMethodsRule$1.evaluate(NoShadowingOrOverridesOnMethodsRule.java:39)
	at com.carrotsearch.randomizedtesting.rules.StatementAdapter.evaluate(StatementAdapter.java:36)
	at org.apache.lucene.util.TestRuleAssertionsRequired$1.evaluate(TestRuleAssertionsRequired.java:43)
	at org.apache.lucene.util.TestRuleMarkFailure$1.evaluate(TestRuleMarkFailure.java:48)
	at org.apache.lucene.util.TestRuleIgnoreAfterMaxFailures$1.evaluate(TestRuleIgnoreAfterMaxFailures.java:70)
	at org.apache.lucene.util.TestRuleIgnoreTestSuites$1.evaluate(TestRuleIgnoreTestSuites.java:55)
	at com.carrotsearch.randomizedtesting.rules.StatementAdapter.evaluate(StatementAdapter.java:36)
	at com.carrotsearch.randomizedtesting.ThreadLeakControl$StatementRunner.run(ThreadLeakControl.java:358)
	at java.lang.Thread.run(Thread.java:722)


REGRESSION:  org.apache.solr.handler.component.DistributedMLTComponentTest.testDistribSearch

Error Message:
Timeout occured while waiting response from server at: http://127.0.0.1:61913

Stack Trace:
org.apache.solr.client.solrj.SolrServerException: Timeout occured while waiting response from server at: http://127.0.0.1:61913
	at __randomizedtesting.SeedInfo.seed([C521A92A7DD5CCA0:44C727320A8AAC9C]:0)
	at org.apache.solr.client.solrj.impl.HttpSolrServer.request(HttpSolrServer.java:409)
	at org.apache.solr.client.solrj.impl.HttpSolrServer.request(HttpSolrServer.java:181)
	at org.apache.solr.client.solrj.request.QueryRequest.process(QueryRequest.java:90)
	at org.apache.solr.client.solrj.SolrServer.query(SolrServer.java:301)
	at org.apache.solr.BaseDistributedSearchTestCase.queryServer(BaseDistributedSearchTestCase.java:470)
	at org.apache.solr.BaseDistributedSearchTestCase.query(BaseDistributedSearchTestCase.java:493)
	at org.apache.solr.BaseDistributedSearchTestCase.query(BaseDistributedSearchTestCase.java:475)
	at org.apache.solr.handler.component.DistributedMLTComponentTest.doTest(DistributedMLTComponentTest.java:119)
	at org.apache.solr.BaseDistributedSearchTestCase.testDistribSearch(BaseDistributedSearchTestCase.java:794)
	at sun.reflect.NativeMethodAccessorImpl.invoke0(Native Method)
	at sun.reflect.NativeMethodAccessorImpl.invoke(NativeMethodAccessorImpl.java:57)
	at sun.reflect.DelegatingMethodAccessorImpl.invoke(DelegatingMethodAccessorImpl.java:43)
	at java.lang.reflect.Method.invoke(Method.java:601)
	at com.carrotsearch.randomizedtesting.RandomizedRunner.invoke(RandomizedRunner.java:1559)
	at com.carrotsearch.randomizedtesting.RandomizedRunner.access$600(RandomizedRunner.java:79)
	at com.carrotsearch.randomizedtesting.RandomizedRunner$6.evaluate(RandomizedRunner.java:737)
	at com.carrotsearch.randomizedtesting.RandomizedRunner$7.evaluate(RandomizedRunner.java:773)
	at com.carrotsearch.randomizedtesting.RandomizedRunner$8.evaluate(RandomizedRunner.java:787)
	at com.carrotsearch.randomizedtesting.rules.SystemPropertiesRestoreRule$1.evaluate(SystemPropertiesRestoreRule.java:53)
	at org.apache.lucene.util.TestRuleSetupTeardownChained$1.evaluate(TestRuleSetupTeardownChained.java:50)
	at org.apache.lucene.util.TestRuleFieldCacheSanity$1.evaluate(TestRuleFieldCacheSanity.java:51)
	at org.apache.lucene.util.AbstractBeforeAfterRule$1.evaluate(AbstractBeforeAfterRule.java:46)
	at com.carrotsearch.randomizedtesting.rules.SystemPropertiesInvariantRule$1.evaluate(SystemPropertiesInvariantRule.java:55)
	at org.apache.lucene.util.TestRuleThreadAndTestName$1.evaluate(TestRuleThreadAndTestName.java:49)
	at org.apache.lucene.util.TestRuleIgnoreAfterMaxFailures$1.evaluate(TestRuleIgnoreAfterMaxFailures.java:70)
	at org.apache.lucene.util.TestRuleMarkFailure$1.evaluate(TestRuleMarkFailure.java:48)
	at com.carrotsearch.randomizedtesting.rules.StatementAdapter.evaluate(StatementAdapter.java:36)
	at com.carrotsearch.randomizedtesting.ThreadLeakControl$StatementRunner.run(ThreadLeakControl.java:358)
	at com.carrotsearch.randomizedtesting.ThreadLeakControl.forkTimeoutingTask(ThreadLeakControl.java:782)
	at com.carrotsearch.randomizedtesting.ThreadLeakControl$3.evaluate(ThreadLeakControl.java:442)
	at com.carrotsearch.randomizedtesting.RandomizedRunner.runSingleTest(RandomizedRunner.java:746)
	at com.carrotsearch.randomizedtesting.RandomizedRunner$3.evaluate(RandomizedRunner.java:648)
	at com.carrotsearch.randomizedtesting.RandomizedRunner$4.evaluate(RandomizedRunner.java:682)
	at com.carrotsearch.randomizedtesting.RandomizedRunner$5.evaluate(RandomizedRunner.java:693)
	at com.carrotsearch.randomizedtesting.rules.StatementAdapter.evaluate(StatementAdapter.java:36)
	at com.carrotsearch.randomizedtesting.rules.SystemPropertiesRestoreRule$1.evaluate(SystemPropertiesRestoreRule.java:53)
	at org.apache.lucene.util.AbstractBeforeAfterRule$1.evaluate(AbstractBeforeAfterRule.java:46)
	at org.apache.lucene.util.TestRuleStoreClassName$1.evaluate(TestRuleStoreClassName.java:42)
	at com.carrotsearch.randomizedtesting.rules.SystemPropertiesInvariantRule$1.evaluate(SystemPropertiesInvariantRule.java:55)
	at com.carrotsearch.randomizedtesting.rules.NoShadowingOrOverridesOnMethodsRule$1.evaluate(NoShadowingOrOverridesOnMethodsRule.java:39)
	at com.carrotsearch.randomizedtesting.rules.NoShadowingOrOverridesOnMethodsRule$1.evaluate(NoShadowingOrOverridesOnMethodsRule.java:39)
	at com.carrotsearch.randomizedtesting.rules.StatementAdapter.evaluate(StatementAdapter.java:36)
	at org.apache.lucene.util.TestRuleAssertionsRequired$1.evaluate(TestRuleAssertionsRequired.java:43)
	at org.apache.lucene.util.TestRuleMarkFailure$1.evaluate(TestRuleMarkFailure.java:48)
	at org.apache.lucene.util.TestRuleIgnoreAfterMaxFailures$1.evaluate(TestRuleIgnoreAfterMaxFailures.java:70)
	at org.apache.lucene.util.TestRuleIgnoreTestSuites$1.evaluate(TestRuleIgnoreTestSuites.java:55)
	at com.carrotsearch.randomizedtesting.rules.StatementAdapter.evaluate(StatementAdapter.java:36)
	at com.carrotsearch.randomizedtesting.ThreadLeakControl$StatementRunner.run(ThreadLeakControl.java:358)
	at java.lang.Thread.run(Thread.java:722)
Caused by: java.net.SocketTimeoutException: Read timed out
	at java.net.SocketInputStream.socketRead0(Native Method)
	at java.net.SocketInputStream.read(SocketInputStream.java:150)
	at java.net.SocketInputStream.read(SocketInputStream.java:121)
	at org.apache.http.impl.io.AbstractSessionInputBuffer.fillBuffer(AbstractSessionInputBuffer.java:149)
	at org.apache.http.impl.io.SocketInputBuffer.fillBuffer(SocketInputBuffer.java:111)
	at org.apache.http.impl.io.AbstractSessionInputBuffer.readLine(AbstractSessionInputBuffer.java:264)
	at org.apache.http.impl.conn.DefaultResponseParser.parseHead(DefaultResponseParser.java:98)
	at org.apache.http.impl.io.AbstractMessageParser.parse(AbstractMessageParser.java:252)
	at org.apache.http.impl.AbstractHttpClientConnection.receiveResponseHeader(AbstractHttpClientConnection.java:282)
	at org.apache.http.impl.conn.DefaultClientConnection.receiveResponseHeader(DefaultClientConnection.java:247)
	at org.apache.http.impl.conn.AbstractClientConnAdapter.receiveResponseHeader(AbstractClientConnAdapter.java:216)
	at org.apache.http.protocol.HttpRequestExecutor.doReceiveResponse(HttpRequestExecutor.java:298)
	at org.apache.http.protocol.HttpRequestExecutor.execute(HttpRequestExecutor.java:125)
	at org.apache.http.impl.client.DefaultRequestDirector.tryExecute(DefaultRequestDirector.java:647)
	at org.apache.http.impl.client.DefaultRequestDirector.execute(DefaultRequestDirector.java:464)
	at org.apache.http.impl.client.AbstractHttpClient.execute(AbstractHttpClient.java:820)
	at org.apache.http.impl.client.AbstractHttpClient.execute(AbstractHttpClient.java:754)
	at org.apache.http.impl.client.AbstractHttpClient.execute(AbstractHttpClient.java:732)
	at org.apache.solr.client.solrj.impl.HttpSolrServer.request(HttpSolrServer.java:352)
	... 48 more




Build Log:
[...truncated 9060 lines...]
[junit4:junit4] Suite: org.apache.solr.cloud.BasicDistributedZkTest
[junit4:junit4]   2> 1 T1102 oas.BaseDistributedSearchTestCase.initHostContext Setting hostContext system property: /nud/i
[junit4:junit4]   2> 7 T1102 oas.SolrTestCaseJ4.setUp ###Starting testDistribSearch
[junit4:junit4]   2> Creating dataDir: /usr/home/hudson/hudson-slave/workspace/Lucene-Solr-Tests-trunk-java7/solr/build/solr-core/test/J0/./solrtest-BasicDistributedZkTest-1355724685327
[junit4:junit4]   2> 8 T1102 oasc.ZkTestServer.run STARTING ZK TEST SERVER
[junit4:junit4]   2> 8 T1103 oasc.ZkTestServer$ZKServerMain.runFromConfig Starting server
[junit4:junit4]   2> 12 T1103 oazs.ZooKeeperServer.setTickTime tickTime set to 1000
[junit4:junit4]   2> 12 T1103 oazs.ZooKeeperServer.setMinSessionTimeout minSessionTimeout set to -1
[junit4:junit4]   2> 12 T1103 oazs.ZooKeeperServer.setMaxSessionTimeout maxSessionTimeout set to -1
[junit4:junit4]   2> 13 T1103 oazs.NIOServerCnxnFactory.configure binding to port 0.0.0.0/0.0.0.0:0
[junit4:junit4]   2> 14 T1103 oazsp.FileTxnSnapLog.save Snapshotting: 0x0 to /usr/home/hudson/hudson-slave/workspace/Lucene-Solr-Tests-trunk-java7/solr/build/solr-core/test/J0/./org.apache.solr.cloud.BasicDistributedZkTest-1355724685327/zookeeper/server1/data/version-2/snapshot.0
[junit4:junit4]   2> 109 T1102 oasc.ZkTestServer.run start zk server on port:54876
[junit4:junit4]   2> 109 T1102 oaz.ZooKeeper.<init> Initiating client connection, connectString=127.0.0.1:54876 sessionTimeout=10000 watcher=org.apache.solr.common.cloud.ConnectionManager@555c8425
[junit4:junit4]   2> 110 T1102 oascc.ConnectionManager.waitForConnected Waiting for client to connect to ZooKeeper
[junit4:junit4]   2> 111 T1108 oaz.ClientCnxn$SendThread.logStartConnect Opening socket connection to server localhost/127.0.0.1:54876. Will not attempt to authenticate using SASL (access denied ("javax.security.auth.AuthPermission" "getLoginConfiguration"))
[junit4:junit4]   2> 111 T1108 oaz.ClientCnxn$SendThread.primeConnection Socket connection established to localhost/127.0.0.1:54876, initiating session
[junit4:junit4]   2> 112 T1104 oazs.NIOServerCnxnFactory.run Accepted socket connection from /140.211.11.196:65239
[junit4:junit4]   2> 112 T1104 oazs.ZooKeeperServer.processConnectRequest Client attempting to establish new session at /140.211.11.196:65239
[junit4:junit4]   2> 113 T1106 oazsp.FileTxnLog.append Creating new log file: log.1
[junit4:junit4]   2> 115 T1106 oazs.ZooKeeperServer.finishSessionInit Established session 0x13ba77d00180000 with negotiated timeout 10000 for client /140.211.11.196:65239
[junit4:junit4]   2> 115 T1108 oaz.ClientCnxn$SendThread.onConnected Session establishment complete on server localhost/127.0.0.1:54876, sessionid = 0x13ba77d00180000, negotiated timeout = 10000
[junit4:junit4]   2> 115 T1109 oascc.ConnectionManager.process Watcher org.apache.solr.common.cloud.ConnectionManager@555c8425 name:ZooKeeperConnection Watcher:127.0.0.1:54876 got event WatchedEvent state:SyncConnected type:None path:null path:null type:None
[junit4:junit4]   2> 115 T1102 oascc.ConnectionManager.waitForConnected Client is connected to ZooKeeper
[junit4:junit4]   2> 116 T1102 oascc.SolrZkClient.makePath makePath: /solr
[junit4:junit4]   2> 119 T1107 oazs.PrepRequestProcessor.pRequest2Txn Processed session termination for sessionid: 0x13ba77d00180000
[junit4:junit4]   2> 120 T1109 oaz.ClientCnxn$EventThread.run EventThread shut down
[junit4:junit4]   2> 121 T1104 oazs.NIOServerCnxn.closeSock Closed socket connection for client /140.211.11.196:65239 which had sessionid 0x13ba77d00180000
[junit4:junit4]   2> 120 T1102 oaz.ZooKeeper.close Session: 0x13ba77d00180000 closed
[junit4:junit4]   2> 121 T1102 oaz.ZooKeeper.<init> Initiating client connection, connectString=127.0.0.1:54876/solr sessionTimeout=10000 watcher=org.apache.solr.common.cloud.ConnectionManager@3dc664fd
[junit4:junit4]   2> 122 T1102 oascc.ConnectionManager.waitForConnected Waiting for client to connect to ZooKeeper
[junit4:junit4]   2> 122 T1110 oaz.ClientCnxn$SendThread.logStartConnect Opening socket connection to server localhost/127.0.0.1:54876. Will not attempt to authenticate using SASL (access denied ("javax.security.auth.AuthPermission" "getLoginConfiguration"))
[junit4:junit4]   2> 123 T1110 oaz.ClientCnxn$SendThread.primeConnection Socket connection established to localhost/127.0.0.1:54876, initiating session
[junit4:junit4]   2> 123 T1104 oazs.NIOServerCnxnFactory.run Accepted socket connection from /140.211.11.196:12206
[junit4:junit4]   2> 123 T1104 oazs.ZooKeeperServer.processConnectRequest Client attempting to establish new session at /140.211.11.196:12206
[junit4:junit4]   2> 125 T1106 oazs.ZooKeeperServer.finishSessionInit Established session 0x13ba77d00180001 with negotiated timeout 10000 for client /140.211.11.196:12206
[junit4:junit4]   2> 125 T1110 oaz.ClientCnxn$SendThread.onConnected Session establishment complete on server localhost/127.0.0.1:54876, sessionid = 0x13ba77d00180001, negotiated timeout = 10000
[junit4:junit4]   2> 125 T1111 oascc.ConnectionManager.process Watcher org.apache.solr.common.cloud.ConnectionManager@3dc664fd name:ZooKeeperConnection Watcher:127.0.0.1:54876/solr got event WatchedEvent state:SyncConnected type:None path:null path:null type:None
[junit4:junit4]   2> 125 T1102 oascc.ConnectionManager.waitForConnected Client is connected to ZooKeeper
[junit4:junit4]   2> 126 T1102 oascc.SolrZkClient.makePath makePath: /collections/collection1
[junit4:junit4]   2> 136 T1102 oascc.SolrZkClient.makePath makePath: /collections/collection1/shards
[junit4:junit4]   2> 145 T1102 oascc.SolrZkClient.makePath makePath: /collections/control_collection
[junit4:junit4]   2> 149 T1102 oascc.SolrZkClient.makePath makePath: /collections/control_collection/shards
[junit4:junit4]   2> 153 T1102 oasc.AbstractZkTestCase.putConfig put /usr/home/hudson/hudson-slave/workspace/Lucene-Solr-Tests-trunk-java7/solr/build/solr-core/test-files/solr/collection1/conf/solrconfig.xml to /configs/conf1/solrconfig.xml
[junit4:junit4]   2> 154 T1102 oascc.SolrZkClient.makePath makePath: /configs/conf1/solrconfig.xml
[junit4:junit4]   2> 168 T1102 oasc.AbstractZkTestCase.putConfig put /usr/home/hudson/hudson-slave/workspace/Lucene-Solr-Tests-trunk-java7/solr/build/solr-core/test-files/solr/collection1/conf/schema.xml to /configs/conf1/schema.xml
[junit4:junit4]   2> 169 T1102 oascc.SolrZkClient.makePath makePath: /configs/conf1/schema.xml
[junit4:junit4]   2> 275 T1102 oasc.AbstractZkTestCase.putConfig put /usr/home/hudson/hudson-slave/workspace/Lucene-Solr-Tests-trunk-java7/solr/build/solr-core/test-files/solr/collection1/conf/stopwords.txt to /configs/conf1/stopwords.txt
[junit4:junit4]   2> 276 T1102 oascc.SolrZkClient.makePath makePath: /configs/conf1/stopwords.txt
[junit4:junit4]   2> 280 T1102 oasc.AbstractZkTestCase.putConfig put /usr/home/hudson/hudson-slave/workspace/Lucene-Solr-Tests-trunk-java7/solr/build/solr-core/test-files/solr/collection1/conf/protwords.txt to /configs/conf1/protwords.txt
[junit4:junit4]   2> 281 T1102 oascc.SolrZkClient.makePath makePath: /configs/conf1/protwords.txt
[junit4:junit4]   2> 290 T1102 oasc.AbstractZkTestCase.putConfig put /usr/home/hudson/hudson-slave/workspace/Lucene-Solr-Tests-trunk-java7/solr/build/solr-core/test-files/solr/collection1/conf/currency.xml to /configs/conf1/currency.xml
[junit4:junit4]   2> 291 T1102 oascc.SolrZkClient.makePath makePath: /configs/conf1/currency.xml
[junit4:junit4]   2> 296 T1102 oasc.AbstractZkTestCase.putConfig put /usr/home/hudson/hudson-slave/workspace/Lucene-Solr-Tests-trunk-java7/solr/build/solr-core/test-files/solr/collection1/conf/open-exchange-rates.json to /configs/conf1/open-exchange-rates.json
[junit4:junit4]   2> 297 T1102 oascc.SolrZkClient.makePath makePath: /configs/conf1/open-exchange-rates.json
[junit4:junit4]   2> 301 T1102 oasc.AbstractZkTestCase.putConfig put /usr/home/hudson/hudson-slave/workspace/Lucene-Solr-Tests-trunk-java7/solr/build/solr-core/test-files/solr/collection1/conf/mapping-ISOLatin1Accent.txt to /configs/conf1/mapping-ISOLatin1Accent.txt
[junit4:junit4]   2> 302 T1102 oascc.SolrZkClient.makePath makePath: /configs/conf1/mapping-ISOLatin1Accent.txt
[junit4:junit4]   2> 306 T1102 oasc.AbstractZkTestCase.putConfig put /usr/home/hudson/hudson-slave/workspace/Lucene-Solr-Tests-trunk-java7/solr/build/solr-core/test-files/solr/collection1/conf/old_synonyms.txt to /configs/conf1/old_synonyms.txt
[junit4:junit4]   2> 306 T1102 oascc.SolrZkClient.makePath makePath: /configs/conf1/old_synonyms.txt
[junit4:junit4]   2> 311 T1102 oasc.AbstractZkTestCase.putConfig put /usr/home/hudson/hudson-slave/workspace/Lucene-Solr-Tests-trunk-java7/solr/build/solr-core/test-files/solr/collection1/conf/synonyms.txt to /configs/conf1/synonyms.txt
[junit4:junit4]   2> 312 T1102 oascc.SolrZkClient.makePath makePath: /configs/conf1/synonyms.txt
[junit4:junit4]   2> 315 T1107 oazs.PrepRequestProcessor.pRequest2Txn Processed session termination for sessionid: 0x13ba77d00180001
[junit4:junit4]   2> 316 T1111 oaz.ClientCnxn$EventThread.run EventThread shut down
[junit4:junit4]   2> 316 T1102 oaz.ZooKeeper.close Session: 0x13ba77d00180001 closed
[junit4:junit4]   2> 317 T1104 oazs.NIOServerCnxn.closeSock Closed socket connection for client /140.211.11.196:12206 which had sessionid 0x13ba77d00180001
[junit4:junit4]   2> 508 T1102 oejs.Server.doStart jetty-8.1.8.v20121106
[junit4:junit4]   2> 512 T1102 oejs.AbstractConnector.doStart Started SocketConnector@127.0.0.1:47425
[junit4:junit4]   2> 513 T1102 oasc.SolrResourceLoader.locateSolrHome JNDI not configured for solr (NoInitialContextEx)
[junit4:junit4]   2> 513 T1102 oasc.SolrResourceLoader.locateSolrHome using system property solr.solr.home: /usr/home/hudson/hudson-slave/workspace/Lucene-Solr-Tests-trunk-java7/solr/build/solr-core/test/J0/./org.apache.solr.cloud.BasicDistributedZkTest-controljetty-1355724685637
[junit4:junit4]   2> 513 T1102 oasc.SolrResourceLoader.<init> new SolrResourceLoader for deduced Solr Home: '/usr/home/hudson/hudson-slave/workspace/Lucene-Solr-Tests-trunk-java7/solr/build/solr-core/test/J0/./org.apache.solr.cloud.BasicDistributedZkTest-controljetty-1355724685637/'
[junit4:junit4]   2> 551 T1102 oass.SolrDispatchFilter.init SolrDispatchFilter.init()
[junit4:junit4]   2> 552 T1102 oasc.SolrResourceLoader.locateSolrHome JNDI not configured for solr (NoInitialContextEx)
[junit4:junit4]   2> 552 T1102 oasc.SolrResourceLoader.locateSolrHome using system property solr.solr.home: /usr/home/hudson/hudson-slave/workspace/Lucene-Solr-Tests-trunk-java7/solr/build/solr-core/test/J0/./org.apache.solr.cloud.BasicDistributedZkTest-controljetty-1355724685637
[junit4:junit4]   2> 552 T1102 oasc.CoreContainer$Initializer.initialize looking for solr.xml: /usr/home/hudson/hudson-slave/workspace/Lucene-Solr-Tests-trunk-java7/solr/build/solr-core/test/J0/./org.apache.solr.cloud.BasicDistributedZkTest-controljetty-1355724685637/solr.xml
[junit4:junit4]   2> 553 T1102 oasc.CoreContainer.<init> New CoreContainer 77135198
[junit4:junit4]   2> 553 T1102 oasc.CoreContainer.load Loading CoreContainer using Solr Home: '/usr/home/hudson/hudson-slave/workspace/Lucene-Solr-Tests-trunk-java7/solr/build/solr-core/test/J0/./org.apache.solr.cloud.BasicDistributedZkTest-controljetty-1355724685637/'
[junit4:junit4]   2> 553 T1102 oasc.SolrResourceLoader.<init> new SolrResourceLoader for directory: '/usr/home/hudson/hudson-slave/workspace/Lucene-Solr-Tests-trunk-java7/solr/build/solr-core/test/J0/./org.apache.solr.cloud.BasicDistributedZkTest-controljetty-1355724685637/'
[junit4:junit4]   2> 578 T1102 oashc.HttpShardHandlerFactory.getParameter Setting socketTimeout to: 30000
[junit4:junit4]   2> 579 T1102 oashc.HttpShardHandlerFactory.getParameter Setting urlScheme to: http://
[junit4:junit4]   2> 579 T1102 oashc.HttpShardHandlerFactory.getParameter Setting connTimeout to: 15000
[junit4:junit4]   2> 580 T1102 oashc.HttpShardHandlerFactory.getParameter Setting maxConnectionsPerHost to: 20
[junit4:junit4]   2> 580 T1102 oashc.HttpShardHandlerFactory.getParameter Setting corePoolSize to: 0
[junit4:junit4]   2> 580 T1102 oashc.HttpShardHandlerFactory.getParameter Setting maximumPoolSize to: 2147483647
[junit4:junit4]   2> 580 T1102 oashc.HttpShardHandlerFactory.getParameter Setting maxThreadIdleTime to: 5
[junit4:junit4]   2> 581 T1102 oashc.HttpShardHandlerFactory.getParameter Setting sizeOfQueue to: -1
[junit4:junit4]   2> 581 T1102 oashc.HttpShardHandlerFactory.getParameter Setting fairnessPolicy to: false
[junit4:junit4]   2> 581 T1102 oascsi.HttpClientUtil.createClient Creating new http client, config:maxConnectionsPerHost=20&maxConnections=10000&socketTimeout=30000&connTimeout=15000&retry=false
[junit4:junit4]   2> 602 T1102 oasc.CoreContainer.load Registering Log Listener
[junit4:junit4]   2> 617 T1102 oasc.CoreContainer.initZooKeeper Zookeeper client=127.0.0.1:54876/solr
[junit4:junit4]   2> 618 T1102 oasc.ZkController.checkChrootPath zkHost includes chroot
[junit4:junit4]   2> 618 T1102 oaz.ZooKeeper.<init> Initiating client connection, connectString=127.0.0.1:54876 sessionTimeout=60000 watcher=org.apache.solr.common.cloud.ConnectionManager@1192508a
[junit4:junit4]   2> 619 T1102 oascc.ConnectionManager.waitForConnected Waiting for client to connect to ZooKeeper
[junit4:junit4]   2> 620 T1121 oaz.ClientCnxn$SendThread.logStartConnect Opening socket connection to server localhost/127.0.0.1:54876. Will not attempt to authenticate using SASL (access denied ("javax.security.auth.AuthPermission" "getLoginConfiguration"))
[junit4:junit4]   2> 620 T1121 oaz.ClientCnxn$SendThread.primeConnection Socket connection established to localhost/127.0.0.1:54876, initiating session
[junit4:junit4]   2> 620 T1104 oazs.NIOServerCnxnFactory.run Accepted socket connection from /140.211.11.196:26628
[junit4:junit4]   2> 621 T1104 oazs.ZooKeeperServer.processConnectRequest Client attempting to establish new session at /140.211.11.196:26628
[junit4:junit4]   2> 623 T1106 oazs.ZooKeeperServer.finishSessionInit Established session 0x13ba77d00180002 with negotiated timeout 20000 for client /140.211.11.196:26628
[junit4:junit4]   2> 623 T1121 oaz.ClientCnxn$SendThread.onConnected Session establishment complete on server localhost/127.0.0.1:54876, sessionid = 0x13ba77d00180002, negotiated timeout = 20000
[junit4:junit4]   2> 624 T1122 oascc.ConnectionManager.process Watcher org.apache.solr.common.cloud.ConnectionManager@1192508a name:ZooKeeperConnection Watcher:127.0.0.1:54876 got event WatchedEvent state:SyncConnected type:None path:null path:null type:None
[junit4:junit4]   2> 624 T1102 oascc.ConnectionManager.waitForConnected Client is connected to ZooKeeper
[junit4:junit4]   2> 625 T1107 oazs.PrepRequestProcessor.pRequest2Txn Processed session termination for sessionid: 0x13ba77d00180002
[junit4:junit4]   2> 626 T1122 oaz.ClientCnxn$EventThread.run EventThread shut down
[junit4:junit4]   2> 627 T1104 oazs.NIOServerCnxn.closeSock Closed socket connection for client /140.211.11.196:26628 which had sessionid 0x13ba77d00180002
[junit4:junit4]   2> 626 T1102 oaz.ZooKeeper.close Session: 0x13ba77d00180002 closed
[junit4:junit4]   2> 627 T1102 oascsi.HttpClientUtil.createClient Creating new http client, config:maxConnections=500&maxConnectionsPerHost=16&socketTimeout=15000&connTimeout=30000
[junit4:junit4]   2> 636 T1102 oaz.ZooKeeper.<init> Initiating client connection, connectString=127.0.0.1:54876/solr sessionTimeout=30000 watcher=org.apache.solr.common.cloud.ConnectionManager@74b2be59
[junit4:junit4]   2> 637 T1102 oascc.ConnectionManager.waitForConnected Waiting for client to connect to ZooKeeper
[junit4:junit4]   2> 637 T1123 oaz.ClientCnxn$SendThread.logStartConnect Opening socket connection to server localhost/127.0.0.1:54876. Will not attempt to authenticate using SASL (access denied ("javax.security.auth.AuthPermission" "getLoginConfiguration"))
[junit4:junit4]   2> 638 T1123 oaz.ClientCnxn$SendThread.primeConnection Socket connection established to localhost/127.0.0.1:54876, initiating session
[junit4:junit4]   2> 638 T1104 oazs.NIOServerCnxnFactory.run Accepted socket connection from /140.211.11.196:30399
[junit4:junit4]   2> 638 T1104 oazs.ZooKeeperServer.processConnectRequest Client attempting to establish new session at /140.211.11.196:30399
[junit4:junit4]   2> 664 T1106 oazs.ZooKeeperServer.finishSessionInit Established session 0x13ba77d00180003 with negotiated timeout 20000 for client /140.211.11.196:30399
[junit4:junit4]   2> 664 T1123 oaz.ClientCnxn$SendThread.onConnected Session establishment complete on server localhost/127.0.0.1:54876, sessionid = 0x13ba77d00180003, negotiated timeout = 20000
[junit4:junit4]   2> 664 T1124 oascc.ConnectionManager.process Watcher org.apache.solr.common.cloud.ConnectionManager@74b2be59 name:ZooKeeperConnection Watcher:127.0.0.1:54876/solr got event WatchedEvent state:SyncConnected type:None path:null path:null type:None
[junit4:junit4]   2> 665 T1102 oascc.ConnectionManager.waitForConnected Client is connected to ZooKeeper
[junit4:junit4]   2> 676 T1107 oazs.PrepRequestProcessor.pRequest Got user-level KeeperException when processing sessionid:0x13ba77d00180003 type:create cxid:0x2 zxid:0x1a txntype:-1 reqpath:n/a Error Path:/solr/overseer Error:KeeperErrorCode = NodeExists for /solr/overseer
[junit4:junit4]   2> 690 T1102 oascc.SolrZkClient.makePath makePath: /live_nodes
[junit4:junit4]   2> 695 T1102 oasc.ZkController.createEphemeralLiveNode Register node as live in ZooKeeper:/live_nodes/127.0.0.1:47425_nud%2Fi
[junit4:junit4]   2> 695 T1107 oazs.PrepRequestProcessor.pRequest Got user-level KeeperException when processing sessionid:0x13ba77d00180003 type:delete cxid:0x7 zxid:0x1c txntype:-1 reqpath:n/a Error Path:/solr/live_nodes/127.0.0.1:47425_nud%2Fi Error:KeeperErrorCode = NoNode for /solr/live_nodes/127.0.0.1:47425_nud%2Fi
[junit4:junit4]   2> 752 T1102 oascc.SolrZkClient.makePath makePath: /live_nodes/127.0.0.1:47425_nud%2Fi
[junit4:junit4]   2> 756 T1102 oascc.SolrZkClient.makePath makePath: /overseer_elect/election
[junit4:junit4]   2> 847 T1107 oazs.PrepRequestProcessor.pRequest Got user-level KeeperException when processing sessionid:0x13ba77d00180003 type:delete cxid:0x15 zxid:0x21 txntype:-1 reqpath:n/a Error Path:/solr/overseer_elect/leader Error:KeeperErrorCode = NoNode for /solr/overseer_elect/leader
[junit4:junit4]   2> 848 T1102 oascc.SolrZkClient.makePath makePath: /overseer_elect/leader
[junit4:junit4]   2> 872 T1102 oasc.Overseer.start Overseer (id=88848772978180099-127.0.0.1:47425_nud%2Fi-n_0000000000) starting
[junit4:junit4]   2> 873 T1107 oazs.PrepRequestProcessor.pRequest Got user-level KeeperException when processing sessionid:0x13ba77d00180003 type:create cxid:0x1a zxid:0x23 txntype:-1 reqpath:n/a Error Path:/solr/overseer Error:KeeperErrorCode = NodeExists for /solr/overseer
[junit4:junit4]   2> 874 T1107 oazs.PrepRequestProcessor.pRequest Got user-level KeeperException when processing sessionid:0x13ba77d00180003 type:create cxid:0x1b zxid:0x24 txntype:-1 reqpath:n/a Error Path:/solr/overseer Error:KeeperErrorCode = NodeExists for /solr/overseer
[junit4:junit4]   2> 880 T1107 oazs.PrepRequestProcessor.pRequest Got user-level KeeperException when processing sessionid:0x13ba77d00180003 type:create cxid:0x1c zxid:0x25 txntype:-1 reqpath:n/a Error Path:/solr/overseer Error:KeeperErrorCode = NodeExists for /solr/overseer
[junit4:junit4]   2> 881 T1107 oazs.PrepRequestProcessor.pRequest Got user-level KeeperException when processing sessionid:0x13ba77d00180003 type:create cxid:0x1d zxid:0x26 txntype:-1 reqpath:n/a Error Path:/solr/overseer Error:KeeperErrorCode = NodeExists for /solr/overseer
[junit4:junit4]   2> 889 T1126 oasc.OverseerCollectionProcessor.run Process current queue of collection messages
[junit4:junit4]   2> 890 T1102 oascc.SolrZkClient.makePath makePath: /clusterstate.json
[junit4:junit4]   2> 898 T1102 oascc.ZkStateReader.createClusterStateWatchersAndUpdate Updating cluster state from ZooKeeper... 
[junit4:junit4]   2> 900 T1125 oasc.Overseer$ClusterStateUpdater.run Starting to work on the main queue
[junit4:junit4]   2> 905 T1127 oasc.CoreContainer.create Creating SolrCore 'collection1' using instanceDir: /usr/home/hudson/hudson-slave/workspace/Lucene-Solr-Tests-trunk-java7/solr/build/solr-core/test/J0/./org.apache.solr.cloud.BasicDistributedZkTest-controljetty-1355724685637/collection1
[junit4:junit4]   2> 905 T1127 oasc.ZkController.createCollectionZkNode Check for collection zkNode:control_collection
[junit4:junit4]   2> 906 T1127 oasc.ZkController.createCollectionZkNode Collection zkNode exists
[junit4:junit4]   2> 906 T1127 oasc.ZkController.readConfigName Load collection config from:/collections/control_collection
[junit4:junit4]   2> 908 T1127 oasc.SolrResourceLoader.<init> new SolrResourceLoader for directory: '/usr/home/hudson/hudson-slave/workspace/Lucene-Solr-Tests-trunk-java7/solr/build/solr-core/test/J0/./org.apache.solr.cloud.BasicDistributedZkTest-controljetty-1355724685637/collection1/'
[junit4:junit4]   2> 908 T1127 oasc.SolrResourceLoader.replaceClassLoader Adding 'file:/usr/home/hudson/hudson-slave/workspace/Lucene-Solr-Tests-trunk-java7/solr/build/solr-core/test/J0/org.apache.solr.cloud.BasicDistributedZkTest-controljetty-1355724685637/collection1/lib/README' to classloader
[junit4:junit4]   2> 909 T1127 oasc.SolrResourceLoader.replaceClassLoader Adding 'file:/usr/home/hudson/hudson-slave/workspace/Lucene-Solr-Tests-trunk-java7/solr/build/solr-core/test/J0/org.apache.solr.cloud.BasicDistributedZkTest-controljetty-1355724685637/collection1/lib/classes/' to classloader
[junit4:junit4]   2> 947 T1127 oasc.SolrConfig.<init> Using Lucene MatchVersion: LUCENE_50
[junit4:junit4]   2> 998 T1127 oasc.SolrConfig.<init> Loaded SolrConfig: solrconfig.xml
[junit4:junit4]   2> 1099 T1127 oass.IndexSchema.readSchema Reading Solr Schema
[junit4:junit4]   2> 1104 T1127 oass.IndexSchema.readSchema Schema name=test
[junit4:junit4]   2> 1702 T1127 oass.OpenExchangeRatesOrgProvider.init Initialized with rates=open-exchange-rates.json, refreshInterval=1440.
[junit4:junit4]   2> 1713 T1127 oass.IndexSchema.readSchema default search field in schema is text
[junit4:junit4]   2> 1717 T1127 oass.IndexSchema.readSchema unique key field: id
[junit4:junit4]   2> 1733 T1127 oass.FileExchangeRateProvider.reload Reloading exchange rates from file currency.xml
[junit4:junit4]   2> 1739 T1127 oass.FileExchangeRateProvider.reload Reloading exchange rates from file currency.xml
[junit4:junit4]   2> 1744 T1127 oass.OpenExchangeRatesOrgProvider.reload Reloading exchange rates from open-exchange-rates.json
[junit4:junit4]   2> 1745 T1127 oass.OpenExchangeRatesOrgProvider.reload Reloading exchange rates from open-exchange-rates.json
[junit4:junit4]   2> 1747 T1127 oasc.SolrCore.<init> [collection1] Opening new SolrCore at /usr/home/hudson/hudson-slave/workspace/Lucene-Solr-Tests-trunk-java7/solr/build/solr-core/test/J0/./org.apache.solr.cloud.BasicDistributedZkTest-controljetty-1355724685637/collection1/, dataDir=./org.apache.solr.cloud.BasicDistributedZkTest-1355724685327/control/data/
[junit4:junit4]   2> 1747 T1127 oasc.JmxMonitoredMap.<init> JMX monitoring is enabled. Adding Solr mbeans to JMX Server: com.sun.jmx.mbeanserver.JmxMBeanServer@59a63e10
[junit4:junit4]   2> 1748 T1127 oasc.SolrCore.initDirectoryFactory solr.NRTCachingDirectoryFactory
[junit4:junit4]   2> 1749 T1127 oasc.CachingDirectoryFactory.get return new directory for /usr/home/hudson/hudson-slave/workspace/Lucene-Solr-Tests-trunk-java7/solr/build/solr-core/test/J0/./org.apache.solr.cloud.BasicDistributedZkTest-1355724685327/control/data forceNew:false
[junit4:junit4]   2> 1750 T1127 oasc.CachingDirectoryFactory.close Releasing directory:/usr/home/hudson/hudson-slave/workspace/Lucene-Solr-Tests-trunk-java7/solr/build/solr-core/test/J0/./org.apache.solr.cloud.BasicDistributedZkTest-1355724685327/control/data
[junit4:junit4]   2> 1750 T1127 oasc.SolrCore.getNewIndexDir New index directory detected: old=null new=./org.apache.solr.cloud.BasicDistributedZkTest-1355724685327/control/data/index/
[junit4:junit4]   2> 1751 T1127 oasc.SolrCore.initIndex WARNING [collection1] Solr index directory './org.apache.solr.cloud.BasicDistributedZkTest-1355724685327/control/data/index' doesn't exist. Creating new index...
[junit4:junit4]   2> 1751 T1127 oasc.CachingDirectoryFactory.get return new directory for /usr/home/hudson/hudson-slave/workspace/Lucene-Solr-Tests-trunk-java7/solr/build/solr-core/test/J0/./org.apache.solr.cloud.BasicDistributedZkTest-1355724685327/control/data/index forceNew:false
[junit4:junit4]   2> 1764 T1127 oasc.SolrDeletionPolicy.onCommit SolrDeletionPolicy.onCommit: commits:num=1
[junit4:junit4]   2> 		commit{dir=RateLimitedDirectoryWrapper(NRTCachingDirectory(org.apache.lucene.store.NIOFSDirectory@/usr/home/hudson/hudson-slave/workspace/Lucene-Solr-Tests-trunk-java7/solr/build/solr-core/test/J0/org.apache.solr.cloud.BasicDistributedZkTest-1355724685327/control/data/index lockFactory=org.apache.lucene.store.NativeFSLockFactory@1c71be88; maxCacheMB=48.0 maxMergeSizeMB=4.0)),segFN=segments_1,generation=1,filenames=[segments_1]
[junit4:junit4]   2> 1764 T1127 oasc.SolrDeletionPolicy.updateCommits newest commit = 1[segments_1]
[junit4:junit4]   2> 1765 T1127 oasc.CachingDirectoryFactory.close Releasing directory:/usr/home/hudson/hudson-slave/workspace/Lucene-Solr-Tests-trunk-java7/solr/build/solr-core/test/J0/./org.apache.solr.cloud.BasicDistributedZkTest-1355724685327/control/data/index
[junit4:junit4]   2> 1765 T1127 oasc.SolrCore.initWriters created xml: solr.XMLResponseWriter
[junit4:junit4]   2> 1767 T1127 oasup.UpdateRequestProcessorChain.init inserting DistributedUpdateProcessorFactory into updateRequestProcessorChain "dedupe"
[junit4:junit4]   2> 1768 T1127 oasup.UpdateRequestProcessorChain.init inserting DistributedUpdateProcessorFactory into updateRequestProcessorChain "dedupe-allfields"
[junit4:junit4]   2> 1768 T1127 oasup.UpdateRequestProcessorChain.init inserting DistributedUpdateProcessorFactory into updateRequestProcessorChain "stored_sig"
[junit4:junit4]   2> 1768 T1127 oasup.UpdateRequestProcessorChain.init inserting DistributedUpdateProcessorFactory into updateRequestProcessorChain "uniq-fields"
[junit4:junit4]   2> 1769 T1127 oasup.UpdateRequestProcessorChain.init inserting DistributedUpdateProcessorFactory into updateRequestProcessorChain "distrib-dup-test-chain-implicit"
[junit4:junit4]   2> 1769 T1127 oasc.RequestHandlers.initHandlersFromConfig adding lazy requestHandler: solr.ReplicationHandler
[junit4:junit4]   2> 1769 T1127 oasc.RequestHandlers.initHandlersFromConfig created /replication: solr.ReplicationHandler
[junit4:junit4]   2> 1771 T1127 oasc.RequestHandlers.initHandlersFromConfig created standard: solr.StandardRequestHandler
[junit4:junit4]   2> 1772 T1127 oasc.RequestHandlers.initHandlersFromConfig created /get: solr.RealTimeGetHandler
[junit4:junit4]   2> 1773 T1127 oasc.RequestHandlers.initHandlersFromConfig created dismax: solr.SearchHandler
[junit4:junit4]   2> 1774 T1127 oasc.RequestHandlers.initHandlersFromConfig created mock: org.apache.solr.core.MockQuerySenderListenerReqHandler
[junit4:junit4]   2> 1774 T1127 oasc.RequestHandlers.initHandlersFromConfig created /admin/: org.apache.solr.handler.admin.AdminHandlers
[junit4:junit4]   2> 1775 T1127 oasc.RequestHandlers.initHandlersFromConfig created defaults: solr.StandardRequestHandler
[junit4:junit4]   2> 1775 T1127 oasc.RequestHandlers.initHandlersFromConfig adding lazy requestHandler: solr.StandardRequestHandler
[junit4:junit4]   2> 1776 T1127 oasc.RequestHandlers.initHandlersFromConfig created lazy: solr.StandardRequestHandler
[junit4:junit4]   2> 1777 T1127 oasc.RequestHandlers.initHandlersFromConfig created /update: solr.UpdateRequestHandler
[junit4:junit4]   2> 1778 T1127 oasc.RequestHandlers.initHandlersFromConfig created /terms: org.apache.solr.handler.component.SearchHandler
[junit4:junit4]   2> 1779 T1127 oasc.RequestHandlers.initHandlersFromConfig created spellCheckCompRH: org.apache.solr.handler.component.SearchHandler
[junit4:junit4]   2> 1780 T1127 oasc.RequestHandlers.initHandlersFromConfig created spellCheckCompRH_Direct: org.apache.solr.handler.component.SearchHandler
[junit4:junit4]   2> 1781 T1127 oasc.RequestHandlers.initHandlersFromConfig created spellCheckWithWordbreak: org.apache.solr.handler.component.SearchHandler
[junit4:junit4]   2> 1782 T1127 oasc.RequestHandlers.initHandlersFromConfig created spellCheckWithWordbreak_Direct: org.apache.solr.handler.component.SearchHandler
[junit4:junit4]   2> 1783 T1127 oasc.RequestHandlers.initHandlersFromConfig created spellCheckCompRH1: org.apache.solr.handler.component.SearchHandler
[junit4:junit4]   2> 1784 T1127 oasc.RequestHandlers.initHandlersFromConfig created mltrh: org.apache.solr.handler.component.SearchHandler
[junit4:junit4]   2> 1785 T1127 oasc.RequestHandlers.initHandlersFromConfig created tvrh: org.apache.solr.handler.component.SearchHandler
[junit4:junit4]   2> 1786 T1127 oasc.RequestHandlers.initHandlersFromConfig created /mlt: solr.MoreLikeThisHandler
[junit4:junit4]   2> 1787 T1127 oasc.RequestHandlers.initHandlersFromConfig created /debug/dump: solr.DumpRequestHandler
[junit4:junit4]   2> 1800 T1127 oashl.XMLLoader.init xsltCacheLifetimeSeconds=60
[junit4:junit4]   2> 1804 T1127 oasc.SolrCore.initDeprecatedSupport WARNING solrconfig.xml uses deprecated <admin/gettableFiles>, Please update your config to use the ShowFileRequestHandler.
[junit4:junit4]   2> 1806 T1127 oasc.SolrCore.initDeprecatedSupport WARNING adding ShowFileRequestHandler with hidden files: [SCHEMA.XML, OLD_SYNONYMS.TXT, STOPWORDS.TXT, PROTWORDS.TXT, OPEN-EXCHANGE-RATES.JSON, SYNONYMS.TXT, CURRENCY.XML, MAPPING-ISOLATIN1ACCENT.TXT]
[junit4:junit4]   2> 1809 T1127 oasc.CachingDirectoryFactory.close Releasing directory:/usr/home/hudson/hudson-slave/workspace/Lucene-Solr-Tests-trunk-java7/solr/build/solr-core/test/J0/./org.apache.solr.cloud.BasicDistributedZkTest-1355724685327/control/data
[junit4:junit4]   2> 1811 T1127 oass.SolrIndexSearcher.<init> Opening Searcher@2dd2d509 main
[junit4:junit4]   2> 1812 T1127 oasu.CommitTracker.<init> Hard AutoCommit: disabled
[junit4:junit4]   2> 1812 T1127 oasu.CommitTracker.<init> Soft AutoCommit: disabled
[junit4:junit4]   2> 1813 T1127 oashc.SpellCheckComponent.inform Initializing spell checkers
[junit4:junit4]   2> 1830 T1127 oass.DirectSolrSpellChecker.init init: {name=direct,classname=DirectSolrSpellChecker,field=lowerfilt,minQueryLength=3}
[junit4:junit4]   2> 1926 T1128 oasc.SolrCore.registerSearcher [collection1] Registered new searcher Searcher@2dd2d509 main{StandardDirectoryReader(segments_1:1)}
[junit4:junit4]   2> 1931 T1127 oasc.ZkController.publish publishing core=collection1 state=down
[junit4:junit4]   2> 1931 T1127 oasc.ZkController.publish numShards not found on descriptor - reading it from system property
[junit4:junit4]   2> 1932 T1107 oazs.PrepRequestProcessor.pRequest Got user-level KeeperException when processing sessionid:0x13ba77d00180003 type:create cxid:0x56 zxid:0x29 txntype:-1 reqpath:n/a Error Path:/solr/overseer/queue Error:KeeperErrorCode = NoNode for /solr/overseer/queue
[junit4:junit4]   2> 2409 T1125 oascc.ZkStateReader.updateClusterState Updating cloud state from ZooKeeper... 
[junit4:junit4]   2> 2410 T1125 oasc.Overseer$ClusterStateUpdater.updateState Update state numShards=1 message={
[junit4:junit4]   2> 	  "operation":"state",
[junit4:junit4]   2> 	  "numShards":"1",
[junit4:junit4]   2> 	  "shard":null,
[junit4:junit4]   2> 	  "roles":null,
[junit4:junit4]   2> 	  "state":"down",
[junit4:junit4]   2> 	  "core":"collection1",
[junit4:junit4]   2> 	  "collection":"control_collection",
[junit4:junit4]   2> 	  "node_name":"127.0.0.1:47425_nud%2Fi",
[junit4:junit4]   2> 	  "base_url":"http://127.0.0.1:47425/nud/i"}
[junit4:junit4]   2> 2410 T1125 oasc.Overseer$ClusterStateUpdater.createCollection Create collection control_collection with numShards 1
[junit4:junit4]   2> 2411 T1125 oasc.Overseer$ClusterStateUpdater.updateState Assigning new node to shard shard=shard1
[junit4:junit4]   2> 2411 T1107 oazs.PrepRequestProcessor.pRequest Got user-level KeeperException when processing sessionid:0x13ba77d00180003 type:create cxid:0x5e zxid:0x2c txntype:-1 reqpath:n/a Error Path:/solr/overseer/queue-work Error:KeeperErrorCode = NoNode for /solr/overseer/queue-work
[junit4:junit4]   2> 2431 T1124 oascc.ZkStateReader$2.process A cluster state change: WatchedEvent state:SyncConnected type:NodeDataChanged path:/clusterstate.json, has occurred - updating... (live nodes size: 1)
[junit4:junit4]   2> 2938 T1127 oasc.CoreContainer.registerCore registering core: collection1
[junit4:junit4]   2> 2938 T1127 oasc.ZkController.register Register shard - core:collection1 address:http://127.0.0.1:47425/nud/i shardId:shard1
[junit4:junit4]   2> 2939 T1127 oascc.SolrZkClient.makePath makePath: /collections/control_collection/leader_elect/shard1/election
[junit4:junit4]   2> 2957 T1107 oazs.PrepRequestProcessor.pRequest Got user-level KeeperException when processing sessionid:0x13ba77d00180003 type:delete cxid:0x7b zxid:0x36 txntype:-1 reqpath:n/a Error Path:/solr/collections/control_collection/leaders Error:KeeperErrorCode = NoNode for /solr/collections/control_collection/leaders
[junit4:junit4]   2> 2958 T1127 oasc.ShardLeaderElectionContext.runLeaderProcess Running the leader process.
[junit4:junit4]   2> 2959 T1107 oazs.PrepRequestProcessor.pRequest Got user-level KeeperException when processing sessionid:0x13ba77d00180003 type:create cxid:0x7c zxid:0x37 txntype:-1 reqpath:n/a Error Path:/solr/overseer Error:KeeperErrorCode = NodeExists for /solr/overseer
[junit4:junit4]   2> 2969 T1127 oasc.ShardLeaderElectionContext.waitForReplicasToComeUp Enough replicas found to continue.
[junit4:junit4]   2> 2970 T1127 oasc.ShardLeaderElectionContext.runLeaderProcess I may be the new leader - try and sync
[junit4:junit4]   2> 2970 T1127 oasc.SyncStrategy.sync Sync replicas to http://127.0.0.1:47425/nud/i/collection1/
[junit4:junit4]   2> 2970 T1127 oasc.SyncStrategy.syncReplicas Sync Success - now sync replicas to me
[junit4:junit4]   2> 2970 T1127 oasc.SyncStrategy.syncToMe http://127.0.0.1:47425/nud/i/collection1/ has no replicas
[junit4:junit4]   2> 2971 T1127 oasc.ShardLeaderElectionContext.runLeaderProcess I am the new leader: http://127.0.0.1:47425/nud/i/collection1/
[junit4:junit4]   2> 2971 T1127 oascc.SolrZkClient.makePath makePath: /collections/control_collection/leaders/shard1
[junit4:junit4]   2> 2976 T1107 oazs.PrepRequestProcessor.pRequest Got user-level KeeperException when processing sessionid:0x13ba77d00180003 type:create cxid:0x86 zxid:0x3b txntype:-1 reqpath:n/a Error Path:/solr/overseer Error:KeeperErrorCode = NodeExists for /solr/overseer
[junit4:junit4]   2> 3446 T1125 oascc.ZkStateReader.updateClusterState Updating cloud state from ZooKeeper... 
[junit4:junit4]   2> 3469 T1124 oascc.ZkStateReader$2.process A cluster state change: WatchedEvent state:SyncConnected type:NodeDataChanged path:/clusterstate.json, has occurred - updating... (live nodes size: 1)
[junit4:junit4]   2> 3540 T1127 oasc.ZkController.register We are http://127.0.0.1:47425/nud/i/collection1/ and leader is http://127.0.0.1:47425/nud/i/collection1/
[junit4:junit4]   2> 3540 T1127 oasc.ZkController.register No LogReplay needed for core=collection1 baseURL=http://127.0.0.1:47425/nud/i
[junit4:junit4]   2> 3540 T1127 oasc.ZkController.checkRecovery I am the leader, no recovery necessary
[junit4:junit4]   2> 3541 T1127 oasc.ZkController.publish publishing core=collection1 state=active
[junit4:junit4]   2> 3541 T1127 oasc.ZkController.publish numShards not found on descriptor - reading it from system property
[junit4:junit4]   2> 3543 T1127 oascc.ZkStateReader.updateClusterState Updating cloud state from ZooKeeper... 
[junit4:junit4]   2> 3544 T1102 oass.SolrDispatchFilter.init user.dir=/usr/home/hudson/hudson-slave/workspace/Lucene-Solr-Tests-trunk-java7/solr/build/solr-core/test/J0
[junit4:junit4]   2> 3545 T1102 oass.SolrDispatchFilter.init SolrDispatchFilter.init() done
[junit4:junit4]   2> 3546 T1102 oascsi.HttpClientUtil.createClient Creating new http client, config:maxConnections=128&maxConnectionsPerHost=32&followRedirects=false
[junit4:junit4]   2> 3563 T1102 oascsi.HttpClientUtil.createClient Creating new http client, config:
[junit4:junit4]   2> 3578 T1102 oaz.ZooKeeper.<init> Initiating client connection, connectString=127.0.0.1:54876/solr sessionTimeout=10000 watcher=org.apache.solr.common.cloud.ConnectionManager@2ccec7c1
[junit4:junit4]   2> 3579 T1102 oascc.ConnectionManager.waitForConnected Waiting for client to connect to ZooKeeper
[junit4:junit4]   2> 3579 T1129 oaz.ClientCnxn$SendThread.logStartConnect Opening socket connection to server localhost/127.0.0.1:54876. Will not attempt to authenticate using SASL (access denied ("javax.security.auth.AuthPermission" "getLoginConfiguration"))
[junit4:junit4]   2> 3580 T1129 oaz.ClientCnxn$SendThread.primeConnection Socket connection established to localhost/127.0.0.1:54876, initiating session
[junit4:junit4]   2> 3580 T1104 oazs.NIOServerCnxnFactory.run Accepted socket connection from /140.211.11.196:20787
[junit4:junit4]   2> 3580 T1104 oazs.ZooKeeperServer.processConnectRequest Client attempting to establish new session at /140.211.11.196:20787
[junit4:junit4]   2> 3582 T1106 oazs.ZooKeeperServer.finishSessionInit Established session 0x13ba77d00180004 with negotiated timeout 10000 for client /140.211.11.196:20787
[junit4:junit4]   2> 3582 T1129 oaz.ClientCnxn$SendThread.onConnected Session establishment complete on server localhost/127.0.0.1:54876, sessionid = 0x13ba77d00180004, negotiated timeout = 10000
[junit4:junit4]   2> 3582 T1130 oascc.ConnectionManager.process Watcher org.apache.solr.common.cloud.ConnectionManager@2ccec7c1 name:ZooKeeperConnection Watcher:127.0.0.1:54876/solr got event WatchedEvent state:SyncConnected type:None path:null path:null type:None
[junit4:junit4]   2> 3582 T1102 oascc.ConnectionManager.waitForConnected Client is connected to ZooKeeper
[junit4:junit4]   2> 3584 T1102 oascc.ZkStateReader.createClusterStateWatchersAndUpdate Updating cluster state from ZooKeeper... 
[junit4:junit4]   2> 3587 T1102 oasc.ChaosMonkey.monkeyLog monkey: init - expire sessions:true cause connection loss:true
[junit4:junit4]   2> 3771 T1102 oejs.Server.doStart jetty-8.1.8.v20121106
[junit4:junit4]   2> 3774 T1102 oejs.AbstractConnector.doStart Started SocketConnector@127.0.0.1:20788
[junit4:junit4]   2> 3774 T1102 oasc.SolrResourceLoader.locateSolrHome JNDI not configured for solr (NoInitialContextEx)
[junit4:junit4]   2> 3775 T1102 oasc.SolrResourceLoader.locateSolrHome using system property solr.solr.home: /usr/home/hudson/hudson-slave/workspace/Lucene-Solr-Tests-trunk-java7/solr/build/solr-core/test/J0/./org.apache.solr.cloud.BasicDistributedZkTest-jetty1-1355724688907
[junit4:junit4]   2> 3776 T1102 oasc.SolrResourceLoader.<init> new SolrResourceLoader for deduced Solr Home: '/usr/home/hudson/hudson-slave/workspace/Lucene-Solr-Tests-trunk-java7/solr/build/solr-core/test/J0/./org.apache.solr.cloud.BasicDistributedZkTest-jetty1-1355724688907/'
[junit4:junit4]   2> 3820 T1102 oass.SolrDispatchFilter.init SolrDispatchFilter.init()
[junit4:junit4]   2> 3820 T1102 oasc.SolrResourceLoader.locateSolrHome JNDI not configured for solr (NoInitialContextEx)
[junit4:junit4]   2> 3821 T1102 oasc.SolrResourceLoader.locateSolrHome using system property solr.solr.home: /usr/home/hudson/hudson-slave/workspace/Lucene-Solr-Tests-trunk-java7/solr/build/solr-core/test/J0/./org.apache.solr.cloud.BasicDistributedZkTest-jetty1-1355724688907
[junit4:junit4]   2> 3821 T1102 oasc.CoreContainer$Initializer.initialize looking for solr.xml: /usr/home/hudson/hudson-slave/workspace/Lucene-Solr-Tests-trunk-java7/solr/build/solr-core/test/J0/./org.apache.solr.cloud.BasicDistributedZkTest-jetty1-1355724688907/solr.xml
[junit4:junit4]   2> 3822 T1102 oasc.CoreContainer.<init> New CoreContainer 628020016
[junit4:junit4]   2> 3822 T1102 oasc.CoreContainer.load Loading CoreContainer using Solr Home: '/usr/home/hudson/hudson-slave/workspace/Lucene-Solr-Tests-trunk-java7/solr/build/solr-core/test/J0/./org.apache.solr.cloud.BasicDistributedZkTest-jetty1-1355724688907/'
[junit4:junit4]   2> 3823 T1102 oasc.SolrResourceLoader.<init> new SolrResourceLoader for directory: '/usr/home/hudson/hudson-slave/workspace/Lucene-Solr-Tests-trunk-java7/solr/build/solr-core/test/J0/./org.apache.solr.cloud.BasicDistributedZkTest-jetty1-1355724688907/'
[junit4:junit4]   2> 3854 T1102 oashc.HttpShardHandlerFactory.getParameter Setting socketTimeout to: 30000
[junit4:junit4]   2> 3855 T1102 oashc.HttpShardHandlerFactory.getParameter Setting urlScheme to: http://
[junit4:junit4]   2> 3855 T1102 oashc.HttpShardHandlerFactory.getParameter Setting connTimeout to: 15000
[junit4:junit4]   2> 3856 T1102 oashc.HttpShardHandlerFactory.getParameter Setting maxConnectionsPerHost to: 20
[junit4:junit4]   2> 3856 T1102 oashc.HttpShardHandlerFactory.getParameter Setting corePoolSize to: 0
[junit4:junit4]   2> 3857 T1102 oashc.HttpShardHandlerFactory.getParameter Setting maximumPoolSize to: 2147483647
[junit4:junit4]   2> 3857 T1102 oashc.HttpShardHandlerFactory.getParameter Setting maxThreadIdleTime to: 5
[junit4:junit4]   2> 3857 T1102 oashc.HttpShardHandlerFactory.getParameter Setting sizeOfQueue to: -1
[junit4:junit4]   2> 3858 T1102 oashc.HttpShardHandlerFactory.getParameter Setting fairnessPolicy to: false
[junit4:junit4]   2> 3858 T1102 oascsi.HttpClientUtil.createClient Creating new http client, config:maxConnectionsPerHost=20&maxConnections=10000&socketTimeout=30000&connTimeout=15000&retry=false
[junit4:junit4]   2> 3881 T1102 oasc.CoreContainer.load Registering Log Listener
[junit4:junit4]   2> 3901 T1102 oasc.CoreContainer.initZooKeeper Zookeeper client=127.0.0.1:54876/solr
[junit4:junit4]   2> 3902 T1102 oasc.ZkController.checkChrootPath zkHost includes chroot
[junit4:junit4]   2> 3903 T1102 oaz.ZooKeeper.<init> Initiating client connection, connectString=127.0.0.1:54876 sessionTimeout=60000 watcher=org.apache.solr.common.cloud.ConnectionManager@384fb67
[junit4:junit4]   2> 3904 T1102 oascc.ConnectionManager.waitForConnected Waiting for client to connect to ZooKeeper
[junit4:junit4]   2> 3904 T1140 oaz.ClientCnxn$SendThread.logStartConnect Opening socket connection to server localhost/127.0.0.1:54876. Will not attempt to authenticate using SASL (access denied ("javax.security.auth.AuthPermission" "getLoginConfiguration"))
[junit4:junit4]   2> 3905 T1140 oaz.ClientCnxn$SendThread.primeConnection Socket connection established to localhost/127.0.0.1:54876, initiating session
[junit4:junit4]   2> 3905 T1104 oazs.NIOServerCnxnFactory.run Accepted socket connection from /140.211.11.196:20790
[junit4:junit4]   2> 3906 T1104 oazs.ZooKeeperServer.processConnectRequest Client attempting to establish new session at /140.211.11.196:20790
[junit4:junit4]   2> 3908 T1106 oazs.ZooKeeperServer.finishSessionInit Established session 0x13ba77d00180005 with negotiated timeout 20000 for client /140.211.11.196:20790
[junit4:junit4]   2> 3908 T1140 oaz.ClientCnxn$SendThread.onConnected Session establishment complete on server localhost/127.0.0.1:54876, sessionid = 0x13ba77d00180005, negotiated timeout = 20000
[junit4:junit4]   2> 3908 T1141 oascc.ConnectionManager.process Watcher org.apache.solr.common.cloud.ConnectionManager@384fb67 name:ZooKeeperConnection Watcher:127.0.0.1:54876 got event WatchedEvent state:SyncConnected type:None path:null path:null type:None
[junit4:junit4]   2> 3909 T1102 oascc.ConnectionManager.waitForConnected Client is connected to ZooKeeper
[junit4:junit4]   2> 3910 T1107 oazs.PrepRequestProcessor.pRequest2Txn Processed session termination for sessionid: 0x13ba77d00180005
[junit4:junit4]   2> 3922 T1141 oaz.ClientCnxn$EventThread.run EventThread shut down
[junit4:junit4]   2> 3922 T1104 oazs.NIOServerCnxn.closeSock Closed socket connection for client /140.211.11.196:20790 which had sessionid 0x13ba77d00180005
[junit4:junit4]   2> 3922 T1102 oaz.ZooKeeper.close Session: 0x13ba77d00180005 closed
[junit4:junit4]   2> 3923 T1102 oascsi.HttpClientUtil.createClient Creating new http client, config:maxConnections=500&maxConnectionsPerHost=16&socketTimeout=15000&connTimeout=30000
[junit4:junit4]   2> 3936 T1102 oaz.ZooKeeper.<init> Initiating client connection, connectString=127.0.0.1:54876/solr sessionTimeout=30000 watcher=org.apache.solr.common.cloud.ConnectionManager@a0a3409
[junit4:junit4]   2> 3937 T1102 oascc.ConnectionManager.waitForConnected Waiting for client to connect to ZooKeeper
[junit4:junit4]   2> 3937 T1142 oaz.ClientCnxn$SendThread.logStartConnect Opening socket connection to server localhost/127.0.0.1:54876. Will not attempt to authenticate using SASL (access denied ("javax.security.auth.AuthPermission" "getLoginConfiguration"))
[junit4:junit4]   2> 3938 T1142 oaz.ClientCnxn$SendThread.primeConnection Socket connection established to localhost/127.0.0.1:54876, initiating session
[junit4:junit4]   2> 3938 T1104 oazs.NIOServerCnxnFactory.run Accepted socket connection from /140.211.11.196:20791
[junit4:junit4]   2> 3938 T1104 oazs.ZooKeeperServer.processConnectRequest Client attempting to establish new session at /140.211.11.196:20791
[junit4:junit4]   2> 3940 T1106 oazs.ZooKeeperServer.finishSessionInit Established session 0x13ba77d00180006 with negotiated timeout 20000 for client /140.211.11.196:20791
[junit4:junit4]   2> 3940 T1142 oaz.ClientCnxn$SendThread.onConnected Session establishment complete on server localhost/127.0.0.1:54876, sessionid = 0x13ba77d00180006, negotiated timeout = 20000
[junit4:junit4]   2> 3940 T1143 oascc.ConnectionManager.process Watcher org.apache.solr.common.cloud.ConnectionManager@a0a3409 name:ZooKeeperConnection Watcher:127.0.0.1:54876/solr got event WatchedEvent state:SyncConnected type:None path:null path:null type:None
[junit4:junit4]   2> 3940 T1102 oascc.ConnectionManager.waitForConnected Client is connected to ZooKeeper
[junit4:junit4]   2> 3942 T1107 oazs.PrepRequestProcessor.pRequest Got user-level KeeperException when processing sessionid:0x13ba77d00180006 type:create cxid:0x1 zxid:0x49 txntype:-1 reqpath:n/a Error Path:/solr/overseer Error:KeeperErrorCode = NodeExists for /solr/overseer
[junit4:junit4]   2> 3943 T1107 oazs.PrepRequestProcessor.pRequest Got user-level KeeperException when processing sessionid:0x13ba77d00180006 type:create cxid:0x2 zxid:0x4a txntype:-1 reqpath:n/a Error Path:/solr/overseer Error:KeeperErrorCode = NodeExists for /solr/overseer
[junit4:junit4]   2> 3951 T1102 oasc.ZkController.createEphemeralLiveNode Register node as live in ZooKeeper:/live_nodes/127.0.0.1:20788_nud%2Fi
[junit4:junit4]   2> 3951 T1107 oazs.PrepRequestProcessor.pRequest Got user-level KeeperException when processing sessionid:0x13ba77d00180006 type:delete cxid:0x4 zxid:0x4b txntype:-1 reqpath:n/a Error Path:/solr/live_nodes/127.0.0.1:20788_nud%2Fi Error:KeeperErrorCode = NoNode for /solr/live_nodes/127.0.0.1:20788_nud%2Fi
[junit4:junit4]   2> 3952 T1102 oascc.SolrZkClient.makePath makePath: /live_nodes/127.0.0.1:20788_nud%2Fi
[junit4:junit4]   2> 3955 T1124 oascc.ZkStateReader$2.process A cluster state change: WatchedEvent state:SyncConnected type:NodeChildrenChanged path:/live_nodes, has occurred - updating... (live nodes size: 1)
[junit4:junit4]   2> 3957 T1130 oascc.ZkStateReader$3.process Updating live nodes... (2)
[junit4:junit4]   2> 3963 T1124 oascc.ZkStateReader$3.process Updating live nodes... (2)
[junit4:junit4]   2> 3964 T1102 oascc.ZkStateReader.createClusterStateWatchersAndUpdate Updating cluster state from ZooKeeper... 
[junit4:junit4]   2> 3973 T1144 oasc.CoreContainer.create Creating SolrCore 'collection1' using instanceDir: /usr/home/hudson/hudson-slave/workspace/Lucene-Solr-Tests-trunk-java7/solr/build/solr-core/test/J0/./org.apache.solr.cloud.BasicDistributedZkTest-jetty1-1355724688907/collection1
[junit4:junit4]   2> 3973 T1144 oasc.ZkController.createCollectionZkNode Check for collection zkNode:collection1
[junit4:junit4]   2> 3974 T1144 oasc.ZkController.createCollectionZkNode Collection zkNode exists
[junit4:junit4]   2> 3974 T1144 oasc.ZkController.readConfigName Load collection config from:/collections/collection1
[junit4:junit4]   2> 3976 T1144 oasc.SolrResourceLoader.<init> new SolrResourceLoader for directory: '/usr/home/hudson/hudson-slave/workspace/Lucene-Solr-Tests-trunk-java7/solr/build/solr-core/test/J0/./org.apache.solr.cloud.BasicDistributedZkTest-jetty1-1355724688907/collection1/'
[junit4:junit4]   2> 3978 T1144 oasc.SolrResourceLoader.replaceClassLoader Adding 'file:/usr/home/hudson/hudson-slave/workspace/Lucene-Solr-Tests-trunk-java7/solr/build/solr-core/test/J0/org.apache.solr.cloud.BasicDistributedZkTest-jetty1-1355724688907/collection1/lib/README' to classloader
[junit4:junit4]   2> 3979 T1144 oasc.SolrResourceLoader.replaceClassLoader Adding 'file:/usr/home/hudson/hudson-slave/workspace/Lucene-Solr-Tests-trunk-java7/solr/build/solr-core/test/J0/org.apache.solr.cloud.BasicDistributedZkTest-jetty1-1355724688907/collection1/lib/classes/' to classloader
[junit4:junit4]   2> 3992 T1125 oascc.ZkStateReader.updateClusterState Updating cloud state from ZooKeeper... 
[junit4:junit4]   2> 3993 T1125 oasc.Overseer$ClusterStateUpdater.updateState Update state numShards=1 message={
[junit4:junit4]   2> 	  "operation":"state",
[junit4:junit4]   2> 	  "numShards":"1",
[junit4:junit4]   2> 	  "shard":"shard1",
[junit4:junit4]   2> 	  "roles":null,
[junit4:junit4]   2> 	  "state":"active",
[junit4:junit4]   2> 	  "core":"collection1",
[junit4:junit4]   2> 	  "collection":"control_collection",
[junit4:junit4]   2> 	  "node_name":"127.0.0.1:47425_nud%2Fi",
[junit4:junit4]   2> 	  "base_url":"http://127.0.0.1:47425/nud/i"}
[junit4:junit4]   2> 4006 T1143 oascc.ZkStateReader$2.process A cluster state change: WatchedEvent state:SyncConnected type:NodeDataChanged path:/clusterstate.json, has occurred - updating... (live nodes size: 2)
[junit4:junit4]   2> 4006 T1130 oascc.ZkStateReader$2.process A cluster state change: WatchedEvent state:SyncConnected type:NodeDataChanged path:/clusterstate.json, has occurred - updating... (live nodes size: 2)
[junit4:junit4]   2> 4006 T1124 oascc.ZkStateReader$2.process A cluster state change: WatchedEvent state:SyncConnected type:NodeDataChanged path:/clusterstate.json, has occurred - updating... (live nodes size: 2)
[junit4:junit4]   2> 4040 T1144 oasc.SolrConfig.<init> Using Lucene MatchVersion: LUCENE_50
[junit4:junit4]   2> 4111 T1144 oasc.SolrConfig.<init> Loaded SolrConfig: solrconfig.xml
[junit4:junit4]   2> 4212 T1144 oass.IndexSchema.readSchema Reading Solr Schema
[junit4:junit4]   2> 4219 T1144 oass.IndexSchema.readSchema Schema name=test
[junit4:junit4]   2> 4957 T1144 oass.OpenExchangeRatesOrgProvider.init Initialized with rates=open-exchange-rates.json, refreshInterval=1440.
[junit4:junit4]   2> 4971 T1144 oass.IndexSchema.readSchema default search field in schema is text
[junit4:junit4]   2> 4977 T1144 oass.IndexSchema.readSchema unique key field: id
[junit4:junit4]   2> 5000 T1144 oass.FileExchangeRateProvider.reload Reloading exchange rates from file currency.xml
[junit4:junit4]   2> 5008 T1144 oass.FileExchangeRateProvider.reload Reloading exchange rates from file currency.xml
[junit4:junit4]   2> 5015 T1144 oass.OpenExchangeRatesOrgProvider.reload Reloading exchange rates from open-exchange-rates.json
[junit4:junit4]   2> 5017 T1144 oass.OpenExchangeRatesOrgProvider.reload Reloading exchange rates from open-exchange-rates.json
[junit4:junit4]   2> 5019 T1144 oasc.SolrCore.<init> [collection1] Opening new SolrCore at /usr/home/hudson/hudson-slave/workspace/Lucene-Solr-Tests-trunk-java7/solr/build/solr-core/test/J0/./org.apache.solr.cloud.BasicDistributedZkTest-jetty1-1355724688907/collection1/, dataDir=./org.apache.solr.cloud.BasicDistributedZkTest-1355724685327/jetty1/
[junit4:junit4]   2> 5019 T1144 oasc.JmxMonitoredMap.<init> JMX monitoring is enabled. Adding Solr mbeans to JMX Server: com.sun.jmx.mbeanserver.JmxMBeanServer@59a63e10
[junit4:junit4]   2> 5020 T1144 oasc.SolrCore.initDirectoryFactory solr.NRTCachingDirectoryFactory
[junit4:junit4]   2> 5022 T1144 oasc.CachingDirectoryFactory.get return new directory for /usr/home/hudson/hudson-slave/workspace/Lucene-Solr-Tests-trunk-java7/solr/build/solr-core/test/J0/./org.apache.solr.cloud.BasicDistributedZkTest-1355724685327/jetty1 forceNew:false
[junit4:junit4]   2> 5023 T1144 oasc.CachingDirectoryFactory.close Releasing directory:/usr/home/hudson/hudson-slave/workspace/Lucene-Solr-Tests-trunk-java7/solr/build/solr-core/test/J0/./org.apache.solr.cloud.BasicDistributedZkTest-1355724685327/jetty1
[junit4:junit4]   2> 5023 T1144 oasc.SolrCore.getNewIndexDir New index directory detected: old=null new=./org.apache.solr.cloud.BasicDistributedZkTest-1355724685327/jetty1/index/
[junit4:junit4]   2> 5024 T1144 oasc.SolrCore.initIndex WARNING [collection1] Solr index directory './org.apache.solr.cloud.BasicDistributedZkTest-1355724685327/jetty1/index' doesn't exist. Creating new index...
[junit4:junit4]   2> 5026 T1144 oasc.CachingDirectoryFactory.get return new directory for /usr/home/hudson/hudson-slave/workspace/Lucene-Solr-Tests-trunk-java7/solr/build/solr-core/test/J0/./org.apache.solr.cloud.BasicDistributedZkTest-1355724685327/jetty1/index forceNew:false
[junit4:junit4]   2> 5035 T1144 oasc.SolrDeletionPolicy.onCommit SolrDeletionPolicy.onCommit: commits:num=1
[junit4:junit4]   2> 		commit{dir=RateLimitedDirectoryWrapper(NRTCachingDirectory(org.apache.lucene.store.NIOFSDirectory@/usr/home/hudson/hudson-slave/workspace/Lucene-Solr-Tests-trunk-java7/solr/build/solr-core/test/J0/org.apache.solr.cloud.BasicDistributedZkTest-1355724685327/jetty1/index lockFactory=org.apache.lucene.store.NativeFSLockFactory@60c3a4bf; maxCacheMB=48.0 maxMergeSizeMB=4.0)),segFN=segments_1,generation=1,filenames=[segments_1]
[junit4:junit4]   2> 5035 T1144 oasc.SolrDeletionPolicy.updateCommits newest commit = 1[segments_1]
[junit4:junit4]   2> 5036 T1144 oasc.CachingDirectoryFactory.close Releasing directory:/usr/home/hudson/hudson-slave/workspace/Lucene-Solr-Tests-trunk-java7/solr/build/solr-core/test/J0/./org.apache.solr.cloud.BasicDistributedZkTest-1355724685327/jetty1/index
[junit4:junit4]   2> 5037 T1144 oasc.SolrCore.initWriters created xml: solr.XMLResponseWriter
[junit4:junit4]   2> 5040 T1144 oasup.UpdateRequestProcessorChain.init inserting DistributedUpdateProcessorFactory into updateRequestProcessorChain "dedupe"
[junit4:junit4]   2> 5041 T1144 oasup.UpdateRequestProcessorChain.init inserting DistributedUpdateProcessorFactory into updateRequestProcessorChain "dedupe-allfields"
[junit4:junit4]   2> 5041 T1144 oasup.UpdateRequestProcessorChain.init inserting DistributedUpdateProcessorFactory into updateRequestProcessorChain "stored_sig"
[junit4:junit4]   2> 5042 T1144 oasup.UpdateRequestProcessorChain.init inserting DistributedUpdateProcessorFactory into updateRequestProcessorChain "uniq-fields"
[junit4:junit4]   2> 5043 T1144 oasup.UpdateRequestProcessorChain.init inserting DistributedUpdateProcessorFactory into updateRequestProcessorChain "distrib-dup-test-chain-implicit"
[junit4:junit4]   2> 5043 T1144 oasc.RequestHandlers.initHandlersFromConfig adding lazy requestHandler: solr.ReplicationHandler
[junit4:junit4]   2> 5044 T1144 oasc.RequestHandlers.initHandlersFromConfig created /replication: solr.ReplicationHandler
[junit4:junit4]   2> 5046 T1144 oasc.RequestHandlers.initHandlersFromConfig created standard: solr.StandardRequestHandler
[junit4:junit4]   2> 5048 T1144 oasc.RequestHandlers.initHandlersFromConfig created /get: solr.RealTimeGetHandler
[junit4:junit4]   2> 5050 T1144 oasc.RequestHandlers.initHandlersFromConfig created dismax: solr.SearchHandler
[junit4:junit4]   2> 5052 T1144 oasc.RequestHandlers.initHandlersFromConfig created mock: org.apache.solr.core.MockQuerySenderListenerReqHandler
[junit4:junit4]   2> 5053 T1144 oasc.RequestHandlers.initHandlersFromConfig created /admin/: org.apache.solr.handler.admin.AdminHandlers
[junit4:junit4]   2> 5054 T1144 oasc.RequestHandlers.initHandlersFromConfig created defaults: solr.StandardRequestHandler
[junit4:junit4]   2> 5055 T1144 oasc.RequestHandlers.initHandlersFromConfig adding lazy requestHandler: solr.StandardRequestHandler
[junit4:junit4]   2> 5055 T1144 oasc.RequestHandlers.initHandlersFromConfig created lazy: solr.StandardRequestHandler
[junit4:junit4]   2> 5057 T1144 oasc.RequestHandlers.initHandlersFromConfig created /update: solr.UpdateRequestHandler
[junit4:junit4]   2> 5059 T1144 oasc.RequestHandlers.initHandlersFromConfig created /terms: org.apache.solr.handler.component.SearchHandler
[junit4:junit4]   2> 5061 T1144 oasc.RequestHandlers.initHandlersFromConfig created spellCheckCompRH: org.apache.solr.handler.component.SearchHandler
[junit4:junit4]   2> 5062 T1144 oasc.RequestHandlers.initHandlersFromConfig created spellCheckCompRH_Direct: org.apache.solr.handler.component.SearchHandler
[junit4:junit4]   2> 5064 T1144 oasc.RequestHandlers.initHandlersFromConfig created spellCheckWithWordbreak: org.apache.solr.handler.component.SearchHandler
[junit4:junit4]   2> 5066 T1144 oasc.RequestHandlers.initHandlersFromConfig created spellCheckWithWordbreak_Direct: org.apache.solr.handler.component.SearchHandler
[junit4:junit4]   2> 5068 T1144 oasc.RequestHandlers.initHandlersFromConfig created spellCheckCompRH1: org.apache.solr.handler.component.SearchHandler
[junit4:junit4]   2> 5069 T1144 oasc.RequestHandlers.initHandlersFromConfig created mltrh: org.apache.solr.handler.component.SearchHandler
[junit4:junit4]   2> 5071 T1144 oasc.RequestHandlers.initHandlersFromConfig created tvrh: org.apache.solr.handler.component.SearchHandler
[junit4:junit4]   2> 5072 T1144 oasc.RequestHandlers.initHandlersFromConfig created /mlt: solr.MoreLikeThisHandler
[junit4:junit4]   2> 5074 T1144 oasc.RequestHandlers.initHandlersFromConfig created /debug/dump: solr.DumpRequestHandler
[junit4:junit4]   2> 5094 T1144 oashl.XMLLoader.init xsltCacheLifetimeSeconds=60
[junit4:junit4]   2> 5102 T1144 oasc.SolrCore.initDeprecatedSupport WARNING solrconfig.xml uses deprecated <admin/gettableFiles>, Please update your config to use the ShowFileRequestHandler.
[junit4:junit4]   2> 5105 T1144 oasc.SolrCore.initDeprecatedSupport WARNING adding ShowFileRequestHandler with hidden files: [SCHEMA.XML, OLD_SYNONYMS.TXT, STOPWORDS.TXT, PROTWORDS.TXT, OPEN-EXCHANGE-RATES.JSON, SYNONYMS.TXT, CURRENCY.XML, MAPPING-ISOLATIN1ACCENT.TXT]
[junit4:junit4]   2> 5108 T1144 oasc.CachingDirectoryFactory.close Releasing directory:/usr/home/hudson/hudson-slave/workspace/Lucene-Solr-Tests-trunk-java7/solr/build/solr-core/test/J0/./org.apache.solr.cloud.BasicDistributedZkTest-1355724685327/jetty1
[junit4:junit4]   2> 5111 T1144 oass.SolrIndexSearcher.<init> Opening Searcher@cab39ef main
[junit4:junit4]   2> 5113 T1144 oasu.CommitTracker.<init> Hard AutoCommit: disabled
[junit4:junit4]   2> 5113 T1144 oasu.CommitTracker.<init> Soft AutoCommit: disabled
[junit4:junit4]   2> 5114 T1144 oashc.SpellCheckComponent.inform Initializing spell checkers
[junit4:junit4]   2> 5124 T1144 oass.DirectSolrSpellChecker.init init: {name=direct,classname=DirectSolrSpellChecker,field=lowerfilt,minQueryLength=3}
[junit4:junit4]   2> 5219 T1145 oasc.SolrCore.registerSearcher [collection1] Registered new searcher Searcher@cab39ef main{StandardDirectoryReader(segments_1:1)}
[junit4:junit4]   2> 5225 T1144 oasc.ZkController.publish publishing core=collection1 state=down
[junit4:junit4]   2> 5225 T1144 oasc.ZkController.publish numShards not found on descriptor - reading it from system property
[junit4:junit4]   2> 5519 T1125 oascc.ZkStateReader.updateClusterState Updating cloud state from ZooKeeper... 
[junit4:junit4]   2> 5520 T1125 oasc.Overseer$ClusterStateUpdater.updateState Update state numShards=2 message={
[junit4:junit4]   2> 	  "operation":"state",
[junit4:junit4]   2> 	  "numShards":"2",
[junit4:junit4]   2> 	  "shard":null,
[junit4:junit4]   2> 	  "roles":null,
[junit4:junit4]   2> 	  "state":"down",
[junit4:junit4]   2> 	  "core":"collection1",
[junit4:junit4]   2> 	  "collection":"collection1",
[junit4:junit4]   2> 	  "node_name":"127.0.0.1:20788_nud%2Fi",
[junit4:junit4]   2> 	  "base_url":"http://127.0.0.1:20788/nud/i"}
[junit4:junit4]   2> 5520 T1125 oasc.Overseer$ClusterStateUpdater.createCollection Create collection collection1 with numShards 2
[junit4:junit4]   2> 5520 T1125 oasc.Overseer$ClusterStateUpdater.updateState Assigning new node to shard shard=shard1
[junit4:junit4]   2> 5614 T1124 oascc.ZkStateReader$2.process A cluster state change: WatchedEvent state:SyncConnected type:NodeDataChanged path:/clusterstate.json, has occurred - updating... (live nodes size: 2)
[junit4:junit4]   2> 5614 T1130 oascc.ZkStateReader$2.process A cluster state change: WatchedEvent state:SyncConnected type:NodeDataChanged path:/clusterstate.json, has occurred - updating... (live nodes size: 2)
[junit4:junit4]   2> 5614 T1143 oascc.ZkStateReader$2.process A cluster state change: WatchedEvent state:SyncConnected type:NodeDataChanged path:/clusterstate.json, has occurred - updating... (live nodes size: 2)
[junit4:junit4]   2> 5728 T1144 oasc.CoreContainer.registerCore registering core: collection1
[junit4:junit4]   2> 5728 T1144 oasc.ZkController.register Register shard - core:collection1 address:http://127.0.0.1:20788/nud/i shardId:shard1
[junit4:junit4]   2> 5729 T1144 oascc.SolrZkClient.makePath makePath: /collections/collection1/leader_elect/shard1/election
[junit4:junit4]   2> 5807 T1107 oazs.PrepRequestProcessor.pRequest Got user-level KeeperException when processing sessionid:0x13ba77d00180006 type:delete cxid:0x45 zxid:0x5b txntype:-1 reqpath:n/a Error Path:/solr/collections/collection1/leaders Error:KeeperErrorCode = NoNode for /solr/collections/collection1/leaders
[junit4:junit4]   2> 5834 T1144 oasc.ShardLeaderElectionContext.runLeaderProcess Running the leader process.
[junit4:junit4]   2> 5835 T1107 oazs.PrepRequestProcessor.pRequest Got user-level KeeperException when processing sessionid:0x13ba77d00180006 type:create cxid:0x46 zxid:0x5c txntype:-1 reqpath:n/a Error Path:/solr/overseer Error:KeeperErrorCode = NodeExists for /solr/overseer
[junit4:junit4]   2> 5866 T1144 oasc.ShardLeaderElectionContext.waitForReplicasToComeUp Enough replicas found to continue.
[junit4:junit4]   2> 5866 T1144 oasc.ShardLeaderElectionContext.runLeaderProcess I may be the new leader - try and sync
[junit4:junit4]   2> 5866 T1144 oasc.SyncStrategy.sync Sync replicas to http://127.0.0.1:20788/nud/i/collection1/
[junit4:junit4]   2> 5867 T1144 oasc.SyncStrategy.syncReplicas Sync Success - now sync replicas to me
[junit4:junit4]   2> 5867 T1144 oasc.SyncStrategy.syncToMe http://127.0.0.1:20788/nud/i/collection1/ has no replicas
[junit4:junit4]   2> 5867 T1144 oasc.ShardLeaderElectionContext.runLeaderProcess I am the new leader: http://127.0.0.1:20788/nud/i/collection1/
[junit4:junit4]   2> 5868 T1144 oascc.SolrZkClient.makePath makePath: /collections/collection1/leaders/shard1
[junit4:junit4]   2> 5910 T1107 oazs.PrepRequestProcessor.pRequest Got user-level KeeperException when processing sessionid:0x13ba77d00180006 type:create cxid:0x50 zxid:0x60 txntype:-1 reqpath:n/a Error Path:/solr/overseer Error:KeeperErrorCode = NodeExists for /solr/overseer
[junit4:junit4]   2> 6120 T1125 oascc.ZkStateReader.updateClusterState Updating cloud state from ZooKeeper... 
[junit4:junit4]   2> 6141 T1124 oascc.ZkStateReader$2.process A cluster state change: WatchedEvent state:SyncConnected type:NodeDataChanged path:/clusterstate.json, has occurred - updating... (live nodes size: 2)
[junit4:junit4]   2> 6141 T1130 oascc.ZkStateReader$2.process A cluster state change: WatchedEvent state:SyncConnected type:NodeDataChanged path:/clusterstate.json, has occurred - updating... (live nodes size: 2)
[junit4:junit4]   2> 6141 T1143 oascc.ZkStateReader$2.process A cluster state change: WatchedEvent state:SyncConnected type:NodeDataChanged path:/clusterstate.json, has occurred - updating... (live nodes size: 2)
[junit4:junit4]   2> 6177 T1144 oasc.ZkController.register We are http://127.0.0.1:20788/nud/i/collection1/ and leader is http://127.0.0.1:20788/nud/i/collection1/
[junit4:junit4]   2> 6177 T1144 oasc.ZkController.register No LogReplay needed for core=collection1 baseURL=http://127.0.0.1:20788/nud/i
[junit4:junit4]   2> 6177 T1144 oasc.ZkController.checkRecovery I am the leader, no recovery necessary
[junit4:junit4]   2> 6178 T1144 oasc.ZkController.publish publishing core=collection1 state=active
[junit4:junit4]   2> 6178 T1144 oasc.ZkController.publish numShards not found on descriptor - reading it from system property
[junit4:junit4]   2> 6184 T1144 oascc.ZkStateReader.updateClusterState Updating cloud state from ZooKeeper... 
[junit4:junit4]   2> 6185 T1102 oass.SolrDispatchFilter.init user.dir=/usr/home/hudson/hudson-slave/workspace/Lucene-Solr-Tests-trunk-java7/solr/build/solr-core/test/J0
[junit4:junit4]   2> 6186 T1102 oass.SolrDispatchFilter.init SolrDispatchFilter.init() done
[junit4:junit4]   2> 6187 T1102 oascsi.HttpClientUtil.createClient Creating new http client, config:maxConnections=128&maxConnectionsPerHost=32&followRedirects=false
[junit4:junit4]   2> 6373 T1102 oejs.Server.doStart jetty-8.1.8.v20121106
[junit4:junit4]   2> 6376 T1102 oejs.AbstractConnector.doStart Started SocketConnector@127.0.0.1:20794
[junit4:junit4]   2> 6377 T1102 oasc.SolrResourceLoader.locateSolrHome JNDI not configured for solr (NoInitialContextEx)
[junit4:junit4]   2> 6378 T1102 oasc.SolrResourceLoader.locateSolrHome using system property solr.solr.home: /usr/home/hudson/hudson-slave/workspace/Lucene-Solr-Tests-trunk-java7/solr/build/solr-core/test/J0/./org.apache.solr.cloud.BasicDistributedZkTest-jetty2-1355724691522
[junit4:junit4]   2> 6378 T1102 oasc.SolrResourceLoader.<init> new SolrResourceLoader for deduced Solr Home: '/usr/home/hudson/hudson-slave/workspace/Lucene-Solr-Tests-trunk-java7/solr/build/solr-core/test/J0/./org.apache.solr.cloud.BasicDistributedZkTest-jetty2-1355724691522/'
[junit4:junit4]   2> 6422 T1102 oass.SolrDispatchFilter.init SolrDispatchFilter.init()
[junit4:junit4]   2> 6423 T1102 oasc.SolrResourceLoader.locateSolrHome JNDI not configured for solr (NoInitialContextEx)
[junit4:junit4]   2> 6423 T1102 oasc.SolrResourceLoader.locateSolrHome using system property solr.solr.home: /usr/home/hudson/hudson-slave/workspace/Lucene-Solr-Tests-trunk-java7/solr/build/solr-core/test/J0/./org.apache.solr.cloud.BasicDistributedZkTest-jetty2-1355724691522
[junit4:junit4]   2> 6424 T1102 oasc.CoreContainer$Initializer.initialize looking for solr.xml: /usr/home/hudson/hudson-slave/workspace/Lucene-Solr-Tests-trunk-java7/solr/build/solr-core/test/J0/./org.apache.solr.cloud.BasicDistributedZkTest-jetty2-1355724691522/solr.xml
[junit4:junit4]   2> 6424 T1102 oasc.CoreContainer.<init> New CoreContainer 663962491
[junit4:junit4]   2> 6425 T1102 oasc.CoreContainer.load Loading CoreContainer using Solr Home: '/usr/home/hudson/hudson-slave/workspace/Lucene-Solr-Tests-trunk-java7/solr/build/solr-core/test/J0/./org.apache.solr.cloud.BasicDistributedZkTest-jetty2-1355724691522/'
[junit4:junit4]   2> 6425 T1102 oasc.SolrResourceLoader.<init> new SolrResourceLoader for directory: '/usr/home/hudson/hudson-slave/workspace/Lucene-Solr-Tests-trunk-java7/solr/build/solr-core/test/J0/./org.apache.solr.cloud.BasicDistributedZkTest-jetty2-1355724691522/'
[junit4:junit4]   2> 6455 T1102 oashc.HttpShardHandlerFactory.getParameter Setting socketTimeout to: 30000
[junit4:junit4]   2> 6456 T1102 oashc.HttpShardHandlerFactory.getParameter Setting urlScheme to: http://
[junit4:junit4]   2> 6456 T1102 oashc.HttpShardHandlerFactory.getParameter Setting connTimeout to: 15000
[junit4:junit4]   2> 6457 T1102 oashc.HttpShardHandlerFactory.getParameter Setting maxConnectionsPerHost to: 20
[junit4:junit4]   2> 6457 T1102 oashc.HttpShardHandlerFactory.getParameter Setting corePoolSize to: 0
[junit4:junit4]   2> 6458 T1102 oashc.HttpShardHandlerFactory.getParameter Setting maximumPoolSize to: 2147483647
[junit4:junit4]   2> 6458 T1102 oashc.HttpShardHandlerFactory.getParameter Setting maxThreadIdleTime to: 5
[junit4:junit4]   2> 6458 T1102 oashc.HttpShardHandlerFactory.getParameter Setting sizeOfQueue to: -1
[junit4:junit4]   2> 6459 T1102 oashc.HttpShardHandlerFactory.getParameter Setting fairnessPolicy to: false
[junit4:junit4]   2> 6459 T1102 oascsi.HttpClientUtil.createClient Creating new http client, config:maxConnectionsPerHost=20&maxConnections=10000&socketTimeout=30000&connTimeout=15000&retry=false
[junit4:junit4]   2> 6480 T1102 oasc.CoreContainer.load Registering Log Listener
[junit4:junit4]   2> 6500 T1102 oasc.CoreContainer.initZooKeeper Zookeeper client=127.0.0.1:54876/solr
[junit4:junit4]   2> 6500 T1102 oasc.ZkController.checkChrootPath zkHost includes chroot
[junit4:junit4]   2> 6501 T1102 oaz.ZooKeeper.<init> Initiating client connection, connectString=127.0.0.1:54876 sessionTimeout=60000 watcher=org.apache.solr.common.cloud.ConnectionManager@724bb435
[junit4:junit4]   2> 6502 T1102 oascc.ConnectionManager.waitForConnected Waiting for client to connect to ZooKeeper
[junit4:junit4]   2> 6503 T1155 oaz.ClientCnxn$SendThread.logStartConnect Opening socket connection to server localhost/127.0.0.1:54876. Will not attempt to authenticate using SASL (access denied ("javax.security.auth.AuthPermission" "getLoginConfiguration"))
[junit4:junit4]   2> 6503 T1155 oaz.ClientCnxn$SendThread.primeConnection Socket connection established to localhost/127.0.0.1:54876, initiating session
[junit4:junit4]   2> 6504 T1104 oazs.NIOServerCnxnFactory.run Accepted socket connection from /140.211.11.196:20795
[junit4:junit4]   2> 6504 T1104 oazs.ZooKeeperServer.processConnectRequest Client attempting to establish new session at /140.211.11.196:20795
[junit4:junit4]   2> 6510 T1106 oazs.ZooKeeperServer.finishSessionInit Established session 0x13ba77d00180007 with negotiated timeout 20000 for client /140.211.11.196:20795
[junit4:junit4]   2> 6510 T1155 oaz.ClientCnxn$SendThread.onConnected Session establishment complete on server localhost/127.0.0.1:54876, sessionid = 0x13ba77d00180007, negotiated timeout = 20000
[junit4:junit4]   2> 6510 T1156 oascc.ConnectionManager.process Watcher org.apache.solr.common.cloud.ConnectionManager@724bb435 name:ZooKeeperConnection Watcher:127.0.0.1:54876 got event WatchedEvent state:SyncConnected type:None path:null path:null type:None
[junit4:junit4]   2> 6510 T1102 oascc.ConnectionManager.waitForConnected Client is connected to ZooKeeper
[junit4:junit4]   2> 6512 T1107 oazs.PrepRequestProcessor.pRequest2Txn Processed session termination for sessionid: 0x13ba77d00180007
[junit4:junit4]   2> 6521 T1156 oaz.ClientCnxn$EventThread.run EventThread shut down
[junit4:junit4]   2> 6521 T1104 oazs.NIOServerCnxn.closeSock Closed socket connection for client /140.211.11.196:20795 which had sessionid 0x13ba77d00180007
[junit4:junit4]   2> 6521 T1102 oaz.ZooKeeper.close Session: 0x13ba77d00180007 closed
[junit4:junit4]   2> 6522 T1102 oascsi.HttpClientUtil.createClient Creating new http client, config:maxConnections=500&maxConnectionsPerHost=16&socketTimeout=15000&connTimeout=30000
[junit4:junit4]   2> 6532 T1102 oaz.ZooKeeper.<init> Initiating client connection, connectString=127.0.0.1:54876/solr sessionTimeout=30000 watcher=org.apache.solr.common.cloud.ConnectionManager@84dffa3
[junit4:junit4]   2> 6533 T1102 oascc.ConnectionManager.waitForConnected Waiting for client to connect to ZooKeeper
[junit4:junit4]   2> 6534 T1157 oaz.ClientCnxn$SendThread.logStartConnect Opening socket connection to server localhost/127.0.0.1:54876. Will not attempt to authenticate using SASL (access denied ("javax.security.auth.AuthPermission" "getLoginConfiguration"))
[junit4:junit4]   2> 6534 T1157 oaz.ClientCnxn$SendThread.primeConnection Socket connection established to localhost/127.0.0.1:54876, initiating session
[junit4:junit4]   2> 6534 T1104 oazs.NIOServerCnxnFactory.run Accepted socket connection from /140.211.11.196:20796
[junit4:junit4]   2> 6535 T1104 oazs.ZooKeeperServer.processConnectRequest Client attempting to establish new session at /140.211.11.196:20796
[junit4:junit4]   2> 6536 T1106 oazs.ZooKeeperServer.finishSessionInit Established session 0x13ba77d00180008 with negotiated timeout 20000 for client /140.211.11.196:20796
[junit4:junit4]   2> 6536 T1157 oaz.ClientCnxn$SendThread.onConnected Session establishment complete on server localhost/127.0.0.1:54876, sessionid = 0x13ba77d00180008, negotiated timeout = 20000
[junit4:junit4]   2> 6537 T1158 oascc.ConnectionManager.process Watcher org.apache.solr.common.cloud.ConnectionManager@84dffa3 name:ZooKeeperConnection Watcher:127.0.0.1:54876/solr got event WatchedEvent state:SyncConnected type:None path:null path:null type:None
[junit4:junit4]   2> 6537 T1102 oascc.ConnectionManager.waitForConnected Client is connected to ZooKeeper
[junit4:junit4]   2> 6538 T1107 oazs.PrepRequestProcessor.pRequest Got user-level KeeperException when processing sessionid:0x13ba77d00180008 type:create cxid:0x1 zxid:0x6d txntype:-1 reqpath:n/a Error Path:/solr/overseer Error:KeeperErrorCode = NodeExists for /solr/overseer
[junit4:junit4]   2> 6540 T1107 oazs.PrepRequestProcessor.pRequest Got user-level KeeperException when processing sessionid:0x13ba77d00180008 type:create cxid:0x2 zxid:0x6e txntype:-1 reqpath:n/a Error Path:/solr/overseer Error:KeeperErrorCode = NodeExists for /solr/overseer
[junit4:junit4]   2> 6548 T1102 oasc.ZkController.createEphemeralLiveNode Register node as live in ZooKeeper:/live_nodes/127.0.0.1:20794_nud%2Fi
[junit4:junit4]   2> 6549 T1107 oazs.PrepRequestProcessor.pRequest Got user-level KeeperException when processing sessionid:0x13ba77d00180008 type:delete cxid:0x4 zxid:0x6f txntype:-1 reqpath:n/a Error Path:/solr/live_nodes/127.0.0.1:20794_nud%2Fi Error:KeeperErrorCode = NoNode for /solr/live_nodes/127.0.0.1:20794_nud%2Fi
[junit4:junit4]   2> 6550 T1102 oascc.SolrZkClient.makePath makePath: /live_nodes/127.0.0.1:20794_nud%2Fi
[junit4:junit4]   2> 6553 T1124 oascc.ZkStateReader$2.process A cluster state change: WatchedEvent state:SyncConnected type:NodeChildrenChanged path:/live_nodes, has occurred - updating... (live nodes size: 2)
[junit4:junit4]   2> 6553 T1130 oascc.ZkStateReader$2.process A cluster state change: WatchedEvent state:SyncConnected type:NodeChildrenChanged path:/live_nodes, has occurred - updating... (live nodes size: 2)
[junit4:junit4]   2> 6554 T1143 oascc.ZkStateReader$3.process Updating live nodes... (3)
[junit4:junit4]   2> 6554 T1143 oascc.ZkStateReader$2.process A cluster state change: WatchedEvent state:SyncConnected type:NodeChildrenChanged path:/live_nodes, has occurred - updating... (live nodes size: 3)
[junit4:junit4]   2> 6555 T1124 oascc.ZkStateReader$3.process Updating live nodes... (3)
[junit4:junit4]   2> 6561 T1130 oascc.ZkStateReader$3.process Updating live nodes... (3)
[junit4:junit4]   2> 6562 T1102 oascc.ZkStateReader.createClusterStateWatchersAndUpdate Updating cluster state from ZooKeeper... 
[junit4:junit4]   2> 6574 T1159 oasc.CoreContainer.create Creating SolrCore 'collection1' using instanceDir: /usr/home/hudson/hudson-slave/workspace/Lucene-Solr-Tests-trunk-java7/solr/build/solr-core/test/J0/./org.apache.solr.cloud.BasicDistributedZkTest-jetty2-1355724691522/collection1
[junit4:junit4]   2> 6574 T1159 oasc.ZkController.createCollectionZkNode Check for collection zkNode:collection1
[junit4:junit4]   2> 6575 T1159 oasc.ZkController.createCollectionZkNode Collection zkNode exists
[junit4:junit4]   2> 6575 T1159 oasc.ZkController.readConfigName Load collection config from:/collections/collection1
[junit4:junit4]   2> 6577 T1159 oasc.SolrResourceLoader.<init> new SolrResourceLoader for directory: '/usr/home/hudson/hudson-slave/workspace/Lucene-Solr-Tests-trunk-java7/solr/build/solr-core/test/J0/./org.apache.solr.cloud.BasicDistributedZkTest-jetty2-1355724691522/collection1/'
[junit4:junit4]   2> 6578 T1159 oasc.SolrResourceLoader.replaceClassLoader Adding 'file:/usr/home/hudson/hudson-slave/workspace/Lucene-Solr-Tests-trunk-java7/solr/build/solr-core/test/J0/org.apache.solr.cloud.BasicDistributedZkTest-jetty2-1355724691522/collection1/lib/classes/' to classloader
[junit4:junit4]   2> 6579 T1159 oasc.SolrResourceLoader.replaceClassLoader Adding 'file:/usr/home/hudson/hudson-slave/workspace/Lucene-Solr-Tests-trunk-java7/solr/build/solr-core/test/J0/org.apache.solr.cloud.BasicDistributedZkTest-jetty2-1355724691522/collection1/lib/README' to classloader
[junit4:junit4]   2> 6634 T1159 oasc.SolrConfig.<init> Using Lucene MatchVersion: LUCENE_50
[junit4:junit4]   2> 6663 T1125 oascc.ZkStateReader.updateClusterState Updating cloud state from ZooKeeper... 
[junit4:junit4]   2> 6664 T1125 oasc.Overseer$ClusterStateUpdater.updateState Update state numShards=2 message={
[junit4:junit4]   2> 	  "operation":"state",
[junit4:junit4]   2> 	  "numShards":"2",
[junit4:junit4]   2> 	  "shard":"shard1",
[junit4:junit4]   2> 	  "roles":null,
[junit4:junit4]   2> 	  "state":"active",
[junit4:junit4]   2> 	  "core":"collection1",
[junit4:junit4]   2> 	  "collection":"collection1",
[junit4:junit4]   2> 	  "node_name":"127.0.0.1:20788_nud%2Fi",
[junit4:junit4]   2> 	  "base_url":"http://127.0.0.1:20788/nud/i"}
[junit4:junit4]   2> 6677 T1124 oascc.ZkStateReader$2.process A cluster state change: WatchedEvent state:SyncConnected type:NodeDataChanged path:/clusterstate.json, has occurred - updating... (live nodes size: 3)
[junit4:junit4]   2> 6677 T1158 oascc.ZkStateReader$2.process A cluster state change: WatchedEvent state:SyncConnected type:NodeDataChanged path:/clusterstate.json, has occurred - updating... (live nodes size: 3)
[junit4:junit4]   2> 6677 T1130 oascc.ZkStateReader$2.process A cluster state change: WatchedEvent state:SyncConnected type:NodeDataChanged path:/clusterstate.json, has occurred - updating... (live nodes size: 3)
[junit4:junit4]   2> 6677 T1143 oascc.ZkStateReader$2.process A cluster state change: WatchedEvent state:SyncConnected type:NodeDataChanged path:/clusterstate.json, has occurred - updating... (live nodes size: 3)
[junit4:junit4]   2> 6709 T1159 oasc.SolrConfig.<init> Loaded SolrConfig: solrconfig.xml
[junit4:junit4]   2> 6810 T1159 oass.IndexSchema.readSchema Reading Solr Schema
[junit4:junit4]   2> 6817 T1159 oass.IndexSchema.readSchema Schema name=test
[junit4:junit4]   2> 7474 T1159 oass.OpenExchangeRatesOrgProvider.init Initialized with rates=open-exchange-rates.json, refreshInterval=1440.
[junit4:junit4]   2> 7486 T1159 oass.IndexSchema.readSchema default search field in schema is text
[junit4:junit4]   2> 7490 T1159 oass.IndexSchema.readSchema unique key field: id
[junit4:junit4]   2> 7507 T1159 oass.FileExchangeRateProvider.reload Reloading exchange rates from file currency.xml
[junit4:junit4]   2> 7513 T1159 oass.FileExchangeRateProvider.reload Reloading exchange rates from file currency.xml
[junit4:junit4]   2> 7517 T1159 oass.OpenExchangeRatesOrgProvider.reload Reloading exchange rates from open-exchange-rates.json
[junit4:junit4]   2> 7519 T1159 oass.OpenExchangeRatesOrgProvider.reload Reloading exchange rates from open-exchange-rates.json
[junit4:junit4]   2> 7520 T1159 oasc.SolrCore.<init> [collection1] Opening new SolrCore at /usr/home/hudson/hudson-slave/workspace/Lucene-Solr-Tests-trunk-java7/solr/build/solr-core/test/J0/./org.apache.solr.cloud.BasicDistributedZkTest-jetty2-1355724691522/collection1/, dataDir=./org.apache.solr.cloud.BasicDistributedZkTest-1355724685327/jetty2/
[junit4:junit4]   2> 7521 T1159 oasc.JmxMonitoredMap.<init> JMX monitoring is enabled. Adding Solr mbeans to JMX Server: com.sun.jmx.mbeanserver.JmxMBeanServer@59a63e10
[junit4:junit4]   2> 7521 T1159 oasc.SolrCore.initDirectoryFactory solr.NRTCachingDirectoryFactory
[junit4:junit4]   2> 7522 T1159 oasc.CachingDirectoryFactory.get return new directory for /usr/home/hudson/hudson-slave/workspace/Lucene-Solr-Tests-trunk-java7/solr/build/solr-core/test/J0/./org.apache.solr.cloud.BasicDistributedZkTest-1355724685327/jetty2 forceNew:false
[junit4:junit4]   2> 7523 T1159 oasc.CachingDirectoryFactory.close Releasing directory:/usr/home/hudson/hudson-slave/workspace/Lucene-Solr-Tests-trunk-java7/solr/build/solr-core/test/J0/./org.apache.solr.cloud.BasicDistributedZkTest-1355724685327/jetty2
[junit4:junit4]   2> 7523 T1159 oasc.SolrCore.getNewIndexDir New index directory detected: old=null new=./org.apache.solr.cloud.BasicDistributedZkTest-1355724685327/jetty2/index/
[junit4:junit4]   2> 7524 T1159 oasc.SolrCore.initIndex WARNING [collection1] Solr index directory './org.apache.solr.cloud.BasicDistributedZkTest-1355724685327/jetty2/index' doesn't exist. Creating new index...
[junit4:junit4]   2> 7525 T1159 oasc.CachingDirectoryFactory.get return new directory for /usr/home/hudson/hudson-slave/workspace/Lucene-Solr-Tests-trunk-java7/solr/build/solr-core/test/J0/./org.apache.solr.cloud.BasicDistributedZkTest-1355724685327/jetty2/index forceNew:false
[junit4:junit4]   2> 7536 T1159 oasc.SolrDeletionPolicy.onCommit SolrDeletionPolicy.onCommit: commits:num=1
[junit4:junit4]   2> 		commit{dir=RateLimitedDirectoryWrapper(NRTCachingDirectory(org.apache.lucene.store.NIOFSDirectory@/usr/home/hudson/hudson-slave/workspace/Lucene-Solr-Tests-trunk-java7/solr/build/solr-core/test/J0/org.apache.solr.cloud.BasicDistributedZkTest-1355724685327/jetty2/index lockFactory=org.apache.lucene.store.NativeFSLockFactory@5a4b4bf3; maxCacheMB=48.0 maxMergeSizeMB=4.0)),segFN=segments_1,generation=1,filenames=[segments_1]
[junit4:junit4]   2> 7537 T1159 oasc.SolrDeletionPolicy.updateCommits newest commit = 1[segments_1]
[junit4:junit4]   2> 7537 T1159 oasc.CachingDirectoryFactory.close Releasing directory:/usr/home/hudson/hudson-slave/workspace/Lucene-Solr-Tests-trunk-java7/solr/build/solr-core/test/J0/./org.apache.solr.cloud.BasicDistributedZkTest-1355724685327/jetty2/index
[junit4:junit4]   2> 7538 T1159 oasc.SolrCore.initWriters created xml: solr.XMLResponseWriter
[junit4:junit4]   2> 7540 T1159 oasup.UpdateRequestProcessorChain.init inserting DistributedUpdateProcessorFactory into updateRequestProcessorChain "dedupe"
[junit4:junit4]   2> 7540 T1159 oasup.UpdateRequestProcessorChain.init inserting DistributedUpdateProcessorFactory into updateRequestProcessorChain "dedupe-allfields"
[junit4:junit4]   2> 7541 T1159 oasup.UpdateRequestProcessorChain.init inserting DistributedUpdateProcessorFactory into updateRequestProcessorChain "stored_sig"
[junit4:junit4]   2> 7541 T1159 oasup.UpdateRequestProcessorChain.init inserting DistributedUpdateProcessorFactory into updateRequestProcessorChain "uniq-fields"
[junit4:junit4]   2> 7542 T1159 oasup.UpdateRequestProcessorChain.init inserting DistributedUpdateProcessorFactory into updateRequestProcessorChain "distrib-dup-test-chain-implicit"
[junit4:junit4]   2> 7542 T1159 oasc.RequestHandlers.initHandlersFromConfig adding lazy requestHandler: solr.ReplicationHandler
[junit4:junit4]   2> 7543 T1159 oasc.RequestHandlers.initHandlersFromConfig created /replication: solr.ReplicationHandler
[junit4:junit4]   2> 7544 T1159 oasc.RequestHandlers.initHandlersFromConfig created standard: solr.StandardRequestHandler
[junit4:junit4]   2> 7545 T1159 oasc.RequestHandlers.initHandlersFromConfig created /get: solr.RealTimeGetHandler
[junit4:junit4]   2> 7546 T1159 oasc.RequestHandlers.initHandlersFromConfig created dismax: solr.SearchHandler
[junit4:junit4]   2> 7548 T1159 oasc.RequestHandlers.initHandlersFromConfig created mock: org.apache.solr.core.MockQuerySenderListenerReqHandler
[junit4:junit4]   2> 7548 T1159 oasc.RequestHandlers.initHandlersFromConfig created /admin/: org.apache.solr.handler.admin.AdminHandlers
[junit4:junit4]   2> 7549 T1159 oasc.RequestHandlers.initHandlersFromConfig created defaults: solr.StandardRequestHandler
[junit4:junit4]   2> 7550 T1159 oasc.RequestHandlers.initHandlersFromConfig adding lazy requestHandler: solr.StandardRequestHandler
[junit4:junit4]   2> 7550 T1159 oasc.RequestHandlers.initHandlersFromConfig created lazy: solr.StandardRequestHandler
[junit4:junit4]   2> 7551 T1159 oasc.RequestHandlers.initHandlersFromConfig created /update: solr.UpdateRequestHandler
[junit4:junit4]   2> 7553 T1159 oasc.RequestHandlers.initHandlersFromConfig created /terms: org.apache.solr.handler.component.SearchHandler
[junit4:junit4]   2> 7554 T1159 oasc.RequestHandlers.initHandlersFromConfig created spellCheckCompRH: org.apache.solr.handler.component.SearchHandler
[junit4:junit4]   2> 7555 T1159 oasc.RequestHandlers.initHandlersFromConfig created spellCheckCompRH_Direct: org.apache.solr.handler.component.SearchHandler
[junit4:junit4]   2> 7556 T1159 oasc.RequestHandlers.initHandlersFromConfig created spellCheckWithWordbreak: org.apache.solr.handler.component.SearchHandler
[junit4:junit4]   2> 7558 T1159 oasc.RequestHandlers.initHandlersFromConfig created spellCheckWithWordbreak_Direct: org.apache.solr.handler.component.SearchHandler
[junit4:junit4]   2> 7559 T1159 oasc.RequestHandlers.initHandlersFromConfig created spellCheckCompRH1: org.apache.solr.handler.component.SearchHandler
[junit4:junit4]   2> 7560 T1159 oasc.RequestHandlers.initHandlersFromConfig created mltrh: org.apache.solr.handler.component.SearchHandler
[junit4:junit4]   2> 7561 T1159 oasc.RequestHandlers.initHandlersFromConfig created tvrh: org.apache.solr.handler.component.SearchHandler
[junit4:junit4]   2> 7562 T1159 oasc.RequestHandlers.initHandlersFromConfig created /mlt: solr.MoreLikeThisHandler
[junit4:junit4]   2> 7564 T1159 oasc.RequestHandlers.initHandlersFromConfig created /debug/dump: solr.DumpRequestHandler
[junit4:junit4]   2> 7577 T1159 oashl.XMLLoader.init xsltCacheLifetimeSeconds=60
[junit4:junit4]   2> 7582 T1159 oasc.SolrCore.initDeprecatedSupport WARNING solrconfig.xml uses deprecated <admin/gettableFiles>, Please update your config to use the ShowFileRequestHandler.
[junit4:junit4]   2> 7584 T1159 oasc.SolrCore.initDeprecatedSupport WARNING adding ShowFileRequestHandler with hidden files: [SCHEMA.XML, OLD_SYNONYMS.TXT, STOPWORDS.TXT, PROTWORDS.TXT, OPEN-EXCHANGE-RATES.JSON, SYNONYMS.TXT, CURRENCY.XML, MAPPING-ISOLATIN1ACCENT.TXT]
[junit4:junit4]   2> 7587 T1159 oasc.CachingDirectoryFactory.close Releasing directory:/usr/home/hudson/hudson-slave/workspace/Lucene-Solr-Tests-trunk-java7/solr/build/solr-core/test/J0/./org.apache.solr.cloud.BasicDistributedZkTest-1355724685327/jetty2
[junit4:junit4]   2> 7588 T1159 oass.SolrIndexSearcher.<init> Opening Searcher@1a0afd46 main
[junit4:junit4]   2> 7590 T1159 oasu.CommitTracker.<init> Hard AutoCommit: disabled
[junit4:junit4]   2> 7590 T1159 oasu.CommitTracker.<init> Soft AutoCommit: disabled
[junit4:junit4]   2> 7590 T1159 oashc.SpellCheckComponent.inform Initializing spell checkers
[junit4:junit4]   2> 7598 T1159 oass.DirectSolrSpellChecker.init init: {name=direct,classname=DirectSolrSpellChecker,field=lowerfilt,minQueryLength=3}
[junit4:junit4]   2> 7672 T1160 oasc.SolrCore.registerSearcher [collection1] Registered new searcher Searcher@1a0afd46 main{StandardDirectoryReader(segments_1:1)}
[junit4:junit4]   2> 7678 T1159 oasc.ZkController.publish publishing core=collection1 state=down
[junit4:junit4]   2> 7678 T1159 oasc.ZkController.publish numShards not found on descriptor - reading it from system property
[junit4:junit4]   2> 7686 T1125 oascc.ZkStateReader.updateClusterState Updating cloud state from ZooKeeper... 
[junit4:junit4]   2> 7687 T1125 oasc.Overseer$ClusterStateUpdater.updateState Update state numShards=2 message={
[junit4:junit4]   2> 	  "operation":"state",
[junit4:junit4]   2> 	  "numShards":"2",
[junit4:junit4]   2> 	  "shard":null,
[junit4:junit4]   2> 	  "roles":null,
[junit4:junit4]   2> 	  "state":"down",
[junit4:junit4]   2> 	  "core":"collection1",
[junit4:junit4]   2> 	  "collection":"collection1",
[junit4:junit4]   2> 	  "node_name":"127.0.0.1:20794_nud%2Fi",
[junit4:junit4]   2> 	  "base_url":"http://127.0.0.1:20794/nud/i"}
[junit4:junit4]   2> 7688 T1125 oasc.Overseer$ClusterStateUpdater.updateState Collection already exists with numShards=2
[junit4:junit4]   2> 7688 T1125 oasc.Overseer$ClusterStateUpdater.updateState Assigning new node to shard shard=shard2
[junit4:junit4]   2> 7700 T1124 oascc.ZkStateReader$2.process A cluster state change: WatchedEvent state:SyncConnected type:NodeDataChanged path:/clusterstate.json, has occurred - updating... (live nodes size: 3)
[junit4:junit4]   2> 7700 T1158 oascc.ZkStateReader$2.process A cluster state change: WatchedEvent state:SyncConnected type:NodeDataChanged path:/clusterstate.json, has occurred - updating... (live nodes size: 3)
[junit4:junit4]   2> 7700 T1143 oascc.ZkStateReader$2.process A cluster state change: WatchedEvent state:SyncConnected type:NodeDataChanged path:/clusterstate.json, has occurred - updating... (live nodes size: 3)
[junit4:junit4]   2> 7700 T1130 oascc.ZkStateReader$2.process A cluster state change: WatchedEvent state:SyncConnected type:NodeDataChanged path:/clusterstate.json, has occurred - updating... (live nodes size: 3)
[junit4:junit4]   2> 8181 T1159 oasc.CoreContainer.registerCore registering core: collection1
[junit4:junit4]   2> 8181 T1159 oasc.ZkController.register Register shard - core:collection1 address:http://127.0.0.1:20794/nud/i shardId:shard2
[junit4:junit4]   2> 8182 T1159 oascc.SolrZkClient.makePath makePath: /collections/collection1/leader_elect/shard2/election
[junit4:junit4]   2> 8207 T1107 oazs.PrepRequestProcessor.pRequest Got user-level KeeperException when processing sessionid:0x13ba77d00180008 type:delete cxid:0x44 zxid:0x7e txntype:-1 reqpath:n/a Error Path:/solr/collections/collection1/leaders/shard2 Error:KeeperErrorCode = NoNode for /solr/collections/collection1/leaders/shard2
[junit4:junit4]   2> 8208 T1159 oasc.ShardLeaderElectionContext.runLeaderProcess Running the leader process.
[junit4:junit4]   2> 8209 T1107 oazs.PrepRequestProcessor.pRequest Got user-level KeeperException when processing sessionid:0x13ba77d00180008 type:create cxid:0x45 zxid:0x7f txntype:-1 reqpath:n/a Error Path:/solr/overseer Error:KeeperErrorCode = NodeExists for /solr/overseer
[junit4:junit4]   2> 8219 T1159 oasc.ShardLeaderElectionContext.waitForReplicasToComeUp Enough replicas found to continue.
[junit4:junit4]   2> 8219 T1159 oasc.ShardLeaderElectionContext.runLeaderProcess I may be the new leader - try and sync
[junit4:junit4]   2> 8219 T1159 oasc.SyncStrategy.sync Sync replicas to http://127.0.0.1:20794/nud/i/collection1/
[junit4:junit4]   2> 8220 T1159 oasc.SyncStrategy.syncReplicas Sync Success - now sync replicas to me
[junit4:junit4]   2> 8220 T1159 oasc.SyncStrategy.syncToMe http://127.0.0.1:20794/nud/i/collection1/ has no replicas
[junit4:junit4]   2> 8220 T1159 oasc.ShardLeaderElectionContext.runLeaderProcess I am the new leader: http://127.0.0.1:20794/nud/i/collection1/
[junit4:junit4]   2> 8220 T1159 oascc.SolrZkClient.makePath makePath: /collections/collection1/leaders/shard2
[junit4:junit4]   2> 8225 T1107 oazs.PrepRequestProcessor.pRequest Got user-level KeeperException when processing sessionid:0x13ba77d00180008 type:create cxid:0x4e zxid:0x82 txntype:-1 reqpath:n/a Error Path:/solr/overseer Error:KeeperErrorCode = NodeExists for /solr/overseer
[junit4:junit4]   2> 8711 T1125 oascc.ZkStateReader.updateClusterState Updating cloud state from ZooKeeper... 
[junit4:junit4]   2> 8732 T1124 oascc.ZkStateReader$2.process A cluster state change: WatchedEvent state:SyncConnected type:NodeDataChanged path:/clusterstate.json, has occurred - updating... (live nodes size: 3)
[junit4:junit4]   2> 8733 T1130 oascc.ZkStateReader$2.process A cluster state change: WatchedEvent state:SyncConnected type:NodeDataChanged path:/clusterstate.json, has occurred - updating... (live nodes size: 3)
[junit4:junit4]   2> 8732 T1158 oascc.ZkStateReader$2.process A cluster state change: WatchedEvent state:SyncConnected type:NodeDataChanged path:/clusterstate.json, has occurred - updating... (live nodes size: 3)
[junit4:junit4]   2> 8733 T1143 oascc.ZkStateReader$2.process A cluster state change: WatchedEvent state:SyncConnected type:NodeDataChanged path:/clusterstate.json, has occurred - updating... (live nodes size: 3)
[junit4:junit4]   2> 8744 T1159 oasc.ZkController.register We are http://127.0.0.1:20794/nud/i/collection1/ and leader is http://127.0.0.1:20794/nud/i/collection1/
[junit4:junit4]   2> 8744 T1159 oasc.ZkController.register No LogReplay needed for core=collection1 baseURL=http://127.0.0.1:20794/nud/i
[junit4:junit4]   2> 8744 T1159 oasc.ZkController.checkRecovery I am the leader, no recovery necessary
[junit4:junit4]   2> 8745 T1159 oasc.ZkController.publish publishing core=collection1 state=active
[junit4:junit4]   2> 8745 T1159 oasc.ZkController.publish numShards not found on descriptor - reading it from system property
[junit4:junit4]   2> 8747 T1159 oascc.ZkStateReader.updateClusterState Updating cloud state from ZooKeeper... 
[junit4:junit4]   2> 8748 T1102 oass.SolrDispatchFilter.init user.dir=/usr/home/hudson/hudson-slave/workspace/Lucene-Solr-Tests-trunk-java7/solr/build/solr-core/test/J0
[junit4:junit4]   2> 8749 T1102 oass.SolrDispatchFilter.init SolrDispatchFilter.init() done
[junit4:junit4]   2> 8749 T1102 oascsi.HttpClientUtil.createClient Creating new http client, config:maxConnections=128&maxConnectionsPerHost=32&followRedirects=false
[junit4:junit4]   2> 8919 T1102 oejs.Server.doStart jetty-8.1.8.v20121106
[junit4:junit4]   2> 8922 T1102 oejs.AbstractConnector.doStart Started SocketConnector@127.0.0.1:20797
[junit4:junit4]   2> 8923 T1102 oasc.SolrResourceLoader.locateSolrHome JNDI not configured for solr (NoInitialContextEx)
[junit4:junit4]   2> 8923 T1102 oasc.SolrResourceLoader.locateSolrHome using system property solr.solr.home: /usr/home/hudson/hudson-slave/workspace/Lucene-Solr-Tests-trunk-java7/solr/build/solr-core/test/J0/./org.apache.solr.cloud.BasicDistributedZkTest-jetty3-1355724694084
[junit4:junit4]   2> 8924 T1102 oasc.SolrResourceLoader.<init> new SolrResourceLoader for deduced Solr Home: '/usr/home/hudson/hudson-slave/workspace/Lucene-Solr-Tests-trunk-java7/solr/build/solr-core/test/J0/./org.apache.solr.cloud.BasicDistributedZkTest-jetty3-1355724694084/'
[junit4:junit4]   2> 8964 T1102 oass.SolrDispatchFilter.init SolrDispatchFilter.init()
[junit4:junit4]   2> 8964 T1102 oasc.SolrResourceLoader.locateSolrHome JNDI not configured for solr (NoInitialContextEx)
[junit4:junit4]   2> 8965 T1102 oasc.SolrResourceLoader.locateSolrHome using system property solr.solr.home: /usr/home/hudson/hudson-slave/workspace/Lucene-Solr-Tests-trunk-java7/solr/build/solr-core/test/J0/./org.apache.solr.cloud.BasicDistributedZkTest-jetty3-1355724694084
[junit4:junit4]   2> 8965 T1102 oasc.CoreContainer$Initializer.initialize looking for solr.xml: /usr/home/hudson/hudson-slave/workspace/Lucene-Solr-Tests-trunk-java7/solr/build/solr-core/test/J0/./org.apache.solr.cloud.BasicDistributedZkTest-jetty3-1355724694084/solr.xml
[junit4:junit4]   2> 8966 T1102 oasc.CoreContainer.<init> New CoreContainer 1636075677
[junit4:junit4]   2> 8966 T1102 oasc.CoreContainer.load Loading CoreContainer using Solr Home: '/usr/home/hudson/hudson-slave/workspace/Lucene-Solr-Tests-trunk-java7/solr/build/solr-core/test/J0/./org.apache.solr.cloud.BasicDistributedZkTest-jetty3-1355724694084/'
[junit4:junit4]   2> 8967 T1102 oasc.SolrResourceLoader.<init> new SolrResourceLoader for directory: '/usr/home/hudson/hudson-slave/workspace/Lucene-Solr-Tests-trunk-java7/solr/build/solr-core/test/J0/./org.apache.solr.cloud.BasicDistributedZkTest-jetty3-1355724694084/'
[junit4:junit4]   2> 8996 T1102 oashc.HttpShardHandlerFactory.getParameter Setting socketTimeout to: 30000
[junit4:junit4]   2> 8997 T1102 oashc.HttpShardHandlerFactory.getParameter Setting urlScheme to: http://
[junit4:junit4]   2> 8997 T1102 oashc.HttpShardHandlerFactory.getParameter Setting connTimeout to: 15000
[junit4:junit4]   2> 8998 T1102 oashc.HttpShardHandlerFactory.getParameter Setting maxConnectionsPerHost to: 20
[junit4:junit4]   2> 8998 T1102 oashc.HttpShardHandlerFactory.getParameter Setting corePoolSize to: 0
[junit4:junit4]   2> 8998 T1102 oashc.HttpShardHandlerFactory.getParameter Setting maximumPoolSize to: 2147483647
[junit4:junit4]   2> 8999 T1102 oashc.HttpShardHandlerFactory.getParameter Setting maxThreadIdleTime to: 5
[junit4:junit4]   2> 8999 T1102 oashc.HttpShardHandlerFactory.getParameter Setting sizeOfQueue to: -1
[junit4:junit4]   2> 9000 T1102 oashc.HttpShardHandlerFactory.getParameter Setting fairnessPolicy to: false
[junit4:junit4]   2> 9000 T1102 oascsi.HttpClientUtil.createClient Creating new http client, config:maxConnectionsPerHost=20&maxConnections=10000&socketTimeout=30000&connTimeout=15000&retry=false
[junit4:junit4]   2> 9021 T1102 oasc.CoreContainer.load Registering Log Listener
[junit4:junit4]   2> 9040 T1102 oasc.CoreContainer.initZooKeeper Zookeeper client=127.0.0.1:54876/solr
[junit4:junit4]   2> 9041 T1102 oasc.ZkController.checkChrootPath zkHost includes chroot
[junit4:junit4]   2> 9041 T1102 oaz.ZooKeeper.<init> Initiating client connection, connectString=127.0.0.1:54876 sessionTimeout=60000 watcher=org.apache.solr.common.cloud.ConnectionManager@1bc91dec
[junit4:junit4]   2> 9042 T1102 oascc.ConnectionManager.waitForConnected Waiting for client to connect to ZooKeeper
[junit4:junit4]   2> 9043 T1170 oaz.ClientCnxn$SendThread.logStartConnect Opening socket connection to server localhost/127.0.0.1:54876. Will not attempt to authenticate using SASL (access denied ("javax.security.auth.AuthPermission" "getLoginConfiguration"))
[junit4:junit4]   2> 9043 T1170 oaz.ClientCnxn$SendThread.primeConnection Socket connection established to localhost/127.0.0.1:54876, initiating session
[junit4:junit4]   2> 9044 T1104 oazs.NIOServerCnxnFactory.run Accepted socket connection from /140.211.11.196:20798
[junit4:junit4]   2> 9044 T1104 oazs.ZooKeeperServer.processConnectRequest Client attempting to establish new session at /140.211.11.196:20798
[junit4:junit4]   2> 9046 T1106 oazs.ZooKeeperServer.finishSessionInit Established session 0x13ba77d00180009 with negotiated timeout 20000 for client /140.211.11.196:20798
[junit4:junit4]   2> 9046 T1170 oaz.ClientCnxn$SendThread.onConnected Session establishment complete on server localhost/127.0.0.1:54876, sessionid = 0x13ba77d00180009, negotiated timeout = 20000
[junit4:junit4]   2> 9047 T1171 oascc.ConnectionManager.process Watcher org.apache.solr.common.cloud.ConnectionManager@1bc91dec name:ZooKeeperConnection Watcher:127.0.0.1:54876 got event WatchedEvent state:SyncConnected type:None path:null path:null type:None
[junit4:junit4]   2> 9047 T1102 oascc.ConnectionManager.waitForConnected Client is connected to ZooKeeper
[junit4:junit4]   2> 9049 T1107 oazs.PrepRequestProcessor.pRequest2Txn Processed session termination for sessionid: 0x13ba77d00180009
[junit4:junit4]   2> 9056 T1171 oaz.ClientCnxn$EventThread.run EventThread shut down
[junit4:junit4]   2> 9056 T1104 oazs.NIOServerCnxn.closeSock Closed socket connection for client /140.211.11.196:20798 which had sessionid 0x13ba77d00180009
[junit4:junit4]   2> 9056 T1102 oaz.ZooKeeper.close Session: 0x13ba77d00180009 closed
[junit4:junit4]   2> 9057 T1102 oascsi.HttpClientUtil.createClient Creating new http client, config:maxConnections=500&maxConnectionsPerHost=16&socketTimeout=15000&connTimeout=30000
[junit4:junit4]   2> 9067 T1102 oaz.ZooKeeper.<init> Initiating client connection, connectString=127.0.0.1:54876/solr sessionTimeout=30000 watcher=org.apache.solr.common.cloud.ConnectionManager@64ab38b3
[junit4:junit4]   2> 9068 T1102 oascc.ConnectionManager.waitForConnected Waiting for client to connect to ZooKeeper
[junit4:junit4]   2> 9068 T1172 oaz.ClientCnxn$SendThread.logStartConnect Opening socket connection to server localhost/127.0.0.1:54876. Will not attempt to authenticate using SASL (access denied ("javax.security.auth.AuthPermission" "getLoginConfiguration"))
[junit4:junit4]   2> 9069 T1172 oaz.ClientCnxn$SendThread.primeConnection Socket connection established to localhost/127.0.0.1:54876, initiating session
[junit4:junit4]   2> 9069 T1104 oazs.NIOServerCnxnFactory.run Accepted socket connection from /140.211.11.196:20799
[junit4:junit4]   2> 9070 T1104 oazs.ZooKeeperServer.processConnectRequest Client attempting to establish new session at /140.211.11.196:20799
[junit4:junit4]   2> 9071 T1106 oazs.ZooKeeperServer.finishSessionInit Established session 0x13ba77d0018000a with negotiated timeout 20000 for client /140.211.11.196:20799
[junit4:junit4]   2> 9071 T1172 oaz.ClientCnxn$SendThread.onConnected Session establishment complete on server localhost/127.0.0.1:54876, sessionid = 0x13ba77d0018000a, negotiated timeout = 20000
[junit4:junit4]   2> 9072 T1173 oascc.ConnectionManager.process Watcher org.apache.solr.common.cloud.ConnectionManager@64ab38b3 name:ZooKeeperConnection Watcher:127.0.0.1:54876/solr got event WatchedEvent state:SyncConnected type:None path:null path:null type:None
[junit4:junit4]   2> 9072 T1102 oascc.ConnectionManager.waitForConnected Client is connected to ZooKeeper
[junit4:junit4]   2> 9073 T1107 oazs.PrepRequestProcessor.pRequest Got user-level KeeperException when processing sessionid:0x13ba77d0018000a type:create cxid:0x1 zxid:0x8f txntype:-1 reqpath:n/a Error Path:/solr/overseer Error:KeeperErrorCode = NodeExists for /solr/overseer
[junit4:junit4]   2> 9075 T1107 oazs.PrepRequestProcessor.pRequest Got user-level KeeperException when processing sessionid:0x13ba77d0018000a type:create cxid:0x2 zxid:0x90 txntype:-1 reqpath:n/a Error Path:/solr/overseer Error:KeeperErrorCode = NodeExists for /solr/overseer
[junit4:junit4]   2> 9083 T1102 oasc.ZkController.createEphemeralLiveNode Register node as live in ZooKeeper:/live_nodes/127.0.0.1:20797_nud%2Fi
[junit4:junit4]   2> 9084 T1107 oazs.PrepRequestProcessor.pRequest Got user-level KeeperException when processing sessionid:0x13ba77d0018000a type:delete cxid:0x4 zxid:0x91 txntype:-1 reqpath:n/a Error Path:/solr/live_nodes/127.0.0.1:20797_nud%2Fi Error:KeeperErrorCode = NoNode for /solr/live_nodes/127.0.0.1:20797_nud%2Fi
[junit4:junit4]   2> 9085 T1102 oascc.SolrZkClient.makePath makePath: /live_nodes/127.0.0.1:20797_nud%2Fi
[junit4:junit4]   2> 9088 T1124 oascc.ZkStateReader$2.process A cluster state change: WatchedEvent state:SyncConnected type:NodeChildrenChanged path:/live_nodes, has occurred - updating... (live nodes size: 3)
[junit4:junit4]   2> 9088 T1158 oascc.ZkStateReader$2.process A cluster state change: WatchedEvent state:SyncConnected type:NodeChildrenChanged path:/live_nodes, has occurred - updating... (live nodes size: 3)
[junit4:junit4]   2> 9088 T1130 oascc.ZkStateReader$2.process A cluster state change: WatchedEvent state:SyncConnected type:NodeChildrenChanged path:/live_nodes, has occurred - updating... (live nodes size: 3)
[junit4:junit4]   2> 9089 T1143 oascc.ZkStateReader$3.process Updating live nodes... (4)
[junit4:junit4]   2> 9089 T1143 oascc.ZkStateReader$2.process A cluster state change: WatchedEvent state:SyncConnected type:NodeChildrenChanged path:/live_nodes, has occurred - updating... (live nodes size: 4)
[junit4:junit4]   2> 9090 T1124 oascc.ZkStateReader$3.process Updating live nodes... (4)
[junit4:junit4]   2> 9091 T1158 oascc.ZkStateReader$3.process Updating live nodes... (4)
[junit4:junit4]   2> 9092 T1130 oascc.ZkStateReader$3.process Updating live nodes... (4)
[junit4:junit4]   2> 9093 T1102 oascc.ZkStateReader.createClusterStateWatchersAndUpdate Updating cluster state from ZooKeeper... 
[junit4:junit4]   2> 9102 T1174 oasc.CoreContainer.create Creating SolrCore 'collection1' using instanceDir: /usr/home/hudson/hudson-slave/workspace/Lucene-Solr-Tests-trunk-java7/solr/build/solr-core/test/J0/./org.apache.solr.cloud.BasicDistributedZkTest-jetty3-1355724694084/collection1
[junit4:junit4]   2> 9102 T1174 oasc.ZkController.createCollectionZkNode Check for collection zkNode:collection1
[junit4:junit4]   2> 9103 T1174 oasc.ZkController.createCollectionZkNode Collection zkNode exists
[junit4:junit4]   2> 9103 T1174 oasc.ZkController.readConfigName Load collection config from:/collections/collection1
[junit4:junit4]   2> 9105 T1174 oasc.SolrResourceLoader.<init> new SolrResourceLoader for directory: '/usr/home/hudson/hudson-slave/workspace/Lucene-Solr-Tests-trunk-java7/solr/build/solr-core/test/J0/./org.apache.solr.cloud.BasicDistributedZkTest-jetty3-1355724694084/collection1/'
[junit4:junit4]   2> 9106 T1174 oasc.SolrResourceLoader.replaceClassLoader Adding 'file:/usr/home/hudson/hudson-slave/workspace/Lucene-Solr-Tests-trunk-java7/solr/build/solr-core/test/J0/org.apache.solr.cloud.BasicDistributedZkTest-jetty3-1355724694084/collection1/lib/classes/' to classloader
[junit4:junit4]   2> 9107 T1174 oasc.SolrResourceLoader.replaceClassLoader Adding 'file:/usr/home/hudson/hudson-slave/workspace/Lucene-Solr-Tests-trunk-java7/solr/build/solr-core/test/J0/org.apache.solr.cloud.BasicDistributedZkTest-jetty3-1355724694084/collection1/lib/README' to classloader
[junit4:junit4]   2> 9161 T1174 oasc.SolrConfig.<init> Using Lucene MatchVersion: LUCENE_50
[junit4:junit4]   2> 9233 T1174 oasc.SolrConfig.<init> Loaded SolrConfig: solrconfig.xml
[junit4:junit4]   2> 9246 T1125 oascc.ZkStateReader.updateClusterState Updating cloud state from ZooKeeper... 
[junit4:junit4]   2> 9246 T1125 oasc.Overseer$ClusterStateUpdater.updateState Update state numShards=2 message={
[junit4:junit4]   2> 	  "operation":"state",
[junit4:junit4]   2> 	  "numShards":"2",
[junit4:junit4]   2> 	  "shard":"shard2",
[junit4:junit4]   2> 	  "roles":null,
[junit4:junit4]   2> 	  "state":"active",
[junit4:junit4]   2> 	  "core":"collection1",
[junit4:junit4]   2> 	  "collection":"collection1",
[junit4:junit4]   2> 	  "node_name":"127.0.0.1:20794_nud%2Fi",
[junit4:junit4]   2> 	  "base_url":"http://127.0.0.1:20794/nud/i"}
[junit4:junit4]   2> 9259 T1124 oascc.ZkStateReader$2.process A cluster state change: WatchedEvent state:SyncConnected type:NodeDataChanged path:/clusterstate.json, has occurred - updating... (live nodes size: 4)
[junit4:junit4]   2> 9259 T1143 oascc.ZkStateReader$2.process A cluster state change: WatchedEvent state:SyncConnected type:NodeDataChanged path:/clusterstate.json, has occurred - updating... (live nodes size: 4)
[junit4:junit4]   2> 9259 T1130 oascc.ZkStateReader$2.process A cluster state change: WatchedEvent state:SyncConnected type:NodeDataChanged path:/clusterstate.json, has occurred - updating... (live nodes size: 4)
[junit4:junit4]   2> 9259 T1158 oascc.ZkStateReader$2.process A cluster state change: WatchedEvent state:SyncConnected type:NodeDataChanged path:/clusterstate.json, has occurred - updating... (live nodes size: 4)
[junit4:junit4]   2> 9334 T1174 oass.IndexSchema.readSchema Reading Solr Schema
[junit4:junit4]   2> 9334 T1173 oascc.ZkStateReader$2.process A cluster state change: WatchedEvent state:SyncConnected type:NodeDataChanged path:/clusterstate.json, has occurred - updating... (live nodes size: 4)
[junit4:junit4]   2> 9341 T1174 oass.IndexSchema.readSchema Schema name=test
[junit4:junit4]   2> 10205 T1174 oass.OpenExchangeRatesOrgProvider.init Initialized with rates=open-exchange-rates.json, refreshInterval=1440.
[junit4:junit4]   2> 10218 T1174 oass.IndexSchema.readSchema default search field in schema is text
[junit4:junit4]   2> 10223 T1174 oass.IndexSchema.readSchema unique key field: id
[junit4:junit4]   2> 10241 T1174 oass.FileExchangeRateProvider.reload Reloading exchange rates from file currency.xml
[junit4:junit4]   2> 10247 T1174 oass.FileExchangeRateProvider.reload Reloading exchange rates from file currency.xml
[junit4:junit4]   2> 10253 T1174 oass.OpenExchangeRatesOrgProvider.reload Reloading exchange rates from open-exchange-rates.json
[junit4:junit4]   2> 10255 T1174 oass.OpenExchangeRatesOrgProvider.reload Reloading exchange rates from open-exchange-rates.json
[junit4:junit4]   2> 10256 T1174 oasc.SolrCore.<init> [collection1] Opening new SolrCore at /usr/home/hudson/hudson-slave/workspace/Lucene-Solr-Tests-trunk-java7/solr/build/solr-core/test/J0/./org.apache.solr.cloud.BasicDistributedZkTest-jetty3-1355724694084/collection1/, dataDir=./org.apache.solr.cloud.BasicDistributedZkTest-1355724685327/jetty3/
[junit4:junit4]   2> 10256 T1174 oasc.JmxMonitoredMap.<init> JMX monitoring is enabled. Adding Solr mbeans to JMX Server: com.sun.jmx.mbeanserver.JmxMBeanServer@59a63e10
[junit4:junit4]   2> 10257 T1174 oasc.SolrCore.initDirectoryFactory solr.NRTCachingDirectoryFactory
[junit4:junit4]   2> 10258 T1174 oasc.CachingDirectoryFactory.get return new directory for /usr/home/hudson/hudson-slave/workspace/Lucene-Solr-Tests-trunk-java7/solr/build/solr-core/test/J0/./org.apache.solr.cloud.BasicDistributedZkTest-1355724685327/jetty3 forceNew:false
[junit4:junit4]   2> 10259 T1174 oasc.CachingDirectoryFactory.close Releasing directory:/usr/home/hudson/hudson-slave/workspace/Lucene-Solr-Tests-trunk-java7/solr/build/solr-core/test/J0/./org.apache.solr.cloud.BasicDistributedZkTest-1355724685327/jetty3
[junit4:junit4]   2> 10259 T1174 oasc.SolrCore.getNewIndexDir New index directory detected: old=null new=./org.apache.solr.cloud.BasicDistributedZkTest-1355724685327/jetty3/index/
[junit4:junit4]   2> 10260 T1174 oasc.SolrCore.initIndex WARNING [collection1] Solr index directory './org.apache.solr.cloud.BasicDistributedZkTest-1355724685327/jetty3/index' doesn't exist. Creating new index...
[junit4:junit4]   2> 10261 T1174 oasc.CachingDirectoryFactory.get return new directory for /usr/home/hudson/hudson-slave/workspace/Lucene-Solr-Tests-trunk-java7/solr/build/solr-core/test/J0/./org.apache.solr.cloud.BasicDistributedZkTest-1355724685327/jetty3/index forceNew:false
[junit4:junit4]   2> 10297 T1174 oasc.SolrDeletionPolicy.onCommit SolrDeletionPolicy.onCommit: commits:num=1
[junit4:junit4]   2> 		commit{dir=RateLimitedDirectoryWrapper(NRTCachingDirectory(org.apache.lucene.store.NIOFSDirectory@/usr/home/hudson/hudson-slave/workspace/Lucene-Solr-Tests-trunk-java7/solr/build/solr-core/test/J0/org.apache.solr.cloud.BasicDistributedZkTest-1355724685327/jetty3/index lockFactory=org.apache.lucene.store.NativeFSLockFactory@4a7c95e6; maxCacheMB=48.0 maxMergeSizeMB=4.0)),segFN=segments_1,generation=1,filenames=[segments_1]
[junit4:junit4]   2> 10298 T1174 oasc.SolrDeletionPolicy.updateCommits newest commit = 1[segments_1]
[junit4:junit4]   2> 10298 T1174 oasc.CachingDirectoryFactory.close Releasing directory:/usr/home/hudson/hudson-slave/workspace/Lucene-Solr-Tests-trunk-java7/solr/build/solr-core/test/J0/./org.apache.solr.cloud.BasicDistributedZkTest-1355724685327/jetty3/index
[junit4:junit4]   2> 10298 T1174 oasc.SolrCore.initWriters created xml: solr.XMLResponseWriter
[junit4:junit4]   2> 10300 T1174 oasup.UpdateRequestProcessorChain.init inserting DistributedUpdateProcessorFactory into updateRequestProcessorChain "dedupe"
[junit4:junit4]   2> 10301 T1174 oasup.UpdateRequestProcessorChain.init inserting DistributedUpdateProcessorFactory into updateRequestProcessorChain "dedupe-allfields"
[junit4:junit4]   2> 10301 T1174 oasup.UpdateRequestProcessorChain.init inserting DistributedUpdateProcessorFactory into updateRequestProcessorChain "stored_sig"
[junit4:junit4]   2> 10301 T1174 oasup.UpdateRequestProcessorChain.init inserting DistributedUpdateProcessorFactory into updateRequestProcessorChain "uniq-fields"
[junit4:junit4]   2> 10302 T1174 oasup.UpdateRequestProcessorChain.init inserting DistributedUpdateProcessorFactory into updateRequestProcessorChain "distrib-dup-test-chain-implicit"
[junit4:junit4]   2> 10302 T1174 oasc.RequestHandlers.initHandlersFromConfig adding lazy requestHandler: solr.ReplicationHandler
[junit4:junit4]   2> 10302 T1174 oasc.RequestHandlers.initHandlersFromConfig created /replication: solr.ReplicationHandler
[junit4:junit4]   2> 10303 T1174 oasc.RequestHandlers.initHandlersFromConfig created standard: solr.StandardRequestHandler
[junit4:junit4]   2> 10304 T1174 oasc.RequestHandlers.initHandlersFromConfig created /get: solr.RealTimeGetHandler
[junit4:junit4]   2> 10305 T1174 oasc.RequestHandlers.initHandlersFromConfig created dismax: solr.SearchHandler
[junit4:junit4]   2> 10306 T1174 oasc.RequestHandlers.initHandlersFromConfig created mock: org.apache.solr.core.MockQuerySenderListenerReqHandler
[junit4:junit4]   2> 10306 T1174 oasc.RequestHandlers.initHandlersFromConfig created /admin/: org.apache.solr.handler.admin.AdminHandlers
[junit4:junit4]   2> 10307 T1174 oasc.RequestHandlers.initHandlersFromConfig created defaults: solr.StandardRequestHandler
[junit4:junit4]   2> 10307 T1174 oasc.RequestHandlers.initHandlersFromConfig adding lazy requestHandler: solr.StandardRequestHandler
[junit4:junit4]   2> 10307 T1174 oasc.RequestHandlers.initHandlersFromConfig created lazy: solr.StandardRequestHandler
[junit4:junit4]   2> 10308 T1174 oasc.RequestHandlers.initHandlersFromConfig created /update: solr.UpdateRequestHandler
[junit4:junit4]   2> 10309 T1174 oasc.RequestHandlers.initHandlersFromConfig created /terms: org.apache.solr.handler.component.SearchHandler
[junit4:junit4]   2> 10310 T1174 oasc.RequestHandlers.initHandlersFromConfig created spellCheckCompRH: org.apache.solr.handler.component.SearchHandler
[junit4:junit4]   2> 10310 T1174 oasc.RequestHandlers.initHandlersFromConfig created spellCheckCompRH_Direct: org.apache.solr.handler.component.SearchHandler
[junit4:junit4]   2> 10311 T1174 oasc.RequestHandlers.initHandlersFromConfig created spellCheckWithWordbreak: org.apache.solr.handler.component.SearchHandler
[junit4:junit4]   2> 10312 T1174 oasc.RequestHandlers.initHandlersFromConfig created spellCheckWithWordbreak_Direct: org.apache.solr.handler.component.SearchHandler
[junit4:junit4]   2> 10313 T1174 oasc.RequestHandlers.initHandlersFromConfig created spellCheckCompRH1: org.apache.solr.handler.component.SearchHandler
[junit4:junit4]   2> 10314 T1174 oasc.RequestHandlers.initHandlersFromConfig created mltrh: org.apache.solr.handler.component.SearchHandler
[junit4:junit4]   2> 10315 T1174 oasc.RequestHandlers.initHandlersFromConfig created tvrh: org.apache.solr.handler.component.SearchHandler
[junit4:junit4]   2> 10315 T1174 oasc.RequestHandlers.initHandlersFromConfig created /mlt: solr.MoreLikeThisHandler
[junit4:junit4]   2> 10316 T1174 oasc.RequestHandlers.initHandlersFromConfig created /debug/dump: solr.DumpRequestHandler
[junit4:junit4]   2> 10325 T1174 oashl.XMLLoader.init xsltCacheLifetimeSeconds=60
[junit4:junit4]   2> 10328 T1174 oasc.SolrCore.initDeprecatedSupport WARNING solrconfig.xml uses deprecated <admin/gettableFiles>, Please update your config to use the ShowFileRequestHandler.
[junit4:junit4]   2> 10330 T1174 oasc.SolrCore.initDeprecatedSupport WARNING adding ShowFileRequestHandler with hidden files: [SCHEMA.XML, OLD_SYNONYMS.TXT, STOPWORDS.TXT, PROTWORDS.TXT, OPEN-EXCHANGE-RATES.JSON, SYNONYMS.TXT, CURRENCY.XML, MAPPING-ISOLATIN1ACCENT.TXT]
[junit4:junit4]   2> 10332 T1174 oasc.CachingDirectoryFactory.close Releasing directory:/usr/home/hudson/hudson-slave/workspace/Lucene-Solr-Tests-trunk-java7/solr/build/solr-core/test/J0/./org.apache.solr.cloud.BasicDistributedZkTest-1355724685327/jetty3
[junit4:junit4]   2> 10333 T1174 oass.SolrIndexSearcher.<init> Opening Searcher@2c733112 main
[junit4:junit4]   2> 10334 T1174 oasu.CommitTracker.<init> Hard AutoCommit: disabled
[junit4:junit4]   2> 10335 T1174 oasu.CommitTracker.<init> Soft AutoCommit: disabled
[junit4:junit4]   2> 10335 T1174 oashc.SpellCheckComponent.inform Initializing spell checkers
[junit4:junit4]   2> 10340 T1174 oass.DirectSolrSpellChecker.init init: {name=direct,classname=DirectSolrSpellChecker,field=lowerfilt,minQueryLength=3}
[junit4:junit4]   2> 10392 T1175 oasc.SolrCore.registerSearcher [collection1] Registered new searcher Searcher@2c733112 main{StandardDirectoryReader(segments_1:1)}
[junit4:junit4]   2> 10396 T1174 oasc.ZkController.publish publishing core=collection1 state=down
[junit4:junit4]   2> 10396 T1174 oasc.ZkController.publish numShards not found on descriptor - reading it from system property
[junit4:junit4]   2> 10772 T1125 oascc.ZkStateReader.updateClusterState Updating cloud state from ZooKeeper... 
[junit4:junit4]   2> 10773 T1125 oasc.Overseer$ClusterStateUpdater.updateState Update state numShards=2 message={
[junit4:junit4]   2> 	  "operation":"state",
[junit4:junit4]   2> 	  "numShards":"2",
[junit4:junit4]   2> 	  "shard":null,
[junit4:junit4]   2> 	  "roles":null,
[junit4:junit4]   2> 	  "state":"down",
[junit4:junit4]   2> 	  "core":"collection1",
[junit4:junit4]   2> 	  "collection":"collection1",
[junit4:junit4]   2> 	  "node_name":"127.0.0.1:20797_nud%2Fi",
[junit4:junit4]   2> 	  "base_url":"http://127.0.0.1:20797/nud/i"}
[junit4:junit4]   2> 10773 T1125 oasc.Overseer$ClusterStateUpdater.updateState Collection already exists with numShards=2
[junit4:junit4]   2> 10773 T1125 oasc.Overseer$ClusterStateUpdater.updateState Assigning new node to shard shard=shard1
[junit4:junit4]   2> 10839 T1173 oascc.ZkStateReader$2.process A cluster state change: WatchedEvent state:SyncConnected type:NodeDataChanged path:/clusterstate.json, has occurred - updating... (live nodes size: 4)
[junit4:junit4]   2> 10839 T1143 oascc.ZkStateReader$2.process A cluster state change: WatchedEvent state:SyncConnected type:NodeDataChanged path:/clusterstate.json, has occurred - updating... (live nodes size: 4)
[junit4:junit4]   2> 10839 T1130 oascc.ZkStateReader$2.process A cluster state change: WatchedEvent state:SyncConnected type:NodeDataChanged path:/clusterstate.json, has occurred - updating... (live nodes size: 4)
[junit4:junit4]   2> 10839 T1124 oascc.ZkStateReader$2.process A cluster state change: WatchedEvent state:SyncConnected type:NodeDataChanged path:/clusterstate.json, has occurred - updating... (live nodes size: 4)
[junit4:junit4]   2> 10839 T1158 oascc.ZkStateReader$2.process A cluster state change: WatchedEvent state:SyncConnected type:NodeDataChanged path:/clusterstate.json, has occurred - updating... (live nodes size: 4)
[junit4:junit4]   2> 10899 T1174 oasc.CoreContainer.registerCore registering core: collection1
[junit4:junit4]   2> 10899 T1174 oasc.ZkController.register Register shard - core:collection1 address:http://127.0.0.1:20797/nud/i shardId:shard1
[junit4:junit4]   2> 10906 T1174 oasc.ZkController.register We are http://127.0.0.1:20797/nud/i/collection1/ and leader is http://127.0.0.1:20788/nud/i/collection1/
[junit4:junit4]   2> 10906 T1174 oasc.ZkController.register No LogReplay needed for core=collection1 baseURL=http://127.0.0.1:20797/nud/i
[junit4:junit4]   2> 10906 T1174 oasc.ZkController.checkRecovery Core needs to recover:collection1
[junit4:junit4]   2> 10906 T1174 oasu.DefaultSolrCoreState.doRecovery Running recovery - first canceling any ongoing recovery
[junit4:junit4]   2> ASYNC  NEW_CORE C71 name=collection1 org.apache.solr.core.SolrCore@48329542 url=http://127.0.0.1:20797/nud/i/collection1 node=127.0.0.1:20797_nud%2Fi
[junit4:junit4]   2> 10907 T1176 C71 P20797 oasc.RecoveryStrategy.run Starting recovery process.  core=collection1 recoveringAfterStartup=true
[junit4:junit4]   2> 10908 T1176 C71 P20797 oasc.RecoveryStrategy.doRecovery ###### startupVersions=[]
[junit4:junit4]   2> 10908 T1174 oascc.ZkStateReader.updateClusterState Updating cloud state from ZooKeeper... 
[junit4:junit4]   2> 10908 T1176 C71 P20797 oasc.ZkController.publish publishing core=collection1 state=recovering
[junit4:junit4]   2> 10909 T1176 C71 P20797 oasc.ZkController.publish numShards not found on descriptor - reading it from system property
[junit4:junit4]   2> 10909 T1102 oass.SolrDispatchFilter.init user.dir=/usr/home/hudson/hudson-slave/workspace/Lucene-Solr-Tests-trunk-java7/solr/build/solr-core/test/J0
[junit4:junit4]   2> 10910 T1102 oass.SolrDispatchFilter.init SolrDispatchFilter.init() done
[junit4:junit4]   2> 10911 T1102 oascsi.HttpClientUtil.createClient Creating new http client, config:maxConnections=128&maxConnectionsPerHost=32&followRedirects=false
[junit4:junit4]   2> 10964 T1176 C71 P20797 oasc.RecoveryStrategy.doRecovery Attempting to PeerSync from http://127.0.0.1:20788/nud/i/collection1/ core=collection1 - recoveringAfterStartup=true
[junit4:junit4]   2> 10965 T1176 C71 P20797 oasu.PeerSync.sync PeerSync: core=collection1 url=http://127.0.0.1:20797/nud/i START replicas=[http://127.0.0.1:20788/nud/i/collection1/] nUpdates=100
[junit4:junit4]   2> 10966 T1176 C71 P20797 oasu.PeerSync.sync WARNING no frame of reference to tell of we've missed updates
[junit4:junit4]   2> 10966 T1176 C71 P20797 oasc.RecoveryStrategy.doRecovery PeerSync Recovery was not successful - trying replication. core=collection1
[junit4:junit4]   2> 10966 T1176 C71 P20797 oasc.RecoveryStrategy.doRecovery Starting Replication Recovery. core=collection1
[junit4:junit4]   2> 10967 T1176 C71 P20797 oascsi.HttpClientUtil.createClient Creating new http client, config:maxConnections=128&maxConnectionsPerHost=32&followRedirects=false
[junit4:junit4]   2> ASYNC  NEW_CORE C72 name=collection1 org.apache.solr.core.SolrCore@12137b1e url=http://127.0.0.1:20788/nud/i/collection1 node=127.0.0.1:20788_nud%2Fi
[junit4:junit4]   2> 10978 T1133 C72 P20788 REQ /get {distrib=false&qt=/get&wt=javabin&version=2&getVersions=100} status=0 QTime=1 
[junit4:junit4]   2> 11118 T1102 oejs.Server.doStart jetty-8.1.8.v20121106
[junit4:junit4]   2> 11121 T1102 oejs.AbstractConnector.doStart Started SocketConnector@127.0.0.1:20810
[junit4:junit4]   2> 11122 T1102 oasc.SolrResourceLoader.locateSolrHome JNDI not configured for solr (NoInitialContextEx)
[junit4:junit4]   2> 11123 T1102 oasc.SolrResourceLoader.locateSolrHome using system property solr.solr.home: /usr/home/hudson/hudson-slave/workspace/Lucene-Solr-Tests-trunk-java7/solr/build/solr-core/test/J0/./org.apache.solr.cloud.BasicDistributedZkTest-jetty4-1355724696247
[junit4:junit4]   2> 11123 T1102 oasc.SolrResourceLoader.<init> new SolrResourceLoader for deduced Solr Home: '/usr/home/hudson/hudson-slave/workspace/Lucene-Solr-Tests-trunk-java7/solr/build/solr-core/test/J0/./org.apache.solr.cloud.BasicDistributedZkTest-jetty4-1355724696247/'
[junit4:junit4]   2> 11165 T1102 oass.SolrDispatchFilter.init SolrDispatchFilter.init()
[junit4:junit4]   2> 11166 T1102 oasc.SolrResourceLoader.locateSolrHome JNDI not configured for solr (NoInitialContextEx)
[junit4:junit4]   2> 11167 T1102 oasc.SolrResourceLoader.locateSolrHome using system property solr.solr.home: /usr/home/hudson/hudson-slave/workspace/Lucene-Solr-Tests-trunk-java7/solr/build/solr-core/test/J0/./org.apache.solr.cloud.BasicDistributedZkTest-jetty4-1355724696247
[junit4:junit4]   2> 11167 T1102 oasc.CoreContainer$Initializer.initialize looking for solr.xml: /usr/home/hudson/hudson-slave/workspace/Lucene-Solr-Tests-trunk-java7/solr/build/solr-core/test/J0/./org.apache.solr.cloud.BasicDistributedZkTest-jetty4-1355724696247/solr.xml
[junit4:junit4]   2> 11168 T1102 oasc.CoreContainer.<init> New CoreContainer 1792133662
[junit4:junit4]   2> 11168 T1102 oasc.CoreContainer.load Loading CoreContainer using Solr Home: '/usr/home/hudson/hudson-slave/workspace/Lucene-Solr-Tests-trunk-java7/solr/build/solr-core/test/J0/./org.apache.solr.cloud.BasicDistributedZkTest-jetty4-1355724696247/'
[junit4:junit4]   2> 11169 T1102 oasc.SolrResourceLoader.<init> new SolrResourceLoader for directory: '/usr/home/hudson/hudson-slave/workspace/Lucene-Solr-Tests-trunk-java7/solr/build/solr-core/test/J0/./org.apache.solr.cloud.BasicDistributedZkTest-jetty4-1355724696247/'
[junit4:junit4]   2> 11199 T1102 oashc.HttpShardHandlerFactory.getParameter Setting socketTimeout to: 30000
[junit4:junit4]   2> 11200 T1102 oashc.HttpShardHandlerFactory.getParameter Setting urlScheme to: http://
[junit4:junit4]   2> 11200 T1102 oashc.HttpShardHandlerFactory.getParameter Setting connTimeout to: 15000
[junit4:junit4]   2> 11201 T1102 oashc.HttpShardHandlerFactory.getParameter Setting maxConnectionsPerHost to: 20
[junit4:junit4]   2> 11201 T1102 oashc.HttpShardHandlerFactory.getParameter Setting corePoolSize to: 0
[junit4:junit4]   2> 11202 T1102 oashc.HttpShardHandlerFactory.getParameter Setting maximumPoolSize to: 2147483647
[junit4:junit4]   2> 11202 T1102 oashc.HttpShardHandlerFactory.getParameter Setting maxThreadIdleTime to: 5
[junit4:junit4]   2> 11203 T1102 oashc.HttpShardHandlerFactory.getParameter Setting sizeOfQueue to: -1
[junit4:junit4]   2> 11203 T1102 oashc.HttpShardHandlerFactory.getParameter Setting fairnessPolicy to: false
[junit4:junit4]   2> 11204 T1102 oascsi.HttpClientUtil.createClient Creating new http client, config:maxConnectionsPerHost=20&maxConnections=10000&socketTimeout=30000&connTimeout=15000&retry=false
[junit4:junit4]   2> 11226 T1102 oasc.CoreContainer.load Registering Log Listener
[junit4:junit4]   2> 11246 T1102 oasc.CoreContainer.initZooKeeper Zookeeper client=127.0.0.1:54876/solr
[junit4:junit4]   2> 11247 T1102 oasc.ZkController.checkChrootPath zkHost includes chroot
[junit4:junit4]   2> 11247 T1102 oaz.ZooKeeper.<init> Initiating client connection, connectString=127.0.0.1:54876 sessionTimeout=60000 watcher=org.apache.solr.common.cloud.ConnectionManager@529a8d50
[junit4:junit4]   2> 11248 T1102 oascc.ConnectionManager.waitForConnected Waiting for client to connect to ZooKeeper
[junit4:junit4]   2> 11249 T1187 oaz.ClientCnxn$SendThread.logStartConnect Opening socket connection to server localhost/127.0.0.1:54876. Will not attempt to authenticate using SASL (access denied ("javax.security.auth.AuthPermission" "getLoginConfiguration"))
[junit4:junit4]   2> 11250 T1187 oaz.ClientCnxn$SendThread.primeConnection Socket connection established to localhost/127.0.0.1:54876, initiating session
[junit4:junit4]   2> 11250 T1104 oazs.NIOServerCnxnFactory.run Accepted socket connection from /140.211.11.196:20811
[junit4:junit4]   2> 11250 T1104 oazs.ZooKeeperServer.processConnectRequest Client attempting to establish new session at /140.211.11.196:20811
[junit4:junit4]   2> 11254 T1106 oazs.ZooKeeperServer.finishSessionInit Established session 0x13ba77d0018000b with negotiated timeout 20000 for client /140.211.11.196:20811
[junit4:junit4]   2> 11255 T1187 oaz.ClientCnxn$SendThread.onConnected Session establishment complete on server localhost/127.0.0.1:54876, sessionid = 0x13ba77d0018000b, negotiated timeout = 20000
[junit4:junit4]   2> 11255 T1188 oascc.ConnectionManager.process Watcher org.apache.solr.common.cloud.ConnectionManager@529a8d50 name:ZooKeeperConnection Watcher:127.0.0.1:54876 got event WatchedEvent state:SyncConnected type:None path:null path:null type:None
[junit4:junit4]   2> 11255 T1102 oascc.ConnectionManager.waitForConnected Client is connected to ZooKeeper
[junit4:junit4]   2> 11257 T1107 oazs.PrepRequestProcessor.pRequest2Txn Processed session termination for sessionid: 0x13ba77d0018000b
[junit4:junit4]   2> 11258 T1188 oaz.ClientCnxn$EventThread.run EventThread shut down
[junit4:junit4]   2> 11258 T1104 oazs.NIOServerCnxn.closeSock Closed socket connection for client /140.211.11.196:20811 which had sessionid 0x13ba77d0018000b
[junit4:junit4]   2> 11258 T1102 oaz.ZooKeeper.close Session: 0x13ba77d0018000b closed
[junit4:junit4]   2> 11259 T1102 oascsi.HttpClientUtil.createClient Creating new http client, config:maxConnections=500&maxConnectionsPerHost=16&socketTimeout=15000&connTimeout=30000
[junit4:junit4]   2> 11271 T1102 oaz.ZooKeeper.<init> Initiating client connection, connectString=127.0.0.1:54876/solr sessionTimeout=30000 watcher=org.apache.solr.common.cloud.ConnectionManager@3ef4558
[junit4:junit4]   2> 11272 T1102 oascc.ConnectionManager.waitForConnected Waiting for client to connect to ZooKeeper
[junit4:junit4]   2> 11272 T1189 oaz.ClientCnxn$SendThread.logStartConnect Opening socket connection to server localhost/127.0.0.1:54876. Will not attempt to authenticate using SASL (access denied ("javax.security.auth.AuthPermission" "getLoginConfiguration"))
[junit4:junit4]   2> 11273 T1189 oaz.ClientCnxn$SendThread.primeConnection Socket connection established to localhost/127.0.0.1:54876, initiating session
[junit4:junit4]   2> 11273 T1104 oazs.NIOServerCnxnFactory.run Accepted socket connection from /140.211.11.196:20812
[junit4:junit4]   2> 11273 T1104 oazs.ZooKeeperServer.processConnectRequest Client attempting to establish new session at /140.211.11.196:20812
[junit4:junit4]   2> 11275 T1106 oazs.ZooKeeperServer.finishSessionInit Established session 0x13ba77d0018000c with negotiated timeout 20000 for client /140.211.11.196:20812
[junit4:junit4]   2> 11275 T1189 oaz.ClientCnxn$SendThread.onConnected Session establishment complete on server localhost/127.0.0.1:54876, sessionid = 0x13ba77d0018000c, negotiated timeout = 20000
[junit4:junit4]   2> 11275 T1190 oascc.ConnectionManager.process Watcher org.apache.solr.common.cloud.ConnectionManager@3ef4558 name:ZooKeeperConnection Watcher:127.0.0.1:54876/solr got event WatchedEvent state:SyncConnected type:None path:null path:null type:None
[junit4:junit4]   2> 11275 T1102 oascc.ConnectionManager.waitForConnected Client is connected to ZooKeeper
[junit4:junit4]   2> 11276 T1107 oazs.PrepRequestProcessor.pRequest Got user-level KeeperException when processing sessionid:0x13ba77d0018000c type:create cxid:0x1 zxid:0xa2 txntype:-1 reqpath:n/a Error Path:/solr/overseer Error:KeeperErrorCode = NodeExists for /solr/overseer
[junit4:junit4]   2> 11278 T1107 oazs.PrepRequestProcessor.pRequest Got user-level KeeperException when processing sessionid:0x13ba77d0018000c type:create cxid:0x2 zxid:0xa3 txntype:-1 reqpath:n/a Error Path:/solr/overseer Error:KeeperErrorCode = NodeExists for /solr/overseer
[junit4:junit4]   2> 11286 T1102 oasc.ZkController.createEphemeralLiveNode Register node as live in ZooKeeper:/live_nodes/127.0.0.1:20810_nud%2Fi
[junit4:junit4]   2> 11287 T1107 oazs.PrepRequestProcessor.pRequest Got user-level KeeperException when processing sessionid:0x13ba77d0018000c type:delete cxid:0x4 zxid:0xa4 txntype:-1 reqpath:n/a Error Path:/solr/live_nodes/127.0.0.1:20810_nud%2Fi Error:KeeperErrorCode = NoNode for /solr/live_nodes/127.0.0.1:20810_nud%2Fi
[junit4:junit4]   2> 11288 T1102 oascc.SolrZkClient.makePath makePath: /live_nodes/127.0.0.1:20810_nud%2Fi
[junit4:junit4]   2> 11291 T1124 oascc.ZkStateReader$2.process A cluster state change: WatchedEvent state:SyncConnected type:NodeChildrenChanged path:/live_nodes, has occurred - updating... (live nodes size: 4)
[junit4:junit4]   2> 11291 T1158 oascc.ZkStateReader$2.process A cluster state change: WatchedEvent state:SyncConnected type:NodeChildrenChanged path:/live_nodes, has occurred - updating... (live nodes size: 4)
[junit4:junit4]   2> 11291 T1130 oascc.ZkStateReader$2.process A cluster state change: WatchedEvent state:SyncConnected type:NodeChildrenChanged path:/live_nodes, has occurred - updating... (live nodes size: 4)
[junit4:junit4]   2> 11291 T1143 oascc.ZkStateReader$3.process Updating live nodes... (5)
[junit4:junit4]   2> 11291 T1173 oascc.ZkStateReader$3.process Updating live nodes... (5)
[junit4:junit4]   2> 11292 T1143 oascc.ZkStateReader$2.process A cluster state change: WatchedEvent state:SyncConnected type:NodeChildrenChanged path:/live_nodes, has occurred - updating... (live nodes size: 5)
[junit4:junit4]   2> 11292 T1173 oascc.ZkStateReader$2.process A cluster state change: WatchedEvent state:SyncConnected type:NodeChildrenChanged path:/live_nodes, has occurred - updating... (live nodes size: 5)
[junit4:junit4]   2> 11293 T1124 oascc.ZkStateReader$3.process Updating live nodes... (5)
[junit4:junit4]   2> 11293 T1130 oascc.ZkStateReader$3.process Updating live nodes... (5)
[junit4:junit4]   2> 11293 T1158 oascc.ZkStateReader$3.process Updating live nodes... (5)
[junit4:junit4]   2> 11296 T1102 oascc.ZkStateReader.createClusterStateWatchersAndUpdate Updating cluster state from ZooKeeper... 
[junit4:junit4]   2> 11306 T1191 oasc.CoreContainer.create Creating SolrCore 'collection1' using instanceDir: /usr/home/hudson/hudson-slave/workspace/Lucene-Solr-Tests-trunk-java7/solr/build/solr-core/test/J0/./org.apache.solr.cloud.BasicDistributedZkTest-jetty4-1355724696247/collection1
[junit4:junit4]   2> 11306 T1191 oasc.ZkController.createCollectionZkNode Check for collection zkNode:collection1
[junit4:junit4]   2> 11307 T1191 oasc.ZkController.createCollectionZkNode Collection zkNode exists
[junit4:junit4]   2> 11307 T1191 oasc.ZkController.readConfigName Load collection config from:/collections/collection1
[junit4:junit4]   2> 11309 T1191 oasc.SolrResourceLoader.<init> new SolrResourceLoader for directory: '/usr/home/hudson/hudson-slave/workspace/Lucene-Solr-Tests-trunk-java7/solr/build/solr-core/test/J0/./org.apache.solr.cloud.BasicDistributedZkTest-jetty4-1355724696247/collection1/'
[junit4:junit4]   2> 11310 T1191 oasc.SolrResourceLoader.replaceClassLoader Adding 'file:/usr/home/hudson/hudson-slave/workspace/Lucene-Solr-Tests-trunk-java7/solr/build/solr-core/test/J0/org.apache.solr.cloud.BasicDistributedZkTest-jetty4-1355724696247/collection1/lib/classes/' to classloader
[junit4:junit4]   2> 11311 T1191 oasc.SolrResourceLoader.replaceClassLoader Adding 'file:/usr/home/hudson/hudson-slave/workspace/Lucene-Solr-Tests-trunk-java7/solr/build/solr-core/test/J0/org.apache.solr.cloud.BasicDistributedZkTest-jetty4-1355724696247/collection1/lib/README' to classloader
[junit4:junit4]   2> 11346 T1125 oascc.ZkStateReader.updateClusterState Updating cloud state from ZooKeeper... 
[junit4:junit4]   2> 11347 T1125 oasc.Overseer$ClusterStateUpdater.updateState Update state numShards=2 message={
[junit4:junit4]   2> 	  "operation":"state",
[junit4:junit4]   2> 	  "numShards":"2",
[junit4:junit4]   2> 	  "shard":"shard1",
[junit4:junit4]   2> 	  "roles":null,
[junit4:junit4]   2> 	  "state":"recovering",
[junit4:junit4]   2> 	  "core":"collection1",
[junit4:junit4]   2> 	  "collection":"collection1",
[junit4:junit4]   2> 	  "node_name":"127.0.0.1:20797_nud%2Fi",
[junit4:junit4]   2> 	  "base_url":"http://127.0.0.1:20797/nud/i"}
[junit4:junit4]   2> 11365 T1173 oascc.ZkStateReader$2.process A cluster state change: WatchedEvent state:SyncConnected type:NodeDataChanged path:/clusterstate.json, has occurred - updating... (live nodes size: 5)
[junit4:junit4]   2> 11365 T1158 oascc.ZkStateReader$2.process A cluster state change: WatchedEvent state:SyncConnected type:NodeDataChanged path:/clusterstate.json, has occurred - updating... (live nodes size: 5)
[junit4:junit4]   2> 11365 T1130 oascc.ZkStateReader$2.process A cluster state change: WatchedEvent state:SyncConnected type:NodeDataChanged path:/clusterstate.json, has occurred - updating... (live nodes size: 5)
[junit4:junit4]   2> 11365 T1143 oascc.ZkStateReader$2.process A cluster state change: WatchedEvent state:SyncConnected type:NodeDataChanged path:/clusterstate.json, has occurred - updating... (live nodes size: 5)
[junit4:junit4]   2> 11365 T1191 oasc.SolrConfig.<init> Using Lucene MatchVersion: LUCENE_50
[junit4:junit4]   2> 11365 T1190 oascc.ZkStateReader$2.process A cluster state change: WatchedEvent state:SyncConnected type:NodeDataChanged path:/clusterstate.json, has occurred - updating... (live nodes size: 5)
[junit4:junit4]   2> 11365 T1124 oascc.ZkStateReader$2.process A cluster state change: WatchedEvent state:SyncConnected type:NodeDataChanged path:/clusterstate.json, has occurred - updating... (live nodes size: 5)
[junit4:junit4]   2> 11436 T1191 oasc.SolrConfig.<init> Loaded SolrConfig: solrconfig.xml
[junit4:junit4]   2> 11537 T1191 oass.IndexSchema.readSchema Reading Solr Schema
[junit4:junit4]   2> 11544 T1191 oass.IndexSchema.readSchema Schema name=test
[junit4:junit4]   2> 12159 T1191 oass.OpenExchangeRatesOrgProvider.init Initialized with rates=open-exchange-rates.json, refreshInterval=1440.
[junit4:junit4]   2> 12167 T1191 oass.IndexSchema.readSchema default search field in schema is text
[junit4:junit4]   2> 12170 T1191 oass.IndexSchema.readSchema unique key field: id
[junit4:junit4]   2> 12182 T1191 oass.FileExchangeRateProvider.reload Reloading exchange rates from file currency.xml
[junit4:junit4]   2> 12185 T1191 oass.FileExchangeRateProvider.reload Reloading exchange rates from file currency.xml
[junit4:junit4]   2> 12189 T1191 oass.OpenExchangeRatesOrgProvider.reload Reloading exchange rates from open-exchange-rates.json
[junit4:junit4]   2> 12190 T1191 oass.OpenExchangeRatesOrgProvider.reload Reloading exchange rates from open-exchange-rates.json
[junit4:junit4]   2> 12191 T1191 oasc.SolrCore.<init> [collection1] Opening new SolrCore at /usr/home/hudson/hudson-slave/workspace/Lucene-Solr-Tests-trunk-java7/solr/build/solr-core/test/J0/./org.apache.solr.cloud.BasicDistributedZkTest-jetty4-1355724696247/collection1/, dataDir=./org.apache.solr.cloud.BasicDistributedZkTest-1355724685327/jetty4/
[junit4:junit4]   2> 12191 T1191 oasc.JmxMonitoredMap.<init> JMX monitoring is enabled. Adding Solr mbeans to JMX Server: com.sun.jmx.mbeanserver.JmxMBeanServer@59a63e10
[junit4:junit4]   2> 12191 T1191 oasc.SolrCore.initDirectoryFactory solr.NRTCachingDirectoryFactory
[junit4:junit4]   2> 12192 T1191 oasc.CachingDirectoryFactory.get return new directory for /usr/home/hudson/hudson-slave/workspace/Lucene-Solr-Tests-trunk-java7/solr/build/solr-core/test/J0/./org.apache.solr.cloud.BasicDistributedZkTest-1355724685327/jetty4 forceNew:false
[junit4:junit4]   2> 12192 T1191 oasc.CachingDirectoryFactory.close Releasing directory:/usr/home/hudson/hudson-slave/workspace/Lucene-Solr-Tests-trunk-java7/solr/build/solr-core/test/J0/./org.apache.solr.cloud.BasicDistributedZkTest-1355724685327/jetty4
[junit4:junit4]   2> 12193 T1191 oasc.SolrCore.getNewIndexDir New index directory detected: old=null new=./org.apache.solr.cloud.BasicDistributedZkTest-1355724685327/jetty4/index/
[junit4:junit4]   2> 12193 T1191 oasc.SolrCore.initIndex WARNING [collection1] Solr index directory './org.apache.solr.cloud.BasicDistributedZkTest-1355724685327/jetty4/index' doesn't exist. Creating new index...
[junit4:junit4]   2> 12193 T1191 oasc.CachingDirectoryFactory.get return new directory for /usr/home/hudson/hudson-slave/workspace/Lucene-Solr-Tests-trunk-java7/solr/build/solr-core/test/J0/./org.apache.solr.cloud.BasicDistributedZkTest-1355724685327/jetty4/index forceNew:false
[junit4:junit4]   2> 12203 T1191 oasc.SolrDeletionPolicy.onCommit SolrDeletionPolicy.onCommit: commits:num=1
[junit4:junit4]   2> 		commit{dir=RateLimitedDirectoryWrapper(NRTCachingDirectory(org.apache.lucene.store.NIOFSDirectory@/usr/home/hudson/hudson-slave/workspace/Lucene-Solr-Tests-trunk-java7/solr/build/solr-core/test/J0/org.apache.solr.cloud.BasicDistributedZkTest-1355724685327/jetty4/index lockFactory=org.apache.lucene.store.NativeFSLockFactory@3b815a1b; maxCacheMB=48.0 maxMergeSizeMB=4.0)),segFN=segments_1,generation=1,filenames=[segments_1]
[junit4:junit4]   2> 12203 T1191 oasc.SolrDeletionPolicy.updateCommits newest commit = 1[segments_1]
[junit4:junit4]   2> 12203 T1191 oasc.CachingDirectoryFactory.close Releasing directory:/usr/home/hudson/hudson-slave/workspace/Lucene-Solr-Tests-trunk-java7/solr/build/solr-core/test/J0/./org.apache.solr.cloud.BasicDistributedZkTest-1355724685327/jetty4/index
[junit4:junit4]   2> 12204 T1191 oasc.SolrCore.initWriters created xml: solr.XMLResponseWriter
[junit4:junit4]   2> 12206 T1191 oasup.UpdateRequestProcessorChain.init inserting DistributedUpdateProcessorFactory into updateRequestProcessorChain "dedupe"
[junit4:junit4]   2> 12206 T1191 oasup.UpdateRequestProcessorChain.init inserting DistributedUpdateProcessorFactory into updateRequestProcessorChain "dedupe-allfields"
[junit4:junit4]   2> 12206 T1191 oasup.UpdateRequestProcessorChain.init inserting DistributedUpdateProcessorFactory into updateRequestProcessorChain "stored_sig"
[junit4:junit4]   2> 12206 T1191 oasup.UpdateRequestProcessorChain.init inserting DistributedUpdateProcessorFactory into updateRequestProcessorChain "uniq-fields"
[junit4:junit4]   2> 12207 T1191 oasup.UpdateRequestProcessorChain.init inserting DistributedUpdateProcessorFactory into updateRequestProcessorChain "distrib-dup-test-chain-implicit"
[junit4:junit4]   2> 12207 T1191 oasc.RequestHandlers.initHandlersFromConfig adding lazy requestHandler: solr.ReplicationHandler
[junit4:junit4]   2> 12207 T1191 oasc.RequestHandlers.initHandlersFromConfig created /replication: solr.ReplicationHandler
[junit4:junit4]   2> 12208 T1191 oasc.RequestHandlers.initHandlersFromConfig created standard: solr.StandardRequestHandler
[junit4:junit4]   2> 12209 T1191 oasc.RequestHandlers.initHandlersFromConfig created /get: solr.RealTimeGetHandler
[junit4:junit4]   2> 12210 T1191 oasc.RequestHandlers.initHandlersFromConfig created dismax: solr.SearchHandler
[junit4:junit4]   2> 12211 T1191 oasc.RequestHandlers.initHandlersFromConfig created mock: org.apache.solr.core.MockQuerySenderListenerReqHandler
[junit4:junit4]   2> 12211 T1191 oasc.RequestHandlers.initHandlersFromConfig created /admin/: org.apache.solr.handler.admin.AdminHandlers
[junit4:junit4]   2> 12212 T1191 oasc.RequestHandlers.initHandlersFromConfig created defaults: solr.StandardRequestHandler
[junit4:junit4]   2> 12212 T1191 oasc.RequestHandlers.initHandlersFromConfig adding lazy requestHandler: solr.StandardRequestHandler
[junit4:junit4]   2> 12212 T1191 oasc.RequestHandlers.initHandlersFromConfig created lazy: solr.StandardRequestHandler
[junit4:junit4]   2> 12213 T1191 oasc.RequestHandlers.initHandlersFromConfig created /update: solr.UpdateRequestHandler
[junit4:junit4]   2> 12214 T1191 oasc.RequestHandlers.initHandlersFromConfig created /terms: org.apache.solr.handler.component.SearchHandler
[junit4:junit4]   2> 12215 T1191 oasc.RequestHandlers.initHandlersFromConfig created spellCheckCompRH: org.apache.solr.handler.component.SearchHandler
[junit4:junit4]   2> 12216 T1191 oasc.RequestHandlers.initHandlersFromConfig created spellCheckCompRH_Direct: org.apache.solr.handler.component.SearchHandler
[junit4:junit4]   2> 12216 T1191 oasc.RequestHandlers.initHandlersFromConfig created spellCheckWithWordbreak: org.apache.solr.handler.component.SearchHandler
[junit4:junit4]   2> 12217 T1191 oasc.RequestHandlers.initHandlersFromConfig created spellCheckWithWordbreak_Direct: org.apache.solr.handler.component.SearchHandler
[junit4:junit4]   2> 12218 T1191 oasc.RequestHandlers.initHandlersFromConfig created spellCheckCompRH1: org.apache.solr.handler.component.SearchHandler
[junit4:junit4]   2> 12219 T1191 oasc.RequestHandlers.initHandlersFromConfig created mltrh: org.apache.solr.handler.component.SearchHandler
[junit4:junit4]   2> 12220 T1191 oasc.RequestHandlers.initHandlersFromConfig created tvrh: org.apache.solr.handler.component.SearchHandler
[junit4:junit4]   2> 12221 T1191 oasc.RequestHandlers.initHandlersFromConfig created /mlt: solr.MoreLikeThisHandler
[junit4:junit4]   2> 12221 T1191 oasc.RequestHandlers.initHandlersFromConfig created /debug/dump: solr.DumpRequestHandler
[junit4:junit4]   2> 12230 T1191 oashl.XMLLoader.init xsltCacheLifetimeSeconds=60
[junit4:junit4]   2> 12233 T1191 oasc.SolrCore.initDeprecatedSupport WARNING solrconfig.xml uses deprecated <admin/gettableFiles>, Please update your config to use the ShowFileRequestHandler.
[junit4:junit4]   2> 12234 T1191 oasc.SolrCore.initDeprecatedSupport WARNING adding ShowFileRequestHandler with hidden files: [SCHEMA.XML, OLD_SYNONYMS.TXT, STOPWORDS.TXT, PROTWORDS.TXT, OPEN-EXCHANGE-RATES.JSON, SYNONYMS.TXT, CURRENCY.XML, MAPPING-ISOLATIN1ACCENT.TXT]
[junit4:junit4]   2> 12236 T1191 oasc.CachingDirectoryFactory.close Releasing directory:/usr/home/hudson/hudson-slave/workspace/Lucene-Solr-Tests-trunk-java7/solr/build/solr-core/test/J0/./org.apache.solr.cloud.BasicDistributedZkTest-1355724685327/jetty4
[junit4:junit4]   2> 12238 T1191 oass.SolrIndexSearcher.<init> Opening Searcher@12b83346 main
[junit4:junit4]   2> 12238 T1191 oasu.CommitTracker.<init> Hard AutoCommit: disabled
[junit4:junit4]   2> 12239 T1191 oasu.CommitTracker.<init> Soft AutoCommit: disabled
[junit4:junit4]   2> 12239 T1191 oashc.SpellCheckComponent.inform Initializing spell checkers
[junit4:junit4]   2> 12245 T1191 oass.DirectSolrSpellChecker.init init: {name=direct,classname=DirectSolrSpellChecker,field=lowerfilt,minQueryLength=3}
[junit4:junit4]   2> 12307 T1192 oasc.SolrCore.registerSearcher [collection1] Registered new searcher Searcher@12b83346 main{StandardDirectoryReader(segments_1:1)}
[junit4:junit4]   2> 12311 T1191 oasc.ZkController.publish publishing core=collection1 state=down
[junit4:junit4]   2> 12311 T1191 oasc.ZkController.publish numShards not found on descriptor - reading it from system property
[junit4:junit4]   2> 12373 T1125 oascc.ZkStateReader.updateClusterState Updating cloud state from ZooKeeper... 
[junit4:junit4]   2> 12374 T1125 oasc.Overseer$ClusterStateUpdater.updateState Update state numShards=2 message={
[junit4:junit4]   2> 	  "operation":"state",
[junit4:junit4]   2> 	  "numShards":"2",
[junit4:junit4]   2> 	  "shard":null,
[junit4:junit4]   2> 	  "roles":null,
[junit4:junit4]   2> 	  "state":"down",
[junit4:junit4]   2> 	  "core":"collection1",
[junit4:junit4]   2> 	  "collection":"collection1",
[junit4:junit4]   2> 	  "node_name":"127.0.0.1:20810_nud%2Fi",
[junit4:junit4]   2> 	  "base_url":"http://127.0.0.1:20810/nud/i"}
[junit4:junit4]   2> 12374 T1125 oasc.Overseer$ClusterStateUpdater.updateState Collection already exists with numShards=2
[junit4:junit4]   2> 12374 T1125 oasc.Overseer$ClusterStateUpdater.updateState Assigning new node to shard shard=shard2
[junit4:junit4]   2> 12386 T1190 oascc.ZkStateReader$2.process A cluster state change: WatchedEvent state:SyncConnected type:NodeDataChanged path:/clusterstate.json, has occurred - updating... (live nodes size: 5)
[junit4:junit4]   2> 12386 T1143 oascc.ZkStateReader$2.process A cluster state change: WatchedEvent state:SyncConnected type:NodeDataChanged path:/clusterstate.json, has occurred - updating... (live nodes size: 5)
[junit4:junit4]   2> 12386 T1158 oascc.ZkStateReader$2.process A cluster state change: WatchedEvent state:SyncConnected type:NodeDataChanged path:/clusterstate.json, has occurred - updating... (live nodes size: 5)
[junit4:junit4]   2> 12386 T1130 oascc.ZkStateReader$2.process A cluster state change: WatchedEvent state:SyncConnected type:NodeDataChanged path:/clusterstate.json, has occurred - updating... (live nodes size: 5)
[junit4:junit4]   2> 12386 T1124 oascc.ZkStateReader$2.process A cluster state change: WatchedEvent state:SyncConnected type:NodeDataChanged path:/clusterstate.json, has occurred - updating... (live nodes size: 5)
[junit4:junit4]   2> 12386 T1173 oascc.ZkStateReader$2.process A cluster state change: WatchedEvent state:SyncConnected type:NodeDataChanged path:/clusterstate.json, has occurred - updating... (live nodes size: 5)
[junit4:junit4]   2> 12814 T1191 oasc.CoreContainer.registerCore registering core: collection1
[junit4:junit4]   2> 12814 T1191 oasc.ZkController.register Register shard - core:collection1 address:http://127.0.0.1:20810/nud/i shardId:shard2
[junit4:junit4]   2> 12818 T1191 oasc.ZkController.register We are http://127.0.0.1:20810/nud/i/collection1/ and leader is http://127.0.0.1:20794/nud/i/collection1/
[junit4:junit4]   2> 12818 T1191 oasc.ZkController.register No LogReplay needed for core=collection1 baseURL=http://127.0.0.1:20810/nud/i
[junit4:junit4]   2> 12818 T1191 oasc.ZkController.checkRecovery Core needs to recover:collection1
[junit4:junit4]   2> 12818 T1191 oasu.DefaultSolrCoreState.doRecovery Running recovery - first canceling any ongoing recovery
[junit4:junit4]   2> ASYNC  NEW_CORE C73 name=collection1 org.apache.solr.core.SolrCore@3225f171 url=http://127.0.0.1:20810/nud/i/collection1 node=127.0.0.1:20810_nud%2Fi
[junit4:junit4]   2> 12818 T1193 C73 P20810 oasc.RecoveryStrategy.run Starting recovery process.  core=collection1 recoveringAfterStartup=true
[junit4:junit4]   2> 12819 T1191 oascc.ZkStateReader.updateClusterState Updating cloud state from ZooKeeper... 
[junit4:junit4]   2> 12819 T1193 C73 P20810 oasc.RecoveryStrategy.doRecovery ###### startupVersions=[]
[junit4:junit4]   2> 12820 T1193 C73 P20810 oasc.ZkController.publish publishing core=collection1 state=recovering
[junit4:junit4]   2> 12820 T1193 C73 P20810 oasc.ZkController.publish numShards not found on descriptor - reading it from system property
[junit4:junit4]   2> 12820 T1102 oass.SolrDispatchFilter.init user.dir=/usr/home/hudson/hudson-slave/workspace/Lucene-Solr-Tests-trunk-java7/solr/build/solr-core/test/J0
[junit4:junit4]   2> 12821 T1102 oass.SolrDispatchFilter.init SolrDispatchFilter.init() done
[junit4:junit4]   2> 12822 T1102 oascsi.HttpClientUtil.createClient Creating new http client, config:maxConnections=128&maxConnectionsPerHost=32&followRedirects=false
[junit4:junit4]   2> 12826 T1193 C73 P20810 oasc.RecoveryStrategy.doRecovery Attempting to PeerSync from http://127.0.0.1:20794/nud/i/collection1/ core=collection1 - recoveringAfterStartup=true
[junit4:junit4]   2> 12826 T1193 C73 P20810 oasu.PeerSync.sync PeerSync: core=collection1 url=http://127.0.0.1:20810/nud/i START replicas=[http://127.0.0.1:20794/nud/i/collection1/] nUpdates=100
[junit4:junit4]   2> 12827 T1193 C73 P20810 oasu.PeerSync.sync WARNING no frame of reference to tell of we've missed updates
[junit4:junit4]   2> 12827 T1193 C73 P20810 oasc.RecoveryStrategy.doRecovery PeerSync Recovery was not successful - trying replication. core=collection1
[junit4:junit4]   2> 12828 T1193 C73 P20810 oasc.RecoveryStrategy.doRecovery Starting Replication Recovery. core=collection1
[junit4:junit4]   2> 12828 T1193 C73 P20810 oascsi.HttpClientUtil.createClient Creating new http client, config:maxConnections=128&maxConnectionsPerHost=32&followRedirects=false
[junit4:junit4]   2> ASYNC  NEW_CORE C74 name=collection1 org.apache.solr.core.SolrCore@2ed930f url=http://127.0.0.1:20794/nud/i/collection1 node=127.0.0.1:20794_nud%2Fi
[junit4:junit4]   2> 12834 T1148 C74 P20794 REQ /get {distrib=false&qt=/get&wt=javabin&version=2&getVersions=100} status=0 QTime=0 
[junit4:junit4]   2> 12846 T1102 oascc.ZkStateReader.updateClusterState Updating cloud state from ZooKeeper... 
[junit4:junit4]   2> 12848 T1102 oasc.AbstractDistribZkTestBase.waitForRecoveriesToFinish Wait for recoveries to finish - collection: collection1 failOnTimeout:true timeout (sec):540
[junit4:junit4]   2> 12850 T1102 oascc.ZkStateReader.updateClusterState Updating cloud state from ZooKeeper... 
[junit4:junit4]   2> 12894 T1125 oascc.ZkStateReader.updateClusterState Updating cloud state from ZooKeeper... 
[junit4:junit4]   2> 12895 T1125 oasc.Overseer$ClusterStateUpdater.updateState Update state numShards=2 message={
[junit4:junit4]   2> 	  "operation":"state",
[junit4:junit4]   2> 	  "numShards":"2",
[junit4:junit4]   2> 	  "shard":"shard2",
[junit4:junit4]   2> 	  "roles":null,
[junit4:junit4]   2> 	  "state":"recovering",
[junit4:junit4]   2> 	  "core":"collection1",
[junit4:junit4]   2> 	  "collection":"collection1",
[junit4:junit4]   2> 	  "node_name":"127.0.0.1:20810_nud%2Fi",
[junit4:junit4]   2> 	  "base_url":"http://127.0.0.1:20810/nud/i"}
[junit4:junit4]   2> 12906 T1190 oascc.ZkStateReader$2.process A cluster state change: WatchedEvent state:SyncConnected type:NodeDataChanged path:/clusterstate.json, has occurred - updating... (live nodes size: 5)
[junit4:junit4]   2> 12907 T1124 oascc.ZkStateReader$2.process A cluster state change: WatchedEvent state:SyncConnected type:NodeDataChanged path:/clusterstate.json, has occurred - updating... (live nodes size: 5)
[junit4:junit4]   2> 12907 T1130 oascc.ZkStateReader$2.process A cluster state change: WatchedEvent state:SyncConnected type:NodeDataChanged path:/clusterstate.json, has occurred - updating... (live nodes size: 5)
[junit4:junit4]   2> 12907 T1143 oascc.ZkStateReader$2.process A cluster state change: WatchedEvent state:SyncConnected type:NodeDataChanged path:/clusterstate.json, has occurred - updating... (live nodes size: 5)
[junit4:junit4]   2> 12907 T1173 oascc.ZkStateReader$2.process A cluster state change: WatchedEvent state:SyncConnected type:NodeDataChanged path:/clusterstate.json, has occurred - updating... (live nodes size: 5)
[junit4:junit4]   2> 12907 T1158 oascc.ZkStateReader$2.process A cluster state change: WatchedEvent state:SyncConnected type:NodeDataChanged path:/clusterstate.json, has occurred - updating... (live nodes size: 5)
[junit4:junit4]   2> 13852 T1102 oascc.ZkStateReader.updateClusterState Updating cloud state from ZooKeeper... 
[junit4:junit4]   2>  C71_STATE=coll:collection1 core:collection1 props:{shard=shard1, roles=null, state=recovering, core=collection1, collection=collection1, node_name=127.0.0.1:20797_nud%2Fi, base_url=http://127.0.0.1:20797/nud/i}
[junit4:junit4]   2> 13993 T1176 C71 P20797 oasc.RecoveryStrategy.doRecovery Begin buffering updates. core=collection1
[junit4:junit4]   2> 13993 T1176 C71 P20797 oasu.UpdateLog.bufferUpdates Starting to buffer updates. FSUpdateLog{state=ACTIVE, tlog=null}
[junit4:junit4]   2> 13993 T1176 C71 P20797 oasc.RecoveryStrategy.replicate Attempting to replicate from http://127.0.0.1:20788/nud/i/collection1/. core=collection1
[junit4:junit4]   2> 13994 T1176 C71 P20797 oascsi.HttpClientUtil.createClient Creating new http client, config:maxConnections=128&maxConnectionsPerHost=32&followRedirects=false
[junit4:junit4]   2> 14005 T1135 C72 P20788 oasu.DirectUpdateHandler2.commit start commit{flags=0,_version_=0,optimize=false,openSearcher=false,waitSearcher=true,expungeDeletes=false,softCommit=false}
[junit4:junit4]   2> 14007 T1135 C72 P20788 oasc.CachingDirectoryFactory.close Releasing directory:/usr/home/hudson/hudson-slave/workspace/Lucene-Solr-Tests-trunk-java7/solr/build/solr-core/test/J0/./org.apache.solr.cloud.BasicDistributedZkTest-1355724685327/jetty1
[junit4:junit4]   2> 14012 T1135 C72 P20788 oasc.SolrDeletionPolicy.onInit SolrDeletionPolicy.onInit: commits:num=1
[junit4:junit4]   2> 		commit{dir=RateLimitedDirectoryWrapper(NRTCachingDirectory(org.apache.lucene.store.NIOFSDirectory@/usr/home/hudson/hudson-slave/workspace/Lucene-Solr-Tests-trunk-java7/solr/build/solr-core/test/J0/org.apache.solr.cloud.BasicDistributedZkTest-1355724685327/jetty1/index lockFactory=org.apache.lucene.store.NativeFSLockFactory@60c3a4bf; maxCacheMB=48.0 maxMergeSizeMB=4.0)),segFN=segments_1,generation=1,filenames=[segments_1]
[junit4:junit4]   2> 14013 T1135 C72 P20788 oasc.SolrDeletionPolicy.updateCommits newest commit = 1[segments_1]
[junit4:junit4]   2> 14043 T1135 C72 P20788 oasc.SolrDeletionPolicy.onCommit SolrDeletionPolicy.onCommit: commits:num=2
[junit4:junit4]   2> 		commit{dir=RateLimitedDirectoryWrapper(NRTCachingDirectory(org.apache.lucene.store.NIOFSDirectory@/usr/home/hudson/hudson-slave/workspace/Lucene-Solr-Tests-trunk-java7/solr/build/solr-core/test/J0/org.apache.solr.cloud.BasicDistributedZkTest-1355724685327/jetty1/index lockFactory=org.apache.lucene.store.NativeFSLockFactory@60c3a4bf; maxCacheMB=48.0 maxMergeSizeMB=4.0)),segFN=segments_1,generation=1,filenames=[segments_1]
[junit4:junit4]   2> 		commit{dir=RateLimitedDirectoryWrapper(NRTCachingDirectory(org.apache.lucene.store.NIOFSDirectory@/usr/home/hudson/hudson-slave/workspace/Lucene-Solr-Tests-trunk-java7/solr/build/solr-core/test/J0/org.apache.solr.cloud.BasicDistributedZkTest-1355724685327/jetty1/index lockFactory=org.apache.lucene.store.NativeFSLockFactory@60c3a4bf; maxCacheMB=48.0 maxMergeSizeMB=4.0)),segFN=segments_2,generation=2,filenames=[segments_2]
[junit4:junit4]   2> 14044 T1135 C72 P20788 oasc.SolrDeletionPolicy.updateCommits newest commit = 2[segments_2]
[junit4:junit4]   2> 14045 T1135 C72 P20788 oasc.CachingDirectoryFactory.close Releasing directory:/usr/home/hudson/hudson-slave/workspace/Lucene-Solr-Tests-trunk-java7/solr/build/solr-core/test/J0/./org.apache.solr.cloud.BasicDistributedZkTest-1355724685327/jetty1
[junit4:junit4]   2> 14045 T1135 C72 P20788 oass.SolrIndexSearcher.<init> Opening Searcher@ecf3e8c realtime
[junit4:junit4]   2> 14046 T1135 C72 P20788 oasu.DirectUpdateHandler2.commit end_commit_flush
[junit4:junit4]   2> 14046 T1135 C72 P20788 /update {waitSearcher=true&openSearcher=false&commit=true&commit_end_point=true&wt=javabin&softCommit=false&version=2} {commit=} 0 41
[junit4:junit4]   2> 14048 T1176 C71 P20797 oash.ReplicationHandler.inform Commits will be reserved for  10000
[junit4:junit4]   2> 14048 T1176 C71 P20797 oash.SnapPuller.<init>  No value set for 'pollInterval'. Timer Task not started.
[junit4:junit4]   2> 14051 T1136 C72 P20788 oash.ReplicationHandler.inform Commits will be reserved for  10000
[junit4:junit4]   2> 14052 T1136 C72 P20788 REQ /replication {command=indexversion&wt=javabin&qt=/replication&version=2} status=0 QTime=2 
[junit4:junit4]   2> 14052 T1176 C71 P20797 oash.SnapPuller.fetchLatestIndex Master's generation: 2
[junit4:junit4]   2> 14053 T1176 C71 P20797 oash.SnapPuller.fetchLatestIndex Slave's generation: 1
[junit4:junit4]   2> 14053 T1176 C71 P20797 oash.SnapPuller.fetchLatestIndex Starting replication process
[junit4:junit4]   2> 14055 T1136 C72 P20788 oasc.CachingDirectoryFactory.close Releasing directory:/usr/home/hudson/hudson-slave/workspace/Lucene-Solr-Tests-trunk-java7/solr/build/solr-core/test/J0/./org.apache.solr.cloud.BasicDistributedZkTest-1355724685327/jetty1
[junit4:junit4]   2> 14056 T1136 C72 P20788 oasc.CachingDirectoryFactory.close Releasing directory:/usr/home/hudson/hudson-slave/workspace/Lucene-Solr-Tests-trunk-java7/solr/build/solr-core/test/J0/./org.apache.solr.cloud.BasicDistributedZkTest-1355724685327/jetty1/index
[junit4:junit4]   2> 14057 T1136 C72 P20788 REQ /replication {command=filelist&generation=2&wt=javabin&qt=/replication&version=2} status=0 QTime=2 
[junit4:junit4]   2> 14057 T1176 C71 P20797 oash.SnapPuller.fetchLatestIndex Number of files in latest index in master: 1
[junit4:junit4]   2> 14059 T1176 C71 P20797 oasc.CachingDirectoryFactory.get return new directory for /usr/home/hudson/hudson-slave/workspace/Lucene-Solr-Tests-trunk-java7/solr/build/solr-core/test/J0/./org.apache.solr.cloud.BasicDistributedZkTest-1355724685327/jetty3/index.20121217041139378 forceNew:false
[junit4:junit4]   2> 14059 T1176 C71 P20797 oasc.CachingDirectoryFactory.close Releasing directory:/usr/home/hudson/hudson-slave/workspace/Lucene-Solr-Tests-trunk-java7/solr/build/solr-core/test/J0/./org.apache.solr.cloud.BasicDistributedZkTest-1355724685327/jetty3
[junit4:junit4]   2> 14060 T1176 C71 P20797 oash.SnapPuller.fetchLatestIndex Starting download to RateLimitedDirectoryWrapper(NRTCachingDirectory(org.apache.lucene.store.NIOFSDirectory@/usr/home/hudson/hudson-slave/workspace/Lucene-Solr-Tests-trunk-java7/solr/build/solr-core/test/J0/org.apache.solr.cloud.BasicDistributedZkTest-1355724685327/jetty3/index.20121217041139378 lockFactory=org.apache.lucene.store.NativeFSLockFactory@5dac7392; maxCacheMB=48.0 maxMergeSizeMB=4.0)) fullCopy=true
[junit4:junit4]   2> 14063 T1136 C72 P20788 REQ /replication {file=segments_2&command=filecontent&checksum=true&generation=2&qt=/replication&wt=filestream} status=0 QTime=0 
[junit4:junit4]   2> 14065 T1176 C71 P20797 oasc.CachingDirectoryFactory.close Releasing directory:/usr/home/hudson/hudson-slave/workspace/Lucene-Solr-Tests-trunk-java7/solr/build/solr-core/test/J0/./org.apache.solr.cloud.BasicDistributedZkTest-1355724685327/jetty3/index
[junit4:junit4]   2> 14065 T1176 C71 P20797 oash.SnapPuller.fetchLatestIndex Total time taken for download : 0 secs
[junit4:junit4]   2> 14066 T1176 C71 P20797 oash.SnapPuller.modifyIndexProps New index installed. Updating index properties... index=index.20121217041139378
[junit4:junit4]   2> 14067 T1176 C71 P20797 oasc.CachingDirectoryFactory.close Releasing directory:/usr/home/hudson/hudson-slave/workspace/Lucene-Solr-Tests-trunk-java7/solr/build/solr-core/test/J0/./org.apache.solr.cloud.BasicDistributedZkTest-1355724685327/jetty3
[junit4:junit4]   2> 14068 T1176 C71 P20797 oasc.CachingDirectoryFactory.close Releasing directory:/usr/home/hudson/hudson-slave/workspace/Lucene-Solr-Tests-trunk-java7/solr/build/solr-core/test/J0/./org.apache.solr.cloud.BasicDistributedZkTest-1355724685327/jetty3
[junit4:junit4]   2> 14068 T1176 C71 P20797 oasc.SolrCore.getNewIndexDir New index directory detected: old=./org.apache.solr.cloud.BasicDistributedZkTest-1355724685327/jetty3/index/ new=./org.apache.solr.cloud.BasicDistributedZkTest-1355724685327/jetty3/index.20121217041139378
[junit4:junit4]   2> 14072 T1176 C71 P20797 oasc.SolrDeletionPolicy.onInit SolrDeletionPolicy.onInit: commits:num=1
[junit4:junit4]   2> 		commit{dir=RateLimitedDirectoryWrapper(NRTCachingDirectory(org.apache.lucene.store.NIOFSDirectory@/usr/home/hudson/hudson-slave/workspace/Lucene-Solr-Tests-trunk-java7/solr/build/solr-core/test/J0/org.apache.solr.cloud.BasicDistributedZkTest-1355724685327/jetty3/index.20121217041139378 lockFactory=org.apache.lucene.store.NativeFSLockFactory@5dac7392; maxCacheMB=48.0 maxMergeSizeMB=4.0)),segFN=segments_2,generation=2,filenames=[segments_2]
[junit4:junit4]   2> 14072 T1176 C71 P20797 oasc.SolrDeletionPolicy.updateCommits newest commit = 2[segments_2]
[junit4:junit4]   2> 14073 T1176 C71 P20797 oasc.CachingDirectoryFactory.close Releasing directory:/usr/home/hudson/hudson-slave/workspace/Lucene-Solr-Tests-trunk-java7/solr/build/solr-core/test/J0/./org.apache.solr.cloud.BasicDistributedZkTest-1355724685327/jetty3
[junit4:junit4]   2> 14074 T1176 C71 P20797 oasu.DefaultSolrCoreState.newIndexWriter Creating new IndexWriter...
[junit4:junit4]   2> 14074 T1176 C71 P20797 oasu.DefaultSolrCoreState.newIndexWriter Waiting until IndexWriter is unused... core=collection1
[junit4:junit4]   2> 14074 T1176 C71 P20797 oasu.DefaultSolrCoreState.newIndexWriter Rollback old IndexWriter... core=collection1
[junit4:junit4]   2> 14075 T1176 C71 P20797 oasc.CachingDirectoryFactory.close Releasing directory:/usr/home/hudson/hudson-slave/workspace/Lucene-Solr-Tests-trunk-java7/solr/build/solr-core/test/J0/./org.apache.solr.cloud.BasicDistributedZkTest-1355724685327/jetty3/index.20121217041139378
[junit4:junit4]   2> 14075 T1176 C71 P20797 oasc.CachingDirectoryFactory.close Releasing directory:/usr/home/hudson/hudson-slave/workspace/Lucene-Solr-Tests-trunk-java7/solr/build/solr-core/test/J0/./org.apache.solr.cloud.BasicDistributedZkTest-1355724685327/jetty3
[junit4:junit4]   2> 14079 T1176 C71 P20797 oasc.SolrDeletionPolicy.onInit SolrDeletionPolicy.onInit: commits:num=1
[junit4:junit4]   2> 		commit{dir=RateLimitedDirectoryWrapper(NRTCachingDirectory(org.apache.lucene.store.NIOFSDirectory@/usr/home/hudson/hudson-slave/workspace/Lucene-Solr-Tests-trunk-java7/solr/build/solr-core/test/J0/org.apache.solr.cloud.BasicDistributedZkTest-1355724685327/jetty3/index.20121217041139378 lockFactory=org.apache.lucene.store.NativeFSLockFactory@5dac7392; maxCacheMB=48.0 maxMergeSizeMB=4.0)),segFN=segments_2,generation=2,filenames=[segments_2]
[junit4:junit4]   2> 14079 T1176 C71 P20797 oasc.SolrDeletionPolicy.updateCommits newest commit = 2[segments_2]
[junit4:junit4]   2> 14079 T1176 C71 P20797 oasu.DefaultSolrCoreState.newIndexWriter New IndexWriter is ready to be used.
[junit4:junit4]   2> 14080 T1176 C71 P20797 oasc.CachingDirectoryFactory.close Releasing directory:/usr/home/hudson/hudson-slave/workspace/Lucene-Solr-Tests-trunk-java7/solr/build/solr-core/test/J0/./org.apache.solr.cloud.BasicDistributedZkTest-1355724685327/jetty3
[junit4:junit4]   2> 14080 T1176 C71 P20797 oass.SolrIndexSearcher.<init> Opening Searcher@710a0dd9 main
[junit4:junit4]   2> 14082 T1175 oasc.SolrCore.registerSearcher [collection1] Registered new searcher Searcher@710a0dd9 main{StandardDirectoryReader(segments_2:1:nrt)}
[junit4:junit4]   2> 14083 T1175 oasc.CachingDirectoryFactory.close Releasing directory:/usr/home/hudson/hudson-slave/workspace/Lucene-Solr-Tests-trunk-java7/solr/build/solr-core/test/J0/./org.apache.solr.cloud.BasicDistributedZkTest-1355724685327/jetty3/index
[junit4:junit4]   2> 14083 T1176 C71 P20797 oasu.DirectUpdateHandler2.commit start commit{flags=0,_version_=0,optimize=false,openSearcher=false,waitSearcher=false,expungeDeletes=false,softCommit=false}
[junit4:junit4]   2> 14086 T1176 C71 P20797 oasc.SolrDeletionPolicy.onCommit SolrDeletionPolicy.onCommit: commits:num=2
[junit4:junit4]   2> 		commit{dir=RateLimitedDirectoryWrapper(NRTCachingDirectory(org.apache.lucene.store.NIOFSDirectory@/usr/home/hudson/hudson-slave/workspace/Lucene-Solr-Tests-trunk-java7/solr/build/solr-core/test/J0/org.apache.solr.cloud.BasicDistributedZkTest-1355724685327/jetty3/index.20121217041139378 lockFactory=org.apache.lucene.store.NativeFSLockFactory@5dac7392; maxCacheMB=48.0 maxMergeSizeMB=4.0)),segFN=segments_2,generation=2,filenames=[segments_2]
[junit4:junit4]   2> 		commit{dir=RateLimitedDirectoryWrapper(NRTCachingDirectory(org.apache.lucene.store.NIOFSDirectory@/usr/home/hudson/hudson-slave/workspace/Lucene-Solr-Tests-trunk-java7/solr/build/solr-core/test/J0/org.apache.solr.cloud.BasicDistributedZkTest-1355724685327/jetty3/index.20121217041139378 lockFactory=org.apache.lucene.store.NativeFSLockFactory@5dac7392; maxCacheMB=48.0 maxMergeSizeMB=4.0)),segFN=segments_3,generation=3,filenames=[segments_3]
[junit4:junit4]   2> 14087 T1176 C71 P20797 oasc.SolrDeletionPolicy.updateCommits newest commit = 3[segments_3]
[junit4:junit4]   2> 14088 T1176 C71 P20797 oasc.CachingDirectoryFactory.close Releasing directory:/usr/home/hudson/hudson-slave/workspace/Lucene-Solr-Tests-trunk-java7/solr/build/solr-core/test/J0/./org.apache.solr.cloud.BasicDistributedZkTest-1355724685327/jetty3
[junit4:junit4]   2> 14088 T1176 C71 P20797 oasu.DirectUpdateHandler2.commit end_commit_flush
[junit4:junit4]   2> 14088 T1176 C71 P20797 oasc.CachingDirectoryFactory.close Releasing directory:/usr/home/hudson/hudson-slave/workspace/Lucene-Solr-Tests-trunk-java7/solr/build/solr-core/test/J0/./org.apache.solr.cloud.BasicDistributedZkTest-1355724685327/jetty3/index.20121217041139378
[junit4:junit4]   2> 14088 T1176 C71 P20797 oasc.CachingDirectoryFactory.close Releasing directory:/usr/home/hudson/hudson-slave/workspace/Lucene-Solr-Tests-trunk-java7/solr/build/solr-core/test/J0/./org.apache.solr.cloud.BasicDistributedZkTest-1355724685327/jetty3/index
[junit4:junit4]   2> 14089 T1176 C71 P20797 oasc.RecoveryStrategy.replay No replay needed. core=collection1
[junit4:junit4]   2> 14089 T1176 C71 P20797 oasc.RecoveryStrategy.doRecovery Replication Recovery was successful - registering as Active. core=collection1
[junit4:junit4]   2> 14089 T1176 C71 P20797 oasc.ZkController.publish publishing core=collection1 state=active
[junit4:junit4]   2> 14089 T1176 C71 P20797 oasc.ZkController.publish numShards not found on descriptor - reading it from system property
[junit4:junit4]   2> 14096 T1176 C71 P20797 oasc.RecoveryStrategy.doRecovery Finished recovery process. core=collection1
[junit4:junit4]   2> 14417 T1125 oascc.ZkStateReader.updateClusterState Updating cloud state from ZooKeeper... 
[junit4:junit4]   2> 14418 T1125 oasc.Overseer$ClusterStateUpdater.updateState Update state numShards=2 message={
[junit4:junit4]   2> 	  "operation":"state",
[junit4:junit4]   2> 	  "numShards":"2",
[junit4:junit4]   2> 	  "shard":"shard1",
[junit4:junit4]   2> 	  "roles":null,
[junit4:junit4]   2> 	  "state":"active",
[junit4:junit4]   2> 	  "core":"collection1",
[junit4:junit4]   2> 	  "collection":"collection1",
[junit4:junit4]   2> 	  "node_name":"127.0.0.1:20797_nud%2Fi",
[junit4:junit4]   2> 	  "base_url":"http://127.0.0.1:20797/nud/i"}
[junit4:junit4]   2> 14431 T1190 oascc.ZkStateReader$2.process A cluster state change: WatchedEvent state:SyncConnected type:NodeDataChanged path:/clusterstate.json, has occurred - updating... (live nodes size: 5)
[junit4:junit4]   2> 14431 T1173 oascc.ZkStateReader$2.process A cluster state change: WatchedEvent state:SyncConnected type:NodeDataChanged path:/clusterstate.json, has occurred - updating... (live nodes size: 5)
[junit4:junit4]   2> 14431 T1124 oascc.ZkStateReader$2.process A cluster state change: WatchedEvent state:SyncConnected type:NodeDataChanged path:/clusterstate.json, has occurred - updating... (live nodes size: 5)
[junit4:junit4]   2> 14431 T1158 oascc.ZkStateReader$2.process A cluster state change: WatchedEvent state:SyncConnected type:NodeDataChanged path:/clusterstate.json, has occurred - updating... (live nodes size: 5)
[junit4:junit4]   2> 14431 T1143 oascc.ZkStateReader$2.process A cluster state change: WatchedEvent state:SyncConnected type:NodeDataChanged path:/clusterstate.json, has occurred - updating... (live nodes size: 5)
[junit4:junit4]   2> 14431 T1130 oascc.ZkStateReader$2.process A cluster state change: WatchedEvent state:SyncConnected type:NodeDataChanged path:/clusterstate.json, has occurred - updating... (live nodes size: 5)
[junit4:junit4]   2> 14855 T1102 oascc.ZkStateReader.updateClusterState Updating cloud state from ZooKeeper... 
[junit4:junit4]   2>  C73_STATE=coll:collection1 core:collection1 props:{shard=shard2, roles=null, state=recovering, core=collection1, collection=collection1, node_name=127.0.0.1:20810_nud%2Fi, base_url=http://127.0.0.1:20810/nud/i}
[junit4:junit4]   2> 15849 T1193 C73 P20810 oasc.RecoveryStrategy.doRecovery Begin buffering updates. core=collection1
[junit4:junit4]   2> 15849 T1193 C73 P20810 oasu.UpdateLog.bufferUpdates Starting to buffer updates. FSUpdateLog{state=ACTIVE, tlog=null}
[junit4:junit4]   2> 15849 T1193 C73 P20810 oasc.RecoveryStrategy.replicate Attempting to replicate from http://127.0.0.1:20794/nud/i/collection1/. core=collection1
[junit4:junit4]   2> 15849 T1193 C73 P20810 oascsi.HttpClientUtil.createClient Creating new http client, config:maxConnections=128&maxConnectionsPerHost=32&followRedirects=false
[junit4:junit4]   2> 15858 T1102 oascc.ZkStateReader.updateClusterState Updating cloud state from ZooKeeper... 
[junit4:junit4]   2> 15866 T1150 C74 P20794 oasu.DirectUpdateHandler2.commit start commit{flags=0,_version_=0,optimize=false,openSearcher=false,waitSearcher=true,expungeDeletes=false,softCommit=false}
[junit4:junit4]   2> 16665 T1150 C74 P20794 oasc.CachingDirectoryFactory.close Releasing directory:/usr/home/hudson/hudson-slave/workspace/Lucene-Solr-Tests-trunk-java7/solr/build/solr-core/test/J0/./org.apache.solr.cloud.BasicDistributedZkTest-1355724685327/jetty2
[junit4:junit4]   2> 16670 T1150 C74 P20794 oasc.SolrDeletionPolicy.onInit SolrDeletionPolicy.onInit: commits:num=1
[junit4:junit4]   2> 		commit{dir=RateLimitedDirectoryWrapper(NRTCachingDirectory(org.apache.lucene.store.NIOFSDirectory@/usr/home/hudson/hudson-slave/workspace/Lucene-Solr-Tests-trunk-java7/solr/build/solr-core/test/J0/org.apache.solr.cloud.BasicDistributedZkTest-1355724685327/jetty2/index lockFactory=org.apache.lucene.store.NativeFSLockFactory@5a4b4bf3; maxCacheMB=48.0 maxM

[...truncated too long message...]

low=true -Dtests.locale=in_ID -Dtests.timezone=Australia/Currie -Dtests.file.encoding=US-ASCII
[junit4:junit4] FAILURE  117s J1 | SyncSliceTest.testDistribSearch <<<
[junit4:junit4]    > Throwable #1: java.lang.AssertionError
[junit4:junit4]    > 	at __randomizedtesting.SeedInfo.seed([C521A92A7DD5CCA0:44C727320A8AAC9C]:0)
[junit4:junit4]    > 	at org.junit.Assert.fail(Assert.java:92)
[junit4:junit4]    > 	at org.junit.Assert.assertTrue(Assert.java:43)
[junit4:junit4]    > 	at org.junit.Assert.assertNotNull(Assert.java:526)
[junit4:junit4]    > 	at org.junit.Assert.assertNotNull(Assert.java:537)
[junit4:junit4]    > 	at org.apache.solr.cloud.SyncSliceTest.doTest(SyncSliceTest.java:211)
[junit4:junit4]    > 	at org.apache.solr.BaseDistributedSearchTestCase.testDistribSearch(BaseDistributedSearchTestCase.java:794)
[junit4:junit4]    > 	at sun.reflect.NativeMethodAccessorImpl.invoke0(Native Method)
[junit4:junit4]    > 	at sun.reflect.NativeMethodAccessorImpl.invoke(NativeMethodAccessorImpl.java:57)
[junit4:junit4]    > 	at sun.reflect.DelegatingMethodAccessorImpl.invoke(DelegatingMethodAccessorImpl.java:43)
[junit4:junit4]    > 	at java.lang.reflect.Method.invoke(Method.java:601)
[junit4:junit4]    > 	at com.carrotsearch.randomizedtesting.RandomizedRunner.invoke(RandomizedRunner.java:1559)
[junit4:junit4]    > 	at com.carrotsearch.randomizedtesting.RandomizedRunner.access$600(RandomizedRunner.java:79)
[junit4:junit4]    > 	at com.carrotsearch.randomizedtesting.RandomizedRunner$6.evaluate(RandomizedRunner.java:737)
[junit4:junit4]    > 	at com.carrotsearch.randomizedtesting.RandomizedRunner$7.evaluate(RandomizedRunner.java:773)
[junit4:junit4]    > 	at com.carrotsearch.randomizedtesting.RandomizedRunner$8.evaluate(RandomizedRunner.java:787)
[junit4:junit4]    > 	at com.carrotsearch.randomizedtesting.rules.SystemPropertiesRestoreRule$1.evaluate(SystemPropertiesRestoreRule.java:53)
[junit4:junit4]    > 	at org.apache.lucene.util.TestRuleSetupTeardownChained$1.evaluate(TestRuleSetupTeardownChained.java:50)
[junit4:junit4]    > 	at org.apache.lucene.util.TestRuleFieldCacheSanity$1.evaluate(TestRuleFieldCacheSanity.java:51)
[junit4:junit4]    > 	at org.apache.lucene.util.AbstractBeforeAfterRule$1.evaluate(AbstractBeforeAfterRule.java:46)
[junit4:junit4]    > 	at com.carrotsearch.randomizedtesting.rules.SystemPropertiesInvariantRule$1.evaluate(SystemPropertiesInvariantRule.java:55)
[junit4:junit4]    > 	at org.apache.lucene.util.TestRuleThreadAndTestName$1.evaluate(TestRuleThreadAndTestName.java:49)
[junit4:junit4]    > 	at org.apache.lucene.util.TestRuleIgnoreAfterMaxFailures$1.evaluate(TestRuleIgnoreAfterMaxFailures.java:70)
[junit4:junit4]    > 	at org.apache.lucene.util.TestRuleMarkFailure$1.evaluate(TestRuleMarkFailure.java:48)
[junit4:junit4]    > 	at com.carrotsearch.randomizedtesting.rules.StatementAdapter.evaluate(StatementAdapter.java:36)
[junit4:junit4]    > 	at com.carrotsearch.randomizedtesting.ThreadLeakControl$StatementRunner.run(ThreadLeakControl.java:358)
[junit4:junit4]    > 	at com.carrotsearch.randomizedtesting.ThreadLeakControl.forkTimeoutingTask(ThreadLeakControl.java:782)
[junit4:junit4]    > 	at com.carrotsearch.randomizedtesting.ThreadLeakControl$3.evaluate(ThreadLeakControl.java:442)
[junit4:junit4]    > 	at com.carrotsearch.randomizedtesting.RandomizedRunner.runSingleTest(RandomizedRunner.java:746)
[junit4:junit4]    > 	at com.carrotsearch.randomizedtesting.RandomizedRunner$3.evaluate(RandomizedRunner.java:648)
[junit4:junit4]    > 	at com.carrotsearch.randomizedtesting.RandomizedRunner$4.evaluate(RandomizedRunner.java:682)
[junit4:junit4]    > 	at com.carrotsearch.randomizedtesting.RandomizedRunner$5.evaluate(RandomizedRunner.java:693)
[junit4:junit4]    > 	at com.carrotsearch.randomizedtesting.rules.StatementAdapter.evaluate(StatementAdapter.java:36)
[junit4:junit4]    > 	at com.carrotsearch.randomizedtesting.rules.SystemPropertiesRestoreRule$1.evaluate(SystemPropertiesRestoreRule.java:53)
[junit4:junit4]    > 	at org.apache.lucene.util.AbstractBeforeAfterRule$1.evaluate(AbstractBeforeAfterRule.java:46)
[junit4:junit4]    > 	at org.apache.lucene.util.TestRuleStoreClassName$1.evaluate(TestRuleStoreClassName.java:42)
[junit4:junit4]    > 	at com.carrotsearch.randomizedtesting.rules.SystemPropertiesInvariantRule$1.evaluate(SystemPropertiesInvariantRule.java:55)
[junit4:junit4]    > 	at com.carrotsearch.randomizedtesting.rules.NoShadowingOrOverridesOnMethodsRule$1.evaluate(NoShadowingOrOverridesOnMethodsRule.java:39)
[junit4:junit4]    > 	at com.carrotsearch.randomizedtesting.rules.NoShadowingOrOverridesOnMethodsRule$1.evaluate(NoShadowingOrOverridesOnMethodsRule.java:39)
[junit4:junit4]    > 	at com.carrotsearch.randomizedtesting.rules.StatementAdapter.evaluate(StatementAdapter.java:36)
[junit4:junit4]    > 	at org.apache.lucene.util.TestRuleAssertionsRequired$1.evaluate(TestRuleAssertionsRequired.java:43)
[junit4:junit4]    > 	at org.apache.lucene.util.TestRuleMarkFailure$1.evaluate(TestRuleMarkFailure.java:48)
[junit4:junit4]    > 	at org.apache.lucene.util.TestRuleIgnoreAfterMaxFailures$1.evaluate(TestRuleIgnoreAfterMaxFailures.java:70)
[junit4:junit4]    > 	at org.apache.lucene.util.TestRuleIgnoreTestSuites$1.evaluate(TestRuleIgnoreTestSuites.java:55)
[junit4:junit4]    > 	at com.carrotsearch.randomizedtesting.rules.StatementAdapter.evaluate(StatementAdapter.java:36)
[junit4:junit4]    > 	at com.carrotsearch.randomizedtesting.ThreadLeakControl$StatementRunner.run(ThreadLeakControl.java:358)
[junit4:junit4]    > 	at java.lang.Thread.run(Thread.java:722)
[junit4:junit4]   2> 117000 T2629 oas.SolrTestCaseJ4.deleteCore ###deleteCore
[junit4:junit4]   2> NOTE: test params are: codec=Lucene40, sim=DefaultSimilarity, locale=in_ID, timezone=Australia/Currie
[junit4:junit4]   2> NOTE: FreeBSD 9.0-RELEASE amd64/Oracle Corporation 1.7.0_09 (64-bit)/cpus=16,threads=2,free=265463688,total=490733568
[junit4:junit4]   2> NOTE: All tests run in this JVM: [TestSurroundQueryParser, TestDistributedSearch, SchemaVersionSpecificBehaviorTest, OpenExchangeRatesOrgProviderTest, TestSort, URLClassifyProcessorTest, TestJmxIntegration, TestUpdate, TestRealTimeGet, TestLazyCores, SuggesterTest, TestHashPartitioner, TestRemoteStreaming, OverseerTest, TestReversedWildcardFilterFactory, TestElisionMultitermQuery, TestCharFilters, XsltUpdateRequestHandlerTest, RequiredFieldsTest, HighlighterTest, DistributedQueryElevationComponentTest, StatsComponentTest, FullSolrCloudDistribCmdsTest, TestSolrCoreProperties, IndexReaderFactoryTest, TestSolrIndexConfig, TestWriterPerf, SignatureUpdateProcessorFactoryTest, UpdateParamsTest, RAMDirectoryFactoryTest, StandardRequestHandlerTest, TestPluginEnable, OutputWriterTest, TestArbitraryIndexDir, RecoveryZkTest, SolrInfoMBeanTest, PrimitiveFieldTypeTest, DirectUpdateHandlerTest, LeaderElectionTest, TestFoldingMultitermQuery, XmlUpdateRequestHandlerTest, EchoParamsTest, TestUtils, DocumentBuilderTest, LegacyHTMLStripCharFilterTest, TestAnalyzedSuggestions, BasicFunctionalityTest, ZkCLITest, ExternalFileFieldSortTest, MultiTermTest, TestPropInjectDefaults, TestZkChroot, FieldMutatingUpdateProcessorTest, TestOmitPositions, StatelessScriptUpdateProcessorFactoryTest, TestSolrDeletionPolicy2, TestAtomicUpdateErrorCases, QueryParsingTest, QueryEqualityTest, SpellCheckComponentTest, TestReplicationHandler, LeaderElectionIntegrationTest, TestDistributedGrouping, TestRandomFaceting, TestExtendedDismaxParser, SoftAutoCommitTest, BasicZkTest, ZkSolrClientTest, WordBreakSolrSpellCheckerTest, TestRecovery, TestJoin, SolrCoreTest, TestRangeQuery, TestMultiCoreConfBootstrap, SimpleFacetsTest, TestCoreContainer, LukeRequestHandlerTest, TestGroupingSearch, DirectSolrSpellCheckerTest, FileBasedSpellCheckerTest, ConvertedLegacyTest, SortByFunctionTest, TestBinaryResponseWriter, SampleTest, CoreAdminHandlerTest, TestTrie, SolrRequestParserTest, TestWordDelimiterFilterFactory, PolyFieldTest, TestCSVResponseWriter, DisMaxRequestHandlerTest, BinaryUpdateRequestHandlerTest, MinimalSchemaTest, TestPHPSerializedResponseWriter, PingRequestHandlerTest, TermVectorComponentTest, IndexSchemaRuntimeFieldTest, SolrPluginUtilsTest, DebugComponentTest, ReturnFieldsTest, SearchHandlerTest, TestQueryUtils, SuggesterTSTTest, NotRequiredUniqueKeyTest, TestSolrDeletionPolicy1, TestPropInject, TestBinaryField, DefaultValueUpdateProcessorTest, TestXIncludeConfig, TestQuerySenderListener, TestQuerySenderNoQuery, TestBM25SimilarityFactory, TestPerFieldSimilarity, TestLMJelinekMercerSimilarityFactory, TestCodecSupport, DateMathParserTest, PrimUtilsTest, FileUtilsTest, TestSolrXMLSerializer, DOMUtilTest, PreAnalyzedFieldTest, CircularListTest, PathHierarchyTokenizerFactoryTest, ClusterStateTest, SyncSliceTest]
[junit4:junit4] Completed on J1 in 117.02s, 1 test, 1 failure <<< FAILURES!

[...truncated 12 lines...]
BUILD FAILED
/usr/home/hudson/hudson-slave/workspace/Lucene-Solr-Tests-trunk-java7/build.xml:353: The following error occurred while executing this line:
/usr/home/hudson/hudson-slave/workspace/Lucene-Solr-Tests-trunk-java7/build.xml:39: The following error occurred while executing this line:
/usr/home/hudson/hudson-slave/workspace/Lucene-Solr-Tests-trunk-java7/solr/build.xml:178: The following error occurred while executing this line:
/usr/home/hudson/hudson-slave/workspace/Lucene-Solr-Tests-trunk-java7/solr/common-build.xml:438: The following error occurred while executing this line:
/usr/home/hudson/hudson-slave/workspace/Lucene-Solr-Tests-trunk-java7/lucene/common-build.xml:1175: The following error occurred while executing this line:
/usr/home/hudson/hudson-slave/workspace/Lucene-Solr-Tests-trunk-java7/lucene/common-build.xml:840: There were test failures: 241 suites, 1006 tests, 2 errors, 1 failure, 21 ignored (3 assumptions)

Total time: 33 minutes 55 seconds
Build step 'Invoke Ant' marked build as failure
Archiving artifacts
Recording test results
Email was triggered for: Failure
Sending email for trigger: Failure



Mime
View raw message