lucene-dev mailing list archives

Site index · List index
Message view « Date » · « Thread »
Top « Date » · « Thread »
From Apache Jenkins Server <jenk...@builds.apache.org>
Subject [JENKINS] Lucene-Solr-Tests-trunk-Java6 - Build # 15721 - Still Failing
Date Mon, 17 Dec 2012 03:12:25 GMT
Build: https://builds.apache.org/job/Lucene-Solr-Tests-trunk-Java6/15721/

14 tests failed.
REGRESSION:  org.apache.solr.cloud.OverseerCollectionProcessorTest.testNoReplicationUnequalNumberOfSlicesPerNode

Error Message:
Captured an uncaught exception in thread: Thread[id=2760, name=Thread-977, state=RUNNABLE, group=TGRP-OverseerCollectionProcessorTest]

Stack Trace:
com.carrotsearch.randomizedtesting.UncaughtExceptionError: Captured an uncaught exception in thread: Thread[id=2760, name=Thread-977, state=RUNNABLE, group=TGRP-OverseerCollectionProcessorTest]
Caused by: java.lang.AssertionError: 
  Unexpected method call poll():
	at __randomizedtesting.SeedInfo.seed([B2E533D3F17E6070]:0)
	at org.easymock.internal.MockInvocationHandler.invoke(MockInvocationHandler.java:45)
	at org.easymock.internal.ObjectMethodsFilter.invoke(ObjectMethodsFilter.java:73)
	at org.easymock.internal.ClassProxyFactory$MockMethodInterceptor.intercept(ClassProxyFactory.java:92)
	at org.apache.solr.cloud.DistributedQueue$$EnhancerByCGLIB$$4eacec50.poll(<generated>)
	at org.apache.solr.cloud.OverseerCollectionProcessor.run(OverseerCollectionProcessor.java:122)
	at java.lang.Thread.run(Thread.java:679)


REGRESSION:  org.apache.solr.cloud.OverseerCollectionProcessorTest.testNoReplicationCollectionNotCreatedDueToMaxShardsPerNodeAndNodesToCreateOnLimits

Error Message:
Captured an uncaught exception in thread: Thread[id=2761, name=Thread-978, state=RUNNABLE, group=TGRP-OverseerCollectionProcessorTest]

Stack Trace:
com.carrotsearch.randomizedtesting.UncaughtExceptionError: Captured an uncaught exception in thread: Thread[id=2761, name=Thread-978, state=RUNNABLE, group=TGRP-OverseerCollectionProcessorTest]
Caused by: java.lang.AssertionError: 
  Unexpected method call poll():
	at __randomizedtesting.SeedInfo.seed([B2E533D3F17E6070]:0)
	at org.easymock.internal.MockInvocationHandler.invoke(MockInvocationHandler.java:45)
	at org.easymock.internal.ObjectMethodsFilter.invoke(ObjectMethodsFilter.java:73)
	at org.easymock.internal.ClassProxyFactory$MockMethodInterceptor.intercept(ClassProxyFactory.java:92)
	at org.apache.solr.cloud.DistributedQueue$$EnhancerByCGLIB$$4eacec50.poll(<generated>)
	at org.apache.solr.cloud.OverseerCollectionProcessor.run(OverseerCollectionProcessor.java:122)
	at java.lang.Thread.run(Thread.java:679)


REGRESSION:  org.apache.solr.cloud.OverseerCollectionProcessorTest.testNoReplicationEqualNumberOfSlicesPerNodeSendCreateNodesEqualToLiveNodes

Error Message:
Captured an uncaught exception in thread: Thread[id=2762, name=Thread-979, state=RUNNABLE, group=TGRP-OverseerCollectionProcessorTest]

Stack Trace:
com.carrotsearch.randomizedtesting.UncaughtExceptionError: Captured an uncaught exception in thread: Thread[id=2762, name=Thread-979, state=RUNNABLE, group=TGRP-OverseerCollectionProcessorTest]
Caused by: java.lang.AssertionError: 
  Unexpected method call poll():
	at __randomizedtesting.SeedInfo.seed([B2E533D3F17E6070]:0)
	at org.easymock.internal.MockInvocationHandler.invoke(MockInvocationHandler.java:45)
	at org.easymock.internal.ObjectMethodsFilter.invoke(ObjectMethodsFilter.java:73)
	at org.easymock.internal.ClassProxyFactory$MockMethodInterceptor.intercept(ClassProxyFactory.java:92)
	at org.apache.solr.cloud.DistributedQueue$$EnhancerByCGLIB$$4eacec50.poll(<generated>)
	at org.apache.solr.cloud.OverseerCollectionProcessor.run(OverseerCollectionProcessor.java:122)
	at java.lang.Thread.run(Thread.java:679)


REGRESSION:  org.apache.solr.cloud.OverseerCollectionProcessorTest.testNoReplicationLimitedNodesToCreateOn

Error Message:
Captured an uncaught exception in thread: Thread[id=2763, name=Thread-980, state=RUNNABLE, group=TGRP-OverseerCollectionProcessorTest]

Stack Trace:
com.carrotsearch.randomizedtesting.UncaughtExceptionError: Captured an uncaught exception in thread: Thread[id=2763, name=Thread-980, state=RUNNABLE, group=TGRP-OverseerCollectionProcessorTest]
Caused by: java.lang.AssertionError: 
  Unexpected method call poll():
	at __randomizedtesting.SeedInfo.seed([B2E533D3F17E6070]:0)
	at org.easymock.internal.MockInvocationHandler.invoke(MockInvocationHandler.java:45)
	at org.easymock.internal.ObjectMethodsFilter.invoke(ObjectMethodsFilter.java:73)
	at org.easymock.internal.ClassProxyFactory$MockMethodInterceptor.intercept(ClassProxyFactory.java:92)
	at org.apache.solr.cloud.DistributedQueue$$EnhancerByCGLIB$$4eacec50.poll(<generated>)
	at org.apache.solr.cloud.OverseerCollectionProcessor.run(OverseerCollectionProcessor.java:122)
	at java.lang.Thread.run(Thread.java:679)


REGRESSION:  org.apache.solr.cloud.OverseerCollectionProcessorTest.testNoReplicationEqualNumberOfSlicesPerNodeSendNullCreateNodes

Error Message:
Captured an uncaught exception in thread: Thread[id=2764, name=Thread-981, state=RUNNABLE, group=TGRP-OverseerCollectionProcessorTest]

Stack Trace:
com.carrotsearch.randomizedtesting.UncaughtExceptionError: Captured an uncaught exception in thread: Thread[id=2764, name=Thread-981, state=RUNNABLE, group=TGRP-OverseerCollectionProcessorTest]
Caused by: java.lang.AssertionError: 
  Unexpected method call poll():
	at __randomizedtesting.SeedInfo.seed([B2E533D3F17E6070]:0)
	at org.easymock.internal.MockInvocationHandler.invoke(MockInvocationHandler.java:45)
	at org.easymock.internal.ObjectMethodsFilter.invoke(ObjectMethodsFilter.java:73)
	at org.easymock.internal.ClassProxyFactory$MockMethodInterceptor.intercept(ClassProxyFactory.java:92)
	at org.apache.solr.cloud.DistributedQueue$$EnhancerByCGLIB$$4eacec50.poll(<generated>)
	at org.apache.solr.cloud.OverseerCollectionProcessor.run(OverseerCollectionProcessor.java:122)
	at java.lang.Thread.run(Thread.java:679)


REGRESSION:  org.apache.solr.cloud.OverseerCollectionProcessorTest.testReplicationEqualNumberOfSlicesPerNodeSendCreateNodesEqualToLiveNodes

Error Message:
Captured an uncaught exception in thread: Thread[id=2765, name=Thread-982, state=RUNNABLE, group=TGRP-OverseerCollectionProcessorTest]

Stack Trace:
com.carrotsearch.randomizedtesting.UncaughtExceptionError: Captured an uncaught exception in thread: Thread[id=2765, name=Thread-982, state=RUNNABLE, group=TGRP-OverseerCollectionProcessorTest]
Caused by: java.lang.AssertionError: 
  Unexpected method call poll():
	at __randomizedtesting.SeedInfo.seed([B2E533D3F17E6070]:0)
	at org.easymock.internal.MockInvocationHandler.invoke(MockInvocationHandler.java:45)
	at org.easymock.internal.ObjectMethodsFilter.invoke(ObjectMethodsFilter.java:73)
	at org.easymock.internal.ClassProxyFactory$MockMethodInterceptor.intercept(ClassProxyFactory.java:92)
	at org.apache.solr.cloud.DistributedQueue$$EnhancerByCGLIB$$4eacec50.poll(<generated>)
	at org.apache.solr.cloud.OverseerCollectionProcessor.run(OverseerCollectionProcessor.java:122)
	at java.lang.Thread.run(Thread.java:679)


REGRESSION:  org.apache.solr.cloud.OverseerCollectionProcessorTest.testReplicationEqualNumberOfSlicesPerNodeSendNullCreateNodes

Error Message:
Captured an uncaught exception in thread: Thread[id=2766, name=Thread-983, state=RUNNABLE, group=TGRP-OverseerCollectionProcessorTest]

Stack Trace:
com.carrotsearch.randomizedtesting.UncaughtExceptionError: Captured an uncaught exception in thread: Thread[id=2766, name=Thread-983, state=RUNNABLE, group=TGRP-OverseerCollectionProcessorTest]
Caused by: java.lang.AssertionError: 
  Unexpected method call poll():
	at __randomizedtesting.SeedInfo.seed([B2E533D3F17E6070]:0)
	at org.easymock.internal.MockInvocationHandler.invoke(MockInvocationHandler.java:45)
	at org.easymock.internal.ObjectMethodsFilter.invoke(ObjectMethodsFilter.java:73)
	at org.easymock.internal.ClassProxyFactory$MockMethodInterceptor.intercept(ClassProxyFactory.java:92)
	at org.apache.solr.cloud.DistributedQueue$$EnhancerByCGLIB$$4eacec50.poll(<generated>)
	at org.apache.solr.cloud.OverseerCollectionProcessor.run(OverseerCollectionProcessor.java:122)
	at java.lang.Thread.run(Thread.java:679)


REGRESSION:  org.apache.solr.cloud.OverseerCollectionProcessorTest.testNoReplicationEqualNumberOfSlicesPerNode

Error Message:
Captured an uncaught exception in thread: Thread[id=2767, name=Thread-984, state=RUNNABLE, group=TGRP-OverseerCollectionProcessorTest]

Stack Trace:
com.carrotsearch.randomizedtesting.UncaughtExceptionError: Captured an uncaught exception in thread: Thread[id=2767, name=Thread-984, state=RUNNABLE, group=TGRP-OverseerCollectionProcessorTest]
Caused by: java.lang.AssertionError: 
  Unexpected method call poll():
	at __randomizedtesting.SeedInfo.seed([B2E533D3F17E6070]:0)
	at org.easymock.internal.MockInvocationHandler.invoke(MockInvocationHandler.java:45)
	at org.easymock.internal.ObjectMethodsFilter.invoke(ObjectMethodsFilter.java:73)
	at org.easymock.internal.ClassProxyFactory$MockMethodInterceptor.intercept(ClassProxyFactory.java:92)
	at org.apache.solr.cloud.DistributedQueue$$EnhancerByCGLIB$$4eacec50.poll(<generated>)
	at org.apache.solr.cloud.OverseerCollectionProcessor.run(OverseerCollectionProcessor.java:122)
	at java.lang.Thread.run(Thread.java:679)


REGRESSION:  org.apache.solr.cloud.OverseerCollectionProcessorTest.testReplicationUnequalNumberOfSlicesPerNode

Error Message:
Captured an uncaught exception in thread: Thread[id=2768, name=Thread-985, state=RUNNABLE, group=TGRP-OverseerCollectionProcessorTest]

Stack Trace:
com.carrotsearch.randomizedtesting.UncaughtExceptionError: Captured an uncaught exception in thread: Thread[id=2768, name=Thread-985, state=RUNNABLE, group=TGRP-OverseerCollectionProcessorTest]
Caused by: java.lang.AssertionError: 
  Unexpected method call poll():
	at __randomizedtesting.SeedInfo.seed([B2E533D3F17E6070]:0)
	at org.easymock.internal.MockInvocationHandler.invoke(MockInvocationHandler.java:45)
	at org.easymock.internal.ObjectMethodsFilter.invoke(ObjectMethodsFilter.java:73)
	at org.easymock.internal.ClassProxyFactory$MockMethodInterceptor.intercept(ClassProxyFactory.java:92)
	at org.apache.solr.cloud.DistributedQueue$$EnhancerByCGLIB$$4eacec50.poll(<generated>)
	at org.apache.solr.cloud.OverseerCollectionProcessor.run(OverseerCollectionProcessor.java:122)
	at java.lang.Thread.run(Thread.java:679)


REGRESSION:  org.apache.solr.cloud.OverseerCollectionProcessorTest.testReplicationCollectionNotCreatedDueToMaxShardsPerNodeLimit

Error Message:
Captured an uncaught exception in thread: Thread[id=2769, name=Thread-986, state=RUNNABLE, group=TGRP-OverseerCollectionProcessorTest]

Stack Trace:
com.carrotsearch.randomizedtesting.UncaughtExceptionError: Captured an uncaught exception in thread: Thread[id=2769, name=Thread-986, state=RUNNABLE, group=TGRP-OverseerCollectionProcessorTest]
Caused by: java.lang.AssertionError: 
  Unexpected method call poll():
	at __randomizedtesting.SeedInfo.seed([B2E533D3F17E6070]:0)
	at org.easymock.internal.MockInvocationHandler.invoke(MockInvocationHandler.java:45)
	at org.easymock.internal.ObjectMethodsFilter.invoke(ObjectMethodsFilter.java:73)
	at org.easymock.internal.ClassProxyFactory$MockMethodInterceptor.intercept(ClassProxyFactory.java:92)
	at org.apache.solr.cloud.DistributedQueue$$EnhancerByCGLIB$$4eacec50.poll(<generated>)
	at org.apache.solr.cloud.OverseerCollectionProcessor.run(OverseerCollectionProcessor.java:122)
	at java.lang.Thread.run(Thread.java:679)


REGRESSION:  org.apache.solr.cloud.OverseerCollectionProcessorTest.testReplicationEqualNumberOfSlicesPerNode

Error Message:
Captured an uncaught exception in thread: Thread[id=2770, name=Thread-987, state=RUNNABLE, group=TGRP-OverseerCollectionProcessorTest]

Stack Trace:
com.carrotsearch.randomizedtesting.UncaughtExceptionError: Captured an uncaught exception in thread: Thread[id=2770, name=Thread-987, state=RUNNABLE, group=TGRP-OverseerCollectionProcessorTest]
Caused by: java.lang.AssertionError: 
  Unexpected method call poll():
	at __randomizedtesting.SeedInfo.seed([B2E533D3F17E6070]:0)
	at org.easymock.internal.MockInvocationHandler.invoke(MockInvocationHandler.java:45)
	at org.easymock.internal.ObjectMethodsFilter.invoke(ObjectMethodsFilter.java:73)
	at org.easymock.internal.ClassProxyFactory$MockMethodInterceptor.intercept(ClassProxyFactory.java:92)
	at org.apache.solr.cloud.DistributedQueue$$EnhancerByCGLIB$$4eacec50.poll(<generated>)
	at org.apache.solr.cloud.OverseerCollectionProcessor.run(OverseerCollectionProcessor.java:122)
	at java.lang.Thread.run(Thread.java:679)


REGRESSION:  org.apache.solr.cloud.OverseerCollectionProcessorTest.testReplicationCollectionNotCreatedDueToMaxShardsPerNodeAndNodesToCreateOnLimits

Error Message:
Captured an uncaught exception in thread: Thread[id=2771, name=Thread-988, state=RUNNABLE, group=TGRP-OverseerCollectionProcessorTest]

Stack Trace:
com.carrotsearch.randomizedtesting.UncaughtExceptionError: Captured an uncaught exception in thread: Thread[id=2771, name=Thread-988, state=RUNNABLE, group=TGRP-OverseerCollectionProcessorTest]
Caused by: java.lang.AssertionError: 
  Unexpected method call poll():
	at __randomizedtesting.SeedInfo.seed([B2E533D3F17E6070]:0)
	at org.easymock.internal.MockInvocationHandler.invoke(MockInvocationHandler.java:45)
	at org.easymock.internal.ObjectMethodsFilter.invoke(ObjectMethodsFilter.java:73)
	at org.easymock.internal.ClassProxyFactory$MockMethodInterceptor.intercept(ClassProxyFactory.java:92)
	at org.apache.solr.cloud.DistributedQueue$$EnhancerByCGLIB$$4eacec50.poll(<generated>)
	at org.apache.solr.cloud.OverseerCollectionProcessor.run(OverseerCollectionProcessor.java:122)
	at java.lang.Thread.run(Thread.java:679)


REGRESSION:  org.apache.solr.cloud.OverseerCollectionProcessorTest.testNoReplicationCollectionNotCreatedDueToMaxShardsPerNodeLimit

Error Message:
Captured an uncaught exception in thread: Thread[id=2772, name=Thread-989, state=RUNNABLE, group=TGRP-OverseerCollectionProcessorTest]

Stack Trace:
com.carrotsearch.randomizedtesting.UncaughtExceptionError: Captured an uncaught exception in thread: Thread[id=2772, name=Thread-989, state=RUNNABLE, group=TGRP-OverseerCollectionProcessorTest]
Caused by: java.lang.AssertionError: 
  Unexpected method call poll():
	at __randomizedtesting.SeedInfo.seed([B2E533D3F17E6070]:0)
	at org.easymock.internal.MockInvocationHandler.invoke(MockInvocationHandler.java:45)
	at org.easymock.internal.ObjectMethodsFilter.invoke(ObjectMethodsFilter.java:73)
	at org.easymock.internal.ClassProxyFactory$MockMethodInterceptor.intercept(ClassProxyFactory.java:92)
	at org.apache.solr.cloud.DistributedQueue$$EnhancerByCGLIB$$4eacec50.poll(<generated>)
	at org.apache.solr.cloud.OverseerCollectionProcessor.run(OverseerCollectionProcessor.java:122)
	at java.lang.Thread.run(Thread.java:679)


REGRESSION:  org.apache.solr.cloud.OverseerCollectionProcessorTest.testReplicationLimitedNodesToCreateOn

Error Message:
Captured an uncaught exception in thread: Thread[id=2773, name=Thread-990, state=RUNNABLE, group=TGRP-OverseerCollectionProcessorTest]

Stack Trace:
com.carrotsearch.randomizedtesting.UncaughtExceptionError: Captured an uncaught exception in thread: Thread[id=2773, name=Thread-990, state=RUNNABLE, group=TGRP-OverseerCollectionProcessorTest]
Caused by: java.lang.AssertionError: 
  Unexpected method call poll():
	at __randomizedtesting.SeedInfo.seed([B2E533D3F17E6070]:0)
	at org.easymock.internal.MockInvocationHandler.invoke(MockInvocationHandler.java:45)
	at org.easymock.internal.ObjectMethodsFilter.invoke(ObjectMethodsFilter.java:73)
	at org.easymock.internal.ClassProxyFactory$MockMethodInterceptor.intercept(ClassProxyFactory.java:92)
	at org.apache.solr.cloud.DistributedQueue$$EnhancerByCGLIB$$4eacec50.poll(<generated>)
	at org.apache.solr.cloud.OverseerCollectionProcessor.run(OverseerCollectionProcessor.java:122)
	at java.lang.Thread.run(Thread.java:679)




Build Log:
[...truncated 8736 lines...]
[junit4:junit4] Suite: org.apache.solr.cloud.OverseerCollectionProcessorTest
[junit4:junit4]   2> 1166 T2759 oas.SolrTestCaseJ4.setUp ###Starting testNoReplicationUnequalNumberOfSlicesPerNode
[junit4:junit4]   2> 1232 T2760 oasc.OverseerCollectionProcessor.run Process current queue of collection messages
[junit4:junit4]   2> 1233 T2760 oasc.OverseerCollectionProcessor.createCollection Creating shard mycollection_shard1_replica1 as part of slice shard1 of collection mycollection on localhost:8963_solr
[junit4:junit4]   2> 1237 T2760 oasc.OverseerCollectionProcessor.createCollection Creating shard mycollection_shard2_replica1 as part of slice shard2 of collection mycollection on localhost:8964_solr
[junit4:junit4]   2> 1237 T2760 oasc.OverseerCollectionProcessor.createCollection Creating shard mycollection_shard3_replica1 as part of slice shard3 of collection mycollection on localhost:8966_solr
[junit4:junit4]   2> 1238 T2760 oasc.OverseerCollectionProcessor.createCollection Creating shard mycollection_shard4_replica1 as part of slice shard4 of collection mycollection on localhost:8965_solr
[junit4:junit4]   2> 1238 T2760 oasc.OverseerCollectionProcessor.createCollection Creating shard mycollection_shard5_replica1 as part of slice shard5 of collection mycollection on localhost:8963_solr
[junit4:junit4]   2> 1238 T2760 oasc.OverseerCollectionProcessor.createCollection Creating shard mycollection_shard6_replica1 as part of slice shard6 of collection mycollection on localhost:8964_solr
[junit4:junit4]   2> 1239 T2760 oasc.OverseerCollectionProcessor.createCollection Successfully created all shards for collection mycollection
[junit4:junit4]   2> 1253 T2760 ccr.RandomizedRunner$QueueUncaughtExceptionsHandler.uncaughtException WARNING Uncaught exception in thread: Thread[Thread-977,5,TGRP-OverseerCollectionProcessorTest] java.lang.AssertionError: 
[junit4:junit4]   2>   Unexpected method call poll():
[junit4:junit4]   2> 	at __randomizedtesting.SeedInfo.seed([B2E533D3F17E6070]:0)
[junit4:junit4]   2> 	at org.easymock.internal.MockInvocationHandler.invoke(MockInvocationHandler.java:45)
[junit4:junit4]   2> 	at org.easymock.internal.ObjectMethodsFilter.invoke(ObjectMethodsFilter.java:73)
[junit4:junit4]   2> 	at org.easymock.internal.ClassProxyFactory$MockMethodInterceptor.intercept(ClassProxyFactory.java:92)
[junit4:junit4]   2> 	at org.apache.solr.cloud.DistributedQueue$$EnhancerByCGLIB$$4eacec50.poll(<generated>)
[junit4:junit4]   2> 	at org.apache.solr.cloud.OverseerCollectionProcessor.run(OverseerCollectionProcessor.java:122)
[junit4:junit4]   2> 	at java.lang.Thread.run(Thread.java:679)
[junit4:junit4]   2> 
[junit4:junit4]   2> 11234 T2759 oas.SolrTestCaseJ4.tearDown ###Ending testNoReplicationUnequalNumberOfSlicesPerNode
[junit4:junit4]   2> NOTE: reproduce with: ant test  -Dtestcase=OverseerCollectionProcessorTest -Dtests.method=testNoReplicationUnequalNumberOfSlicesPerNode -Dtests.seed=B2E533D3F17E6070 -Dtests.multiplier=3 -Dtests.slow=true -Dtests.locale=es_DO -Dtests.timezone=Etc/GMT+8 -Dtests.file.encoding=UTF-8
[junit4:junit4] ERROR   10.1s J0 | OverseerCollectionProcessorTest.testNoReplicationUnequalNumberOfSlicesPerNode <<<
[junit4:junit4]    > Throwable #1: java.lang.AssertionError: Queue not empty within 10000 ms
[junit4:junit4]    > 	at org.junit.Assert.fail(Assert.java:93)
[junit4:junit4]    > 	at org.apache.solr.cloud.OverseerCollectionProcessorTest.waitForEmptyQueue(OverseerCollectionProcessorTest.java:395)
[junit4:junit4]    > 	at org.apache.solr.cloud.OverseerCollectionProcessorTest.testTemplate(OverseerCollectionProcessorTest.java:436)
[junit4:junit4]    > 	at org.apache.solr.cloud.OverseerCollectionProcessorTest.testNoReplicationUnequalNumberOfSlicesPerNode(OverseerCollectionProcessorTest.java:527)
[junit4:junit4]    > 	at sun.reflect.NativeMethodAccessorImpl.invoke0(Native Method)
[junit4:junit4]    > 	at sun.reflect.NativeMethodAccessorImpl.invoke(NativeMethodAccessorImpl.java:57)
[junit4:junit4]    > 	at sun.reflect.DelegatingMethodAccessorImpl.invoke(DelegatingMethodAccessorImpl.java:43)
[junit4:junit4]    > 	at java.lang.reflect.Method.invoke(Method.java:616)
[junit4:junit4]    > 	at com.carrotsearch.randomizedtesting.RandomizedRunner.invoke(RandomizedRunner.java:1559)
[junit4:junit4]    > 	at com.carrotsearch.randomizedtesting.RandomizedRunner.access$600(RandomizedRunner.java:79)
[junit4:junit4]    > 	at com.carrotsearch.randomizedtesting.RandomizedRunner$6.evaluate(RandomizedRunner.java:737)
[junit4:junit4]    > 	at com.carrotsearch.randomizedtesting.RandomizedRunner$7.evaluate(RandomizedRunner.java:773)
[junit4:junit4]    > 	at com.carrotsearch.randomizedtesting.RandomizedRunner$8.evaluate(RandomizedRunner.java:787)
[junit4:junit4]    > 	at com.carrotsearch.randomizedtesting.rules.SystemPropertiesRestoreRule$1.evaluate(SystemPropertiesRestoreRule.java:53)
[junit4:junit4]    > 	at org.apache.lucene.util.TestRuleSetupTeardownChained$1.evaluate(TestRuleSetupTeardownChained.java:50)
[junit4:junit4]    > 	at org.apache.lucene.util.TestRuleFieldCacheSanity$1.evaluate(TestRuleFieldCacheSanity.java:51)
[junit4:junit4]    > 	at org.apache.lucene.util.AbstractBeforeAfterRule$1.evaluate(AbstractBeforeAfterRule.java:46)
[junit4:junit4]    > 	at com.carrotsearch.randomizedtesting.rules.SystemPropertiesInvariantRule$1.evaluate(SystemPropertiesInvariantRule.java:55)
[junit4:junit4]    > 	at org.apache.lucene.util.TestRuleThreadAndTestName$1.evaluate(TestRuleThreadAndTestName.java:49)
[junit4:junit4]    > 	at org.apache.lucene.util.TestRuleIgnoreAfterMaxFailures$1.evaluate(TestRuleIgnoreAfterMaxFailures.java:70)
[junit4:junit4]    > 	at org.apache.lucene.util.TestRuleMarkFailure$1.evaluate(TestRuleMarkFailure.java:48)
[junit4:junit4]    > 	at com.carrotsearch.randomizedtesting.rules.StatementAdapter.evaluate(StatementAdapter.java:36)
[junit4:junit4]    > 	at com.carrotsearch.randomizedtesting.ThreadLeakControl$StatementRunner.run(ThreadLeakControl.java:358)
[junit4:junit4]    > 	at com.carrotsearch.randomizedtesting.ThreadLeakControl.forkTimeoutingTask(ThreadLeakControl.java:782)
[junit4:junit4]    > 	at com.carrotsearch.randomizedtesting.ThreadLeakControl$3.evaluate(ThreadLeakControl.java:442)
[junit4:junit4]    > 	at com.carrotsearch.randomizedtesting.RandomizedRunner.runSingleTest(RandomizedRunner.java:746)
[junit4:junit4]    > 	at com.carrotsearch.randomizedtesting.RandomizedRunner$3.evaluate(RandomizedRunner.java:648)
[junit4:junit4]    > 	at com.carrotsearch.randomizedtesting.RandomizedRunner$4.evaluate(RandomizedRunner.java:682)
[junit4:junit4]    > 	at com.carrotsearch.randomizedtesting.RandomizedRunner$5.evaluate(RandomizedRunner.java:693)
[junit4:junit4]    > 	at com.carrotsearch.randomizedtesting.rules.StatementAdapter.evaluate(StatementAdapter.java:36)
[junit4:junit4]    > 	at com.carrotsearch.randomizedtesting.rules.SystemPropertiesRestoreRule$1.evaluate(SystemPropertiesRestoreRule.java:53)
[junit4:junit4]    > 	at org.apache.lucene.util.AbstractBeforeAfterRule$1.evaluate(AbstractBeforeAfterRule.java:46)
[junit4:junit4]    > 	at org.apache.lucene.util.TestRuleStoreClassName$1.evaluate(TestRuleStoreClassName.java:42)
[junit4:junit4]    > 	at com.carrotsearch.randomizedtesting.rules.SystemPropertiesInvariantRule$1.evaluate(SystemPropertiesInvariantRule.java:55)
[junit4:junit4]    > 	at com.carrotsearch.randomizedtesting.rules.NoShadowingOrOverridesOnMethodsRule$1.evaluate(NoShadowingOrOverridesOnMethodsRule.java:39)
[junit4:junit4]    > 	at com.carrotsearch.randomizedtesting.rules.NoShadowingOrOverridesOnMethodsRule$1.evaluate(NoShadowingOrOverridesOnMethodsRule.java:39)
[junit4:junit4]    > 	at com.carrotsearch.randomizedtesting.rules.StatementAdapter.evaluate(StatementAdapter.java:36)
[junit4:junit4]    > 	at org.apache.lucene.util.TestRuleAssertionsRequired$1.evaluate(TestRuleAssertionsRequired.java:43)
[junit4:junit4]    > 	at org.apache.lucene.util.TestRuleMarkFailure$1.evaluate(TestRuleMarkFailure.java:48)
[junit4:junit4]    > 	at org.apache.lucene.util.TestRuleIgnoreAfterMaxFailures$1.evaluate(TestRuleIgnoreAfterMaxFailures.java:70)
[junit4:junit4]    > 	at org.apache.lucene.util.TestRuleIgnoreTestSuites$1.evaluate(TestRuleIgnoreTestSuites.java:55)
[junit4:junit4]    > 	at com.carrotsearch.randomizedtesting.rules.StatementAdapter.evaluate(StatementAdapter.java:36)
[junit4:junit4]    > 	at com.carrotsearch.randomizedtesting.ThreadLeakControl$StatementRunner.run(ThreadLeakControl.java:358)
[junit4:junit4]    > 	at java.lang.Thread.run(Thread.java:679)
[junit4:junit4]    > Throwable #2: com.carrotsearch.randomizedtesting.UncaughtExceptionError: Captured an uncaught exception in thread: Thread[id=2760, name=Thread-977, state=RUNNABLE, group=TGRP-OverseerCollectionProcessorTest]
[junit4:junit4]    > Caused by: java.lang.AssertionError: 
[junit4:junit4]    >   Unexpected method call poll():
[junit4:junit4]    > 	at __randomizedtesting.SeedInfo.seed([B2E533D3F17E6070]:0)
[junit4:junit4]    > 	at org.easymock.internal.MockInvocationHandler.invoke(MockInvocationHandler.java:45)
[junit4:junit4]    > 	at org.easymock.internal.ObjectMethodsFilter.invoke(ObjectMethodsFilter.java:73)
[junit4:junit4]    > 	at org.easymock.internal.ClassProxyFactory$MockMethodInterceptor.intercept(ClassProxyFactory.java:92)
[junit4:junit4]    > 	at org.apache.solr.cloud.DistributedQueue$$EnhancerByCGLIB$$4eacec50.poll(<generated>)
[junit4:junit4]    > 	at org.apache.solr.cloud.OverseerCollectionProcessor.run(OverseerCollectionProcessor.java:122)
[junit4:junit4]    > 	at java.lang.Thread.run(Thread.java:679)
[junit4:junit4]   2> 11291 T2759 oas.SolrTestCaseJ4.setUp ###Starting testNoReplicationCollectionNotCreatedDueToMaxShardsPerNodeAndNodesToCreateOnLimits
[junit4:junit4]   2> 11292 T2761 oasc.OverseerCollectionProcessor.run Process current queue of collection messages
[junit4:junit4]   2> 11292 T2761 oasc.OverseerCollectionProcessor.createCollection SEVERE Cannot create collection mycollection. Value of maxShardsPerNode is 2, and the number of live nodes is 3. This allows a maximum of 6 to be created. Value of numShards is 8 and value of replicationFactor is 1. This requires 8 shards to be created (higher than the allowed number)
[junit4:junit4]   2> 11293 T2761 oasc.SolrException.log SEVERE Collection createcollection of mycollection failed
[junit4:junit4]   2> 11293 T2761 ccr.RandomizedRunner$QueueUncaughtExceptionsHandler.uncaughtException WARNING Uncaught exception in thread: Thread[Thread-978,5,TGRP-OverseerCollectionProcessorTest] java.lang.AssertionError: 
[junit4:junit4]   2>   Unexpected method call poll():
[junit4:junit4]   2> 	at __randomizedtesting.SeedInfo.seed([B2E533D3F17E6070]:0)
[junit4:junit4]   2> 	at org.easymock.internal.MockInvocationHandler.invoke(MockInvocationHandler.java:45)
[junit4:junit4]   2> 	at org.easymock.internal.ObjectMethodsFilter.invoke(ObjectMethodsFilter.java:73)
[junit4:junit4]   2> 	at org.easymock.internal.ClassProxyFactory$MockMethodInterceptor.intercept(ClassProxyFactory.java:92)
[junit4:junit4]   2> 	at org.apache.solr.cloud.DistributedQueue$$EnhancerByCGLIB$$4eacec50.poll(<generated>)
[junit4:junit4]   2> 	at org.apache.solr.cloud.OverseerCollectionProcessor.run(OverseerCollectionProcessor.java:122)
[junit4:junit4]   2> 	at java.lang.Thread.run(Thread.java:679)
[junit4:junit4]   2> 
[junit4:junit4]   2> 21392 T2759 oas.SolrTestCaseJ4.tearDown ###Ending testNoReplicationCollectionNotCreatedDueToMaxShardsPerNodeAndNodesToCreateOnLimits
[junit4:junit4]   2> NOTE: reproduce with: ant test  -Dtestcase=OverseerCollectionProcessorTest -Dtests.method=testNoReplicationCollectionNotCreatedDueToMaxShardsPerNodeAndNodesToCreateOnLimits -Dtests.seed=B2E533D3F17E6070 -Dtests.multiplier=3 -Dtests.slow=true -Dtests.locale=es_DO -Dtests.timezone=Etc/GMT+8 -Dtests.file.encoding=UTF-8
[junit4:junit4] ERROR   10.1s J0 | OverseerCollectionProcessorTest.testNoReplicationCollectionNotCreatedDueToMaxShardsPerNodeAndNodesToCreateOnLimits <<<
[junit4:junit4]    > Throwable #1: java.lang.AssertionError: Queue not empty within 10000 ms
[junit4:junit4]    > 	at org.junit.Assert.fail(Assert.java:93)
[junit4:junit4]    > 	at org.apache.solr.cloud.OverseerCollectionProcessorTest.waitForEmptyQueue(OverseerCollectionProcessorTest.java:395)
[junit4:junit4]    > 	at org.apache.solr.cloud.OverseerCollectionProcessorTest.testTemplate(OverseerCollectionProcessorTest.java:436)
[junit4:junit4]    > 	at org.apache.solr.cloud.OverseerCollectionProcessorTest.testNoReplicationCollectionNotCreatedDueToMaxShardsPerNodeAndNodesToCreateOnLimits(OverseerCollectionProcessorTest.java:604)
[junit4:junit4]    > 	at sun.reflect.NativeMethodAccessorImpl.invoke0(Native Method)
[junit4:junit4]    > 	at sun.reflect.NativeMethodAccessorImpl.invoke(NativeMethodAccessorImpl.java:57)
[junit4:junit4]    > 	at sun.reflect.DelegatingMethodAccessorImpl.invoke(DelegatingMethodAccessorImpl.java:43)
[junit4:junit4]    > 	at java.lang.reflect.Method.invoke(Method.java:616)
[junit4:junit4]    > 	at com.carrotsearch.randomizedtesting.RandomizedRunner.invoke(RandomizedRunner.java:1559)
[junit4:junit4]    > 	at com.carrotsearch.randomizedtesting.RandomizedRunner.access$600(RandomizedRunner.java:79)
[junit4:junit4]    > 	at com.carrotsearch.randomizedtesting.RandomizedRunner$6.evaluate(RandomizedRunner.java:737)
[junit4:junit4]    > 	at com.carrotsearch.randomizedtesting.RandomizedRunner$7.evaluate(RandomizedRunner.java:773)
[junit4:junit4]    > 	at com.carrotsearch.randomizedtesting.RandomizedRunner$8.evaluate(RandomizedRunner.java:787)
[junit4:junit4]    > 	at com.carrotsearch.randomizedtesting.rules.SystemPropertiesRestoreRule$1.evaluate(SystemPropertiesRestoreRule.java:53)
[junit4:junit4]    > 	at org.apache.lucene.util.TestRuleSetupTeardownChained$1.evaluate(TestRuleSetupTeardownChained.java:50)
[junit4:junit4]    > 	at org.apache.lucene.util.TestRuleFieldCacheSanity$1.evaluate(TestRuleFieldCacheSanity.java:51)
[junit4:junit4]    > 	at org.apache.lucene.util.AbstractBeforeAfterRule$1.evaluate(AbstractBeforeAfterRule.java:46)
[junit4:junit4]    > 	at com.carrotsearch.randomizedtesting.rules.SystemPropertiesInvariantRule$1.evaluate(SystemPropertiesInvariantRule.java:55)
[junit4:junit4]    > 	at org.apache.lucene.util.TestRuleThreadAndTestName$1.evaluate(TestRuleThreadAndTestName.java:49)
[junit4:junit4]    > 	at org.apache.lucene.util.TestRuleIgnoreAfterMaxFailures$1.evaluate(TestRuleIgnoreAfterMaxFailures.java:70)
[junit4:junit4]    > 	at org.apache.lucene.util.TestRuleMarkFailure$1.evaluate(TestRuleMarkFailure.java:48)
[junit4:junit4]    > 	at com.carrotsearch.randomizedtesting.rules.StatementAdapter.evaluate(StatementAdapter.java:36)
[junit4:junit4]    > 	at com.carrotsearch.randomizedtesting.ThreadLeakControl$StatementRunner.run(ThreadLeakControl.java:358)
[junit4:junit4]    > 	at com.carrotsearch.randomizedtesting.ThreadLeakControl.forkTimeoutingTask(ThreadLeakControl.java:782)
[junit4:junit4]    > 	at com.carrotsearch.randomizedtesting.ThreadLeakControl$3.evaluate(ThreadLeakControl.java:442)
[junit4:junit4]    > 	at com.carrotsearch.randomizedtesting.RandomizedRunner.runSingleTest(RandomizedRunner.java:746)
[junit4:junit4]    > 	at com.carrotsearch.randomizedtesting.RandomizedRunner$3.evaluate(RandomizedRunner.java:648)
[junit4:junit4]    > 	at com.carrotsearch.randomizedtesting.RandomizedRunner$4.evaluate(RandomizedRunner.java:682)
[junit4:junit4]    > 	at com.carrotsearch.randomizedtesting.RandomizedRunner$5.evaluate(RandomizedRunner.java:693)
[junit4:junit4]    > 	at com.carrotsearch.randomizedtesting.rules.StatementAdapter.evaluate(StatementAdapter.java:36)
[junit4:junit4]    > 	at com.carrotsearch.randomizedtesting.rules.SystemPropertiesRestoreRule$1.evaluate(SystemPropertiesRestoreRule.java:53)
[junit4:junit4]    > 	at org.apache.lucene.util.AbstractBeforeAfterRule$1.evaluate(AbstractBeforeAfterRule.java:46)
[junit4:junit4]    > 	at org.apache.lucene.util.TestRuleStoreClassName$1.evaluate(TestRuleStoreClassName.java:42)
[junit4:junit4]    > 	at com.carrotsearch.randomizedtesting.rules.SystemPropertiesInvariantRule$1.evaluate(SystemPropertiesInvariantRule.java:55)
[junit4:junit4]    > 	at com.carrotsearch.randomizedtesting.rules.NoShadowingOrOverridesOnMethodsRule$1.evaluate(NoShadowingOrOverridesOnMethodsRule.java:39)
[junit4:junit4]    > 	at com.carrotsearch.randomizedtesting.rules.NoShadowingOrOverridesOnMethodsRule$1.evaluate(NoShadowingOrOverridesOnMethodsRule.java:39)
[junit4:junit4]    > 	at com.carrotsearch.randomizedtesting.rules.StatementAdapter.evaluate(StatementAdapter.java:36)
[junit4:junit4]    > 	at org.apache.lucene.util.TestRuleAssertionsRequired$1.evaluate(TestRuleAssertionsRequired.java:43)
[junit4:junit4]    > 	at org.apache.lucene.util.TestRuleMarkFailure$1.evaluate(TestRuleMarkFailure.java:48)
[junit4:junit4]    > 	at org.apache.lucene.util.TestRuleIgnoreAfterMaxFailures$1.evaluate(TestRuleIgnoreAfterMaxFailures.java:70)
[junit4:junit4]    > 	at org.apache.lucene.util.TestRuleIgnoreTestSuites$1.evaluate(TestRuleIgnoreTestSuites.java:55)
[junit4:junit4]    > 	at com.carrotsearch.randomizedtesting.rules.StatementAdapter.evaluate(StatementAdapter.java:36)
[junit4:junit4]    > 	at com.carrotsearch.randomizedtesting.ThreadLeakControl$StatementRunner.run(ThreadLeakControl.java:358)
[junit4:junit4]    > 	at java.lang.Thread.run(Thread.java:679)
[junit4:junit4]    > Throwable #2: com.carrotsearch.randomizedtesting.UncaughtExceptionError: Captured an uncaught exception in thread: Thread[id=2761, name=Thread-978, state=RUNNABLE, group=TGRP-OverseerCollectionProcessorTest]
[junit4:junit4]    > Caused by: java.lang.AssertionError: 
[junit4:junit4]    >   Unexpected method call poll():
[junit4:junit4]    > 	at __randomizedtesting.SeedInfo.seed([B2E533D3F17E6070]:0)
[junit4:junit4]    > 	at org.easymock.internal.MockInvocationHandler.invoke(MockInvocationHandler.java:45)
[junit4:junit4]    > 	at org.easymock.internal.ObjectMethodsFilter.invoke(ObjectMethodsFilter.java:73)
[junit4:junit4]    > 	at org.easymock.internal.ClassProxyFactory$MockMethodInterceptor.intercept(ClassProxyFactory.java:92)
[junit4:junit4]    > 	at org.apache.solr.cloud.DistributedQueue$$EnhancerByCGLIB$$4eacec50.poll(<generated>)
[junit4:junit4]    > 	at org.apache.solr.cloud.OverseerCollectionProcessor.run(OverseerCollectionProcessor.java:122)
[junit4:junit4]    > 	at java.lang.Thread.run(Thread.java:679)
[junit4:junit4]   2> 21406 T2759 oas.SolrTestCaseJ4.setUp ###Starting testNoReplicationEqualNumberOfSlicesPerNodeSendCreateNodesEqualToLiveNodes
[junit4:junit4]   2> 21408 T2762 oasc.OverseerCollectionProcessor.run Process current queue of collection messages
[junit4:junit4]   2> 21408 T2762 oasc.OverseerCollectionProcessor.createCollection Creating shard mycollection_shard1_replica1 as part of slice shard1 of collection mycollection on localhost:8966_solr
[junit4:junit4]   2> 21408 T2762 oasc.OverseerCollectionProcessor.createCollection Creating shard mycollection_shard2_replica1 as part of slice shard2 of collection mycollection on localhost:8965_solr
[junit4:junit4]   2> 21408 T2762 oasc.OverseerCollectionProcessor.createCollection Creating shard mycollection_shard3_replica1 as part of slice shard3 of collection mycollection on localhost:8963_solr
[junit4:junit4]   2> 21409 T2762 oasc.OverseerCollectionProcessor.createCollection Creating shard mycollection_shard4_replica1 as part of slice shard4 of collection mycollection on localhost:8964_solr
[junit4:junit4]   2> 21409 T2762 oasc.OverseerCollectionProcessor.createCollection Creating shard mycollection_shard5_replica1 as part of slice shard5 of collection mycollection on localhost:8966_solr
[junit4:junit4]   2> 21409 T2762 oasc.OverseerCollectionProcessor.createCollection Creating shard mycollection_shard6_replica1 as part of slice shard6 of collection mycollection on localhost:8965_solr
[junit4:junit4]   2> 21410 T2762 oasc.OverseerCollectionProcessor.createCollection Creating shard mycollection_shard7_replica1 as part of slice shard7 of collection mycollection on localhost:8963_solr
[junit4:junit4]   2> 21410 T2762 oasc.OverseerCollectionProcessor.createCollection Creating shard mycollection_shard8_replica1 as part of slice shard8 of collection mycollection on localhost:8964_solr
[junit4:junit4]   2> 21410 T2762 oasc.OverseerCollectionProcessor.createCollection Successfully created all shards for collection mycollection
[junit4:junit4]   2> 21411 T2762 ccr.RandomizedRunner$QueueUncaughtExceptionsHandler.uncaughtException WARNING Uncaught exception in thread: Thread[Thread-979,5,TGRP-OverseerCollectionProcessorTest] java.lang.AssertionError: 
[junit4:junit4]   2>   Unexpected method call poll():
[junit4:junit4]   2> 	at __randomizedtesting.SeedInfo.seed([B2E533D3F17E6070]:0)
[junit4:junit4]   2> 	at org.easymock.internal.MockInvocationHandler.invoke(MockInvocationHandler.java:45)
[junit4:junit4]   2> 	at org.easymock.internal.ObjectMethodsFilter.invoke(ObjectMethodsFilter.java:73)
[junit4:junit4]   2> 	at org.easymock.internal.ClassProxyFactory$MockMethodInterceptor.intercept(ClassProxyFactory.java:92)
[junit4:junit4]   2> 	at org.apache.solr.cloud.DistributedQueue$$EnhancerByCGLIB$$4eacec50.poll(<generated>)
[junit4:junit4]   2> 	at org.apache.solr.cloud.OverseerCollectionProcessor.run(OverseerCollectionProcessor.java:122)
[junit4:junit4]   2> 	at java.lang.Thread.run(Thread.java:679)
[junit4:junit4]   2> 
[junit4:junit4]   2> 31507 T2759 oas.SolrTestCaseJ4.tearDown ###Ending testNoReplicationEqualNumberOfSlicesPerNodeSendCreateNodesEqualToLiveNodes
[junit4:junit4]   2> NOTE: reproduce with: ant test  -Dtestcase=OverseerCollectionProcessorTest -Dtests.method=testNoReplicationEqualNumberOfSlicesPerNodeSendCreateNodesEqualToLiveNodes -Dtests.seed=B2E533D3F17E6070 -Dtests.multiplier=3 -Dtests.slow=true -Dtests.locale=es_DO -Dtests.timezone=Etc/GMT+8 -Dtests.file.encoding=UTF-8
[junit4:junit4] ERROR   10.1s J0 | OverseerCollectionProcessorTest.testNoReplicationEqualNumberOfSlicesPerNodeSendCreateNodesEqualToLiveNodes <<<
[junit4:junit4]    > Throwable #1: java.lang.AssertionError: Queue not empty within 10000 ms
[junit4:junit4]    > 	at org.junit.Assert.fail(Assert.java:93)
[junit4:junit4]    > 	at org.apache.solr.cloud.OverseerCollectionProcessorTest.waitForEmptyQueue(OverseerCollectionProcessorTest.java:395)
[junit4:junit4]    > 	at org.apache.solr.cloud.OverseerCollectionProcessorTest.testTemplate(OverseerCollectionProcessorTest.java:436)
[junit4:junit4]    > 	at org.apache.solr.cloud.OverseerCollectionProcessorTest.testNoReplicationEqualNumberOfSlicesPerNodeSendCreateNodesEqualToLiveNodes(OverseerCollectionProcessorTest.java:479)
[junit4:junit4]    > 	at sun.reflect.NativeMethodAccessorImpl.invoke0(Native Method)
[junit4:junit4]    > 	at sun.reflect.NativeMethodAccessorImpl.invoke(NativeMethodAccessorImpl.java:57)
[junit4:junit4]    > 	at sun.reflect.DelegatingMethodAccessorImpl.invoke(DelegatingMethodAccessorImpl.java:43)
[junit4:junit4]    > 	at java.lang.reflect.Method.invoke(Method.java:616)
[junit4:junit4]    > 	at com.carrotsearch.randomizedtesting.RandomizedRunner.invoke(RandomizedRunner.java:1559)
[junit4:junit4]    > 	at com.carrotsearch.randomizedtesting.RandomizedRunner.access$600(RandomizedRunner.java:79)
[junit4:junit4]    > 	at com.carrotsearch.randomizedtesting.RandomizedRunner$6.evaluate(RandomizedRunner.java:737)
[junit4:junit4]    > 	at com.carrotsearch.randomizedtesting.RandomizedRunner$7.evaluate(RandomizedRunner.java:773)
[junit4:junit4]    > 	at com.carrotsearch.randomizedtesting.RandomizedRunner$8.evaluate(RandomizedRunner.java:787)
[junit4:junit4]    > 	at com.carrotsearch.randomizedtesting.rules.SystemPropertiesRestoreRule$1.evaluate(SystemPropertiesRestoreRule.java:53)
[junit4:junit4]    > 	at org.apache.lucene.util.TestRuleSetupTeardownChained$1.evaluate(TestRuleSetupTeardownChained.java:50)
[junit4:junit4]    > 	at org.apache.lucene.util.TestRuleFieldCacheSanity$1.evaluate(TestRuleFieldCacheSanity.java:51)
[junit4:junit4]    > 	at org.apache.lucene.util.AbstractBeforeAfterRule$1.evaluate(AbstractBeforeAfterRule.java:46)
[junit4:junit4]    > 	at com.carrotsearch.randomizedtesting.rules.SystemPropertiesInvariantRule$1.evaluate(SystemPropertiesInvariantRule.java:55)
[junit4:junit4]    > 	at org.apache.lucene.util.TestRuleThreadAndTestName$1.evaluate(TestRuleThreadAndTestName.java:49)
[junit4:junit4]    > 	at org.apache.lucene.util.TestRuleIgnoreAfterMaxFailures$1.evaluate(TestRuleIgnoreAfterMaxFailures.java:70)
[junit4:junit4]    > 	at org.apache.lucene.util.TestRuleMarkFailure$1.evaluate(TestRuleMarkFailure.java:48)
[junit4:junit4]    > 	at com.carrotsearch.randomizedtesting.rules.StatementAdapter.evaluate(StatementAdapter.java:36)
[junit4:junit4]    > 	at com.carrotsearch.randomizedtesting.ThreadLeakControl$StatementRunner.run(ThreadLeakControl.java:358)
[junit4:junit4]    > 	at com.carrotsearch.randomizedtesting.ThreadLeakControl.forkTimeoutingTask(ThreadLeakControl.java:782)
[junit4:junit4]    > 	at com.carrotsearch.randomizedtesting.ThreadLeakControl$3.evaluate(ThreadLeakControl.java:442)
[junit4:junit4]    > 	at com.carrotsearch.randomizedtesting.RandomizedRunner.runSingleTest(RandomizedRunner.java:746)
[junit4:junit4]    > 	at com.carrotsearch.randomizedtesting.RandomizedRunner$3.evaluate(RandomizedRunner.java:648)
[junit4:junit4]    > 	at com.carrotsearch.randomizedtesting.RandomizedRunner$4.evaluate(RandomizedRunner.java:682)
[junit4:junit4]    > 	at com.carrotsearch.randomizedtesting.RandomizedRunner$5.evaluate(RandomizedRunner.java:693)
[junit4:junit4]    > 	at com.carrotsearch.randomizedtesting.rules.StatementAdapter.evaluate(StatementAdapter.java:36)
[junit4:junit4]    > 	at com.carrotsearch.randomizedtesting.rules.SystemPropertiesRestoreRule$1.evaluate(SystemPropertiesRestoreRule.java:53)
[junit4:junit4]    > 	at org.apache.lucene.util.AbstractBeforeAfterRule$1.evaluate(AbstractBeforeAfterRule.java:46)
[junit4:junit4]    > 	at org.apache.lucene.util.TestRuleStoreClassName$1.evaluate(TestRuleStoreClassName.java:42)
[junit4:junit4]    > 	at com.carrotsearch.randomizedtesting.rules.SystemPropertiesInvariantRule$1.evaluate(SystemPropertiesInvariantRule.java:55)
[junit4:junit4]    > 	at com.carrotsearch.randomizedtesting.rules.NoShadowingOrOverridesOnMethodsRule$1.evaluate(NoShadowingOrOverridesOnMethodsRule.java:39)
[junit4:junit4]    > 	at com.carrotsearch.randomizedtesting.rules.NoShadowingOrOverridesOnMethodsRule$1.evaluate(NoShadowingOrOverridesOnMethodsRule.java:39)
[junit4:junit4]    > 	at com.carrotsearch.randomizedtesting.rules.StatementAdapter.evaluate(StatementAdapter.java:36)
[junit4:junit4]    > 	at org.apache.lucene.util.TestRuleAssertionsRequired$1.evaluate(TestRuleAssertionsRequired.java:43)
[junit4:junit4]    > 	at org.apache.lucene.util.TestRuleMarkFailure$1.evaluate(TestRuleMarkFailure.java:48)
[junit4:junit4]    > 	at org.apache.lucene.util.TestRuleIgnoreAfterMaxFailures$1.evaluate(TestRuleIgnoreAfterMaxFailures.java:70)
[junit4:junit4]    > 	at org.apache.lucene.util.TestRuleIgnoreTestSuites$1.evaluate(TestRuleIgnoreTestSuites.java:55)
[junit4:junit4]    > 	at com.carrotsearch.randomizedtesting.rules.StatementAdapter.evaluate(StatementAdapter.java:36)
[junit4:junit4]    > 	at com.carrotsearch.randomizedtesting.ThreadLeakControl$StatementRunner.run(ThreadLeakControl.java:358)
[junit4:junit4]    > 	at java.lang.Thread.run(Thread.java:679)
[junit4:junit4]    > Throwable #2: com.carrotsearch.randomizedtesting.UncaughtExceptionError: Captured an uncaught exception in thread: Thread[id=2762, name=Thread-979, state=RUNNABLE, group=TGRP-OverseerCollectionProcessorTest]
[junit4:junit4]    > Caused by: java.lang.AssertionError: 
[junit4:junit4]    >   Unexpected method call poll():
[junit4:junit4]    > 	at __randomizedtesting.SeedInfo.seed([B2E533D3F17E6070]:0)
[junit4:junit4]    > 	at org.easymock.internal.MockInvocationHandler.invoke(MockInvocationHandler.java:45)
[junit4:junit4]    > 	at org.easymock.internal.ObjectMethodsFilter.invoke(ObjectMethodsFilter.java:73)
[junit4:junit4]    > 	at org.easymock.internal.ClassProxyFactory$MockMethodInterceptor.intercept(ClassProxyFactory.java:92)
[junit4:junit4]    > 	at org.apache.solr.cloud.DistributedQueue$$EnhancerByCGLIB$$4eacec50.poll(<generated>)
[junit4:junit4]    > 	at org.apache.solr.cloud.OverseerCollectionProcessor.run(OverseerCollectionProcessor.java:122)
[junit4:junit4]    > 	at java.lang.Thread.run(Thread.java:679)
[junit4:junit4]   2> 31520 T2759 oas.SolrTestCaseJ4.setUp ###Starting testNoReplicationLimitedNodesToCreateOn
[junit4:junit4]   2> 31522 T2763 oasc.OverseerCollectionProcessor.run Process current queue of collection messages
[junit4:junit4]   2> 31523 T2763 oasc.OverseerCollectionProcessor.createCollection Creating shard mycollection_shard1_replica1 as part of slice shard1 of collection mycollection on localhost:8964_solr
[junit4:junit4]   2> 31523 T2763 oasc.OverseerCollectionProcessor.createCollection Creating shard mycollection_shard2_replica1 as part of slice shard2 of collection mycollection on localhost:8966_solr
[junit4:junit4]   2> 31523 T2763 oasc.OverseerCollectionProcessor.createCollection Creating shard mycollection_shard3_replica1 as part of slice shard3 of collection mycollection on localhost:8964_solr
[junit4:junit4]   2> 31523 T2763 oasc.OverseerCollectionProcessor.createCollection Creating shard mycollection_shard4_replica1 as part of slice shard4 of collection mycollection on localhost:8966_solr
[junit4:junit4]   2> 31524 T2763 oasc.OverseerCollectionProcessor.createCollection Creating shard mycollection_shard5_replica1 as part of slice shard5 of collection mycollection on localhost:8964_solr
[junit4:junit4]   2> 31524 T2763 oasc.OverseerCollectionProcessor.createCollection Creating shard mycollection_shard6_replica1 as part of slice shard6 of collection mycollection on localhost:8966_solr
[junit4:junit4]   2> 31525 T2763 oasc.OverseerCollectionProcessor.createCollection Successfully created all shards for collection mycollection
[junit4:junit4]   2> 31525 T2763 ccr.RandomizedRunner$QueueUncaughtExceptionsHandler.uncaughtException WARNING Uncaught exception in thread: Thread[Thread-980,5,TGRP-OverseerCollectionProcessorTest] java.lang.AssertionError: 
[junit4:junit4]   2>   Unexpected method call poll():
[junit4:junit4]   2> 	at __randomizedtesting.SeedInfo.seed([B2E533D3F17E6070]:0)
[junit4:junit4]   2> 	at org.easymock.internal.MockInvocationHandler.invoke(MockInvocationHandler.java:45)
[junit4:junit4]   2> 	at org.easymock.internal.ObjectMethodsFilter.invoke(ObjectMethodsFilter.java:73)
[junit4:junit4]   2> 	at org.easymock.internal.ClassProxyFactory$MockMethodInterceptor.intercept(ClassProxyFactory.java:92)
[junit4:junit4]   2> 	at org.apache.solr.cloud.DistributedQueue$$EnhancerByCGLIB$$4eacec50.poll(<generated>)
[junit4:junit4]   2> 	at org.apache.solr.cloud.OverseerCollectionProcessor.run(OverseerCollectionProcessor.java:122)
[junit4:junit4]   2> 	at java.lang.Thread.run(Thread.java:679)
[junit4:junit4]   2> 
[junit4:junit4]   2> 41528 T2759 oas.SolrTestCaseJ4.tearDown ###Ending testNoReplicationLimitedNodesToCreateOn
[junit4:junit4]   2> NOTE: reproduce with: ant test  -Dtestcase=OverseerCollectionProcessorTest -Dtests.method=testNoReplicationLimitedNodesToCreateOn -Dtests.seed=B2E533D3F17E6070 -Dtests.multiplier=3 -Dtests.slow=true -Dtests.locale=es_DO -Dtests.timezone=Etc/GMT+8 -Dtests.file.encoding=UTF-8
[junit4:junit4] ERROR   10.0s J0 | OverseerCollectionProcessorTest.testNoReplicationLimitedNodesToCreateOn <<<
[junit4:junit4]    > Throwable #1: java.lang.AssertionError: Queue not empty within 10000 ms
[junit4:junit4]    > 	at org.junit.Assert.fail(Assert.java:93)
[junit4:junit4]    > 	at org.apache.solr.cloud.OverseerCollectionProcessorTest.waitForEmptyQueue(OverseerCollectionProcessorTest.java:395)
[junit4:junit4]    > 	at org.apache.solr.cloud.OverseerCollectionProcessorTest.testTemplate(OverseerCollectionProcessorTest.java:436)
[junit4:junit4]    > 	at org.apache.solr.cloud.OverseerCollectionProcessorTest.testNoReplicationLimitedNodesToCreateOn(OverseerCollectionProcessorTest.java:578)
[junit4:junit4]    > 	at sun.reflect.NativeMethodAccessorImpl.invoke0(Native Method)
[junit4:junit4]    > 	at sun.reflect.NativeMethodAccessorImpl.invoke(NativeMethodAccessorImpl.java:57)
[junit4:junit4]    > 	at sun.reflect.DelegatingMethodAccessorImpl.invoke(DelegatingMethodAccessorImpl.java:43)
[junit4:junit4]    > 	at java.lang.reflect.Method.invoke(Method.java:616)
[junit4:junit4]    > 	at com.carrotsearch.randomizedtesting.RandomizedRunner.invoke(RandomizedRunner.java:1559)
[junit4:junit4]    > 	at com.carrotsearch.randomizedtesting.RandomizedRunner.access$600(RandomizedRunner.java:79)
[junit4:junit4]    > 	at com.carrotsearch.randomizedtesting.RandomizedRunner$6.evaluate(RandomizedRunner.java:737)
[junit4:junit4]    > 	at com.carrotsearch.randomizedtesting.RandomizedRunner$7.evaluate(RandomizedRunner.java:773)
[junit4:junit4]    > 	at com.carrotsearch.randomizedtesting.RandomizedRunner$8.evaluate(RandomizedRunner.java:787)
[junit4:junit4]    > 	at com.carrotsearch.randomizedtesting.rules.SystemPropertiesRestoreRule$1.evaluate(SystemPropertiesRestoreRule.java:53)
[junit4:junit4]    > 	at org.apache.lucene.util.TestRuleSetupTeardownChained$1.evaluate(TestRuleSetupTeardownChained.java:50)
[junit4:junit4]    > 	at org.apache.lucene.util.TestRuleFieldCacheSanity$1.evaluate(TestRuleFieldCacheSanity.java:51)
[junit4:junit4]    > 	at org.apache.lucene.util.AbstractBeforeAfterRule$1.evaluate(AbstractBeforeAfterRule.java:46)
[junit4:junit4]    > 	at com.carrotsearch.randomizedtesting.rules.SystemPropertiesInvariantRule$1.evaluate(SystemPropertiesInvariantRule.java:55)
[junit4:junit4]    > 	at org.apache.lucene.util.TestRuleThreadAndTestName$1.evaluate(TestRuleThreadAndTestName.java:49)
[junit4:junit4]    > 	at org.apache.lucene.util.TestRuleIgnoreAfterMaxFailures$1.evaluate(TestRuleIgnoreAfterMaxFailures.java:70)
[junit4:junit4]    > 	at org.apache.lucene.util.TestRuleMarkFailure$1.evaluate(TestRuleMarkFailure.java:48)
[junit4:junit4]    > 	at com.carrotsearch.randomizedtesting.rules.StatementAdapter.evaluate(StatementAdapter.java:36)
[junit4:junit4]    > 	at com.carrotsearch.randomizedtesting.ThreadLeakControl$StatementRunner.run(ThreadLeakControl.java:358)
[junit4:junit4]    > 	at com.carrotsearch.randomizedtesting.ThreadLeakControl.forkTimeoutingTask(ThreadLeakControl.java:782)
[junit4:junit4]    > 	at com.carrotsearch.randomizedtesting.ThreadLeakControl$3.evaluate(ThreadLeakControl.java:442)
[junit4:junit4]    > 	at com.carrotsearch.randomizedtesting.RandomizedRunner.runSingleTest(RandomizedRunner.java:746)
[junit4:junit4]    > 	at com.carrotsearch.randomizedtesting.RandomizedRunner$3.evaluate(RandomizedRunner.java:648)
[junit4:junit4]    > 	at com.carrotsearch.randomizedtesting.RandomizedRunner$4.evaluate(RandomizedRunner.java:682)
[junit4:junit4]    > 	at com.carrotsearch.randomizedtesting.RandomizedRunner$5.evaluate(RandomizedRunner.java:693)
[junit4:junit4]    > 	at com.carrotsearch.randomizedtesting.rules.StatementAdapter.evaluate(StatementAdapter.java:36)
[junit4:junit4]    > 	at com.carrotsearch.randomizedtesting.rules.SystemPropertiesRestoreRule$1.evaluate(SystemPropertiesRestoreRule.java:53)
[junit4:junit4]    > 	at org.apache.lucene.util.AbstractBeforeAfterRule$1.evaluate(AbstractBeforeAfterRule.java:46)
[junit4:junit4]    > 	at org.apache.lucene.util.TestRuleStoreClassName$1.evaluate(TestRuleStoreClassName.java:42)
[junit4:junit4]    > 	at com.carrotsearch.randomizedtesting.rules.SystemPropertiesInvariantRule$1.evaluate(SystemPropertiesInvariantRule.java:55)
[junit4:junit4]    > 	at com.carrotsearch.randomizedtesting.rules.NoShadowingOrOverridesOnMethodsRule$1.evaluate(NoShadowingOrOverridesOnMethodsRule.java:39)
[junit4:junit4]    > 	at com.carrotsearch.randomizedtesting.rules.NoShadowingOrOverridesOnMethodsRule$1.evaluate(NoShadowingOrOverridesOnMethodsRule.java:39)
[junit4:junit4]    > 	at com.carrotsearch.randomizedtesting.rules.StatementAdapter.evaluate(StatementAdapter.java:36)
[junit4:junit4]    > 	at org.apache.lucene.util.TestRuleAssertionsRequired$1.evaluate(TestRuleAssertionsRequired.java:43)
[junit4:junit4]    > 	at org.apache.lucene.util.TestRuleMarkFailure$1.evaluate(TestRuleMarkFailure.java:48)
[junit4:junit4]    > 	at org.apache.lucene.util.TestRuleIgnoreAfterMaxFailures$1.evaluate(TestRuleIgnoreAfterMaxFailures.java:70)
[junit4:junit4]    > 	at org.apache.lucene.util.TestRuleIgnoreTestSuites$1.evaluate(TestRuleIgnoreTestSuites.java:55)
[junit4:junit4]    > 	at com.carrotsearch.randomizedtesting.rules.StatementAdapter.evaluate(StatementAdapter.java:36)
[junit4:junit4]    > 	at com.carrotsearch.randomizedtesting.ThreadLeakControl$StatementRunner.run(ThreadLeakControl.java:358)
[junit4:junit4]    > 	at java.lang.Thread.run(Thread.java:679)
[junit4:junit4]    > Throwable #2: com.carrotsearch.randomizedtesting.UncaughtExceptionError: Captured an uncaught exception in thread: Thread[id=2763, name=Thread-980, state=RUNNABLE, group=TGRP-OverseerCollectionProcessorTest]
[junit4:junit4]    > Caused by: java.lang.AssertionError: 
[junit4:junit4]    >   Unexpected method call poll():
[junit4:junit4]    > 	at __randomizedtesting.SeedInfo.seed([B2E533D3F17E6070]:0)
[junit4:junit4]    > 	at org.easymock.internal.MockInvocationHandler.invoke(MockInvocationHandler.java:45)
[junit4:junit4]    > 	at org.easymock.internal.ObjectMethodsFilter.invoke(ObjectMethodsFilter.java:73)
[junit4:junit4]    > 	at org.easymock.internal.ClassProxyFactory$MockMethodInterceptor.intercept(ClassProxyFactory.java:92)
[junit4:junit4]    > 	at org.apache.solr.cloud.DistributedQueue$$EnhancerByCGLIB$$4eacec50.poll(<generated>)
[junit4:junit4]    > 	at org.apache.solr.cloud.OverseerCollectionProcessor.run(OverseerCollectionProcessor.java:122)
[junit4:junit4]    > 	at java.lang.Thread.run(Thread.java:679)
[junit4:junit4]   2> 41541 T2759 oas.SolrTestCaseJ4.setUp ###Starting testNoReplicationEqualNumberOfSlicesPerNodeSendNullCreateNodes
[junit4:junit4]   2> 41542 T2764 oasc.OverseerCollectionProcessor.run Process current queue of collection messages
[junit4:junit4]   2> 41543 T2764 oasc.OverseerCollectionProcessor.createCollection Creating shard mycollection_shard1_replica1 as part of slice shard1 of collection mycollection on localhost:8965_solr
[junit4:junit4]   2> 41543 T2764 oasc.OverseerCollectionProcessor.createCollection Creating shard mycollection_shard2_replica1 as part of slice shard2 of collection mycollection on localhost:8966_solr
[junit4:junit4]   2> 41544 T2764 oasc.OverseerCollectionProcessor.createCollection Creating shard mycollection_shard3_replica1 as part of slice shard3 of collection mycollection on localhost:8963_solr
[junit4:junit4]   2> 41544 T2764 oasc.OverseerCollectionProcessor.createCollection Creating shard mycollection_shard4_replica1 as part of slice shard4 of collection mycollection on localhost:8964_solr
[junit4:junit4]   2> 41544 T2764 oasc.OverseerCollectionProcessor.createCollection Creating shard mycollection_shard5_replica1 as part of slice shard5 of collection mycollection on localhost:8965_solr
[junit4:junit4]   2> 41544 T2764 oasc.OverseerCollectionProcessor.createCollection Creating shard mycollection_shard6_replica1 as part of slice shard6 of collection mycollection on localhost:8966_solr
[junit4:junit4]   2> 41545 T2764 oasc.OverseerCollectionProcessor.createCollection Creating shard mycollection_shard7_replica1 as part of slice shard7 of collection mycollection on localhost:8963_solr
[junit4:junit4]   2> 41545 T2764 oasc.OverseerCollectionProcessor.createCollection Creating shard mycollection_shard8_replica1 as part of slice shard8 of collection mycollection on localhost:8964_solr
[junit4:junit4]   2> 41546 T2764 oasc.OverseerCollectionProcessor.createCollection Successfully created all shards for collection mycollection
[junit4:junit4]   2> 41546 T2764 ccr.RandomizedRunner$QueueUncaughtExceptionsHandler.uncaughtException WARNING Uncaught exception in thread: Thread[Thread-981,5,TGRP-OverseerCollectionProcessorTest] java.lang.AssertionError: 
[junit4:junit4]   2>   Unexpected method call poll():
[junit4:junit4]   2> 	at __randomizedtesting.SeedInfo.seed([B2E533D3F17E6070]:0)
[junit4:junit4]   2> 	at org.easymock.internal.MockInvocationHandler.invoke(MockInvocationHandler.java:45)
[junit4:junit4]   2> 	at org.easymock.internal.ObjectMethodsFilter.invoke(ObjectMethodsFilter.java:73)
[junit4:junit4]   2> 	at org.easymock.internal.ClassProxyFactory$MockMethodInterceptor.intercept(ClassProxyFactory.java:92)
[junit4:junit4]   2> 	at org.apache.solr.cloud.DistributedQueue$$EnhancerByCGLIB$$4eacec50.poll(<generated>)
[junit4:junit4]   2> 	at org.apache.solr.cloud.OverseerCollectionProcessor.run(OverseerCollectionProcessor.java:122)
[junit4:junit4]   2> 	at java.lang.Thread.run(Thread.java:679)
[junit4:junit4]   2> 
[junit4:junit4]   2> 51643 T2759 oas.SolrTestCaseJ4.tearDown ###Ending testNoReplicationEqualNumberOfSlicesPerNodeSendNullCreateNodes
[junit4:junit4]   2> NOTE: reproduce with: ant test  -Dtestcase=OverseerCollectionProcessorTest -Dtests.method=testNoReplicationEqualNumberOfSlicesPerNodeSendNullCreateNodes -Dtests.seed=B2E533D3F17E6070 -Dtests.multiplier=3 -Dtests.slow=true -Dtests.locale=es_DO -Dtests.timezone=Etc/GMT+8 -Dtests.file.encoding=UTF-8
[junit4:junit4] ERROR   10.1s J0 | OverseerCollectionProcessorTest.testNoReplicationEqualNumberOfSlicesPerNodeSendNullCreateNodes <<<
[junit4:junit4]    > Throwable #1: java.lang.AssertionError: Queue not empty within 10000 ms
[junit4:junit4]    > 	at org.junit.Assert.fail(Assert.java:93)
[junit4:junit4]    > 	at org.apache.solr.cloud.OverseerCollectionProcessorTest.waitForEmptyQueue(OverseerCollectionProcessorTest.java:395)
[junit4:junit4]    > 	at org.apache.solr.cloud.OverseerCollectionProcessorTest.testTemplate(OverseerCollectionProcessorTest.java:436)
[junit4:junit4]    > 	at org.apache.solr.cloud.OverseerCollectionProcessorTest.testNoReplicationEqualNumberOfSlicesPerNodeSendNullCreateNodes(OverseerCollectionProcessorTest.java:503)
[junit4:junit4]    > 	at sun.reflect.NativeMethodAccessorImpl.invoke0(Native Method)
[junit4:junit4]    > 	at sun.reflect.NativeMethodAccessorImpl.invoke(NativeMethodAccessorImpl.java:57)
[junit4:junit4]    > 	at sun.reflect.DelegatingMethodAccessorImpl.invoke(DelegatingMethodAccessorImpl.java:43)
[junit4:junit4]    > 	at java.lang.reflect.Method.invoke(Method.java:616)
[junit4:junit4]    > 	at com.carrotsearch.randomizedtesting.RandomizedRunner.invoke(RandomizedRunner.java:1559)
[junit4:junit4]    > 	at com.carrotsearch.randomizedtesting.RandomizedRunner.access$600(RandomizedRunner.java:79)
[junit4:junit4]    > 	at com.carrotsearch.randomizedtesting.RandomizedRunner$6.evaluate(RandomizedRunner.java:737)
[junit4:junit4]    > 	at com.carrotsearch.randomizedtesting.RandomizedRunner$7.evaluate(RandomizedRunner.java:773)
[junit4:junit4]    > 	at com.carrotsearch.randomizedtesting.RandomizedRunner$8.evaluate(RandomizedRunner.java:787)
[junit4:junit4]    > 	at com.carrotsearch.randomizedtesting.rules.SystemPropertiesRestoreRule$1.evaluate(SystemPropertiesRestoreRule.java:53)
[junit4:junit4]    > 	at org.apache.lucene.util.TestRuleSetupTeardownChained$1.evaluate(TestRuleSetupTeardownChained.java:50)
[junit4:junit4]    > 	at org.apache.lucene.util.TestRuleFieldCacheSanity$1.evaluate(TestRuleFieldCacheSanity.java:51)
[junit4:junit4]    > 	at org.apache.lucene.util.AbstractBeforeAfterRule$1.evaluate(AbstractBeforeAfterRule.java:46)
[junit4:junit4]    > 	at com.carrotsearch.randomizedtesting.rules.SystemPropertiesInvariantRule$1.evaluate(SystemPropertiesInvariantRule.java:55)
[junit4:junit4]    > 	at org.apache.lucene.util.TestRuleThreadAndTestName$1.evaluate(TestRuleThreadAndTestName.java:49)
[junit4:junit4]    > 	at org.apache.lucene.util.TestRuleIgnoreAfterMaxFailures$1.evaluate(TestRuleIgnoreAfterMaxFailures.java:70)
[junit4:junit4]    > 	at org.apache.lucene.util.TestRuleMarkFailure$1.evaluate(TestRuleMarkFailure.java:48)
[junit4:junit4]    > 	at com.carrotsearch.randomizedtesting.rules.StatementAdapter.evaluate(StatementAdapter.java:36)
[junit4:junit4]    > 	at com.carrotsearch.randomizedtesting.ThreadLeakControl$StatementRunner.run(ThreadLeakControl.java:358)
[junit4:junit4]    > 	at com.carrotsearch.randomizedtesting.ThreadLeakControl.forkTimeoutingTask(ThreadLeakControl.java:782)
[junit4:junit4]    > 	at com.carrotsearch.randomizedtesting.ThreadLeakControl$3.evaluate(ThreadLeakControl.java:442)
[junit4:junit4]    > 	at com.carrotsearch.randomizedtesting.RandomizedRunner.runSingleTest(RandomizedRunner.java:746)
[junit4:junit4]    > 	at com.carrotsearch.randomizedtesting.RandomizedRunner$3.evaluate(RandomizedRunner.java:648)
[junit4:junit4]    > 	at com.carrotsearch.randomizedtesting.RandomizedRunner$4.evaluate(RandomizedRunner.java:682)
[junit4:junit4]    > 	at com.carrotsearch.randomizedtesting.RandomizedRunner$5.evaluate(RandomizedRunner.java:693)
[junit4:junit4]    > 	at com.carrotsearch.randomizedtesting.rules.StatementAdapter.evaluate(StatementAdapter.java:36)
[junit4:junit4]    > 	at com.carrotsearch.randomizedtesting.rules.SystemPropertiesRestoreRule$1.evaluate(SystemPropertiesRestoreRule.java:53)
[junit4:junit4]    > 	at org.apache.lucene.util.AbstractBeforeAfterRule$1.evaluate(AbstractBeforeAfterRule.java:46)
[junit4:junit4]    > 	at org.apache.lucene.util.TestRuleStoreClassName$1.evaluate(TestRuleStoreClassName.java:42)
[junit4:junit4]    > 	at com.carrotsearch.randomizedtesting.rules.SystemPropertiesInvariantRule$1.evaluate(SystemPropertiesInvariantRule.java:55)
[junit4:junit4]    > 	at com.carrotsearch.randomizedtesting.rules.NoShadowingOrOverridesOnMethodsRule$1.evaluate(NoShadowingOrOverridesOnMethodsRule.java:39)
[junit4:junit4]    > 	at com.carrotsearch.randomizedtesting.rules.NoShadowingOrOverridesOnMethodsRule$1.evaluate(NoShadowingOrOverridesOnMethodsRule.java:39)
[junit4:junit4]    > 	at com.carrotsearch.randomizedtesting.rules.StatementAdapter.evaluate(StatementAdapter.java:36)
[junit4:junit4]    > 	at org.apache.lucene.util.TestRuleAssertionsRequired$1.evaluate(TestRuleAssertionsRequired.java:43)
[junit4:junit4]    > 	at org.apache.lucene.util.TestRuleMarkFailure$1.evaluate(TestRuleMarkFailure.java:48)
[junit4:junit4]    > 	at org.apache.lucene.util.TestRuleIgnoreAfterMaxFailures$1.evaluate(TestRuleIgnoreAfterMaxFailures.java:70)
[junit4:junit4]    > 	at org.apache.lucene.util.TestRuleIgnoreTestSuites$1.evaluate(TestRuleIgnoreTestSuites.java:55)
[junit4:junit4]    > 	at com.carrotsearch.randomizedtesting.rules.StatementAdapter.evaluate(StatementAdapter.java:36)
[junit4:junit4]    > 	at com.carrotsearch.randomizedtesting.ThreadLeakControl$StatementRunner.run(ThreadLeakControl.java:358)
[junit4:junit4]    > 	at java.lang.Thread.run(Thread.java:679)
[junit4:junit4]    > Throwable #2: com.carrotsearch.randomizedtesting.UncaughtExceptionError: Captured an uncaught exception in thread: Thread[id=2764, name=Thread-981, state=RUNNABLE, group=TGRP-OverseerCollectionProcessorTest]
[junit4:junit4]    > Caused by: java.lang.AssertionError: 
[junit4:junit4]    >   Unexpected method call poll():
[junit4:junit4]    > 	at __randomizedtesting.SeedInfo.seed([B2E533D3F17E6070]:0)
[junit4:junit4]    > 	at org.easymock.internal.MockInvocationHandler.invoke(MockInvocationHandler.java:45)
[junit4:junit4]    > 	at org.easymock.internal.ObjectMethodsFilter.invoke(ObjectMethodsFilter.java:73)
[junit4:junit4]    > 	at org.easymock.internal.ClassProxyFactory$MockMethodInterceptor.intercept(ClassProxyFactory.java:92)
[junit4:junit4]    > 	at org.apache.solr.cloud.DistributedQueue$$EnhancerByCGLIB$$4eacec50.poll(<generated>)
[junit4:junit4]    > 	at org.apache.solr.cloud.OverseerCollectionProcessor.run(OverseerCollectionProcessor.java:122)
[junit4:junit4]    > 	at java.lang.Thread.run(Thread.java:679)
[junit4:junit4]   2> 51656 T2759 oas.SolrTestCaseJ4.setUp ###Starting testReplicationEqualNumberOfSlicesPerNodeSendCreateNodesEqualToLiveNodes
[junit4:junit4]   2> 51658 T2765 oasc.OverseerCollectionProcessor.run Process current queue of collection messages
[junit4:junit4]   2> 51658 T2765 oasc.OverseerCollectionProcessor.createCollection Creating shard mycollection_shard1_replica1 as part of slice shard1 of collection mycollection on localhost:8964_solr
[junit4:junit4]   2> 51658 T2765 oasc.OverseerCollectionProcessor.createCollection Creating shard mycollection_shard1_replica2 as part of slice shard1 of collection mycollection on localhost:8966_solr
[junit4:junit4]   2> 51659 T2765 oasc.OverseerCollectionProcessor.createCollection Creating shard mycollection_shard2_replica1 as part of slice shard2 of collection mycollection on localhost:8966_solr
[junit4:junit4]   2> 51659 T2765 oasc.OverseerCollectionProcessor.createCollection Creating shard mycollection_shard2_replica2 as part of slice shard2 of collection mycollection on localhost:8963_solr
[junit4:junit4]   2> 51659 T2765 oasc.OverseerCollectionProcessor.createCollection Creating shard mycollection_shard3_replica1 as part of slice shard3 of collection mycollection on localhost:8963_solr
[junit4:junit4]   2> 51660 T2765 oasc.OverseerCollectionProcessor.createCollection Creating shard mycollection_shard3_replica2 as part of slice shard3 of collection mycollection on localhost:8965_solr
[junit4:junit4]   2> 51660 T2765 oasc.OverseerCollectionProcessor.createCollection Creating shard mycollection_shard4_replica1 as part of slice shard4 of collection mycollection on localhost:8965_solr
[junit4:junit4]   2> 51660 T2765 oasc.OverseerCollectionProcessor.createCollection Creating shard mycollection_shard4_replica2 as part of slice shard4 of collection mycollection on localhost:8964_solr
[junit4:junit4]   2> 51661 T2765 oasc.OverseerCollectionProcessor.createCollection Successfully created all shards for collection mycollection
[junit4:junit4]   2> 51661 T2765 ccr.RandomizedRunner$QueueUncaughtExceptionsHandler.uncaughtException WARNING Uncaught exception in thread: Thread[Thread-982,5,TGRP-OverseerCollectionProcessorTest] java.lang.AssertionError: 
[junit4:junit4]   2>   Unexpected method call poll():
[junit4:junit4]   2> 	at __randomizedtesting.SeedInfo.seed([B2E533D3F17E6070]:0)
[junit4:junit4]   2> 	at org.easymock.internal.MockInvocationHandler.invoke(MockInvocationHandler.java:45)
[junit4:junit4]   2> 	at org.easymock.internal.ObjectMethodsFilter.invoke(ObjectMethodsFilter.java:73)
[junit4:junit4]   2> 	at org.easymock.internal.ClassProxyFactory$MockMethodInterceptor.intercept(ClassProxyFactory.java:92)
[junit4:junit4]   2> 	at org.apache.solr.cloud.DistributedQueue$$EnhancerByCGLIB$$4eacec50.poll(<generated>)
[junit4:junit4]   2> 	at org.apache.solr.cloud.OverseerCollectionProcessor.run(OverseerCollectionProcessor.java:122)
[junit4:junit4]   2> 	at java.lang.Thread.run(Thread.java:679)
[junit4:junit4]   2> 
[junit4:junit4]   2> 61758 T2759 oas.SolrTestCaseJ4.tearDown ###Ending testReplicationEqualNumberOfSlicesPerNodeSendCreateNodesEqualToLiveNodes
[junit4:junit4]   2> NOTE: reproduce with: ant test  -Dtestcase=OverseerCollectionProcessorTest -Dtests.method=testReplicationEqualNumberOfSlicesPerNodeSendCreateNodesEqualToLiveNodes -Dtests.seed=B2E533D3F17E6070 -Dtests.multiplier=3 -Dtests.slow=true -Dtests.locale=es_DO -Dtests.timezone=Etc/GMT+8 -Dtests.file.encoding=UTF-8
[junit4:junit4] ERROR   10.1s J0 | OverseerCollectionProcessorTest.testReplicationEqualNumberOfSlicesPerNodeSendCreateNodesEqualToLiveNodes <<<
[junit4:junit4]    > Throwable #1: java.lang.AssertionError: Queue not empty within 10000 ms
[junit4:junit4]    > 	at org.junit.Assert.fail(Assert.java:93)
[junit4:junit4]    > 	at org.apache.solr.cloud.OverseerCollectionProcessorTest.waitForEmptyQueue(OverseerCollectionProcessorTest.java:395)
[junit4:junit4]    > 	at org.apache.solr.cloud.OverseerCollectionProcessorTest.testTemplate(OverseerCollectionProcessorTest.java:436)
[junit4:junit4]    > 	at org.apache.solr.cloud.OverseerCollectionProcessorTest.testReplicationEqualNumberOfSlicesPerNodeSendCreateNodesEqualToLiveNodes(OverseerCollectionProcessorTest.java:491)
[junit4:junit4]    > 	at sun.reflect.NativeMethodAccessorImpl.invoke0(Native Method)
[junit4:junit4]    > 	at sun.reflect.NativeMethodAccessorImpl.invoke(NativeMethodAccessorImpl.java:57)
[junit4:junit4]    > 	at sun.reflect.DelegatingMethodAccessorImpl.invoke(DelegatingMethodAccessorImpl.java:43)
[junit4:junit4]    > 	at java.lang.reflect.Method.invoke(Method.java:616)
[junit4:junit4]    > 	at com.carrotsearch.randomizedtesting.RandomizedRunner.invoke(RandomizedRunner.java:1559)
[junit4:junit4]    > 	at com.carrotsearch.randomizedtesting.RandomizedRunner.access$600(RandomizedRunner.java:79)
[junit4:junit4]    > 	at com.carrotsearch.randomizedtesting.RandomizedRunner$6.evaluate(RandomizedRunner.java:737)
[junit4:junit4]    > 	at com.carrotsearch.randomizedtesting.RandomizedRunner$7.evaluate(RandomizedRunner.java:773)
[junit4:junit4]    > 	at com.carrotsearch.randomizedtesting.RandomizedRunner$8.evaluate(RandomizedRunner.java:787)
[junit4:junit4]    > 	at com.carrotsearch.randomizedtesting.rules.SystemPropertiesRestoreRule$1.evaluate(SystemPropertiesRestoreRule.java:53)
[junit4:junit4]    > 	at org.apache.lucene.util.TestRuleSetupTeardownChained$1.evaluate(TestRuleSetupTeardownChained.java:50)
[junit4:junit4]    > 	at org.apache.lucene.util.TestRuleFieldCacheSanity$1.evaluate(TestRuleFieldCacheSanity.java:51)
[junit4:junit4]    > 	at org.apache.lucene.util.AbstractBeforeAfterRule$1.evaluate(AbstractBeforeAfterRule.java:46)
[junit4:junit4]    > 	at com.carrotsearch.randomizedtesting.rules.SystemPropertiesInvariantRule$1.evaluate(SystemPropertiesInvariantRule.java:55)
[junit4:junit4]    > 	at org.apache.lucene.util.TestRuleThreadAndTestName$1.evaluate(TestRuleThreadAndTestName.java:49)
[junit4:junit4]    > 	at org.apache.lucene.util.TestRuleIgnoreAfterMaxFailures$1.evaluate(TestRuleIgnoreAfterMaxFailures.java:70)
[junit4:junit4]    > 	at org.apache.lucene.util.TestRuleMarkFailure$1.evaluate(TestRuleMarkFailure.java:48)
[junit4:junit4]    > 	at com.carrotsearch.randomizedtesting.rules.StatementAdapter.evaluate(StatementAdapter.java:36)
[junit4:junit4]    > 	at com.carrotsearch.randomizedtesting.ThreadLeakControl$StatementRunner.run(ThreadLeakControl.java:358)
[junit4:junit4]    > 	at com.carrotsearch.randomizedtesting.ThreadLeakControl.forkTimeoutingTask(ThreadLeakControl.java:782)
[junit4:junit4]    > 	at com.carrotsearch.randomizedtesting.ThreadLeakControl$3.evaluate(ThreadLeakControl.java:442)
[junit4:junit4]    > 	at com.carrotsearch.randomizedtesting.RandomizedRunner.runSingleTest(RandomizedRunner.java:746)
[junit4:junit4]    > 	at com.carrotsearch.randomizedtesting.RandomizedRunner$3.evaluate(RandomizedRunner.java:648)
[junit4:junit4]    > 	at com.carrotsearch.randomizedtesting.RandomizedRunner$4.evaluate(RandomizedRunner.java:682)
[junit4:junit4]    > 	at com.carrotsearch.randomizedtesting.RandomizedRunner$5.evaluate(RandomizedRunner.java:693)
[junit4:junit4]    > 	at com.carrotsearch.randomizedtesting.rules.StatementAdapter.evaluate(StatementAdapter.java:36)
[junit4:junit4]    > 	at com.carrotsearch.randomizedtesting.rules.SystemPropertiesRestoreRule$1.evaluate(SystemPropertiesRestoreRule.java:53)
[junit4:junit4]    > 	at org.apache.lucene.util.AbstractBeforeAfterRule$1.evaluate(AbstractBeforeAfterRule.java:46)
[junit4:junit4]    > 	at org.apache.lucene.util.TestRuleStoreClassName$1.evaluate(TestRuleStoreClassName.java:42)
[junit4:junit4]    > 	at com.carrotsearch.randomizedtesting.rules.SystemPropertiesInvariantRule$1.evaluate(SystemPropertiesInvariantRule.java:55)
[junit4:junit4]    > 	at com.carrotsearch.randomizedtesting.rules.NoShadowingOrOverridesOnMethodsRule$1.evaluate(NoShadowingOrOverridesOnMethodsRule.java:39)
[junit4:junit4]    > 	at com.carrotsearch.randomizedtesting.rules.NoShadowingOrOverridesOnMethodsRule$1.evaluate(NoShadowingOrOverridesOnMethodsRule.java:39)
[junit4:junit4]    > 	at com.carrotsearch.randomizedtesting.rules.StatementAdapter.evaluate(StatementAdapter.java:36)
[junit4:junit4]    > 	at org.apache.lucene.util.TestRuleAssertionsRequired$1.evaluate(TestRuleAssertionsRequired.java:43)
[junit4:junit4]    > 	at org.apache.lucene.util.TestRuleMarkFailure$1.evaluate(TestRuleMarkFailure.java:48)
[junit4:junit4]    > 	at org.apache.lucene.util.TestRuleIgnoreAfterMaxFailures$1.evaluate(TestRuleIgnoreAfterMaxFailures.java:70)
[junit4:junit4]    > 	at org.apache.lucene.util.TestRuleIgnoreTestSuites$1.evaluate(TestRuleIgnoreTestSuites.java:55)
[junit4:junit4]    > 	at com.carrotsearch.randomizedtesting.rules.StatementAdapter.evaluate(StatementAdapter.java:36)
[junit4:junit4]    > 	at com.carrotsearch.randomizedtesting.ThreadLeakControl$StatementRunner.run(ThreadLeakControl.java:358)
[junit4:junit4]    > 	at java.lang.Thread.run(Thread.java:679)
[junit4:junit4]    > Throwable #2: com.carrotsearch.randomizedtesting.UncaughtExceptionError: Captured an uncaught exception in thread: Thread[id=2765, name=Thread-982, state=RUNNABLE, group=TGRP-OverseerCollectionProcessorTest]
[junit4:junit4]    > Caused by: java.lang.AssertionError: 
[junit4:junit4]    >   Unexpected method call poll():
[junit4:junit4]    > 	at __randomizedtesting.SeedInfo.seed([B2E533D3F17E6070]:0)
[junit4:junit4]    > 	at org.easymock.internal.MockInvocationHandler.invoke(MockInvocationHandler.java:45)
[junit4:junit4]    > 	at org.easymock.internal.ObjectMethodsFilter.invoke(ObjectMethodsFilter.java:73)
[junit4:junit4]    > 	at org.easymock.internal.ClassProxyFactory$MockMethodInterceptor.intercept(ClassProxyFactory.java:92)
[junit4:junit4]    > 	at org.apache.solr.cloud.DistributedQueue$$EnhancerByCGLIB$$4eacec50.poll(<generated>)
[junit4:junit4]    > 	at org.apache.solr.cloud.OverseerCollectionProcessor.run(OverseerCollectionProcessor.java:122)
[junit4:junit4]    > 	at java.lang.Thread.run(Thread.java:679)
[junit4:junit4]   2> 61773 T2759 oas.SolrTestCaseJ4.setUp ###Starting testReplicationEqualNumberOfSlicesPerNodeSendNullCreateNodes
[junit4:junit4]   2> 61775 T2766 oasc.OverseerCollectionProcessor.run Process current queue of collection messages
[junit4:junit4]   2> 61775 T2766 oasc.OverseerCollectionProcessor.createCollection Creating shard mycollection_shard1_replica1 as part of slice shard1 of collection mycollection on localhost:8963_solr
[junit4:junit4]   2> 61775 T2766 oasc.OverseerCollectionProcessor.createCollection Creating shard mycollection_shard1_replica2 as part of slice shard1 of collection mycollection on localhost:8966_solr
[junit4:junit4]   2> 61776 T2766 oasc.OverseerCollectionProcessor.createCollection Creating shard mycollection_shard2_replica1 as part of slice shard2 of collection mycollection on localhost:8966_solr
[junit4:junit4]   2> 61776 T2766 oasc.OverseerCollectionProcessor.createCollection Creating shard mycollection_shard2_replica2 as part of slice shard2 of collection mycollection on localhost:8965_solr
[junit4:junit4]   2> 61776 T2766 oasc.OverseerCollectionProcessor.createCollection Creating shard mycollection_shard3_replica1 as part of slice shard3 of collection mycollection on localhost:8965_solr
[junit4:junit4]   2> 61777 T2766 oasc.OverseerCollectionProcessor.createCollection Creating shard mycollection_shard3_replica2 as part of slice shard3 of collection mycollection on localhost:8964_solr
[junit4:junit4]   2> 61777 T2766 oasc.OverseerCollectionProcessor.createCollection Creating shard mycollection_shard4_replica1 as part of slice shard4 of collection mycollection on localhost:8964_solr
[junit4:junit4]   2> 61777 T2766 oasc.OverseerCollectionProcessor.createCollection Creating shard mycollection_shard4_replica2 as part of slice shard4 of collection mycollection on localhost:8963_solr
[junit4:junit4]   2> 61778 T2766 oasc.OverseerCollectionProcessor.createCollection Successfully created all shards for collection mycollection
[junit4:junit4]   2> 61778 T2766 ccr.RandomizedRunner$QueueUncaughtExceptionsHandler.uncaughtException WARNING Uncaught exception in thread: Thread[Thread-983,5,TGRP-OverseerCollectionProcessorTest] java.lang.AssertionError: 
[junit4:junit4]   2>   Unexpected method call poll():
[junit4:junit4]   2> 	at __randomizedtesting.SeedInfo.seed([B2E533D3F17E6070]:0)
[junit4:junit4]   2> 	at org.easymock.internal.MockInvocationHandler.invoke(MockInvocationHandler.java:45)
[junit4:junit4]   2> 	at org.easymock.internal.ObjectMethodsFilter.invoke(ObjectMethodsFilter.java:73)
[junit4:junit4]   2> 	at org.easymock.internal.ClassProxyFactory$MockMethodInterceptor.intercept(ClassProxyFactory.java:92)
[junit4:junit4]   2> 	at org.apache.solr.cloud.DistributedQueue$$EnhancerByCGLIB$$4eacec50.poll(<generated>)
[junit4:junit4]   2> 	at org.apache.solr.cloud.OverseerCollectionProcessor.run(OverseerCollectionProcessor.java:122)
[junit4:junit4]   2> 	at java.lang.Thread.run(Thread.java:679)
[junit4:junit4]   2> 
[junit4:junit4]   2> 71792 T2759 oas.SolrTestCaseJ4.tearDown ###Ending testReplicationEqualNumberOfSlicesPerNodeSendNullCreateNodes
[junit4:junit4]   2> NOTE: reproduce with: ant test  -Dtestcase=OverseerCollectionProcessorTest -Dtests.method=testReplicationEqualNumberOfSlicesPerNodeSendNullCreateNodes -Dtests.seed=B2E533D3F17E6070 -Dtests.multiplier=3 -Dtests.slow=true -Dtests.locale=es_DO -Dtests.timezone=Etc/GMT+8 -Dtests.file.encoding=UTF-8
[junit4:junit4] ERROR   10.0s J0 | OverseerCollectionProcessorTest.testReplicationEqualNumberOfSlicesPerNodeSendNullCreateNodes <<<
[junit4:junit4]    > Throwable #1: java.lang.AssertionError: Queue not empty within 10000 ms
[junit4:junit4]    > 	at org.junit.Assert.fail(Assert.java:93)
[junit4:junit4]    > 	at org.apache.solr.cloud.OverseerCollectionProcessorTest.waitForEmptyQueue(OverseerCollectionProcessorTest.java:395)
[junit4:junit4]    > 	at org.apache.solr.cloud.OverseerCollectionProcessorTest.testTemplate(OverseerCollectionProcessorTest.java:436)
[junit4:junit4]    > 	at org.apache.solr.cloud.OverseerCollectionProcessorTest.testReplicationEqualNumberOfSlicesPerNodeSendNullCreateNodes(OverseerCollectionProcessorTest.java:515)
[junit4:junit4]    > 	at sun.reflect.NativeMethodAccessorImpl.invoke0(Native Method)
[junit4:junit4]    > 	at sun.reflect.NativeMethodAccessorImpl.invoke(NativeMethodAccessorImpl.java:57)
[junit4:junit4]    > 	at sun.reflect.DelegatingMethodAccessorImpl.invoke(DelegatingMethodAccessorImpl.java:43)
[junit4:junit4]    > 	at java.lang.reflect.Method.invoke(Method.java:616)
[junit4:junit4]    > 	at com.carrotsearch.randomizedtesting.RandomizedRunner.invoke(RandomizedRunner.java:1559)
[junit4:junit4]    > 	at com.carrotsearch.randomizedtesting.RandomizedRunner.access$600(RandomizedRunner.java:79)
[junit4:junit4]    > 	at com.carrotsearch.randomizedtesting.RandomizedRunner$6.evaluate(RandomizedRunner.java:737)
[junit4:junit4]    > 	at com.carrotsearch.randomizedtesting.RandomizedRunner$7.evaluate(RandomizedRunner.java:773)
[junit4:junit4]    > 	at com.carrotsearch.randomizedtesting.RandomizedRunner$8.evaluate(RandomizedRunner.java:787)
[junit4:junit4]    > 	at com.carrotsearch.randomizedtesting.rules.SystemPropertiesRestoreRule$1.evaluate(SystemPropertiesRestoreRule.java:53)
[junit4:junit4]    > 	at org.apache.lucene.util.TestRuleSetupTeardownChained$1.evaluate(TestRuleSetupTeardownChained.java:50)
[junit4:junit4]    > 	at org.apache.lucene.util.TestRuleFieldCacheSanity$1.evaluate(TestRuleFieldCacheSanity.java:51)
[junit4:junit4]    > 	at org.apache.lucene.util.AbstractBeforeAfterRule$1.evaluate(AbstractBeforeAfterRule.java:46)
[junit4:junit4]    > 	at com.carrotsearch.randomizedtesting.rules.SystemPropertiesInvariantRule$1.evaluate(SystemPropertiesInvariantRule.java:55)
[junit4:junit4]    > 	at org.apache.lucene.util.TestRuleThreadAndTestName$1.evaluate(TestRuleThreadAndTestName.java:49)
[junit4:junit4]    > 	at org.apache.lucene.util.TestRuleIgnoreAfterMaxFailures$1.evaluate(TestRuleIgnoreAfterMaxFailures.java:70)
[junit4:junit4]    > 	at org.apache.lucene.util.TestRuleMarkFailure$1.evaluate(TestRuleMarkFailure.java:48)
[junit4:junit4]    > 	at com.carrotsearch.randomizedtesting.rules.StatementAdapter.evaluate(StatementAdapter.java:36)
[junit4:junit4]    > 	at com.carrotsearch.randomizedtesting.ThreadLeakControl$StatementRunner.run(ThreadLeakControl.java:358)
[junit4:junit4]    > 	at com.carrotsearch.randomizedtesting.ThreadLeakControl.forkTimeoutingTask(ThreadLeakControl.java:782)
[junit4:junit4]    > 	at com.carrotsearch.randomizedtesting.ThreadLeakControl$3.evaluate(ThreadLeakControl.java:442)
[junit4:junit4]    > 	at com.carrotsearch.randomizedtesting.RandomizedRunner.runSingleTest(RandomizedRunner.java:746)
[junit4:junit4]    > 	at com.carrotsearch.randomizedtesting.RandomizedRunner$3.evaluate(RandomizedRunner.java:648)
[junit4:junit4]    > 	at com.carrotsearch.randomizedtesting.RandomizedRunner$4.evaluate(RandomizedRunner.java:682)
[junit4:junit4]    > 	at com.carrotsearch.randomizedtesting.RandomizedRunner$5.evaluate(RandomizedRunner.java:693)
[junit4:junit4]    > 	at com.carrotsearch.randomizedtesting.rules.StatementAdapter.evaluate(StatementAdapter.java:36)
[junit4:junit4]    > 	at com.carrotsearch.randomizedtesting.rules.SystemPropertiesRestoreRule$1.evaluate(SystemPropertiesRestoreRule.java:53)
[junit4:junit4]    > 	at org.apache.lucene.util.AbstractBeforeAfterRule$1.evaluate(AbstractBeforeAfterRule.java:46)
[junit4:junit4]    > 	at org.apache.lucene.util.TestRuleStoreClassName$1.evaluate(TestRuleStoreClassName.java:42)
[junit4:junit4]    > 	at com.carrotsearch.randomizedtesting.rules.SystemPropertiesInvariantRule$1.evaluate(SystemPropertiesInvariantRule.java:55)
[junit4:junit4]    > 	at com.carrotsearch.randomizedtesting.rules.NoShadowingOrOverridesOnMethodsRule$1.evaluate(NoShadowingOrOverridesOnMethodsRule.java:39)
[junit4:junit4]    > 	at com.carrotsearch.randomizedtesting.rules.NoShadowingOrOverridesOnMethodsRule$1.evaluate(NoShadowingOrOverridesOnMethodsRule.java:39)
[junit4:junit4]    > 	at com.carrotsearch.randomizedtesting.rules.StatementAdapter.evaluate(StatementAdapter.java:36)
[junit4:junit4]    > 	at org.apache.lucene.util.TestRuleAssertionsRequired$1.evaluate(TestRuleAssertionsRequired.java:43)
[junit4:junit4]    > 	at org.apache.lucene.util.TestRuleMarkFailure$1.evaluate(TestRuleMarkFailure.java:48)
[junit4:junit4]    > 	at org.apache.lucene.util.TestRuleIgnoreAfterMaxFailures$1.evaluate(TestRuleIgnoreAfterMaxFailures.java:70)
[junit4:junit4]    > 	at org.apache.lucene.util.TestRuleIgnoreTestSuites$1.evaluate(TestRuleIgnoreTestSuites.java:55)
[junit4:junit4]    > 	at com.carrotsearch.randomizedtesting.rules.StatementAdapter.evaluate(StatementAdapter.java:36)
[junit4:junit4]    > 	at com.carrotsearch.randomizedtesting.ThreadLeakControl$StatementRunner.run(ThreadLeakControl.java:358)
[junit4:junit4]    > 	at java.lang.Thread.run(Thread.java:679)
[junit4:junit4]    > Throwable #2: com.carrotsearch.randomizedtesting.UncaughtExceptionError: Captured an uncaught exception in thread: Thread[id=2766, name=Thread-983, state=RUNNABLE, group=TGRP-OverseerCollectionProcessorTest]
[junit4:junit4]    > Caused by: java.lang.AssertionError: 
[junit4:junit4]    >   Unexpected method call poll():
[junit4:junit4]    > 	at __randomizedtesting.SeedInfo.seed([B2E533D3F17E6070]:0)
[junit4:junit4]    > 	at org.easymock.internal.MockInvocationHandler.invoke(MockInvocationHandler.java:45)
[junit4:junit4]    > 	at org.easymock.internal.ObjectMethodsFilter.invoke(ObjectMethodsFilter.java:73)
[junit4:junit4]    > 	at org.easymock.internal.ClassProxyFactory$MockMethodInterceptor.intercept(ClassProxyFactory.java:92)
[junit4:junit4]    > 	at org.apache.solr.cloud.DistributedQueue$$EnhancerByCGLIB$$4eacec50.poll(<generated>)
[junit4:junit4]    > 	at org.apache.solr.cloud.OverseerCollectionProcessor.run(OverseerCollectionProcessor.java:122)
[junit4:junit4]    > 	at java.lang.Thread.run(Thread.java:679)
[junit4:junit4]   2> 71805 T2759 oas.SolrTestCaseJ4.setUp ###Starting testNoReplicationEqualNumberOfSlicesPerNode
[junit4:junit4]   2> 71807 T2767 oasc.OverseerCollectionProcessor.run Process current queue of collection messages
[junit4:junit4]   2> 71807 T2767 oasc.OverseerCollectionProcessor.createCollection Creating shard mycollection_shard1_replica1 as part of slice shard1 of collection mycollection on localhost:8964_solr
[junit4:junit4]   2> 71807 T2767 oasc.OverseerCollectionProcessor.createCollection Creating shard mycollection_shard2_replica1 as part of slice shard2 of collection mycollection on localhost:8966_solr
[junit4:junit4]   2> 71808 T2767 oasc.OverseerCollectionProcessor.createCollection Creating shard mycollection_shard3_replica1 as part of slice shard3 of collection mycollection on localhost:8963_solr
[junit4:junit4]   2> 71808 T2767 oasc.OverseerCollectionProcessor.createCollection Creating shard mycollection_shard4_replica1 as part of slice shard4 of collection mycollection on localhost:8965_solr
[junit4:junit4]   2> 71808 T2767 oasc.OverseerCollectionProcessor.createCollection Creating shard mycollection_shard5_replica1 as part of slice shard5 of collection mycollection on localhost:8964_solr
[junit4:junit4]   2> 71809 T2767 oasc.OverseerCollectionProcessor.createCollection Creating shard mycollection_shard6_replica1 as part of slice shard6 of collection mycollection on localhost:8966_solr
[junit4:junit4]   2> 71809 T2767 oasc.OverseerCollectionProcessor.createCollection Creating shard mycollection_shard7_replica1 as part of slice shard7 of collection mycollection on localhost:8963_solr
[junit4:junit4]   2> 71809 T2767 oasc.OverseerCollectionProcessor.createCollection Creating shard mycollection_shard8_replica1 as part of slice shard8 of collection mycollection on localhost:8965_solr
[junit4:junit4]   2> 71810 T2767 oasc.OverseerCollectionProcessor.createCollection Successfully created all shards for collection mycollection
[junit4:junit4]   2> 71810 T2767 ccr.RandomizedRunner$QueueUncaughtExceptionsHandler.uncaughtException WARNING Uncaught exception in thread: Thread[Thread-984,5,TGRP-OverseerCollectionProcessorTest] java.lang.AssertionError: 
[junit4:junit4]   2>   Unexpected method call poll():
[junit4:junit4]   2> 	at __randomizedtesting.SeedInfo.seed([B2E533D3F17E6070]:0)
[junit4:junit4]   2> 	at org.easymock.internal.MockInvocationHandler.invoke(MockInvocationHandler.java:45)
[junit4:junit4]   2> 	at org.easymock.internal.ObjectMethodsFilter.invoke(ObjectMethodsFilter.java:73)
[junit4:junit4]   2> 	at org.easymock.internal.ClassProxyFactory$MockMethodInterceptor.intercept(ClassProxyFactory.java:92)
[junit4:junit4]   2> 	at org.apache.solr.cloud.DistributedQueue$$EnhancerByCGLIB$$4eacec50.poll(<generated>)
[junit4:junit4]   2> 	at org.apache.solr.cloud.OverseerCollectionProcessor.run(OverseerCollectionProcessor.java:122)
[junit4:junit4]   2> 	at java.lang.Thread.run(Thread.java:679)
[junit4:junit4]   2> 
[junit4:junit4]   2> 81809 T2759 oas.SolrTestCaseJ4.tearDown ###Ending testNoReplicationEqualNumberOfSlicesPerNode
[junit4:junit4]   2> NOTE: reproduce with: ant test  -Dtestcase=OverseerCollectionProcessorTest -Dtests.method=testNoReplicationEqualNumberOfSlicesPerNode -Dtests.seed=B2E533D3F17E6070 -Dtests.multiplier=3 -Dtests.slow=true -Dtests.locale=es_DO -Dtests.timezone=Etc/GMT+8 -Dtests.file.encoding=UTF-8
[junit4:junit4] ERROR   10.0s J0 | OverseerCollectionProcessorTest.testNoReplicationEqualNumberOfSlicesPerNode <<<
[junit4:junit4]    > Throwable #1: java.lang.AssertionError: Queue not empty within 10000 ms
[junit4:junit4]    > 	at org.junit.Assert.fail(Assert.java:93)
[junit4:junit4]    > 	at org.apache.solr.cloud.OverseerCollectionProcessorTest.waitForEmptyQueue(OverseerCollectionProcessorTest.java:395)
[junit4:junit4]    > 	at org.apache.solr.cloud.OverseerCollectionProcessorTest.testTemplate(OverseerCollectionProcessorTest.java:436)
[junit4:junit4]    > 	at org.apache.solr.cloud.OverseerCollectionProcessorTest.testNoReplicationEqualNumberOfSlicesPerNode(OverseerCollectionProcessorTest.java:455)
[junit4:junit4]    > 	at sun.reflect.NativeMethodAccessorImpl.invoke0(Native Method)
[junit4:junit4]    > 	at sun.reflect.NativeMethodAccessorImpl.invoke(NativeMethodAccessorImpl.java:57)
[junit4:junit4]    > 	at sun.reflect.DelegatingMethodAccessorImpl.invoke(DelegatingMethodAccessorImpl.java:43)
[junit4:junit4]    > 	at java.lang.reflect.Method.invoke(Method.java:616)
[junit4:junit4]    > 	at com.carrotsearch.randomizedtesting.RandomizedRunner.invoke(RandomizedRunner.java:1559)
[junit4:junit4]    > 	at com.carrotsearch.randomizedtesting.RandomizedRunner.access$600(RandomizedRunner.java:79)
[junit4:junit4]    > 	at com.carrotsearch.randomizedtesting.RandomizedRunner$6.evaluate(RandomizedRunner.java:737)
[junit4:junit4]    > 	at com.carrotsearch.randomizedtesting.RandomizedRunner$7.evaluate(RandomizedRunner.java:773)
[junit4:junit4]    > 	at com.carrotsearch.randomizedtesting.RandomizedRunner$8.evaluate(RandomizedRunner.java:787)
[junit4:junit4]    > 	at com.carrotsearch.randomizedtesting.rules.SystemPropertiesRestoreRule$1.evaluate(SystemPropertiesRestoreRule.java:53)
[junit4:junit4]    > 	at org.apache.lucene.util.TestRuleSetupTeardownChained$1.evaluate(TestRuleSetupTeardownChained.java:50)
[junit4:junit4]    > 	at org.apache.lucene.util.TestRuleFieldCacheSanity$1.evaluate(TestRuleFieldCacheSanity.java:51)
[junit4:junit4]    > 	at org.apache.lucene.util.AbstractBeforeAfterRule$1.evaluate(AbstractBeforeAfterRule.java:46)
[junit4:junit4]    > 	at com.carrotsearch.randomizedtesting.rules.SystemPropertiesInvariantRule$1.evaluate(SystemPropertiesInvariantRule.java:55)
[junit4:junit4]    > 	at org.apache.lucene.util.TestRuleThreadAndTestName$1.evaluate(TestRuleThreadAndTestName.java:49)
[junit4:junit4]    > 	at org.apache.lucene.util.TestRuleIgnoreAfterMaxFailures$1.evaluate(TestRuleIgnoreAfterMaxFailures.java:70)
[junit4:junit4]    > 	at org.apache.lucene.util.TestRuleMarkFailure$1.evaluate(TestRuleMarkFailure.java:48)
[junit4:junit4]    > 	at com.carrotsearch.randomizedtesting.rules.StatementAdapter.evaluate(StatementAdapter.java:36)
[junit4:junit4]    > 	at com.carrotsearch.randomizedtesting.ThreadLeakControl$StatementRunner.run(ThreadLeakControl.java:358)
[junit4:junit4]    > 	at com.carrotsearch.randomizedtesting.ThreadLeakControl.forkTimeoutingTask(ThreadLeakControl.java:782)
[junit4:junit4]    > 	at com.carrotsearch.randomizedtesting.ThreadLeakControl$3.evaluate(ThreadLeakControl.java:442)
[junit4:junit4]    > 	at com.carrotsearch.randomizedtesting.RandomizedRunner.runSingleTest(RandomizedRunner.java:746)
[junit4:junit4]    > 	at com.carrotsearch.randomizedtesting.RandomizedRunner$3.evaluate(RandomizedRunner.java:648)
[junit4:junit4]    > 	at com.carrotsearch.randomizedtesting.RandomizedRunner$4.evaluate(RandomizedRunner.java:682)
[junit4:junit4]    > 	at com.carrotsearch.randomizedtesting.RandomizedRunner$5.evaluate(RandomizedRunner.java:693)
[junit4:junit4]    > 	at com.carrotsearch.randomizedtesting.rules.StatementAdapter.evaluate(StatementAdapter.java:36)
[junit4:junit4]    > 	at com.carrotsearch.randomizedtesting.rules.SystemPropertiesRestoreRule$1.evaluate(SystemPropertiesRestoreRule.java:53)
[junit4:junit4]    > 	at org.apache.lucene.util.AbstractBeforeAfterRule$1.evaluate(AbstractBeforeAfterRule.java:46)
[junit4:junit4]    > 	at org.apache.lucene.util.TestRuleStoreClassName$1.evaluate(TestRuleStoreClassName.java:42)
[junit4:junit4]    > 	at com.carrotsearch.randomizedtesting.rules.SystemPropertiesInvariantRule$1.evaluate(SystemPropertiesInvariantRule.java:55)
[junit4:junit4]    > 	at com.carrotsearch.randomizedtesting.rules.NoShadowingOrOverridesOnMethodsRule$1.evaluate(NoShadowingOrOverridesOnMethodsRule.java:39)
[junit4:junit4]    > 	at com.carrotsearch.randomizedtesting.rules.NoShadowingOrOverridesOnMethodsRule$1.evaluate(NoShadowingOrOverridesOnMethodsRule.java:39)
[junit4:junit4]    > 	at com.carrotsearch.randomizedtesting.rules.StatementAdapter.evaluate(StatementAdapter.java:36)
[junit4:junit4]    > 	at org.apache.lucene.util.TestRuleAssertionsRequired$1.evaluate(TestRuleAssertionsRequired.java:43)
[junit4:junit4]    > 	at org.apache.lucene.util.TestRuleMarkFailure$1.evaluate(TestRuleMarkFailure.java:48)
[junit4:junit4]    > 	at org.apache.lucene.util.TestRuleIgnoreAfterMaxFailures$1.evaluate(TestRuleIgnoreAfterMaxFailures.java:70)
[junit4:junit4]    > 	at org.apache.lucene.util.TestRuleIgnoreTestSuites$1.evaluate(TestRuleIgnoreTestSuites.java:55)
[junit4:junit4]    > 	at com.carrotsearch.randomizedtesting.rules.StatementAdapter.evaluate(StatementAdapter.java:36)
[junit4:junit4]    > 	at com.carrotsearch.randomizedtesting.ThreadLeakControl$StatementRunner.run(ThreadLeakControl.java:358)
[junit4:junit4]    > 	at java.lang.Thread.run(Thread.java:679)
[junit4:junit4]    > Throwable #2: com.carrotsearch.randomizedtesting.UncaughtExceptionError: Captured an uncaught exception in thread: Thread[id=2767, name=Thread-984, state=RUNNABLE, group=TGRP-OverseerCollectionProcessorTest]
[junit4:junit4]    > Caused by: java.lang.AssertionError: 
[junit4:junit4]    >   Unexpected method call poll():
[junit4:junit4]    > 	at __randomizedtesting.SeedInfo.seed([B2E533D3F17E6070]:0)
[junit4:junit4]    > 	at org.easymock.internal.MockInvocationHandler.invoke(MockInvocationHandler.java:45)
[junit4:junit4]    > 	at org.easymock.internal.ObjectMethodsFilter.invoke(ObjectMethodsFilter.java:73)
[junit4:junit4]    > 	at org.easymock.internal.ClassProxyFactory$MockMethodInterceptor.intercept(ClassProxyFactory.java:92)
[junit4:junit4]    > 	at org.apache.solr.cloud.DistributedQueue$$EnhancerByCGLIB$$4eacec50.poll(<generated>)
[junit4:junit4]    > 	at org.apache.solr.cloud.OverseerCollectionProcessor.run(OverseerCollectionProcessor.java:122)
[junit4:junit4]    > 	at java.lang.Thread.run(Thread.java:679)
[junit4:junit4]   2> 81823 T2759 oas.SolrTestCaseJ4.setUp ###Starting testReplicationUnequalNumberOfSlicesPerNode
[junit4:junit4]   2> 81825 T2768 oasc.OverseerCollectionProcessor.run Process current queue of collection messages
[junit4:junit4]   2> 81826 T2768 oasc.OverseerCollectionProcessor.createCollection Creating shard mycollection_shard1_replica1 as part of slice shard1 of collection mycollection on localhost:8963_solr
[junit4:junit4]   2> 81826 T2768 oasc.OverseerCollectionProcessor.createCollection Creating shard mycollection_shard1_replica2 as part of slice shard1 of collection mycollection on localhost:8966_solr
[junit4:junit4]   2> 81826 T2768 oasc.OverseerCollectionProcessor.createCollection Creating shard mycollection_shard2_replica1 as part of slice shard2 of collection mycollection on localhost:8966_solr
[junit4:junit4]   2> 81827 T2768 oasc.OverseerCollectionProcessor.createCollection Creating shard mycollection_shard2_replica2 as part of slice shard2 of collection mycollection on localhost:8965_solr
[junit4:junit4]   2> 81827 T2768 oasc.OverseerCollectionProcessor.createCollection Creating shard mycollection_shard3_replica1 as part of slice shard3 of collection mycollection on localhost:8965_solr
[junit4:junit4]   2> 81827 T2768 oasc.OverseerCollectionProcessor.createCollection Creating shard mycollection_shard3_replica2 as part of slice shard3 of collection mycollection on localhost:8964_solr
[junit4:junit4]   2> 81828 T2768 oasc.OverseerCollectionProcessor.createCollection Successfully created all shards for collection mycollection
[junit4:junit4]   2> 81828 T2768 ccr.RandomizedRunner$QueueUncaughtExceptionsHandler.uncaughtException WARNING Uncaught exception in thread: Thread[Thread-985,5,TGRP-OverseerCollectionProcessorTest] java.lang.AssertionError: 
[junit4:junit4]   2>   Unexpected method call poll():
[junit4:junit4]   2> 	at __randomizedtesting.SeedInfo.seed([B2E533D3F17E6070]:0)
[junit4:junit4]   2> 	at org.easymock.internal.MockInvocationHandler.invoke(MockInvocationHandler.java:45)
[junit4:junit4]   2> 	at org.easymock.internal.ObjectMethodsFilter.invoke(ObjectMethodsFilter.java:73)
[junit4:junit4]   2> 	at org.easymock.internal.ClassProxyFactory$MockMethodInterceptor.intercept(ClassProxyFactory.java:92)
[junit4:junit4]   2> 	at org.apache.solr.cloud.DistributedQueue$$EnhancerByCGLIB$$4eacec50.poll(<generated>)
[junit4:junit4]   2> 	at org.apache.solr.cloud.OverseerCollectionProcessor.run(OverseerCollectionProcessor.java:122)
[junit4:junit4]   2> 	at java.lang.Thread.run(Thread.java:679)
[junit4:junit4]   2> 
[junit4:junit4]   2> 91842 T2759 oas.SolrTestCaseJ4.tearDown ###Ending testReplicationUnequalNumberOfSlicesPerNode
[junit4:junit4]   2> NOTE: reproduce with: ant test  -Dtestcase=OverseerCollectionProcessorTest -Dtests.method=testReplicationUnequalNumberOfSlicesPerNode -Dtests.seed=B2E533D3F17E6070 -Dtests.multiplier=3 -Dtests.slow=true -Dtests.locale=es_DO -Dtests.timezone=Etc/GMT+8 -Dtests.file.encoding=UTF-8
[junit4:junit4] ERROR   10.0s J0 | OverseerCollectionProcessorTest.testReplicationUnequalNumberOfSlicesPerNode <<<
[junit4:junit4]    > Throwable #1: java.lang.AssertionError: Queue not empty within 10000 ms
[junit4:junit4]    > 	at org.junit.Assert.fail(Assert.java:93)
[junit4:junit4]    > 	at org.apache.solr.cloud.OverseerCollectionProcessorTest.waitForEmptyQueue(OverseerCollectionProcessorTest.java:395)
[junit4:junit4]    > 	at org.apache.solr.cloud.OverseerCollectionProcessorTest.testTemplate(OverseerCollectionProcessorTest.java:436)
[junit4:junit4]    > 	at org.apache.solr.cloud.OverseerCollectionProcessorTest.testReplicationUnequalNumberOfSlicesPerNode(OverseerCollectionProcessorTest.java:539)
[junit4:junit4]    > 	at sun.reflect.NativeMethodAccessorImpl.invoke0(Native Method)
[junit4:junit4]    > 	at sun.reflect.NativeMethodAccessorImpl.invoke(NativeMethodAccessorImpl.java:57)
[junit4:junit4]    > 	at sun.reflect.DelegatingMethodAccessorImpl.invoke(DelegatingMethodAccessorImpl.java:43)
[junit4:junit4]    > 	at java.lang.reflect.Method.invoke(Method.java:616)
[junit4:junit4]    > 	at com.carrotsearch.randomizedtesting.RandomizedRunner.invoke(RandomizedRunner.java:1559)
[junit4:junit4]    > 	at com.carrotsearch.randomizedtesting.RandomizedRunner.access$600(RandomizedRunner.java:79)
[junit4:junit4]    > 	at com.carrotsearch.randomizedtesting.RandomizedRunner$6.evaluate(RandomizedRunner.java:737)
[junit4:junit4]    > 	at com.carrotsearch.randomizedtesting.RandomizedRunner$7.evaluate(RandomizedRunner.java:773)
[junit4:junit4]    > 	at com.carrotsearch.randomizedtesting.RandomizedRunner$8.evaluate(RandomizedRunner.java:787)
[junit4:junit4]    > 	at com.carrotsearch.randomizedtesting.rules.SystemPropertiesRestoreRule$1.evaluate(SystemPropertiesRestoreRule.java:53)
[junit4:junit4]    > 	at org.apache.lucene.util.TestRuleSetupTeardownChained$1.evaluate(TestRuleSetupTeardownChained.java:50)
[junit4:junit4]    > 	at org.apache.lucene.util.TestRuleFieldCacheSanity$1.evaluate(TestRuleFieldCacheSanity.java:51)
[junit4:junit4]    > 	at org.apache.lucene.util.AbstractBeforeAfterRule$1.evaluate(AbstractBeforeAfterRule.java:46)
[junit4:junit4]    > 	at com.carrotsearch.randomizedtesting.rules.SystemPropertiesInvariantRule$1.evaluate(SystemPropertiesInvariantRule.java:55)
[junit4:junit4]    > 	at org.apache.lucene.util.TestRuleThreadAndTestName$1.evaluate(TestRuleThreadAndTestName.java:49)
[junit4:junit4]    > 	at org.apache.lucene.util.TestRuleIgnoreAfterMaxFailures$1.evaluate(TestRuleIgnoreAfterMaxFailures.java:70)
[junit4:junit4]    > 	at org.apache.lucene.util.TestRuleMarkFailure$1.evaluate(TestRuleMarkFailure.java:48)
[junit4:junit4]    > 	at com.carrotsearch.randomizedtesting.rules.StatementAdapter.evaluate(StatementAdapter.java:36)
[junit4:junit4]    > 	at com.carrotsearch.randomizedtesting.ThreadLeakControl$StatementRunner.run(ThreadLeakControl.java:358)
[junit4:junit4]    > 	at com.carrotsearch.randomizedtesting.ThreadLeakControl.forkTimeoutingTask(ThreadLeakControl.java:782)
[junit4:junit4]    > 	at com.carrotsearch.randomizedtesting.ThreadLeakControl$3.evaluate(ThreadLeakControl.java:442)
[junit4:junit4]    > 	at com.carrotsearch.randomizedtesting.RandomizedRunner.runSingleTest(RandomizedRunner.java:746)
[junit4:junit4]    > 	at com.carrotsearch.randomizedtesting.RandomizedRunner$3.evaluate(RandomizedRunner.java:648)
[junit4:junit4]    > 	at com.carrotsearch.randomizedtesting.RandomizedRunner$4.evaluate(RandomizedRunner.java:682)
[junit4:junit4]    > 	at com.carrotsearch.randomizedtesting.RandomizedRunner$5.evaluate(RandomizedRunner.java:693)
[junit4:junit4]    > 	at com.carrotsearch.randomizedtesting.rules.StatementAdapter.evaluate(StatementAdapter.java:36)
[junit4:junit4]    > 	at com.carrotsearch.randomizedtesting.rules.SystemPropertiesRestoreRule$1.evaluate(SystemPropertiesRestoreRule.java:53)
[junit4:junit4]    > 	at org.apache.lucene.util.AbstractBeforeAfterRule$1.evaluate(AbstractBeforeAfterRule.java:46)
[junit4:junit4]    > 	at org.apache.lucene.util.TestRuleStoreClassName$1.evaluate(TestRuleStoreClassName.java:42)
[junit4:junit4]    > 	at com.carrotsearch.randomizedtesting.rules.SystemPropertiesInvariantRule$1.evaluate(SystemPropertiesInvariantRule.java:55)
[junit4:junit4]    > 	at com.carrotsearch.randomizedtesting.rules.NoShadowingOrOverridesOnMethodsRule$1.evaluate(NoShadowingOrOverridesOnMethodsRule.java:39)
[junit4:junit4]    > 	at com.carrotsearch.randomizedtesting.rules.NoShadowingOrOverridesOnMethodsRule$1.evaluate(NoShadowingOrOverridesOnMethodsRule.java:39)
[junit4:junit4]    > 	at com.carrotsearch.randomizedtesting.rules.StatementAdapter.evaluate(StatementAdapter.java:36)
[junit4:junit4]    > 	at org.apache.lucene.util.TestRuleAssertionsRequired$1.evaluate(TestRuleAssertionsRequired.java:43)
[junit4:junit4]    > 	at org.apache.lucene.util.TestRuleMarkFailure$1.evaluate(TestRuleMarkFailure.java:48)
[junit4:junit4]    > 	at org.apache.lucene.util.TestRuleIgnoreAfterMaxFailures$1.evaluate(TestRuleIgnoreAfterMaxFailures.java:70)
[junit4:junit4]    > 	at org.apache.lucene.util.TestRuleIgnoreTestSuites$1.evaluate(TestRuleIgnoreTestSuites.java:55)
[junit4:junit4]    > 	at com.carrotsearch.randomizedtesting.rules.StatementAdapter.evaluate(StatementAdapter.java:36)
[junit4:junit4]    > 	at com.carrotsearch.randomizedtesting.ThreadLeakControl$StatementRunner.run(ThreadLeakControl.java:358)
[junit4:junit4]    > 	at java.lang.Thread.run(Thread.java:679)
[junit4:junit4]    > Throwable #2: com.carrotsearch.randomizedtesting.UncaughtExceptionError: Captured an uncaught exception in thread: Thread[id=2768, name=Thread-985, state=RUNNABLE, group=TGRP-OverseerCollectionProcessorTest]
[junit4:junit4]    > Caused by: java.lang.AssertionError: 
[junit4:junit4]    >   Unexpected method call poll():
[junit4:junit4]    > 	at __randomizedtesting.SeedInfo.seed([B2E533D3F17E6070]:0)
[junit4:junit4]    > 	at org.easymock.internal.MockInvocationHandler.invoke(MockInvocationHandler.java:45)
[junit4:junit4]    > 	at org.easymock.internal.ObjectMethodsFilter.invoke(ObjectMethodsFilter.java:73)
[junit4:junit4]    > 	at org.easymock.internal.ClassProxyFactory$MockMethodInterceptor.intercept(ClassProxyFactory.java:92)
[junit4:junit4]    > 	at org.apache.solr.cloud.DistributedQueue$$EnhancerByCGLIB$$4eacec50.poll(<generated>)
[junit4:junit4]    > 	at org.apache.solr.cloud.OverseerCollectionProcessor.run(OverseerCollectionProcessor.java:122)
[junit4:junit4]    > 	at java.lang.Thread.run(Thread.java:679)
[junit4:junit4]   2> 91864 T2759 oas.SolrTestCaseJ4.setUp ###Starting testReplicationCollectionNotCreatedDueToMaxShardsPerNodeLimit
[junit4:junit4]   2> 91865 T2769 oasc.OverseerCollectionProcessor.run Process current queue of collection messages
[junit4:junit4]   2> 91866 T2769 oasc.OverseerCollectionProcessor.createCollection SEVERE Cannot create collection mycollection. Value of maxShardsPerNode is 1, and the number of live nodes is 4. This allows a maximum of 4 to be created. Value of numShards is 3 and value of replicationFactor is 2. This requires 6 shards to be created (higher than the allowed number)
[junit4:junit4]   2> 91866 T2769 oasc.SolrException.log SEVERE Collection createcollection of mycollection failed
[junit4:junit4]   2> 91867 T2769 ccr.RandomizedRunner$QueueUncaughtExceptionsHandler.uncaughtException WARNING Uncaught exception in thread: Thread[Thread-986,5,TGRP-OverseerCollectionProcessorTest] java.lang.AssertionError: 
[junit4:junit4]   2>   Unexpected method call poll():
[junit4:junit4]   2> 	at __randomizedtesting.SeedInfo.seed([B2E533D3F17E6070]:0)
[junit4:junit4]   2> 	at org.easymock.internal.MockInvocationHandler.invoke(MockInvocationHandler.java:45)
[junit4:junit4]   2> 	at org.easymock.internal.ObjectMethodsFilter.invoke(ObjectMethodsFilter.java:73)
[junit4:junit4]   2> 	at org.easymock.internal.ClassProxyFactory$MockMethodInterceptor.intercept(ClassProxyFactory.java:92)
[junit4:junit4]   2> 	at org.apache.solr.cloud.DistributedQueue$$EnhancerByCGLIB$$4eacec50.poll(<generated>)
[junit4:junit4]   2> 	at org.apache.solr.cloud.OverseerCollectionProcessor.run(OverseerCollectionProcessor.java:122)
[junit4:junit4]   2> 	at java.lang.Thread.run(Thread.java:679)
[junit4:junit4]   2> 
[junit4:junit4]   2> 101965 T2759 oas.SolrTestCaseJ4.tearDown ###Ending testReplicationCollectionNotCreatedDueToMaxShardsPerNodeLimit
[junit4:junit4]   2> NOTE: reproduce with: ant test  -Dtestcase=OverseerCollectionProcessorTest -Dtests.method=testReplicationCollectionNotCreatedDueToMaxShardsPerNodeLimit -Dtests.seed=B2E533D3F17E6070 -Dtests.multiplier=3 -Dtests.slow=true -Dtests.locale=es_DO -Dtests.timezone=Etc/GMT+8 -Dtests.file.encoding=UTF-8
[junit4:junit4] ERROR   10.1s J0 | OverseerCollectionProcessorTest.testReplicationCollectionNotCreatedDueToMaxShardsPerNodeLimit <<<
[junit4:junit4]    > Throwable #1: java.lang.AssertionError: Queue not empty within 10000 ms
[junit4:junit4]    > 	at org.junit.Assert.fail(Assert.java:93)
[junit4:junit4]    > 	at org.apache.solr.cloud.OverseerCollectionProcessorTest.waitForEmptyQueue(OverseerCollectionProcessorTest.java:395)
[junit4:junit4]    > 	at org.apache.solr.cloud.OverseerCollectionProcessorTest.testTemplate(OverseerCollectionProcessorTest.java:436)
[junit4:junit4]    > 	at org.apache.solr.cloud.OverseerCollectionProcessorTest.testReplicationCollectionNotCreatedDueToMaxShardsPerNodeLimit(OverseerCollectionProcessorTest.java:565)
[junit4:junit4]    > 	at sun.reflect.NativeMethodAccessorImpl.invoke0(Native Method)
[junit4:junit4]    > 	at sun.reflect.NativeMethodAccessorImpl.invoke(NativeMethodAccessorImpl.java:57)
[junit4:junit4]    > 	at sun.reflect.DelegatingMethodAccessorImpl.invoke(DelegatingMethodAccessorImpl.java:43)
[junit4:junit4]    > 	at java.lang.reflect.Method.invoke(Method.java:616)
[junit4:junit4]    > 	at com.carrotsearch.randomizedtesting.RandomizedRunner.invoke(RandomizedRunner.java:1559)
[junit4:junit4]    > 	at com.carrotsearch.randomizedtesting.RandomizedRunner.access$600(RandomizedRunner.java:79)
[junit4:junit4]    > 	at com.carrotsearch.randomizedtesting.RandomizedRunner$6.evaluate(RandomizedRunner.java:737)
[junit4:junit4]    > 	at com.carrotsearch.randomizedtesting.RandomizedRunner$7.evaluate(RandomizedRunner.java:773)
[junit4:junit4]    > 	at com.carrotsearch.randomizedtesting.RandomizedRunner$8.evaluate(RandomizedRunner.java:787)
[junit4:junit4]    > 	at com.carrotsearch.randomizedtesting.rules.SystemPropertiesRestoreRule$1.evaluate(SystemPropertiesRestoreRule.java:53)
[junit4:junit4]    > 	at org.apache.lucene.util.TestRuleSetupTeardownChained$1.evaluate(TestRuleSetupTeardownChained.java:50)
[junit4:junit4]    > 	at org.apache.lucene.util.TestRuleFieldCacheSanity$1.evaluate(TestRuleFieldCacheSanity.java:51)
[junit4:junit4]    > 	at org.apache.lucene.util.AbstractBeforeAfterRule$1.evaluate(AbstractBeforeAfterRule.java:46)
[junit4:junit4]    > 	at com.carrotsearch.randomizedtesting.rules.SystemPropertiesInvariantRule$1.evaluate(SystemPropertiesInvariantRule.java:55)
[junit4:junit4]    > 	at org.apache.lucene.util.TestRuleThreadAndTestName$1.evaluate(TestRuleThreadAndTestName.java:49)
[junit4:junit4]    > 	at org.apache.lucene.util.TestRuleIgnoreAfterMaxFailures$1.evaluate(TestRuleIgnoreAfterMaxFailures.java:70)
[junit4:junit4]    > 	at org.apache.lucene.util.TestRuleMarkFailure$1.evaluate(TestRuleMarkFailure.java:48)
[junit4:junit4]    > 	at com.carrotsearch.randomizedtesting.rules.StatementAdapter.evaluate(StatementAdapter.java:36)
[junit4:junit4]    > 	at com.carrotsearch.randomizedtesting.ThreadLeakControl$StatementRunner.run(ThreadLeakControl.java:358)
[junit4:junit4]    > 	at com.carrotsearch.randomizedtesting.ThreadLeakControl.forkTimeoutingTask(ThreadLeakControl.java:782)
[junit4:junit4]    > 	at com.carrotsearch.randomizedtesting.ThreadLeakControl$3.evaluate(ThreadLeakControl.java:442)
[junit4:junit4]    > 	at com.carrotsearch.randomizedtesting.RandomizedRunner.runSingleTest(RandomizedRunner.java:746)
[junit4:junit4]    > 	at com.carrotsearch.randomizedtesting.RandomizedRunner$3.evaluate(RandomizedRunner.java:648)
[junit4:junit4]    > 	at com.carrotsearch.randomizedtesting.RandomizedRunner$4.evaluate(RandomizedRunner.java:682)
[junit4:junit4]    > 	at com.carrotsearch.randomizedtesting.RandomizedRunner$5.evaluate(RandomizedRunner.java:693)
[junit4:junit4]    > 	at com.carrotsearch.randomizedtesting.rules.StatementAdapter.evaluate(StatementAdapter.java:36)
[junit4:junit4]    > 	at com.carrotsearch.randomizedtesting.rules.SystemPropertiesRestoreRule$1.evaluate(SystemPropertiesRestoreRule.java:53)
[junit4:junit4]    > 	at org.apache.lucene.util.AbstractBeforeAfterRule$1.evaluate(AbstractBeforeAfterRule.java:46)
[junit4:junit4]    > 	at org.apache.lucene.util.TestRuleStoreClassName$1.evaluate(TestRuleStoreClassName.java:42)
[junit4:junit4]    > 	at com.carrotsearch.randomizedtesting.rules.SystemPropertiesInvariantRule$1.evaluate(SystemPropertiesInvariantRule.java:55)
[junit4:junit4]    > 	at com.carrotsearch.randomizedtesting.rules.NoShadowingOrOverridesOnMethodsRule$1.evaluate(NoShadowingOrOverridesOnMethodsRule.java:39)
[junit4:junit4]    > 	at com.carrotsearch.randomizedtesting.rules.NoShadowingOrOverridesOnMethodsRule$1.evaluate(NoShadowingOrOverridesOnMethodsRule.java:39)
[junit4:junit4]    > 	at com.carrotsearch.randomizedtesting.rules.StatementAdapter.evaluate(StatementAdapter.java:36)
[junit4:junit4]    > 	at org.apache.lucene.util.TestRuleAssertionsRequired$1.evaluate(TestRuleAssertionsRequired.java:43)
[junit4:junit4]    > 	at org.apache.lucene.util.TestRuleMarkFailure$1.evaluate(TestRuleMarkFailure.java:48)
[junit4:junit4]    > 	at org.apache.lucene.util.TestRuleIgnoreAfterMaxFailures$1.evaluate(TestRuleIgnoreAfterMaxFailures.java:70)
[junit4:junit4]    > 	at org.apache.lucene.util.TestRuleIgnoreTestSuites$1.evaluate(TestRuleIgnoreTestSuites.java:55)
[junit4:junit4]    > 	at com.carrotsearch.randomizedtesting.rules.StatementAdapter.evaluate(StatementAdapter.java:36)
[junit4:junit4]    > 	at com.carrotsearch.randomizedtesting.ThreadLeakControl$StatementRunner.run(ThreadLeakControl.java:358)
[junit4:junit4]    > 	at java.lang.Thread.run(Thread.java:679)
[junit4:junit4]    > Throwable #2: com.carrotsearch.randomizedtesting.UncaughtExceptionError: Captured an uncaught exception in thread: Thread[id=2769, name=Thread-986, state=RUNNABLE, group=TGRP-OverseerCollectionProcessorTest]
[junit4:junit4]    > Caused by: java.lang.AssertionError: 
[junit4:junit4]    >   Unexpected method call poll():
[junit4:junit4]    > 	at __randomizedtesting.SeedInfo.seed([B2E533D3F17E6070]:0)
[junit4:junit4]    > 	at org.easymock.internal.MockInvocationHandler.invoke(MockInvocationHandler.java:45)
[junit4:junit4]    > 	at org.easymock.internal.ObjectMethodsFilter.invoke(ObjectMethodsFilter.java:73)
[junit4:junit4]    > 	at org.easymock.internal.ClassProxyFactory$MockMethodInterceptor.intercept(ClassProxyFactory.java:92)
[junit4:junit4]    > 	at org.apache.solr.cloud.DistributedQueue$$EnhancerByCGLIB$$4eacec50.poll(<generated>)
[junit4:junit4]    > 	at org.apache.solr.cloud.OverseerCollectionProcessor.run(OverseerCollectionProcessor.java:122)
[junit4:junit4]    > 	at java.lang.Thread.run(Thread.java:679)
[junit4:junit4]   2> 101978 T2759 oas.SolrTestCaseJ4.setUp ###Starting testReplicationEqualNumberOfSlicesPerNode
[junit4:junit4]   2> 101980 T2770 oasc.OverseerCollectionProcessor.run Process current queue of collection messages
[junit4:junit4]   2> 101980 T2770 oasc.OverseerCollectionProcessor.createCollection Creating shard mycollection_shard1_replica1 as part of slice shard1 of collection mycollection on localhost:8965_solr
[junit4:junit4]   2> 101980 T2770 oasc.OverseerCollectionProcessor.createCollection Creating shard mycollection_shard1_replica2 as part of slice shard1 of collection mycollection on localhost:8966_solr
[junit4:junit4]   2> 101981 T2770 oasc.OverseerCollectionProcessor.createCollection Creating shard mycollection_shard2_replica1 as part of slice shard2 of collection mycollection on localhost:8966_solr
[junit4:junit4]   2> 101981 T2770 oasc.OverseerCollectionProcessor.createCollection Creating shard mycollection_shard2_replica2 as part of slice shard2 of collection mycollection on localhost:8964_solr
[junit4:junit4]   2> 101981 T2770 oasc.OverseerCollectionProcessor.createCollection Creating shard mycollection_shard3_replica1 as part of slice shard3 of collection mycollection on localhost:8964_solr
[junit4:junit4]   2> 101982 T2770 oasc.OverseerCollectionProcessor.createCollection Creating shard mycollection_shard3_replica2 as part of slice shard3 of collection mycollection on localhost:8963_solr
[junit4:junit4]   2> 101982 T2770 oasc.OverseerCollectionProcessor.createCollection Creating shard mycollection_shard4_replica1 as part of slice shard4 of collection mycollection on localhost:8963_solr
[junit4:junit4]   2> 101982 T2770 oasc.OverseerCollectionProcessor.createCollection Creating shard mycollection_shard4_replica2 as part of slice shard4 of collection mycollection on localhost:8965_solr
[junit4:junit4]   2> 101983 T2770 oasc.OverseerCollectionProcessor.createCollection Successfully created all shards for collection mycollection
[junit4:junit4]   2> 101984 T2770 ccr.RandomizedRunner$QueueUncaughtExceptionsHandler.uncaughtException WARNING Uncaught exception in thread: Thread[Thread-987,5,TGRP-OverseerCollectionProcessorTest] java.lang.AssertionError: 
[junit4:junit4]   2>   Unexpected method call poll():
[junit4:junit4]   2> 	at __randomizedtesting.SeedInfo.seed([B2E533D3F17E6070]:0)
[junit4:junit4]   2> 	at org.easymock.internal.MockInvocationHandler.invoke(MockInvocationHandler.java:45)
[junit4:junit4]   2> 	at org.easymock.internal.ObjectMethodsFilter.invoke(ObjectMethodsFilter.java:73)
[junit4:junit4]   2> 	at org.easymock.internal.ClassProxyFactory$MockMethodInterceptor.intercept(ClassProxyFactory.java:92)
[junit4:junit4]   2> 	at org.apache.solr.cloud.DistributedQueue$$EnhancerByCGLIB$$4eacec50.poll(<generated>)
[junit4:junit4]   2> 	at org.apache.solr.cloud.OverseerCollectionProcessor.run(OverseerCollectionProcessor.java:122)
[junit4:junit4]   2> 	at java.lang.Thread.run(Thread.java:679)
[junit4:junit4]   2> 
[junit4:junit4]   2> 111994 T2759 oas.SolrTestCaseJ4.tearDown ###Ending testReplicationEqualNumberOfSlicesPerNode
[junit4:junit4]   2> NOTE: reproduce with: ant test  -Dtestcase=OverseerCollectionProcessorTest -Dtests.method=testReplicationEqualNumberOfSlicesPerNode -Dtests.seed=B2E533D3F17E6070 -Dtests.multiplier=3 -Dtests.slow=true -Dtests.locale=es_DO -Dtests.timezone=Etc/GMT+8 -Dtests.file.encoding=UTF-8
[junit4:junit4] ERROR   10.0s J0 | OverseerCollectionProcessorTest.testReplicationEqualNumberOfSlicesPerNode <<<
[junit4:junit4]    > Throwable #1: java.lang.AssertionError: Queue not empty within 10000 ms
[junit4:junit4]    > 	at org.junit.Assert.fail(Assert.java:93)
[junit4:junit4]    > 	at org.apache.solr.cloud.OverseerCollectionProcessorTest.waitForEmptyQueue(OverseerCollectionProcessorTest.java:395)
[junit4:junit4]    > 	at org.apache.solr.cloud.OverseerCollectionProcessorTest.testTemplate(OverseerCollectionProcessorTest.java:436)
[junit4:junit4]    > 	at org.apache.solr.cloud.OverseerCollectionProcessorTest.testReplicationEqualNumberOfSlicesPerNode(OverseerCollectionProcessorTest.java:467)
[junit4:junit4]    > 	at sun.reflect.NativeMethodAccessorImpl.invoke0(Native Method)
[junit4:junit4]    > 	at sun.reflect.NativeMethodAccessorImpl.invoke(NativeMethodAccessorImpl.java:57)
[junit4:junit4]    > 	at sun.reflect.DelegatingMethodAccessorImpl.invoke(DelegatingMethodAccessorImpl.java:43)
[junit4:junit4]    > 	at java.lang.reflect.Method.invoke(Method.java:616)
[junit4:junit4]    > 	at com.carrotsearch.randomizedtesting.RandomizedRunner.invoke(RandomizedRunner.java:1559)
[junit4:junit4]    > 	at com.carrotsearch.randomizedtesting.RandomizedRunner.access$600(RandomizedRunner.java:79)
[junit4:junit4]    > 	at com.carrotsearch.randomizedtesting.RandomizedRunner$6.evaluate(RandomizedRunner.java:737)
[junit4:junit4]    > 	at com.carrotsearch.randomizedtesting.RandomizedRunner$7.evaluate(RandomizedRunner.java:773)
[junit4:junit4]    > 	at com.carrotsearch.randomizedtesting.RandomizedRunner$8.evaluate(RandomizedRunner.java:787)
[junit4:junit4]    > 	at com.carrotsearch.randomizedtesting.rules.SystemPropertiesRestoreRule$1.evaluate(SystemPropertiesRestoreRule.java:53)
[junit4:junit4]    > 	at org.apache.lucene.util.TestRuleSetupTeardownChained$1.evaluate(TestRuleSetupTeardownChained.java:50)
[junit4:junit4]    > 	at org.apache.lucene.util.TestRuleFieldCacheSanity$1.evaluate(TestRuleFieldCacheSanity.java:51)
[junit4:junit4]    > 	at org.apache.lucene.util.AbstractBeforeAfterRule$1.evaluate(AbstractBeforeAfterRule.java:46)
[junit4:junit4]    > 	at com.carrotsearch.randomizedtesting.rules.SystemPropertiesInvariantRule$1.evaluate(SystemPropertiesInvariantRule.java:55)
[junit4:junit4]    > 	at org.apache.lucene.util.TestRuleThreadAndTestName$1.evaluate(TestRuleThreadAndTestName.java:49)
[junit4:junit4]    > 	at org.apache.lucene.util.TestRuleIgnoreAfterMaxFailures$1.evaluate(TestRuleIgnoreAfterMaxFailures.java:70)
[junit4:junit4]    > 	at org.apache.lucene.util.TestRuleMarkFailure$1.evaluate(TestRuleMarkFailure.java:48)
[junit4:junit4]    > 	at com.carrotsearch.randomizedtesting.rules.StatementAdapter.evaluate(StatementAdapter.java:36)
[junit4:junit4]    > 	at com.carrotsearch.randomizedtesting.ThreadLeakControl$StatementRunner.run(ThreadLeakControl.java:358)
[junit4:junit4]    > 	at com.carrotsearch.randomizedtesting.ThreadLeakControl.forkTimeoutingTask(ThreadLeakControl.java:782)
[junit4:junit4]    > 	at com.carrotsearch.randomizedtesting.ThreadLeakControl$3.evaluate(ThreadLeakControl.java:442)
[junit4:junit4]    > 	at com.carrotsearch.randomizedtesting.RandomizedRunner.runSingleTest(RandomizedRunner.java:746)
[junit4:junit4]    > 	at com.carrotsearch.randomizedtesting.RandomizedRunner$3.evaluate(RandomizedRunner.java:648)
[junit4:junit4]    > 	at com.carrotsearch.randomizedtesting.RandomizedRunner$4.evaluate(RandomizedRunner.java:682)
[junit4:junit4]    > 	at com.carrotsearch.randomizedtesting.RandomizedRunner$5.evaluate(RandomizedRunner.java:693)
[junit4:junit4]    > 	at com.carrotsearch.randomizedtesting.rules.StatementAdapter.evaluate(StatementAdapter.java:36)
[junit4:junit4]    > 	at com.carrotsearch.randomizedtesting.rules.SystemPropertiesRestoreRule$1.evaluate(SystemPropertiesRestoreRule.java:53)
[junit4:junit4]    > 	at org.apache.lucene.util.AbstractBeforeAfterRule$1.evaluate(AbstractBeforeAfterRule.java:46)
[junit4:junit4]    > 	at org.apache.lucene.util.TestRuleStoreClassName$1.evaluate(TestRuleStoreClassName.java:42)
[junit4:junit4]    > 	at com.carrotsearch.randomizedtesting.rules.SystemPropertiesInvariantRule$1.evaluate(SystemPropertiesInvariantRule.java:55)
[junit4:junit4]    > 	at com.carrotsearch.randomizedtesting.rules.NoShadowingOrOverridesOnMethodsRule$1.evaluate(NoShadowingOrOverridesOnMethodsRule.java:39)
[junit4:junit4]    > 	at com.carrotsearch.randomizedtesting.rules.NoShadowingOrOverridesOnMethodsRule$1.evaluate(NoShadowingOrOverridesOnMethodsRule.java:39)
[junit4:junit4]    > 	at com.carrotsearch.randomizedtesting.rules.StatementAdapter.evaluate(StatementAdapter.java:36)
[junit4:junit4]    > 	at org.apache.lucene.util.TestRuleAssertionsRequired$1.evaluate(TestRuleAssertionsRequired.java:43)
[junit4:junit4]    > 	at org.apache.lucene.util.TestRuleMarkFailure$1.evaluate(TestRuleMarkFailure.java:48)
[junit4:junit4]    > 	at org.apache.lucene.util.TestRuleIgnoreAfterMaxFailures$1.evaluate(TestRuleIgnoreAfterMaxFailures.java:70)
[junit4:junit4]    > 	at org.apache.lucene.util.TestRuleIgnoreTestSuites$1.evaluate(TestRuleIgnoreTestSuites.java:55)
[junit4:junit4]    > 	at com.carrotsearch.randomizedtesting.rules.StatementAdapter.evaluate(StatementAdapter.java:36)
[junit4:junit4]    > 	at com.carrotsearch.randomizedtesting.ThreadLeakControl$StatementRunner.run(ThreadLeakControl.java:358)
[junit4:junit4]    > 	at java.lang.Thread.run(Thread.java:679)
[junit4:junit4]    > Throwable #2: com.carrotsearch.randomizedtesting.UncaughtExceptionError: Captured an uncaught exception in thread: Thread[id=2770, name=Thread-987, state=RUNNABLE, group=TGRP-OverseerCollectionProcessorTest]
[junit4:junit4]    > Caused by: java.lang.AssertionError: 
[junit4:junit4]    >   Unexpected method call poll():
[junit4:junit4]    > 	at __randomizedtesting.SeedInfo.seed([B2E533D3F17E6070]:0)
[junit4:junit4]    > 	at org.easymock.internal.MockInvocationHandler.invoke(MockInvocationHandler.java:45)
[junit4:junit4]    > 	at org.easymock.internal.ObjectMethodsFilter.invoke(ObjectMethodsFilter.java:73)
[junit4:junit4]    > 	at org.easymock.internal.ClassProxyFactory$MockMethodInterceptor.intercept(ClassProxyFactory.java:92)
[junit4:junit4]    > 	at org.apache.solr.cloud.DistributedQueue$$EnhancerByCGLIB$$4eacec50.poll(<generated>)
[junit4:junit4]    > 	at org.apache.solr.cloud.OverseerCollectionProcessor.run(OverseerCollectionProcessor.java:122)
[junit4:junit4]    > 	at java.lang.Thread.run(Thread.java:679)
[junit4:junit4]   2> 112008 T2759 oas.SolrTestCaseJ4.setUp ###Starting testReplicationCollectionNotCreatedDueToMaxShardsPerNodeAndNodesToCreateOnLimits
[junit4:junit4]   2> 112009 T2771 oasc.OverseerCollectionProcessor.run Process current queue of collection messages
[junit4:junit4]   2> 112009 T2771 oasc.OverseerCollectionProcessor.createCollection SEVERE Cannot create collection mycollection. Value of maxShardsPerNode is 2, and the number of live nodes is 3. This allows a maximum of 6 to be created. Value of numShards is 4 and value of replicationFactor is 2. This requires 8 shards to be created (higher than the allowed number)
[junit4:junit4]   2> 112010 T2771 oasc.SolrException.log SEVERE Collection createcollection of mycollection failed
[junit4:junit4]   2> 112011 T2771 ccr.RandomizedRunner$QueueUncaughtExceptionsHandler.uncaughtException WARNING Uncaught exception in thread: Thread[Thread-988,5,TGRP-OverseerCollectionProcessorTest] java.lang.AssertionError: 
[junit4:junit4]   2>   Unexpected method call poll():
[junit4:junit4]   2> 	at __randomizedtesting.SeedInfo.seed([B2E533D3F17E6070]:0)
[junit4:junit4]   2> 	at org.easymock.internal.MockInvocationHandler.invoke(MockInvocationHandler.java:45)
[junit4:junit4]   2> 	at org.easymock.internal.ObjectMethodsFilter.invoke(ObjectMethodsFilter.java:73)
[junit4:junit4]   2> 	at org.easymock.internal.ClassProxyFactory$MockMethodInterceptor.intercept(ClassProxyFactory.java:92)
[junit4:junit4]   2> 	at org.apache.solr.cloud.DistributedQueue$$EnhancerByCGLIB$$4eacec50.poll(<generated>)
[junit4:junit4]   2> 	at org.apache.solr.cloud.OverseerCollectionProcessor.run(OverseerCollectionProcessor.java:122)
[junit4:junit4]   2> 	at java.lang.Thread.run(Thread.java:679)
[junit4:junit4]   2> 
[junit4:junit4]   2> 122110 T2759 oas.SolrTestCaseJ4.tearDown ###Ending testReplicationCollectionNotCreatedDueToMaxShardsPerNodeAndNodesToCreateOnLimits
[junit4:junit4]   2> NOTE: reproduce with: ant test  -Dtestcase=OverseerCollectionProcessorTest -Dtests.method=testReplicationCollectionNotCreatedDueToMaxShardsPerNodeAndNodesToCreateOnLimits -Dtests.seed=B2E533D3F17E6070 -Dtests.multiplier=3 -Dtests.slow=true -Dtests.locale=es_DO -Dtests.timezone=Etc/GMT+8 -Dtests.file.encoding=UTF-8
[junit4:junit4] ERROR   10.1s J0 | OverseerCollectionProcessorTest.testReplicationCollectionNotCreatedDueToMaxShardsPerNodeAndNodesToCreateOnLimits <<<
[junit4:junit4]    > Throwable #1: java.lang.AssertionError: Queue not empty within 10000 ms
[junit4:junit4]    > 	at org.junit.Assert.fail(Assert.java:93)
[junit4:junit4]    > 	at org.apache.solr.cloud.OverseerCollectionProcessorTest.waitForEmptyQueue(OverseerCollectionProcessorTest.java:395)
[junit4:junit4]    > 	at org.apache.solr.cloud.OverseerCollectionProcessorTest.testTemplate(OverseerCollectionProcessorTest.java:436)
[junit4:junit4]    > 	at org.apache.solr.cloud.OverseerCollectionProcessorTest.testReplicationCollectionNotCreatedDueToMaxShardsPerNodeAndNodesToCreateOnLimits(OverseerCollectionProcessorTest.java:617)
[junit4:junit4]    > 	at sun.reflect.NativeMethodAccessorImpl.invoke0(Native Method)
[junit4:junit4]    > 	at sun.reflect.NativeMethodAccessorImpl.invoke(NativeMethodAccessorImpl.java:57)
[junit4:junit4]    > 	at sun.reflect.DelegatingMethodAccessorImpl.invoke(DelegatingMethodAccessorImpl.java:43)
[junit4:junit4]    > 	at java.lang.reflect.Method.invoke(Method.java:616)
[junit4:junit4]    > 	at com.carrotsearch.randomizedtesting.RandomizedRunner.invoke(RandomizedRunner.java:1559)
[junit4:junit4]    > 	at com.carrotsearch.randomizedtesting.RandomizedRunner.access$600(RandomizedRunner.java:79)
[junit4:junit4]    > 	at com.carrotsearch.randomizedtesting.RandomizedRunner$6.evaluate(RandomizedRunner.java:737)
[junit4:junit4]    > 	at com.carrotsearch.randomizedtesting.RandomizedRunner$7.evaluate(RandomizedRunner.java:773)
[junit4:junit4]    > 	at com.carrotsearch.randomizedtesting.RandomizedRunner$8.evaluate(RandomizedRunner.java:787)
[junit4:junit4]    > 	at com.carrotsearch.randomizedtesting.rules.SystemPropertiesRestoreRule$1.evaluate(SystemPropertiesRestoreRule.java:53)
[junit4:junit4]    > 	at org.apache.lucene.util.TestRuleSetupTeardownChained$1.evaluate(TestRuleSetupTeardownChained.java:50)
[junit4:junit4]    > 	at org.apache.lucene.util.TestRuleFieldCacheSanity$1.evaluate(TestRuleFieldCacheSanity.java:51)
[junit4:junit4]    > 	at org.apache.lucene.util.AbstractBeforeAfterRule$1.evaluate(AbstractBeforeAfterRule.java:46)
[junit4:junit4]    > 	at com.carrotsearch.randomizedtesting.rules.SystemPropertiesInvariantRule$1.evaluate(SystemPropertiesInvariantRule.java:55)
[junit4:junit4]    > 	at org.apache.lucene.util.TestRuleThreadAndTestName$1.evaluate(TestRuleThreadAndTestName.java:49)
[junit4:junit4]    > 	at org.apache.lucene.util.TestRuleIgnoreAfterMaxFailures$1.evaluate(TestRuleIgnoreAfterMaxFailures.java:70)
[junit4:junit4]    > 	at org.apache.lucene.util.TestRuleMarkFailure$1.evaluate(TestRuleMarkFailure.java:48)
[junit4:junit4]    > 	at com.carrotsearch.randomizedtesting.rules.StatementAdapter.evaluate(StatementAdapter.java:36)
[junit4:junit4]    > 	at com.carrotsearch.randomizedtesting.ThreadLeakControl$StatementRunner.run(ThreadLeakControl.java:358)
[junit4:junit4]    > 	at com.carrotsearch.randomizedtesting.ThreadLeakControl.forkTimeoutingTask(ThreadLeakControl.java:782)
[junit4:junit4]    > 	at com.carrotsearch.randomizedtesting.ThreadLeakControl$3.evaluate(ThreadLeakControl.java:442)
[junit4:junit4]    > 	at com.carrotsearch.randomizedtesting.RandomizedRunner.runSingleTest(RandomizedRunner.java:746)
[junit4:junit4]    > 	at com.carrotsearch.randomizedtesting.RandomizedRunner$3.evaluate(RandomizedRunner.java:648)
[junit4:junit4]    > 	at com.carrotsearch.randomizedtesting.RandomizedRunner$4.evaluate(RandomizedRunner.java:682)
[junit4:junit4]    > 	at com.carrotsearch.randomizedtesting.RandomizedRunner$5.evaluate(RandomizedRunner.java:693)
[junit4:junit4]    > 	at com.carrotsearch.randomizedtesting.rules.StatementAdapter.evaluate(StatementAdapter.java:36)
[junit4:junit4]    > 	at com.carrotsearch.randomizedtesting.rules.SystemPropertiesRestoreRule$1.evaluate(SystemPropertiesRestoreRule.java:53)
[junit4:junit4]    > 	at org.apache.lucene.util.AbstractBeforeAfterRule$1.evaluate(AbstractBeforeAfterRule.java:46)
[junit4:junit4]    > 	at org.apache.lucene.util.TestRuleStoreClassName$1.evaluate(TestRuleStoreClassName.java:42)
[junit4:junit4]    > 	at com.carrotsearch.randomizedtesting.rules.SystemPropertiesInvariantRule$1.evaluate(SystemPropertiesInvariantRule.java:55)
[junit4:junit4]    > 	at com.carrotsearch.randomizedtesting.rules.NoShadowingOrOverridesOnMethodsRule$1.evaluate(NoShadowingOrOverridesOnMethodsRule.java:39)
[junit4:junit4]    > 	at com.carrotsearch.randomizedtesting.rules.NoShadowingOrOverridesOnMethodsRule$1.evaluate(NoShadowingOrOverridesOnMethodsRule.java:39)
[junit4:junit4]    > 	at com.carrotsearch.randomizedtesting.rules.StatementAdapter.evaluate(StatementAdapter.java:36)
[junit4:junit4]    > 	at org.apache.lucene.util.TestRuleAssertionsRequired$1.evaluate(TestRuleAssertionsRequired.java:43)
[junit4:junit4]    > 	at org.apache.lucene.util.TestRuleMarkFailure$1.evaluate(TestRuleMarkFailure.java:48)
[junit4:junit4]    > 	at org.apache.lucene.util.TestRuleIgnoreAfterMaxFailures$1.evaluate(TestRuleIgnoreAfterMaxFailures.java:70)
[junit4:junit4]    > 	at org.apache.lucene.util.TestRuleIgnoreTestSuites$1.evaluate(TestRuleIgnoreTestSuites.java:55)
[junit4:junit4]    > 	at com.carrotsearch.randomizedtesting.rules.StatementAdapter.evaluate(StatementAdapter.java:36)
[junit4:junit4]    > 	at com.carrotsearch.randomizedtesting.ThreadLeakControl$StatementRunner.run(ThreadLeakControl.java:358)
[junit4:junit4]    > 	at java.lang.Thread.run(Thread.java:679)
[junit4:junit4]    > Throwable #2: com.carrotsearch.randomizedtesting.UncaughtExceptionError: Captured an uncaught exception in thread: Thread[id=2771, name=Thread-988, state=RUNNABLE, group=TGRP-OverseerCollectionProcessorTest]
[junit4:junit4]    > Caused by: java.lang.AssertionError: 
[junit4:junit4]    >   Unexpected method call poll():
[junit4:junit4]    > 	at __randomizedtesting.SeedInfo.seed([B2E533D3F17E6070]:0)
[junit4:junit4]    > 	at org.easymock.internal.MockInvocationHandler.invoke(MockInvocationHandler.java:45)
[junit4:junit4]    > 	at org.easymock.internal.ObjectMethodsFilter.invoke(ObjectMethodsFilter.java:73)
[junit4:junit4]    > 	at org.easymock.internal.ClassProxyFactory$MockMethodInterceptor.intercept(ClassProxyFactory.java:92)
[junit4:junit4]    > 	at org.apache.solr.cloud.DistributedQueue$$EnhancerByCGLIB$$4eacec50.poll(<generated>)
[junit4:junit4]    > 	at org.apache.solr.cloud.OverseerCollectionProcessor.run(OverseerCollectionProcessor.java:122)
[junit4:junit4]    > 	at java.lang.Thread.run(Thread.java:679)
[junit4:junit4]   2> 122124 T2759 oas.SolrTestCaseJ4.setUp ###Starting testNoReplicationCollectionNotCreatedDueToMaxShardsPerNodeLimit
[junit4:junit4]   2> 122125 T2772 oasc.OverseerCollectionProcessor.run Process current queue of collection messages
[junit4:junit4]   2> 122125 T2772 oasc.OverseerCollectionProcessor.createCollection SEVERE Cannot create collection mycollection. Value of maxShardsPerNode is 1, and the number of live nodes is 4. This allows a maximum of 4 to be created. Value of numShards is 6 and value of replicationFactor is 1. This requires 6 shards to be created (higher than the allowed number)
[junit4:junit4]   2> 122126 T2772 oasc.SolrException.log SEVERE Collection createcollection of mycollection failed
[junit4:junit4]   2> 122126 T2772 ccr.RandomizedRunner$QueueUncaughtExceptionsHandler.uncaughtException WARNING Uncaught exception in thread: Thread[Thread-989,5,TGRP-OverseerCollectionProcessorTest] java.lang.AssertionError: 
[junit4:junit4]   2>   Unexpected method call poll():
[junit4:junit4]   2> 	at __randomizedtesting.SeedInfo.seed([B2E533D3F17E6070]:0)
[junit4:junit4]   2> 	at org.easymock.internal.MockInvocationHandler.invoke(MockInvocationHandler.java:45)
[junit4:junit4]   2> 	at org.easymock.internal.ObjectMethodsFilter.invoke(ObjectMethodsFilter.java:73)
[junit4:junit4]   2> 	at org.easymock.internal.ClassProxyFactory$MockMethodInterceptor.intercept(ClassProxyFactory.java:92)
[junit4:junit4]   2> 	at org.apache.solr.cloud.DistributedQueue$$EnhancerByCGLIB$$4eacec50.poll(<generated>)
[junit4:junit4]   2> 	at org.apache.solr.cloud.OverseerCollectionProcessor.run(OverseerCollectionProcessor.java:122)
[junit4:junit4]   2> 	at java.lang.Thread.run(Thread.java:679)
[junit4:junit4]   2> 
[junit4:junit4]   2> 132225 T2759 oas.SolrTestCaseJ4.tearDown ###Ending testNoReplicationCollectionNotCreatedDueToMaxShardsPerNodeLimit
[junit4:junit4]   2> NOTE: reproduce with: ant test  -Dtestcase=OverseerCollectionProcessorTest -Dtests.method=testNoReplicationCollectionNotCreatedDueToMaxShardsPerNodeLimit -Dtests.seed=B2E533D3F17E6070 -Dtests.multiplier=3 -Dtests.slow=true -Dtests.locale=es_DO -Dtests.timezone=Etc/GMT+8 -Dtests.file.encoding=UTF-8
[junit4:junit4] ERROR   10.1s J0 | OverseerCollectionProcessorTest.testNoReplicationCollectionNotCreatedDueToMaxShardsPerNodeLimit <<<
[junit4:junit4]    > Throwable #1: java.lang.AssertionError: Queue not empty within 10000 ms
[junit4:junit4]    > 	at org.junit.Assert.fail(Assert.java:93)
[junit4:junit4]    > 	at org.apache.solr.cloud.OverseerCollectionProcessorTest.waitForEmptyQueue(OverseerCollectionProcessorTest.java:395)
[junit4:junit4]    > 	at org.apache.solr.cloud.OverseerCollectionProcessorTest.testTemplate(OverseerCollectionProcessorTest.java:436)
[junit4:junit4]    > 	at org.apache.solr.cloud.OverseerCollectionProcessorTest.testNoReplicationCollectionNotCreatedDueToMaxShardsPerNodeLimit(OverseerCollectionProcessorTest.java:552)
[junit4:junit4]    > 	at sun.reflect.NativeMethodAccessorImpl.invoke0(Native Method)
[junit4:junit4]    > 	at sun.reflect.NativeMethodAccessorImpl.invoke(NativeMethodAccessorImpl.java:57)
[junit4:junit4]    > 	at sun.reflect.DelegatingMethodAccessorImpl.invoke(DelegatingMethodAccessorImpl.java:43)
[junit4:junit4]    > 	at java.lang.reflect.Method.invoke(Method.java:616)
[junit4:junit4]    > 	at com.carrotsearch.randomizedtesting.RandomizedRunner.invoke(RandomizedRunner.java:1559)
[junit4:junit4]    > 	at com.carrotsearch.randomizedtesting.RandomizedRunner.access$600(RandomizedRunner.java:79)
[junit4:junit4]    > 	at com.carrotsearch.randomizedtesting.RandomizedRunner$6.evaluate(RandomizedRunner.java:737)
[junit4:junit4]    > 	at com.carrotsearch.randomizedtesting.RandomizedRunner$7.evaluate(RandomizedRunner.java:773)
[junit4:junit4]    > 	at com.carrotsearch.randomizedtesting.RandomizedRunner$8.evaluate(RandomizedRunner.java:787)
[junit4:junit4]    > 	at com.carrotsearch.randomizedtesting.rules.SystemPropertiesRestoreRule$1.evaluate(SystemPropertiesRestoreRule.java:53)
[junit4:junit4]    > 	at org.apache.lucene.util.TestRuleSetupTeardownChained$1.evaluate(TestRuleSetupTeardownChained.java:50)
[junit4:junit4]    > 	at org.apache.lucene.util.TestRuleFieldCacheSanity$1.evaluate(TestRuleFieldCacheSanity.java:51)
[junit4:junit4]    > 	at org.apache.lucene.util.AbstractBeforeAfterRule$1.evaluate(AbstractBeforeAfterRule.java:46)
[junit4:junit4]    > 	at com.carrotsearch.randomizedtesting.rules.SystemPropertiesInvariantRule$1.evaluate(SystemPropertiesInvariantRule.java:55)
[junit4:junit4]    > 	at org.apache.lucene.util.TestRuleThreadAndTestName$1.evaluate(TestRuleThreadAndTestName.java:49)
[junit4:junit4]    > 	at org.apache.lucene.util.TestRuleIgnoreAfterMaxFailures$1.evaluate(TestRuleIgnoreAfterMaxFailures.java:70)
[junit4:junit4]    > 	at org.apache.lucene.util.TestRuleMarkFailure$1.evaluate(TestRuleMarkFailure.java:48)
[junit4:junit4]    > 	at com.carrotsearch.randomizedtesting.rules.StatementAdapter.evaluate(StatementAdapter.java:36)
[junit4:junit4]    > 	at com.carrotsearch.randomizedtesting.ThreadLeakControl$StatementRunner.run(ThreadLeakControl.java:358)
[junit4:junit4]    > 	at com.carrotsearch.randomizedtesting.ThreadLeakControl.forkTimeoutingTask(ThreadLeakControl.java:782)
[junit4:junit4]    > 	at com.carrotsearch.randomizedtesting.ThreadLeakControl$3.evaluate(ThreadLeakControl.java:442)
[junit4:junit4]    > 	at com.carrotsearch.randomizedtesting.RandomizedRunner.runSingleTest(RandomizedRunner.java:746)
[junit4:junit4]    > 	at com.carrotsearch.randomizedtesting.RandomizedRunner$3.evaluate(RandomizedRunner.java:648)
[junit4:junit4]    > 	at com.carrotsearch.randomizedtesting.RandomizedRunner$4.evaluate(RandomizedRunner.java:682)
[junit4:junit4]    > 	at com.carrotsearch.randomizedtesting.RandomizedRunner$5.evaluate(RandomizedRunner.java:693)
[junit4:junit4]    > 	at com.carrotsearch.randomizedtesting.rules.StatementAdapter.evaluate(StatementAdapter.java:36)
[junit4:junit4]    > 	at com.carrotsearch.randomizedtesting.rules.SystemPropertiesRestoreRule$1.evaluate(SystemPropertiesRestoreRule.java:53)
[junit4:junit4]    > 	at org.apache.lucene.util.AbstractBeforeAfterRule$1.evaluate(AbstractBeforeAfterRule.java:46)
[junit4:junit4]    > 	at org.apache.lucene.util.TestRuleStoreClassName$1.evaluate(TestRuleStoreClassName.java:42)
[junit4:junit4]    > 	at com.carrotsearch.randomizedtesting.rules.SystemPropertiesInvariantRule$1.evaluate(SystemPropertiesInvariantRule.java:55)
[junit4:junit4]    > 	at com.carrotsearch.randomizedtesting.rules.NoShadowingOrOverridesOnMethodsRule$1.evaluate(NoShadowingOrOverridesOnMethodsRule.java:39)
[junit4:junit4]    > 	at com.carrotsearch.randomizedtesting.rules.NoShadowingOrOverridesOnMethodsRule$1.evaluate(NoShadowingOrOverridesOnMethodsRule.java:39)
[junit4:junit4]    > 	at com.carrotsearch.randomizedtesting.rules.StatementAdapter.evaluate(StatementAdapter.java:36)
[junit4:junit4]    > 	at org.apache.lucene.util.TestRuleAssertionsRequired$1.evaluate(TestRuleAssertionsRequired.java:43)
[junit4:junit4]    > 	at org.apache.lucene.util.TestRuleMarkFailure$1.evaluate(TestRuleMarkFailure.java:48)
[junit4:junit4]    > 	at org.apache.lucene.util.TestRuleIgnoreAfterMaxFailures$1.evaluate(TestRuleIgnoreAfterMaxFailures.java:70)
[junit4:junit4]    > 	at org.apache.lucene.util.TestRuleIgnoreTestSuites$1.evaluate(TestRuleIgnoreTestSuites.java:55)
[junit4:junit4]    > 	at com.carrotsearch.randomizedtesting.rules.StatementAdapter.evaluate(StatementAdapter.java:36)
[junit4:junit4]    > 	at com.carrotsearch.randomizedtesting.ThreadLeakControl$StatementRunner.run(ThreadLeakControl.java:358)
[junit4:junit4]    > 	at java.lang.Thread.run(Thread.java:679)
[junit4:junit4]    > Throwable #2: com.carrotsearch.randomizedtesting.UncaughtExceptionError: Captured an uncaught exception in thread: Thread[id=2772, name=Thread-989, state=RUNNABLE, group=TGRP-OverseerCollectionProcessorTest]
[junit4:junit4]    > Caused by: java.lang.AssertionError: 
[junit4:junit4]    >   Unexpected method call poll():
[junit4:junit4]    > 	at __randomizedtesting.SeedInfo.seed([B2E533D3F17E6070]:0)
[junit4:junit4]    > 	at org.easymock.internal.MockInvocationHandler.invoke(MockInvocationHandler.java:45)
[junit4:junit4]    > 	at org.easymock.internal.ObjectMethodsFilter.invoke(ObjectMethodsFilter.java:73)
[junit4:junit4]    > 	at org.easymock.internal.ClassProxyFactory$MockMethodInterceptor.intercept(ClassProxyFactory.java:92)
[junit4:junit4]    > 	at org.apache.solr.cloud.DistributedQueue$$EnhancerByCGLIB$$4eacec50.poll(<generated>)
[junit4:junit4]    > 	at org.apache.solr.cloud.OverseerCollectionProcessor.run(OverseerCollectionProcessor.java:122)
[junit4:junit4]    > 	at java.lang.Thread.run(Thread.java:679)
[junit4:junit4]   2> 132235 T2759 oas.SolrTestCaseJ4.setUp ###Starting testReplicationLimitedNodesToCreateOn
[junit4:junit4]   2> 132236 T2773 oasc.OverseerCollectionProcessor.run Process current queue of collection messages
[junit4:junit4]   2> 132237 T2773 oasc.OverseerCollectionProcessor.createCollection Creating shard mycollection_shard1_replica1 as part of slice shard1 of collection mycollection on localhost:8964_solr
[junit4:junit4]   2> 132237 T2773 oasc.OverseerCollectionProcessor.createCollection Creating shard mycollection_shard1_replica2 as part of slice shard1 of collection mycollection on localhost:8966_solr
[junit4:junit4]   2> 132238 T2773 oasc.OverseerCollectionProcessor.createCollection Creating shard mycollection_shard2_replica1 as part of slice shard2 of collection mycollection on localhost:8966_solr
[junit4:junit4]   2> 132238 T2773 oasc.OverseerCollectionProcessor.createCollection Creating shard mycollection_shard2_replica2 as part of slice shard2 of collection mycollection on localhost:8964_solr
[junit4:junit4]   2> 132238 T2773 oasc.OverseerCollectionProcessor.createCollection Creating shard mycollection_shard3_replica1 as part of slice shard3 of collection mycollection on localhost:8964_solr
[junit4:junit4]   2> 132238 T2773 oasc.OverseerCollectionProcessor.createCollection Creating shard mycollection_shard3_replica2 as part of slice shard3 of collection mycollection on localhost:8966_solr
[junit4:junit4]   2> 132239 T2773 oasc.OverseerCollectionProcessor.createCollection Successfully created all shards for collection mycollection
[junit4:junit4]   2> 132240 T2773 ccr.RandomizedRunner$QueueUncaughtExceptionsHandler.uncaughtException WARNING Uncaught exception in thread: Thread[Thread-990,5,TGRP-OverseerCollectionProcessorTest] java.lang.AssertionError: 
[junit4:junit4]   2>   Unexpected method call poll():
[junit4:junit4]   2> 	at __randomizedtesting.SeedInfo.seed([B2E533D3F17E6070]:0)
[junit4:junit4]   2> 	at org.easymock.internal.MockInvocationHandler.invoke(MockInvocationHandler.java:45)
[junit4:junit4]   2> 	at org.easymock.internal.ObjectMethodsFilter.invoke(ObjectMethodsFilter.java:73)
[junit4:junit4]   2> 	at org.easymock.internal.ClassProxyFactory$MockMethodInterceptor.intercept(ClassProxyFactory.java:92)
[junit4:junit4]   2> 	at org.apache.solr.cloud.DistributedQueue$$EnhancerByCGLIB$$4eacec50.poll(<generated>)
[junit4:junit4]   2> 	at org.apache.solr.cloud.OverseerCollectionProcessor.run(OverseerCollectionProcessor.java:122)
[junit4:junit4]   2> 	at java.lang.Thread.run(Thread.java:679)
[junit4:junit4]   2> 
[junit4:junit4]   2> 142263 T2759 oas.SolrTestCaseJ4.tearDown ###Ending testReplicationLimitedNodesToCreateOn
[junit4:junit4]   2> NOTE: reproduce with: ant test  -Dtestcase=OverseerCollectionProcessorTest -Dtests.method=testReplicationLimitedNodesToCreateOn -Dtests.seed=B2E533D3F17E6070 -Dtests.multiplier=3 -Dtests.slow=true -Dtests.locale=es_DO -Dtests.timezone=Etc/GMT+8 -Dtests.file.encoding=UTF-8
[junit4:junit4] ERROR   10.0s J0 | OverseerCollectionProcessorTest.testReplicationLimitedNodesToCreateOn <<<
[junit4:junit4]    > Throwable #1: java.lang.AssertionError: Queue not empty within 10000 ms
[junit4:junit4]    > 	at org.junit.Assert.fail(Assert.java:93)
[junit4:junit4]    > 	at org.apache.solr.cloud.OverseerCollectionProcessorTest.waitForEmptyQueue(OverseerCollectionProcessorTest.java:395)
[junit4:junit4]    > 	at org.apache.solr.cloud.OverseerCollectionProcessorTest.testTemplate(OverseerCollectionProcessorTest.java:436)
[junit4:junit4]    > 	at org.apache.solr.cloud.OverseerCollectionProcessorTest.testReplicationLimitedNodesToCreateOn(OverseerCollectionProcessorTest.java:591)
[junit4:junit4]    > 	at sun.reflect.NativeMethodAccessorImpl.invoke0(Native Method)
[junit4:junit4]    > 	at sun.reflect.NativeMethodAccessorImpl.invoke(NativeMethodAccessorImpl.java:57)
[junit4:junit4]    > 	at sun.reflect.DelegatingMethodAccessorImpl.invoke(DelegatingMethodAccessorImpl.java:43)
[junit4:junit4]    > 	at java.lang.reflect.Method.invoke(Method.java:616)
[junit4:junit4]    > 	at com.carrotsearch.randomizedtesting.RandomizedRunner.invoke(RandomizedRunner.java:1559)
[junit4:junit4]    > 	at com.carrotsearch.randomizedtesting.RandomizedRunner.access$600(RandomizedRunner.java:79)
[junit4:junit4]    > 	at com.carrotsearch.randomizedtesting.RandomizedRunner$6.evaluate(RandomizedRunner.java:737)
[junit4:junit4]    > 	at com.carrotsearch.randomizedtesting.RandomizedRunner$7.evaluate(RandomizedRunner.java:773)
[junit4:junit4]    > 	at com.carrotsearch.randomizedtesting.RandomizedRunner$8.evaluate(RandomizedRunner.java:787)
[junit4:junit4]    > 	at com.carrotsearch.randomizedtesting.rules.SystemPropertiesRestoreRule$1.evaluate(SystemPropertiesRestoreRule.java:53)
[junit4:junit4]    > 	at org.apache.lucene.util.TestRuleSetupTeardownChained$1.evaluate(TestRuleSetupTeardownChained.java:50)
[junit4:junit4]    > 	at org.apache.lucene.util.TestRuleFieldCacheSanity$1.evaluate(TestRuleFieldCacheSanity.java:51)
[junit4:junit4]    > 	at org.apache.lucene.util.AbstractBeforeAfterRule$1.evaluate(AbstractBeforeAfterRule.java:46)
[junit4:junit4]    > 	at com.carrotsearch.randomizedtesting.rules.SystemPropertiesInvariantRule$1.evaluate(SystemPropertiesInvariantRule.java:55)
[junit4:junit4]    > 	at org.apache.lucene.util.TestRuleThreadAndTestName$1.evaluate(TestRuleThreadAndTestName.java:49)
[junit4:junit4]    > 	at org.apache.lucene.util.TestRuleIgnoreAfterMaxFailures$1.evaluate(TestRuleIgnoreAfterMaxFailures.java:70)
[junit4:junit4]    > 	at org.apache.lucene.util.TestRuleMarkFailure$1.evaluate(TestRuleMarkFailure.java:48)
[junit4:junit4]    > 	at com.carrotsearch.randomizedtesting.rules.StatementAdapter.evaluate(StatementAdapter.java:36)
[junit4:junit4]    > 	at com.carrotsearch.randomizedtesting.ThreadLeakControl$StatementRunner.run(ThreadLeakControl.java:358)
[junit4:junit4]    > 	at com.carrotsearch.randomizedtesting.ThreadLeakControl.forkTimeoutingTask(ThreadLeakControl.java:782)
[junit4:junit4]    > 	at com.carrotsearch.randomizedtesting.ThreadLeakControl$3.evaluate(ThreadLeakControl.java:442)
[junit4:junit4]    > 	at com.carrotsearch.randomizedtesting.RandomizedRunner.runSingleTest(RandomizedRunner.java:746)
[junit4:junit4]    > 	at com.carrotsearch.randomizedtesting.RandomizedRunner$3.evaluate(RandomizedRunner.java:648)
[junit4:junit4]    > 	at com.carrotsearch.randomizedtesting.RandomizedRunner$4.evaluate(RandomizedRunner.java:682)
[junit4:junit4]    > 	at com.carrotsearch.randomizedtesting.RandomizedRunner$5.evaluate(RandomizedRunner.java:693)
[junit4:junit4]    > 	at com.carrotsearch.randomizedtesting.rules.StatementAdapter.evaluate(StatementAdapter.java:36)
[junit4:junit4]    > 	at com.carrotsearch.randomizedtesting.rules.SystemPropertiesRestoreRule$1.evaluate(SystemPropertiesRestoreRule.java:53)
[junit4:junit4]    > 	at org.apache.lucene.util.AbstractBeforeAfterRule$1.evaluate(AbstractBeforeAfterRule.java:46)
[junit4:junit4]    > 	at org.apache.lucene.util.TestRuleStoreClassName$1.evaluate(TestRuleStoreClassName.java:42)
[junit4:junit4]    > 	at com.carrotsearch.randomizedtesting.rules.SystemPropertiesInvariantRule$1.evaluate(SystemPropertiesInvariantRule.java:55)
[junit4:junit4]    > 	at com.carrotsearch.randomizedtesting.rules.NoShadowingOrOverridesOnMethodsRule$1.evaluate(NoShadowingOrOverridesOnMethodsRule.java:39)
[junit4:junit4]    > 	at com.carrotsearch.randomizedtesting.rules.NoShadowingOrOverridesOnMethodsRule$1.evaluate(NoShadowingOrOverridesOnMethodsRule.java:39)
[junit4:junit4]    > 	at com.carrotsearch.randomizedtesting.rules.StatementAdapter.evaluate(StatementAdapter.java:36)
[junit4:junit4]    > 	at org.apache.lucene.util.TestRuleAssertionsRequired$1.evaluate(TestRuleAssertionsRequired.java:43)
[junit4:junit4]    > 	at org.apache.lucene.util.TestRuleMarkFailure$1.evaluate(TestRuleMarkFailure.java:48)
[junit4:junit4]    > 	at org.apache.lucene.util.TestRuleIgnoreAfterMaxFailures$1.evaluate(TestRuleIgnoreAfterMaxFailures.java:70)
[junit4:junit4]    > 	at org.apache.lucene.util.TestRuleIgnoreTestSuites$1.evaluate(TestRuleIgnoreTestSuites.java:55)
[junit4:junit4]    > 	at com.carrotsearch.randomizedtesting.rules.StatementAdapter.evaluate(StatementAdapter.java:36)
[junit4:junit4]    > 	at com.carrotsearch.randomizedtesting.ThreadLeakControl$StatementRunner.run(ThreadLeakControl.java:358)
[junit4:junit4]    > 	at java.lang.Thread.run(Thread.java:679)
[junit4:junit4]    > Throwable #2: com.carrotsearch.randomizedtesting.UncaughtExceptionError: Captured an uncaught exception in thread: Thread[id=2773, name=Thread-990, state=RUNNABLE, group=TGRP-OverseerCollectionProcessorTest]
[junit4:junit4]    > Caused by: java.lang.AssertionError: 
[junit4:junit4]    >   Unexpected method call poll():
[junit4:junit4]    > 	at __randomizedtesting.SeedInfo.seed([B2E533D3F17E6070]:0)
[junit4:junit4]    > 	at org.easymock.internal.MockInvocationHandler.invoke(MockInvocationHandler.java:45)
[junit4:junit4]    > 	at org.easymock.internal.ObjectMethodsFilter.invoke(ObjectMethodsFilter.java:73)
[junit4:junit4]    > 	at org.easymock.internal.ClassProxyFactory$MockMethodInterceptor.intercept(ClassProxyFactory.java:92)
[junit4:junit4]    > 	at org.apache.solr.cloud.DistributedQueue$$EnhancerByCGLIB$$4eacec50.poll(<generated>)
[junit4:junit4]    > 	at org.apache.solr.cloud.OverseerCollectionProcessor.run(OverseerCollectionProcessor.java:122)
[junit4:junit4]    > 	at java.lang.Thread.run(Thread.java:679)
[junit4:junit4]   2> 142273 T2759 oas.SolrTestCaseJ4.deleteCore ###deleteCore
[junit4:junit4]   2> NOTE: test params are: codec=DummyCompressingStoredFields(storedFieldsFormat=CompressingStoredFieldsFormat(compressionMode=DUMMY, chunkSize=128)), sim=RandomSimilarityProvider(queryNorm=false,coord=yes): {}, locale=es_DO, timezone=Etc/GMT+8
[junit4:junit4]   2> NOTE: FreeBSD 9.0-RELEASE amd64/Sun Microsystems Inc. 1.6.0_32 (64-bit)/cpus=16,threads=1,free=35274032,total=466354176
[junit4:junit4]   2> NOTE: All tests run in this JVM: [ClusterStateUpdateTest, SyncSliceTest, TestRangeQuery, FieldAnalysisRequestHandlerTest, TestRTGBase, TestLuceneMatchVersion, TestSuggestSpellingConverter, SpellCheckCollatorTest, TestDocumentBuilder, TestJoin, QueryElevationComponentTest, LoggingHandlerTest, MoreLikeThisHandlerTest, TestSearchPerf, TestBinaryResponseWriter, TestFastLRUCache, CircularListTest, NumericFieldsTest, TestBadConfig, JsonLoaderTest, TestDefaultSimilarityFactory, TermsComponentTest, AutoCommitTest, TestPHPSerializedResponseWriter, TestCoreContainer, PreAnalyzedFieldTest, SimpleFacetsTest, TestIBSimilarityFactory, DateMathParserTest, JSONWriterTest, MinimalSchemaTest, CoreAdminHandlerTest, SuggesterFSTTest, CopyFieldTest, ResourceLoaderTest, SampleTest, FastVectorHighlighterTest, DirectSolrConnectionTest, TestSystemIdResolver, TestSolrQueryParser, RequestHandlersTest, ShardRoutingTest, TestCollationField, TestWordDelimiterFilterFactory, SpatialFilterTest, ResponseLogComponentTest, FileBasedSpellCheckerTest, TestLFUCache, TestXIncludeConfig, PathHierarchyTokenizerFactoryTest, SolrCmdDistributorTest, DateFieldTest, CurrencyFieldTest, TestQueryTypes, OverseerTest, RecoveryZkTest, SpellCheckComponentTest, LeaderElectionIntegrationTest, LeaderElectionTest, DistributedSpellCheckComponentTest, TestRealTimeGet, ZkControllerTest, TestDistributedGrouping, TestDistributedSearch, TestExtendedDismaxParser, SoftAutoCommitTest, ZkSolrClientTest, TestFaceting, WordBreakSolrSpellCheckerTest, TestHashPartitioner, DistributedTermsComponentTest, StatsComponentTest, SolrCoreTest, IndexBasedSpellCheckerTest, TestGroupingSearch, DirectSolrSpellCheckerTest, TestFiltering, DisMaxRequestHandlerTest, DistanceFunctionTest, XmlUpdateRequestHandlerTest, DirectUpdateHandlerOptimizeTest, IndexSchemaRuntimeFieldTest, SolrPluginUtilsTest, SearchHandlerTest, TestOmitPositions, TestArbitraryIndexDir, SuggesterTSTTest, CSVRequestHandlerTest, ShowFileRequestHandlerTest, SolrCoreCheckLockOnStartupTest, UpdateRequestProcessorFactoryTest, TestIndexingPerformance, PrimitiveFieldTypeTest, BadComponentTest, TestUpdate, SOLR749Test, DefaultValueUpdateProcessorTest, TestNumberUtils, TestSolrCoreProperties, TestConfig, TestPhraseSuggestions, TestPerFieldSimilarity, TestLMJelinekMercerSimilarityFactory, URLClassifyProcessorTest, TestSolrXMLSerializer, DOMUtilTest, RAMDirectoryFactoryTest, TestUtils, ClusterStateTest, OverseerCollectionProcessorTest]
[junit4:junit4] Completed on J0 in 142.30s, 14 tests, 14 errors <<< FAILURES!

[...truncated 59 lines...]
BUILD FAILED
/usr/home/hudson/hudson-slave/workspace/Lucene-Solr-Tests-trunk-Java6/build.xml:353: The following error occurred while executing this line:
/usr/home/hudson/hudson-slave/workspace/Lucene-Solr-Tests-trunk-Java6/build.xml:39: The following error occurred while executing this line:
/usr/home/hudson/hudson-slave/workspace/Lucene-Solr-Tests-trunk-Java6/solr/build.xml:178: The following error occurred while executing this line:
/usr/home/hudson/hudson-slave/workspace/Lucene-Solr-Tests-trunk-Java6/solr/common-build.xml:438: The following error occurred while executing this line:
/usr/home/hudson/hudson-slave/workspace/Lucene-Solr-Tests-trunk-Java6/lucene/common-build.xml:1175: The following error occurred while executing this line:
/usr/home/hudson/hudson-slave/workspace/Lucene-Solr-Tests-trunk-Java6/lucene/common-build.xml:840: There were test failures: 241 suites, 1006 tests, 14 errors, 21 ignored (3 assumptions)

Total time: 36 minutes 19 seconds
Build step 'Invoke Ant' marked build as failure
Archiving artifacts
Recording test results
Email was triggered for: Failure
Sending email for trigger: Failure



Mime
View raw message